##TITLE=NES1062_159122.0011_002_9704227_S7YpYeiwKW
##JCAMPDX= 6.0         $$ Bruker NMR JCAMP-DX V2.0
##DATA TYPE= NMR SPECTRUM
##DATA CLASS= NTUPLES
##ORIGIN= BRUKER
##OWNER= Administrator
$$ 1.72 TOPSPIN		Version 2.1
$$ 2016-04-30 15:16:13.521 -0700  Administrator@X
$$ Compression mode = diff/dup
##.OBSERVE FREQUENCY= 400.02188249412
##.OBSERVE NUCLEUS= ^1H
##.ACQUISITION MODE= SIMULTANEOUS (DQD)
##.ACQUISITION SCHEME= undefined
##.AVERAGES= 8
##.DIGITISER RES= 22
##SPECTROMETER/DATA SYSTEM= spect
##.PULSE SEQUENCE= zg30
##.SOLVENT NAME= COFFEE_meoh
##.SHIFT REFERENCE= INTERNAL, COFFEE_meoh, 1, 14.98509
##AUDIT TRAIL= $$ (NUMBER, WHEN, WHO, WHERE, PROCESS, VERSION, WHAT)
$$ ##TITLE= Audit trail, TOPSPIN		Version 2.1
$$ ##JCAMPDX= 5.01
$$ ##ORIGIN= Bruker BioSpin GmbH
$$ ##OWNER= Administrator
$$ $$ E:\/data/COFFEE/nmr/NES1062_159122.0011_002_9704227_S7YpYeiwKW/10/pdata/1/auditp.txt
$$ ##AUDIT TRAIL=  $$ (NUMBER, WHEN, WHO, WHERE, PROCESS, VERSION, WHAT)
(   1,<2016-04-30 15:16:06.146 -0700>,<Administrator>,<X>,<go>,<TOPSPIN 2.1>,
      <created by zg
	started at 2016-04-30 15:15:00.302 -0700,
	POWCHK enabled, PULCHK disabled,
       configuration hash MD5:
       21 0F 79 D6 B3 7B B4 F6 88 20 88 DB 03 48 BD 9F
       data hash MD5: 64K
       ED 58 D4 18 EB 16 09 99 2B 9E 1C 64 55 A4 CF 03>)
(   2,<2016-04-30 15:16:09.474 -0700>,<Administrator>,<X>,<proc1d>,<TOPSPIN 2.1>,
      <Start of raw data processing
       efp LB = 0 FT_mod = 6 PKNL = 1 PHC0 = 0 PHC1 = 0 SI = 32K 
       data hash MD5: 32K
       89 EC D1 B5 2D 16 CF F2 4E 7B 07 E5 62 1A 83 57>)
(   3,<2016-04-30 15:16:09.771 -0700>,<Administrator>,<X>,<proc1d>,<TOPSPIN 2.1>,
      <pk PHC0 = 94.45496 PHC1 = 0 
       data hash MD5: 32K
       D3 5C 50 59 B6 15 1E AD 3F 2E 4B 07 15 13 28 07>)
(   4,<2016-04-30 15:16:09.896 -0700>,<Administrator>,<X>,<proc1d>,<TOPSPIN 2.1>,
      <abs ABSG = 1 
       data hash MD5: 32K
       B7 AF CB 19 3F FC D5 36 3F D6 1E 14 7E E6 65 1D>)
(   5,<2016-04-30 15:16:09.958 -0700>,<Administrator>,<X>,<proc1d>,<TOPSPIN 2.1>,
      <abs ABSG = 2 
       data hash MD5: 32K
       28 72 4F DE 69 E9 02 CC 6E DB BB 4E 2C 12 62 7B>)
(   6,<2016-04-30 15:16:10.021 -0700>,<Administrator>,<X>,<proc1d>,<TOPSPIN 2.1>,
      <abs ABSG = 3 
       data hash MD5: 32K
       CD C8 D9 A3 EF FB 9A 09 68 15 47 96 42 85 29 42>)
(   7,<2016-04-30 15:16:10.083 -0700>,<Administrator>,<X>,<proc1d>,<TOPSPIN 2.1>,
      <abs ABSG = 4 
       data hash MD5: 32K
       2C A5 9E 21 AE BA 3F 51 86 F1 F7 C3 34 46 A6 BD>)
(   8,<2016-04-30 15:16:10.146 -0700>,<Administrator>,<X>,<proc1d>,<TOPSPIN 2.1>,
      <abs ABSG = 5 
       data hash MD5: 32K
       B7 42 19 52 E2 E6 B8 B9 36 6F CF D3 25 CF 04 AB>)
$$ ##END=
$$ 
$$ $$ hash MD5
$$ $$ B0 7E 77 AE C2 50 49 33 81 B5 FA C4 37 CC AE 64
##$RELAX= 
##$RELAX= 
##$RELAX= 
##$RELAX= 
##$RELAX= 
##$RELAX= 
##$RELAX= 
$$ Bruker specific parameters
$$ --------------------------
##$DU= <E:\>
##$EXPNO= 10
$$ [...]
150 150 150 150 150 150 150 150
##$TP07= 0
##$TPNAME0= <>
##$TPNAME1= <>
##$TPNAME2= <>
##$TPNAME3= <>
##$TPNAME4= <>
##$TPNAME5= <>
##$TPNAME6= <>
##$TPNAME7= <>
##$TPOAL= (0..7)
0.5 0.5 0.5 0.5 0.5 0.5 0.5 0.5
##$TPOFFS= (0..7)
0 0 0 0 0 0 0 0
##$TUNHIN= 0
##$TUNHOUT= 0
##$TUNXOUT= 0
##$USERA1= <user>
##$USERA2= <user>
##$USERA3= <user>
##$USERA4= <user>
##$USERA5= <user>
##$V9= 5
##$VALIST= <valist>
##$VCLIST= <CCCCCCCCCCCCCCC>
##$VD= 0
##$VDLIST= <DDDDDDDDDDDDDDD>
##$VPLIST= <PPPPPPPPPPPPPPP>
##$VTLIST= <TTTTTTTTTTTTTTT>
##$WBST= 2048
##$WBSW= 25
##$XGAIN= (0..3)
0 0 0 0
##$XL= 0
##$YL= 0
##$YMAX_a= 566358
##$YMIN_a= -481481
##$ZGOPTNS= <>
##$ZL1= 120
##$ZL2= 120
##$ZL3= 120
##$ZL4= 120
##$ABSF1= 14.98509
##$ABSF2= -5.573092
##$ABSG= 5
##$ABSL= 3
##$ALPHA= 0
##$AQORDER= 0
##$ASSFAC= 0
##$ASSFACI= 0
##$ASSFACX= 0
##$ASSWID= 0
##$AUNMP= <proc_prof1d_extract_pilot.lims>
##$AXLEFT= 0
##$AXNAME= <>
##$AXNUC= <1H>
##$AXRIGHT= 0
##$AXTYPE= 0
##$AXUNIT= <>
##$AZFE= 0.1
##$AZFW= 0.1
##$BCFW= 0
##$BC_mod= 0
##$BYTORDP= 0
##$COROFFS= 0
##$CY= 15
##$DATMOD= 1
##$DC= 0
##$DFILT= <>
##$DTYPP= 0
##$F1P= 0
##$F2P= 0
##$FCOR= 0.5
##$FTSIZE= 32768
##$FT_mod= 6
##$GAMMA= 0
##$GB= 0
##$INTBC= 1
##$INTSCL= 1
##$ISEN= 128
##$LB= 0
##$LEV0= 0
##$LPBIN= 0
##$MAXI= 10000
##$MC2= 0
##$MEAN= 0
##$ME_mod= 0
##$MI= 0
##$NCOEF= 0
##$NC_proc= -8
##$NLEV= 6
##$NOISF1= 0
##$NOISF2= 0
##$NSP= 0
##$NTH_PI= 0
##$NZP= 0
##$OFFSET= 14.98509
##$PC= 1
##$PHC0= 94.45496
##$PHC1= 0
##$PH_mod= 1
##$PKNL= yes
##$PPARMOD= 0
##$PPDIAG= 0
##$PPIPTYP= 0
##$PPMPNUM= 2147483647
##$PPRESOL= 1
##$PSCAL= 4
##$PSIGN= 0
##$PYNMP= <proc.py>
##$REVERSE= no
##$SF= 400.02
##$SI= 32768
##$SIGF1= 0
##$SIGF2= 0
##$SINO= 400
##$SIOLD= 32768
##$SPECTYP= <>
##$SREGLST= <1H.CDCl3>
##$SSB= 0
##$STSI= 32768
##$STSR= 0
##$SW_p= 8223.68421052631
##$SYMM= 0
##$S_DEV= 0
##$TDeff= 65536
##$TDoff= 0
##$TI= <>
##$TILT= no
##$TM1= 0
##$TM2= 0
##$TOPLEV= 0
##$USERP1= <user>
##$USERP2= <user>
##$USERP3= <user>
##$USERP4= <user>
##$USERP5= <user>
##$WDW= 1
##$XDIM= 32768
##$YMAX_p= 422561276
##$YMIN_p= -689104
##$CURPLOT= <Network HP LaserJet P1505>
##$CURPRIN= <$Network HP LaserJet P1505>
##$DFORMAT= <normdp>
##$LAYOUT= <+/1D_H.xwp>
##$LFORMAT= <normlp>
##$PFORMAT= <normpl>
##$SURQMSG= 1
$$ End of Bruker specific parameters
$$ ---------------------------------
##NTUPLES= NMR SPECTRUM
##VAR_NAME=  FREQUENCY,     SPECTRUM/REAL,   SPECTRUM/IMAG
##SYMBOL=    X,             R,               I
##VAR_TYPE=  INDEPENDENT,   DEPENDENT,       DEPENDENT
##VAR_FORM=  AFFN,          ASDF,            ASDF
##VAR_DIM=   32768,         32768,           32768
##UNITS=     HZ,            ARBITRARY UNITS, ARBITRARY UNITS
##FACTOR=    0.250966925370066, 1,           1
##FIRST=     8223.43324360094, -91928,       -103681
##LAST=      0,             -106268,         34052
##MIN=       0,             -689104,         0
##MAX=       8223.43324360094, 422561276,    0
$$ Real data points
##PAGE= N=1
##DATA TABLE= (X++(R..R)), XYDATA
$$ [...]
$$ plain form
19547 -132649 56988 351215 -125097 76508 -249148 -71497 -12359 13843 170490 12751 -149809
19535 -210829 -31243 -227055 78629 152519 239349 -3477 -75085 -210716 162015 115338 165211
19524 165211 91579 -68825 -77767 -230210 -81006 -428145 -272065 47373 -232574 106057 -169392
19512 46726 70309 108232 -97724 -28919 -50223 3881 -102901 -99297 62382 117339 -298251 60990
19499 197499 -118623 -151936 251659 -221082 206979 -164920 58089 -84906 -56939 -142634
19489 -142634 178240 206928 -14907 21165 73342 -85448 112760 78709 -216337 -287289 -276990
19478 -276990 -79429 80995 139713 -96735 238260 -82203 -251716 -120719 -135429 -143314 -23918
19466 -182397 -48049 25238 -189453 -326278 -536268 50211 -30807 111635 -54807 -497 -69534
$$ packed form
19547a32649E6988K94227a25097G6508b49148g1497a2359A3843J56647A2751a49809
19535b10829c1243j95812G8629P3890Q6830c477p1608j35631A62015m6677M9873
19524A65211p3632f8825q942j52443h1006l47139J56080D7373b32574A06057a69392
19512D6726K3583L7923i7724b8919k1304C881a02901L604F2382N4957b98251F0990
19499A97499a18623l3313B51659b21082B06979a64920E8089h4906K7967q5695
19489a42634A78240K8688a4907B1165N2177h5448A12760l4051b16337p0952J0299
19478b76990g9429H0995N8718i6735B38260h2203j69513a20719j4710p885b3918
19466a82397d8049B5238a89453j36825k09990E0211c0807A11635e4807d97o9037
$$ plain form
19455 -69534 -164252 129850 237046 -228282 -144875 193911 -201917 121900 -212825 48570
19444 -382668 42327 -29310 -373497 186682 -212313 -56043 -204662 -87349 -152280 -35283 -49181
19433 -49181 -163923 194106 181932 -51245 -139937 232029 -64646 -21485 -14426 314092 -33178
19421 -136150 -255654 -226536 58420 -182077 132036 -38280 -243659 -359602 -53819 44751
19410 -80604 -106747 31751 63836 -71982 120477 64170 318700 -116954 -21107 -36882 39012
19398 -246608 -116123 -124159 181148 -110299 -476044 -123947 -204733 -133654 81797 -51021 -133918
19387 -133918 -25910 -40492 107305 193022 -73955 -110985 -302924 141966 -90930 56071 -18938
19375 -35244 -277895 -43693 -148770 -180285 -2956 -285948 -300764 -51944 192706 -119064 -142176
$$ packed form
19455f9534r4718A29850J07196b28282Q3407A93911b01917A21900b12825D8570
19444c82668D2327b9310l44187A86682b12313e6043j48619h7349o4931c5283j3898
19433d9181j14742A94106j2174e1245q8692B32029f4646b1485P059C14092c3178
19421a36150j19504K9118E8420a82077A32036c8280k05379j15943e3819D4751
19410h0604k6143C1751L2085g1982A20477n6307K54530a16954b1107j5775C9012
19398b46608a16123q036A81148a10299l65745a23947q0786P1079H1797e1021q2897
19387a33918b5910j4582A07305Q5717g3955l7030j91939A41966i0930E6071a8938
19375c5244k42651d3693j05077l1515b956k82992j4816e1944A92706a19064k3112
$$ plain form
19364 -142176 -70300 28726 -6818 -174451 -135471 -6326 68765 -160911 11955 159809 -284095
19352 -156566 -182947 -117819 -142966 10593 59175 103208 -322038 -184530 -54685 -79085 97074
19340 -88717 -87734 -151830 -61593 69147 465482 -2682 -250580 448648 14431 -134530 -200780
19329 -200780 24482 -108579 -139957 -102325 49018 -51235 -443981 -239565 -159263 -240826 149554
19317 102065 56792 81401 81888 234658 -41170 -159449 -10271 -285448 -167340 -21668 163511
19305 124829 -96973 -280439 76155 131372 190418 -626592 161965 114163 198817 -30657 -119788
19294 -119788 -11681 107014 -203185 266 34670 -52300 134565 -135023 125390 58867 136176
19283 136176 93569 -143405 -195131 123278 36942 10633 126105 -127077 352047 -344101
$$ packed form
19364a42176g0300B8726f818j67633L8980f326F8765a60911A1955J47854b84095
19352a56566k6381O5128k5147A0593M8582M4033c22038J37508e4685k4400I7074
19340h8717R83o4096f1593F9147L96335b682k47898D48648A4431a34530o6250
19329b00780B4482a08579l1378L7632D9018e1235l92746K04416Q0302q1563A49554
19317A02065m5273K4609M87J52770d1170j18279a0271k75177J18108b1668A63511
19305A24829i6973j83466G6155N5217N9046f26592A61965m7802Q4654c0657q9131
19294a19788a1681A07014b03185B66L4404e2300A34565a35023A25390E8867P7309
19283A36176m2607a43405n1726A23278C6942A0633J15472a27077C52047c44101
$$ plain form
19272 91355 -60677 -263198 144725 195489 212225 -190162 -143616 -54480 249940 10821 204693
19261 204693 65903 -31776 -114324 -64312 -110429 -234255 -256765 66121 83091 4657 36698
19250 36698 -190820 -194833 -240946 78351 -58627 -130984 156266 72241 39412 -192814 -114907
19239 -114907 -120421 -133667 94324 -327910 -327212 -135380 11484 -20152 -189202 110099 -32167
19227 136180 8668 -258192 -245040 93509 -231425 -257225 -400794 -96561 66365 -65911 -207559
19216 -207559 -251612 -72670 96865 21954 -106559 -96009 -95067 -202931 -185329 95182 -18824
19204 86037 -296644 -196987 24576 -317985 15546 -159171 -88606 239974 174227 89916 178635
19193 178635 162288 151133 -99065 -262720 -313181 -229222 -176610 -93570 -322761 -263948 -267715
$$ packed form
19272I1355f0677k02521A44725N0764J6736a90162M6546e4480B49940A0821J93872
19261B04693F5903c1776q2548N0012m6117j23826k2510F6121J6970D657L2041
19250C6698a90820m013m6113G8351e8627p2357A56266G2241l2829a92814P7907
19239a14907n514j3246I4324c27910O98a35380A1484b0152j69050A10099c2167
19227A36180H668b58192J3152I3509b31425k5800j43569i6561F6365f5911j41648
19216b07559m4053g2670I6865B1954a06559J0550R42j07864J7602I5182a8824
19204H6037b96644R9657B4576c17985A5546a59171P0565B39974o5747q4311Q8719
19193A78635j6347j1155i9065j63655n0461Q3959N2612Q3040k29191N8813l767
$$ plain form
19182 -267715 -99677 111617 -19524 -91420 -167448 -57127 48263 -117351 61962 271089 -15798
19170 43760 -368068 -78261 158095 225596 -77610 -269644 -72914 39509 -85165 -132333 84783
19158 -172061 -139378 68025 -191179 189272 -149436 -376808 -67177 -21755 -231534 -341224
19148 -341224 90219 -89380 25229 345125 100961 -154427 -111719 65457 -342188 219116
19137 221621 -211788 -178617 173060 -150629 -77569 -18246 -39708 -302429 19400 -169222
19126 52137 -254510 173935 29429 -101075 154928 226898 -108067 -3231 -20556 458960 -63031
19114 67153 -200672 5016 -160522 -166827 61668 -48306 -41169 -43031 -121761 52170 31244 -174518
19101 -178649 17302 -110099 25177 -200543 107891 -218533 -70228 371446 -522406 165515
$$ packed form
19182b67715i9677A11617a9524p1896p6028e7127D8263a17351F1962K09127a5798
19170D3760c68068g8261A58095O7501g7610j92034g2914C9509h5165m7168H4783
19158a72061L2683F8025a91179A89272a49436k27372f7177b1755k09779j09690
19148c41224I0219h9380B5229L19896A00961a54427M2708F5457c42188B19116
19137B21621b11788L3171A73060a50629P3060a8246k1462k62721A9400a69222
19126E2137b54510A73935B9429a01075A54928P1970a08067c231j7325D58960f3031
19114F7153b00672E016a60522o305F1668d8306P137j862p8730E2170k0926a74518
19101a78649A7302a10099B5177b00543A07891b18533g0228C71446e22406A65515
$$ plain form
19090 212918 -105469 -97422 -24606 -20886 -62013 194520 101127 134524 -52532 206660 87284
19078 -42353 -39849 -226613 -7262 144254 -128397 147926 60850 133732 79483 -301738 -96840
19066 -296444 -29748 67700 -200726 287898 110384 -310927 -239492 171798 -83916 -46270
19056 -46270 -188647 -254096 -180591 -6967 -94077 95924 -249903 -231180 160359 34590 -66373
19044 27090 -178160 5494 -277896 -70963 -174820 -120457 -232488 36861 -67676 9643 -37648
19032 34632 112081 -82061 101846 -258000 138722 130334 181236 -102176 20117 247207 -134888
19020 -269264 -302130 -11815 304405 -36200 194748 -210 -59672 426 162266 193279 -158141
19008 45322 -40583 -79074 -227885 112058 50727 -95071 -141421 200576 83782 -153731 -128404
$$ packed form
19090B12918a05469Q047b4606L720m1127A94520r3393L3397e2532B06660H7284
19078d2353K504j86764g262A44254a28397A47926F0850P2882n4249c01738i6840
19066b96444b9748F7700b00726B87898A10384c10927P1435A71798h3916L7646
19056d6270j42377o5449P3505f967q7110I5924b49903J8723A60359C4590f6373
19044B7090a78160E494b77896g0963j03857N4363j12031C6861f7676I643c7648
19032C4632P7449h2061A01846b58000A38722q388N0902a02176B0117K27090a34888
19020b69264l2866a1815C04405c6200A94748b10n9462D26J61840L1013a58141
19008D5322d0583l8491j48811A12058E0727i5071m6350B00576H3782a53731K5327
$$ plain form
18997 -128404 -137196 138955 411 45364 -85200 -136262 -194184 -147099 -37447 -99558 -163176 195779
18984 122010 -84226 -8870 18637 -378675 -20961 101027 -125006 -68695 123728 93059 36267
18972 -57833 30175 53665 61729 55513 169973 71241 46995 -199283 -110298 150635 -135622
18960 85077 -243697 -291670 121316 194650 -83037 -138732 -186921 278547 -79309 -9644 -109814
18949 -109814 118512 -3019 -320392 155345 -14460 186007 -11552 120822 -9380 27460 -140081
18937 147690 -62529 -266389 -39822 212370 -10496 -131652 96714 163254 5882 27580 188026
18926 188026 -42068 -43854 -53768 103696 -40362 -66445 74176 -170859 31417 -227030 222221
18914 -137710 19458 -228051 -20371 -149265 -27938 -321616 -180766 538251 152113 144920
$$ packed form
18997a28404q792A38955D11M4953h5200n1062n7922M7085c7447o2111o3618A95779
18984A22010h4226h870A8637c78675b0961A01027a25006N6311A23728l0669C6267
18972e7833C0175K3490Q064o216J14460G1241k4246a99283Q8985A50635a35622
18960H5077b43697m7973A21316P3334h3037n5695m8189B78547g9309i644j00170
18949a09814A18512c019l17373A55345a4460A86007a1552A20822i380B7460a40081
18937A47690f2529k03860c9822B12370a0496j21156I6714O6540E882K1698J60446
18926A88026d2068j786r914A03696d0362k6083G4176a70859C1417b27030B22221
18914a37710A9458b28051b0371j28894b7938k93678J40850E38251A52113p193
$$ plain form
18904 144920 48718 94595 -18996 -111499 -44712 217610 -249355 -140592 -158223 -182409 56200
18892 -282153 1910 70340 -60396 231767 24510 -127730 105462 82282 143780 -201333 12203
18880 -139114 -252697 -227589 363424 60976 343907 147233 120513 -96599 7974 235009 268811
18869 268811 -109337 -264619 -448150 -384687 -15496 122181 -295448 -103230 215415 84237
18858 -432828 11620 70859 -345285 250873 -7481 120164 98680 48130 -112435 -40489 -222548
18847 -222548 -151593 136043 188398 81013 157198 -201518 11212 -41937 -72107 -46439 -96384
18836 -96384 68155 82689 -66736 -37605 73320 -268188 -48869 -6829 -161370 23016 -72905
18824 -270921 -92492 143749 -202164 2777 -56067 -147874 -79105 111931 -182675 309715 112892
$$ packed form
18904A44920D8718M5877a8996r2503d4712B17610b49355J08763j7631k4186E6200
18892b82153A910O8430f0396B31767B4510a27730A05462k3180O1498b01333A2203
18880a39114j13583K5108C63424F0976K82931A47233k6720i6599G974K27035L3802
18869B68811a09337j55282j83531O3463a5496A22181b95448a03230B15415H4237
18858d32828A1620N9239c45285B50873g481A20164k1484D8130a12435d0489j82059
18847b22548P0955A36043N2355H1013P6185b01518A1212d1937l0170K5668m9945
18836i6384F8155J4534f6736K9131G3320b68188d8869f829j54541B3016g2905
18824b70921i2492A43749b02164B777e6067r1807O8769A11931a82675C09715A12892
$$ plain form
18812 311990 -201222 -177957 108326 8137 -26051 -63084 -112539 -69706 -96943 -124563 -95991
18801 -95991 81995 10790 -45632 108678 -278770 -821 -175545 58879 -167680 -103259 -240329
18790 -240329 180298 57309 -65639 107254 -41329 109170 -5849 89042 -85256 -177983 -398741
18779 -398741 -132246 -359 -204525 -30687 -158537 -26382 49107 53504 101457 -75302 241858
18767 -109993 99505 269402 -135498 282815 -205277 -54145 13628 -67486 -40721 149829
18756 -266769 -52117 -378096 237231 193776 55786 -113887 -14813 -13625 -70816 -32092 140824
18744 105273 129668 -167918 -259026 239525 -446060 62878 -16168 39111 47924 -324695 -195620
18733 -195620 -204964 -1645 13611 -201206 246881 -149944 -238568 -320565 134805 70073 23164
$$ packed form
18812C11990b01222K3265A08326H137b6051l7033m9455M2833k7237k7620K8572
18801i5991H1995A0790d5632A08678b78770h21j74724E8879a67680O4421j37070
18790b40329A80298E7309f5639A07254d1329A09170e849H9042h5256r2727k20758
18779c98741a32246c59k04166c0687j27850b6382D9107M397M7953g5302B41858
18767a09993I9505J69897a35498B82815b05277e4145A3628f7486K6765A49829
18756b66769e2117l25979B37231m3455E5786a13887a4813J188n7191c2092A40824
18744A05273K4395a67918r1108B39525d46060F2878a6168C9111Q813c24695J29075
18733a95620r344a645A3611b01206B46881a49944q8624q1997A34805o4732B3164
$$ plain form
18721 91649 -347479 -140616 95860 -84174 -26691 -180805 -348547 -286616 12558 -22077 77287
18709 243828 -67941 -68481 212518 3453 -105723 -139784 -156832 -218183 -15659 163218 -192716
18697 83793 166762 117069 -152756 137504 -204370 8594 -368635 -134794 -139239 -158946 -81948
18686 -81948 -252911 143048 257003 27496 13807 -106462 146541 -66975 -226745 -74580
18675 -24951 -216262 27678 86093 71593 -8035 -167826 -324635 29778 -6237 52041 -218226
18663 -133227 -109469 -170634 -23455 -230000 -154847 62845 -232492 -92499 -72851 -382627 -117880
18651 70992 315698 -119378 -73683 -126437 -131536 165485 7912 84566 180894 -56726 -89649
18640 -89649 -218660 49039 -51939 -65631 19585 -261750 -264094 75594 148278 -342963 160599
$$ packed form
18721I1649c47479a40616I5860h4174b6691j54114j67742O1931A2558b2077G7287
18709B43828f7941n40B12518C453a05723l4061j7048o1351a5659A63218a92716
18697H3793Q2969m9693a52756A37504b04370H594c68635a34794m445j9707P6998
18686h1948j70963A43048J13955B7496j3689a06462A46541f6975j59770g4580
18675b4951j91311B7678N8415j4500h035j59791j56809B9778f237E2041b18226
18663a33227K3758o1165b3455k06545P5153F2845b32492i2499J9648l09776a17880
18651G0992K44706a19378M5695n2754n099A65485G912P6654R6328e6726l2923
18640h9649j29011D9039e1939j3692A9585b61750k344G5594P2684c42963A60599
$$ plain form
18628 -94672 95878 -53816 -363515 -209142 -155549 -91255 -26609 -29650 198669 7035 340885
18617 340885 -53565 -358177 -14011 -32929 70290 -160076 -267090 95034 4731 -522792 -52827
18605 145687 -56982 -91208 -322952 -38235 -285593 29155 132600 -173488 -234387 -41986 43891
18593 20631 97093 -75459 2892 -13243 -61844 273840 -175960 1877 -236448 220901 -87486
18581 -37278 107385 -189328 34063 -235592 -254382 -290195 -31761 97578 137696 67203 150927
18570 150927 142232 63976 14027 -124047 -189395 234296 7973 100420 -170874 -76206 221409
18558 78436 19366 -170597 -418334 -133316 137873 92991 -108169 134628 283385 23300
18547 126730 54170 -113562 -337960 -53920 -37691 65604 -140526 107526 -73221 66886 -66310
$$ packed form
18628i4672I5878e3816l09699J54373N3593O4294b6609l041A98669G035L33850
18617C40885e3565l04612a4011j8918G0290a60076j07014I5034D731e22792e2827
18605A45687e6982l4226k31744c8235k47358B9155J03445a73488o0899d1986D3891
18593B0631P6462g5459B892a3243m8601B73840a75960A877b36448B20901h7486
18581c7278A07385a89328C4063b35592j8790l5813c1761I7578M0118F7203Q3724
18570A50927q695F3976A4027a24047o5348B34296G973R2447a70874g6206B21409
18558G8436A9366a70597k47737a33316A37873m4882a08169A34628J48757B3300
18547A26730E4170a13562k24398e3920J6229F5604a40526A07526g3221F6886f6310
$$ plain form
18535 -22130 29654 20901 -294487 -106262 122722 -233612 163135 11145 -124613 -251585
18525 -251585 -254645 -24890 73120 -335578 20461 238812 4861 -357783 54990 -92860 -54775
18514 -54775 -212112 211240 94530 23420 -118581 213420 214330 176030 156612 -54347 34256
18502 68147 -121526 163445 -21974 83035 107651 -97607 180571 109731 54774 -65320 -152930
18491 -152930 -41431 -470476 55053 259867 34000 84767 -56852 -212929 -112660 -94982 -14838
18479 116905 -255483 430358 -164336 98553 -122669 -98215 -439489 -165410 -353464 -315198
18469 -315198 -72971 -79401 92531 -85073 -326368 25231 -109794 -189 54525 16620 -291111
18457 112210 -95385 350997 -198544 -43828 -29550 54533 -74370 -28576 58845 -85277 -240524
$$ packed form
18535b2130B9654q753b94487a06262A22722b33612A63135A1145a24613j26972
18525b51585l060b4890G3120c35578B0461K18351D861c57783E4990i2860L8085
18514e4775j57337B11240I4530B3420a18581B13420R10l8300j9418e4347C4256
18502F8147a21526A63445b1974H3035K4616i7607A80571p0840E4774f5320q7610
18491a52930d1431m29045E5053K04814C4000N0767e6852j56077J00269J7678a4838
18479A16905b55483D30358a64336I8553a22669K4454l41274a65410j88054L8266
18469c15198g2971o430I2531h5073k41295B5231a09794a89E4525A6620b91111
18457A12210i5385C50997a98544d3828J4278E4533g4370b8576E8845h5277j55247
$$ plain form
18446 -240524 -310473 -194600 115803 -205300 105094 161559 -186184 -205720 -20096 177836
18435 -1814 63317 -123504 97442 40524 210043 -218752 -103172 108334 -142123 -112365 -82141
18424 -82141 54754 145296 138768 180966 -94593 92358 -177281 -265293 31915 -161175 -117008
18413 -117008 112637 -157296 -31795 24342 -60008 197265 43894 -6275 -95944 -53895 130664
18401 114130 -53370 -136188 -18063 -368459 -326717 -153752 -173714 -429143 -2097 189000 294480
18390 294480 155764 -74229 -232778 177430 213196 40945 -254505 156286 -10874 29195
18379 -110240 -111268 -100196 67276 164910 149798 173348 -128307 205768 191711 129920 -320570
18367 46090 -154865 -11513 -460530 123055 -30334 67554 -218308 -309332 -49246 317336 -64391
$$ packed form
18446b40524o9949J15873A15803b05300A05094N6465a86184j9536b0096A77836
18435a814F3317a23504I7442D0524J69519b18752a03172A08334a42123K9758L0224
18424h2141E4754R0542o528M2198i4593I2358a77281q8012C1915a61175M4167
18413a17008A12637a57296c1795B4342f0008A97265D3894f275q9669M2049A30664
18401A14130e3370q2818a8063l50396M1742a53752j9962k55429b097A89000J05480
18390B94480j38716g4229j58549A77430L5766D0945b54505A56286a0874B9195
18379a10240j028J1072F7276R7634j5112K3550a28307B05768j4057o1791c20570
18367D6090a54865a1513m49017A23055c0334F7554b18308r1024d9246C17336f4391
$$ plain form
18355 434296 106181 -30809 6906 -128479 -315766 -101729 6361 108748 -156054 20728 -27850
18343 -53112 -54681 -72716 158332 -114717 219320 -85585 -171208 -215171 263810 -229681 206243
18331 71055 -56792 -223066 -376038 101361 -25009 797 -110806 114383 -230542 -140105 -91435
18320 -91435 -98639 70318 -184440 229107 58177 -433439 -42849 -62943 226668 119342 -6428
18308 -302512 -3880 -290060 39951 -132206 142390 -182921 -81209 -151673 -68734 83665 -295647
18296 144191 304608 92665 -61763 58704 -204417 -274179 -121422 305017 3070 -63298 157365
18284 -149338 -52317 -137569 100391 -18978 -94034 -32457 158894 -414403 -223682 225671
18273 -126657 115490 -56372 53426 -548805 -190713 -59255 -239827 -242352 133199 569 39877
$$ packed form
18355D34296A06181c0809F906a28479j87287a01729F361J02387a56054B0728b7850
18343e3112j569j8035A58332a14717B19320h5585q5623m3963B63810b29681B06243
18331G1055e6792j66274j52972A01361b5009G97a10806A14383b30542R0437M8670
18320i1435p204G0318a84440B29107E8177d33439d2849k0094B26668j07326f428
18308c02512c880k86180C9951a32206A42390a82921h1209p0464f8734H3665b95647
18296A44191J60417I2665f1763E8704b04417o9762a21422C05017C070f3298A57365
18284a49338e2317q5252A00391a8978p5056c2457A58894d14403J90721B25671
18273a26657A15490e6372E3426e48805a90713e9255j80572k525A33199E69L9308
$$ plain form
18262 39877 -417012 -111314 173482 -3636 -105012 -196000 -190912 -40753 89372 98965 97455 -59602
18249 -72380 -140988 -159756 -10644 62596 -333067 12162 73448 -123960 -141314 219606 -128590
18237 -236211 -19943 134819 119400 -269028 -4329 -431871 233408 -272324 72695 -3998 -78316
18226 -78316 390337 63321 5514 -228769 -6318 -42466 47346 -67070 -70111 -346526 -42090 -5057
18213 -8102 -172620 -271661 43561 317182 57375 69347 85197 -87859 -103647 -62422 -89404
18202 -89404 -136370 -4401 183997 76962 96823 32726 7873 -177583 42486 -40761 -22590 -148403
18190 -148403 -303829 -42656 -24509 213834 224117 354053 -170854 -314095 -188720 -347787
18180 -347787 -78008 -79957 -19139 -229041 -388660 115473 -195387 -220935 -34876 -53562 -91250
$$ packed form
18262C9877d17012a11314A73482c636j01376r0988N088d0753H9372R593j510e9602
18249g2380o8608j8768a0644F2596c33067A2162O1286a23960j7354B19606a28590
18237b36211a9943A34819j5419b69028d329m27542B33408b72324G2695c998p4318
18226g8316C90337F3321E514b28769f318l6148D7346f7070l041k76415d2090e057
18213h102j64518r9041D3561K73621E7375J1972J5850h7859j5788M1225k6982
18202h9404m6966d401A83997G6962J9861C2726G873a77583D2486d0761J8171j25813
18190a48403j55426d2656J8147B13834J0283J29936a70854j43241J25375j59067
18180c47787g8008j949a9139k09902j59619A15473a95387k5548c4876j8686l7688
$$ plain form
18169 -91250 -72420 78839 3125 206770 -176334 -155030 243283 -224708 37974 76124 -162241
18157 -34646 12907 -74146 -284510 -58294 45226 53073 -116137 370017 230568 224273 -69616
18145 330488 -5726 -16632 -87957 20984 121336 83785 -48241 -161692 -135356 -80505 92335
18133 22907 -71786 -179693 -134847 120582 -77008 165205 -28450 -162274 16354 -132804 119225
18121 -99901 -26097 144793 52400 -259627 -219168 339084 -289413 158724 -50770 20110 -82963
18109 -208210 169840 175011 235424 151282 -72890 182660 -24448 -261174 -118423 238749 -43698
18097 -76825 -5632 249759 -108537 -117465 35605 304526 155041 627 -67334 -7314 55893 -187642
18084 -47065 -65610 -118193 -175189 67747 -183512 -118988 157914 -179227 107477 -9452 21225
$$ packed form
18169i1250J8830G8839C125K03645a76334K1304B43283b24708C7974L8150a62241
18157c4646A2907g4146k10364e8294D5226P847a16137C70017j39449o295f9616
18145C30488e726j0906p1325B0984J00352l7551d8241j13451K6336N4851I2335
18133B2907g1786j07907M4846A20582g7008A65205b8450j33824A6354a32804A19225
18121i9901b6097A44793E2400b59627M0459C39084b89413A58724e0770B0110h2963
18109b08210A69840N171O0413q4142g2890A82660b4448k36726a18423B38749d3698
18097g6825e632B49759a08537q928C5605K68921j49485F27f7334g314E5893a87642
18084d7065j8545n2583n6996F7747a83512O4524A57914a79227A07477i452B1225
$$ plain form
18072 160208 -72652 -61315 83825 -195899 -25843 164565 80563 -211189 450263 -434153
18061 86243 -64309 96843 39084 -189371 -46180 -114772 192288 83510 -258092 566000 10015
18049 -261272 -111240 121715 273353 38003 18158 312093 95639 317381 141967 140060
18039 140060 209699 -113710 105022 38900 -92738 -184559 102456 -167271 -148468 -140349 -226649
18028 -226649 -132301 -98068 31446 44933 -84694 143807 -314813 -76136 -116088 -86081 -104383
18017 -104383 114717 286501 -371986 211028 1582 -88567 -128152 141329 221556 32643 3294
18005 216334 -68965 -46282 -54293 -133637 131219 129942 27826 68372 234820 -61933 -92607
17994 -92607 -373786 -61370 -220877 145945 -175506 -105535 51251 64786 139654 -279718 26599
$$ packed form
18072A60208g2652J1337H3825a95899b5843A64565H0563b11189D50263d34153
18061H6243f4309I6843C9084a89371d6180o8592A92288H3510b58092E66000A0015
18049b61272a11240A21715J51638C8003A8158K93935I5639K21742A41967j907
18039A40060O9639a13710A05022C8900i2738r1821A02456a67271J8803Q119q6300
18028b26649R4348L4233C1446J3487h4694A43807c14813g6136l9952L0007j8302
18017a04383A14717J71784c71986B11028A582h8567l9585A41329Q0227C2643C294
18005B16334f8965K2683q011p9344A31219j277B7826M0546J66448f1933l0674
17994i2607k81179f1370j59507A45945a75506O9971E1251J3535P4868b79718B6599
$$ plain form
17982 142762 -175020 11963 1688 -1388 204337 150372 170233 -160572 -233783 53132 15233
17970 142098 -48037 -467803 151565 133251 15851 -3885 84280 -180997 -156322 92400 -23647
17958 22908 -221207 -168508 94613 -119571 45353 -13296 66513 291511 32039 -91863 244318
17946 -432519 -20778 60813 -148085 -5907 -158808 204253 239844 346950 135355 -36939 -16747
17934 -113418 42923 53090 -143353 26551 143675 74834 -195473 33589 5732 -212107 167668
17922 329305 305657 245115 -766 55455 21131 -197667 36736 -372359 252215 -254371 54846
17910 -196080 205063 205016 67297 5203 153124 -18719 38496 -76596 -212678 266134 -286427
17898 -40161 -40106 115867 -161476 -101309 921 -90627 -207831 122305 22570 20160 -89095 17324
$$ packed form
17982A42762a75020A1963A688a388B04337n3965J9861a60572p3211E3132A5233
17970A42098d8037m19766A51565j8314A5851c885H4280a80997K4675I2400b3647
17958B2908b21207N2699I4613a19571D5353a3296F6513K24998C2039i1863B44318
17946d32519b0778F0813a48085e907j52901B04253L5591J07106A35355c6939a6747
17934a13418D2923J0167a43353B6551J17124o8841a95473C3589E732b12107A67668
17922C29305k3648o0542g66E5455B1131a97667C6736c72359B52215b54371E4846
17910a96080B05063m7F7297E203J47921a8719C8496g6596j36082B66134b86427
17898d0161N5A15867a61476O0167I21i0627j17204A22305B2570k410h9095A7324
$$ plain form
17885 -26423 409339 99715 -3788 -52318 -425991 -32952 1617 -139802 -56736 14610 -106065
17873 -202413 17132 38832 -287082 176490 -76490 -183624 203790 105209 75352 -85946 163854
17861 -74985 -16004 -97510 -37082 -314677 119186 159769 237437 -111555 255535 196922 -32094
17849 203780 -16468 95559 -219631 106461 126358 136427 159958 21031 89064 81174 -169776
17837 -183710 248923 56815 2352 -55605 -121221 -212682 -48720 -274090 264159 -39389 -133081
17826 -133081 -220190 169171 -142300 -159868 29787 172765 -42210 126976 -243048 -127142
17816 -127142 -10745 -168708 238159 388133 -31650 -165215 291024 -107852 -139197 176265
17805 66152 310005 -103010 94114 122973 -117624 -262519 484377 84303 251461 156540
$$ packed form
17885b6423D09339I9715c788m8530l73673c2952A617a39802e6736A4610a06065
17873b02413A7132K1700b87082A76490g6490j07134B03790r8581k9857h5946A63854
17861g4985a6004q1506c7082k77595A19186M0583P7668a11555B55535n8613c2094
17849B03780a6468I5559b19631A06461J9897J0069K3531B1031O8033p890a69776
17837a83710B48923E6815B352e5605o5616r1461d8720k25370B64159c9389r3692
17826a33081q7109A69171a42300j7568B9787J42978d2210A26976b43048J15906
17816a27142a0745j57963B38159J49974c1650j33565B91024a07852l1345A76265
17805F6152K43853a03010I4114K8859a17624j44895D84377H4303J67158r4921
$$ plain form
17795 156540 -221011 -142031 31595 37064 297040 -29240 -178612 400344 229413 25232 252868
17784 252868 30643 -149467 -214938 -70224 2519 -35977 -193318 -67956 -21600 -45080 -113341
17773 -113341 125262 141300 -175322 50713 14385 290761 255197 -595782 82211 39635 -62050
17761 -18285 -1494 7510 -62810 263320 322248 -84081 -127041 218176 183667 -123650 24774
17749 308980 29278 -135516 37089 23665 29696 -46811 -65040 -350690 436975 -245844 -91314
17737 70820 -251666 -123907 303379 -14852 271170 170509 44034 -154778 -64470 2780 47074
17726 47074 -155038 118422 317696 -102104 -97768 303097 103952 -83001 -29459 18748 -200187
17714 25489 178748 45372 -36189 274785 115954 -230764 241812 51768 97980 -86914 153635
$$ packed form
17795A56540b21011P8980C1595N469K59976b9240j49372D00344j70931B5232K27636
17784B52868C0643a49467o5471g0224B519c5977j57341f7956b1600k3480o8261
17773a13341A25262J6038a75322E0713A4385K76376l5564e95782H2211C9635f2050
17761a8285a494G510f2810B63320N8928h4081m2960B18176l4509a23650B4774
17749C08980B9278a35516C7089j3424O031d6811j8229k85650D36975b45844i1314
17737G0820b51666a23907C03379a4852B71170j00661D4034a54778f4470B780M4294
17726D7074a55038A18422J99274a02104M336C03097A03952h3001b9459A8748b00187
17714B5489J53259D5372c6189B74785A15954b30764B41812E1768M6212h6914A53635
$$ plain form
17702 -119703 3604 40349 47708 -175707 250607 152496 109955 -200626 73056 276354 205491
17691 205491 34696 -71310 -121725 -346971 147342 104204 354875 -66831 181834 171766 -159417
17679 144749 -170748 -216587 73086 12156 33894 -282976 93613 -34973 27790 44628 -150147
17667 98694 38668 -126282 58631 176823 72688 42045 -154613 144637 231385 143269 -49602
17655 -82390 -54040 180709 87817 -4008 6683 -28656 -169929 -17290 58063 165335 253955
17644 253955 -247722 -125079 -78054 89887 -138990 -129518 194192 -11035 -42408 267582 -120468
17632 4166 -50994 -132140 168806 264964 -77817 24283 -68400 181612 81432 -90786 -298940
17621 -298940 -13531 353165 -107589 -204414 80082 -161033 -184425 4515 -117483 425739 -61357
$$ packed form
17702a19703C604L6745P359a75707B50607r8111m2541b00626G3056K03298p0863
17691B05491C4696g1310n0415k25246A47342m3138K50671f6831A81834j0068a59417
17679A44749a70748m5839G3086A2156K1738b82976I3613c4973B7790J6838a50147
17667I8694C8668a26282E8631J18192G2688l0643a54613A44637Q6748q8116d9602
17655h2390K8350A80709H7817d008F683b8656j41273a7290E8063J07272Q8620
17644B53955b47722J22643M7025H9887a38990R472A94192a1035l1373B67582a20468
17632D166e0994q1146A68806R6158g7817B4283f8400A81612H1432i0786k08154
17621b98940a3531C53165a07589r6825H0082a61033k3392D515a17483D25739f1357
$$ plain form
17609 145397 -9301 104726 -61904 447971 111782 77644 -83977 -81864 32307 -3875 -232594
17598 -232594 -5140 -134870 488890 126112 356694 470984 -83628 197688 166033 -6660 -114912
17587 -114912 88954 -71275 74263 125520 -29977 -58990 -44795 161954 147250 20898 138459
17576 138459 138482 -240104 169796 58716 -191944 200596 299987 177252 -129770 50633 -240923
17564 -147916 -194182 162344 -84150 -8732 108944 -42854 96258 165665 -96470 85552 42803
17553 42803 5711 182667 332756 281261 -163517 185886 86226 -21419 -29276 47970 16051
17541 50530 298141 155368 -104363 -148216 -123031 93915 239287 -83545 94928 -89319 164596
17529 26762 -39760 -125109 188780 1937 159197 263586 288699 208173 138027 16956 336436
$$ packed form
17609A45397i301A04726f1904D47971A11782l4138h3977K113C2307c875k28719
17598b32594e140j29730D88890A26112K30582J14290h3628A97688l1655f660j08252
17587a14912H8954g1275G4263N1257b9977k9013J4195A61954j4704B0898J17561
17576A38459K3b40104A69796E8716a91944B00596R9391j22735a29770E0633b40923
17564a47916m6266A62344h4150h732A08944d2854I6258O9407i6470H5552m2749
17553D2803E711J76956J50089n1495a63517A85886H6226b1419p857D7970A6051
17541E0530K47611j42773a04363m3853K5185I3915J45372h3545I4928h9319A64596
17529B6762c9760q5349A88780A937J57260J04389K5113q0526p0146A6956L19480
$$ plain form
17518 336436 192531 428196 266288 202207 78382 382565 13057 103650 122967 167930 -161154
17506 184247 -4441 227026 56131 268552 234118 212614 300510 60824 -48051 82100 -261475
17494 201679 153871 177492 37158 36489 36704 12898 129650 77032 280427 -36392 -62532 -21005
17481 -195656 10073 72711 103313 444742 31065 117802 -29287 63569 32229 371419 220915
17470 220915 121632 -18336 228639 -38099 193363 -30327 144010 269299 101832 163690
17460 163690 -16418 -123726 212450 220112 16580 9111 38642 -129756 8250 23185 16903 99290
17448 99290 389600 163069 -60788 37117 68113 69098 -119186 267083 496478 58456 264746
17437 264746 140393 315686 229465 132631 352649 -100721 125724 -33980 160663 50738
$$ packed form
17518C36436j43905K35665j61908o4081G8382L04183A3057R0593J9317M4963a61154
17506A84247d441B27026E6131K12421l4434k1504Q7896F0824d8051H2100b61475
17494B01679m7808K3621C7158o69K15A2898J16752n2618K03395c6392k6140b1005
17481a95656A0073O2638L0602L41429C1065Q6737b9287F3569l1340L39190j50504
17470B20915r9283a8336B28639c8099A93363c0327A44010J25289A01832O1858
17460A63690a6418j07308B12450P662A6580p469K9531a29756H250J4935o282Q2387
17448I9290K90310A63069f0788C7117L0996R85a19186B67083K29395E8456K06290
17437B64746j24353J75293q6221r6834K20018a00721A25724c3980A60663E0738
$$ plain form
17426 235817 452755 216306 286355 374386 226498 214066 193632 305639 400892 134547
17415 285210 15649 120339 217365 285196 115400 79133 63626 216229 220607 139617 243686
17404 243686 -32905 134857 109824 110219 -65605 -71315 101824 314317 33967 -126852 510373
17392 30674 40412 -50860 91879 300133 288 222066 44690 308669 -102556 85499 -69761
17380 -126957 -236123 22988 43489 187341 -408287 54748 133043 96741 -194769 52564 227556
17369 227556 -196394 454648 -65571 189420 189552 182703 147437 112685 137934 111949 -256253
17357 -17623 121599 32026 171989 -29992 34028 482102 -16267 43264 -25935 93794 40024
17345 167719 -100150 -187564 75242 -21547 46454 104692 -87288 283700 -101038 -56889 147773
$$ packed form
17426B35817K16938B16306P0049Q8031j47888j2432k0434J12007R5253A34547
17415B85210A5649J04690R7026O7831A15400l6267j5507J52603M378q0990J04069
17404B43686c2905A34857k5033L95f5605n710A01824K12493C3967a26852E10373
17392C0674R738e0860I1879K08254B88K21778D4690K63979a02556H5499f9761
17380a26957j09166B2988K0501J43852d08287E4748P8295l6302a94769E2564J74992
17369B27556a96394D54648f5571A89420J32o849l5266l4752K5249k5985b56253
17357a7623A21599C2026J39963b9992C4028M48074a6267D3264b5935I3794D0024
17345A67719a00150q7414G5242b1547D6454N8238h7288B83700a01038M4149A47773
$$ plain form
17333 211557 -281487 46220 398508 -17561 15333 227219 -94386 11423 292944 -152397
17322 36085 158114 221547 156575 116789 12110 313409 51250 -39617 295718 7545 279159
17311 279159 126324 355030 250669 157890 -2732 375487 251657 186473 271272 186639 200987
17300 200987 72319 351519 -97509 65189 94120 362214 -41710 183025 161073 138348 -160950
17288 332552 -217309 359159 52795 154124 235464 142139 238274 201308 162783 63491 -69277
17276 349087 90910 272655 449265 205585 -37324 53298 120958 73824 45774 82516 58670
17265 58670 92030 12455 -87376 305686 21664 224341 217453 313855 179084 566361 -22150
17253 77294 -99447 265625 88185 216839 137113 -52795 194513 297843 58057 267691 65546
$$ packed form
17333B11557b81487D6220L52288a7561A5333K11886i4386A1423K81521a52397
17322C6085J22029O3433o4972l9786A2110L01299E1250c9617B95718G545K71614
17311B79159A26324K28706j04361r2779b732C75487j23830o5184Q4799q4633J4348
17300B00987G2319K79200i7509F5189K8931K68094d1710A83025k1952k2725a60950
17288C32552b17309C59159E2795J01329Q1340r3325R6135l6966l8525F3491f9277
17276C49087I0910J81745J76610B05585c7324E3298O7660m7134k8050L6742k3846
17265E8670L3360A2455h7376C05686B1664K02677o888R6402j34771L87277b2150
17253G7294i9447B65625H8185J28654p9726e2795A94513J03330E8057K09634F5546
$$ plain form
17241 -25627 86751 246048 107211 28866 155160 201179 274459 317199 302871 -82836 466354
17229 113185 423522 287552 250766 426167 92379 381582 306646 277139 153808 378561
17219 378561 89028 309069 -63972 -21679 -2846 -85646 80178 213231 -57949 366720 236358
17208 236358 454618 -28341 339233 99128 26117 51184 20149 557444 502952 273224 113554
17196 269065 -58282 188403 352759 525321 -26088 195064 239351 247458 158796 142354 -99814
17184 253663 130940 369035 457855 331865 352424 78592 335479 302318 -8238 -28195 229695
17172 374202 239007 196947 -48497 222166 117639 257629 147707 61829 234271 403472
17162 403472 241402 181936 65858 262668 338856 128938 -13036 566549 43705 512922
$$ packed form
17241b5627H6751J59297A07211B8866J26294M6019P3280M2740j4328h2836D66354
17229A13185L10337j35970l6786J75401I2379K89203p4936k9507j23331K24753
17219C78561H9028K20041f3972b1679b846q2800H0178J33053e7949C66720j30362
17208B36358K18260b8341C39233I9128B6117K5067B0149N37295n4492k29728A13554
17196B69065e8282A88403J64356J72562b6088A95064M4287Q107q8662j6442i9814
17184B53663j22723K38095Q8820j25990K0559G8592K56887l3161h238j9957B29695
17172C74202j35195m2060d8497B22166j04527J39990j09922F1829J72442J69201
17162D03472j62070n9466F5858J96810P6188A28938a3036E66549D3705M69217
$$ plain form
17152 512922 322664 428383 225819 399868 299471 262166 108701 205502 351751 406650
17142 406650 672917 205204 319641 140684 82674 70817 331167 329382 582739 448474
17132 448474 107715 123507 40036 61191 94582 199620 31704 330962 321896 263113 432585
17121 432585 459068 132539 342429 223675 511382 467335 357809 576460 460158 195437
17110 173658 363714 -120392 261075 195112 277875 184009 621732 461452 517917 396012
17100 396012 257603 162508 202634 802831 -43701 188230 608594 285191 349832 293738
17090 293738 78953 299151 521193 153887 248182 86033 426314 310980 438271 216673
17079 -122886 334070 214268 249618 383531 457692 341735 122502 133091 221515 299378
$$ packed form
17152E12922j90258J05719k02564J74049j00397l7305A08701R6801J46249N4899
17142D06650K66267B05204J14437A40684n8010j1857K60350j785K53357j34265
17132D48474A07715J5792D0036K1155L3391J05038C1704K99258r066n8783J69472
17121D32585K6483A32539K09890j18754K87707m4047j09526K18651j16302A95437
17110A73658J90056a20392B61075o5963Q2763r3866M37723j60280N6465j21905
17100C96012j38409r5095M0126O00197d3701A88230M20364B85191O4641n6094
17090B93738G8953K20198K22042A53887R4295H6033L40281j15334J27291B16673
17079a22886C34070j19802L5350J33913P4161j15957A22502J0589Q8424P7863
$$ plain form
17069 299378 445003 197298 598034 307234 479868 143907 553264 193531 -63972 206417
17058 451777 319067 797879 371242 439267 303876 508672 185336 321084 330601 627164
17048 627164 389254 300913 304470 399281 670958 459606 436215 645924 393465 652610
17038 652610 256328 158130 405041 788134 520603 648834 400329 602351 504733 426898
17028 426898 404569 524406 600785 317262 579385 637427 970312 437315 313728 487710
17018 487710 870511 740651 515077 699518 922452 596251 656360 399922 583718 360267
17008 360267 741091 685829 284995 681855 785373 324883 699785 601684 832108 657780
16998 657780 599142 645212 747243 739329 677926 369782 876933 512122 514845 820110 432990
$$ packed form
17069B99378J45625A97298M00736k90800J72634A43907M09357A93531f3972B06417
17058D51777j32710M78812C71242O8025j35391K04796A85336J35748R517K96563
17048F27164k37910q8341L557R4811K71677k11352k3391K09709k52459K59145
17038F52610B56328r8198K46911L83093k67531J28231k48505K02022r7618p7835
17028D26898k2329J19837P6379k83523K62123N8042L32885D37315j23587J73982
17018D87710L82801j29860k25574J84441K22934l26201O0109k56438J83796k23451
17008C60267L80824n5262B84995L96860J03518C24883L74902r8101K30424j74328
16998F57780n8638M6070J02031p914o1403l08144N07151l64811K723L05265l87120
$$ plain form
16987 432990 678849 715172 628871 407000 486256 895863 749834 962138 714490 1053732
16977 1053732 576498 894635 702713 676693 745832 886959 987561 799317 709126 821821
16967 821821 799091 621142 883554 632089 1010126 649148 821212 697410 818386 644648
16957 644648 1003220 602843 804180 586135 1098385 1094209 883475 795104 633702 773552
16947 773552 988252 884105 797247 996885 1146707 866951 983581 978101 1041973 850345
16937 850345 934711 1211280 932867 935917 881422 921488 995132 726076 990110 1283811 1022505
16926 1022505 1168901 1349024 1157979 903002 1244101 1343463 959409 1081763 1286915 1202819
16916 1202819 1284937 1355194 1650574 1459738 1074695 1240663 1522172 1248555 1056478 1187413
$$ packed form
16987D32990K45859L6323q6301k21871P9256M09607j46029K12304k47648L39242
16977A053732m77234L18137j91922k6020O9139J41127J00602j88244r0191J12695
16967H21821k2730j77949K62412k51465L78037l60978J72064j23802J20976j73738
16957F44648L58572m00377K01337k18045N12250m176k10734q8371j61402J39850
16947G73552K14700j04147q6858J99638J49822k79756J16630n480O3872j91628
16937H50345Q4366K76569k78413L050n4495M0066P3644k69056K64034K93701k61306
16926A022505J46396J80123j91045k54977L41099R9362l84054J22354K05152q4096
16916A202819Q2118P0257K95380j90836l85043J65968K81509k73617j92077J30935
$$ plain form
16906 1187413 1489412 1399472 1190844 1381444 1729899 1272695 1443690 1854676 1788871 1402682
16896 1402682 1461130 1601899 1787742 1778703 2071648 1812168 1884341 1609250 2340148 2032340
16886 2032340 1622963 1642101 1740394 1924181 1868405 1857724 2108655 1980587 1884945 2050807
16876 2050807 1827575 2076098 2669225 1916032 2151444 2212896 2330828 2272606 1994698 2648298
16866 2648298 2559345 2270768 2653683 2684145 2498429 2669589 2825981 2710140 2847996 2894301
16856 2894301 2728256 2846945 3289997 3294788 3017337 3004417 3058521 3346433 3364010 3461422
16846 3461422 3382370 3422603 3519430 3654293 3708745 3761132 3703545 3697292 3989808 4012197 3740236
16835 3740236 4261953 4197482 4264403 4568000 4932632 4235511 4548571 4837249 4893431 4961488
$$ packed form
16906A187413L01999q9940k08628J90600L48455m57204J70995M10986o5805l86189
16896A402682N8448J40769J85843r039K92945k59480P2173k75091P30898l07808
16886B032340m09377J9138R8293J83787n5776j0681K50931j28068r5642J65862
16876B050807k23232K48523N93127p53193K35412O1452J17932n8222k77908O53600
16866B648298q8953k88577L82915L0462j85716J71160J56392j15841J37856M6305
16856B894301j66045J18689M43052M791k77451j2920N4104K87912J7577R7412
16846C461422p9052M0233R6827J34863N4452N2387n7587o253K92516K2389k71961
16835C740236N21717o4471O6921L03597L64632o97121L13060K88678N6182O8057
$$ plain form
16825 4961488 5149447 5123998 5349403 5607485 5472093 5582394 5463589 5734337 5888272 6269595
16815 6269595 6200496 6191007 6523129 6737660 7049829 7123587 7392235 7261815 7566620 7779055
16805 7779055 7998743 8160329 8502476 8061093 9158280 9201193 9258088 9744433 9993068 10172794
16795 10172794 10372628 10676552 11208322 11359438 11391664 12147159 12474189 12804738 13335403
16786 13335403 13540432 13992574 14648781 15139969 15427346 16152627 16719890 17277350 17883479
16777 17883479 18225242 19007052 19799629 20386105 21032525 21798205 22800369 23712748 24841407
16768 24841407 25882361 26885937 27798659 29153109 30322077 31664770 32659117 34435866
16760 34435866 36129864 37453456 39257459 41122123 43030359 44766933 47339606 49743816
$$ packed form
16825D961488J87959k5449K25405K58082j35392J10301j18805K70748J53935L81323
16815F269595o9099r489L32122K14531L12169P3758K68648j30420L04805K12435
16805G779055K19688J61586L42147m41383J097187M2913N6895M86345K48635J79726
16795A0172794J99834L03924N31770J51116L2226P55495L27030L30549N30665
16786A3335403K05029M52142O56207M91188K87377P25281N67263N57460O06129
16777A7883479L41763P81810P92577N86476O46420P65680J002164R12379J128659
16768B4841407J040954J003576R12722J354450J168968J342693R94347J776749
16760C4435866J693998J323592J804003J864664J908236J736574K572673K404210
$$ plain form
16752 49743816 51924978 54104229 57015391 59690597 62796924 65997253 69229062 72768910
16744 72768910 75846187 79797915 83320401 87444916 91391999 95265582 99723770 104238356
16736 104238356 108004071 112118876 115827762 119497310 123373478 126875216 129505760 132005722
16728 132005722 134020129 135684837 136665095 137079034 136527707 135853485 134766961 132766989
16720 132766989 130609793 128037830 125050061 121651413 118115306 114265384 110280217 106591314
16712 106591314 102195551 98382696 94485334 90776714 86646105 82737346 79280473 75938190
16704 75938190 72748392 69217757 66497332 63538246 60410549 57863695 55189390 53154108
16696 53154108 50932081 48808635 46470961 44613313 42774660 41031732 39354888 37845338
$$ packed form
16752D9743816K181162K179251K911162K675206L106327L200329L231809L539848
16744G2768910L077277L951728L522486M124515L947083L873583M458188M514586
16736A04238356L765715M114805L708886L669548L876168L501738K630544K499962
16728A32005722K014407J664708R80258M13939n51327o74222j086524j999972
16720A32766989k157196k571963k987769l398648l536107l849922l985167l688903
16712A06591314m395763l812855l897362l708620m130609l908759l456873l342283
16704G5938190l189798l530635k720425k959086l127697k546854k674305k035282
16696E3154108k222027k123446k337674j857648j838653j742928j676844j509550
$$ plain form
16688 37845338 36541870 35423892 33492142 32447287 31183823 30035929 28904181 27624175
16680 27624175 26933808 25955988 24912511 24155979 23511077 22607718 21821035 21073728 20421603
16671 20421603 19963313 19094233 18502190 18259660 17500178 16945722 16443809 15871395 15451079
16662 15451079 14836208 14952549 14053356 14058125 13522475 13104502 12652013 12117932 12090529 11477070
16652 11477070 11363620 11005181 10618084 10500559 10159910 9960478 9692135 9312765 9486587
16643 9486587 9207321 8489541 8878911 8322424 8227206 8030520 8160156 7794869 7230960 7152356
16633 7152356 7422457 7204573 6941501 6447897 6784049 6406269 6191486 5985001 5571861
16624 5571861 5634071 5952472 5575802 5519942 5565055 5329314 5142855 5429421 5290189 4867915
$$ packed form
16688C7845338j303468j117978j931750j044855j263464j147894j131748j280006
16680B7624175o90367r77820j043477p56532o44902r03359p86683p47307o52125
16671B0421603m58290q69080n92043k42530p59482n54456n01913n72414m20316
16662A5451079o14871J16341q99193M769n35650m17973m52489n34081k7403o13459
16652A1477070j13450l58439l87097j17525l40649j99432k68343l79370J73822
16643I486587k79266p17780L89370n56487r5218j96686J29636l65287n63909p8604
16633G152356K70101k17884k63072m93604L36152l77780k14783k06485m13140
16624E571861O2210L18401l76670n5860M5113k35741j86459K86566j39232m22274
$$ plain form
16614 4867915 5009495 4715187 4613566 4699172 4629661 4519242 4462521 4217355 4116863 4277890
16604 4277890 4187201 3902072 3746722 3783681 3581043 3664876 3939665 3590503 3255889 3588673
16594 3588673 3251608 3137818 2986558 3439113 3426781 3401090 3183100 2872702 2957930 3082144
16584 3082144 3016038 2681604 2854848 2735378 2598321 2431518 2574279 2724154 2663144 2243179
16574 2243179 2529327 2411652 2342207 2234858 2465456 2376546 2222615 2216116 2199451 2169601
16564 2169601 2183660 2044686 2196836 2026475 1827706 2387558 2029677 1837243 1670416 1780297
16554 1780297 1788811 1692814 1858798 1768867 2108038 1943434 1854256 1597579 1858560 1946848
16544 1946848 1468932 1553634 1677759 1774473 1504191 1731409 1584416 1541912 1572212 1512165
$$ packed form
16614D867915J41580k94308j01621Q5606o9511j10419n6721k45166j00492J61027
16604D277890r0689k85129j55350L6959k02638Q3833K74789l49162l34614L32784
16594C588673l37065j13790j51260M52555j2332k5691k17990l10398Q5228J24214
16584C082144o6106l34434J73244j19470j37057j66803J42761J49875o1010m19965
16574B243179K86148j17675o9445j07349K30598q8910j53931o499j6665k9850
16564B169601J4059j38974J52150j70361j98769N59852l57881j92434j66827J09881
16554A780297Q514r5997J65984q9931L39171j64604q9178k56677K60981Q8288
16544A946848m77916Q4702J24125R6714k70282K27218j46993m2504L0300o0047
$$ plain form
16534 1512165 1511507 1419425 1637363 1594394 1657703 1440128 1469083 1637743 1357631 1539520 1754347
16523 1754347 1356806 1337911 1513315 1331326 1621944 1355352 1413106 1415574 1244616 1630563
16513 1630563 1142784 1086344 1487969 810073 1149805 1462709 1282083 1495537 1137451 1114519
16503 1114519 1389261 1272919 1258904 1449984 1150543 1362005 1053833 1028059 1013546 975311
16493 975311 1390601 1197501 1122849 1040449 1373968 980272 901240 1241105 1224403 922072
16483 922072 826280 1091531 1060584 608297 749201 684910 1081583 846011 1005858 1240704
16473 1240704 913887 992673 993941 984796 933049 872355 724695 828369 1024594 786433 1335363
16462 1335363 1057288 847307 761175 1090871 966856 879719 763943 891971 630752 992318
$$ packed form
16534A512165o58r2082K17938m2969O3309k17575K8955J68660k80112J81889K14827
16523A754347l97541j8895J75404j81989K90618k66592N7754K468j70958L85947
16513A630563m87779n6440M01625o77896L39732L12904j80626K13454l58086k2932
16503A114519K74742j16342j4015J91080k99441K11462l08172k5774j4513l8235
16493I75311M15290j93100p4652q2400L33519l93696p9032L39865j6702l02331
16483I22072r5792K65251l0947m52287J40904o4291L96673k35572J59847K34846
16473A240704l26817P8786J268r145n1747o0694j47660J03674J96225k38161N48930
16462A335363k78075k09981q6132L29696j24015q7137j15776J28028k61219L61566
$$ plain form
16452 992318 802638 1158958 873629 892233 776478 782754 975283 882757 669724 496020
16442 496020 784965 841936 855440 1055446 1021076 347374 796015 548426 825749 667324
16432 667324 797596 677435 826085 784762 677958 749122 914601 525850 751161 743713
16422 743713 799515 911547 572503 972271 732700 411962 663348 695190 763911 970586
16412 970586 911797 641968 897266 784516 866692 832696 1347588 638315 657158 1002741
16402 1002741 744879 697375 832530 883629 689919 543937 825442 923520 674697 1054562
16392 1054562 595368 485877 742885 750166 633903 914045 885688 824520 1020947 518745
16382 518745 647679 807981 841543 809775 640623 928764 817439 664801 1153862 476023
$$ packed form
16452I92318j89680L56320k85329J8604j15755O276J92529r2526k13033j73704
16442D96020K88945N6971J3504K00006l4370C47374M48641k47589K77323j58425
16432F67324J30272j20161J48650m1323j06804P1164J65479l88751K25311p448
16422G43713N5802J12032l39044L99768k39571l20738K51386L1842O8721K06675
16412I70586n8789k69829K55298j12750Q2176l3996N14892F38315J8843L45583
16402A002741k57862m7504J35155N1099j93710j45982K81505R8078k48823L79865
16392A054562m59194j09491K57008P281j16263K80142k8357o1168J96427n02202
16382E18745J28934J60302L3562l1768j69152K88141j11325j52638M89061D76023
$$ plain form
16371 544303 500433 816851 1029846 877326 737886 774723 704183 635857 498960 809924
16361 809924 708349 743227 630433 607344 704193 766131 591775 675175 603757 665361 825649
16350 825649 840707 1020076 947971 545649 735328 517606 514373 863960 887911 847201 812492
16339 812492 652770 637566 939507 1003191 516555 805188 732862 992407 889173 433682
16328 810633 261880 817613 596717 806482 616450 731658 949878 559238 829249 749054
16318 749054 1199551 745182 701982 446505 525847 646797 948012 889232 753058 709798
16308 709798 891235 683888 798961 628276 263377 427693 759747 619780 819035 724658
16298 724658 535558 750862 624368 954804 551010 781729 838026 713787 646117 565494
$$ packed form
16371E44303m3870L16418K12995j52520j39440L6837p0540o8326j36897L10964
16361H09924j01575L4878j12794k3089R6849O1938j74356Q3400p1418O1604J60288
16350H25649J5058J79369p2105m02322J89679k17722l233L49587K3951m0710l4709
16339H12492j59722j5204L01941O3684m86636K88633p2326K59545j03234D33682
16328H10633B61880N55733k20896K09765j90032J15208K18220l90640K70011q0195
16318G49054M50497m54369m3200k55477P9342J20950L01215n8780j36174m3260
16308G09798J81437k07347J15073j70685B63377J64316L32054j39967J99255r4377
16298G24658j89100K15304j26494L30436m03794K30719N6297j24239o7670q0623
$$ plain form
16288 565494 959752 682432 626465 568141 616260 732835 361959 606342 375067 566150
16278 566150 520800 599522 516550 406222 450142 746035 511239 769478 573384 706263
16268 706263 578710 820719 797514 837893 509460 688433 766419 359029 848701 377189
16257 621720 572272 512780 511547 561761 718139 508437 777228 454704 682633 541542
16247 541542 567517 682539 665572 389870 434361 521441 478007 548804 894319 777993 704747
16236 704747 452720 320606 572799 383534 691428 686404 358369 500448 247377 430100
16226 430100 837236 321896 629213 689707 463010 452005 230503 334868 422745 392766
16216 392766 371069 379864 745035 335084 310469 321784 459859 422762 551845 421248 523473
$$ packed form
16288E65494L94258k77320n5967n8324M8119J16575C61959K44383k31275J91083
16278E66150m5350P8722q2972j10328M3920K95893k34796K58239j96094J32879
16268G06263j27553K42009k3205M0379l28433J78973P7986C59029M89672C77189
16257F21720m9448n9492j233N0214J56378k09702K68791l22524K27929j41091
16247E41542K5975J15022j6967k75702M4491Q7080m3434P0797L45515j16326p3246
16236G04747k52027j32114K52193j89265L07894n024l28035J42079B47377J82723
16226D30100M07136C21896L07317O0494k26697j1005k21502J04365Q7877k9979
16216C92766k1697Q795L65171C35084k4615J1315J38075l7097J29083j30597J02225
$$ plain form
16205 523473 470800 235161 664113 545040 395159 443161 397447 288918 569160 439463
16195 439463 586260 821989 592362 236004 421015 546162 520222 292088 515905 269259
16185 269259 609617 427172 245586 326121 507753 157167 303760 152460 321770 353424
16175 353424 518773 450814 214342 462208 261189 573327 317695 398071 76982 328918
16165 328918 379053 121253 284975 293807 325626 198614 375040 518824 287628 255295
16155 255295 227909 -14901 291138 384073 393433 405631 369025 -44487 713414 316797 380862
16144 380862 181657 342020 498134 125663 268178 -49664 171614 207280 382387 279287
16134 279287 315344 504956 137602 71538 718339 220959 240361 362428 109304 300371
$$ packed form
16205E23473n2673B35161M28952j19073j49881M8002m5714j08529K80242j29697
16195D39463J46797K35729k29627B36004J85011J25147k5940k28134K23817k46646
16185B69259L40358j82445j81586Q0535J81632A57167J46593j51300J69310L1654
16175C53424J65349o7959B14342K47866k01019L12138k55632Q0376G6982K51936
16165C28918N0135A21253J63722Q832L1819j27012J76426J43784k31196l2333
16155B55295k7386a4901B91138R2935R360J2198l6606d4487G13414C16797O4065
16144C80862A81657J60363J56114A25663J42515d9664A71614L5666J75107j03100
16134B79287L6057J89612A37602o6064O46801B20959J9402J22067A09304J91067
$$ plain form
16124 300371 81742 348806 12151 -70538 468032 78449 35939 180230 183637 362293 204590
16113 204590 307322 111650 186697 -45609 -101198 353206 4739 436172 405691 215327 221265
16102 221265 200105 154163 -10897 215772 402407 156749 451053 137321 195918 350283
16092 350283 104325 188127 478138 121810 260184 231203 93604 157488 25366 -9471 319926
16080 -353901 -143801 176576 -53402 -66313 34080 -160419 -413335 190077 136566 255316
16070 255316 -166801 242885 448435 -41612 11117 313376 -29460 -278940 199755 -230258
16059 121886 45851 116786 59635 48876 137821 -108067 282830 143386 -257312 475078
16048 282001 222400 187510 -184935 -283951 -187691 -35894 -219900 385693 -23002 -19523 -32817
$$ packed form
16124C00371H1742K67064A2151g0538D68032G8449C5939J44291L407J78656j57703
16113B04590J02732A11650P5047d5609n5589C53206D739M31433l0481j90364N938
16102B21265k1160m5942a0897B15772J86635A56749K94304A37321N8597J54365
16092C50283A04325Q3802K90011A21810J38374k8981I3604O3884B5366i471C19926
16080c53901a43801A76576e3402j2911C4080a60419k52916A90077n3511J18750
16070B55316a66801B42885K05550d1612A1117L02259b9460k49480A99755b30258
16059A21886D5851P0935n7151j0759Q8945a08067B82830j39444b57312D75078
16048B82001n9601l4890a84935r9016R6260c5894j84006C85693b3002L479j3294
$$ plain form
16037 -32817 299896 123416 62054 42444 91384 -13270 244892 110373 -115105 136778
16026 -25192 218137 124547 105466 185366 64920 64844 -212790 155126 -282123 -176456 52079
16014 231286 241388 35026 -15410 -77527 -15984 -92194 30499 120706 228372 3169 -60966
16002 -22991 -287406 55766 170853 -139880 97502 94177 -179977 27367 -356186 51602 148527
15991 148527 17979 223117 185044 -55028 300427 164541 89323 253696 406917 240370
15981 240370 570174 169818 352281 -4514 -240628 -108619 39270 -223773 61557 116901
15971 116901 -202565 365648 -56059 94825 -131008 -57174 -162700 -18036 23798 -53485 56458
15959 -219909 -57617 48917 135489 103357 -24243 -128863 190656 146087 -5313 -222502 -2791
$$ packed form
16037c2817B99896A23416o1362j9610M8940a3270B44892A10373a15105A36778
16026b5192B18137r3590j9081P9900F4920p6b12790A55126b82123J05667E2079
16014B31286J0102C5026a5410o2117a5984p6210C0499R0207J07666C169f0966
16002b2991k64415E5766J15087a39880I7502l325a79977B7367c56186E1602R6925
15991A48527A7979K05138l8073e5028C00427j35886p5218J64373J53221j66547
15981B40370L29804A69818J82463d514k36114a08619C9270b23773F1557N5344
15971A16901b02565C65648e6059I4825a31008e7174j05526a8036B3798e3485E6458
15959b19909e7617D8917Q6572l2132b4243j04620A90656m4569e313k17189b791
$$ plain form
15947 -72729 -97187 -174811 165666 -85649 43728 -79111 -78488 -157510 211780 -318984 -137522
15935 -105516 -237265 -252435 -199336 -48269 23193 47745 32926 -105169 -166472 -262344 193265
15923 208424 56976 -132924 -39169 -317554 -113992 -90479 -78887 157442 236370 -205412
15912 -211812 -77234 -244362 174820 62496 87029 181113 3825 -90413 123788 -400139 -84789
15900 -18495 114453 -85004 197956 134768 -21803 -300686 140638 -242521 -22102 71187 111534
15889 111534 -476 242667 -190788 -318479 269398 -182811 -140950 29497 111422 -41868 -154756
15878 -154756 86991 8626 14031 -244159 43517 196529 42185 -44721 -217541 -327291 -70987
15866 -55332 -143055 231973 -15650 109778 50606 1214 -224746 -62754 1541 -99681 -88487
$$ packed form
15947g2729k4458p7624A65666h5649D3728g9111O23p9022B11780c18984a37522
15935a05516j31749j5170N3099d8269B3193K4552j4819a05169o1303r5872A93265
15923B08424E6976a32924c9169k78385a13992K3513J1592A57442P8928b05412
15912b11812g7234j67128A74820F2496K4533R4084C825i0413A23788d00139h4789
15900a8495A14453h5004A97956o3188b1803k78883A40638b42521b2102G1187M0347
15889A11534d76B42667a90788j27691B69398a82811M1861B9497Q1925d1868j12888
15878a54756H6991H626N405b44159D3517J53012D2185d4721j72820j09750g0987
15866e5332q7723B31973a5650A09778E0606A214b24746f2754A541i9681J1194
$$ plain form
15855 -88487 -240841 106971 327795 -17166 -44589 76755 -143653 86911 90430 -40326 -152299
15844 -152299 113498 5027 -50397 8722 -5987 125869 38327 112610 214804 -47174 -45210 70277
15831 -358672 3078 99026 325678 -154512 57635 138120 32880 6142 -22044 -20351 39551 -25633
15818 -234826 -314197 123231 94357 287376 -76442 -228796 -28219 -254451 46761 -39722 79803
15806 -151197 335386 238588 80354 -65979 -160225 -45259 -7629 -6192 -193883 -4474 -41544 -335913
15794 -335913 41720 209594 146593 -229687 -81723 -55343 -94422 62260 -46554 394992 -35485
15782 282336 -29341 80670 -194503 19676 45673 95929 68893 235116 -244494 123981 68142
15771 68142 -122867 -165159 -356602 -129661 156491 194250 17260 -187147 100615 147821
$$ packed form
15855h8487j52354A06971K20824a7166k7423G6755a43653H6911L519d0326j11973
15844a52299A13498E027e0397H722e987A25869C8327P4283J02194d7174J964G0277
15831c58672C078R5948K26652a54512E7635Q0485C2880F142b2044J693C9551b5633
15818b34826p9371A23231k8874J93019g6442j52354b8219k26232D6761c9722G9803
15806a51197C35386r6798H0354f5979r4246d5259g629J437j87691d474l7070k94369
15794c35913D1720J67874o3001b29687h1723K6380l9079F2260d6554C94992c5485
15782B82336b9341H0670a94503A9676K5997N0256k7036J66223b44494A23981n5839
15771F8142a22867m2292j91443a29661A56491L7759A7260a87147A00615M7206
$$ plain form
15761 147821 183960 8563 3591 -170064 -22578 49221 -153503 113353 -265704 -154929 -59925
15749 -82158 107726 -113276 -168619 177271 123201 -111536 -154914 294410 -242210 362016
15738 -177354 -318642 -386569 -250774 -316427 108878 -84591 305061 -14245 -359599 -132633
15727 90953 21700 2291 -220880 279027 -227209 513 -427899 -164873 -79236 365077 -330626
15715 -91230 -42492 -403716 -351529 197913 -37576 118596 -407952 -146960 -250903 -10357
15704 -232039 -239138 206 115368 -223504 -108947 53226 -409089 -399365 -87290 307628 -175290
15692 -277791 295118 -162743 265831 -95020 -46162 -6684 12656 59429 -206454 -108458 62246
15680 -9004 -97942 -286764 -264348 -135455 -70618 -24098 201881 -112912 -64433 201924 -116729
$$ packed form
15761A47821L6139H563C591a70064b2578D9221a53503A13353b65704J10775e9925
15749h2158A07726a13276n5343A77271n4070a11536m3378B94410b42210C62016
15738a77354j41288o7927J35795o5653A08878h4591C05061a4245l45354a32633
15727I0953B1700B291b20880B79027b27209E13d27899a64873g9236C65077c30626
15715i1230d2492l61224N2187A97913c7576A18596d07952a46960j03943a0357
15704b32039p099B06J15162b23504a08947E3226d09089R724h7290C07628a75290
15692b77791B95118a62743B65831i5020d6162f684A2656M6773b06454R7996F2246
15680i004q8938j88822K2416J28893O4837b4098B01881a12912M8479B01924a16729
$$ plain form
15668 -96916 -81395 12252 -64834 -126658 -251460 255858 247866 -28627 45317 -153698 -73971
15656 98582 126051 15085 -233410 -85827 10004 -53130 162747 33582 -40498 -110624 101846
15644 85661 166442 -114128 -174355 183806 358354 143739 -50571 -51073 -35799 -90438 -93749
15633 -93749 33755 -74022 -288353 -239952 96780 -101941 -121563 131489 -173000 -228379 -147936
15622 -147936 101546 108444 -38517 -53585 176700 35719 42009 -209808 -203939 -149478 -207880
15611 -207880 -12209 -30329 44781 -23412 -43431 -34672 43573 -83837 82582 95476 -157086
15599 -25823 -52254 -28406 39776 97943 -276025 11186 54626 -320639 -211805 -653 18736
15587 117877 -216914 -155193 39578 105029 -168843 123908 -290189 -153142 127849 58157
$$ packed form
15668i6916J5521A2252f4834o1824j24802B55858p992b8627D5317a53698g3971
15656I8582K7469A5085b33410h5827A0004e3130A62747C3582d0498p0126A01846
15644H5661Q0781a14128o0227A83806J74548A43739e0571n02J5274n4639l311
15633i3749C3755g4022k14331M8401I6780a01941j9622A31489a73000n5379Q0443
15622a47936A01546O898c8517j5068A76700C5719O290b09808N869N4461n8402
15611b07880a2209j8120D4781b3412k0019Q759D3573h3837H2582J2894a57086
15599b5823k6431K3848C9776N8167b76025A1186M3440c20639J08834f53A8736
15587A17877b16914O1721C9578O5451a68843A23908b90189J37047A27849E8157
$$ plain form
15576 85455 -5153 78770 -190591 -111513 -19358 -173618 288756 239406 -183784 185142 51823
15564 33279 -435041 -26864 202440 -299187 -31632 179943 62794 33188 150036 -251095
15553 -31879 117213 -119885 5397 -153054 122360 -216888 85882 -267931 31873 -21221 -119871
15542 -119871 6668 125466 189528 107295 -105390 156910 -44754 209140 2854 -160182 107154
15530 322385 220091 16292 159746 -114001 -141375 -421907 70933 -170320 76942 -186725
15519 2024 -241208 -65198 1232 323708 -169331 -158904 114312 262205 -20827 387195 -107878
15507 267690 202229 -51134 181490 -207424 58109 146452 -209182 -155663 -93028 -274901 -59594
15495 43665 -302068 119631 40185 -186845 -29592 -42479 193181 33618 -275597 24241 120297
$$ packed form
15576H5455e153G8770a90591P9078a9358j54260B88756m9350a83784A85142E1823
15564C3279d35041b6864B02440b99187c1632A79943F2794k9606J16848b51095
15553c1879A17213a19885E397a53054A22360b16888H5882b67931C1873b1221r8650
15542a19871F668J18798O4062q2233a05390A56910d4754B09140B854a60182A07154
15530C22385j02294A6292J43454a14001k7374k80532G0933a70320G6942a86725
15519B024b41208f5198A232L22476a69331J0427A14312J47893b0827C87195a07878
15507B67690o5461e1134A81490b07424E8109Q8343b09182N3519O2635j81873e9594
15495D3665c02068A19631D0185a86845b9592j2887A93181C3618b75597B4241R6056
$$ plain form
15484 120297 129154 -53682 115345 -224321 -181002 37700 169004 180793 42640 38542 167672
15473 167672 69131 93930 60681 316285 150941 35656 84533 154152 84037 -58289 -59380
15462 -59380 -299840 -85026 11481 -327992 -141261 -52322 -44508 -212521 44793 65909 199806
15451 199806 -55906 23416 370421 47027 -90847 -54531 57466 47463 77834 153668 -163426
15439 120706 -11309 170685 283715 19060 41841 100561 -201329 117011 -56702 178804
15428 -140460 51530 6823 -43930 131084 -208725 -151913 40999 125102 331891 72520 -86058
15416 41548 62555 -248127 141176 161124 -241832 214046 -42258 291044 271721 -80262 -98210
15405 -98210 -251743 -587558 145425 160423 134176 289402 93915 349557 -97480 94273 -12020
$$ packed form
15484A20297Q857e3682A15345b24321M3319C7700J31304J1789D2640m098J29130
15473A67672F9131K4799l3249K55604A50941C5656M8877O9619p0115e8289j091
15462e9380k40460h5026A1481c27992a41261e2322P814j68013D4793K1116J33897
15451A99806e5906B3416L47005D7027i0847L6316E7466j0003L0371P5834a63426
15439A20706a1309A70685J13030A9060K2781N8720b01329A17011e6702A78804
15428a40460E1530F823d3930A31084b08725N6812D0999Q4103K06789G2520h6058
15416D1548K1007b48127A41176J9948b41832B14046d2258B91044j9323h0262j7948
15405i8210j53533l35815A45425J4998k6247J55226I3915K55642i7480I4273a2020
$$ plain form
15393 311603 18376 33538 261527 429721 -319318 14132 190814 180509 25885 -199048
15382 -61192 37820 -117647 -349685 89284 -388138 -212357 -221759 -213123 133336 -6573 -326452
15371 -326452 28496 -231097 308162 -6212 59638 -359430 124391 -46807 -12485 -79283 -18418
15359 160014 -80622 56450 110344 37397 -19484 -451127 170443 8392 -41560 -182948 407783
15347 208694 -174669 84253 -294577 140213 44882 148367 180729 85973 -148697 83423
15336 -41469 -67936 100554 -210348 -230871 161459 -406478 246961 9968 -59624 74328 -95084
15324 -269226 -244519 -212187 38021 -182716 298923 -102805 269106 -47489 -23634 -90034 338525
15312 270693 -92865 14584 241694 -47504 121218 34561 64826 172595 -1223 234089 -131443
$$ packed form
15393C11603A8376J5162K27989J68194c19318A4132J76682j0305B5885a99048
15382f1192C7820a17647k32038H9284c88138J75781r402Q636A33336f573l19879
15371c26452B8496b31097C08162f212E9638c59430A24391d6807a2485o6798a8418
15359A60014h0622E6450N3894C7397a9484m31643A70443H392d1560j41388D07783
15347B08694a74669H4253b94577A40213D4882J03485L2362H5973a48697H3423
15336d1469k6467A00554b10348k0523A61459d06478B46961I968e9624G4328i5084
15324b69226K4707L2332C8021a82716B98923a02805B69106d7489b3634o6400C38525
15312B70693i2865A4584K27110d7504A21218C4561L0265J07769a223B34089a31443
$$ plain form
15300 -12153 -238224 314914 3121 -312991 -24486 92238 214322 -228323 99189 -84620 65631
15288 17739 -143434 121934 -78110 -70720 -285593 194468 -204722 162045 -117346 -78481
15278 -78481 377350 -20768 56087 515365 128579 178361 -361135 54895 25962 -30462 117328
15266 15984 303371 240810 90647 -64093 108841 153637 -36982 -96758 77211 174747 -53332
15254 6715 248129 134873 436979 859576 645967 889918 400174 48634 -30133 90496
15243 89633 141442 5603 -95267 8213 35932 -54042 209617 345659 -105632 48557 40032 -110844
15230 121079 -18201 76736 85319 -93222 32879 -31215 -320839 -10697 411468 -147624 -94472
15219 -94472 -101934 111267 188187 -101455 184755 6744 65645 -143334 -235298 -66709 97910
$$ packed form
15300a2153k26071C14914C121c12991b4486I2238J22084b28323I9189h4620F5631
15288A7739a43434A21934g8110P390k14873A94468b04722A62045a17346L8865
15278g8481C77350b0768E6087M59278A28579M9782c61135E4895B5962c0462A17328
15266A5984K87387o2561I0647f4093A08841M4796c6982n9776G7211R7536e3332
15254F715K41414j13256L02106M22597k13609K43951D00174D8634c0133I0496
15243H9633N1809E603i5267H213K7719e4042B09617J36042a05632D8557q525a10844
15230A21079a8201G6736Q583i3222C2879c1215k89624a0697D11468a47624N3152
15219i4472p462A11267P6920a01455A84755F744N8901a43334r1964f6709I7910
$$ plain form
15207 121170 220275 232359 49163 87098 148212 45271 165973 351083 90343 272817 11863
15195 -292531 65920 255909 172128 298945 328189 23786 91294 156635 51566 383499 42948
15183 -129909 -153212 275611 136853 70682 -53242 91478 -92935 243084 230237 64739 66311
15172 66311 296559 116206 141905 126534 -18133 51920 44413 224043 178822 -86313 -59264
15161 -59264 197654 196142 36431 -49325 28079 -138562 -117928 137986 -389975 -150666 185927
15149 -17006 -87841 130028 -396190 355544 -46147 161874 138497 -57999 -39693 -132960 247749
15137 199946 61238 341364 45549 -39432 61269 89917 109172 78549 14968 181026 17423
15125 -255755 113801 34862 343079 27769 258726 31127 89047 14085 120555 194309 304117
$$ packed form
15207A21170R9105J2084D9163L7935O1114D5271J20702J85110I0343J82474A1863
15195b92531F5920J89989q3781J26817K9244B3786O7508O5341E1566L31933D2948
15183a29909k3303B75611A36853o6171e3242I1478i2935B43084j2847F4739J572
15172F6311K30248A16206K5699j5371a8133E1920p507J79630m5221h6313K7049
15161e9264A97654j512C6431d9325B8079a38562K0634A37986c89975a50666A85927
15149a7006p0835A30028c96190C55544d6147A61874k3377e7999J8306r3267B47749
15137A99946F1238K80126D5549c9432F1269K8648J9255l0623A4968J66058A7423
15125b55755A13801C4862L08217B7769K30957C1127N7920A4085J06470P3754J09808
$$ plain form
15114 304117 -70767 144889 377529 -16130 -74139 -117400 2401 134852 -29168 -190194 -37710
15102 133359 -270569 -69557 -217086 111981 139646 77625 107686 141117 -158796 253639
15091 355258 -130470 7264 -49482 231732 -130184 93742 -71449 -38629 -190094 -67300 191979
15079 129247 -153769 -13113 332701 230089 194081 -91484 142870 -189673 447867 97981
15068 -72719 -371662 424843 133337 217601 50982 144572 161869 148663 27964 -129771 77623
15056 -921 192295 248161 132356 52071 488069 499679 382500 93132 248862 23974 195104
15045 195104 85187 197611 265835 352955 275127 61021 124258 181156 -58111 104102 245061
15034 245061 391936 -188792 159000 191090 412165 279126 340315 -100483 351254 327678
$$ packed form
15114C04117g0767A44889K32640a6130n8009m3261B401J32451b9168j61026c7710
15102A33359b70569f9557j47529A11981K7665o2021L0061L3431a58796B53639
15091C55258a30470G264d9482B31732a30184I3742g1449L2820j51465f7300A91979
15079A29247a53769a3113C32701j02612l6008i1484A42870a89673D47867I7981
15068g2719k98943D24843A33337Q4264E0982R3590J7297j3206B7964a29771G7623
15056i21A92295N5866j15805E2071M35998J1610j17179I3132J55730B3974J71130
15045A95104H5187J12424O8224Q7120p7828F1021O3237N6898e8111A04102J40959
15034B45061J46875a88792A59000L2090K21075j33039O1189a00483C51254k3576
$$ plain form
15024 327678 329456 129569 166198 258363 299624 417770 331269 51960 -180856 300782 280809
15013 280809 161803 172622 180530 10567 550945 230937 -206435 112476 -94000 132886
15002 459274 289356 235620 476382 -4724 156907 -16815 527364 -150050 25513 216286
14992 216286 71241 643026 296654 143343 345255 326241 389497 -21054 43199 430009
14982 430009 298515 322969 420170 213552 533112 326741 129086 93863 270936 492231
14972 492231 75827 270171 66270 126566 39781 299586 282174 391341 422866 194290 157169
14961 157169 72355 121030 82661 396964 54133 290141 289192 394684 269673 154579 463632
14950 463632 79778 179893 -172935 318057 62469 309248 195974 486794 332032 101241
$$ packed form
15024C27678J778A29569L6629R2165M1261J18146q6501E1960a80856C00782j9973
15013B80809j19006J0819P908A0567N40378B30937b06435A12476i4000A32886
15002D59274j69918n3736K40762d724A56907a6815E27364a50050B5513J90773
14992B16286G1241N71785B96654A43343K01912j9014O3256b1054D3199L86810
14982D30009j31494K4454R7201k06618L19560k06371A29086l5223J77073K21295
14972D92231G5827J94344F6270O0296C9781K59805j7412J09167L1525A94290l7121
14961A57169G2355M8675l8369L14303E4133K36008r49J05492j25011j15094L09053
14950D63632G9778J00115a72935C18057F2469K46779j13274K90820j54762A01241
$$ plain form
14939 354920 338604 279801 242625 370904 -126239 399096 376140 216177 562412 251020
14928 412084 145945 299490 36913 214898 624521 681056 358900 496363 267894 223297
14918 223297 524082 410978 509368 565887 479501 283589 506772 456605 346203 365172
14908 365172 387383 225217 194421 623138 554989 69676 6997 47213 342860 693088 66452
14896 438663 502856 357181 325148 -98107 232503 105063 236004 407523 65261 84344
14886 84344 127236 340433 523336 158714 455438 438752 273561 692883 257573 326127
14876 326127 119876 158578 -124756 463639 443713 318770 228230 -48627 426161 764651
14866 764651 200486 -48335 101863 426067 252740 437671 410952 542271 384295 84424
$$ packed form
14939C54920j6316n8803l7176J28279a26239C99096k2956j59963L46235B51020
14928D12084A45945J53545C6913J77985M09623N6535l22156J37463k28469m4597
14918B23297L00785j13104R8390N6519q6386j95912K23183n0167j10402J8969
14908C65172K2211j62166l0796M28717o8149F9676F997M0216K95647L50228F6452
14896D38663O4193j45675l2033i8107B32503A05063J30941J71519F5261J9083
14886H4344M2892K13197J82903A58714K96724j6686j65191M19322B57573O8554
14876C26127A19876L8702a24756D63639j9926j24943r0540d8627D26161L38490
14866G64651B00486d8335A01863L24204j73327J84931k6719J31319j57976H4424
$$ plain form
14855 169289 190425 663540 126788 457814 298317 560734 300550 534390 494883 526176
14845 526176 544419 793758 360837 453816 141706 239760 406679 364401 453103 536946 559693
14834 559693 88747 632790 439948 632751 380718 485857 309380 473775 323229 578820
14824 578820 678202 442017 620748 221505 191219 127670 396736 379327 136600 444004
14814 444004 44557 758482 201961 423566 563870 561209 487366 276358 222233 388214
14804 388214 494696 414742 587978 376527 720055 404257 373816 504902 286438 425464
14794 425464 547931 453140 362690 563818 548151 435087 289824 683703 626870 709294
14784 709294 72724 435094 20532 704226 247148 595909 600320 335273 366024 504804
$$ packed form
14855A69289K1136M73115A26788L31026j59497K62417k60184K33840l9507L1293
14845E26176J8243K49339C60837R2979A41706R8054J66919m2278Q8702Q3843K2747
14834E59693H8747N44043j92842J92803k52033J05139j76477J64395j50546K55591
14824E78820R9382k36185J78731B21505l0286o3549K69066j7409A36600L07404
14814D44004D4557P13925B01961K21605J40304k661p3843k11008n4125J65981
14804C88214J06482p9954J73236k11451L43528l15798l0441J31086k18464J39026
14794D25464J22467r4791r0450K01128j5667j13064j45263L93879n6833Q2424
14784G09294G2724L62370B0532O83694B47148L48761M411k65047L0751J38780
$$ plain form
14774 504804 830754 636325 622560 507910 599125 284914 422697 548952 658495 566107
14764 566107 421852 682700 428377 329249 400237 409906 518389 471898 333280 500753
14754 500753 787431 455579 574003 570320 483190 641208 458831 279425 638992 898654
14744 898654 280499 401306 486744 593348 509546 485312 508549 640506 607691 831379
14734 831379 748238 534842 545911 855332 830906 515371 518833 637213 531813 1047169
14724 1047169 610792 524519 651267 580603 822305 673543 627025 751530 851356 616011
14714 616011 696461 664534 539365 918674 634853 415686 529511 490704 538131 917832
14704 917832 603778 922448 999602 746463 843173 735581 577916 1022123 877907 1069335
$$ packed form
14774E04804L25950j94429j3765j14650R1215B84914J37783J26255J09543r2388
14764E66107j44255K60848k54323r9128P0988R669J08483m6491j38618J67473
14754E00753K86678l31852J18424l683q7130J58018j82377j79406L59567K59662
14744H98654B80499J20807Q5438J06604q3802k4234K3237J31957l2815K23688
14734H31379q3141k13396J1069L09421k4426l15535L462J18380j05400N15356
14724A047169m36377q6273J26748p0664K41702j48762m6518J24505R9826k35345
14714F16011Q0450l1927j25169L79309k83821k19167J13825l8807M7427L79701
14704I17832l14054L18670P7154k53139R6710j07592j57665M44207j44216J91428
$$ plain form
14694 1069335 630889 848680 789161 776258 1026667 792120 706171 911554 703976 624499
14684 624499 967730 661941 922436 1206049 844635 1092673 627867 749814 963463 1057709
14674 1057709 880918 1000734 826694 739095 933115 771125 767912 647500 1027048 942616
14664 942616 866893 884697 1209317 799876 922969 963928 898847 888155 773562 737118 739125
14653 739125 767502 941450 753157 918447 801279 1029336 790330 1091064 1227173 912805
14643 912805 939211 832189 1089710 560774 755041 1207719 614227 1035662 813666 1075975
14633 1075975 1028148 1101910 1138268 1166214 1109983 1194109 983595 980647 1274420 963072 1019537
14622 1019537 1154067 1273152 1120486 1310821 905064 1153657 1429722 1097816 978567
$$ packed form
14694A069335m38446K17791n9519j2903K50409k34547q5949K05383k07578p9477
14684F24499L43231l05789K60495K83613l61414K48038m64806J21947K13649R4246
14674A057709j76791J19816j74040q7599J94020j61990l213j20412L79548q4432
14664I42616p5723J7804L24620m09441J23093M0959o5081j0692j14593l6444K007
14653G39125K8377J73948j88293J65290j17168K28057k39006L00734J36109l14368
14643I12805K6406j07022K57521n28936J94267M52678n93492M21435k21996K62309
14633A075975m7827P3762L6358K7946n6231Q4126k10514k948K93773l11348N6465
14622A019537J34530J19085j52666J90335m05757K48593K76065l31906j19249
$$ plain form
14613 978567 1301502 617232 1566028 1276452 1617144 1378137 1203644 1458492 1135941 1257473
14603 1257473 1463247 1300795 1294318 1392854 1455719 1150824 1238408 1532887 1301465 1636384
14593 1636384 1004007 1371424 1400123 1207070 1625180 1817026 1332379 1781334 1538473 1355971
14583 1355971 1644893 1573215 1792815 1258431 1656888 1987639 1346847 1514164 1639409 1860908
14573 1860908 1666138 1974453 1842641 2213712 1765715 2007316 1964025 2323278 2127125 2101878
14563 2101878 1992467 2321308 2179883 2650862 2431645 2578023 2682785 2904300 3306587
14554 3306587 3464572 3864560 4376596 5494305 6786740 9701403 14152351 20487488 26090171
14545 26090171 23649869 15402194 8654736 5520919 3620604 2924265 2168979 1978272
$$ packed form
14613I78567L22935F17232R48796k89576L40692k39007j74493K54848l22551J21532
14603A257473K05774j62452o477R8536O2865l04895Q7584K94479k31422L34919
14593A636384o32377L67417K8699j93053M18110J91846m84647M48955k42861j82502
14583A355971K88922p1678K19600n34384L98457L30751o40792J67317J25245K21499
14573A860908j94770L08315j31812L71071m47997K41601m3291L59253j96153k5247
14563B101878j09411L28841j41425M70979k19217J46378J04762K21515M02287
14554C306587J57985L99988N12036J117709J292435K914663M450948O335137N602683
14545B6090171k440302q247675o747458l133817j900315o96339p55286j90707
$$ plain form
14537 1978272 1741587 1932505 1930187 2062160 1942826 1946597 1970366 1702653 1715789 2027316
14527 2027316 1780954 1938123 1785098 2187563 2187053 2124061 2309951 2252969 1684795 2188716
14517 2188716 2049728 1940173 2177881 2321530 1948373 2310196 2318384 2476290 2366513 2094830
14507 2094830 2329309 2771537 2298909 2714348 2660117 2560457 2342166 2389345 2406808 2670991
14497 2670991 2659940 2539376 2400496 2736553 2842555 3100496 2964618 2866005 2734409 2653377
14487 2653377 2918847 3112581 2815447 2802917 3008060 2966922 3159470 3175910 3288975 3049365
14477 3049365 3465995 3492220 3014048 3543290 3492903 3445468 3449336 3485640 3681238 3445564
14467 3445564 3779604 3902306 3965771 3850403 4193931 3674691 3774937 3965488 3873946 4237930
$$ packed form
14537A978272k36685J90918k318J31973j19334L771K3769k67713J3136L11527
14527B027316k46362J57169j53025M02465n10o2992J85890n6982n68174N03921
14517B188716j38988j09555K37708J43649l73157L61823Q188J57906j09777k71683
14507B094830K34479M42228m72628M15439n4231r9660k18291M7179J7463K64183
14497B670991j1051j20564j38880L36057J06002K57941j35878r8613j31596q1032
14487B653377K65470J93734k97134j2530K05143m1138J92548J6440J13065k39610
14477C049365M16630K6225m78172N29242n0387m7435L868L6304J95598k35674
14467C445564L34040J22702O3465j15368L43528n19240J00246J90551r1542L63984
$$ plain form
14457 4237930 4470622 4104225 4302540 4239115 4303130 4389448 4545576 4678159 4394715 4874176
14447 4874176 4633553 4665986 4802283 4924125 4876593 4949235 5043171 4802907 5092624 5278341
14437 5278341 5109320 5396249 5291790 5629783 5479139 5563048 5787196 5849729 6003139 6155880
14427 6155880 5980307 6065913 6085199 6386946 6156197 6179865 6626473 6847628 6422171 6801193
14417 6801193 6859063 7216688 6935633 7374938 7466653 7505581 7696253 7774573 7873391 7979184
14407 7979184 7976389 8297087 8231419 8262689 8439235 8654678 8787481 8570096 8890441 9007707
14397 9007707 9484247 9369130 9697510 9679274 10020040 10003862 10036305 10514926 10517855 10740159
14387 10740159 10777862 11027603 11274737 11767082 11689564 11643647 11907225 12313173 12769778 12922645
$$ packed form
14457D237930K32692l66397J98315o3425O4015Q6318J56128J32583k83444M79461
14447D874176k40623L2433J36297J21842m7532P2642R3936k40264K89717J85717
14437E278341j69021K86929j04459L37993j50644Q3909K24148O2533J53410J52741
14427F155880j75573Q5606J9286L01747k30749K3668M46608K21155m25457L79022
14417F801193N7870L57625k81055M39305R1715L8928J90672P8320R8818J05793
14407G979184k795L20698o5668L1270J76546K15443J32803k17385L20345J17266
14397I007707M76540j15117L28380j8236L40766j6178L2443M78621K929K22304
14387A0740159L7703K49741K47134M92345p7518m5917K63578M05948M56605J52867
$$ plain form
14377 12922645 13286552 13250563 13640464 14283301 14429200 14434416 14891319 15037448 15403182 15354929
14367 15354929 16089815 16079964 16468263 16814812 17289985 17624137 17943815 18373410 18965605 19447223
14357 19447223 19787268 20212982 20687563 21006453 21518170 22177677 22377249 23079672 23657539
14348 23657539 24204640 25022859 25723284 25951279 26714397 27443778 28339572 29177503 30205102
14339 30205102 30641767 31653004 32373120 33250931 34307052 35182198 36419040 37276398 38577158
14330 38577158 39805093 41486548 42449834 43887203 45381670 46868602 48490033 50235436
14322 50235436 52045775 53811210 55671031 57891581 59839778 62463003 64640495 67298375
14314 67298375 69682179 72836339 75843693 78899140 82290031 85915251 89568681 93499042
$$ packed form
14377A2922645L63907l5989L89901O42837J45899N216M56903J46129L65734m8253
14367A5354929P34886r851L88299L46549M75173L34152L19678M29595N92195M81618
14357A9447223L40045M25714M74581L18890N11717O59507J99572P02423N77867
14348B3657539N47101Q18219P00425K27995P63118P29381Q95794Q37931J027599
14339C0205102M36665J011237P20116Q77811J056121Q75146J236842Q57358J300760
14330C8577158J227935J681455R63286J437369J494467J486932J621431J745403
14322E0235436J810339J765435J859821K220550J948197K623225K177492K657880
14314F7298375K383804L154160L007354L055447L390891L625220L653430L930361
$$ plain form
14306 93499042 97838698 102430968 106959781 111727442 117547647 122859947 129016849 135352215
14298 135352215 142248814 149562299 157335896 165482372 173891737 183210418 193233218 203317651
14290 203317651 214454609 225779449 237901536 250254085 263573500 277135242 291162886
14283 291162886 305072297 319797255 334151880 348263172 362237786 375168031 387488714
14276 387488714 398271413 407669234 415467944 420535360 422561276 422528749 421422424 419699310
14268 419699310 417239927 412622507 406092470 397465624 386635192 374633343 361105244
14261 361105244 346912191 332713526 318154928 303780693 289694454 275537902 261948288
14254 261948288 248933501 236198927 224264503 212884542 202380831 192306630 182258038
$$ packed form
14306I3499042M339656M592270M528813M767661N820205N312300O156902O335366
14298A35352215O896599P313485P773597Q146476Q409365R318681J0022800J0084433
14290B03317651J1136958J1324840J2122087J2352549J3319415J3561742J4027644
14283B91162886J3909411J4724958J4354625J4111292J3974614J2930245J2320683
14276C87488714J0782699R397821P798710N067416K025916l2527j106325j723114
14268D19699310k459383m617420o530037q626846j0830432j2001849j3528099
14261C61105244j4193053j4198665j4558598j4374235j4086239j4156552j3589614
14254B61948288j3014787j2734574j1934424j1379961j0503711j0074201j0048592
$$ plain form
14247 182258038 173108982 164474531 156686777 149004155 141860369 135046952 128600189 122609721
14239 122609721 117457845 112132130 107239165 102275339 98022263 93886471 89875789 86209591
14231 86209591 82959031 79486533 76136969 73320005 70624531 67805252 64955897 62652246
14223 62652246 60527896 58371866 56372215 54181856 52843656 50732864 49337464 47692265
14215 47692265 46229103 44326551 43084386 42006342 40337869 39175380 38108054 36950999
14207 36950999 36309688 35244686 33703610 33139987 32151016 31436485 30871925 29669886 28742399
14198 28742399 28304788 27247719 26436514 25890787 25560166 24506412 24023921 23211624 22868260
14189 22868260 22393356 21428060 21171500 20811370 20076341 19785219 19294722 18851082 18455985
$$ packed form
14247A82258038r149056q634451p787754p682622p143786o813417o446763n990468
14239A22609721n151876n325715m892965m963826m253076m135792m010682l666198
14231H6209591l250560l472498l349564k816964k695474k819279k849355k303651
14223F2652246k124350k156030j999651k190359j338200k110792j395400j645199
14215D7692265j463162j902552j242165j078044j668473j162489j067326j157055
14207C6950999o41311j065002j541076n63623r88971p14531n64560j202039r27487
14198B8742399m37611j057069q11205n45727l30621j053754m82491q12297l43364
14189B2868260m74904r65296k56560l60130p35029k91122m90497m43640l95097
$$ plain form
14180 18455985 18177330 17971489 17204425 16879435 16289291 16298140 15482603 15576278 15145270 14639090
14170 14639090 14692564 14256297 13915519 13569319 13543539 13179161 12909035 12718223 12468612 12325714
14160 12325714 11960398 11713058 11707474 11464890 10941692 10870970 10900264 10614283 10868504 10240191
14150 10240191 10365669 9863100 9637180 9513455 9349124 9249665 8954544 8907910 8692866 8602178
14140 8602178 8592662 8196339 8096669 7853088 7829925 7861318 7847093 7405578 7471151 7315188 7548157
14129 7548157 7082308 6916078 6919981 6576618 6603108 6316032 6711218 6425734 6336628 6557800
14119 6557800 6485680 5838946 5993402 6004707 6152362 6048717 5664358 5742693 5942576 5514101
14109 5514101 5436018 5610866 5102997 4947716 5327579 5381973 5103383 4492221 5004833 5035242
$$ packed form
14180A8455985k78655k05841p67064l24990n90144Q849q15537R3675m31008n06180
14170A4639090N3474m36267l40778l46200k5780l64378k70126j90812k49611j42898
14160A2325714l65316k47340n584k42584n23198p0722K9294k85981K54221o28313
14150A0240191J25478n02569k25920j23725j64331r9459k95121m6634k15044r0688
14140H602178r516l96323r9670k43581k3163L1393j4225m41515O5573j55963K32969
14129G548157m65849j66230L903l43363K6490k87076L95186k85484q9106K21172
14119F557800p2120o46734J54456J1305J47655j03645l84359P8335J99883m28475
14109E514101p8083J74848n07869j55281L79863N4394k78590o11162N12612L0409
$$ plain form
14099 5035242 4633158 4790465 4704649 4710453 4640343 4713734 4561006 4498139 4501876 4466276 4323958
14088 4323958 4247379 4089298 4165368 4173175 4008683 4101098 4096039 3953802 4123244 3912624 4132934
14077 4132934 3759579 3742819 3776813 3566383 3618682 3808114 3605113 3640586 3594842 3281030
14067 3281030 3612814 3326202 3180974 3455283 3359764 3164215 3581450 3100171 3114533 3139710
14057 3139710 3142783 3283386 3148635 2991715 3168223 2879273 2885407 3151006 3019094 2831595
14047 2831595 2812769 2819904 2934469 2860102 2894473 2730171 2849523 2709045 2679689 2804628
14037 2804628 2706233 2475974 2597591 2428520 2595418 2349053 2355276 2366206 2362882 2575473
14027 2575473 2301595 2349891 2209502 1937465 2258528 2354263 2219368 2159799 2233333 2195623
$$ packed form
14099E035242m02084J57307q5816N804p0110P3391j52728o2867L737l5600j42318
14088D323958p6579j58081P6070P807j64492R2415n059j42237J69442k10620K20310
14077D132934l73355j6760L3994k10430N2299J89432k03001L5473m5744l13812
14067C281030L31784k86612j45228K74309r5519j95549M17235m81279J4362K5177
14057C139710L073J40603j34751j56920J76508k88950O134K65599j31912j87499
14047B831595j8826P135J14565p4367L4371j64302J19352j40478k9356J24939
14037B804628r8395k30259J21617j69071J66898k46365O223J0930l324K12591
14027B575473k73878M8296j40389k72037L21063R5735j34895n9569P3534l7710
$$ plain form
14017 2195623 2115198 2136364 2093950 2290742 2098187 2092985 2162565 2013115 2014812 1719223 2041896
14006 2041896 1822198 2024610 1975430 1902969 1668046 1826504 1810117 1866706 1846370 1848070 2029294
13995 2029294 1960185 1911974 2406493 2760269 3153739 3859808 5789530 9195073 15970743
13986 15970743 23821761 25303268 18206683 11663090 7849899 5689070 4389667 4036568
13978 4036568 3327604 3284176 2705021 2468097 2498761 2552159 2501501 2060326 2044795 2040119 1953052
13967 1953052 1967136 1958948 1837213 1792047 1759717 1954752 1821761 1789225 1903291 1689479
13957 1689479 1655835 1829118 1565855 1502176 1450610 1706574 1703818 1651559 1803949 1701087
13947 1701087 1537585 1686632 1449606 1907494 1377948 1313774 1613773 1483083 1171365 1405184
$$ packed form
14017B195623q0425K1166m2414J96792j92555n202O9580j49450J697k95589L22673
14006B041896k19698K02412m9180p2461k34923J58458j6387N6589k0336J700J81224
13995B029294o9109m8211M94519L53776L93470P06069J929722L405543O775670
13986A5970743P851018J481507p096585o543593l813191k160829j299403l53099
13978D036568p08964m3428n79155k36924L0664N3398n0658m41175j5531m676q7067
13967A953052J4084q188j21735m5166l2330J95035j32991l2536J14066k13812
13957A689479l3644J73283k63263o3679n1566K55964k756n2259J52390j02862
13947A701087j63502J49047k37026M57888n29546o4174K99999j30690l11718K33819
$$ plain form
13937 1405184 1219063 1366513 1231483 1352048 1352389 1437747 1294790 1301925 1127000 1341096
13927 1341096 1185536 1561337 1479332 1259337 1146633 1180525 1325032 1356515 1002086 1230083
13917 1230083 1039124 857599 1065067 1252023 1557269 1421048 1175863 1123562 1389858 788414
13907 788414 921032 1050010 785882 1286574 912727 1169966 1356146 1180430 1348304 1193332
13897 1193332 977521 1396748 762373 1105912 1181208 1148311 707797 1356425 992271 1168145
13887 1168145 737682 912630 1094609 830566 1134223 755088 1102335 989539 868228
13878 868228 654603 989202 820632 1206092 999175 698284 1203040 1049764 1165735 526083
13867 818947 952047 839368 1121485 497340 773948 496359 853292 1048638 1284141 673495
$$ packed form
13937A405184j86121J47450j35030J20565L41Q5358j42957P135j74925K14096
13927A341096j55560L75801q2005k19995j12704L3892J44507L1483l54429K27997
13917A230083j90959j81525K07468J86956L05246j36221k45185n2301K66296o01444
13907G88414J32618J28978k64128N00692l73847K57239J86180j75716J67874j54972
13897A193332k15811M19227o34375L43539P5296l2897m40514O48628l64154J75874
13887A168145m30463J74948J81979k64043L03657l79135L47247j12796j21311
13878H68228k13625L34599j68570L85460k06917l00891N04756j53276J15971E26083
13867H18947J33100j12679K82117D97340K76608k77589L56933J95346K35503o10646
$$ plain form
13857 673495 717724 830382 660261 765160 846633 643616 827554 638937 878058 828313
13847 828313 827128 815252 948665 744046 914001 1127250 683830 703621 726057 710980 760078
13836 760078 903941 649790 779223 599644 569427 700170 849033 709739 823078 671551
13826 671551 917898 922105 676651 753859 707914 822204 577148 387513 781668 345542
13815 774521 302350 818321 605596 581706 604448 697234 550018 758560 687157 691238 486113
13804 486113 987261 820857 690696 736879 449914 678693 895810 735858 580433 644224
13794 644224 756853 630944 413858 736667 483605 435831 674817 445894 713729 467677
13784 467677 571404 819995 448520 643222 645579 540287 722344 443911 626768 263234
$$ packed form
13857F73495M4229J12658j70121J04899Q1473k03017J83938j88617K39121m9745
13847H28313j185j1876J33413k04619J69955K13249m43420J9791K2436j5077M9098
13836G60078J43863k54151J29433j79579l0217J30743J48863j39294J13339j51527
13826F71551K46347M207k45454P7208m5945J14290k45056j89635L94155C45542
13815G74521C02350N15971k12725k3890K2742R2786j47216K08542p1403M081k05125
13804D86113N01148j66404j30161M6183k86965K28779K17117j59952j55425O3791
13794F44224J12629j25909k17086L22809k53062m7774K38986k28923K67835k46052
13784D67677J03727K48591l71475J94702K357j05292J82057k78433J82857B63234
$$ plain form
13773 689677 852954 841950 416452 734637 577303 628390 542420 248619 472172 491432
13763 491432 748222 338321 382726 431446 690030 449043 675374 598171 418145 196541
13752 816649 490549 222558 300146 545593 385184 501695 511242 774297 356300 474109
13742 474109 748856 617571 547725 513162 496328 306129 495170 508894 289056 362141
13732 362141 757886 311093 300328 661519 551210 433214 380603 427124 414832 710492
13722 710492 515947 524103 265191 654442 255296 323217 356916 263916 664486 433666
13712 433666 155742 258521 436659 322328 412096 649308 363274 505899 659049 306700
13701 445657 666379 456590 204909 281146 635826 400272 538193 350263 318423 345176
$$ packed form
13773F89677J63277j1004D16452L18185j57334N1087q5970B48619K23553J9260
13763D91432K56790C38321M4405M8720K58584k40987K26331p7203j80026A96541
13752H16649l26100B22558P7588K45447j60409J16511R547K63055C56300J17809
13742D74109K74747j31285o9846l4563j6834j90199J89041J3724k19838P3085
13732C62141L95745C11093j0765L61191j10309j17996n2611M6521j2292K95660
13722G10492j94545Q156k58912L89251B55296O7921L3699r3000M00570k30820
13712D33666A55742J02779J78138j14331Q9768K37212k86034J42625J53150C06700
13701D45657K20722k09789B04909P6237L54680k35554J37921j87930l1840K6753
$$ plain form
13691 345176 464232 468019 40566 664654 499246 474564 372385 625584 207615 280351
13681 280351 461108 399889 387287 295415 434966 90213 499379 424214 248435 518453
13671 518453 405509 83742 436889 677823 497823 470256 364830 392724 420817 676285
13661 676285 448972 380421 376436 381546 307055 648393 350813 142265 141560 332755 294332
13650 294332 316824 250581 316237 231964 186793 553378 65410 290532 460431 570690 132721
13638 161581 316455 540709 273651 322024 8641 308833 -10042 292504 -88205 -32237 120449
13626 425237 528401 329792 216648 687702 342687 235835 285383 142206 278726 408942
13616 408942 323486 274505 214180 353123 182611 229341 444496 142035 366449 106407
$$ packed form
13691C45176J19056L787D0566O24088j65408k4682j02179K53199B07615P2736
13681B80351J80757o1219j2602r1872J39551I0213M09166p5165j75779K70018
13671E18453j12944H3742L53147K40934j80000k7567j05426K7894K8093K55468
13661F76285k27313o8551l985N110p4491L41338k97580A42265p05J91195l8423
13650B94332K2492o6243O5656q4273m5171L66585F5410K25122J69899J10259A32721
13638A61581J54874K24254k67058M8373H641L00192a0042B92504h8205c2237A20449
13626D25237J03164j98609j13144M71054C42687j06852M9548A42206J36520J30216
13616D08942q5456m8981o0325J38943j70512M6730K15155A42035K24414A06407
$$ plain form
13605 431994 278743 278058 238445 46876 248440 668560 490100 479279 33617 462355 494582
13594 494582 316343 145783 468951 104789 310435 381683 368273 53492 245179 214986
13584 214986 43653 352755 193481 386262 453092 437153 323418 293296 54863 302206
13574 302206 236037 268892 566333 184231 309121 492240 257770 -136693 281733 275401
13564 275401 56684 205544 75194 89357 407579 68537 328621 369509 232767 -65999 105125
13552 295789 100844 -174880 84292 163336 151417 170981 103679 417129 107657 155717 278077
13541 278077 433669 430683 333774 44389 176420 476085 190452 799677 358989 202625
13531 202625 284980 338614 191683 326006 98897 365349 -45701 412194 243113 201689
$$ packed form
13605D31994j53251o85l9613D6876K01564M20120j78460j0821C3617M28738L2227
13594D94582j78239A45783L23168A04789K05646P1248j3410E3492J91687l0193
13584B14986D3653L09102j59274J92781O6830j5939j13735l0122E4863K47343
13574C02206o6169L2855K97441A84231J24890J83119k34470a36693B81733o332
13564B75401E6684J48860G5194J4163L18222F8537K60084M0888j36742f5999A05125
13552B95789A00844a74880H4292P9044j1919J9564o7302L13450A07657M8060J22360
13541B78077J55592k986r6909D4389J32031K99665A90452O09225C58989j56364
13531B02625Q2355N3634j46931J34323I8897K66452d5701D12194j69081m1424
$$ plain form
13521 201689 254870 115548 44540 376399 547288 72899 358995 372954 244804 -50723
13510 530692 469574 126055 158755 285149 320959 186325 100141 -139088 373599 317764
13500 317764 286497 331055 237318 53975 238958 160550 73291 403742 440189 350977 436691
13489 436691 41357 63872 177854 139039 -73516 442122 -120326 -40331 -9237 356063 -185888
13477 186285 71292 343564 315984 68689 221925 11238 -30701 330435 65744 87912 369946
13466 369946 237228 109873 413627 121267 296650 135571 75664 217135 363081 256857
13456 256857 247065 134002 130984 255970 -117248 269009 -128540 17566 228906 49027 233982
13445 233982 10714 283522 220196 -21130 -83450 -127412 88755 227290 -218103 70622 41740
$$ packed form
13521B01689N3181A15548D4540L31859J70889G2899K86096J3959j28150e0723
13510E30692o1118A26055L2700J26394L5810j34634q6184a39088C73599n5835
13500C17764l1267M4558r3737E3975J84983p8408G3291L30451L6447q9212Q5714
13489D36691D1357K2515J13982l8815g3516D42122a20326d0331i237C56063a85888
13477A86285G1292K72272k7580F8689J53236A1238c0701C30435F5744K2168K82034
13466C69946j32718A09873L03754A21267J75383A35571n9907J41471J45946j06224
13456B56857r792j13063l018J24986a17248B69009a28540A7566K11340D9027J84955
13445B33982A0714K72808o3326b1130o2320m3962H8755J38535b18103G0622k8882
$$ plain form
13434 41740 44460 415662 441630 83908 174074 28447 164224 249183 155575 280263 11585
13422 215377 170824 142536 37871 238242 -52954 -158178 -134755 -2863 -68625 -17671 99031
13410 116205 171422 148995 313476 204140 191157 104831 -43325 86629 324170 -1975 470549
13398 -36567 19483 390078 -73448 183280 182071 134746 210278 77202 384003 73533 -161719
13386 263473 74686 147885 277315 140757 181317 10399 257283 -276274 -95545 206188
13375 13191 34798 242913 277752 -201027 333702 -1669 103653 40814 11795 96193 448445
13364 448445 58013 183240 23421 203200 86367 93106 163140 -74026 136742 69319 146178
13353 146178 -4456 251104 44063 396948 323916 170837 224154 182083 224853 204743 -100957
$$ packed form
13434D1740K720L71202K5968H3908R0166B8447J35777Q4959r3608J24688A1585
13422B15377m4553k8288C7871K00371e2954j05224K3423b863o5762a7671I9031
13410A16205N5217k2427J64481j09336j2983q6326d3325H6629K37541a975D70549
13398c6567A9483L70595g3448A83280j209m7325P5532G7202L06801G3533a61719
13386B63473G4686P3199J29430j36558M0560A0399K46884b76274i5545B06188
13375A3191K1607K08115L4839b01027C33702a669A03653D0814A1795Q4398L52252
13364D48445E8013J25227B3421J79779H6367O739P0034g4026A36742o7423P6859
13353A46178d456B51104D4063L52885p3032j53079N3317m2071M2770k0110a00957
$$ plain form
13341 193699 129366 20051 58616 96200 168764 33440 124149 184820 267240 171364 145725
13330 145725 236592 -62532 100107 239371 86655 -196848 145623 258672 213731 70913
13319 489541 58388 279919 281745 321425 133646 180044 355696 193638 201846 72121 -8271
13307 107547 973 9180 29739 18818 -110934 433267 -113337 -86308 21404 74959 156200
13296 156200 -363931 370226 4642 83860 23196 136290 130681 -26711 107599 -159391 25396
13284 149851 131862 22153 11204 54092 76593 237863 -50863 155838 388709 225947 -145749
13272 -185540 183678 238317 416430 195839 -35496 59213 -62024 194099 294375 -43674
13261 202083 -65770 97259 -97366 199320 203583 -114499 70724 234016 -235038 347608 -168800
$$ packed form
13341A93699o4333B0051L8565L7584P2564C3440R0709O0671Q2420r5876k5639
13330A45725R0867f2532A00107J39264H6655a96848A45623J13049m4941G0913
13319D89541E8388K21531J826L9680A33646M6398J75652j62058Q208G2121h271
13307A07547I73Q207K0559j0921a10934D33267a13337K7029B1404N3555Q1241
13296A56200c63931C70226D642P9218B3196J13094n609b6711A07599a59391B5396
13284A49851j7989B2153j0949M2888K2501J61270e0863A55838K32871j62762a45749
13272a85540A83678N4639J78113A95839c5496E9213f2024A94099J00276d3674
13261B02083f5770I7259i7366A99320M263a14499G0724J63292b35038C47608a68800
$$ plain form
13249 286573 -120666 79441 -9116 -272218 -111711 172477 245651 -36154 112039 901 228399
13238 228399 -20414 150667 -45566 -84507 214694 219421 -153656 238009 -185203 114988
13227 104589 -42903 -4130 -125407 85151 -26583 129699 -21070 49461 180179 34889 210469
13216 210469 -114717 -135195 -121718 2090 125339 319533 92184 225665 77348 264681 93215
13204 -103266 -220812 176225 178623 241848 18762 28795 -514975 -221987 27492 -6501 -55803
13193 -55803 -124607 -143382 255059 321185 -41247 109896 285523 54248 190425 -211990 6989
13181 26267 89901 149667 5212 79235 339202 139231 78784 -171150 107717 137187 109607
13170 109607 -121727 -28532 -364530 174518 -61457 2450 -192528 185006 17708 -37635 -100586
$$ packed form
13249B86573a20666G9441i116k63102a11711A72477P3174c6154A12039I01K27498
13238B28399b0414A50667d5566l8941B14694M727a53656B38009a85203A14988
13227A04589d2903d130j21277H5151b6583A29699b1070D9461J30718C4889J75580
13216B10469a14717k0478J3477B090J23249J94194I2184J33481G7348J87333I3215
13204a03266j17546A76225K398O3225A8762J0033e14975b21987B7492f501m9302
13193e5803o8804j8775B55059O6126d1247A09896J75627E4248J36177b11990F989
13181B6267O3634N9766E212P4023K59967A39231o0447a71150A07717K9470k7580
13170A09607a21727b8532l35998A74518f1457B450a92528A85006A7708c7635o2951
$$ plain form
13159 -100586 -10340 191858 -18843 -27802 -110726 115213 51858 10435 156313 -253578 -44301
13147 -231232 -19954 76151 -44947 143761 316215 320024 94910 50706 216828 -200218 -48468
13135 78761 -104234 84833 410041 88996 268588 250104 156 17168 -133495 208905 68772
13123 79965 2786 -249506 -159776 -14216 -87244 -170016 296452 -8728 -34918 -193336 266737
13111 -261741 -203258 127052 7441 -61508 -101972 53523 143414 7168 -18688 172789 27312
13099 237337 53462 -21054 168748 77644 123648 -331651 66187 -18934 259663 -14555 187824
13087 59560 238028 -45135 102641 -226815 -191276 -73840 -88468 -178877 302242 129486 114933
13076 114933 308468 54782 19625 10828 197982 -102620 -20946 -223208 114296 49205 28789
$$ packed form
13159a00586a0340A91858a8843q959q2924A15213E1858A0435J45878b53578d4301
13147b31232a9954G6151d4947A43761J72454L809I4910m4204J66122b00218d8468
13135G8761a04234H4833L25208H8996J79592j8484A56J7012a33495B08905F8772
13123G9965B786b49506Q9730a4216p3028q2772B96452h728k6190j58418B66737
13111b61741N8483A27052G441f1508m0464E3523Q9891G168a8688A72789B7312
13099B37337E3462b1054A68748G7644M6004c31651F6187a8934B59663a4555A87824
13087E9560J78468d5135A02641b26815L5539g3840j4628r0409C02242A29486j4553
13076A14933J93535E4782A9625q797J87154a02620b0946k02262A14296D9205k0416
$$ plain form
13065 28789 24256 97643 -401749 -214300 72699 -132949 -87629 302745 125948 83704 166433
13054 166433 247255 51278 336712 -10940 268872 29721 245602 157459 190089 195616 1003
13042 530692 54411 248103 139882 -237501 14830 -119929 190515 14283 240827 166315
13032 166315 -112010 115908 -61291 67341 -21775 36787 216644 205517 -77777 368331 -7653
13020 318204 -103789 225060 178000 154802 -239613 346224 156912 68230 -95636 -178481
13010 -178481 163246 103751 -155831 239845 111931 -11490 -39819 325618 482972 -314540
12999 79797 -97307 348568 -162507 -209072 31556 117275 -39005 -235410 -183707 -28937 145755
12987 -147583 -99090 207229 219223 -150043 134562 30089 72096 -5859 66343 -154305 10002
$$ packed form
13065B8789m533P3387d01749J87449G2699a32949M5320C02745A25948m2244Q2729
13054A66433Q0822E1278K85434a0940B68872B9721K15881q8143L2630N527A003
13042E30692E4411J93692j08221b37501A4830a19929A90515A4283K26544p4512
13032A66315a12010A15908f1291F7341b1775C6787J79857j1127g7777C68331g653
13020C18204a03789B25060m7060k3198b39613C46224A56912F8230i5636q2845
13010a78481A63246n9495a55831B39845A11931a1490k8329C25618J57354c14540
12999G9797i7307C48568a62507m6565C1556Q5719c9005j96405N1703b8937A45755
12987a47583M8493B07229J1994a50043A34562C0089M2007e859F6343a54305A0002
$$ plain form
12975 353817 132905 -120077 66977 37739 -59286 123548 133870 33447 -243120 -114616
12964 -14604 201203 204523 60059 -139225 265071 -274400 77898 81739 6760 151563 77372
12953 77372 147703 127648 94420 36476 111871 61911 -6774 -187665 143178 6085 81681 270706
12941 270706 25644 28460 18830 -118940 339118 23607 -79808 76534 81335 -319851 145662
12929 77343 231043 16754 29256 8632 -81747 73261 -336486 -37040 4879 33607 96374 -195457
12916 236099 318129 -215908 -60663 268571 286946 -185360 26021 191170 -70996 -106338 -38278
12904 -168348 -197568 274106 6531 -153301 127549 43052 257297 32643 -162398 1311 -290632
12892 -132872 347798 -68994 -13218 -63331 222035 54996 227153 -222664 -121540 45432
$$ packed form
12975C53817A32905a20077F6977k9238e9286A23548J0322C3447b43120a14616
12964a4604B01203L320F0059a39225B65071b74400G7898L841F760J44803p4191
12953G7372P0331k0055l3228C6476P5395m9960f774j80891A43178F085P5596J89025
12941B70706B5644K816r630a18940C39118B3607g9808G6534M801c19851A45662
12929G7343J53700A6754J2502H632h1747G3261c36486c7040D879K8728O2767a95457
12916B36099Q2030b15908f0663B68571J8375a85360B6021J65149g0996l5342c8278
12904a68348k9220B74106F531a53301A27549D3052K14245C2643a62398A311b90632
12892a32872C47798f8994a3218n0113B22035E4996J72157b22664J01124D5432
$$ plain form
12881 9866 155327 -40592 264472 -84375 55755 156073 -4288 -95004 -23133 106894 -181849
12869 -18073 -63929 64763 259910 216560 -48492 191861 170877 71698 303721 273297 -26488
12857 -244000 3372 106719 -8785 234343 -244160 -214368 -264957 -20264 -197000 5594 137539
12846 137539 68328 33879 -82629 -227162 -316395 -91108 426531 201184 156099 105494 215517
12835 215517 -185374 -43022 71231 48180 170665 -75576 126058 88094 -127664 340505
12824 233756 114520 5290 -6276 -16574 149726 -44626 -303054 -403170 -300370 -44860 -61761
12813 -61761 -224453 97631 -71995 -66541 31626 26883 -178564 112416 50443 296951 -68049
12801 29581 -206807 -230257 465722 -154097 -168555 62081 39126 77093 -86453 175044 -51849
$$ packed form
12881I866J45461d0592B64472h4375E5755J00318d288r0716b3133A06894a81849
12869a8073m5856F4763J95147m3350d8492A91861k0984G1698K32023l0424b6488
12857b44000C372J03347h785B34343b44160K9792n0589b0264j76736E594J31945
12846A37539F8328C3879h2629j44533q9233i1108D26531B01184m5085n0605J10023
12835B15517a85374d3022G1231k3051J22485g5576A26058l7964a27664C40505
12824B33756A14520E290f276j0298A49726d4626k58428j00116J02800d4860j6901
12813f1761j62692I7631g1995N454C1626m743a78564A12416E0443K46508f8049
12801B9581b06807k3450D65722a54097j4458F2081k2955L7967h6453A75044e1849
$$ plain form
12789 -211074 -279418 -192423 -73558 103607 -115611 54351 -135727 73139 -42211 -73994 91241
12777 -211674 331342 -37035 180067 -235520 -44012 -85372 -13508 -58205 -82074 2154 25158
12766 25158 18985 204032 -72566 120432 -168405 -119758 26070 101988 176725 121735 96369
12755 96369 252143 -227652 -81930 85341 325715 -180640 -31982 -144221 207313 -121838
12744 -296395 -265782 -109046 207161 139940 268347 26050 9200 84404 -21355 318026 79791
12732 45270 -154175 319153 381597 171663 -160553 90020 -30964 -236988 -273553 -181121 -193725
12721 -193725 7567 84821 69331 265083 166329 -179698 372525 71378 1908 -70497 281616
12709 98211 197034 39906 -130831 39208 281977 -19524 -62447 57822 -106476 19816 136377
$$ packed form
12789b11074o8344Q6995g3558A03607a15611E4351a35727G3139d2211l1783I1241
12777b11674C31342c7035A80067b35520d4012m1360a3508m4697k3869B154K3004
12766B5158o173J85047g2566A20432a68405M8647B6070P5918P4737n4990k5366
12755I6369J55774b27652h1930H5341K40374a80640c1982j12239B07313a21838
12744b96395L0613a09046B07161o7221J28407B6050I200P5204b1355C18026G9791
12732D5270a54175C19153O2444A71663a60553I0020c0964k06024l6565R2432j2604
12721a93725G567P7254j5490J95752r8754a79698C72525G1378A908g0497B81616
12709I8211R8823C9906a30831C9208K42769a9524m2923E7822a06476A9816J16561
$$ plain form
12698 136377 39743 -184582 140074 -20405 149010 42770 -86746 -83210 -169796 -4320 105 59992
12686 59992 -37800 -13996 20643 281993 305511 147211 177845 -202867 105393 -274312 -21123
12674 105202 -164147 -22790 14567 162090 -112385 -141562 -149759 -152772 112994 37217 -77551
12662 -159593 -106080 236111 -101061 -20062 -276732 4466 97642 -119280 63208 66556 152248
12651 152248 45851 156300 277178 -26300 181056 -77908 43328 -67403 -127117 21488 -285638
12639 -22649 115781 -27047 -81510 -233551 -197216 202723 109203 -176661 255888 43493 311403
12628 311403 261257 74503 187136 -124994 44524 90935 283412 31369 78316 158517 283722
12617 283722 -49888 -302442 120220 133675 208985 34211 11457 13756 -241551 -37998 -379
$$ packed form
12698A36377C9743a84582A40074b0405A49010D2770h6746L536q6586d320A05N9887
12686E9992c7800a3996B0643K61350K3518A47211L0634b02867A05393b74312b1123
12674A05202a64147b2790A4567J47523a12385k9177q197l013A12994C7217g7551
12662a59593N3513B36111a01061b0062k56670D466R3176a19280F3208L348Q5692
12651A52248D5851J10449J20878b6300A81056g7908D3328f7403n9714B1488b85638
12639b2649A15781b7047n4463j52041L6335B02723r3520a76661B55888D3493K67910
12628C11403n0146G4503J12633a24994D4524M6411J92477C1369M6947Q0201J25205
12617B83722d9888k52554A20220J3455P5310C4211A1457K299b41551c7998c79
$$ plain form
12605 14171 154327 276550 -73413 299518 239001 379846 -150843 134375 141920 -98079 -177581
12594 -177581 161841 8106 85716 2895 470646 -62604 143035 -3319 170545 258910 -129372
12582 -146628 -173683 -87626 97761 -215534 226477 23761 -80962 109387 85354 -90378 174232
12570 181113 -33259 -42366 77734 289926 -203384 104825 8118 -305914 2099 -74299 309576
12558 -96245 288912 39523 -353231 -140285 209860 229089 -76782 -211194 -314267 -142207
12547 200144 227440 -279090 -27213 149566 103971 174924 3123 6546 125530 173001 131673
12536 131673 -23135 -10186 -3256 -261903 493556 -283793 -95913 159921 -142345 -91274 -172005
12525 -172005 123053 292086 56456 186042 380977 8896 171855 -99453 240967 422879
$$ packed form
12605A4171J40156J22223g3413B99518o0517J40845a50843A34375P545i8079p9502
12594a77581A61841H106P7610B895M67751f2604A43035c319A70545Q8365a29372
12582a46628k7055Q6057I7761b15534B26477B3761h0962A09387k4033i0378A74232
12570A81113c3259r107G7734K12192b03384A04825H118c05914B099g4299C09576
12558i6245B88912C9523c53231a40285B09860J9229g6782j34412j03073a42207
12547B00144K7296b79090b7213A49566m5595P0953C123L423J18984M7471m1328
12536A31673b3135a0186c256k58647D93556b83793i5913A59921a42345N1071q0731
12525a72005A23053J69033E6456J29586J94935H896J62959i9453B40967J81912
$$ plain form
12515 422879 -100351 -150458 82457 -54876 103630 -274382 -253564 -28303 264279 -194712
12504 -27519 39085 -14069 358954 -30139 -2341 -36301 -394211 -122406 -9955 144035 -137579
12492 45666 -164755 -49380 66319 47400 -92662 -111713 1556 -513039 -432377 -277665 -354074
12481 -354074 47909 -72356 -78509 -189112 -168511 -235431 467159 16481 -161642 -170659 -20295
12469 -17879 69477 109974 20638 -116234 -119279 51681 123741 266119 182627 -115289 -137113
12458 -137113 -279887 -48524 45078 37616 75807 -34233 -181740 -348840 199159 -194276 -24542
12446 69890 -36565 -51209 -150191 -59414 -66666 -233449 42515 259779 -281355 -165808 -233409
12435 -233409 -107017 6948 -349794 -24092 -1395 -396550 -239477 208558 36716 -41204 39326
$$ packed form
12515D22879a00351n0107H2457e4876A03630b74382K0818b8303B64279a94712
12504b7519C9085a4069C58954c0139b341l3960l57910a22406i955A44035a37579
12492D5666a64755d9380F6319j8919i2662j9051A556e13039Q0662J54712p6409
12481c54074D7909g2356o153j10603K0601o6920D67159A6481a61642r017b0295
12469a7879F9477M0497B0638a16234l045E1681P2060J42378q3492a15289k1824
12458a37113j42774d8524D5078p462L8191c4233j47507j67100A99159a94276b4542
12446F9890c6565j4644r8982e9414p252j66783D2515K17264b81355J15547o7601
12435b33409a07017F948c49794b4092a395l95155J57073B08558C6716d1204C9326
$$ plain form
12423 127246 -67224 17629 -1391 35367 -128777 4524 -190257 27465 6735 -220072 -186413
12412 -186413 49193 49250 164900 -164717 -48768 -67663 -286880 -275448 -32952 -191070 -93114
12400 -9828 -98499 -82842 167882 -3789 -128027 64925 -72974 -194255 -225599 -203814 49726
12388 -99716 189714 118457 -236282 -78590 -378787 -133788 18827 -6805 -60882 50258 -108574
12376 45516 174290 84912 61922 -74750 -371783 50665 460361 126046 197106 -193339 -50687
12364 -105412 315261 146897 -248727 -77186 204037 -228520 -91029 134048 -43936 166715
12353 74498 -376306 -248599 -45866 -47936 98486 -274005 -1266 150661 -70978 -7183 55001
12341 -32921 -158042 -2199 -32173 96853 43997 -412954 54162 18078 -68012 -34798 67357
$$ packed form
12423A27246f7224A7629a391C5367a28777D524a90257B7465F735b20072L3659
12412a86413D9193N7J15650a64717d8768j8895k19217J1432c2952j58118i3114
12400i828q8671J5657A67882c789j24238F4925g2974j21281l1344K1785D9726
12388i9716A89714p1257b36282g8590l00197a33788A8827f805n4077E0258a08574
12376D5516J28774H4912k2990g4750k97033E0665M09696A26046P1060a93339e0687
12364a05412C15261A46897b48727g7186B04037b28520i1029A34048d3936A66715
12353G4498c76306J27707d5866k070I8486b74005a266A50661g0978g183E5001
12341c2921j25121b199k9974I6853D3997d12954E4162A8078f8012L3214F7357
$$ plain form
12329 -262124 -16770 220552 119099 -78565 131683 -114656 -260529 106080 -489160 -25488
12318 -26807 232909 -28050 216839 -130837 -108906 253685 -32133 32588 -17738 -281521 280728
12306 156397 -364 -95032 255359 -139087 126648 42194 217849 -83306 246600 -86692 -69941
12295 -69941 17576 195188 311199 -14297 20664 -126526 238504 137501 -151989 8430 -209288
12283 112306 134831 9283 273198 23493 12441 134023 230139 50098 -97745 91390 169693
12272 169693 212960 436003 -194954 -3722 -35049 64779 85759 385964 283108 -251571 275600
12260 78610 -311282 3070 6764 94539 324585 -74487 186604 171913 77393 51749 33615
12249 33615 -181232 83083 24302 167315 201654 23101 241124 145391 129278 -140278 -225170
$$ packed form
12329b62124a6770B20552j01453g8565A31683a14656j45873A06080d89160b5488
12318b6807B32909b8050B16839a30837K1931B53685c2133C2588a7738k63783B80728
12306A56397c64r4668B55359a39087A26648D2194J75655h3306B46600h6692J6751
12295f9941A7576J77612J16011a4297B0664a26526B38504j01003a51989H430b09288
12283A12306K2525I283K63915B3493j1052J21582R6116E0098i7745I1390P8303
12272A69693M3267K23043a94954c722l1327F4779K0980L00205j02856b51571B75600
12260G8610c11282C070L694Q7775K30046g4487A86604j4691G7393k5644j8134
12249C3615a81232H3083B4302J43013L4339B3101K18023r5733j6113a40278q4892
$$ plain form
12238 -225170 -154734 248174 38379 -271404 323524 78389 125582 -69186 384196 -117 71515
12226 335610 238074 506477 -99095 -68969 114880 -55588 -238802 -29945 44461 84311 36470
12214 -60072 11186 160166 67330 240260 226339 134832 -112409 151973 300714 -58012 258484
12202 199519 115738 143972 35847 46449 79996 88092 -13927 -143276 42895 110375 110711 95641
12190 95641 -71097 -139239 108367 -200582 -102261 151360 235836 -87490 137213 479779 -69137
12178 -9410 200920 40651 139094 77130 -225119 395242 11139 305939 106844 -109635 543271
12166 119306 535869 -231843 145291 57824 -110933 211641 258018 112225 -96930 -249505
12156 -249505 113717 -205595 -74273 3094 -239294 -333256 -118768 -207265 -20655 -281884 -253327
$$ packed form
12238b25170P0436B48174C8379b71404C23524G8389M7193f9186C84196a17G1515
12226C35610r7536K68403i9095L0126A14880e5588j83214b9945D4461L9850C6470
12214f0072A1186J48980F7330J72930j3921r1507a12409A51973J48741e8012B58484
12202A99519q3781K8234C5847J0602L3547Q096a3927j29349D2895O7480L36j5070
12190I5641g1097o8142A08367b00582R8321A51360Q4476h7490A37213L42566f9137
12178i410B00920D0651R8443o1964b25119C95242A1139K94800A06844a09635E43271
12166A19306M16563b31843A45291E7824a10933B11641M6377A12225i6930j52575
12156b49505A13717b05595g4273C094b39294r3962a18768q8497b0655k61229K8557
$$ plain form
12145 -253327 145014 -121800 -91711 174285 120382 -200457 41404 -142655 189792 28177
12134 -109329 -110457 -136640 -183088 -103263 -82640 34109 -230681 -188145 -59113 71698 -41632
12122 32581 53891 -46682 37214 86767 56850 391623 78363 178833 -217183 -59717 171628
12110 85987 106947 -71118 -52983 -39949 -128109 44906 65876 -171566 -355240 -169988 265136
12098 -280117 172087 95553 92462 -40870 210988 -79590 43849 100000 -129696 23369 -58848
12086 144981 41253 -99824 -150707 -84634 -130219 91008 49892 19570 -43113 -309893 -147247
12074 3711 53696 -75541 -220602 29899 106984 -91465 -157617 -121663 -33291 93382 -219417
12062 -53235 279983 395769 -82322 -96492 -45434 -154354 160046 19282 198748 195555 271144
$$ packed form
12145b53327A45014a21800L0089A74285n3903b00457D1404a42655A89792B8177
12134a09329j128k6183m6448P9825K0623C4109b30681M2536e9113G1698d1632
12122C2581K1310d6682C7214M9553k9917L34773G8363J00470b17183e9717A71628
12110H5987K0960g1118J8135J3034q8160D4906K0970a71566j83674a69988B65136
12098b80117A72087p6534l091d0870B10988g9590D3849N6151a29696B3369e8848
12086A44981D1253i9824n0883O6073m5585I1008m1116A9570d3113k66780a47247
12074C711M9985g5541j45061B9899P7085i1465o6152L5954c3291I3382b19417
12062e3235B79983J15786h2322j4170d5434j08920A60046A9282J79466l193P5589
$$ plain form
12051 271144 -183807 -79177 35061 -4911 -355370 21346 339838 166586 10982 112177 245139
12040 245139 333700 -232976 -58132 -5276 -285051 33109 -288657 70581 66768 39063 -52285
12028 30385 -294355 -33851 -126397 -28941 -216141 14555 -60809 -88187 151994 4043 122061
12017 122061 232599 -230768 128819 128017 -127252 14537 26620 -267007 74028 328705 42594
12005 94970 -258919 -219518 153891 -70317 151295 -28405 -239069 345089 116413 17772
11994 79172 -24641 29927 -158317 251199 -251527 55154 203963 46120 4739 -125504 -207095
11983 -207095 212488 -24417 6266 -75166 -105598 -137491 39852 162032 -42764 -186141 203486
11971 12203 -20541 -207539 -77103 142071 64986 -90499 127500 -212847 -92218 -136241 -121102
$$ packed form
12051B71144a83807g9177C5061d911l50459B1346L18492A66586A0982J01195J32962
12040B45139Q8561b32976e8132e276k79775C3109b88657G0581l813k7705e2285
12028C0385b94355c3851r2546b8941j87200A4555f0809k7378A51994D043J18018
12017A22061J10538b30768A28819q02a27252A4537J2083b67007G4028K54677D2594
12005I4970b58919L9401A53891g0317A51295b8405k10664C45089A16413A7772
11994G9172b4641B9927a58317B51199b51527E5154J48809D6120D739a25504q1591
11983b07095B12488b4417F266g5166l0432l1893C9852J22180d2764j43377B03486
11971A2203b0541j86998g7103A42071F4986i0499A27500b12847i2218m4023J5139
$$ plain form
11960 -121102 -477 -392603 208951 108138 -29447 291765 5555 170695 182343 -309911 33926
11948 -49134 -345768 302371 80649 -122886 48155 62935 -269369 -7798 96891 35886 180855
11937 180855 -31383 23191 -78150 -33860 -25168 -11391 -164930 -53682 -107891 -279528 133547
11925 -86074 -120731 -39078 114082 -101661 149195 -205509 -132603 45111 -98366 4359 -120168
11913 -189230 53221 127933 -141850 165223 143152 -295780 88599 257000 -106127 227572
11902 -115646 -84927 -178451 206775 -30975 -176928 -37396 -111781 -32965 -88788 138178 -170898
11890 -113511 141608 -195948 44015 17148 101105 353663 119729 -95162 14294 -22448 118485
11878 -109744 109516 -60075 -38511 -262172 57479 -350815 160826 157812 -83568 -64035 -23906
$$ packed form
11960a21102d77l92126B08951j00813b9447B91765E555J65140J1648c09911C3926
11948d9134k96634C02371H0649a22886D8155J4780b69369g798I6891C5886J44969
11937A80855c1383B3191g8150c3860Q692a1391j53539e3682n4209j71637A33547
11925h6074l4657c9078A14082a01661A49195b05509P2906D5111i8366D359a20168
11913a89230E3221P4712a41850A65223k2071b95780H8599J68401a06127B27572
11902a15646L0719r3524B06775c0975j45953c7396p4385c2965n5823A38178a70898
11890a13511A41608a95948D4015A7148Q3957K52558A19729i5162A4294b2448A18485
11878a09744A09516f0075K1564k23661E7479c50815A60826l014h3568J9533b3906
$$ plain form
11866 179715 -375173 48421 -35926 95034 -18751 -283812 -79373 81402 -96099 134291 -118749
11854 190850 -82535 -183921 -78926 -287003 15965 195525 151868 -188739 -314170 -162132
11844 -162132 -147846 -75192 -133816 -244669 156969 73297 57726 -220539 -141220 -224544 -26228
11832 58429 -332386 -83706 -77125 132737 -237049 57625 104550 -72724 -60595 -51895 170443
11820 31687 -186756 -434338 167668 177595 43508 -155766 26853 237646 -117535 -8077 -79851
11809 -79851 104166 -90342 -227090 -355957 145494 -206606 9567 59679 24816 171302 -78133
11797 -155333 14628 -227888 -270805 89601 79121 -160951 133937 26716 -162066 38036 -155556
11785 -349313 -277877 -174739 175054 44664 71665 77607 264430 -6988 -123382 80732 -72354
$$ packed form
11866A79715c75173D8421c5926I5034a8751k65061g9373H1402i6099A34291a18749
11854A90850h2535j01386g8926k08077A5965J79560m3657a88739j25431J52038
11844a62132J4286P2654n8624j10853A56969G3297j5571b20539P9319q3324b6228
11832E8429c32386h3706O581A32737b37049E7625M6925g2724J2129Q700A70443
11820C1687a86756k47582A67668R927D3508a55766B6853K10793a17535h077p1774
11809g9851A04166i0342j36748j28867A45494b06606I567N0112B4816J46486g8133
11797a55333A4628b27888m2917H9601j0480a60951A33937B6716a62066C8036a55556
11785c49313P1436J03138A75054D4664K7001N942J86823f988j16394H0732g2354
$$ plain form
11773 283772 -128525 -213903 -51289 -18274 65060 -55744 -187747 25719 -162541 -44892 -17672
11761 -507538 -73282 -22170 34283 -53966 182366 -190497 -34876 132099 8920 89568 -132589
11749 114352 260146 45604 118718 -28032 90752 -147174 165724 69531 -188952 3921 39899
11738 39899 56418 -9338 -132555 2227 -1143 4451 -85619 -8629 -18931 200673 15276 -149443
11725 -312946 -16907 411982 158236 27362 -122861 330886 -94209 25391 -283512 108424
11714 -78001 -16734 299216 -134349 -234571 -111890 234829 -126747 -57245 62571 6875 107185
11703 107185 18454 36598 -84151 289341 -48663 6144 218628 -18705 15147 -58244 -10191
11691 9140 111245 -340108 30102 -45181 155449 48774 36966 -60093 103669 145177 208364
$$ packed form
11773B83772a28525q5378e1289a8274F5060e5744j32003B5719a62541d4892a7672
11761e07538g3282b2170C4283e3966A82366a90497c4876A32099H920Q0648a32589
11749A14352J45794D5604P3114b8032I0752a47174A65724F9531a88952C921L5978
11738C9899J6519i338j23217B227a143D451h5619h629j0302B00673A5276a49443
11725c12946a6907D11982A58236B7362a22861C30886i4209B5391b83512A08424
11714g8001a6734B99216a34349j00222a11890B34829a26747e7245F2571F875J00310
11703A07185A8454J8144h4151B89341d8663F144K12484a8705A5147e8244a0191
11691I140J02105c40108C0102d5181A55449D8774j1808f0093A03669M1508O3187
$$ plain form
11680 208364 135704 36975 338024 195643 27840 112259 1020 -147471 -170770 -6477 19083
11668 -455191 -5166 -44508 81548 183266 -8241 136688 -285089 -210262 -160914 39460 190033
11657 190033 -176857 76452 52347 -121239 41823 -89273 -89782 -36665 166551 179285 -174033
11645 -63582 -239298 70729 230167 208526 -76327 226665 -109121 208657 164973 233881 -24032
11633 28291 18399 -228131 -281777 91152 -90351 202988 -169140 -289014 -25754 16695 158014
11622 158014 165652 199505 287763 103597 154551 -88401 -23686 34847 -35313 -77287 53566
11610 101024 80239 -94839 -225419 -97673 146572 141325 110187 -134328 18756 -77315 -86227
11599 -86227 186946 200111 -520354 25844 -78605 199009 189530 -252675 273324 101369 346395
$$ packed form
11680B08364p2660C6975L01049j42381B7840Q4419A020a47471k3299f477A9083
11668d55191e166l9342H1548J01718h241A36688b85089P4827M9348C9460J50573
11657A90033a76857G6452k4105a21239D1823h9273n09c6665A66551J2734a74033
11645f3582j75716G0729J59438k1641g6327B26665a09121B08657m3684O8908b4032
11633B8291r892b28131n3646I1152i0351B02988a69140j19874b5754A6695J41319
11622A58014P638L3853Q8258A03597N0954h8401b3686C4847c5313m1974E3566
11610A01024k0785i4839j30580i7673A46572n247l1138a34328A8756g7315q912
11599h6227A86946J3165e20354B5844g8605A99009r479b52675B73324A01369K45026
$$ plain form
11588 346395 26788 -110730 263030 90665 -39818 33281 -116105 -100411 53940 -149247 -140054
11577 -140054 145410 26977 -113148 267241 -84443 25010 -114311 -35935 -218162 -68827
11566 310834 115339 50208 -54123 535354 169389 -6270 259347 -160436 157241 312818
11556 312818 -198516 186926 206294 72807 198929 6978 3239 -5867 -86933 80337 282598
11545 282598 -164459 -105179 -109513 -25017 219607 167640 194975 199129 -201100 63022 -6609
11533 -108403 -47236 -136673 -25968 292228 54607 -27316 37161 108068 348881 -443548 -48493
11521 165437 268464 -125668 -6267 555 -163281 -47110 -40432 -10504 -86059 302285 329981
11510 329981 76298 268953 -158480 90166 309771 383878 182020 -154348 252114 179569
$$ packed form
11588C46395B6788a10730B63030I0665c9818C3281a16105J5694E3940a49247R193
11577a40054A45410B6977a13148B67241h4443B5010a14311c5935j82227f8827
11566C10834A15339E0208e4123E35354A69389f270B59347a60436A57241J55577
11556C12818a98516A86926J9368G2807J26122F978C239e867q1066H0337K02261
11545B82598a64459N9280m334b5017B19607n1967K7335M154b01100F3022f609
11533a08403d7236q9437b5968B92228E4607b7316C7161P0907K40813d43548d8493
11521A65437J03027a25668f267E55a63281d7110O678a0504p5555C02285K7696
11510C29981G6298J92655a58480I0166K19605P4107A82020a54348B52114p2545
$$ plain form
11500 179569 371863 -31811 101968 151569 -294003 117612 27970 -172587 56285 -49866
11489 98347 51091 -70053 111446 64482 188537 -52404 104590 137276 51121 398207 -20586
11477 38332 128009 135293 153577 143376 426223 130244 -40438 141321 -2290 147406 345214
11466 345214 145757 161064 85932 -184321 95660 10995 -76439 32890 -4802 209459 354191
11455 354191 338692 -60243 92586 13698 298198 143394 -131738 46677 -48398 19324 -116649
11443 -64295 130383 150426 -325410 -128613 97187 177375 128212 296350 13351 123121 -203312
11431 117405 276949 -257661 -195313 121425 131307 -58225 -73915 58209 -68499 58342 125699
11420 125699 330910 -109673 182962 25179 -151365 262770 -16229 -255920 36530 314593
$$ packed form
11500A79569J92294c1811A01968M9601b94003A17612B7970a72587E6285d9866
11489I8347m7256g0053A11446m6964J24055e2404A04590L2686E1121L47086b0586
11477C8332Q9677P284J8284j0201K82847A30244d0438A41321b290A47406J97808
11466C45214A45757J5307p5132a84321I5660A0995g6439C2890d802B09459J44732
11455C54191j5499f0243I2586A3698K84500A43394a31738D6677d8398A9324a16649
11443f4295A30383K0043c25410a28613I7187Q0188m9163J68138A3351J09770b03312
11431A17405J59544b57661O2348A21425R882e8225j5690E8209f8499E8342O7357
11420A25699K05211a09673A82962B5179a51365B62770a6229k39691C6530K78063
$$ plain form
11410 314593 -204755 -277114 -87554 6164 -244213 -29955 154194 49382 -96583 135977 -79133
11398 149521 -267342 161592 106305 117599 -54670 -180076 -103155 -172795 164646 -278079
11387 -116389 312571 -103322 -15565 239215 173398 -27991 -52738 51992 -53274 -20939 367903
11375 10462 323945 110545 250363 176311 -131299 371484 -118677 70556 -181235 -103688
11365 -103688 -56768 -411722 -108471 -257693 -287977 -242118 149434 -103441 21547 38535
11355 38535 225783 -413671 6571 -118892 -60815 119037 195907 -183961 167316 -15060 243251
11343 434276 1070 -8621 -111211 -6418 90313 -135037 459423 110574 -18303 -47869 49912
11331 225175 -53908 -84691 153654 135471 -148612 -335668 -105348 -175016 203525 239027
$$ packed form
11410C14593b04755p2359h7554F164b44213b9955A54194D9382i6583A35977g9133
11398A49521b67342A61592n5287J1294e4670j25406P6921o9640A64646b78079
11387a16389C12571a03322a5565B39215o5817b7991k4747E1992e3274b0939C67903
11375A0462L13483A10545J39818p4052a31299C71484a18677G0556a81235P7547
11365a03688M6920l54954a08471j49222l0284M5859A49434a03441B1547J6988
11355C8535J87248d13671F571a18892N8077A19037P6870a83961A67316a5060B43251
11343D34276A070h621j02590f418I0313a35037D59423A10574a8303k9566D9912
11331B25175e3908l0783A53654j8183a48612j87056a05348o9668B03525L5502
$$ plain form
11321 239027 -144503 171651 -54166 50182 -80047 -333065 -91753 -101643 -38831 -115028 290093
11309 118541 51290 -407932 -76529 125855 -325318 -50621 155137 160619 65542 -51824 316885
11297 45251 -184731 -107786 -170392 -239869 34144 -215904 -4639 172552 -55404 -22645 -120539
11286 -120539 111022 122412 -395473 -286892 -168451 48906 68898 -174187 -8123 220028
11275 331272 -58615 -202918 -55141 120881 -40478 132072 275586 77218 44577 88961 -50900
11263 -135974 -32893 -137440 106214 -236492 -114617 -593320 -11627 -150123 -57869 -34626
11253 -34626 157489 -115808 -179362 38845 -225640 8486 -156228 -58789 151918 155117 -17287
11241 82900 -148446 126846 -119378 -122951 -168058 -180431 -236556 -66883 -477831 -52269 124313
$$ packed form
11321B39027a44503A71651e4166E0182h0047k53018i1753r890c8831p6197B90093
11309A18541E1290d07932g6529A25855c25318e0621A55137N482F5542e1824C16885
11297D5251a84731P6945o2606o9477C4144b15904d639A72552e5404b2645r7894
11286a20539A11022J1390c95473J08581J18441D8906J9992a74187h123B20028
11275C31272e8615j44303e5141A20881d0478A32072J43514G7218l2641M4384e0900
11263a35974c2893j04547A06214b36492a14617m78703a1627j38496e7869K3243
11253c4626A57489a15808o3554C8845b25640H486a56228e8789A51918L199a7287
11241H2900a48446A26846a19378l573m5107j2373n6125f6883m10948e2269A24313
$$ plain form
11229 -50623 168540 64292 -216548 97720 -192304 -54666 150110 -51715 -190949 -47674 131650
11217 -38831 -72496 156252 161439 -372191 183909 -127872 -515074 343169 -60168 27700 24360
11206 24360 314251 -38443 161643 -70774 -109200 145831 -123273 -146815 -109124 -16135 55001
11194 139148 -73952 -159703 78440 68231 -8349 73534 -62902 -294907 -152539 154029 113194
11183 113194 64472 171295 -57382 158676 -234296 -410119 -68136 160703 -98024 -60916
11173 -60916 -203273 184240 157257 -40852 -94850 -146270 -15581 220751 -252474 -35753 -79085
11162 -79085 82510 17649 -5316 175510 73994 -142712 52125 161541 -234086 81624 -281129
11150 -91268 251551 377320 96989 126846 29827 69004 169387 198196 -18417 84239 186751
$$ packed form
11229e0623A68540F4292b16548I7720a92304e4666A50110e1715j39234d7674A31650
11217c8831l3665A56252N187c72191A83909a27872l87202C43169f0168B7700l340
11206B4360K89891c8443A61643g0774l8426A45831a23273k3542L7691a6135E5001
11194A39148g3952q5751G8440j0209h349G3534f2902k32005J42368A54029m0835
11183A13194m8722J06823e7382A58676b34296j75823f8136A60703i8024L7108
11173f0916j42357A84240k6983d0852n3998n1420a5581B20751b52474c5753m3332
11162g9085H2510A7649e316A75510G3994a42712E2125J09416b34086H1624b81129
11150i1268B51551J25769I6989K9857B9827L9177J00383K8809a8417H4239J02512
$$ plain form
11139 186751 56507 21723 11490 132614 139660 -181516 -72253 93965 4862 119921 -227860
11127 -158682 12724 35356 4971 134928 76996 -212240 -26659 293401 -89510 419850 -109174
11115 65256 -170330 -509941 -137687 -129582 -61847 21152 59833 325869 -114362 239144 15228
11103 362379 15571 282997 93567 24628 13572 -34106 66181 -95143 166658 89742 -71255
11091 31391 -244288 -274914 38028 97722 -96012 483757 253554 -22049 222453 95735 130941
11080 130941 154203 -94610 -74282 5747 56771 249148 174725 170430 329181 316292 180546
11069 180546 113012 54783 473307 -126114 305666 510302 207449 129273 298919 294637
11059 294637 102478 321065 734858 147368 26522 325106 687524 445928 701434 198052
$$ packed form
11139A86751E6507B1723j0233J21124P046a81516g2253I3965D862J15059b27860
11127a58682A2724K2632D971J29957n7932b12240b6659B93401h9510D19850a09174
11115F5256a70330l39611a37687Q105f1847B1152L8681K66036a14362B39144A5228
11103C62379A5571K67426I3567B4628j1056c4106F6181i5143A66658p6916g1255
11091C1391b44288l0626C8028N9694i6012D83757k30203b2049B22453I5735L5206
11080A30941K3262i4610K0328E747N1024J92377p4423m295J58751j2889j35746
11069A80546o7534E4783M18524a26114C05666K04636B07449p8176J69646m282
11059B94637A02478K18587M13793A47368B6522K98584L62418k41596K55506A98052
$$ plain form
11048 360002 268716 415853 414110 601748 250890 443416 534090 667380 286060 225550
11038 225550 364956 792698 306441 607180 399618 292083 273824 605933 719136 464111
11028 464111 393697 648744 500353 453659 305360 561833 157035 399958 428287 274973
11018 274973 384904 550468 579081 610944 419670 515287 247355 436035 606416 530037
11008 530037 201980 510546 265100 148423 372697 613778 439815 491245 430286 892579
10998 892579 274648 243439 281341 512120 409964 486249 242838 601406 880954 249350
10987 441570 685912 279171 513440 659929 589699 979455 642340 826129 1055487 1014807
10977 1014807 962611 918364 1098479 1489795 1536839 1963986 1863106 1954202 1780944 1581124
$$ packed form
11048C60002r1286J47137j743J87638B50890J92526R0674J33290B86060o0510
11038B25550J39406M27742C06441L00739k07562j07535j8259L32109J13203k55025
11028D64111p0414K55047j48391m6694j48299K56473A57035K42923K8329j53314
11018B74973J09931J65564K8613L1863j91274R5617B47355J88680J70381p6379
11008E30037B01980L08566k45446j16677K24274K41081j73963N1430o0959M62293
10998H92579B74648l1209L7902K30779j02156P6285B42838L58568K79548B49350
10987D41570K44342B79171K34269J46489p0230L89756l37115J83789K29358m0680
10977A014807n2196m4247J80115L91316M7044M27147j00880R1096j73258j99820
$$ plain form
10967 1581124 1471366 1372284 1079405 1068046 1175136 1076807 1343425 1186526 1341070 1423751
10957 1423751 1009953 1161544 1249058 1334395 590289 812298 495415 703882 429064 411275
10947 411275 151817 427805 235885 253079 -11813 168560 95343 230971 29428 222761
10937 222761 167836 -120173 217909 38267 148862 4282 356697 -227551 6676 15958 162640
10926 162640 58363 -105645 78547 27336 -370533 82144 -199680 -6031 -93525 377841 -9516
10914 -102551 -117388 133772 66744 99978 -503778 -236268 -192081 108793 -211408 -114125
10904 -114125 -317173 -262879 -325707 -255646 -207392 -129953 344265 -43343 -80430 -255958 -197912
10893 -197912 -202518 -110022 76734 -139447 272594 195659 72516 92865 160467 106657 72091
$$ packed form
10967A581124j09758r9082k92879j1359J07090r8329K66618j56899J54544Q2681
10957A423751m13798J51591Q7514Q5337E90289K22009l16883K08467k74818j7789
10947D11275A51817K75988j91920J7194a1813A68560p3217J35628B9428J93333
10937B22761n4925a20173B17909C8267J10595D282L52415b27551F676R282J46682
10926A62640E8363a05645G8547B7336c70533H2144a99680f031q7494C77841i516
10914a02551j4837A33772F6744L3234e03778b36268M4187A08793b11408R7283
10904a14125k03048N4294o2828P0061M8254P7439C44265d3343l7087j75528N8046
10893a97912m606R2496G6734a39447B72594p6935G2516K0349O7602n3810l4566
$$ plain form
10882 72091 10856 -443275 -30296 -86955 -32117 -214147 115717 19389 -320647 -192487 494458
10870 36190 216094 -90407 -61154 -99369 -287869 28961 2814 -130265 -200583 -22476 -13962
10859 -13962 -287311 45159 -231467 -88748 149851 178638 -157819 28354 -63995 -191671 -366229
10848 -366229 -220845 -505992 32231 137815 82537 181257 -13248 -66193 67069 209460 -99367
10836 38490 -178701 -91744 149296 220088 -147036 237152 -113894 -69945 -179546 -137158
10826 -137158 182517 -113950 -26239 107718 190921 2505 91048 -42715 46187 -213706 -347320
10815 -347320 -83022 164252 -12451 52674 259851 -132478 227932 15381 115156 231339
10805 231339 -77565 304743 -173384 -296731 115806 389505 69006 -388298 -39106 -23802
$$ packed form
10882G2091A0856d43275c0296n6659c2117j82030A15717A9389c20647J28160D94458
10870C6190J79904i0407K9253l8215j88500B8961B814a30265p0318b2476Q514
10859a3962k73349D5159b31467h8748A49851K8787a57819B8354f3995j27676j74558
10848c66229J45384k85147C2231J05584n5278R8720a3248n2945F7069J42391i9367
10836C8490a78701Q6957A49296P0792a47036B37152a13894M3949j09601M2388
10826a37158A82517a13950b6239A07718Q3203B505Q8543d2715D6187b13706j33614
10815c47320h3022A64252a2451E2674K07177a32478B27932A5381R9775J16183
10805B31339g7565C04743a73384j23347A15806K73699F9006c88298c9106J5304
$$ plain form
10795 -23802 -78845 183006 83765 -49467 64977 57631 -23230 -425687 -328354 -10310 223708
10783 309627 68425 -866 -18736 -256854 -107875 -395363 -188566 -51054 -187673 -22161 -153494
10772 -153494 141923 -175775 82388 284463 72173 81660 -152958 -259893 -63169 -392 44452
10760 -29786 -163069 -16412 36031 137075 31377 26056 202921 -46501 -214326 -63415 73001
10748 -10433 -157838 -243348 -153427 137873 155523 -15079 -35001 2347 315493 212548 6445
10736 -171346 -69076 -201977 189097 214503 -55768 -170169 -153818 -5431 -116776 -26413 -223181
10725 -223181 29498 -804 -191083 307439 -281642 -14714 -246702 -165917 -161522 76329 -226880
10713 181 -84064 -148216 -134726 -30820 -244554 -175450 -63786 -233271 167489 -117280 74517
$$ packed form
10795b3802n5043A83006H3765d9467F4977p346b3230m02457R7333a0310B23708
10783C09627F8425h66j7870k38118a07875k87488a88566e1054j36619b2161j31333
10772a53494A41923a75775H2388K02075G2173R487a52958j06935f3169c92D4452
10760b9786j33283a6412C6031J01044C1377n321J76865d6501j67825f3415G3001
10748a0433j47405q5510Q9921A37873J7650a5079j9922B347L13146j02945F445
10736a71346f9076j32901A89097K5406e5768j14401J6351e431j11345b6413j96768
10725b23181B9498h04j90279C07439b81642a4714k31988Q0785M395G6329b26880
10713A81h4064o4152J3490c0820k13734O9104f3786j69485A67489a17280G4517
$$ plain form
10701 -160819 -242632 -135418 -354987 -107751 -47611 -41098 -23642 137372 -285791 -82230 48099
10689 -11029 112932 155728 97046 -4382 -35683 -191876 204294 92522 -337229 129158 -84789
10677 -157300 108033 22934 -254293 -222513 -147201 -168801 199793 -115228 -94011 -121674 -131311
10666 -131311 18340 -1450 61068 157234 5250 -3753 131902 -69538 -132205 -290484 -35846 -61353
10654 -61353 -289257 -50230 132362 -208542 -225216 151945 45007 -172769 38022 100990 -173905
10642 -15588 37785 41705 24175 -62019 110588 -124625 -43284 159688 -363855 141981 223404
10631 223404 77937 -8526 -53560 -22226 -17089 -6266 -140121 -94207 74480 -22530 -114604 -266837
10619 -266837 198940 -92131 110321 -167977 81257 -172187 240648 148196 -192188 134439
$$ packed form
10701a60819q1813J07214k19569a07751d7611O513J7456A37372b85791h2230D8099
10689a1029A12932M2796n8682d382l1301j56193B04294I2522c37229A29158h4789
10677a57300A08033B2934b54293L1780P5312k1600A99793a15228K1217k7663r637
10666a31311A8340a450F1068R6166E250c753A31902f9538o2667j58279c5846k5507
10654f1353k27904e0230A32362b08542j6674A51945D5007a72769C8022O2968a73905
10642a5588C7785L920j7530f2019A10588a24625d3284A59688c63855A41981Q1423
10631B23404G7937h526m5034b2226N137f266j33855M5914G4480b2530r2074j52233
10619b66837A98940i2131A10321a67977H1257a72187B40648r2452a92188A34439
$$ plain form
10608 358482 -171220 -485247 -269110 -212831 -500052 -15384 -20951 -188724 -50542 89555 -215816
10596 195305 -109385 31632 -110858 -95949 -271128 80122 67674 30987 183703 -91295 -181369
10585 -181369 -197389 -58404 -317652 -128499 -118140 -104267 50709 -182283 -41348 -70566 -254001
10574 -254001 -96850 -161220 -366185 -194267 -75638 -99202 79704 124842 -31677 -172219 185596
10562 -269843 -15598 100487 -86914 -4364 293166 -618 -25475 -359105 -120485 -156706 -193539
10551 -193539 -106019 6608 -96973 178509 62565 10603 234156 -26443 -396715 214103 48640
10539 21730 -76827 69830 97688 27867 117890 16202 -125866 161455 -91601 3207 147912
10528 147912 -219990 28256 3608 -272132 83778 -67898 260737 418607 87629 83467 191669
$$ packed form
10608C58482a71220l14027K16137N6279k87221a5384n567j67773e0542H9555b15816
10596A95305a09385C1632a10858J4909j75179H0122j2448C0987J52716i1295r0074
10585a81369j6020e8404k59248a28499J0359J3873E0709a82283d1348k9218j83435
10574b54001i6850o4370k04965J71918g5638k3564G9704M5138c1677j40542A85596
10562b69843a5598A00487h6914d364B93166f18k4857l33630a20485l6221l6833
10551a93539Q7520F608i6973A78509F2565A0603K23553b6443l70272B14103D8640
10539B1730g6827F9830K7858B7867R0023A6202a25866A61455i1601C207J44705
10528A47912b19990B8256C608b72132H3778f7898B60737J57870H7629m162J08202
$$ plain form
10517 191669 3121 -184495 -253233 -244837 -323100 -185239 -147806 81838 40282 -248741 -414082
10506 -414082 52405 -47167 209656 -233061 77566 -211966 -3338 153161 12784 -14845 -227819
10495 -227819 37534 -38738 -254855 -270179 -201557 10048 120734 -77912 7702 -67607 112717
10483 259211 282313 333386 91918 -86707 51073 204582 39326 -145913 -59426 32563 44186
10472 44186 317974 28138 86576 -183445 73767 -66821 -85331 -44138 141350 -69291 -35731
10461 -35731 67683 -73633 52584 98394 88553 -144875 -59466 -72112 -285299 99373 15544
10449 38670 -17465 -207436 139243 -158490 -102531 114610 -50715 217312 -223572 28718
10438 -211475 -406880 233772 -114852 104397 -36709 -114915 -26398 -241025 191216 -104596
$$ packed form
10517A91669C121a84495o8738Q396p8263J37861L7433H1838D0282b48741j65341
10506d14082E2405d7167B09656b33061G7566b11966c338A53161A2784a4845k12974
10495b27819C7534c8738k16117j5324O8622A0048J10686g7912G702f7607A12717
10483B59211K3102N1073I1918h6707E1073J53509C9326a45913e9426C2563J1623
10472D4186K73788B8138N8438a83445G3767f6821j8510M1193A41350f9291L3560
10461c5731F7683g3633E2584M5810r841a44875e9466j2646k13187I9373A5544
10449C8670a7465j89971A39243a58490N5959A14610e0715B17312b23572B8718
10438b11475j95405B33772a14852A04397c6709p8206b6398k14627A91216a04596
$$ plain form
10427 -102336 -407879 -56616 -30208 -129912 -122482 -267394 118376 93920 -81040 -132766 -68312
10416 -68312 -25441 66586 83305 -435485 8720 16308 -77060 174066 169090 39485 -170460 -250457
10404 -250457 145384 -67154 35057 -201859 -208558 134505 -157198 -205344 356402 32439 99448
10393 99448 551882 -111066 92262 63890 -180652 -321859 -41044 27248 -235635 -255830 37750
10381 49189 232519 -55538 -21916 227068 -150893 54981 -274864 -263289 78010 -76099 -60156
10370 -60156 247922 357661 7499 351432 286712 470872 233502 175449 454856 -6943 294030
10358 249800 267643 223510 215211 -78218 9064 -201067 118919 151130 498888 310835 118133
10346 -57630 43634 383861 -40692 303763 357104 73826 -54680 174731 198648 400695 139479
$$ packed form
10427a02336l05543e6616K6408r9704P430j44912A18376k4456h1040n1726O4454
10416f8312b5441F6586J6719d35485H720P588g7060A74066m976C9485a70460p9997
10404b50457A45384f7154C5057b01859o699A34505a57198m8146C56402C2439O7009
10393I9448M52434a11066I2262k8372a80652j41207d1044B7248b35635k0195C7750
10381D9189J83330e5538b1916B27068a50893E4981b74864J1575G8010g6099J5943
10370f0156B47922J09739G499L43933o4720J84160B33502n8053K79407f943B94030
10358B49800J7843m4133q299g8218I064b01067A18919L2211L47758j88053A18133
10346e7630D3634L40227d0692C03763N3341G3826e4680A74731K3917K02047A39479
$$ plain form
10334 -66667 29986 212589 70344 -86678 -78394 -200674 -128953 -110456 -150772 221799 242869
10323 242869 -127665 -165500 -90989 64506 95183 -82202 463165 213309 -27557 29434 218050
10312 218050 -34558 -83471 -14839 -86590 127795 -286858 219861 107818 66951 159328 103595
10301 103595 -60101 -94818 -87964 281256 -26120 -182032 -182997 51611 215563 62386 163023
10290 163023 -215364 -249860 -39565 49911 -46543 -29118 -313448 -108872 -91762 44142 113732
10279 113732 229284 -186922 -55999 -79232 -57068 -212397 -24752 -255304 46810 -45625 -401819
10268 -401819 344552 191730 191444 -12527 40913 366199 14636 326063 13541 148226 194679
10257 194679 519841 267094 122634 378558 -60179 -77215 -146292 81259 27453 -308012
$$ packed form
10334f6667B9986J82603G0344h6678Q284j22280P1721J8497m0316B21799K1070
10323B42869a27665l7835P4511F4506L0677h2202D63165B13309b7557B9434J88616
10312B18050c4558m8913a4839p1751A27795b86858B19861A07818m0867R2377n5733
10301A03595f0101l4717O854B81256b6120j55912r65E1611J63952F2386J00637
10290A63023b15364l4496c9565D9911d6543J7425k84330a08872J7110D4142O9590
10279A13732J15552a86922e5999k3233K2164j55329b4752k30552D6810d5625l56194
10268d01819C44552j52822k86a2527D0913L25286A4636L11427A3541J34685M6453
10257A94679L25162k52747A22634K55924f0179j7036o9077H1259B7453c08012
$$ plain form
10246 -11039 6698 -62421 309518 21225 -73833 -15952 -292603 -65719 166138 151555 -104492
10234 -129463 -97153 -48494 -35669 41562 -224917 -65965 299294 -80064 120822 -930 197817
10222 -142216 251571 8059 -362360 75272 47337 -258274 -95314 12405 -109375 -333173 48919
10210 -156259 195833 -208465 95731 -86854 -75400 153177 -70759 -86818 -294693 -15919 -342375
10199 -342375 -214845 92541 128955 38750 -74704 98078 22204 -42735 -20310 -465969 -263225
10188 -263225 -117157 -394101 15300 -76957 -104621 241954 -5224 -99968 -167397 -94566 -228093
10177 -228093 -189574 -36047 215537 105123 94859 52945 184438 -57980 119220 -250559
10166 -180232 -61464 -105195 -75402 -44728 -13154 -81576 -122676 51053 34616 -71366 -27078
$$ packed form
10246a1039F698f2421C09518B1225g3833a5952k76651f5719A66138j4583a04492
10234a29463L2310d8494J2825D1562b24917f5965B99294h0064A20822i30A97817
10222a42216B51571H059c62360G5272k7935b58274i5314A2405a09375k23798D8919
10210a56259A95833b08465I5731h6854J1454A53177g0759j6059k07875a5919l26456
10199c42375J27530I2541L6414C8750g4704I8078B2204d2735b0310m45659K02744
10188b63225a17157k76944A5300g6957k7664B41954e224r4744o7429P2831j33527
10177b28093L8519c6047B15537A05123j0264m1914J31493e7980A19220b50559
10166a80232f1464m3731K9793L0674a3154o8422m1100E1053j6437g1366b7078
$$ plain form
10154 -97899 144271 -188922 -159135 50804 -227971 109198 -27211 62058 -207476 78098 -73943
10142 -169202 -228085 -187947 42373 30411 273354 86268 -67389 -223459 -9251 256701 -358942
10130 -132043 -381403 -13047 -197797 -202316 -96760 176079 4362 -234530 -150333 57872 -102407
10118 -408708 -118360 -89951 -115184 -3508 -366926 -23940 -150357 48303 64771 185444 -32708
10106 -148040 65157 43027 -23723 -55932 -77493 58101 -125057 -102336 73459 -83005 -168934
10095 -168934 359659 127661 -34567 -84606 -109377 -140532 -376503 126081 -321228 179482
10084 190047 -32961 -204111 130908 -105082 -104331 81115 -127978 195876 53143 -86865 134316
10072 275704 -162997 -116987 -371082 1364 274491 107377 151335 85581 105641 -100639 -28068
$$ packed form
10154i7899A44271a88922K9787E0804b27971A09198b7211F2058b07476G8098g3943
10142a69202n8883M0138D2373j1962K42943H6268f7389j56070i251B56701c58942
10130a32043k49360a3047j84750m519i6760A76079D362b34530Q4197E7872a02407
10118d08708a18360K8409k5233c508l63418b3940j26417D8303J6468J20673c2708
10106a48040F5157k2130b3723l2209k1561E8101a25057K2721G3459h3005q5929
10095a68934C59659A27661c4567n0039k4771l1155k35971A26081c21228A79482
10084A90047c2961j71150A30908a05082P51H1115a27978A95876E3143h6865A34316
10072B75704a62997M6010k54095A364K73127A07377M3958o5754K0060a00639b8068
$$ plain form
10060 -191222 -171210 -421472 -32924 -173592 -298074 -110597 -37341 -24524 -285417 -18548
10049 -270900 252172 -136434 -3861 238436 51179 -132403 201508 -199487 -1919 274532
10038 181735 -260213 -34870 -286050 -5851 -79544 -297339 -232687 279362 -115441 -9607 252925
10026 46039 -267310 -93156 -54160 -142035 -92955 1861 -10065 36846 -275188 277469 -53424
10014 -2062 61756 -277062 231889 -266087 -331411 -158077 109515 51954 -159676 3436 -50376
10002 -149324 -162729 -227980 -151398 6315 142784 193638 -19814 175209 -35763 70277 21705
9990 298692 -279481 -4951 221218 101826 216506 -72333 -64826 -181760 -216204 -167375 -84033
9979 -84033 -129899 -467081 -305401 -159474 -139236 -240724 -208159 -181494 142517 -137310 -168963
$$ packed form
10060a91222K0012k50262c2924j40668j24482a10597c7341J2817k60893a8548
10049b70900B52172a36434c861B38436E1179a32403B01508a99487a919B74532
10038A81735b60213c4870k51180e851p3693k17795O4652B79362a15441i607B52925
10026D6039b67310i3156L8996q7875M9080A861a0065C6846b75188B77469e3424
10014b062F1756b77062B31889b66087o5324a58077A09515E1954a59676C436e0376
10002a49324j3405o5251P6582F315J36469N0854a9814A75209c5763G0277B1705
9990B98692b79481d951B21218A01826J14680g2333P507j16934l4444M8829Q3342
9979h4033m5866l37182J61680J45927K0238j01488L2565K6665A42517a37310l1653
$$ plain form
9968 -168963 -253253 -160503 -373304 -236567 -221461 249446 150648 123574 169338 -96221 170677
9956 219296 6469 -39059 -16584 256413 -152382 56438 52373 -123009 56353 -206270 74392
9944 -107291 -187009 -192119 250977 -121693 -19727 -25014 -131064 59060 -51229 195611 -62679
9932 168851 -259407 -129539 66642 -212079 -26227 -227016 -4246 -90407 138239 -226091 64749
9920 -90975 -315616 177885 143925 96695 -51681 -15244 -404996 22230 -295805 -201199 -125998
9909 -125998 155337 5693 75563 -101842 -42649 -110223 120507 -145351 -85289 -126013 -140151
9898 -140151 5558 -66449 49886 -46969 -39152 -149659 140739 -243381 -436466 -72376 -282242
9887 -282242 119924 -168424 -171043 -42243 201316 60694 -28451 -227406 150505 -154412 -25468
$$ packed form
9968a68963q4290R2750k12801J36737J5106B49446r8798k7074M5764i6221A70677
9956B19296F469c9059a6584B56413a52382E6438m065a23009E6353b06270G4392
9944a07291p9718n110B50977a21693a9727n287j06050E9060e1229A95611f2679
9932A68851b59407a29539F6642b12079b6227k00789d246q6161A38239b26091F4749
9920i0975k24641A77885l3960m7230e1681a5244l89752B2230b95805R4606P5201
9909a25998A55337E693O9870a01842d2649o7574A20507a45351O0062m0724j4138
9898a40151E558f6449D9886d6969P817j10507A40739b43381j93085g2376k09866
9887b82242A19924a68424k619d2243B01316F0694b8451j98955A50505a54412b5468
$$ plain form
9875 -80530 -22033 298861 66491 -134067 -25393 33251 -125020 -326582 149786 -2602 -863
9863 300183 90058 103392 31981 -140707 -227026 9569 153847 -96409 -280633 -180681 -58094
9851 -23831 241366 61752 -183048 198667 -22505 -208449 -24363 -196766 135933 -223385
9840 84829 -121679 47366 40971 -191979 188125 -58685 148012 63395 -94859 237257 53838
9828 -198785 168152 4580 113209 89560 -158669 -346261 -267884 -43311 -201294 146689 -158583
9816 -421834 -237805 -363334 54934 -211699 -248665 137156 140445 -238213 -33131 -35542 -184733
9805 -184733 61291 47814 -40002 158527 -228763 337787 -246325 -8732 -114208 2993 -86265
9793 213849 -95597 -218682 -227657 223119 17319 -84311 142467 12303 198556 -265712 -104863
$$ packed form
9875h0530b2033B98861F6491a34067b5393C3251a25020k01562A49786b602h63
9863C00183I0058J3334C1981a40707q6319I569J44278i6409j84224R9952e8094
9851b3831B41366F1752a83048A98667b2505j85944b4363j72403A35933b23385
9840H4829a21679D7366o395a91979A88125e8685A48012F3395i4859B37257E3838
9828a98785A68152D580J08629k3649a58669j87592P8377d3311j57983A46689a58583
9816d21834J84029j25529E4934b11699l6966A37156L289b38213c3131k411j49191
9805a84733F1291j3477d0002A58527b28763C37787b46325h732j05476B993h6265
9793B13849i5597j23085q975B23119A7319h4311A42467A2303J86253b65712a04863
$$ plain form
9781 -84323 96736 73653 -11 285493 55690 -176671 8649 61940 -165936 132179 -145003 190429
9768 -255615 198942 80265 194706 -1626 -88083 -211845 -44568 -171341 -2676 106586 75329
9757 75329 136704 67553 -139704 2469 -32601 -116341 -179608 -87824 76826 -12020 121558 -362790
9744 -30934 27019 -161762 -402192 -67134 -171695 10628 -245064 -260046 -111594 -32417 173630
9732 47454 -54805 180400 -299925 -335360 436018 -129426 -240724 35544 115622 -142905 -121624
9721 -121624 221103 81704 305772 130037 -281176 -75361 210425 173774 -215553 -321596
9711 -321596 -264764 -286828 26814 -114212 -42809 -117575 -220821 -461684 30326 -137172 -6338
9699 -243891 165950 101200 -179320 -41692 126439 -86841 -141549 23986 217219 -102339 -168329
$$ packed form
9781h4323I6736k3083a1B85493E5690a76671H649N3291a65936A32179a45003A90429
9768b55615A98942H0265J14441a626q6457j23762d4568j26773b676A06586l1257
9757G5329O1375F7553a39704B469c2601q3740o3267h7824G6826a2020A21558c62790
9744c0934B7019a61762k40430f7134j04561A0628b45064j4982a11594c2417A73630
9732D7454e4805A80400b99925l5435D36018a29426j11298C5544Q0078a42905K1281
9721a21624B21103H1704K24068A30037b81176g5361B10425l6651b15553j06043
9711c21596N6832k2064B6814a14212d2809p4766j03246k40863C0326a37172f338
9699b43891A65950o4750a79320d1692A26439h6841n4708B3986J93233a02339o5990
$$ plain form
9688 -168329 240261 132524 198565 -58043 -15488 -355753 114068 -148864 -13421 -117723
9678 -117723 292152 76886 -105644 -341641 -317048 -9753 -135749 65723 -29860 -234390 -216184
9667 -216184 -139659 -103311 204796 -41752 -2342 -162693 -269548 -39333 -100729 -216865 -313150
9656 -313150 114608 116841 -166506 122356 63937 -85426 94509 151230 -70299 -21391 -13374
9645 -13374 -40165 -438301 -93358 60779 -225973 -22539 -316144 12137 64249 -466675 -333395
9634 -333395 188325 -97694 -74848 258116 20560 103568 -249031 -298329 331879 -184154 -103347
9623 -103347 149125 -8518 -146809 348419 -409285 -38505 10854 -150274 -97050 108278 135203
9612 135203 -164552 -1265 401880 43643 118820 173604 -85798 -55520 114610 2561 -178347
$$ packed form
9688a68329B40261j07737O6041e8043a5488l40265A14068a48864a3421j04302
9678a17723B92152G6886a05644k35997K4593i753j25996F5723b9860k04530J8206
9667b16184P6525L6348B04796d1752b342j60351j06855c9333o1396j16136r6285
9656c13150A14608K233a66506A22356n8419h5426I4509N6721g0299b1391Q017
9645a3374k6791l98136i3358F0779b25973b2539k93605A2137N2112d66675J33280
9634c33395A88325i7694K2846B58116B0560Q3008b49031m9298C31879a84154Q0807
9623a03347A49125h518j38291C48419d09285c8505A0854a50274N3224A08278K6925
9612A35203a64552a265D01880D3643P5177N4784h5798L0278A14610B561a78347
$$ plain form
9600 34662 -36671 -173879 -52399 -252817 -192273 402959 53587 74542 -150641 -81507 97687
9588 -182747 -188527 50631 190670 264601 -229617 96697 109813 59260 308887 -117903 -161909
9577 -161909 12804 -88820 237336 -201529 -193045 -87906 -293593 -266055 -153579 -74949 35022
9565 -75607 -371003 58596 -16536 29106 15254 -174413 195720 10654 -187419 -163731 173417
9553 131599 -61007 -257377 159522 -108570 -120447 112611 355261 148247 -89768 23629
9542 -37589 -42601 155595 -91401 7855 19460 -198259 -125405 125752 -37593 -61512 -112051 49961
9529 68577 -170564 -239974 64658 139750 -105650 115472 191689 -296738 -309994 154221 -265165
9517 14385 -270941 31347 -9019 18641 96451 150751 -307025 -354102 5621 -103777 71417 -6952
$$ packed form
9600C4662c6671j37208e2399k00418O0544D02959E3587K0955a50641O9134I7687
9588a82747n780E0631J40039P3931b29617I6697J3116n0553K49627a17903m4006
9577a61909A2804h8820B37336b01529Q484h7906k05687K7538J12476g4949C5022
9565g5607k95396E8596a6536B9106j3852a74413A95720A0654a87419K3688A73417
9553A31599f1007j96370A59522a08570j1877A12611K42650A48247h9768B3629
9542c7589n012A55595i1401G855J1605a98259P2854A25752c7593k3919n0539D9961
9529F8577a70564o9410F4658P5092a05650A15472P6217b96738j3256A54221b65165
9517A4385b70941C1347i019A8641P7810N4300c07025m7077E621a03777G1417f952
$$ plain form
9504 76605 -81201 102819 -83895 26790 164128 -130024 -159128 31787 -194952 -3054 -13444
9493 -13444 -88545 -1039 211755 -359418 -22538 -186404 -1156 50976 13873 96142 326244
9482 326244 -145416 -206371 -223375 -111808 89965 -162451 -300952 65128 -78576 -33546 -273671
9471 -273671 38981 -70616 -319987 -217759 -196905 -340847 79129 -86290 -54160 -157662 -164784
9460 -164784 31146 235351 175050 59798 -3961 162653 113659 45331 -161540 -113845 -54125
9448 -95822 378612 -365690 8986 -153175 -3936 22740 -226446 -90245 29812 -299846 -124199
9436 16047 99006 10706 65507 -19759 -383895 -79432 110196 -35838 -305565 -5643 72031
9424 -348418 25512 -164171 -158 -254417 145170 42613 -268982 262668 24523 -253956 -325958
$$ packed form
9504G6605h1201A02819h3895B6790J37338a30024k9104C1787a94952c054j0390
9493a3444p5101a039B11755c59418b2538j63866a156E0976A3873Q2269K30102
9482C26244a45416o0955j7004J11567H9965a62451j38501F5128g8576c3546k40125
9471b73671C8981g0616k49371J02228K0854j43942G9129h6290L2130j03502p122
9460a64784C1146K04205o0301E9798c961A62653m8994D5331a61540M7695e4125
9448i5822C78612c65690H986a53175c936B2740b26446i0245B9812b99846a24199
9436A6047Q2959A0706N4801a9759l64136g9432A10196c5838k69727e643G2031
9424c48418B5512a64171a58k54259A45170D2613b68982B62668B4523b53956p2002
$$ plain form
9413 -325958 -284057 -99640 -140725 5260 -78427 -210202 -29929 133580 31151 -35725 -51859
9402 -51859 -202431 231638 -271285 143046 -286851 -30270 168689 -237565 157098 4659
9391 -60375 -33146 -212714 -56938 -204968 -137141 141990 1129 21531 -263083 -118884 -408337
9380 -408337 -266790 -141634 258489 58509 95784 -286133 19791 -49575 180687 -175469
9369 -59635 98075 55416 98117 -3027 153434 30476 -323595 335991 -88035 102248 -295261
9357 41332 74872 -6577 -224493 -36714 -261231 -166411 -95591 -32158 83590 -497998 -4814 64171
9344 8819 -87874 -24258 -212794 -176373 -128829 -101589 52485 -55442 206475 51586 -150395
9332 -72229 4173 -65242 -179955 -156206 209213 -168506 -183062 -307664 -223024 -130673 304739
$$ packed form
9413c25958M1901i9640m1085E260g8427j31775b9929A33580C1151c5725j6134
9402e1859j50572B31638b71285A43046b86851c0270A68689b37565A57098D659
9391f0375K7229j79568e6938j48030O7827A41990A129K0402b63083a18884k89453
9380d08337J41547J25156B58489E8509L7275b86133A9791d9575A80687a75469
9369e9635I8075m2659M2701c027A53434C0476c23595C35991h8035A02248b95261
9357D1332L3540f577k17916c6714k24517R4820P0820c2158H3590d97998d814F4171
9344H819h7874b4258j88536L6421M7544K7240E2485e5442B06475E1586a50395
9332g2229D173f5242j14713K3749B09213a68506j4556j24602Q4640R2351C04739
$$ plain form
9320 -61529 118106 -90308 44851 100106 -13814 -164732 -284740 -17481 15802 -121322 75455
9308 69581 -345851 112370 -81462 281114 34815 188976 -387115 -77458 -116718 114916 222867
9297 222867 10696 151945 34890 -241379 185013 -155428 94021 55324 -345786 -258682 238547
9285 109633 -229156 33600 164669 -14973 -390799 73236 -140284 73231 -152504 511511
9274 46792 254500 -7372 85323 -284197 -129142 -188958 -88671 -177229 -112418 -58257 -123963
9263 -123963 -72313 263317 222744 30498 307645 168629 -183646 -34660 55671 -245012 -22850
9251 -230446 95371 -104346 -30300 -124430 -179778 -242614 10945 66647 49544 1406 -81184 54295
9238 -51854 -197998 165802 -187075 69530 -580 11709 -307223 -78408 -186628 54580 857 -94912
$$ packed form
9320f1529A18106i0308D4851N5255a3814j50918j20008a7481A5802a21322G5455
9308F9581c45851A12370h1462B81114C4815J54161c87115g7458l9260A14916J07951
9297B22867A0696J41249C4890b41379A85013a55428I4021l8697c45786Q7104B38547
9285A09633b29156C3600J31069a4973l75826G3236a40284G3231a52504E11511
9274D6792K07708g372H5323b84197a29142n9816h8671q8558O4811N4161o5706
9263a23963N1650B63317m0573C0498K77147j39016a83646c4660E5671b45012b2850
9251b30446I5371a04346c0300r4130n5348o2836A0945N5702j7103A406h1184E4295
9238e1854j46144A65802a87075F9530e80A1709c07223g8408j08220E4580H57i4912
$$ plain form
9225 520 -131763 -135898 -145625 -130007 -163200 83316 -168277 -224962 40247 -31418 11 -171364 -311584
9212 -311584 -248903 -211901 -83953 64038 -128182 312284 -272613 -363648 24624 252620 84407
9200 -47893 158898 -276751 -52053 63112 -101992 20751 -69339 -186266 -279659 64988 -117330
9188 -3357 -51640 189189 -128575 -27428 292095 -192625 55692 -20983 -12484 241210 -80981
9176 -12319 -237655 -22678 -86405 220110 -84238 -245440 -462535 79320 -91436 74458 -168826
9164 -65057 -234078 -12818 -14084 -81178 -26966 -98291 -219242 109585 89870 -102055 -407955
9153 -407955 -148697 47222 -32276 -225214 30877 -258374 24625 156816 -161434 -216544 -57262
9141 206868 -61279 -20314 65361 -263768 -14339 -127226 41454 59012 50909 -104343 -133127
$$ packed form
9225E20a31763m135r727J5618l3193H3316a68277n6685D0247c1418A1a71364j40220
9212c11584O2681L7002h3953F4038a28182C12284b72613r1035B4624K27996H4407
9200d7893A58898b76751e2053F3112a01992B0751f9339j16927r3393F4988a17330
9188c357m8283A89189a28575b7428B92095a92625E5692b0983Q499B41210h0981
9176a2319k25336b2678o3727B20110h4238j61202k17095G9320i1436G4458a68826
9164f5057j69021a2818j266o7094b6966p1325j20951A09585j9715a02055l05900
9153d07955a48697D7222c2276j92938C0877b58374B4625J32191a61434n5110e7262
9141B06868f1279b0314F5361b63768a4339j12887D1454J7558q103a04343k8784
$$ plain form
9130 -133127 44370 -199674 -188491 -234159 -137142 -181302 -67718 -151497 -185678 -128023 199025
9118 -82113 -24329 -118129 32158 -125006 -299378 -85740 -353229 292749 81406 130153 -307847
9106 78850 243917 -61397 -201408 96009 154541 102310 -45986 105120 -159689 -89587 -66613
9095 -66613 208650 -84195 -141307 -74807 -81713 59957 -311335 -163741 -136711 -199287 316622
9083 -376236 -120249 -29979 -9358 -50515 86995 289304 -281353 19161 -40451 -102307 25460
9071 -26704 -16705 -212847 -15209 335644 -212437 -77596 -136801 200720 67569 135029 32722
9059 122016 142269 185343 32447 223491 -80117 -163852 14629 251216 8960 -27921 -81568
9048 -81568 70467 110994 -111249 -115078 -14208 -59141 -69899 -139855 125159 -287944 366547
$$ packed form
9130a33127D4370a99674J1183m5668R7017m4160f7718q3779l4181N7655A99025
9118h2113b4329r3800C2158a25006j74372h5740k67489B92749H1406M8747c07847
9106G8850J65067f1397j40011I6009N8532n2231d5986A05120a59689P0102K2974
9095f6613B08650h4195n7112O6500o906E9957c11335J47594K7030o2576C16622
9083c76236a20249b9979i358m1157H6995K02309b81353A9161d0451o1856B5460
9071b6704R999j96142a5209C35644b12437g7596n9205B00720F7569O7460C2722
9059A22016K0253M3074C2447J91044h0117q3735A4629K36587H960b7921n3647
9048h1568G0467M0527a11249l829a4208m4933j0758o9956A25159b87944C66547
$$ plain form
9036 -37157 -96306 -69681 60277 -192083 82284 154509 -49635 14400 309797 -412240 118987
9024 -132405 -75866 -223647 -95967 -208931 -149363 -112909 -28642 -2067 -60227 -15969 179590
9012 60751 -62000 111307 -36535 5654 -28501 -27476 112083 -389113 17215 -92680 -208814
9001 -208814 -415666 -520818 -213188 -84032 -173028 -221519 24387 37650 229961 -261113 27388
8989 -301715 -37076 300166 -54428 -65576 269199 -87581 77450 -190265 4932 -339990 41180
8977 74414 54668 -120694 -122991 92468 98247 -134163 -103686 -228968 115354 57110 -160896
8965 -187487 -48763 -84455 -87893 -57882 -142439 56134 31882 816 89006 110505 -222360 8327
8952 97416 23555 185977 -166253 -284497 59970 106740 -115305 -69186 -90829 -206367 137548
$$ packed form
9036c7157n9149K6625F0277a92083H2284P2225d9635A4400K95397d12240A18987
9024a32405N6539j47781i5967j12964N9568L6454b8642b067n8160a5969A79590
9012F0751f2000A11307c6535E654b8501J025A12083c89113A7215i2680j16134
9001b08814k06852j05152b13188h4032q8996m8491B4387J3263J92311b61113B7388
8989c01715c7076C00166e4428j1148B69199h7581G7450a90265D932c39990D1180
8977G4414j9746a20694k297I2468N779a34163L0477j25282A15354E7110a60896
8965a87487d8763l5692l438L0011q4557E6134k4252H16Q8190K1499b22360H327
8952I7416B3555J62422a66253j18244E9970M6770a15305M6119k1643j15538A37548
$$ plain form
8940 17750 -31651 99267 -84379 184579 112897 59234 147433 202625 15500 141031 -174047
8928 -207943 -279895 -130347 35111 543411 772360 2764807 8826706 14711346 4318192
8918 1130043 660572 527546 377911 69984 108650 55442 -271798 -347935 80067 142790 302926
8907 302926 303867 -83501 -124411 275581 98316 15163 -91953 -113280 -36936 3601 243223 51160
8894 -23538 -119326 -61075 -304967 -249516 48119 -55337 -143041 -139498 -73713 -147274 -50695 -167711
8882 -167711 -151594 140038 12456 168786 -106050 -124706 -16074 -308857 39026 -59309 -171533
8871 -171533 -53239 -53445 -11939 -188870 -161534 -374249 425527 -179254 3442 -274080 -243356
8860 -243356 99727 165386 103494 -57110 -75426 18005 3583 -193527 -97513 -6091 -37975 -264367
$$ packed form
8940A7750c1651I9267h4379A84579p1682n3663Q8199N5192A5500J25531a74047
8928b07943p1952a30347C5111N08300K28949J992447O061899N884640D318192
8918A130043m69471j33026j49635F9984L8666n3208b71798p6137H0067O2723J60136
8907C02926R41h3501m0910B75581I8316A5163i1953k1327c6936C601K39622E1160
8894b3538r5788N8251k43892N5451D8119e5337q7704L543O5785p3561e0695j17016
8882a67711J6117A40038A2456J56330a06050j8656a6074k92783C9026e9309j12224
8871a71533e3239k06a1939j76931K7336k12715D25527a79254C442b74080L0724
8860b43356I9727O5659o1892e7110j8316A8005C583a93527R6014f091l1884k26392
$$ plain form
8848 -264367 144050 65859 -184230 142242 8766 77580 -196258 -206949 287282 27467 41559
8837 41559 32282 1143 -20827 -175052 -148195 -270106 -42755 -75300 -25903 -308830 237261
8825 156523 -74013 -164746 -71147 -28564 66349 -23292 65395 -60937 -143267 -48837 65479 303193
8813 303193 14543 -102185 99894 -235880 -91520 -181421 -96420 -145972 -159867 -353928 33998
$$ packed form
8848b64367A44050F5859a84230A42242H766O8814a96258j0691B87282B7467J4092
8837D1559r277A143b0827j54225K6857j21911d2755l2545b5903k82927B37261
8825A56523g4013r0733g1147b8564F6349b3292F5395f0937q2330d8837F5479K37714
8813C03193A4543a02185I9894b35880i1520q9901Q5001m9552j3895j94061C3998
$$ [...]
##END NTUPLES=NMR SPECTRUM
##END=
