##TITLE=NES1063_159122.0004_001_9704314_vr22o5BivX
##JCAMPDX= 6.0         $$ Bruker NMR JCAMP-DX V2.0
##DATA TYPE= NMR SPECTRUM
##DATA CLASS= NTUPLES
##ORIGIN= BRUKER
##OWNER= Administrator
$$ 1.72 TOPSPIN		Version 2.1
$$ 2016-04-30 16:01:44.396 -0700  Administrator@X
$$ Compression mode = diff/dup
##.OBSERVE FREQUENCY= 400.02188249412
##.OBSERVE NUCLEUS= ^1H
##.ACQUISITION MODE= SIMULTANEOUS (DQD)
##.ACQUISITION SCHEME= undefined
##.AVERAGES= 64
##.DIGITISER RES= 22
##SPECTROMETER/DATA SYSTEM= spect
##.PULSE SEQUENCE= noesygpps1d.comp
##.SOLVENT NAME= COFFEE_meoh
##.SHIFT REFERENCE= INTERNAL, COFFEE_meoh, 1, 14.96134
##AUDIT TRAIL= $$ (NUMBER, WHEN, WHO, WHERE, PROCESS, VERSION, WHAT)
$$ ##TITLE= Audit trail, TOPSPIN		Version 2.1
$$ ##JCAMPDX= 5.01
$$ ##ORIGIN= Bruker BioSpin GmbH
$$ ##OWNER= Administrator
$$ $$ E:\/data/COFFEE/nmr/NES1063_159122.0004_001_9704314_vr22o5BivX/12/pdata/1/auditp.txt
$$ ##AUDIT TRAIL=  $$ (NUMBER, WHEN, WHO, WHERE, PROCESS, VERSION, WHAT)
(   1,<2016-04-30 16:01:39.005 -0700>,<Administrator>,<X>,<go>,<TOPSPIN 2.1>,
      <created by zg
	started at 2016-04-30 15:50:09.380 -0700,
	POWCHK enabled, PULCHK disabled,
       configuration hash MD5:
       21 0F 79 D6 B3 7B B4 F6 88 20 88 DB 03 48 BD 9F
       data hash MD5: 64K
       AB A6 C2 37 E1 C5 57 4B 18 FD CF FC 46 E0 8A 49>)
(   2,<2016-04-30 16:01:42.349 -0700>,<Administrator>,<X>,<proc1d>,<TOPSPIN 2.1>,
      <Start of raw data processing
       efp LB = 0.3 FT_mod = 6 PKNL = 1 PHC0 = 0 PHC1 = 0 SI = 128K 
       data hash MD5: 128K
       9E D9 55 FB 30 8B 93 C4 EB 7E D3 48 72 73 2E F0>)
(   3,<2016-04-30 16:01:43.224 -0700>,<Administrator>,<X>,<proc1d>,<TOPSPIN 2.1>,
      <pk PHC0 = -83.88062 PHC1 = 0 
       data hash MD5: 128K
       AE A5 D9 64 92 42 17 A7 25 51 8E A5 24 B3 CB 25>)
(   4,<2016-04-30 16:01:43.630 -0700>,<Administrator>,<X>,<proc1d>,<TOPSPIN 2.1>,
      <abs ABSG = 1 
       data hash MD5: 128K
       42 CC 94 2B 0C 38 26 AC 1F BD 20 1A 36 99 E0 85>)
(   5,<2016-04-30 16:01:43.724 -0700>,<Administrator>,<X>,<proc1d>,<TOPSPIN 2.1>,
      <abs ABSG = 2 
       data hash MD5: 128K
       80 BB 63 09 76 71 EA 71 AB FD 2E 0F E2 1B 86 9A>)
(   6,<2016-04-30 16:01:43.817 -0700>,<Administrator>,<X>,<proc1d>,<TOPSPIN 2.1>,
      <abs ABSG = 3 
       data hash MD5: 128K
       63 5B 46 0E EA 02 65 76 64 A5 3F 55 10 B2 F3 6F>)
(   7,<2016-04-30 16:01:43.896 -0700>,<Administrator>,<X>,<proc1d>,<TOPSPIN 2.1>,
      <abs ABSG = 4 
       data hash MD5: 128K
       60 41 55 9A F8 41 13 A6 BF 9B 48 ED 3B F1 6B 55>)
(   8,<2016-04-30 16:01:44.021 -0700>,<Administrator>,<X>,<proc1d>,<TOPSPIN 2.1>,
      <abs ABSG = 5 
       data hash MD5: 128K
       09 72 5C FE 4F B5 CA 2C C0 88 D7 10 C9 C5 C5 59>)
$$ ##END=
$$ 
$$ $$ hash MD5
$$ $$ 3C 22 83 31 DA 6F EC 07 FB 4E B1 D5 69 08 27 4F
##$RELAX= 
##$RELAX= 
##$RELAX= 
##$RELAX= 
##$RELAX= 
##$RELAX= 
##$RELAX= 
##$RELAX= 
$$ Bruker specific parameters
$$ --------------------------
##$DU= <E:\>
##$EXPNO= 12
$$ [...]
##$TP07= 0
##$TPNAME0= <>
##$TPNAME1= <>
##$TPNAME2= <>
##$TPNAME3= <>
##$TPNAME4= <>
##$TPNAME5= <>
##$TPNAME6= <>
##$TPNAME7= <>
##$TPOAL= (0..7)
0.5 0.5 0.5 0.5 0.5 0.5 0.5 0.5
##$TPOFFS= (0..7)
0 0 0 0 0 0 0 0
##$TUNHIN= 0
##$TUNHOUT= 0
##$TUNXOUT= 0
##$USERA1= <user>
##$USERA2= <user>
##$USERA3= <user>
##$USERA4= <user>
##$USERA5= <user>
##$V9= 5
##$VALIST= <valist>
##$VCLIST= <CCCCCCCCCCCCCCC>
##$VD= 0
##$VDLIST= <DDDDDDDDDDDDDDD>
##$VPLIST= <PPPPPPPPPPPPPPP>
##$VTLIST= <TTTTTTTTTTTTTTT>
##$WBST= 2048
##$WBSW= 25
##$XGAIN= (0..3)
0 0 0 0
##$XL= 0
##$YL= 0
##$YMAX_a= 5269802
##$YMIN_a= -9923653
##$ZGOPTNS= <>
##$ZL1= 120
##$ZL2= 120
##$ZL3= 120
##$ZL4= 120
##$ABSF1= 14.96134
##$ABSF2= -5.596842
##$ABSG= 5
##$ABSL= 3
##$ALPHA= 0
##$AQORDER= 0
##$ASSFAC= 0
##$ASSFACI= 0
##$ASSFACX= 0
##$ASSWID= 0
##$AUNMP= <proc_prof1d_extract.lims>
##$AXLEFT= 0
##$AXNAME= <>
##$AXNUC= <1H>
##$AXRIGHT= 0
##$AXTYPE= 0
##$AXUNIT= <>
##$AZFE= 0.1
##$AZFW= 0.1
##$BCFW= 0
##$BC_mod= 0
##$BYTORDP= 0
##$COROFFS= 0
##$CY= 15
##$DATMOD= 1
##$DC= 0
##$DFILT= <>
##$DTYPP= 0
##$F1P= 0
##$F2P= 0
##$FCOR= 0.5
##$FTSIZE= 131072
##$FT_mod= 6
##$GAMMA= 0
##$GB= 0
##$INTBC= 1
##$INTSCL= 1
##$ISEN= 128
##$LB= 0.3
##$LEV0= 0
##$LPBIN= 0
##$MAXI= 10000
##$MC2= 0
##$MEAN= 0
##$ME_mod= 0
##$MI= 0
##$NCOEF= 0
##$NC_proc= -2
##$NLEV= 6
##$NOISF1= 0
##$NOISF2= 0
##$NSP= 0
##$NTH_PI= 0
##$NZP= 0
##$OFFSET= 14.96134
##$PC= 1
##$PHC0= -83.88062
##$PHC1= 0
##$PH_mod= 1
##$PKNL= yes
##$PPARMOD= 0
##$PPDIAG= 0
##$PPIPTYP= 0
##$PPMPNUM= 2147483647
##$PPRESOL= 1
##$PSCAL= 4
##$PSIGN= 0
##$PYNMP= <proc.py>
##$REVERSE= no
##$SF= 400.020009500957
##$SI= 131072
##$SIGF1= 0
##$SIGF2= 0
##$SINO= 400
##$SIOLD= 131072
##$SPECTYP= <>
##$SREGLST= <1H.CDCl3>
##$SSB= 0
##$STSI= 131072
##$STSR= 0
##$SW_p= 8223.68421052631
##$SYMM= 0
##$S_DEV= 0
##$TDeff= 65536
##$TDoff= 0
##$TI= <>
##$TILT= no
##$TM1= 0
##$TM2= 0
##$TOPLEV= 0
##$USERP1= <user>
##$USERP2= <user>
##$USERP3= <user>
##$USERP4= <user>
##$USERP5= <user>
##$WDW= 1
##$XDIM= 131072
##$YMAX_p= 313070891
##$YMIN_p= -14217
##$CURPLOT= <Network HP LaserJet P1505>
##$CURPRIN= <$Network HP LaserJet P1505>
##$DFORMAT= <normdp>
##$LAYOUT= <+/1D_H.xwp>
##$LFORMAT= <normlp>
##$PFORMAT= <normpl>
##$SURQMSG= 1
$$ End of Bruker specific parameters
$$ ---------------------------------
##NTUPLES= NMR SPECTRUM
##VAR_NAME=  FREQUENCY,     SPECTRUM/REAL,   SPECTRUM/IMAG
##SYMBOL=    X,             R,               I
##VAR_TYPE=  INDEPENDENT,   DEPENDENT,       DEPENDENT
##VAR_FORM=  AFFN,          ASDF,            ASDF
##VAR_DIM=   131072,        131072,          131072
##UNITS=     HZ,            ARBITRARY UNITS, ARBITRARY UNITS
##FACTOR=    0.0627417313425164, 1,          1
##FIRST=     8223.62146879497, 2020,         -44862
##LAST=      0,             3366,            -44074
##MIN=       0,             -14217,          0
##MAX=       8223.62146879497, 313070891,    0
$$ Real data points
##PAGE= N=1
##DATA TABLE= (X++(R..R)), XYDATA
$$ [...]
61391G01779m896l503k388j144J21J120K063L545N827Q569J1276J3627J5412J6563
61377G67971J7425J8621K0348K1976K2685K2296K1321K0243J9065J7610J5910
61366I85471J4120J2197R887P048L849N86k590n655q566j1242j3670j5864j7728
61353I57843j9175k0400k1798k3391k4576k4700k3818k2586k1511k0520j9294
61342G16074j7706j5914j4235j2986j2230j1616j0635r076p212n565m602m438
61330E89859m574m118k685j048l23m92l05J176L418N183N959O228O653P473Q509
61315F20913R349R656R485R168Q684P597N923M547M259M723N029N013N162N591
61301G15099N888O014O372O821O566N347L940L002K220J143J45k96o39j698l252
$$ y = [701779, 696883, 693380, 690992, 689848, 689969, 691089, 693152, 696697, 702524, 711093, 722369, 735996, 751408, 767971, 785396, 804017, 824365, 846341, 869026, 891322, 912643, 932886, 951951, 969561, 985471, 999591, 1011788, 1021675, 1028723, 1032572, 1033158, 1030568, 1024913, 1016347, 1005105, 991435, 975571, 957843, 938668, 918268, 896470, 873079, 848503, 823803, 799985, 777399, 755888, 735368, 716074, 698368, 682454, 668219, 655233, 643003, 631387, 620752, 611676, 604464, 598899, 594297, 589859, 585285, 581167, 578482, 577434, 577111, 576619, 576314, 577490, 580908, 586091, 592050, 598278, 604931, 612404, 620913, 630262, 639918, 649403, 658571, 667255, 674852, 680775, 685322, 689581, 694304, 699333, 704346, 709508, 715099, 720987, 727001, 733373, 740194, 746760, 752107, 756047, 759049, 761269, 762412, 762557, 762261, 761622, 759924, 756672]
61286G56672m161l832k767j647n91M81J457K245K921L404L467L304L649M886O376
61271G75864P170P101O759O449N808M512K957J863J426J202P53K49K40J029K388
61256H25770L929N631P905J1072J4913J8896K2922K7589L3537M0558M7617N3676
61244A114015N8163O0448N9338N3610M3056K8722J2254m625k0038l2047l9357
61233A333539m1905m0654l6862l1489k5005j7564r437j230O569J4138K1863K9158
61221A201121L4235L5392L2135K4762J3444j435j8204l3929m5866n2704n4618
61210A134333n2669m8269m2701l6740l0758k5107k0115j5759j1810q397o112n346
61198H30550n723o364o517n929m832l739l090l010l421m236n317o355p149p852
$$ y = [756672, 752511, 748679, 745912, 744265, 743674, 744155, 745612, 747857, 750778, 754182, 757649, 760953, 764602, 769488, 775864, 783034, 790135, 796894, 803343, 809151, 813663, 816620, 818483, 819909, 821111, 821864, 822113, 822353, 823382, 825770, 829699, 835330, 843235, 854307, 869220, 888116, 911038, 938627, 972164, 1012722, 1060339, 1114015, 1172178, 1232626, 1291964, 1345574, 1388630, 1417352, 1429606, 1424981, 1404943, 1372896, 1333539, 1291634, 1250980, 1214118, 1182629, 1157624, 1140060, 1130623, 1129393, 1135962, 1150100, 1171963, 1201121, 1235356, 1270748, 1302883, 1327645, 1341089, 1339654, 1321450, 1287521, 1241655, 1188951, 1134333, 1081664, 1033395, 990694, 953954, 923196, 898089, 877974, 862215, 850405, 842008, 835896, 830550, 824827, 818463, 811946, 806017, 801185, 797446, 794356, 791346, 787925, 783689, 778372, 772017, 764868, 757016]
61184G57016q615r109q914q310q087q450q793q683q462q470q374p845p370p633
61170F39901q344q468p623o521n996o069o207o072n712n337n145n209n457n817
61156E51924o427p438q632r507r864j0127j0808j1834j2530j2303j1192r776q653
61143D22833p991p592p237o909o616o195n455m492l714l461l667l960m050l865
61129C47629l371k385q00J015K303K605K280K140K636L626M760N834O766P572
61115C82610Q352R055R341Q997Q349P825P135N613L515K143K221K821K611J589
61101D62177P35L38l17j553k567k504j549n96k13l40p37j297j972k636l050l001
61085D40918k552k065j885k020k284k534k614k287j585j041j097j398j152j94
$$ y = [757016, 748401, 739292, 730378, 722068, 713981, 705531, 696738, 688055, 679593, 671123, 662749, 654904, 647534, 639901, 631557, 623089, 615466, 608945, 602949, 596880, 590673, 584601, 578889, 573552, 568407, 563198, 557741, 551924, 545497, 538059, 529427, 519920, 510056, 499929, 489121, 477287, 464757, 452454, 441262, 431486, 422833, 414842, 407250, 400013, 393104, 386488, 380293, 374838, 370346, 366632, 363171, 359504, 355544, 351494, 347629, 344258, 341873, 341073, 342088, 344391, 346996, 349276, 351416, 354052, 357678, 362438, 368272, 375038, 382610, 390962, 400017, 409358, 418355, 426704, 434529, 441664, 447277, 450792, 452935, 455156, 457977, 460588, 462177, 462912, 463250, 462933, 461380, 458813, 456309, 454760, 454164, 453951, 453611, 452874, 451577, 449605, 446969, 443919, 440918, 438366, 436301, 434416, 432396, 430112, 427578, 424964, 422677, 421092, 420051, 418954, 417556, 416404, 416210]
61071D16210P79J119R66R23J362K212L155L915M442M872N213N226M878M629M931
61056D64832N624O325P098Q222R506J0523J1361J2436J3642J4555J5405J6909
61044E96438J9016K0738K1517K1860K2383K3222K4646K7256L0996L4988L8944
61033H82004M3630M9344N5053O0048O5410P2758Q2609R5280J12455J36241J67353
61022A822185K05881K53347L12599L86504M78335N91486P24697Q67163J001206
61013F643403J108470J167171J142904R96234P18102L63194L7129j63890k08252
61004A1804465j30793O905J46448K30317J97475R413l10821o74875r76009j147218
60994I155307j182743j117385r94878q50840p09653n84836m80258l94200l23830
$$ y = [416210, 416989, 418108, 419074, 419997, 421359, 423571, 426726, 430641, 435083, 439955, 445168, 450394, 455272, 459901, 464832, 470456, 476781, 483879, 492101, 501607, 512130, 523491, 535927, 549569, 564124, 579529, 596438, 615454, 636192, 657709, 679569, 701952, 725174, 749820, 777076, 808072, 843060, 882004, 925634, 974978, 1030031, 1090079, 1155489, 1228247, 1310856, 1406136, 1518591, 1654832, 1822185, 2028066, 2281413, 2594012, 2980516, 3458851, 4050337, 4775034, 5642197, 6643403, 7751873, 8919044, 10061948, 11058182, 11776284, 12139478, 12176607, 12012717, 11804465, 11673672, 11680577, 11827025, 12057342, 12254817, 12264230, 11953409, 11278534, 10302525, 9155307, 7972564, 6855179, 5860301, 5009461, 4299808, 3714972, 3234714, 2840514, 2516684]
60985B516684k66582k19670j80777j49122j24538j05763r0662p7931o7497n9390
60975A174752n3051m7753m3029l8608l4438l0751k7686k4974k2334j9990j8392
60964H13746j7638j7486j7647j7688j7009j5385j3373j1745j0688r923r282q768
60952F47114q251p597o914o325n688m892m205l938m079m472n118n978o866p868
60938E64923r314j0955j1800j1347j0366r695q897p094m668k910k127j301L45
60925D74794K380L986M767M585L448J855N66k16q38j345j331p96k81j7L03P00
60909D92560P51M81M64O63J50j404k887l142k499k090k299k713l148l749m366
60894D66772m656m667m676m608m220l696l415l276k871k162j427o74K06Q10N22
$$ y = [2516684, 2250102, 2030432, 1849655, 1700533, 1575995, 1470232, 1379570, 1301639, 1234142, 1174752, 1121701, 1073948, 1030919, 992311, 957873, 927122, 899436, 874462, 852128, 832138, 813746, 796108, 778622, 760975, 743287, 726278, 710893, 697520, 685775, 675087, 665164, 655882, 647114, 638863, 631266, 624352, 618027, 612339, 607447, 603242, 599304, 595225, 590753, 585635, 579657, 572791, 564923, 555609, 544654, 532854, 521507, 511141, 501446, 492549, 485455, 480787, 477877, 475750, 474449, 474794, 477174, 481160, 485927, 490512, 493960, 495815, 496381, 496165, 495327, 493982, 492651, 491855, 491574, 491557, 491860, 492560, 493311, 493792, 494256, 494919, 495069, 493665, 490778, 487636, 485137, 483047, 480748, 478035, 474887, 471138, 466772, 462116, 457449, 452773, 448165, 443945, 440249, 436834, 433558, 430687, 428525, 427098, 426424, 426630, 427440, 427962]
60879D27962m83j215j060m47j04n6K80J339K903M193M406L394J884Q02M33L74
60863D44605K10j78q33j851l095m186m907n422n909o225o012n121l793k565j868
60848C92850j667j572j373j272j409j514j329j138j377j947k429k844l570m552
60834C64857n213n267n000m637m028l237k762k793k842k554k373k750l186k852
60820C15363j890j265j397j648j387p52j96J46K49p3p05r68l83N88J101J092J215
60803C09090J745K271K516K774L233L533L397L204L376L656L514K994K528K181
60789C50012J770J522J825K394K463J930J462J339J037L39j10P5J31p92k274l251
60773C59872l537l803m287m541m428m357m382l942k835j747j388j585j705j572
$$ y = [427962, 427479, 426264, 425204, 424757, 424653, 424597, 424877, 426216, 429119, 433312, 437718, 441112, 442996, 443798, 444231, 444605, 444815, 444637, 443804, 441953, 438858, 434672, 429765, 424343, 418434, 412209, 406197, 401076, 397283, 394718, 392850, 391183, 389611, 388238, 386966, 385557, 384043, 382714, 381576, 380199, 378252, 375823, 372979, 369409, 364857, 359644, 354377, 349377, 344740, 340712, 337475, 334713, 331920, 329078, 326524, 324151, 321401, 318215, 315363, 313473, 312208, 310811, 309163, 307776, 307024, 306828, 306974, 307223, 307150, 306445, 305477, 305094, 305682, 306783, 307875, 309090, 310835, 313106, 315622, 318396, 321629, 325162, 328559, 331763, 335139, 338795, 342309, 345303, 347831, 350012, 351782, 353304, 355129, 357523, 359986, 361916, 363378, 364717, 365754, 366093, 365983, 366058, 366189, 365397, 363123, 359872, 356335, 352532, 348245, 343704, 339276, 334919, 330537, 326595, 323760, 322013, 320625, 319040, 317335, 315763]
60759C15763j576k044k832l405l281k533j817j628j617j103j99K23k02p87q64
60744B92098p37j071j769k154j966j623j496j449j161n56J97Q43J171J077O15
60729B82019m3o63r51p28k09Q7j33o76j148j396j527j730k165k836l491l823l831
60712B56756l706l435k912k455k653l382l658k865j616r18r01j003j007j112j225
60697B23908j033p42q72j222q55N59K051K486J954J458J554J801J540Q28L72O97
60681B34484J491J952J757J406J425J591J448J215J531K273K519J832R20N76P21
60666B57141R67J496K578L669L878L214K567K407K331J993J732J961K517L010
60652B91461L356L537L254K364J344P77N07j37j337k528l293l934m871n845o171
$$ y = [315763, 314187, 312143, 309311, 305906, 302625, 300092, 298275, 296647, 295030, 293927, 293728, 293951, 293749, 292962, 292098, 291361, 290290, 288521, 286367, 284401, 282778, 281282, 279833, 278672, 278116, 278313, 279156, 280327, 281404, 282019, 281976, 281313, 280362, 279634, 279425, 279512, 279379, 278703, 277555, 276159, 274632, 272902, 270737, 267901, 264410, 260587, 256756, 253050, 249615, 246703, 244248, 241595, 238213, 234555, 231690, 230074, 229156, 228255, 227252, 226245, 225133, 223908, 222875, 222133, 221261, 220039, 219184, 219743, 221794, 224280, 226234, 227692, 229246, 231047, 232587, 233415, 233787, 234484, 235975, 237927, 239684, 241090, 242515, 244106, 245554, 246769, 248300, 250573, 253092, 254924, 255844, 256420, 257141, 258108, 259604, 262182, 265851, 269729, 272943, 275510, 277917, 280248, 282241, 283973, 285934, 288451, 291461, 294817, 298354, 301608, 303972, 305316, 306093, 306600, 306463, 305126, 302598, 299305, 295371, 290500, 284655, 278484]
60637B78484n608m601l697l043k569k304k286k310k020j316m66J97N94Q08Q18
60622B50681N01o3m90m58q8J62j8m84q49q50n04j4L76M60J72l83r27j180j088
60603B44956r18j030j456j874k075k270k656k862k302j090j09J3m04o89o55m49
60587B24130k5O64J210J189R12J022J395J231M34M4Q71K321L158K962K235J504
60571B45257R57P88J118J593J700J510J606K209K865L144L188L323L600L994M705
60556B81557N867P195Q277R192J0491J2529J4993J7260J9123K1095K3814K7157
60544D58550L0065L1395L0814K8629K4883J9131J1252K115o883j4745k1049k5470
60532E68687k7627k7542k5933k3757k1508j9100j6381j3522j0914q786p114n729
$$ y = [278484, 272876, 268275, 264578, 261535, 258966, 256662, 254376, 252066, 250046, 248730, 248264, 248461, 249055, 249863, 250681, 251182, 251119, 250629, 250171, 250083, 250245, 250227, 249743, 248894, 248044, 247540, 247526, 247902, 248362, 248534, 248151, 247224, 246044, 244956, 244038, 243008, 241552, 239678, 237603, 235333, 232677, 229815, 227513, 226423, 226314, 226327, 225923, 225234, 224579, 224130, 224105, 224769, 225979, 227168, 228080, 229102, 230497, 231728, 232162, 232206, 233077, 235398, 238556, 241518, 243753, 245257, 246214, 247002, 248120, 249713, 251413, 252923, 254529, 256738, 259603, 262747, 265935, 269258, 272858, 276852, 281557, 287424, 294619, 302896, 312088, 322579, 335108, 350101, 367361, 386484, 407579, 431393, 458550, 488615, 520010, 550824, 579453, 604336, 623467, 634719, 636834, 629951, 615206, 594157, 568687, 541060, 513518, 487585, 463828, 442320, 423220, 406839, 393317, 382403, 373617, 366503, 360774]
60520C60774m373k706n95J612L414M890O762R444J2386J4780J6725J9154K2576
60507D64843K6456K9937L2620L4307L4395L2152K7523K1228J4128O849J33m857
60495G19714p036o214l241P43N080R448J3090J4686J3259R075L292l242j0403
60482G58251j8084k5550l1790l6126l8212l7875l5420l1955k8746k6115k3404
60471D24974k0166j6975j4735j3443j2223j0510q761p707p312o826n810m592l691
60458B92223l143k699k344k267k450k642k665k486k092j549j181j261j571j610
60444B62263j260q12l26N49J874L028L375L082K851L118L792M606N275N466N005
60429C01886M145L315K643J955J234P04M48K57l7k68j38L66Q81J022Q47Q91J595
$$ y = [360774, 356401, 353695, 353100, 354712, 358126, 363016, 369778, 379222, 391608, 406388, 423113, 442267, 464843, 491299, 521236, 553856, 588163, 622558, 654710, 682233, 703461, 717589, 724438, 724571, 719714, 712678, 706464, 703223, 703966, 709046, 718494, 731584, 746270, 759529, 768604, 771896, 768654, 758251, 740167, 714617, 682827, 646701, 608489, 570614, 535194, 503239, 474493, 448378, 424974, 404808, 387833, 373098, 359655, 347432, 336922, 328161, 320454, 313142, 306316, 300506, 295914, 292223, 289080, 286381, 284037, 281770, 279320, 276678, 274013, 271527, 269435, 267886, 266705, 265444, 263873, 262263, 261003, 260191, 259865, 260414, 262288, 265316, 268691, 271773, 274624, 277742, 281534, 286140, 291415, 296881, 301886, 306031, 309346, 311989, 313944, 315178, 315882, 316330, 316587, 316550, 316282, 316144, 316510, 317391, 318413, 319260, 320151, 321746]
60412C21746K745L697M176M569N253O039O559O868P261P739Q151Q664R571J0634
60398D13672J1218J1168J1100J1600J2483J3063J2949J2353J1748J1377J1064
60387E43795J0460R521Q592P910P268O363N324M515M006L620L290K952K284J147
60373F21047K11L41J320J970J688J136J037J165R92O68N97O06K93j20r6K72L70
60356F33497K5l49o37j438l326o111q941j1007j2134j2823j3606j4267j4081j2987
60342E21815j1982j1793j1767j0831r207q104p929p897p476p087p041o851o153
60329D07697n451n241n135m612l992l865m067l988l615l307k894j925o92n0r7
60314C58766Q7J090K387L282L953N054O647Q200R298R885R867Q983P109M367R03
$$ y = [321746, 324491, 328188, 332364, 336933, 342186, 348225, 354784, 361652, 368913, 376652, 384803, 393467, 403038, 413672, 424890, 436058, 447158, 458758, 471241, 484304, 497253, 509606, 521354, 532731, 543795, 554255, 563776, 572368, 580278, 587546, 593909, 599233, 603748, 607754, 611374, 614664, 617616, 619900, 621047, 621258, 621599, 622919, 624889, 626577, 627713, 628750, 629915, 630907, 631575, 632172, 632778, 633071, 632951, 632855, 633127, 633497, 633522, 633173, 632536, 631098, 627772, 621661, 612720, 601713, 589579, 576756, 563150, 548883, 534802, 521815, 509833, 498040, 486273, 475442, 466235, 458131, 450202, 442305, 434829, 427742, 420701, 413850, 407697, 402246, 397005, 391870, 387258, 383266, 379401, 375334, 371346, 367731, 364424, 361530, 359605, 358913, 358863, 358766, 358853, 359943, 362330, 365612, 369565, 374619, 381266, 389466, 398764, 408649, 418516, 427499, 434608, 438975, 439878]
60299D39878l135p297j0743j2689j2968j2055j0617r079p600o256n123m239l607
60286C34470l148k631j732m55O26Q38J97n50p68n04j08L65J101K150L354M467
60270C37672N162N258N130N516O524P273P016O244O008O478O942P038P057P006
60256D26324O327M773K830J048l59j079q10p7n0r98j846j795j417j323q28Q97
60240D31617L068M212M426N209P095Q982J0029J0785J1847J2791J3189J3651J4872
60227E51773J6439J7569J8467J9899K1799K3274K3923K4233K4736K5523K6614
60216G94249K8107K9756L0968L1435L1380L1088L0557K9808K9135K8818K8771
60205A124072K8605K7899K6451K4429K2273K0228J8067J5547J3011J1115R980
$$ y = [439878, 436743, 429446, 418703, 406014, 393046, 380991, 370374, 361295, 353695, 347439, 342316, 338077, 334470, 331322, 328691, 326959, 326504, 327130, 327968, 328165, 327615, 326847, 326343, 326235, 326600, 327701, 329851, 333205, 337672, 342834, 348092, 353222, 358738, 365262, 372535, 379551, 385795, 391803, 398281, 405223, 412261, 419318, 426324, 432651, 437424, 440254, 441302, 440943, 439864, 439054, 438977, 438927, 437929, 436083, 434288, 432871, 431548, 430720, 431617, 434685, 438897, 443323, 448532, 455627, 464609, 474638, 485423, 497270, 510061, 523250, 536901, 551773, 568212, 585781, 604248, 624147, 645946, 669220, 693143, 717376, 742112, 767635, 794249, 822356, 852112, 883080, 914515, 945895, 976983, 1007540, 1037348, 1066483, 1095301, 1124072, 1152677, 1180576, 1207027, 1231456, 1253729, 1273957, 1292024, 1307571, 1320582, 1331697, 1341677]
60194A341677R083Q111P419P423P921Q402Q792R522J0887J2654J4360J5865J7433
60181A479549J9262K1024K2104K2364K2354K2459K2113K0336J7000J3017R199
60170A690781N446J316l110p382j1327j5066j8586k1687k4278k6357k7723k8098
60158A513929k7582k6669k5698k4478k2585j9925j6990j4559j3106j2395j1732
60147A298210j0646r292q211p824q212r079r882j0280j0619j1653j3531j5449
60135A173532j6626j7260j8003j8774j8815j7855j6482j5255j4079j2726j1350
60124I96307j0088q629o647m364k181pK561N521Q413J1018J3687J6835K0333K3622
60110A066381K6349K8701L1113L3622L5668L6642L6542L5836L4699L2753K9662
$$ y = [1341677, 1350760, 1358871, 1366290, 1373713, 1381634, 1390036, 1398828, 1408350, 1419237, 1431891, 1446251, 1462116, 1479549, 1498811, 1519835, 1541939, 1564303, 1586657, 1609116, 1631229, 1651565, 1668565, 1681582, 1690781, 1696227, 1697543, 1694433, 1687051, 1675724, 1660658, 1642072, 1620385, 1596107, 1569750, 1542027, 1513929, 1486347, 1459678, 1433980, 1409502, 1386917, 1366992, 1350002, 1335443, 1322337, 1309942, 1298210, 1287564, 1278272, 1270061, 1262237, 1254025, 1244946, 1235064, 1224784, 1214165, 1202512, 1188981, 1173532, 1156906, 1139646, 1121643, 1102869, 1084054, 1066199, 1049717, 1034462, 1020383, 1007657, 996307, 986219, 977590, 970943, 966579, 964398, 964391, 966952, 972473, 980886, 991904, 1005591, 1022426, 1042759, 1066381, 1092730, 1121431, 1152544, 1186166, 1221834, 1258476, 1295018, 1330854, 1365553, 1398306, 1427968]
60099A427968K5645K1140J6216J0728M843r65o387j1475j6402k1224k5736k9394
60087A394957l1630l2589l3291l4531l5733l5523l3516l0837k8634k6723k4224
60076A047726k1041j7968j5502j3350j1199r353q134p048n155k319M27J966K299
60063I41349K341K716L197L358L218K878J973J17k261m195n391o569q299j0153
60049I24279j1434j2301j3441j4887j5932j6217j6187j6244j6105j5419j4475
60038G61637j3661j2583j0421p148l761j117R06K914N147P572J0314J3454J6520
60025G69773J8848K0459K2061K4044K5924K6994K7126K6568K5373K3403K0705
60014A031278J7468J3657R104L926j456o707j1725j6336k0206k3083k4961k5913
$$ y = [1427968, 1453613, 1474753, 1490969, 1501697, 1506540, 1505575, 1499188, 1487713, 1471311, 1450087, 1424351, 1394957, 1363327, 1330738, 1297447, 1262916, 1227183, 1191660, 1158144, 1127307, 1098673, 1071950, 1047726, 1026685, 1008717, 993215, 979865, 968666, 959313, 951179, 944131, 938976, 936657, 937084, 939050, 941349, 943690, 946406, 949603, 952961, 956179, 959057, 961030, 961147, 958886, 954691, 949300, 942731, 934432, 924279, 912845, 900544, 887103, 872216, 856284, 840067, 823880, 807636, 791531, 776112, 761637, 747976, 735393, 724972, 717824, 714063, 712946, 713852, 716766, 721913, 729485, 739799, 753253, 769773, 788621, 809080, 831141, 855185, 881109, 908103, 935229, 961797, 987170, 1010573, 1031278, 1048746, 1062403, 1071507, 1075433, 1073977, 1067270, 1055545, 1039209, 1019003, 995920, 970959, 945046]
60002I45046k5926k4983k3141k0621j7848j5330j3191j1005q368n466k718j7L122
59989G79554O715J0232J3507J7023K1032K4920K7893K9816L0958L1425L1390L1386
59977A055851L1654L1425K9659K6388K2676J9306J6166J2979R774O433K539j916
59965A262934o267j0031j3514j6969j9704k0746k0208j9176j8293j7171j5344
59954A085511j3117j0975q731n867k480P39L535O454R973J3658J6654J8684K0150
59941A134188K1361K2256K2886K3583K4325K4440K3475K2009K1108K0999K0854
59930A381484J9860J8000J5717J3381J1348J0087R769R986J0269J0765J1968J3926
59918A536560J6101J7997J9566K0933K2089K3054K4028K5025K5526K4755K2398
$$ y = [945046, 919120, 894137, 870996, 850375, 832527, 817197, 804006, 793001, 784633, 779167, 776449, 776432, 779554, 786269, 796501, 810008, 827031, 848063, 872983, 900876, 930692, 961650, 993075, 1024465, 1055851, 1087505, 1118930, 1148589, 1174977, 1197653, 1216959, 1233125, 1246104, 1255878, 1262311, 1264850, 1262934, 1256667, 1246636, 1233122, 1216153, 1196449, 1175703, 1155495, 1136319, 1118026, 1100855, 1085511, 1072394, 1061419, 1052688, 1046821, 1044341, 1045080, 1048615, 1055069, 1065042, 1078700, 1095354, 1114038, 1134188, 1155549, 1177805, 1200691, 1224274, 1248599, 1273039, 1296514, 1318523, 1339631, 1360630, 1381484, 1401344, 1419344, 1435061, 1448442, 1459790, 1469877, 1479646, 1489632, 1499901, 1510666, 1522634, 1536560, 1552661, 1570658, 1590224, 1611157, 1633246, 1656300, 1680328, 1705353, 1730879, 1755634, 1778032]
59907A778032J8815J4505R562L863k342q236j3062j6785j9980k3009k5542k6942
59895A688879k7050k6345k5363k4131k2309j9808j7070j4627j2503j0129p016
59884A482528l353J70L167N952Q989J2093J4593J6302J7973K0410K3407K6093
59872A628324K8215L0510L3573L6911L9536M1170M2325M3402M4254M4498M3744
59861B056462M1499L7418L1736K4938J6947P308l613j4314k3476l1080l7698m3212
59849B062915m6893m8400m7979m5812m1903l6659l0940k5430k0384j5901j2028
59838A690586q567n261k141P98M170Q702J4156J9448K4042K8522L3511L8795M3939
59825A890700M9159N4777O0287O4710O7684O9588P0496O9677O6242O0064N1815
$$ y = [1778032, 1796847, 1811352, 1820914, 1824777, 1822435, 1814199, 1801137, 1784352, 1764372, 1741363, 1715821, 1688879, 1661829, 1635484, 1610121, 1585990, 1563681, 1543873, 1526803, 1512176, 1499673, 1489544, 1482528, 1479175, 1479345, 1482512, 1488464, 1497453, 1509546, 1524139, 1540441, 1558414, 1578824, 1602231, 1628324, 1656539, 1687049, 1720622, 1757533, 1797069, 1838239, 1880564, 1923966, 1968220, 2012718, 2056462, 2097961, 2135379, 2167115, 2192053, 2209000, 2216308, 2212695, 2198381, 2174905, 2143825, 2106127, 2062915, 2016022, 1967622, 1919643, 1873831, 1831928, 1795269, 1764329, 1738899, 1718515, 1702614, 1690586, 1682019, 1676758, 1674617, 1675415, 1679585, 1688287, 1702443, 1721891, 1745933, 1774455, 1807966, 1846761, 1890700, 1939859, 1994636, 2054923, 2119633, 2187317, 2256905, 2327401, 2397078, 2463320, 2523384, 2575199]
59814B575199M2330L2108K1369J0623R46o595j1899j5897j9518k2903k5848k8617
59802B551298l1861l5845m0180m4299m7928n1117n3999n6567n8549n9651n9923
59791B011379n9664n8921n7391n5092n2631n0424m7921m4273l9536l4675l0410
59780A480441k6525k2385j7693j2576p392k578J608N329Q894J2214J4880J6902
59768A451119J9041K2093K6135L0600L4865L8462M0939M1871M1099L8672L4466
59757A819362K8056J9168Q273l387j4399k3704l0608l4612l5636l4377l2020k9471
59745A636645k7022k4783k2987k1709k0581j9237j7775j6594j5885j5494j5070
59734A419508j4145j2331r715o823l968r79K129M771O579Q168J0394J3210J5989
$$ y = [2575199, 2617529, 2649637, 2671006, 2681629, 2682575, 2675980, 2664081, 2648184, 2628666, 2605763, 2579915, 2551298, 2519437, 2483592, 2443412, 2399113, 2351185, 2300068, 2246069, 2189502, 2130953, 2071302, 2011379, 1951715, 1892794, 1835403, 1780311, 1727680, 1677256, 1629335, 1585062, 1545526, 1510851, 1480441, 1453916, 1431531, 1413838, 1401262, 1393870, 1391292, 1392900, 1398229, 1407123, 1419337, 1434217, 1451119, 1470160, 1492253, 1518388, 1548988, 1583853, 1622315, 1663254, 1705125, 1746224, 1784896, 1819362, 1847418, 1866586, 1874859, 1871472, 1857073, 1833369, 1802761, 1768149, 1732513, 1698136, 1666116, 1636645, 1609623, 1584840, 1561853, 1540144, 1519563, 1500326, 1482551, 1465957, 1450072, 1434578, 1419508, 1405363, 1393032, 1383317, 1376494, 1372526, 1371547, 1373676, 1378447, 1385026, 1393194, 1403588, 1416798, 1432787]
59721A432787J8739K2107K6129L0040L3484L7159M1766M7069N2418N7651O2964
59710A862313O8268P3135P7115P9804Q0882Q0354P8417P5017O9955O3662N7243
59699B666165N1315M5359L8685L1598K5055J9621J5340J2324J0711J0171J0086
59688B936430J0176J0490J0847J0802J0105Q775O808M353K113R91J248K402M000
59675C019540O029Q568J1548J4954J8856K3120K7527L2186L7426M3093M8490N3093
59663C344430N6863N9662O0871O0014N7281N3070M7282L9485K9556J7879N072
59652C831465q185k1307l4086m6620n8654o9225p7377q2990q6474q7822q6624
59641C172101q3040p8065p2631o6887o0883n5627n2961n4315n9733o8073p7792
$$ y = [1432787, 1451526, 1473633, 1499762, 1529802, 1563286, 1600445, 1642211, 1689280, 1741698, 1799349, 1862313, 1930581, 2003716, 2080831, 2160635, 2241517, 2321871, 2400288, 2475305, 2545260, 2608922, 2666165, 2717480, 2762839, 2801524, 2833122, 2858177, 2877798, 2893138, 2905462, 2916173, 2926344, 2936430, 2946606, 2957096, 2967943, 2978745, 2988850, 2997625, 3004433, 3008786, 3010899, 3011890, 3013138, 3015540, 3019540, 3025569, 3034137, 3045685, 3060639, 3079495, 3102615, 3130142, 3162328, 3199754, 3242847, 3291337, 3344430, 3401293, 3460955, 3521826, 3581840, 3639121, 3692191, 3739473, 3778958, 3808514, 3826393, 3831465, 3823280, 3801973, 3767887, 3721267, 3662613, 3593388, 3516011, 3433021, 3346547, 3258725, 3172101, 3089061, 3010996, 2938365, 2871478, 2810595, 2754968, 2702007, 2647692, 2587959, 2519886, 2442094]
59630B442094q7452r5732j01446j03794j02689r8648r2383q4526p5731o6743n8036
59619A474914m9589m1282l3479k6855k1656j7558j4402j2613j2507j3519j4539
59608A216915j4950j4960j4995j5150j5229j4949j4075j2692j1380j0711j0501
59597A067323r920q569o955n716m715l430j883o36M1M32P44O99m6j469l365n664
59581A016871q306j0956j3029j3941j3405j1673r621q201p613p156o074m390k693
59568H99813j299L9J692L620N516P235Q980J0986J3075J4712J5726J6741J8578
59555A015414K1205K3679K5307K6350K7341K8174K8510K8777K9962L2270L4619
59544A321608L5819L5693L4586L2158K7431K0195J1929N050J264O10J755L032
$$ y = [2442094, 2354642, 2258910, 2157464, 2053670, 1950981, 1852333, 1759950, 1675424, 1599693, 1532950, 1474914, 1425325, 1384043, 1350564, 1323709, 1302053, 1284495, 1270093, 1257480, 1244973, 1231454, 1216915, 1201965, 1187005, 1172010, 1156860, 1141631, 1126682, 1112607, 1099915, 1088535, 1077824, 1067323, 1057403, 1048834, 1041879, 1036163, 1031448, 1028018, 1026135, 1025499, 1025540, 1025972, 1026716, 1027415, 1027369, 1025900, 1022535, 1016871, 1008565, 997609, 984580, 970639, 957234, 945561, 935940, 927739, 920126, 912970, 906896, 902506, 899813, 898514, 898553, 900245, 903865, 909381, 916616, 925596, 936582, 949657, 964369, 980095, 996836, 1015414, 1036619, 1060298, 1085605, 1111955, 1139296, 1167470, 1195980, 1224757, 1254719, 1286989, 1321608, 1357427, 1393120, 1427706, 1459864, 1487295, 1507490, 1519419, 1524469, 1525733, 1526343, 1528098, 1531130]
59532A531130L349K536J014q58l182o274j0099j4086j7615k0551k3112k5334k6940
59519A389978k7853k8468k9181k9873l0116k9770k9019k7885k6167k3902k1477
59508A086267j9076j6436j3413j0412p857n461k583Q80M424P739J0961J4106J6837
59495A065976J9109K1447K4211K7055K9515L1661L3532L4323L3050K9915K6168
59484A375962K2505J8371J3134P129J090m825j0744j6280k0730k3898k6056k7246
59472A308412k7217k6066k4314k2221j9513j6063j2414r358p113n199l136j118
59460A134680J06J18n67j050j251k021l870o129p920r484j1778j4961j8083k0312
59446A037478k1659k2402k2591k2417k2400k2729k2865k2234k0924j9451j8172
$$ y = [1531130, 1534479, 1537015, 1538029, 1537171, 1533989, 1527715, 1517616, 1503530, 1485915, 1465364, 1442252, 1416918, 1389978, 1362125, 1333657, 1304476, 1274603, 1244487, 1214717, 1185698, 1157813, 1131646, 1107744, 1086267, 1067191, 1050755, 1037342, 1026930, 1019073, 1013612, 1011029, 1011909, 1016333, 1024072, 1035033, 1049139, 1065976, 1085085, 1106532, 1130743, 1157798, 1187313, 1218974, 1252506, 1286829, 1319879, 1349794, 1375962, 1398467, 1416838, 1429972, 1437101, 1438191, 1433366, 1422622, 1406342, 1385612, 1361714, 1335658, 1308412, 1281195, 1255129, 1230815, 1208594, 1189081, 1173018, 1160604, 1151246, 1144133, 1138934, 1135798, 1134680, 1134786, 1134904, 1134337, 1133287, 1132036, 1130015, 1126145, 1120016, 1112096, 1102612, 1090834, 1075873, 1057790, 1037478, 1015819, 993417, 970826, 948409, 926009, 903280, 880415, 858181, 837257, 817806, 799634]
59435G99634j7164j6321j5261j3567j1396r479q271p491o747o129n680m806k738
59422F74584N46M282P624J0158J1977J3380J4157J3052Q722J768m933q572q682
59409G38063o551l180J185N992J0200J3084J4160J2481P252m35p654j2040j3467
59396G59090j3046j1392q577n076j721J127L694O107Q107R525J0744J2472J5079
59383G86133J8113K0647K2228K3394K4977K7063K9086L0762L2340L3895L5101
59372A083739L5839L6384L6598L5648L2987K9188K5297K1727J8301J5037J2396
59361A383141J0815J0372J0865J2006J3753J6527K0766K6164L1819L7288M2883
59350A616399M8570N3401N6654N8903O1000O2538O2331O0251N7401N4376N0410
$$ y = [799634, 782470, 766149, 750888, 737321, 725925, 716446, 708175, 700684, 693937, 687808, 682128, 677322, 674584, 675130, 679412, 687036, 697194, 709171, 722551, 736708, 749760, 758482, 760250, 755317, 746745, 738063, 731512, 728332, 729517, 735509, 745709, 758793, 772953, 785434, 792686, 792251, 784597, 772557, 759090, 746044, 734652, 726075, 720999, 719278, 720405, 724099, 730206, 738313, 747838, 758582, 771054, 786133, 804246, 824893, 847121, 870515, 895492, 922555, 951641, 982403, 1014743, 1048638, 1083739, 1119578, 1155962, 1192560, 1228208, 1261195, 1290383, 1315680, 1337407, 1355708, 1370745, 1383141, 1393956, 1404328, 1415193, 1427199, 1440952, 1457479, 1478245, 1504409, 1536228, 1573516, 1616399, 1664969, 1718370, 1775024, 1833927, 1894927, 1957465, 2019796, 2080047, 2137448, 2191824, 2242234]
59339B242234M4722L7778L0694K3933J7252J0583M258j494o844j2083j7244k2097
59327B351692k6417l0349l4445l9054m3658m7144m8927m9558n0076n1003n2203
59316A878858n3488n5063n7292o0182o3040o4633o3949o0927n6388n1221m5825
59305A246850m0370l5211l0665k6616k2686j8813j5320j2453j0079p905n816l832
59293A017084k003m29O81J214J368J559J999K480K611K267J703J268J126J277
59279A034205J644K087K444K831L721N441P610R405J0436J1074J1727J2182J1932
59266A126739J0948R594P869N203J203l716q599j2732j6017j8817k1611k4586
59254A055478k7348k9118k9419k8581k7379k6282k5277k4291k3397k2469k1092
$$ y = [2242234, 2286956, 2324734, 2355428, 2379361, 2396613, 2407196, 2411454, 2409960, 2403116, 2391033, 2373789, 2351692, 2325275, 2294926, 2260481, 2221427, 2177769, 2130625, 2081698, 2032140, 1982064, 1931061, 1878858, 1825370, 1770307, 1713015, 1652833, 1589793, 1525160, 1461211, 1400284, 1343896, 1292675, 1246850, 1206480, 1171269, 1140604, 1113988, 1091302, 1072489, 1057169, 1044716, 1034637, 1026732, 1020916, 1017084, 1015081, 1014652, 1015333, 1016547, 1017915, 1019474, 1021473, 1023953, 1026564, 1028831, 1030534, 1031802, 1032928, 1034205, 1035849, 1037936, 1040380, 1043211, 1046932, 1052373, 1059983, 1069388, 1079824, 1090898, 1102625, 1114807, 1126739, 1137687, 1147281, 1155150, 1160353, 1161556, 1157840, 1149241, 1136509, 1120492, 1101675, 1080064, 1055478, 1028130, 999012, 969593, 941012, 913633, 887351, 862074, 837783, 814386, 791917, 770825]
59243G70825j9060j6812j5033j3919j3076j2121j1078j0108r164q070o820n623
59231F29941m631l752k704j337R0J005J094P38O82J182J775K023K205K977M460
59216F35748O065P205P866Q357Q841R369J0150J1486J3399J5584J7760J9852K1904
59203G93586K3956K6173K8830L2018L5457L8773M1963M5319M8852N1985N4004
59192A220916N4756N4718N4331N3386N1143M7027M1032L3494K4668J4791M441
59181A654703n531j4615k2918l0616l7286m2151m4861m5767m5380m3949m1617
59170A280012l8609l5078l1077k6817k2660j8639j4371r744n312j588J694N078
59158A082889Q379J0903J2585J4208J6261J8312J9800K0857K1760K1958K0425
$$ y = [770825, 751765, 734953, 719920, 706001, 692925, 680804, 669726, 659618, 650454, 642384, 635564, 629941, 625310, 621558, 618854, 617517, 617607, 618612, 619706, 620444, 621126, 622308, 624083, 626106, 628311, 631288, 635748, 641813, 649018, 656884, 665241, 674082, 683451, 693601, 705087, 718486, 734070, 751830, 771682, 793586, 817542, 843715, 872545, 904563, 940020, 978793, 1020756, 1066075, 1114927, 1166912, 1220916, 1275672, 1330390, 1384721, 1438107, 1489250, 1536277, 1577309, 1610803, 1635471, 1650262, 1654703, 1649172, 1634557, 1611639, 1581023, 1543737, 1501586, 1456725, 1410958, 1365578, 1321629, 1280012, 1241403, 1206325, 1175248, 1148431, 1125771, 1107132, 1092761, 1083017, 1077705, 1076117, 1077811, 1082889, 1091268, 1102171, 1114756, 1128964, 1145225, 1163537, 1183337, 1204194, 1225954, 1247912, 1268337]
59147A268337J6999J2868R533P524O254M909L175J164j040l426n613o852o780
59134A307052n924n096m355l087j053J230L274N152O974Q353Q925R003R206R609
59120A349263R723R125P717N513K689k60k882n286p878j0626j3015j4750j6070
59107A313263j7245j8263j9102j9958k0860k1389k1053j9797j7963j5947j4090
59096A107596j2748j2164j2228j2471j2331j1516j0252r142q657q685q683q231
59084I80488p284o011m580l160j879p71J27O69Q68J122J746K373K272J348K77
59069I67605n07j286k223k781k599k381l072m423n346n552n849o666p221o763
59055I10936n815n454n835o179n990n499m969m309l608l364l857m736n562o432
$$ y = [1268337, 1285336, 1298204, 1307737, 1315261, 1321515, 1326424, 1329599, 1330763, 1329723, 1326297, 1320684, 1313832, 1307052, 1301128, 1296032, 1291677, 1288590, 1287537, 1288767, 1292041, 1297193, 1304167, 1312520, 1321445, 1330448, 1339654, 1349263, 1358986, 1368111, 1375828, 1381341, 1384030, 1383770, 1380888, 1375602, 1367724, 1357098, 1344083, 1329333, 1313263, 1296018, 1277755, 1258653, 1238695, 1217835, 1196446, 1175393, 1155596, 1137633, 1121686, 1107596, 1094848, 1082684, 1070456, 1057985, 1045654, 1034138, 1023886, 1014744, 1006087, 997402, 988719, 980488, 973204, 967193, 962613, 959453, 957574, 956803, 956930, 957599, 958467, 959589, 961335, 963708, 965980, 967328, 967605, 967098, 965812, 963589, 960808, 958209, 955828, 952756, 948333, 942987, 937435, 931586, 924920, 917699, 910936, 905121, 899667, 893832, 887653, 881663, 876164, 871195, 866886, 863278, 859914, 856057, 851321, 845759, 839327]
59041H39327p600q779r409r509r715j0288j0604r987q699p636p162o738n800m512
59027G22889l397k572j746q31r4K65L51K66p0o28j106j223j018o31o3O15J045
59010G12052R46O14O46J244K094K837L345L561L547L715M520N797O858P405P849
58995G67030Q523R150R542J0233J1816J3994J6012J7817K0019K2776K5540K8019
58983I60471L0613L3583L6489L8887M1105M3704M6474M8487M9070M8282M6498
58972A423663M3796L9910L4598K8004K0679J3085N219l040j1166j8042k3052k6746
58960A526908l0095l3355l6051l7759l8391l7847l6017l3334l0743k8874k7359
58949A157083k5338k2509j9469j7046j5400j3940j2104j0067q427p275n971m024
$$ y = [839327, 831727, 822948, 813539, 804030, 794315, 784027, 773423, 763436, 754737, 747101, 739939, 733201, 727401, 722889, 719492, 716920, 715174, 714343, 714249, 714514, 714865, 715131, 715061, 714433, 713327, 712104, 711086, 710455, 710392, 711007, 712052, 712998, 713612, 714258, 715502, 717596, 720433, 723778, 727339, 730886, 734601, 739121, 744918, 751776, 759181, 767030, 775553, 784703, 794245, 804478, 816294, 830288, 846300, 864117, 884136, 906912, 932452, 960471, 991084, 1024667, 1061156, 1100043, 1141148, 1184852, 1231326, 1279813, 1328883, 1377165, 1423663, 1467459, 1507369, 1541967, 1569971, 1590650, 1603735, 1608954, 1605914, 1594748, 1576706, 1553654, 1526908, 1496813, 1463458, 1427407, 1389648, 1351257, 1313410, 1277393, 1244059, 1213316, 1184442, 1157083, 1131745, 1109236, 1089767, 1072721, 1057321, 1043381, 1031277, 1021210, 1012783, 1005508, 999537, 995513]
58937I95513j806p4J005J879K798L601M275N241O708Q203R234J0194J2124J5413
58923A074308J9176K2198K4352K6755L0413L5043L9525M3354M7168N1793N6987
58912A471072O1428O3595O2504N7786M9593L8497K5320J1009l079j5035k3007
58901A799683k6277k5609k2436j7825j2215n892O64O899J2504J7537K2215K6687
58889A775935L1012L5278L9613M4083M8694N3493N8361O2663O5372O5713O3423
58878B343640N8165M9204L6222K0402M095j0685k2997l2435l8571m1414m1897
58867B323729m1383m0750m0193l9726l9440l9393l9510l9666l9700l9479l9138
58856A885351l9085l9539m0153m0422m0381m0500m0825m0686l9529l7728l6207
$$ y = [995513, 993707, 993633, 994638, 996517, 999315, 1002916, 1007191, 1012432, 1019140, 1027343, 1036577, 1046771, 1058895, 1074308, 1093484, 1115682, 1140034, 1166789, 1197202, 1232245, 1271770, 1315124, 1362292, 1414085, 1471072, 1532500, 1596095, 1658599, 1716385, 1765978, 1804475, 1829795, 1840804, 1837725, 1822690, 1799683, 1773406, 1747797, 1725361, 1707536, 1695321, 1689429, 1690093, 1696992, 1709496, 1727033, 1749248, 1775935, 1806947, 1842225, 1881838, 1925921, 1974615, 2028108, 2086469, 2149132, 2214504, 2280217, 2343640, 2401805, 2451009, 2487231, 2507633, 2511728, 2501043, 2478046, 2445611, 2407040, 2365626, 2323729, 2282346, 2241596, 2201403, 2161677, 2122237, 2082844, 2043334, 2003668, 1963968, 1924489, 1885351, 1846266, 1806727, 1766574, 1726152, 1685771, 1645271, 1604446, 1563760, 1524231, 1486503, 1450296]
58845A450296l5326l4579l3397l1890l0582k9618k8565k6987k4926k2749k0723
58834A130954j8844j6978j4995j2906j0897r196p761o177m064j527Q80K661L731
58821A034881M336M829N585O820Q338R602J0286J0627J1018J1285J0768R225P292
58808A144892N740M528L081J376J94Q4O01R80J170J715K860M332N923P770R966
58793A195212J2315J4637J6901J9051K1008K2942K5110K7336K9070L0100L0742
58782A444424L1299L1771L2188L2541L2213L0267K6749K2954J9800J6643J2401
58771A733250P266K344j973o222j0657j4890j8717k2352k5659k8044k9358l0140
58759A554848l0801l1249l1526l1969l2431l2182l1019k9765k9121k8713k7843
$$ y = [1450296, 1414970, 1380391, 1346994, 1315104, 1284522, 1254904, 1226339, 1199352, 1174426, 1151677, 1130954, 1112110, 1095132, 1080137, 1067231, 1056334, 1047138, 1039377, 1033200, 1029136, 1027609, 1028489, 1031150, 1034881, 1039217, 1044046, 1049631, 1056451, 1064789, 1074391, 1084677, 1095304, 1106322, 1117607, 1128375, 1137600, 1144892, 1150632, 1155160, 1158241, 1159617, 1159811, 1159895, 1160496, 1161476, 1162646, 1164361, 1167221, 1171553, 1177476, 1185246, 1195212, 1207527, 1222164, 1239065, 1258116, 1279124, 1302066, 1327176, 1354512, 1383582, 1413682, 1444424, 1475723, 1507494, 1539682, 1572223, 1604436, 1634703, 1661452, 1684406, 1704206, 1720849, 1733250, 1740516, 1742860, 1740887, 1734665, 1724008, 1709118, 1690401, 1668049, 1642390, 1614346, 1584988, 1554848, 1524047, 1492798, 1461272, 1429303, 1396872, 1364690, 1333671, 1303906, 1274785, 1246072, 1218229]
58748A218229k6627k5624k4829k3713k2137k0471j9003j7695j6441j5131j3545
58737I93013j1691j0112r339r106q575p351n846m540l332j788K41K532M851P261
58723I36218J0083J3584J7763K2414K7379L2610L7923M2767M6270M7404M5272
58712A279687L9469L0211J7969L212j3084k8880m1782n0610n5771n7926n7073
58701A065422n3362m8103m2921l8248l3381k7967k2584j7809j3464r059m458K30
58689G54296N048J0133J5435K0649K5203K8347K9454K8291K4788J8589R424j965
58677I67692j3680k3895l1903l7720m1056m1288l8512l3999k9294k5115k1290
58666F29940j7601j4275j1715j0056r166q828q738q536q048p456o988o599o206
$$ y = [1218229, 1191602, 1165978, 1141149, 1117436, 1095299, 1074828, 1055825, 1038130, 1021689, 1006558, 993013, 981322, 971210, 961871, 952765, 944190, 936839, 930993, 926453, 923121, 921333, 921574, 924106, 928957, 936218, 946301, 959885, 977648, 1000062, 1027441, 1060051, 1097974, 1140741, 1187011, 1234415, 1279687, 1319156, 1349367, 1367336, 1370548, 1357464, 1328584, 1286802, 1236192, 1180421, 1122495, 1065422, 1012060, 963957, 921036, 882788, 849407, 821440, 798856, 781047, 767583, 758524, 754066, 754296, 759344, 769477, 784912, 805561, 830764, 859111, 888565, 916856, 941644, 960233, 969657, 967692, 954012, 930117, 898214, 860494, 819438, 778150, 739638, 705639, 676345, 651230, 629940, 612339, 598064, 586349, 576293, 567127, 558299, 549561, 541025, 532977, 525521, 518533, 511934, 505728]
58653E05728o021o256o529o133m969l748k963k258j156ON14L54K50O56J326J949
58637D70750K696L850N259O366O745O409N723N029M281L129J500l9q18r13j065
58622E18902j675k279k205j469o96l43l25l39l23m48q04j193j267p99J29J220
58606E06086K122K579K525K167J934K176K897L800M543M974N274N884P089Q523
58592E62573R384R405R362J0176J1588J2318J1704J0654J0582J1659J2600J2103
58580F94108J0133P733N902M823L991K884J493K83l79o77j135j967k842l323l375
58565G17652l213k937k556k275k381k807l205l474l852m308m366l901l624m241
58551F70512n467o435o949p523q330q869q876q736q675q308p509p045p573q425
$$ y = [505728, 499707, 493451, 486922, 480789, 475820, 472072, 469109, 466851, 465695, 465701, 466215, 466569, 466819, 467475, 468801, 470750, 473446, 477296, 482555, 488921, 495666, 502075, 507798, 512827, 517108, 520237, 521737, 521698, 520880, 519967, 518902, 517227, 514948, 512743, 511274, 510578, 510235, 509910, 509571, 509248, 508800, 507996, 506803, 505536, 504737, 504866, 506086, 508208, 510787, 513312, 515479, 517413, 519589, 522486, 526286, 530829, 535803, 541077, 546961, 554050, 562573, 571957, 581362, 590724, 600900, 612488, 624806, 636510, 647164, 657746, 669405, 682005, 694108, 704241, 711974, 717876, 722699, 726690, 729574, 731067, 731350, 730971, 730294, 729159, 727192, 724350, 721027, 717652, 714439, 711502, 708946, 706671, 704290, 701483, 698278, 694804, 690952, 686644, 682278, 678377, 674753, 670512, 665045, 658610, 651661, 644138, 635808, 626939, 618063, 609327, 600652, 592344, 584835, 577790, 570217, 561792]
58537E61792q270o859n342m760m915m914m290l256k212j427j014r12q36m15N29
58522E12899J812K983L626L642L194K427J368J91p51j256j470j497j096j28Q85
58507E26829J147O01J09M85J612K766L443L681L778M071M861O187P574Q328Q296
58492E83768Q142Q640R750J0654J0668R835Q619P369O272N434M610L164P29k143
58478F75511m454n800o537p027p295p472p918q595q880q310p145n894m743l772
58464E81669l249l201l064k256r21L27J173J644J685J276Q02O91P05J79r63j924
58448E74573j978j250l97J42M08O46R67J226J138O49J69K33R16J749K223K264
58432E83678K204K432L028L598L555K759J851J715K556L661M151L816L216K980
$$ y = [561792, 553522, 546663, 541321, 536561, 531646, 526732, 522442, 519186, 516974, 515547, 514533, 513621, 512785, 512370, 512899, 514711, 517694, 521320, 524962, 528156, 530583, 531951, 532142, 531391, 530135, 528665, 527168, 526072, 525944, 526829, 527976, 528577, 528686, 529171, 530783, 533549, 536992, 540673, 544451, 548522, 553383, 559570, 567144, 575472, 583768, 591910, 600550, 610300, 620954, 631622, 641457, 650076, 657445, 663717, 669151, 673761, 676925, 677654, 675511, 671057, 665257, 658720, 651693, 644398, 636926, 629008, 620413, 611533, 603223, 596078, 590184, 585441, 581669, 578420, 575219, 572155, 569899, 568978, 569305, 570478, 572122, 573807, 575083, 575885, 576576, 577281, 577460, 576497, 574573, 572595, 571345, 570948, 571090, 571498, 572144, 573111, 574337, 575475, 576124, 576293, 576526, 577442, 579191, 581414, 583678, 585882, 588314, 591342, 594940, 598495, 601254, 603105, 604820, 607376, 611037, 615188, 619004, 622220, 625200]
58418F25200L132L221L059L075L709M697N332N379N230N178N104N003N236N880
58404F88435O365O187N660N474N827O382O795O823O224N024L833L408L953M995
58390G65385N852N967N183M044L520M021M910N417N616O080O856P445P635P696
58376H45627P794P745P449P152P093P185P121O696O125O022O717P587P603O669
58362I44585N866N988O558O834P004P626Q482Q922Q938Q995R087Q917Q686Q801
58348A055289R021Q924Q993J0084J1890J3100J3229J3182J3710J4366J4430J3960
58336A200178J3453J3133J3078J3417J3951J4076J3497J2649J2162J2295J3040
58325A344929J4261J5552J6416J6819J7185J7780J8540J9556K1074K2859K4192
$$ y = [625200, 628332, 631553, 634612, 637687, 641396, 646093, 651425, 656804, 662034, 667212, 672316, 677319, 682555, 688435, 694800, 700987, 706647, 712121, 717948, 724330, 731125, 737948, 744172, 749196, 753029, 756437, 760390, 765385, 771237, 777204, 782387, 786431, 789951, 793972, 798882, 804299, 809915, 815995, 822851, 830296, 837931, 845627, 853421, 861166, 868615, 875767, 882860, 890045, 897166, 903862, 909987, 916009, 922726, 930313, 937916, 944585, 950451, 956439, 962997, 969831, 976835, 984461, 992943, 1001865, 1010803, 1019798, 1028885, 1037802, 1046488, 1055289, 1064310, 1073234, 1082227, 1092311, 1104201, 1117301, 1130530, 1143712, 1157422, 1171788, 1186218, 1200178, 1213631, 1226764, 1239842, 1253259, 1267210, 1281286, 1294783, 1307432, 1319594, 1331889, 1344929, 1359190, 1374742, 1391158, 1407977, 1425162, 1442942, 1461482, 1481038, 1502112, 1524971, 1549163]
58314A549163K4758K5046K5566K6184K6527K6709K7250K8374K9649L0323L0065
58303A849614K9320K8735K8311K7574K6631K6333K6983K7703K7712K7461K7671
58292B154048K8028K7904K7812K8820L0863L2839L4233L5422L6579L7525L8600
58281B512673M0378M2514M4001M4695M5444M6711M8224M9926N2112N4505N6452
58270C037635N8104O0277O3121O6091O9223P3067P7301Q0835Q3495Q6202Q9321
58259C844672R2214R4603R7085J00034J03332J07264J12332J18081J23539J28877
58249D922033J35107J42205J49203J56117J63897J72509J81036J89742J99873
58240F411722K11241K22336K33125K45325K59537K74621K90387L08182L28208
$$ y = [1549163, 1573921, 1598967, 1624533, 1650717, 1677244, 1703953, 1731203, 1759577, 1789226, 1819549, 1849614, 1878934, 1907669, 1935980, 1963554, 1990185, 2016518, 2043501, 2071204, 2098916, 2126377, 2154048, 2182076, 2209980, 2237792, 2266612, 2297475, 2330314, 2364547, 2399969, 2436548, 2474073, 2512673, 2553051, 2595565, 2639566, 2684261, 2729705, 2776416, 2824640, 2874566, 2926678, 2981183, 3037635, 3095739, 3156016, 3219137, 3285228, 3354451, 3427518, 3504819, 3585654, 3669149, 3755351, 3844672, 3936886, 4031489, 4128574, 4228608, 4331940, 4439204, 4551536, 4669617, 4793156, 4922033, 5057140, 5199345, 5348548, 5504665, 5668562, 5841071, 6022107, 6211849, 6411722, 6622963, 6845299, 7078424, 7323749, 7583286, 7857907, 8148294, 8456476, 8784684]
58231H784684L49146L71175L96463M25693M57148M90227N26604N66660O08257
58222A2976057O50632O96193P46946Q02882Q65703R40205J029717J134005J254019
58213B1096359J394558J559974J752047J975220K239316K554594K929665L375541
58205C8877274L901154M498201N139684N800010O461805P089450P618351Q015101
58197H7401030Q365262Q876776R766973J1135017J2929151J4998092J7138915
58190A70611216J9102141K0589066K1273035K0834782J9002116J5612976J0709670
58183B97735002M620065k045842q518397j4070112j8204004k0742412k1793271
58176B16981029k1641268k0633700j9100731j7312052j5460966j3669893j2008030
$$ y = [8784684, 9133830, 9505005, 9901468, 10327161, 10784309, 11274536, 11801140, 12367800, 12976057, 13626689, 14322882, 15069828, 15872710, 16738413, 17678618, 18708335, 19842340, 21096359, 22490917, 24050891, 25802938, 27778158, 30017474, 32572068, 35501733, 38877274, 42778428, 47276629, 52416313, 58216323, 64678128, 71767578, 79385929, 87401030, 95766292, 104643068, 114410041, 125545058, 138474209, 153472301, 170611216, 189713357, 210302423, 231575458, 252410240, 271412356, 287025332, 297735002, 302355067, 300309225, 291790828, 277720716, 259516712, 238774300, 216981029, 195339761, 174706061, 155605330, 138293278, 122832312, 109162419, 97154389]
58169I7154389j0508369r179157q013520o998400o119119n359788m704397m139246
58161D2132393l652919l234103k871769k557587k285908k051061j846694j667800
58153B1964552j511169j373423j250576j139964j040786r52260q72761q00996
58145A3022617p36407o78149o25116n77066n34236m95823m60388m27746l98741
58136H088945l73171l49574l27184l06396k87298k69412k53020k38881k26420
58127E457589k14046k01526j90238j80670j71551j62029j52898j44932j37599
58118C902100j30320j23537j17678j12313j07146j02670r9019r5267r0620q5407
58108B838123q0402p5990p2469p0078o8267o5914o2780n9764n7465n5574n3955
$$ y = [97154389, 86646020, 77466863, 69453343, 62454943, 56335824, 50976036, 46271639, 42132393, 38479474, 35245371, 32373602, 29816015, 27530107, 25479046, 23632352, 21964552, 20453383, 19079960, 17829384, 16689420, 15648634, 14696374, 13823613, 13022617, 12286210, 11608061, 10982945, 10405879, 9871643, 9375820, 8915432, 8487686, 8088945, 7715774, 7366200, 7039016, 6732620, 6445322, 6175910, 5922890, 5684009, 5457589, 5243543, 5042017, 4851779, 4671109, 4499558, 4337529, 4184631, 4039699, 3902100, 3771780, 3648243, 3530565, 3418252, 3311106, 3208436, 3109417, 3014150, 2923530, 2838123, 2757721, 2681731, 2609262, 2539184, 2470917, 2405003, 2342223, 2282459, 2224994, 2169420, 2115465]
58097B115465n2985n2319n0745m7931m5045m2895m0728l7736l4612l2509l1461
58086A646499l0812l0337k9970k9255k8098k7423k7960k8963k9147k8410k7641
58075A328483k7125k6232k4591k2739k1478k1085k1207k1215k0737k0014j9527
58064A082533j9217j8522j7342j6396j6285j6716j7000j6921j6691j6457j6233
58053H94753j6037j5820j5474j5082j4862j4781j4579j4196j3790j3357j2809
58042G33966j2308j1954j1322j0021q613q044q231q179p564p087p100p065o748
58029F19730o790p439p862p390o608o397o652o694o273n525m527l553l128l278
58015E37614l291k722k028j695j521j223r30n18O11K346L473L271K687K962M009
$$ y = [2115465, 2062480, 2010161, 1959416, 1911485, 1866440, 1823545, 1782817, 1745081, 1710469, 1677960, 1646499, 1615687, 1585350, 1555380, 1526125, 1498027, 1470604, 1442644, 1413681, 1384534, 1356124, 1328483, 1301358, 1275126, 1250535, 1227796, 1206318, 1185233, 1164026, 1142811, 1122074, 1102060, 1082533, 1063316, 1044794, 1027452, 1011056, 994771, 978055, 961055, 944134, 927443, 910986, 894753, 878716, 862896, 847422, 832340, 817478, 802697, 788118, 773922, 760132, 746775, 733966, 721658, 709704, 698382, 688361, 679748, 671704, 663473, 655294, 647730, 640643, 633543, 626478, 619730, 612940, 605501, 597639, 590249, 583641, 577244, 570592, 563898, 557625, 552100, 547573, 544020, 540892, 537614, 534323, 531601, 529573, 527878, 526357, 525134, 524204, 523686, 524297, 526643, 530116, 533387, 536074, 539036, 543045]
58000E43045N145O479Q268R737J0020R754J0294J1711J3067J4330J6293J8682
57988F76825K0179K0689K1891K4831K8377L1040L3196L6315M0705M5158M8597
57977A027803N1017N2853N4152N4569N3758N1438M7257M0822L1981K1147R277
57966A496074k635j4064k4824l4599m2791m8833n2505n4015n3989n3168n1871
57955A062780m9811m6733m3117l9841l7174l4486l1156k7390k3983k1366j9157
57944F88566j6695j3912j1492r996r162q350p512p093o990o393n013l805l835
57931E78318m846n593n293m246l120k255j576p15P21K770N070P449J0177J3315
57917E90176J6252J8473K0335K2450K4576K5914K6220K5720K4136K0843J6155
$$ y = [543045, 548190, 554669, 562937, 572674, 582694, 592448, 602742, 614453, 627520, 641850, 658143, 676825, 697004, 717693, 739584, 764415, 792792, 823832, 857028, 893343, 934048, 979206, 1027803, 1078820, 1131673, 1185825, 1240394, 1294152, 1345590, 1392847, 1433669, 1465650, 1486797, 1496074, 1493439, 1479375, 1454551, 1419952, 1377161, 1328328, 1275823, 1221808, 1167819, 1114651, 1062780, 1012969, 966236, 923119, 883278, 846104, 811618, 780462, 753072, 729089, 707723, 688566, 671871, 657959, 646467, 636471, 627309, 618959, 611447, 604354, 597364, 590971, 585958, 582153, 578318, 573472, 567879, 562586, 558340, 555220, 552965, 551389, 550674, 551395, 554165, 559235, 566684, 576861, 590176, 606428, 624901, 645236, 667686, 692262, 718176, 744396, 770116, 794252, 815095, 831250]
57906H31250J1329O888J923m417j1431j7583k2159k5451k7804k9212k9772k9840
57894F53721k9590k8898k7684k6076k4246k2398k0909k0132j9875j9418j8174
57883C96321j6281j4430j3200j2582j2036j0970r280p508o376o081o101n706m606
57870B71164l081j616n21J90P31J353K091K656K741K442K173K068J730P53o21
57855B84253j656j915j696j649k063k605k643j929r09k82k55m98p98j244j562
57840B62549r63P91K679L497L402L513M257M967N198N319N557N366M259K570Q52
57825C13813p96k382l609m361m967n432m981l153q22O45R68R92J459K411L691
57810B93476N200O757Q242R937J2140J4639J7000J9301K1929K4771K7216K8886
$$ y = [831250, 842579, 849467, 851390, 846973, 835542, 817959, 795800, 770349, 742545, 713333, 683561, 653721, 624131, 595233, 567549, 541473, 517227, 494829, 473920, 453788, 433913, 414495, 396321, 380040, 365610, 352410, 339828, 327792, 316822, 307542, 300034, 293658, 287577, 281476, 275770, 271164, 268083, 266467, 265946, 266136, 266867, 268220, 270311, 272967, 275708, 278150, 280323, 282391, 284121, 284874, 284253, 282597, 280682, 278986, 277337, 275274, 272669, 270026, 268097, 267188, 266906, 266651, 266153, 265355, 264111, 262549, 261586, 262377, 265056, 268553, 271955, 275468, 279725, 284692, 289890, 295209, 300766, 306132, 310391, 312961, 313813, 313017, 310635, 307026, 302665, 297698, 292266, 287285, 284132, 283310, 283955, 284923, 285915, 287374, 289785, 293476, 298676, 305433, 313675, 323612, 335752, 350391, 367391, 386692, 408621, 433392, 460608, 489494]
57798D89494K9841L0075K9421K7968K5982K3294J9349J3951P584Q41n970j2504
57786F79326j8112k2134k4288k4768k4237k3646k3584k3737k3341k2199k0920
57775D28360k0018j9320j8383j7148j5916j4946j4243j3557j2526j1056r547q570
57763B53130q216q048p657o995o157n181m216l544l257l080k698k103j521j107
57749A89350p78l50J96O27O98M81K61J31jJ7N05J273J576J146P36J133K073K778
57731B01852L163L676M292M580M646N071N797O058N623N168N074M646L138Q45
57717B63629j350l033m285n089n401n539n877o240o105n385m555l994l579k975
57703B00222k088j102k55K75L52j27j119k311l201l420k937j938o87M63J193J590
$$ y = [489494, 519335, 549410, 578831, 606799, 632781, 656075, 675424, 689375, 696959, 697800, 691830, 679326, 661214, 639080, 614792, 590024, 565787, 542141, 518557, 494820, 471479, 449280, 428360, 408342, 389022, 370639, 353491, 337575, 322629, 308386, 294829, 282303, 271247, 261700, 253130, 244914, 236866, 229209, 222214, 216057, 210876, 206660, 203116, 199859, 196779, 194081, 191978, 190457, 189350, 188572, 188222, 188418, 189045, 189743, 190224, 190485, 190616, 190615, 190632, 191137, 192410, 193986, 195132, 195868, 197001, 199074, 201852, 205015, 208691, 212983, 217563, 222209, 227280, 233077, 239135, 244758, 249926, 255000, 259646, 262784, 263629, 262279, 259246, 254961, 249872, 244471, 238932, 233055, 226815, 220710, 215325, 210770, 206776, 203197, 200222, 198134, 197032, 196777, 197052, 197404, 197277, 196158, 193847, 190646, 187226, 184289, 182351, 181664, 182127, 183320, 184910]
57687A84910K137L061L963M439M810N721P204Q666R774J0830J2346J4737J8316
57674B90914K3099K8602L4349M0507M7333N4005N8668N9622N5735M5883K9426
57663G68143Q071j3667l0844m0991m4509m3112l8558l2360k5653j9122j3380r131
57651D64887o629n217l977k690j816j714k281l126l772l931l874m270n292o271
57637D10027o607o656p100p798p960p348o639o526p001p538p615p028o084n448
57623C12679n415n423m739l494k561k437k739k892k678k093j161j21O31J048J523
57608B80128K307L253M237N341O347O582N754M563L955L983M003L813L945M704
57594C42915N585N921N705N390N143M762M127L361K517J464J23j413l043m645
$$ y = [184910, 187047, 190108, 194071, 198510, 203320, 209041, 216245, 224911, 234685, 245515, 257861, 272598, 290914, 314013, 342615, 376964, 417471, 464804, 518809, 577477, 637099, 692834, 738717, 768143, 776214, 762547, 731703, 690712, 646203, 603091, 564533, 532173, 506520, 487398, 474018, 464887, 458258, 453041, 449064, 446374, 444558, 442844, 440563, 437437, 433665, 429734, 425860, 421590, 416298, 410027, 403420, 396764, 389664, 381866, 373906, 366558, 359919, 353393, 346392, 338854, 331239, 324211, 318127, 312679, 307264, 301841, 297102, 293608, 291047, 288610, 285871, 282979, 280301, 278208, 277047, 276926, 277557, 278605, 280128, 282435, 285688, 289925, 295266, 301613, 308195, 313949, 318512, 322467, 326450, 330453, 334266, 338211, 342915, 348500, 354421, 360126, 365516, 370659, 375421, 379548, 382909, 385426, 386890, 387013, 385600, 382557, 377912]
57580C77912n949o757p327q120r050r436q942q154p794p768p496o946o695p085
57566B70393p803q287q191p468o446n737n625n607n074m234l747l519k737j255
57552A94663n9R4k28k3P06J095O99J9j66M62J602K544K607J697M27m47o71n53
57534B04468n64q92j217r68p1P19P13L14M44J053J233R07J250K772M112L717J969
57517B19959O86R39K397M286N973O852O714O177N904N632M803L909M028N108N905
57502B89272N754N324N288N325M948M331L775L063K064J288J169J227O24p09k030
57487C30713k732k896l005l475m343n208n644n722n840o005n717m783l787l401
57473B68155l580l778l677l341k917k528k294k149j820j251r08j234j974k302
$$ y = [377912, 371963, 365206, 357879, 349759, 340709, 331273, 322331, 314177, 306383, 298615, 291119, 284173, 277478, 270393, 262590, 254303, 246112, 238644, 232198, 226461, 220836, 215229, 210155, 205921, 202174, 198655, 195918, 194663, 194604, 194698, 194470, 194447, 195153, 196248, 196947, 196966, 196800, 197262, 198864, 201408, 204015, 205712, 206139, 205692, 205021, 204468, 203904, 203012, 201795, 200827, 200756, 201475, 202188, 202502, 202946, 203999, 205232, 206139, 207389, 210161, 214273, 217990, 219959, 220645, 221584, 223981, 228267, 234240, 241092, 247806, 253983, 259887, 265519, 270322, 274231, 278259, 283367, 289272, 295026, 300350, 305638, 310963, 315911, 320242, 324017, 327080, 329144, 330432, 331601, 332828, 333452, 332743, 330713, 327981, 325085, 322080, 318605, 314262, 309054, 303410, 297688, 291848, 285843, 280126, 275343, 271556, 268155, 264575, 260797, 257120, 253779, 250862, 248334, 246040, 243891, 242071, 240820, 239912, 238678, 236704, 234402]
57459B34402j663k40J267K201K302J783J229J318K424M220N640N691M559L657
57445B68790M073N291N962N737N498N837O272O237N953N770N400M513L538L085
57431C41956K966K466J449M09m16j367k685m112n296o132o593o565o069n419n001
57416B99591m967n165n251m973m447m099m171m442m551m403m084l598k940k282
57402B40218j773j314p87l93m43r07j427j677j490p79L05J283J689J515J127Q00
57386B35947O42P27R90J062O11r5l26L18J469K390K620K252J782J656J793J645
57370B55483R13J16J29J171K566L461L606L346L171L240L232K716J712Q18N68
57355B86248Q64J241J494J709J938K190K623L262L646L257K300J644J837K556
$$ y = [234402, 232739, 232499, 233766, 235967, 238269, 240052, 241281, 242599, 245023, 249243, 254883, 260574, 265133, 268790, 272863, 278154, 284116, 289853, 295351, 301188, 307460, 313697, 319650, 325420, 330820, 335333, 338871, 341956, 344922, 347388, 348837, 349246, 348830, 347463, 344778, 340666, 335370, 329238, 322645, 316080, 310011, 304592, 299591, 294624, 289459, 284208, 279235, 274788, 270689, 266518, 262076, 257525, 253122, 249038, 245440, 242500, 240218, 238445, 237131, 236344, 235951, 235508, 234601, 233174, 231497, 230007, 229228, 229533, 230816, 232505, 234020, 235147, 235947, 236589, 237316, 238306, 239368, 239979, 239884, 239558, 239876, 241345, 243735, 246355, 248607, 250389, 252045, 253838, 255483, 256396, 256512, 256641, 257812, 260378, 263839, 267445, 270791, 273962, 277202, 280434, 283150, 284862, 285680, 286248, 287112, 288353, 289847, 291556, 293494, 295684, 298307, 301569, 305215, 308472, 310772, 312416, 314253, 316809]
57341C16809L097L073K656K355K591L242L666L423K805K327K033J836K182L510
57327C55605N129N651M786L803L832M511M822M513M032L600L153K830K876L207
57313D12350L577L990M480M747M504L973L621L559L633L822M175M579N017N724
57299D71751O631P021O452N642N711O636P329P165O611O250O044N878O074O843
57285E62038P727Q062P741P187O842O874P158P359P245O982O880O871O642O281
57271F61889O181O263N865M731L549L094L343L749M046M279M378M191L831L600
57257G22989L732M314N249O075O241N807N497N748O175O333O432O761O942O556
57243H04851O084O330P104P383O761N900N446N408N721O490P347P462O748O313
$$ y = [316809, 319906, 322979, 325635, 327990, 330581, 333823, 337489, 340912, 343717, 346044, 348077, 349913, 352095, 355605, 360734, 366385, 371171, 374974, 378806, 383317, 388139, 392652, 396684, 400284, 403437, 406267, 409143, 412350, 415927, 419917, 424397, 429144, 433648, 437621, 441242, 444801, 448434, 452256, 456431, 461010, 466027, 471751, 478382, 485403, 491855, 497497, 503208, 509844, 517173, 524338, 530949, 537199, 543243, 549121, 555195, 562038, 569765, 577827, 585568, 592755, 599597, 606471, 613629, 620988, 628233, 635215, 642095, 648966, 655608, 661889, 668070, 674333, 680198, 684929, 688478, 691572, 694915, 698664, 702710, 706989, 711367, 715558, 719389, 722989, 726721, 731035, 736284, 742359, 748600, 754407, 759904, 765652, 771827, 778160, 784592, 791353, 798295, 804851, 810935, 817265, 824369, 831752, 838513, 844413, 849859, 855267, 860988, 867478, 874825, 882287, 889035, 895348]
57229H95348P021Q243Q774Q535Q445Q861R128Q736Q035P600P503P602P970Q586
57215A010387Q964Q678Q062P831Q108Q280P963P561P656Q140Q386Q090P543P139
57201A122788P037P293P890Q511Q657Q255P786P636P634P598P890Q931J0348J1209
57187A239463J1046J0233R461R275R998J1485J2890J3323J2899J2576J2814J3020
57175A378483J2639J2095J2019J2121J1561J0293R247R118R524R631R187Q713
57163A504631Q777R335R829R927R912J0178J0506J0343R840R957J1265J3103J4398
57150A642001J4859J4898J4867J4989J5652J7012J8485J9407K0082K1300K2891
57139A836443K3775K3712K3872K5153K6815K7595K7569K7861K8912L0011L0595
$$ y = [895348, 902369, 910612, 919386, 927921, 936366, 945227, 954355, 963091, 971126, 978726, 986229, 993831, 1001801, 1010387, 1019351, 1028029, 1036091, 1043922, 1052030, 1060310, 1068273, 1075834, 1083490, 1091630, 1100016, 1108106, 1115649, 1122788, 1129825, 1137118, 1145008, 1153519, 1162176, 1170431, 1178217, 1185853, 1193487, 1201085, 1208975, 1217906, 1228254, 1239463, 1250509, 1260742, 1270203, 1279478, 1289476, 1300961, 1313851, 1327174, 1340073, 1352649, 1365463, 1378483, 1391122, 1403217, 1415236, 1427357, 1438918, 1449211, 1458458, 1467576, 1477100, 1486731, 1495918, 1504631, 1513408, 1522743, 1532572, 1542499, 1552411, 1562589, 1573095, 1583438, 1593278, 1603235, 1614500, 1627603, 1642001, 1656860, 1671758, 1686625, 1701614, 1717266, 1734278, 1752763, 1772170, 1792252, 1813552, 1836443, 1860218, 1883930, 1907802, 1932955, 1959770, 1987365, 2014934, 2042795, 2071707, 2101718, 2132313]
57128B132313L1114L2294L4168L6185L7993L9828M2281M5885N0783N6680O3132
57117B602656O9897P6940Q4302R2273J01618J13167J27007J42357J58506J75726
57107C744449J95102K17670K44071K74960L11404L54651M05655M65049N33527
57098F746538O12036P01446Q02081R13492J034410J162578J294481J425390J549767
57089A6242219J661698J755128J824041J862754J866274J830625J753018J631713
57081C0427470J465645J254497R99861P06819L84481M4860k98729o32683r43818
57072C3408403j220397j453196j635919j765375j841888j869367j854141j803340
57064A9964780j724219j624425j511648j392418j271468j152375j038196r31202
$$ y = [2132313, 2163427, 2195721, 2229889, 2266074, 2304067, 2343895, 2386176, 2432061, 2482844, 2539524, 2602656, 2672553, 2749493, 2833795, 2926068, 3027686, 3140853, 3267860, 3410217, 3568723, 3744449, 3939551, 4157221, 4401292, 4676252, 4987656, 5342307, 5747962, 6213011, 6746538, 7358574, 8060020, 8862101, 9775593, 10810003, 11972581, 13267062, 14692452, 16242219, 17903917, 19659045, 21483086, 23345840, 25212114, 27042739, 28795757, 30427470, 31893115, 33147612, 34147473, 34854292, 35238773, 35283633, 34984904, 34352221, 33408403, 32188006, 30734810, 29098891, 27333516, 25491628, 23622261, 21768120, 19964780, 18240561, 16616136, 15104488, 13712070, 12440602, 11288227, 10250031, 9318829]
57056I318829q32505p42517o61501n89343n25259m68214m17466l72232l31270
57047D378522k93471k58626k26962j98192j72249j51055j38117j35245j39887
57038B664718j46396j49777j47960j41313j31291j19724j08318r7939q8522p9849
57028A453629p2243o6131o1280n6955n2815m9203m6414m3988m1178l7986l5267
57017H90169l3619l2549l1077k8987k7018k5787k5050k4140k2761k1077j9328
57006E98776j7720j6460j5586j4861j4102j3452j3059j2651j1782j0467r179q262
56994D41195p579o831n930n051m377l835k973j324Q85K702L393L235K852K136
56980D18498N20j781l672m609n331o583p798p758o333m719l965l831l326k004
$$ y = [9318829, 8486324, 7743807, 7082306, 6492963, 5967704, 5499490, 5082024, 4709792, 4378522, 4085051, 3826425, 3599463, 3401271, 3229022, 3077967, 2939850, 2804605, 2664718, 2518322, 2368545, 2220585, 2079272, 1947981, 1828257, 1719939, 1622000, 1533478, 1453629, 1381386, 1315255, 1253975, 1197020, 1144205, 1095002, 1048588, 1004600, 963422, 925436, 890169, 856550, 824001, 792924, 763937, 736919, 711132, 686082, 661942, 639181, 618104, 598776, 581056, 564596, 549010, 534149, 520047, 506595, 493536, 480885, 469103, 458636, 449457, 441195, 433616, 426785, 420855, 415804, 411427, 407592, 404619, 403295, 404180, 406882, 410275, 413510, 416362, 418498, 419018, 417237, 413565, 408956, 403625, 397042, 389244, 381486, 375153, 370434, 366469, 362638, 359312, 357308]
56966C57308l94O93J079J365K229L710N232O266O698O637O087M912K961K31k885
56951D02129n587p275q206r073r910r895q559o600n026l942k706j005Q65K621
56937C27831M289N832P077Q094R187J0367J1171J1052R739P170L504p44m891q527
56923D01151j1520j3594j4319j3683j2320j0942r783q756p866p225o806o434n979
56910B71924n398m659l810l071k710k816l202l524l539l277k973k673k075r10
56896B27287N25J564J957K218L007M373N787O814P527Q227Q921R148Q337O460
56882C02152M290K814K256J865P89r28k503l355l549l323k647j510j86J138K776
56867C00079N029P409R076J0078J1420J3513J5318J5623J4535J2896J0707P284
$$ y = [357308, 356914, 357607, 358686, 360051, 362280, 365990, 371222, 377488, 384186, 390823, 396910, 401822, 404783, 405014, 402129, 396542, 389267, 381061, 371988, 362078, 352183, 343624, 337024, 331998, 328056, 325350, 324345, 325210, 327831, 332120, 337952, 345029, 353123, 362310, 372677, 383848, 394900, 404639, 411809, 415313, 414569, 409678, 401151, 389631, 376037, 361718, 348035, 335715, 324773, 314990, 306234, 298368, 291143, 284337, 277903, 271924, 266526, 261867, 258057, 254986, 252276, 249460, 246258, 242734, 239195, 235918, 232945, 230272, 228197, 227287, 227812, 229376, 231333, 233551, 236558, 240931, 246718, 253532, 261059, 269286, 278207, 287355, 295692, 302152, 306442, 309256, 311512, 313377, 314166, 313238, 310735, 307380, 303831, 300508, 297861, 296351, 296165, 297303, 300079, 305108, 312517, 321593, 331671, 343091, 356604, 371922, 387545, 402080, 414976, 425683, 432967]
56855D32967K863j223m224o765r422j1518j2046j1067r319p041m020m88L000O327
56841C68024R728J3091J6093J8892K1918K4984K7314K8455K8356K6549K2072J4653
56829F20129N432l796j1759j8006k2538k5448k6678k6044k3690k0361j6878j3455
56817D16908r914o385l129J64M047Q276J1853J4331J6261J8038J9023J8230J5335
56804E23038J0611M530k115q275j3354j7442k0546k2096k1818k0432j8848j7009
56792C76244j4244j0547o800l781j481N85K838N396Q019J0211J1518J1716J0714
56779D00388Q560N596K261j411n649j0047j3438j5032j5260j5039j4716j4199
56767C12014j3620j3066j2045r989p254m984l959m034m545m833m502l694k983
$$ y = [432967, 435830, 434607, 430383, 423618, 414196, 402678, 390632, 379565, 370246, 363205, 359185, 358697, 361697, 368024, 377752, 390843, 406936, 425828, 447746, 472730, 500044, 528499, 556855, 583404, 605476, 620129, 625561, 621765, 610006, 592000, 569462, 544014, 517336, 491292, 467602, 447241, 430363, 416908, 406994, 400609, 397480, 397644, 401691, 409967, 421820, 436151, 452412, 470450, 489473, 507703, 523038, 533649, 538179, 536064, 527789, 514435, 496993, 476447, 454351, 432533, 412101, 393253, 376244, 362000, 351453, 344653, 340872, 339391, 339976, 342814, 348210, 356229, 366440, 377958, 389674, 400388, 408948, 414544, 416805, 415394, 409745, 399698, 386260, 371228, 355968, 340929, 326213, 312014, 298394, 285328, 273283, 263294, 256040, 251056, 247097, 243063, 238518, 233685, 229183, 225489, 222506]
56754B22506k638k227j456r56j561k909l714l389k717k686l359m083m296l887
56740A82628l186k790l026l471l368k561j662j280j507k100k678k699j878p45
56726A49677k01m41p44n01Q9N27O41N13K33N4K79Q07J194J319J452J506R50j68
56708A57186q31l23P12J103O63J26o3j09j61o1J93L19K90M30Q67J325J628J964
56690A65258K505L074L429L603L764M005M443N266O459P620Q315Q571Q850R485
56676B44647J0337J1033J1430J1650J1645J0978R288O916M764L365K424J414L84
56663C40275j65o0L61Q32J535K634L726M150L699K854K243K071K100J989J604
56648C69848J046M73j14q99j974l059l672l689l540l695m045m119l824l600l764
$$ y = [222506, 219868, 217641, 216185, 215229, 213668, 210759, 207045, 203656, 200939, 198253, 194894, 190811, 186515, 182628, 179442, 176652, 173626, 170155, 166787, 164226, 162564, 161284, 159777, 157677, 154999, 152300, 150422, 149677, 149476, 149035, 148291, 147790, 147879, 148406, 149047, 149560, 149793, 149847, 150126, 150933, 152127, 153446, 154898, 156404, 157354, 157186, 156355, 156032, 156744, 157847, 158510, 158636, 158573, 158464, 158303, 158242, 158435, 158754, 159044, 159474, 160341, 161666, 163294, 165258, 167763, 170837, 174266, 177869, 181633, 185638, 190081, 195347, 201806, 209426, 217741, 226312, 235162, 244647, 254984, 266017, 277447, 289097, 300742, 311720, 321008, 327924, 332688, 336053, 338477, 339891, 340275, 340110, 340050, 340411, 341243, 342778, 345412, 349138, 353288, 356987, 359841, 362084, 364155, 366255, 368244, 369848, 370894, 371367, 371253, 370354, 368380, 365321, 361649, 357960, 354420, 350725, 346680, 342561, 338737, 335137, 331373]
56633C31373m060m073l779l408l040k724k754l370m232m659m462m063l731l169
56619B79849k168j214r56j241j105K15K485M728O028O038M950L196J248m36j505
56604C00112j960k180k433k500j969j030n71j212k541l560l780l586l591l955
56590B65244m345m290l513k090m72P97J509J885K237K666L142L626L957L829L122
56575B77304K218J678J631J719J714J764J920J829J322J009J700L328M944N844
56561C09924O129O083N610M649L611K845K050P33r02k075k345k018j658j624j972
56546C29040k374k258j487q38j242k507l431l287k678k616l356m449n463o192
56532B86862o529o622o899p502p915p577o651n756n166m745m527m701m986m698
$$ y = [331373, 327313, 323240, 319461, 316053, 313013, 310289, 307535, 304165, 299933, 295274, 290812, 286749, 283018, 279849, 277681, 276467, 275511, 274270, 273165, 273380, 275865, 280593, 286621, 292659, 297609, 300805, 302053, 301617, 300112, 298152, 295972, 293539, 291039, 289070, 288040, 287469, 286257, 283716, 280156, 276376, 272790, 269199, 265244, 260899, 256609, 253096, 251006, 250534, 251331, 252840, 254725, 256962, 259628, 262770, 266396, 270353, 274182, 277304, 279522, 281200, 282831, 284550, 286264, 288028, 289948, 291777, 293099, 294108, 295808, 299136, 304080, 309924, 316053, 322136, 327746, 332395, 336006, 338851, 340901, 341634, 340732, 338657, 336312, 334294, 332636, 331012, 329040, 326666, 324408, 322921, 322083, 320841, 318334, 314903, 311616, 308938, 306322, 302966, 298517, 293054, 286862, 280333, 273711, 266812, 259310, 251395, 243818, 237167, 231411, 226245, 221500, 216973, 212272, 207286, 202588]
56518B02588l683k711k550k991l206k839k284j981j902j811j729j823k030k012
56504A69036j533p88k89m13r72j301r15r9L80J70l03n51o92j036j353j114l36
56487A57891M27R67J543K024J716N33m64l62L22M10k88r23r18m45L19J365K305
56470A66422K497K011J676J929K306K297J987J541Q70J94J95J015J729J456M87
56455A88612l27p19r78j175j256j476j953k050j114L92J229R21J55l27m26k47
56439A79261K60R03J208J071R62J172J338J038M42M8J08N66J214J623J348N47
56423A93109K4K39N89J49r96j716j262k59K1q01j706j455r7J009P73m06j224j101
56405A84890n57j37L42J129J789J760J314J301J910K289J610J21j047r68K31J491
$$ y = [202588, 198905, 196194, 193644, 190653, 187447, 184608, 182324, 180343, 178441, 176630, 174901, 173078, 171048, 169036, 167503, 166715, 166426, 166013, 165041, 163740, 162825, 162726, 163106, 163276, 162973, 162422, 161730, 160694, 159341, 158227, 157891, 158318, 159285, 160828, 162852, 164568, 165101, 164637, 164275, 164597, 165007, 164719, 163796, 162878, 162433, 162752, 164117, 166422, 168919, 170930, 172606, 174535, 176841, 179138, 181125, 182666, 183536, 183730, 183925, 184940, 186669, 188125, 188612, 188285, 187566, 186588, 185413, 184157, 182681, 180728, 178678, 177564, 177956, 179185, 180106, 180261, 179934, 179508, 179261, 179521, 180424, 181632, 182703, 183665, 184837, 186175, 187213, 187655, 187703, 187811, 188377, 189591, 191214, 192562, 193109, 193133, 193372, 193961, 194110, 193114, 191398, 190136, 189877, 189898, 189097, 187391, 185936, 185839, 186848, 187621, 187215, 185991, 184890, 184333, 184196, 184538, 185667, 187456, 189216, 190530, 191831, 193741, 196030, 197640, 197761, 196714, 195746, 195977, 197468]
56389A97468J758R54M2n0N29Q81N83J76K94Q03J164J280J473J787J834J456J006
56372B13438Q41Q42P34N96P21J080J340J333J261J313J364J146O47J78P3L55P39
56355B28001Q95P35M15J28j9N7L60O65O64M63O16J395K232K304J582Q26N67N90
56337B42476N47N65Q69J243J259R25P34J056J774K473K826K825K703K643K541
56322B67459K202J760J569J636J512J028O87R81J602J841J595J455J800K334K622
56307B92083K633K571K508K478K610K950L263L261K972K702K687K935L321L714
56293C32688M051M360M741N218N651N860N832N724N671N670N632N477N139M590
56279D06304L965L604L817M542N375O045O660P393Q074Q465Q764R540J1045J2976
$$ y = [197468, 199226, 200180, 200222, 200172, 200701, 201582, 202165, 202341, 202635, 203438, 204602, 205882, 207355, 209142, 210976, 212432, 213438, 214279, 215121, 215855, 216451, 217172, 218252, 219592, 220925, 222186, 223499, 224863, 226009, 226656, 226834, 226907, 227262, 228001, 228896, 229631, 230046, 230174, 230155, 230212, 230572, 231237, 231901, 232364, 232980, 234375, 236607, 238911, 240493, 241319, 241886, 242476, 243023, 243588, 244457, 245700, 246959, 247884, 248618, 249674, 251448, 253921, 256747, 259572, 262275, 264918, 267459, 269661, 271421, 272990, 274626, 276138, 277166, 277853, 278834, 280436, 282277, 283872, 285327, 287127, 289461, 292083, 294716, 297287, 299795, 302273, 304883, 307833, 311096, 314357, 317329, 320031, 322718, 325653, 328974, 332688, 336739, 341099, 345840, 351058, 356709, 362569, 368401, 374125, 379796, 385466, 391098, 396575, 401714, 406304, 410269, 413873, 417690, 422232, 427607, 433652, 440312, 447705, 455779, 464244, 473008, 482548, 493593, 506569]
56265E06569J4951J6919J8972K1044K3092K5324K8022L1281L5094L9461M4235
56254H04964M9057N3700N8258O2749O6785O9951P2255P3799P4150P2645O9253
56243A527566O4591N8973N1947M3086L2750K1758J0679j89j0331j9128k6486l2955
56231A722261l9004m4427m8674n1571n3420n4547n5045n5022n4698n4051n2678
56220A159124n0395m7763m5560m3789m1667l8749l5560l2865l0713k8571k6184
56209G37308k3826k1794k0010j8186j6171j4112j2309j0891r545p804n673l791
56197E73196k690k143j561q30m09n83j002j040l73P91J894K433K300J808J316
56182E73107J021J045J471K087K446K473K726L694N086O220O830P060O862O081
$$ y = [506569, 521520, 538439, 557411, 578455, 601547, 626871, 654893, 686174, 721268, 760729, 804964, 854021, 907721, 965979, 1028728, 1095513, 1165464, 1237719, 1311518, 1385668, 1458313, 1527566, 1592157, 1651130, 1703077, 1746163, 1778913, 1800671, 1811350, 1811161, 1800830, 1781702, 1755216, 1722261, 1683257, 1638830, 1590156, 1538585, 1485165, 1430618, 1375573, 1320551, 1265853, 1211802, 1159124, 1108729, 1060966, 1015406, 971617, 929950, 891201, 855641, 822776, 792063, 763492, 737308, 713482, 691688, 671678, 653492, 637321, 623209, 610900, 600009, 590464, 582660, 576987, 573196, 570506, 568363, 566802, 565972, 565563, 564980, 563978, 562938, 562565, 563356, 565250, 567683, 569983, 571791, 573107, 574128, 575173, 576644, 578731, 581177, 583650, 586376, 590070, 595156, 601376, 608206, 615266, 622128, 628209]
56168F28209N127M876N706P101Q314R064R426R559R806J0646J2201J4070J5968
56155G50073J8221K1341K5256K9428L3741L8911M5800N4395O3571P1931P8660
56144A231328Q3447Q5650Q4178P8521O9711N9786N0472M2712L7145L4171L3156
56133A890277L2162K9070K3038J4830N986k071q446j2874j5849j8702k3228l0741
56121A883452m1039n2345o2484o9999p4181p4512p0834o4023n5796m7561l9733
56110A230945l2209k5120j8888j3839j0014p125m634k076N46K846M580N856O849
56097A137717P644Q364R138R873J0347J0575J0756J0876J0757J0523J0601J1133
56085A258304J1803J2336J2810J3332J3857J4430J5220J6118J6782J7257J8073
$$ y = [628209, 633336, 638212, 643918, 651019, 659333, 668397, 677823, 687382, 697188, 707834, 720035, 734105, 750073, 768294, 789635, 814891, 844319, 878060, 916971, 962771, 1017166, 1080737, 1152668, 1231328, 1314775, 1400425, 1484603, 1563124, 1632835, 1692621, 1743093, 1785805, 1822950, 1857121, 1890277, 1922439, 1951509, 1974547, 1989377, 1995363, 1993292, 1984846, 1971972, 1956123, 1937421, 1914193, 1883452, 1842413, 1790068, 1727584, 1657585, 1583404, 1508892, 1438058, 1374035, 1318239, 1270678, 1230945, 1198736, 1173616, 1154728, 1140889, 1130875, 1123750, 1119116, 1117040, 1117586, 1120432, 1125012, 1130868, 1137717, 1145361, 1153725, 1162863, 1172736, 1183083, 1193658, 1204414, 1215290, 1226047, 1236570, 1247171, 1258304, 1270107, 1282443, 1295253, 1308585, 1322442, 1336872, 1352092, 1368210, 1384992, 1402249, 1420322]
56074A420322J9412K0628K0948K0410J9741J9585K0128K1180K2311K3142K3628
56063A651435K3916K3873K3208K2251K1981K2968K4690K6206K7154K7704K8096
56052A923482K8564K9376L0466L1455L2373L3884L6201L8322L9128L8907L9004
56041B301162M0133M1819M3432M4918M6374M7664M8793N0100N1809N3660N5345
56030B825209N6977N8961O1586O4840O8541P2451P6317P9822Q2635Q4808Q7054
56019C619201R0167R4030R7707J00847J04331J09005J14349J19247J23662J28577
56009D701123J34399J40542J46605J53011J60130J67668J75389J83749J93222
56000F155838K03497K13874K24218K35043K46965K60318K75142K91142L07959
$$ y = [1420322, 1439734, 1460362, 1481310, 1501720, 1521461, 1541046, 1561174, 1582354, 1604665, 1627807, 1651435, 1675351, 1699224, 1722432, 1744683, 1766664, 1789632, 1814322, 1840528, 1867682, 1895386, 1923482, 1952046, 1981422, 2011888, 2043343, 2075716, 2109600, 2145801, 2184123, 2223251, 2262158, 2301162, 2341295, 2383114, 2426546, 2471464, 2517838, 2565502, 2614295, 2664395, 2716204, 2769864, 2825209, 2882186, 2941147, 3002733, 3067573, 3136114, 3208565, 3284882, 3364704, 3447339, 3532147, 3619201, 3709368, 3803398, 3901105, 4001952, 4106283, 4215288, 4329637, 4448884, 4572546, 4701123, 4835522, 4976064, 5122669, 5275680, 5435810, 5603478, 5778867, 5962616, 6155838, 6359335, 6573209, 6797427, 7032470, 7279435, 7539753, 7814895, 8106037, 8413996]
55991H413996L25772L45394L67481L91788M17618M44887M74444N07281N43767
55982A2232428N83891O28032O77113P31836P92114Q57839R30185J011536J103834
55973A9548808J207711J323795J454324J602782J772447J966427K189009K446055
55965C3511358K744250L091232L496916L973978M536954N201931N987221O913160
55957F9457000Q000237R267405J0730498J2397120J4255968J6262539J8323907
55950A58694674K0283889K1914170K2921325K2974956K1753547J9007527J4645513
55943C02195601Q832025K043265m986871j1443776j6656448k0255577k2201838
55936B37526381k2706209k2109732k0777953j9032137j7117826j5202331j3388077
$$ y = [8413996, 8739768, 9085162, 9452643, 9844431, 10262049, 10706936, 11181380, 11688661, 12232428, 12816319, 13444351, 14121464, 14853300, 15645414, 16503253, 17433438, 18444974, 19548808, 20756519, 22080314, 23534638, 25137420, 26909867, 28876294, 31065303, 33511358, 36255608, 39346840, 42843756, 46817734, 51354688, 56556619, 62543840, 69457000, 77457237, 86724642, 97455140, 109852260, 124108228, 140370767, 158694674, 178978563, 200892733, 223814058, 246789014, 268542561, 287550088, 302195601, 311027626, 313070891, 308084020, 296640244, 279983796, 259728219, 237526381, 214820172, 192710440, 171932487, 152900350, 135782524, 120580193, 107192116]
55929A07192116j1729363j0246970q940943p801164o813447n961381n227427m595044
55921D5876377m050177l580735l175639k825158k521527k258259k029060j828049
55913B3607773j650809j494394j356223j233536j124036j026327r39355q61669
55905A3921424p91620p28005o70213o17861n70604n28269m90835m58123m29495
55896H636399m03937l80402l58202l37103l17112k98128k79892k62367k45957
55887E753299k31136k17799k05245j92896j80821j69438j58997j49695j42039
55878D105233j36403j32113j27576j21794j15369j09544j04628r9919r4995r0274
55868B972618q6214q2715p9628p7225p5657p4366p2583p0178o7573o5070o2686
$$ y = [107192116, 95462753, 85215783, 76274840, 68473676, 61660229, 55698848, 50471421, 45876377, 41826200, 38245465, 35069826, 32244668, 29723141, 27464882, 25435822, 23607773, 21956964, 20462570, 19106347, 17872811, 16748775, 15722448, 14783093, 13921424, 13129804, 12401799, 11731586, 11113725, 10543121, 10014852, 9524017, 9065894, 8636399, 8232462, 7852060, 7493858, 7156755, 6839643, 6541515, 6261623, 5999256, 5753299, 5522163, 5304364, 5099119, 4906223, 4725402, 4555964, 4396967, 4247272, 4105233, 3968830, 3836717, 3709141, 3587347, 3471978, 3362434, 3257806, 3157887, 3062892, 2972618, 2886404, 2803689, 2724061, 2646836, 2571179, 2496813, 2424230, 2354052, 2286479, 2221409, 2158723]
55857B158723o0443n8296n5877n2852m9618m7035m5380m3985m2141m0042l8490
55846A624564l7859l7649l7004l5535l3600l1872l0629k9573k8387k7196k6301
55835A268959k5616k4757k3656k2629k1820k0922j9713j8524j7875j7838j7986
55824A037623j7850j7253j6338j5519j5245j5585j6052j6033j5373j4369j3353
55813H64653j2479j1802j1264j0579r457q081p047o692o701o652o632o955p407
55800G52905p358o724o218o322o441n684m204l134l166l821m424n237p110j0210
55786F72852j3540j5735j6077j4784j2588j0178p870n570k927K63L561N668N098
55773E88173J529l535p857j0216j0828j0232q528n935l321j550n47M32J857L663
$$ y = [2158723, 2098280, 2039984, 1984107, 1931255, 1881637, 1834602, 1789222, 1745237, 1703096, 1663054, 1624564, 1586705, 1549056, 1512052, 1476517, 1442917, 1411045, 1380416, 1350843, 1322456, 1295260, 1268959, 1243343, 1218586, 1194930, 1172301, 1150481, 1129559, 1109846, 1091322, 1073447, 1055609, 1037623, 1019773, 1002520, 986182, 970663, 955418, 939833, 923781, 907748, 892375, 878006, 864653, 852174, 840372, 829108, 818529, 809072, 800991, 793944, 787252, 780551, 773899, 767267, 760312, 752905, 745547, 738823, 732605, 726283, 719842, 714158, 709954, 706820, 703654, 699833, 695409, 690172, 683062, 672852, 659312, 643577, 627500, 612716, 600128, 589950, 582080, 576510, 573583, 573846, 577407, 583075, 588173, 589702, 586167, 578310, 568094, 557266, 547034, 538506, 532571, 529250, 527700, 527153, 527585, 529442, 533105]
55759E33105N726Q004J0223J1954J2964J3299J2996J2056J0608Q683N969K185
55747F47772k273o506r975j2863j5532j7955j9810k0835k1053k0752k0290j9706
55735D60222j8708j7209j5700j4721j4158j3503j2640j1870j1233j0462r589q956
55723C01473q491p614o149m766m166m272m587m889n131n052m473l723l301l143
55709B31716k744j927j175j086j702k513k915k664k001j451j455k104l044l608
55695B01327l293k310j547j642k242k496k131j602j227q11k08M01R93J902L064
55680A88178L696L211K131J502J657K077K238K044J537Q16K69L45R14J307J120
55665B13042P29P53J321K000K337K235J926J686J592J451R95J61p54j263j103
$$ y = [533105, 538831, 546835, 557058, 569012, 581976, 595275, 608271, 620327, 630935, 639618, 645587, 647772, 645499, 638993, 629018, 616155, 600623, 582668, 562858, 542023, 520970, 500218, 479928, 460222, 441514, 424305, 408605, 393884, 379726, 366223, 353583, 341713, 330480, 320018, 310429, 301473, 292982, 285368, 279219, 274453, 270287, 266015, 261428, 256539, 251408, 246356, 241883, 238160, 234859, 231716, 228972, 227045, 225870, 224784, 223082, 220569, 217654, 214990, 212989, 211538, 210083, 207979, 204935, 201327, 198034, 195724, 194177, 192535, 190293, 187797, 185666, 184064, 182837, 182026, 181818, 182219, 183212, 185114, 188178, 191874, 195085, 197216, 198718, 200375, 202452, 204690, 206734, 208271, 209087, 209356, 209701, 210615, 211922, 213042, 213771, 214524, 215845, 217845, 220182, 222417, 224343, 226029, 227621, 229072, 230067, 230228, 229474, 228211, 227108]
55650B27108n64k90n65q59l83R11K237L006L526M442N821P183Q298R400J0724
55635B79995J2236J3913J5887J8111K0152K1509K2002K1647K0390J8128J4989
55624D78959J1334P520L802M95k022l629m657n456n831n292l899k404j343l94
55610D67183Q59J911J734J32k034m086o309r171j2330j4940j6710j8125j9731
55597C68383k1491k2827k3042k1874j9822j7835j6488j5526j4353j2746j0940
55586A71439r253p875o905o283n741n038m153l138j975p88%L5n26j163j556j782
55570A15298j995k221k410k578k798l122l464l605l393l041k967l288l579l318
55556G3519k413j260m28k98p94j335j355r72q13j075j159m82O40J340J197N25
$$ y = [227108, 226544, 226254, 225689, 224830, 224447, 225358, 227595, 230601, 234127, 238569, 244390, 251573, 259871, 269271, 279995, 292231, 306144, 322031, 340142, 360294, 381803, 403805, 425452, 445842, 463970, 478959, 490293, 497813, 501615, 502110, 500088, 496459, 491802, 486346, 480515, 475223, 471324, 468920, 467577, 467183, 468042, 469953, 471687, 471819, 469785, 465699, 459390, 450219, 437889, 422949, 406239, 388114, 368383, 346892, 324065, 301023, 279149, 259327, 241492, 225004, 209478, 195125, 182379, 171439, 162186, 154311, 147406, 141123, 135382, 130344, 126191, 123053, 121078, 120290, 120290, 120325, 119799, 118636, 117080, 115298, 113303, 111082, 108672, 106094, 103296, 100174, 96710, 93105, 89712, 86671, 83704, 80416, 76837, 73519, 71106, 69846, 69418, 69120, 68326, 66991, 65636, 64664, 63851, 62776, 61617, 61135, 61775, 63115, 64312, 64837]
55540F4837j02k84J05Q41J408J391Q71K51k13n89j019j492j730j358l36P08R97
55523F4286N43J30J78J88l35r45q89k53K63M22N59O96M50n2P6J319K887L498K913
55504G5934K224K611M064N511O182O468P239Q557R665J0216J0773J1791J2793
55491A74028J3191J3321J3915J4914J5566J5519J4964J3793J1516Q109M236M59
55479C13531l158o525r314j1513j3568j5655j7286j7964j7803j7188j6234j4936
55467A52387j3479j2137j1000j0032r139q143o996o040n654n574n121m202l505
55454E1365l442l499l088k456k224k422k572k438k056j330k49N89L84q31k105
55439B3626k679k647k339j702o89J51J89l79p02l91J15L63M45L93k60j643k707
$$ y = [64837, 64735, 64451, 64556, 65397, 66805, 68196, 69067, 69318, 69105, 68516, 67497, 66005, 64275, 62917, 62581, 63289, 64286, 64829, 64959, 65137, 65325, 64990, 64045, 63156, 62903, 63166, 63588, 64147, 64843, 65293, 65241, 65317, 66636, 69523, 73021, 75934, 78158, 80769, 84833, 90344, 96526, 102994, 110233, 118790, 128455, 138671, 149444, 161235, 174028, 187219, 200540, 214455, 229369, 244935, 260454, 275418, 289211, 300727, 308836, 313072, 313531, 310373, 303848, 294534, 283021, 269453, 253798, 236512, 218548, 200745, 183557, 167323, 152387, 138908, 126771, 115771, 105739, 96600, 88457, 81461, 75421, 69767, 64193, 59072, 54870, 51365, 47923, 44424, 41336, 38880, 36656, 34234, 31662, 29224, 27168, 25838, 25589, 26178, 26562, 25731, 23626, 20947, 18300, 15961, 14259, 13570, 13721, 13910, 13531, 12829, 12438, 12553, 12916, 13361, 13754, 13494, 11851, 9144]
55422I144k212m95P16M56l93n77j59ll65p98j076j302j384C79e50r09o57L51a46
55402A944J583R10M79j00q30r22r5O83M59l89p98n06j28r1j51J24Q05J503J631
55383F111R70j5o67r86j434j981c5j473j006j020r76l46N14R97J151h91D11Q75
55365A286K17l86A9a950k314j486j1R39R77O12J98l62r14r95n36L7M98R39J170
55346c198P60j74q53q60o43o97q48o44r1M42P46R14J037J054Q25K72m54j017j157
55327d586r23n28j40Q0Rj59Q8R45J824a456b69f5m07m32qL65M1r76j711j262q7
55306d542N86L53n6q4Pl6P6N04P69M81oj61p2j18k44o3M76R09d45O2p90j209j005
55283c387o29n99p49m45L98J118J192P96K25n81j552k080j724q27QP04J345J512
$$ y = [9144, 6932, 6437, 7153, 7609, 7216, 6639, 6480, 6477, 6112, 5314, 4238, 2936, 1552, 379, -550, -1459, -2116, -1765, -146, 1944, 3527, 4437, 4916, 4816, 3986, 3064, 2969, 3652, 4111, 3722, 2924, 2418, 2290, 2199, 2048, 2172, 2977, 4480, 6111, 7081, 7066, 6399, 5413, 3979, 1998, -35, -1508, -2514, -3534, -4510, -4856, -4342, -3345, -2194, -891, 411, 1286, 1503, 1117, 19, -1950, -4264, -5750, -5761, -4822, -3845, -3233, -3035, -3397, -4311, -5306, -5842, -5805, -5307, -4368, -3198, -2438, -2612, -3465, -4325, -4968, -5665, -6513, -7157, -7248, -6806, -6060, -5146, -4109, -3055, -2230, -1958, -2412, -3429, -4586, -5509, -6037, -6177, -6097, -6088, -6247, -6159, -5214, -3390, -1456, -269, -65, -472, -904, -912, -547, -506, -1482, -3193, -4455, -4542, -3956, -3603, -3659, -3743, -3736, -3772, -3696, -3192, -2423, -1942, -1948, -2109, -2181, -2299, -2543, -2606, -2130, -1221, -445, -383, -1173, -2382, -3387, -4016, -4615, -5364, -5809, -5411, -4293, -3101, -2305, -2080, -2661, -4213, -6293, -8017, -8844, -8836, -8132, -6787, -5275]
55265e275P67m33j096q88l92j33l1J38L49N81Q99J127Q87K39k31j71L2j66o56
55246d453q19l26N27J164J189O32m6k62J51P61d28E15O22J56m32G5c81@I00N56
55226A456k05n61C23A25b51n50l20O8P9l39o71n02K8M78N79M26K71K56a69B4P9
55205A03J91N35O89K68n31A84g55l03L37a51A29a24n54m17j85l30p94j086j007
55186d497q94r84r64m10N52J338J544J248P51K54k00n97q15p31m27k31l31m62
55168e856k31K78N62M47L46O15R94J017O55L14K72a49C90L56q6B31a05l9j85q81
55148a210j294o84M29Q41K57l78k78J79K04j76k35L37i59C66J185R29O05M6o56
55129B475j113A72a073j605j923j603o47K30N23M83N17N12J84j93k9P06J366a059
$$ y = [-5275, -4508, -4941, -6037, -6925, -7317, -7450, -7481, -7343, -6994, -6413, -5514, -4387, -3500, -3261, -3492, -3663, -3631, -3797, -4453, -5272, -5598, -5071, -3907, -2718, -2086, -2132, -2394, -2243, -1482, -428, 515, 1137, 1293, 861, 75, -381, 0, 900, 1456, 1251, 690, 323, 125, -251, -801, -1121, -1053, -974, -1313, -1984, -2486, -2458, -1980, -1401, -975, -704, -448, -169, 24, 103, 294, 829, 1518, 1786, 1255, 184, -755, -1058, -721, -151, 129, -124, -678, -1095, -1280, -1610, -2404, -3490, -4497, -5391, -6375, -7339, -7749, -7197, -5859, -4315, -3067, -2316, -2062, -2262, -2859, -3674, -4405, -4832, -5063, -5394, -5856, -6087, -5809, -5247, -4800, -4454, -3839, -2845, -1828, -1173, -859, -587, -149, 390, 746, 660, 231, -105, -144, -329, -1210, -2504, -3188, -2759, -1918, -1661, -2039, -2317, -2138, -1934, -2110, -2345, -2008, -959, 366, 1551, 2480, 3085, 3131, 2475, 1362, 172, -1073, -2678, -4601, -6204, -6851, -6621, -6098, -5615, -5098, -4586, -4402, -4595, -4624, -3918, -2552, -1059]
55110A57Q50M01j65F11a25m54P5A88J143J155P72L70J67K2j60j15L68J051J529
55091F490J716J678J302N06l41p47p60q21r84q02p1P57J116R04L30l72q82q49
55073H170m08k45p19j210q96L6O08M35J85M67R87J168J037R30P41J62m69l83M87
55054A1083J234J143N68K58L11L04J41J23K61J48l71q95j055r63q96q22n90k75
55036I707l3K22O05Q78O58J0m77l61J70N34L32l82j180j522j084m9R51J272P42
55017A0993k38j008j157p73k39K47Q26J580K186K172J485N90K4n3Q8nn65j250
54999A4903j352n75M45P61J94n84j022j197j284j047k85O48J151J086P97N85M50
54982A3674K52r2m94o82m67p6P0NK24P91J015M49k83l19J43J34o23j372j398p55
$$ y = [157, 1007, 1408, 1243, 611, -125, -579, -504, 188, 1331, 2486, 3258, 3628, 3795, 3817, 3657, 3542, 3910, 4961, 6490, 8206, 9884, 11186, 11692, 11351, 10604, 9844, 9023, 8039, 7237, 7166, 7923, 9039, 9943, 10273, 9901, 9019, 8170, 7762, 7517, 6798, 5588, 4692, 4728, 5336, 5771, 5956, 6423, 7410, 8578, 9615, 10545, 11286, 11448, 10979, 10596, 11083, 12317, 13460, 14028, 14286, 14597, 14901, 15042, 15165, 15426, 15574, 15203, 14308, 13253, 12290, 11394, 10572, 9982, 9707, 9674, 9896, 10501, 11379, 12037, 12047, 11570, 11209, 11379, 11913, 12245, 11863, 10683, 9161, 8077, 8028, 8979, 10251, 10993, 10755, 9747, 8590, 7817, 7578, 7825, 8651, 10231, 12417, 14589, 16074, 16664, 16688, 16635, 16723, 16718, 16153, 14903, 13551, 12976, 13421, 14182, 14376, 13792, 12770, 11573, 10289, 9242, 8957, 9605, 10756, 11842, 12639, 13224, 13674, 13926, 13834, 13340, 12658, 12191, 12115, 12185, 12190, 12414, 13205, 14220, 14669, 14386, 14067, 14210, 14344, 13721, 12349, 10951, 10196]
54962A0196J69J080J572J255L96j41O3M68M60J92J39K77K72J32J53L23K92j17
54944A7181o37q31m28M66J359J726J566J423J658K057K329K701L626N042O344
54929D5582O974O830O257N800N768N734M732K304q03l345m804n548o054o365o343
54914E6719n960n332m690m283m025l420k199q80k62m45q30j041j287j675j808
54899A8582j316m46K63O09P86R81J236J551J945K459L204M302N614O636O894O439
54883E9739N735N056M161K694Q48p36j732k555l705m990n728n701n336m956m363
54868C8431l432k594k305k434k483k174j524p04j82n09j497k027j257K61J236
54853A6806J146M61k34o11l88L38P36O5j086j380n81J76J21j82m2J89j64r22j348
$$ y = [10196, 10365, 11445, 13017, 14272, 14668, 14527, 14590, 15058, 15518, 15710, 15849, 16126, 16398, 16530, 16683, 17006, 17298, 17181, 16544, 15713, 15285, 15751, 17110, 18836, 20402, 21825, 23483, 25540, 27869, 30570, 34196, 39238, 45582, 52556, 59386, 65643, 71443, 77211, 82945, 87677, 89981, 89178, 85833, 81029, 75481, 69427, 63062, 56719, 50759, 45427, 40737, 36454, 32429, 29009, 26810, 25930, 25668, 25223, 24393, 23352, 22065, 20390, 18582, 17266, 16820, 17083, 17692, 18478, 19459, 20695, 22246, 24191, 26650, 29854, 34156, 39770, 46406, 53300, 59739, 65474, 70530, 74691, 77385, 78233, 77497, 75765, 73210, 69505, 64515, 58787, 53086, 47750, 42794, 38431, 34999, 32405, 30100, 27666, 25183, 23009, 21485, 20781, 20599, 20090, 18593, 16566, 15309, 15570, 16806, 17952, 18413, 18179, 17568, 17180, 17518, 18254, 18319, 17233, 15853, 15272, 15448, 15569, 15387, 15345, 15534, 15370, 14448, 13100]
54834A3100j142n29K14Q00Q00J12p51j194j118o75O1P81Q82K81k33m8K93Nn19
54815A1120k45P37J076O4j279j478m17P38J018N42L9m9J81M40N78N59L35l7k49
54796A3673m4L69N76O09R24J546J783J187L12N8N40J150J487J637J738J815K038
54779C1398K580L269L799M255M903N522N510M734L790L213K822K106Q67o74k130
54764G5964l158l575l463l056k489j866j477j632k209k605k321j408l52L66N66
54749D7285M46L62M47N09M35M06M89K84n59j627k067j566n55M51J281J873K256
54732E0150K763L746M907N458N061M122L030J737K86r30j800k779m042m945m884
54717F1880m236l818l751l574l218l065l103k790j939j146j010j378j604j324
$$ y = [13100, 11958, 11429, 11643, 12443, 13243, 13355, 12604, 11410, 10292, 9617, 9678, 10459, 11341, 11622, 11389, 11341, 11634, 11639, 11120, 10875, 11612, 12688, 12752, 11473, 9995, 9578, 10316, 11334, 11876, 11915, 11866, 12047, 12487, 13065, 13624, 13959, 13922, 13673, 13629, 13998, 14574, 15183, 16107, 17653, 19436, 20623, 20935, 20993, 21533, 22683, 24170, 25807, 27545, 29360, 31398, 33978, 37247, 41046, 45301, 50204, 55726, 61236, 65970, 69760, 72973, 75795, 77901, 78768, 78094, 75964, 72806, 69231, 65768, 62712, 60223, 58357, 56880, 55248, 53039, 50434, 48113, 46705, 46353, 46719, 47285, 47731, 48093, 48540, 49049, 49484, 49890, 50379, 50663, 50104, 48477, 46410, 44844, 44289, 44740, 46021, 47894, 50150, 52913, 56659, 61566, 67024, 72085, 76207, 79237, 80974, 81260, 80330, 78530, 75751, 71709, 66764, 61880, 57644, 53826, 50075, 46501, 43283, 40218, 37115, 34325, 32386, 31240, 30230, 28852, 27248, 25924]
54703B5924p54l71m31p34p92l69K04L20k82j282k021j916q97L51Q54L68k97l68
54685A7507j03j36j85N80J931K443J468K53K86J218J444M22p22r25m91k35k00
54668B4555J31P64J057N91l08r86j095p69l71j20N2K85M67L34p1k79M1O31J031
54649B5940J222J590K288L013L413L458L336L267L356L452L096K065Q58L10M99
54634F1163N74r6j066j555j675k177l131l593k891j579p74q71j365j723j863j802
54618C5576j377n85J51L60J02j87k92l65m55l67j47k80j021j793j760r45k00n8
54600B6357j33J34O44R65J027R89O96j36j250j918j752j063l74R1L41M54O19R80
54582B6671J321J170M14m77r69r65o19q1L34J26p38j411j047J2N45O9n44l65L00
$$ y = [25924, 25170, 24799, 24368, 23634, 22842, 22473, 22677, 22997, 22715, 21433, 19412, 17496, 16599, 16950, 17804, 18172, 17875, 17507, 17404, 17268, 17083, 17663, 19594, 22037, 23505, 23758, 24044, 25262, 26706, 27128, 26406, 25481, 24990, 24755, 24555, 24686, 25450, 26507, 27098, 26790, 25804, 24709, 23940, 23569, 23449, 23501, 23786, 24253, 24587, 24516, 24237, 24278, 24909, 25940, 27162, 28752, 31040, 34053, 37466, 40924, 44260, 47527, 50883, 54335, 57431, 59496, 60354, 60664, 61163, 61737, 61641, 60575, 59020, 57345, 55168, 52037, 48444, 45553, 43974, 43200, 42329, 40964, 39241, 37378, 35576, 34199, 33614, 33765, 34125, 34227, 34040, 33748, 33383, 32928, 32561, 32414, 32134, 31113, 29320, 27560, 26615, 26415, 26357, 26224, 26358, 27002, 27967, 28994, 29983, 30679, 30543, 29293, 27375, 25623, 24560, 24186, 24277, 24618, 25072, 25691, 26671, 27992, 29162, 29576, 29099, 28130, 27165, 26546, 26465, 26799, 26925, 26187, 24776, 23729, 23741, 24286, 24355, 23811, 23446, 23746]
54563B3746M76Ol19j0M95O35N37O06P51N91J94Q4N03J077J263Q62Q6o41r24p32
54543B9286m51l86l24J15P55J021P70M40K86J28K3M92J613K484K262J363Q97J183
54525D1957J507J271N92j94r32j367j163m83m4k72p82j010r74j012j153j179j115
54508C3647j178j307j126n23J35M42M08K77R5k37n92n68p2M18M11P8o4k0k68p69
54488B9187o99L70J619J905J176L31m4o8J51P76J637K155K051J654J281Q54K81
54471D4617l07q69j455j737j220j36N67M74K18L20K41o03j639j817j148n73n07
54454C4426m29K3M69M47N0l95o72n69N2Q62J208Q90M17K40K11N4m4K56P97R94
54434C9287N41k42p39o35j94k5m36j027j110n28K04N49M64J58k09m42k31M39J081
$$ y = [23746, 24222, 24228, 23909, 23899, 24394, 25029, 25566, 26172, 26923, 27514, 27708, 27792, 28295, 29372, 30635, 31497, 31583, 30942, 30018, 29286, 28835, 28449, 28125, 28240, 28995, 30016, 30786, 31226, 31512, 31640, 31663, 32155, 33768, 36252, 38514, 39877, 40774, 41957, 43464, 44735, 45327, 45133, 44201, 42834, 41671, 41188, 41144, 40872, 40090, 39080, 38106, 37094, 35941, 34762, 33647, 32469, 31162, 30036, 29513, 29648, 30090, 30498, 30775, 30870, 30633, 30041, 29473, 29401, 29819, 30230, 30308, 30244, 30224, 29956, 29187, 28488, 28858, 30477, 32382, 33558, 33889, 33845, 33777, 33928, 34704, 36341, 38496, 40547, 42201, 43482, 44336, 44617, 44310, 43441, 41986, 40249, 39029, 38893, 39460, 39934, 40152, 40472, 40713, 40110, 38471, 36654, 35506, 34933, 34426, 33997, 34020, 34489, 34936, 34986, 34591, 33919, 33350, 33402, 34264, 35472, 36362, 36779, 37019, 37230, 37284, 37240, 37496, 38293, 39287, 39828, 39586, 38847, 38212, 38018, 37993, 37557, 36530, 35420, 34892, 35096, 35645, 36109, 36267, 36058, 35616, 35385, 35824, 36905]
54415C6905J178Q10M63M12N17O10O82P42P80R12J256J596J423N48n69j233j187
54398D5845p30k94j02j36k49k52q8M8p3l42l37J56P78R63N46j24o24p79o45m22
54378D3139l91o49q04l09P39J466J177K47k97M2Q10J206Q38r5j002j278q12j86
54360D3841n9l41l60J29N52K95n22j322j718j618j039k42K56K08NQ2K50Q2k40
54341C8239j33L96O50L05j00m0K33J85j89n08o05n60l95k01l51j062j887k071
54323C1906j434m85K36N11L22j50m09l7P31J303J489J527J349O31l23n86M0M89
54305C7110r0r48p10O11J572J191K8q51j169j268j237q39r7N57P47N54L28K77
54287C5766K72J23r0o9K40M63K58j83l15J12Q27J368J462J135O23J73j82n25p10
$$ y = [36905, 38083, 38893, 39356, 39768, 40285, 40895, 41577, 42319, 43099, 44011, 45267, 46863, 48286, 48834, 48265, 47032, 45845, 45115, 44821, 44719, 44583, 44334, 44082, 43994, 44042, 43969, 43627, 43290, 43446, 44224, 45187, 45733, 45609, 44985, 44206, 43561, 43139, 42748, 42099, 41295, 40986, 41725, 43191, 44368, 44615, 44318, 44360, 45170, 46376, 47214, 47119, 46117, 44839, 44027, 43841, 43782, 43441, 43081, 43210, 43762, 44057, 43535, 42213, 40495, 38877, 37838, 37596, 37852, 38060, 38065, 38147, 38397, 38479, 38239, 38106, 38502, 39152, 39457, 39357, 39317, 39550, 39735, 39546, 39038, 38433, 37873, 37478, 37277, 36926, 35864, 33977, 31906, 30472, 29987, 30223, 30734, 31056, 30906, 30497, 30460, 31191, 32494, 33983, 35510, 36859, 37490, 37167, 36581, 36621, 37110, 37020, 36072, 35362, 35973, 37545, 38736, 38764, 37913, 36744, 35476, 34239, 33400, 33303, 33860, 34607, 35161, 35489, 35766, 36038, 36161, 36071, 36002, 36242, 36705, 36963, 36780, 36465, 36577, 37404, 38772, 40234, 41369, 41992, 42165, 41983, 41458, 40748]
54268D0748m42J30L57m2m87m06j84m89j036r39j52M31M05L35N18L37n59j387j313
54249C5825p34n81q73q30j86M91O88M38m2n32o86l00K88N42M13K52J43l6p1L95
54229C4604J082J205N35l17q27j078j143o80L38J139R85J80m12n20n85q66j121
54212C2519j165j156j151q49r2O79Q68M42r3l74n02n95m66N7O39P67M54K97O47
54193C0926J102J073N87J91K05M53O84Q74J060J161J108Q67L55m70j335j776j655
54176C5410j374j366j588j613j103j39Q09J166P06j30n72l13J97L16j15q10j391
54159B8090j499r05Q9O11J09p89q48J81J185J129M06J48N76P82J79n85n82Q6M83
54140B8846J68l21l73o8J77L01M91N88J91o20j158r04j75K80K05J6J25L53K74
$$ y = [40748, 40306, 40436, 40793, 40751, 40264, 39858, 39674, 39185, 38149, 37210, 37058, 37489, 37894, 38229, 38747, 39084, 38525, 37138, 35825, 35091, 34510, 33637, 32807, 32621, 33112, 33800, 34238, 34196, 33664, 32978, 32678, 32966, 33508, 33921, 34173, 34316, 34280, 34209, 34604, 35686, 36891, 37426, 37109, 36282, 35204, 34061, 33381, 33719, 34858, 35843, 36023, 35611, 35091, 34506, 33640, 32519, 31354, 30198, 29047, 28198, 28106, 28785, 29653, 30095, 30002, 29628, 29126, 28531, 28065, 28122, 28761, 29528, 29982, 30279, 30926, 32028, 33101, 33688, 33879, 34084, 34537, 35221, 36095, 37155, 38316, 39424, 40291, 40646, 40176, 38841, 37065, 35410, 34036, 32670, 31082, 29469, 28366, 28227, 29036, 30202, 30908, 30778, 30206, 29893, 30090, 30406, 30291, 29481, 28090, 26591, 25686, 25775, 26386, 26495, 25706, 24858, 25039, 26224, 27353, 27759, 27907, 28483, 29265, 29444, 28859, 28277, 28363, 28846, 29014, 28693, 28320, 28252, 28429, 28730, 29221, 29809, 30000, 29380, 28222, 27318, 27143, 27423, 27628, 27644, 27769, 28122, 28396]
54121B8396j61n31m91j27K57N18O79P30O29M11J42j82m86m51K04J254J997J927
54103C4715J203M02q8k75l73n49q31j062j006n47J43O92P79M34J05K86R40J458
54085C6426J390J023Q85R05N79p7l60J38R83J562J740J564R40R2k33K97R17P23
54067D9494qk51K52P22O14K98L15O86J183J707K067J936J316O45K85K42N10J202
54049F3215K152K912L383L908M520M681M179L659L727M032L871L342L205L742
54035A14528M422M623M174L212K073J275J108J204R64L75o2k16n39j243j908k227
54019A31763k611l517m521m649l600k160j344j485k253l213m074m539m388l775
54005H5634l241l095k972k292j136k54o7j09J17K19n74k041k909k311q35L37P84
$$ y = [28396, 28235, 27704, 27213, 27086, 27343, 27861, 28540, 29270, 29899, 30310, 30452, 30270, 29784, 29333, 29537, 30791, 32788, 34715, 35918, 36320, 36232, 35957, 35584, 35035, 34204, 33142, 32136, 31589, 31732, 32424, 33203, 33637, 33742, 34028, 34968, 36426, 37816, 38839, 39724, 40629, 41208, 41131, 40771, 40909, 41892, 43454, 45194, 46758, 47698, 47790, 47557, 47854, 48771, 49494, 49486, 49235, 49487, 50209, 50823, 51121, 51436, 52122, 53305, 55012, 57079, 59015, 60331, 60976, 61261, 61503, 62013, 63215, 65367, 68279, 71662, 75570, 80090, 84771, 88950, 92609, 96336, 100368, 104239, 107581, 110786, 114528, 118950, 123573, 127747, 130959, 133032, 134307, 135415, 136619, 137583, 137958, 137896, 137680, 137141, 135898, 133990, 131763, 129152, 125635, 121114, 116465, 112865, 110705, 109361, 107876, 105623, 102410, 98336, 93797, 89409, 85634, 82393, 79298, 76326, 74034, 72898, 72644, 72577, 72468, 72585, 72804, 72230, 70189, 67280, 64969, 64134, 64471, 65255]
53988F5255R34J120J141P58J08m99q46q53o09m24n62q36p77k84J41ro53j260j344
53969F0501p11M91J687K097J406J64p28q90n98k71j47k80m49j49Q98K230L060
53952F8311L146K859K397J640Q73Q72J832K819K904K415K354K956L601L962M363
53937A07304M957N349N324N241N367N382N028M761N167N958O179N366M017K938
53923A78338K496K622L102L604L769L527L269L398L765L768K988J621K34p02j056
53908B14743j043j147j745k703l411l473l137k878k840l031l683m883o021o336
53894A68412o021n978o347o179m980l718l497l950l841k878j945j717j969k275
53880A13117k511k529k111j507j373j926k640k962k864k532k052j627j579j889
$$ y = [65255, 66189, 67309, 68450, 69208, 69316, 68817, 67971, 67118, 66509, 66085, 65523, 64687, 63910, 63626, 63767, 63758, 63105, 61845, 60501, 59790, 60281, 61968, 64065, 65471, 65635, 64907, 64017, 63419, 63148, 63001, 62721, 62272, 62123, 63021, 65251, 68311, 71457, 74316, 76713, 78353, 79226, 80098, 81930, 84749, 87653, 90068, 92422, 95378, 98979, 102941, 107304, 112261, 117610, 122934, 128175, 133542, 138924, 143952, 148713, 153880, 159838, 166017, 171383, 175400, 178338, 180834, 183456, 186558, 190162, 193931, 197458, 200727, 204125, 207890, 211658, 214646, 216267, 216501, 215799, 214743, 213700, 212553, 210808, 208105, 204694, 201221, 198084, 195206, 192366, 189335, 185652, 180769, 174748, 168412, 162391, 156413, 150066, 143887, 138907, 135189, 131692, 127742, 123901, 121023, 119078, 117361, 115392, 113117, 110606, 108077, 105966, 104459, 103086, 101160, 98520, 95558, 92694, 90162, 88110, 86483, 84904, 83015]
53866H3015k161k196k180k148j820j168o35m62l29j3R4m25j304j913j984j638
53850F2733j029l02K35L47J19k09m84n91m45j85%L10J091K017K162J232Q8m44
53832F6645o02r27j142o78J50N01L18L52Q90J351J319J158J350J826K236K456
53816G7203K592K824L260L701L655L009K498K891L789M056L423K803K819K947
53802A21470K611K203K300K559K262J513R56N64k46j340j736j069l12n17j469
53787A29749k197k360k400k630k913l196l594l871l506k549j796j741j949j887
53773I3160j836k256k801k769k256j974k004j701q77j25J76K80J96n35j694k082
53757G0902j144nJ1p87j121o71j65LR2J02k60p51p52l38k50o47q84o76n27p25
$$ y = [83015, 80854, 78658, 76478, 74330, 72510, 71342, 70707, 70245, 69916, 69903, 69997, 69572, 68268, 66355, 64371, 62733, 61704, 61402, 61637, 61984, 62103, 61894, 61410, 60819, 60374, 60189, 60189, 60499, 61590, 63607, 65769, 67001, 67089, 66645, 66043, 65116, 63974, 63296, 63446, 63947, 64265, 64617, 65507, 66858, 68177, 69335, 70685, 72511, 74747, 77203, 79795, 82619, 85879, 89580, 93235, 96244, 98742, 101633, 105422, 109478, 112901, 115704, 118523, 121470, 124081, 126284, 128584, 131143, 133405, 134918, 135874, 136438, 136192, 134852, 133116, 132047, 131735, 131218, 129749, 127552, 125192, 122792, 120162, 117249, 114053, 110459, 106588, 103082, 100533, 98737, 96996, 95047, 93160, 91324, 89068, 86267, 83498, 81242, 79268, 77264, 75563, 74686, 74561, 74737, 75017, 75213, 74678, 72984, 70902, 69758, 69753, 69764, 68977, 67856, 67185, 67020, 67023, 67115, 67217, 66957, 66206, 65454, 65116, 64866, 64219, 63335, 62659, 62132, 61407]
53737F1407q65o83m86l80P2R73J621J466Q56L49qk20O6Q81J513J500J377J712
53719G1151K007J498N03PK16M82N61Q46J388J634J324R13Q10Q65Q18P14O43N56
53701H6936N41Q37J366J678J601J467J574J796J931K008K039J851J389R23O70
53686A08607N42M47M83O23N67J88k28m71q16j519k181k094j145M9Q63J161J104
53669A06180Q32M17o0m80o65m33P8L32l4o22o82j48J56m10j393j751j086J4P83
53650A01028J051J124J219J251J093P68L99O1j61j45J63O12R75J165J258J267
53634A13128J074P13M85O33R61J055Q44O41O47P39Q45J170J789K360K538K470
53618A32092K471K399J864J027O60J176K054K470K230J727J313J073J080J406
$$ y = [61407, 60542, 59859, 59373, 58993, 59065, 60038, 61659, 63125, 63981, 64330, 64322, 64102, 64168, 65049, 66562, 68062, 69439, 71151, 73158, 74656, 75159, 75166, 75382, 75864, 76425, 77271, 78659, 80293, 81617, 82530, 83340, 84205, 85023, 85737, 86380, 86936, 87477, 88314, 89680, 91358, 92959, 94426, 96000, 97796, 99727, 101735, 103774, 105625, 107014, 107937, 108607, 109149, 109596, 110079, 110702, 111269, 111457, 111229, 110758, 109942, 108423, 106242, 104148, 103003, 103052, 103915, 105076, 106180, 107012, 107429, 107369, 106889, 106224, 105791, 105869, 106201, 106167, 105545, 104863, 104715, 104871, 104461, 103068, 101317, 100231, 100245, 101028, 102079, 103203, 104422, 105673, 106766, 107534, 107933, 107994, 107833, 107688, 107851, 108463, 109438, 110603, 111861, 113128, 114202, 114915, 115400, 116033, 116994, 118049, 118893, 119534, 120181, 120920, 121765, 122935, 124724, 127084, 129622, 132092, 134563, 136962, 138826, 139853, 140513, 141689, 143743, 146213, 148443, 150170, 151483, 152556, 153636, 155042]
53604A55042J883K190K295K480K852L048K665J857J206J084J279J375J278J195
53590A81729J102O26l68j316j496j029q37j464k303k377j597p98o81j135j599
53575A66457j619j026KQ21O78m74j710j966j101Q5P35N90n6p22j018p99k78J72
53557A58771L89N19P24R51J025R16P62P12Q40J122J416J518J408J356J615K075
53541A76119K384K429K439K543K570K476K603L214L971M324M334M627N447O224
53527B25704O321N859N524N762O546P702R064J0212J0480R579Q183P610Q636J0663
53513C37845J2241J2599J2405J2841J4136J5391J5779J5449J5165J5348J5739
53502D94938J5827J5474J5146J5451J6309J6784J6100J4680J3684J3613J3936
$$ y = [155042, 156925, 159115, 161410, 163890, 166742, 169790, 172455, 174312, 175518, 176602, 177881, 179256, 180534, 181729, 182831, 183457, 183089, 181773, 180277, 179248, 178411, 176947, 174644, 172267, 170670, 169872, 169191, 168056, 166457, 164838, 163812, 163814, 164635, 165313, 164839, 163129, 161163, 160062, 160147, 160882, 161472, 161416, 160694, 159676, 158877, 158599, 158771, 159160, 159679, 160403, 161354, 162379, 163295, 164057, 164769, 165609, 166731, 168147, 169665, 171073, 172429, 174044, 176119, 178503, 180932, 183371, 185914, 188484, 190960, 193563, 196777, 200748, 205072, 209406, 214033, 219480, 225704, 232025, 237884, 243408, 249170, 255716, 263418, 272482, 282694, 293174, 302753, 310936, 318546, 327182, 337845, 350086, 362685, 375090, 387931, 402067, 417458, 433237, 448686, 463851, 479199, 494938, 510765, 526239, 541385, 556836, 573145, 589929, 606029, 620709, 634393, 648006, 661942]
53491F61942J4095J4146J4225J4145J3853J3656J3557J3081J2181J1698J2169
53480H08748J2874J2802J2076J1518J1288J0879J0244R769R262P969N791L548
53468I26768J869O10n41j669l018m866o821q047q500r024r917j0355r815r152
53454H47522r426j0395j1116j1470j2094j3070j3745j3812j3699j3759j3768j3511
53442F97657j3263j3262j3188j2455j0878q780o616m731l356k567k121j583p67
53429F04090jK47O0Q6Q20K037L232M322N546O857P865Q380Q619Q851R203R812
53413F80026J0807J2126J3602J5175J6714J7820J8271J8523J9179K0121K0841
53402H63205K1521K2925K5139K7298K8812L0000L1252L2419L3451L4700L6075
$$ y = [661942, 676037, 690183, 704408, 718553, 732406, 746062, 759619, 772700, 784881, 796579, 808748, 821622, 834424, 846500, 858018, 869306, 880185, 890429, 900198, 909460, 917429, 923220, 926768, 928637, 929247, 928706, 927037, 924019, 919153, 912332, 904285, 895785, 886761, 876844, 866489, 856674, 847522, 838096, 827701, 816585, 805115, 793021, 779951, 766206, 752394, 738695, 724936, 711168, 697657, 684394, 671132, 657944, 645489, 634611, 625831, 619215, 614484, 611128, 608561, 606440, 604857, 604090, 604089, 604336, 604396, 604482, 605302, 607339, 610571, 614893, 620439, 627296, 635161, 643541, 652160, 661011, 670214, 680026, 690833, 702959, 716561, 731736, 748450, 766270, 784541, 803064, 822243, 842364, 863205, 884726, 907651, 932790, 960088, 988900, 1018900, 1050152, 1082571, 1116022, 1150722, 1186797]
53391A186797L6807L6699L6735L7639L8616L8427L7082L5462L3907L2257L0818
53380A581246L0059K9498K8034K5389K2307J9394J6659J4119J1843R432O383L107
53368A797470N49j357l902p950j2949j7886k2333k6191k9281l1741l4100l6393
53356A573936l7782l7627l6400l5047l3943l3002l2238l1572l0525k8797k6956
53345A210047k5907k5837k6144k6288k6181k5886k5372k4661k3813k2814k1678
53334I35466k0580j9592j8458j6868j4867j2755j0758r119q220q220q634q788
53322G78607q602q532q748q862q609q304q316q431q166p509o856o251n200l504
53308F72717j792p76j70R38K676M071M497M666N487O624P150P331Q450J0760J2869
$$ y = [1186797, 1223604, 1260303, 1297038, 1334677, 1373293, 1411720, 1448802, 1484264, 1518171, 1550428, 1581246, 1611305, 1640803, 1668837, 1694226, 1716533, 1735927, 1752586, 1766705, 1778548, 1787980, 1794363, 1797470, 1798019, 1796662, 1792760, 1784810, 1771861, 1753975, 1731642, 1705451, 1676170, 1644429, 1610329, 1573936, 1536154, 1498527, 1462127, 1427080, 1393137, 1360135, 1327897, 1296325, 1265800, 1237003, 1210047, 1184140, 1158303, 1132159, 1105871, 1079690, 1053804, 1028432, 1003771, 979958, 957144, 935466, 914886, 895294, 876836, 859968, 845101, 832346, 821588, 812469, 804249, 796029, 787395, 778607, 770005, 761473, 752725, 743863, 735254, 726950, 718634, 710203, 702037, 694528, 687672, 681421, 676221, 672717, 670925, 670149, 669979, 670917, 673593, 677664, 682161, 686827, 692314, 698938, 706088, 713419, 721869, 732629, 745498]
53293G45498J3704J4025J5122J6858J8067J8371J8425J8543J8276J7402J6342
53282I30633J5338J4080J2505J1113J0091Q836O901M741K919J140j127l505n107
53269A008558n929o948q679j0534j1798j2611j3533j4667j5701j6487j7131j7690
53257H56850j8189j8714j9186j9200j8526j7603j7149j7286j7458j7157j6386
53246F59996j5374j4343j3647j3673j4344j5000j5041j4496j3746j2991j2245
53235E05096j1664j1461j1500j1318j0593r411q040o664n433m574m309m645n323
53222D00161n986o334o233n789n353n318n811o620p528q525r494r907r308q109
53208B99846p337p349p368o670n696n363n672n788n228m259l199k275k079l166
$$ y = [745498, 759202, 773227, 788349, 805207, 823274, 841645, 860070, 878613, 896889, 914291, 930633, 945971, 960051, 972556, 983669, 993760, 1002596, 1009497, 1014238, 1017157, 1018297, 1017170, 1013665, 1008558, 1002629, 995681, 987002, 976468, 964670, 952059, 938526, 923859, 908158, 891671, 874540, 856850, 838661, 819947, 800761, 781561, 763035, 745432, 728283, 710997, 693539, 676382, 659996, 644622, 630279, 616632, 602959, 588615, 573615, 558574, 544078, 530332, 517341, 505096, 493432, 481971, 470471, 459153, 448560, 439149, 431109, 424445, 419012, 414438, 410129, 405484, 400161, 394175, 387841, 381608, 375819, 370466, 365148, 359337, 352717, 345189, 336664, 327170, 317263, 307955, 299846, 292509, 285160, 277792, 271122, 265426, 260063, 254391, 248603, 243375, 239116, 235917, 233642, 231563, 228397]
53194B28397m966o011n641m671m099l945l896m087m589m837m455l926l699l303
53180A66272k249j204j103j617j696j314j355j832j687n38N85P36J56n64j399
53165A51191k321k725k212j362r84j050j008p52o52q59j205j575j897j988j800
53150A28801j642j758j941j937j927k106k081j270J34J180J243O14n1m41n64l70
53134A15884J99R14J269R40J52n27p59p37q53j198j549j734j762j637j311q82
53118A06409n86n13n30n63p01r53j125j135j146j285j370j100m64K33O40O29L17
53101I6757j04n67j126j701k017j864j277l49Q24J721J463j48j882k204j073J09
53085H6562L72P3k10o07j205j289k69J168J739J163L20k2R1L10M94N73M67K90
$$ y = [228397, 223431, 217420, 211779, 207108, 203009, 199064, 195168, 191081, 186492, 181655, 177200, 173274, 169575, 166272, 164023, 162819, 161716, 160099, 158403, 157089, 155734, 153902, 152215, 151677, 152262, 152998, 153154, 152590, 151191, 148870, 146145, 143933, 142571, 141587, 140537, 139529, 138777, 138125, 137266, 136061, 134486, 132589, 130601, 128801, 127159, 125401, 123460, 121523, 119596, 117490, 115409, 114139, 114273, 115453, 116696, 117310, 117259, 116818, 116254, 115884, 116083, 116997, 118266, 119206, 119358, 118831, 118072, 117335, 116482, 115284, 113735, 112001, 110239, 108602, 107291, 106409, 105823, 105310, 104780, 104217, 103516, 102563, 101438, 100303, 99157, 97872, 96502, 95402, 94938, 95171, 95811, 96440, 96757, 96653, 96086, 94960, 93259, 91242, 89378, 88101, 87752, 88576, 90297, 91760, 91612, 89730, 87526, 86453, 86562, 86934, 87007, 86797, 86190, 84985, 83696, 83427, 84595, 86334, 87497, 87817, 87795, 87886, 88196, 88690, 89263, 89730, 90020]
53067I0020K17J33k09o55p53m79l77p78j259j186n58L2R7l21q27j078r98p65n76
53048G9680m66l47k35l29p10j092r64j33R75J626J465Q15K73O3m7k71m49l13K1
53029G9562P7l92r16o78N19J814K167J562R44Q96R64N57k8j07K63M18J56n4pn0
53009H7667k60j36N38J153J128Q00Q91J401J645J235N25P2M6K21K98J38j84n36
52991I6642q43j000p55J6R25J372J275J125J210J172O06k84r17r19l46M90J176
52974A00945J419J304J128R53N76J2m36o17o36m19K09R04Q78l2j001j287j108
52957A02792r93q88m85L3K82L45N31P41O21J98k02m40n22l76p0Kl25o03l96O8
52937A00313L07K85J32k76q39q68n4O90L10p70j249r14p82j234j367n68M01M76
$$ y = [90020, 90237, 90370, 90161, 89506, 88753, 88274, 87897, 87119, 85860, 84674, 84116, 84148, 84245, 83924, 83097, 82019, 81021, 80256, 79680, 79214, 78867, 78632, 78303, 77593, 76501, 75537, 75404, 76379, 78005, 79470, 80285, 80558, 80621, 80574, 80303, 79854, 79541, 79562, 79639, 79247, 78331, 77653, 78172, 79986, 82153, 83715, 84659, 85555, 86519, 87076, 87048, 86941, 87204, 87622, 87778, 87724, 87717, 87667, 87407, 87271, 87809, 88962, 90090, 90890, 91781, 93182, 94827, 96062, 96587, 96659, 96705, 96926, 97224, 97362, 97178, 96642, 95799, 94799, 94044, 94060, 94985, 96357, 97632, 98757, 99967, 101139, 101745, 101461, 100544, 99625, 99279, 99769, 100945, 102364, 103668, 104796, 105749, 106325, 106337, 105901, 105284, 104648, 104229, 104438, 105342, 106220, 106188, 105187, 103900, 102792, 101799, 100911, 100426, 100459, 100741, 101086, 101617, 102358, 102979, 103177, 102975, 102535, 102013, 101637, 101567, 101569, 101244, 100641, 100245, 100313, 100620, 100905, 101037, 100761, 99922, 99054, 99000, 99690, 100000, 99230, 97981, 97067, 96285, 95051, 93684, 93116, 93517, 93993]
52919I3993k65r18r35m75PR4l13p73o84j07K28j36q06j099p49M3Q31J086O10q7
52899H9545l30k01l41p93q52l30k0m36r01o29OJ03k94l12L17Q40N93j52o84o65
52879H4464k22M07J020J437J614J715J908K048J703O98n16j193j151j011j390
52864I1531k116k596k698k742k807k612k120j628j183n64P4K17o3O0R65J841J769
52847G5328J028O06P17O72O6o40q55n98k71r6l5J8J35L01L61J75j15j44K42P10
52827G7605P65L14k57n24m78l72k37J64P33Q05q9j466k326k266j678r37j8Q70
52809G0608J108M58m07p45o76p32p92k39R20J744J414K07q54j048m62L49R14J027
52791G2794O59r0q98j273r62k95J16K8k53l60k23J32P36J399J591R90po00l97
$$ y = [93993, 93728, 92810, 91875, 91400, 91407, 91501, 91188, 90415, 89731, 89624, 89852, 89716, 88910, 87811, 87062, 87105, 87936, 89022, 89632, 89545, 89215, 89014, 88673, 87880, 87028, 86698, 86678, 86242, 85341, 84712, 84718, 84821, 84527, 84215, 84532, 85372, 85965, 85813, 85129, 84464, 84242, 84649, 85669, 87106, 88720, 90435, 92343, 94391, 96094, 96792, 96276, 95083, 93932, 92921, 91531, 89415, 86819, 84121, 81379, 78572, 75960, 73840, 72212, 71029, 70465, 70539, 70756, 70693, 70753, 71718, 73559, 75328, 76356, 76962, 77679, 78351, 78417, 77777, 76922, 76324, 76053, 75957, 75922, 75940, 76075, 76376, 76737, 76912, 76797, 76653, 76895, 77605, 78370, 78684, 78427, 77903, 77425, 77053, 76816, 76980, 77713, 78518, 78429, 76963, 74637, 72371, 70693, 69756, 69738, 70608, 71716, 72174, 71767, 71022, 70346, 69614, 68822, 68583, 69503, 71247, 72661, 72868, 72014, 70966, 70504, 70853, 71767, 72794, 73453, 73363, 72465, 71192, 70230, 69935, 70051, 70079, 69826, 69466, 69243, 69375, 70111, 71510, 73101, 74091, 74084, 73484, 73087]
52772G3087L33J036J308J004K85m31p69o89m51k98l17m85o80p01m63j72q2j25
52754G1390K7M73Q96R21N33M3k45j68L47J168J797J691R33K58J75K93l9o05m90
52735G9398N62J727K300K596L098L379K683J276K93K39N15M92K86K55L51L63K86
52718A00099J49j45n32p29o55n81o87p99p69o66m64L2P29J100Q60L64Q0N8J42
52699I7586L79P78J056R38N49J78p0k08k46l11o33j132j341j041n80l44k68j49
52681I5141q5k42n21p65j013j250j279j132j173j454j441q17p9J21j06k49j90
52664H3466j17M3M08O32L28j56j33L26M46j27r05j328j334j046m66K56P34P55
52646H1782N20L37L31M54N82N39L30K06K94L34J64J48O39J216J143M85Q1K63M06
$$ y = [73087, 73420, 74456, 75764, 76768, 77053, 76622, 75853, 75164, 74713, 74415, 74098, 73613, 72933, 72232, 71769, 71597, 71515, 71390, 71417, 71890, 72786, 73707, 74240, 74283, 74038, 73870, 74217, 75385, 77182, 78873, 79806, 80064, 80239, 80532, 80493, 79888, 79398, 79960, 81687, 83987, 86583, 89681, 93060, 95743, 97019, 97312, 97551, 98066, 98558, 98844, 99099, 99450, 99813, 100099, 100248, 100103, 99571, 98842, 98187, 97606, 96919, 96120, 95351, 94685, 94221, 94253, 94982, 96082, 96942, 97306, 97386, 97444, 97586, 97965, 98743, 99799, 100737, 101286, 101464, 101394, 101186, 100940, 100629, 99996, 98864, 97523, 96482, 95902, 95558, 95290, 95141, 95056, 94814, 94293, 93528, 92515, 91265, 89986, 88854, 87681, 86227, 84786, 83969, 83890, 84011, 83905, 83656, 83466, 83349, 83392, 83800, 84432, 84760, 84604, 84471, 84797, 85243, 85116, 84211, 82883, 81549, 80503, 80037, 80293, 81027, 81782, 82302, 82639, 82970, 83424, 84006, 84545, 84875, 85081, 85375, 85709, 85873, 86021, 86660, 87876, 89019, 89504, 89585, 89848, 90254]
52627I0254o9q44j263j224j039q47n67k81j47m5L23R32J299J030L43j43j81k20
52609H7311o88j170p84M81J475J325O05M11P69P70J23m28l48k8K5k7J02J14l91
52590H9647j129j394r77l51k2l4q1J80Q24J479J617J126M81J46kl03o83p56n27
52571H9241m88q77j222r04L8R11J145P24q4j055j865j993j177J53J204J613J573
52554H6937J238N29l90r58q39l65k6J04J93K00N8l4R8J91p3n36q10q97r90r61
52534H2669n61p3q0n41p13j74O02Q90N33n8m16l56k5K10J25j37l38n51r31j287
52514G8788j238q15m51l55l73l76m04l32N1N69P47M83J84N6j66o30r32o43N2O19
52494G4834Q14P94O98M18j99j003j431r56K03J099J031L27k58n75r96j475j494
$$ y = [90254, 90185, 89341, 88078, 86854, 85815, 84968, 84401, 84120, 83973, 83928, 84251, 85183, 86482, 87512, 87855, 87712, 87531, 87311, 86623, 85453, 84669, 85150, 86625, 87950, 88555, 88966, 89735, 90505, 90628, 90200, 89852, 89824, 89849, 89822, 89924, 90038, 89647, 88518, 87124, 86147, 85796, 85774, 85740, 85659, 85839, 86663, 88142, 89759, 90885, 91366, 91512, 91510, 91207, 90524, 89768, 89241, 88753, 87876, 86654, 85750, 85788, 86699, 87844, 88568, 88484, 87429, 85564, 83571, 82394, 82547, 83751, 85364, 86937, 88175, 88704, 88314, 87356, 86517, 86152, 86126, 86230, 86423, 86623, 86681, 86647, 86745, 86936, 86863, 86327, 85517, 84620, 83630, 82669, 82108, 82035, 81955, 81414, 80701, 80527, 81129, 82019, 82552, 82494, 82078, 81722, 81697, 81907, 82032, 81895, 81557, 81006, 80075, 78788, 77550, 76735, 76284, 75929, 75556, 75180, 74776, 74444, 74495, 75064, 75811, 76294, 76478, 76534, 76368, 75738, 74806, 74163, 74215, 74834, 75648, 76442, 77140, 77558, 77359, 76356, 74925, 73969, 74172, 75271, 76302, 76629, 76371, 75796, 74800, 73325, 71831]
52477G1831q74k6O82J204J350Q34o1n02j17N76R01P07J79m33o89k36N64Q94N98
52458G7382L38M73N67L57K74N37N99J65j50J23L54j02o12j29J057J678J261N53
52440H4725J65r0m21n78l61j8J66J65K1j74j20M10J115J485J466J325J004K54
52422I0539o61j123j015q04o64k49N23J124J146Q44O03L57j25o62p87k94N03J000
52404I0255P87R4l40j05L88N48M69O52J035J068O60L63M71O90Q26J069J348J169
52386A01447M89O5M24J076J271J053R53J118J344J634K053K259J825R73M46O52
52370A19082J307J891K071J829J500J569K085K465K286J998K287K918K976K262
52356A48526J695J996K684K775K102J372J207J547K004K356K576K633K373J741
$$ y = [71831, 70957, 70931, 71613, 72817, 74167, 75001, 74940, 74438, 74321, 74897, 75798, 76505, 76684, 76251, 75562, 75326, 75890, 76784, 77382, 77720, 78193, 78760, 79117, 79391, 79928, 80527, 80692, 80542, 80665, 81019, 80917, 80305, 80176, 81233, 82911, 84172, 84725, 84890, 84800, 84379, 83801, 83440, 83422, 83588, 83753, 83774, 83600, 83480, 83890, 85005, 86490, 87956, 89281, 90285, 90539, 89878, 88755, 87740, 86936, 86272, 86023, 86546, 87670, 88816, 89660, 90263, 90620, 90495, 89833, 89046, 88752, 89255, 90255, 91042, 91136, 90796, 90691, 91079, 91627, 92096, 92748, 93783, 94851, 95511, 95874, 96345, 97035, 97861, 98930, 100278, 101447, 101936, 102001, 102425, 103501, 104772, 105825, 106778, 107896, 109240, 110874, 112927, 115186, 117011, 117984, 118430, 119082, 120389, 122280, 124351, 126180, 127680, 129249, 131334, 133799, 136085, 138083, 140370, 143288, 146264, 148526, 150221, 152217, 154901, 157676, 159778, 161150, 162357, 163904, 165908, 168264, 170840, 173473, 175846, 177587]
52342A77587J087J146K380M347N973O656O852P307Q037Q443Q321Q288R052J0526
52328B66002J1914J2585J2706J2954J3683J4464J4598J4015J3416J3364J3594
52317D13295J3510J3048J2642J2350J1697J0484R220Q391P772O870N763M961M553
52304E34556M041L067J788M81q29k117l098l538l650l931m613n422n885n841n576
52289D99433n391n045l919j897J92J468K147L186M839O307O940P128P546Q144
52275E31078Q505Q688R017R377R458R555J0271J1359J1705J0730R229Q384Q380
52262F55736Q406P707O245M540L219K562K263J750Q80J11k41o13j656l333n009
52247F82567o338p579q949j0095j0508j0130r377q645q065p597p124o477n540
$$ y = [177587, 178674, 179820, 182200, 186547, 192520, 199176, 206028, 213335, 221372, 229815, 238136, 246424, 255476, 266002, 277916, 290501, 303207, 316161, 329844, 344308, 358906, 372921, 386337, 399701, 413295, 426805, 439853, 452495, 464845, 476542, 487026, 496246, 504637, 512409, 519279, 525042, 530003, 534556, 538597, 541664, 543452, 543933, 543104, 540987, 537889, 534351, 530701, 526770, 522157, 516735, 510850, 505009, 499433, 494042, 488997, 485078, 483181, 483373, 484841, 486988, 490174, 495013, 501320, 508260, 515388, 522934, 531078, 539583, 548271, 557288, 566665, 576123, 585678, 595949, 607308, 619013, 629743, 638972, 647356, 655736, 664142, 671849, 678094, 682634, 685853, 688415, 690678, 692428, 693308, 693419, 693178, 692565, 690909, 687576, 682567, 676229, 668650, 659701, 649606, 639098, 628968, 619591, 610946, 602881, 595284, 588160, 581683, 576143]
52234E76143m444l505k926k570k077j259l75O0j57n66m70K97J215J796K154K630
52218E65946L145L325L215L320L850M346M335L978L723L617L358K924K649K655
52204F14386K587K097J326P54O93R72J069N67l61j014r08l61r7l54p65j043j331
52187F18217j788k248k532k752l078l399l512l384l094k760k639k966l430l304
52173E77331k399j498j354j660j631j292j342j802j716n79P54J102M62j67j38
52158E64071K55M58L51J66J16K56N00N68K02m41q27o50k60k39o40r07n58L88J610
52139E64419K845L800M124L827L635M425O248Q280R840J0999J2029J2689J2596
52126F59756J2026J1782J2206J2760J2805J2414J2168J2371J2711J2611J1760
$$ y = [576143, 571699, 568194, 565268, 562698, 560621, 559362, 558987, 559047, 558890, 558324, 557854, 558151, 559366, 561162, 563316, 565946, 569091, 572416, 575631, 578951, 582801, 587147, 591482, 595460, 599183, 602800, 606158, 609082, 611731, 614386, 616973, 619070, 620396, 621150, 621843, 622815, 623884, 624451, 624090, 623076, 622168, 621807, 621710, 621356, 620591, 619548, 618217, 616429, 614181, 611649, 608897, 605819, 602420, 598908, 595524, 592430, 589670, 587031, 584065, 580635, 577331, 574932, 573434, 572080, 570420, 568789, 567497, 566155, 564353, 562637, 562058, 562812, 563914, 564376, 564209, 564071, 564326, 564784, 565135, 565301, 565417, 565673, 566173, 566741, 566943, 566502, 565675, 565025, 564765, 564526, 563886, 562979, 562421, 562809, 564419, 567264, 571064, 575188, 579015, 582650, 587075, 593323, 601603, 611443, 622442, 634471, 647160, 659756, 671782, 683564, 695770, 708530, 721335, 733749, 745917, 758288, 770999, 783610, 795370]
52115G95370J0330Q868P901P484P123O286M974L641K571J543J89j497l162m480
52101H47141n370n954o453p066p701p968p631p078o931p140o917n750m075k667
52087G58440j721r18j26N33J126K029L481N394P469R205J0011R789R338R627J0677
52072H34354J1599J1768J1367J0782J0079R293Q612P940O772M871K699Q98l30
52059I30704j189k005l260n321p800r679j0493j0948j1928j3338j4426j4892j5034
52046H10391j5097j5102j5155j5364j5540j5456j5289j5304j5175j4247j2498
52035F46164j0728r706r437r369q993q208p295o633o336o266o356o674p015o906
52021E36242o337o026o523p439q076q436q978r710j0260j0646j1182j1710j1729
$$ y = [795370, 805700, 814568, 822469, 829953, 837076, 843362, 848336, 851977, 854548, 856091, 856280, 854783, 851621, 847141, 841771, 835817, 829364, 822298, 814597, 806629, 798998, 791920, 784989, 777849, 770932, 765182, 761107, 758440, 756719, 755801, 755675, 756208, 757334, 759363, 762844, 768238, 775707, 784912, 794923, 804712, 814050, 823677, 834354, 845953, 857721, 869088, 879870, 889949, 899242, 907854, 915794, 922566, 927437, 930136, 931034, 930704, 929515, 927510, 924250, 918929, 911129, 901450, 890957, 880009, 868081, 854743, 840317, 825425, 810391, 795294, 780192, 765037, 749673, 734133, 718677, 703388, 688084, 672909, 658662, 646164, 635436, 625730, 616293, 606924, 597931, 589723, 582428, 575795, 569459, 563193, 556837, 550163, 543148, 536242, 529905, 523879, 517356, 509917, 501841, 493405, 484427, 474717, 464457, 453811, 442629, 430919, 419190]
52008D19190j1294j1087j1441j2012j2449j2762j2906j2670j2172j1839j1672
51997B86886j1160j0103q981q187p545o889o507o590o752o583o222n962n610m821
51983A84974l743k869k366j964j472j024q44r89j270j352j052o27n85j143k042
51968A61632k950l683m015l652k715j933k001k776l377l023j781n17j45p27j450
51953A26887j637j512j597j679j102J1O71M11q5l7M01P23R43J252J320P84J18
51936A25872K00J042J680J359L41o54j279j693k139k577k691k236j453r48j002
51921A13822j177r24m16l76j100j951j982r13N66J378J020n4r63j308j343j308
51905A02971j053m92k9j15n79p78l49N45J509K214K464K358K376K913L700M016
$$ y = [419190, 407896, 396809, 385368, 373356, 360907, 348145, 335239, 322569, 310397, 298558, 286886, 275726, 265623, 256642, 248455, 240910, 234021, 227514, 220924, 214172, 207589, 201367, 195405, 189795, 184974, 181231, 178362, 175996, 174032, 172560, 171536, 170692, 169703, 168433, 167081, 166029, 165402, 164817, 163674, 161632, 158682, 154999, 150984, 147332, 144617, 142684, 140683, 137907, 134530, 131507, 129726, 129209, 129064, 128337, 126887, 125250, 123738, 122141, 120462, 119360, 119371, 120042, 120453, 120368, 120331, 120732, 121455, 122398, 123650, 124970, 125754, 125872, 126072, 127114, 128794, 130153, 130494, 129840, 128561, 126868, 124729, 122152, 119461, 117225, 115772, 114824, 113822, 112645, 111721, 111305, 110929, 109829, 107878, 105896, 104983, 105549, 106927, 107947, 107893, 106930, 105622, 104279, 102971, 101918, 101426, 101397, 101282, 100703, 99925, 99576, 100121, 101630, 103844, 106308, 108666, 111042, 113955, 117655, 121671]
51889A21671L593L069L287M313N412O062O659P977J0059J2030J3175J3712J4092
51876B25111J3817J1705P384J952l043o828r414j0967j1642j1738j1526j0992
51864A83819j0052q835p584o431n481m883m547m045l097j972j184r34j062j322
51850A22390j450j177m68M04J153J711J970J660P67k52r24j203j200q51k44Q2
51834A22368k96j050j513j504j224n80O07J823K068J093j67p10n47l15k91k62
51818A19500j62k71p43j258j377j056o11k55J22O46J120J219R12M68Q4k17l46
51801A17775j72J76L61L26L80O53P89M01l75j013j084n08L55Q33M84k77n53j32
51783A18419J82k74j050j225n93K44O91N81L3o19r41q31n95l84O5P05Q87L35j30
$$ y = [121671, 125264, 128333, 131620, 135933, 141345, 147407, 154066, 162043, 172102, 184132, 197307, 211019, 225111, 238928, 250633, 258017, 259969, 256926, 250098, 240684, 229717, 218075, 206337, 194811, 183819, 173767, 164932, 157348, 150917, 145436, 140553, 136006, 131961, 128864, 126892, 125708, 124774, 123712, 122390, 120940, 119763, 119295, 119699, 120852, 122563, 124533, 126193, 126960, 126708, 125784, 124581, 123381, 122530, 122286, 122368, 122072, 121022, 119509, 118005, 116781, 116201, 116808, 118631, 120699, 121792, 121625, 120915, 120368, 120053, 119762, 119500, 119338, 119067, 118324, 117066, 115689, 114633, 114022, 113767, 113889, 114535, 115655, 116874, 117786, 118254, 118338, 118121, 117775, 117603, 117779, 118140, 118466, 118846, 119499, 120288, 120689, 120314, 119301, 118217, 117709, 118064, 118897, 119381, 119104, 118551, 118419, 118601, 118327, 117277, 116052, 115459, 115703, 116394, 116975, 117008, 116389, 115448, 114617, 114022, 113638, 113703, 114408, 115295, 115630, 115500]
51764A15500L50J240J245J45r95j400j388j450j446j109o01j60K98Q40J201J140
51748A13410P80L49o3l88n16n04n01l86J22R76J720J993J756J075J76l62j4R26
51730A20549J559J470J045N82k16j491k558k600j717p69l59l65m12l92m65p19
51714A13142r75j023j004j342k104k676k439j582p70k22L04P76Q04L34k05n65
51698A00453q33q56k38Q37J557J498J099P20J09q02j299q13Q6L70j55q65j271
51681I9597j317j020n06j64k23l05K0M99O18N47R08J697K118J613M85n64j053
51664A02950q38j38M14K81l44p61p14o15p26o95k13L58M35Q3o5L38Q71Q32L2r36
51644A00549j251p19j6P8m85j084j271j117q08l51J21K47l5k03J45N93M65n4k8
$$ y = [115500, 115850, 117090, 118335, 118480, 117485, 116085, 114697, 113247, 111801, 110692, 110091, 109931, 110229, 111069, 112270, 113410, 114190, 114539, 114476, 114088, 113572, 113068, 112567, 112181, 112303, 113279, 114999, 116992, 118748, 119823, 119999, 119637, 119623, 120549, 122108, 123578, 124623, 125205, 124989, 123498, 120940, 118340, 116623, 115854, 115495, 115130, 114718, 114326, 113861, 113142, 112167, 111144, 110140, 108798, 106694, 104018, 101579, 99997, 99227, 99005, 99309, 100085, 100889, 101223, 101018, 100453, 99620, 98764, 98526, 99363, 100920, 102418, 103517, 104237, 104346, 103544, 102245, 101432, 101518, 101888, 101733, 100868, 99597, 98280, 97260, 96754, 96590, 96367, 96062, 96082, 96581, 97199, 97746, 98654, 100351, 102469, 104082, 104567, 104003, 102950, 102112, 101974, 102388, 102669, 102325, 101564, 100850, 100235, 99509, 98814, 98601, 98959, 99394, 99477, 99412, 99750, 100621, 101453, 101485, 100549, 99298, 98579, 98563, 98641, 98156, 97072, 95801, 94684, 93876, 93525, 93646, 93893, 93858, 93655, 93800, 94393, 94858, 94804, 94776]
51625I4776Q98J900K015J291M30k19p02p99j90P26Q88j24j416j768r10M87J693
51608I8976K344K352J926J553J498J506J291J050J002P97J6r37j275j048j002
51593A10049j177o45R26K382K489J555Q62R50J269J338J305J362J263Q37M38N81
51577A25784J313K206K792K863K482J838J184P26M79J44o56j839k683k513j578
51562A32542q58q81j097p32J31P13N45q0n94p01l62L00R65J201P95rp26j034r28
51543A29190o35m33n14q45j077q02l4N77L98l58p48k76M50N32k7m63l80j86l90
51524A23979r76j609j991j895j289o26n42j098j543j149l5J051J536J370Q61L60
51508A16404N8j38l90o62p82p22n59k40K89P82Q65N42R9m18j148j817j865j284
$$ y = [94776, 95674, 97574, 99589, 100880, 101310, 101091, 100389, 99590, 99400, 100126, 101014, 100890, 99474, 97706, 96796, 97283, 98976, 101320, 103672, 105598, 107151, 108649, 110155, 111446, 112496, 113498, 114295, 114311, 113374, 112099, 111051, 110049, 108872, 108227, 109153, 111535, 114024, 115579, 116441, 117391, 118660, 119998, 121303, 122665, 123928, 124765, 125203, 125784, 127097, 129303, 132095, 134958, 137440, 139278, 140462, 141188, 141667, 141811, 141155, 139316, 136633, 134120, 132542, 131684, 130803, 129706, 128974, 129105, 129818, 130363, 130283, 129689, 128988, 128626, 128926, 129891, 131092, 131887, 131878, 131152, 130118, 129190, 128555, 128122, 127608, 126763, 125686, 124884, 124850, 125427, 125825, 125467, 124719, 124443, 124893, 125425, 125398, 124935, 124555, 124369, 123979, 123003, 121394, 119403, 117508, 116219, 115593, 115051, 113953, 112410, 111261, 111226, 112277, 113813, 115183, 116044, 116404, 116462, 116324, 115934, 115272, 114490, 113768, 113209, 112969, 113258, 114040, 114905, 115447, 115546, 115128, 113980, 112163, 110298, 109014]
51490A09014p73p28o58O0J257K175K304J750J046Q06J273K041K598L013L642M162
51474A32982L743K355J008L51j63j264k738l953m703m945m402l172k145j913j913
51459A09128j412q20j034j887k365k154j885j933j919j492q38k73Qj73p26j043
51443H9182o28J02L32Rk68l00m13n50k25N14R18O32J80J17L53N15M72K44n7n0
51423I1079O25J652K241K088J655J361R97K29q46j801k250k113j761j762k129
51408H9265k154j465q08j021j603j401m26K19J92K99Q89J143M98l95p96q92j031
51391H0513q96k36L99M61K79M12P52R55J124J366J309Q33O41J264K077K157J669
51374I5079J423J528J441J059P84O17Q7r35k047k914l390l252k483j703j598j947
$$ y = [109014, 108241, 107513, 106855, 106915, 108172, 110347, 112651, 114401, 115447, 116253, 117526, 119567, 122165, 125178, 128820, 132982, 136725, 139080, 140088, 140439, 140276, 139012, 136274, 132321, 127618, 122673, 118271, 115099, 112954, 111041, 109128, 107716, 106896, 105862, 103975, 101610, 99456, 97571, 95638, 93719, 92227, 91389, 91116, 91124, 90951, 90225, 89182, 88554, 88656, 88988, 88997, 88729, 88429, 88016, 87466, 87241, 87755, 88673, 89305, 89485, 89602, 89955, 90470, 90942, 91186, 91129, 91079, 91704, 93356, 95597, 97685, 99340, 100701, 101698, 101927, 101081, 99280, 97030, 94917, 93156, 91394, 89265, 87111, 85646, 84838, 83817, 82214, 80813, 80387, 80606, 80798, 81097, 81986, 83129, 83627, 83232, 82436, 81544, 80513, 79617, 79381, 79780, 80241, 80520, 80932, 81684, 82639, 83763, 85129, 86438, 87271, 87912, 89176, 91253, 93410, 95079, 96502, 98030, 99471, 100530, 101314, 101931, 102018, 101083, 99036, 96122, 92732, 89480, 86997, 85294, 83696, 81749]
51358H1749j931j344p42l63J95J039J404N18j313k882l160k118n95N00R35J074
51342G2966J125Q51K24j89P9O76R72J030J372J956K150J667R60N21L39J58j35
51325H6722n20r07j126j090q99o15j28M88P28K20o89j297j330r84n03j62l22r21
51307G6665j260q90l74m26p22m44L31Q37R69J244J478Q43m77j056k10R73J265
51290G8746R37R48J385J687J767J939K124J998J631J308R84N11J04l6k04o78j140
51273I4011j201j161j463j742j286k82K54k24j252k096k308j679m03O16M76n61
51257G9699j231q09J82R08J172J165R44O00L92L74K40j03l04j60P1K55O98J411
51239H5504J622P37o15j187o33K40O50N95M32K91J61J10J58J98K11L77P93J278
$$ y = [81749, 79818, 78474, 77732, 77369, 77564, 78603, 80007, 80525, 79212, 76330, 73170, 71052, 70457, 70957, 71892, 72966, 74091, 74942, 75166, 74977, 75056, 75732, 76704, 77734, 79106, 81062, 83212, 84879, 85839, 86360, 86699, 86857, 86722, 86202, 85295, 84169, 83079, 82180, 81565, 81437, 81925, 82653, 82873, 82184, 80887, 79557, 78573, 78070, 77908, 77586, 76665, 75405, 74515, 74141, 73715, 72993, 72549, 72880, 73717, 74686, 75930, 77408, 78251, 77774, 76718, 76508, 77481, 78746, 79683, 80631, 82016, 83703, 85470, 87409, 89533, 91531, 93162, 94470, 95454, 95965, 96069, 96033, 95829, 95151, 94011, 92810, 91649, 90186, 88444, 87158, 86876, 87130, 86906, 85654, 83558, 81250, 79571, 79168, 79784, 80260, 79699, 78468, 77659, 77841, 78749, 79921, 81086, 82030, 82630, 83022, 83396, 83636, 83533, 83229, 83069, 83140, 83395, 84093, 85504, 87126, 87863, 87248, 86061, 85428, 85668, 86318, 86913, 87345, 87636, 87797, 87907, 88065, 88263, 88474, 88851, 89644, 90922]
51221I0922J550J453J047N23J35k3o2n3J32N12O58J13q74j482j266o39k25j99
51203I2222m03p17j035j110q45n16l60j97J81M55J23o01q44j66Q22J230R50O03
51185H9792O32Q21P31K55l43p46p88n08r9J57J10j19k67k92m01o71p99m59J38
51166H7144L39j60q94j167q57m62m44p25q92o74k11J77M34Q82J748K657K910K285
51148I2090J294N26J31J04N40J221J398O54l47o55l71m02r32j124m68M33Q56R04
51130I5852R31Q19M71M46J183K120K335J855J375J003K35q02j199o92k07n26j134
51113A04065j057l44Q4k71j002j474j463j127p55n40l12L64J473K204J823Q02
51097A02470M58J279K263K159R80k06n88l14K7J32R0R2K38N22Q86J253J468J298
$$ y = [90922, 92472, 93925, 94972, 95495, 95630, 95607, 95545, 95492, 95624, 96136, 96794, 96907, 96033, 94551, 93285, 92646, 92421, 92222, 91819, 91102, 90067, 88957, 88112, 87596, 87236, 87039, 87220, 87675, 87798, 87197, 86353, 86187, 87009, 88239, 89189, 89792, 90424, 91245, 91976, 92231, 91888, 91142, 90354, 89846, 89747, 89904, 90014, 89895, 89628, 89336, 88935, 88264, 87465, 87006, 87144, 87483, 87323, 86429, 85262, 84405, 83943, 83499, 82774, 81882, 81208, 80997, 81174, 81608, 82490, 84238, 86895, 89805, 92090, 93384, 93910, 94041, 94145, 94685, 95906, 97304, 97958, 97611, 96956, 96585, 96183, 95251, 94127, 93659, 94092, 94948, 95852, 96783, 97602, 98073, 98519, 99702, 101822, 104157, 106012, 107387, 108390, 108625, 107823, 106624, 105932, 105725, 105199, 104065, 103008, 102664, 102748, 102477, 101475, 100001, 98538, 97411, 96656, 96116, 95804, 96168, 97641, 99845, 101668, 102470, 102928, 104207, 106470, 108629, 109609, 109403, 108815, 108501, 108528, 108660, 108750, 108842, 109080, 109602, 110488, 111741, 113209, 114507]
51079A14507O55j18m26r2L79L97o1o07j012j221j033l14M85O38R2m74o64q33j268
51060A09030j563j286p30k89L57J573K665K487J150O0P1N25M92J15L9L09N51P88
51042A16344J248J631J385N95n2j96j46k74n55p94p83k66Q06J901K261J830J321
51025A26256J227J214Q00K19J35P40J539J974J975J833J810J927K015J950J888
51010A47502K175K964L957M655M845M778M883N354N940O159N800N270N303O216
50996B15801P553Q584R006Q977Q660Q023P201O638O694P209P736Q124Q635R513
50982C28354J0695J2046J3668J5742J8256K1035K4052K7407L0974L4225L6631
50971E73085L8188L9454M1011M2878M4491M5305M5290M4721M3558M1378L8035
$$ y = [114507, 115162, 115044, 114618, 114526, 114905, 115302, 115241, 114634, 113622, 112401, 111368, 111054, 111539, 112177, 112269, 111795, 111131, 110298, 109030, 107467, 106181, 105451, 105162, 105519, 107092, 109757, 112244, 113394, 113454, 113525, 114050, 114542, 114657, 114696, 115005, 115556, 116344, 117592, 119223, 120608, 121203, 121151, 120955, 120809, 120535, 119980, 119186, 118403, 118137, 118943, 120844, 123105, 124935, 126256, 127483, 128697, 129497, 129716, 129851, 130591, 132130, 134104, 136079, 137912, 139722, 141649, 143664, 145614, 147502, 149677, 152641, 156598, 161253, 166098, 170876, 175759, 181113, 187053, 193212, 199012, 204282, 209585, 215801, 223354, 231938, 240944, 249921, 258581, 266604, 273805, 280443, 287137, 294346, 302082, 310206, 318841, 328354, 339049, 351095, 364763, 380505, 398761, 419796, 443848, 471255, 502229, 536454, 573085, 611273, 650727, 691738, 734616, 779107, 824412, 869702, 914423, 957981, 999359, 1037394]
50960A037394L4073L0136K6245K2016J7500J3332R971P226M694K377O54j49k5
50947A205444P02J568K330L135M004M247K936M3l444o813j0439j4904j9838k4367
50933A144604k8336l2371l6754m0989m4471m6976m8347m8365m7265m5750m4139
50922F80841m1869l8388l4227l0570k7834k5297k2261j9057j6483j4651j3003
50911C97201j1297r888q845p525n555l714l073l482l706l054k102j600j483j333
50897C30544j119r55o21P3Q40J332J674K092K443K634L105M203N442O114O330
50882C64131O682P076O899O333O430P692R433J0885J2162J3686J5293J6585J7622
50869E00909J8768K0118K1591K3368K5832K9169L3293L8035M3171M8425N3660
$$ y = [1037394, 1071467, 1101603, 1127848, 1149864, 1167364, 1180696, 1190667, 1197893, 1202587, 1204964, 1205618, 1205469, 1205444, 1206146, 1207714, 1210044, 1213179, 1217183, 1221430, 1224366, 1224409, 1220965, 1214152, 1203713, 1188809, 1168971, 1144604, 1116268, 1083897, 1047143, 1006154, 961683, 914707, 866360, 817995, 770730, 724980, 680841, 638972, 600584, 566357, 535787, 507953, 482656, 460395, 441338, 424855, 410204, 397201, 385904, 376016, 367171, 359646, 354091, 350377, 347304, 343822, 340116, 337062, 334960, 333360, 331877, 330544, 329425, 328470, 327849, 327922, 328762, 330094, 331768, 333860, 336303, 338937, 342042, 346245, 351687, 357801, 364131, 370813, 377889, 384788, 391121, 397551, 405243, 414676, 425561, 437723, 451409, 466702, 483287, 500909, 519677, 539795, 561386, 584754, 610586, 639755, 673048, 711083, 754254, 802679, 856339]
50858H56339N9024O4771P1037P7716Q4354R0239R4910R8530J01479J03569J04118
50847A806086J02747R9529R4307Q6481P5825O3176M9961L7301K5715J5273N829
50836B462230k566r266j3363j4530j3194r767m295K829J0356J6715K0772K1871
50824B467792J9670J4330O445l585j5700k9504m3937n8080p1686q4537r5775j04494
50812B000939j10503j13905j14422j11947j07313j01631r5086q7228p8324o9510
50802A011070o1490n3957m6523l9540l3587k8614k4038j9514j5405j2415j0799
50791F65188r855q558o771n471n430o136o530o321n973n762n667n892o591p216
50777E73015p087o569o707p585q098p592o700o153n689m851m013l781l938l764
$$ y = [856339, 915363, 980134, 1051171, 1128887, 1213241, 1303480, 1398390, 1496920, 1598399, 1701968, 1806086, 1908833, 2008362, 2102669, 2189150, 2264975, 2328151, 2378112, 2415413, 2441128, 2456401, 2462230, 2459664, 2450398, 2437035, 2422505, 2409311, 2399544, 2395249, 2398078, 2408434, 2425149, 2445921, 2467792, 2487462, 2501792, 2508237, 2504652, 2488952, 2459448, 2415511, 2357431, 2285745, 2201208, 2105433, 2000939, 1890436, 1776531, 1662109, 1550162, 1442849, 1341218, 1246132, 1158904, 1080580, 1011070, 949580, 895623, 849100, 809560, 775973, 747359, 723321, 703807, 688402, 675987, 665188, 655333, 646775, 640004, 634533, 629103, 622967, 616437, 610116, 604143, 598381, 592714, 586822, 580231, 573015, 565928, 559359, 552652, 545067, 536969, 529377, 522677, 516524, 510835, 505984, 501971, 498190, 494252, 490488]
50763D90488l097k352j779j193l68Q67K647M745O429P208P566Q439J0088J1994
50749E41682J3807J5850J8571K1872K5223K8215L0877L3620L6929M1010M5614
50738H53270N0092N3644N5729N6516N6944N7874N9054N9212N7306N3390M8114
50727A461145M1850L4547K6118J6613O333l838j2504j8638k2265k3951k3823k1496
50715A460091j6874j0607l826K369P315J1025J3853J5703J5751J3239Q239J280
50703A517558p350j7412k8108l8360m7564n5423o1232o4179o4383o2877o0366
50692A010304n6688n1777m6370m1278l6497l1529k6239k0954j6017j1681q094
50681F63180n029j894J550M732O944Q289R512J0964J2191J2534J1856J0600R383
$$ y = [490488, 487391, 485039, 483260, 482067, 481699, 482566, 485213, 489958, 496387, 503595, 511161, 519600, 529688, 541682, 555489, 571339, 589910, 611782, 637005, 665220, 696097, 729717, 766646, 807656, 853270, 903362, 957006, 1012735, 1069251, 1126195, 1184069, 1243123, 1302335, 1359641, 1413031, 1461145, 1502995, 1537542, 1563660, 1580273, 1586606, 1582768, 1570264, 1551626, 1529361, 1505410, 1481587, 1460091, 1443217, 1432610, 1428784, 1431153, 1438468, 1449493, 1463346, 1479049, 1494800, 1508039, 1516278, 1517558, 1510208, 1492796, 1464688, 1426328, 1378764, 1323341, 1262109, 1197930, 1133547, 1070670, 1010304, 953616, 901839, 855469, 814191, 777694, 746165, 719926, 698972, 682955, 671274, 663180, 658151, 656257, 657807, 662539, 669483, 677772, 687284, 698248, 710439, 722973, 734829, 745429, 754812]
50668G54812Q522P928P426P134P329P978Q763R557J0446J1214J1513J1788J3244
50655H77654J6329J9853K2494K4547K7192L0483L3274L5122L6840L8847M0198
50644A202833L9923L8412L6604L4500L1351K6964K1922J6778J1653O537J395l878
50632A464994r182j4024j8046k1474k4577k6998k8148k8021k6904k4628k0939
50621A222053j6454j2329q903n492j710J903M816P182R163J0394J0608J0108Q959
50608A240298O406J830m254j0884j7854k5290l2417l7865m1231m3362m5001m5903
50596I44473m5608m4213m1988l8889l5008l1063k7835k5241k2457j8892j4816
50585E98463j1054q246o380m930l519k343j786j707j491q06J22J071K145L309
$$ y = [754812, 763334, 771262, 778688, 785822, 793151, 801129, 809892, 819449, 829895, 841109, 852622, 864410, 877654, 893983, 913836, 936330, 960877, 988069, 1018552, 1051826, 1086948, 1123788, 1162635, 1202833, 1242756, 1281168, 1317772, 1352272, 1383623, 1410587, 1432509, 1449287, 1460940, 1467477, 1468872, 1464994, 1455812, 1441788, 1423742, 1402268, 1377691, 1350693, 1322545, 1294524, 1267620, 1242992, 1222053, 1205599, 1193270, 1184367, 1178875, 1177165, 1179068, 1183884, 1191066, 1200229, 1210623, 1221231, 1231339, 1240298, 1246704, 1248534, 1244280, 1233396, 1215542, 1190252, 1157835, 1119970, 1078739, 1035377, 990376, 944473, 898865, 854652, 812664, 773775, 738767, 707704, 679869, 654628, 632171, 613279, 598463, 587409, 579163, 572783, 567853, 564334, 561991, 560205, 558498, 557007, 556201, 556323, 557394, 559539, 562848]
50571E62848M072M126L947M361N614P308R006J0504J1656J2445J3197J4311J5758
50558F79153J7140J8184J8826J8959J8516J7882J7692J8083J8586J8950J9698
50547H81669K1520K4413K7700L0770L3598L6673M0579M5505N1035N6644O2390
50536A312496O8857P6149Q3433Q9722R4786R8853J01750J02995J02509J00562
50526B232112R6910R0721Q1676P0562N8376M5247L0667J4499k747k0416l7875
50515B659732n4228o8419p9858q8585r4661r7707r7288r3579q7337p9289o9785
50504A748996n9071m7604l5919k4236j2421l90J1494K2549L2158L9867M5120M7202
50492A767745M5545M0013L0671J7586J133j7468l6240n3243o7249p7723q4467
$$ y = [562848, 566920, 571046, 574993, 579354, 584968, 592276, 601282, 611786, 623442, 635887, 649084, 663395, 679153, 696293, 714477, 733303, 752262, 770778, 788660, 806352, 824435, 843021, 861971, 881669, 903189, 927602, 955302, 986072, 1019670, 1056343, 1096922, 1142427, 1193462, 1250106, 1312496, 1381353, 1457502, 1540935, 1630657, 1725443, 1824296, 1926046, 2029041, 2131550, 2232112, 2329022, 2419743, 2501419, 2571981, 2630357, 2675604, 2706271, 2720770, 2718023, 2697607, 2659732, 2605504, 2537085, 2457227, 2368642, 2273981, 2176274, 2078986, 1985407, 1898070, 1818781, 1748996, 1689925, 1642321, 1606402, 1582166, 1569745, 1569355, 1580849, 1603398, 1635556, 1675423, 1720543, 1767745, 1813290, 1853303, 1883974, 1901560, 1902693, 1885225, 1848985, 1795742, 1728493, 1650770, 1566303]
50481A566303q7498q7258q4752q1242p7613p3902o9533o4118n7930n1629m5711
50470G85117m0441l5974l2122k8196k3657j8900j4886j1852r035n954l299j949
50458E58852j571r12O32K462L833M726N476O141O601O911P130P042O475N666N007
50443F24471M456L641K506J552J324J877K884M054N326O752Q331R930J1358J2571
50429G01033J3829J5521J7737K0181K2565K4977K7670L0666L3825L7203M0960
50418I86167M4857M8222N0709N2707N4678N6267N6537N5056N2242M8542M3728
50407A549712L7306K9400K0758J1987K996o665j7128k7910l8231m7483n5328o1430
50395A397984o5349o6897o6448o4532o1209n6222m9882m3212l6917l0522k3125
$$ y = [1566303, 1478805, 1391547, 1306795, 1225553, 1147940, 1074038, 1004505, 940387, 882457, 830828, 785117, 744676, 708702, 676580, 648384, 624727, 605827, 590941, 579089, 570054, 564100, 560801, 558852, 557281, 556369, 557001, 559463, 563296, 568022, 573498, 579639, 586240, 593151, 600281, 607323, 613798, 619464, 624471, 628927, 632568, 635074, 636626, 637950, 639827, 642711, 646765, 652091, 658843, 667174, 677104, 688462, 701033, 714862, 730383, 748120, 768301, 790866, 815843, 843513, 874179, 908004, 945207, 986167, 1031024, 1079246, 1129955, 1182662, 1237340, 1293607, 1350144, 1405200, 1457442, 1505984, 1549712, 1587018, 1616418, 1637176, 1649163, 1652159, 1645494, 1628366, 1600456, 1562225, 1514742, 1459414, 1397984, 1332635, 1265738, 1199290, 1134758, 1073549, 1017327, 967445, 924233, 887316, 856794, 833669]
50384H33669j4770o552O46O964J2864J8160K2149K4483K5300K4453K1209J5170
50372I83745P218j020q646j5932k3124k9520l4196l7162l8994l9616l8473l5919
50360F88361l3425l1905l0673k8711k6187k3947k2046j9761j6879j4086j2037
50349D28704j0761r947r171p873n754l392j789j183q19J2J273K616L853M815N291
50334C95875N377N421N407M972M257M068M804N776O071N628N010M514M070L635
50320D64885L228K732K082J428Q77L46m8J07Q33J560J982K542L564M483M679M481
50304D99761M488M370L438K124J629K170K753K888L274M401N623O302O934Q348
50290E58503J0506J2963J5945J9956K4608K8728L1459L2345L0303K3590J1520
$$ y = [833669, 818899, 812347, 812993, 819957, 832821, 850981, 873130, 897613, 922913, 947366, 968575, 983745, 990963, 989943, 981297, 965365, 942241, 912721, 878525, 841363, 802369, 762753, 724280, 688361, 654936, 623031, 592358, 563647, 537460, 513513, 491467, 471706, 454827, 440741, 428704, 417943, 407996, 398825, 390952, 385198, 381806, 380017, 378834, 378015, 378027, 379300, 381916, 385769, 390584, 395875, 401252, 406673, 412080, 417052, 421309, 425377, 430181, 435957, 442028, 447656, 452666, 457180, 461250, 464885, 468113, 470845, 472927, 474355, 475232, 475578, 475530, 475637, 476470, 478030, 480012, 482554, 486118, 490601, 495280, 499761, 504249, 508619, 512057, 514181, 515810, 517980, 520733, 523621, 526895, 531296, 536919, 543221, 550155, 558503, 569009, 581972, 597917, 617873, 642481, 671209, 702668, 735013, 765316, 788906, 800426]
50279H00426l978j8964k9766l4857l5039l2258k8284k4180k0489j7451j4951j2634
50267E27575j0305q152o523n558n059m537l458j758j28O27N58M56P34J018J056
50252D86546J356K284L175L089K097J122O65M66L24M21P22P05pj206k403l228
50236D96128l477l238l013l286l860m137l969l760l642l283k535j592k83J963
50222D58016N084Q003R846J0871J1752J2623J3414J4384J5466J5672J4153J1506
50210F00790R113P564O650O432P033P493O281L129p64m609q794j3408j7478k0422
50196E89010k3015k5774k7514k6872k4485k2172k0434j8346j5763j3905j3408
50185C57322j3293j2528j1447j0797j0333r364q136p528p623p488o474n025l988
$$ y = [800426, 796448, 777484, 747718, 712861, 677822, 645564, 617280, 593100, 572611, 555160, 540209, 527575, 517270, 509118, 502595, 497037, 491978, 487441, 483983, 482225, 482097, 482724, 483282, 483738, 484472, 485490, 486546, 487902, 490186, 493361, 496450, 498547, 499669, 500334, 500800, 501124, 501545, 502267, 502972, 502965, 501759, 499356, 496128, 492651, 489413, 486400, 483114, 479254, 475117, 471148, 467388, 463746, 460463, 457928, 456336, 456053, 458016, 463100, 471103, 480949, 491820, 503572, 516195, 529609, 543993, 559459, 575131, 589284, 600790, 609903, 617467, 624117, 630549, 637582, 645075, 651356, 654485, 653721, 649112, 640318, 626910, 609432, 589010, 565995, 540221, 512707, 485835, 461350, 439178, 418744, 400398, 384635, 370730, 357322, 344029, 331501, 320054, 309257, 298924, 289560, 281424, 273896, 266273, 258785, 252311, 247286, 243298]
50172B43298l604l441l074k563k224k095j697o20P35J322O14o50j200o67J08J62
50156B24404m46p64p5J235K050J781J058J013J901K864L117K944L143L792M140
50141B52157L723L004K731L002L320L411L569M149M920N244M912M528M858N963
50127C09491P219Q101Q571Q693Q379P802P585Q073Q721Q740Q170P784Q003Q489
50113D23821Q923R429J0088J0677J1288J2638J5166J8270K1118K3897K7441L1734
50101F24490L5586L8007L9194L9782L9752L8638L6476L3980L1937L0789L0559
50090A019190L0683L0091K7928K4226J9523J3897O947j274r856j7725k4334k9550
50078A089746l3418l6231l8421l9973m0395l9570l8152l6759l5179l2883k9985
$$ y = [243298, 239694, 236253, 233179, 230616, 228392, 226297, 224600, 223980, 224715, 226037, 226651, 226001, 224801, 224134, 224242, 224404, 223958, 223194, 223119, 224354, 226404, 228185, 229243, 230256, 232157, 235021, 238138, 241082, 244225, 248017, 252157, 255880, 258884, 261615, 264617, 267937, 271348, 274917, 279066, 283986, 289230, 294142, 298670, 303528, 309491, 316710, 324811, 333382, 342075, 350454, 358256, 365841, 373914, 382635, 391375, 399545, 407329, 415332, 423821, 432744, 442173, 452261, 462938, 474226, 486864, 502030, 520300, 541418, 565315, 592756, 624490, 660076, 698083, 737277, 777059, 816811, 855449, 891925, 925905, 957842, 988631, 1019190, 1049873, 1079964, 1107892, 1132118, 1151641, 1165538, 1172485, 1171211, 1161355, 1143630, 1119296, 1089746, 1056328, 1020097, 981676, 941703, 901308, 861738, 823586, 786827, 751648, 718765, 688780]
50067F88780k7003k4065k1058j8273j6137j4354j2295j0205r053q863q256o192
50055E13026l443j536q33m61K87J292K196K774K770K063J095N84N73K66r14k542
50039E17197l663l850l569l657m553n924p029p514p811q520r546j0186j0036r436
50025D21903q917q613q338p975p500o878o145n509n153m966m638m027l341k884
50011C37019k670k361j706r95q08j245j608j107K87J908L075L471L076K164J322
49996C39822R81R56Q34P16J064J792K168J924J822K745M640O871R166J1589J3813
49981D00903J5222J5786J6174J6749J6912J5863J3704J1414R772Q701P748O884
49969E55832O487O542O266M749J819k019o333j1074j6093k0802k4533k6935k7861
$$ y = [688780, 661777, 637712, 616654, 598381, 582244, 567890, 555595, 545390, 536337, 527474, 519218, 513026, 509583, 508047, 507214, 506753, 507040, 508332, 510528, 513302, 516072, 518135, 519230, 519814, 520387, 520653, 519739, 517197, 513534, 509684, 506115, 502458, 497905, 491981, 484952, 477438, 469627, 461107, 451561, 441375, 431339, 421903, 412986, 404373, 396035, 388060, 380560, 373682, 367537, 362028, 356875, 351909, 347271, 343244, 339903, 337019, 334349, 331988, 330282, 329287, 328479, 327234, 325626, 324519, 324806, 326714, 329789, 333260, 336336, 338500, 339822, 340803, 341759, 342593, 343309, 344373, 346165, 348333, 350257, 352079, 354824, 359464, 366335, 375501, 387090, 400903, 416125, 431911, 448085, 464834, 481746, 497609, 511313, 522727, 532499, 541200, 548948, 555832, 562319, 568861, 575127, 579876, 581695, 579676, 573343, 562269, 546176, 525374, 500841, 473906, 446045]
49956D46045k7226k5352k3163k1454k0010j7951j5044j2194j0416r663r091q224
49944B46257p319o609n767m474l135k471k467k351j705j007p33m87L07J267J404
49929B10710N61l57o85p47r63j006m33M32Q61O65J86l40q29j012p00k48k12n79
49911B05304r11j080j314j520j296o74k36l57q11j229j424j229n78P7N0o54j264
49894A90854j373j462j933k316k018j299q31o67l76M3P0m94j242j689j662j192
49878A72413m19L81R85J337J269M52r54j934j584k40R66J525J781J914J676J289
49862A80857J506K375K811K090R66N87Q92R67O06M36O55O20o4q76j141q65m64
49845A91958j12J85K66L0j96j2M45O23L62J02J88L38R2m22o32l31J10L71N84Q74
$$ y = [446045, 418819, 393467, 370304, 348850, 328840, 310889, 295845, 283651, 273235, 263572, 254481, 246257, 238938, 232329, 226562, 222088, 218953, 216482, 214015, 211664, 209959, 208952, 208219, 207732, 208039, 209306, 210710, 211271, 210914, 210229, 209482, 208519, 207513, 207080, 207512, 208373, 209038, 209224, 208884, 208055, 207043, 206343, 206095, 205883, 205304, 204393, 203313, 201999, 200479, 199183, 198509, 198273, 197916, 197105, 195876, 194452, 193223, 192645, 192722, 192772, 192118, 190854, 189481, 188019, 186086, 183770, 181752, 180453, 179622, 178955, 178579, 178622, 178692, 178198, 176956, 175267, 173605, 172413, 171994, 172375, 173360, 174697, 175966, 176418, 175464, 173530, 171946, 171706, 172672, 174197, 175978, 177892, 179568, 180857, 182363, 184738, 187549, 189639, 190605, 191192, 192084, 193051, 193657, 194093, 194748, 195368, 195304, 194428, 193287, 192422, 191958, 191846, 192031, 192297, 192327, 192131, 192119, 192564, 193187, 193549, 193651, 193839, 194177, 194269, 193847, 193215, 192884, 192994, 193365, 193949, 194823]
49825A94823R68O85M33O34R10N82j26j81O96J444J094J07m12k95l16q55j445j603
49807A97143j407j099p01k15J92L50J93l07q84q44J85J359J241m28k223k694j942
49790A87919j080p70q75j151j509j706j486j022p28o35m93l98o64j003o04O47
49774A74442J622J287J02n69k94K4l26p76m14N33J010O98L88O41Q70L82l37k09
49756A79074Q11J604J502J119J220J517J247M65k3Q3K23p7m57k75M61J127J291
49739A90912J137J068J148J133R35P53P17O45L99L08Q45J877K667K791K654K807
49723B12796L040K535R33j124k546k796k332k048k266k322j375M30J969K407K012
49708B09313J472R66L17l58p78j051j438j711j340l81M36O59O36R63J765K674
$$ y = [194823, 195791, 196476, 196909, 197543, 198453, 199035, 198909, 198728, 199424, 200868, 201962, 202069, 201657, 201362, 201046, 200191, 198746, 197143, 195736, 194637, 193936, 193721, 193913, 194263, 194456, 194149, 193265, 192421, 192606, 193965, 195206, 194778, 192555, 189861, 187919, 186839, 186069, 185194, 184043, 182534, 180828, 179342, 178320, 177592, 176957, 176464, 176066, 175402, 174399, 173795, 174442, 176064, 177351, 177453, 176884, 176590, 176614, 176288, 175512, 175098, 175631, 176641, 177339, 177727, 178368, 179238, 179620, 179283, 179074, 179885, 181489, 182991, 184110, 185330, 186847, 188094, 188559, 188536, 188619, 188842, 188765, 188308, 188033, 188494, 189621, 190912, 192049, 193117, 194265, 195398, 196333, 197086, 197803, 198448, 198847, 199155, 200000, 201877, 204544, 207335, 209989, 212796, 215836, 218371, 219304, 218180, 215634, 212838, 210506, 208458, 206192, 203870, 202495, 202925, 204894, 207301, 209313, 210785, 211751, 212068, 211710, 210932, 209881, 208443, 206732, 205392, 205011, 205447, 206106, 206742, 207705, 209470, 212144]
49692B12144L141K729J599P34J109K403L101K327J041Q58K047L345L527K564J151
49677B43820j49j126j715k003k185k228j748n34R28J831J941J733J528R72k98
49662B40767j827k768k981l015k968k204n21J100J674J629K285M144O459Q389
49648B50163R794J0722J0890R889P475L570j415o175r188j0176j0299j0554j0548
49635B44148r371p115m856l442k888k778k701k367j726r86m01r8j98p17j153p18
49619B02633O13J805J980J538J407J635J533R22M13M44Q27J292J761K051J975
49604B22829J804J981K308K165J613J438J875K195J967J821K318K886K691J949
49590B51840J479J446J454J558K130K832K837K122J571J623J751J629J755K359
$$ y = [212144, 215285, 218014, 219613, 220347, 221456, 223859, 226960, 229287, 230328, 231186, 233233, 236578, 240105, 242669, 243820, 243671, 242545, 240830, 238827, 236642, 234414, 232666, 232132, 233060, 234891, 236832, 238565, 240093, 241065, 240767, 238940, 236172, 233191, 230176, 227208, 225004, 224483, 225583, 227257, 228886, 231171, 235315, 241774, 250163, 259957, 270679, 281569, 291458, 298933, 302503, 301088, 294913, 285725, 275549, 265250, 254696, 244148, 234777, 227662, 222806, 219364, 216476, 213698, 210997, 208630, 206904, 205918, 205517, 205419, 205221, 204504, 203351, 202633, 203246, 205051, 207031, 208569, 209976, 211611, 213144, 214066, 214479, 214923, 215750, 217042, 218803, 220854, 222829, 224633, 226614, 228922, 231087, 232700, 234138, 236013, 238208, 240175, 241996, 244314, 247200, 249891, 251840, 253319, 254765, 256219, 257777, 259907, 262739, 265576, 267698, 269269, 270892, 272643, 274272, 276027, 278386]
49576B78386K637J972J218J655L028L763L136K126J855K175K294K062J940K144
49562C10391K488K806K949K648J906J302J251J167J51j519k459j939p98j99j95
49547C19950j63K3L3o9J37O77J151J406J560J497J050P24J308K586L315K985K765
49530C40935L941O070P539P620O987O283N253L559J675M33J53O34J626K879L974
49515C99561M593M866N094N237M917L915K419Q00o04j593k202k690l242l792m267
49500D13012m799n401n672n278m609m429m856n268n296n284n474n396m654l749
49486C42847l445l601l454k881k570k862l164k823j988j268j031j303j946k528
49472C07983k476j783j242j472k027j998j271n58l18l19l52o10j123j342q61j12
$$ y = [278386, 281023, 282995, 284213, 285868, 288896, 292659, 295795, 297921, 299776, 301951, 304245, 306307, 308247, 310391, 312879, 315685, 318634, 321282, 323188, 324490, 325741, 326908, 327059, 325540, 323081, 321142, 320344, 320145, 319950, 319787, 319810, 319843, 319774, 319911, 320588, 321739, 323145, 324705, 326202, 327252, 327976, 329284, 331870, 335185, 338170, 340935, 344876, 350946, 358485, 366105, 373092, 379375, 384628, 388187, 389862, 390295, 390448, 391082, 392708, 395587, 399561, 404154, 409020, 414114, 419351, 424268, 428183, 430602, 431402, 430798, 429205, 427003, 424313, 421071, 417279, 413012, 408213, 402812, 397140, 391862, 387253, 382824, 377968, 372700, 367404, 362120, 356646, 351250, 346596, 342847, 339402, 335801, 332347, 329466, 326896, 324034, 320870, 318047, 316059, 314791, 313760, 312457, 310511, 307983, 305507, 303724, 302482, 301010, 298983, 296985, 295714, 295156, 294838, 294519, 294167, 293557, 292434, 291092, 290231, 290119]
49456B90119J17k95p94j015j192j545j795j618j202r76q60l49O48J498J668J491
49440B83900J696K353K776K523K035K079K828L797M498M890N168N304M899L522
49426C32268J248j236l136m088m130l333j913n17J40J18L05J301K698L720M183
49411C27628M414M570M632M858N635O844P877Q358Q498Q610Q729Q822R004R286
49397D27765R338Q815P853O997O597O382N761M546L292K715K833K913K351J292
49383D99450K80l88p87j143j739k713l640l693k671j484j066j181r32k12K81L15
$$ y = [290119, 290236, 289941, 289147, 288132, 286940, 285395, 283600, 281982, 280780, 279804, 278944, 278595, 279243, 280741, 282409, 283900, 285596, 287949, 290725, 293248, 295283, 297362, 300190, 303987, 308485, 313375, 318543, 323847, 328746, 332268, 333516, 332280, 329144, 325056, 320926, 317593, 315680, 315163, 315303, 315421, 315726, 317027, 319725, 323445, 327628, 332042, 336612, 341244, 346102, 351737, 358581, 366458, 374816, 383314, 391924, 400653, 409475, 418479, 427765, 437103, 445918, 453771, 460768, 467365, 473747, 479508, 484054, 487346, 490061, 492894, 495807, 498158, 499450, 499730, 499342, 498555, 497412, 495673, 492960, 489320, 485627, 482956, 481472, 480406, 479225, 478293, 478081, 478362, 478677]
$$ [...]
##END NTUPLES=NMR SPECTRUM
##END=
