##TITLE=NES1063_159122.0004_001_9704314_vr22o5BivX
##JCAMPDX= 6.0         $$ Bruker NMR JCAMP-DX V2.0
##DATA TYPE= NMR SPECTRUM
##DATA CLASS= NTUPLES
##ORIGIN= BRUKER
##OWNER= Administrator
$$ 1.72 TOPSPIN		Version 2.1
$$ 2016-05-01 18:24:02.099 -0700  Administrator@X
$$ Compression mode = diff/dup
##.OBSERVE FREQUENCY= 400.02188249412
##.OBSERVE NUCLEUS= ^1H
##.ACQUISITION MODE= SIMULTANEOUS (DQD)
##.ACQUISITION SCHEME= undefined
##.AVERAGES= 8
##.DIGITISER RES= 22
##SPECTROMETER/DATA SYSTEM= spect
##.PULSE SEQUENCE= zg30
##.SOLVENT NAME= COFFEE_meoh
##.SHIFT REFERENCE= INTERNAL, COFFEE_meoh, 1, 14.98509
##AUDIT TRAIL= $$ (NUMBER, WHEN, WHO, WHERE, PROCESS, VERSION, WHAT)
$$ ##TITLE= Audit trail, TOPSPIN		Version 2.1
$$ ##JCAMPDX= 5.01
$$ ##ORIGIN= Bruker BioSpin GmbH
$$ ##OWNER= Administrator
$$ $$ E:\/data/COFFEE/nmr/NES1063_159122.0004_001_9704314_vr22o5BivX/10/pdata/1/auditp.txt
$$ ##AUDIT TRAIL=  $$ (NUMBER, WHEN, WHO, WHERE, PROCESS, VERSION, WHAT)
(   1,<2016-05-01 18:23:55.130 -0700>,<Administrator>,<X>,<go>,<TOPSPIN 2.1>,
      <created by zg
	started at 2016-05-01 18:22:49.208 -0700,
	POWCHK enabled, PULCHK disabled,
       configuration hash MD5:
       21 0F 79 D6 B3 7B B4 F6 88 20 88 DB 03 48 BD 9F
       data hash MD5: 64K
       5A EA 5C 21 C7 83 BB 28 05 79 E6 A1 88 D6 BE 45>)
(   2,<2016-05-01 18:23:58.208 -0700>,<Administrator>,<X>,<proc1d>,<TOPSPIN 2.1>,
      <Start of raw data processing
       efp LB = 0 FT_mod = 6 PKNL = 1 PHC0 = 0 PHC1 = 0 SI = 32K 
       data hash MD5: 32K
       58 7A A7 C6 8F 34 EE 5D 47 3E 07 F6 71 BA B4 5F>)
(   3,<2016-05-01 18:23:58.474 -0700>,<Administrator>,<X>,<proc1d>,<TOPSPIN 2.1>,
      <pk PHC0 = 95.39978 PHC1 = 0 
       data hash MD5: 32K
       25 9E 5D EC B7 12 E9 4B 23 F7 45 43 40 B4 A2 18>)
(   4,<2016-05-01 18:23:58.583 -0700>,<Administrator>,<X>,<proc1d>,<TOPSPIN 2.1>,
      <abs ABSG = 1 
       data hash MD5: 32K
       CC 7E 3F 6D 57 EF F7 31 54 2E 44 7F 01 79 71 AA>)
(   5,<2016-05-01 18:23:58.630 -0700>,<Administrator>,<X>,<proc1d>,<TOPSPIN 2.1>,
      <abs ABSG = 2 
       data hash MD5: 32K
       ED C2 1B 54 22 7C 0A 09 FA 38 A2 C7 4C 37 BD C3>)
(   6,<2016-05-01 18:23:58.708 -0700>,<Administrator>,<X>,<proc1d>,<TOPSPIN 2.1>,
      <abs ABSG = 3 
       data hash MD5: 32K
       9B FF 1D 78 A1 FE E8 73 0D 0C BC 30 A3 81 6A 11>)
(   7,<2016-05-01 18:23:58.755 -0700>,<Administrator>,<X>,<proc1d>,<TOPSPIN 2.1>,
      <abs ABSG = 4 
       data hash MD5: 32K
       08 A4 20 71 07 99 18 17 49 D0 ED 97 DE 6E 42 B3>)
(   8,<2016-05-01 18:23:58.817 -0700>,<Administrator>,<X>,<proc1d>,<TOPSPIN 2.1>,
      <abs ABSG = 5 
       data hash MD5: 32K
       84 58 0E 80 11 7A DF A3 02 5A 65 91 52 4C 4F 5D>)
$$ ##END=
$$ 
$$ $$ hash MD5
$$ $$ 8D 5A 61 04 08 AB 71 05 15 8D 67 B2 29 E2 82 1D
##$RELAX= 
##$RELAX= 
##$RELAX= 
##$RELAX= 
##$RELAX= 
##$RELAX= 
##$RELAX= 
$$ Bruker specific parameters
$$ --------------------------
##$DU= <E:\>
##$EXPNO= 10
$$ [...]
150 150 150 150 150 150 150 150
##$TP07= 0
##$TPNAME0= <>
##$TPNAME1= <>
##$TPNAME2= <>
##$TPNAME3= <>
##$TPNAME4= <>
##$TPNAME5= <>
##$TPNAME6= <>
##$TPNAME7= <>
##$TPOAL= (0..7)
0.5 0.5 0.5 0.5 0.5 0.5 0.5 0.5
##$TPOFFS= (0..7)
0 0 0 0 0 0 0 0
##$TUNHIN= 0
##$TUNHOUT= 0
##$TUNXOUT= 0
##$USERA1= <user>
##$USERA2= <user>
##$USERA3= <user>
##$USERA4= <user>
##$USERA5= <user>
##$V9= 5
##$VALIST= <valist>
##$VCLIST= <CCCCCCCCCCCCCCC>
##$VD= 0
##$VDLIST= <DDDDDDDDDDDDDDD>
##$VPLIST= <PPPPPPPPPPPPPPP>
##$VTLIST= <TTTTTTTTTTTTTTT>
##$WBST= 2048
##$WBSW= 25
##$XGAIN= (0..3)
0 0 0 0
##$XL= 0
##$YL= 0
##$YMAX_a= 578307
##$YMIN_a= -490660
##$ZGOPTNS= <>
##$ZL1= 120
##$ZL2= 120
##$ZL3= 120
##$ZL4= 120
##$ABSF1= 14.98509
##$ABSF2= -5.573092
##$ABSG= 5
##$ABSL= 3
##$ALPHA= 0
##$AQORDER= 0
##$ASSFAC= 0
##$ASSFACI= 0
##$ASSFACX= 0
##$ASSWID= 0
##$AUNMP= <proc_prof1d_extract_pilot.lims>
##$AXLEFT= 0
##$AXNAME= <>
##$AXNUC= <1H>
##$AXRIGHT= 0
##$AXTYPE= 0
##$AXUNIT= <>
##$AZFE= 0.1
##$AZFW= 0.1
##$BCFW= 0
##$BC_mod= 0
##$BYTORDP= 0
##$COROFFS= 0
##$CY= 15
##$DATMOD= 1
##$DC= 0
##$DFILT= <>
##$DTYPP= 0
##$F1P= 0
##$F2P= 0
##$FCOR= 0.5
##$FTSIZE= 32768
##$FT_mod= 6
##$GAMMA= 0
##$GB= 0
##$INTBC= 1
##$INTSCL= 1
##$ISEN= 128
##$LB= 0
##$LEV0= 0
##$LPBIN= 0
##$MAXI= 10000
##$MC2= 0
##$MEAN= 0
##$ME_mod= 0
##$MI= 0
##$NCOEF= 0
##$NC_proc= -8
##$NLEV= 6
##$NOISF1= 0
##$NOISF2= 0
##$NSP= 0
##$NTH_PI= 0
##$NZP= 0
##$OFFSET= 14.98509
##$PC= 1
##$PHC0= 95.39978
##$PHC1= 0
##$PH_mod= 1
##$PKNL= yes
##$PPARMOD= 0
##$PPDIAG= 0
##$PPIPTYP= 0
##$PPMPNUM= 2147483647
##$PPRESOL= 1
##$PSCAL= 4
##$PSIGN= 0
##$PYNMP= <proc.py>
##$REVERSE= no
##$SF= 400.02
##$SI= 32768
##$SIGF1= 0
##$SIGF2= 0
##$SINO= 400
##$SIOLD= 32768
##$SPECTYP= <>
##$SREGLST= <1H.CDCl3>
##$SSB= 0
##$STSI= 32768
##$STSR= 0
##$SW_p= 8223.68421052631
##$SYMM= 0
##$S_DEV= 0
##$TDeff= 65536
##$TDoff= 0
##$TI= <>
##$TILT= no
##$TM1= 0
##$TM2= 0
##$TOPLEV= 0
##$USERP1= <user>
##$USERP2= <user>
##$USERP3= <user>
##$USERP4= <user>
##$USERP5= <user>
##$WDW= 1
##$XDIM= 32768
##$YMAX_p= 423956754
##$YMIN_p= -743160
##$CURPLOT= <Network HP LaserJet P1505>
##$CURPRIN= <$Network HP LaserJet P1505>
##$DFORMAT= <normdp>
##$LAYOUT= <+/1D_H.xwp>
##$LFORMAT= <normlp>
##$PFORMAT= <normpl>
##$SURQMSG= 1
$$ End of Bruker specific parameters
$$ ---------------------------------
##NTUPLES= NMR SPECTRUM
##VAR_NAME=  FREQUENCY,     SPECTRUM/REAL,   SPECTRUM/IMAG
##SYMBOL=    X,             R,               I
##VAR_TYPE=  INDEPENDENT,   DEPENDENT,       DEPENDENT
##VAR_FORM=  AFFN,          ASDF,            ASDF
##VAR_DIM=   32768,         32768,           32768
##UNITS=     HZ,            ARBITRARY UNITS, ARBITRARY UNITS
##FACTOR=    0.250966925370066, 1,           1
##FIRST=     8223.43324360094, -46554,       -45345
##LAST=      0,             889,             -393292
##MIN=       0,             -743160,         0
##MAX=       8223.43324360094, 423956754,    0
$$ Real data points
##PAGE= N=1
##DATA TABLE= (X++(R..R)), XYDATA
$$ [...]
$$ plain form
19529 211708 -319354 -166469 -261766 220221 -222499 -206702 100309 -244671 7364 -238598
19518 -102489 75379 -280718 -156389 -10758 -244573 -66413 44213 -367254 -209426 415570
19507 -235643 11609 -124479 -123847 69334 -139034 -169533 -24819 -149596 -51238 -453293 -76617
19495 92013 -186052 -25031 -163554 38032 109594 73909 -206214 -322373 103027 -239861
19484 -277778 30884 73612 -39367 122349 -61196 -211757 -65535 -45564 -136623 -74215 303287
19472 -99725 -146003 255279 -45201 331777 3850 -35239 -211183 -111299 124901 55292 -76683
19460 -315501 -55546 -13493 171365 -218819 142945 -194081 34611 -120475 -54101 13434
19449 -38603 -82495 -100115 -83084 -57831 36136 -179820 -75757 83977 28544 81303 -130331
$$ packed form
19529B11708c19354J52885r5297B20221b22499J5797A00309b44671G364b38598
19518a02489G5379b80718J24329a0758k33815f6413D4213c67254J57828D15570
19507b35643A1609a24479O32F9334a39034l0499b4819j24777e1238m02055g6617
19495I2013a86052b5031j38523C8032P1562l5685b06214j16159A03027b39861
19484b77778C0884M2728c9367A22349f1196j50561f5535J9971r1059O2408C03287
19472i9725m6278B55279d5201C31777C850c5239j75944R9884A24901E5292g6683
19460c15501e5546a3493A71365b18819A42945a94081C4611a20475e4101A3434
19449c8603m3892j7620J7031K5253C6136a79820g5757H3977B8544N2759a30331
$$ plain form
19437 52113 -54626 186922 -41948 120027 -62129 -494689 -303775 299124 289435 -379534 102535
19425 151427 -84458 -353690 -443394 -78685 -140999 211566 -86646 36937 -75500 78176 -103671
19413 -228610 -239223 -152300 14033 -134558 -255364 -261059 -95900 11583 -220956 -319042 -332878
19402 -332878 115372 151104 692 -236612 -52453 83275 6921 -300514 19534 -157456 -99796
19391 -99796 110015 107265 97271 36847 338302 -137968 -4694 -110713 49 84404 252865 70143
19378 14997 -84046 -158603 -101683 12683 26869 -391957 331593 -386744 -58520 -146035 -93533
19367 -93533 -41052 -132166 30842 -337401 -164394 8822 -28950 221160 268830 159187 -27144
19355 124701 -220024 -287961 -107268 -167007 -13398 -281680 391907 -324352 -141870 -128617
$$ packed form
19437E2113e4626A86922d1948A20027f2129m32560J90914B99124r689c79534A02535
19425A51427h4458k69232q9704g8685o2314B11566h6646C6937g5500G8176a03671
19413b28610j0613Q6923A4033a34558j20806n695i5900A1583b20956r8086j3836
19402c32878A15372L5732F92b36612e2453H3275F921c00514A9534a57456N7660
19391i9796A10015k750r994C6847L01455a37968d694j06019D9Q4355J68461G0143
19378A4997h4046p4557N6920A2683J4186c91957C31593c86744e8520q7515N2502
19367i3533d1052r1114C0842c37401a64394H822b8950B21160M7670j09643b7144
19355A24701b20024o7937a07268n9739a3398k68282C91907c24352a41870J3253
$$ plain form
19345 -128617 63314 36267 30053 -123499 -275933 139163 -250432 -326924 18627 126772 85001
19334 85001 109995 99782 -134754 -14523 -47710 -139478 -52279 -399859 25528 -75791 19451
19322 -477542 115511 -30963 -239976 -131505 -344914 -166848 24964 -165373 -117719 -293822
19312 -293822 -98453 15978 -67779 -18766 98350 256344 -130483 -19088 -15166 -376732 -145431
19300 -109888 -91569 92517 -155393 96351 594 181904 95694 -10607 33574 -265339 -91520
19288 76985 110006 -33747 6679 111112 -178213 -600467 -130958 -30901 216524 195440 86143
19276 -267874 -16333 -78520 131291 -108171 91837 47461 -243470 -152152 -227150 129515 -95937
19264 -157309 84255 -152262 191450 226833 119944 -202597 -151406 342875 -129868 -121838
$$ packed form
19345a28617F3314k7047o214a23499j52434A39163b50432p6492A8627J08145m1771
19334H5001K4994j0213a34754a4523l3187r1768e2279l47580B5528g5791A9451
19322d77542A15511c0963k09013J08471k13409a66848B4964a65373M7654j76103
19312b93822i8453A5978f7779a8766I8350J57994a30483a9088L922l61566a45431
19300a09888J8319I2517a55393I6351E94J81310q6210a0607C3574b65339i1520
19288G6985L3021c3747F679J04433a78213m22254a30958c0901B16524k1084H6143
19276b67874a6333o2187A31291a08171I1837m4376b43470R1318p4998A29515i5937
19264a57309H4255a52262A91450L5383j06889b02597N1191C42875a29868Q030
$$ plain form
19254 -121838 -152653 12576 -249736 -64117 -197322 111990 157784 64742 -271752 142044
19243 23969 -59647 249796 -101420 -140595 -41306 16219 148951 133086 -80575 206821 35015
19231 -65565 262837 -2903 -13485 -20378 -147874 -96057 -65000 -245512 -67246 24297 -165626
19219 -294204 86590 -153396 -82080 -3591 -102504 -85742 -73827 -137392 187837 -127591 -165019
19208 -165019 -44616 -44540 -61839 -217803 258236 63776 -50738 -83489 155708 -91908 -158294
19197 -158294 -254282 -400376 56027 45407 -283022 248628 -123061 187951 -95579 -191981
19187 -191981 -29065 -400354 -55614 -103364 -8357 2365 -446725 -92212 -158949 130094 -134380
19175 -99552 285231 14086 -3685 -122731 -65836 -561555 -19667 -298177 59729 -251681 -212549
$$ packed form
19254a21838l0815A2576b49736f4117j33205A11990M5794F4742b71752A42044
19243B3969e9647B49796a01420l9175d1306A6219J32732j5865h0575B06821C5015
19231f5565B62837b903j0582o893j27496N1817L1057j80512f7246B4297a65626
19219b94204H6590a53396P1316c591r8913J6762J1915o3565A87837a27591l7428
19208a65019d4616P6j7299j55964B58236F3776e0738l2751A55708i1908o6386
19197a58294r5988j46094E6027j0620b83022B48628a23061A87951i5579r6402
19187a91981b9065l71289e5614m7750h357B365d46725i2212o6737A30094a34380
19175i9552B85231A4086c685j19046N6895m95719a9667k78510E9729b51681L9132
$$ plain form
19164 -212549 -63429 -165751 -349166 -105724 -193266 -87718 -84718 -86447 -71493 -87509 34064
19152 149417 -413415 92765 -149384 218737 171884 445 -203737 27196 -210274 88072 98511
19141 98511 -111854 99593 -94021 -36737 205672 -157617 -248698 33269 -233960 -257887 177685
19129 -74897 -11066 -267176 15033 70704 13746 -138375 83624 -199420 -42100 40441 -95384
19117 114632 -1792 40352 -315541 -305823 -88010 142670 -97799 13810 87611 65736 -5150 -10290
19105 -10290 -176194 171926 -13567 167924 -46887 147461 -103835 -183592 -342682 113999
19094 -60727 -163314 -132421 391055 57945 -50359 -2875 -21387 -124221 -212811 -3955 46709
19082 82657 -484019 -60181 244609 -24339 23435 225898 50513 103139 30778 -92722 -313093
$$ packed form
19164b12549f3429j02322j83415a05724q7542h7718L000j729J4954j6016C4064
19152A49417d13415I2765a49384B18737m6853D45b03737B7196b10274H8072J0439
19141I8511a11854I9593i4021c6737B05672a57617r1081C3269b33960k3927A77685
19129g4897a1066k56110A5033N5671A3746a38375H3624a99420d2100D0441i5384
19117A14632a792D0352c15541R718h8010A42670i7799A3810P3801k1875e150n140
19105a0290j65904A71926a3567A67924d6887A47461a03835p9757j59090A13999
19094f0727j02587L0893C91055E7945e0359b875j8512j02834q8590c955D6709
19082H2657d84019f0181B44609b4339B3435K02463E0513N2626C0778i2722k20371
$$ plain form
19071 -313093 155569 -151135 -305079 210683 154416 -225437 -242225 -78994 -129675 -127963 -64733
19060 -64733 -142747 137332 -125081 -206849 249120 -226373 -179606 144190 228676 18021 -43504
19048 -36049 -10100 -47109 41035 78690 -62538 -195246 232392 -257609 -220547 -54974 -45360
19037 -45360 57762 -47935 176419 144249 99752 181077 -46219 -69012 -200850 -192563 197129
19025 -250916 74688 155970 -123633 91566 -310895 -294672 -195339 -150451 -169102 -6388 -91653
19014 -91653 22078 120125 -92073 -347828 -21953 162523 15329 386620 -158379 42449 -281468
19002 -184222 352600 -257234 -111365 -65604 -238328 -64464 -268461 -6982 -180234 -193877
18992 -193877 -40217 195934 36083 60216 -345970 -294701 -13768 88328 140531 66413 -144534
$$ packed form
19071c13093A55569a51135j53944B10683n6267b25437j6788g8994n0681J712O3230
19060f4733p8014A37332a25081q1768B49120b26373M6767A44190Q4486A8021d3504
19048c6049a0100l7009D1035L7655f2538j32708B32392b57609L7062e4974R614
19037d5360E7762d7935A76419l2170m4497Q1325d6219k2793j31838Q287A97129
19025b50916G4688Q1282a23633I1566c10895J6223R9333M4888j8651f388q5265
19014i1653B2078R8047i2073k55755b1953A62523A5329L71291a58379D2449b81468
19002a84222C52600b57234a11365M5761j72724f4464k03997f982j73252j3643
18992a93877d0217A95934C6083K4133c45970N1269a3768H8328N2203F6413a44534
$$ plain form
18980 18450 -189954 -20348 -106862 180583 9097 -50200 187408 -125731 -81234 18110 35388
18969 35388 130115 136999 293750 175879 -391523 69966 -189926 -20173 -88768 -17533 -86251
18958 -86251 -179580 -185007 -295326 -380874 186103 9958 16852 -25744 -52491 -211855 31265 -75626
18945 -43641 -104226 -147317 -383726 416001 -10963 253638 -232707 283254 -38805 -149441
18935 -149441 359357 127451 -103134 120718 -49858 -231001 -68050 50928 -162152 -341161
18925 -341161 -71663 -34309 131181 -120370 111916 -164482 92018 -223433 -25080 -99005
18915 -99005 121337 -178524 74776 -148247 -28635 -19960 -49424 386734 190778 166079 -332392
18903 243058 134962 -172025 2748 144513 180666 -32092 -29308 362109 133248 -22022 -83351
$$ packed form
18980A8450a89954b0348q6514A80583I097e0200A87408a25731M4497A8110J7278
18969C5388R4727O884J56751j17871c91523F9966a89926b0173o8595a7533o8718
18958h6251r3329n427j10319q5548A86103I958O894b5744k6747j59364C1265g5626
18945d3641o0585m3091k36409D16001a0963B53638b32707B83254c8805j10636
18935a49441C59357A27451a03134A20718d9858j81143f8050E0928a62152j79009
18925c41161g1663c4309A31181a20370A11916a64482I2018b23433b5080p3925
18915i9005A21337a78524G4776a48247b8635Q675k9464C86734A90778k4699c32392
18903B43058j08096a72025B748J41765L6153c2092K784C62109A33248b2022o1329
$$ plain form
18892 -83351 274568 80051 -188383 -250663 24539 35186 -258556 -140851 13653 40718 322282
18881 322282 -28208 -140859 215586 6130 -4459 198276 -244588 -91759 61999 -328558 -178945
18870 -178945 -7588 47722 -127656 10418 -74400 51692 -272003 -373874 -134019 136877 25527
18858 303088 -234052 -39270 9809 -194947 -285765 94987 344316 -65716 266469 -122229 155251
18846 -147797 -72325 32725 247943 245799 -62630 -15740 -152384 -100262 -58004 -84680 62480
18834 -83084 -120756 -97065 -7134 133854 38812 -190361 -155988 -81778 -27970 -275608 -248328
18823 -248328 -41401 45468 -158432 -14969 -246749 -80763 -163146 103375 -284341 -110654
18812 -141079 129711 44784 -10544 -29077 11664 -169225 -258945 -13417 -14871 -213538 306256
$$ packed form
18892h3351B74568H0051a88383o2280B4539J0647b58556J17705A3653K7065K81564
18881C22282b8208j12651B15586F130d459A98276b44588i1759F1999c28558J49613
18870a78945g588D7722a27656A0418g4400E1692b72003j01871a34019A36877B5527
18858C03088b34052c9270I809a94947r0818I4987K49329f5716B66469a22229A55251
18846a47797g2325C2725K15218k144f2630a5740j36644N2122M2258k6676F2480
18834h3084l7672K3691g134A33854C8812a90361L4373P4210b7970k47638K7280
18823b48328d1401D5468a58432a4969k31780h0763q2383A03375b84341a10654
18812a41079A29711D4784a0544j8533A1664a69225q9720a3417j454j98667C06256
$$ plain form
18800 125906 -851 218942 9236 -85768 33098 16359 78447 -36397 -7371 325672 29272 31780
18788 31780 -196838 65961 239797 -210139 -455427 -80364 55834 -246899 -228925 60355 -383955
18776 242741 -233896 -289401 18737 63845 -171962 -232956 9053 36296 221695 -168730 149248
18764 199131 80310 -50072 -241899 -47814 -253782 -316850 159440 34383 46684 -91978 -106342
18753 -106342 65866 -165784 144805 7616 -236772 -30739 -348682 -156320 -167592 -45919 6903
18741 -30633 -67920 -75182 -63577 92162 -348501 -74674 158808 -169036 149689 271779 -398785
18729 -92927 -53145 -53390 -508359 -358559 -163905 29910 -18512 -26908 -242277 -172204 154039
18717 192140 -349226 -233699 20616 -188002 33656 -320266 42117 -85937 126035 -122046
$$ packed form
18800A25906h51B18942I236h5768C3098A6359O2088c6397g371C25672B9272K508
18788C1780a96838F5961J73836b10139k45288h0364E5834b46899J7974F0355c83955
18776B42741b33896n5505A8737M5108a71962o0994I053K7243J85399a68730A49248
18764A99131H0310e0072j91827d7814k05968o3068A59440C4383J2301i1978j4364
18753a06342F5866a65784A44805G616b36772c0739l17943a56320j1272d5919F903
18741c0633l7287p262J1605I2162c48501g4674A58808a69036A49689J22090c98785
18729i2927L9782k45m54969J49800a63905B9910a8512q396k15369P0073A54039
18717A92140c49226J15527B0616a88002C3656c20266D2117h5937A26035a22046
$$ plain form
18706 3003 199037 -352368 -187175 38962 -175076 128402 -46153 -135345 126011 31569 -9365
18694 -73913 159284 -195379 154585 60551 184013 -70028 -50094 94990 161490 217909 135738
18683 135738 -152715 -346537 -121735 -110428 238604 -47048 -78937 -320994 -28412 -362589
18673 -362589 73124 -243936 203543 -194520 -245014 -168642 -80666 -112534 121996 -45639 -55561
18662 -55561 -281418 -159361 123280 -152542 -122956 233277 18051 -139144 -41605 129444
18651 -78156 -58787 287004 -64231 -51628 256796 -380615 -168769 -67882 12036 -79632 24897
18639 116311 -63943 -86133 -146040 -12604 62913 -266502 -139939 -527196 49864 -129947 68081
18627 30218 46097 99811 108909 185647 66058 -432475 4710 32969 -4763 121834 27139 6352
$$ packed form
18706C003J96034c52368J65193C8962a75076A28402d6153q9192A26011C1569i365
18694g3913A59284a95379A54585F0551J23462g0028J9934I4990O6500N6419q2171
18683A35738a52715j93822a21735J1307B38604d7048l1889k42057b8412l34177
18673c62589G3124b43936B03543a94520n0494P6372h0666l1868A21996d5639r922
18662e5561k25857J22057A23280a52542K9586B33277A8051a39144d1605A29444
18651g8156J9369B87004f4231J2603B56796c80615a68769f7882A2036g9632B4897
18639A16311f3943k2190n9907a2604F2913b66502J26563l87257D9864a29947F8081
18627C0218J5879N3714R098P6738F6058d32475D710K8259d763A21834B7139F352
$$ plain form
18614 -69838 109127 -254103 311917 34172 82984 -178163 91642 -412838 224174 115918
18604 115918 81616 39232 157226 65389 29606 157558 56707 91816 251036 129040 125889
18593 125889 -415837 -19236 148627 -391854 -65846 -62922 250431 124974 -140721 -75097
18583 -75097 -15185 30172 -284618 -432763 -463744 -157796 -284364 69228 118092 61993 -93469
18571 -184521 -248483 -196266 -236952 78140 -90208 854 -156986 -224419 95074 151988 -100168
18559 -46847 17351 -133958 42035 184143 10081 83109 111309 91857 117432 -84733 -70753
18548 -70753 -198287 97733 -35585 -6773 -130458 2073 -195418 -88107 40977 -243485 183391
18536 44776 -68187 -39227 -363226 -152643 -110349 -9814 -87761 239745 -127964 145876 110315
$$ packed form
18614f9838A09127b54103C11917C4172M8812a78163I1642d12838B24174j08256
18604A15918l4302C9232J17994F5389B9606J27952E6707L5109J59220j21996l151
18593A25889d15837a9236A48627c91854f5846K924B50431A24974a40721O5624
18583g5097a5185C0172b84618j48145l0981a57796j26568F9228M8864n6099i3469
18571a84521o3962N2217m0686G8140i0208H54a56986o7433I5074N6914a00168
18559d6847A7351a33958D2035J42108A0081P3028K8200j9452K5575h4733J3980
18548g0753j27534I7733c5585f773j23685B073a95418h8107D0977b43485A83391
18536D4776f8187K8960l23999a52643M2294i814p7947B39745a27964A45876l5561
$$ plain form
18525 110315 161489 -66271 -192858 -52004 156157 -197731 -200113 137058 -127851 -98996 -24957
18513 151503 -108084 -344140 205109 -126313 -228614 288591 157747 -155751 -174226 50747
18502 32576 52893 231852 -131619 -105872 67962 171831 -12000 -28071 -62440 -173395 24592
18490 -224085 156661 216578 -251212 -83748 -122234 -487728 132232 272881 398340 -183660
18479 -70957 -263052 -291576 147476 69177 -9511 -108551 -63309 -43273 -147955 -45475 -57775
18468 -57775 -222510 -234328 60593 -152418 -92438 -167299 -98791 214795 192695 135754 -293864
18456 173263 -61993 -214822 -271928 141100 115397 -126536 -202828 -210501 -36753 -246821 68293
18444 -84108 837 126686 -218285 -101212 -116591 371797 181880 -330725 135250 -167447
$$ packed form
18525A10315N1174f6271j26587e2004A56157a97731k382A37058a27851K8855b4957
18513A51503a08084k36056B05109a26313j02301B88591j30844a55751j8475E0747
18502C2576K0317J78959a31619K5747F7962J03869a2000j6071l4369j10955B4592
18490b24085A56661N9917b51212h3748l8486l65494A32232J40649J25459a83660
18479g0957j92095k8524A47476F9177i511r9040M5242K0036j04682d5475j2300
18468e7775j64735j1818F0593a52418N9980p4861O8508B14795k2100n6941b93864
18456A73263f1993j52829n7106A41100k5703a26536p6292p673c6753k10068F8293
18444h4108H37J25849b18285a01212j5379C71797A81880c30725A35250a67447
$$ plain form
18433 -41743 186547 175715 104334 190235 167805 -45813 -44512 213244 -171779 -108987 413093
18421 232099 -7989 -90458 -229827 -239806 -126124 -380798 99051 -46764 -172134 -60386 -212933
18410 -212933 -4618 64559 213913 -49947 -129240 189550 -3546 146901 -277029 76506 -2484
18398 -19927 -207656 28117 -25678 -44869 -152352 164357 26276 -170646 4317 -233132 -222812
18387 -222812 -288360 -170911 80969 129663 73096 -273600 -76090 221662 85043 98854 67887
18376 67887 -104227 122696 -243209 -180493 -160469 31822 -319050 94562 225921 51652 -82553
18364 128096 -243725 -128222 308542 158937 -281785 36408 -183561 100360 48393 128012
18354 128012 109222 -50320 -104728 -316175 -20535 31725 -164739 249430 -36844 191534 196421
$$ packed form
18433d1743A86547j0832p1381Q5901k2430d5813J301B13244a71779O2792D13093
18421B32099g989q2469j39369r979J13682k54674I9051d6764j25370f0386j52547
18410b12933d618F4559J49354d9947p9293A89550c546A46901b77029G6506b484
18398a9927j87729B8117b5678j9191j07483A64357B6276a70646D317b33132J0320
18387b22812o5548J17449H0969M8694n6567b73600g6090B21662H5043J3811l0967
18376F7887a04227A22696b43209O2716K0024C1822c19050I4562J31359E1652h2553
18364A28096b43725J15503C08542j49605b81785C6408a83561A00360D8393P9619
18354A28012j8790e0320n4408k11447b0535C1725a64739B49430c6844A91534M887
$$ plain form
18343 196421 -270446 36154 -78298 328660 26018 -22627 -46256 -126971 36560 -171567 -63552
18331 -76906 -197137 62658 -197052 -243011 40232 -187385 -149019 -67187 -4760 45944 -141964
18319 -158175 91833 32150 64675 -100559 94939 80054 -281193 -24744 101112 -247372 20980
18307 68939 -257590 35142 -41783 99005 -286247 -100059 -14597 -227029 218793 -16328 236746
18295 -116484 91708 -112240 60569 299471 148312 -265349 -136171 195545 -3119 -100236
18285 -100236 63710 -213776 25887 -27274 78677 62526 157489 -224077 12214 -163127 214717
18273 -40046 -163701 -16798 -963 -143580 118833 -116671 -164378 -22933 110391 121598 -334884
18261 89815 32561 30869 -149429 -52721 -109078 177293 3161 -314012 -29610 172963 -338015
$$ packed form
18343A96421b70446C6154g8298C28660B6018b2627k3629q0715C6560a71567f3552
18331g6906j20231F2658a97052m5959D0232a87385L8366f7187d760D5944a41964
18319a58175I1833C2150L2525a00559I4939j4885b81193b4744A01112b47372B0980
18307F8939b57590C5142d1783I9005b86247a00059a4597k12432B18793a6328B36746
18295a16484I1708a12240F0569K38902A48312b65349J29178A95545c119r7117
18285a00236F3710b13776B5887b7274G8677j6151R4963b24077A2214a63127B14717
18273d0046j23655a6798i63j42617A18833a16671m7707b2933A10391J1207c34884
18261H9815C2561j692a49429e2721n6357A77293C161c14012b9610A72963c38015
$$ plain form
18249 99789 10683 -90525 -158706 -368405 -187787 -188706 -137282 550867 -69054 -190621 -177321
18238 -177321 56567 -247690 -62467 162435 50764 225233 -365998 -54626 298802 -21661
18227 -37733 -50276 -227341 120782 -68817 -194255 309927 35455 100419 -170719 258043
18216 511004 -179676 44285 -58002 36513 -233696 -324795 -20156 -126394 -347385 88105 -14107
18204 105248 162832 39634 76208 -207849 244227 105644 10139 129187 135116 -178989 -39827
18192 -240178 60583 -165189 -6122 -202956 46192 -275024 -3477 -48287 -162814 113342 183966
18181 183966 -424951 -1613 191662 -89406 -214797 115713 305152 180733 -65257 -5199 -96847
18170 -96847 12586 91446 71421 106504 -600 -5445 295979 -226288 -303158 151599 62255 -91635
$$ packed form
18249I9789A0683i0525o8181k09699J80618r19N1424E50867f9054j21567J3300
18238a77321E6567b47690f2467A62435E0764J74469c65998e4626B98802b1661
18227c7733j2543j77065A20782f8817j25438C09927C5455O4964a70719B58043
18216E11004a79676D4285e8002C6513b33696r1099b0156j06238k20991H8105a4107
18204A05248N7584C9634L6574b07849B44227A05644A0139J19048N929a78989c9827
18192b40178F0583a65189f122j96834D6192b75024c477m4810j14527A13342P0624
18181A83966d24951a613A91662h9406j25391A15713J89439j24419f5257e199r1648
18170i6847A2586P8860k0025L5083f00m845B95979b26288p6870A51599F2255i1635
$$ plain form
18157 -1963 -80334 -225961 -281726 77653 -102375 9845 -147542 -4639 185082 -112484 106054
18145 249677 -193348 -209473 41973 92350 20312 129272 -306561 76953 100604 28381 -192452
18133 206650 -278 31094 243876 -238208 -321199 118054 103338 -109487 -155829 78644 4317
18121 192124 359371 69554 -231311 45330 -19915 -5379 -400850 -31344 57868 -240855 -191988
18110 -191988 -154713 127895 -402441 -111233 104993 219082 70386 134771 111668 17405
18099 100508 -89486 -33434 -268679 31826 -256534 80256 -98313 231318 145601 31224 140879
18088 140879 -179522 188323 228330 -169827 -476869 -42470 -172438 170424 -219136 -348421
18078 -348421 -119266 186596 -246211 240238 -200882 308268 -284903 55970 59725 -210840
$$ packed form
18157a963p8371j45627n5765G7653a02375I845a47542d639A85082a12484A06054
18145B49677a93348j6125D1973N0377B0312J08960c06561G6953K3651B8381a92452
18133B06650b78C1094K12782b38208q2991A18054j4716a09487m6342G8644D317
18121A92124J67247F9554b31311D5330a9915e379l95471c1344E7868b40855M8867
18110a91988L7275A27895d02441a11233A04993J14089G0386O4385k3103A7405
18099A00508h9486c3434k35245C1826b56534H0256i8313B31318q5717C1224J09655
18088A40879a79522A88323M0007a69827l07042d2470j29968A70424b19136j29285
18078c48421a19266A86596b46211B40238b00882C08268b84903E5970L755b10840
$$ plain form
18067 -120231 147535 110960 -61963 -109746 -127028 256578 47481 -120776 -89829 -177676 -137477
18056 -137477 -162516 85343 -170305 198172 271997 -166337 -20558 -146006 6071 205249 255075
18045 255075 -87575 357204 256493 77425 294024 123786 146275 -147324 -52304 -180796
18035 -180796 -32733 -279396 237614 126332 93362 -123766 -48916 -68583 -123521 -504180
18025 -504180 287391 105968 201775 -109194 -38422 -390946 -218862 96641 -134136 28590
18014 -178614 -241235 44591 -16541 251609 126773 13336 107209 116521 89790 -237217 158876
18002 150148 287925 -359992 -178769 -79983 -190626 -21136 102183 202497 -16041 -73065
17992 -73065 -247775 -148542 -6197 104428 -422728 -73346 56321 -183673 -322627 8477 -198681
$$ packed form
18067a20231A47535l6575f1963m7783j7282B56578D7481a20776L0947q7847M0199
18056a37477k5039H5343a70305A98172P3825a66337b0558j25448F071J99178M9826
18045B55075h7575C57204j00711G7425K16599A23786K2489a47324e2304j28492
18035a80796c2733k46663B37614j11282l2970a23766d8916j9667n4938l80659
18025e04180B87391A05968R5807a09194c8422l52524J72084I6641a34136B8590
18014a78614o2621D4591a6541B51609j24836A3336R3873R312k6731b37217A58876
18002A50148J37777c59992a78769g9983j10643b1136A02183J00314a6041n7024
17992g3065j74710R9233f197A04428d22728g3346E6321a83673j38954H477a98681
$$ plain form
17980 7781 93846 170240 -259135 163819 -345739 63602 -72557 -55351 -81831 -324313 -23975
17968 37029 72966 133848 54491 192296 178417 -40463 72135 -112398 73871 378506 -37090
17956 25537 139838 -41441 -257523 -77630 -145030 41830 -22794 -142692 -27578 43403 -197631
17944 -54759 -27389 -219108 -204087 -31660 -54634 8035 253812 -55299 365542 -56244 231355
17932 -43052 96132 -145629 28846 11897 -268466 -205905 -34067 65887 245475 -149102 34504
17920 119625 -316 -203218 -113258 -119101 154921 -141572 -109267 -7790 -87082 324533 78426
17908 -181761 -57401 -45558 73039 -363574 136064 -286121 7871 79998 -115277 -41273 269582
17896 131025 -163069 -93917 129676 78782 -161299 -34719 -61122 179967 -136285 -68637
$$ packed form
17980G781Q6065P6394b59135A63819c45739F3602g2557J7206k6480k42482b3975
17968C7029L5937O0882E4491J37805j3879d0463G2135a12398G3871L04635c7090
17956B5537J14301d1441k16082g7630o7400D1830b2794j19898b7578D3403a97631
17944e4759K7370j91719J5021c1660k2974H035K45777e5299C65542e6244B31355
17932d3052I6132a45629B8846A1897b68466O2561c4067F5887J79588a49102C4504
17920A19625c16k02902Q9960n843A54921a41572L2305g790p9292C24533G8426
17908a81761e7401J1843G3039c63574A36064b86121G871P2127a15277d1273B69582
17896A31025a63069O9152A29676n0894a61299c4719k6403A79967a36285O7648
$$ plain form
17886 -68637 104445 124729 -11627 202707 -211302 -33885 289503 -41059 -362724 131416
17875 -163535 -247465 51156 82184 -109264 132730 -61370 203597 -174162 -123348 234121
17864 37303 118177 29887 107209 105197 168172 63828 368413 171368 67944 47426 -138975
17852 110626 162365 -66354 80121 -49025 41349 126869 -108434 113452 73300 -55339 -210244
17841 -210244 71161 -9965 -34163 195259 -213208 436940 -15788 238176 271114 -237815 -52784
17829 297708 -140000 -307025 -91900 310310 -199578 -122023 181791 -76683 -13999 83689
17818 118112 -88819 -6723 64617 -82682 141832 -152101 67563 162497 110724 107628 74013
17807 74013 -44093 64832 8949 -368372 115784 93066 -16219 124613 82173 -184299 -114010
$$ packed form
17886f8637A04445K0284a1627B02707b11302c3885B89503d1059l21665A31416
17875a63535q3930E1156L1028a09264A32730f1370B03597a74162N0814B34121
17864C7303Q0874B9887P7322k012O2975F3828L04585A71368F7944k0518a38975
17852A10626N1739f6354H0121d9025D1349Q5520a08434A13452m0152e5339j54905
17841b10244G1161i965k4198A95259b13208D36940a5788B38176L2938b37815e2784
17829B97708a40000j67025i1900C10310a99578P7555A81791g6683a3999H3689
17818A18112h8819f723F4617h2682A41832a52101F7563R4934n1773l096l3615
17807G4013d4093F4832H949c68372A15784k2718a6219A24613m2440a84299P0289
$$ plain form
17796 -114010 -232372 -232967 64862 301339 -156916 150866 -89078 47495 -85597 94947 -130750
17784 -80360 -198493 15544 -119313 125090 -238735 33006 -79174 -270854 60202 174378
17774 174378 -14048 55044 -135809 213112 21964 -127710 -78817 8422 113645 9960 -11773
17762 -20563 38788 -244397 7635 94713 144476 19442 80217 102333 -11832 168369 -126021
17750 314234 424316 -96973 154568 -130543 -33448 110593 -182418 -286295 76223 -96555
17739 3941 -192419 83766 101639 -224027 170948 -178939 133588 29306 195183 -88878 -26355
17727 374373 112595 120440 150096 160137 -67469 -124511 122177 59692 -238630 -53100 108795
17715 54344 -47710 23226 -304601 232092 -249454 45694 207027 232236 -244657 125946
$$ packed form
17796a14010j18362n95F4862K36477a56916A50866h9078D7495h5597I4947a30750
17784h0360j18133A5544a19313A25090b38735C3006g9174j91680F0202J14176
17774A74378a4048E5044a35809B13112B1964a27710M8893H422J05223I960a1773
17762b0563C8788b44397G635Q7078M9763A9442O0775K2116a1832A68369a26021
17750C14234J10082i6973A54568a30543c3448A10593a82418j03877G6223i6555
17739C941a92419H3766J7873b24027A70948a78939A33588B9306J65877h8878b6355
17727C74373A12595P845K9656J0041f7469n7042A22177E9692b38630e3100A08795
17715E4344d7710B3226c04601B32092b49454D5694J61333K5209b44657A25946
$$ plain form
17704 20807 -60314 -45682 -118541 190073 170252 -26707 34017 -106843 128555 -317942 21310
17692 149496 136679 -257221 19686 -47580 -94086 -184829 91885 -113064 104091 -282439 -407570
17681 -407570 215727 171867 102248 106405 -4209 255554 -1727 96588 -202166 126283 14393
17669 129567 -146362 81120 44002 -215777 111852 8012 -66145 -90927 4765 -56715 188013
17657 249897 312543 21887 6655 104822 128568 320496 179917 24245 200316 -334764 76295
17645 16297 46802 -90891 -108845 86375 -107225 56470 169114 97438 172954 67910 -44296
17633 -83143 -112588 -2371 -126484 -174685 -58640 -213117 92899 79821 156597 265353 -102719
17621 -158812 294957 287227 -186063 88489 167211 152717 -134460 268405 -69241 241237 270819
$$ packed form
17704B0807f0314J4632p2859A90073j9821b6707C4017a06843A28555c17942B1310
17692A49496j2817b57221A9686d7580m6506r0743I1885a13064A04091b82439j25131
17681d07570B15727m3860o9619M157d209B55554a727I6588b02166A26283A4393
17669A29567a46362H1120l7118b15777A11852H012f6145k4782D765e6715A88013
17657B49897O2646B1887F655R8167K3746J91928j40579B4245J76071c34764G6295
17645A6297L0505i0891j7954H6375a07225E6470J12644p1676P5516F7910d4296
17633h3143k9445b371j24113m8201e8640j54477I2899j3078P6776J08756a02719
17621a58812B94957p730a86063H8489P8722j4494a34460B68405f9241B41237K9582
$$ plain form
17610 270819 262227 -6642 -59911 209714 72043 156133 119047 79201 -169489 176342 98182
17599 98182 -24160 -99732 254503 29652 66863 230319 300407 185258 -103518 68302 -73939
17587 -40132 30813 206671 -150085 142044 180290 14609 69043 88914 334226 -45654 -11615
17575 -29055 -112536 -61792 -245101 -73673 81982 12382 -124168 83055 -952 -239820 -5028 252319
17562 32935 124409 72477 279206 135370 -159215 130641 -375632 -99193 66723 -14381 166388
17550 288683 75202 -184511 -84156 -4218 100650 -3286 -60026 -270393 99777 159888 103253
17539 103253 89358 -96091 367909 404582 4807 216307 71961 190492 8725 -61956 371775
17527 -73192 180005 216102 196720 169950 338426 194973 143602 -208426 240689 312145 -49098
$$ packed form
17610B70819q592f642n3269B09714G2043Q4090l7086l9846a69489A76342p8160
17599I8182b4160p5572B54503B9652L7211J63456P0088j15149a03518F8302g3939
17587d0132C0813J75858a50085A42044L8246A4609N4434J9871K45312d5654a1615
17575b9055q3481N0744j83309g3673H1982A2382a24168H3055i52k38868e028B52319
17562C2935R1474n1932K06729A35370a59215A30641c75632i9193F6723a4381A66388
17550B88683G5202a84511h4156d218A00650c286n6740k10367I9777O0111n6635
17539A03253j3895i6091C67909L6673D807K11500G1961J18531H725f1956C71775
17527g3192A80005L6097j9382k6770J68476j43453n1371b08426B40689P1456d9098
$$ plain form
17515 327473 157331 -152618 96014 205460 416886 294277 182975 -74709 94418 118413
17505 118413 231087 127138 84480 92213 295592 -57738 358501 31380 -281481 68087 -131906
17493 92454 -44103 -132585 202358 -9513 40665 21586 -22561 114209 355540 28979 -49445
17481 168268 90809 128839 119653 243013 60642 -159497 256045 -42640 472870 60752 80036
17470 80036 -300122 -135713 156733 321896 90790 96349 155433 181823 29813 -222790 -221467
17459 -221467 172818 -132803 341293 -171006 27705 96862 272680 -93593 152852 309202
17449 309202 20323 371453 316514 176172 189204 194142 360159 331214 393533 364387 -151702
17437 349596 191217 -124952 387795 -62882 221660 219500 -164241 -109066 351690 140223
$$ packed form
17515C27473A57331a52618I6014J09446K11426j22609j11302g4709I4418K3995
17505A18413J12674j03949m2658P733K03379e7738C58501C1380b81481F8087a31906
17493I2454d4103q8482B02358i513D0665j9079b2561A14209K41331B8979d9445
17481A68268p7459L8030r186J23360F0642a59497B56045d2640D72870F0752J9284
17470H0036c00122a35713A56733J65163I0790N559N9084K6390B9813b22790J323
17459b21467A72818a32803C41293a71006B7705O9157J75818i3593A52852J56350
17449C09202B0323L51130n4939j40342J3032M938J66017k8945O2319k9146a51702
17437C49596j58379a24952C87795f2882B21660k160a64241N5175C51690A40223
$$ plain form
17426 204540 -99620 170183 601207 208679 250608 112037 119825 60192 212480 -29593 72722
17414 284581 335352 7156 264443 256457 57765 325883 348619 -88528 492832 241431 186038
17403 186038 -58047 115367 336632 -212291 124884 286192 157126 309610 344861 300977
17393 300977 73609 438347 263798 -89083 98017 107316 34864 305517 106996 133367 277690
17382 277690 139280 109433 304575 359086 145957 -140846 54742 59746 193982 186193 291897
17371 291897 -11305 172267 87616 35419 160696 -155352 91316 209603 -125876 -58555
17360 218025 233176 250333 84536 192314 14184 157062 257807 129556 242009 33092
17349 272784 58150 342618 259105 49879 238811 -24176 72403 237892 477398 290008
$$ packed form
17426B04540i9620A70183M31024B08679M1929A12037P788n9633J52288b9593G2722
17414B84581N0771G156K57287p986E7765K68118K2736h8528D92832B41431n5393
17403A86038e8047A15367K21265b12291A24884J61308j29066J52484L5251m3884
17393C00977G3609L64738j74549h9083I8017R299C4864K70653A06996K6371J44323
17382B77690j38410k9847J95142N4511A45957a40846E4742N004J34236p789J05704
17371B91897a1305A72267q4651C5419J25277a55352I1316J18287a25876e8555
17360B18025J5151J7157H4536J07778A4184J42878J00745j28251J12453C3092
17349B72784E8150K84468q3513D9879J88932b4176G2403J65489K39506j87390
$$ plain form
17339 290008 70149 -41257 399507 352107 93355 90826 112051 8534 268920 217879 70043
17327 -272697 38192 359748 -71759 -73418 -158672 15472 284422 106638 -13551 236710 230974
17316 230974 111534 69624 166000 -147083 69962 382989 106228 334262 388258 125454
17305 322292 161036 260183 115628 88183 77593 -220735 323784 240299 265775 173462 47899
17293 271567 249171 -159328 -113768 172923 9533 367413 387291 360378 186636 -156156 191538
17281 206014 37599 72234 -48469 80956 208486 -67440 24772 -29580 120234 292542 126536
17269 200772 58785 443390 181951 -88288 -88590 -201581 -96727 336887 192865 342540 138196
17257 167594 226180 382278 351149 124268 315846 340898 211542 314045 95572 39150
$$ packed form
17339B90008G0149d1257C99507m7400I3355k529K1225H534K60386n1041G0043
17327b72697C8192L21556g1759j659q5254A5472K68950A06638a3551B36710n736
17316B30974A11534m1910R6376a47083F9962L13027A06228K28034N3996A25454
17305C22292A61036R9147A15628k7445j0590b20735C23784q3485K5476r2313D7899
17293B71567k2396a59328M5560A72923I533L57880J9878k6913j73742a56156A91538
17281B06014C7599L4635d8469H0956J27530f7440B4772b9580A20234J72308A26536
17269B00772E8785L84605A81951h8288l02j12991i6727C36887j44022J49675A38196
17257A67594N8586J56098l1129A24268J91578K5052j29356J02503I5572C9150
$$ plain form
17246 113786 346138 129387 301300 302287 258791 141059 133463 289048 261729 -36173 83438
17234 187479 434685 244131 -7248 -24720 32978 -12476 56372 164908 382052 281199 415528
17223 415528 83202 539272 252900 244761 283369 18490 312317 -19641 222925 152352 -100671
17211 437138 321283 253856 108619 6198 245288 338121 57340 249459 116383 -109368
17200 68745 38578 287129 92535 256989 252146 404766 -37309 395243 351089 246704 4416
17188 142316 308843 334049 128662 408142 225273 509579 144549 256550 -173262 -119367
17178 -119367 294144 7667 388223 255817 415009 280462 396673 439061 304174 203743
17168 203743 338415 212974 180088 257740 198422 194821 156089 49565 65101 582695 116751
$$ packed form
17246A13786K32352A29387J71913R87m3496j17732p596J55585k7319c6173H3438
17234A87479K47206j90554g248j7472C2978a2476E6372J08536K17144j00853J34329
17223D15528H3202M56070B52900q139L8608A8490K93827a9641B22925p0573a00671
17211D37138j15855o7427A08619F198K39090R2833E7340J92119A16383a09368
17200F8745l0167K48551I2535J64454m843J52620c7309C95243m4154j04385D416
17188A42316J66527K5206A28662K79480j82869K84306A44549J12001a73262N3895
17178a19367B94144G667L80556j32406J59192j34547J16211M2388j34887j00431
17168B03743J34672j25441l2886P7652n9318l601l8732D9565J5536N17594A16751
$$ plain form
17156 261322 272970 54071 414951 -289 319804 401882 5611 443943 252700 331260 199431
17145 199431 160102 243879 182081 275819 141021 478788 324500 192429 456454 228745
17135 228745 150028 475106 40664 385019 457591 145117 422316 217911 505975 361238
17125 361238 458177 273242 269966 115701 422422 267166 270277 81751 299277 371537 608806
17114 608806 376939 538725 521515 513617 59802 120125 345595 139476 532921 178339
17103 370735 267349 115326 261996 394537 100455 170006 13431 531433 468213 483130
17093 483130 393574 6570 396108 566406 330424 376793 37121 647084 286593 374206 454627
17082 454627 355205 409155 469567 168332 516898 763908 433251 373572 11840 312989
$$ packed form
17156B61322J1648E4071L60880b89C19804Q2078E611M38332j91243P8560j31829
17145A99431l9329Q3777o1798R3738j34798L37767j54288j32071K64025k27709
17135B28745p8717L25078D0664L44355P2572A45117K77199k04405K88064j44737
17125C61238R6939j84935l276A15701L06721j55256L111H1751K17526P2260K37269
17114F08806k31867J61786j7210p898E9802O0323K25470A39476L93445A78339
17103C70735j03386A15326J46670J32541A00455O9551A3431N18002o3220J4917
17093D83130q9556F570L89538J70298k35982M6369C7121O09963B86593Q7613Q0421
17082D54627r9422N3950O0412A68332L48566K47010l30657n9679A1840L01149
$$ plain form
17072 312989 528811 539831 381057 651218 659434 640751 537991 427396 599032 323975
17062 323975 226999 354811 534766 589444 483875 323449 462510 448693 481438 269183
17052 269183 363676 294745 684439 504372 310785 675673 320072 447610 531310 707283
17042 707283 840838 270597 434976 615567 441331 351971 208915 591242 459195 693009
17032 693009 585526 475875 642163 284768 161748 429670 465866 349638 906457 536420
17022 536420 779273 320277 569504 642506 1098763 650609 618855 404042 350031 722082
17012 722082 701075 543546 664752 536309 550970 739098 541250 635528 490812 629940
17002 629940 876243 512820 692020 716508 466970 817811 752132 942634 732489 714392
$$ packed form
17072C12989K15822J1020j58774K70161Q216j8683j02760j10595J71636k75057
17062C23975r6976J27812J79955N4678j05569j60426J39061j3817L2745k12255
17052B69183R4493o8931L89694j80067j93587L64888C20072J27538Q3700J75973
17042G07283J33555B70597J64379J80591j74236q9360j43056L82327j32047K33814
17032F93009j07483j09651J66288B84768j23020K67922L6196j16228N56819l70037
17022E36420K42853C20277K49227P3002M56257m48154l1754k14813n4011L72051
17012G22082k1007j57529J21206j28443J4661J88128j97848R4278j44716J39128
17002F29940K46303l63423J79200K4488k49538L50841o5679J90502k10145j8097
$$ plain form
16992 714392 803650 705000 690595 617796 566448 601460 923986 763935 820316 811099 688645
16981 688645 463126 652085 854598 560219 578512 419397 722457 841921 752885 794278
16971 794278 779117 840067 958209 602906 577128 972754 894185 1008257 967365 1042066 771705
16960 771705 1095760 797509 636698 737471 1086295 1029378 1124018 1051108 924932 850124
16950 850124 960213 825373 911163 717372 765484 875100 945723 1111861 988565 1044129
16940 1044129 1041556 1030711 1119521 1412393 1141713 801264 1129722 1185371 1247634 1067227
16930 1067227 1215892 1292605 1303995 1080569 1220738 1658506 1418852 1311340 1324777 1878117
16920 1878117 1354626 1153279 1312948 1294426 1471860 1416117 1660024 1247769 1283915 1747812
$$ packed form
16992G14392Q9258r8650j4405p2799n1348L5012L22526j60051N6381r217j22454
16981F88645k25519J88959K02513k94379J8293j59115L03060J19464q9036M1393
16971G94278j5161O0950J18142l55303k5778L95626p8569J14072m0892P4701k70361
16960G71705L24055k98251j60811J00773L48824n6917R4640p2910j26176p4808
16950H50124J10089j34840Q5790j93791M8112J09616P0623J66138j23296N5564
16940A044129k573j0845Q8810K92872k70680l40449L28458N5649O2263j80407
16930A067227J48665P6713J1390k23426J40169M37768k39654j07512J3437N53340
16920A878117n23491k01347J59669j8522J77434n5743K43907m12255L6146M63897
$$ plain form
16910 1747812 1213394 1569910 1420083 1548714 1488927 1516806 1822257 1443626 1496086 1496307
16900 1496307 1734064 1796947 1954325 1402405 2084071 1835171 1960451 1800098 2007664 1947546
16890 1947546 1896483 1873947 2193887 1989281 1994399 1921159 1999165 2376347 2326990 1923276 2368951
16879 2368951 1809756 2411340 2153843 2075901 2336889 2149067 2084016 2415767 2507415 2901192
16869 2901192 2286097 2670426 2322219 2491967 2621247 2933245 2980878 2856976 2929420 2980949
16859 2980949 3059093 3012353 3291176 2921928 2982210 3749547 3311556 3232184 3563491 3288333
16849 3288333 3993422 3302546 3765166 3628055 3926593 3783262 3827798 4265571 4364542 4114103
16839 4114103 4209220 4311143 4527416 4509305 4755426 4748570 5063956 4852208 5131964 4947487
$$ packed form
16910A747812n34418L56516j49827J28631n9787K7879L05451l78631N2460K21
16900A496307K37757O2883J57378n51920O81666k48900J25280j60353K07566o0118
16890A947546n1063k2536L19940k04606N118p3240P8006L77182m9357m03714M45675
16879B368951n59195O01584k57497p7942K60988j87822o5051L31751R1648L93777
16869B901192o15095L84329l48207J69748J29280L11998M7633j23902P2444N1529
16859B980949P8144m6740K78823l69248O0282P67337m37991p9372L31307k75158
16849C288333P05089o90876M62620j37111K98538j43331M4536M37773R8971k50439
16839D114103R5117J01923K16273j8111K46121o856L15386k11748K79756j84477
$$ plain form
16829 4947487 5101357 5256189 5471647 5834878 5562264 5500863 5763695 6325483 6158137 6110903
16819 6110903 6402238 6538290 6755721 7445310 7157973 7030990 7543483 7610668 7982887 8026145
16809 8026145 8181308 8241778 8810560 9045872 9285812 9308050 9322533 10006601 10331796 10308525
16799 10308525 10468399 11283427 11457900 11560047 12160960 12709455 13092619 13055965 13817533
16790 13817533 14024268 14652051 14678677 15150496 16010710 16454215 17169436 17623154 18410466
16781 18410466 19022923 19418134 20184848 20871693 21851063 22416708 23180393 24228750 24714246
16772 24714246 26035276 27051243 28113671 29043466 30401430 31959468 32678171 34313194
16764 34313194 35927227 37199282 38738372 40447002 42356067 44245608 46036563 48030922
$$ packed form
16829D947487J53870J54832K15458L63231k72614o1401K62832N61788j67346m7234
16819F110903K91335J36052K17431O89589k87337j26983N12493O7185L72219M3258
16809H026145J55163O0470N68782K35312K39940K2238J4483O84068L25195k3271
16799A0308525J59874Q15028J74473J02147O00913N48495L83164l6654P61568
16790A3817533K06735O27783K6626M71819Q60214M43505P15221M53718P87312
16781A8410466O12457L95211P66714O86845R79370N65645P63685J048357M85496
16772B4714246J321030J015967J062428R29795J357964J558038P18703J635023
16764C4313194J614033J272055J539090J708630J909065J889541J790955J994359
$$ plain form
16756 48030922 50202938 52567541 55300775 57578663 60049975 62883449 65703283 68855940
16748 68855940 71783905 74812738 78180276 81585353 85198952 89029750 92455889 95932486
16740 95932486 99748080 103400676 106701768 110597656 113840677 116959984 119555071 122270028
16732 122270028 124953678 126767772 128150202 129118575 129782678 129682128 129580602 128818205 127233469
16723 127233469 126100960 123921096 121903014 119004009 116203696 112848982 109734438 106324119
16715 106324119 103048709 99730506 95871409 92237147 88803307 85275919 81965278 78512352
16707 78512352 75574647 72500370 69696825 66783721 63897061 61533303 58885298 56531142
16699 56531142 54210470 51888791 49616212 47940210 46154629 43991083 42618654 40888427
$$ packed form
16756D8030922K172016K364603K733234K277888K471312K833474K819834L152657
16748F8855940K927965L028833L367538L405077L613599L830798L426139L476597
16740I5932486L815594L652596L301092L895888L243021L119307K595087K714957
16732A22270028K683650J814094J382430R68373O64103j00550j01526p62397j584736
16723A27233469j132509k179864k018082k899005k800313l354714l114544l410319
16715A06324119l275410l318203l859097l634262l433840l527388l310641l452926
16707G8512352k937705l074277k803545k913104k886660k363758k648005k354156
16699E6531142k320672k321679k272579j676002j785581k163546j372429j730227
$$ plain form
16691 40888427 39243525 38297139 36456508 35024133 33683316 32622608 31509913 30373210
16683 30373210 29265774 28099547 27342271 26479208 25517846 24711896 24110492 23367900 22532186
16674 22532186 21828625 21127080 20405474 19638905 19203590 18883000 17846309 17291517 17057122
16665 17057122 16569304 16230092 15562800 15405989 14777533 14646621 14182443 13665607 13339598
16656 13339598 13190809 12539885 12535142 11693129 11849598 11405852 11224895 10682096 10422266 10414123
16646 10414123 10152403 9920343 9971363 9254986 9395190 9091143 8587940 8605750 8328499 8061865
16636 8061865 8102402 7966120 7784962 7397344 7439897 7459312 7261430 7127995 6736561 7024582
16626 7024582 6851449 6545695 6173901 6075420 6131078 6160350 5742387 5596236 5803592 5442758
$$ packed form
16691D0888427j644902r46386j840631j432375j340817j060708j112695j136703
16683C0373210j107436j166227p57276q63063r61362q05950o01404p42592q35714
16674B2532186p03561p01545p21606p66569m35315l20590j036691n54792k34395
16665A7057122m87818l39212o67292j56811o28456j30912m64178n16836l26009
16656A3339598j48789o50924m743q42013J56469m43746j80957n42799k59830q143
16646A0414123k61720k32060N1020p16377J40204l04047n03203J7810k77251k66634
16636H061865M0537j36282j81158l87618M2553J9415j97882j33435l91434K88021
16626G024582j73133l05754l71794r8481N5658K9272m17963j46151K07356l60834
$$ plain form
16616 5442758 5321333 5226132 5490189 4930696 4926978 4849169 5020395 4997316 4734856 4624104
16606 4624104 4629186 4700852 4175455 4282589 4075178 4114363 3636667 3912438 3888290 4186420
16596 4186420 3915413 3824572 3555917 3657375 3499947 3666277 3657785 3460507 3300185 3316644
16586 3316644 3525935 3460920 3165392 2749964 3191813 3044878 3001886 3029393 3108959 2971264
16576 2971264 3094596 2674165 2861044 2834674 2649639 2801372 2595972 2507746 2677336 2890807
16566 2890807 2626362 2290437 2370521 2218428 2601704 2284138 2769526 2430154 2370473 2063862
16556 2063862 2109482 2301388 2531190 2029847 2254209 1799949 1866757 2192895 2129662 2139740
16546 2139740 1808286 2033348 1991624 1951413 1877747 1863854 1776222 1864815 2014837 1767307
$$ packed form
16616E442758j21425r5201K64057n59493l718p7809J71226k3079k62460j10752
16606D624104N082P1666n25397J07134k07411L9185m77696K75771k4148K98130
16596D186420k71007r0841k68655J01458j57428J66330q492j97278j60322J6459
16586C316644K09291o5015k95528m15428M41849j46935m2992K7507P9566j37695
16576B971264J23332m20431J86879k6370j85035J51733k05400q8226J69590K13471
16566B890807k64445l35925Q0084j52093L83276l17566M85388l39372n9681l06611
16556B063862M5620J91906K29802n01343K24362m54260O6808L26138o3233J0078
16546B139740l31454K25062m1724m0211p3666j3893q7632Q8593J50022k47530
$$ plain form
16536 1767307 1743312 1507240 1598367 1738938 2103574 1899265 1932723 1857977 1793328 1640697
16526 1640697 1547610 1709319 1490456 1653895 1676313 1600015 1448486 1466554 1422582 1805157
16516 1805157 1489914 1442338 1330926 1481735 1628569 1507626 1074350 1381904 1639615 1502336
16506 1502336 1367130 1279013 1376887 1644542 1470480 1483444 1198181 1547114 1401510 1153982
16496 1153982 1563582 1110444 1550331 1274869 1274975 1282281 1012350 1190739 1184438 1200121 1418677
16485 1418677 1158484 1256316 1471631 1138527 1117888 1335200 1245558 1347240 1595977 1380438
16475 1380438 1327938 1505501 1464869 1212375 1077827 1058270 1105809 967965 1269244 1386204
16465 1386204 1293401 1111606 1248637 828803 1149910 1389633 1239855 1223522 947107 1058302
$$ packed form
16536A767307k3995k36072R1127J40571L64636k04309L3458p4746o4649j52631
16526A640697r3087J61709k18863J63439K2418p6298j51529J8068m3972L82575
16516A805157l15243m7576j11412J50809J46834j20943m33276L07554K57711j37279
16506A502336j35206q8117R7874K67655j74062J2964k85263L48933j45604k47528
16496A153982M09600m53138M39887k75462J06P306k69931J78389o301J5683K18556
16485A418677k60193R7832K15315l33104k0639K17312q9642J01682K48737k15539
16475A380438n2500J77563m0632k52494j34548j9557M7539j37844L01279J16960
16465A386204r2803j81795J37031m19834L21107K39723j49778j6333k76415J11195
$$ plain form
16455 1058302 889958 973649 981935 1185688 1189810 1184484 1255368 971301 1217870 1074741 1142781
16444 1142781 1032011 1145111 1136024 1274535 1022239 970308 1034223 1309700 995207 928784
16434 928784 1117442 1105029 1117516 783827 1188999 1142714 1044842 1278576 1265774 1192695 1062684
16423 1062684 825040 1041186 923016 1108433 1147233 765122 1008696 822067 884702 1212677
16413 1212677 715937 889641 981715 707718 1190194 1019304 1004977 952558 1055780 867409
16403 867409 810099 918869 1083525 1005054 1021002 1036947 1024084 1292320 983133 799508
16393 799508 1107928 1045226 1203743 1149015 915188 908939 1250837 720371 1062658 772137
16383 772137 961507 817865 882353 561827 911289 749799 785817 1028646 710850 739818
$$ packed form
16455A058302j68344Q3691Q286K03753M122n326P0884k84067K46569j43129O8040
16444A142781j10770J13100r087J38511k52296n1931O3915K75477l14493o6423
16434I28784J88658j2413J2487l33689M05172m6285r7872K33734j2802p3079j30011
16423A062684k37644K16146j18170J85417L8800l82111K43574j86629O2635L27975
16413A212677m96740J73704R2074k73997M82476j70890j4327n2419J03222j88371
16403H67409n7310J08770J64656p8471J5948J5945j2863K68236l09187j83625
16393G99508L08420o2702J58517n4728k33827o249L41898n30466L42287k90521
16383G72137J89370j43642O4488l20526L49462j61490L6018K42829l17796K8968
$$ plain form
16373 739818 943131 888482 1082734 879425 857641 764573 605779 807045 939276 964826
16363 964826 985071 1393903 818390 904627 1018166 630702 1015338 844954 562422 862446
16353 862446 1045023 866069 1066672 860342 751086 901654 993001 674058 981538 940829
16343 940829 921866 1008755 831155 913699 982648 1036148 665473 1063845 765156 842552 582311
16332 582311 733346 702466 953858 786219 1040524 913260 961642 914252 446179 878342
16322 878342 809284 762449 922279 796750 788332 821106 831088 973677 783779 881931 949744
16311 949744 983148 864301 927171 1039573 970722 775005 883406 1025638 1146154 809897
16301 809897 810670 736788 606147 1079454 853168 978838 1058832 1033902 602294 682696 771987
$$ packed form
16373G39818K03313n4649J94252k03309k1784r3068j58794K01266J32231K5550
16363I64826K0245M08832n75513Q6237J13539l87464L84636j70384k82532L00024
16353H62446J82577j78954K00603k06330j09256J50568R1347l18943L07480m0709
16343I40829j8963Q6889j77600Q2544O8949N3500l70675L98372k98689P7396k60241
16332E82311J51035l0880K51392j67639K54305j27264M8382m7390D46179M32163
16322H78342o9058m6835J59830j25529q418L2774R982J42589j89898R8152O7813
16311I49744L3404j18847O2870J12402o8851j95717J08401J42232J20516l36257
16301H09897P73p3882j30641M73307k26286J25670P9994k4930m31608Q0402Q9291
$$ plain form
16290 771987 1130298 1110328 967573 825901 651575 943779 955755 984559 900732 817991
16280 817991 1014285 696147 1091043 515578 675065 944531 782016 1101112 1091453 530701
16269 777150 568978 888399 662284 698947 500878 660552 625235 1116415 721331 868059
16259 868059 775048 522987 744407 540394 377199 857647 911192 647520 416672 616971
16249 616971 588893 1027257 633058 833734 793717 708156 833127 837809 1002996 585382
16239 585382 692626 773070 635340 771287 831556 727860 543957 533395 637684 520167
16229 520167 628335 816404 759334 908892 854271 600757 557001 625130 824536 750442
16219 750442 763715 716958 988774 663377 735373 697902 766725 809908 704157 876111 514946
$$ packed form
16290G71987L58311j9970j42755j41672j74326K92204J1976K8804q3827q2741
16280H17991J96294l18138L94896E15578J59487K69466j62515L19096r659E30701
16269G77150k08172L19421k26115L6663j98069J59674l5317M91180l95084J46728
16259H68059r3011k52061K21420k04013j63195M80448N3545k63672k30848K00299
16249F16971k8078M38364l94199K00676m0017q5561J24971M682J65187m17614
16239E85382J07244Q0444j37730J35947O0269j03696j83903j0562J04289j17517
16229E20167J08168J88069n7070J49558n4621k53514m3756O8129J99406p4094
16219G50442J3273m6757K71816l25397P1996l7471O8823M3183j05751J71954l61165
$$ plain form
16208 514946 538250 493178 575550 708982 680561 622640 402902 583197 543639 643738 342721
16197 342721 276128 457843 389322 375827 540779 369495 314459 599357 374415 575127
16187 575127 587375 308822 623111 901871 248426 443567 413533 640501 327628 497810
16177 497810 375358 768031 585663 294029 203486 760619 365980 540281 575336 556195
16167 556195 300588 367622 484430 269498 387527 521343 608174 582605 235149 399465
16157 399465 354403 365327 407454 491081 570785 267236 599048 612363 533831 368413 670271
16146 670271 2054 115802 392349 198527 260042 337385 171328 486333 532432 598413 260891
16134 77640 347486 180600 365373 383356 157036 253195 441017 -29831 316121 443981
$$ packed form
16208E14946K3304m5072Q2372J33432k8421n7921k19738J80295l9558J00099l01017
16197C42721o6593J81715o8521j3495J64952j71284n5036K84898k24942K00712
16187E75127J2248k78553L14289K78760B48426J95141l0034K26968l12873J70182
16177D97810j22452L92673j82368k91634r0543N57133C65980J74301L5055j9141
16167E56195k55607O7034J16808k14932J18029J33816Q6831k5569B35149J64316
16157C99465m5062J0924M2127Q3627P9704B67236L31812J3315p8532j65418L01858
16146F70271B054J13748K76547j93822O1515P7343j66057L15005M6099O5981B60891
16134G7640K69846j66886J84773J7983A57036R6159J87822b9831C16121J27860
$$ plain form
16124 443981 660099 345517 314018 67083 162737 134575 265647 283291 81501 501878 295186
16113 295186 280316 281626 134230 312464 196917 328168 246838 129153 95475 123191 183515
16102 183515 138553 35245 62741 515618 3431 490438 324461 503943 233850 -25251 465456
16090 204337 -176971 75887 84942 410663 480552 119633 195436 -188295 147283 227248 156570
16079 156570 517958 1422 -33481 156880 152020 199382 142350 225156 231906 49009 459945
16068 459945 542505 -246303 93880 97760 596666 200794 52117 191788 229839 228853 367336
16057 367336 414468 131133 -221635 -176104 205806 -72123 58948 -205864 155051 177634
16047 177634 -109678 161149 284237 1736 288898 191455 -378043 42247 36783 403223 154364
$$ packed form
16124D43981K16118l14582l1499F7083R5654k8162J31072J7644H1501M20377k06692
16113B95186j4870J310A34230J78234j15547J31251q1330j17685l3678K7716O0324
16102A83515m4962C5245K7496M52877C431M87007j65977J79482B33850b5251D65456
16090B04337a76971G5887R055L25721O9889A19633P5803a88295A47283P9965p0678
16079A56570L61388A422c3481A56880m860M7362n7032Q2806O750D9009M10936
16068D59945Q2560b46303I3880L880M98906B00794E2117J39671L8051r86J38483
16057C67336M7132A31133b21635M5531B05806g2123E8948b05864A55051K2583
16047A77634a09678A61149J23088A736K87162r7443c78043D2247n464L66440A54364
$$ plain form
16035 509217 146408 8128 214274 183785 227295 427519 -43690 -170122 -68284 273589 -322560
16023 71091 247290 105541 338562 63034 -165153 97780 96948 244087 73407 -246632 -223817
16012 -223817 -191540 81454 -37332 -101374 358360 18360 106102 78319 -274062 26545 -122216
16000 -81768 -71848 -102894 -71662 -56932 -231000 92184 -155697 -29644 -122121 242461 172191
15989 172191 -19831 62290 230569 185720 344461 153342 104864 44641 463823 143847
15978 -159543 -107108 64955 198861 -21273 246134 91409 -4331 -15656 -31718 119801 -69134
15966 15949 18768 282507 277426 307443 -24515 -136187 -167774 241740 237219 -80491 44938 -500649
15953 -80483 -70502 -577062 40852 -141318 -94031 -87964 179067 77796 -22633 13173 36640
$$ packed form
16035E09217A46408H128K06146l0489M3510K00224d3690j26432f8284B73589c22560
16023G1091J76199A05541K33021F3034a65153I7780q32J47139G3407b46632K2815
16012b23817L2277H1454c7332o4042C58360A8360Q7742k7783b74062B6545a22216
16000h1768R920l1046L1232J4730j74068I2184a55697b9644r2477B42461p0270
15989A72191a9831F2290J68279m4849J58741A53342m8478D4641M19182A43847
15978a59543N2435F4955J33906b1273B46134I1409d331j1325j6062A19801f9134
15966A5949K819K63739n081L0017b4515j11672l1587B41740m521h0491D4938e00649
15953h0483R981n06560D0852a41318M7287O067A79067G7796b2633A3173K3467
$$ plain form
15942 36640 -9128 61682 81882 -485580 -3148 37233 -99643 -9923 -23597 51151 112716 159941
15930 159941 -179371 34737 1175 32285 -122009 -99855 255356 -345196 -120229 223057
15919 253140 61962 -416327 11929 15919 158530 176602 -41340 37047 88121 127491 -51832
15907 -84038 -93074 170331 -77749 403206 -128323 13629 66956 -749 -16029 -2941 -85173 122797
15894 33190 372043 -95809 -77772 -218489 186994 -87832 -143808 -99049 -57109 -5891 -68592
15883 -68592 318068 -212519 -62832 -356088 -151461 -40137 -18848 98231 -316817 21775 -25090
15871 -248883 88801 -13584 -70657 -238999 27763 -248582 105552 -21898 2148 12839 199176
15860 199176 -291793 13932 -140451 307200 -196974 304622 -278475 228417 71494 78447
$$ packed form
15942C6640i128F1682K0200d85580c148C7233i9643i923j3674E1151O1565M7225
15930A59941a79371C4737A175L1110a22009K2154B55356c45196a20229B23057
15919B53140F1962d16327A1929L990J42611J8072d1340C7047N1074L9370e1832
15907h4038r036A70331g7749D03206a28323A3629N3327g49j5280b941q2232A22797
15894C3190L38853i5809J8037j40717A86994h7832n5976M4759M1940e891o2701
15883f8592C18068b12519f2832k93256a51461d0137a8848I8231c16817B1775b5090
15871b48883H8801a3584n7073j68342B7763b48582A05552b1898B148J0691J86337
15860A99176b91793A3932a40451C07200a96974C04622b78475B28417G1494O953
$$ plain form
15850 78447 32981 427533 -125621 196119 716 163008 119200 -343465 -26147 44250 113276
15839 113276 221424 405239 -228016 -41906 -33087 -31502 -277179 -430305 -172407 90115 -208910
15827 -16723 -32049 -111936 14260 162856 -353001 -103799 7664 -47705 -317999 38585 -204053
15815 330586 108836 -203021 -198301 -26436 42799 -228312 30761 -303278 -374510 10095 -156248
15803 -62763 -45960 104562 59792 -149108 -108734 285469 218161 -190854 200090 62911 -369740
15791 -22262 26717 64895 -92337 349388 -23440 -49476 -51511 -59919 -152044 32436 248890 -334754
15778 56334 -35685 -77862 121982 -188481 -55562 -125943 -47878 -72443 -43951 -13857 92157
15766 -47266 -213285 -105099 225932 -250257 166215 -27673 -75959 40411 277882 46434
$$ packed form
15850G8447C2981L94552a25621A96119G16J62292m3808c43465b6147D4250O9026
15839A13276J08148J83815b28016d1906Q819J585k45677j53126a72407I0115b08910
15827a6723j5326p9887A4260J48596c53001a03799G664d7705k70294C8585b04053
15815C30586A08836b03021M720b6436D2799b28312C0761c03278p1232A0095a56248
15803f2763J6803A04562m4770a49108M0374B85469o7308a90854B00090F2911c69740
15791b2262B6717L8178i2337C49388b3440k6036k035q408r2125C2436K16454c34754
15778E6334c5685m2177A21982a88481e5562p0381d7878k4565K8492a3857I2157
15766d7266j66019a05099B25932b50257A66215b7673m8286D0411K37471D6434
$$ plain form
15755 -24348 331400 -19524 -11003 -121991 270557 -315302 -59324 134016 -87445 42607 25493
15744 25493 20471 123493 -70478 93 -181165 -183574 -280254 -149672 -126560 -19290 -246695 212096
15731 -304381 -123076 -485102 67417 -156113 -13707 -138769 83420 283693 -214079 -66616
15720 152464 -449613 -146921 -201894 -34503 84941 82447 -99836 -210616 -140990 -247483 -87415
15708 -188596 -81158 317994 -236414 -97778 -85407 187893 9321 -73051 -84619 -80161 -235688
15697 -235688 -33240 124449 -45693 -51511 -41577 -2833 302627 113801 -112281 75751 95725
15686 95725 17397 -209154 95537 -95246 238358 -99009 -498827 137139 -82878 142088 142421
15675 142421 180157 -44809 -35956 11301 -52173 -140016 124606 82632 131059 119573 331072
$$ packed form
15755b4348C31400a9524Q521j10988B70557c15302e9324A34016h7445D2607j7114
15744B5493n022J03022g0478I3a81165k409r6680J30582K3112a9290k27405B12096
15731c04381a23076l62026F7417a56113a3707j25062H3420K00273b14079f6616
15720A52464d49613a46921n4973c4503H4941k494i9836j10780O9626j06493h7415
15708a88596h1158C17994b36414i7778J2371A87893I321g3051j1568M458j55527
15697b35688c3240A24449d5693n818R934b833C02627A13801a12281G5751J9974
15686I5725A7397b09154I5537i5246B38358i9009l99818A37139h2878A42088L33
15675A42421L7736d4809Q853A1301e2173q7843A24606m1974M8427j1486K11499
$$ plain form
15664 331072 -20999 -140946 4410 61122 106958 -262084 -88743 -72002 -92296 4456 61628
15653 61628 148689 -203542 -312528 -22872 -70257 -152675 -267340 -362176 -165651 166827 -322037
15641 -89089 11692 -87033 240513 305341 -651 -264629 40558 -29430 33704 -271868 39592
15629 -169184 -195038 58991 465924 -83956 -58727 -12944 77803 -176874 -97724 169906 63006
15617 -140339 112117 61962 -280564 -286679 -342005 -51775 289783 -175198 90860 213496 109086
15606 109086 111025 142085 -161630 -50955 76279 -60224 -139234 246795 73611 -310902 -5438
15594 112941 14819 152031 266029 17751 61422 57779 -376154 60783 77862 40641 183435
15583 183435 62047 -57967 310581 98735 1374 97026 -76323 -45153 111768 281352 -74116
$$ packed form
15664C31072b0999j19947D410N6712M5836b62084h8743J6741k0294D456N7172
15653F1628Q7061b03542j08986b2872m7385q2418j14665r4836a65651A66827c22037
15641h9089A1692h7033B40513O4828f51k63978D0558b9430C3704b71868C9592
15629a69184k5854E8991M06933h3956K5229a2944G7803a76874P9150A69906F3006
15617a40339A12117n0155b80564o115n5326e1775B89783a75198I0860J22636j04410
15606A09086J939L1060a61630e0955G6279f0224p9010B46795G3611c10902e438
15594A12941A4819J37212J13998A7751M3671l643c76154F0783J7079l7221J42794
15583A83435F2047e7967C10581I8735A374R5652g6323L1170A11768J69584g4116
$$ plain form
15571 -294135 -196768 -16038 -467618 89877 63567 16617 -223317 -40790 33452 -43294 -17456
15559 368218 -152511 -394749 -259674 -216200 191218 51193 -61076 49545 -180638 119806
15548 -126242 -48515 -120006 -370208 113427 -2841 -106787 -68243 -170334 223552 -281954
15537 -156412 169275 42328 86697 175955 329825 200457 183713 151321 -206677 -305052 69414
15525 7103 183962 77804 -73781 -294983 319347 23393 -162692 212945 53741 109489 42743
15513 -146342 101461 -47927 -455718 -138442 -69190 191611 -141094 -107753 -40815 68530
15502 10287 -63922 -74689 -99713 -423850 -125864 -51100 64578 75456 139799 -166779 193362
15490 261775 180585 -123576 -109876 140923 35811 10017 -267331 -104469 -221838 37097
$$ packed form
15571b94135R7367a6038m51580H9877k6310A6617b23317d0790C3452d3294a7456
15559C68218a52511k42238J35075M3474A91218E1193f1076D9545a80638A19806
15548a26242d8515p1491k50202A13427b841j03946L8544j02091B23552b81954
15537a56412A69275D2328M4369Q9258J53870j29368j6744l2392b06677r8375F9414
15525G103J76859G7804g3781k21202C19347B3393a62692B12945E3741N5748D2743
15513a46342A01461d7927m07791a38442f9190A91611a41094L3341d0815F8530
15502A0287f3922j0767k5024l24137a25864e1100F4578J0878O4343a66779A93362
15490B61775q1190a23576J3700A40923C5811A0017b67331a04469j17369C7097
$$ plain form
15479 128475 9457 -13260 36061 -234252 -164970 264721 -106639 306593 -266771 253717
15468 34275 127720 71990 -167364 -76069 -75379 -43434 -212010 193600 206309 -104589 -209397
15457 -209397 -120173 -321754 -169866 -145499 -11786 46845 -10991 182448 -168913 122983
15446 -216877 67274 123262 181443 69259 22614 133497 113842 395984 6787 339185 226837
15435 226837 -190625 -96799 130790 13695 108473 72100 -87530 238160 63190 -152523 155348
15423 -190074 46112 76760 -8322 333216 195936 99383 -1695 190573 292216 -174372 285533
15411 79845 4325 -222126 272712 108304 -25374 -232943 -190207 -322662 45547 -8273 325226
15399 -158871 -235445 77910 -21572 209039 30565 -146197 -18619 -183253 36724 -10729 -139724
$$ packed form
15479A28475I457a3260C6061b34252O9282B64721a06639C06593b66771B53717
15468C4275R3445n5730a67364g6069O90L1945j68576A93600J2709a04589j04808
15457b09397Q9224k01581J51888K4367a1786D6845a0991A82448a68913A22983
15446b16877F7274N5988N8181F9259B2614J10883j9655K82142F787L32398j12348
15435B26837a90625R3826A30790A3695R4778l6373h7530B38160F3190a52523A55348
15423a90074D6112L0648h322C33216j37280r6553a695A90573J01643a74372B85533
15411G9845D325b22126B72712A08304b5374k07569M2736j32455D5547h273C25226
15399a58871p6574G7910b1572B09039C0565a46197a8619j64634C6724a0729j28995
$$ plain form
15388 -139724 -250191 49239 14314 -279159 239501 -256999 26234 -120534 268913 193362
15378 193362 525265 -37119 98715 222702 -206266 158490 210945 -102628 74416 -154366
15367 95036 -328253 58257 89538 46720 -171006 292875 13301 210864 -290872 273345
15356 -62641 -57606 327967 -109328 -92639 134806 69569 303941 -36094 82998 303299 -60989
15344 -47471 162672 -38487 69981 -21268 -90126 -36460 3000 167835 -64257 185515 117281
15333 117281 274352 60004 132622 273125 199683 -388489 -238764 237055 -120157 -92691
15323 -92691 149741 -73333 42318 -22680 68335 -423140 -76825 153559 -194986 -296141 124340
15311 52117 95699 -217446 40688 -60695 -33953 -57760 -22108 365223 55063 356797 233070
$$ packed form
15388a39724j10467D9239A4314b79159B39501b56999B6234a20534B68913p5551
15378A93362L31903c7119I8715J23987b06266A58490N2455a02628G4416a54366
15367I5036c28253E8257L1281m2818a71006B92875A3301J97563b90872B73345
15356f2641N035C27967a09328J6689A34806o5237K34372c6094H2998K20301f0989
15344d7471A62672c8487F9981b1268o8858c6460C000J64835f4257A85515o8234
15333A17281J57071F0004P2618J40503p3442c88489J49725B37055a20157K7466
15323i2691A49741g3333D2318b2680F8335d23140g6825A53559a94986j01155A24340
15311E2117M3582b17446D0688f0695K6742k3807b2108C65223E5063L01734j23727
$$ plain form
15300 233070 219184 90723 428032 53919 402598 220975 -11769 -139178 139301 -135949
15289 23472 207410 -302670 -102417 71808 45632 -141853 210202 -44148 -37135 44930 -131550
15277 282945 -148794 71927 78833 9412 -5275 198513 153004 78523 360916 146457 -152543
15265 -128642 -72162 -139309 -203590 -161861 -423465 23787 70424 -41403 -94933 -6480 -24547
15254 -24547 184688 460948 743009 144032 642130 287990 66700 23302 -27527 164552
15243 154989 363960 20648 160279 67117 200354 -54488 -69612 241508 173839 463930
15233 463930 86166 67066 -12272 215602 -79147 -134630 216076 98709 210172 -105432 199166
15221 161881 167443 46805 -177172 -164970 118595 -187613 131282 -142975 -271331 218887
$$ packed form
15300B33070j3886I0723L37309E3919L48679j81623a1769j27409A39301a35949
15289B3472J83938c02670a02417G1808k6176a41853B10202d4148P013D4930a31550
15277B82945a48794G1927O906I412e275A98513m5509p4481K82393A46457a52543
15265a28642N6480o7147o4281M1729k61604B3787M6637d1403n3530f480j8067
15254b4547A84688K76260K82061A44032M98098B87990F6700B3302b7527A64552
15243A54989K08971B0648J39631F7117J33237e4488j5124B41508o7669K90091
15233D63930H6166j9100a2272B15602g9147n5483B16076I8709J11463a05432A99166
15221A61881N562D6805a77172J2202A18595a87613A31282a42975j28356B18887
$$ plain form
15210 -299822 295437 1877 297836 69957 142318 255300 223387 52221 -186556 263316 123476
15198 -187682 266624 222021 -210774 -95423 236455 97530 233631 230902 244188 15416 -163602
15186 56399 247563 -54524 -28364 273130 267998 67199 166725 206415 380584 200638 -64452
15174 62553 -46109 59895 -45378 12826 -67460 31794 243995 -388168 -150731 252334 136250
15163 136250 -88061 -62346 -77754 62584 -23763 54089 -177084 54899 173043 -1563 256821
15151 -145095 72594 142244 131584 174745 171806 330741 175350 308975 314740 114372 -37884
15139 155550 76212 130536 52571 -152758 -35984 -32179 -73232 227489 121425 144211 310733
15128 310733 318708 371021 243197 84151 251468 -212867 380091 221586 3938 -77332 45778
$$ packed form
15210b99822B95437A877K95959F9957P2361J12982l1913E2221a86556B63316A23476
15198a87682B66624m4603b10774i5423B36455I7530J36101k729J3286A5416a63602
15186E6399J91164e4524K6160B73130n132F7199R9526L9690J74169j79946f4452
15174F2553d6109E9895d5378A2826f7460C1794K12201c88168a50731B52334j16084
15163A36250h8061K5715j5408F2584b3763E4089a77084E4899J18144a563B56821
15151a45095G2594O9650j0660M3161k939J58935j55391J33625N765A14372c7884
15139A55550G6212N4324E2571a52758c5984L805m1053B27489j06064K2786J66522
15128C10733P975N2313j27824H4151J67317b12867C80091j58505C938g7332D5778
$$ plain form
15116 -168566 -55448 166830 90373 190764 68504 66910 60945 62603 220137 45467 -19869
15104 -276179 61780 -255549 89802 384086 262558 40373 61383 -57516 25288 233220 269167
15093 269167 154760 -110796 95542 210578 -11964 101108 -19396 145050 81541 368226
15083 368226 118221 -266195 154524 158054 897 317178 186589 225969 146783 143890 438601
15072 438601 198672 -100349 32220 -33653 203460 177293 27331 350473 229146 149723
15062 149723 425268 -7473 328198 -103049 31581 169843 -71478 -81508 -101738 33811 251808
15051 251808 -19496 202884 291476 211085 204925 331776 139881 54741 365554 77039 816727
15040 816727 184286 275154 127901 151409 150406 444003 -43361 198300 -203651 157859
$$ packed form
15116a68566e5448A66830p6457J00391F8504j594n965J658J57534D5467a9869
15104b76179F1780b55549H9802K94284j21528D0373K1010e7516B5288K07932L5947
15093B69167j14407a10796I5542J15036a1964A01108a9396A45050o3509K86685
15083C68226A18221b66195A54524L530H97L16281j30589L9380p9186k893K94711
15072D38601A98672a00349C2220c3653B03460k6167B7331L23142j21327p9423
15062A49723K75545g473C28198a03049C1581J38262g1478j0030k0230C3811K17997
15051B51808a9496B02884Q8592q0391o160J26851A39881E4741L10813G7039P39688
15040H16727A84286R0868A27901K3508j003K93597d3361A98300b03651A57859
$$ plain form
15029 101070 226984 164524 14057 201917 217229 -335623 323075 541020 485786 427657
15019 427657 315090 305887 -213126 207397 151225 -26954 608731 207814 153358 51708 183891
15008 183891 -2594 154259 370254 130264 25047 268226 175273 201253 113596 -79764 300494
14996 52708 173111 132272 -39106 411440 -7999 331034 50886 111947 83165 -60008 123340
14984 229290 298510 100619 101492 231268 306704 227906 208635 365573 13529 239389 111895
14972 11501 -37858 296582 172899 338172 55966 -125603 315848 429989 481582 451355
14962 451355 213425 202320 321792 334731 258209 505564 237953 259887 284007 308687 329951
14951 329951 255197 240783 131184 271390 92363 221784 265889 132182 415393 12596
$$ packed form
15029A01070J25914o2460A4057J87860J5312c35623C23075K17945n5234n8129
15019D27657j12567r203b13126B07397n6172b6954F08731B07814n4456E1708J32183
15008A83891b594A54259K15995A30264B5047K43179r2953K5980q7657g9764C00494
14996E2708J20403m0839c9106D11440g999C31034E0886O1061k8782f0008A23340
14984B29290O9220A00619Q73J29776P5436p8798j9271J56938A3529K25860A11895
14972A1501c7858B96582j23683J65273E5966a25603C15848J14141N1593l0227
14962D51355B13425j1105J19472J2939p6522K47355B37953K1934K4120K4680K1264
14951C29951p4754j4414j09599J40206I2363J29421M4105A32182K83211A2596
$$ plain form
14940 175126 196288 362349 523764 90060 343824 326039 260028 379234 134809 182992
14930 182992 247211 395536 232613 267240 614666 151273 249162 352330 103627 186815
14920 186815 257953 579609 168478 338666 290902 703120 270480 499262 354749 616815
14910 616815 503539 336858 401904 184631 208549 418666 443971 516673 98633 317542
14900 317542 385817 73249 -125410 487972 223908 587941 128339 383897 99227 566465
14890 566465 516921 260502 171947 225870 91504 315906 332617 555607 288968 473202
14880 473202 209243 348318 417214 438152 83655 270692 394272 202728 191970 110485
14870 110485 672622 266425 413030 41914 455522 145338 425518 -53360 369540 18281
$$ packed form
14940A75126K1162J66061J61415I0060K53764j7785o6011J19206A34809M8183
14930A82992O4219J48325j62923L4627L47426A51273R7889J03168A03627Q3188
14920A86815P1138L21656A68478J70188m7764M12218B70480K28782j44513K62066
14910F16815j13276j66681O5046A84631K3918K10117K5305P2702I8633K18909
14900C17542O8275G3249a25410D87972B23908L64033A28339K55558I9227M67238
14890E66465m9544k56419q8555N3923I1504K24402J6711K22990k66639J84234
14880D73202B09243J39075O8896K0938H3655J87037J23580j91544j0758q1485
14870A10485N62137B66425J46605D1914M13608A45338K80180e3360C69540A8281
$$ plain form
14859 349104 510269 535337 188195 377436 212692 288882 379445 352148 20102 309833
14849 309833 360450 318492 218438 457955 485927 590847 549699 376414 393481 603467
14839 603467 562203 651757 458980 405455 481199 455799 93657 512362 512886 128710 588398
14828 588398 545272 491922 324907 615011 643102 444490 320308 299872 231334 182636 141485
14817 141485 251219 337403 447933 512484 180988 479541 207718 232672 475822 726293
14807 726293 299605 93893 310500 397370 444651 457699 393132 276964 370043 584462 397387
14796 397387 741588 438542 442916 800224 362874 483207 599347 466822 490902 368205
14786 368205 327745 377050 414208 516160 513079 536065 501985 476655 697830 383141 742225
$$ packed form
14859C49104J61165K5068A88195J89241j64744P6190R0563k7297B0102K89731
14849C09833N0617m1958j00054K39517K7972J04920m1148j73285J7067K09986
14839F03467m1264Q9554j92777n3525P5744k5400I3657M18705N24A28710M59688
14828E88398m3126n3350j67015K90104K8091j98612j24182k0436o8538m8698m1151
14817A41485J09734Q6184J10530O4551A80988K98553B07718K4954K43150K50471
14807G26293B99605I3893K16607Q6870M7281J3048o4567j16168R3079K14419j87075
14796C97387L44201l03046M374L57308C62874J20333J16140j32525K4080j22697
14786C68205m0460M9305L7158J01952l081K2986l4080k5330K21175l14689L59084
$$ plain form
14775 742225 279381 363804 566927 563021 698649 542338 381590 615495 692412 767871
14765 767871 189927 382014 524848 249096 664206 468117 595926 454956 583021 594291
14755 594291 481783 514676 719364 382447 657017 630944 653947 643076 370784 577768
14745 577768 719872 602518 761166 186057 480258 357125 658991 500787 606003 618249
14735 618249 520295 701497 350448 570777 470742 604518 736160 682101 737850 777644
14725 777644 625605 571724 437026 679407 795096 838394 603788 830476 820527 641374
14715 641374 640408 753290 980465 595795 551749 848749 797516 799265 624225 796647 940561
14704 940561 690843 813967 707759 732519 516570 946978 758773 623786 836107 887246
$$ packed form
14775G42225B79381Q4423K03123l906J35628j56311j60748K33905P6917P5459
14765G67871A89927J92087J42834B49096M15110j96089J27809j40970J28065J1270
14755E94291j12508L2893K04688l36917K74570k6073K3003j0871k72292K06984
14745E77768J42104j17354J58648A86057K94201j23133L01866j58204J05216J2246
14735F18249r7954J81202C50448K20329j00035J33776J31642n4059N5749L9794
14725G77644j52039n3881j34698K42381J15689M3298k34606K26688r949j79153
14715F41374r66J12882K27175l84670m4046K97000n1233J749j75040J72422J43914
14704I40561k49718J23124j06208K4760k15949M30408j88205j34987K12321N1139
$$ plain form
14694 887246 687931 458094 902570 708084 948833 852672 897998 774573 957691 726114
14684 726114 891067 1120384 918388 897218 867661 753333 944006 861919 993096 874112
14674 874112 815059 795886 972891 692867 1014692 1072065 734371 915683 959556 1081382
14664 1081382 830671 905136 610680 751592 905229 984796 903834 1039194 853883 691782
14654 691782 1172360 973696 798324 1063947 669678 1076372 852984 804439 725516 1119814
14644 1119814 1313994 1072712 684891 1030220 1186337 1014952 1016352 1252660 1055854 1129394
14634 1129394 1299876 982954 802724 1244846 844635 1270245 982867 1063539 1057447 1196352
14624 1196352 1137111 1329016 1002203 964864 969696 1376681 1147815 1358425 1102096 1474439
$$ packed form
14694H87246j99315k29837M44476j94486K40749r6161M5326j23425J83118k31577
14684G26114J64953K29317k01996k1170k9557j14328J90673q2087J31177j18984
14674H74112n9053j9173J77005k80024L21825N7373l37694J81312M3873J21826
14664A081382k50711P4465k94456J40912J53637P9567q0962J35360j85311j62101
14654F91782M80578j98664j75372K65623l94269M06694k23388m8545p8923L94298
14644A119814J94180k41282l87821L45329J56117j71385J400K36308j96806P3540
14634A129394J70482l16922j80230M42122m00211M25610k87378Q0672o092J38905
14624A196352n9241J91905l26813l7339M832M06985k28866K10610k56329L72343
$$ plain form
14614 1474439 1264357 906989 1140066 1209213 1430427 1072383 1314388 1232988 1096605 1521343
14604 1521343 1409265 1360203 1507253 1374286 1321655 1455223 1317931 1412587 1363661 1372195
14594 1372195 1233493 1320711 1578730 1388439 1430808 1467032 1717986 1404855 1597397 1959090
14584 1959090 1276627 1694184 1654542 1995855 1611487 1792373 1996840 1611414 1604424 1625730
14574 1625730 1620702 1905837 1996565 1777789 2214900 1989953 2195207 1930417 2179453 1929010
14564 1929010 2140908 2111374 2568051 2313254 2390971 2442304 2605582 2780815 2873298 3211121
14554 3211121 3524475 3628006 4423350 5166701 7036399 9042581 12063836 17839031 25871908
14545 25871908 25393523 16960076 9888744 5836971 4281412 2811608 2749366 2593188 2197723
$$ packed form
14614A474439k10082l57368K33077O9147K21214l58044K42005q1400j36383M24738
14604A521343j12078m9062J47050j32967n2631J33568j37292R4656m8926Q534
14594A372195j38702Q7218K58019j90291M2369L6224K50954l13131J92542L61693
14584A959090o82463M17557l9642L41313l84368J80886K04467l85426o990K1306
14574A625730n028K85135R0728k18776M37111k24947K05254k64790K49036k50443
14564A929010K11898k9534M56677k54797P7717N1333J63278J75233R2483L37823
14554C211121L13354J03531P95344P43351J869698K006182L021255N775195Q032877
14545B5871908m78385q433447p071332m051773j555559j469804o2242j56178l95465
$$ plain form
14536 2197723 1911918 2242989 2083486 1835776 2066966 2230092 1811127 1749985 2336268 1845446
14526 1845446 2115233 2187425 2118834 1811031 1923887 1977352 2019734 2169547 2282848 2019350
14516 2019350 2176200 1933964 2331758 2333098 2344250 2201282 2251319 2392616 2338620 2606612
14506 2606612 2358961 2723223 2483238 2665346 2559066 2558091 2738487 3102947 2287880 2766190
14496 2766190 2795406 2839270 2783223 2809586 2842797 2832858 2936846 3251064 2771371 3074041 2910588
14485 2910588 2994315 3163514 2952736 3285091 3024402 3146897 3379030 3241279 3327753 3555141
14475 3555141 3267741 3690023 3482614 3439773 3422134 3599258 3423951 3850714 3607633 3638625
14465 3638625 3666539 3908140 3659525 4141339 4161618 4067558 4254895 3894012 4028735 4686318
$$ packed form
14536B197723k85805L31071j59503k47710K31190J63126m18965o1142N86283m90822
14526A845446K69787P2192o8591l07803J12856N3465M2382J49813J13301k63498
14516B019350J56850k42236L97794J340J1152j42968N0037J41297n3996K67992
14506B606612k47651L64262k39985J82108j06280r75J80396L64460q15067M78310
14496B766190K9216M3864n6047K6363L3211r939J03988L14218m79693L02670j63453
14485B910588Q3727J69199k10778L32355k60689J22495K32133j37751Q6474K27388
14475C555141k87400M22282k07409m2841j7639J77124j75307M26763k43081L0992
14465C638625K7914K41601k48615M81814K0279r4060J87337l60883J34723O57583
$$ plain form
14455 4686318 4448742 4379614 4566406 4398597 4388112 4620879 4548591 4740400 4638390 4905013
14445 4905013 4791815 5123649 5022125 5195604 5177797 5116167 5334077 5299909 5598625 5596812
14435 5596812 5481533 5714824 5890745 5794959 5833378 5796332 5903104 6161248 5925405 6231548
14425 6231548 6327555 6426263 6576636 6540907 6108294 6940623 6464857 6861814 6831458 7092901
14415 7092901 6844233 7481007 7214646 7451260 7915562 7839919 7991241 7915453 8409978 8071834
14405 8071834 8433934 8456412 8702007 8735191 8787856 8980449 9154966 9416043 9654950 9554651
14395 9554651 9520387 9586540 10111550 9951025 10596503 10340199 10512503 10875823 11209322 11132498
14385 11132498 11459514 11786529 11881809 11967951 12385336 12634169 12907782 13116922 12987197 13272573
$$ packed form
14455D686318k37576o9128J86792j67809j0485K32767p2288J91809j02010K66623
14445D905013j13198L31834j01524J73479j7807o1630K17910l4168K98716j813
14435E596812j15279K33291J75921r5786L8419l7046J06772K58144k35843L06143
14425F231548R6007R8708J50373l5729m32613Q32329m75766L96957l0356K61443
14415G092901k48668O36774k66361K36614M64302p5643J51322p5788M94525l38144
14405H071834L62100K2478K45595L3184N2665J92593J74517K61077K38907j00299
14395I554651l4264O6153N25010j60525O45478k56304J72304L63320L33499p6824
14385A1132498L27016L27015R5280Q6142M17385K48833K73613K09140j29725K85376
$$ plain form
14375 13272573 13807534 14345140 14168419 14692248 15047202 15312297 15344876 15698188 16016328
14366 16016328 16390531 16722229 17244291 17531121 18023248 18491521 18708792 19066580 19887264
14357 19887264 20100704 20438116 20867626 21635716 21990565 22741356 22827237 23547764 23907154
14348 23907154 24742591 25666707 26172468 27030577 27836993 28109818 28724216 29792523 30398261
14339 30398261 31383803 32298799 33185444 34561104 35179495 36440759 37231364 38753178 39815199
14330 39815199 40991476 42418549 43641943 45070645 46901050 48067655 49987521 51448386
14322 51448386 53347309 55233780 57527242 59432474 61459447 64037978 66344083 68875664
14314 68875664 71477927 74464547 77335972 80650944 84241541 87490187 91463395 94984903
$$ packed form
14375A3272573N34961N37606j76721N23829L54954K65095L2579L53312L18140
14366A6016328L74203L31698N22062K86830M92127M68273K17271L57788Q20684
14357A9887264K13440L37412M29510P68090L54849P50791Q5881P20527L59390
14348B3907154Q35437R24116N05761Q58109Q06416K72825O14398J068307O05738
14339C0398261R85542R14996Q86645J375660O18391J261264P90605J521814J062021
14330C9815199J176277J427073J223394J428702J830405J166605J919866J460865
14322E1448386J898923J886471K293462J905232K026973K578531K306105K531581
14314F8875664K602263K986620K871425L314972L590597L248646L973208L521508
$$ plain form
14306 94984903 99073380 103717644 108782934 113493441 118887209 124484426 130339331 136968108
14298 136968108 143814162 150764111 158691195 166219579 175161127 184192885 193434080 203680301
14290 203680301 214286919 225613030 237534741 249825658 262670348 275848408 289664911
14283 289664911 303658796 318003128 331985828 346157333 359833609 372850553 385424961
14276 385424961 396592968 406550719 414407445 419565394 422059430 423336794 423956754 422918444
14268 422918444 419309879 415050855 409046127 401085314 391437167 380437049 368344111 354580044
14260 354580044 340974415 326718687 312295498 297829812 284013426 270263035 256678841
14253 256678841 244123459 232046890 220227922 208984870 198637440 188588215 179073200
$$ packed form
14306I4984903M088477M644264N065290M710507N393768N597217N854905O628777
14298A36968108O846054O949949P927084P528384Q941548R031758R241195J0246221
14290B03680301J0606618J1326111J1921711J2290917J2844690J3178060J3816503
14283B89664911J3993885J4344332J3982700J4171505J3676276J3016944J2574408
14276C85424961J1168007R957751P856726N157949K494036J277364O19960j038310
14268D22918444l608565m259024o004728p960813r648147j1000118j2092938j3764067
14260C54580044j3605629j4255728j4423189j4465686j3816386j3750391j3584194
14253B56678841j2555382j2076569j1818968j1243052j0347430j0049225r515015
$$ plain form
14246 179073200 170025422 162050820 154504889 146666338 139871058 133054268 126862918 120987815
14238 120987815 115714355 110589789 105503754 100716284 96621973 92637571 88976624 85399743
14230 85399743 81676607 78491252 75416307 72667335 69469156 66947237 64518653 61931352
14222 61931352 59907814 57925890 55576533 54113938 51929201 50288133 48579862 47146989
14214 47146989 45487960 44542421 43035817 41588344 40681709 39288842 38061039 37256970
14206 37256970 35844696 35033086 34040795 33132078 32176248 31348759 30792955 29760477 28960397
14197 28960397 28007015 27192983 26698721 26175956 25442170 24775946 23992572 23601974 22867820
14188 22867820 22201294 21741615 21548701 20991713 20371719 19923596 19466436 18922784 18828731
$$ packed form
14246A79073200r047778p974602p545931p838551o795280o816790o191350n875103
14238A20987815n273460n124566n086035m787470m094311l984402l660947l576881
14230H5399743l723136l185355l074945k748972l198179k521919k428584k587301
14222F1931352k023538j981924k349357j462595k184737j641068j708271j432873
14214D7146989j659029r45539j506604j447473r06635j392867j227803q04069
14206C7256970j412274q11610r92291r08717r55830q27489n55804j032478q00080
14197B8960397r53382q14032m94262n22765p33786o66224p83374l90598p34154
14188B2867820o66526m59679j92914n56988o19994m48123m57160n43652r4053
$$ plain form
14179 18828731 18050011 17580365 17760350 17247141 16916907 16269989 16028120 15741907 15293570
14170 15293570 14988523 14599585 14871829 14261458 14010812 13882025 13343033 13560673 12963554
14161 12963554 12802907 12448213 12667310 12192779 11966105 11878206 11587974 11263438 11085439
14152 11085439 10851235 10736569 10498578 10720609 10300791 9918585 9709141 9611309 9790897
14143 9790897 9251082 9382332 9116589 8885463 8676197 8800608 8668235 8402962 8244956
14134 8244956 8077374 8186777 7825510 7932323 7834729 7624668 7249626 7587958 7384983 7186569
14124 7186569 7110632 6915889 6868811 6716388 6949926 6742907 6334100 6093608 6401947 6403453
14114 6403453 6487777 5865518 5903178 6076988 5917752 5830962 5867894 5787698 5610987 5457598
$$ packed form
14179A8828731p78720m69646J79985n13209l30234o46918k41869k86213m48337
14170A5293570l05047l88938K72244o10371k50646j28787n38992K17640n97119
14161A2963554j60647l54694K19097m74531k26674q7899k90232l24536j77999
14152A1085439k34204j14666k37991K22031m19818l82206k09444r7832J79588
14143I790897n39815J31250k65743k31126k09266J24411j32373k65273j58006
14134H244956j67582J09403l61267J06813r7594k10061l75042L38332k02975j98414
14124G186569p5937j94743m7078j52423K33538k07019m08807k40492L08339J506
14114F403453Q4324o22259L7660J73810j59236q6790L6932q0196j76711j53389
$$ plain form
14104 5457598 5520144 5483167 5741784 5161719 4977785 5407107 5127355 5403737 5147551 4881416
14094 4881416 4862629 4766312 4652664 4702542 4510779 4308609 4774692 4581362 4304043 4500053
14084 4500053 4078968 4400798 4137087 4200710 4176359 4113340 4091131 4041723 3633494 3634526 3890455
14073 3890455 3764495 3983178 3555195 3791270 3813333 3370871 3614791 3567987 3382900 3813515
14063 3813515 3406615 3336866 3332648 3418615 3316844 3291890 3421540 2984804 3194238 2958728
14053 2958728 3067952 2931069 3020722 2935403 2921728 2846797 2720698 3025599 2802974 2512705
14043 2512705 2875864 2904785 2727213 2743426 2732511 2691841 2985941 2634678 2499448 2511723
14033 2511723 2739041 2559780 2323110 2298692 2519280 2718104 2379398 2566511 2457600 2243824
$$ packed form
14104E457598O2546l6977K58617n80065j83934M29322k79752K76382k56186k66135
14094D881416j8787r6317j13648M9878j91763k02170M66083j93330k77319J96010
14084D500053m21085L21830k63711O3623k4351o3019k2209m9408m08229J032K55929
14073C890455j25960K18683m27983K36075K2063m42462K43920m6804j85087M30615
14063C813515m06900o9749m218Q5967j01771k4954J29650m36736K09434k35510
14053B958728J09224j36883Q9653q5319j3675p4931j26099L04901k22625k90269
14043B512705L63159K8921j77572J6213j0915m0670K94100l51263j35230J2275
14033B511723K27318j79261k36670k4418K20588J98824l38706J87113j08911k13776
$$ plain form
14023 2243824 2410266 2184557 2397470 2101040 2395311 2291278 2093081 2320871 2075340
14014 2075340 2183626 2034720 2154156 2121402 2204444 2098710 1889800 2492152 2191987 2028937
14004 2028937 2178236 2130834 2014440 2004324 1911333 1725691 1873980 2004857 2115743 2096550
13994 2096550 2080257 2156525 2574749 2998256 3911846 5367289 8629806 13784680 22547153
13985 22547153 26961952 20328519 13337818 8836365 6481421 5039647 4630901 3735292
13977 3735292 2842103 3346661 3175242 2754889 2543920 2155307 2282347 2230904 2441878 2200417
13967 2200417 1898516 2117078 1814241 1688315 1963473 1975886 1822224 1967259 1810721 1849002
13957 1849002 1767274 1741205 1810889 1657487 1715549 1587137 1627224 1830101 1616445 1708221
$$ packed form
14023B243824J66442k25709K12913k96430K94271j04033j98197K27790k45531
14014B075340J08286j48906J19436l2754Q3042j05734k08910O02352l00165j63050
14004B028937J49299m7402j16394j0116r2991j85642J48289J30877J10886j9193
13994B096550j6293P6268M18224M23507R13590J455443L262517N154874Q762473
13985B2547153M414799o633433o990701m501453k354944j441774m08746q95609
13977C735292q93189N04558j71419m20353k10969l88613J27040n1443K10974k41461
13967B200417l01901K18562l02837j25926K75158J2413j53662J45035j56538L8281
13957A849002q1728k6069O9684j53402N8062j28412M0087K02877k13656R1776
$$ plain form
13947 1708221 1601595 1715169 1724434 1339611 1641342 1613928 1501797 1638366 1115229 1421149
13937 1421149 1442964 1516580 1508501 1346026 1479669 1645135 1437179 1599373 1404586 1583126
13927 1583126 1553393 1339003 1715323 1390811 1442344 1207142 1423238 1504420 1275505 1304702
13917 1304702 1155556 1522740 1042308 1275448 1271550 1428396 1239907 640850 1097631 1309860
13907 1309860 1171215 1355251 1166969 1385789 1212328 1209452 1299640 1064153 1303517 1124452
13897 1124452 1145893 1053807 1204700 1001436 1055711 1363986 1051311 1006674 1213335 1058577
13887 1058577 1182020 1151905 839095 1095271 872420 1214271 949669 1267703 952166 1253873
13877 1253873 987451 997357 857967 679418 1284033 1366566 994429 1263234 825764 728277
$$ packed form
13947A708221j06626J13574R265l84823L01731k7414j12131J36569n23137L05920
13937A421149K1815P3616q079j62475J33643J65466k07956J62194j94787J78540
13927A583126k9733k14390L76320l24512N1533k35202K16096Q1182k28915K9197
13917A304702j49146L67184m80432K33140l898J56846j88489n99057M56781K12229
13907A309860j38645J84036j88282K18820j73461k876R0188k35487K39364j79065
13897A124452K1441r2086J50893k03264N4275L08275l12675m4637K06661j54758
13887A058577J23443l0115l12810K56176k22851L41851k64602L18034l15537L01707
13877A253873k66422R906j39390j78549O04615Q2533l72137K68805m37470r7487
$$ plain form
13867 728277 586010 898749 981154 1004843 1056297 1045295 793597 531006 843812 852156 737638
13856 737638 1282156 972577 533442 913581 1222749 994536 947663 897502 626724 920408
13846 920408 821766 1043846 1066363 666727 773344 589760 918945 735171 661744 855456
13836 855456 1001689 746049 1025922 835731 842735 737149 807060 711674 803844 811146 782899
13825 782899 629096 517386 903989 561254 720571 722374 685238 588751 821132 871939
13815 871939 865525 986309 721721 710653 864357 772570 795192 559708 572818 850253 877256
13804 877256 650244 733924 554344 627423 616538 788810 575471 362471 1046900 568081
13794 568081 1015848 787736 938492 608241 593118 847194 734818 604087 539429 711210
$$ packed form
13867G28277j42267L12739Q2405K3689N1454j1002k51698k62591L12806Q344j14518
13856G37638N44518l09579m39135L80139L09168k28213m6873n0161k70778K93684
13846I20408r8642K22080K2517l99636J06617j83584L29185j83774p3427J93712
13836H55456J46233k55640K79873j90191P004j05586O9911r5386R2170P302k8247
13825G82899j53803j11710L86603l42735J59317J803l7136r6487K32381N0807
13815H71939o414J20784k64588j1068J53704r1787K2622k35484J3110K77435K7003
13804H77256k27012Q3680j79580P3079j0885J72272k13339k13000O84429m78819
13794E68081M47767k28112J50756l30251j5123K54076j12376j30731o4658J71781
$$ plain form
13784 711210 547958 733948 711579 389894 421034 859454 757801 618676 572936 471135
13774 471135 703049 462639 381482 643076 459246 583475 748100 475652 446782 690879
13764 690879 801898 474871 664269 688226 316912 552067 492171 335647 575328 429790
13754 429790 579928 401652 412827 395071 707067 440957 323402 625918 950199 718550
13744 718550 610383 765467 729628 647096 480409 355814 426902 488758 429343 386999 330127
13733 330127 715272 650982 418081 619640 431684 425628 359001 734582 385811 348505
13723 348505 503619 407921 434018 625656 373875 205389 404721 744802 523736 734408
13713 734408 367329 536737 736334 601008 351044 502505 399898 314805 495129 499914
$$ packed form
13784G11210j63252J85990k2369l21685L1140M38420j01653j39125m5740j01801
13774D71135K31914k40410q1157K61594j83830J24229J64625k72448k8870K44097
13764F90879J11019l27027J89398K3957C16912K35155n9896j56524K39681j45538
13754D29790J50138j78276J1175j7756L11996k66110j17555L02516L24281k31649
13744G18550j08167J55084l5839q2532j66687j24595P1088O1856n9415m2344n6872
13733C30127L85145o4290k32901K01559j87956o056o6627L75581l48771l7306
13723C48505J55114r5698K6097J91638k51781j68486J99332L40081k21066K10672
13713G34408l67079J69408J99597j35326k49964J51461j02607q5093J80324M785
$$ plain form
13703 499914 280247 534506 679389 311319 412220 363175 502785 609728 133928 588978
13693 588978 405942 270188 347185 363411 249011 663087 428400 778754 510641 210983
13682 552134 434895 578637 339545 190201 491006 422806 144152 455412 452515 343915
13672 343915 430429 400563 196565 269134 332747 506198 293254 527590 441363 345166 505190
13661 505190 311642 506597 348732 487742 487540 568494 72755 591626 224263 144677 345902
13650 345902 234395 386736 544045 313424 264718 487837 462612 381985 478644 316072
13640 316072 344845 420933 304150 288939 490022 382566 192541 688410 373653 459617
13630 459617 336361 438346 58509 284569 461857 302147 328898 371508 206964 89368
$$ packed form
13703D99914k19667K54259J44883C11319J00901m9045J39610J06943A33928M55050
13693E88978j83036j35754P6997J6226j14400M14076k34687L50354k68113B10983
13682E52134j17239J43742k39092j49344L00805o8200A44152L11260k897j08600
13672C43915Q6514k9866A96565P2569O3613J73451k12944K34336q6227r6197J60024
13661E05190j93548J94955j57865J39010k02Q0954G2755N18871B24263p9586K01225
13650C45902j11507J52341J57309k30621m8706K23119k5225q0627R6659j62572
13640C16072K8773P6088j16783j5211K01083j07456j90025M95869l14757Q5964
13630D59617j23256J01985E8509K26060J77288j59710K6751M2610j64544H9368
$$ plain form
13619 182240 423730 500157 907876 207814 88727 421381 299888 148220 335826 586498
13609 586498 196289 331251 333527 487110 330504 366208 372546 236340 164732 267102 340640
13598 340640 313847 -46660 -57548 479474 255239 377641 306899 293698 254242 216311 383175
13587 383175 368949 430151 222766 468284 300519 263720 -95011 176871 201574 206703 131767
13576 131767 183893 299250 311617 339299 443274 380161 -36154 381410 139668 145944 142082
13565 142082 590611 72463 386611 220300 235215 23518 210691 43904 325450 57744
13554 368326 272321 310540 105942 356316 426463 336496 -2338 193848 305315 275102 224927
13543 224927 360763 386960 425679 154865 -142206 138048 157240 168866 334927 342419 -70701
$$ packed form
13619A82240K41490P6427M07719B07814H8727L32654j21493A48220J87606K50672
13609E86498A96289J34962K276J53583j56606L5704O338j36206p1608J02370P3538
13598C40640k6793d6660j0888D79474k24235J22402p0742j3201l9456l7931J66864
13587C83175j4226O1202k07385K45518j67765l6799i5011A76871K4703N129p4936
13576A31767N2126J15357J2367K7682J03975o3113c6154C81410A39668O276l862
13565A42082M48529G2463L14148j66311J4915B3518J87173D3904K81546E7744
13554C68326r6005L8219A05942K50374P0147q9967b338A93848J11467l0213n0175
13543B24927J35836K6197L8719A54865a42206A38048J9192J1626J66061P492g0701
$$ plain form
13531 159694 103014 506968 354095 376031 89385 120483 266455 -183222 555599 307874
13521 307874 156668 128196 -48691 43526 410174 56403 293536 361375 215546 376341
13511 376341 314859 175843 -58145 -87617 306632 131932 -49250 431937 395304 133961
13500 -20787 145526 295837 144068 438655 -17470 28433 201106 119100 434732 246625
13490 246625 -216473 104443 425350 226321 283712 269600 184409 196108 419992 -4151 142401
13478 383141 -171021 457590 -115384 265761 425016 22013 459560 98780 388823 204189
13468 204189 641058 653983 198502 157191 253213 626334 282866 -120207 379692 265522
13458 265522 45923 152104 192974 166234 213195 -6263 392578 317283 381774 332455 15518
$$ packed form
13531A59694n6680M03954j52873K1936H9385L1098J45972a83222E55599k47725
13521C07874j51206k8472d8691D3526L66648E6403K37133O7839j45829J60795
13511C76341o1482j39016e8145k9472C06632A31932d9250D31937l6633A33961
13500b0787A45526J50311A44068K94587a7470B8433J72673q2006L15632j88107
13490B46625b16473A04443L20907j99029N7391j4112q5191J1699K23884d151A42401
13478C83141a71021D57590a15384B65761J59255B2013M37547I8780K90043j84634
13468B04189M36869J2925A98502m1311R6022L73121B82866a20207C79692j14170
13458B65522D5923J06181M0870k6740M6961f263C92578p5295O4491m9319A5518
$$ plain form
13446 -51964 -11851 -29123 280082 410231 279279 60291 401261 190158 376310 89533
13435 163651 -31174 51533 54994 458992 -238650 197285 62641 416573 19911 172023 279505
13424 279505 215105 228352 156704 519501 190757 594421 425580 56530 151472 272228
13414 272228 121487 195960 270963 177004 145045 145982 220630 94334 174389 356359 66730
13402 465239 -3627 29813 545198 -102567 282682 267825 117227 268391 80077 75140 154546
13391 154546 266749 23066 251567 -114846 77016 82806 198888 71418 360732 227623
13381 227623 183452 170737 112270 55126 126144 184576 61401 -12964 132427 277836 70726
13369 606741 39362 177440 246955 -5446 -130580 557435 162035 291942 212149 415418
$$ packed form
13446e1964a1851j7272B80082J30149j30952F0291L40970A90158J86152H9533
13435A63651c1174E1533L461M03998b38650A97285F2641L53932A9911J52112J07482
13424B79505o4400J3247p1648L62797A90757M03664j68841E6530R4942J20756
13414B72228A21487P4473P5003r3959l1959R37P4648I4334Q0055J81970F6730
13402D65239c627B9813N15385a02567B82682j4857A17227J51164H0077m937P9406
13391A54546J12203B3066K28501a14846G7016N790J16082G1418K89314j33109
13381B27623m4171j2715n8467E5126P1018N8432F1401a2964A32427J45409G0726
13369F06741C9362J38078O9515e446j25134E57435A62035J29907p9793K03269
$$ plain form
13359 415418 324821 100511 63678 229275 15695 85983 251324 267802 157028 265116
13349 265116 175842 485507 416388 176100 236277 168665 98045 356310 269233 182949 221440
13338 221440 120936 403212 -97607 248029 83204 272716 130675 156617 102843 46957
13327 143572 409524 -10726 190502 -157211 -80671 -106422 281340 583244 251889 91592
13316 26342 255116 130786 122740 136213 198961 -57666 216239 234588 -159400 63304 -100458
13304 -15565 116412 133316 271388 73597 45708 -69616 245631 182954 183297 39511 79522
13293 79522 162328 76796 -32992 -132911 90402 -174583 -157892 113963 222982 125351 -50788
13281 82081 -183889 251001 -127600 183673 111230 262274 266268 86015 242023 -117076
$$ packed form
13359D15418r0597A00511l6833J65597A5695P0288J65341J6478j10774J08088
13349B65116q9274L09665o9119A76100O0177o7612p0620K58265q7077q6284L8491
13338B21440j00504K82276i7607B48029H3204J89512A30675K5942n3774D6957
13327A43572K65952a0726A90502a57211P6540k5751B81340L01904B51889I1592
13316B6342K28774j24330q046J3473O2748e7666B16239J8349a59400F3304a00458
13304a5565A16412J6904J38072G3597k7889f9616B45631o2677L43C9511M0011
13293G9522Q2806G6796c2992r9919I0402a74583J6691A13963J09019r7631e0788
13281H2081a83889B51001a27600A83673p2443J51044L994H6015J56008a17076
$$ plain form
13270 57663 115886 4784 227152 83376 235241 245177 -137117 89094 -73082 200693 330247
13259 330247 154572 111187 60811 63963 16354 42785 188937 -70600 -204248 93975 246685
13248 246685 154883 64587 132869 125032 74100 297724 233958 111005 -2256 126407 413611
13237 413611 202218 184275 -3022 -82045 61701 -17467 69668 140109 -120879 -59106 -63481
13226 -63481 159875 107440 318825 260648 -70174 -80123 226632 420740 106293 110339 -99172
13214 161861 240650 61436 125844 -141493 -319800 -214881 149220 -31048 -36819 -41690 155758
13202 -18974 -15626 42535 44562 112311 200933 298546 15202 8506 376385 105315 -36457 -26559
13190 -26559 -244130 123569 228566 189820 79107 248134 -148975 168634 51001 61742
$$ packed form
13270E7663N8223D784K22368H3376J51865R936a37117H9094g3082B00693J29554
13259C30247A54572m3385n0376L152A6354K6431J46152g0600j33648I3975J52710
13248B46685r1802F4587O8282p837n0932K23624o3766A11005b256A26407K87204
13237D13611B02218j7943c022p9023F1701a7467F9668P0441a20879e9106m375
13226f3481A59875n2435K11385n8177g0174r949B26632J94108A06293M046i9172
13214A61861P8789F1436O4408a41493j78307J04919A49220c1048n771m871A55758
13202a8974L348D2535K027O7749Q8622R7613A5202o696L67879A05315c6457R898
13190b6559k17571A23569J04997l8746G9107J69027a48975A68634E1001J0741
$$ plain form
13180 61742 593 145961 174402 64466 299655 -244460 173456 -73716 195372 201070 -7772
13168 248202 146622 64952 -115466 37699 12796 198201 42446 -196842 -117019 -103226 120934
13156 -81734 -14171 31577 435499 -34994 25176 -22120 -169919 285749 -28544 -354202 -89402
13144 -145422 160188 -52488 216428 18282 193714 -315973 122079 239498 66306 -20560
13133 297363 -80914 -164169 7712 47739 41374 10841 303976 361625 60859 47987 -94874 319746
13120 138159 8764 -169846 -33663 228301 337703 223440 347590 -205432 223837 48640
13109 -253029 -89207 67444 73608 -26854 -29929 138157 212785 89072 -97161 949 -28305 172732
13096 53184 -178405 12970 167430 -15 -144664 5123 138533 683122 89767 -452708 78690
$$ packed form
13180F1742E93J45368K8441F4466K35189b44460A73456g3716A95372N698g772
13168B48202j01580F4952a15466C7699A2796J85405D2446a96842P9823J3793A20934
13156h1734a4171C1577M03922c4994B5176b2120j47799B85749b8544l25658h9402
13144a45422A60188e2488B16428A8282J75432c15973A22079J17419F6306b0560
13133B97363h0914q3255G712M0027o365A0841K93135N7649F0859j2872i4874C19746
13120A38159H764a69846c3663B28301J09402j14263J24150b05432B23837D8640
13109b53029h9207F7444O164b6854l075A38157P4628H9072i7161I49b8305A72732
13096E3184a78405A2970J54460a5j44649E123J33410N44589H9767d52708G8690
$$ plain form
13084 201294 28125 250195 5470 184616 86425 259898 64831 -88384 53448 -14165 471753
13072 145014 60856 163531 111738 425333 270701 313602 102666 -155838 250014 -91002
13061 233029 -12879 50804 406712 98769 150417 236652 -180287 224873 249977 344271 -103514
13049 103909 220871 -241356 280504 277367 273933 70692 -235548 -22836 -10675 177614 377622
13038 377622 -52947 59218 230935 232027 296546 200635 186844 295310 61095 -58623 186891
13026 209275 61510 19965 -43605 -177391 59167 207415 -41492 104717 48935 282754 8730
13014 374261 27745 115369 184158 178966 48071 366511 140439 291770 -117715 152799 264988
13003 264988 -130239 -70925 143163 172458 36466 87720 342719 -99975 182493 -99103 173444
$$ packed form
13084B01294B8125K22070E470J79146H6425J73473F4831h8384E3448a4165D71753
13072A45014F0856J02675n1793L13595j54632M2901A02666a55838B50014i1002
13061B33029a2879E0804L55908I8769N1648Q6235a80287B24873K5104R4294a03514
13049A03909J16962b41356B80504l137l434G0692b35548b2836a0675A77614K00008
13038C77622e2947E9218J71717J092O4519r5911j3791J08466F1095e8623A86891
13026B09275F1510A9965d3605j33786E9167J48248d1492A04717D8935K33819H730
13014C74261B7745Q7624O8789n192D8071L18440A40439J51331a17715A52799J12189
13003B64988a30239N9314A43163K9295C6466N1254K54999i9975A82493i9103A73444
$$ plain form
12991 -31675 183887 117687 -246493 114990 -76820 373111 -14914 33926 7075 218034 110757
12980 110757 50050 117379 -57605 59425 104714 -358095 85649 -190901 -124899 -63992 388198
12968 -164608 313716 -4215 41811 -134194 -160540 -195806 -369111 23675 91216 -29326 -71812
12957 -71812 49864 -47836 58095 310345 46798 -278506 103675 89944 245387 255451 55973
12945 -28985 -94608 189539 104398 -49915 103941 123416 76207 -314816 274022 219186 15836
12933 38189 83635 -26471 -42352 -63342 73999 -37030 -110695 -219848 -81660 -66908 -261251
12922 -261251 -81167 119693 418182 159697 -192384 228086 62440 41308 -87006 -206693
12912 -206693 -133107 -145214 -133470 146461 -45944 -232925 -267138 195316 78600 -171667 16182
$$ packed form
12991c1675A83887o6200b46493A14990g6820C73111a4914C3926G075K10959j07277
12980A10757E0050O7329e7605E9425M5289c58095H5649a90901O6002O0907C88198
12968a64608C13716d215D1811a34194k6346l5266j73305B3675O7541b9326m2486
12957g1812D9864d7836E8095K52250D6798b78506A03675j3731J55443J0064E5973
12945b8985o5623A89539q5141d9915A03941J9475m7209c14816B74022n4836A5836
12933C8189M5446b6471j5881k0990G3999c7030p3665j09153h1660J4752j94343
12922b61251h1167A19693K98489A59697a92384B28086F2440k1132h7006j19687
12912b06693P3586j2107J1744A46461d5944j86981l4213A95316G8600a71667A6182
$$ plain form
12900 -131447 -149600 -139230 -104309 -86664 55953 -49878 119304 -97564 -399209 -333114 26201
12888 310193 -122967 -44055 421658 27859 -158404 -1551 154192 346525 207493 -91939
12877 -194286 28964 220776 161788 354174 -61825 31749 181799 -94024 132296 -16003 279784
12865 384529 205349 -23431 -153009 -237294 -112645 196661 344723 -184704 -72083 -73164
12855 -73164 168169 314597 -227456 20508 -593 -50089 -106428 280913 -51534 -25397 -102314
12844 -102314 -115563 -284871 30636 -16314 105475 192157 26001 -188765 -163739 -101189 -253456
12833 -253456 -1041 -26582 -4795 7417 202629 143172 217427 -195162 27753 200555 27155
12821 -6190 -101252 -53661 141744 -64660 -183612 -27835 -106911 -57090 -137461 -60594 178800
$$ packed form
12900a31447j8153J0370L4921J7645E5953d9878A19304i7564l01645O6095B6201
12888C10193a22967d4055D21658B7859a58404a551A54192J92333j39032i1939
12877a94286B8964J91812n8988J92386f1825C1749J50050i4024A32296a6003B79784
12865C84529j79180b3431j29578q4285a12645A96661J48062a84704g2083j081
12855g3164A68169J46428b27456B0508e93m9496n6339B80913e1534b5397p6917
12844a02314j3249j69308C0636a6314A05475Q6682B6001a88765K5026O2550j52267
12833b53456a041k5541d795G417J95212n9457P4255a95162B7753J72802B7155
12821f190r5062M7591A41744f4660j18952b7835p9076M9821q0371f0594A78800
$$ plain form
12809 -84316 204976 -317945 -9187 162270 -101697 21153 372667 -109431 134478 -301379
12798 -35873 113901 82189 176785 -82419 327037 -372940 77349 240427 -316188 -367448 24085
12786 -114157 50617 128648 -42777 112434 100421 219664 -114392 68294 7858 95298 28089
12774 -27986 69177 99580 216007 166163 -9694 -171615 200399 186556 -56524 51637 -213490
12762 88404 -117427 -150999 120289 221075 -68231 15221 -33070 -137704 424578 107068
12751 -62754 -272192 -314945 -252096 -154016 180964 -123326 -279617 -107342 -82529 -159840 -182359
12740 -182359 202115 165544 -37497 44978 248341 81651 -116144 140057 189160 -135067
12729 358882 59254 -218702 198276 264538 -197669 -228508 48785 13621 110364 137894 -34986
$$ packed form
12809h4316B04976c17945i187A62270a01697B1153L51514a09431A34478c01379
12798c5873A13901l1712R4596h2419C27037c72940G7349J63078c16188n1260B4085
12786a14157E0617P8031d2777A12434j2013J19243a14392F8294G858Q7440B8089
12774b7986F9177L0403J16427m9844i694j61921B00399j3843e6524E1637b13490
12762H8404a17427l3572A20289J00786f8231A5221c3070j04634D24578A07068
12751f2754k09438m2753O2849R8080A80964a23326j56291a07342K4813p7311k2519
12740a82359B02115l6571c7497D4978K03363H1651a16144A40057M9103a35067
12729C58882E9254b18702A98276O6262a97669l0839D8785A3621R6743K7530c4986
$$ plain form
12717 -336967 -69964 260275 -177968 -4467 -131709 -27716 -146712 205353 -73086 65586 -66605
12705 2845 16927 240087 30253 91081 406742 -72246 -237848 -21032 -65155 44711 136384
12694 136384 220625 -141223 -258804 122470 306158 63341 -395932 -30790 -112891 73040
12683 196220 -130678 -49692 191232 181447 183607 226914 175840 -190552 339512 301383 -162450
12671 65912 158059 313763 -221693 128347 -365299 82496 82838 -140392 63300 -72713 112397
12659 86920 184347 84135 402325 132541 49816 270097 -63025 -103514 -211336 -210051 -163254
12648 -163254 159094 79672 -42091 442655 218865 -290 125634 -114307 48831 49656 93637
12637 93637 -218262 -121729 -120214 -136802 37666 102718 84490 52826 276559 256357 -15634
$$ packed form
12717c36967f9964B60275a77968d467j27242b7716j18996B05353g3086F5586f6605
12705B845J4082K23160C0253O0828L15661g2246j65602b1032m4123D4711R1673
12694A36384Q4241a41223j17581A22470J83688F3341c95932c0790q2101G3040
12683A96220a30678d9692A91232r785K160M3307n1074a90552C39512l8129a62450
12671F5912R2147J55704b21693A28347c65299H2496L42a40392F3300g2713A12397
12659H6920R7427H4135L18190A32541D9816K20281f3025m0489j07822J285M6797
12648a63254A59094p9422d2091D42655B18865b90A25634a14307D8831Q25M3981
12637I3637b18262R6533J515j6588C7666O5052j8228l1664K23733k0202a5634
$$ plain form
12625 233364 -60746 -96285 320139 151423 161028 -77103 -17106 -60572 -222369 -3098 78658
12613 44590 -40289 30017 -26195 114185 46027 158744 133203 269125 -325299 -47787 66854
12601 626299 -134461 -47068 244938 169223 17005 -46089 111002 -99132 167431 -14318 196259
12589 67919 -209916 -202093 -5312 140981 -49401 -111732 -136163 74625 -6521 -105424 160050 112438
12577 112438 12238 -128973 190203 192839 105517 -111188 -85037 159230 -116180 128102
12566 248791 147777 28353 -214282 17403 -31079 14996 -55818 -442742 182958 -30909 104349
12554 233800 139020 69438 -283936 -198838 2844 337948 33843 -116059 -3380 -55275 131862
12542 -74015 -258268 -457753 57093 -115579 -114988 -116398 -334926 -212910 36423 140067 -239876
$$ packed form
12625B33364f0746l5539C20139A51423R605g7103a7106m3466j61797c098G8658
12613D4590d0289C0017b6195A14185D6027J12717k5541J35922c25299d7787F6854
12601F26299a34461d7068B44938p5715A7005d6089A11002i9132A67431a4318A96259
12589F7919b09916P823e312A40981d9401o2331k4431G4625f521r8903A60050m7612
12577A12438A2238a28973A90203K636q7322a11188K6151A59230a16180A28102
12566B48791j01014B8353b14282A7403c1079A4996e5818l86924A82958c0909A04349
12554B33800r4780F9438b83936Q5098B844L35104C3843a16059c380n1895A31862
12542g4015j84253j99485E7093a15579N91j410k18528J22016C6423J03644b39876
$$ plain form
12530 216069 -23352 -111532 190987 -92364 314360 -75521 65673 152511 129507 188100 142019
12519 142019 -43908 230905 24167 26032 94492 -66218 -131620 217611 293055 185770 -75593
12507 227978 17826 -62083 478320 -124208 299705 37317 59625 349852 118754 -29708
12496 201765 151575 -140472 -276464 -22923 -213760 -189861 -9334 -63760 86467 -94568 106846
12484 -100028 4686 74067 -105827 201550 282894 245549 147012 79996 -23660 -46880 2430
12472 -294762 -160163 73177 -3015 277661 -73907 115979 13477 -40882 -13165 56246 -220010
12460 -56211 241316 -116459 -28504 185047 -293364 -55083 -92519 69782 -148698 -51567 45080
12448 333772 -278155 -40022 -88765 134181 -214516 -315449 227040 -228486 -106814 32767
$$ packed form
12530B16069b3352q8180A90987i2364C14360g5521F5673Q6838k3004N8593m6081
12519A42019d3908B30905B4167J865O8460f6218o5402B17611P5444j07285g5593
12507B27978A7826f2083D78320a24208B99705C7317K2308K90227A18754b9708
12496B01765n0190a40472j35992b2923j90837K3899i334n4426H6467i4568A06846
12484a00028D686O9381a05827B01550Q1344l7345r8537o7016b3660k3220B430
12472b94762J34599G3177c015B77661g3907A15979A3477d0882a3165E6246b20010
12460e6211B41316a16459b8504A85047b93364e5083l7436F9782a48698e1567D5080
12448C33772b78155d0022m8743A34181b14516j00933B27040b28486a06814C2767
$$ plain form
12437 32349 -120748 -308211 -126365 -124044 -172526 -67426 -7622 80792 51326 -46378 37578
12425 -6885 42462 -254764 69007 -163578 -114589 -200653 38273 298770 -45713 -157504 325747
12413 5934 28978 -292818 -81363 -47418 254612 -252493 112328 -116099 -239217 5366 -106143
12401 -53780 -268326 -136188 -91072 392313 -47584 153479 -70509 231978 253923 -44134 -106970
12390 -106970 -252567 4832 45582 -90147 29225 -326154 -143089 -72287 -184172 53157 -181564
12378 281538 187282 -90703 -74783 33417 -379503 136360 -44359 -119264 -68901 192105 206459
12367 206459 -4969 -135112 -84470 5425 -88528 -29364 998 -12312 48499 -58515 61381 152739
12355 152739 18975 -259130 -234036 -88827 200966 -58481 -26102 -16999 -191627 106366 -92577
$$ packed form
12437C2349a20748j87463a26365K321m8482f7426g622H0792k9466d6378C7578
12425f885D2462b54764F9007a63578M8989q6064C8273K60497d5713j11791C25747
12413E934K3044b92818h1363L3945B54612b52493A12328a16099j23118E366a06143
12401e3780k14546J32138M5116C92313d7584A53479g0509B31978K1945d4134o2836
12390a06970j45597D832M0750i0147B9225c26154a43089P0802j11885E3157a81564
12378B81538r4256i0703J5920C3417c79503A36360d4359p4905N0363A92105J4354
12367B06459d969j30143N0642E425h8528b9364I98a2312D8499e8515F1381R1358
12355A52739A8975b59130K5094h8827B00966e8481b6102R103j74628A06366i2577
$$ plain form
12343 241971 -26186 99425 258405 -67021 56702 -168159 -231379 -320559 108905 -68326 -95758
12332 -95758 -97037 40681 22055 -120615 5573 214712 -13751 150435 28941 141834 15030
12320 -281437 153373 68921 241117 128309 -12310 -9607 -3114 -112816 -43815 -183696 -113125
12309 -113125 85304 -92365 -6882 36340 248520 115592 -243702 -79144 55347 66697 -32464
12297 27133 -284284 164134 -30548 91471 100130 -5532 198826 -71519 171468 -164955 140713
12285 76253 -121534 281780 -133543 -6524 -19898 -244538 -141117 54362 48297 112589 -102626
12273 204499 -1050 122776 292714 196224 -63041 133547 -178824 -299042 -17261 346724
12262 111125 -75494 -427424 -50116 12794 213390 27683 233267 -231596 16272 140944
$$ packed form
12343B41971b6186I9425J58980f7021E6702a68159o3220q9180A08905f8326k7432
12332i5758j279D0681j8626a20615E573K09139a3751A50435B8941J12893A5030
12320b81437A53373F8921J72196j12808a2310K703c114j09702d3815j39881P0571
12309a13125H5304i2365f882C6340K12180A15592b43702g9144E5347J1350c2464
12297B7133b84284A64134c0548I1471Q659e532A98826g1519A71468a64955A40713
12285G6253a21534B81780a33543f524j3374k24640J03421E4362o065O4292a02626
12273B04499a050A22776J69938r6490f3041A33547a78824j20218a7261C46724
12262A11125g5494l51930e0116A2794K00596B7683K05584b31596A6272J24672
$$ plain form
12252 140944 41568 -170298 97218 -149592 123951 255175 -47035 -216122 38235 141564
12242 141564 189666 -103378 241150 -140976 -83149 101731 379555 -109261 104984 12547
12231 -56047 206107 242546 172640 296345 24673 -237258 464830 172185 430072 -169937
12220 174756 20352 275724 331990 -52832 102592 145428 -35878 107631 134399 -96960 124851
12208 230333 211851 -218942 162305 -84750 151292 -72124 -121092 108829 208687 10562 53621
12197 53621 143410 -4924 -32636 113388 334934 378217 394066 -73662 241577 119104 -9781
12185 116370 93251 72188 243 268057 -222049 -58127 29948 -28335 262383 192696 -53627
12173 100351 216514 -72282 72175 -270849 206340 -88898 67964 242198 53532 -122353
$$ packed form
12252A40944D1568a70298I7218a49592A23951J31224d7035j69087C8235J03329
12242A41564M8102a03378B41150a40976N7827A01731K77824a09261A04984A2547
12231e6047B06107L6439o9906J23705B4673b37258D64830A72185K57887a69937
12220A74756B0352K55372N6266e2832A02592M2836c5878A07631K6768i6960A24851
12208B30333j8482b18942A62305h4750A51292g2124m8968A08829R9858A0562M3059
12197E3621Q9789d924k7712A13388K21546M3283J5849g3662B41577A19104i781
12185A16370k3119k1063B43K67814b22049e8127B9948b8335B62383o9687e3627
12173A00351J16163g2282G2175b70849B06340h8898F7964J74234E3532a22353
$$ plain form
12162 -89609 160673 68908 50009 290993 8878 -29320 188843 -15512 -85406 289515 5289
12150 373203 -81130 -33006 -136826 37489 168888 36845 357320 314426 -33688 -64850 -26977
12138 72733 14714 71486 -119971 310395 41286 58139 -114596 -394620 274301 -209037
12127 -78072 -85206 -49940 -71569 -461454 141335 -13772 -68487 -122534 103628 51971 265014
12116 265014 -64721 98604 -75478 -33553 279980 150429 120411 163095 86789 47898 83832
12105 83832 112186 -116789 125674 -226800 318219 114413 39949 -14510 -119135 14897
12094 39963 -89854 6842 63831 -251503 -9653 -54399 -202532 -85728 -221090 -186007 6756 9935
12082 9935 -271429 361026 -103155 -188424 235892 -10931 135125 -119773 9275 -111205 -203552
$$ packed form
12162h9609A60673F8908j8899K40984H878b9320A88843a5512o9894B89515E289
12150C73203h1130c3006j03820C7489J31399C6845L20475m2894c3688l1162b6977
12138G2733A4714N6772a19971C10395D1286J6853a14596k80024B74301b09037
12127g8072p134L5266k1629l89885A41335a3772n4715n4047A03628n1657K13043
12116B65014f4721I8604g5478c3553B79980j29551l0018M2684p6306l8891L5934
12105H3832K8354a16789A25674b26800C18219A14413C9949a4510j04625A4897
12094C9963h9854F842N6989b51503i653m4746j48133h5728j35362L5083F756L179
12082I935b71429C61026a03155q5269B35892a0931A35125a19773I275a11205r2347
$$ plain form
12071 -203552 38605 -58106 1754 -20102 -31005 44676 304726 125001 314993 -75230 -17793
12059 22644 -383724 105936 -155553 -375987 -177282 270563 -88077 170232 -105875 10294
12048 -172057 -30464 49170 155343 -49771 56030 23983 -64020 -207272 149920 -124441 -56357
12036 91463 -99688 -240275 -110559 94551 -157974 148920 82146 -67463 105285 57275 -37148
12024 107750 -319075 98499 30058 176514 -96757 -229681 300229 -133525 -129361 95807 2962
12012 87744 183049 26622 -253818 -121485 157461 -310574 -347705 88155 10217 -84551 -200841
12001 -200841 -178781 -228498 -17471 119645 -82003 459306 5463 9918 -480901 -74533 -36837
11989 -95425 74300 -259028 157494 160377 246873 132821 -88038 337560 107807 -98022 -88413
$$ packed form
12071b03552C8605e8106A754b0102j0903D4676K60050A25001J89992g5230a7793
12059B2644c83724A05936a55553k20434a77282B70563h8077A70232a05875A0294
12048a72057c0464D9170J06173d9771E6030B3983f4020j43252A49920a24441e6357
12036I1463i9688j40587a10559I4551a57974A48920o6774f7463A05285m8010c7148
12024A07750c19075I8499C0058J46456i6757j32924C00229a33525M164I5807B962
12012H7744R5305B6622b53818a21485A57461c10574l7131H8155A0217h4551j16290
12001b00841K2060m9717a7471A19645h2003D59306E463M455d80901g4533c6837
11989i5425G4300b59028A57494K883Q6496j14052h8038C37560A07807i8022R609
$$ plain form
11978 -88413 12065 232289 -31534 78711 -26150 185350 39355 -323076 -11969 -56349 29509
11966 149602 -18644 51600 142538 -394483 -283491 75908 149371 63947 -68070 -256821 -73738
11954 7943 -173262 104849 -231941 170010 -352127 -222549 14186 -46254 -267083 128042
11943 -508614 95387 140183 29737 127692 30661 -298791 38310 232927 69612 -297926 -121801
11931 -31213 -91668 -50338 72362 -149714 213398 -93225 54692 -40303 -223671 67903 93334
11920 93334 55151 -218721 172700 -8679 -18394 -16975 -109677 147664 18182 -10693 -139543
11909 -139543 -51963 182468 202471 112077 36829 46023 -257121 -148657 -103864 52351 61926
11898 61926 232152 115906 128442 -441404 17086 42310 76014 -100636 -195442 -113010 -41661
$$ packed form
11978h8413A2065K20224c1534G8711b6150A85350C9355c23076a1969m4380B9509
11966A49602a8644E1600R0938c94483J10992G5908P3463F3947f8070j88751g3738
11954G943a73262A04849b31941A70010c52127J29578A4186d6254k20829A28042
11943e08614I5387M4796B9737R7955C0661b98791C8310J94617F9612b97926a21801
11931c1213o0455M1330G2362a49714B13398i3225E4692d0303j83368F7903K5431
11920I3334l8183b18721A72700h679r715J419r2702A47664A8182a0693j28850
11909a39543e1963A82468K0003r0394C6829R194b57121J08464M4793E2351R575
11898F1926J70226A15906J2536d41404A7086K5224L3704a00636r4806Q2432d1661
$$ plain form
11886 81050 -133181 434913 465 -179276 121006 -266141 184388 -18377 88543 -176020 30715
11874 -287983 -160828 -13240 140252 -243569 -62409 -173091 7351 -105350 -219043 126202
11863 -51418 -260483 -79423 -86698 59223 -420016 -153731 85856 110915 -129014 -62233 -175350
11852 -175350 18474 52779 -68972 -23159 -121181 39016 1523 78418 -299233 -140174 378342
11840 -122495 -22211 176375 251072 216493 -40972 -220537 205180 -84921 -101486 19205 47122
11829 47122 -162906 7878 -115579 217547 100224 114952 72729 79942 82794 112033 -113878
11817 29957 -382984 -12712 49828 101241 -185032 6210 24210 246652 -150548 2981 -231665
11805 255808 -102570 -425530 -116298 -217650 67300 9053 77409 132174 148962 -198012 236138
$$ packed form
11886H1050a33181D34913D65a79276A21006b66141A84388a8377H8543a76020C0715
11874b87983J27155a3240A40252b43569f2409j10682G351a05350j13693A26202
11863e1418k09065g9423p275E9223d20016a53731H5856K5059a29014f2233j13117
11852a75350A8474L4305f8972b3159r8022C9016A523P6895b99233a40174C78342
11840a22495b2211A76375P4697l4579d0972j79565B05180h4921j6565A9205K7917
11829D7122a62906G878a15579B17547A00224J4728m2223P213K852K9239a13878
11817B9957c82984a2712D9828N1413a85032F210J8000K22442a50548B981b31665
11805B55808a02570l22960a16298j01352F7300I053O8356N4765J6788a98012B36138
$$ plain form
11793 -94617 -107220 116768 265740 -98826 15141 52926 63865 -382603 -114051 -48476 -165395
11782 -165395 112601 375418 343120 -125810 238917 -58197 -145407 -216861 -197341 86516 -138055
11770 -51705 46316 301091 -11009 146268 -80892 13935 8641 -87730 -7702 -47972 181225
11758 -145680 -183202 -259636 -21590 78586 -187787 10774 -46214 153634 226620 -96589 155557
11746 -36562 -69884 -71417 120559 -224259 218987 -135971 -13700 -205916 -141433 -47661 -85026
11735 -85026 -12331 -81838 -47056 -108513 -243208 -34955 -207871 290001 -144801 206450 -161954
11723 -137775 95638 168173 -67617 -38233 -57024 -189779 233000 -64240 -57404 209078 -149687
11711 216804 -15898 -68724 133896 54345 106911 144699 228984 -188539 -24861 88668 -221186
$$ packed form
11793i4617j2603A16768J48972i8826A5141L7785J0939c82603a14051d8476j16919
11782a65395A12601K62817l2298a25810B38917e8197q7210p1454J9520H6516a38055
11770e1705D6316K54775a1009A46268h0892A3935n294h7730g702m0270A81225
11758a45680l7522p6434b1590G8586a87787A0774d6214A53634P2986i6589A55557
11746c6562l3322j533A20559b24259B18987a35971a3700j92216O4483d7661l7365
11735h5026a2331o9507L4782o1457j34695c4955j72916B90001a44801B06450a61954
11723a37775I5638P2535f7617K9384j8791j32755B33000f4240O836B09078a49687
11711B16804a5898n2826A33896E4345N2566L7788Q4285a88539b4861H8668b21186
$$ plain form
11699 -145175 8373 -142442 254184 345352 -208753 269127 216251 130813 -68772 -215879 120061
11687 -278003 54166 -68997 44216 279012 280986 153667 -243067 298353 11658 -227395 14812
11675 128245 207284 -228127 50100 -72440 121480 -73683 -94947 -172990 -55110 333350 -39571
11663 -296486 -143654 -199421 -119109 -254742 77670 -215669 31559 98661 -187829 163549
11652 -162186 72361 -109529 -178858 -7327 -132099 -312924 73458 42353 83505 258050 82604
11640 81245 75217 -153582 -220683 -274008 75790 -2125 25220 -295687 -227210 237954 -136912
11628 -41256 -13667 156852 -24553 -32925 409576 39889 -80494 89317 156024 212487 -102901
11616 239565 27636 -120202 -282356 -87531 85057 14036 -226076 -39591 -148295 -121674 78901
$$ packed form
11699a45175H373a42442B54184R1168b08753B69127n2876q5438f8772j47107A20061
11687b78003E4166f8997D4216K34796J974j27319b43067B98353A1658b27395A4812
11675A28245P9039b28127E0100g2440A21480g3683k1264p8043e5110C33350c9571
11663b96486a43654n5767Q0312j35633G7670b15669C1559O7102a87829A63549
11652a62186G2361a09529o9329g327j24772j80825G3458l1105M1152J74545H2604
11640H1245o028a53582o7101n3325G5790b125B5220b95687O8477B37954a36912
11628d1256a3667A56852b4553q372D09576C9889h0494H9317O6707N6463a02901
11616B39565B7636a20202j62154h7531H5057A4036b26076c9591j08704K6621G8901
$$ plain form
11604 109296 -216403 14726 -20264 -154344 73923 -138767 -186796 -118640 -99977 96407 36181
11592 49289 276696 -115016 -50270 79950 36349 24080 156789 264694 199013 202429 -94514
11580 161366 300094 -171400 -42690 5057 -251083 -51356 142131 -107187 95955 -57906 -59614
11569 -59614 304301 -110219 99031 191414 -200475 154563 51154 -191855 -181626 -83591 -299766
11558 -299766 186132 -241925 -115954 -164645 78716 -189452 -55879 83340 -71013 110320
11547 76002 -84518 240752 233534 261844 -23261 78334 120151 113001 273585 -164064 29840
11535 162021 -4505 106455 130657 -41754 -145103 -22968 -104578 -176520 146637 268481 -35318
11523 81906 41995 -70667 6035 128125 -92912 -239624 53588 227833 67755 338441 23836
$$ packed form
11604A09296b16403A4726b0264j34080G3923a38767m8029O8156J8663I6407C6181
11592D9289K27407a15016e0270G9950C6349j2269J32709J07905o5681L416i4514
11580A61366J38728a71400d2690E057b51083e1356A42131a07187I5955e7906j708
11569e9614C04301a10219I9031R2383b00475A54563E1154a91855J0229h3591k16175
11558b99766A86132b41925a15954m8691G8716a89452e5879H3340g1013A10320
11547G6002h4518B40752p218K8310b3261G8334M1817p150J60584a64064B9840
11535A62021d505A06455K4202d1754j03349b2968q1610p1942A46637J21844c5318
11523H1906l9911g0667F035J22090i2912j46712E3588J74245F7755K70686B3836
$$ plain form
11511 205535 123158 403267 59735 252936 149968 -15798 344452 -190500 -62035 -88309
11501 -88309 395509 33811 347414 -79907 266584 209685 128783 -96985 356411 182874 -75141
11489 382825 -203161 73844 82397 45970 -136734 -153070 3581 -207793 -83548 2596 -77704
11477 211722 145373 -143680 83160 263102 -50053 94537 163319 232220 104436 -64726 -74203
11466 -74203 -39547 74187 334308 -19821 -156194 76429 -54445 236325 -74233 -106223 -29502
11454 255547 56629 172810 338117 -120388 108509 154759 -183798 -236189 161357 -31914
11443 270674 32662 -56826 -22650 -181431 200358 -2948 220614 -112078 77150 36068 -213972
11431 -81051 -220449 -51822 -197424 161502 556021 56330 -97491 52284 -69353 115326 50141
$$ packed form
11511B05535q2377K80109E9735J93201j02968a5798C44452a90500f2035k6274
11501h8309C95509C3811L13603g9907B66584n6899q0902i6985C56411j73537g5141
11489C82825b03161G3844Q553l6427a36734j6336C581b07793h3548B596g7704
11477B11722o6349a43680H3160J79942e0053I4537O8782O8901A04436f4726r477
11466g4203L4656G4187K60121a9821j36373G6429e4445B36325g4233l1990b9502
11454B55547E6629J16181J65307a20388A08509M6250a83798n2391A61357c1914
11443B70674C2662e6826b2650j58781B00358b948B20614a12078G7150C6068b13972
11431h1051j39398e1822j45602A61502L94519E6330i7491E2284f9353A15326E0141
$$ plain form
11419 -135273 -242680 43573 133960 212580 260913 -144636 213420 13073 39020 47008 122281
11408 122281 -213381 -201569 -212086 -48791 -86677 147843 -148357 -25752 62915 -97137 187064
11396 -22623 -48773 -118417 -41069 -214434 -30376 161359 91251 -150541 16823 97648 -268517
11384 -137352 -54077 26997 -203917 -67837 169618 -95505 193786 -24946 -80024 -145072 -263535
11373 -263535 -171714 -224094 49322 -217368 -61739 -22025 21288 277268 -341023 -6942 -112583
11362 -112583 -37787 86260 293319 -105077 16408 -249377 74083 -225857 6311 -78217 -121704
11351 -121704 -15990 254451 -62585 -284086 73099 -230794 135021 -92759 -79562 -127951 44552
11339 -20235 209433 256249 -163066 75833 -285147 -145111 20450 82337 -168424 -144278 11462
$$ packed form
11419a35273j07407D3573R0387P8620M8333a44636B13420A3073K5947P988P5273
11408A22281b13381J1812j0517d8791l7886A47843a48357b5752F2915i7137A87064
11396b2623k6150o9644d1069j73365c0376A61359p0108a50541A6823Q0825b68517
11384a37352e4077B6997b03917f7837A69618i5505A93786b4946n5078o5048j18463
11373b63535R1821n2380D9322b17368f1739b2025B1288K55980c41023f942j05641
11362a12583c7787H6260K07059a05077A6408b49377G4083b25857F311g8217m3487
11351a21704a5990B54451f2585k21501G3099b30794A35021i2759J3197m8389D4552
11339b0235B09433M6816a63066G5833b85147J40036B0450O1887a68424K4146A1462
$$ plain form
11327 -383217 82611 10262 -85972 79176 -247296 -238619 100006 -104363 -137548 162053 -234496
11315 63388 103141 -186269 367108 129312 -184876 130790 218760 -297453 -40122 -109499
11305 -109499 -32120 -94040 -21335 -300985 -299796 197900 -61183 -206338 -422605 196955 -182686
11293 -211578 91426 -145459 -221713 62335 54728 -59849 -138991 285286 245980 -38444 -148434
11282 -148434 85863 -149055 171565 112359 -53031 -208292 -112166 -346599 -80759 -183257
11272 -183257 -239597 -213659 -173529 370386 3319 77572 149961 116780 -142712 15646 -120064
11260 23404 -184928 24638 -167554 -213330 26360 19423 -129562 -70793 -61425 -69672 60371 129227
11248 129227 106231 82518 -358179 -408152 -57707 -147943 -13779 245976 -142290 119641 126723
$$ packed form
11327c83217H2611A0262h5972G9176b47296Q677A00006a04363l3185A62053b34496
11315F3388L9753a86269C67108A29312a84876A30790Q7970b97453d0122o9377
11305a09499c2120o1920b1335k79650J189A97900f1183j45155k16267A96955a82686
11293b11578I1426a45459p6254F2335p607e9849p9142B85286l9306c8444j09990
11282a48434H5863a49055A71565n9206e3031j55261R6126k34433h0759j02498
11272a83257n6340K5938M0130C70386C319P4253P2389l3181a42712A5646a20064
11260B3404a84928B4638a67554m5776B6360o937a29562N8769R368q247F0371O8856
11248A29227k2996k3713c58179m9973e7707r0236a3779B45976a42290A19641P082
$$ plain form
11237 126723 177078 -96896 -106005 -119866 -186555 -210177 -57056 133527 255028 192378 -53817
11225 -404039 21774 220752 196615 -82135 18058 62932 -203409 -153727 -34466 -72000 -99201
11214 -99201 35159 -63962 -140091 8881 -79064 89056 24289 -108126 -147767 -249490 323823
11202 -27971 -196844 -110131 177818 -410187 49533 -161010 -207425 -40445 -26734 218699 -90723
11190 221229 -12445 29715 -251712 -30828 -87127 176065 -22680 -142729 -380118 -282103 39594
11178 28938 124866 99649 -96547 -251179 -238432 -118658 -214341 -41838 -218201 -93317 -223099
11167 -223099 -214176 -296761 -77449 -140237 185704 184367 -168028 265 254938 -56404 -15014 -76437
11155 -76437 -240310 49757 -294630 -101802 -51034 194123 -42794 -153189 207902 25701
$$ packed form
11237A26723N0355i6896r109j3861o6689k3622e7056A33527J21501o2650e3817
11225d04039B1774J98978k4137h2135A8058M4874b03409M9682c4466l7534k7201
11214i9201C5159f3962p6129H881g9064H9056B4289a08126l9641j01723C23823
11202b7971j68873Q6713A77818d10187D9533a61010m6415d0445J3711B18699i0723
11190B21229a2445B9715b51712c0828n6299A76065b2680j20049k37389R8015C9594
11178B8938R5928k5217i6547j54632J2747a18658r5683d1838j76363i3317j29782
11167b23099Q923q2585g7449o2788A85704j337a68028B65K54673e6404a5014o1423
11155g6437j63873D9757b94630a01802N0768A94123d2794j10395B07902B5701
$$ plain form
11144 -100584 79203 -4809 190348 139362 292724 -288013 52368 -68697 -142705 2090 319185
11133 319185 -243668 228665 -131101 -217085 116250 -103581 14978 230619 93228 160290
11123 160290 -49778 250070 -133510 -113421 36175 -144198 253956 81258 433586 89355
11112 48961 232273 -192228 -574 58952 -240216 17170 -216442 124504 -108209 -76941 169915
11100 -147619 1949 2465 158937 172055 -261746 295819 148246 10200 -25390 283536 104169
11088 359708 414856 20124 175146 -66561 -73467 90178 -11790 33162 154186 -140921 77597
11076 207985 132459 -10590 166100 235398 379567 312319 61465 121717 352032 283132 294249
11065 294249 233744 198094 445264 -87751 278519 -54406 312834 309696 108549 309687 502499
$$ packed form
11144a00584G9203d809A90348n0986J53362b88013E2368f8697p4008B090L17095
11133C19185b43668B28665a31101q5984A16250a03581A4978K15641I3228O7062
11123A60290d9778B50070a33510K0089C6175a44198B53956H1258L52328H9355
11112D8961J83312a92228e74E8952b40216A7170b16442A24504a08209L1268A69915
11100a47619A949N16J56472J3118b61746B95819j47573A0200b5390B83536A04169
11088C59708N5148B0124J55022f6561o906I0178a1790C3162J21024a40921G7597
11076B07985p5526a0590A66100O9298J44169o7248F1465O0252K30315o8900J1117
11065B94249o0505l5650K47170h7751B78519e4406C12834l138A08549K01138J92812
$$ plain form
11054 502499 361339 511954 196062 454128 295934 96996 654953 653496 547655 646998
11044 646998 135259 569349 398429 208143 472199 515098 424338 361287 398790 578744
11034 578744 236221 129118 533077 434139 335592 343716 482421 -7398 324484 124506 545465
11023 545465 412224 402723 271620 243095 463141 364071 313355 379666 402411 492216 599208
11012 599208 222750 633284 368182 338661 507585 343020 491951 395725 307150 379554
11002 379554 432631 385109 253642 276327 346613 388274 426756 175744 227614 508690 127304
10990 142034 362815 668718 227400 271172 383750 606613 831742 386912 415285 575415
10980 575415 1026996 576783 808846 1101812 812533 1092510 1602910 1126878 1853559 1302506
$$ packed form
11054E02499j41160J50615A96062K58066j58194I6996N57957j457j05841R9343
11044F46998A35259M34090j70920j90286K64056M2899r0760o3051L7503J79954
11034E78744B36221j07103M03959r8938r8547Q124J38705g398C24484A24506M20959
11023E45465j33241r501j31103k8525K20046r9070n0716O6311K2745Q9805J06992
11012E99208B22750M10534k65102k9521J68924j64565J48931r6226q8575P2404
11002C79554N3077m7522j31467K2685P0286M1661L8482A75744N1870K81076A27304
10990A42034K20781L05903B27400M3772J12578K22863K25129C86912K8373J60130
10980E75415M51581m50213K32063K92966k89279K79977N10400m76032P26681n51053
$$ plain form
10970 1302506 1641516 1345602 1203229 1524391 983259 1148083 869927 739018 1154254
10961 1154254 1037301 793817 1123327 1139795 1256148 977205 1062684 885032 748038 672909
10951 672909 457227 652226 285654 253072 431373 145805 451705 311015 233763 175033
10941 175033 -71081 -39124 190923 104172 141441 -123844 84817 231961 -213226 140249
10930 -213601 -161648 42535 -118144 -261243 157354 -40367 -152516 -49035 111484 -131678
10919 -187833 -204497 294115 -126651 -91582 -106336 -263144 -68011 -145115 -129603 -157851 141573
10907 304122 -5634 43724 153324 -135776 36906 171335 -103378 43965 22726 182341 -107278
10895 -110879 -195851 -130096 77827 -21357 -172907 -156253 -237516 88834 -137601 137592 -208327
$$ packed form
10970A302506L39010k95914j42373L21162n41132J64824k78156j30909M15236
10961A154254j16953k43484L29510J6468J16353k78943Q5479j77652j36994p5129
10951F72909k15682J94999B85654l2582J78301A45805L05900j40690p7252n8730
10941A75033g1081L1957A90923q6751L7269a23844H4817J47144b13226A40249
10930b13601N1953D2535a18144j43099A57354d0367j12149d9035A11484a31678
10919a87833j6664B94115a26651L5069j4754j56808f8011p7104J5512k8248A41573
10907C04122e634D3724J09600a35776C6906J34429a03378D3965k1239J59615a07278
10895a10879q4972O5755G7827b1357j51550J6654q1263H8834a37601A37592b08327
$$ plain form
10883 84107 -19933 86382 -17885 -155386 -124103 -303564 357163 -295290 6561 -113418 163803
10871 -83753 -266689 -86269 -115832 283262 -192503 68877 -160976 -59653 -352623 44082 -48667
10859 -187685 -1457 -192142 187399 88330 176054 -84351 132668 75975 144252 145031 -243254
10847 90064 -309541 105444 281722 -2668 25468 -143374 170247 219824 -84501 -258610 -14125
10835 -271101 47958 -132845 -363152 4425 -411865 -94769 -204170 137502 -149840 -68793
10824 -84069 169373 -143270 7487 -148688 -79872 -210060 146921 -145877 149536 -34036
10813 -25793 72844 -43607 -108668 104447 5549 -196380 -185572 -233979 -114621 -263713 138133
10801 -175367 -319690 46919 -98722 -147204 116668 -386057 169925 -183036 -136996 -155100
$$ packed form
10883H4107a9933H6382a7885j37501L1283j79461C57163b95290F561a13418A63803
10871h3753j82936h6269k9563B83262a92503F8877a60976e9653k92970D4082d8667
10859a87685a457j90685A87399H8330Q7724h4351A32668n6693O8277P79b43254
10847I0064c09541A05444J76278b668B5468a43374A70247M9577h4501j74109a4125
10835b71101D7958a32845k30307D425d11865i4769j09401A37502a49840f8793
10824h4069A69373a43270G487a48688O8816j30188A46921a45877A49536c4036
10813b5793G2844d3607o5061A04447E549a96380J0808m8407a14621j49092A38133
10801a75367j44323D6919i8722m8482A16668c86057A69925a83036M6040j8104
$$ plain form
10791 -155100 -223749 -184935 196541 -211264 298211 -280230 -86196 338647 -111279 8253
10780 -129664 -147155 -52723 -43544 -164594 -321005 -300869 -57851 45381 44615 -200819 394176
10768 117529 -222256 -60633 193808 -41241 -212060 -79541 -160852 -175810 190277 -98819 -23257
10756 -41860 -350996 -136674 331019 -176605 -127831 21222 -246260 -66918 77904 84231 -254
10744 77043 110587 -305920 51898 -394269 -228221 -156926 -157037 -36150 -88957 83393 -179403
10732 56166 -43308 151719 15235 -52453 61931 82941 55468 -26668 -326895 118209 164866
10721 164866 -483380 -191435 -32340 -52975 -88155 -1306 245519 -62907 -403667 197308 -146034
10709 136448 151531 129719 -531861 -139291 259059 -155989 -221312 77963 -42395 -153404
$$ packed form
10791a55100o8649L8814A96541b11264B98211b80230h6196C38647a11279H253
10780a29664j7491e2723R179j21050j56411K0136e7851D5381p66b00819C94176
10768A17529b22256f0633A93808d1241j70819g9541q1311j4958A90277i8819b3257
10756d1860l09136a36674C31019a76605M8774B1222b46260f6918G7904O327b54
10744G7043L3544c05920E1898c94269J66048P1295j11c6150n2807H3393a79403
10732E6166d3308A51719A5235e2453F1931K1010k7473b6668l00227A18209M6657
10721A64866d83380a91435c2340k0635l5180a306B45519f2907l40760A97308a46034
10709A36448J5083k1812e31861a39291B59059a55989o5323G7963d2395j11009
$$ plain form
10699 -153404 -25959 -54929 -57166 -222638 41067 10753 177178 149651 20865 -175757 -45709
10687 145846 -502703 46046 -78556 3894 -382023 -8250 -207829 126932 -51646 -75827 -7813
10675 90456 35133 -134633 -239061 200765 -113465 -105339 -153451 25353 -107683 106894 97258
10664 97258 153956 -113002 -169531 -159429 -87222 -154281 233910 -22231 100784 -22555 -177831
10653 -177831 -104663 -15541 211857 -186903 -264064 73233 -179067 71682 -127958 116400
10642 312221 48067 -255781 246303 176538 -349269 -169578 -126121 -1637 -4633 20426 -169000
10630 -201082 -14772 294228 -126052 -54444 -276480 -59907 -128827 41532 124519 -65167 10621
10618 -325834 50632 -196021 25587 -234437 5376 -116586 -171330 -127325 -4100 -91813 -27069
$$ packed form
10699a53404b5959k8970k237j65472D1067A0753J66425k7527B0865a75757d5709
10687A45846e02703D6046g8556C894c82023h250j99579A26932e1646k4181g813
10675I0456C5133a34633j04428B00765a13465Q126m8112B5353a07683A06894r636
10664I7258N6698a13002n6529J0102P2207o7059B33910b2231A00784b2555j55276
10653a77831P3168a5541B11857a86903p7161G3233a79067G1682a27958A16400
10642C12221D8067b55781B46303o9765c49269a69578M3457a637k996B0426a69000
10630b01082a4772B94228a26052e4444k22036e9907o8920D1532Q2987f5167A0621
10618c25834E0632a96021B5587b34437E376a16586n4744M4005d100q7713b7069
$$ plain form
10606 -102579 53628 119873 84160 -51415 -88228 99619 34889 125944 -260876 121139 -178174
10594 175423 229213 -103877 -202362 184181 71557 25080 -98151 -62370 -117240 -33304 67311
10582 67512 57190 266156 -330030 -156414 70044 -286832 -5982 -35028 -88586 -214695 -53349
10570 -44933 34588 -12933 -80696 -177443 11786 23019 -39101 -295466 113643 35793 -214867
10558 -163269 -47847 -91750 -22303 339122 -47943 51210 -143516 38654 55124 6419 -254744
10546 13445 89024 1343 10287 230353 32649 35312 92081 -6641 -83863 44873 86498 -48851
10533 -179571 61880 -119018 -235369 -21314 -74757 -14605 -43480 216164 420810 75926 49000
10522 49000 9458 28826 114008 210392 -165589 -370663 3385 17609 15356 58885 -103316 -43931
$$ packed form
10606a02579E3628O6245l5713e1415l6813I9619C4889R1055b60876A21139a78174
10594A75423N3790a03877r8485A84181G1557B5080i8151L5781n4870c3304F7311
10582F7512j0322K08966c30030a56414G0044b86832e982k9046n3558j26109e3349
10570d4933C4588a2933o7763r6747A1786J1233c9101k56365A13643C5793b14867
10558a63269d7847m3903b2303C39122d7943E1210a43516C8654J6470F419b54744
10546A3445P5579A343Q944K20066C2649K663N6769f641p7222D4873M1625d8851
10533a79571F1880a19018j16351b1314n3443a4605k8875B16164K04646G5926k6926
10522D9000I458J9368Q5182R6384a65589k05074C385J4224k253M3529a03316d3931
$$ plain form
10509 -119842 54636 19445 -64664 4266 14555 -65212 -300389 118596 -236964 86914 -47115
10497 -46597 432 -336937 167544 -170277 228508 -369166 -48240 102083 -209722 208079
10486 128497 247555 -196774 2116 155913 266803 200244 330293 83381 74795 46487 31408
10475 31408 -149762 248843 -51100 -191102 -14960 -36771 459903 -158924 46977 217931
10465 217931 182093 166721 -102801 -3137 -75117 -247425 167529 -65892 -136424 -19592 147338
10453 -292017 -145843 169583 86953 -160232 -233406 309136 -15005 93656 -80295 247742
10442 -290048 -49593 121003 -350143 -333866 318048 -61553 -93195 -47417 -232206 205527
10431 -242596 -315860 -120246 -45353 -141565 -226499 -178825 135082 108711 -159546 -81661 -6866
$$ packed form
10509a19842E4636A9445f4664D266J0289f5212k35177A18596b36964H6914d7115
10497d6597D32c36937A67544a70277B28508c69166d8240A02083b09722B08079
10486A28497J19058a96774B116J53797J10890o6559J30049H3381q586k8308j5079
10475C1408a49762B48843e1100j40002a4960k1811D59903a58924D6977J70954
10465B17931l5838j5372a02801c137p1980j72308A67529f5892p0532a9592A47338
10453b92017a45843A69583q2630a60232p3174C09136a5005I3656h0295B47742
10442b90048d9593A21003c50143J6277C18048f1553l1642M5778j84789B05527
10431b42596p3264a20246d5353r6212q4934M7674A35082k6371a59546P7885f866
$$ plain form
10419 -36440 -199713 -109553 -36959 -409299 -205199 -94471 180601 76380 239000 -197738
10408 -353648 134473 -217668 95589 145323 -82255 9492 75947 133209 -228955 65156 67372
10397 67372 -190809 -200262 -103015 -179792 -60987 82370 18482 167772 70224 -75639 254553
10385 -113282 350344 152624 -7263 -38777 158748 231420 72304 256865 282427 107178 -30325
10373 207579 55786 425015 145273 291661 120600 -258496 124109 527757 165288 212166
10363 212166 87197 115724 171084 -126498 40382 129565 134016 431225 211131 198901 -292264
10351 147855 436879 280163 70024 107513 12529 86216 161532 235134 223249 262381 93852
10339 38484 278911 165036 172715 -210442 -135682 -5465 -365254 194948 157552 231730 362499
$$ packed form
10419c6440j63273R0160c6959l72340K04100i4471A80601G6380J62620a97738
10408c53648A34473b17668I5589M9734h2255I492O6455N7262b28955F5156K216
10397F7372a90809r453R7247p6777f0987H2370A8482J49290G0224g5639B54553
10385a13282C50344A52624g263l1514A58748P2672G2304J84561K5562A07178c0325
10373B07579E5786L69229A45273J46388A20600b58496A24109M03648A65288M6878
10363B12166H7197K8527N5360a26498D0382Q9183M451K97209B11131j2230b92264
10351A47855K89024j56716G0024L7489A2529P3687P5316P3602j1885L9132I3852
10339C8484K40427j13875P679b10442P4760e465l59789A94948l7396P4178J30769
$$ plain form
10328 362499 -208279 90207 -156361 -233418 -63699 245954 4549 33621 -66635 -126592 -235617
10317 -235617 -4185 71481 -201383 251637 143237 -168046 -309824 155386 -57017 45514
10306 -319903 -248404 -112859 157069 -373746 192837 207395 141671 227060 92235 -144555
10295 236601 375374 95907 330257 -146730 -132731 -245703 -60334 388091 -793 -90748 -219114
10284 -219114 -79749 -252418 -113817 38603 -140301 -125319 37652 -48406 62430 -211455 59661
10272 -164305 -69941 50981 -15418 -50159 -11441 -147477 -49254 45082 -27494 324080 89890
10260 89941 77937 -88945 255727 239890 126020 -38768 -100550 -24516 -74473 146767 1707
10248 10550 -9342 125939 -232567 -36970 -37594 101651 -15177 -206308 28155 -324342 90487
$$ packed form
10328C62499b08279I0207a56361p7057f3699B45954D549K9072f6635n9957j09025
10317b35617d185G1481b01383B51637j08400a68046j41778A55386e7017D5514
10306c19903P1499a12859A57069c73746A92837J4558o5724Q5389I2235a44555
10295B36601J38773I5907K34350a46730J3999j12972f0334C88091g93q9955j28366
10284b19114g9749j72669a13817C8603a40301J4982C7652d8406F2430b11455E9661
10272a64305f9941E0981a5418l4741a1441j36036d9254D5082b7494C24080H9890
10260H9941j2004h8945B55727j5837j13870c8768o1782b4516m9957A46767A707
10248A0550i342A25939b32567c6970o24A01651a5177j91131B8155c24342I0487
$$ plain form
10236 -84428 -97394 134156 188939 -80181 -128158 -167283 -38954 -70591 -89041 -57976 -106239
10225 -106239 110161 65965 -309926 -97497 24838 -1911 -165980 408945 157066 -93233 -138006
10214 -138006 -27125 -112978 -21272 107425 -25045 -55661 114846 -83743 108879 50456 114365
10203 114365 223089 -267977 -15258 -58182 52636 69281 -172752 262713 283784 -371433
10192 -343662 -38365 -28055 19904 -229385 31716 207466 -121423 86081 329340 197326
10182 197326 -16052 -160500 149924 -126306 -64221 32718 -141197 -369567 -181932 209888
10171 -186829 -195714 -124830 -68478 64072 -30713 -230006 215386 -172313 93206 171999 214699
10160 214699 -130015 -11718 -148571 10828 -218686 -40513 -210780 -57228 26862 -134412
$$ packed form
10236h4428j2966A34156N4783h0181m7977l9125c8954l1637j8450L1065m8263
10225a06239A10161m4196c09926i7497B4838a911j64069D08945A57066i3233m4773
10214a38006b7125q5853b1272A07425b5045l0616A14846h3743A08879E0456O3909
10203A14365J08724b67977a5258m2924E2636J6645a72752B62713K1071c71433
10192c43662c8365J0310A9904b29385C1716J75750a21423H6081K43259j32014
10182A97326a6052j44448A49924a26306O2085C2718a41197k28370a81932B09888
10171a86829q885P0884N6352F4072c0713j99293B15386a72313I3206P8793M2700
10160B14699a30015a1718j36853A0828b18686d0513j70267e7228B6862a34412
$$ plain form
10149 100598 24346 -185800 -147580 -56865 -1023 -102255 82026 -286634 94123 250863 285508
10138 285508 -86254 -233106 -206865 -6637 -94092 -200769 -99369 164159 140706 95574 74011
10127 74011 -88542 -45626 96097 -64311 33635 215717 -60420 -307131 127710 -309403 -254145
10116 -254145 241 -326721 108348 -237386 61858 -157035 116043 -274780 -110611 -121271
10106 -121271 -36200 290557 -159018 49214 35345 -242154 83266 -282374 -78818 270626
10095 247601 -178163 241151 25848 -129713 140856 -101529 -252402 -100839 170771 -253093
10084 -20939 -103761 -29101 -139560 129721 -184832 -71483 -293245 -262542 -108561 -283524
10074 -283524 -36548 -163863 73416 -100914 207611 237811 -46312 -17293 -529354 -117538
$$ packed form
10149A00598B4346a85800L8220e6865a023j01232H2026b86634I4123J56740L4645
10138B85508h6254j46852K6241f637q7455j06677i9369A64159k3453m5132k1563
10127G4011h8542M2916I6097f4311C3635J82082f0420k46711A27710c09403N5258
10116b54145B41c26721A08348b37386F1858a57035A16043b74780a10611j0660
10106a21271c6200B90557a59018D9214j3869b42154H3266b82374g8818B70626
10095B47601a78163B41151B5848a29713A40856a01529j50873a00839A70771b53093
10084b0939q2822b9101j10459A29721a84832g1483k21762L0703a08561j74963
10074b83524c6548j27315G3416a00914B07611L0200d6312a7293n12061a17538
$$ plain form
10063 -59701 -479196 -30079 181101 64600 -172589 -190158 -62182 25509 153442 1697 -294209
10051 105840 -83285 136935 -184133 -170470 -97392 -162294 -507060 250672 -305616 66567
10040 -1747 -57324 16275 -301546 63129 -73541 -321557 472869 -276535 331791 178897 -271901
10028 -317157 58125 -15932 76364 88101 -86696 -187530 -246719 -281285 -238375 -112744 -119163
10017 -119163 -147796 -19228 -17771 42676 -156346 -53820 26983 307278 -125317 352284 165796
10005 -43622 -110285 -84244 -24209 -32719 186164 -54406 -106122 -893 -137860 -163548 -34163 134681
9992 189029 37123 105612 7153 -241178 -18407 63579 342745 -225824 3683 123366 -90823
9980 -153827 229396 -136860 -57283 401345 -19967 -284305 -179641 39882 35240 -137105 -96711
$$ packed form
10063e9701m19495c0079A81101F4600a72589j7569f2182B5509J27933A697b94209
10051A05840h3285A36935a84133J3663P3078o4902l44766B50672c05616F6567
10040a747n5577A6275c01546F3129g3541k48016D72869b76535C31791j52894b71901
10028c17157E8125a5932G6364J1737h6696j00834n9189l4566M2910a12744o419
10017a19163k8633a9228J457D2676a56346e3820B6983K80295a25317C52284A65796
10005d3622o6663K6041b4209q510A86164e4406n1716h93j36967k5688c4163A34681
9992A89029C7123O8489G153b41178a8407F3579K79166b25824C683J19683i0823
9980a53827B29396a36860e7283D01345a9967k64338J04664C9882m642a37105M0394
$$ plain form
9969 -96711 -116747 -25304 141756 -198729 -230669 54799 -68507 -206506 244220 -306244 -9899
9957 -114500 7633 129283 -156708 -180776 -246247 -208175 102393 195527 -41410 274215 -76944
9945 70045 71542 153947 239926 319641 84165 -4906 -239628 -9867 -81275 -96716 -155807 -154945 170919
9931 -181673 172418 62118 -324758 -93881 -6105 55825 -298793 118098 250377 -132444 -206401
9920 -206401 -155334 74541 -34184 -365891 6931 215416 -439945 -38027 -14527 202662 10433
9908 -51944 130224 -307015 128254 -151147 -133773 189671 -399673 120330 21812 -149534
9897 -143205 397961 -233998 87545 -128593 -373949 203294 6396 -93521 178916 108029 49353
9885 59057 -119948 233757 10296 128488 -312480 -24335 121940 91281 114710 118478 -179197
$$ packed form
9969i6711k0036b5304A41756a98729l1940E4799f8507j37999B44220c06244i899
9957a14500G633J21650a56708k4068o5471L8072A02393R3134d1410B74215g6944
9945G0045J497Q2405Q5979P9715H4165d906k34722i867p1408j5441n9091Q62A70919
9931a81673A72418F2118c24758i3881f105E5825b98793A18098J32279a32444p3957
9920b06401N1067G4541c4184l31707F931K08485d39945c8027a4527B02662A0433
9908e1944A30224c07015A28254a51147J7374A89671c99673A20330B1812a49534
9897a43205C97961b33998H7545a28593k45356B03294F396i3521A78916p0887D9353
9885E9057a19948B33757A0296J18192c12480b4335A21940l0659K3429L768a79197
$$ plain form
9873 -326325 25119 312495 -190744 3701 -121400 -31566 -150999 -63741 -67750 -11280 -499553
9862 -499553 85159 -342678 -19143 -425039 1919 114551 -115793 -1198 -81247 116905 -49179
9850 -1058 -120932 -90524 57864 -224235 118341 -31943 -467606 -213913 -148877 -92202 -247646
9839 -247646 107921 2907 107314 61342 -173070 299409 55421 -73533 -80305 -254620 244754
9827 -202457 -215795 -168926 26127 79208 -134091 44834 11057 -56173 -30189 328032 -153871
9815 165597 -132815 237474 161061 75767 -201356 87031 216943 88157 -27897 -20010 53795
9803 194586 -163615 -308085 -137018 323289 51210 125396 -188393 -216937 -378283 -23350
9792 189873 101946 -37144 -2505 2206 -46176 50085 -142629 -178648 147164 51400 -74975 63820
$$ packed form
9873c26325B5119K87376a90744C701a21400c1566j19433f3741m009a1280m88273
9862d99553H5159c42678a9143m05896A919J12632a15793a198q0049A16905d9179
9850a058j19874L0408E7864b24235A18341c1943m35663b13913O5036N6675j55444
9839b47646A07921B907J04407m5972a73070B99409E5421g3533o772j74315B44754
9827b02457j3338M6869B6127N3081a34091D4834A1057e6173K5984C28032a53871
9815A65597a32815B37474p6413G5767b01356H7031J29912H8157b7897P887E3795
9803A94586a63615j44470a37018C23289E1210P4186a88393k8544j61346b3350
9792A89873q7927c7144b505B206d6176E0085a42629l6019A47164E1400g4975F3820
$$ plain form
9779 300446 -15577 -136167 225055 48353 -18697 -15220 -200755 52540 316896 -336255 116533
9767 -17476 -196913 -51224 -51500 -233672 -99398 154154 -344482 173514 118098 -8002 -351030
9756 -351030 73717 -47757 -73918 -440280 307517 -305570 144986 -24192 -325866 -29224 43639
9744 170910 -184927 91415 -237109 -121471 -60783 65144 -106464 25982 -72800 -63332 -215238
9733 -215238 132909 155357 191298 -234524 -187778 176556 235660 -115961 170250 60174 6610
9721 -271396 -163615 -204840 60636 -188667 -87842 -280961 -193040 -125742 -213650 -349446 -93466
9709 -256378 -87405 -114146 56199 -378822 147861 -161451 -66844 -69905 -66732 150084 -92923
9697 -190111 -350939 -37706 -101279 263789 -191264 -118574 -285941 -2199 -299816 -183956 -103219
$$ packed form
9779C00446a5577j20590B25055D8353a8697L477j85535E2540K64356c36255A16533
9767a7476j79437e1224k76j82172i9398A54154c44482A73514n5416h002l43028
9756c51030G3717d7757k6161l66362C07517c05570A44986b4192l01674b9224D3639
9744A70910a84927I1415b37109J15638O0688F5144a06464B5982g2800R468j51906
9733b15238A32909K2448L5941b34524M6746A76556N9104a15961A70250F0174F610
9721b71396J07781m1225F0636a88667h7842j93119Q7921O7298q7908j35796i3466
9709b56378h7405k6741E6199c78822A47861a61451f6844l061L173A50084i2923
9697a90111j60828c7706o3573B63789a91264P2690j67367b199k97617J15860Q0737
$$ plain form
9686 -103219 -194475 140786 321699 -244574 -34674 -57501 360644 -179394 121839 -346315
9675 36414 251402 71625 11298 6707 -21599 59239 -177772 -106171 -164504 -114088 -59498 -76148
9663 -76148 348152 -297457 -270526 -275943 15541 105156 179381 133162 215753 -133304 4567 -32681
9650 -76564 -105121 -312510 56769 -102083 -116979 -7959 -240128 -7508 -341634 24509 60566
9639 60566 -7931 37368 -206088 -136789 -17406 -255560 -52979 -245852 -270011 -119276 163357
9627 -230502 -267185 -58899 -129397 -113987 -151239 -160508 -4759 189519 85808 -77787 276095 -170151
9614 -31839 -165636 -12222 -121048 178853 -232728 -31648 -16441 121550 -17210 -332600 -72256
9602 339873 -74834 -110045 -132961 31696 -17447 -105494 -39093 19950 382555 71549 81348 -122656
$$ packed form
9686a03219r1256A40786J80913b44574c4674k2827C60644a79394A21839c46315
9675C6414K14988G1625A1298m591b1599E9239a77772P1601n8333N0416N4590j6650
9663g6148C48152b97457K6931n417A5541Q9615P4225m6219Q2591a33304D567c2681
9650g6564k8557k07389E6769a02083j4896g959k32169g508l34126B4509L6057
9639F0566g931C7368b06088O9299a7406k38154e2979j92873k4159a19276A63357
9627b30502l6683e8899p0498J5410l7252r269d759A89519H5808g7787B76095a70151
9614c1839j33797a2222j08826A78853b32728c1648J5207A21550a7210l15390g2256
9602C39873g4834l5211k2916C1696a7447q8047c9093A9950L62605G1549R799a22656
$$ plain form
9589 -226981 127475 93863 -67400 -364091 -1067 197624 71538 561695 -101496 40729 102092
9578 102092 280588 66259 -305511 14389 -243900 219530 372155 -170066 -95946 -313563
9568 -313563 7289 -64846 -120023 -129670 -232335 -387541 -194303 -255195 81882 -262726 205548
9556 124546 -16474 -206580 120973 -337345 -170434 24749 128984 -131931 28857 -79421
9545 107059 -49626 -148520 -175428 272066 -106777 -28128 154853 353319 444261 -199816 -168368
9534 -168368 16036 -16983 59167 19264 -232430 -454301 -212562 -186544 44565 234436 116597
9522 9290 20415 -171143 -273066 -174902 107351 155967 -173969 -38441 28585 -121143 -277636
9511 -277636 -149293 -333874 -120464 310451 268133 -96498 -146300 305598 -63668 -148044 -205498
$$ packed form
9589b26981A27475l3612f7400k96691a067A97624G1538M90157a01496D0729O1363
9578A02092J78496F6259c05511A4389b43900B19530J52625a70066P4120k17617
9568c13563G289f4846n5177r647j02665j55206J93238o0892H1882b62726B05548
9556A24546a6474j90106A20973c37345J66911B4749J04235a31931B8857g9421
9545A07059d9626r8894k6908B72066a06777b8128A54853J98466R0942a99816L1448
9534a68368A6036a6983E9167A9264b32430k21871b12562K6018D4565J89871A16597
9522I290J1125a71143j01923R8164A07351M8616a73969c8441B8585a21143j56493
9511b77636J28343j84581a20464C10451m2318i6498m9802C05598f3668q4376n7454
$$ plain form
9500 -205498 -333884 31124 -236229 135429 -352000 -193457 -1089 -268765 163224 -198391
9489 20600 -133405 -108905 138458 -252671 266059 16900 -24307 162275 -307508 170 -142653
9477 -214952 105483 62090 -96267 -154822 -259875 -239123 -44274 -246319 -251219 -24314 6864
9465 16653 129091 22093 -3245 73423 -72280 327932 -144086 132407 63929 -5367 -97999
9454 -97999 -123478 -167653 -17204 19121 107131 104718 -92179 -6004 25760 27081 3094 34560 41606
9441 41606 -171823 71998 -98926 62619 -288441 -30336 -246834 127559 -269325 -215143 -92417
9429 -177855 115341 -138645 -79194 180318 -140886 -225903 310441 -282090 -60605 241140
9418 -1186 55934 -93483 -254562 103502 -48747 143812 160159 118356 62244 -82424 -114183
$$ packed form
9500b05498j28386C1124b36229A35429c52000J58543a089k67676A63224a98391
9489B0600a33405K4500A38458b52671B66059A6900b4307A62275c07508A70a42653
9477b14952A05483m3393i6267n8555j05053K0752d4274k02045m900b4314F864
9465A6653J12438B2093c245G3423g2280C27932a44086A32407F3929e367r2632
9454i7999k5479m4175a7204A9121Q8010k413i2179f004B5760J321C094L1466P046
9441D1606a71823G1998i8926F2619b88441c0336k16498A27559b69325N4182i2417
9429a77855A15341a38645N9451A80318a40886q5017C10441b82090f0605B41140
9418a186E5934i3483j61079A03502d8747A43812J6347m1803n6112h2424l1759
$$ plain form
9407 -114183 42300 10902 -138473 54007 -157879 193735 51943 -120421 -84285 -99872 -24495
9395 84613 -160532 -90756 29313 53264 -289028 -158731 63093 -243461 -254960 -20712 -137425
9384 -137425 3938 -61241 52552 -67559 -1372 167131 67110 -25468 100882 -156851 -147556 -191658
9372 -191658 85527 -4091 142581 28629 -26491 -216038 -181127 -215305 122541 84585 -41884
9360 29258 211055 -102549 77602 -158187 1045 96772 -90998 104083 -107555 207848 -243026
9348 104424 -6695 -90671 256034 24720 210298 -288905 -94079 -68796 -139010 -73360 -100166
9337 -100166 -209306 183512 -150138 3600 59848 -110270 138008 -227363 247990 -302251
9326 -56905 181287 -13842 -15300 -417176 -179228 -128950 116248 -429692 -3827 -94470 -109371
$$ packed form
9407a14183D2300A0902a38473E4007a57879A93735E1943a20421L6136j5587b4495
9395H4613a60532O9776B9313K3951b89028J30297F3093b43461j1499b0712j16713
9384a37425C938f1241E2552f7559a372A67131F7110b5468A00882a56851R295m4102
9372a91658H5527d091A42581B8629b6491j89547L4911l4178A22541l7956d1884
9360B9258J81797a02549G7602a58187A045R5727i0998A04083a07555B07848b43026
9348A04424f695q3976B56034B4720J85578b88905i4079K5283p0214O5650k6806
9337a00166j09140A83512a50138C600N6248a10270A38008b27363B47990c02251
9326e6905A81287a3842j458m01876a79228N0278A16248d29692c827r0643j4901
$$ plain form
9315 -109371 -82578 -147327 -35158 -192620 -339558 -338348 52208 -144706 77660 31085 166820
9304 166820 35713 147781 -7301 -69021 -60015 -38459 138878 214903 -206974 -201950 -467933
9293 -467933 -365614 53525 -41687 -116261 -271858 26933 -59285 -101003 -155945 65135 -337382
9281 -34369 -307917 -59736 244277 -150986 364058 -11298 -116823 121197 134721 127841 -347381
9269 -97347 91120 172400 -246525 -274651 179416 -154862 -310183 -63764 64514 13226 -81565
9257 -47155 243253 125221 86294 34051 223091 246447 143005 -163567 -146262 -413331 -13170
9245 -107452 -163559 230421 -436555 95406 -122346 -124797 -29449 -39260 -151157 -184796 -176052
9234 -176052 -108500 -76431 -150136 -247883 -139486 8088 -85844 23270 -120248 35658 -154181
$$ packed form
9315a09371K6793o4749c5158j57462j46938J210E2208a44706G7660C1085J35735
9304A66820C5713J12068g301o1720R006K1556A38878P6025b06974N024k65983
9293d67933J02319E3525d1687p4574j55597B6933e9285m1718n4942F5135c37382
9281c4369k73548e9736B44277a50986C64058a1298j05525A21197J3524o880c47381
9269i7347I1120Q1280b46525k8126A79416a54862j55321f3764F4514A3226h1565
9257d7155B43253j18032l8927C4051J89040K3356j03442a63567J7305k67069a3170
9245a07452n6107B30421d36555I5406a22346k451b9449r811j11897l3639Q744
9234a76052O7552L2069p3705r7747J08397H088h5844B3270a20248C5658a54181
$$ plain form
9222 50913 -33040 -99821 -137877 35885 -310427 11316 221227 10741 -140059 -175508 -107399
9211 -107399 -211715 -115116 27274 -317077 -120467 -62152 45458 197585 -85677 -152946 -277180
9200 -277180 -158458 -228216 -157949 42239 -201252 133861 -96180 -159302 -214860 29601 -285925
9188 -27103 -86987 82677 11013 -176485 -13498 48128 136094 -171738 -176636 -206534 329291
9176 -165510 -158688 -16641 23427 139665 8782 -141954 -198672 -59006 -209554 -122943 -230081
9165 -230081 106502 -23903 -161536 37048 124164 -345525 161842 149121 59173 55285 -2763
9153 264025 260963 230743 -117197 75991 203181 -100319 -77398 177505 -264594 154492 31047
9141 -342284 -32541 175125 -42584 -198475 22864 -192780 18696 -175793 56948 -359804 -85926
$$ packed form
9222E0913c3040o6781l8056C5885c10427A1316K09911A0741a40059l5449O8109
9211a07399j04316R6599B7274c17077a20467N8315D5458J52127h5677o7269j24234
9200b77180J18722o9758P0267D2239b01252A33861i6180o3122n5558B9601b85925
9188b7103n9884H2677A1013a76485a3498D8128Q7966a71738m898k9898C29291
9176a65510O822a6641B3427J16238H782a41954n6718e9006j50548Q6611j07138
9165b30081A06502b3903j37633C7048Q7116c45525A61842j2721E9173l888b763
9153B64025l062l0220a17197G5991J27190a00319K2921A77505b64594A54492C1047
9141c42284c2541A75125d2584j55891B2864a92780A8696a75793E6948c59804h5926
$$ plain form
9129 -140990 -309990 133721 -156310 -237450 310891 90016 -312812 -279099 -90614 233752
9118 -39842 95640 7324 133840 -132459 -6325 179132 -92221 -277727 -277485 186418 185392 171241
9106 171241 -181468 -233987 -10820 -9901 279094 -105915 141562 134327 -183095 -68906 -206308
9095 -206308 -424661 -121271 -81726 -122242 177464 35126 -111789 172466 -26722 -3145 -301617
9084 -301617 5190 39044 -108212 -157048 -266275 -266483 4569 -337083 12283 -91800 136576 151961
9072 151961 -39865 -54364 160384 -12068 -44424 26231 170520 -30248 -94749 -21896 82556
9060 -252913 110335 -25342 74050 171164 118573 -296757 -250361 -67737 175891 5637 -145589
9048 42489 -168770 -38930 15289 61593 -142437 -12276 4381 -159910 -187621 -32440 82405
$$ packed form
9129a40990j69000A33721a56310q1140C10891I0016c12812L3713i0614B33752
9118c9842I5640G324J26516a32459f325A79132i2221j85506K42A86418j026j4151
9106A71241a81468n2519a0820R19B79094a05915A41562p235a83095f8906j37402
9095b06308k18353a21271L9545m0516A77464C5126a11789A72466b6722c145k98472
9084c01617E190L3854a08212m8836j09227k08D569c37083A2283i1800A36576J5385
9072A51961c9865j4499A60384a2068l2356B6231J44289c0248o4501b1896H2556
9060b52913A10335b5342G4050R7114n2591b96757M6396f7737A75891E637a45589
9048D2489a68770c8930A5289M6304a42437a2276D381a59910k7711c2440H2405
$$ plain form
9036 257917 -228268 -27222 41795 -160598 -70720 -289601 168670 136455 -120238 -323357
9026 -323357 -129065 83683 -68239 32875 -87325 -105113 -186135 278891 47105 140227 -123135
9014 -340800 78901 -27475 186484 -129878 -193960 -47152 60713 150203 -227421 -216754 -389528
9003 -389528 -241463 -147529 131715 52519 47965 -195785 -363618 41798 148558 -18733 -24518
8992 -24518 -10958 -182029 314242 89671 -88489 77433 -148796 -141701 120778 -36494 -196879
8981 -196879 -4789 48060 -245163 -176800 -339724 -77902 -21896 -126624 24280 119318 143153
8970 143153 63963 -82122 -291141 -136925 -14974 77216 -177869 32530 -352249 37299 -9779
8958 -15358 -61980 -230279 -99850 210765 75680 -89996 -11793 -240673 -241556 88021 -129734
$$ packed form
9036B57917b28268b7222D1795a60598g0720k18881A68670l2215a20238k03119
9026c23357a29065H3683f8239C2875h7325j7788q1022B78891D7105R3122a23135
9014c40800G8901b7475A86484a29878o4082d7152F0713Q9490b27421J0667j72774
9003c89528J48065R3934A31715E2519m554a95785j67833D1798J06760a8733n785
8992b4518a0958j71071C14242H9671h8489G7433a48796P095A20778c6494j60385
8981a96879d789D8060b45163O8363j62924g7902b1896j04728B4280R5038K3835
8970A43153F3963h2122k09019a36925a4974G7216a77869C2530c52249C7299i779
8958a5358m6622j68299i9850B10765G5680h9996a1793k28880q83H8021a29734
$$ plain form
8946 55862 295538 -119244 -83953 -77435 -132987 58471 -142320 168177 -313071 -292102 -32308
8934 66808 489657 219181 -87909 -5578 -25819 410286 91129 -83336 464462 444415 404418
8923 404418 1636949 3869338 14489101 5768911 1541415 452144 -12203 87663 220408
8914 220408 129266 -152906 -52248 203628 -102143 22964 337304 106040 86159 -167218
8903 -306851 -144356 -148688 232103 23900 192040 -291121 -52307 -191351 -52274 31329 -18091
8891 -20672 17388 -89110 -130021 53330 -2408 393398 -104789 -178316 -81133 -118146 -118974 -20679
8878 -66411 384240 138379 -178304 120768 -369573 -301171 -25588 -89621 -285096 -237803 -398856
8867 -398856 -127020 -70436 -189768 -315046 -309985 -36643 35912 -16779 153143 -34644 -44560
$$ packed form
8946E5862K39676a19244L5291O518n5552E8471a42320A68177c13071K0969c2308
8934F6808M22849B19181h7909e578k0241D10286I1129h3336D64462k0047l9997
8923D04418J232531K232389J0619763E768911A541415D52144a2203H7663J32745
8914B20408r1142a52906e2248B03628a02143B2964L14340A06040j9881a67218
8903c06851a44356m332B32103B3900J68140b91121e2307j39044e2274C1329a8091
8891b0672A7388h9110m0911E3330b408C93398a04789p3527h1133l7013q28b0679
8878f6411C84240A38379a78304A20768c69573O8402b5588o4033j95475M7293j61053
8867c98856a27020N6584j19332j25278N061c6643C5912a6779A53143c4644r916
$$ plain form
8856 -44560 -32860 -87420 -24565 52416 160459 -315231 75757 -238619 -237886 167278 -149939
8844 79038 -109535 -80998 324542 -97316 -160320 -113381 235257 -280783 -236235 -75264 -202550
8833 -202550 -324171 160359 -166572 -123740 179577 -83006 37277 -25541 37223 99000 -63024
8821 191065 -256942 -159693 288167 269681 -399 -97866 -32086 -126708 -5390 17525 57257 -438364
$$ packed form
8856d4560J1700n4560b4565E2416J08043c15231G5757b38619P33A67278a49939
8844G9038a09535K8537C24542i7316o3004M6939B35257b80783M4548g5264j27286
8833b02550j21621A60359a66572M2832A79577h3006C7277b5541C7223O1777f3024
8821A91065b56942R7249B88167j8486c99r7467c2086r4622e390A7525L9732d38364
$$ [...]
##END NTUPLES=NMR SPECTRUM
##END=
