##TITLE=NES1063_159122.0004_001_9704314_vr22o5BivX
##JCAMPDX= 6.0         $$ Bruker NMR JCAMP-DX V2.0
##DATA TYPE= NMR SPECTRUM
##DATA CLASS= NTUPLES
##ORIGIN= BRUKER
##OWNER= Administrator
$$ 1.72 TOPSPIN		Version 2.1
$$ 2016-05-01 18:37:05.177 -0700  Administrator@X
$$ Compression mode = diff/dup
##.OBSERVE FREQUENCY= 400.02188249412
##.OBSERVE NUCLEUS= ^1H
##.ACQUISITION MODE= SIMULTANEOUS (DQD)
##.ACQUISITION SCHEME= undefined
##.AVERAGES= 64
##.DIGITISER RES= 22
##SPECTROMETER/DATA SYSTEM= spect
##.PULSE SEQUENCE= noesygpps1d.comp
##.SOLVENT NAME= COFFEE_meoh
##.SHIFT REFERENCE= INTERNAL, COFFEE_meoh, 1, 14.96128
##AUDIT TRAIL= $$ (NUMBER, WHEN, WHO, WHERE, PROCESS, VERSION, WHAT)
$$ ##TITLE= Audit trail, TOPSPIN		Version 2.1
$$ ##JCAMPDX= 5.01
$$ ##ORIGIN= Bruker BioSpin GmbH
$$ ##OWNER= Administrator
$$ $$ E:\/data/COFFEE/nmr/NES1063_159122.0004_001_9704314_vr22o5BivX/12/pdata/1/auditp.txt
$$ ##AUDIT TRAIL=  $$ (NUMBER, WHEN, WHO, WHERE, PROCESS, VERSION, WHAT)
(   1,<2016-05-01 18:37:00.052 -0700>,<Administrator>,<X>,<go>,<TOPSPIN 2.1>,
      <created by zg
	started at 2016-05-01 18:25:30.677 -0700,
	POWCHK enabled, PULCHK disabled,
       configuration hash MD5:
       21 0F 79 D6 B3 7B B4 F6 88 20 88 DB 03 48 BD 9F
       data hash MD5: 64K
       4A FD ED 28 47 8D E5 58 81 E7 04 05 F3 9D D5 1E>)
(   2,<2016-05-01 18:37:03.427 -0700>,<Administrator>,<X>,<proc1d>,<TOPSPIN 2.1>,
      <Start of raw data processing
       efp LB = 0.3 FT_mod = 6 PKNL = 1 PHC0 = 0 PHC1 = 0 SI = 128K 
       data hash MD5: 128K
       B4 D8 3E 40 8F 80 59 5F 31 9E 9A AA 3B 97 D6 76>)
(   3,<2016-05-01 18:37:04.302 -0700>,<Administrator>,<X>,<proc1d>,<TOPSPIN 2.1>,
      <pk PHC0 = -82.45239 PHC1 = 0 
       data hash MD5: 128K
       D8 16 E7 A4 83 B7 1B A6 58 78 02 C7 B1 39 93 8B>)
(   4,<2016-05-01 18:37:04.692 -0700>,<Administrator>,<X>,<proc1d>,<TOPSPIN 2.1>,
      <abs ABSG = 1 
       data hash MD5: 128K
       C6 BA 1A CE DB F9 49 9B 99 AA 21 F0 4E 6D 92 24>)
(   5,<2016-05-01 18:37:04.786 -0700>,<Administrator>,<X>,<proc1d>,<TOPSPIN 2.1>,
      <abs ABSG = 2 
       data hash MD5: 128K
       08 98 AB 94 26 85 B5 0D 32 1B C3 E6 40 AB D6 16>)
(   6,<2016-05-01 18:37:04.864 -0700>,<Administrator>,<X>,<proc1d>,<TOPSPIN 2.1>,
      <abs ABSG = 3 
       data hash MD5: 128K
       AC 20 7C 82 A2 1A 1F 64 7C 60 C1 47 70 25 DD 23>)
(   7,<2016-05-01 18:37:04.942 -0700>,<Administrator>,<X>,<proc1d>,<TOPSPIN 2.1>,
      <abs ABSG = 4 
       data hash MD5: 128K
       82 14 4C 7C 38 9D 92 0E 4B A3 D9 E3 D4 D4 1F 56>)
(   8,<2016-05-01 18:37:05.021 -0700>,<Administrator>,<X>,<proc1d>,<TOPSPIN 2.1>,
      <abs ABSG = 5 
       data hash MD5: 128K
       F5 CB 16 76 7D 46 36 D7 7E 5C 9C C0 EB 5B C4 7C>)
$$ ##END=
$$ 
$$ $$ hash MD5
$$ $$ CB A5 2D 69 E9 03 7A 69 5B 51 20 1B F0 E9 FB 60
##$RELAX= 
##$RELAX= 
##$RELAX= 
##$RELAX= 
##$RELAX= 
##$RELAX= 
##$RELAX= 
##$RELAX= 
$$ Bruker specific parameters
$$ --------------------------
##$DU= <E:\>
##$EXPNO= 12
$$ [...]
##$TP07= 0
##$TPNAME0= <>
##$TPNAME1= <>
##$TPNAME2= <>
##$TPNAME3= <>
##$TPNAME4= <>
##$TPNAME5= <>
##$TPNAME6= <>
##$TPNAME7= <>
##$TPOAL= (0..7)
0.5 0.5 0.5 0.5 0.5 0.5 0.5 0.5
##$TPOFFS= (0..7)
0 0 0 0 0 0 0 0
##$TUNHIN= 0
##$TUNHOUT= 0
##$TUNXOUT= 0
##$USERA1= <user>
##$USERA2= <user>
##$USERA3= <user>
##$USERA4= <user>
##$USERA5= <user>
##$V9= 5
##$VALIST= <valist>
##$VCLIST= <CCCCCCCCCCCCCCC>
##$VD= 0
##$VDLIST= <DDDDDDDDDDDDDDD>
##$VPLIST= <PPPPPPPPPPPPPPP>
##$VTLIST= <TTTTTTTTTTTTTTT>
##$WBST= 2048
##$WBSW= 25
##$XGAIN= (0..3)
0 0 0 0
##$XL= 0
##$YL= 0
##$YMAX_a= 4835146
##$YMIN_a= -9033806
##$ZGOPTNS= <>
##$ZL1= 120
##$ZL2= 120
##$ZL3= 120
##$ZL4= 120
##$ABSF1= 14.96128
##$ABSF2= -5.596902
##$ABSG= 5
##$ABSL= 3
##$ALPHA= 0
##$AQORDER= 0
##$ASSFAC= 0
##$ASSFACI= 0
##$ASSFACX= 0
##$ASSWID= 0
##$AUNMP= <proc_prof1d_extract.lims>
##$AXLEFT= 0
##$AXNAME= <>
##$AXNUC= <1H>
##$AXRIGHT= 0
##$AXTYPE= 0
##$AXUNIT= <>
##$AZFE= 0.1
##$AZFW= 0.1
##$BCFW= 0
##$BC_mod= 0
##$BYTORDP= 0
##$COROFFS= 0
##$CY= 15
##$DATMOD= 1
##$DC= 0
##$DFILT= <>
##$DTYPP= 0
##$F1P= 0
##$F2P= 0
##$FCOR= 0.5
##$FTSIZE= 131072
##$FT_mod= 6
##$GAMMA= 0
##$GB= 0
##$INTBC= 1
##$INTSCL= 1
##$ISEN= 128
##$LB= 0.3
##$LEV0= 0
##$LPBIN= 0
##$MAXI= 10000
##$MC2= 0
##$MEAN= 0
##$ME_mod= 0
##$MI= 0
##$NCOEF= 0
##$NC_proc= -2
##$NLEV= 6
##$NOISF1= 0
##$NOISF2= 0
##$NSP= 0
##$NTH_PI= 0
##$NZP= 0
##$OFFSET= 14.96128
##$PC= 1
##$PHC0= -82.45239
##$PHC1= 0
##$PH_mod= 1
##$PKNL= yes
##$PPARMOD= 0
##$PPDIAG= 0
##$PPIPTYP= 0
##$PPMPNUM= 2147483647
##$PPRESOL= 1
##$PSCAL= 4
##$PSIGN= 0
##$PYNMP= <proc.py>
##$REVERSE= no
##$SF= 400.020009523505
##$SI= 131072
##$SIGF1= 0
##$SIGF2= 0
##$SINO= 400
##$SIOLD= 131072
##$SPECTYP= <>
##$SREGLST= <1H.CDCl3>
##$SSB= 0
##$STSI= 131072
##$STSR= 0
##$SW_p= 8223.68421052631
##$SYMM= 0
##$S_DEV= 0
##$TDeff= 65536
##$TDoff= 0
##$TI= <>
##$TILT= no
##$TM1= 0
##$TM2= 0
##$TOPLEV= 0
##$USERP1= <user>
##$USERP2= <user>
##$USERP3= <user>
##$USERP4= <user>
##$USERP5= <user>
##$WDW= 1
##$XDIM= 131072
##$YMAX_p= 282695562
##$YMIN_p= -11820
##$CURPLOT= <Network HP LaserJet P1505>
##$CURPRIN= <$Network HP LaserJet P1505>
##$DFORMAT= <normdp>
##$LAYOUT= <+/1D_H.xwp>
##$LFORMAT= <normlp>
##$PFORMAT= <normpl>
##$SURQMSG= 1
$$ End of Bruker specific parameters
$$ ---------------------------------
##NTUPLES= NMR SPECTRUM
##VAR_NAME=  FREQUENCY,     SPECTRUM/REAL,   SPECTRUM/IMAG
##SYMBOL=    X,             R,               I
##VAR_TYPE=  INDEPENDENT,   DEPENDENT,       DEPENDENT
##VAR_FORM=  AFFN,          ASDF,            ASDF
##VAR_DIM=   131072,        131072,          131072
##UNITS=     HZ,            ARBITRARY UNITS, ARBITRARY UNITS
##FACTOR=    0.0627417313425164, 1,          1
##FIRST=     8223.62146879497, 2297,         -44732
##LAST=      0,             4976,            -43938
##MIN=       0,             -11820,          0
##MAX=       8223.62146879497, 282695562,    0
$$ Real data points
##PAGE= N=1
##DATA TABLE= (X++(R..R)), XYDATA
$$ [...]
63855A30351M81L08Q31R42L71rK70N44J60n93j151j529j985k446k743k976l233
63838A17593l296l000k575k307k205k208k373k572k417j774r90m34j40j46o41
63823I0515j474k022j959j678j498j029K4R46P27n01j599j909j825j790j577q80
63807G2471j6M36L60J09L4K83Q13J327J354O79k83p98m85L19Q77O81j48r94j294
63788G5725r91m07J37M82M97J23l78m70J15R78J397J048K37n29j056j440j704
63771G3764j710j434j111r23o75j5J040J978K259J764P97j58o78o38l43k43m13
63754G3261n43n07n66q17q46l09L83N65K72J77N38Q74P88O06P73J104J092P01
63736G7546M01M41N73N32M85Q19J597K406K717K414J908J713J869J916J564J114
$$ y = [130351, 130832, 131140, 131971, 132913, 133284, 133275, 133545, 134089, 134249, 133656, 132505, 130976, 128991, 126545, 123802, 120826, 117593, 114297, 111297, 108722, 106415, 104210, 102002, 99629, 97057, 94640, 92866, 91876, 91442, 91302, 91156, 90515, 89041, 87019, 85060, 83382, 81884, 80855, 80879, 81825, 82552, 82051, 80452, 78543, 76718, 74928, 73351, 72471, 72455, 72891, 73251, 73360, 73394, 73677, 74490, 75817, 77171, 77850, 77567, 76769, 76284, 76603, 77480, 78161, 78013, 77019, 75725, 74734, 74327, 74464, 74946, 75443, 75566, 75188, 74718, 74833, 75811, 77208, 78256, 78493, 77964, 76908, 75468, 73764, 72054, 70620, 69509, 68586, 67911, 67896, 68936, 70914, 73173, 74937, 75734, 75576, 74898, 74260, 73917, 73674, 73261, 72718, 72211, 71645, 70828, 69982, 69673, 70056, 70621, 70893, 71070, 71608, 72482, 73270, 73876, 74649, 75753, 76845, 77546, 77947, 78388, 78961, 79493, 79978, 80797, 82394, 84800, 87517, 89931, 91839, 93552, 95421, 97337, 98901, 100015]
63720A00015R89R81M19q14j850j786q40j19k54p45q49o81r08j608k010j527m96
63703H7917L64Q57J222J469J371J089J172J715K073J734J145J167J899K532K410
63688A10136J741J153R24R09R53J048J087Q32J82o24j200j336j105o81j56N27
63672A14390J411K296K773K561J811R66L25j62o85j280j808k090k040j722j389
63657A15357j279j314j165p77o17j086j834k066j544q50n19l23K36J099J785K136
63641A07239K446K849L077K991K980L504M496N414N834N768N600N817O726Q191
63627A72932R667J0700J1330J1943J2751J3662J4567J5602J6974J8697K0575K2324
63615C51724K3599K3962K2986K0480J6579J1709O499J693k034m364n483n843n766
$$ y = [100015, 101004, 101985, 102404, 101590, 99740, 97954, 97114, 96995, 96741, 95996, 95147, 94466, 93558, 91950, 89940, 88413, 87917, 88281, 89138, 90360, 91829, 93200, 94289, 95461, 97176, 99249, 100983, 102128, 103295, 105194, 107726, 110136, 111877, 113030, 113954, 114863, 115816, 116864, 117951, 118783, 118965, 118341, 117141, 115805, 114700, 114019, 113863, 114390, 115801, 118097, 120870, 123431, 125242, 126208, 126533, 126371, 125686, 124406, 122598, 120508, 118468, 116746, 115357, 114078, 112764, 111599, 110822, 110205, 109119, 107285, 105219, 103675, 102825, 102306, 101983, 102219, 103318, 105103, 107239, 109685, 112534, 115611, 118602, 121582, 125086, 129582, 134996, 140830, 146598, 152198, 158015, 164741, 172932, 182599, 193299, 204629, 216572, 229323, 242985, 257552, 273154, 290128, 308825, 329400, 351724, 375323, 399285, 422271, 442751, 459330, 471039, 477538, 479231, 477197, 472833, 467350, 461507, 455741]
63602D55741n322m625m014l879m380n531p359r788j2363j4546j6233j7713j8931
63589C31057j9205j7987j5718j3508j2033j1019r780p976n904m236l436l197k580
63576B04478r78J085K504K905K976L485M501N726P039Q322R225R605R960J0879
63562B81712J2288J3601J4544J5360J6311J7466J8879K0439K1479K1098J9004
63551D72181J5730J1877P585K951j512n135p592q860q955q004o395m638l170k382
63537D53681k576l706n391p388r835j2735j5516j7442j8340j8614j8635j8395
63525C05108j7745j6630j5132j3426j1782j0415r358q537p878p299o748o333o203
63512A67622o172n789m930m012l349k713j871j213j252j721j810j235m89k1K42
$$ y = [455741, 450419, 445794, 441780, 437901, 433521, 427990, 420631, 410843, 398480, 383934, 367701, 349988, 331057, 311852, 293865, 278147, 264639, 252606, 241587, 231807, 223831, 217927, 213691, 210255, 207058, 204478, 203500, 204585, 207089, 209994, 212970, 216455, 220956, 226682, 233721, 242043, 251268, 260873, 270833, 281712, 294000, 307601, 322145, 337505, 353816, 371282, 390161, 410600, 432079, 453177, 472181, 487911, 499788, 507373, 510324, 508812, 503677, 496085, 487225, 478270, 470266, 463871, 459233, 456063, 453681, 451105, 447399, 442008, 434620, 424785, 412050, 396534, 379092, 360752, 342138, 323503, 305108, 287363, 270733, 255601, 242175, 230393, 219978, 210620, 202083, 194205, 186906, 180158, 173825, 167622, 161450, 155661, 150731, 146719, 143370, 140657, 138786, 137573, 136321, 134600, 132790, 131555, 131066, 131045, 131287]
63497A31287M58N56N06M62M45K39j67m36l59j34j9JO1K92Q21J548J904J425O26
63478A39516O17J561K207J493k7r81r06m69l23n85j223k141k800k541j498n91
63462A31309m17n44j75Q33J878K286J896J203R51J472K393L155L692M274M860
63447A59066N130N157N466O240O960P152P116P530Q600R981J1283J2387J3299
63434B65367J4097J4979J6162J7741J9762K2239K4959K7438K9314L0636L1511
63423E14205L1597L0252K7177K2617J6961J0523L834k133o345q358q535p705o659
63410F17431n830n300n111n554p140j0120j4074j8056k1240k3380k4634k5034
63398D51958k4366k2614k0346j8374j6996j5760j4057j1838r630p910o651n443
$$ y = [131287, 131745, 132301, 132807, 133269, 133714, 133953, 133786, 133350, 132991, 132857, 132838, 132839, 132900, 133192, 134013, 135561, 137465, 138890, 139516, 140133, 141694, 143901, 145394, 145367, 144386, 143480, 143011, 142688, 142103, 140880, 138739, 135939, 133398, 131900, 131309, 130892, 130348, 130173, 131006, 132884, 135170, 137066, 138269, 139220, 140692, 143085, 146240, 149932, 154206, 159066, 164196, 169353, 174819, 181059, 188019, 195171, 202287, 209817, 218417, 228398, 239681, 252068, 265367, 279464, 294443, 310605, 328346, 348108, 370347, 395306, 422744, 452058, 482694, 514205, 545802, 576054, 603231, 625848, 642809, 653332, 657166, 655033, 648688, 640330, 631795, 624090, 617431, 611601, 606301, 601190, 595636, 588496, 578376, 564302, 546246, 525006, 501626, 476992, 451958, 427592, 404978, 384632, 366258, 349262, 333502, 319445, 307607, 297977, 290067, 283416, 277973]
63386B77973l975k270n48J045K541M011N453O849Q243R689J1153J2592J4017J5337
63372C62110J6193J6283J5859J5620J5916J6508J7254J8640K1017K3536K4491
63361E63427K2925J9390J5012J0338N458P52l128n880p703q793r102q598p554
63348E86544o521o199p191r527j2506j5302j7706j9982k2019k3245k3408k2976
63336C99962k2460k1750k0427j8453j6233j4160j2406j0942r632q430p653p654
63324B29762q084p957o761n139m002l425k954k561k549k688k363j580j034j020
63310A77645r41j93J094K451L636M442M537L876K965K280J720R32j38j336k621
63295B00349l933m992n581n768n608m936l814k875k709l029k905j877m79L42J53
$$ y = [277973, 273998, 271728, 271180, 272225, 274766, 278777, 284230, 291079, 299322, 309011, 320164, 332756, 346773, 362110, 378303, 394586, 410445, 426065, 441981, 458489, 475743, 494383, 515400, 538936, 563427, 586352, 605742, 620754, 631092, 636550, 637302, 634174, 628294, 620591, 611798, 602696, 594098, 586544, 580023, 573824, 566633, 557106, 544600, 529298, 511592, 491610, 469591, 446346, 422938, 399962, 377502, 355752, 335325, 316872, 300639, 286479, 274073, 263131, 253499, 245069, 237416, 229762, 221678, 213721, 206960, 201821, 197819, 194394, 191440, 188879, 186330, 183642, 181279, 179699, 178665, 177645, 176704, 176511, 177605, 180056, 183692, 188134, 192671, 196547, 199512, 201792, 203512, 204444, 204306, 202970, 200349, 196416, 191424, 185843, 180075, 174467, 169531, 165717, 162842, 160133, 157104, 154199, 152322, 151843, 152185, 152338]
63280A52338o21j123q33o6M10J64n38j155j330r13n3O91P21J64k05M1M76O28O90
63261A49486J027J473J730J967K467L016L271L444L915M458M529M166L933M080
63247A92962M439N001N907O954P817Q685R920J1160J1634J1373J1313J1961J2775
63234C11901J3170J3280J3417J3449J3261J3167J3362J3446J3036J2450J2282
63223D56221J2629J3165J3701J4177J4381J4113J3435J2485J1174R287O667L236
63211E94671q37m802p750r612j1280j3261j4798j4848j3574j2114j1139j0319
63199D70337r130p533n789m127k844k252k289k366j804l73J642L815O001Q321
63185D51609J0755J2883J4252J4890J5124J5029J4463J3698J3349J3543J3748
$$ y = [152338, 151717, 150594, 149761, 149695, 150105, 150269, 149731, 148576, 147246, 146333, 146280, 146971, 147692, 147856, 147651, 147692, 148168, 148796, 149486, 150513, 151986, 153716, 155683, 158150, 161166, 164437, 167881, 171796, 176254, 180783, 184949, 188882, 192962, 197401, 202402, 208309, 215263, 223080, 231765, 241685, 252845, 264479, 275852, 287165, 299126, 311901, 325071, 338351, 351768, 365217, 378478, 391645, 405007, 418453, 431489, 443939, 456221, 468850, 482015, 495716, 509893, 524274, 538387, 551822, 564307, 575481, 584768, 591435, 594671, 593834, 589032, 581282, 571670, 560390, 547129, 532331, 517483, 503909, 491795, 480656, 470337, 461207, 453674, 447885, 443758, 440914, 438662, 436373, 434007, 432203, 431830, 433472, 437287, 443288, 451609, 462364, 475247, 489499, 504389, 519513, 534542, 549005, 562703, 576052, 589595, 603343]
63174F03343J3661J3625J3724J3224J1557R267P131M836J509k701o630r690j2471
63161F60385j5534j8510k0831k2522k3816k4500k4208k3042k1474j9854j8359
63150D27735j7117j6066j4890j3390j1765j0291q978p705o478n269l878k274q73
63137C08761j65r3j08K84J234K627M127N268N792N908N879N487M287K437P34l03
63121C52156j056k166l620m842n483n687n590n080m173l277k795k660k455j944
63107C01328j297q86r10j176j187o25K57Q62R70R60J233J711K074K182K071J804
63091C09371J609J765K099K017J471J376K364L638L968L514L528M282M587L730
63077C49319K632K438K967L410L754M505N507O144O371O685P170P519P857Q729
$$ y = [603343, 617004, 630629, 644353, 657577, 669134, 678401, 685532, 690368, 691877, 689176, 682546, 672856, 660385, 644851, 626341, 605510, 582988, 559172, 534672, 510464, 487422, 465948, 446094, 427735, 410618, 394552, 379662, 366272, 354507, 344216, 335238, 327533, 321055, 315786, 311908, 309634, 308761, 308596, 308503, 308395, 308679, 309913, 312540, 316667, 321935, 327727, 333635, 339514, 345001, 349288, 351725, 352459, 352156, 351100, 348934, 345314, 340472, 334989, 329302, 323712, 318632, 314459, 311182, 308387, 305727, 303272, 301328, 300031, 299145, 298235, 297059, 295872, 295247, 295504, 296366, 297336, 298296, 299529, 301240, 303314, 305496, 307567, 309371, 310980, 312745, 314844, 316861, 318332, 319708, 322072, 325710, 329678, 333192, 336720, 341002, 345589, 349319, 351951, 354389, 357356, 360766, 364520, 369025, 374532, 380676, 387047, 393732, 400902, 408421, 416278, 425007]
63063D25007J0255J1973J3633J5393J7254J8925K0414K2109K4063K5800K7012
63052F31838K7965K8974K9918L0494L0620L0344K9720K8978K8457K8178K7778
63041I53264K7092K6512K6533K7160K7956K8431K8220K7034K4693K1149J6372
63030A234416J0345L293m205j1478j8157k4289l0027l5139l8859m0503m0291l9264
63018I65842l8164l6654l3989l0103k5609k0914j5948j0760n787j361K701O785
63006G56039J1015J5044J8253K0232K1388K2821K5215K7939K9705K9995K9348
62995A006994K8427K7459K6587K6033K5707K5150K4057K2354J9823J6169J1567
62984A260327O454O92o283j4228k1872k8350l4161m0077m5758n0057n2256n2466
$$ y = [425007, 435262, 447235, 460868, 476261, 493515, 512440, 532854, 554963, 579026, 604826, 631838, 659803, 688777, 718695, 749189, 779809, 810153, 839873, 868851, 897308, 925486, 953264, 980356, 1006868, 1033401, 1060561, 1088517, 1116948, 1145168, 1172202, 1196895, 1218044, 1234416, 1244761, 1248054, 1243849, 1232371, 1214214, 1189925, 1159898, 1124759, 1085900, 1045397, 1005106, 965842, 927678, 891024, 857035, 826932, 801323, 780409, 764461, 753701, 747914, 746553, 749254, 756039, 767054, 782098, 800351, 820583, 841971, 864792, 890007, 917946, 947651, 977646, 1006994, 1035421, 1062880, 1089467, 1115500, 1141207, 1166357, 1190414, 1212768, 1232591, 1248760, 1260327, 1266781, 1267473, 1261190, 1246962, 1225090, 1196740, 1162579, 1122502, 1076744, 1026687, 974431, 921965]
62972I21965n1263m9513m8051m6841m4819m1285l7007l3266l0184k6986k3639
62961D89111k1040j9510j8169j6304j4477j3622j3639j3547j2738j1455j0189
62950C24421r122q250p593p135o741o298n844n503n304n180n086n028m922m525
62936B37890l725k867k537k873l287l080k227j377j084j269j420j181o69l13l97
62921B09584p66j027r73p43n73n62p38j143j710k202k402k266j883j403j068j051
62905A89074j215j241j116j198j596j835j424n20K86P08Q83R33P84M27K8k39k84
62888A82455o6L14N47M30J92K29N58Q48R32R47R23O55J30k53j88M6j03p60j506
62869A86330j871j761j365q72l99n2R1J10K20N09Q23R16P67N72M38K62j1j95j29
$$ y = [921965, 870702, 821189, 773138, 726297, 681478, 640193, 603186, 569920, 539736, 512750, 489111, 468071, 448561, 430392, 414088, 399611, 385989, 372350, 358803, 346065, 334610, 324421, 315299, 307049, 299456, 292321, 285580, 279282, 273438, 267935, 262631, 257451, 252365, 247337, 242415, 237890, 234165, 231298, 228761, 225888, 222601, 219521, 217294, 215917, 214833, 213564, 212144, 210963, 210294, 209981, 209584, 208818, 207791, 206818, 206075, 205502, 204940, 204202, 203059, 201349, 199147, 196745, 194479, 192596, 191193, 190125, 189074, 187859, 186618, 185502, 184304, 182708, 180873, 179449, 178929, 179215, 179923, 180806, 181739, 182523, 182950, 182978, 182739, 182455, 182389, 182703, 183250, 183680, 183872, 184101, 184659, 185507, 186439, 187386, 188309, 188964, 189094, 188841, 188653, 188699, 188596, 187836, 186330, 184459, 182698, 181333, 180461, 180062, 180010, 180101, 180211, 180431, 180940, 181763, 182679, 183446, 184018, 184456, 184718, 184707, 184512, 184383]
62850A84383m0l61j122j708j464n00L86O02L86L03M11K89j58m75m30l97o62p91
62832A78652l22L43N39M81R41J794K022J373R46J495K131J676N80L34J315K404
62816A96704K762K873L475M358M795M601M207L980L960M091M371M764N157N453
62802B55551N632N830O370P506R058J0512J1617J2649J4021J5775J7667J9624
62790C91812K1833K4404K7170K9941L2801L5961L9358M2657M5719M8774N1897
62779G92327N4473N5558N4763N2437M8921M4078L7676K9869K1065J1634K021p203
62767A197619j5772k3874l1548l8141m2907m5926m7988m9564n0365m9926m8239
62756G53369m5773m3122m0672l8325l5596l2294k9018k6626k5206k3950k2087
$$ y = [184383, 184343, 183982, 182860, 181152, 179688, 179188, 179574, 180176, 180562, 180865, 181276, 181565, 181407, 180932, 180502, 180105, 179443, 178652, 178330, 178673, 179212, 179693, 180634, 182428, 184450, 185823, 186769, 188264, 190395, 192071, 192651, 192985, 194300, 196704, 199466, 202339, 205814, 210172, 214967, 219568, 223775, 227755, 231715, 235806, 240177, 244941, 250098, 255551, 261183, 267013, 273383, 280889, 289947, 300459, 312076, 324725, 338746, 354521, 372188, 391812, 413645, 438049, 465219, 495160, 527961, 563922, 603280, 645937, 691656, 740430, 792327, 846800, 902358, 957121, 1009558, 1058479, 1102557, 1140233, 1170102, 1191167, 1202801, 1204822, 1197619, 1181847, 1157973, 1126425, 1088284, 1045377, 999451, 951463, 901899, 851534, 801608, 753369, 707596, 664474, 623802, 585477, 549881, 517587, 488569, 461943, 436737, 412787, 390700]
62745C90700j9646j7177j5100j3450j2031j0654r292q036o870n602m260l291l081
62732B62210l363l459l028k169r66N85K131L013L019K711K820L562M722N998P155
62717B84941Q110R059J0345J2043J3909J5838J8048K0694K3535K6209K8607L0900
62705E02238L3439L6696M0944M5780N0264N3734N6225N8022N9058N9004N7553
62694A052957N4399M9239M2168L3838K4809J4967L956p863j9288k9175l7192m3737
62682A139078m9316n4023n7384n8752n8012n5916n3443n0946m8041m4427m0425
62671E68393l6639l3343l0380k7532k4746k2098j9713j7723j6070j4452j2711
62660C12986j1280j0808j1175j1285j0241q463p092o493o042n365m918m981m895
$$ y = [390700, 371054, 353877, 338777, 325327, 313296, 302642, 293350, 285314, 278444, 272842, 268582, 265291, 262210, 258847, 255388, 252360, 250191, 249225, 249810, 251941, 254954, 257973, 260684, 263504, 267066, 271788, 277786, 284941, 293051, 302110, 312455, 324498, 338407, 354245, 372293, 392987, 416522, 442731, 471338, 502238, 535677, 572373, 613317, 659097, 709361, 763095, 819320, 877342, 936400, 995404, 1052957, 1107356, 1156595, 1198763, 1232601, 1257410, 1272377, 1276333, 1268470, 1249182, 1220007, 1182815, 1139078, 1089762, 1035739, 978355, 919603, 861591, 805675, 752232, 701286, 653245, 608818, 568393, 531754, 498411, 468031, 440499, 415753, 393655, 373942, 356219, 340149, 325697, 312986, 301706, 290898, 279723, 268438, 258197, 249734, 242642, 236149, 230107, 224742, 219824, 214843, 209948]
62647B09948m008k837k377k607k562j847j181j227j686j926j898j893j859j467
62633A80573p48j64m6j74o1M16P52L30p12j397j001%N24L14K35J023K316L177
62615A85357L221K914K979L749M886N686N819N862O779Q792J1157J3097J4556
62602B74854J5928J7398J8902K0455K2153K4008K5880K7457K8249K7893K6437
62591E29614K4155K1059J7027J2313P447K572k540p689j2099j5336j7799j9967
62579E38757k1703k2740k3294k3662k3611k2753k1271j9763j8543j7492j6388
62568C07537j5046j3398j1700j0400r435q204o545n197m711m409l259j457k33
62555B13543k22q29j228j259j181j208j439j801j954j633j131r61j103j112r20
$$ y = [209948, 205940, 203103, 200726, 198119, 195557, 193710, 192529, 191302, 189616, 187690, 185792, 183899, 182040, 180573, 179825, 179661, 179615, 179441, 179380, 179796, 180548, 180878, 180166, 178769, 177768, 177768, 178292, 178606, 178841, 179864, 182180, 185357, 188578, 191492, 194471, 198220, 203106, 208792, 214611, 220473, 227252, 236044, 247201, 260298, 274854, 290782, 308180, 327082, 347537, 369690, 393698, 419578, 447035, 475284, 503177, 529614, 553769, 574828, 591855, 604168, 611615, 614187, 611647, 603958, 591859, 576523, 558724, 538757, 517054, 494314, 471020, 447358, 423747, 400994, 379723, 359960, 341417, 323925, 307537, 292491, 279093, 267393, 256993, 247558, 239354, 232809, 227612, 222901, 218492, 215233, 213776, 213543, 213321, 212492, 211264, 210005, 208824, 207616, 206177, 204376, 202422, 200789, 199658, 198697, 197594, 196482, 195562]
62540A95562q41p79j83J006K114K755L402M460N412N545N172N319O428Q045R746
62525B53163J1641J3749J5592J6891J8218K0293K2813K4708K5625K6492K8172
62514D77357L0149L1176L0826K9599K7687K4631K0330J5466J0476M930j512q117
62502F92998j3772j8082k1237k3292k4373k5125k6030k6523k5639k3417k0815
62491D44693j8400j5993j3530j1352r541p804o164n043m439l865l252l105l519
62478C38686l866l836l977m674n396n515n302n394n845o352o931p682q183p884
62464B57849o945o018n371m747m013l327k733k071j388j000j015j079o92L32J628
62449B19410K450K280J467J003J419K252K830L124L436L620L325K807K692K962
$$ y = [195562, 194721, 193942, 193759, 194765, 196879, 199634, 203036, 207496, 212908, 218453, 223625, 228944, 235372, 243417, 253163, 264804, 278553, 294145, 311036, 329254, 349547, 372360, 397068, 422693, 449185, 477357, 507506, 538682, 569508, 599107, 626794, 651425, 671755, 687221, 697697, 702627, 701115, 692998, 679226, 661144, 639907, 616615, 592242, 567117, 541087, 514564, 488925, 465508, 444693, 426293, 410300, 396770, 385418, 375877, 368073, 361909, 356866, 352427, 348562, 345310, 342205, 338686, 334820, 330984, 327007, 322333, 316937, 311422, 306120, 300726, 294881, 288529, 281598, 273916, 265733, 257849, 250904, 244886, 239515, 234768, 230755, 227428, 224695, 222624, 221236, 220236, 219221, 218142, 217450, 217782, 219410, 221860, 224140, 225607, 226610, 228029, 230281, 233111, 236235, 239671, 243291, 246616, 249423, 252115, 255077]
62435B55077K822J748J47j284k352l197l759l833l558l436l764m203m047k979
62421B23382j562p91j084j850k227k077j947k208k587k654k361j972j646j323
62407A97093r07m50j20m9j35j26L8Q3j87m41j21Q31J878K587L095L660M077L932
62389B14738L287K749K815L357L894M177M377M789N456O057O167N732N324N763
62375B78682P297R208J0449J0761J0968J2076J4223J6702J8845K0689K2733K5339
62363D57972K8462L1858L5364L8848M1958M3985M4208M2396L8866L3990K7859
62352H65766K0680J3286O831J860k081n874j0041j4560j9138k3410k7049k9901
62340G76369l2068l3668l4596l4532l3254l0911k8009k5119k2522k0190j8098
$$ y = [255077, 257899, 259647, 259794, 258510, 256158, 252961, 249202, 245369, 241811, 238375, 234611, 230408, 226361, 223382, 221820, 221029, 219945, 218095, 215868, 213791, 211844, 209636, 207049, 204395, 202034, 200062, 198416, 197093, 196186, 195736, 195616, 195567, 195432, 195306, 195344, 195427, 195240, 194799, 194678, 195509, 197387, 199974, 203069, 206729, 210806, 214738, 218025, 220774, 223589, 226946, 230840, 235017, 239394, 244183, 249639, 255696, 261863, 267595, 272919, 278682, 285979, 295187, 305636, 316397, 327365, 339441, 353664, 370366, 389211, 409900, 432633, 457972, 486434, 518292, 553656, 592504, 634462, 678447, 722655, 765051, 803917, 837907, 865766, 886446, 899732, 906563, 908423, 906342, 900468, 890427, 875867, 856729, 833319, 806270, 776369, 744301, 710633, 676037, 641505, 608251, 577340, 549331, 524212, 501690, 481500, 463402]
62329D63402j6363j5005j3760j2396j1092j0299j0184j0478j0808j0918j0663
62318C31436j0056r376q902q549p993p119o062m946l954l533l857m131l190j072
62304B48696P41J094N51M18R69J436J427J368J594J776J574J225J245J803K683
62289B68600L546M090M180L963L784L886M292M927N710O473P042P377P557P716
62275C43143Q093R005J0436J1798J2424J2351J2340J3112J4769J6954J9257K1465
62263E05147K3723K6518L0162L4263L7874M0305M1501M1561M0234L7128L2215
62252H90631K5894J8747J1479M960j03l729o754j0195j4496j9446k4616k9606
62240H42766l3853l6567l7370l6834l5950l4920l2972k9616k5660k2530k0744
$$ y = [463402, 447039, 432034, 418274, 405878, 394786, 384487, 374303, 363825, 353017, 342099, 331436, 321380, 312004, 303102, 294553, 286560, 279441, 273379, 268433, 264479, 260946, 257089, 252958, 249768, 248696, 249437, 250531, 251082, 251500, 252469, 253905, 255332, 256700, 258294, 260070, 261644, 262869, 264114, 265917, 268600, 272146, 276236, 280416, 284379, 288163, 292049, 296341, 301268, 306978, 313451, 320493, 327870, 335427, 343143, 351236, 360241, 370677, 382475, 394899, 407250, 419590, 432702, 447471, 464425, 483682, 505147, 528870, 555388, 585550, 619813, 657687, 697992, 739493, 781054, 821288, 858416, 890631, 916525, 935272, 946751, 951711, 951608, 947879, 941125, 930930, 916434, 896988, 872372, 842766, 808913, 772346, 734976, 698142, 662192, 627272, 594300, 564684, 539024, 516494, 495750]
62229D95750j9490j7699j5139j2479j0575r748r534r088p973o550n470m983m857
62216C62165m816m737m526m154l743l392k928k153j187l46K54O75Q61P54O16Q18
62200C34161J391K098K860L670M220M151L682L446L659L951M085M262M617N003
62186C85256N488O409P665Q517Q470P847P187O657O402O917Q402J0306J2091J4072
62172E01686J6812K0101K3240K6117K9113L2034L3930L4096L2602K9676K5298
62161H04705J9644J3483P739K980o26l236n480q195j1709j5542j9055k2097k4792
62148G37819k6908k7832k7158k5126k2416j9617j6945j4409j2133j0259q577o625
62136E19814m406k704k228k680l149l285l508m109m806n287n537n392m472k968
$$ y = [495750, 476260, 458561, 443422, 430943, 420368, 410620, 401086, 391998, 384025, 377475, 372005, 367022, 362165, 357349, 352612, 348086, 343932, 340189, 336797, 333869, 331716, 330529, 330183, 330437, 331112, 331973, 332727, 333343, 334161, 335552, 337650, 340510, 344180, 348400, 352551, 356233, 359679, 363338, 367289, 371374, 375636, 380253, 385256, 390744, 397153, 404818, 413335, 421805, 429652, 436839, 443496, 449898, 456815, 465217, 475523, 487614, 501686, 518498, 538599, 561839, 587956, 617069, 649103, 683033, 717129, 749731, 779407, 804705, 824349, 837832, 845571, 848551, 847925, 844689, 839209, 831014, 819305, 803763, 784708, 762611, 737819, 710911, 683079, 655921, 630795, 608379, 588762, 571817, 557408, 545275, 535016, 526439, 519814, 515408, 512704, 510476, 507796, 504647, 501362, 497854, 493745, 488939, 483652, 478115, 472723, 468251, 465283]
62122D65283j944k271l629n012n895o345o339n746m865m290m086l685k800j949
62108D06427j802k320k852k928k619k213j743r70K01J379J890J453N67P3L58J089
62092C95990J659J752J558J620K390L775N180O106O664P295Q127Q888R367R739
62078D70110J0415J1684J3425J5043J5917J6157J6719J8401K0934K3423K5385
62067F57613K6828K7483K6780K4635K1565J7878J3476Q626M166N00k808o048q722
62054H11972j0582j2572j5802j9991k3808k6446k7979k8491k7955k6854k5892
62043E65600k4926k3107k0297j7417j5119j3030j0770q828p813p428o959o230
62031D03676n505m797l975l286l144l556m201m920n646o061n851n212m647m326
$$ y = [465283, 463339, 461068, 457439, 452427, 446532, 440187, 433848, 428102, 423237, 418947, 414861, 411176, 408376, 406427, 404625, 402305, 399453, 396525, 393906, 391693, 389950, 388980, 389181, 390560, 392450, 393903, 394470, 394543, 394901, 395990, 397649, 399401, 400959, 402579, 404969, 408744, 413924, 420030, 426694, 433989, 442116, 451004, 460371, 470110, 480525, 492209, 505634, 520677, 536594, 552751, 569470, 587871, 608805, 632228, 657613, 684441, 711924, 738704, 763339, 784904, 802782, 816258, 824884, 829050, 829550, 826742, 820694, 811972, 801390, 788818, 773016, 753025, 729217, 702771, 674792, 646301, 618346, 591492, 565600, 540674, 517567, 497270, 479853, 464734, 451704, 440934, 432106, 424293, 416865, 409906, 403676, 398171, 393374, 389399, 386113, 382969, 379413, 375212, 370292, 364646, 358585, 352734, 347522, 342875, 338549]
62017C38549m055l757l571l520l479l456l501l436l037k453k044j845j551j031
62003B97813n25k28m5J96M63N80M06j9l94l62j8O0m71j226j712k116k925l894
61985B85583m174l509k691k550l022l491l611l447l169k906k710k439j894j200
61971B44770q45j072j590j964k123k245k341k222j745r69j88K40K16R6K96P74
61955B29088J196J578K219L001L323L001K623K683K871K711K450K743L734M998
61941B68219O186P230Q019Q387Q398Q251P969P566P380P694Q141Q013P203O360
61927C75016N932N645N152M702M733N068N044M374L535L217L670M707O121P794
61913D44710R510J0955J2126J3504J5469J7600J8993J9306J9130J9155J9358J9352
$$ y = [338549, 334494, 330737, 327166, 323646, 320167, 316711, 313210, 309774, 306737, 304284, 302240, 300395, 298844, 297813, 297288, 297060, 297015, 297211, 297674, 298254, 298660, 298641, 298247, 297885, 297867, 297927, 297456, 296230, 294518, 292402, 289477, 285583, 281409, 277900, 275209, 272659, 269637, 266146, 262535, 259088, 255919, 253013, 250303, 247864, 245970, 244770, 243925, 242853, 241263, 239299, 237176, 234931, 232590, 230368, 228623, 227654, 227466, 227706, 227922, 228018, 228314, 229088, 230284, 231862, 234081, 237082, 240405, 243406, 246029, 248712, 251583, 254294, 256744, 259487, 263221, 268219, 274405, 281635, 289654, 298041, 306439, 314690, 322659, 330225, 337605, 345299, 353440, 361453, 368656, 375016, 380948, 386593, 391745, 396447, 401180, 406248, 411292, 415666, 419201, 422418, 426088, 430795, 436916, 444710, 454220, 465175, 477301, 490805, 506274, 523874, 542867, 562173, 581303, 600458, 619816, 639168]
61901F39168J9153J9088J9156J9008J8576J8246J8311J8567J8543J7914J6699
61890H42429J5199J3722J2211J0175P299L922O15k634o334j0605j4884j8557k1449
61877H31109k3557k4753k5032k4739k4207k3473k2531k1582k0748j9817j8577
61866E82093j7186j5919j4732j3374j1847j0411r187q021o711n140l309j428Q3
61853D64911R85J594K531M044N716O884P228O901O239N396M299K875J248m08k147
61838E18296m047n799o770o664n830m709l292j389Q04K864M635O178P356P928
61824E09561Q019Q094Q340Q429P945O712M718K081p90l405n766q324j1160j3540
61810E20914j4585j4207j3052j1767j0576r398q055o375m338k166j74J405K472
$$ y = [639168, 658321, 677409, 696565, 715573, 734149, 752395, 770706, 789273, 807816, 825730, 842429, 857628, 871350, 883561, 893736, 901035, 904957, 905572, 902938, 896604, 885999, 871115, 852558, 831109, 807552, 782799, 757767, 733028, 708821, 685348, 662817, 641235, 620487, 600670, 582093, 564907, 548988, 534256, 520882, 509035, 498624, 489437, 481416, 474705, 469565, 466256, 464828, 464911, 465896, 467490, 470021, 474065, 479781, 486665, 493893, 500794, 507033, 512429, 516728, 519603, 520851, 520443, 518296, 514249, 508450, 501680, 495016, 489186, 484477, 481185, 479796, 480600, 483464, 488099, 494277, 501633, 509561, 517580, 525674, 534014, 542443, 550388, 557100, 561818, 563899, 563109, 559704, 553938, 545614, 534454, 520914, 506329, 492122, 479070, 467303, 456727, 447329, 439274, 432899, 428561, 426395, 426221, 427626, 430098]
61797D30098L040L334L656M131M730N589O961Q684J0099J0800J1137J1614J2200
61784E26073J2675J3300J4455J5864J6910J7711J9090K1279K3469K4944K6072
61773G31842K7604K9575L1497L3295L5295L7438L9136M0049M0471M0807M1020
61762A128029M0762L9812L8130L5677L2362K8200K3354J7933J1865N090k055q867
61750A390292j4883k0327k5578l0349l3877l6012l7511l8980m0149m0598m0623
61739A031405m0662m0254l8520l5645l2960l1343l0263k8785k6856k5040k3449
61728F77628k1685j9687j7996j7039j6523j5805j4631j3282j2046j0884r728q885
61716D99437q741r008q749p515o093n617o103o460o000n219m890n013n117n122
$$ y = [430098, 433138, 436472, 440128, 444259, 448989, 454578, 461539, 470223, 480322, 491122, 502259, 513873, 526073, 538748, 552048, 566503, 582367, 599277, 616988, 636078, 657357, 680826, 705770, 731842, 759446, 789021, 820518, 853813, 889108, 926546, 965682, 1005731, 1046202, 1087009, 1128029, 1168791, 1208603, 1246733, 1282410, 1314772, 1342972, 1366326, 1384259, 1396124, 1401214, 1399159, 1390292, 1375409, 1355082, 1329504, 1299155, 1265278, 1229266, 1191755, 1152775, 1112626, 1072028, 1031405, 990743, 950489, 911969, 876324, 843364, 812021, 781758, 752973, 726117, 701077, 677628, 655943, 636256, 618260, 601221, 584698, 568893, 554262, 540980, 528934, 518050, 508322, 499437, 490696, 481688, 472939, 465424, 459331, 453714, 447611, 441151, 435151, 429932, 425042, 420029, 414912, 409790]
61702D09790n289n585n629n253m706m291m140m216m274l941l178k541k568k978
61688C51201k985k426j964k025k086j454l53L70L64O6j03k35m23l66J48O25L63
61671C38717n22j051n30O91J755K287K429K180J172p62l188n342o656p024o749
61656C17407o302n941n434m330k568o92O56J347J738K173K679L188L854M930O177
61641C18882O652N440K747j19k098l387m788o378p480p759p560p070n904l991
61627B77187k240j696k262k821k537j641q87o61p18n91j24L98N86L75P5k6O2O4
61609B62543l28j205k191k610k207j569j425j661j627j297j284j608j432m83K14
61594B41830k10j068j071j69O21Q03Q19R62J016J016J395K178K818L107L465M060
$$ y = [409790, 404501, 398916, 393287, 388034, 383328, 379037, 374897, 370681, 366407, 362466, 359288, 356747, 354179, 351201, 348216, 345790, 343826, 341801, 339715, 338261, 337908, 338278, 338642, 338708, 338605, 338370, 337947, 337581, 337729, 338354, 338717, 338195, 337144, 336614, 337305, 339060, 341347, 343776, 345956, 347128, 346366, 343178, 337836, 331180, 324156, 317407, 311105, 305164, 299730, 295400, 292832, 292140, 292796, 294143, 295881, 298054, 300733, 303921, 307775, 312705, 318882, 325534, 330974, 333721, 333602, 331504, 328117, 323329, 316951, 309471, 301712, 294152, 287082, 281178, 277187, 274947, 273251, 270989, 268168, 265631, 263990, 263103, 262442, 261724, 261133, 261009, 261407, 261993, 262368, 262443, 262417, 262479, 262543, 262215, 261010, 258819, 256209, 254002, 252433, 251008, 249347, 247720, 246423, 245139, 243531, 242099, 241616, 241830, 241620, 240552, 239481, 239312, 239933, 240736, 241555, 242517, 243533, 244549, 245944, 248122, 250940, 254047, 257512, 261572]
61578B61572M421M258M053M293M762N083N468O308P354P935P877P706P978Q723
61564C47791R604J0356J1019J1851J2948J3941J4237J3600J2329J0821R251P662
61552D85410O125M571K831R26q46k277l424m306m817n047n378n952o358o163n565
61537D49730n153n166n286n122m626m041l612l413l352l310l209k859j935m16
61523C98230J021J501R97M36O48J508K376K981L553M369N581P227R086J0630J1540
61508D61684J2147J3093J4590J6285J7799J9100K0447K2129K4218K6372K8054
61497F75918K9145L0223L1910L4000L5609L6172L5912L5234L3993L1627K7891
61486A037634K3112J7819J2413P397L543J394N67O4n01m40Q73K832M272N038O031
$$ y = [261572, 265993, 270251, 274304, 278597, 283359, 288442, 293910, 300218, 307572, 315507, 323384, 331090, 339068, 347791, 357395, 367751, 378770, 390621, 403569, 417510, 431747, 445347, 457676, 468497, 477748, 485410, 491535, 496106, 498937, 499863, 499017, 496740, 493316, 489010, 484193, 479146, 473768, 467816, 461458, 455295, 449730, 444577, 439411, 434125, 429003, 424377, 420336, 416724, 413311, 409959, 406649, 403440, 400581, 398646, 398230, 399251, 400752, 401749, 402185, 402833, 404341, 406717, 409698, 413251, 417620, 423201, 430428, 439514, 450144, 461684, 473831, 486924, 501514, 517799, 535598, 554698, 575145, 597274, 621492, 647864, 675918, 705063, 735286, 767196, 801196, 836805, 872977, 908889, 944123, 978116, 1009743, 1037634, 1060746, 1078565, 1090978, 1098375, 1101918, 1103312, 1103879, 1103943, 1103442, 1103002, 1103875, 1106707, 1110979, 1116017, 1122048]
61471A122048P695R281R955R791R196Q021N885K945l20l791p548j1315j4640j7442
61457A129761j9819k1576k2436k2647k2676k2411k1242j8930j5807j2185q182
61446I21850m151n00L158P964J4481K1693K7730L1151L1274K7764K0633J0624
61434A113671p93j1950k1380k7946l1026l0797k8175k4247j9722j4808r512l934
61422H89381J758P494J3231J8756K3658K7430K9276K7816K1618J0569l393j7266
61410A050328k8724l6824m1520m3153m2407m0084l6705l2597k8325k4553k1425
61399F74011j8533j5623j2972j0888r313q136p375o774n716l979k232j229p61
61386E70480J3J349K679L577M344N409O683P929R334J1156J2955J3845J3644J3255
$$ y = [1122048, 1129743, 1139024, 1148979, 1158770, 1167966, 1175987, 1181872, 1184817, 1184497, 1180706, 1173158, 1161843, 1147203, 1129761, 1109942, 1088366, 1065930, 1043283, 1020607, 998196, 976954, 958024, 942217, 930032, 921850, 917699, 917199, 920357, 928321, 942802, 964495, 992225, 1023376, 1054650, 1082414, 1103047, 1113671, 1112878, 1100928, 1079548, 1051602, 1020576, 989779, 961604, 937357, 917635, 902827, 893315, 889381, 891139, 898633, 911864, 930620, 954278, 981708, 1010984, 1038800, 1060418, 1070987, 1067594, 1050328, 1021604, 984780, 943260, 900107, 857700, 817616, 780911, 748314, 719989, 695436, 674011, 655478, 639855, 626883, 615995, 606682, 598546, 591171, 584397, 578681, 574702, 572470, 571241, 570480, 570493, 571842, 574521, 578098, 582442, 587851, 594534, 602463, 611797, 622953, 635908, 649753, 663397, 676652]
61372F76652J3576J4406J4915J4878J4794J4789J4153J2327R774P372N300L143
61360H16079Q62j029k291l377m828o689q730j0807j2824j4566j5870j6776j7324
61347G01830j7439j7155j6704j6216j5510j4427j3175j2107j1311j0672j0209
61336E46905j0033r996r667q709p200n537m109l089k453k164k232k486k363j296
61322D75571N79K333L152L177L190L644M352N052N821O704P334P318O841O437
61308E41505O178N503M074K540J948K587L679M320M317M024L729L569L782M581
61294E96336N646O095N219L226J122j96o78r30j374j828j960j862j754j404m01
61279F05257Q87J397P54l5J95J321K353K979L771M962N931O217O277O724P262
$$ y = [676652, 690228, 704634, 719549, 734427, 749221, 764010, 778163, 790490, 800264, 807636, 812936, 816079, 816941, 815912, 813621, 810244, 805416, 798727, 789997, 779190, 766366, 751800, 735930, 719154, 701830, 684391, 667236, 650532, 634316, 618806, 604379, 591204, 579097, 567786, 557114, 546905, 536872, 526876, 517209, 508500, 501300, 495763, 491654, 488565, 486112, 483948, 481716, 479230, 476867, 475571, 476150, 478483, 481635, 484812, 488002, 491646, 495998, 501050, 506871, 513575, 520909, 528227, 535068, 541505, 547683, 553186, 557260, 559800, 561748, 564335, 568014, 572334, 576651, 580675, 584404, 587973, 591755, 596336, 601982, 608077, 613296, 616522, 617644, 617448, 616770, 615840, 614466, 612638, 610678, 608816, 607062, 605658, 605257, 606144, 607541, 608295, 608260, 608455, 609776, 612129, 615108, 618879, 623841, 629772, 635989, 642266, 648990, 656252]
61264F56252O971N501L554K114J510J309J095J153K212M432O964Q871J0285J2188
61250G24411J5120J8658K2315K6332L1236L6992M2910M8144N1737N2320M8249
61239A118424L8528K3863O847r109k1470k9506l3773l4978l3597l0186k5456j9968
61227I49619j4134q363k743L344J0557J8396K5256K9728L1216K9104K2379J0851
61215A105210l760j8628l1366m0479m5100m5373m2852l9464l5927l1761k6743
61204G43757k1544j6852j2725r136o480n055m482m091l590l044k494j982j716
61191F50566j783j889j762j746k508m062n502n942n506n097n425o435p618q495
61177E86796q803q541q021p617p330o755n670m471l761l682l849l878l735l644
$$ y = [656252, 663223, 668724, 672278, 674392, 675902, 677211, 678306, 679459, 681671, 686103, 693067, 701938, 712223, 724411, 739531, 758189, 780504, 806836, 838072, 875064, 917974, 966118, 1017855, 1070175, 1118424, 1156952, 1180815, 1187662, 1178553, 1157083, 1127577, 1093804, 1058826, 1025229, 995043, 969587, 949619, 935485, 927122, 924379, 927723, 938280, 956676, 981932, 1011660, 1042876, 1071980, 1094359, 1105210, 1101450, 1082822, 1051456, 1010977, 965877, 920504, 877652, 838188, 802261, 770500, 743757, 722213, 705361, 692636, 683500, 677020, 671965, 667483, 663392, 659802, 656758, 654264, 652282, 650566, 648783, 646894, 645132, 643386, 640878, 636816, 631314, 625372, 619866, 614769, 609344, 602909, 595291, 586796, 577993, 569452, 561431, 553814, 546484, 539729, 534059, 529588, 525827, 522145, 518296, 514418, 510683, 507039]
61163E07039l870m478n114n214m679m092l973m141m252m650n943p908r566j0379
61149D28780j0595j0422r689q582p857p825p872p450o887o621o302n457m479m175
61135C24567m558m887m742m336l866l285k683k346k272k150j823j439j053m76
61121B84651M27J522K531L207L542L897M712N867O614O526O169O362P022P276
61107C50325O598N396M407L918L605L007K100J420J431J784J696J150R25J228
61093C88990J086k11j861k577k318j977j906j771j591j717j860j361m81l02j095
61078C69048j858j798j338j178j239j109q37p14p14o56m87q8P88J985K805K826
61062C65436K500K593L249L956M282M302M371M680N079N396N789O607P820R015
$$ y = [507039, 503169, 498691, 493577, 488363, 483684, 479592, 475619, 471478, 467226, 462576, 456633, 448725, 439159, 428780, 418185, 407763, 398074, 389492, 381635, 373810, 365938, 358488, 351601, 344980, 338678, 333221, 328742, 324567, 320009, 315122, 310380, 306044, 302178, 298893, 296210, 293864, 291592, 289442, 287619, 286180, 285127, 284651, 285078, 286600, 289131, 292338, 295880, 299777, 304489, 310356, 316970, 323496, 329665, 336027, 343049, 350325, 356923, 362319, 366726, 370644, 374249, 377256, 379356, 380776, 382207, 383991, 385687, 386837, 387762, 388990, 390076, 389865, 388004, 385427, 383109, 381132, 379226, 377455, 375864, 374147, 372287, 370926, 370445, 370143, 369048, 367190, 365392, 364054, 362876, 361637, 360528, 359691, 358977, 358263, 357607, 357120, 357032, 357820, 359805, 362610, 365436, 367936, 370529, 373778, 377734, 382016, 386318, 390689, 395369, 400448, 405844, 411633, 418240, 426060, 435075]
61048D35075J0111J1506J3257J4758J5699J6582J7602J7945J7211J6727J8080
61037F04553K1005K4226K7726L2409L7871M2610M6440N0696N6097O2669P2028
61026A078330Q7072J08544J34276J62706J94670K31134K72831L24007L92891M86025
61016C472486O05814P54316R27226J089540J162179J059304P62645L59774m547
61007A0188737k22995k74976j96927l2071J73476L41613L69187J93622j46090
60998A0393576n25600q19021r70669r98314r48462q59032p52797o44479n43354
60989C331848m52861l73468l05849k50209k04810j67406j37183j13923r6320q2476
60979A147343p1217o2004n4261m7668m2348l8028l3743k9040k4685k1492j9248
$$ y = [435075, 445186, 456692, 469949, 484707, 500406, 516988, 534590, 552535, 569746, 586473, 604553, 625558, 649784, 677510, 709919, 747790, 790400, 836840, 887536, 943633, 1006302, 1078330, 1165402, 1273946, 1408222, 1570928, 1765598, 1996732, 2269563, 2593570, 2986461, 3472486, 4078300, 4832616, 5759842, 6849382, 8011561, 9070865, 9833510, 10193284, 10188737, 9965742, 9690766, 9493839, 9461768, 9635244, 9976857, 10346044, 10539666, 10393576, 9867976, 9048955, 8078286, 7079972, 6131510, 5272478, 4519681, 3875202, 3331848, 2878987, 2505519, 2199670, 1949461, 1744651, 1577245, 1440062, 1326139, 1229819, 1147343, 1076126, 1014122, 959861, 912193, 869845, 831817, 798074, 769034, 744349, 722857, 703609]
60968G03609j7378j5880j4867j3994j3118j2754j3114j3373j2749j1585j0534
60957E54263r422p898o575o323o738o544n370m148l765m154m777n180m960l935
60943D74474k535j571j459k017k939m022n016n746o380p127p727p729p180o551
60929D06475o026n316m232k953j626j38J507K901L605L630L340K963K342J219
60915D07691k56j438j776j425j033q93p19k56K91O28P18N12k09j374k330k516
60899C95615k150j877j937k106k227k345k461k536k708l142l762m289m476m169
60885C55430l377k434j736j114M0J710K820K422R12m73r76o26K89J282J549P63
60869C56481j57RJ142J901J580R20P78R30O10l66j545k509l102l334l373l509
$$ y = [703609, 686231, 670351, 655484, 641490, 628372, 615618, 602504, 589131, 576382, 564797, 554263, 544841, 536943, 530368, 524045, 517307, 510763, 505393, 501245, 497480, 493326, 488549, 483369, 478409, 474474, 471939, 470368, 468909, 466892, 463953, 459931, 454915, 449169, 442789, 435662, 427935, 420206, 413026, 406475, 400449, 395133, 390901, 387948, 386322, 386184, 387691, 390592, 394197, 397827, 401167, 404130, 406472, 407691, 407435, 405997, 404221, 402796, 401763, 400870, 400151, 399895, 400186, 400814, 401532, 402044, 401835, 400461, 398131, 395615, 393465, 391588, 389651, 387545, 385318, 382973, 380512, 377976, 375268, 372126, 368364, 364075, 359599, 355430, 352053, 349619, 347883, 346769, 346809, 348519, 351339, 353761, 354673, 354200, 353224, 352598, 352887, 354169, 355718, 356481, 356324, 356333, 357475, 359376, 360956, 361876, 362654, 363584, 364194, 363828, 362283, 359774, 356672, 353338, 349965, 346456]
60853C46456l817m038l900l324k347j150k35j24p35j386j519j177p03l94n17j210
60837C19880k177k894l245l635m322n095n720o189o291n550l975k408j656j656
60823B65067j853k019k210k189j553m17N28P10J89n18r28r34q35r19j051q76m14
60806B49778j38k53l80j55K60O10J050J765K435K665K696L025L523L574L116K835
60790B76406L166L618L381K304J061N16J029K140K855K579J738J292J535J753
60776C05373J136k84j770k643k750k419k152k183k218j805j061p29j316k435l231
60761B79513l257k713j976j345j083j351j992k602k931k995k819k330j620j088
60747B49411r93j052p83k54j29q43j982k748k845k595k308j940j416r04n33j66
$$ y = [346456, 342639, 338601, 334701, 331377, 329030, 327880, 327645, 327521, 326786, 325400, 323881, 322704, 322001, 321607, 321090, 319880, 317703, 314809, 311564, 307929, 303607, 298512, 292792, 286603, 280312, 274762, 270787, 268379, 266723, 265067, 263214, 261195, 258985, 256796, 255243, 254826, 255354, 256064, 256253, 255735, 254807, 253873, 253038, 252119, 251068, 250192, 249778, 249640, 249387, 249007, 248852, 249112, 249722, 250772, 252537, 254972, 257637, 260333, 263358, 266881, 270455, 273571, 276406, 279572, 283190, 286571, 288875, 289936, 290452, 291481, 293621, 296476, 299055, 300793, 302085, 303620, 305373, 306509, 306225, 304455, 301812, 299062, 296643, 294491, 292308, 290090, 288285, 287224, 286495, 285179, 282744, 279513, 276256, 273543, 271567, 270222, 269139, 267788, 265796, 263194, 260263, 257268, 254449, 252119, 250499, 249411, 248418, 247366, 246583, 246329, 246200, 245357, 243375, 240627, 237782, 235187, 232879, 230939, 229523, 228619, 228086, 227920]
60731B27920L18P87J061J168J090O22j90o95l17N25P70L6r28j312j234j346j857
60714B26418k395k637k626k523k391k238k078j899j699j529j444j483j704k080
60700A97692k362k268j866j511j322j029n09j26j77m12m32l24l72l51K85J501
60684A86417K534K779K397J892J456J013N36J44n4K9L98R40J507K034K367K178
60668B08567J365M67J89N59J026J370J857K411K429J821J432J852K476K478K191
60653B32490K584L697M586M739M527M170L289J820N13o8m31j390k848l902l992
60638B49784l448l000l155l925m807n154m730l889l065k327j619j086q52o21j6
60623B08090Q04J221Q79K9q16j301j357j141r22q03n96j58K52K68m1k23r1O7m4
$$ y = [227920, 228238, 229025, 230086, 231254, 232344, 232966, 232776, 232081, 231764, 232289, 233059, 233095, 232167, 230855, 229621, 228275, 226418, 224023, 221386, 218760, 216237, 213846, 211608, 209530, 207631, 205932, 204403, 202959, 201476, 199772, 197692, 195330, 193062, 191196, 189685, 188363, 187334, 186825, 186699, 186522, 186110, 185678, 185354, 184982, 184631, 184916, 186417, 188951, 191730, 194127, 196019, 197475, 198488, 199024, 199168, 199114, 199143, 199541, 200481, 201988, 204022, 206389, 208567, 209932, 210399, 210588, 211147, 212173, 213543, 215400, 217811, 220240, 222061, 223493, 225345, 227821, 230299, 232490, 235074, 238771, 243357, 248096, 252623, 256793, 260082, 261902, 262415, 262347, 261916, 260526, 257678, 253776, 249784, 246336, 243336, 240181, 236256, 231449, 226295, 221565, 217676, 214611, 212284, 210665, 209579, 208727, 208106, 208090, 208894, 210115, 210994, 211023, 210207, 208906, 207549, 206408, 205486, 204683, 204087, 203929, 204181, 204449, 204408, 204185, 204094, 204161, 204117]
60604B04117l69p57j214j662j757j280n96l20n73q77q64p39q81j195j274j067
60588A88692r77j161j147m83M43P41J82m41l04M42R94R19N30L12M27P98J327J881
60570A93175K211K131J775J570J907K726L443L474K929K651L261M324M837M526
60556B34940M270M962O411P712Q471R178J0424J2232J4365J6806J9591K2383K4687
60543C96432K6260K6967K6223K3169J7666J0689L490l331r666j5189j9301k1707
60531D61702k2574k2206k0978j9468j8102j6610j4324j1222q199o009m436k844
60519B94730j198jO55J412K921N077P179Q720R973J1703J4322J7487K0659K3849
60505D17488K7299L0440L1720K9869K5069J8699J2209O414J597k112m443m926
$$ y = [204117, 203748, 202991, 201777, 200115, 198358, 197078, 196482, 196162, 195589, 194712, 193848, 193109, 192228, 191033, 189759, 188692, 187715, 186554, 185407, 184924, 185367, 186108, 186290, 185849, 185545, 185987, 186981, 187900, 188430, 188742, 189169, 189967, 191294, 193175, 195386, 197517, 199292, 200862, 202769, 205495, 208938, 212412, 215341, 217992, 221253, 225577, 230414, 234940, 239210, 244172, 250583, 258295, 266766, 275944, 286368, 298600, 312965, 329771, 349362, 371745, 396432, 422692, 449659, 475882, 499051, 516717, 527406, 530896, 527565, 517899, 502710, 483409, 461702, 439128, 416922, 395944, 376476, 358374, 341764, 327440, 316218, 308019, 302010, 297574, 294730, 293532, 293531, 294186, 295598, 298519, 303596, 310775, 319495, 329468, 341171, 355493, 372980, 393639, 417488, 444787, 475227, 506947, 536816, 561885, 580584, 592793, 599207, 600804, 598692, 594249, 589323]
60493E89323l406m88K852O207R655J2571J3341J0828N671n80p051j3703k0307
60480F04913k6144l0561l3035l2988l0437k6739k3709k1825k0068j7627j4958
60469C26822j2924j1680j0839j0031q897p123m996l455l121l534l763l463k940
60456B40056k481k054j595j246j262j699k187k191j660j198j208j196m89N40Q72
60441B21002L87Q4N38J158J385J638K379L059K924K267K048K562L287L735L801
60426B52254L419K617J755J159O10k34j130j461j078l49M40J200J755K021K328
60411B65306L059L954M378M200L897L901M240M795N355N606N501N615O526P934
60397C34267Q910Q998Q630Q465Q799R557J0309J0434R733Q854Q475Q343P748O769
$$ y = [589323, 585917, 585429, 588281, 594488, 604143, 616714, 630055, 640883, 646554, 645974, 638923, 625220, 604913, 578769, 548208, 515173, 482185, 451748, 425009, 401300, 379475, 359407, 341780, 326822, 313898, 302218, 291379, 281348, 272451, 265328, 260332, 256877, 253756, 250222, 246459, 242996, 240056, 237575, 235521, 233926, 232680, 231418, 229719, 227532, 225341, 223681, 222483, 221275, 220079, 219590, 220130, 221002, 221389, 221473, 222011, 223169, 224554, 226192, 228571, 231630, 234554, 236821, 238869, 241431, 244718, 248453, 252254, 255673, 258290, 260045, 261204, 261814, 261580, 260450, 258989, 257911, 257562, 258002, 259202, 260957, 262978, 265306, 268365, 272319, 276697, 280897, 284794, 288695, 292935, 297730, 303085, 308691, 314192, 319807, 326333, 334267, 343177, 352175, 360805, 369270, 378069, 387626, 397935, 408369, 418102, 426956, 435431, 443774, 451522, 458291]
60383D58291O201O215O081N340M354L473K599J905J961K628K773J832Q34R40J697
60368E07124J761R39L29N81J120J222R18N36J82J7M10J307J953J754J043M50k16
60351E21430j772m316o817q285q880r414j0124j0578j0636j0760j1154j1230j0443
60338D07021r185q263p799p269o505n952n875n930n753n443n154m709l954l199
60324C22031k876k974l082k926k621k425k380k152j346p5R34J142R55J241K210
60309C05656L365M543O130Q047R293R063P694N925L811J077j872m254n942p462
60295C45074q923r834r961r681r188q108o281m374l244k871k489j596n11J85M16
60280B68614N91R35J114P65J95J39Q30J654K011K090K416K983L378L564L978M743
$$ y = [458291, 464492, 470707, 476788, 482128, 486482, 489955, 492554, 494459, 496420, 499048, 501821, 503653, 504487, 505427, 507124, 508885, 509824, 510153, 510734, 511854, 513076, 513994, 514530, 514712, 514729, 515139, 516446, 518399, 520153, 521196, 521646, 521430, 519658, 515342, 508525, 500240, 491360, 481946, 471822, 461244, 450608, 439848, 428694, 417464, 407021, 397836, 389573, 381774, 374505, 368000, 362048, 356173, 350243, 344490, 339047, 333893, 329184, 325230, 322031, 319155, 316181, 313099, 310173, 307552, 305127, 302747, 300595, 299249, 299174, 300108, 301250, 302205, 303446, 305656, 309021, 313564, 319694, 327741, 337034, 346097, 353791, 359716, 363527, 364604, 362732, 358478, 352536, 345074, 336151, 326317, 316356, 306675, 297487, 289379, 283098, 278724, 275480, 272609, 270120, 268524, 268013, 268198, 268614, 269205, 270140, 271254, 272019, 272214, 272353, 273183, 274837, 276848, 278938, 281354, 284337, 287715, 291279, 295257, 300000]
60264C00000N360N359M898M504M493M833N349N795N854N243L998K534J464J100
60250C60784J086P21k16j135j383j082q80j051j300j373j283q94J56J889L720
60235C57759N012N631N864O130O907Q440J0288J1591J2130J2665J3805J5001J5353
60222D86576J5085J5421J6986J9085K0740K1782K2553K3091K3203K3038K3061
60211G10621K3489K4135K4739K5112K5012K4236K2944K1619K0568J9699J8806
60200I60980J7836J6781J5560J4170J2769J1427J0063Q751P880P659P664P265
60188A098805O430N806O000P122Q917J1008J2919J4297J5243J6135J7056J7753
60176A237491J8143J8461J8660J8199J6731J4602J2334R921P078L876N97k788
$$ y = [300000, 305360, 310719, 315617, 320121, 324614, 329447, 334796, 340591, 346445, 351688, 355686, 358220, 359684, 360784, 361870, 362591, 362375, 361240, 359857, 358775, 357895, 356844, 355544, 354171, 352888, 351994, 352150, 354039, 357759, 362771, 368402, 374266, 380396, 387303, 395743, 406031, 417622, 429752, 442417, 456222, 471223, 486576, 501661, 517082, 534068, 553153, 573893, 595675, 618228, 641319, 664522, 687560, 710621, 734110, 758245, 782984, 808096, 833108, 857344, 880288, 901907, 922475, 942174, 960980, 978816, 995597, 1011157, 1025327, 1038096, 1049523, 1059586, 1068337, 1076217, 1083876, 1091540, 1098805, 1105235, 1111041, 1117041, 1124163, 1133080, 1144088, 1157007, 1171304, 1186547, 1202682, 1219738, 1237491, 1255634, 1274095, 1292755, 1310954, 1327685, 1342287, 1354621, 1364542, 1371620, 1375496, 1376093, 1373305]
60164A373305o523j0521j4397j7922k0954k3079k3898k3664k3021k2075k0334
60153A166917j7784j5349j3889j3218j2522j1428j0141q819p314n609m113l370
60141A043361l618m589n769o892q153r776j1412j2384j2612j2901j3940j5358
60129I25957j6148j5809j4706j3415j2192j1044r872q424o382l746r87J265K718
60116H17215L674M862O889R663J2492J4815J6729J8694K0967K3533K6237K8498
60104A004268K9338K8363K6635K5686K5597K4811K2217J8552J5102J1829P733
60093A240131K738j992n681q930j2687j6944k0940k4172k6568k8066k8636k8622
60081A039631k8522k8371k7698k6144k3860k1355j9139j7463j6116j4547j2449
$$ y = [1373305, 1366782, 1356261, 1341864, 1323942, 1302988, 1279909, 1256011, 1232347, 1209326, 1187251, 1166917, 1149133, 1133784, 1119895, 1106677, 1094155, 1082727, 1072586, 1063767, 1056453, 1050844, 1046731, 1043361, 1039743, 1035154, 1029385, 1022493, 1014340, 1004564, 993152, 980768, 968156, 955255, 941315, 925957, 909809, 894000, 879294, 865879, 853687, 842643, 832771, 824347, 817965, 814219, 813232, 814497, 817215, 820889, 825751, 832640, 842303, 854795, 869610, 886339, 905033, 926000, 949533, 975770, 1004268, 1033606, 1061969, 1088604, 1114290, 1139887, 1164698, 1186915, 1205467, 1220569, 1232398, 1240131, 1242869, 1240877, 1235196, 1226266, 1213579, 1196635, 1175695, 1151523, 1124955, 1096889, 1068253, 1039631, 1011109, 982738, 955040, 928896, 905036, 883681, 864542, 847079, 830963, 816416, 803967]
60070H03967j0197q392p019n505l587j662q4J299K618L474L442K836K361K169
60056G85720J747P47o36k160l842n550o774p219p334p835q868j0062j1260j2732
60042G03942j4473j5734j5647j4226j2432j1167j0396r403p766n765l825j864
60030E81244M78L115N433P076Q458J0265J2615J5041J7179J9109K0922K2327K2952
60017G46214K2770K2024K0800J8983J6569J3759J0639P070K990j325n500r416
60005H65577j3113j6369j8693j9779j9853j9420j8757j7756j6218j4244j2262
59994F79113j0652r313p709n407k556K76K703M849P072R605J2500J5734J9173
59981G15388K2455K5103K6857K7846K8362K8470K7915K6461K4252K1675J8938
$$ y = [803967, 793770, 785378, 778359, 772854, 769267, 767605, 767521, 768820, 771438, 774912, 778354, 781190, 783551, 785720, 787467, 788214, 787578, 785418, 781576, 776026, 769252, 762033, 754699, 746864, 737996, 727934, 716674, 703942, 689469, 673735, 658088, 643862, 631430, 620263, 609867, 600464, 592698, 586933, 583108, 581244, 581722, 584837, 590270, 597346, 605804, 616069, 628684, 643725, 660904, 680013, 700935, 723262, 746214, 768984, 791008, 811808, 830791, 847360, 861119, 871758, 878828, 881818, 880493, 874993, 865577, 852464, 836095, 817402, 797623, 777770, 758350, 739593, 721837, 705619, 691375, 679113, 668461, 659148, 651439, 646032, 643476, 643752, 646455, 651304, 658376, 667981, 680481, 696215, 715388, 737843, 762946, 789803, 817649, 846011, 874481, 902396, 928857, 953109, 974784, 993722]
59970I93722J5988J2879R888P052L913J13l918p315r801j1827j3717j5155j5708
59957I66114j5452j4791j4022j3277j2582j1644r945p372m484j836O65L330O020
59944H70724Q374J0533J3004J5773J8097J9343J9630J9522J9401J9317J9208J9046
59932A071972J8817J8426J7632J6278J4639J3291J2416J1499J0019Q264P076P016
59920A227345Q056R809J1608J2700J2954J3197J4220J5688J6698J7188J7788J8307
59908A395558J7580J5193J2295J0038Q059N310J616k394o397j0387j3884j6151
59896A416436j7200j7850j8670j9428j9595j8895j7300j5022j2596j0526q824
59885A240530p159n385l586j667N42K866M919O597Q031R148R868J0704J2446J5125
$$ y = [993722, 1009710, 1022589, 1032477, 1039529, 1043442, 1043555, 1039637, 1032322, 1022521, 1010694, 996977, 981822, 966114, 950662, 935871, 921849, 908572, 895990, 884346, 874401, 867029, 862545, 860709, 861374, 864704, 870724, 879098, 889631, 902635, 918408, 936505, 955848, 975478, 995000, 1014401, 1033718, 1052926, 1071972, 1090789, 1109215, 1126847, 1143125, 1157764, 1171055, 1183471, 1194970, 1204989, 1213253, 1220329, 1227345, 1235401, 1245210, 1256818, 1269518, 1282472, 1295669, 1309889, 1325577, 1342275, 1359463, 1377251, 1395558, 1413138, 1428331, 1440626, 1450664, 1458723, 1464033, 1465649, 1463255, 1456858, 1446471, 1432587, 1416436, 1399236, 1381386, 1362716, 1343288, 1323693, 1304798, 1287498, 1272476, 1259880, 1249354, 1240530, 1233371, 1227986, 1224400, 1222733, 1223275, 1226141, 1231060, 1237657, 1245688, 1254836, 1264704, 1275408, 1287854, 1302979]
59871A302979J7864J9997K1717K3391K4901K6114K7414K9155L0898L1763L1360
59860A587553K9965K7945K5565K3128K0705J7746J3485P839J486n124j2243k0010
59848A718040k7529l3239l6173l6525l5062l2336k8630k4325j9999j6197j3198
59837A414827j0998r293p511n093j926J520M635P239R670J2322J5219J8119K1028
59824A469758K4415K8774L3936L9019M3196M6390M8984N0958N1633N0367M7217
59813A934647M2770L7539L1738K5437J8748J1956N613L17l769p044r938j2487
59801B075527j4651j6782j9420k2668k6165k9576l2786l5698l8195m0310m2062
59790A757214m3208m3555m3503m3712m4161m4021m2638m0250l7441l4421l1157
$$ y = [1302979, 1320843, 1340840, 1362557, 1385948, 1410849, 1436963, 1464377, 1493532, 1524430, 1556193, 1587553, 1617518, 1645463, 1671028, 1694156, 1714861, 1732607, 1746092, 1753931, 1755417, 1750293, 1738050, 1718040, 1690511, 1657272, 1621099, 1584574, 1549512, 1517176, 1488546, 1464221, 1444222, 1428025, 1414827, 1403829, 1394536, 1387025, 1381932, 1380006, 1381526, 1386161, 1393400, 1403070, 1415392, 1430611, 1448730, 1469758, 1494173, 1522947, 1556883, 1595902, 1639098, 1685488, 1734472, 1785430, 1837063, 1887430, 1934647, 1977417, 2014956, 2046694, 2072131, 2090879, 2102835, 2108448, 2108765, 2104996, 2097952, 2088014, 2075527, 2060876, 2044094, 2024674, 2002006, 1975841, 1946265, 1913479, 1877781, 1839586, 1799276, 1757214, 1714006, 1670451, 1626948, 1583236, 1539075, 1495054, 1452416, 1412166, 1374725, 1340304, 1309147]
59779A309147k7832k4675k1604j8361j4891j1217p262l204K39K479L962N872Q829
59766A201482J2268J5235J7339J8853K0306K2230K4973K8324L1429L3409L3955
59755A459803L3098L0483K5251J6873O043n296j4879k1323k4748k6361k7259k7611
59743A424074k7021k5563k4079k3252k2740k1647j9806j8028j6961j6202j4920
59732A193855j3050j1260r797q091n674l005r26M35J759L639O009Q463J0806J3114
59718A186277J5539J8217K1264K4575K7806L0700L3532L6954M1320M6289N1144
59707A533617N5399N8942O1784O3934O5464O6294O5892O3519N9091N3469M7641
59696B195046M1828L5747K9504K3607J8256J3279Q990O386N996O910P453O796
$$ y = [1309147, 1281315, 1256640, 1235036, 1216675, 1201784, 1190567, 1183305, 1180101, 1180340, 1182819, 1186781, 1192653, 1201482, 1213750, 1228985, 1246324, 1265177, 1285483, 1307713, 1332686, 1361010, 1392439, 1425848, 1459803, 1492901, 1523384, 1548635, 1565508, 1571551, 1566255, 1551376, 1530053, 1505305, 1478944, 1451685, 1424074, 1397053, 1371490, 1347411, 1324159, 1301419, 1279772, 1259966, 1241938, 1224977, 1208775, 1193855, 1180805, 1169545, 1159748, 1151657, 1145983, 1142978, 1142052, 1142487, 1144246, 1147885, 1153894, 1162357, 1173163, 1186277, 1201816, 1220033, 1241297, 1265872, 1293678, 1324378, 1357910, 1394864, 1436184, 1482473, 1533617, 1589016, 1647958, 1709742, 1773676, 1839140, 1905434, 1971326, 2034845, 2093936, 2147405, 2195046, 2236874, 2272621, 2302125, 2325732, 2343988, 2357267, 2366257, 2372643, 2378639, 2385549, 2393002, 2399798]
59684B399798N558M901N298O158O432N606M189L115K729K692K877L837N913Q450
59670B467553J0477J1951J3708J6324J9659K3438K7578L1815L5638L8860M1660
59659B738661M3838M4569M3316M0555L7082L3011K7927K1724J4674O834j985j1617
59647C038589k1399l0760l9534m7592n4558o0105o4237o7026o8202o7254o3984
59636B453938n8908n3122m7865m4017m1891m1481m2956m6856n3563o2454p1601
59625A889224p8660q2266q2600q0518p6433p0351o2820n5132m8316m2313l6480
59614A173335l0579k4929j9866j5625j2623j1333j1708j2998j4264j4896j4822
59603I89692j4425j4193j4117j3591j2247j0663r678r206q406p057n871n234m457
$$ y = [2399798, 2405356, 2410257, 2415555, 2421713, 2428145, 2433751, 2437940, 2441055, 2443784, 2446476, 2449353, 2453190, 2459103, 2467553, 2478030, 2489981, 2503689, 2520013, 2539672, 2563110, 2590688, 2622503, 2658141, 2697001, 2738661, 2782499, 2827068, 2870384, 2910939, 2948021, 2981032, 3008959, 3030683, 3045357, 3052191, 3050206, 3038589, 3017190, 2986430, 2946896, 2899304, 2844746, 2784641, 2720404, 2653378, 2585176, 2517922, 2453938, 2395030, 2341908, 2294043, 2250026, 2208135, 2166654, 2123698, 2076842, 2023279, 1960825, 1889224, 1810564, 1728298, 1645698, 1565180, 1488747, 1418396, 1355576, 1300444, 1252128, 1209815, 1173335, 1142756, 1117827, 1097961, 1082336, 1069713, 1058380, 1046672, 1033674, 1019410, 1004514, 989692, 975267, 961074, 946957, 933366, 921119, 910456, 900778, 891572, 883166, 876109, 870238, 865004, 860547]
59590H60547k937j322o64q19o38L37J157O97j065l248n105o494p609q633r565
59575H14639j0158j0030r087p791o883o656o573n759m019k057n45P27K351M160
59561G52319N347N796O518Q305J0665J2649J4179J5773J7403J8572J9329K0288
59549I07143K1624K2851K3709K4487K5403K6521K8373L1496L4722L4946K9754
59538A211029K0139R858K278j724l117l003j839J28K244L446L020J194j231l863
59524A238559o881j0277j3455j5848j7509j8761j9739k0572k1492k2401k2748
59513A048876k2346k1801k1645k1544k0920j9921j8945j7665j5427j2447r697
59502H46518p624n793l814j786K52K535N051P487R844J2396J4959J6961J8461
$$ y = [860547, 857610, 856288, 855624, 854805, 854167, 854504, 855661, 856358, 855293, 852045, 846940, 840446, 832837, 824204, 814639, 804481, 794451, 785364, 777573, 770690, 764034, 757461, 751702, 747683, 745626, 745081, 745808, 748159, 752319, 757666, 763462, 769980, 778285, 788950, 801599, 815778, 831551, 848954, 867526, 886855, 907143, 928767, 951618, 975327, 999814, 1025217, 1051738, 1080111, 1111607, 1146329, 1181275, 1211029, 1231168, 1241026, 1243304, 1241580, 1238463, 1235460, 1233621, 1233749, 1235993, 1239439, 1242459, 1243653, 1242422, 1238559, 1231678, 1221401, 1207946, 1192098, 1174589, 1155828, 1136089, 1115517, 1094025, 1071624, 1048876, 1026530, 1004729, 983084, 961540, 940620, 920699, 901754, 884089, 868662, 856215, 846518, 838894, 833101, 829287, 827501, 827753, 830288, 835339, 842826, 852670, 865066, 880025, 896986, 915447]
59489I15447K0216K2438K4296K5102K5181K5025K4351K2710K0425J8022J5202
59478A158415J1255O288J197l499q007j2423j6209j8742j9950k0196j9897j9270
59466A038962j8274j6744j4751j2745j1050r455p633n826m657m280m191l922l522
59453I21912l273l283l589m374n846p963j0359j2561j4292j5605j6670j7435j7674
59440G88988j7453j7189j7082j6785j5941j4801j3870j3184j2391j1403j0497
59429F28392r811r201q562p892p061n925m576l108j219J404M431P357J0463J4230
59415F08922J7454J7158J1515K432n779j0110j0598q798n797j935K680Q089J4139
59402F39372J9338K0647J5767N884m651j1871j5017j5643j4931j2914r813o742
$$ y = [915447, 935663, 958101, 982397, 1007499, 1032680, 1057705, 1082056, 1104766, 1125191, 1143213, 1158415, 1169670, 1175958, 1177155, 1173656, 1165649, 1153226, 1137017, 1118275, 1098325, 1078129, 1058232, 1038962, 1020688, 1003944, 989193, 976448, 965398, 955943, 948310, 942484, 937827, 933547, 929356, 925434, 921912, 918639, 915356, 911767, 907393, 901547, 893584, 883225, 870664, 856372, 840767, 824097, 806662, 788988, 771535, 754346, 737264, 720479, 704538, 689737, 675867, 662683, 650292, 638889, 628392, 618581, 609380, 600818, 592926, 585865, 579940, 575364, 572256, 571037, 572441, 576872, 584229, 594692, 608922, 626376, 643534, 655049, 657481, 651702, 641592, 630994, 622196, 616399, 614464, 617144, 625233, 639372, 658710, 679357, 695124, 701008, 696357, 684486, 669469, 653826, 638895, 625981, 616168, 609426]
59390F09426m462k398L71L610O196P670Q716J0069J1634J2894J3743J4605J5951
59377G08025J7859J9899K1392K2077K2495K3444K4976K6357K7060K7293K7388
59366I68265K7060K5678K3057J9669J6208J3236J1090R821R245R196R668J0706
59354A152899J2300J4462J7210K0398K3770K7240L0879L4562L7977M1039M3887
59343A456623M6357M7930M8395M8088M7104M4903M1170L6606L2127K7702K2726
59332A899731J7344J2432Q334M405Q4m344q305j1689j4733j7647k0580k3585k6393
59319A815054k8672l0722l3516l7693m2887m8174n2725n5846n7025n6444n4954
59308A316396n3141n0725m7387m3620m0133l6819l3055k8861k4928k1571j8404
$$ y = [609426, 604964, 602566, 602937, 606547, 612743, 620413, 629129, 639198, 650832, 663726, 677469, 692074, 708025, 725884, 745783, 767175, 789252, 811747, 835191, 860167, 886524, 913584, 940877, 968265, 995325, 1021003, 1044060, 1063729, 1079937, 1093173, 1104263, 1114084, 1123329, 1132525, 1142193, 1152899, 1165199, 1179661, 1196871, 1217269, 1241039, 1268279, 1299158, 1333720, 1371697, 1412736, 1456623, 1502980, 1550910, 1599305, 1647393, 1694497, 1739400, 1780570, 1817176, 1849303, 1877005, 1899731, 1917075, 1929507, 1937841, 1942246, 1942330, 1937986, 1929681, 1917992, 1903259, 1885612, 1865032, 1841447, 1815054, 1786382, 1755660, 1722144, 1684451, 1641564, 1593390, 1540665, 1484819, 1427794, 1371350, 1316396, 1263255, 1212530, 1165143, 1121523, 1081390, 1044571, 1011516, 982655, 957727, 936156, 917752]
59297I17752j5214j2457j0555r244p870o125m197k510j364o84n7P22J174P29k92
59282H49808q40m60J73L23K07M47J024J415J571K047L173M645O030P224Q304R250
59266H94341R984J0361J0058Q718O429L810J392r04l518o608r893j3061j5951
59253H95158j8328j9828k0359k0446k0758k1313k1453k0752j9675j8984j8680
59242F74582j8005j6496j4645j3308j2766j2568j2115j1099r583p957o745o199
59230E33096o047n743m973l783k407j143k81J08L41Q56J728K594L026K887K340
59215E22599J742J467J736K517L718N340P290R107J0253J0801J1494J2931J4832
59202F15827J6425J7441J8474K0205K2584K4998K7141K9341L1942L4701L7052
$$ y = [917752, 902538, 890081, 879526, 870282, 862412, 856287, 852090, 849580, 848216, 847532, 847475, 848197, 849371, 850100, 849808, 848968, 848508, 848681, 849004, 849211, 849658, 850682, 852097, 853668, 855715, 858888, 863533, 869563, 876787, 885091, 894341, 904325, 914686, 924744, 933462, 939891, 943701, 945093, 944189, 940671, 934063, 924170, 911109, 895158, 876830, 857002, 836643, 816197, 795439, 774126, 752673, 731921, 712246, 693262, 674582, 656577, 640081, 625436, 612128, 599362, 586794, 574679, 563580, 553997, 546040, 539295, 533096, 527049, 521306, 516333, 512550, 510143, 509000, 508719, 508827, 509168, 510024, 511752, 514346, 517372, 520259, 522599, 524341, 525808, 527544, 530061, 533779, 539119, 546409, 555516, 565769, 576570, 588064, 600995, 615827, 632252, 649693, 668167, 688372, 710956, 735954, 763095, 792436, 824378, 859079, 896131]
59191H96131L8771M0023M0937M1514M1874M1994M1236L8675L4142K8412K2116
59180A305825J5105P246p35p875j3960j9241k3626k6923k9548l2000l3793l3912
59168A106563l2395l0420k8680k6655k3847k0714j7817j4878j1430p775m505j645
59156H85802J027L309N023O747R143J1698J3075J2766J1736J1228J1562J2204
59144I95320J2510J2126J1131R947Q931P996O814N289L577J852M12k48L3O36Q53
59129A077179Q45J306K316L304M137N294O780P798P938P820Q014Q007P018N236
59115A152992L463J895J56j746l379m789o586q951j1255j2911j4049j5020j5794
59102A064026j6279j6804j7737j8724j8853j7655j5778j4390j3982j3855j2917
$$ y = [896131, 934902, 974925, 1015862, 1057376, 1099250, 1141244, 1182480, 1221155, 1255297, 1283709, 1305825, 1320930, 1328176, 1327441, 1319566, 1305606, 1286365, 1262739, 1235816, 1206268, 1174268, 1140475, 1106563, 1074168, 1043748, 1015068, 988413, 964566, 943852, 926035, 911157, 899727, 891952, 887447, 885802, 886829, 890138, 895161, 901908, 911051, 922749, 935824, 948590, 960326, 971554, 983116, 995320, 1007830, 1019956, 1031087, 1041034, 1049965, 1057961, 1064775, 1070064, 1073641, 1075493, 1075905, 1075657, 1075690, 1076326, 1077179, 1078024, 1079330, 1081646, 1084950, 1089087, 1094381, 1101161, 1108959, 1116897, 1124717, 1132731, 1140738, 1147756, 1152992, 1156455, 1158350, 1158506, 1156760, 1153381, 1148592, 1142006, 1133055, 1121800, 1108889, 1094840, 1079820, 1064026, 1047747, 1030943, 1013206, 994482, 975629, 957974, 942196, 927806, 913824, 899969, 887052]
59091H87052j1032r327q944r603r865q802p041n858n672n841n657n039m220l289
59077G86862k302j487r89n61J37R61J265O70l88j025q82m63m88j029j563j822
59061G76896k231l218m374m789m242l549l548m163m767n094n256n125m372l134
59047G19034k112j849k342l324m500n384n492m999m687m947n316n333n331n808
59033F57610o481o669o354o096o019n638m751l847l387l261l084k595j702n80
59019E97146J89J09m54n50J04P37O38O4l65n83q09q73m48K99R17J373J942K534
59001F01970K752K620K678L174L732L935L925M095M593N324O292P583R136J0620
58987F72429J1740J2566J3567J5187J7286J9218K0594K1788K3490K5885K8612
$$ y = [887052, 876020, 866693, 857749, 848146, 838281, 829479, 822438, 816580, 810908, 805067, 799410, 794371, 790151, 786862, 784560, 783073, 782084, 781523, 781660, 782621, 783886, 784556, 784168, 783143, 782261, 781798, 781310, 780281, 778718, 776896, 774665, 771447, 767073, 762284, 758042, 754493, 750945, 746782, 742015, 736921, 731665, 726540, 722168, 719034, 716922, 715073, 712731, 709407, 704907, 699523, 694031, 689032, 684345, 679398, 674082, 668749, 663418, 657610, 651129, 644460, 638106, 632010, 625991, 620353, 615602, 611755, 608368, 605107, 602023, 599428, 597726, 597146, 597335, 597444, 596990, 596440, 596544, 597281, 597919, 597983, 597618, 597035, 596226, 595353, 594905, 595204, 596121, 597494, 599436, 601970, 604722, 607342, 610020, 613194, 616926, 620861, 624786, 628881, 633474, 638798, 645090, 652673, 661809, 672429, 684169, 696735, 710302, 725489, 742775, 761993, 782587, 804375, 827865, 853750, 882362]
58976H82362L1360L4047L6371L7648L7434L6082L4380L2714L0741K7881K3947
58965A244967J9183J3864Q053J907m028r161j3464j7318k0688k2989k4070k4797
58953A151459k5984k7169k7175k5789k3997k2535k1143j9508j8078j7259j6460
58942I06362j4741j2127r591p880o973o536o229n558m128k196m60Q33K140L786
58928H36702N366O340O832P402Q271R206J0081J1158J2757J4881J7291J9805K2501
58915I88593K5612K9223L3070L6767M0261M3880M7768N1319N3328N2560M8121
58904A450502L9686K7852J4310J297r403j6892k0928k1661j9758j6342j2346q032
58892A408285l301J726O648J1240J5515J9372K2487K4823K6979K9812L3671L8109
$$ y = [882362, 913722, 947769, 984140, 1021788, 1059222, 1095304, 1129684, 1162398, 1193139, 1221020, 1244967, 1264150, 1278014, 1286067, 1287974, 1283946, 1274785, 1261321, 1244003, 1223315, 1200326, 1176256, 1151459, 1125475, 1098306, 1071131, 1045342, 1021345, 998810, 977667, 958159, 940081, 922822, 906362, 891621, 879494, 869903, 862023, 855050, 848514, 842285, 836727, 832599, 830403, 829943, 830776, 832916, 836702, 842068, 848408, 855240, 862642, 870913, 880119, 890200, 901358, 914115, 928996, 946287, 966092, 988593, 1014205, 1043428, 1076498, 1113265, 1153526, 1197406, 1245174, 1296493, 1349821, 1402381, 1450502, 1490188, 1518040, 1532350, 1533647, 1524244, 1507352, 1486424, 1464763, 1445005, 1428663, 1416317, 1408285, 1404984, 1406710, 1413358, 1424598, 1440113, 1459485, 1481972, 1506795, 1533774, 1563586, 1597257, 1635366]
58880A635366M2327M5850M8646N0627N1015M8425M1763L1175J8105M398q490j9619
58868A989588k8274l3994l6836l7418l6529l4836l2899l1290l0400l0160l0071
58857A626881k9674k9022k8624k8875k9569l0047k9899k9363k8933k8757k8593
58846A305525k8344k8238k8359k8307k7665k6589k5629k4978k4335k3436k2300
58835A017345k0881j8961j6711j4841j3707j2666j0937q836p406o831o110m521
58823H74937k623j287l95P65K291L638M658N755O993P818P993Q032Q331Q403P559
58808I42868O041M827M345L987K981J415O6n29n82o46q65q53j99J036K470L907
58792I70269N437P092Q683J0081J1451J3000J4727J6509J8325K0141K1723K2779
$$ y = [1635366, 1677693, 1723543, 1772189, 1822816, 1873831, 1922256, 1964019, 1995194, 2013299, 2017697, 2009207, 1989588, 1961314, 1927320, 1890484, 1853066, 1816537, 1781701, 1748802, 1717512, 1687112, 1656952, 1626881, 1597207, 1568185, 1539561, 1510686, 1481117, 1451070, 1421171, 1391808, 1362875, 1334118, 1305525, 1277181, 1248943, 1220584, 1192277, 1164612, 1138023, 1112394, 1087416, 1063081, 1039645, 1017345, 996464, 977503, 960792, 945951, 932244, 919578, 908641, 899805, 892399, 885568, 879458, 874937, 872314, 871027, 870632, 871397, 873688, 877326, 881984, 887739, 894732, 902550, 910543, 918575, 926906, 935309, 942868, 948909, 953736, 958081, 962068, 965049, 966464, 966530, 966001, 965419, 964773, 963908, 963055, 962856, 963892, 966362, 970269, 975706, 982798, 991481, 1001562, 1013013, 1026013, 1040740, 1057249, 1075574, 1095715, 1117438, 1140217]
58780A140217K3274K3393K3262K2875K2247K1389K0163J8330J5861J3035J0173
58769A354219P349M399J133k405n815q555j0490j2102j3899j5678j6788j7170
58757A264198j7693j9075k0946k2327k2832k2827k2590k2017k1284k1058k1597
58746A029952k2116k1624k0122j8475j7222j6189j5154j4263j3507j2480j1045
58735H47755r827r471r676r504q568p386o511n863n084m157l263k261o63J854
58721G67375N101Q511J1531J4009J6408J9538K3795K8607L2797L5558L6842L6687
58709A036759L4482K9196K0296Q265n617j9603l1767m0578m5627m7526m6975m4352
58697H46953m0317l6163l2778k9614k5524k0569j6068j2736r674n711r67L523
$$ y = [1140217, 1163491, 1186884, 1210146, 1233021, 1255268, 1276657, 1296820, 1315150, 1331011, 1344046, 1354219, 1361568, 1365967, 1367100, 1364695, 1358880, 1350325, 1339835, 1327733, 1313834, 1298156, 1281368, 1264198, 1246505, 1227430, 1206484, 1184157, 1161325, 1138498, 1115908, 1093891, 1072607, 1051549, 1029952, 1007836, 986212, 966090, 947615, 930393, 914204, 899050, 884787, 871280, 858800, 847755, 837928, 828457, 818781, 809277, 800709, 793323, 786812, 780949, 775865, 771708, 768445, 766184, 765521, 767375, 772476, 780987, 792518, 806527, 822935, 842473, 866268, 894875, 927672, 963230, 1000072, 1036759, 1071241, 1100437, 1120733, 1128998, 1123381, 1103778, 1072011, 1031433, 985806, 938280, 891305, 846953, 806636, 770473, 737695, 708081, 682557, 661988, 645920, 633184, 623510, 617799, 616832, 620355]
58685F20355P311J0847J4610J8543K2266K5218K6571K5414K1172J3747L639p750
58673H01943j8314k6385l1610l4337l4557l2168k8092k4078k1185j9069j7006
58662E15142j4882j2902j1070r423q364q123q244p985p156o145n311m655m002
58649D06880l254k564k241k349k393j783p09m6k17n53j95Q31J791K268K444K638
58633D00548K971L463M015M321M114L544L067K978L203L477L524L123K197Q79
58619D45424n76j864k645k732k381k116k050j699o49P47J639J492M73p28j281
58604D31054p22N79J601J690J235J129J684K439K868K915K913L251M135N408O600
58589D68779P336P638P732P715P601P501P565P869Q465R305R934R646Q275O511
$$ y = [620355, 627666, 638513, 653123, 671666, 693932, 719150, 745721, 771135, 792307, 806054, 809693, 801943, 783629, 757244, 725634, 691297, 656740, 624572, 596480, 572402, 551217, 532148, 515142, 500260, 487358, 476288, 466865, 458501, 450378, 442134, 434149, 426993, 420848, 415537, 410882, 406880, 403626, 401062, 398821, 396472, 394079, 392296, 391587, 391541, 391324, 390771, 390576, 391407, 393198, 395466, 397910, 400548, 403519, 406982, 410997, 415318, 419432, 422976, 426043, 429021, 432224, 435701, 439225, 442348, 444545, 445424, 444848, 442984, 440339, 437607, 435226, 433110, 431060, 429361, 428712, 429459, 431098, 432590, 433063, 432335, 431054, 430332, 430911, 432512, 434202, 435437, 436566, 438250, 440689, 443557, 446472, 449385, 452636, 456771, 462179, 468779, 476115, 483753, 491485, 499200, 506801, 514302, 521867, 529736, 538201, 547506, 557440, 567086, 575361, 581872]
58575E81872N064L879K628J605J387J787J873J119k5q68j208j227j116j091j358
58560E94321j781j928j640j324j441k027k772l408l803l982m175m682n485o170
58546E49703o391o209n912n705n659n790n983o042n889n590n182m694m365m436
58532D71856m673m493l763l118l099l361l172k480j907j704j393o36J18K85Q0
58517D38540K50J017J835K290K662L314L943L880L000J906J218J005R55P59K97
58502D66871l25p71p21j40P57J789K772L398L534L656M497O109P705Q569Q715
58487E16415Q496Q020P357O793O477O060N135L825K475J050o73k469l765m376
58473E60820m670m941n039m750m219l815l679l536k979j985j064p20p42m52K74
$$ y = [581872, 586936, 590815, 593443, 595048, 596435, 598222, 600095, 601214, 601189, 600321, 599113, 597886, 596770, 595679, 594321, 592540, 590612, 588972, 587648, 586207, 584180, 581408, 578000, 574197, 570215, 566040, 561358, 555873, 549703, 543312, 537103, 531191, 525486, 519827, 514037, 508054, 502012, 496123, 490533, 485351, 480657, 476292, 471856, 467183, 462690, 458927, 455809, 452710, 449349, 446177, 443697, 441790, 440086, 438693, 438057, 438175, 438460, 438540, 438790, 439807, 441642, 443932, 446594, 449908, 453851, 457731, 460731, 462637, 463855, 464860, 465815, 466574, 466871, 466546, 465775, 465054, 464914, 465671, 467460, 470232, 473630, 477164, 480820, 485317, 491426, 499131, 507700, 516415, 524911, 532931, 540288, 547081, 553558, 559618, 564753, 568578, 571053, 572103, 571430, 568961, 565196, 560820, 556150, 551209, 546170, 541420, 537201, 533386, 529707, 526171, 523192, 521207, 520143, 519423, 518681, 518229, 518503]
58458E18503P50N08R2L02J027J447J123L23o03j482j992j750r53m10o38j260j501
58441E13486j070l56J01K21M14J015J779K115J872J541J542J694J633J450J468
58426E28905J727K133K785L746M643M996M829M522M246L961L722L587L398L110
58412E80310L066L421L620L127K458K665L848M941N166M954N167N973O797P139
58398F42652P023O875O987P176P029O516O027N626M882L775L184L690M464M270
58384G20176L282K861L626M742N261N221N186N512O295P382Q141P937P072O617
58370G99311P086P791P882P413P089P319P868Q191P947P370P128P518P990P901
58356I05804P462P353P606P578P085O776P236Q303R324R703R230Q428Q381R632
$$ y = [518503, 519253, 519761, 519853, 520155, 521182, 522629, 523752, 524075, 523472, 521990, 519998, 518248, 517295, 516885, 516247, 514987, 513486, 512416, 512060, 512161, 512382, 512796, 513811, 515590, 517705, 519577, 521118, 522660, 524354, 525987, 527437, 528905, 530632, 532765, 535550, 539296, 543939, 548935, 553764, 558286, 562532, 566493, 570215, 573802, 577200, 580310, 583376, 586797, 590417, 593544, 596002, 598667, 602515, 607456, 612622, 617576, 622743, 628716, 635513, 642652, 649675, 656550, 663537, 670713, 677742, 684258, 690285, 695911, 700793, 704568, 707752, 711442, 715906, 720176, 723458, 726319, 729945, 734687, 739948, 745169, 750355, 755867, 762162, 769544, 777685, 785622, 792694, 799311, 806397, 814188, 822070, 829483, 836572, 843891, 851759, 859950, 867897, 875267, 882395, 889913, 897903, 905804, 913266, 920619, 928225, 935803, 942888, 949664, 956900, 965203, 974527, 984230, 993460, 1001888, 1010269, 1019901]
58342A019901J1348J2300J2419J2634J3323J3876J3835J3471J3146J2868J2638
58331A161759J2516J2310J1914J1826J2577J3778J4592J4984J5515J6106J6176
58320A314053J5959J6394J7676J9039K0075K1082K2034K2517K2813K3706K5005
58309A540353K5609K5348K5324K6090K6924K7315K7741K8435K8825K8755K8929
58298A839648K9508K9627K8889K8031K7523K6984K6565K7337K9389L1116L1366
58287B155983L1006L1407L2682L4299L6080L7658L8322L8371L9267M1437M3369
58276B559881M3945M4162M5338M7130M8697N0435N3084N6231N9091O1780O4610
58265C134384O7188O9425P2193P5902P9618Q2653Q5642Q8958R1692R3511R5921
$$ y = [1019901, 1031249, 1043549, 1055968, 1068602, 1081925, 1095801, 1109636, 1123107, 1136253, 1149121, 1161759, 1174275, 1186585, 1198499, 1210325, 1222902, 1236680, 1251272, 1266256, 1281771, 1297877, 1314053, 1330012, 1346406, 1364082, 1383121, 1403196, 1424278, 1446312, 1468829, 1491642, 1515348, 1540353, 1565962, 1591310, 1616634, 1642724, 1669648, 1696963, 1724704, 1753139, 1781964, 1810719, 1839648, 1869156, 1898783, 1927672, 1955703, 1983226, 2010210, 2036775, 2064112, 2093501, 2124617, 2155983, 2186989, 2218396, 2251078, 2285377, 2321457, 2359115, 2397437, 2435808, 2475075, 2516512, 2559881, 2603826, 2647988, 2693326, 2740456, 2789153, 2839588, 2892672, 2948903, 3007994, 3069774, 3134384, 3201572, 3270997, 3343190, 3419092, 3498710, 3581363, 3667005, 3755963, 3847655, 3941166, 4037087]
58254D037087J00134J05178J09664J13927J18817J23896J28593J33781J40458
58245E111535J48086J55730J63562J71918J80413J89277J99811K12197K24897
58236F757426K37513K51849K68601K85812L02477L20752L42308L65725L90047
58227I522510M17567M49904M84576N18855N53879N91528O31046O72925P22329
58218A4565119P84015Q57407R41453J040067J157331J291725J441322J610082
58210B3688521J803101K022423K275991K583349K962693L421315L968055M610288
58202D7335736N299574N888752O205821O219288O119114O201251O666836P535552
58194I7471924Q719347J0129293J1705411J3386355J5080993J6652307J7896045
$$ y = [4037087, 4137221, 4242399, 4352063, 4465990, 4584807, 4708703, 4837296, 4971077, 5111535, 5259621, 5415351, 5578913, 5750831, 5931244, 6120521, 6320332, 6532529, 6757426, 6994939, 7246788, 7515389, 7801201, 8103678, 8424430, 8766738, 9132463, 9522510, 9940077, 10389981, 10874557, 11393412, 11947291, 12538819, 13169865, 13842790, 14565119, 15349134, 16206541, 17147994, 18188061, 19345392, 20637117, 22078439, 23688521, 25491622, 27514045, 29790036, 32373385, 35336078, 38757393, 42725448, 47335736, 52635310, 58524062, 64729883, 70949171, 77068285, 83269536, 89936372, 97471924, 106191271, 116320564, 128025975, 141412330, 156493323, 173145630, 191041675]
58187A91041675J8527193J8207628J6626454J3615665R261878L952529j697451
58180B69535571p023021j1495644j4823522j6946562j7972294j8100941j7561881
58173A65611706j6570577j5308847j3920401j2510513j1148590r876465q717751
58166G7558562p681976o766464n961845n258229m646040m114060l650727l247299
58158C6231922k897375k594100k330029k099040j896234j716607j555852j411901
58150A9730784j283884j169950j067614r75549q93335q19898p53658o93785o40036
58141A1433075n91741n48080n08766m73497m41271m11212l83413l58183l35215
58132G381697l14247k95542k78826k62857k47005k32187k19211k07316j95550
$$ y = [191041675, 209568868, 227776496, 244402950, 258018615, 267280493, 271233022, 269535571, 262512550, 251016906, 236193384, 219246822, 201274528, 183173587, 165611706, 149041129, 133732282, 119811881, 107301368, 96152778, 86276313, 77558562, 69876586, 63110122, 57148277, 51890048, 47244008, 43129948, 39479221, 36231922, 33334547, 30740447, 28410418, 26311378, 24415144, 22698537, 21142685, 19730784, 18446900, 17276950, 16209336, 15233787, 14340452, 13520554, 12766896, 12073111, 11433075, 10841334, 10293254, 9784488, 9310991, 8869720, 8458508, 8075095, 7716912, 7381697, 7067450, 6771908, 6493082, 6230225, 5983220, 5751033, 5531822, 5324506, 5128956]
58123E128956j84454j74953j66572j58272j50340j43800j38415j32753j26137
58114C753260j19313j13296j08432j04470j00749r6559r1833q7241q3190p9374
58104B768803p5676p2652p0462o8248o5331o2167n9317n6459n3308n0618m9135
58093B085430m8281m6966m5086m3199m1383l9483l7836l6683l5418l3575l1951
58082A645569l1560l1960l1868l1060l0354k9938k9045k7413k5907k5355k5519
58071A325590k5489k4564k2765k0866j9833j9888k0272k0198j9692j9195j8823
58060A094005j8495j8225j7845j6974j5824j5330j5933j6854j7207j7118j7075
58049I07125j6883j6159j5210j4582j4198j3771j3490j3507j3327j2502j1392
$$ y = [5128956, 4944502, 4769549, 4602977, 4444705, 4294365, 4150565, 4012150, 3879397, 3753260, 3633947, 3520651, 3412219, 3307749, 3207000, 3110441, 3018608, 2931367, 2848177, 2768803, 2693127, 2620475, 2550013, 2481765, 2416434, 2354267, 2294950, 2238491, 2185183, 2134565, 2085430, 2037149, 1990183, 1945097, 1901898, 1860515, 1821032, 1783196, 1746513, 1711095, 1677520, 1645569, 1614009, 1582049, 1550181, 1519121, 1488767, 1458829, 1429784, 1402371, 1376464, 1351109, 1325590, 1300101, 1275537, 1252772, 1231906, 1212073, 1192185, 1171913, 1151715, 1132023, 1112828, 1094005, 1075510, 1057285, 1039440, 1022466, 1006642, 991312, 975379, 958525, 941318, 924200, 907125, 890242, 874083, 858873, 844291, 830093, 816322, 802832, 789325, 775998, 763496, 752104]
58038G52104j0473r622q805q651r288r568q624p406p315q073q446q404q802r392
58024F29235q990p606o571o435o376n939n725n939n811n005m259m047l825l237
58010E49470k883l091l062k102q10j57m5L37J160J837J957J754J707K131K993
57995E51196L982M871N863P244Q827J0140J1156J2186J3186J3918J4772J6536
57983F73877J9178K1676K3421K4953K7007K9560L2213L4736L6823L8021L8355
57972I99820L8375L8095L6631L3348K8636K2931J5827P020k422j0834j7632k3426
57960A166369k8634l2911l5877l7586l8245l8060l7498l6995l6305l4735l2172
57949G77351k9413k7213k5468k3565k1153j8340j5477j3055j1524j0803j0146
$$ y = [752104, 741631, 732009, 723204, 714553, 705265, 695697, 687073, 679667, 672352, 664279, 655833, 647429, 638627, 629235, 620245, 612639, 606068, 599633, 593257, 587318, 581593, 575654, 569843, 564838, 560579, 556532, 552707, 549470, 546587, 543496, 540434, 538332, 537522, 537365, 537320, 537657, 538817, 540654, 542611, 544365, 546072, 548203, 551196, 555178, 560049, 565912, 573156, 581983, 592123, 603279, 615465, 628651, 642569, 657341, 673877, 693055, 714731, 738152, 763105, 790112, 819672, 851885, 886621, 923444, 961465, 999820, 1038195, 1076290, 1112921, 1146269, 1174905, 1197836, 1213663, 1220683, 1218261, 1207427, 1189795, 1166369, 1137735, 1104824, 1068947, 1031361, 993116, 955056, 917558, 880563, 844258, 809523, 777351, 747938, 720725, 695257, 671692, 650539, 632199, 616722, 603667, 592143, 581340, 571194]
57938E71194q815o941n403m883n241n909o492o875o976o733o230n563m597l264
57924D87272j968j298j171p41N96K482M227N768P500R424J1061J2241J3346J4699
57910E63438J6096J7161J7816J8128J7908J6751J4378J0909O798K506j769o022
57898F94098j0035j3352j5749j7485j8880j9893k0475k0956k1572k1856k1154
57887D92691j9683j8406j7862j7698j7449j7005j6125j4322j1766r655q985r279
57875C14456r251q421p430o804o229n250m096l335l014k563j560k45P83J216J302
57860B59559J466J840K163K129J647Q46j08j071j861k347k568k658k621k287j634
57845B52495j085j148j702j931j237j6P72P61M86N30Q79J298J895K883M062M923
$$ y = [571194, 562379, 555438, 550035, 545152, 539911, 534002, 527510, 520635, 513659, 506926, 500696, 495133, 490536, 487272, 485304, 484006, 482835, 482094, 482690, 485172, 489399, 495167, 502667, 512091, 523152, 535393, 548739, 563438, 579534, 596695, 614511, 632639, 650547, 667298, 681676, 692585, 699383, 701889, 700120, 694098, 684063, 670711, 654962, 637477, 618597, 598704, 578229, 557273, 535701, 513845, 492691, 473008, 454602, 436740, 419042, 401593, 384588, 368463, 354141, 342375, 332720, 323735, 314456, 305205, 296784, 289354, 282550, 276321, 271071, 266975, 263640, 260626, 258063, 256503, 256258, 257041, 258257, 259559, 261025, 262865, 265028, 267157, 268804, 269650, 269542, 268471, 266610, 264263, 261695, 259037, 256416, 254129, 252495, 251410, 250262, 248560, 246629, 245392, 245376, 246148, 246909, 247395, 247925, 248804, 250102, 251997, 254880, 258942, 263865]
57829B63865N166M734L522J482r51k949l950m024l551k817k031j470j359j594
57815B54073j785j639j202o20L24K129M778P262Q483Q643R190J1076J3580J5295
57801C29587J5953J6570J7983J9791K0943K0955K0331J9917J9977J9747J7958
57790E39712J3950Q303K335k883o995j0144j2699j4987j7015j8375j8690j8129
57778D44383j7352j6965j7155j7658j7900j7344j5947j4270j2930j2068j1383
57767B73411j0597r712r020q853r102r007p864o077m863m673m594l799k826k610
57753A79814k918k751j956j348j252j062m49M6j5k20L8O91J201J163M54p44j756
57736A68936j824r55J2N14R07J658K533L024L174L374L606L488L001K638K761
$$ y = [263865, 269031, 273765, 277287, 278769, 277818, 274869, 270919, 266895, 263344, 260527, 258496, 257026, 255667, 254073, 252288, 250649, 249447, 248827, 249151, 251280, 256058, 263320, 271803, 280446, 289636, 300712, 314292, 329587, 345540, 362110, 380093, 399884, 420827, 441782, 462113, 482030, 502007, 521754, 539712, 553662, 561965, 564300, 561417, 554422, 544278, 531579, 516592, 499577, 481202, 462512, 444383, 427031, 410066, 392911, 375253, 357353, 340009, 324062, 309792, 296862, 284794, 273411, 262814, 253102, 244082, 235229, 226127, 217120, 209256, 203179, 198316, 193643, 189049, 185250, 182424, 179814, 176896, 174145, 172189, 170841, 169589, 168527, 168078, 168124, 168109, 167889, 167927, 168618, 169819, 170982, 171436, 170692, 168936, 167112, 166157, 166169, 166683, 167590, 169248, 171781, 174805, 177979, 181353, 184959, 188447, 191448, 194086, 196847]
57721A96847L143L267K901K238J594J017K87o76j628k378l153m199n181n443m914
57706A83722m243l923l750l369k882k616k590k554k324j874j329j032j279j777
57692A48180j734q20L12P97O43N76J026J733K325K802L384M203N270O552P934
57677A83183R276J0632J2290J4499J7267K0487K4258K8997L5175M2773N0570N5785
57665E05192N4702M4726K6660M998j4587k8459l5978l8157l6352l2210k7544k3317
57653C99674j9185j4739j0589p579n489l520j669n64j27L98J045R66qq26p31m33
57637C36624r47k127l079l482l648l748l800m123m969n844n936n269m749m977
57623B79926n613o016o032n798n251m223k978k160k136k529k621k139j406p42
$$ y = [196847, 199990, 203257, 206158, 208396, 209990, 211007, 211294, 210618, 208990, 206612, 203459, 199260, 194079, 188636, 183722, 179479, 175556, 171806, 168437, 165555, 162939, 160349, 157795, 155471, 153597, 152268, 151236, 149957, 148180, 146446, 145626, 145938, 146735, 147378, 147954, 148980, 150713, 153038, 155840, 159224, 163427, 168697, 175249, 183183, 192459, 203091, 215381, 229880, 247147, 267634, 291892, 320889, 356064, 398837, 449407, 505192, 559894, 604620, 631280, 636278, 621691, 593232, 557254, 519097, 482745, 450535, 422991, 399674, 380489, 365750, 355161, 347582, 342093, 338573, 336904, 336340, 336213, 336611, 337656, 338622, 338614, 337788, 337057, 336624, 335677, 333550, 330471, 326989, 323341, 319593, 315793, 311670, 306701, 300857, 294921, 289652, 284903, 279926, 274313, 268297, 262265, 256467, 251216, 246993, 244015, 241855, 239719, 237190, 234569, 232430, 231024, 230282]
57609B30282m7P92J413J413J055J021J480J935K107K376L071L771L785L033K080
57594B59567J480J415J838K619L554M379M862M821M190L132K012J162O75L57j63
57579B95900j118k230k891k929k958l626m705n458n676n790o008o070n904n896
57565B34641o342p032p515p456o689n483m634m669m986m554l432k697k744k677
57551A63731j854r86j056j846k327j982j040J33J187J694J500R58M29j26p30j066
57535A56619r71p62o56l83J10K54k82q97q82m08m8J36L06K24j61q1J083K584L107
57516A58892K606K272K737L367L423K979K515K313K497L005L465L556L482L551
57502B00660L484K910K315K568L472L837L184K387K350K869L243L195K713J706
$$ y = [230282, 230235, 231027, 232440, 233853, 234908, 235929, 237409, 239344, 241451, 243827, 246898, 250669, 254454, 257487, 259567, 261047, 262462, 264300, 266919, 270473, 274852, 279714, 284535, 288725, 291857, 293869, 295031, 295706, 296063, 295900, 294782, 292552, 289661, 286732, 283774, 280148, 275443, 269985, 264309, 258519, 252511, 246441, 240537, 234641, 228299, 221267, 213752, 206296, 199607, 194124, 189490, 184821, 179835, 175281, 171849, 169152, 166408, 163731, 161877, 160891, 159835, 157989, 155662, 153680, 152640, 152773, 153960, 155654, 157154, 158112, 158541, 158415, 157685, 156619, 155648, 154886, 154230, 153847, 153957, 154211, 153929, 153032, 152150, 151742, 151694, 151830, 152136, 152360, 152199, 152118, 153201, 155785, 158892, 161498, 163770, 166507, 169874, 173297, 176276, 178791, 181104, 183601, 186606, 190071, 193627, 197109, 200660, 204144, 207054, 209369, 211937, 215409, 219246, 222430, 224817, 227167, 230036, 233279, 236474, 239187, 240893]
57488B40893L73n95p89o77r26j511j945k070k127k262k443k699l079l452l696
57473B12995l941m372m843n014m775m437m365m570m687m364l672k951k277j364
57459A57363k13N09K28o22j019o13J1L85P72J412J834J486P06M57J119K044K429
57442A68288K304K399L182M321N194N612N822N864N450M510L438K594J904J250
57428B22132P97N99K39n77j389j574j306j373k064k880l348l559l825m288m972
57413A92612n769o291o132n383m559l990l633l443l430l371k927k179j638j658
57399A38209k068k438k427j954j379j375k146k940k868k094j576j673j765j291
57385A10215n15P4L96N51M26o4o72j025r69o77n99j202k274k795k004n23L63L37
$$ y = [240893, 241266, 240671, 239882, 239205, 238279, 236768, 234823, 232753, 230626, 228364, 225921, 223222, 220143, 216691, 212995, 209054, 204682, 199839, 194825, 190050, 185613, 181248, 176678, 171991, 167627, 163955, 161004, 158727, 157363, 157150, 157659, 157887, 157265, 156246, 155633, 155644, 156029, 156801, 158213, 160047, 161533, 162239, 162696, 163815, 165859, 168288, 170592, 172991, 176173, 180494, 185688, 191300, 197122, 202986, 208436, 212946, 216384, 218978, 220882, 222132, 222929, 223528, 223767, 223190, 221801, 220227, 218921, 217548, 215484, 212604, 209256, 205697, 201872, 197584, 192612, 186843, 180552, 174420, 169037, 164478, 160488, 156855, 153412, 149982, 146611, 143684, 141505, 139867, 138209, 136141, 133703, 131276, 129322, 127943, 126568, 124422, 121482, 118614, 116520, 114944, 113271, 111506, 110215, 109700, 109774, 110170, 110721, 111147, 111083, 110411, 109386, 108417, 107740, 107141, 105939, 103665, 100870, 98866, 98343, 98706, 99043]
57367I9043K05M49O68N98O39R39J024P45P22J213J499J038M52N02Q19N83r2m26
57349A10620k30J1N0L0j04n01q41o44o8K59J77P0J16R0j39m81r59j568j858j320
57329A02710k04O47Q31P16O45M83J30p5J75O92J094J339J639K054K341K189J537
57312A18943P31K62K65L69K90K69N95R96R52N64N26J166K036K536K522K150J567
57295A36739J004Q00J055J477J752J864J854J528P91N8j2P53J790K386K370K137
57279A58346K144K461K818K935K724K305J965K028K476K788K388J375M72J71K03
57264A87599M4l22n22m31l31m20n02k58L05P70O94J37k97j30L41M25N1j12K88
57245A87329P15O07K61K93O14O83M97N96J100J526J551J342R96M25j8M67K061
$$ y = [99043, 99248, 99697, 100365, 100963, 101602, 102541, 103565, 104310, 105032, 106245, 107744, 108782, 109234, 109736, 110555, 111138, 111046, 110620, 110390, 110401, 110451, 110481, 110377, 109876, 109035, 108391, 108323, 108582, 108759, 108829, 108945, 109035, 108896, 108415, 107456, 105888, 104030, 102710, 102506, 103153, 103984, 104700, 105345, 105828, 105958, 105883, 106058, 106750, 107844, 109183, 110822, 112876, 115217, 117406, 118943, 119674, 119936, 120201, 120570, 120860, 121129, 121724, 122720, 123672, 124236, 124762, 125928, 127964, 130500, 133022, 135172, 136739, 137743, 138543, 139598, 141075, 142827, 144691, 146545, 148073, 148864, 148922, 148910, 149663, 151453, 153839, 156209, 158346, 160490, 162951, 165769, 168704, 171428, 173733, 175698, 177726, 180202, 182990, 185378, 186753, 187225, 187396, 187599, 187643, 187321, 186799, 186368, 186037, 185617, 185115, 184857, 185162, 185932, 186626, 186763, 186466, 186336, 186677, 187102, 187153, 187041, 187329, 188044, 188651, 188912, 189205, 189819, 190502, 190999, 191595, 192695, 194221, 195772, 197114, 198110, 198535, 198517, 198984, 201045]
57228B01045L735M270L543K458J907K191L119M155M591M151L382L123L554M109
57214B49333M335M375M503M564M201L453K831K808L439M445N465O210O515O403
57200C12880O019N460M768M200M218N027O141O717O439N824N576N877O381O729
57186C92256O832O801O806O955P150P180P042P002P221P449P386P171P263P842
57172D92356Q607R162R396R432R403R350R252R209R538J0551J2101J3572J4516
57159F26445J5101J5713J6360J6868J7399J8209J8992J9121J8697J8715J9815
57148H21435K1362K2292K2487K2753K3573K4554K5164K5516K6119K7165K8391
57137A090811K9509L0545L1733L3296L5290L7591L9947M2134M4126M6180M8662
$$ y = [201045, 204780, 209050, 212593, 215051, 216958, 219149, 222268, 226423, 231014, 235165, 238547, 241670, 245224, 249333, 253668, 258043, 262546, 267110, 271311, 274764, 277595, 280403, 283842, 288287, 293752, 299962, 306477, 312880, 318899, 324359, 329127, 333327, 337545, 342572, 348713, 355430, 361869, 367693, 373269, 379146, 385527, 392256, 399088, 405889, 412695, 419650, 426800, 433980, 441022, 448024, 455245, 462694, 470080, 477251, 484514, 492356, 500963, 510125, 519521, 528953, 538356, 547706, 556958, 566167, 575705, 586256, 598357, 611929, 626445, 641546, 657259, 673619, 690487, 707886, 726095, 745087, 764208, 782905, 801620, 821435, 842797, 865089, 887576, 910329, 933902, 958456, 983620, 1009136, 1035255, 1062420, 1090811, 1120320, 1150865, 1182598, 1215894, 1251184, 1288775, 1328722, 1370856, 1414982, 1461162, 1509824]
57126A509824N1752N5253N8755O2062O5402O9181P3539P8264Q3152Q8345R4245
57115B289774J01168J09187J18221J28247J39405J51943J66101J82012J99750
57106C585808K19575K42044K67898K97887L32783L73376M20320M74023N34927
57097F748641O03777O81234P67162Q60418R59351J062040J165935J267666J363538
57088A5479762J449857J522480J576240J605338J604327J568646J494654J379955
57080B7681259J224093J029050P99390N42251K67038j5498k94365n59120q00679
57071B9873419j012434j190679j333598j439951j509267j543032j544845j519179
57063A8780434j470568j403834j324060j235769j142573j047931r55412q67647
$$ y = [1509824, 1561576, 1616829, 1675584, 1737646, 1803048, 1872229, 1945768, 2024032, 2107184, 2195529, 2289774, 2390942, 2500129, 2618350, 2746597, 2886002, 3037945, 3204046, 3386058, 3585808, 3805383, 4047427, 4315325, 4613212, 4945995, 5319371, 5739691, 6213714, 6748641, 7352418, 8033652, 8800814, 9661232, 10620583, 11682623, 12848558, 14116224, 15479762, 16929619, 18452099, 20028339, 21633677, 23238004, 24806650, 26301304, 27681259, 28905352, 29934402, 30733792, 31276043, 31543081, 31527583, 31233218, 30674098, 29873419, 28860985, 27670306, 26336708, 24896757, 23387490, 21844458, 20299613, 18780434, 17309866, 15906032, 14581972, 13346203, 12203630, 11155699, 10200287, 9332640]
57055I332640p85554p09180o38929n75381n18313m66701m19627l76608l37065
57046D505282l00209k65952k35784k12314j97391j90129j86745j82799j75886
57037B558073j66208j54995j43153j31360j20354j10338j00828r1602q3335p6565
57027A379335p0675o4684n8637n3409m9349m6003m3042m0564l8494l6485l4510
57016H43483l2955l1922l0977k9667k7841k5595k3302k1614k0821k0353j9451
57005E58985j8143j6890j5567j3759j1924j1128j1397j1488j0682r704r324r063
56993D09916q137o777n678m725l375j888j082j012q35o1Q74J355J090j42k514
56978C77009n427p569q208p967p869p959p524o387n260m720m436l712k426j015
$$ y = [9332640, 8547086, 7837906, 7198977, 6623596, 6105283, 5638582, 5218955, 4842347, 4505282, 4205073, 3939121, 3703337, 3491023, 3293632, 3103503, 2916758, 2733959, 2558073, 2391865, 2236870, 2093717, 1962357, 1842003, 1731665, 1630837, 1539235, 1455900, 1379335, 1308660, 1243976, 1185339, 1131930, 1082581, 1036578, 993536, 952972, 914478, 877993, 843483, 810528, 778606, 747629, 717962, 690121, 664526, 641224, 619610, 598789, 578436, 558985, 540842, 523952, 508385, 494626, 482702, 471574, 460177, 448689, 438007, 428303, 418979, 409916, 401779, 395002, 389324, 384599, 381224, 379336, 378254, 377242, 376407, 376346, 377220, 378575, 379665, 379523, 377009, 371582, 364013, 355805, 347838, 339969, 332010, 324486, 318099, 312839, 308119, 303683, 299971, 297545, 296530]
56964B96530J28Q98J211J109J135K102M139O237P124O445M829K954R58j258l552
56949C30989n483o613o810o456o190o288o263n417l740j946o34K81J229K446L914
56934B83019N489O895P834Q301Q571Q631P930N928K826o22l888o924r628j1475
56920C12887j2010j1537j0933j0684j0409r516q042o565n440m599m075m078m416
56907B10583m409l774l127l030l013k260j014l88p68j239r21q6M49N66Q57J691
56891A90117K823L802M371M404L950L421L500M506N826O228M998K775R80L40K97
56876B42338K1m74n93j58N02J228K117K952L247L038L052L918N584P636R686J1334
56860B95428J2289J2732J3016J2795J1051P381K690j687n105p498q825r184r029
$$ y = [296530, 296658, 297556, 298767, 299876, 301011, 303113, 307252, 313489, 320613, 327058, 331887, 334841, 335799, 334541, 330989, 325506, 318893, 312083, 305627, 299437, 293149, 286886, 281469, 277729, 275783, 275149, 275430, 276659, 279105, 283019, 288508, 295403, 303237, 311538, 320109, 328740, 336670, 342598, 345424, 344802, 340914, 333990, 324362, 312887, 300877, 289340, 278407, 267723, 257314, 247798, 239756, 233191, 227751, 223152, 219077, 214999, 210583, 206174, 202400, 199273, 196243, 193230, 190970, 189956, 189568, 188800, 187561, 186640, 186554, 187003, 187569, 188426, 190117, 192940, 196742, 201113, 205517, 209467, 212888, 216388, 220894, 226720, 232948, 237946, 240721, 241701, 242041, 242338, 242359, 241885, 241292, 241134, 241636, 242864, 244981, 247933, 251180, 254218, 257270, 261188, 266772, 274408, 284094, 295428, 307717, 320449, 333465, 346260, 357311, 364692, 367382, 365695, 360590, 353092, 344267, 335083, 326054]
56847C26054q573p425n334k885p22J535M678Q403J1472J3466J5385J8184K1417
56834C95655K3821K4633K3815K1477J7724J2852P162O98o312j2888j7698k0126
56822D70813k0649k0093j8897j7177j5048j2590r756o611l498o67K089N092Q169
56809C61177J0763J2608J3887J4628J4358J2581R255M657q54o626j1666j5251
56797D19517j7432j8543j8519j7108j4661j2057r864p939n921l684j299J087L220
56784B96797M968O522Q095R440J0033R663Q363N937K206k171n896q289r786j0961
56770C24921j1728j1910j1907j2151j2368j2010j1172j0371r638q505o935n580
56758B00646m912m572l911k895k136k056k360k436k176k049k402k907k972k512
$$ y = [326054, 317481, 310056, 304722, 301837, 301115, 302650, 307328, 315731, 327203, 340669, 356054, 374238, 395655, 419476, 444109, 467924, 489401, 507125, 519977, 527139, 527837, 521525, 508637, 490939, 470813, 450164, 430071, 411174, 393997, 378949, 366359, 356603, 349992, 346494, 345827, 347916, 353008, 361177, 371940, 384548, 398435, 413063, 427421, 440002, 449257, 453914, 453060, 446434, 434768, 419517, 402085, 383542, 365023, 347915, 333254, 321197, 311333, 303394, 297473, 293789, 292490, 293577, 296797, 301765, 308287, 316382, 325822, 335855, 345518, 353881, 359818, 362024, 359853, 353957, 345668, 335882, 324921, 313193, 301283, 289376, 277225, 264857, 252847, 241675, 231304, 221666, 213161, 206226, 200646, 195734, 191162, 187251, 184356, 182220, 180164, 177804, 175368, 173192, 171143, 168741, 165834, 162862, 160350]
56744A60350j988j820k038k448k755k661k214k008k498l232l358k877k670l124
56730A24659l543l232k427j617p27L74J089P13m52j334j333p59j52J97J56k39
56714A11373n94m50J72P88J049R96P77M81J78l8j59j74l8J70K35J68K72O25P71
56695A16602K88n73j134r77j16J194K452L029K750K193K039K342K804L385M109
56680A40387M617M517M055L851M081M526N233O476P992Q956Q827P884O849O364
56666B24615O670P368P534O596N015L689K847K144J534J339J416J215O90M66Q20
56651B73958J299J595K041K812L320K956J961J000L17k35p14j151j782k716l523
56636B81138l693l388l311l803m455m619m087l167k375k038k135k446k765k965
$$ y = [160350, 158362, 156542, 154504, 152056, 149301, 146640, 144426, 142418, 139920, 136688, 133330, 130453, 127783, 124659, 121116, 117884, 115457, 113840, 113113, 113487, 114576, 115289, 114837, 113503, 112170, 111411, 111259, 111456, 111612, 111373, 110779, 110329, 110501, 111289, 112338, 113334, 114111, 114592, 114770, 114732, 114573, 114399, 114361, 114531, 114766, 114934, 115206, 115831, 116602, 116890, 116317, 115183, 114206, 114090, 115284, 117736, 120765, 123515, 125708, 127747, 130089, 132893, 136278, 140387, 145004, 149521, 153576, 157427, 161508, 166034, 171267, 177743, 185735, 194691, 203518, 211402, 218251, 224615, 231285, 238653, 246187, 252783, 257798, 261487, 264334, 266478, 268012, 269351, 270767, 271982, 272672, 273138, 273958, 275257, 276852, 278893, 281705, 285025, 287981, 289942, 290942, 291259, 291024, 290310, 289159, 287377, 284661, 281138, 277445, 274057, 270746, 266943, 262488, 257869, 253782, 250615, 248240, 246202, 244067, 241621, 238856, 235891]
56622B35891k875k405j729j225j095j260j502j568j221n45j03l18o73j43J421
56607B20650K846L006K094J139O30K71j58m32m90p41j439k111k101j485j067j338
56591B19274j894k140k210k723l640m025l231j822q26m20O6R96J907K280K230
56576B03822K226K486K843K948K497J534O40M95J122J823J983J722J642K140L110
56561B33033M072M544M384L875L338K792K159J578J162P00O3l19m2L43j69j508
56545B60005k399k063j191p31n91k75o0o01j734k626k978l236l676m062m232m307
56529B25243m252l965l870m669o170p124o716n661n217n499n545m859m069l835
56515A53792l791l129j876r74j079j760k150j993j727j674j646j416j217j437
$$ y = [235891, 233016, 230611, 228882, 227657, 226562, 225302, 223800, 222232, 221011, 220466, 220363, 220045, 219372, 219229, 220650, 223496, 226502, 228596, 229735, 230365, 230636, 230478, 230046, 229556, 228815, 227376, 225265, 223164, 221679, 220612, 219274, 217380, 215240, 213030, 210307, 206667, 202642, 199411, 197589, 196763, 196343, 196409, 197405, 199312, 201592, 203822, 206048, 208534, 211377, 214325, 216822, 218356, 218996, 219491, 220613, 222436, 224419, 226141, 227783, 229923, 233033, 237105, 241649, 246033, 249908, 253246, 256038, 258197, 259775, 260937, 261637, 261700, 261381, 261339, 261682, 261513, 260005, 257606, 255543, 254352, 253621, 253030, 252755, 252695, 252094, 250360, 247734, 244756, 241520, 237844, 233782, 229550, 225243, 220991, 217026, 213156, 208487, 202317, 195193, 188477, 182816, 177599, 172100, 166555, 161696, 157627, 153792, 150001, 146872, 144996, 144022, 142943, 141183, 139033, 137040, 135313, 133639, 131993, 130577, 129360, 127923]
56501A27923j929j987j136K31J212J418J307J373J265K79j385k518k339j386n51
56486A21777K12J325K239J804O9j386j411o51l34m58n2J137K181K181J212m4r76
56469A28825j218o59L93J307J677J632J499J395J261J128J109J187J169Q95L92
56454A41992j86p30j149j284r81l98m9l08r43j313j045l34M44J103J601J820J623
56437A39863J040L65KJ81O81R87Q27M28J09k07o85j080r83m91q6R5L55P02P01
56418A42804K21k80m98p13j046r38KJ078J203L79k35K25J371K139J934J040J96
56401A48882j01K6O7k56p24r60q33m15K16Q50J128R41O70O90Q06N64K1k74l7M02
56381A51663O62Q56J307J880J997J360M64J17M53Q02O41L27M44Q14P72L06J44
$$ y = [127923, 125994, 124007, 122871, 123102, 124314, 125732, 127039, 128412, 129677, 129956, 128571, 126053, 123714, 122328, 121777, 121989, 123314, 125553, 127357, 127426, 126040, 124629, 123978, 123644, 123186, 123134, 124271, 126452, 128633, 129845, 129801, 128825, 127607, 126948, 127341, 128648, 130325, 131957, 133456, 134851, 136112, 137240, 138349, 139536, 140705, 141600, 141992, 141806, 141076, 139927, 138643, 137662, 137264, 137215, 136907, 135964, 134651, 133606, 133272, 133716, 134819, 136420, 138240, 139863, 140903, 141268, 141270, 141451, 142132, 143119, 143946, 144374, 144483, 144276, 143591, 142511, 141528, 141037, 140951, 141046, 141401, 142103, 142804, 143025, 142745, 142247, 141534, 140488, 139550, 139552, 140630, 141833, 142212, 141977, 142202, 143573, 145712, 147646, 148686, 148882, 148781, 148807, 148874, 148618, 147894, 146934, 146101, 145686, 145902, 146752, 147880, 148821, 149491, 150181, 150987, 151551, 151572, 151298, 151261, 151663, 152325, 153181, 154488, 156368, 158365, 159725, 160189, 160306, 160759, 161561, 162202, 162529, 162973, 163787, 164559, 164865, 165009]
56364A65009O27J238J481J509J499J189N37J68M67Q10M46k72l77K73R36J163J174
56347A77877J110P63K04m7K95R39J503J860J931J663J287J107R69M57l11o60k79
56330A90668L62Q16J256J983K738K970K530J843J445J526J797J790J474J399J910
56315B16507K387J899O09k11K36J323K015K164K254K380K278K072K255K852L175
56300B44195K693J718J106J383K347L338L803L659L258L002L003L116L281L705
56286B83607M592N608N889M915L419K885L845N119N244M308L673M049M770N080
56272C47003N200N629O153O346O571P634R513J1211J2016J2327J3006J4330J5950
56259D72889J7659J9791K2812K6685L0846L4806L8595M2482M6352M9733N2473
$$ y = [165009, 165636, 166874, 168355, 169864, 171363, 172552, 173089, 173257, 173724, 174534, 174980, 174708, 174331, 174604, 175540, 176703, 177877, 178987, 179750, 179954, 179907, 180202, 181141, 182644, 184504, 186435, 188098, 189385, 190492, 191461, 191918, 191607, 190947, 190668, 191030, 191846, 193102, 195085, 197823, 200793, 203323, 205166, 206611, 208137, 209934, 211724, 213198, 214597, 216507, 218894, 220793, 221402, 221191, 221427, 222750, 224765, 226929, 229183, 231563, 233841, 235913, 238168, 241020, 244195, 246888, 248606, 249712, 251095, 253442, 256780, 260583, 264242, 267500, 270502, 273505, 276621, 279902, 283607, 288199, 293807, 299696, 304611, 308030, 310915, 314760, 319879, 325123, 329431, 333104, 337153, 341923, 347003, 352203, 357832, 363985, 370331, 376902, 384536, 394049, 405260, 417276, 429603, 442609, 456939, 472889, 490548, 510339, 533151, 559836, 590682, 625488, 664083, 706565, 752917, 802650, 855123]
56248H55123N5068N8018O0990O2998O3356O2210O0009N6726N1823M5009L6758
56237A468088K7929J8919R549j25r229j6684k2319k6961l1395l5571l8914m1144
56225A302143m2475m3293m3811m3963m3582m2740m1898m1426m0986l9770l7560
56214H40639l5172l3502l2398l0856k8270k5110k2322k0374j8980j7558j5798
56203E60299j3814j1907j0211q708p443o567o050n572m776l611k292j110k98P4
56189D78014K18M70R27J374J648J880K192K452K534K620K927L261L204K737K288
56174E08746K243K644L410M452N509O168O345O398O623O843O793O702P086Q028
56160E87990Q977R393R312R287R984J1841J4767J8081K1046K3691K6825L1076
$$ y = [855123, 910191, 968209, 1029199, 1092197, 1155553, 1217763, 1277772, 1334498, 1386321, 1431330, 1468088, 1496017, 1514936, 1524485, 1524360, 1515131, 1498447, 1476128, 1449167, 1417772, 1382201, 1343287, 1302143, 1259668, 1216375, 1172564, 1128601, 1085019, 1042279, 1000381, 958955, 917969, 878199, 840639, 805467, 771965, 739567, 708711, 680441, 655331, 633009, 612635, 593655, 576097, 560299, 546485, 534578, 524367, 515659, 508216, 501649, 495599, 490027, 485251, 481640, 479348, 478238, 477940, 478014, 478232, 478702, 479629, 481003, 482651, 484531, 486723, 489175, 491709, 494329, 497256, 500517, 503721, 506458, 508746, 510989, 513633, 517043, 521495, 527004, 533172, 539517, 545915, 552538, 559381, 566174, 572876, 579962, 587990, 596967, 606360, 615672, 624959, 634943, 646784, 661551, 679632, 700678, 724369, 751194, 782270]
56148G82270L6323M2395M9708N8338O6730P2213P3126O9765O3266N4596M5109
56137A413839L7049L2222L0459L0102K9699K8374K5022J8657R994J688l774n995
56125A647336o426o844q649j2931k0236l0087m0974n0867n7817o0597n9277n5064
56113A237567m9377m3103l6693l0427k4362j8457j3122r175o778m875k287Q35
56101I99746L308M481M899N384O178P109Q060Q930R557R924J0211J0439J0348
56088A098574R865R414R542J0306J1309J2153J2699J3004J3311J3955J5028J6157
56076A245317J6859J7116J7327J7682J7929J7932J8113J8949K0212K1213K1761
56065A450410K2362K3318K4150K4301K4022K4019K4463K4914K5170K5542K6157
$$ y = [782270, 818593, 860988, 910696, 969034, 1035764, 1107977, 1181103, 1250868, 1314134, 1368730, 1413839, 1450888, 1483110, 1513569, 1543671, 1573370, 1601744, 1626766, 1645423, 1655417, 1657105, 1653331, 1647336, 1640910, 1634066, 1625417, 1612486, 1592250, 1562163, 1521189, 1470322, 1412505, 1351908, 1292631, 1237567, 1188190, 1145087, 1108394, 1077967, 1053605, 1035148, 1022026, 1012851, 1006073, 1001198, 998911, 999746, 1003054, 1007535, 1012434, 1017818, 1023996, 1031105, 1039165, 1048095, 1057652, 1067576, 1077787, 1088226, 1098574, 1108439, 1117853, 1127395, 1137701, 1149010, 1161163, 1173862, 1186866, 1200177, 1214132, 1229160, 1245317, 1262176, 1279292, 1296619, 1314301, 1332230, 1350162, 1368275, 1387224, 1407436, 1428649, 1450410, 1472772, 1496090, 1520240, 1544541, 1568563, 1592582, 1617045, 1641959, 1667129, 1692671, 1718828]
56054A718828K6631K6671K6646K7146K8252K9542L0650L1597L2750L4496L6843
56043B050052L9128M0465M0670M0486M0788M1761M3066M4394M5604M6623M7633
56032B520670M9137N1436N4179N6818N9302O1916O4581O6795O8363O9826P1966
56021C194989P5091P8841Q2536Q5793Q8869R2384R6537J00803J04623J08171J12087
56010D220724J16627J21495J26463J31838J38063J45215J52909J60691J68458
56001E482483J76569J85416J94881K04548K14574K25839K38916K53280K68122
55992G444628K83531L00311L18834L38876L60390L83730M09121M36641M66686
55983A0742748M99699N35554N74079O16275O63915P17753P77279Q42625R15508
$$ y = [1718828, 1745459, 1772130, 1798776, 1825922, 1854174, 1883716, 1914366, 1945963, 1978713, 2013209, 2050052, 2089180, 2129645, 2170315, 2210801, 2251589, 2293350, 2336416, 2380810, 2426414, 2473037, 2520670, 2569807, 2621243, 2675422, 2732240, 2791542, 2853458, 2918039, 2984834, 3053197, 3123023, 3194989, 3270080, 3348921, 3431457, 3517250, 3606119, 3698503, 3795040, 3895843, 4000466, 4108637, 4220724, 4337351, 4458846, 4585309, 4717147, 4855210, 5000425, 5153334, 5314025, 5482483, 5659052, 5844468, 6039349, 6243897, 6458471, 6684310, 6923226, 7176506, 7444628, 7728159, 8028470, 8347304, 8686180, 9046570, 9430300, 9839421, 10276062, 10742748, 11242447, 11778001, 12352080, 12968355, 13632270, 14350023, 15127302, 15969927, 16885435]
55974A6885435R97604J089233J190766J304457J433736J581566J750826J945701
55966B8179324K171169K431750K732558L081724L490120L968347M525364N170204
55958E5750560N912951O762672P725506Q805921J0008956J1339287J2795906J4362508
55950A33464267J5992415J7587967J8978766J9907473K0037656J9005154J6526303
55943B61500001J2538063P297024J360474m562928r819298j3967595j6830304
55936B37515437j8450497j9008174j8741333j7890823j6669597j5250098j3762441
55929A17742474j2297767j0913976r642971q498312p481691o587454n805699n124727
55921E1389877m532826m018989l572775l184394k845399k549167k290224k063253
$$ y = [16885435, 17883039, 18972272, 20163038, 21467495, 22901231, 24482797, 26233623, 28179324, 30350493, 32782243, 35514801, 38596525, 42086645, 46054992, 50580356, 55750560, 61663511, 68426183, 76151689, 84957610, 94966566, 106305853, 119101759, 133464267, 149456682, 167044649, 186023415, 205930888, 225968544, 244973698, 261500001, 274038064, 281335088, 282695562, 278132634, 268313336, 254345741, 237515437, 219064940, 200056766, 181315433, 163424610, 146755013, 131504915, 117742474, 105444707, 94530731, 84887760, 76389448, 68907757, 62320303, 56514604, 51389877, 46857051, 42838062, 39265287, 36080893, 33235494, 30686327, 28396103, 26332850]
55913B6332850j863168j686053j529154j389805j265072j152856j052442r63172
55905A5431128q83149q10157p43479o83765o31221n84934n43990n08038m76344
55896I566051m47199m19093l91951l66662l43706l22747l03297k85105k68088
55887F418203k52190k37447k23847k11224j99383j88164j77391j67024j57550
55878D603983j49848j44258j39965j35606j30408j24531j18541j12869j07613
55869C440344j02503r7108r1404q6127q2308q0309p9416p8389p6373p3401p0165
55858B522841o7319o4941o2672o0282n7918n5740n3615n1342m9007m6950m5423
55847A907632m4391m3614m2798m1784m0610l9336l7866l6154l4483l3307l2671
$$ y = [26332850, 24469682, 22783629, 21254475, 19864670, 18599598, 17446742, 16394300, 15431128, 14547979, 13737822, 12994343, 12310578, 11679357, 11094423, 10550433, 10042395, 9566051, 9118852, 8699759, 8307808, 7941146, 7597440, 7274693, 6971396, 6686291, 6418203, 6166013, 5928566, 5704719, 5493495, 5294112, 5105948, 4928557, 4761533, 4603983, 4454135, 4309877, 4169912, 4034306, 3903898, 3779367, 3660826, 3547957, 3440344, 3337841, 3240733, 3149329, 3063202, 2980894, 2900585, 2821169, 2742780, 2666407, 2593006, 2522841, 2455522, 2390581, 2327909, 2267627, 2209709, 2153969, 2100354, 2049012, 2000005, 1953055, 1907632, 1863241, 1819627, 1776829, 1735045, 1694435, 1655099, 1617233, 1581079, 1546596, 1513289, 1480618]
55836A480618l2131l1279l0100k8773k7420k6125k4906k3507k1594j9391j7684
55825A197708j7044j7260j7768j8262j8647j8808j8718j8592j8528j8301j7711
55814I98069j6947j6343j5954j5558j4841j3477j1443r423q334q197q047p272
55802H52233o376n942n546m620l749m129n837p635q392p940o590m748l144k708
55788G74877l893o469r892j3347j5747j6403j5702j4411j2459r256n015o92L271
55775F54862O836Q792O938P40p188j3361j6454j7258j6569j4503j1507q670o661
55762E65997n164l566j687J91J564J990J605J339K131L894N632O508O522O181
55748E93137N963N948N613M149J393j681l938n483p460j0472j3809j6375j7756
$$ y = [1480618, 1448487, 1417208, 1387108, 1358335, 1330915, 1304790, 1279884, 1256377, 1234783, 1215392, 1197708, 1180664, 1163404, 1145636, 1127374, 1108727, 1089919, 1071201, 1052609, 1034081, 1015780, 998069, 981122, 964779, 948825, 933267, 918426, 904949, 893506, 884083, 875749, 867552, 859505, 852233, 845857, 839915, 834369, 829749, 826000, 821871, 816034, 808399, 800007, 792067, 785477, 780729, 777585, 774877, 770984, 764515, 754623, 741276, 725529, 709126, 693424, 679013, 666554, 657298, 652283, 651591, 654862, 661698, 670490, 677428, 678168, 670980, 657619, 641165, 623907, 607338, 592835, 581328, 572658, 565997, 560833, 557267, 555580, 555771, 557335, 559325, 560930, 562269, 564400, 568294, 573926, 580434, 586956, 593137, 599100, 605048, 610661, 614810, 616203, 614522, 610584, 605101, 597641, 587169, 573360, 556985, 539229]
55735E39229j8169j7914j7316j6727j6145j5104j3417j1782j1151j1498j1772
55724C78234j1188j0153r582r601r385q283o658n370m731m352l897l511l470l775
55710B84278m257m746m934m441l367k492k513l176l598l421l211l588m328m625
55696B31581m095l244k856l082l323l019k364j980k006j875j085J30J065J266
55682B05113P97N3m41l06L32R63J258J328J205N87n64j579j804j449j133q91k87
55665B03182O46J417J928K508L069L078K563K254K400K328J646J028J111J434
55651B30592J264Q79R77J314R57j66j155j503j563j449n63J225K853L298K966
55636B39926L124M234N662O892Q209R980J1864J3099J3435J3396J3691J4480J5250
$$ y = [539229, 521060, 503146, 485830, 469103, 452958, 437854, 424437, 412655, 401504, 390006, 378234, 367046, 356893, 347311, 337710, 328325, 320042, 313384, 308014, 303283, 298931, 295034, 291523, 288053, 284278, 280021, 275275, 270341, 265900, 262533, 260041, 257528, 254352, 250754, 247333, 244122, 240534, 236206, 231581, 227486, 224242, 221386, 218304, 214981, 211962, 209598, 207618, 205612, 203737, 202652, 202782, 203847, 205113, 205910, 205963, 205522, 205216, 205548, 206511, 207769, 209097, 210302, 210889, 210325, 208746, 206942, 205493, 204360, 203469, 203182, 203828, 205245, 207173, 209681, 212750, 215828, 218391, 220645, 223045, 225373, 227019, 228047, 229158, 230592, 231856, 232735, 233712, 235026, 235983, 235817, 234662, 233159, 231596, 230147, 229584, 230809, 233662, 236960, 239926, 243050, 247284, 252946, 259838, 268047, 278027, 289891, 302990, 316425, 329821, 343512, 357992, 373242]
55623C73242J5310J4344J2524J0226P741N213K746M80j429k900l986m711m892
55610D23908m287l097k008j487j257q65n23r03k121l565m844o316q370j0724j2819
55595C60722j4526j5984j7025j7285j6771j5930j5175j4561j3875j2847j1393
55584A95350r821q627p913p311o561n857n358m814m057l433l212l021k423j781
55570A21161j814k485l057l151l041k940k770k556k445k299j995j998k773l602
55556H4235l118j279K86M05k02k69J85L40M2j98k71m21m56L7P89J056O77J45k92
55537H1691q03j179p86M52J637J876J268O24M91P11P32J85p13j376j506j400j367
55520H0537j163l83P25J358J031J6r92j351q14K20R01P93M19N57J203J712J787
$$ y = [373242, 388552, 402896, 415420, 425646, 433387, 438600, 441346, 441826, 440397, 437497, 433511, 428800, 423908, 419621, 416524, 414516, 413029, 411772, 410907, 410384, 409481, 407360, 403795, 398951, 392635, 384265, 373541, 360722, 346196, 330212, 313187, 295902, 279131, 263201, 248026, 233465, 219590, 206743, 195350, 185529, 176902, 168989, 161678, 155117, 149260, 143902, 139088, 135031, 131598, 128386, 125365, 122942, 121161, 119347, 116862, 113805, 110654, 107613, 104673, 101903, 99347, 96902, 94603, 92608, 90610, 87837, 84235, 81117, 79838, 80124, 80529, 80327, 80058, 80243, 80583, 80625, 80427, 80156, 79735, 79279, 79316, 80105, 81161, 81838, 81983, 81691, 80888, 79709, 78923, 79375, 81012, 82888, 84156, 84780, 85271, 85982, 86714, 86899, 86186, 84810, 83304, 81904, 80537, 79374, 78991, 79716, 81074, 82105, 82121, 81129, 79778, 78964, 79184, 80085, 80878, 81297, 81854, 83057, 84769, 86556]
55503H6556J651J491J312J344J868K676L322L896M767N686N935N580N635O662
55489A38381Q028Q923R421R981J0551J0796J0721J0470R930R063Q224P584O504
55476B58577M134N07l462o902r498j1289j2458j3245j3661j3342j2095j0553r774
55463A46939j0039j0409r714p839n855m856m854m945m472l723l366l546l901m101
55449F5319l958l247k085j300j628k554k765j879q61n39o19o06p08j136j366r43
55433C9125m09n18j042j213r39o76m47nL16l7p43r48o73q02j498j814j270p32
55415B5675j058j709j535m05P86J323J227P28k0p16r86q24o73q95j398j779j673
55398A6068r69Q7R57J202R10N76M95M62J85j44m5M94P65J86q28j234o21L26P59
$$ y = [86556, 88207, 89698, 91010, 92354, 94222, 96898, 100220, 104116, 108883, 114569, 120504, 126084, 131719, 138381, 146409, 155332, 164753, 174734, 185285, 196081, 206802, 217272, 227202, 236265, 244489, 252073, 258577, 262711, 263218, 259756, 252854, 243356, 232067, 219609, 206364, 192703, 179361, 167266, 156713, 146939, 136900, 126491, 116777, 108938, 103083, 98227, 93373, 88428, 83956, 80233, 76867, 73321, 69420, 65319, 61361, 58114, 56029, 54729, 53101, 50547, 47782, 45903, 45042, 44503, 43884, 43278, 42570, 41434, 40068, 39125, 38716, 38198, 37156, 35943, 35004, 34328, 33881, 33876, 34192, 34155, 33412, 32464, 31791, 30989, 29491, 27677, 26407, 25675, 24617, 22908, 21373, 20968, 21754, 23077, 24304, 25032, 25012, 24296, 23310, 22486, 21813, 20918, 19520, 17741, 16068, 15099, 15186, 16143, 17345, 18255, 18831, 19326, 19788, 19973, 19829, 19784, 20278, 21043, 21229, 20401, 19167, 18546, 18872, 19631]
55379A9631O13L55J60k06p81j274j487j494j328r26m59l58p11r58n20M00R65P03
55361A2325j6n09n49l66j04K87O33M75k64r33q51k15J76m2m78p00o51l57K34Q78
55341H973J014N18m4j50O5K34L06L26J72n2J27P76J115N54k97m86k09m52j252
55322A1238j499o36M42O63J92q2R5K64K21L71J004J674J601N96o52j313j301j209
55304A1669j348j354q93l33k34n36p73q37r06q18k41N64R08O51L67M19N46N34
55286G385N88P80P50L63M7J15L10L80N44Q76Q41R9o66n30L15P58K62n95j090j208
55266A0324j253j181p45m4M61M35k1n04o75m67q8J61J18j45l52k57Q0L09J93m7
55246F302K5M94R31Q37J52p00j122p88P5Q30J062R36P98O08J73l03m00k19l13
$$ y = [19631, 20244, 20599, 20759, 20553, 19772, 18498, 17011, 15517, 14189, 13263, 12804, 12446, 11735, 10777, 10257, 10657, 11622, 12325, 12309, 11800, 11251, 10885, 10781, 11068, 11701, 12176, 11912, 10979, 10128, 9913, 10089, 10047, 9569, 8869, 8218, 7861, 8095, 8973, 9987, 10505, 10461, 10311, 10376, 10610, 10916, 11242, 11414, 11362, 11489, 12265, 13380, 13934, 13637, 13151, 12942, 12490, 11238, 9739, 9103, 9545, 10208, 10400, 10318, 10413, 10677, 10898, 11269, 12273, 13947, 15548, 16144, 15492, 14179, 12878, 11669, 10321, 8967, 8074, 7741, 7507, 6971, 6198, 5361, 4455, 3637, 3396, 3960, 4868, 5519, 5886, 6305, 6851, 7385, 7973, 8753, 9503, 9866, 9913, 10028, 10338, 10718, 11262, 12138, 12979, 13078, 12412, 11882, 12197, 12955, 13217, 12622, 11532, 10324, 9071, 7890, 7145, 7101, 7562, 7997, 7976, 7472, 6797, 6330, 6242, 6403, 6521, 6376, 6024, 5767, 5847, 6156, 6349, 6302, 6327, 6821, 7752, 8589, 8741, 8041, 6919, 6131, 6206, 7036, 8098, 9034, 9832, 10440, 10613, 10310, 9910, 9691, 9378]
55227I378q01j122r11m95k24J29P60J189Q18j13p49p14l83j48M4L11M90L74L7
55208G870k36k29M4L59M62L25J41j5l02p33r07m79L05Q82J082J180J244R44J37
55189A2074p40j108r05n35l01p7L96J031J297P39l79j158r58j49L25Q1l08j63
55171I162L82O00J29o17j014r09o40n01m45k48J44N18O01L65J49L04O93P30J28
55152I531n63n74K0L25j25p22o99k47j25m57o07j77M68P67O07K50n2k03l05n32
55132F580q23p47q8P08J084J190J475J668J033k52r44l39Q01J361J130M18o85
55115A3570j849k152j201j11k00j081j211k57M86K56J7Q48K159K503J580M72M9
55098A3878O8q8m48n06L9R57J673J759J251O18L56N28P27N23m3n09n38l01j80
$$ y = [9378, 8577, 7455, 6544, 6049, 5825, 5954, 6714, 7903, 8721, 8608, 7859, 7145, 6762, 6614, 6658, 6969, 7459, 7833, 7870, 7634, 7405, 7449, 7808, 8270, 8595, 8736, 8721, 8419, 7686, 6779, 6300, 6605, 7487, 8569, 9749, 10993, 11937, 12074, 11334, 10226, 9321, 8786, 8485, 8408, 8804, 9835, 11132, 11871, 11492, 10334, 9376, 9227, 9552, 9633, 9325, 9162, 9544, 10144, 10273, 9656, 8642, 7733, 7093, 6592, 6147, 5899, 6043, 6561, 7162, 7527, 7676, 7980, 8673, 9403, 9531, 8968, 8394, 8414, 8739, 8614, 7892, 7193, 6946, 6821, 6364, 5757, 5580, 6048, 6815, 7422, 7672, 7620, 7417, 7112, 6580, 5757, 5010, 4922, 5630, 6714, 7904, 9379, 11047, 12080, 11828, 10884, 10545, 11346, 12707, 13837, 14255, 13570, 11721, 9569, 8368, 8257, 8057, 6976, 5765, 5508, 5994, 6250, 6267, 7115, 9274, 11777, 13357, 13829, 13878, 13946, 13858, 13410, 12904, 12943, 13900, 15573, 17332, 18583, 19201, 19557, 20085, 20812, 21335, 21292, 20783, 20245, 19944, 19764]
55079A9764k01q3J64R4m80j037r76m99l60q01j257j192p65m33k47J19Q02J505
55061A4117J818J577R16Q4o63j108j094o84k11j7m9J13O54J145J016K82m75p79
55043A6642o12j11O37J367J552R12j15p35n46J73Q40J035O49j44r21j226r63m87
55025A7947j97r0J13M73O80M66l2m88p53r08j047j192j234q74J79J634K559K277
55007A9513J200L62K11L38L18K03J13q0l89n79n99o89q25o27j05J08l16p96p53
54988A6608n21o88j015q20j40L87O22J027J632J773J130K27l29n41o48o41m90
54971A7573m09n05n40k99O0L13M71N37K65m40j126j168m67M88J189J476J381R03
54953A9702J34n56o86j98L17K35k55k85N26J468J656J146O35L86J39q1J49Q30
$$ y = [19764, 19563, 19480, 19644, 19738, 19258, 18221, 17245, 16746, 16386, 15585, 14328, 13136, 12371, 11938, 11691, 11810, 12612, 14117, 15935, 17512, 18428, 18512, 17849, 16741, 15647, 14963, 14752, 14735, 14686, 14799, 15453, 16598, 17614, 17896, 17421, 16642, 16030, 15919, 16556, 17923, 19475, 20387, 20272, 19537, 18991, 19164, 20004, 21039, 21688, 21544, 20623, 19397, 18434, 17947, 17750, 17660, 17773, 18246, 18926, 19392, 19360, 18872, 18119, 17211, 16164, 14972, 13738, 12864, 13043, 14677, 17236, 19513, 20713, 21075, 21286, 21624, 21942, 22145, 22258, 22178, 21789, 21210, 20611, 19922, 19097, 18470, 18365, 18473, 18157, 17361, 16608, 16087, 15399, 14384, 13564, 13424, 13811, 14433, 15460, 17092, 18865, 19995, 20222, 19893, 19352, 18704, 18063, 17573, 17164, 16659, 16119, 15820, 15880, 16193, 16664, 17201, 17466, 17026, 15900, 14732, 14265, 14753, 15942, 17418, 18799, 19702, 19836, 19280, 18594, 18396, 18713, 18948, 18693, 18408, 18934, 20402, 22058, 23204, 23839, 24225, 24364, 24283, 24432, 25262]
54935B5262J377J461J418J558J687J668J865K568L404L886M161M657N203N122
54921F5297M158K857J888J264M34r97k691l863m177m175m555n124m996l867k544
54906C8909j987k222k594k616k187j325k28N58N46q8o53o41j46L96O53O17N96
54889B7588Q76J406J966K609L520M435M750M399M115M372M665M347L596K864J860
54874G7368L9k143l506l770l935m807n927o323n681m364k863j672j266j658k236
54859B7256k404k092j480o29K58O92M70J04J25L16J21l70n53l36l30q42j273r02
54841A8131J41J026J158O19j37p42j043j054r06p53o83o73o12m48k71k78n28q03
54823A2144p67k77N08J247J572J266N07j40j70L41Q63J037R35P21L49k12o62o15
$$ y = [25262, 26639, 28100, 29518, 31076, 32763, 34431, 36296, 38864, 42268, 46154, 50315, 54972, 60175, 65297, 69455, 72312, 74200, 75464, 75898, 74901, 72210, 68347, 64170, 59995, 55440, 50316, 45320, 41453, 38909, 36922, 34700, 32106, 29490, 27303, 25978, 25750, 26308, 26854, 26766, 26113, 25472, 25326, 25722, 26375, 26992, 27588, 28464, 29870, 31836, 34445, 37965, 42400, 47150, 51549, 55664, 60036, 64701, 69048, 72644, 75508, 77368, 77407, 75264, 71758, 67988, 64053, 59246, 53319, 46996, 41315, 36951, 34088, 32416, 31150, 29492, 27256, 24852, 22760, 21280, 20651, 20909, 21601, 22071, 22175, 22300, 22616, 22737, 22367, 21814, 21478, 21148, 20306, 19033, 18131, 18272, 19298, 20456, 21075, 20938, 20196, 19153, 18099, 17193, 16440, 15757, 15084, 14472, 14024, 13753, 13475, 12947, 12144, 11377, 11100, 11608, 12855, 14427, 15693, 16200, 16060, 15890, 16231, 17094, 18131, 19066, 19787, 20136, 19924, 19262, 18647]
54805A8647j21L01J85m10r73j013n10NMm25o16j09P93J401J450J191Q72N27K61
54786B1460L36P34R99Q02M75O08J267J913K139K114K168K219J994J705K031L258
54770D6222M673N279M942M384M037L460K236Q15r0o50j656l176m269m307l827
54755E8073l655l736l382k384j213l31J94M14L63K35L65Q39J316J335P15k24q26
54738D8098o41J0K56k46p49k99J013K151K418K140K098K700L764M678M631L222
54722G5244J013q12j572j659j863k490l298l940m192l929l251k511k055j999k255
54707D0431k660k936k828k357j819j387j004p04p64j207j530j187k52O47R86O98
54691B2127J13k23J25J023J723J642J037N62K96k25r92j260n87L12M19k22n65
$$ y = [18647, 18526, 18827, 19012, 18602, 17629, 16616, 16106, 16111, 16115, 15690, 15074, 14965, 15758, 17159, 18609, 19800, 20672, 21199, 21460, 21796, 22530, 23529, 24331, 24806, 25414, 26681, 28594, 30733, 32847, 35015, 37234, 39228, 40933, 42964, 46222, 50895, 56174, 61116, 65500, 69537, 72997, 75233, 76048, 75958, 75308, 73652, 70476, 66207, 61900, 58073, 54418, 50682, 47300, 44916, 43703, 43372, 43566, 43980, 44343, 44578, 44943, 45782, 47098, 48433, 49148, 48924, 48098, 47457, 47467, 47723, 47477, 46728, 46429, 47442, 49593, 52011, 54151, 56249, 58949, 62713, 67391, 72022, 75244, 76257, 75445, 73873, 72214, 70351, 67861, 64563, 60623, 56431, 52502, 49251, 46740, 44685, 42686, 40431, 37771, 34835, 32007, 29650, 27831, 26444, 25440, 24736, 23972, 22765, 21235, 20048, 19796, 20443, 21429, 22127, 22240, 22017, 22142, 23165, 24888, 26530, 27567, 28129, 28425, 28200, 27208, 25948, 25361, 25673, 26092, 25870, 25305]
54674B5305m9O56O39km11j80K13J82k86q11j068q69j57P47J178Q05J05j40K42
54655B6099P12P07J79n18q72n07M58J289J296O80L75R19J872K466K529K506K784
54638D2974L242L410K936K001J289J328J775J648M03j370k566k695k209j797j658
54623D8711j527j208r20j013j440j744j580j089n83j32K43L29J0l52l48k06m84
54606C6667j119j443j194q44p04m42J53N76L20l46q65j184j468j430p19K93Q91
54589B7142J019J178J353R07k34j162j133n49k81m22l99l0J60k04p08o99k08R8
54571B5828j64o03o51l88l58p02r21o26q9K24L45O46J132J352R66J39o72j044
54553B4414p57P6R24J166O72l6l60j91J23K98L41L95N28P31J004J238J166O14
$$ y = [25305, 25256, 25912, 26551, 26549, 26138, 25958, 26171, 26353, 26067, 25256, 24188, 23319, 23162, 23909, 25087, 25892, 25997, 25857, 26099, 26811, 27518, 27697, 27179, 26307, 25800, 26258, 27547, 28843, 29523, 29898, 30817, 32689, 35155, 37684, 40190, 42974, 46216, 49626, 52562, 54563, 55852, 57180, 58955, 60603, 61006, 59636, 57070, 54375, 52166, 50369, 48711, 47184, 45976, 45056, 44043, 42603, 40859, 39279, 38190, 37607, 37475, 37718, 38047, 38057, 37705, 37357, 37151, 36667, 35548, 34105, 32911, 32067, 31363, 30921, 31074, 31650, 31970, 31624, 30759, 29575, 28107, 26677, 25958, 26251, 27142, 28161, 29339, 30692, 31599, 31365, 30203, 29070, 28521, 28240, 27818, 27419, 27389, 27549, 27345, 26637, 25938, 25730, 25828, 25664, 25061, 24410, 24022, 23664, 22962, 22041, 21415, 21326, 21550, 21895, 22541, 23673, 25025, 25991, 26130, 25458, 24414, 23657, 23733, 24657, 25823, 26495, 26459, 26099, 25908, 26031, 26329, 26670, 27065, 27593, 28324, 29328, 30566, 31732, 32346]
54535C2346j78o99p22m31K8P18J449J574Q81K55P24J924K392J545M64L21P94P44
54517D4129j03r30j062o97m44o42j202j687j596q30R7N29K81l09p44o79j75J17
54499C4053n26j869k656k021o04L41N22O01Q90R99Q11Q73J488K068J842Q30k05
54482C7437o17m46k03k38l22rN71O73Kp12o56q1K32L05P62J479J508N95l03m02
54462C9575j54k88o40o68n35q01j356j491r55k47J51K84L70M71O34R93J487J726
54444C8556J358N28j68k63J20M04K06k73n75o01o06p23p92o96n61n03m92n42p83
54425C3594j168j400j261q17k42L29O86O68M81O12J193J795J976J748J364R59
54409D0517O24M86M06K9n92q09k00P62J264J132P79M43K9l72m24q0K27J07l46
$$ y = [32346, 32168, 31469, 30747, 30316, 30344, 31062, 32511, 34085, 34966, 35221, 35945, 37869, 40261, 41806, 42270, 42591, 43385, 44129, 44026, 43096, 42034, 41337, 40893, 40251, 39049, 37362, 35766, 34936, 35033, 35562, 35843, 35534, 34790, 34111, 33936, 34053, 33527, 31658, 29002, 26981, 26377, 26718, 27240, 27841, 28731, 29730, 30541, 31414, 32902, 34970, 36812, 37642, 37437, 36820, 36374, 36171, 35933, 35611, 35602, 36173, 36846, 36848, 36136, 35480, 35399, 35631, 35936, 36698, 38177, 39685, 40280, 39977, 39575, 39421, 39133, 38493, 37825, 37290, 36489, 35133, 33642, 32687, 32440, 32591, 32875, 33245, 33716, 34350, 35343, 36830, 38556, 39914, 40442, 40274, 40011, 40131, 40535, 40741, 40468, 39893, 39292, 38686, 37963, 37171, 36475, 35914, 35411, 34919, 34377, 33594, 32426, 31026, 29765, 28948, 28706, 29035, 29721, 30389, 30870, 31482, 32675, 34470, 36446, 38194, 39558, 40517, 41141, 41627, 42033, 42062, 41470, 40661, 40461, 41223, 42487, 43619, 44398, 44841, 44870, 44498, 44074, 43994, 44221, 44328, 43982]
54390D3982p25o88j54O15J092Q86J56n30p86p00n41l94j94N6K46L21L41L20J09
54371D3412m30j052j165n19L80Q08P31O33O11K58l74m96K86J183J248O42J98M5
54353D6399l75j087j325o92K17O02L28k86r37j317j089l50L02M51L09J42k69j119
54335C9904j888j805r08o6O3l37p44r36r04n66J33R28J370J253P59J79l64q57
54317C5214j187j161p96m46m12m89j74N95J178J066O31O54J174J358O78l02o25
54300C6956j00O65J143J263J021K93p26j396j249n41J16M51O06O96O46M15Q5l09
54282D0035p29r57p58l29j68l56l00M68J487J809J202L97M9j01o52j484j821j284
54264C6508m12J12K72M65P79R22P68M58O5m37q39q42n91n47o97m28M32J087P61
$$ y = [43982, 43257, 42569, 42415, 43030, 44122, 45008, 45164, 44634, 43848, 43148, 42607, 42213, 42019, 42075, 42321, 42642, 42983, 43303, 43412, 42982, 41930, 40765, 40246, 40626, 41434, 42165, 42798, 43409, 43667, 43293, 42797, 43083, 44266, 45514, 46156, 46354, 46399, 46024, 44937, 43612, 42920, 43137, 43739, 44067, 43781, 42844, 41527, 40438, 40088, 40390, 40841, 41150, 41292, 41023, 39904, 38016, 36211, 35303, 35237, 35300, 34963, 34219, 33283, 32379, 31813, 31946, 32874, 34244, 35497, 36256, 36435, 36071, 35214, 34027, 32866, 32070, 31624, 31212, 30723, 30549, 31144, 32322, 33388, 34019, 34673, 35847, 37205, 37883, 37581, 36956, 36856, 37521, 38664, 39927, 40948, 41241, 40515, 39119, 37870, 37329, 37445, 37896, 38502, 39198, 39844, 40259, 40344, 40035, 39306, 38349, 37591, 37262, 37094, 36738, 36438, 36906, 38393, 40202, 41404, 41801, 41850, 41749, 41097, 39613, 37792, 36508, 36096, 36208, 36480, 36945, 37724, 38646, 39414, 39872, 39937, 39500, 38661, 37819, 37228, 36681, 35984, 35556, 35988, 37075, 37836]
54245C7836j76p17n77l06k60k03L4K21K30K58L18Q0m75q06n97l21n28r63r76n48
54225C1524k86m10l62L21J230J451O80m37j003q15l94k05r6L24R72J264Q31n1
54207C4538p49q53m12J29K35k42q24q61k48N61J157J419J196L16q67j484j073
54190C1938j31N51P52P08N07J76K5L63R92J421J478J268P29k22j164j432r69m19
54172C6571k87n01q70j445k063k126j253N2Q50P52J54l69n68n17m17m28n11m26
54154B6598j11J09pq2M94J510J931J246L28L05Q96P82m42j588j548p82m35n87
54136B8617l21P33J841K275K063J507O43l96j124j199p86j51O51J368J418O44
54120C7783k45m94k88l82r58j438j258l83Q29J778J850R35k57q55p60n24m37k31
$$ y = [37836, 37660, 36943, 36366, 36060, 35800, 35597, 35631, 35852, 36082, 36340, 36658, 36738, 36263, 35457, 34860, 34539, 34011, 33048, 32072, 31524, 31238, 30828, 30466, 30787, 32017, 33468, 34148, 33711, 32708, 31893, 31499, 31294, 31198, 31522, 32494, 33758, 34589, 34538, 33789, 32936, 32524, 32653, 32888, 32646, 31822, 30961, 30713, 31274, 32431, 33850, 35046, 35362, 34495, 33011, 31938, 31807, 32358, 33110, 33818, 34325, 34501, 34526, 34889, 35881, 37302, 38780, 40048, 40777, 40555, 39391, 37959, 36990, 36571, 36284, 35783, 34913, 33468, 31405, 29279, 28026, 28078, 28928, 29680, 29834, 29465, 28897, 28380, 27963, 27535, 27024, 26598, 26487, 26596, 26589, 26507, 27001, 28511, 30442, 31688, 32016, 32321, 33217, 33999, 33557, 31969, 30421, 29639, 29204, 28617, 28296, 29029, 30870, 33145, 35208, 36715, 37358, 36962, 35838, 34639, 33853, 33702, 34353, 35721, 37139, 37783, 37538, 37044, 36756, 36374, 35416, 33978, 32720, 32337, 33166, 34944, 36794, 37729, 37472, 36617, 35857, 35333, 34896, 34665]
54102C4665K60P25P77M12o2k78k1N59Q89N14l05q52q28n33k08K66Q69J076M47
54083C8372o95j516j485p51J95R40J307J311J129J025J154J356J257O96M3j97
54067D4141l9M4o8R1O74R85M29m22m43N11J478J828J955K315K576K270J695J546
54049F1566J989K554K808K664K264J917K065K870L826M196L806L205K960L068
54035A01758L133K889K377J773J192P26N41P52J208J524J460J111O26p7j030j866
54019A18097k136j981k037k598l247l472l300l061k897k769k733k816k800k460
54005G9790j930j568j451j331j079q75q73q90o37j35K10K9o47j402j809j746j351
53988F2305q15k92L4k6m82j101j542j585j250p11j81K09M00L67J76N2J94N02O61
$$ y = [34665, 34925, 35650, 36427, 36839, 36777, 36499, 36478, 37037, 37926, 38440, 38135, 37283, 36455, 35922, 35714, 35980, 36849, 37925, 38372, 37677, 36161, 34676, 33925, 34120, 35060, 36367, 37678, 38807, 39832, 40986, 42342, 43599, 44295, 44338, 44141, 44102, 44146, 44078, 44169, 44843, 45828, 46257, 45835, 45392, 45903, 47381, 49209, 51164, 53479, 56055, 58325, 60020, 61566, 63555, 66109, 68917, 71581, 73845, 75762, 77827, 80697, 84523, 88719, 92525, 95730, 98690, 101758, 104891, 107780, 110157, 111930, 113122, 113848, 114389, 115141, 116349, 117873, 119333, 120444, 121070, 120993, 119963, 118097, 115961, 113980, 111943, 109345, 106098, 102626, 99326, 96265, 93368, 90599, 87866, 85050, 82250, 79790, 77860, 76292, 74841, 73510, 72431, 71556, 70683, 69793, 69156, 69021, 69231, 69260, 68613, 67211, 65402, 63656, 62305, 61490, 61198, 61232, 61206, 60724, 59623, 58081, 56496, 55246, 54535, 54354, 54563, 54963, 55330, 55506, 55558, 55752, 56254, 56915]
53969E6915N62M51N70Q56J132J339J402J164O92L59L26K31k07n79l32L35P01O02
53951F6519N55Q56J228J506J906K394K460J900J335J445K116K762L102L210L149
53936I6443L016L130L674M399M987N498O084O513O436N957N454M988M397L815
53922A64791L640L904M158M066L757L513L378L167K666J777O48l31q71j104j399
53907A95760j884k344k577k591k520k505k712l233l939m617n155n491n532n323
53893A45337n150n244n422n290m765m119l614l303l151k980k433j386l92k45r96
53878I6847j800j915j523j318j544j805j695j290r72r56j075j069r45r61j239
53863G6740j569j691j608j388r47l12Q0j87p98r52l96K60M02Q6l51q68j462j741
$$ y = [56915, 57477, 57928, 58498, 59354, 60486, 61825, 63227, 64391, 65083, 65442, 65768, 65999, 65792, 65213, 64881, 65216, 65917, 66519, 67074, 67930, 69158, 70664, 72570, 74964, 77424, 79324, 80659, 82104, 84220, 86982, 90084, 93294, 96443, 99459, 102589, 106263, 110662, 115649, 121147, 127231, 133744, 140180, 146137, 151591, 156579, 160976, 164791, 168431, 172335, 176493, 180559, 184316, 187829, 191207, 194374, 197040, 198817, 199465, 199134, 198263, 197159, 195760, 193876, 191532, 188955, 186364, 183844, 181339, 178627, 175394, 171455, 166838, 161683, 156192, 150660, 145337, 140187, 134943, 129521, 124231, 119466, 115347, 111733, 108430, 105279, 102299, 99866, 98480, 98088, 97843, 96847, 95047, 93132, 91609, 90291, 88747, 86942, 85247, 83957, 82985, 82029, 80954, 79885, 78940, 77979, 76740, 75171, 73480, 71872, 70484, 69537, 69225, 69305, 69118, 68320, 67368, 66972, 67232, 67634, 67720, 67369, 66501, 65039, 63298]
53845F3298j329n44j53m57j036j348j253q51j97O07J328J730J736J400Q55K96
53829F4082j26m24o65p81o96n18l54J0Q62J952K528K219J524J200J416J840K249
53812G6318K719L318L980M579M893M625L865L300L489M037M051L411K849K652
53798A28086K114P74n10n82K90O39k48j467j784j150m68m18r92j944l078m091
53782A15171m568m374l794l202k674k160j839k037k686l167k907k079j413j264
53768G7007j266r92o30o41j005j220j014o61n54p64j093j347j387j158p28k26
53752F2321K47N71N88K62j36k86j97j34k24l79n36o67o50m59l80o57r20n16N14
53733E8362J313J307R33R42J416J864J960J730J229N66N1j8K70N76P53Q14O64
$$ y = [63298, 61969, 61425, 61272, 60815, 59779, 58431, 57178, 56327, 56130, 56737, 58065, 59795, 61531, 62931, 63786, 64082, 63956, 63532, 62867, 62086, 61390, 60872, 60518, 60528, 61390, 63342, 65870, 68089, 69613, 70813, 72229, 74069, 76318, 79037, 82355, 86335, 90914, 95807, 100432, 104297, 107597, 111086, 115123, 119174, 122585, 125434, 128086, 130200, 130974, 130464, 129882, 130172, 130811, 130563, 129096, 127312, 126162, 125694, 125276, 124284, 122340, 119262, 115171, 110603, 106229, 102435, 99233, 96559, 94399, 92560, 90523, 87837, 84670, 81763, 79684, 78271, 77007, 75741, 74749, 74119, 73478, 72473, 71253, 70239, 69578, 69024, 68260, 67167, 65820, 64433, 63275, 62547, 62321, 62568, 63139, 63727, 63989, 63853, 63567, 63370, 63236, 63012, 62633, 62097, 61430, 60780, 60321, 59941, 59284, 58364, 57848, 58362, 59675, 60982, 61915, 62857, 64273, 66137, 68097, 69827, 71056, 71622, 71673, 71655, 71925, 72501, 73254, 74068, 74732]
53716G4732K17k60l11R9M55K86k87o82l79O06J694K192J935J485J463J852K100
53699H7197J859J326Q45M64N5l48m62p0O78J310J470J309J252J398J409J077P57
53682A01526Q81J267J334R05M28L38N45O31L56j69o39p72n79m46p43j251j282
53665A02330n16M43O96P4p03r09n34m3K46K79Nn47r41o17K90Q67N32r4j2O83R01
53644A02430J50o93n95K75R49R90P81P11P64R06J268J740J863J384O72L08M59
53627A14362P84R09P86O57P74J153J592J914K112K234K221J996J647J415J476
53612A36032J761K001J975J765J737K110K573K655K409K434K965L375K929J781
53598A68502P69M37N85P98Q90Q10M90lm02n15m54m71o76r49j065r31o77m89l40
$$ y = [74732, 74949, 74689, 74378, 74477, 74932, 75218, 74931, 74249, 73870, 74476, 76170, 78362, 80297, 81782, 83245, 85097, 87197, 89056, 90382, 91227, 91691, 91746, 91398, 90936, 90866, 91544, 92854, 94324, 95633, 96885, 98283, 99692, 100769, 101526, 102407, 103674, 105008, 105913, 106341, 106679, 107224, 107855, 108211, 108042, 107403, 106631, 106052, 105606, 104863, 103612, 102330, 101814, 102257, 102953, 103027, 102324, 101415, 100881, 100838, 101084, 101363, 101368, 100821, 99880, 99263, 99553, 100420, 100952, 100858, 100846, 101529, 102430, 102580, 101887, 101292, 101567, 102516, 103506, 104287, 104998, 105762, 106668, 107936, 109676, 111539, 112923, 113595, 113903, 114362, 115146, 116055, 116841, 117498, 118272, 119425, 121017, 122931, 125043, 127277, 129498, 131494, 133141, 134556, 136032, 137793, 139794, 141769, 143534, 145271, 147381, 149954, 152609, 155018, 157452, 160417, 163792, 166721, 168502, 169271, 169708, 170293, 171091, 171981, 172791, 173281, 173278, 172876, 172361, 171907, 171436, 170760, 169811, 168746, 167815, 167138, 166649, 166309]
53579A66309p7J27j80j048j782j731j150p90q30p45l20q2n33j381j885j651q35
53562A51416K10J120J512J087o9j380k012j463q1J074J248P49M94Q59J399J666
53546A57829J742J824J789J525J293J430J886K403K881L239L273K970K775L082
53532A89941L626L884L905M242N007N635N765N862O549P673Q475Q560Q341Q456
53518B75921R063R866J0593J1256J1925J2427J2503J2267J2300J3042J4213J5110
53506D20486J5410J5354J5127J4567J3731J3258J3637J4366J4534J4075J3810
53495E78355J4117J4325J3763J2838J2498J2936J3489J3579J3238J2723J2201
53484G24062J1832J1805J2082J2373J2431J2183J1607J0767R930R325Q793P948
$$ y = [166309, 166232, 166359, 166179, 165131, 163349, 161618, 160468, 159678, 158848, 158103, 157783, 157701, 157168, 155787, 153902, 152251, 151416, 151626, 152746, 154258, 155345, 155276, 153896, 151884, 150421, 150340, 151414, 152662, 153411, 153905, 154764, 156163, 157829, 159571, 161395, 163184, 164709, 166002, 167432, 169318, 171721, 174602, 177841, 181114, 184084, 186859, 189941, 193567, 197451, 201356, 205598, 210605, 216240, 222005, 227867, 234416, 242089, 250564, 259124, 267465, 275921, 284984, 294850, 305443, 316699, 328624, 341051, 353554, 365821, 378121, 391163, 405376, 420486, 435896, 451250, 466377, 480944, 494675, 507933, 521570, 535936, 550470, 564545, 578355, 592472, 606797, 620560, 633398, 645896, 658832, 672321, 685900, 699138, 711861, 724062, 735894, 747699, 759781, 772154, 784585, 796768, 808375, 819142, 829072, 838397, 847190, 855138]
53472H55138O717N401M141K686P52j530l646n101n902o728q294j0278j1355j0720
53458H11281r252q464q683r063r176r477j0227j1041j1768j2768j3926j4412j3940
53445F69084j3299j3096j2865j2096j1155j0440r521q021o584n831n197l886k372
53432E54721j618j343m75R25J717J609J563K145K799L079L411M194N177O203P581
53417E91688R284J0657J1418J2130J3153J3991J4198J4278J4989J6345J7835J9161
53405G59127K0222K0873K1225K1806K2971K4501K6118K7946L0101L2220L3818
53394A040928L4740L5025L4711L4141L3969L4462L5178L5612L5729L5534L4625
53383A424654L2783L0568K8801K7597K6342K4461K1925J9109J6373J3667J0555
$$ y = [855138, 861855, 867256, 871397, 874083, 874835, 873305, 869659, 864558, 858656, 851928, 843634, 833356, 822001, 811281, 802029, 793565, 784882, 775819, 766643, 757166, 746939, 735898, 724130, 711362, 697436, 683024, 669084, 655785, 642689, 629824, 617728, 606573, 596133, 586612, 578591, 572007, 566176, 560979, 557093, 554721, 553103, 551760, 551285, 552210, 553927, 555536, 557099, 559244, 562043, 565122, 568533, 572727, 577904, 584107, 591688, 600972, 611629, 623047, 635177, 648330, 662321, 676519, 690797, 705786, 722131, 739966, 759127, 779349, 800222, 821447, 843253, 866224, 890725, 916843, 944789, 974890, 1007110, 1040928, 1075668, 1110693, 1145404, 1179545, 1213514, 1247976, 1283154, 1318766, 1354495, 1390029, 1424654, 1457437, 1488005, 1516806, 1544403, 1570745, 1595206, 1617131, 1636240, 1652613, 1666280, 1676835]
53372A676835O919L538J308o7j920m956q615j2421j6878k2347k7803l1711l3691
53359A528191l4521l4895l5033l5152l5431l5551l5012l3854l2485l0972k9154
53348A156131k7318k6040k5314k4582k3734k3432k4133k5203k5437k4311k2496
53337H84131k1080k0357j9565j7957j5899j4412j3680j2755j1017r136q093p905
53325G12275p979q166q623r038q828q034p209o539n818n199n138n515n545m728
53311F15916l380k112j236p65m83Q3J333L069M647N723O487P208P999Q978J0252
53296F63719J1620J2672J3319J3864J4596J5559J6676J7716J8285J8182J7712
53285H33920J7224J6502J5078J3057J1057R450Q143P081O272N344L724J407r64
$$ y = [1676835, 1683754, 1687292, 1688600, 1688533, 1686613, 1681657, 1673042, 1660621, 1643743, 1621396, 1593593, 1561882, 1528191, 1493670, 1458775, 1423742, 1388590, 1353159, 1317608, 1282596, 1248742, 1216257, 1185285, 1156131, 1128813, 1102773, 1077459, 1052877, 1029143, 1005711, 981578, 956375, 930938, 906627, 884131, 863051, 842694, 823129, 805172, 789273, 774861, 761181, 748426, 737409, 728273, 720180, 712275, 704296, 696130, 687507, 678469, 669641, 661607, 654398, 647859, 642041, 636842, 631704, 626189, 620644, 615916, 612536, 610424, 609188, 608423, 607940, 608023, 609356, 612425, 617072, 622795, 629282, 636490, 644489, 653467, 663719, 675339, 688011, 701330, 715194, 729790, 745349, 762025, 779741, 798026, 816208, 833920, 851144, 867646, 882724, 895781, 906838, 916288, 924431, 931512, 937784, 943128, 946852, 948259, 947295]
53272I47295k963m764o540q005q854r285r783j0760j2416j4572j6486j7346j7138
53259H08383j6685j6694j7161j7753j8251j8440j8071j7305j6729j6678j6847
53248F17769j6790j6395j5679j4553j3199j2233j2104j2567j3037j3195j2974
53237D65043j2362j1574j1085j1018j0832j0023q859p888p004n702m144l247l404
53224C57901l829l610k974k989m145n804p062p652p881q056q286q569q708q305
53210B70031p319o399o218o467o183n140m219m075m145l611k736k480l077l813
53196B04149m133m171m134l922l513l155k993k972l178l732m216l857k592j375
53182A56206j043j344j525j409j378j532j548j323j233j514j827j684j173r01
$$ y = [947295, 944332, 939568, 933028, 925023, 916169, 906884, 897101, 886341, 873925, 859353, 842867, 825521, 808383, 791698, 775004, 757843, 740090, 721839, 703399, 685328, 668023, 651294, 634616, 617769, 600979, 584584, 568905, 554352, 541153, 528920, 516816, 504249, 491212, 478017, 465043, 452681, 441107, 430022, 419004, 408172, 398149, 389290, 381402, 374398, 368696, 364552, 361305, 357901, 354072, 350462, 347488, 344499, 340354, 334550, 327488, 319836, 311955, 303899, 295613, 287044, 278336, 270031, 262712, 256313, 250095, 243628, 237445, 232305, 228086, 224011, 219866, 216255, 213519, 211039, 207962, 204149, 200016, 195845, 191711, 187789, 184276, 181121, 178128, 175156, 171978, 168246, 164030, 160173, 157581, 156206, 155163, 153819, 152294, 150885, 149507, 147975, 146427, 145104, 143871, 142357, 140530, 138846, 137673, 136772]
53168A36772j111j222n84M34P02k22j415j704j062l81k36m69p59r32q46n71n93
53151A25801j212j845j630p23j78n26j190j526j553j418j011n14n34j146j487
53136A09308r60k27k65r64j401j157n80J7N73Q63N21l07r60j063r17j011j425
53119A00045j844j934j616j114p09m41j62Q2km64r55j237j499j849j869j153m2
53102H3237O90Q08P20P42P01L82n8l34m43n90q56j036q76m43j46k96p14r34p81
53083G9773m81k57j50k11m85p28n82j83j34o71j306j498j226o78Q6Q15R92N16
53065G3592j5j51j56l08k33L10O30j8j129j518r51k95j22j84k42l72l72K20J182
53046F9868J584J086M40L19M00J51k30k80q7pkJ01N4m13r60j029o69l50j00M17
$$ y = [136772, 135661, 134439, 133855, 134289, 134991, 134769, 133354, 131650, 130588, 130207, 129971, 129502, 128743, 127811, 126965, 126394, 125801, 124589, 122744, 121114, 120391, 120213, 119687, 118497, 116971, 115418, 114000, 112989, 112475, 111941, 110795, 109308, 108348, 108121, 107856, 106892, 105491, 104334, 103754, 103771, 104344, 105207, 105728, 105421, 104461, 103398, 102481, 101470, 100045, 98201, 96267, 94651, 93537, 92828, 92387, 92225, 92307, 92305, 91841, 90886, 89649, 88150, 86301, 84432, 83279, 83237, 83927, 84735, 85455, 86197, 86898, 87280, 87222, 86888, 86445, 85855, 84999, 83963, 83087, 82644, 82498, 82202, 81488, 80554, 79773, 79292, 79035, 78885, 78674, 78189, 77461, 76879, 76696, 76562, 75891, 74585, 73087, 71861, 71183, 71269, 72084, 73076, 73592, 73577, 73426, 73270, 72962, 72729, 73039, 73669, 73651, 72522, 71004, 70053, 69758, 69636, 69452, 69210, 68838, 68466, 68686, 69868, 71452, 72538, 72978, 73297, 73697, 73848, 73618, 73338, 73251, 73244, 73242, 73343, 73397, 72984, 72024, 70995, 70326, 69976, 69876, 70293]
53026G0293J064J209P09K69N10J141J422J059L56k99o93p16m00JJ93J54J05K13
53008G6590M62P70J064J211J094P72M10Q6k48m97l81J69P38P14r8j319k276k462
52990G6799j794p18J17M34N78J017J679K109K158K129K161J927J167K66j36P1
52974H9964L45K22j38k00K47P62O74j39j031j242p08k0L27L60K91J15k42o30q18
52955H8139p73o22m30j84K8J5l15p92j051p90j37M15N25M36N83R43J078Q20M48
52936H8336J53k32q27j412j768j886j719j142l93j03n47j199j412j154p57l17
52920G3621K21O71Q44R26J182J481J478J127O51J61l33p65j116j465j630j172
52904G5882j48O18N04k2j22K03L44J73J13K32J02m02q83j047r05m06M22R55M63
$$ y = [70293, 71357, 72566, 73275, 73544, 74054, 75195, 76617, 77676, 78032, 77733, 77040, 76324, 75924, 75925, 76118, 76272, 76377, 76590, 77052, 77822, 78886, 80097, 81191, 81963, 82373, 82459, 82211, 81714, 81333, 81502, 82240, 82954, 82856, 81537, 79261, 76799, 75005, 74287, 74404, 74838, 75416, 76433, 78112, 80221, 82379, 84508, 86669, 88596, 89763, 90029, 89893, 89964, 90309, 90531, 90393, 90193, 90440, 91202, 91876, 91737, 90706, 89464, 88756, 88736, 89063, 89423, 89714, 89829, 89587, 88957, 88139, 87366, 86744, 86314, 86130, 86158, 86173, 85858, 85066, 84015, 83225, 83088, 83503, 84028, 84464, 85047, 85990, 87068, 87888, 88336, 88489, 88257, 87430, 86018, 84250, 82364, 80645, 79503, 79110, 79007, 78460, 77261, 75849, 74695, 73938, 73621, 73842, 74513, 75357, 76283, 77465, 78946, 80424, 81551, 82202, 82363, 82030, 81265, 80149, 78684, 77054, 75882, 75734, 76352, 76856, 76834, 76712, 76915, 77259, 77432, 77545, 77777, 77879, 77477, 76594, 75547, 74642, 74236, 74658, 75613, 76076]
52885G6076p73j605j414o84K5P53J479J671J103M63M54Q20Q28L78n1k32l96p52
52867G8143j192j524j624j512j377j409j418j021k64K44J09l69p46r96j185j110
52851F2749p03m26o24q65m90L31P77N33J66K38O65R97R91O50J24l38n03l97k62
52832F3613k16j37R4M01O52Q11R74J264J679J922J576O14l82p77n77l14l25l97
52814G0475j70L22O36L77l74j075j236r30o50o45p33q31j190j742j739p07N52
52797F0340P13l30j284j213o19l69l26J75R98J345J061Q67J113J141L68n68n15
52780F2897N88J533J351M39j07J44O73Q72P04M33J46k27o42r65j183j343j295
52763F4018q13l1N26N25K86L88R15J367J344J009P47N87K59l14q41j036r14o57
$$ y = [76076, 75303, 73698, 72284, 71600, 71625, 72378, 73857, 75528, 76631, 77094, 77548, 78368, 79196, 79574, 79523, 79291, 78895, 78143, 76951, 75427, 73803, 72291, 70914, 69505, 68087, 67066, 66802, 67046, 67155, 66786, 66040, 65044, 63859, 62749, 62046, 61620, 60996, 60131, 59641, 59972, 60749, 61282, 61448, 61686, 62351, 63348, 64339, 64989, 65113, 64775, 64272, 63875, 63613, 63397, 63260, 63354, 63755, 64407, 65218, 66192, 67456, 69135, 71057, 72633, 73247, 72865, 72088, 71511, 71197, 70872, 70475, 70305, 70627, 71263, 71640, 71266, 70191, 68955, 68025, 67375, 66730, 65997, 65166, 63976, 62234, 60495, 59788, 60340, 61053, 60723, 59439, 58226, 57607, 57238, 56912, 57087, 58085, 59430, 60491, 61358, 62471, 63612, 63980, 63412, 62897, 63485, 65018, 66369, 66808, 66701, 66845, 67518, 68390, 69094, 69527, 69673, 69446, 68804, 67839, 66656, 65313, 64018, 63205, 63174, 63700, 64225, 64511, 64899, 65814, 67181, 68525, 69534, 70281, 70868, 71127, 70813, 69972, 68936, 68022, 67365]
52745F7365l81j02J60M10O78R44J113J121J009Q33N75K18j39l01j20M01J043J498
52727G6325J613J535J525J554J316O49j49n64l84O8K48n1m62n14k87l10o38o03
52709H0871J78R44P76J14L06J524K237J250o17j638j277l44M50J107J741K158
52693H9780K106J386j08j932k926k264n83O66Q29M01j21p75j496j819j545j019
52677H0580n19k5K60n5p43r53m53q9n30j195j169n65j93k41j33L90Q01N36k82
52658G5422j063j349j106n86p6K61L85L06J65J81K19k91j510k452j868K4J535
52641F8197J583Q88O70R33R23O08O72J223J553J194M33k67p31q44n02RR8m28j148
52622G5064j593j639j300n85K00N07K18r1J25O17P06K61j23Q3O39R11O88L74L56
$$ y = [67365, 66984, 66882, 67042, 67452, 68130, 69074, 70187, 71308, 72317, 73150, 73725, 73943, 73804, 73503, 73383, 73784, 74827, 76325, 77938, 79473, 80998, 82552, 83868, 84517, 84368, 83804, 83420, 83488, 83736, 83685, 83223, 82709, 82422, 82112, 81474, 80871, 81049, 81993, 82769, 82883, 83189, 84713, 86950, 88200, 87583, 85945, 84668, 84324, 84774, 85881, 87622, 89780, 91886, 93272, 93164, 91232, 88306, 86042, 85459, 86125, 86954, 87355, 87234, 86459, 84963, 83144, 81599, 80580, 80061, 80036, 80296, 80241, 79498, 78545, 78092, 78003, 77473, 76278, 75109, 74544, 74351, 74110, 73977, 74367, 75168, 75704, 75422, 74359, 73010, 71904, 71318, 71242, 71503, 71888, 72194, 72359, 72540, 72759, 72468, 70958, 68506, 66638, 66662, 68197, 69780, 70668, 71338, 72271, 73194, 73802, 74474, 75697, 77250, 78444, 78877, 78610, 77879, 77035, 76533, 76542, 76640, 76212, 75064, 73471, 71832, 70532, 69947, 70147, 70654, 70872, 70781, 70906, 71523, 72229, 72490, 72367, 72450, 73089, 74000, 74688, 75062, 75418]
52603G5418N27N96N41N00M00J29l5K77Q55J020N92J51J42K76J68l1j12l52j007
52584H0055j611j499q01k35p3J5J85K14J09K13N74P19L65j77m78n22m89l79j05
52565G6080K75O15Q32Q88P81N99M65L58K15J29K19L77L87K75J85%n32j213j427
52546G9508r24k80k03o23p39K0J207J689Q54n85j281q55k88n01j030q19N7M19
52528G5626k92j212j306o29O3L68L37J9n01q46p08l30k16m66p28p35n00j60J17
52509F7901J22j16k39l0J20l56j344k057j919j132k78L10O32P97R00R63Q89O24
52491F5787L98N62J052J300Q84O5n58p61p42o63n06l60m00n32m43j66p8j60K06
52472F4885J245K091J761O00j44n6M2l86o86j95N20M53k96p40n20k69l95m15J60
$$ y = [75418, 75945, 76541, 77082, 77582, 77982, 78111, 78076, 78353, 79208, 80228, 80820, 80971, 81113, 81389, 81557, 81526, 81414, 81062, 80055, 78444, 76945, 76144, 75909, 75836, 75851, 76036, 76250, 76359, 76572, 77146, 77865, 78230, 78053, 77575, 77053, 76564, 76185, 76080, 76355, 76970, 77802, 78690, 79471, 80070, 80535, 80893, 81108, 81237, 81456, 81833, 82220, 82495, 82680, 82680, 82148, 80935, 79508, 78584, 78304, 78101, 77478, 76739, 76759, 77966, 79655, 80509, 79924, 78643, 77788, 77500, 76999, 75969, 75150, 75207, 75626, 75334, 74122, 72816, 72187, 72250, 72618, 72955, 72974, 72473, 71627, 70919, 70589, 70373, 69907, 69179, 68444, 67944, 67784, 67901, 68023, 67907, 67668, 67638, 67758, 67402, 66058, 64001, 62082, 60950, 60672, 60982, 61614, 62411, 63311, 64274, 65163, 65787, 66185, 66747, 67799, 69099, 69983, 70048, 69490, 68729, 67987, 67324, 66818, 66458, 66058, 65526, 65083, 64917, 64839, 64679, 64885, 66130, 68221, 69982, 70582, 70438, 70382, 70424, 70038, 69352, 69157, 69677, 70130, 69834, 69094, 68574, 68305, 67910, 67495, 67655]
52453F7655R81J299R06K29k54l61j70J45M60P69J057J152R19N17K62J50n9l33
52435G5324l37K4L84M57L86L94M03L10K83L91K89l12r88j000k98L64M18J40N4
52416G6686J01j54p02r27m10N18J162J237R99P70O06L72n1o61j191j169m07O45
52398G7424J291J402J436J630J640J161N02J67K02L25M64P03R12Q97Q38J140J827
52381I3961K426K460J878J022L62J55J76L7j33K70J306K045J701Q18N63J129J703
52364A11879J821J858K087K191K013J904K037K058J781J568J640J657J489J709
52350A37692K703L826M164L779L440L436L357K993K717K870L251L471L473L596
52336A84768M235N537P232Q814R974J0798J1490J2066J2384J2355J2036J1661
$$ y = [67655, 68636, 69935, 70841, 71070, 70816, 70455, 70285, 70430, 70890, 71659, 72716, 73868, 74787, 75304, 75566, 75716, 75657, 75324, 74987, 75011, 75395, 75852, 76238, 76632, 77035, 77345, 77628, 78019, 78308, 77996, 77008, 76008, 75710, 76074, 76492, 76632, 76686, 76787, 76633, 75931, 75004, 74594, 75112, 76274, 77511, 78510, 79280, 79886, 80258, 80207, 79546, 78355, 77186, 76779, 77424, 78715, 80117, 81553, 83183, 84823, 85984, 86486, 86653, 86855, 87180, 87644, 88347, 89259, 90156, 90994, 92134, 93961, 96387, 98847, 100725, 101747, 102109, 102264, 102440, 102477, 102344, 102614, 103920, 105965, 107666, 108484, 109047, 110176, 111879, 113700, 115558, 117645, 119836, 121849, 123753, 125790, 127848, 129629, 131197, 132837, 134494, 135983, 137692, 140395, 144221, 148385, 152164, 155604, 159040, 162397, 165390, 168107, 170977, 174228, 177699, 181172, 184768, 189003, 194540, 201772, 210586, 220560, 231358, 242848, 254914, 267298, 279653, 291689, 303350]
52324C03350J1649J2218J2909J2902J2035J1137J1018J1488J1757J1507J1020
52313D32990J0443R433P687N486L564K502K214J989J184m3r27j038q27j039j944
52298D71674l317m761n798n930n133m032l265k852k550k434k632k637j599O08
52284D25342L066M754N514N949O617P497Q184Q472Q605Q918R363R726J0133J0813
52270E32953J1332J0760Q951P051O154N976N496M493L602L092K501J588Q18N91
52256F05358N15j47j558l122m094m280m214m651n756o896p364p141o799o868p460
52241E35523q222q407p379n395l516k337j418m00lr42k327k451j049L66O53L91
52225D93087O34J379J904J926J759J709J919K438L082L446L406L290L338L399
$$ y = [303350, 314999, 327217, 340126, 353028, 365063, 376200, 387218, 398706, 410463, 421970, 432990, 443433, 452866, 460553, 466039, 469603, 472105, 474319, 476308, 477492, 477449, 476522, 475484, 474657, 473618, 471674, 468357, 463596, 457798, 451868, 446735, 442703, 439438, 436586, 434036, 431602, 428970, 426333, 424734, 425342, 428408, 433162, 438676, 444625, 451242, 458739, 466923, 475395, 484000, 492918, 502281, 512007, 522140, 532953, 544285, 555045, 563996, 571047, 577201, 583177, 588673, 593166, 596768, 599860, 602361, 603949, 604767, 605358, 605873, 605726, 604168, 601046, 596952, 592672, 588458, 583807, 578051, 571155, 563791, 556650, 549851, 542983, 535523, 527301, 518894, 511515, 506120, 502604, 500267, 498849, 498449, 498446, 497504, 495177, 492726, 491677, 492043, 492696, 493087, 493721, 495100, 497004, 498930, 500689, 502398, 504317, 506755, 509837, 513283, 516689, 519979, 523317, 526716]
52211E26716L350L351L431L300K906K682K879L095K887K409K053J827J543J240
52197E63669J011O08k05j185j809j808j266n33k85j170k918m222m048k815j748
52182E41276j425j524j701j989k344k516k466k488k766l086l061k495j585r08
52168E10922r24j382j485r26k90j76m34p61j365k293k642j570K74J342J195P83
52152E00268P37O06P9j71M63J506K169K404K571K627K409K251K568L159L615M113
52136E31374N078O300P101P339P554Q098Q757R295R824J0412J0849J1034J1183
52123F44198J1431J1536J1186J0466R730R203Q831Q421P795O873N713M444L121
52110G52948J768M96n16j221j823k607l665m799n676o101o189o196o244o266o265
$$ y = [526716, 530066, 533417, 536848, 540148, 543054, 545736, 548615, 551710, 554597, 557006, 559059, 560886, 562429, 563669, 564680, 565288, 565083, 563898, 562089, 560281, 559015, 558482, 558197, 557027, 554109, 549887, 545839, 543024, 541276, 539851, 538327, 536626, 534637, 532293, 529777, 527311, 524823, 522057, 518971, 515910, 513415, 511830, 510922, 509998, 508616, 507131, 506205, 505915, 505739, 505305, 504544, 503179, 500886, 498244, 496674, 496948, 498290, 499485, 500268, 501005, 501611, 501690, 501519, 501982, 503488, 505657, 508061, 510632, 513259, 515668, 517919, 520487, 523646, 527261, 531374, 536452, 542752, 549853, 557192, 564746, 572844, 581601, 590896, 600720, 611132, 621981, 633015, 644198, 655629, 667165, 678351, 688817, 698547, 707750, 716581, 725002, 732797, 739670, 745383, 749827, 752948, 754716, 755212, 754696, 753475, 751652, 749045, 745380, 740581, 734905, 728804, 722615, 716419, 710175, 703909, 697644]
52095F97644o353o447o108m995l405k103j502j231n45Q71K581L825M300M504N183
52080F86219O489P876Q875R585J0281J0907J1309J1652J2071J2122J1208R541
52068H08135Q035P147O420N356M128L010J646m66l036n181o518p541q806j0196
52054H02133j1202j1675j1988j2581j3457j4248j4680j4879j5135j5422j5475
52043F51391j5316j5344j5628j5467j4109j1779r536q122p344o642n816n063m610
52030E16615m581m927n318n337n003m839n138n499n381m944m861n396o173o866
52016D42352p596q489r294r813j0286j0967j1505j1376j0789j0621j1284j2107
52004C18225j2134j1247j0113r335q982q869q836q718q401p980p652p354o791
$$ y = [697644, 691291, 684844, 678736, 673741, 670336, 668233, 666731, 665500, 664955, 665826, 668407, 672232, 676532, 681036, 686219, 692708, 700584, 709459, 719044, 729325, 740232, 751541, 763193, 775264, 787386, 798594, 808135, 816170, 823317, 829737, 835093, 839221, 842231, 843877, 843411, 840375, 835194, 828676, 821135, 812329, 802133, 790931, 779256, 767268, 754687, 741230, 726982, 712302, 697423, 682288, 666866, 651391, 636075, 620731, 605103, 589636, 575527, 563748, 554212, 546090, 538746, 532104, 526288, 521225, 516615, 512034, 507107, 501789, 496452, 491449, 486610, 481472, 475973, 470592, 465648, 460787, 455391, 449218, 442352, 434756, 426267, 416973, 407160, 396874, 385907, 374402, 363026, 352237, 341616, 330332, 318225, 306091, 294844, 284731, 275396, 266414, 257545, 248709, 239991, 231590, 223610, 215958, 208604, 201813]
51991B01813n892n020m581m611m862n052m934m302l241k223j754j940k452k812
51977A48137k613j778p83l71p41j244j222r16j068j770k291k128j703j716k211
51962A25582k646k615k163j545j015p97j008j498j918j910j334l85M37O58L23
51947A08166l7l0J21k5m54o53k94L13N20lr63j694j617o30P46J611J316N6j159
51928A05290j411q28l98p18j216r65rO28K86n17q12l39L69O91L99l84j308j896
51910I6862j881j424r27o86p58r95r95l62P54J524J305M96M3K35M62K94J67O30
51892I4744J356J497R53O95J618L360M649M692L955L482L849M962O657Q828J1001
51877A56298J2339J2420J1679J0632Q946N821J263l577p412r721j0621j0373r382
$$ y = [201813, 195921, 190901, 186320, 181709, 176847, 171795, 166861, 162559, 159318, 157095, 155341, 153401, 150949, 148137, 145524, 143746, 142963, 142592, 141851, 140607, 139385, 138469, 137401, 135631, 133340, 131212, 129509, 127793, 125582, 122936, 120321, 118158, 116613, 115598, 114801, 113793, 112295, 110377, 108467, 107133, 106748, 107185, 107843, 108166, 108129, 108099, 108220, 108195, 107741, 107088, 106794, 107107, 107627, 107624, 106661, 104967, 103350, 102720, 103466, 105077, 106393, 106449, 105290, 103879, 103051, 102653, 101935, 100719, 99754, 99745, 100373, 100659, 100142, 99330, 98991, 99360, 100051, 100450, 100066, 98758, 96862, 94981, 93557, 92630, 91944, 91186, 90191, 89196, 88834, 89588, 91112, 92417, 92913, 92956, 93191, 93653, 93947, 94114, 94744, 96100, 97597, 98550, 99245, 100863, 104223, 108872, 113564, 117519, 121001, 124850, 129812, 136469, 145297, 156298, 168637, 181057, 192736, 203368, 212314, 218135, 219398, 215821, 208409, 198688, 188067, 177694, 168312]
51864A68312q279p500o912o136n189m479m183l967l422k566j807j504j654j923
51850A08791j909j343k52R81J728J533N58m51q57p72p63r79q98o3J191K042J973
51833A10510J078j99j290j625j069k01K09J03J31O45J141J037N43L21M80N14J54
$$ y = [168312, 160033, 152533, 145621, 139485, 134296, 129817, 125634, 121667, 118245, 115679, 113872, 112368, 110714, 108791, 106882, 105539, 105287, 106268, 107996, 109529, 110087, 109636, 108779, 108007, 107244, 106265, 105367, 105304, 106495, 108537, 110510, 111588, 111389, 110099, 108474, 107405, 107204, 107413, 107516, 107647, 108292, 109433, 110470, 111013, 111334, 111814, 112328, 112482]
$$ [...]
##END NTUPLES=NMR SPECTRUM
##END=
