##TITLE=NES1064_159122.0005_001_9704441_LixE7HFyrJ
##JCAMPDX= 6.0         $$ Bruker NMR JCAMP-DX V2.0
##DATA TYPE= NMR SPECTRUM
##DATA CLASS= NTUPLES
##ORIGIN= BRUKER
##OWNER= Administrator
$$ 1.72 TOPSPIN		Version 2.1
$$ 2016-04-30 16:53:47.255 -0700  Administrator@X
$$ Compression mode = diff/dup
##.OBSERVE FREQUENCY= 400.02188249412
##.OBSERVE NUCLEUS= ^1H
##.ACQUISITION MODE= SIMULTANEOUS (DQD)
##.ACQUISITION SCHEME= undefined
##.AVERAGES= 8
##.DIGITISER RES= 22
##SPECTROMETER/DATA SYSTEM= spect
##.PULSE SEQUENCE= zg30
##.SOLVENT NAME= COFFEE_meoh
##.SHIFT REFERENCE= INTERNAL, COFFEE_meoh, 1, 14.98509
##AUDIT TRAIL= $$ (NUMBER, WHEN, WHO, WHERE, PROCESS, VERSION, WHAT)
$$ ##TITLE= Audit trail, TOPSPIN		Version 2.1
$$ ##JCAMPDX= 5.01
$$ ##ORIGIN= Bruker BioSpin GmbH
$$ ##OWNER= Administrator
$$ $$ E:\/data/COFFEE/nmr/NES1064_159122.0005_001_9704441_LixE7HFyrJ/10/pdata/1/auditp.txt
$$ ##AUDIT TRAIL=  $$ (NUMBER, WHEN, WHO, WHERE, PROCESS, VERSION, WHAT)
(   1,<2016-04-30 16:53:39.942 -0700>,<Administrator>,<X>,<go>,<TOPSPIN 2.1>,
      <created by zg
	started at 2016-04-30 16:52:34.021 -0700,
	POWCHK enabled, PULCHK disabled,
       configuration hash MD5:
       21 0F 79 D6 B3 7B B4 F6 88 20 88 DB 03 48 BD 9F
       data hash MD5: 64K
       6B 40 A7 51 95 F1 FF AB 07 1E 41 99 6C D3 EA 2C>)
(   2,<2016-04-30 16:53:43.224 -0700>,<Administrator>,<X>,<proc1d>,<TOPSPIN 2.1>,
      <Start of raw data processing
       efp LB = 0 FT_mod = 6 PKNL = 1 PHC0 = 0 PHC1 = 0 SI = 32K 
       data hash MD5: 32K
       6A 2E 35 21 EE 7D 14 50 6A 1A 21 5E 6D A0 F7 E0>)
(   3,<2016-04-30 16:53:43.505 -0700>,<Administrator>,<X>,<proc1d>,<TOPSPIN 2.1>,
      <pk PHC0 = 91.30737 PHC1 = 0 
       data hash MD5: 32K
       1F FC 74 1F 78 6E 36 28 2C 00 0A 00 2C E9 7A D3>)
(   4,<2016-04-30 16:53:43.614 -0700>,<Administrator>,<X>,<proc1d>,<TOPSPIN 2.1>,
      <abs ABSG = 1 
       data hash MD5: 32K
       04 32 C4 33 74 5F 44 40 B2 7F BF D2 67 70 6C 73>)
(   5,<2016-04-30 16:53:43.677 -0700>,<Administrator>,<X>,<proc1d>,<TOPSPIN 2.1>,
      <abs ABSG = 2 
       data hash MD5: 32K
       55 CD F8 C7 33 51 6B 9F C2 91 02 1A 97 6B 4B 0E>)
(   6,<2016-04-30 16:53:43.755 -0700>,<Administrator>,<X>,<proc1d>,<TOPSPIN 2.1>,
      <abs ABSG = 3 
       data hash MD5: 32K
       7B 0B EF AA 1D F5 96 EB 26 07 FE F0 11 8F 51 8D>)
(   7,<2016-04-30 16:53:43.817 -0700>,<Administrator>,<X>,<proc1d>,<TOPSPIN 2.1>,
      <abs ABSG = 4 
       data hash MD5: 32K
       CB E5 08 92 AA DA 61 2B B6 F7 7E 70 1B B4 04 FD>)
(   8,<2016-04-30 16:53:43.864 -0700>,<Administrator>,<X>,<proc1d>,<TOPSPIN 2.1>,
      <abs ABSG = 5 
       data hash MD5: 32K
       1C 9D 67 61 37 C7 3D 18 65 56 81 18 DB 1E 50 12>)
$$ ##END=
$$ 
$$ $$ hash MD5
$$ $$ F3 70 BD DA 02 E8 CB 5F 09 03 F9 00 DD 07 F7 B4
##$RELAX= 
##$RELAX= 
##$RELAX= 
##$RELAX= 
##$RELAX= 
##$RELAX= 
##$RELAX= 
$$ Bruker specific parameters
$$ --------------------------
##$DU= <E:\>
##$EXPNO= 10
$$ [...]
150 150 150 150 150 150 150 150
##$TP07= 0
##$TPNAME0= <>
##$TPNAME1= <>
##$TPNAME2= <>
##$TPNAME3= <>
##$TPNAME4= <>
##$TPNAME5= <>
##$TPNAME6= <>
##$TPNAME7= <>
##$TPOAL= (0..7)
0.5 0.5 0.5 0.5 0.5 0.5 0.5 0.5
##$TPOFFS= (0..7)
0 0 0 0 0 0 0 0
##$TUNHIN= 0
##$TUNHOUT= 0
##$TUNXOUT= 0
##$USERA1= <user>
##$USERA2= <user>
##$USERA3= <user>
##$USERA4= <user>
##$USERA5= <user>
##$V9= 5
##$VALIST= <valist>
##$VCLIST= <CCCCCCCCCCCCCCC>
##$VD= 0
##$VDLIST= <DDDDDDDDDDDDDDD>
##$VPLIST= <PPPPPPPPPPPPPPP>
##$VTLIST= <TTTTTTTTTTTTTTT>
##$WBST= 2048
##$WBSW= 25
##$XGAIN= (0..3)
0 0 0 0
##$XL= 0
##$YL= 0
##$YMAX_a= 605248
##$YMIN_a= -511207
##$ZGOPTNS= <>
##$ZL1= 120
##$ZL2= 120
##$ZL3= 120
##$ZL4= 120
##$ABSF1= 14.98509
##$ABSF2= -5.573092
##$ABSG= 5
##$ABSL= 3
##$ALPHA= 0
##$AQORDER= 0
##$ASSFAC= 0
##$ASSFACI= 0
##$ASSFACX= 0
##$ASSWID= 0
##$AUNMP= <proc_prof1d_extract_pilot.lims>
##$AXLEFT= 0
##$AXNAME= <>
##$AXNUC= <1H>
##$AXRIGHT= 0
##$AXTYPE= 0
##$AXUNIT= <>
##$AZFE= 0.1
##$AZFW= 0.1
##$BCFW= 0
##$BC_mod= 0
##$BYTORDP= 0
##$COROFFS= 0
##$CY= 15
##$DATMOD= 1
##$DC= 0
##$DFILT= <>
##$DTYPP= 0
##$F1P= 0
##$F2P= 0
##$FCOR= 0.5
##$FTSIZE= 32768
##$FT_mod= 6
##$GAMMA= 0
##$GB= 0
##$INTBC= 1
##$INTSCL= 1
##$ISEN= 128
##$LB= 0
##$LEV0= 0
##$LPBIN= 0
##$MAXI= 10000
##$MC2= 0
##$MEAN= 0
##$ME_mod= 0
##$MI= 0
##$NCOEF= 0
##$NC_proc= -8
##$NLEV= 6
##$NOISF1= 0
##$NOISF2= 0
##$NSP= 0
##$NTH_PI= 0
##$NZP= 0
##$OFFSET= 14.98509
##$PC= 1
##$PHC0= 91.30737
##$PHC1= 0
##$PH_mod= 1
##$PKNL= yes
##$PPARMOD= 0
##$PPDIAG= 0
##$PPIPTYP= 0
##$PPMPNUM= 2147483647
##$PPRESOL= 1
##$PSCAL= 4
##$PSIGN= 0
##$PYNMP= <proc.py>
##$REVERSE= no
##$SF= 400.02
##$SI= 32768
##$SIGF1= 0
##$SIGF2= 0
##$SINO= 400
##$SIOLD= 32768
##$SPECTYP= <>
##$SREGLST= <1H.CDCl3>
##$SSB= 0
##$STSI= 32768
##$STSR= 0
##$SW_p= 8223.68421052631
##$SYMM= 0
##$S_DEV= 0
##$TDeff= 65536
##$TDoff= 0
##$TI= <>
##$TILT= no
##$TM1= 0
##$TM2= 0
##$TOPLEV= 0
##$USERP1= <user>
##$USERP2= <user>
##$USERP3= <user>
##$USERP4= <user>
##$USERP5= <user>
##$WDW= 1
##$XDIM= 32768
##$YMAX_p= 444128110
##$YMIN_p= -795828
##$CURPLOT= <Network HP LaserJet P1505>
##$CURPRIN= <$Network HP LaserJet P1505>
##$DFORMAT= <normdp>
##$LAYOUT= <+/1D_H.xwp>
##$LFORMAT= <normlp>
##$PFORMAT= <normpl>
##$SURQMSG= 1
$$ End of Bruker specific parameters
$$ ---------------------------------
##NTUPLES= NMR SPECTRUM
##VAR_NAME=  FREQUENCY,     SPECTRUM/REAL,   SPECTRUM/IMAG
##SYMBOL=    X,             R,               I
##VAR_TYPE=  INDEPENDENT,   DEPENDENT,       DEPENDENT
##VAR_FORM=  AFFN,          ASDF,            ASDF
##VAR_DIM=   32768,         32768,           32768
##UNITS=     HZ,            ARBITRARY UNITS, ARBITRARY UNITS
##FACTOR=    0.250966925370066, 1,           1
##FIRST=     8223.43324360094, -83628,       -34090
##LAST=      0,             -14581,          -151698
##MIN=       0,             -795828,         0
##MAX=       8223.43324360094, 444128110,    0
$$ Real data points
##PAGE= N=1
##DATA TABLE= (X++(R..R)), XYDATA
$$ [...]
$$ plain form
19522 -377520 -15838 -15855 -98655 -221343 -86705 -236581 241712 -181558 -249933 -170652 -347187
19511 -347187 39726 -210338 -156362 138762 64276 -182339 -63232 372116 6177 47754 -304626
19499 -146089 63417 88280 61932 19706 -8187 -428021 -106945 -16635 -68550 -142187 -41851
19487 -247768 -7252 -32416 -142832 -92813 2219 115608 206308 -125383 -51901 -192611 -27091
19475 571627 244914 -58683 -96820 -60136 -359292 102336 79195 -158950 83566 127235 -118667
19463 -92244 27969 21664 -66995 -65419 -200701 -74481 -142622 58825 267632 450960 -40413
19451 -168248 103133 -91676 -182793 98709 206593 152816 54886 -9525 -472 -42340 -174289
19440 -174289 -224311 57760 -313794 -168198 -11081 44156 82180 94582 272858 46049 -130784
$$ packed form
19522c77520a5838j7q2800j22688h6705j49876B41712a81558o8375P9281j76535
19511c47187C9726b10338N3976A38762F4276a82339f3232C72116F177M1577c04626
19499a46089F3417K4863k6348A9706h187m19834a06945a6635n1915p3637d1851
19487b47768g252k5164j10416N0019B219J13389R0700a25383e1901j40710b7091
19475E71627B44914e8683l8137L6684k99156A02336k3141a58950H3566M3669a18667
19463i2244B7969o305f6995J576j35282g4481o8141E8825K08807J83328d0413
19451a68248A03133i1676r1117I8709J07884n3777E4886i525d72m1868j31949
19440a74289n0022E7760c13794J45596a1081D4156L8024J2402J78276D6049a30784
$$ plain form
19428 -9590 -212086 -228983 351213 -347695 343864 -340045 -106990 -347018 70667 -303171
19417 -122594 -158945 -194216 -298734 183671 16938 -255485 125869 -34422 13180 -2769 -70063
19406 -70063 -220479 217081 70549 -151349 -237427 -256434 -5980 -188927 -44295 -46623 -87003
19395 -87003 -146334 -172715 -22550 21228 -255641 -264015 -291393 -283725 177694 178102 71230 -51433
19382 -225729 -9363 -144606 133890 -6988 10780 -14916 -12958 -5390 43975 -138974 -240626
19371 -240626 -24115 -151117 -149658 -35224 150992 -126305 74116 -1172 -47338 -205921 163414
19359 -163232 27789 -238902 -210428 123368 195787 131455 -80494 -218687 76410 30545 125869
19348 125869 194044 63992 -379931 -108102 -139942 -184228 -309228 -72149 -136420 -442136 -222663
$$ packed form
19428i590k02496j6897C51213c47695C43864c40045a06990k40028G0667c03171
19417a22594l6351l5271j04518A83671A6938b55485A25869c4422A3180b769o7294
19406g0063j50416B17081G0549a51349q6078j9007e980j82947d4295k328m0380
19395h7003n9331k6381b2550B1228b55641q374k7378P668A77694M08G1230e1433
19382b25729i363j35243A33890f988A0780a4916J958e390D3975a38974j01652
19371b40626b4115j27002J459c5224A50992a26305G4116a172m6166j58583A63414
19359a63232B7789b38902K8474A23368P2419o4332h0494j38193G6410C0545R5324
19348A25869O8175F3992c79931a08102l1840m4286j25000g2149o4271l05716K19473
$$ plain form
19337 -222663 193026 12726 -262002 -357086 -14323 168158 -128929 350 71760 -135843 -48343
19325 -41309 249214 -115526 10109 -31185 -296290 -229633 40432 -270329 -8134 144914 -277914
19313 -98375 358808 14557 -183174 -49219 116681 -29365 -312366 -195957 48563 -179326
19302 34577 103897 -13179 -225838 -164040 -126454 -224282 -182821 -199198 -251627 -18955 -147201
19291 -147201 56322 -46166 -11721 -250463 -335301 -4512 -32879 -270606 -36901 19606 -152436
19279 55619 -201297 202230 -118780 -170840 182128 -69200 -19094 108331 -244442 127271
19268 -190726 -530789 33144 50223 -223208 99454 -110284 -47062 -90465 -125108 79784 -26015
19256 -100976 -194193 64413 -309614 -145952 -66943 -109460 -28611 115085 -161700 -111915 -408528
$$ packed form
19337b22663A93026A2726b62002r5084a4323A68158a28929C50P1410a35843d8343
19325d1309B49214a15526A0109c1185k65105O6657D0432b70329h134A44914b77914
19313i8375C58808A4557a83174d9219A16681b9365k83001J16409D8563a79326
19302C4577O9320a3179k12659O1798L7586r7828M1461j6377n2429a8955j28246
19291a47201E6322d6166a1721k38742q4838d512k8367k37727c6901A9606a52436
19279E5619b01297B02230a18780n2060A82128f9200a9094A08331b44442A27271
19268a90726l40063C3144J7079b23208I9454a10284d7062m3403l4643G9784b6015
19256a00976r3217F4413c09614a45952f6943m2517b8611A15085a61700M9785k96613
$$ plain form
19245 -408528 -223146 39249 -106455 142948 -70970 147992 447891 -222103 -53687 73270
19234 -165391 -130684 258321 -67941 49275 -91588 109755 -264444 91695 -369899 -74182 145888
19222 -137260 170095 90168 -193896 121548 128939 15653 116449 31057 -25857 140212 -374507
19210 -446062 111506 21973 -113697 -61101 380 -236651 78300 97927 300679 3987 30883
19199 30883 -54135 -71794 132872 181319 -94397 -227741 -127420 -208022 4677 -110260 -40256
19187 -56973 -338936 -25283 272508 -308216 -186437 -24411 -120683 -181214 101983 -73288 -60446
19176 -60446 -235510 -16997 -275137 344607 -230270 -50482 -56643 669 -106926 38394 52304
19165 52304 -53772 -166813 -50154 82616 -53428 -62734 -201245 -512264 185971 213804 129806
$$ packed form
19245d08528J85382C9249a06455A42948g0970A47992K99899b22103e3687G3270
19234a65391L4707B58321f7941D9275i1588A09755b64444I1695c69899g4182A45888
19222a37260A70095p9927a93896A21548P391A5653J00796C1057b5857A40212c74507
19210d46062A11506B1973a13697N2596C80b36651G8300J9627K02752C987K6896
19199C0883e4135j7659A32872M8447i4397j33344J00321q0602D677a10260d0256
19187e6973k81963b5283B72508c08216J21779b4411r6272o0531A01983g3288J2842
19176f0446j75064a6997k58140C44607b30270e0482o161F69a06926C8394J3910
19165E2304e3772j13041e0154H2616e3428r306j38511l11019A85971K7833q3998
$$ plain form
19154 129806 13970 -30843 79411 -304687 211239 -157155 -104830 238266 50299 -22208 2042
19142 -20196 -216916 -152940 -183087 29397 -177485 76565 24231 260506 162161 -26529 112960
19130 59269 -296569 -15198 -94793 -220776 -92975 96211 -27561 170966 68493 27984 140916
19119 140916 -67099 -303766 -156918 -416940 -219895 270279 39968 -229009 48748 -51831
19108 -74461 24948 -133138 -63100 -40316 -44339 -101229 -299264 36102 -61300 -29932 -69553
19097 -69553 -9583 -115332 -388148 -196105 -52487 74310 162563 162091 -308885 -279388 52651
19085 38781 -21432 -377108 -74345 -156501 176978 -66658 301898 -177974 8844 -233596 -147810
19074 -147810 189473 -215626 -9535 -15192 12857 59739 -109434 119246 -46815 -134475 249415
$$ packed form
19154A29806A3970c0843G9411c04687B11239a57155N2325B38266E0299b2208B042
19142b0196j96720O3976l0147B9397a77485G6565B4231K36275r8345b6529A12960
19130E9269b96569a5198p9595j25983i2975I6211b7561A70966F8493B7984J12932
19119A40916f7099k36667J46848k60022J97045B70279C9968b29009D8748e1831
19108g4461B4948a33138f3100K2784m023n6890j98035C6102f1300b9932l9621
19097f9553i583j05749k72816J92043e2487G4310Q8253m72c08885K9497E2651
19085C8781b1432l55676g4345q2156A76978f6658C01898a77974H844b33596Q5786
19074a47810A89473b15626i535n657A2857M6882a09434A19246d6815q7660B49415
$$ plain form
19062 -400235 29117 -149074 -337176 15923 -106089 -168653 -94914 -5083 79121 -170865 -54891
19050 7937 -126479 -50336 -43831 -35015 -65441 -308570 7866 -121846 -47606 -277577 -244677 -127102
19038 -127102 245993 -271735 -132133 41381 -38001 -275800 -66285 120045 149590 102148
19028 102148 -170710 -33105 89985 124618 4539 314518 -11869 61597 -161767 -20401 -25964
19017 -25964 11180 -217348 252438 -129274 99245 23131 11019 20641 -489378 -239097 -3035
19005 -249462 -122138 433491 -25042 -239099 -131968 168305 -2355 -41270 -167743 59349
18994 87235 93907 -240366 -462268 -35933 78704 -120560 114824 101375 -185958 351821 -252664
18982 29540 -264004 -53164 -227429 -189246 -92136 115534 -184045 -138716 -24106 -33654 -80241
$$ packed form
19062d00235B9117a49074j88102A5923a06089o2564P3739e083G9121a70865e4891
19050G937a26479e0336O505Q816l0426k43129G866a21846d7606k29971L2900J17575
19038a27102B45993b71735a32133D1381c8001k37799f6285A20045K9545m7442
19028A02148a70710c3105H9985L4633D539L09979a1869F1597a61767b0401n563
19017b5964A1180b17348B52438a29274I9245B3131A1019R622d89378b39097c035
19005b49462a22138D33491b5042k14057J07131A68305b355l8915j26473E9349
18994H7235O672b40366k21902c5933G8704a20560A14824j3449a85958C51821b52664
18982B9540b64004e3164j74265L8183i2136A15534a84045M5329b4106r548m6587
$$ plain form
18971 -80241 184276 -113192 -307982 -104231 -158248 190592 65405 4281 -26903 -70004 -147513
18960 -147513 6052 -6192 -218736 -150444 110308 128683 -94965 -290218 -162803 -77717 -63720
18949 -63720 -32780 21722 -17960 -236878 -90571 137413 238308 76245 238356 -214693 -9263
18937 166935 -338840 31695 -168777 393912 -15801 138182 -1495 191769 186523 65475 178184
18926 178184 150414 -119995 -4348 -216348 -54328 -96422 -45062 169790 40538 50811 228720
18915 228720 -125485 183113 -210560 -185781 -309256 70852 -169891 133817 -144319 -45036
18904 -132933 295311 305869 -125385 -35499 114412 -87703 -206927 -58346 -528 -297973 328769
18892 -308537 194129 35201 -199933 -18358 -145158 -88561 -56996 -91746 -48786 -74209 204319
$$ packed form
18971h0241A84276a13192j94790a04231n4017A90592F5405D281b6903m3101p7509
18960a47513F052f192k12544O8292A10308J8375i4965j95253J27415g7717J3997
18949f3720L0940B1722a7960k18918i0571A37413J00895G6245J62111b14693i263
18937A66935c38840C1695a68777C93912a5801A38182a495A91769n246F5475J12709
18926A78184k7770a19995d348k12000e4328m2094d5062A69790D0538J0273J77909
18915B28720a25485A83113b10560K4779j23475G0852a69891A33817a44319d5036
18904a32933B95311J0558a25385c5499A14412h7703j19224e8346e28k97445C28769
18892c08537A94129C5201a99933a8358j26800N6597L1565l4750M2960k5423B04319
$$ plain form
18880 6740 -92497 -31452 4649 -161204 -33206 -229411 -235192 13730 84031 30441 -44967 -323096
18868 -323096 155294 54728 -255737 -328344 305029 -204933 -79112 -46613 168359 -7759 -123024
18857 -123024 231734 -24710 -222604 -62570 77013 131718 46845 -74662 196818 141420 -27812
18845 41343 -109664 -14300 103356 -354872 -321648 -260590 -212507 57868 -112635 218399 325563
18834 325563 -15447 96490 -434285 52297 -43825 -197316 -29666 53992 -236095 114968 290913
18823 290913 -55014 33237 117115 -14459 169735 -204478 141092 135268 -413488 229902 -18622
18811 -216281 383013 147390 87722 112190 81992 55111 -37034 236256 -349926 79917 -192288
18799 -90299 -244050 68305 228225 -170251 -29795 -153781 -238469 -160118 -233374 -94434 197225
$$ packed form
18880F740i2497c1452D649a61204c3206j96205n781A3730P0301C0441d4967k78129
18868c23096A55294E4728b55737p2607C05029b04933g9112L2499A68359g759j15265
18857a23024B31734b4710j97894f2570G7013N4705D6845g4662A96818n5398b7812
18845D1343a09664a4300A03356c54872L3224O1058M8083E7868a12635B18399J07164
18834C25563a5447I6490d34285E2297d3825j53491b9666E3992b36095A14968J75945
18823B90913e5014C3237Q3878a4459A69735b04478A41092n824d13488B29902a8622
18811b16281C83013A47390n9668K4468l0198k6881c7034B36256c49926G9917a92288
18799i0299j53751F8305J59920a70251b9795j23986q4688P8351p3256i4434A97225
$$ plain form
18787 223638 -275330 -336892 -7073 -95790 -184678 57953 -21536 -74575 -52356 -425176 -22798
18775 104481 82669 72903 45172 142110 -290381 -56422 33073 166620 89114 -305176 -85672
18763 -208147 204583 -386112 -127314 -42853 -85835 13322 -295220 169905 145220 43092
18752 12701 90984 435956 -290067 -64878 -90041 -38285 -31142 -51680 11438 31248 -232183
18740 90720 141142 51556 -148427 29066 -445286 -185324 156707 -85191 307640 247668 356138
18729 356138 -167350 -57662 -208497 -124698 -327 -25901 -74077 213465 70631 47675 95690
18718 95690 -174718 -176480 -110841 -311388 -188735 -157504 -6022 -198242 -54624 159712 -156485
18706 -261362 -212494 -173212 -96194 136703 -386349 106398 -32555 -62595 -137799 -277846 -408779
$$ packed form
18787B23638b75330o1562g073q8717q8888E7953b1536n3039K2219l72820b2798
18775A04481k1812r766k7731R6938b90381e6422C3073J33547p7506c05176h5672
18763b08147B04583c86112a27314d2853m2982A3322b95220A69905k4685D3092
18752A2701P8283L44972b90067f4878k5163c8285P143k0538A1438J9810b32183
18740I0720N0422E1556a48427B9066d45286a85324A56707h5191C07640n9972J08470
18729C56138a67350e7662j50835Q3799c27k5574m8176B13465G0631k2956M8015
18718I5690a74718j762O5639k00547J22653L1231f022j92220e4624A59712a56485
18706b61362M8868L9282P7018A36703c86349A06398c2555l0040p5204j40047j30933
$$ plain form
18695 -408779 332795 -398808 -230669 -60776 -203448 -352006 -1962 -105249 -118788 35423
18684 137773 -203391 -203129 209547 -163150 2637 154662 -126113 -186402 315443 82612 -66746
18672 12661 133522 -121314 -136438 -103723 13889 53315 -156810 -424584 204081 -74602 -246033
18661 -246033 -75114 88554 -29321 -38793 -141597 304011 -100692 94119 -66874 -259600 87097
18649 -177798 -229374 -80143 -101495 78019 188454 -293440 -297448 90929 282668 99464 -271332
18637 -139624 -84665 84793 -243564 -410365 -306974 -36491 -206706 -5544 -359733 66337 107201
18626 107201 41378 -321584 -267030 98394 -60748 -55520 -117671 30627 -212052 -107636 -63474
18615 -63474 -198368 -4227 -131560 166564 -125511 -225015 119702 -112728 -221993 296411
$$ packed form
18695d08779C32795c98808J68139f0776j42672j48558a962j03287j3539C5423
18684A37773b03391K62B09547a63150B637J52025a26113o0289C15443H2612f6746
18672A2661J20861a21314j5124L2715A3889L9426a56810k67774B04081g4602j71431
18661b46033g5114H8554b9321r472j02804C04011a00692I4119f6874j92726H7097
18649a77798n1576h0143k1352G8019J10435b93440m008I0929J91739I9464b71332
18637a39624N4959H4793b43564j66801J03391c6491j70215e544l54189F6337M0864
18626A07201D1378c21584N4554I8394f0748N228o2151C0627b12052J04416M4162
18615f3474j34894d227j27333A66564a25511r9504A19702a12728j09265B96411
$$ plain form
18604 -75758 -64238 -415907 165113 28944 -58396 -222278 -78206 146975 4862 -83210 170203
18592 368688 -287760 472557 -94087 -97272 -213573 104158 41840 -154822 -100737 297560
18581 -261347 75133 -227045 16199 -80292 -188146 47772 -139396 -154546 -320791 -8526 207086
18569 10647 -179539 -115247 -67056 95491 116558 304149 -147279 -67300 -170293 -59603 -181806
18558 -181806 -175887 -300143 248518 166903 -195623 -28418 -6748 70113 -168943 91560 -59396
18546 -84801 21341 -211664 -22390 -374173 -114108 18655 4471 -45677 23587 17190 -329038
18534 256604 63005 192524 -149267 30404 -70555 -228561 -152178 -205724 147839 -110223
18523 -50398 -132274 -36638 -338956 -254900 -147857 147460 193725 164373 -259278 28513 17451
$$ packed form
18604g5758J1520l51669A65113B8944e8396j63882g8206A46975D862h3210A70203
18592C68688b87760D72557i4087l185j16301A04158D1840a54822N4085B97560
18581b61347G5133b27045A6199h0292j07854D7772a39396j5150j66245h526B07086
18569A0647a79539O4292M8191I5491K1067J87591a47279f7300j02993e9603j22203
18558a81806N919j24256B48518q1615a95623b8418f748G0113a68943I1560e9396
18546h4801B1341b11664b2390l51783a14108A8655D471d5677B3587o397c29038
18534B56604F3005J29519a49267C0404g0555j58006P6383n3546A47839a10223
18523e0398q1876c6638l02318Q4056J07043A47460M6265k9352b59278B8513j1062
$$ plain form
18512 17451 86356 -76727 -448621 -136861 -94684 -164918 -53966 -196621 26418 68039 101900
18501 101900 -20787 -43339 -85679 -60605 -66731 -36317 121206 231470 316330 369365 -13863
18489 149605 423546 -90710 69522 166354 226435 -274965 25657 -69281 68811 200335 -299637
18477 -270780 -255140 196158 -88036 -48956 53225 -138843 -284884 -3200 -185154 -118232 9152
18465 -201964 35120 144742 -122307 -402156 105239 57374 78050 296866 68539 -184161
18454 -9367 156472 156343 -49757 -28961 -189880 400214 -259294 -177309 167551 -104556 -133534
18443 -133534 -242020 -267517 -196880 -166759 1246 -264166 200088 -189630 196833 -54683 204609
18431 -117888 66413 -68884 -217442 333847 -64985 -183413 12139 11571 -4095 -156496 -200976
$$ packed form
18512A7451O8905g6727l71894a36861M2177p0234e3966j42655B6418M1621L3861
18501A01900b0787k2552m2340K5074o126L0414A21206J10264Q4860N3035a3863
18489A49605K73941i0710F9522R6832O0081b74965B5657f9281F8811J31524b99637
18477b70780J5640A96158h8036L9080E3225a38843j46041c200j81954O6922I152
18465b01964C5120J09622a22307k79849A05239m7865K0676K18816F8539a84161
18454i367A56472j29d9757K0796j60919D00214b59294Q1985A67551a04556k8978
18443a33534j08486k5497P0637L0121A246b64166B00088a89630A96833e4683B04609
18431a17888F6413f8884j48558C33847f4985j18428A2139n68d095j52401m4480
$$ plain form
18420 -200976 235571 154874 -89593 -87511 -60564 -268287 103036 -158405 -90247 -63439 54759
18408 122768 99925 315010 48206 -43576 27741 -60357 6268 -292837 224462 104600 250463
18397 250463 -67944 352215 -22633 80436 -5220 -139870 221975 -6895 -95070 -137691 -10994
18385 -40500 162942 -264207 -124714 24147 -154717 172407 -128940 -87497 181122 -256003
18374 -130049 -228540 -44136 -7541 111360 -327989 -80741 5047 -194462 493203 -32102 -93361
18363 -93361 -90840 162554 -20766 -62009 210775 -249204 -428239 -22188 -114080 -153580 -142729
18352 -142729 -109725 -279169 -267835 -33310 24742 -88764 113955 -189838 -68983 -276 -77460
18341 -77460 -223331 -70183 22395 -149362 44606 158278 100548 21486 20717 74906 -113083
$$ packed form
18420b00976B35571q0697h9593K082K6947k07723A03036a58405O8158K6808E4759
18408A22768k2843K15085D8206d3576B7741f0357F268b92837B24462A04600J45863
18397B50463f7944C52215b2633H0436e220j34650B21975f895q8175m2621a0994
18385d0500A62942b64207a24714B4147a54717A72407a28940M1443A81122b56003
18374a30049r8491d4136g541A11360c27989h0741E047a94462D93203c2102o1259
18363i3361K521A62554b0766m1243B10775b49204j79035b2188r1892l9500J0851
18352a42729L3004j69444J1334c3310B4742h8764A13955a89838f8983b76p7184
18341g7460j45871g0183B2395a49362D4606J13672n7730B1486p69N4189a13083
$$ plain form
18329 -247285 138974 30045 -100063 -72177 -170424 131747 -327032 50574 -294729 -173682
18319 -173682 -19506 -145575 9440 50266 95107 -23875 -81473 -181105 34556 -244355 259507
18307 -94571 -169136 25886 -91516 -302649 -371857 31746 109202 97119 209229 -9916 -9163 -58510
18295 -58510 -34635 -17052 312469 220687 94506 -433245 69320 -393599 -99282 314561 -383357
18283 -23522 158123 202288 -157465 52304 -141509 -91306 -192312 -214866 14056 103483 -331114
18271 -35838 -111618 57716 -84271 75224 162617 116623 -60166 -46057 107587 58229 26384
18259 -108234 -68841 -308545 -81641 24395 -69837 162348 29114 67405 147371 -229552 -273456
18248 -273456 -89266 -105822 159192 -352062 57258 5789 90135 180147 29543 -35787 -359287
$$ packed form
18329b47285A38974C0045a00063K7886r8247A31747c27032E0574b94729J21047
18319a73682a9506j26069I440M0826M4841b3875n7598r9632C4556b44355B59507
18307i4571p4565B5886i1516k11133o9208C1746P7456j2083J12110i916P53m9347
18295e8510K3875a7052C12469r1782I4506d33245F9320c93599i9282C14561c83357
18283b3522A58123M4165a57465E2304a41509N0203j01006k2554A4056Q9427c31114
18271c5838p5780E7716h4271G5224Q7393m5994f0166J4109A07587m9358B6384
18259a08234L9393k39704h1641B4395f9837A62348B9114L8291P9966b29552m3904
18248b73456h9266j6556A59192c52062E7258E789Q4346R0012B9543c5787l23500
$$ plain form
18237 -359287 8333 161028 54186 8935 106437 355013 -45922 -118557 -202994 -112670 153438
18225 -28918 168872 186161 -78925 -168153 -35416 241681 29798 -108557 64926 19243 11541
18214 11541 11678 15337 -162745 46195 101744 -366095 405167 165519 -45423 -187505 4522
18202 -197414 -149548 -260700 87341 -148420 229562 256427 94535 300984 224296 123878
18192 123878 -155058 283254 -173217 -143390 139427 3209 117841 -147108 39522 -284729
18181 65905 90339 160267 -113046 257275 -155004 -273508 -283463 90257 49459 -57189 -240
18169 189588 28720 104597 195672 -163174 46755 220223 -21653 -254535 -138254 -77845 -22064
18157 -168404 -338671 41484 -172300 -21548 -29420 -53527 115636 -101603 -139127 378878 90232
$$ packed form
18237c59287H333J52695E4186H935R7502K48576d5922p2635q4437R0324A53438
18225b8918A68872J7289g8925q9228c5416B41681B9798a08557F4926A9243p702
18214A1541J37L659a62745D6195N5549c66095D05167A65519d5423j42082D522
18202a97414M7866j11152H7341a48420B29562K6865I4535K06449p6688j00418
18192A23878a55058B83254a73217K9827A39427C209J14632a47108C9522b84729
18181F5905K4434O9928a13046B57275a55004j18504r955I0257m0798e7189b40
18169A89588B8720P5877R1075a63174D6755J73468b1653k32882J16281O0409b2064
18157a68404j70267D1484a72300b1548p872k4107A15636a01603l7524C78878I0232
$$ plain form
18145 -203599 87946 43318 -55103 -109096 144571 -90495 -380312 -17178 251625 -55224 1533
18133 203336 -70525 34186 -4762 -263960 -186785 -81929 -35662 12247 -152027 -406022 -12946
18121 91798 75191 -122376 -38112 -351798 13213 172533 -86197 25754 -266502 129848 -246084
18109 7690 -175566 14483 -342615 27121 -158414 300881 -188618 8284 -236137 -76490 -13439
18097 -123826 -134268 -87434 138169 -70321 88563 97001 79998 35911 125766 235923 -277829
18085 -167602 40749 65747 -182622 418541 -438155 248154 186420 -168394 408517 -83472
18074 140801 -119605 -110938 215225 -42250 93445 -35771 60455 116646 -195259 -217940 -126025
18063 -126025 -44612 311633 -159722 -94037 3264 -65038 20275 -144257 -198041 30253 10145
$$ packed form
18145b03599H7946D3318e5103n3993A44571i0495k89817a7178B51625e5224A533
18133B03336g0525C4186d762k59198P7175h1929c5662A2247a52027k53995a2946
18121I1798j6607a22376c8112l13686A3213J59320h6197B5754b66502A29848b46084
18109G690a75566A4483c42615B7121a58414C00881a88618H284b36137g6490a3439
18097a23826j0442M6834A38169g0321H8563Q438j7003C5911Q9855J10157b77829
18085a67602D0749K4998a82622D18541d38155B48154o1734a68394D08517h3472
18074A40801a19605Q667B15225d2250I3445c5771F0455N6191a95259k2681R1915
18063a26025d4612C11633a59722O5685C264f5038B0275a44257n3784C0253A0145
$$ plain form
18051 209799 -77076 -103357 7989 237255 -74459 -233784 10167 175908 367382 173349 20256
18039 268122 136656 254497 -100016 -163401 1159 -158564 164195 -891 300257 -8318 -204363
18028 -204363 4004 1854 -113813 -283001 147658 -247845 219824 -13647 -113523 -55671 110819
18016 -290071 -198170 -161526 19330 -228508 -284099 -56765 56601 275054 -229348 -91890 -288080
18005 -288080 -132466 79473 150039 -264590 -30011 52595 -129830 127414 -45358 172095
17994 88839 148146 41931 -213533 -200056 133420 -196593 -40256 182788 151372 95218 64916
17983 64916 -28623 160945 16118 228139 68939 -83505 256836 15651 173127 -29719 -245106
17972 -245106 -149167 458704 71001 3876 205788 -29979 87962 4079 33715 -450870 310075
$$ packed form
18051B09799g7076k6281G989K29266g4459j59325A0167J65741J91474A73349B0256
18039B68122j31466J17841a00016o3385A159a58564A64195h91C00257h318j96045
18028b04363D004A854a13813j69188A47658b47845B19824a3647r9876e5671A10819
18016b90071R1901L6644A9330b28508n5591e6765E6601K18453b29348i1890j96190
18005b88080a32466G9473P0566b64590c0011E2595a29830A27414d5358A72095
17994H8839N9307D1931b13533J3477A33420a96593d0256A82788l1416n6154l0302
17983F4916b8623A60945A6118K12021F8939h3505B56836A5651J57476b9719k15387
17972b45106R5939D58704G1001C876K01912b9979H7962D079K9636d50870C10075
$$ plain form
17960 22893 353686 -37628 -173739 89946 247391 449508 24927 73533 122732 251633 121060
17948 -33196 252401 165458 -91482 -47963 38226 253492 96287 -194549 -69607 -138928 147688
17936 64152 -264005 40538 -58440 -298486 -228182 -120853 170220 422396 -87351 23238 199415
17925 199415 -158656 77645 -85565 -15093 -129007 -96529 -47864 -107873 -285121 416211 -365707
17913 347859 -75817 -146450 -83557 42236 31039 -6721 -170064 123986 312217 41659 -66003
17901 -61493 -88547 -1113 221964 147593 -21967 139101 -44081 -200806 -140929 -342085 -135811
17889 -84566 -22625 -238735 -186534 71090 -94434 110027 -27033 315955 -18392 -245431 131657
17877 125597 -68311 -266469 68488 99197 -166542 -49400 82894 235138 70124 102087 264633
$$ packed form
17960B2893L30793c7628j36111H9946J57445K02117B4927M8606M9199J28901A21060
17948c3196B52401q6943i1482M3519C8226K15266I6287a94549f9607o9321A47688
17936F4152b64005D0538e8440k40046P0304J07329A70220K52176h7351B3238J76177
17925A99415a58656G7645h5565a5093j13914L2478d7864o0009j77248D16211c65707
17913C47859g5817p0633O2893D2236j1197f721j63343A23986J88231D1659f6003
17901f1493k7054a113B21964p4371b1967A39101d4081j56725N9877k01156a35811
17889h4566b2625k16110N2201G1090i4434A10027b7033C15955a8392k27039A31657
17877A25597f8311j98158F8488L0709a66542d9400H2894J52244G0124L1963J62546
$$ plain form
17866 264633 -96864 261741 63812 70343 -114112 81271 111714 -26026 132813 36407 204863
17855 204863 -338974 -89779 248751 67685 -161381 -139004 30595 91819 60060 -236709 33881
17843 -173506 -124942 -283953 -213052 -190131 -81509 -159680 -5270 46057 -15468 124762 -39553
17831 224367 -108617 -283771 179409 126696 153986 223482 48972 -32773 -45130 221840 155852
17820 155852 30426 -95383 -125880 259377 -168924 112299 -74765 -141247 396195 128618
17809 63035 -5685 198003 135786 -52887 231276 -15246 -167002 146933 223356 -141061 -128563
17798 -128563 299207 -212225 69893 -184708 -234503 160488 -13633 52889 -66316 43178 118899
17787 118899 -316172 -68267 -6061 -247960 41219 146787 38865 -21114 119431 55433 202819
$$ packed form
17866B64633i6864B61741F3812O531a14112H1271L0443b6026A32813C6407J68456
17855B04863c38974h9779B48751F7685a61381K2377C0595O1224l1759b36709C3881
17843a73506M8564j59011P0901K2921h1509p8171e270D6057a5468A24762c9553
17831B24367a08617j75154A79409n2713K7290O9496D8972c2773j2357B21840o5988
17820A55852C0426i5383l0497B59377a68924A12299g4765o6482C96195A28618
17809F3035e685A98003o2217e2887B31276a5246j51756A46933P6423a41061J2498
17798a28563B99207b12225F9893a84708m9795A60488a3633E2889f6316D3178P5721
17787A18899c16172f8267f061k41899D1219J05568C8865b1114A19431E5433J47386
$$ plain form
17776 202819 77300 -158421 -216225 151323 -331898 288478 160832 -243135 -86831 -99910
17766 -99910 33442 31401 215052 148362 -86751 366781 -163874 328621 -131408 -11055 140942
17754 -7272 -80962 -10150 37091 220191 -79119 203105 -67035 53729 -148473 -15789 299636
17742 4204 39549 -94401 -22450 44238 -241113 153563 162058 302896 10667 -15672 309355
17730 -197629 141508 -1296 284087 -84057 114797 300958 286585 -17340 -101029 -125737 230174
17718 140573 248038 192153 29379 207567 46884 76095 -30517 81014 116694 -111412 148514
17706 74478 -111885 -48741 483005 135628 42869 13997 235990 -60459 -18666 196736 20795
17694 -5827 103826 145610 71927 102882 4642 157106 72711 121273 38159 204613 404313
$$ packed form
17776B02819G7300a58421n7804A51323c31898B88478j27646b43135h6831j3079
17766i9910C3442k041J83651o6690h6751C66781a63874C28621a31408a1055A40942
17754g272p3690a0150C7091J83100g9119B03105f7035E3729a48473a5789B99636
17742D204L5345i4401b2450D4238b41113A53563Q495J40838A0667a5672C09355
17730a97629A41508a296B84087h4057A14797J86161j4373a7340q3689k4708B30174
17718A40573J07465n5885B9379J78188D6884K9211c0517H1014L5680a11412A48514
17706G4478a11885d8741D83005A35628D2869A3997K21993f0459a8666A96736B0795
17694e827A03826M1784G1927L0955D642J52464G2711M8562C8159J66454J99700
$$ plain form
17683 404313 -24820 -96514 -275044 24308 62401 20545 -129681 -112860 -176945 29167 -104936
17671 -136361 -140887 145586 64556 46830 146859 315697 32746 75069 -72438 -247782 117549
17659 -50023 67661 -116387 -109285 -35908 322740 -102505 18794 -84298 -20044 27441 88235
17648 88235 182764 220312 -321337 242183 202917 264579 342327 3929 157762 -116343 -40502
17636 -289499 -2556 -134193 -216410 133805 -281766 70597 281010 6765 -67946 105829 -105957
17624 177964 138286 46920 92819 -127527 154072 205187 234728 86445 20819 -9435 412817
17612 150682 18062 1419 -32028 -52191 193963 -293670 136021 39808 -255339 -88462 -189890
17601 -189890 -106801 189402 -196876 83718 141774 18472 -214343 -102732 -160489 100171
$$ packed form
17683D04313b4820p1694j78530B4308L8093B0545a29681J6821o4085B9167a04936
17671a36361m526A45586F4556j7726J00029J68838C2746M2323g2438j75344A17549
17659e0023F7661a16387P102c5908C22740a02505A8794h4298b0044B7441O0794
17648H8235R4529L7548c21337B42183l9266O1662P7748C929J53833a16343d0502
17636b89499b556j31637q2217A33805b81766G0597K10413F765f7946A05829a05957
17624A77964l9678D6920M5899a27527A54072N1115K9541H6445B0819i435D12817
17612A50682A8062A419c2028k0163A93963b93670A36021C9808b55339h8462j01428
17601a89890Q3089A89402a96876H3718N8056A8472b14343a02732n7757A00171
$$ plain form
17590 147049 353761 -243306 175678 27637 -74007 275063 -18298 32431 56041 -115742
17579 23843 31527 -262205 56678 321050 110442 -7210 75277 84130 230267 73133 -124330
17567 -80153 145618 178395 -65087 -186062 78939 205407 -126307 289456 387711 178072
17556 290067 232167 64917 290554 -181557 437502 154543 126841 87715 32484 122513 130522
17545 130522 445372 113456 -15845 241470 94816 36065 -157768 37909 103955 257212
17535 257212 305887 357060 100560 -235361 76079 36140 149673 77400 40923 332131 158483
17523 240008 236399 264753 211017 289919 275958 59431 241095 29728 284885 283196 149576
17512 149576 217235 -28480 180027 482036 -155423 95131 462293 310012 110340 113229
$$ packed form
17590A47049K06712b43306A75678B7637g4007B75063a8298C2431K3610a15742
17579B3843P684b62205E6678K64372A10442g210G5277Q853J46137G3133a24330
17567h0153A45618L2777f5087j20975G8939J26468a26307B89456R8255A78072
17556B90067n7900F4917K25637a81557D37502A54543k7702l9126C2484R0029Q009
17545A30522L14850A13456a5845B41470I4816C6065a57768C7909O6046J53257
17535B57212M8675N1173A00560b35361G6079C6140J13533p2273l6477K91208A58483
17523B40008l609K8354n3736P8902j3961E9431J81664B9728K55157j689j33620
17512A49576O7659b8480A80027L02009a55423I5131L67162j52281A10340K889
$$ plain form
17502 113229 39788 125451 -2246 234993 137243 232199 -90626 22268 154321 35303 197114
17491 197114 78080 273109 164842 221763 175308 162822 460031 286494 190306 233923 112289
17479 232516 230668 328028 346748 158114 450577 209228 393568 79388 95310 449711 -33547
17467 255245 -76178 191375 513739 317687 352445 -146114 -86746 161848 229355 -30243
17456 -99778 162695 39935 148955 635512 10844 20637 310604 213102 165257 132360 177591
17445 177591 189611 408914 -44131 261462 78344 83786 42672 202926 276053 178174 106951
17434 106951 201112 150882 321138 151742 402132 137626 90588 311382 268150 306917
17424 306917 484320 84230 312677 117973 348425 39286 109047 295163 277061 428187
$$ packed form
17502A13229C9788Q5663b246B34993r7750R4956i0626B2268J32053C5303J61811
17491A97114G8080J95029j08267N6921m6455j2486K97209j73537r6188M3617A12289
17479B32516j848R7360J8720A58114K92463B09228J84340G9388J5922L54401c3547
17467B55245g6178A91375L22364j96052L4758a46114N9368A61848O7507c0243
17456i9778A62695C9935J09020M86557A0844R793K89967r7502m7845l2897M5231
17445A77591J2020K19303d4131B61462G8344N442m1114J60254P3127r7879p1223
17434A06951R4161n0230J70256A51742K50390A37626m7038K20794m3232L8767
17424C06917J77403H4230K28447A17973K30452C9286O9761J86116j8102J51126
$$ plain form
17414 428187 437127 158574 325668 230670 143184 254879 290490 135341 391135 -101966
17403 164934 -127656 159377 -62106 -56064 144259 261778 318905 246538 231201 61232 274009
17392 274009 196055 73674 308519 -27198 365837 149708 24345 3530 328267 206548 110510
17381 110510 -82351 336694 247664 29298 329249 103691 194903 77283 148150 82869 -78964
17369 96935 152958 193182 161623 -111155 335888 53583 59949 1517 243613 161777 389501
17358 389501 66582 108109 688165 135584 71440 -225338 277299 226418 56584 499895
17348 499895 296826 99810 129586 236433 47868 181666 -31560 218665 -30310 158948
17337 84084 58801 104785 85536 84221 40451 82489 31604 251175 332522 123295 89457
$$ packed form
17414D28187Q940A58574J67094r4998q7486J11695L5611A35341K55794a01966
17403A64934a27656A59377f2106O042A44259J17519N7127p2367j5337F1232K12777
17392B74009p7954G3674K34845b7198C65837A49708B4345C530L24737j21719r6038
17381A10510h2351C36694q9030B9298K99951A03691R1212G7283P0867o5281g8964
17369I6935N6023M0224l1559a11155C35888E3583O366A517K42096q1836K27724
17358C89501F6582M1527N80056A35584o4144b25338B77299n0881E6584M43311
17348D99895k03069I9810K9776J06847D7868J33798c1560B18665c0310A58948
17337H4084k5283M5984j9249j315D0451M2038C1604K19571Q1347A23295l3838
$$ plain form
17326 89457 5164 -78436 306976 -35702 415499 500919 -59813 162932 83482 -49477 422467
17314 261055 203068 -46134 399917 277088 490561 288516 245327 351442 195435 376995
17304 376995 515773 352629 -67095 105859 289248 482638 99742 114385 261307 258349
17294 258349 314017 201225 518744 239567 89180 634106 321392 220051 269527 -127564
17283 151056 222790 -16232 276239 266384 89450 279103 143246 126780 445285 182559 534688
17272 534688 193162 71452 264096 480644 417377 199130 6994 5853 488739 560883 467922
17261 467922 216257 343880 278028 349706 345277 306030 303052 562658 156057 308715 283490
17250 283490 470217 -70079 191797 562798 108224 237668 31942 206778 265334 27465
$$ packed form
17326H9457E164g8436C06976c5702D15499Q5420e9813A62932p9450d9477D22467
17314B61055n7987d6134C99917j22829K13473k02045m3189J06115j56007J81560
17304C76995J38778j63144f7095A05859J83389J93390I9742J4643J46922k958
17294B58349N5668j12792L17519B39567H9180N44926l12714j01341M9476a27564
17283A51056P1734a6232B76239r855H9450J89653j35857j6466L18505A82559L52129
17272E34688A93162G1452J92644K16548o3267A99130F994j141M82886P2144r2961
17261D67922B16257J27623o5852P1678m429l9247k978K59606A56057J52658k5225
17250B83490J86727g0079A91797L71001A08224J29444C1942J74836N8556B7465
$$ plain form
17239 44957 146702 193994 554687 57116 371349 299408 188232 115428 34350 388881 524276
17228 524276 396362 274248 61036 -91483 272078 568623 405568 -33372 116829 353635
17218 353635 277410 424567 558175 263043 117710 603167 468599 61444 39917 369085
17208 369085 486768 533153 457889 286356 347967 360396 586979 672434 85746 328792 326109
17197 326109 364470 -101540 450256 3778 491973 326055 334417 338020 597072 322503 307164
17186 307164 429522 309975 641445 66155 386243 139108 272252 559098 406481 215788
17176 215788 345431 397072 514549 242675 530939 451241 460815 267369 546272 435459
17166 435459 239825 109628 479286 646256 579168 137919 349028 672225 321900 760584
$$ packed form
17239D4957J01745M7292L60693E7116L14233p1941j11176p2804C4350L54531J35395
17228E24276j27914j22114F1036i1483B72078K96545j63055c3372A16829K36806
17218C53635p6225J47157J33608B63043A17710M85457j34568F1444k1527L29168
17208C69085J17683M6385p5264j71533O1611J2429K26583Q5455H5746K43046k683
17197C26109L8361a01540D50256C778M88195j65918Q362L603K59052k74569j5339
17186C07164J22358j19547L31470F6155L20088A39108J33144K86846j52617j90693
17176B15788J29643N1641J17477B42675K88264p9698R574j93446K78903j10813
17166D35459j95634A09628L69658J66970o7088A37919K11109L23197C21900M38684
$$ plain form
17156 760584 451297 273506 541022 270278 201369 710813 632623 518929 340124 278584
17146 278584 -72516 395874 440677 549262 816143 309256 734775 228430 159882 579493
17136 579493 275282 311259 552263 431297 413185 494702 363249 267275 412292 380873
17126 380873 352461 669853 136823 517706 614334 325048 370535 836131 703963 394226
17116 394226 184465 547320 269252 780998 386078 593414 711505 383034 446049 402553
17106 402553 518123 593356 481288 514573 528971 831138 734919 559663 622833 655224 683930
17095 683930 546318 806855 252534 712277 544470 605016 398864 656045 552026 466440
17085 466440 527162 311214 491898 444390 667249 606818 606271 634425 589425 528172 579091
$$ packed form
17156G60584l09287j77791K67516B70278o8909N09444p8190j13694j78805o1540
17146B78584g2516C95874M4803J08585K66881C09256M25519B28430o8548M19611
17136E79493B75282L5977K41004j20966j8112Q1517j31453r5974J45017l1419
17126C80873k8412L17392A36823L80883R6628k89286M5487M65596j32168l09737
17116C94226A84465L62855B69252N11746C86078K07336J18091l28471O3015m3496
17106D02553J15570P5233j12068L3285J4398L02167r6219j75256O3170L2391K8706
17095F83930j37612K60537B52534M59743j67807O0546k06152K57181j04019q5586
17085D66440O0722k15948J80684m7508K22859o0431n47K8154m5000o1253N0919
$$ plain form
17074 579091 527992 662603 843925 614890 652083 802313 512710 885723 644843 597606
17064 597606 556873 500981 734695 768592 734464 506247 893255 734001 804021 604360
17054 604360 614522 760181 686736 570680 713346 598810 1001287 702563 700149 954922
17044 954922 817530 641500 899641 548614 578860 1035122 1134457 1013489 932123 713977
17034 713977 910993 811490 1119254 827440 918057 821280 1037233 1157031 829485 661020
17024 661020 1036782 1012518 986633 933673 942825 663851 1150730 860373 1070666 909283
17014 909283 788433 788590 1222224 840686 1039970 1056948 1109212 845797 995873 978917 1078970
17003 1078970 1070339 912971 1223779 1241720 1184694 1237517 1145183 972497 1087735 1178580 988668
$$ packed form
17074E79091n1099J34611J81322k29035L7193J50230k89603L73013k40880m7237
17064E97606m0733n5892K33714L3897l4128k28217L87008j59254P0020j99661
17054F04360J0162J45659p3445j16056J42666j14536M02477k98724k414K54773
17044I54922j37392j76030K58141l51027L0246M56262R9335j20968q1366k18146
17034G13977J97016r9503L07764k91814R0617r6777K15953J19798l27546j68465
17024F61020L75762k4264k5885n2960R152k78974M86879k90357K10293j61383
17014I09283j20850J57M33634l81538J99284J6978N2264k63415J50076j6956J00053
17003A078970q631j57368L10808J7941n7026N2823r2334j72686J15238R0845j89912
$$ plain form
16992 988668 1103019 1027913 770774 1251412 926622 820528 1405806 1310167 1211373 1142603
16982 1142603 1379225 1348719 962347 1582447 904023 1278760 1355154 1164294 1340157 1187194
16972 1187194 1335119 1390526 1447398 1264094 1374489 1499407 1076002 1382899 1569746 1107555
16962 1107555 1369585 1406559 1400189 1280394 1576864 1500852 1577714 1762537 1633743 1575773
16952 1575773 2146316 1571439 1272093 1486573 1771014 1929952 1369099 1826715 1500130
16943 1500130 1812402 1684106 1753736 1758715 1627114 1861399 1639045 1422445 1829061 1803614
16933 1803614 1943519 1727213 2074088 2063436 1922000 2076177 1981250 2083947 2173188 2203229
16923 2203229 2056679 1920265 2058124 2114328 2405790 2245852 2133484 2154428 2496593 2251623
$$ packed form
16992I88668J14351p5106k57139M80638l24790j06094N85278r5639r8794o8770
16982A142603K36622l0506l86372O20100o78424L74737P6394j90860J75863j52963
16972A187194J47925N5407N6872j83304J10395J24918m23405L06897J86847m62191
16962A107555K62030L6974o370j19795K96470p6012P6862J84823j28794n7970
16952A575773N70543n74877k99346K14480K84441J58938n60853M57616l26585
16943A500130L12272j28296O9630M979j31601K34285k22354k16600M06616k5447
16933A803614J39905k16306L46875j0652j41436J54177r4927J02697Q9241L0041
16923B203229j46550j36414J37859N6204K91462j59938j12368K0944L42165k44970
$$ plain form
16913 2251623 2098664 2073974 2571022 2572006 2243179 2220451 2324360 2396784 2418391 2154533 2547728
16902 2547728 2236246 2749885 2654440 2639050 2652717 2701264 2312775 2900425 2906799 2806354
16892 2806354 2914941 3097304 2842094 3089141 3016839 3106830 3381528 2923079 3024446 3275893
16882 3275893 3140555 3525730 3411236 3358511 3498703 3539300 3708788 3545367 3756535 3472527
16872 3472527 3541540 3906177 3907359 4025962 3868992 3812082 3843739 4542399 4078377 3931962
16862 3931962 4319796 4305529 4452558 4207833 4795127 4651427 4574981 4574899 4894837 4743827
16852 4743827 5059139 4898745 5340488 5136951 5236049 5372048 5525331 5606819 5330819 5466090
16842 5466090 5464696 5689790 5813926 5944330 6142671 6367144 6457591 6423676 6452666 6541284
$$ packed form
16913B251623j52959k4690M97048R84l28827k2728J03909P2424K1607k63858L93195
16902B547728l11482N13639r5445j5390J3667M8547l88489N87650O374j00445
16892B806354J08587J82363k55210K47047p2302Q9991K74698m58449J01367K51447
16882C275893j35338L85175j14494n2725J40192M0597J69488j63421K11168k84008
16872C472527O9013L64637J182J18603j56970n6910L1657O98660m64022j46415
16862C931962L87834j4267J47029k44725N87294j43700p6446q2L19938j51010
16852D743827L15312j60394M41743k03537R9098J35999J53283Q1488k76000J35271
16842E466090j394K25094J24136J30404J98341K24473R0447l3915K8990Q8618
$$ plain form
16832 6541284 7053584 6594218 7007851 7201346 7080109 7453367 7706229 7603771 7711536
16823 7711536 8302284 8175906 8047605 8216985 8613668 8762109 8973856 9419675 9499316 9320533
16813 9320533 9804438 9949135 10241490 10460981 10239668 10602940 10854238 11422588 11167944
16804 11167944 11532449 12168548 11930534 12503589 12647614 13159924 13148566 13596543 14026951
16795 14026951 14361559 14580195 14756242 15615172 15853007 16163556 16590077 16834326 17272976
16786 17272976 17605621 17980171 18615738 19336441 19686835 20244940 20883575 21414014 22162906
16777 22162906 22759137 23056883 24147846 24240501 25328552 26018343 26738717 27650329 28551956
16768 28551956 29454421 30579274 31311062 32293410 33269808 34445462 35682654 36734534 37967119
$$ packed form
16832F541284N12300m59366M13633J93495j21237L73258K52862j02458J07765
16823G711536N90748j26378j28301J69380L96683J48441K11747M45819P9641j78783
16813I320533M83905J44697K92355K19491k21313L63272K51298N68350k54644
16804A1167944L64505O36099k38014N73055J44025N12310j1358M47977M30408
16795A4026951L34608K18636J76047Q58930K37835L10549M26521K44249M38650
16786A7272976L32645L74550O35567P20703L50394N58105O38635N30439P48892
16777B2162906N96231K97746J090963R2655J088051O89791P20374R11612R01627
16768B8551956R02465J124853P31788R82348R76398J175654J237192J051880J232585
$$ plain form
16759 37967119 39345848 40412992 41725073 43099257 44783924 46307366 47798096 49389015
16751 49389015 51051802 52910812 54607148 56593884 58675409 60700381 62759236 65216104
16743 65216104 67121649 69592899 71884066 74527520 76593032 79081073 81725389 84206417
16735 84206417 86563987 88958682 91622362 93900254 96405431 98338445 100596593 102243678
16727 102243678 104200488 105833107 107520524 109051157 109835304 110920784 111408819 111788489
16719 111788489 111738527 111603687 110968571 110540524 109458797 108334151 106793623 105479790 103540264
16710 103540264 101609007 99738507 97330754 95146132 92770959 90087000 88231283 85300624
16702 85300624 82842107 80676153 77859854 75413405 72871682 70842589 68646097 66107652
$$ packed form
16759C7967119J378729J067144J312081J374184J684667J523442J490730J590919
16751D9389015J662787J859010J696336J986736K081525K024972K058855K456868
16743F5216104J905545K471250K291167K643454K065512K488041K644316K481028
16735H4206417K357570K394695K663680K277892K505177J933014K258148J647085
16727A02243678J956810J632619J687417J530633P84147J085480M88035L79670
16719A11788489m9962j34840o35116m28047j081727j124646j540528j313833j939526
16710A03540264j931257j870500k407753k184622k375173k683959j855717k930659
16702H5300624k458517k165954k816299k446449k541723k029093k196492k538445
$$ plain form
16694 66107652 63971314 61809624 60071255 57761677 55689565 53759035 52188262 50274038
16686 50274038 48909628 47047693 45719866 43959817 42495152 41071828 39658215 38677211
16678 38677211 36937418 35946022 34983247 34051101 32639043 31650001 30894154 30266479 28915402
16669 28915402 28276013 27447359 26489208 25670235 25107051 24304802 23894363 23181478 22334887
16660 22334887 21874388 21302398 20553084 20399915 19715009 19299876 18809385 18133518 17767560
16651 17767560 17097633 16802792 16558657 16418613 15519291 15252344 15198797 14672115 14671074 14307431
16641 14307431 13574335 13415594 13073221 12903629 12448902 12512389 12197413 11704578 11629217 11242215
16631 11242215 11254382 10898357 10714986 10466583 10500449 10226092 9778561 10012485 9390749 8837119
$$ packed form
16694F6107652k136338k161690j738369k309578k072112j930530j570773j914224
16686E0274038j364410j861935j327827j760049j464665j423324j413613r81004
16678C8677211j739793r91396r62775r32146j412058r89042p55847o27675j351077
16669B8915402o39389q28654r58151q18973n63184q02249m10439p12885q46591
16660B2334887m60499n71990p49314j53169o84906m15133m90491o75867l65958
16651A7767560o69927k94841k44135j40044q99322k66947n3547n26682j041l63643
16641A4307431p33096j58741l42373j69592m54727O3487l14976m92835p5361l87002
16631A1242215J2167l56025j83371k48403L3866k74357m47531K33924o21736n53630
$$ plain form
16621 8837119 8998608 8946151 8636510 8749436 8502446 8495858 8229100 8134656 8011090 7739507
16611 7739507 7725610 7351431 7146673 7429176 7311429 6941012 7190816 6999530 6871269 6667885
16601 6667885 6234783 6523910 6213042 5970955 6100073 6090400 5594961 5708857 5566097 5483947
16591 5483947 5640666 5429662 5193417 5295306 5453076 5193067 5267795 5034386 4974374 5115626
16581 5115626 4683976 4606065 4663383 4710502 4673594 4717534 4273479 4398931 4303772 4185150
16571 4185150 4321607 4311825 4061423 4261639 3860315 3954405 3876174 3917697 3596826 3843429
16561 3843429 3480465 3750638 3801002 3642245 3603353 3747331 3284037 3506443 3203391 3104607
16551 3104607 3369017 3401210 3350976 3134449 2858106 2993159 3105228 3342733 3198120 3240121
$$ packed form
16621H837119J61489n2457l09641J12926k46990o588k66758r4444j23566k71583
16611G739507j3897l74179k04758K82503j17747l70417K49804j91286j28261k03384
16601F667885m33102K89127l10868k42087J29118r673m95439J13896j42760q2150
16591E483947J56719k11004k36245J01889J57770k60009P4728k33409o0012J41252
16581E115626m31650p7911N7318M7119l6908M3940m44055J25452r5159j18622
16571D185150J36457r782k50402K00216m01324R4090p8231M1523l20871K46603
16561C843429l62964K70173N0364j58757l8892J43978m63294K22406l03052r8784
16551C104607K64410L2193n0234k16527k76343J35053J12069K37505j44613M2001
$$ plain form
16541 3240121 2908765 2934431 2869806 3009207 2740467 2565244 2737996 3066446 2434871 2586366
16531 2586366 2463984 2714695 2585745 2945138 2683367 2672983 2771954 2636857 2625604 2587552
16521 2587552 2571951 2566149 2289155 2509640 2372162 2545014 2338178 2344245 2356192 1976775
16511 1976775 2219424 2146096 2165062 2103353 1932640 2063781 2076331 2132681 2123695 2167504 2138316
16500 2138316 2266616 1761529 1819023 2062672 1813560 1807477 1712291 1785870 2005772 1910726
16490 1910726 1797927 2107528 1726841 1769059 1651393 2111264 1254105 1670905 1717965 2015414
16480 2015414 1704969 1786025 1732404 1520887 1837526 1871018 1744079 1451012 1180228 1501577
16470 1501577 1604011 1528727 1420414 1651679 1770593 1779254 1504800 1120068 1531164 1577210
$$ packed form
16541C240121l31356K5666o4625J39401k68740j75223J72752L28450o31575J51495
16531B586366j22382K50711j28950L59393k61771j0384R8971j35097j1253l8052
16521B587552j5601n802k76994K20485j37478J72852k06836O067J1947l79417
16511A976775K42649p3328J8966o1709j70713J31141J2550N6350q986M3809k9188
16500B138316J28300n05087N7494K43649k49112o083r5186P3579K19902r5046
16490A910726j12799L09601l80687M2218j17666M59871q57159M16800M7060K97449
16480B015414l10445Q1056n3621k11517L16639L3492j26939k93067k70784L21349
16470A501577J02434p5284j08313K31265J18914Q661k74454l84732M11096M6046
$$ plain form
16460 1577210 1705838 1512386 1548188 1133345 1441258 1439409 1235168 1104863 1254412 1186800
16450 1186800 1272349 1264710 1344722 1031473 1505255 1419776 1019859 1315293 1108784 1066997
16440 1066997 1377374 1466737 1443586 1276700 1223590 1271546 1376859 1129027 1227341 1117243
16430 1117243 1287400 1334882 920140 1126086 1343658 1322769 1162324 1064984 1204729 1130464
16420 1130464 1026417 1039006 1083227 945215 1180969 1120066 1026475 1101234 935269 791632
16410 791632 872992 879938 1248828 1016160 1093143 861107 846574 944386 939049 1019813 863402
16399 863402 961459 785157 1025784 995984 627857 775351 750379 923055 1198932 1158110
16389 1158110 831139 1064330 1083522 955208 751238 645978 831611 831173 970074 905870
$$ packed form
16460A577210J28628j93452L5802m14843L07913j849k04241j30305J49549o7612
16450A186800Q5549p639Q0012l13249M73782q5479l99917K95434k06509m1787
16440A066997L10377Q9363k3151j66886n3110M7956J05313k47832R8314j10098
16430A117243J70157M7482m14742K05946K17572k0889j60445r7340J39745p4265
16420A130464j04047J2589M4221j38012K35754o0903r3591P4759j65965j43637
16410G91632Q1360O946L68890k32668P6983k32036j4533R7812n337Q0764j56411
16399H63402R8057j76302K40627k9800l68127J47494k4972J72676K75877m0822
16389A158110l26971K33191J9192j28314k03970j05260J85633m38J38901o4204
$$ plain form
16379 905870 828959 1146717 970179 701706 1122072 664156 814252 638943 851796 1001786
16369 1001786 729814 636836 1122739 704266 524068 648383 1008694 724916 804742 824777
16359 824777 501886 911487 828222 918500 638158 657464 791669 554769 592259 833179
16349 833179 715157 687096 517906 73401 847183 600483 409853 611565 837825 772779
16339 772779 663056 629813 752702 324758 755013 685776 642660 463300 770844 464623
16329 464623 1064765 428290 661042 371543 719404 685884 698954 500121 424498 794322
16319 794322 378874 493528 760158 940389 593556 512187 412272 342653 655324 507464
16309 507464 290942 372615 508041 789971 718135 463895 445321 435215 783043 354666
$$ packed form
16379I05870p6911L17758j76538k68473M20366m57916J50096j75309K12853J49990
16369A001786k71972r2978M85903m18473j80198J24315L60311k83778P9826K0035
16359H24777l22891M09601q3265R0278k80342J9306J34205k36900L7490K40920
16349H33179j18022k8061j69190G3401P73782k46700j90630K01712K26260o5046
16339G72779j09723l3243J22889C24758M30255o9237m3116j79360L07544l06221
16329D64623O00142D28290K32752k89499L47861l3520J3070j98833p5623L69824
16319G94322C78874J14654K66630J80231l46833q1369r9915o9619L12671j47860
16309E07464k16522Q1673J35426K81930p1836k54240j8574j0106L47828C54666
$$ plain form
16298 417820 577492 608049 397941 306364 550209 567026 587148 243493 410458 382122
16288 382122 334672 446720 489043 621388 453046 654657 626094 558122 467795 342556
16278 342556 492841 436395 745097 -161674 376230 251343 327168 622966 389868 495548
16268 495548 315146 418871 373760 640694 494189 361123 374769 579640 550196 555715
16258 555715 289184 543218 502948 371945 284333 260527 354454 547338 616714 265553
16247 536154 595455 97265 495521 212579 335658 297309 493600 384338 523591 447872
16237 447872 475086 344121 213754 238865 463723 368804 251529 258908 98023 311996 670104
16226 670104 274777 348699 322363 326452 349569 272494 -153864 421223 647257 410647 31563
$$ packed form
16298D17820J59672L0557k10108r1577K43845J6817K0122B43493J66965k8336
16288C82122m7450J12048M2323J32345j68342K01611k8563o7972r0327j25239
16278C42556J50285n6446L08702a61674C76230j24887P5825K95798k33098J05680
16268D95548j80402J03725m5111K66934j46505j33066J3646K04871k9444N519
16258E55715k66531K54034m0270j31003q7612k3806R3927J92884O9376B65553
16247E36154N9301I7265L98256B12579J23079l8349J96291j09262J39253p5719
16237D47872K7214j30965j30367K5111K24858r4919j17275P379I8023K13973L58108
16226F70104B74777P3922k6336M089K3117p7075a53864D21223K26034k36610C1563
$$ plain form
16214 463943 475429 379667 119062 107888 22916 234643 215611 263673 321594 230667 257098
16203 257098 328827 330490 -202423 222257 221673 137117 291823 287721 611104 121974 282672
16192 282672 231135 181795 493532 490481 139761 8624 239231 168794 446236 470190 251211
16181 251211 394672 464176 506362 101045 95338 280273 191629 169530 33048 433180 74941
16169 202332 205041 237097 182152 637026 277896 427379 96458 136677 84818 347465 140176
16157 474758 197262 429460 70407 222489 407432 315138 55715 228464 189078 99474
16147 99474 170166 17053 342121 -263300 90307 375995 319220 -26537 203584 114108 306802
16136 306802 180289 482031 6934 295455 137525 256725 228675 -194045 -79608 152175
$$ packed form
16214D63943J1486r5762A19062j1174B2916K11727j9032M8062N7921r0927K6431
16203B57098P1729J663b02423B22257n84q4556J54706m102L23383A21974J60698
16192B82672n1537m9340L11737l051A39761H624K30607p0437K77442K3954k18979
16181B51211J43461O9504M2186A01045n707J84935q8644k2099C3048M00132G4941
16169B02332K709L2056n4945M54874B77896J49483I6458M0219n1859K62647A40176
16157D74758A97262K32198G0407J52082J84943r2294E5715J72749l9386q9604
16147I9474P0692A7053L25068b63300I0307K85688n6775b6537B03584q9476J92694
16136C06802j26513L01742F934K88521A37525J19200k8050a94045g9608A52175
$$ plain form
16125 106276 387263 563881 -74155 82773 417331 252769 239531 207085 407372 406122 -131688
16113 166626 -45551 267966 195628 -354393 246977 125586 -39383 27632 -91801 133944
16102 -61379 292513 145915 180304 71214 74158 62505 224118 204555 273433 316580 289398
16091 289398 102344 -14854 68957 77074 102443 -79498 228240 157419 306664 170504 129142
16080 129142 -15537 185341 44469 196109 317906 477558 397157 -39013 69345 163925 360344
16069 360344 65156 198823 -294551 104837 -104092 46912 350148 196657 302228 -27766
16058 -19773 5795 145083 20313 -118617 264477 -302194 -28438 237049 72893 122499 188474
16047 188474 -320665 -51946 272103 258733 59000 166123 338138 348953 74761 23173 23868
$$ packed form
16125A06276K80987J76618g4155H2773L34558j64562j3238l2446K00287j250a31688
16113A66626d5551B67966p2338c54393B46977j21391c9383B7632i1801A33944
16102f1379B92513A45915L4389G1214K944j1653J61613j9563O8878M3147k7182
16091B89398A02344a4854F8957Q117K5369g9498B28240p0821J49245j36160m1362
16080A29142a5537A85341D4469J51640J21797J59652q0401c9013F9345R4580J96419
16069C60344F5156J33667b94551A04837a04092D6912L03236j53491J05571b7766
16058a9773E795J39288B0313a18617B64477c02194b8438B37049G2893M9606O5975
16047A88474c20665e1946B72103j3370E9000J07123J72015J0815G4761B3173O95
$$ plain form
16036 23868 207809 79011 114708 -98755 252110 183646 123631 281098 -16838 223117 29746
16024 87255 173907 -302758 -36684 166109 57372 104957 174748 -47142 -36256 59066 128885
16013 128885 345082 3634 236350 49522 -172643 211753 -227379 146241 259958 -113692
16002 85765 -163731 158277 78405 -343626 -33129 335656 -87581 16557 127946 -137619
15991 187108 456422 122661 349941 418471 559724 562124 808554 403343 636441 468989
15981 468989 72062 -4608 -94349 354518 94028 -201925 -61661 232905 163019 393898 38629
15969 138240 120590 182316 426909 350260 221365 99183 162636 91640 -207977 -49006 41208
15957 112352 161463 31246 -183465 -61350 35956 -143903 -10797 176272 -118087 -33867 -38100
$$ packed form
16036B3868J83941G9011L5697i8755B52110o8464o0015J57467a6838B23117B9746
16024H7255Q6652c02758c6684A66109E7372M7585O9791d7142J0886E9066O9819
16013A28885K16197C634K32716D9522a72643B11753b27379A46241J13717a13692
16002H5765a63731A58277G8405c43626c3129C35656h7581A6557J11389a37619
15991A87108K69314A22661K27280O8530J41253K400K46430D03343K33098j67452
15981D68989G2062d608q9741C54518I4028b01925f1661B32905o9886K30879C8629
15969A38240j7650O1726K44593p6649j28895I9183O3453p0996b07977d9006D1208
15957A12352M9111C1246a83465f1350C5956a43903a0797A76272a18087c3867m233
$$ plain form
15946 -38100 -267817 -196271 -62160 -124281 22956 113899 3273 -115063 -26584 113167 -70384
15934 -93442 35416 -337555 243729 -46160 37675 250959 -86523 -42384 3292 18083 -154563
15922 206769 231797 94388 2763 -58417 71730 290873 -156074 306983 -111696 316782 -320357
15910 -51339 6002 -63365 -309914 -80319 1306 3287 234425 -244641 -225837 -6958 140178 207000
15898 207000 103295 257338 1880 -124061 -9414 206396 255141 -63551 -27312 -78883 131650
15886 -113417 170966 -25422 81277 -82816 -38071 23732 152260 222749 -72452 -308345 167
15874 73779 -20653 -164730 -196792 -102521 -192541 140227 111677 19701 -122 37218 33362 -115044
15861 41530 191584 155780 -82307 -170664 328579 28155 55770 -35062 52262 117551 -119202
$$ packed form
15946c8100k29717P1546f2160o2121B2956R0943C273a15063b6584A13167g0384
15934i3442C5416c37555B43729d6160C7675K13284h6523d2384C292J4791a54563
15922B06769K5028I4388B763e8417G1730K19143a56074C06983a11696C16782c20357
15910e1339F002f3365k46549h0319A306J981K31138b44641J8804f958A40178O6822
15898B07000A03295J54043A880a24061i414B06396M8745f3551b7312n1571A31650
15886a13417A70966b5422H1277h2816c8071B3732J28528P0489g2452k35893A67
15874G3779b0653j44077l2062R4271r0020A40227k8550A9701a22C7218l856a15044
15861D1530J50054l5804h2307q8357C28579B8155K7615c5062E2262O5289a19202
$$ plain form
15849 -132895 -43024 296384 102314 -308094 -206103 -143576 39033 -35167 150397 105968
15839 105968 -213311 33309 185040 168228 24952 -72572 175974 135023 179680 14391 -293668
15827 278510 17112 -55329 -284642 -301216 63874 200288 -46510 -49436 96830 -222873 22342
15815 -183575 -144089 -205574 88177 -261934 215872 -129817 137367 -119372 -255989 -15370
15804 284093 179935 -33515 -75637 -8308 -188231 -108120 247426 13051 79968 -220385 -49796
15792 179590 -199683 184663 -100986 -58279 208520 -13558 119420 124309 -82515 8729 -307224
15780 -44179 206224 -89243 135507 125957 -161940 115172 -35445 185884 -188888 169741
15769 -191383 -58355 -172745 -66796 6698 -244343 -70272 56968 324044 -254281 -146638 -53525
$$ packed form
15849a32895d3024B96384A02314c08094J01991O2527C9033c5167A50397m4429
15839A05968b13311C3309J51731j6812B4952g2572A75974m0951M4657A4391b93668
15827B78510A7112e5329k29313j6574F3874J36414d6510k926I6830b22873B2342
15815a83575L9486o1485H8177b61934B15872a29817A37367a19372j36617a5370
15804B84093j04158c3515m2122h308j79923Q0111B47426A3051O6917b20385d9796
15792A79590a99683A84663a00986M2707B08520a3558A19420M889h2515H729c07224
15780d4179B06224h9243A35507r550a61940A15172c5445A85884a88888A69741
15769a91383e8355j14390f6796F698b44343g0272E6968K67076b54281J07643e3525
$$ plain form
15757 261754 -91539 -85103 -189482 516 50893 74019 43532 118478 -53534 -22702 165617 109384
15745 109384 -114804 -10449 216939 -183070 309651 256719 -41168 -118682 -81863 -347303
15735 -347303 -304434 33764 -351296 39976 29970 17381 281197 -56987 40081 72678 -40444
15723 207948 160193 -43894 30864 113404 -225666 -248541 -148235 282534 66151 -112842 246176
15711 -325935 -152539 -38592 -200118 -115273 -197408 -36430 350021 -138698 42505 -154993
15700 -268300 -222911 -81279 158971 22203 151492 -77869 -56059 -122572 -92779 -51737 142752
15688 70509 -482 129837 -164916 -17824 203828 -120226 -223811 322628 -213343 -160249 -186253
15677 -186253 -246454 148814 -5193 -80433 -150881 18773 36517 247087 93312 102721 119622
$$ packed form
15757B61754i1539O436j04379E16N0377K3126l0487P4946e3534b2702A65617n6233
15745A09384a14804a0449B16939a83070C09651n2932d1168p7514L6819k65440
15735c47303M2869C3764c51296C9976j0006j2589K63816e6987D0081L2597d0444
15723B07948m7755d3894C0864Q2540b25666k2875J00306B82534F6151a12842B46176
15711c25935a52539c8592j61526Q4845q2135c6430C50021a38698D2505a54993
15700b68300M5389h1279A58971B2203J29289g7869K1810o6513K9793M1042A42752
15688G0509d82A29837a64916a7824B03828a20226j03585C22628b13343N3094k6004
15677a86253o0201A48814e193p5240p0448A8773J7744K10570I3312R409J6901
$$ plain form
15666 119622 212090 106491 105661 -54283 467480 32651 127708 164470 -113130 119570 -27205
15654 224362 56910 -62995 272007 151268 164746 50980 -195583 290229 36993 166728
15644 166728 -221501 143710 132136 4641 -91272 -281 -268831 171749 283970 -182719 -107431
15633 -107431 -78297 -194294 22164 -1109 -14897 94295 17129 12911 -35018 -94628 109025
15621 97663 -261438 -102833 45263 269837 -161391 -360831 -144274 169041 153484 -6769
15610 157127 -52864 123165 30702 3030 -129010 -70836 89725 33062 114863 324958 53263
15598 -320157 10843 -164324 307932 170567 417869 -320650 -297196 -140611 191930 12662
15587 83445 -28404 -38363 -214854 -138367 47461 -174887 58121 -400339 -189094 -67815 133482
$$ packed form
15666A19622R2468j05599q30e4283D67480C2651R5057L6762a13130A19570b7205
15654B24362E6910f2995B72007j20739J3478E0980a95583B90229C6993J29735
15644A66728b21501A43710j1574D641i1272b81k68550A71749J12221a82719P5288
15633a07431K9134j15997B2164a109j3788I4295A7129m218c5018n9610A09025
15621I7663b61438a02833D5263K24574a61391j99440a44274A69041j5557f769
15610A57127e2864A23165C0702C030a29010N8174H9725C3062Q1801K10095E3263
15598c20157A0843a64324C07932j37365K47302c20650K3454a40611A91930A2662
15587H3445b8404r959j76491P6487D7461a74887E8121d00339a89094f7815A33482
$$ plain form
15575 -283757 -46669 -91001 3970 -185968 168978 -70252 152703 -136038 -157652 23614 139495
15564 139495 52578 56050 -254541 -140845 -11479 94441 -28546 -90590 299581 -77222 -234878
15553 -234878 -54345 11260 -120283 162852 -262005 248372 -70192 253694 -201589 485791
15542 68985 328629 170570 74266 10210 -148137 55674 -221025 77379 -41088 -61003 50801
15530 83967 -56620 -45712 185297 -87007 -192542 47630 97682 -48593 183326 -118454 -131237
15519 -131237 -27245 31363 144377 -3471 24175 -31550 56825 37380 -136668 -167049 43992
15507 117768 309968 -137226 -359258 -74197 -108571 -213712 185311 230061 -43567 88825
15496 69021 98605 -39528 -472250 133131 318804 -319719 -70075 -23719 90496 -267652 -163032
$$ packed form
15575b83757d6669m4332C970a85968A68978g0252A52703a36038k1614B3614J15881
15564A39495E2578L472b54541J13696a1479I4441b8546o2044B99581g7222j57656
15553b34878e4345A1260a20283A62852b62005B48372g0192B53694b01589D85791
15542F8985K59644j58059G4266A0210a48137E5674b21025G7379d1088j9915E0801
15530H3967e6620J0908A85297h7007j05535D7630N0052d8593A83326a18454j2783
15519a31237b7245C1363J13014c471B4175c1550E6825j9445a36668l0381D3992
15507A17768J92200a37226k22032g4197l4374j05141A85311M4750d3567H8825
15496F9021K9584c9528m32722A33131J85673c19719g0075b3719I0496b67652J04620
$$ plain form
15485 -163032 -100505 -246884 -190748 172668 163826 48057 -125348 -174021 80737 72164 -68114
15473 130129 184884 -83710 106124 -25363 -114725 3735 157710 -60855 90914 -222950 143531
15461 -7006 110917 332290 54981 -306927 -268782 -128670 153208 -179318 -79324 -138524 192960
15449 183088 -71195 -114767 135915 113388 -144704 -28141 161375 283377 273836 -53439 302160
15437 -9578 -260657 43041 -7142 -23769 185035 199538 246590 -245295 -187301 -65310 208038
15425 -176454 -229194 93255 -99135 254086 91540 -514659 -28326 301193 63954 147944 -324786
15413 -240116 3839 -28269 102927 190657 -296646 -26203 232581 33622 -260284 373044 154158
15401 -164287 326861 34123 170645 -69469 -24173 -118300 219651 247753 118979 149160 175071
$$ packed form
15485a63032O2527j46379N6136A72668q842D8057a25348m8673H0737q573f8114
15473A30129N4755h3710A06124b5363q9362C735J53975f0855I0914b22950A43531
15461g006A10917K21373E4981c06927L8145a28670A53208a79318g9324n9200A92960
15449A83088g1195m3572A35915k2527a44704b8141A61375J22002r541e3439C02160
15437i578k51079D3041g142j6627A85035J4503M7052b45295N7994f5310B08038
15425a76454n2740I3255i9135B54086I1540e14659b8326C01193F3954Q3990c24786
15413b40116C839b8269A02927Q7730b96646b6203B32581C3622b60284C73044A54158
15401a64287C26861C4123J36522f9469b4173r4127B19651K8102A18979L0181K5911
$$ plain form
15390 175071 348486 59487 -162075 25580 105525 -248291 36223 177595 208068 -100043
15379 -200369 34151 6220 300670 -65575 164669 89618 60146 43487 58260 24706 197868
15368 197868 287182 235033 140570 -46103 269829 -138304 -247308 161878 159362 164866 -94582
15356 298463 76145 323644 143309 105219 -205951 178694 -32216 10067 55369 8748 32243
15345 32243 362001 208721 31166 146508 57086 343644 354292 44789 -21837 197177 11870
15333 166627 -95771 -90738 114682 56142 351752 176543 180230 233285 -18459 -101274 37324
15321 52070 161617 -41029 214743 -94516 21196 -184515 47664 364555 289103 -159095 34310
15309 173225 -144915 327709 498331 17668 182089 306252 88377 100838 -10395 70200
$$ packed form
15390A75071J73415E9487a62075B5580P9945b48291C6223J41372L0473a00043
15379b00369C4151F220K94450f5575A64669p5051k9472j6659J4773B4706J73162
15368A97868Q9314n2149r4463d6103B69829a38304j09004A61878k516N504i4582
15356B98463G6145K47499A43309l8090b05951A78694c2216A0067M5302H748K3495
15345C2243L29758j53280C1166J15342E7086K86558J0648D4789b1837A97177A1870
15333A66627i5771N033A14682E6142K95610j75209L687N3055a8459q2815C7324
15321E2070J09547d1029B14743i4516B1196a84515D7664L16891p5452a59095C4310
15309A73225a44915C27709J70622A7668J64421J24163H8377J2461a0395G0200
$$ plain form
15298 234364 -154297 16695 294480 95204 -326450 -55416 22672 321741 155324 220136
15288 220136 -296731 -10866 -14802 -79624 -62181 78769 -188134 -9344 179846 -168320 -445138
15277 -445138 266798 -161266 259106 -36518 374402 158147 -49999 166237 57325 173134
15267 173134 -138343 118240 150744 128372 234990 260899 249017 219893 429568 120493
15256 210414 -92153 59836 27963 227879 275169 537961 983108 1245624 896995 1167726
15246 1167726 694566 126854 143241 64945 278152 28026 90018 141735 164614 -220969
15235 -225946 176935 10489 -149632 -137366 315042 147636 198021 105497 158575 94228 147361
15224 147361 63169 -126069 132074 107456 309249 125305 17854 65228 67836 -243231 91848
$$ packed form
15298B34364a54297A6695K77785I5204c26450e5416B2672K99069A55324O4812
15288B20136b96731a0866l936o4822J7443G8769a88134i344A79846a68320k76818
15277d45138B66798a61266B59106c6518C74402A58147d9999A66237E7325J15809
15267A73134a38343A18240L2504k2372J06618K5909j1882k9124K09675A20493
15256B10414i2153E9836B7963J99916M7290K62792M45147K62516l48629K70731
15246A167726m73160A26854J6387F4945K13207B8026O1992N1717K2879b20969
15235b25946A76935A0489a49632J2266C15042A47636N0385r2524N3078o4347N3133
15224A47361F3169a26069A32074k4618K01793A25305A7854M7374K608b43231I1848
$$ plain form
15212 157275 160278 -59211 -4603 2031 35065 325830 8394 182239 70445 116319 111789 110594
15200 110594 1092 52702 2687 259073 204984 429510 118416 17493 -132953 198730 -98225
15188 126003 49769 -80431 -78496 192454 151600 -136513 -128070 -254699 17276 -12491 38799
15176 325310 -88695 182030 29033 44695 39385 187908 -32117 32928 174764 110698 171306
15165 171306 174474 140803 -243789 140312 3507 129380 -179377 194182 122531 -173933 63441
15153 334236 -12262 337232 -105697 22344 11751 121860 345349 95010 17580 -206746
15142 -67860 318046 207686 119987 94390 -165105 100202 -203293 -104547 62319 -13591 179056
15130 -6758 48285 -243661 112889 63709 288163 250524 466268 200483 96171 125112 -105419
$$ packed form
15212A57275L003e9211d603B031L3034K90765H394J73845G0445M5874m530j195
15200A10594A092N1610B687K56386n4089K24526A18416A7493a32953A98730i8225
15188A26003D9769h0431J935A92454m0854a36513Q443j26629A7276a2491C8799
15176C25310h8695A82030B9033J5662n310J48523c2117C2928J41836o4066O0608
15165A71306L168l3671b43789A40312C507J25873a79377A94182p1651a73933F3441
15153C34236a2262C37232a05697B2344j0593J10109K23489I5010A7580b06746
15142f7860C18046j10360q7699k5597a65105A00202b03293R8746F2319a3591A79056
15130f758D8285b43661A12889m9180K24454l7639K15744B00483I6171K8941a05419
$$ plain form
15118 23716 303096 -53773 222841 325169 63809 -66616 -85003 83535 271669 186526 177525
15107 177525 250223 99443 36958 212194 19916 -117348 78676 167564 358128 281544 180764
15096 180764 43309 348536 247500 27272 395042 -153372 -217694 209654 237467 118942
15086 118942 277460 -288339 87282 -264794 71223 212876 -81521 -114618 255485 501247
15076 501247 -85656 74646 96659 -97592 322501 68213 -53688 233473 251946 -41147 -27423
15065 -27423 40597 79461 176254 54443 144837 132610 252287 77368 7541 373468 185026
15053 -83069 95327 367361 319382 66603 -80705 318467 106617 265070 -103021 463657
15042 665122 388583 435182 235086 230275 288719 294828 25025 288521 -35153 173355 239675
$$ packed form
15118B3716K79380e3773B22841J02328F3809f6616j8387H3535J88134q5143r001
15107A77525P2698I9443C6958J75236A9916a17348G8676Q8888J90564p6584j00780
15096A80764D3309L05227j01036B7272L67770a53372o4322B09654K7813j18525
15086A18942J58518b88339H7282b64794G1223J41653h1521l3097B55485K45762
15076E01247h5656G4646K2013i7592C22501F8213e3688B33473J8473d1147J3724
15065b7423D0597L8864R6793E4443R0394j2227J19677G7368G541L65927A85026
15053h3069I5327K72034m7979F6603h0705C18467A06617J58453a03021D63657
15042F65122k76539M6599k00096m811N8444O109B5025K63496c5153A73355O6320
$$ plain form
15031 239675 -124057 -52498 233676 -103574 119985 396068 265384 272821 459707 528014
15021 528014 209157 339668 96553 89043 548055 331552 261090 282120 42840 303152 55750
15009 290674 -76790 71377 302743 322679 544860 307375 286037 36634 237722 342582
14999 342582 124799 31952 374760 154383 71380 144998 516527 405032 300427 197620
14989 197620 167735 59747 249601 406732 310715 274104 206329 386809 -70773 344112 126981
14977 245935 356057 179732 185213 -909 -64897 374420 264818 91094 373098 306855 90937
14965 575976 297353 324643 218485 526343 427622 316449 484338 320690 228555 56078
14954 648774 532278 476890 581997 393746 450920 373689 340525 456007 435267 299878
$$ packed form
15031B39675a24057e2498B33676a03574A19985K76083j30684P437J86886O8307
15021E28014B09157J30511I6553p510M59012k16503p0462K1030D2840K60312E5750
15009B90674g6790G1377K31366J9936K22181k37485k1338C6634K01088J04860
14999C42582A24799C1952L42808A54383G1380P3618L71529j11495j04605j02807
14989A97620k9885E9747J89854J57131r6017l6611o7775J80480g0773C44112A26981
14977B45935J10122j76325N481i09o3988C74420j09602I1094K82004o6243I0937
14965E75976k78623K7290j06158L07858r8721j11173J67889j63648r2135E6078
14954F48774j16496n5388J05107j88251N7174p7231l3164J15482k0740j35389
$$ plain form
14944 299878 269333 360393 385970 467333 320966 317162 245420 312975 230281 310510 424010
14933 424010 249811 394389 328828 528167 228147 77393 506449 315905 253077 518950
14923 518950 584491 504174 682291 671286 397982 182556 429963 535358 523305 703265
14913 703265 488515 258238 736873 320736 464292 345308 84446 70173 439049 340878
14903 340878 206390 173284 384436 392865 231289 109034 170359 207944 580084 260852
14892 290759 402544 286594 493285 380104 463840 203896 168885 502000 628449 387725
14882 387725 252562 556320 381278 330135 337391 399406 163371 600199 384018 192657
14872 192657 531508 468274 228413 441641 377298 313525 147342 490979 433117 102116
$$ packed form
14944B99878l0545R1060K5577Q1363j46367l804p1742O7555q2694Q0229J13500
14933D24010j74199J44578o5561J99339B28147G7393M29056j90544o2828K65873
14923E18950O5541q0317J78117j1005k73304A82556K47407J05395j2053J79960
14913G03265k14750k30277M78635C20736J43556j18984H4446j4273L68876r8171
14903C40878j34488l3106K11152Q429j61576A09034O1325L7585L72140B60852
14892B90759J11785j15950K06691j13181Q3736B03896l5011L33115J26449k40724
14882C87725j35163L03758j75042n1143P256O2015A63371M36828k16181j91361
14872A92657L38851o3234B28413K13228o4343o3773A47342L43637n7862A02116
$$ plain form
14861 462485 400821 520459 -70511 169812 378368 335613 274400 310437 332684 580147 357829
14850 357829 501758 470397 398476 440614 488027 290281 576011 545357 382038 648069
14840 648069 585989 663083 282322 347116 668288 230083 432089 429170 344286 474860 225542
14828 259706 458163 513611 334899 706119 947567 293946 556451 356949 507414 550113
14818 550113 776771 463627 144772 438382 120094 444795 598271 279699 246443 321967
14808 321967 491049 547034 91626 299098 542424 599171 291990 242785 359915 604874
14798 604874 413951 646409 601690 376524 580582 450218 578401 446727 583297 390094
14788 390094 340775 818354 622586 741767 492435 669894 220439 781240 506478 719385
$$ packed form
14861D62485o1664J19638g0511A69812K08556m2755o1213L6037K2247K47463k22318
14850C57829J43929l1361p1921M2138M7413j97746K85730l0654j63319K66031
14840F48069o2080P7094B82322O4794L21172B30083K02006k919q4884J30574B25542
14828B59706J98457N5448j78712L71220K41448B93946K62505j99502J50465M2699
14818E50113K26658l13144A44772K93610A20094L24701J53476B79699l3256P5524
14808C21967J69082N5985I1626K07472K43326N6747B91990m9205J17130K44959
14798F04874j90923K32458m4719k25166K04058j30364J28183j31674J36570j93203
14788C90094m9319M77579j95768J19181k49332J77459B20439N60801k74762K12907
$$ plain form
14778 719385 771045 556842 749573 507553 503556 679193 624999 623623 436488 449828 335740
14767 335740 422601 757620 463417 453196 663129 317156 742762 501986 556639 669884
14757 669884 432454 571122 542324 416360 736619 479216 664375 666830 779476 793659
14747 793659 640207 594375 810668 812173 476617 722921 678211 727039 904701 342446
14736 544886 557327 655750 979415 735389 667806 676171 428686 1081550 860423 844287 877461
14725 877461 940598 907917 800693 826904 982761 1110099 348541 1007109 800375 809303
14715 809303 1171541 495059 797093 606855 963635 609269 692852 881878 717680 991294
14705 991294 845694 897273 929711 1069904 678857 580284 1032534 1097298 1076097 846840
$$ packed form
14778G19385N1660k14203J92731k42020l997J75637n4194j376j87135J3340j14088
14767C35740Q6861L35019k94203j0221K09933C17156M25606k40776N4653J13245
14757F69884k37430J38668k8798j25964L20259k57403J85159K455J12646J4183
14747G93659j53452m5832K16293J505l35556K46304m4710M8828J77662C42446
14736E44886J2441R8423L23665k44026o7583Q365k47485O52864k21127j6136L3174
14725H77461O3137l2681j07224K6211J55857J27338C48541O58568k06734Q928
14715H09303L62238D95059L02034j90238L56780l54366Q3583J89026j64198K73614
14705I91294j45600N1579L2438J40193l91047r8573M52250O4764k1201k29257
$$ plain form
14695 846840 1100599 753693 844195 676779 855899 1000693 954147 742282 647228 929478
14685 929478 856372 879401 805212 1000113 1223860 893360 975687 794063 643221 896517
14675 896517 817693 815859 980314 946334 1260481 1015350 992734 1096548 864802 1013074
14665 1013074 644466 685525 838826 885770 899123 1088215 945546 647877 1084851 1020481
14655 1020481 741419 1199092 1082520 1100509 923674 1336517 1388199 1090102 936308 1153894
14645 1153894 1159220 1152700 1187913 1108040 1131114 958224 1283303 1258888 979168 1545756 1258882
14634 1258882 1154150 1276349 1267517 1291566 1255524 1345420 1549469 1103649 1083267 1188037
14624 1188037 1092926 1512025 1062994 1320907 1320921 1231548 1491506 1230555 1381748 834840
$$ packed form
14695H46840K53759l46906R0502j67416J79120J44794m6546k11865r5054K82250
14685I29478p3106K3029p4189J94901K23747l30500Q2327j81624j50842K53296
14675H96517p8824j834J64455l3980L14147k45131k2616J03814k31746J48272
14665A013074l68608M1059J53301M6944J3353J89092j42669k97669M36974o4370
14655A020481k79062M57673j16572J7989j76835M12843N1682k98097j53794K17586
14645A153894N326o520L5213p9873K3074j72890L25079k4415k79720N66588k86874
14634A258882j04732J22199q832K4049l6042Q9896K04049m45820k0382J04770
14624A188037r5111M19099m49031K57913J4q9373K59958k60951J51193n46908
$$ plain form
14614 834840 1465492 1538802 1024918 1415817 1568001 1232600 1445041 1765549 1462942 1438996
14604 1438996 1472570 1095071 1307541 1497581 1322494 1510003 1410413 1601076 1434658 1741369
14594 1741369 1585477 1526847 1544268 1344242 1501846 1580798 1646981 1479101 1509277 1865742
14584 1865742 1802881 1829958 1931775 1887681 1766630 1782749 1794797 1819519 2230558 1975055
14574 1975055 1936178 2093246 1735140 1849445 2284935 1883511 2289733 2297435 1933181 2201613
14564 2201613 2125674 2234427 2648454 2508459 2527404 3132211 2779543 2409554 3131497 3114447
14554 3114447 3241595 3411130 4276379 4510313 5712598 6955803 11356826 21220616 38895333
14545 38895333 39672554 18390134 7629852 4256257 2724908 2572025 2214173 1992808
$$ packed form
14614H34840O30652P3310n13884L90899J52184l35401K12441L20508l02607k3946
14604A438996L3574l77499K12470J90040j75087J87509r9590J90663j66418L06711
14594A741369j55892n8630J7421k00026J57604P8952O6183j67880L0176L56465
14584A865742o2861K7077J01817m4094j21051J6119J2048K4722M11039k55503
14574A975055l8877J57068l58106J14305M35490m01424M06222P702l64254K68432
14564B201613p5939J08753M14027j39995J8945O04807l52668l69989P21943j7050
14554C114447J27148J69535Q65249K33934J202285J243205M401023R863790J7674717
14545C8895333P77221A8390134G629852l373595j531349j52883l57852k21365
$$ plain form
14537 1992808 1910254 2261134 1804047 1981580 1697927 1785825 1911578 1994305 1980956 2049354
14527 2049354 2168820 2202341 2312081 2206640 2352472 2512509 1965593 2397082 2213146 2348396
14517 2348396 2429425 2402642 2544615 2472167 2730963 2682984 2509919 2821737 2620690 2631812
14507 2631812 2507257 2919728 2901926 2644786 2779652 2755379 2968816 2916277 2901159 2954032
14497 2954032 2834271 2955279 3468451 3141804 3821962 3439953 3210129 3071950 3230512
14488 3230512 3680743 3611898 3499296 3350367 3574485 3178412 3361741 3759161 3610706 3875235
14478 3875235 3994682 3852433 3981909 3829354 3932561 4006275 3960269 4091023 3744507 4121891
14468 4121891 3826613 4383011 4182281 4346356 4405530 4338926 4451763 4069915 4485341 4566886
$$ packed form
14537A992808q2554L50880m57087J77533k83653Q7898J25753Q2727j3349O8398
14527B049354J19466L3521J09740j05441J45832J60037n46916M31489j83936J35250
14517B348396Q1029k6783J41973p2448K58796m7979j73065L11818k01047J1122
14507B631812j24555M12471j7802k57140J34866k4273K13437n2539j5118N2873
14497B954032j19761J21008N13172l26647O80158l82009k29824j38179J58562
14488C230512M50231o8845j12602j48929K24118l96073J83329L97420j48455K64529
14478C875235J19447j42249J29476j52555J03207P3714m6006J30754l46516L77384
14468D121891k95278N56398k00730J64075N9174o6604J12837l81848M15426Q1545
$$ plain form
14458 4566886 4645022 4968333 4777452 4785809 4890666 5027337 5026177 5440296 5174198 5290916
14448 5290916 5447339 5557035 5369249 5546714 5439977 5576714 5534273 6085404 5723343 5895850
14438 5895850 6077523 5928388 6014269 6262536 5968012 6600994 5848544 6462085 6632734 6820018
14428 6820018 7180404 7114274 7058939 7106951 7227584 7016336 7245892 7232414 7336553 7730794
14418 7730794 7768844 7912133 8004602 7971691 8231136 8597003 8363574 8721853 8731874 8715341
14408 8715341 8900183 9120372 9034207 9266578 9714985 9686854 9874929 10087699 10369206 10575308
14398 10575308 10630772 10644431 10838915 11121765 11286719 11236922 11430386 11859581 11786212 12032021
14388 12032021 12345770 12338692 12833236 12839852 13087961 13449796 13779097 14261750 14155387 14832778
$$ packed form
14458D566886P8136L23311j90881Q357J04857J36671j160M14119k66098J16718
14448E290916J56423J09696j87786J77465j06737J36737m2441N51131l62061J72507
14438E895850J81673j49135Q5881K48267k94524O32982p52450O13541J70649J87284
14428F820018L60386o6130n5335M8012J20633k11248K29556j3478J04139L94241
14418G730794L8050J43289R2469l2911K59445L65867k33429L58279J0021j6533
14408H715341J84842K20189q6165K32371M48407k8131J88075K12770K81507K06102
14398A0575308N5464J3659J94484K82850J64954m9797J93464M29195p3369K45809
14388A2032021L13749p078M94544O616K48109L61835L29301M82653j06363O77391
$$ plain form
14378 14832778 14672605 14687714 15098798 15364760 15994158 15844950 16295686 17097994 17346400
14369 17346400 17459199 17852805 18336310 18657067 19208031 19638600 19900372 20101985 20890300
14360 20890300 21335610 21747141 22218823 22926196 22978373 23507678 24107324 24632186 25075847
14351 25075847 26148279 26457846 27268853 27951311 28802147 29569053 29782090 30729647 31618320
14342 31618320 32436477 33181301 34071330 35125231 36425724 37123686 38233207 39468546 40439149
14333 40439149 41744734 42899232 44353766 45964898 47348213 48519634 50080312 51858959
14325 51858959 53458950 55264526 57088366 59202432 61128456 63422546 65576023 68026868
14317 68026868 70368905 72944687 75993223 78705288 81732692 85435225 88708220 91939009
$$ packed form
14378A4832778j60173J5109M11084K65962O29398j49208M50736Q02308K48406
14369A7346400J12799L93606M83505L20757N50964M30569K61772K01613P88315
14360B0890300M45310M11531M71682P07373N2177N29305N99646N24862M43661
14351B5075847J072432L09567Q11007O82458Q50836P66906K13037R47557Q88673
14342C1618320Q18157P44824Q90029J053901J300493O97962J109521J235339R70603
14333D0439149J305585J154498J454534J611132J383315J171421J560678J778647
14325E1858959J599991J805576J823840K114066J926024K294090K153477K450845
14317F8026868K342037K575782L048536K712065L027404L702533L272995L230789
$$ plain form
14309 91939009 96255559 100349937 104510566 108788025 113771144 118895929 124341422 130050103
14301 130050103 136214230 142395208 149279880 156318471 164209362 172613088 180728236 189890782
14293 189890782 199432610 209736376 220308031 231473395 243406892 255572912 268398276
14286 268398276 281633659 295589172 309705669 323998002 338548575 352837689 367383788
14279 367383788 381411061 394378886 406913594 418265590 428396378 436400041 442323217
14272 442323217 444128110 442946048 440329236 437010709 433895938 428113526 420336504 411115019
14264 411115019 400459399 387747564 373615848 358967265 343528960 327778816 312633394
14257 312633394 297746060 283739891 270179522 256280166 243442815 230830801 219281256
$$ packed form
14309I1939009M316550M094378M160629M277459M983119N124785N445493N708681
14301A30050103O164127O180978O884672P038591P890891Q403726Q115148R162546
14293A89890782R541828J0303766J0571655J1165364J1933497J2166020J2825364
14286B68398276J3235383J3955513J4116497J4292333J4550573J4289114J4546099
14279C67383788J4027273J2967825J2534708J1351996J0130788Q003663N923176
14272D42323217J804893j182062k616812l318527l114771n782412p777022r221485
14264D11115019j0655620j2711835j4131716j4648583j5438305j5750144j5145422
14257C12633394j4887334j4006169j3560369j3899356j2837351j2612014j1549545
$$ plain form
14250 219281256 208396149 197692783 188098843 178487425 169697855 161670816 154283028 146826770
14242 146826770 139578976 133306719 127173625 121677047 116288410 111332274 106608361 101831100
14234 101831100 97304198 93508637 89773584 86382715 82895590 79463472 76344892 73367265
14226 73367265 70996866 67978417 65703143 63085710 61156552 58992201 57269894 54883776
14218 54883776 53237464 51211777 49588758 48260746 46975458 45330470 43884273 42577014
14210 42577014 41072633 39864220 38919704 38155173 37186792 35904924 35175284 33849884 33002828
14201 33002828 32540935 31889393 30437144 29540777 28953954 28203435 27479410 26900028 26297603
14192 26297603 25396042 25168946 24284153 23818715 23455862 22626899 21868135 21744754 21250169
$$ packed form
14250B19281256j0885107j0703366r593940r611418q789570q027039p387788p456258
14242A46826770p247794o272257o133094n496578n388637m956136m723913m777261
14234A01831100m526902l795561l735053l390869l487125l432118l118580k977627
14226G3367265k370399l018449k275274k617433j929158k164351j722307k386118
14218E4883776j646312k025687j623019j328012j285288j644988j446197j307259
14210D2577014j504381j208413r44516p64531r68381j281868p29640j325400q47056
14201C3002828m61893o51542j452249q96367n86823p50519p24025n79382o02425
14192B6297603r01561k27096q84793m65438l62853q28963p58764j23381m94585
$$ plain form
14183 21250169 20726157 20216377 19766624 19433290 18993977 18621564 18088510 17938700 17766688
14174 17766688 17143074 16665393 16353230 16378523 15770146 15480491 15633942 14892523 14770610
14165 14770610 14511145 14395564 14092380 13971714 13339866 13302007 13080963 12780161 12100863
14156 12100863 12040007 11909263 12251760 11554892 11517957 11474729 11272882 10871091 10972675 10675488
14146 10675488 10550989 10471496 10250560 9905663 9978108 9365595 9617680 9625415 8990679 9154238
14136 9154238 8963318 8783176 8981809 8631203 8474156 8101381 8329801 8052569 8043666 7964496
14126 7964496 7422048 7573576 7369926 7689258 7190928 7414829 7256983 7056556 7105005 7132017
14116 7132017 6883195 6641427 6567025 6394222 6310508 6085603 6633177 6118604 6392287 6130538
$$ packed form
14183B1250169n24012n09780m49753l33334m39313l72413n33054j49810j72012
14174A7766688o23614m77681l12163K5293o08377k89655J53451p41419j21913
14165A4770610k59465j15581l03184j20666o31848l7859k21044l00802o79298
14156A2100863o0856j30744L42497o96868l6935m3228k01847m01791J01584k97187
14146A0675488j24499p9493k20936l44897P2445o12513K52085P735o34736J63559
14136I154238j90920j80142J98633l50606j57047l72775K28420k77232q903p9170
14126G964496n42448J51528k03650L19332m98330K23901j57846k00427M8449K7012
14116G132017k48822k41768p4402j72803q3714k24905N47574n14573K73683k61749
$$ plain form
14106 6130538 5909426 6066680 5770861 5861565 5780664 5769618 5852367 5660977 5269111 5294253
14096 5294253 5563274 5409025 5329524 5248537 5041306 5255384 5098717 5088204 4997041 4669870
14086 4669870 4763694 4776919 4534894 4835140 4572617 4653981 4559069 4613699 4791186 4622974
14076 4622974 4208515 4129906 4131270 4234609 3976297 4030005 3960056 3833338 4317414 3639638
14066 3639638 3941310 4088862 4372770 4011725 3877567 4048172 3908354 3601888 3687583 3625407
14056 3625407 3498028 3519582 3490174 3562316 3498244 3482911 3429654 3530893 3170426 3097568 3097694
14045 3097694 3099608 3056535 2984758 3315103 3117100 3137353 3013647 3012279 3039933 3321790 2850680
14034 2850680 2721352 2952148 2932792 2854042 2809240 3044495 2739940 2628089 2737840 2604989
$$ packed form
14106F130538k21112J57254k95819R0704q0901j1046Q2749j91390l91866K5142
14096E294253K69021j54249p9501q0987k07231K14078j56667j0513r1163l27171
14086D669870R3824J3225k42025L00246k62523Q1364r4912N4630J77487j68212
14076D622974m14459p8609J364J03339k58312N3708o9949j26718M84076o77776
14066C639638L01672J47552K83908l61045j34158J70605j39818l06466Q5695o2176
14056C625407j27379K1554k9408P2142o4072j5333n3257J01239l60467p2858J26
14045C097694J914m3073p1777L30345j98003K0253j23706j368K7654K81857m71110
14034B850680j29328K30796j9356p8750m4802K35255l04555j11851J09751j32851
$$ plain form
14024 2604989 2480729 2136710 2660071 2657530 2673121 2492037 2410581 2562294 2469226 2507214
14014 2507214 2303838 2073439 2284335 2235452 2293393 2229173 2466973 2195644 2226490 2151581
14004 2151581 2325430 2153831 2014455 1675032 1980520 2183555 2007898 2102021 1683383 2155896
13994 2155896 2298857 1852695 1941975 2598663 2689030 3385665 5321587 12031192 27993753
13985 27993753 41569537 26009332 13379877 8094590 5481618 4584065 4094057 3649146
13977 3649146 3161227 2952957 2648125 2333349 2452941 2922884 2330213 2370708 2440931 2158621
13967 2158621 2334321 1916840 1755595 1959506 2268294 2086670 2141789 1748681 1951248 2004462
13957 2004462 1962422 1847107 1786131 1838355 2132523 1792916 1986519 1790459 1735584 1717645
$$ packed form
14024B604989j24260l44019N23361k541J5591j81084q1456J51713r3068L7988
14014B507214k03376k30399K10896m8883N7941o4220K37800k71329L0846p4909
14004B151581J73849j71599j39376l39423L05488K03035j75657R4123m18638M72513
13994B155896J42961m46162Q9280O56688R0367O96635J935922O709605J5962561
13985B7993753J3575784j5560205j2629455n285287k612972q97553m90008m44911
13977C649146m87919k08270l04832l14776J19592M69943n92671M0495P0223k82310
13967B158621J75700m17481j61245K03911L08788j81624N5119l93108K02567N3214
13957B004462m2040j15315o0976N2224K94168l39607J93603j96060n4875j7939
$$ plain form
13947 1717645 1667534 1769264 1980722 1729809 1702650 1858952 1822075 1658118 1494084 1820514
13937 1820514 1896156 1707902 1729965 1608342 1453436 1412510 1569606 1343874 1586943 1272150
13927 1272150 1651128 1281499 1409948 1567134 1494232 1323407 1435831 1656910 1310965 1664805
13917 1664805 1306516 1011782 1206356 1487926 1424225 1349534 1133818 1491151 1077089 1576818
13907 1576818 1337867 1179246 1103084 1491221 1377652 1470171 1337507 1166964 1342051 1357825
13897 1357825 1387187 1061863 1320806 1342100 1392199 1116915 1193049 1451253 1333718 1040098
13887 1040098 1063503 994249 1116001 1093902 1094652 1269299 1035047 1092580 1098001 1143423 989801
13876 989801 1099800 715572 951049 1229357 975670 992357 732645 922015 1169948 1038454
$$ packed form
13947A717645n0111J01730K11458k50913k7159J56302l6877j63957j64034L26430
13937A820514P5642j88254K2063j21623j54906m0926J57096k25732K43069l14793
13927A272150L78978l69629J28449J57186p2902j70825J12424K21079l45945L53840
13917A664805l58289k94734J94574K81570o3701p4691k15716L57333m14062M99729
13907A576818k38951j58621p6162L88137j13569R2519j32664j70543J75087J5774
13897A357825K9362l25324K58943K1294N0099k75284P6134K58204j17535k93620
13887A040098K3405o9254J21752k2099P50J74647k34252N7533N421M5422j53622
13876I89801J09999l84228K35477K78308k53687J6687k59712J89370K47933j31494
$$ plain form
13866 1038454 1203433 808630 1149371 943913 778555 1038518 1307992 978774 1070346 1004563
13856 1004563 1081315 852616 808389 782282 1003726 944094 886243 1065272 1268797 966203
13846 966203 773346 945615 1074669 1165101 769319 1080069 708206 1059364 841819 1084338
13836 1084338 1191671 971939 816478 683934 807482 977256 977509 1039011 955960 845632
13826 845632 707416 705408 673224 960613 825362 724523 785234 559858 609458 995777
13816 995777 814146 631345 793193 904282 974114 592349 810064 422828 995986 1021193
13806 1021193 879351 783070 731410 975956 841399 822245 548420 828392 840213 717500
13796 717500 658464 860620 637588 694127 656911 796952 781084 701735 872209 639155
$$ packed form
13866A038454J64979l94803L40741k05458j65358K59963K69474l29218R1572o5783
13856A004563P6752k28699m4227k6107K21444n9632n7851J79029K03525l02594
13846I66203j92857J72269J29054R0432l95782L10750l71863L51158k17545K42519
13836A084338J07333k19732j55461j32544J23548J69774K53O1502q3051j10328
13826H45632j38216k008l2184K87389j35251j00839O0711k25376M9600L86319
13816I95777j81631j82801J61848J11089O9832l81765K17715l87236N73158K5207
13806A021193j41842r6281n1660K44546j34557j9154k73825K79972J1821j22713
13796G17500n9036K02156k23032N6539l7216J40041j5868p9349J70474k33054
$$ plain form
13786 639155 448473 320488 784411 806737 368563 881704 694583 618133 895596 639254
13776 639254 712406 977367 612416 456134 877849 365715 579241 811304 844708 478785
13766 478785 501308 915070 743268 411686 857786 391114 407045 567141 366560 900596
13756 900596 494928 691032 618670 704372 820887 567867 826666 703338 596297 433833
13746 433833 616692 900039 581055 1004624 528431 608222 536920 355769 659655 492118
13736 492118 388317 207629 680395 577975 603442 622006 320231 414383 445613 460327
13726 460327 745140 509438 505295 522534 569259 838177 695849 597863 524003 398415 770606
13715 770606 588999 444928 494064 415707 539429 418591 558475 74341 587016 265303
$$ packed form
13786F39155j90682j27985M63923K2326C68563N13141j87121p6450K77463k56342
13776F39254P3152K64961l64951j56282M21715C65715K13526K32063L3404l65923
13766D78785K2523M13762j71802l31582M46100C91114J5931J60096k00581N34036
13756I00596m05668J96104p2362Q5702J16515k53020K58799j23328j07041j62464
13746D33833J82859K83347l18984M23569m76193P9791p1302j81151L03886j67537
13736D92118j03801j80688M72766j02420K5467J8564l01775R4152L1230J4714
13726D60327K84813k35702m143J7239M6725K68918j42328r7986p3860j25588L72191
13715G70606j81607j44071M9136p8357J23722j20838J39884G4341N12675B65303
$$ plain form
13704 312814 492238 608321 512502 289335 494311 391363 444573 668506 611298 352262
13694 352262 521866 925872 682319 336376 379823 389725 209629 487870 613699 695070
13684 695070 616108 706218 298404 603328 623865 371499 436198 518841 497237 502734 355255
13673 355255 354980 246784 -25477 353776 390722 496721 378521 282753 489123 287723 194801
13662 194801 342066 566900 204107 303399 345359 397482 353912 463647 371658 414297 397931
13651 397931 563294 434943 654504 207382 800068 437189 514926 288985 513379 169999
13640 399005 509774 467392 193616 149133 504925 256524 571044 278179 363939 464973
13630 464973 718403 238530 649039 213501 372624 346526 403146 113985 369956 528910
$$ packed form
13704C12814J79424J16083r5819k23167K04976j02948N3210K23933n7208k59036
13694C52262J69604M04006k43553C36376M3447R902j80096K78241J25829Q1371
13684F95070p8962R0110B98404L04924K0537k52366O4699Q2643k1604N497j47479
13673C55255k75j08196b5477C53776L6946J05999j18200r5768K06370k01400r2922
13662A94801J47265K24834B04107R9292M1960N2123m3570J09735r1989M2639j6366
13651C97931J65363j28351K19561B07382N92686l62879P7737k25941K24394A69999
13640C99005J10769m2382A93616m4483L55792k48401L14520B78179Q5760J01034
13630D64973K53430B38530M10509B13501J59123k6098N6620A13985K55971J58954
$$ plain form
13620 528910 369793 237987 342653 268901 337543 692157 634730 16044 456001 524997
13610 524997 135750 401496 276999 188049 223576 272477 401653 474652 211110 274654
13600 274654 101505 471508 372463 369972 549901 324736 185525 684304 277753 397008
13590 397008 105447 114778 289995 -27376 58124 146627 254623 266144 185724 440462 310376
13579 310376 339265 182086 432812 452787 484030 397686 139831 433966 326449 357878
13569 357878 52288 60791 256503 631674 290840 342788 191144 222120 160343 213439 405076
13558 405076 162643 290230 254032 310125 293064 321276 611157 13528 114692 378966
13548 378966 32733 236864 506568 379610 430094 188449 230292 364737 167385 100292
$$ packed form
13620E28910j59117j31806J04666p3752O8642L54614n7427A6044M39957O8996
13610E24997A35750K65746j24497q8950L5527M8901J29176P2999B11110O3544
13600B74654A01505L70003r9045k491J79929k25165j39211M98779B77753J19255
13590C97008A05447R331J75217b7376E8124Q8503J07996J1521q0420K54738j30086
13579C10376K8889j57179K50726J9975L1243q6344A39831K94135j07517L1429
13569C57878E2288Q503J95712L75171B90840N1948j51644L0976o1777N3096J91637
13558D05076A62643J27587l6198N6093j7061K8212K89881A3528J01164K64274
13548C78966C2733K04131K69704j26958N0484A88449M1843J34445A67385o7093
$$ plain form
13538 100292 324385 603850 439323 337966 30951 190031 6390 374541 337309 363407
13528 363407 505026 321981 -40769 94892 311464 653651 17040 255638 151093 165515
13518 165515 309649 249187 335042 -22558 277924 208365 128071 255317 265284 410950 175515
13506 211564 256034 164621 278926 -8941 365335 381096 234264 121960 21328 392978 123400
13494 333274 243812 260363 370718 288958 408364 203396 88340 142313 117996 107560 883
13482 411865 76819 505830 277641 367887 278045 78977 -6930 237018 226557 -41762 362842
13470 155105 49997 314374 211784 219209 -87986 97921 494264 250598 134588 264839
13460 264839 212022 172309 420222 28768 132638 93859 61868 110663 23390 320333 335099
$$ packed form
13538A00292K24093K79465j64527j01357C0951J59080F390L68151l7232K6098
13528C63407J41619j83045d0769I4892K16572L42187A7040K38598j04545J4422
13518A65515J44134o0462Q5855b2558B77924o9559q0294J27246R967J45666A75515
13506B11564M4470r1413J14305h941C65335J5761j46832j12304B1328L71650A23400
13494C33274q9462J6551J10355q1760J19406B03396H8340N3973k4317j0436H83
13482D11865G6819M29011k28189R0246q9842G8977f930B37018j0461d1762C62842
13470A55105D9997K64377j02590P425h7986I7921L96343k43666j16010J30251
13460B64839n2817l9713K47913B8768J03870l8779l1991M8795B3390K96943J4766
$$ plain form
13449 335099 -84673 199695 422036 180519 154857 -206149 313253 99214 178011 258019
13439 258019 111763 459567 394472 141610 145889 186711 -102856 205118 203896 -98116 95034
13427 153920 462087 190708 -38545 -101200 307409 535868 350844 364465 235136 251765
13417 251765 84482 151518 105082 268265 230388 187016 235043 32952 -201099 274048 158480
13406 158480 142628 287010 330549 37910 442330 129221 15524 -18845 237861 217888 172276
13395 172276 211370 231882 -14615 194931 175794 252162 384617 136816 146970 -148924 374307
13383 288397 347152 247745 15622 90950 86678 166326 127561 98665 -63196 264151 54236
13371 60112 53093 -104580 231735 -103002 259504 417424 155153 118999 309198 138014
$$ packed form
13449C35099h4673A99695K22341A80519k5662b06149C13253I9214P8797Q0008
13439B58019A11763L47804o5095A41610M279M0822a02856B05118j222i8116I5034
13427A53920L08167A90708c8545o2655C07409K28459j85024J3621j29329J6629
13417B51765H4482O7036m6436J63183l7877m3372M8027C2952b01099B74048j15568
13406A58480j5852J44382M3539C7910M04420A29221A5524a8845B37861j9973m5612
13395A72276L9094K0512a4615A94931j9137P6368J32455A36816J0154a48924C74307
13383B88397N8755r9407A5622P5328m272P9648l8765k8896f3196B64151E4236
13371F0112p019a04580B31735a03002B59504J57920A55153l6154J90199A38014
$$ plain form
13360 205027 309025 -34977 406020 72652 -379379 423066 253830 265196 256645 198511 183288
13349 183288 -196786 485032 493813 178756 24565 527865 396647 118724 150857 142491 112174
13338 112174 22515 418121 405563 240485 349442 123368 74136 123790 226810 208597
13328 208597 39857 24466 58556 201789 61033 -140512 -253294 41438 268121 433773
13318 433773 69900 74582 157285 343362 219428 191044 313160 -134345 421952 52052 106579
13307 106579 -225531 397608 430844 22787 -52060 38221 241465 211374 295317 295667 -108400
13295 294358 612728 148861 -103121 -332131 173214 -8033 177430 156070 74670 127903
13285 127903 176481 149255 41834 115142 -26209 151774 -29803 181147 97215 70500 -2725
$$ packed form
13360B05027J03998c4977D06020G2652c79379D23066j69236J1366q551n8134j5223
13349A83288a96786D85032Q781A78756B4565N03300j31218A18724L2133q366l0317
13338A12174B2515L95606j2558j65078J08957A23368m9232M9654J03020j8213
13328B08597C9857j5391L4090J43233F1033a40512j12782D1438K26683J65652
13318D33773F9900M682Q2703J86077j23934k8384J22116a34345D21952E2052N4527
13307A06579b25531C97608L3236B2787e2060C8221K03244l0091Q3943L50a08400
13295B94358L18370A48861a03121k29010A73214h033A77430k1360G4670N3233
13285A27903M8578k7226D1834P3308b6209A51774b9803A81147q3932k6715b725
$$ plain form
13273 -165833 99960 -30001 109917 144671 158136 55660 159049 -110544 246833 124499
13263 124499 302234 -238475 239011 -53236 34023 -118193 -56967 439973 34108 96311
13253 96311 284366 -29619 136776 39550 253458 307212 421341 67982 320981 -75676 96850
13241 338736 238410 327124 193003 -33646 238347 209480 114830 -18500 85907 -163343 -94055
13230 -94055 380214 -147067 -203441 -45463 -51021 122229 97438 -99855 236865 285264 61086
13218 -187293 426650 -437867 123100 -61447 -118048 92597 184187 322688 218502 -217983
13207 57444 -134569 -93901 214544 202732 -82398 256375 89291 237175 -122042 64536 17353
13195 97250 -166556 96596 -52373 4867 -34243 310368 -22860 -138729 107913 -48706 212695
$$ packed form
13273a65833I9960c0001A09917L4754J3465E5660J03389a10544B46833j22334
13263A24499J77735b38475B39011e3236C4023a18193e6967D39973C4108O2203
13253I6311J88055b9619A36776C9550K13908N3754J14129F7982K52999g5676I6850
13241C38736j00326Q8714j34121c3646B38347k8867r4650a8500H5907a63343O9288
13230i4055C80214a47067n6374d5463n558A22229k4791i9855B36865M8399F1086
13218a87293D26650d37867A23100f1447n6601I2597R1590J38501j04186b17983
13207E7444a34569M0668B14544j1812h2398B56375H9291J47884a22042F4536A7353
13195I7250a66556I6596e2373D867c4243C10368b2860j15869A07913d8706B12695
$$ plain form
13183 212328 481858 -36200 -104776 273611 35055 -224681 82722 182169 203832 7899 37414
13172 37414 -107034 66805 -16418 -41400 -106840 -11082 329331 195246 162732 -98289 -60446
13161 -60446 54703 -169197 215598 5189 -4298 -33195 165194 -306142 160359 277336 -58432
13149 118209 254043 -222724 17615 -20410 254020 443619 177269 -90174 -38452 279232
13138 -221274 -5932 -79088 165417 -2999 72091 -62834 244446 155177 -12957 -140011 127068
13126 -253864 -58867 -167413 17575 176228 -290334 345162 151154 210246 264745 137941
13116 137941 -51985 169181 304759 495537 2098 80789 -66060 52984 -114294 66764 -62364
13104 274695 70742 246397 161548 61379 69929 -1129 -26616 204065 27868 76832 -10984
$$ packed form
13183B12328K69530c6200o8576B73611C5055b24681H2722R9447K1663G899K9515
13172C7414a07034F6805a6418k4982o5440a1082C29331j34085l2514i8289L7843
13161f0446E4703a69197B15598E189d298k8897A65194c06142A60359J16977e8432
13149A18209J35834b22724A7615b0410B54020J89599A77269i0174c8452B79232
13138b21274e932p3156A65417b999G2091f2834B44446q9269a2957j27054A27068
13126b53864e8867j08546A7575J58653b90334C45162A51154N9092N4499j26804
13116A37941e1985A69181J35578J90778B098P8691f6060E2984a14294F6764f2364
13104B74695G0742J75655q4849F1379Q550a129k5487B04065B7868M8964a0984
$$ plain form
13092 128989 119447 53091 449384 -131169 79135 64219 123686 352561 -229115 130289 -47021
13080 -19681 116477 -191012 -121854 18565 -13273 110166 216675 14104 -19183 306004 148092
13068 122151 -276792 150778 341506 81137 -113099 206064 84419 -53753 130463 29450
13057 272716 -126548 208541 407125 -144293 40853 51762 -137679 93290 6894 -46401 162938
13045 -64230 227568 220254 38730 43908 54196 -82471 195027 -49888 76331 -22886 152579
13033 403266 224836 239442 481792 233411 -55924 89851 19935 215102 -68243 -90548 147578
13021 52849 260981 -5771 -296767 93001 -169358 137679 146810 -151870 78002 371243 -194105
13009 178424 -3337 281772 414647 94833 130390 -196986 44971 -226690 73449 275102 -44641
$$ packed form
13092A28989r542E3091L96293a31169G9135j4916N9467K28875b29115A30289d7021
13080a9681A16477a91012O9158A8565a3273A10166J06509A4104a9183C06004A48092
13068A22151b76792A50778J90728H1137a13099B06064H4419e3753A30463B9450
13057B72716a26548B08541J98584a44293D0853J0909a37679I3290F894d6401A62938
13045f4230B27568p314C8730N178J0288h2471A95027d9888G6331b2886A52579
13033D03266j78430J4606K42350B33411e5924H9851A9935J95167f8243k2305A47578
13021E2849K08132e771k90996I3001a69358A37679R131a51870G8002K93241a94105
13009A78424c337B81772J32875I4833L5557a96986D4971b26690G3449K01653d4641
$$ plain form
12997 15438 366227 105313 -19571 201530 -267411 -103562 -124755 -138008 -3464 98337 -94547
12985 148309 237865 92028 26246 16248 120829 257519 -198316 -10018 -56872 -168207 -141101
12974 -141101 -63842 -35485 -157361 -225761 166285 26638 116629 192134 103712 -151951 202834
12962 -98598 -177786 332523 -106862 150569 35614 -33183 56556 240593 209014 109869 -93836
12950 87822 -2308 220132 -159571 -151284 1646 -218217 204783 121359 205489 -124895 197307
12938 -277589 32305 127352 12184 -2613 -92526 -92913 137516 -207518 -199697 -330389 -10857 -152632
12926 -152632 -5071 141880 47102 -135316 187337 -96667 250159 266895 69915 13525 -9191
12914 -98238 -194557 405557 -166727 104450 -110014 77200 -222042 217462 254522 -281000
$$ packed form
12997A5438L50789A05313a9571B01530b67411a03562k1193j3253c464I8337i4547
12985A48309Q9556I2028B6246r998J04581J36690a98316a0018m6854j11335K7106
12974a41101f3842K8357j21876o8400A66285B6638Q9991P5505q8422a51951B02834
12962i8598p9188C32523a06862A50569C5614c3183E6556J84037l1579r9145i3836
12950H7822b308B20132a59571Q287A646b18217B04783q3424Q4130a24895A97307
12938b77589C2305R5047A2184b613q9913l87A37516b07518P821j30692a0857j41775
12926a52632e071A41880D7102a35316A87337i6667B50159J6736F9915A3525i191
12914i8238r6319D05557a66727A04450a10014G7200b22042B17462L7060b81000
$$ plain form
12903 206194 256271 -12 144951 -275715 212340 -110527 90877 35516 125632 -75081 6543
12891 8061 107019 -131677 142850 74267 -28135 29644 -304140 308321 176217 -121106 463005
12879 39407 44866 247399 -164353 103317 -70253 103173 78514 -92815 -75291 -49288 53532
12867 -80462 223616 -99110 126634 233805 403903 -7189 10998 49875 -25468 -324693 314966
12855 -270993 -277063 -229889 84080 178466 -29343 -35725 -53519 162480 142981 181544 -56162 108693
12842 85437 29370 213376 -352882 99943 -223006 -278003 -13703 -142299 -90112 -13521 -11899
12831 -11899 200032 66643 111445 -32181 120828 150854 67913 149186 196243 -80127 -37155
12819 -123360 214539 334430 -124869 -46318 -207692 69183 -97919 15248 -62965 -170391
$$ packed form
12903B06194N0077a2A44951b75715B12340a10527I0877C5516R0116g5081F543
12891H061R8958a31677A42850o8583b8135B9644c04140C08321j32104a21106D63005
12879C9407N459K02533a64353A03317g0253A03173k4659i2815J7524K6003E3532
12867h0462B23616i9110A26634J07171J70098g189A0998L8877b5468k99225C14966
12855b70993o070M7174H4080R4386b9343o382j7794A62480j9499L8563e6162A08693
12842H5437B9370J84006c52882I9943b23006n4997a3703j28596N2187a3521J622
12831a1899B00032F6643M4802c2181A20828L0026F7913Q1273M7057h0127c7155
12819a23360B14539J19891a24869d6318j61374F9183i7919A5248f2965j07426
$$ plain form
12809 -170391 32525 -254122 -109009 356423 -211416 2937 -225337 -65111 -314428 145643
12798 53380 -138675 -119538 111913 201239 222977 202186 202619 -35166 173312 16119 -155510
12786 -24456 221332 103104 108623 67118 16372 25573 -700 46132 -113615 -142704 -162502 -19938
12773 -279775 -17288 176353 8798 -21382 -244334 108536 22468 336906 -101553 6231 403580
12762 403580 -22078 -93892 -30076 -107453 -89479 -218094 374574 -23422 -95448 44539 164116
12751 164116 193900 -109701 52654 140770 115490 94832 62049 -56833 -23963 -59491 329733
12739 76892 -158655 -126822 349296 -197988 3563 95860 129563 16667 34304 281060 389766
12728 389766 9829 157865 -53689 178586 -118233 166049 -228930 76535 -155470 -5251 -53295
$$ packed form
12809a70391C2525b54122a09009C56423b11416B937b25337f5111k49317A45643
12798E3380a38675J9137A11913Q9326K1738k0791M33c5166A73312A6119a55510
12786b4456B21332A03104N519m1505A6372R201g00D6132a13615k9089j9798a9938
12773b79775a7288A76353H798b1382k22952A08536B2468L14438a01553F231L97349
12762D03580b2078p1814c0076p7377J7974j28615C74574b3422p2026D4539J19577
12751A64116K9784a09701E2654Q8116k5280k0658l2783e6833b3963l5528C29733
12739G6892a58655L1833C49296a97988C563R2297L3703A6667J7637K46756J08706
12728C89766I829J48036e3689A78586a18233A66049b28930G6535a55470e251m8044
$$ plain form
12717 -53295 97973 20115 -83530 186384 -179264 372580 189984 192014 259205 183290 95641
12706 95641 234440 290061 190547 75240 313613 301724 -497227 -42666 -229419 38794 -34496
12694 -69639 -29033 115005 -1865 -51084 -7942 -29340 182707 -221729 202377 -29774 -70582
12683 -70582 138730 7002 59014 338795 -3326 259664 -198338 -255722 311766 -194811 -86308
12671 -135799 -8033 61062 259463 -15721 151410 -77633 -168563 -82434 54774 -37477 129163
12659 216327 -109919 295812 -47232 -75531 216099 -22440 -238349 41596 -92212 -44687 238349
12647 -79227 186398 -33560 -192620 -32894 13340 -78552 125855 32224 -313279 117749 -16587
12635 -33520 -14967 118377 154803 -87120 15334 -82524 385623 48859 19557 360131 287966
$$ packed form
12717e3295I7973B0115h3530A86384a79264C72580j82596K030O7191p5915q7649
12706I5641J38799N5621r9514G5240K38373j1889d97227d2666j86753C8794c4496
12694f9639b9033A15005a865m9219g942k1398A82707b21729B02377b9774m0808
12683g0582A38730G002N2012K79781c326B59664a98338n7384C11766a94811h6308
12671a35799h033F1062J98401a5721A51410g7633r0930h2434E4774c7477A29163
12659B16327a09919B95812d7232k8299B16099b2440k15909D1596i2212d4687B38349
12647g9227A86398c3560j59060c2894A3340g8552A25855C2224c13279A17749a6587
12635c3520a4967A18377L6426h7120A5334h2524C85623D8859A9557L40574p2165
$$ plain form
12624 287966 127509 78542 276200 323491 199781 -222526 88600 -120038 -283825 12286
12613 216765 -71727 -222624 -208333 -44002 49682 210194 -107774 -151523 184949 252979 93497
12601 279550 152038 -229930 240759 175069 -12452 -46813 204133 -80422 -119910 -26086 -67137
12590 -67137 -5692 21462 -34187 -26512 -392615 -13498 102960 107085 211063 -154971 28165
12578 -186927 -90707 40187 272672 -23070 11106 20381 -343713 -168502 -46643 -40510 -69419
12567 -69419 -86061 -58313 72029 -309714 -379743 24319 -69980 94297 -286878 -2931 -129241
12556 -129241 58496 162394 -5030 5965 100148 241627 -20774 -103175 -101223 47902 -170115
12544 -303563 -132880 -97279 389220 -79462 168580 -88673 -61173 -111506 136199 -70079 -65600
$$ packed form
12624B87966A27509m8967J97658M7291j23710b22526H8600a20038j63787A2286
12613B16765g1727j50897J4291d4002D9682J60512a07774m3749A84949O8030I3497
12601B79550j27512b29930B40759o5690a2452l4361B04133h0422l9488b6086m1051
12590f7137e692B1462c4187P675l66103a3498A02960M125J03978a54971B8165
12578a86927i0707D0187K32485b3070A1106R275c43713a68502d6643O133k8909
12567f9419j6642K7748G2029c09714p0029B4319f9980I4297b86878b931j26310
12556a29241E8496J03898e030E965R4183J41479b0774q2401J952D7902a70115
12544c03563a32880L5601C89220g9462A68580h8673K7500n0333A36199g0079M479
$$ plain form
12533 -65600 -70808 -65223 150778 137034 168370 48161 19885 67291 -2523 -333175 -225133 63173
12520 -102583 75938 -72567 -6505 -171161 35673 -62717 41092 -194099 -21179 166344 -332292
12508 -74812 367844 -14409 1371 55753 -263787 -136522 130741 164253 66368 243252 217692
12497 217692 -67908 368870 -63233 -66163 24525 -102799 84747 296820 180669 145470 184322
12486 184322 59331 -168554 -189948 -31657 -68214 35692 -182062 105503 9840 -155918 46705
12474 -164690 -17403 -6879 -2267 334042 -181004 -34126 -189917 417112 -26611 -174962 161981
12462 -31533 209432 -66567 -18762 410747 -69892 -5845 -74973 -345324 327411 -35024 265007
12450 137987 -38410 -195279 -168942 -35781 -53980 -144079 -142891 -3201 56342 -407891 -36273
$$ packed form
12533f5600n208N585A50778j3744L1336D8161A9885M7406b523l30652J08042F3173
12520a02583G5938g2567f505j64656C5673f2717D1092a94099b1179A66344c32292
12508g4812C67844a4409A371N4382b63787J27265A30741L3512F6368J76884k5560
12497B17692f7908C68870f3233k930B4525a02799H4747K12073j16151l5199L8852
12486A84322E9331a68554k1394c1657l6557C5692a82062A05503I840a55918D6705
12474a64690a7403f879b267C34042a81004c4126j55791D17112b6611j48351A61981
12462c1533B09432f6567a8762D10747f9892e845o9128k70351C27411c5024B65007
12450A37987c8410j56869K6337c5781j8199r0099J188c201E6342d07891c6273
$$ plain form
12438 -20980 -252083 -84866 -230748 185456 147834 -18105 19092 227873 -52448 -92913 52974
12426 78659 76911 -63122 81808 16458 138028 -13892 62483 4918 -199156 -98021 58389 -116906
12413 -116879 11484 49914 159485 -44977 99414 -185059 309772 -205942 48846 -196718
12402 300573 81408 172685 66042 -21492 -417249 -76893 105929 191555 -269455 -361935 -304550
12391 -304550 -234132 -78312 -144163 21904 46057 48969 -19457 38418 -26496 273467 232877
12380 232877 190603 23456 22373 -29127 154048 -10012 -395665 69790 -13617 41678 91723
12369 91723 44409 107078 111204 -281341 -133825 445208 -63635 -147382 35413 68553 -150414
12357 85696 -120539 -105867 -25511 78519 -34363 -9207 121438 59573 -278883 -155449 39831
$$ packed form
12438b0980k31103h4866j45882A85456l7622a8105A9092K08781e2448m0465E2974
12426G8659j748f3122H1808A6458J21570a3892F2483D918a99156i8021E8389a16906
12413a16879A1484L8430J09571d4977I9414a85059C09772b05942D8846a96718
12402C00573H1408R1277F6042b1492l95757g6893A05929Q5626b69455r2480N7385
12391c04550P0418g8312o5851B1904K4153K912a9457C8418b6496B73467m0590
12380B32877m2274B3456j083b9127A54048a0012l85653F9790a3617D1678N0045
12369I1723D4409O2669M126b81341a33825D45208f3635q3747C5413L3140a50414
12357H5696a20539J4672b5511G8519c4363i207A21438E9573b78883J23434C9831
$$ plain form
12345 -284976 -93138 -134833 165793 -162716 186115 -87499 -234315 -109113 -92405 79619
12334 141861 32981 160270 3360 -224982 214568 -67268 2606 150630 11159 127285 -27587
12322 124911 -193647 65179 211338 186548 -446 -144401 -174766 -32605 -14978 -17722 -168536
12311 -168536 -1164 194852 199661 -84815 -116855 -66298 152405 204108 -66383 -162467 224789
12299 -145561 -111803 163330 -50059 -231580 32186 166673 -114580 36205 -55243 316760
12288 75572 -23436 259384 226274 -80880 10133 -36505 -118459 191589 103938 37144 207066
12277 207066 248081 21255 -13891 140866 127139 -175457 153917 75608 -151788 -145820 -81190
12266 -81190 -159156 152686 133775 -167567 -38107 -6141 -127730 -15978 64706 -59613 6895
$$ packed form
12345b84976i3138m1695A65793a62716A86115h7499j46816a09113J6708G9619
12334A41861C2981J27289C360b24982B14568f7268B606J48024A1159J16126b7587
12322A24911a93647F5179J46159k4790d46j43955l0365c2605a4978k744j50814
12311a68536a164A94852M809h4815l2040N0557A52405N1703f6383r6084B24789
12299a45561L3758A63330e0059j81521C2186J34487a14580C6205e5243C16760
12288G5572b3436B59384l3110h0880A0133c6505q1954A91589q7651C7144J69922
12277B07066M1015B1255a3891A40866j3727a75457A53917G5608a51788N968O4630
12266h1190p7966A52686j8911a67567c8107f141j21589a5978F4706e9613F895
$$ plain form
12254 -105447 36316 120433 9162 -213554 -121259 -277652 -117933 77474 108623 378390 44001
12242 94237 -176487 100802 -131298 244380 -38408 82490 283250 -93511 10868 64154 -176554
12230 61197 165117 77341 169976 112785 -42704 165215 244638 248475 205102 503931 -54000
12218 267124 222985 106223 116572 416211 392490 380169 292439 86898 373656 -68484 -120820
12207 -120820 139706 39841 128502 -39209 232176 350698 114843 159783 321515 242159
12197 242159 -201335 -37910 25562 4551 247886 242921 -63459 346102 -25122 -34281 326671
12185 135196 259150 117274 159157 485673 5853 378136 118116 257927 -220481 160996
12174 340841 180688 297916 175987 135526 -40174 47469 486598 507581 172632 -161869
$$ packed form
12254a05447C6316Q4117I162b13554R2295j56393a17933G7474L1149K69767D4001
12242I4237a76487A00802a31298B44380c8408H2490K00760i3511A0868N3286a76554
12230F1197J03920G7341R2635n7191d2704A65215P9423L837m3373K98829e4000
12218B67124m4139A06223J0349K99639k3721j2321q7730H6898K86758f8484n2336
12207a20820A39706C9841Q8661c9209B32176J18522A14843M4940J61732p9356
12197B42159b01335c7910B5562D551K43335m965f3459C46102b5122r159C26671
12185A35196J23954A17274M1883L26516E853L72283A18116J39811b20481A60996
12174C40841j60153J17228j21929m0461d0174D7469M39129K0983A72632a61869
$$ plain form
12163 338175 -66484 -118233 236028 216153 273227 69515 123422 130895 59152 120336 118258 -92232
12150 -199674 114040 75026 24858 -105838 203009 131185 204024 155992 -210375 -36583 -69438
12139 -69438 -19957 -71677 25502 -19331 51823 164837 223332 57028 -106692 -164029 335745
12127 -99589 242326 144010 -46249 -293812 61910 -87329 60921 -145632 -44975 -28302 216412
12115 7816 -54388 -61705 76896 -312704 -14034 148828 -66321 104221 102452 -69701 -80071 106016
12102 11151 46721 -205843 36565 312888 43344 191284 7496 -61095 -156363 78078 -78845
12090 90845 -188707 -35897 167322 -44828 -291817 80674 -24713 212862 382468 -186723
12079 -13571 2593 -230960 25196 156089 123415 388640 729503 433100 137741 81143 124065
$$ packed form
12163C38175f6484n1749B36028j9875N7074F9515N3907P473E9152O1184k078i2232
12150a99674A14040l9014B4858a05838B03009p1824P2839m8032b10375c6583l2855
12139f9438a9957n1720B5502a9331E1823J13014N8495E7028a06692n7337C35745
12127i9589B42326r8316d6249k47563F1910h7329F0921a45632d4975J6673B16412
12115G816e4388p317G6896c12704a4034A48828f6321A04221j769f9701j0370A06016
12102A1151L5570b05843C6565K76323D3344J47940G496f1095r5268G8078g8845
12090I0845a88707c5897A67322d4828k46989H0674b4713B12862J69606a86723
12079a3571B593b30960B5196J30893l2674K65225L40863k96403A37741n6598M2922
$$ plain form
12068 124065 201231 -78589 -27002 134162 237449 44471 57258 -221497 -79838 -188409 -22703
12056 -87033 73813 377638 168455 25507 -386859 -181286 -243876 -273756 95048 -171431 177350
12044 -61239 119651 -78834 -174832 -314542 199008 160910 -65810 82259 8689 -271224 -328757
12033 -328757 -133776 -45358 -324159 145777 82373 117099 142456 -467458 15227 -202119
12022 87082 268644 291197 28005 356374 95998 -9497 -95059 231330 263155 263693 -166707
12010 -290149 191253 236673 31581 84522 81467 -209731 -87438 -90467 -435718 -104969 -27622
11998 68918 52822 148907 -140979 -107959 80455 172021 71446 -244854 -42170 228922 528467
11987 528467 -102439 104710 -174010 95837 -59699 109839 -48513 64556 -99089 -30919 54280
$$ packed form
12068A24065P7166g8589b7002A34162J03287D4471J2787b21497g9838j08571b2703
12056h7033G3813L03825A68455B5507c86859a81286o2590k9880I5048a71431A77350
12044f1239A19651g8834r5998j39710A99008l8098f5810H2259H689b71224n7533
12033c28757a33776d5358k78801A45777o3404L4726K5357d67458A5227b02119
12022H7082J81562K2553B8005L28369I5998i497q5562B31330L1825N38a66707
12010b90149A91253M5420C1581N2941l055b09731h7438l029l45251a04969b7622
11998F8918j6096R6085a40979L3020H0455R1566G1446b44854d2170B28922K99545
11987E28467a02439A04710a74010I5837e9699A09839d8513F4556i9089c0919E4280
$$ plain form
11975 -63310 -43549 75688 167287 204594 -20872 111603 53314 194924 -132984 -5621 -31144
11964 -31144 -89216 96210 322550 63354 -127411 -285116 77780 30046 117113 -140640 208407
11952 -30248 229652 -181516 137603 -91400 -109036 -159676 -128470 -333044 53963 129319 -225228
11940 -263180 -103197 -29572 -19078 -10620 -71297 170224 -38106 -28115 -119596 196616 -357737
11928 234000 42250 -164692 -80767 -80493 -41932 326300 -129597 -174528 -42618 59227 84612
11917 84612 -78805 935 317540 17140 278698 256261 192828 -194983 -51425 163785 148636
11906 148636 121749 23544 -64662 -11267 58121 138702 -196164 -57933 75887 -188899 -178023
11895 -178023 63004 -25344 -57733 -253901 -284828 4027 -35359 -308145 -147078 175596 109186
$$ packed form
11975f3310J9761G5688R1599L7307b0872A11603E3314J41610a32984e621k5523
11964c1144n8072I6210K26340F3354a27411j57705G7780C0046Q7067a40640B08407
11952c0248B29652a81516A37603i1400j7636n0640L1206k04574E3963P5356b25228
11940b63180a03197b9572J0494Q458o0677A70224c8106R991r1481A96616c57737
11928B34000D2250a64692h0767K74L8561C26300a29597m4931d2618E9227K5385
11917H4612g8805I35L16605A7140K61558k2437o3433a94983e1425A63785j5149
11906A48636k6887B3544f4662a1267E8121Q0581a96164e7933G5887a88899J0876
11895a78023F3004b5344l2389j96168l0927D027c5359k72786a47078A75596o6410
$$ plain form
11884 109186 -371845 127513 238916 -45943 -93689 96719 -167407 -634 194106 105215 58578
11873 58578 228308 -148245 -176123 -154832 238990 -46840 274640 -60153 116768 -125224
11862 -214380 -267488 148692 206466 -43630 50466 -212136 112802 -116883 -51435 -77815 161217
11850 -208623 -82819 -241301 18291 26868 75368 -39173 296988 -25476 466484 -26683 -205081
11839 -205081 9763 -75005 144145 165070 -226019 -12535 66406 121307 72686 -215423 70401
11827 21331 32163 -463892 -198195 -115120 -388828 214694 114071 -100119 -295737 -65327
11816 453533 21608 -85946 267753 -120369 -109606 111459 -362307 -344439 -283876 -236974 -215567
11805 -215567 68565 187549 332215 -342847 246235 58975 85168 144443 -59379 99557 15155
$$ packed form
11884A09186c71845A27513J11403d5943m7746I6719a67407f34A94106q8891m6637
11873E8578J69730a48245k7878K1291B38990d6840B74640f0153A16768a25224
11862b14380n3108A48692N7774d3630E0466b12136A12802a16883e1435k6380A61217
11850b08623h2819j58482A8291Q577M8500c9173B96988b5476D66484b6683j78398
11839b05081I763g5005A44145K0925b26019a2535F6406N4901m8621b15423G0401
11827B1331J0832d63892a98195Q3075k73708B14694j00623a00119j95618f5327
11816D53533B1608h5946B67753a20369J0763A11459c62307J7868O0563M6902K1407
11805b15567F8565J18984J44666c42847B46235E8975K6193N9275e9379I9557A5155
$$ plain form
11793 -29762 -203268 72725 84713 -28103 177129 -264089 659 10762 -94301 -54722 -41250
11782 -41250 160977 92746 -52245 192688 -3227 -293905 -25274 -4378 -151693 244855 234228
11771 234228 36558 -325678 204664 -1663 183190 56023 325445 22147 -284862 -101095
11760 2532 -373307 38069 2954 77897 -38446 167471 81102 -284296 147451 96023 -120681
11748 -135168 -256568 404553 -218063 7566 147300 -19359 25744 -315345 -75736 -354552
11738 -354552 267722 -357780 -120884 104459 -327963 -124318 -7194 103337 89314 160826
11728 160826 -36992 -105391 -36329 96410 -5622 175128 -94911 -327310 150278 -182589 -102287
11717 -102287 -301458 -207158 130458 160462 -11972 124307 249425 1551 39936 99955 23053
$$ packed form
11793b9762j73506G2725J1988b8103A77129b64089F59J0103i4301L9579J3472
11782d1250A60977o8231e2245A92688c227k90678b5274d378j47315B44855j0627
11771B34228C6558c25678B04664a663A83190E6023K69422B2147b84862a01095
11760B532c73307C8069B954P4943c8446A67471H1102b84296A47451n1428a20681
11748a35168j21400D04553b18063G566J39734a9359B5744c15345g5736k78816
11738c54552B67722c57780a20884A04459c27963a24318g194A03337j4023P1512
11728A60826c6992o8399c6329I6410e622A75128i4911k32399A50278a82589Q0302
11717a02287j99171R4300A30458L0004a1972A24307J25118A551L8385O0019B3053
$$ plain form
11705 289409 178273 75480 -314691 -196809 -164890 -151398 -102322 326004 -215560 -18261
11694 25283 -48941 152142 215816 -168395 -58185 -103493 27474 222302 -101249 500239 -247585
11682 56750 -453095 48047 22654 114842 364676 286932 -131622 130351 255386 151305
11672 151305 282308 -73333 37529 -223225 3572 75805 191241 -161396 -110984 -37664 -52882
11661 -52882 -10362 -11643 -182032 -195535 36393 254677 53488 95414 248151 193711 149653
11650 149653 69504 -66815 -183533 -20695 29720 -319388 274544 -304877 -169781 -71618
11639 -200443 188528 -40369 -101186 -168807 159823 -216896 180437 34418 250552 220278
11629 220278 72856 73070 -246756 243834 -35876 -129999 -113929 17922 -54978 236556 -109276
$$ packed form
11705B89409j11136G5480c14691J17882L1919J3492M9076C26004b15560a8261
11694B5283d8941A52142O3674a68395e8185m5308B7474J94828a01249E00239b47585
11682E6750d53095D8047B2654R2188K49834p7744a31622A30351J25035j04081
11672A51305J31003g3333C7529b23225C572P2233J15436a61396N0412c7664j5218
11661e2882a0362j281j70389j3503C6393K18284E3488M1926J52737n4440m4058
11650A49653F9504f6815j16718b0695B9720c19388B74544c04877J35096g1618
11639b00443A88528d0369o0817o7621A59823b16896A80437C4418K16134l0274
11629B20278G2856K14b46756B43834c5876r4123J6070A7922e4978B36556a09276
$$ plain form
11617 -70248 179985 79626 -18134 138480 -52552 -113538 327776 96535 65399 -166613 -5940
11605 -277183 -131215 274570 -22941 -76760 79845 -40627 20657 265517 349650 269890 70318
11593 338934 398240 96515 44997 -20178 242350 71505 -129097 91962 -66401 341267 243803
11582 243803 60350 194189 47570 102215 -324773 156434 77367 -247110 203895 -26691
11571 -178438 109873 -17890 -110526 293736 108477 161027 -15226 470890 218566 42 101835
11560 101835 -161808 20706 71576 -4690 -91041 -121516 27736 -30278 -63649 141789 -311292
11548 108206 -35071 28280 -142781 160495 -39805 -346504 142288 264852 8252 55982 195699
11537 195699 258410 -142284 -94952 79785 160062 -166183 185343 -121702 -208248 -104532
$$ packed form
11617g0248A79985G9626a8134A38480e2552o0986C27776I6535l1136a66613e940
11605b77183a31215B74570b2941n3819G9845d0627B0657K44860Q4133p9760G0318
11593C38934N9306I6515D4997b0178B42350G1505a29097I1962f6401C41267r7464
11582B43803F0350J33839D7570N4645c24773A56434G7367b47110B03895b6691
11571a78438A09873a7890r2636B93736A08477N2550a5226D70890B18566D2J01793
11560A01835a61808B0706N0870d690q6351l0475B7736c0278l3371A41789c11292
11548A08206c5071B8280a42781A60495c9805l06699A42288J22564H252M7730J39717
11537A95699O2711a42284M7332G9785Q0277a66183A85343a21702q6546J03716
$$ plain form
11527 -104532 -27439 -215730 -234155 15005 91629 -8843 -16823 -219006 -102024 188451 -143908
11515 -43086 -22837 -73458 -82899 33755 177229 373580 -37200 359227 -20334 49477 49008 89886
11503 89886 -115132 124796 56462 76014 24361 61186 180828 -118952 57245 6222 -206709
11491 84294 -97040 -89505 -85388 249707 -186667 263738 -81267 224268 -141588 -40737 9645
11479 311500 -100368 156026 11793 119411 132772 -118490 300352 -53850 55187 -111874
11468 108480 168328 200232 206465 4147 -106100 175136 181225 269756 -111782 -109391 -151276 15456
11455 125640 68703 111208 -198694 -234254 -378980 -163825 -116955 -219798 336754 169973
11445 169973 -162440 -51741 20452 -210519 113692 57812 442308 211166 -4666 -7695 -98342
$$ packed form
11527a04532b7439j88291j8425A5005P6624h843p980k02183a02024A88451a43908
11515d3086K0249n0621r441C3755J43474J96351c7200C59227b0334D9477m69M0878
11503H9886a15132A24796E6462J9552B4361L6825J19642a18952E7245F222b06709
11491H4294i7040P535M117B49707a86667B63738h1267B24268a41588d0737I645
11479C11500a00368A56026A1793J07618J3361a18490C00352e3850E5187a11874
11468A08480N9848L1904O233D147a06100A75136O089Q8531a11782K391m1885A5456
11455A25640n6937M2505a98694l5560j44726a63825M6870j02843C36754j66781
11445A69973a62440e1741B0452b10519A13692n5880L84496B11166d666l029r0647
$$ plain form
11434 -98342 188207 101213 116053 -185600 63821 -231030 51062 27270 -79546 -130549 -285461
11423 -285461 74669 -382121 337560 46736 -254304 -141780 110183 -128736 83480 134511
11413 134511 488251 138476 287217 -69120 -225621 2978 -68622 -83966 -21892 123791 -3674
11401 183676 127749 -46827 18253 -141218 -45906 -48848 116368 -83611 -67147 114960 -137538
11389 -83712 436100 -24458 19331 -112411 -50154 -362001 -169315 -57396 232698 -312767
11378 73524 151726 -30479 -129900 -112809 310617 -81461 55953 -150056 -131482 -56780 338417
11366 -182 108081 -18651 -188275 -52472 43192 -136857 22963 -166505 161681 22655 146540
11355 146540 157602 -53300 -160847 38147 -174106 -31645 9289 -40352 -415421 43822 -112839
$$ packed form
11434i8342A88207q6994J4840a85600F3821b31030E1062k3792g9546n1003j54912
11423b85461G4669c82121C37560D6736b54304J12524A10183a28736H3480N1031
11413A34511L53740A38476J48741f9120j56501B978f8622j5344b1892A23791c674
11401A83676n5927d6827A8253a41218d5906k942A16368h3611J6464A14960a37538
11389h3712D36100b4458A9331a12411e0154l11847a69315e7396B32698c12767
11378G3524P8202c0479r9421J7091C10617h1461E5953a50056J8574e6780C38417
11366a82A08081a8651j69624e2472D3192a36857B2963a66505A61681B2655J23885
11355A46540J1062e3300j07547C8147a74106c1645I289d0352l75069D3822a12839
$$ plain form
11343 87509 166859 59623 3047 -176863 114922 32296 -91614 -281337 139562 -246294 204031
11331 -266861 60306 -41408 -263762 -156266 -64955 -245325 312959 230257 -338092 378225
11320 -112430 295834 24780 -67631 24447 -34497 29872 -62233 299399 -56732 -176126 -129568
11309 -129568 100100 -397432 92822 -80077 -279975 142519 -69813 -31501 -28862 172927 -255105
11297 -236968 87560 17953 -55400 398757 -97245 -108055 -110033 -11448 -347695 -206212 -102764
11285 -66525 -58827 -47530 -5846 -2256 -91497 -48361 -54210 -162915 17031 279412 -327350 118128
11272 -88243 251361 12432 -107504 -395740 58828 -115808 -55931 259391 187744 -7431 -65397
11261 -65397 -272479 13508 161520 84037 -76368 -40943 -84811 96874 -30550 140759 -142490
$$ packed form
11343H7509P9350E9623C047a76863A14922C2296i1614j89723A39562b46294B04031
11331b66861F0306d1408k22354J07496f4955j80370C12959q2702c38092C78225
11320a12430B95834B4780f7631B4447c4497B9872f2233B99399e6732j19394M6558
11309a29568A00100c97432I2822h0077j99898A42519f9813c1501K639A72927b55105
11297b36968H7560A7953e5400C98757i7245j0810j978a1448l36247J41483a02764
11285f6525P698J1297e846b256q9241M3136n849j08705A7031K62381c27350A18128
11272h8243B51361A2432a07504k88236E8828a15808e5931B59391p1647g431n7966
11261f5397k07082A3508J48012p7483g6368L5425m3868I6874c0550A40759a42490
$$ plain form
11249 54389 -144466 -150742 53712 42073 1682 159549 -11378 122791 -125862 -79988 -53647
11238 -53647 156802 104906 45248 -235742 14498 61708 138121 -230118 15514 225283 60128
11226 26704 91878 -176213 -186741 58614 57384 -181603 -149869 -108595 -157574 85151 -73703
11214 374107 -399593 129086 -285278 8839 104212 -47746 -172385 -61854 -46865 -250926 -84334
11202 -230864 -225868 34136 -98999 -293451 206457 -135914 175191 -335573 170908 68815
11191 -39899 106908 20435 -106989 -22842 -73212 185590 125840 -258903 97325 20549 390744
11180 390744 188764 115181 19816 -80239 -106327 130677 -427410 -185648 157476 -220107
11169 -242047 -154665 261574 -20905 -43863 163239 11666 213764 -147337 167808 -263589
$$ packed form
11249E4389a44466o276E3712j1639A682J57867a1378A22791a25862M5874K6341
11238e3647A56802n1896D5248b35742A4498M7210P6413b30118A5514K09769F0128
11226B6704O5174a76213j0528E8614j230a81603L1734M1274m8979H5151g3703
11214C74107c99593A29086b85278H839R5373d7746j24639f1854J4989k04061h4334
11202b30864M996C4136i8999j94452B06457a35914A75191c35573A70908F8815
11191c9899A06908B0435a06989b2842n0370A85590n9750b58903I7325B0549L70195
11180C90744A88764p3583A9816h0239k6088A30677d27410a85648A57476b20107
11169b42047Q7382B61574b0905k2958A63239A1666K02098a47337A67808b63589
$$ plain form
11158 72386 -67574 -279527 -129569 -122685 206229 147899 112522 9101 -136307 313917 124482
11146 -184074 -260449 71296 -53708 102763 -241155 10267 127069 -320564 -216201 68593
11135 249084 54957 -114635 -57051 -9508 121142 222556 142078 -198867 161697 49669 -30777
11123 -203287 -97070 -135402 48998 216650 -55022 -57464 -116276 53015 1048 319010 27860
11111 162808 180738 -105530 -72938 114389 131105 -20471 -48911 100225 123958 224101 415097
11100 415097 59301 267333 -99501 117013 119189 142315 -5400 -6267 105572 162314 -109242
11088 406238 -204800 -46577 -39207 205681 -107010 -285668 -22347 322246 33856 202226
11078 202226 16921 -239476 76188 -73724 19504 93854 -16895 53022 -250081 492941 319666
$$ packed form
11158G2386f7574k11953a29569O884B06229n8330l5377I101a36307C13917A24482
11146a84074p6375G1296e3708A02763b41155A0267J16802c20564J04363F8593
11135B49084E4957a14635e7051i508A21142J01414q0478a98867A61697D9669c0777
11123b03287i7070l8332D8998J67652e5022k442n8812E3015A048L17962B7860
11111A62808J7930a05530L2592A14389J6716b0471k8440A00225K3733J00143J90996
11100D15097E9301K08032i9501A17013K176K3126e400q67A05572N6742a09242
11088D06238b04800d6577P370B05681a07010j78658b2347C22246C3856J68370
11078B02226A6921b39476G6188g3724A9504P4350a6895E3022b50081D92941j73275
$$ plain form
11067 319666 368539 371448 234025 225424 -27322 329066 544906 250508 201360 286551 -66193
11055 472837 614021 419029 237280 349735 400015 61932 236364 15188 141598 631160
11045 631160 780864 543687 87669 420601 564783 416737 552572 375018 410249 -47242
11034 832912 830141 573390 599026 500514 567591 210319 481167 581710 412857 459163 670078
11023 670078 299015 461363 262665 711489 355383 673292 650539 697048 520846 194587
11012 412084 311909 233670 555383 500404 279594 303568 664184 278386 316449 379390
11002 379390 139333 486932 364833 181949 490497 486379 531416 372411 444780 274495
10992 274495 348869 352000 475823 419668 351133 382667 414754 718696 535289 587905 506620
$$ packed form
11067C19666M8873K909j37423q601b7322C29066K15840B50508m9148Q5191f6193
11055D72837J41184j94992j81749J12455N0280F1932J74432A5188J26410M89562
11045F31160J49704k37177H7669L32932J44182j48046J35835j77554L5231d7242
11034H32912k771k56751K5636r8512O7077B10319K70848J00543j68853M6306K10915
11023F70078B99015J62348j98698M48824C55383L17909k2753M6509j76202A94587
11012D12084j00175p8239L21713n4979k20810K3974L60616B78386L8063O2941
11002C79390A39333L47599j22099A81949L08548m118M5037j59005P2369j70285
10992B74495P4374L131J23823n6155o8535L1534L2087L03942j83407N2616q1285
$$ plain form
10981 506620 927509 702305 456628 739347 901021 1037207 1279013 1131157 1192925 1448535
10971 1448535 1660948 1472831 1731592 1664953 1776137 1647423 1637939 1328141 1173325 904459
10961 904459 999484 1205038 975325 1366502 1410677 1257069 1342393 1449076 1030026 1203596
10951 1203596 1457478 1168742 883166 824943 530338 612243 399586 626530 233175 301294
10941 301294 474220 211091 132491 263447 -32764 -19246 131622 -318998 -13698 -16739 -46644
10930 -46644 -112175 -31723 -107728 95653 103167 -95044 -184427 -139248 -271457 2623 134846 -77629
10917 -160864 -117205 -36207 67527 203747 -173236 71091 26868 81474 -157521 129707 -13900
10905 -44491 3850 137162 82224 133715 202968 -73718 96907 65795 135941 171513 -350377
$$ packed form
10981E06620M20889k25204k45677K82719J61674J36186K41806j47856O1768K55610
10971A448535K12413j88117K58761o6639J11184j28714r484l09798j54816k68866
10961I04459R5025K05554k29713L91177M4175j53608Q5324J06683m19050J73570
10951A203596K53882k88736k85576n8223k94605Q1905k12657K26944B33175O8119
10941C01294J72926B11091p8600J30956c2764J3518A31622c18998a3698l041k9905
10930d6644o5531c1723p6005I5653P514i5044q9383M5179j32209B623J32223g7629
10917a60864M3659c6207F7527J36220a73236G1091B6868N4606a57521A29707a3900
10905d4491C850J33312n4938N1491O9253g3718I6907l1112P0146L5572c50377
$$ plain form
10893 -22572 280215 149772 53991 -181377 41928 -237763 -18935 95259 -125312 -269516
10883 -269516 80858 146016 -360529 -70231 24175 -136854 -225170 85457 175866 -81137 -10119
10871 101443 -147451 -257972 5650 372875 211223 -114587 449240 91559 149374 -22977
10860 -75018 -146701 118477 -54372 -78000 -27488 -30403 -126197 -191967 185118 124580 -527850
10848 -15320 -195913 -115392 -272187 -60929 -31316 -67387 37606 -845 -29916 13799 272711
10837 272711 -133688 108476 -211859 -300227 180647 -94158 -9511 -74117 -208829 -84095 38657
10825 -39329 -202968 62113 -92820 -110406 -239536 -52892 23890 -84421 -149996 -227560 -70829
10813 -47009 -74828 -70642 -230655 -161713 -124251 254929 128221 -220000 -377676 76559 -57806
$$ packed form
10893b2572B80215j30443E3991a81377D1928b37763a8935I5259a25312j44204
10883b69516H0858O5158c60529g0231B4175a36854q8316H5457R0409h1137a0119
10871A01443a47451j10521E650L67225j61652a14587D49240I1559N7815b2977
10860g5018p1683A18477e4372k3628b7488k915r5794o5770A85118o0538e27850
10848a5320j80593Q0521j56795f0929K9613l6071C7606h45k9071A3799K58912
10837B72711a33688A08476b11859q8368A80647i4158i511o4606j34712h4095C8657
10825c9329j63639F2113i2820j7586j29130e2892B3890h4421o5575p7564g0829
10813d7009k7819M186j60013O8942L7462B54929j26708b20000j57676G6559e7806
$$ plain form
10801 -19148 -371276 61591 -76259 -366946 -169477 -131203 -36174 140989 92844 14005 -10660
10789 -149245 -333123 -20661 46483 -54099 106572 213169 235472 43020 192679 18507 93170
10778 93170 -696 -229415 -120271 -321903 -98603 143600 -241365 -30826 -146299 -556 253576
10766 -204545 99855 96708 81007 55604 -145473 32690 -262143 204445 185410 269502 49134
10754 53876 -330244 32491 -27104 -121333 -224318 -102672 95109 98405 -195694 -64623 56779
10742 23714 -290935 -25371 -115655 -122623 43299 35283 171248 -221054 51253 -133435 -404399
10731 -404399 -272378 67302 109263 -53861 -141992 -151559 -68299 -8702 -55773 -182598 98756
10719 111398 164335 151484 110497 -138739 -162941 -60346 218680 -443471 164973 82874 54721
$$ packed form
10801a9148l52128F1591g6259k90687a69477L8274c6174A40989m8145A4005a0660
10789a49245j83878b0661D6483e4099A06572J06597K2303D3020J49659A8507P4663
10778I3170f96k28719J09144k01632i8603A43600b41365c0826j15473e56B53576
10766b04545I9855l147j5701k5403a45473C2690b62143B04445j9035Q4092D9134
10754E3876c30244C2491b7104r4229j02985a02672I5109L296a95694f4623E6779
10742B3714b90935b5371r0284o968D3299q016J35965b21054E1253a33435k70964
10731d04399J32021F7302M1961e3861q8131r567f8299h702m7071j26825I8756
10719A11398N2937j2851m0987a38739k4202f0346B18680d43471A64973q2099k8153
$$ plain form
10708 54721 49624 -291514 -115549 -359881 -57499 160763 -121255 -226272 -142520 82836 -54635
10696 22945 -287629 -188569 22157 -210717 159840 -14413 61047 139843 40501 84610 57597
10685 57597 -325612 133614 -91143 -63435 111691 53317 -119792 -9431 -367480 341038 54752
10673 69462 -186306 -160685 117071 -41285 -263057 -155734 -77412 181409 -67729 9298 82711
10662 82711 -5303 293480 45910 -21447 -77471 -150242 -273647 9904 43538 -30811 -21903 -15214
10650 -15214 -240794 -38352 55744 -156189 -234045 -164633 34876 -388253 -229963 -178934 -119942
10639 -119942 -163550 279733 200878 -115622 -332627 28033 217740 61 167911 -274445 -208707
10628 -208707 -173283 -168454 190064 -117015 -153396 -213432 -291805 169224 -388324 -180287 -90821
$$ packed form
10708E4721n097b91514a15549k44332e7499A60763a21255j05017Q3752H2836e4635
10696B2945b87629R9060B2157b10717A59840a4413F1047P8796D0501M4109k7013
10685E7597c25612A33614i1143K7708A11691E3317a19792i431l58049C41038E4752
10673F9462a86306K5621A17071d1285k21772J07323g7412A81409f7729I298P3413
10662H2711e303B93480D5910b1447n6024p2771j23405I904L3634c0811Q908O689
10650a5214k25580c8352E5744a56189p7856O9412C4876c88253J58290N1029N8992
10639a19942m3608B79733p8855a15622k17005B8033J89707F1J67850b74445O5738
10628b08707L5424M829A90064a17015l6381o0036p8373A69224c88324a80287Q9466
$$ plain form
10617 -90821 -4150 -85156 -13414 85575 -150381 -23113 -86867 -94331 56079 101747 175255 -299077
10604 110624 -145383 137916 -61959 294986 -91245 -166512 125441 17942 -100233 258969
10593 -216704 -445109 -257326 -204731 -212229 -115973 55418 -300981 -131161 -218432 -10667 -271726
10582 -271726 230023 -113457 91627 -83296 -130771 -52846 -117854 -111043 -103103 32990 -59096
10570 -217133 7283 85022 -190056 -163567 -91881 -272190 40732 -458563 -159781 -151349 -170999
10559 -170999 88742 166878 -21194 84131 -19646 -44648 88275 -231777 -204247 54978 189333
10548 189333 52320 107895 147233 309611 -250559 48414 -253359 36054 427521 292373
10538 292373 6514 47673 -75643 296168 140171 200872 133295 57877 -224781 -202707 -139695
$$ packed form
10617i0821d150q1006a3414H5575a50381b3113o3754p464E6079M5668P3508b99077
10604A10624a45383A37916f1959B94986i1245p5267A25441A7942a00233B58969
10593b16704k28405J87783N2595p498R6256E5418c00981a31161q7271a0667k61059
10582b71726B30023a13457I1627h3296m7475e2846o5008O811P940C2990e9096
10570b17133G283P7739a90056K6489P1686j80309D0732d58563a59781Q432j9650
10559a70999H8742P8136b1194H4131a9646k5002H8275b31777K7530E4978J34355
10548A89333E2320N5575L9338J62378b50559D8414b53359C6054L91467j35148
10538B92373F514M1159g5643B96168A40171O0701o7577E7877b24781K2074O3012
$$ plain form
10527 -139695 24900 -227333 118500 -38456 195057 -119872 -109312 -332492 -205748 -144455
10517 -144455 -379297 -126432 -149015 76875 -232819 127785 -258512 -50454 68088 -5136 -45193
10506 -45193 132 2087 -267489 -222041 -6778 -63264 -296752 -317879 -335981 -176520 107132 86855
10494 86855 145850 185411 -5714 209549 -222722 -82030 -107118 31164 -3907 31422 -44426 285263
10481 72379 214622 155987 337023 208495 216368 260554 -63839 157000 218365 18272 63156
10470 63156 13368 -85972 -15074 72871 -245760 -236940 -145275 197434 -49158 70941 -169549
10458 43858 42960 -214829 10284 19491 190526 -40382 147310 -338448 233452 12548 -15844
10446 91033 -160375 -94573 -142112 60739 29362 -32377 211672 107881 -3001 43239 200710
$$ packed form
10527a39695B4900b27333A18500c8456A95057a19872J0560k23180J26744O1293
10517a44455k34842a26432k2583G6875b32819A27785b58512e0454F8088e136m0057
10506d5193A32J955b67489M5448f778n6486k33488k1127j8102J59461A07132k0277
10494H6855N8995L9561e714B09549b22722h2030k5088C1164c907C1422d4426B85263
10481G2379J42243n8635J81036j28528P873M4186f3839A57000O1365A8272M4884
10470F3156A3368h5972a5074G2871b45760Q820R1665A97434d9158G0941a69549
10458D3858q98b14829A0284R207J71035d0382A47310c38448B33452A2548a5844
10446I1033a60375O5802m7539F0739B9362c2377B11672j03791c001D3239J57471
$$ plain form
10435 200710 98745 -272560 218973 228412 -222115 -160219 -41662 -27719 -80535 129492 -70842
10423 -292430 72867 -131651 -130955 31394 -124045 -125830 -211162 158337 -34478 142148 -146477
10411 -9186 -69099 -283756 -362240 72886 49420 -148539 19965 -52509 16415 116183 16469
10399 -243317 96486 285408 210999 -45620 -226692 -85470 7032 -15662 -93281 -77824 165672
10387 -171929 -29907 -31672 -19222 77693 -60725 -10211 -22978 -96146 -189377 183843 70925
10375 8845 279427 73533 -54741 -55991 274872 372914 33239 110680 -178808 549481 189110
10363 85790 -122498 316640 419091 122956 173309 341826 434281 -265130 -367204 -84857
10352 63370 69328 285449 28988 329034 261192 288417 229764 560224 -159938 282409 51673
$$ packed form
10435B00710I8745b72560B18973R439b22115O1896d1662J3943n2816A29492g0842
10423b92430G2867a31651O96C1394a24045j785q5332A58337c4478A42148a46477
10411i186n9913k14657p8484G2886k3466a48539A9965e2509A6415R9768A6469
10399b43317I6486J88922p4409d5620j81072h5470G032a5662p7619J5457A65672
10387a71929b9907j765J2450G7693f0725a0211j2767p3168r3231A83843G0925
10375H845K70582G3533e4741j250B74872R8042C3239P7441a78808E49481A89110
10363H5790a22498C16640J02451A22956N0353J68517R2455b65130j02074h4857
10352F3370N958K16121B8988L00046o7842K7225n8653L30460a59938B82409E1673
$$ plain form
10340 129286 322031 64550 200507 58746 205259 82406 143015 -2055 65741 67489 -120413
10328 401680 74050 -44495 235824 -40081 222837 -59792 234847 152966 -153931 123415
10317 13072 82386 102824 29695 290667 99354 -173420 2491 189277 16207 57930 -91426
10305 -65845 216456 -9551 -12051 -65057 16004 -342006 86316 -118746 -4499 -3742 -52160 93915
10292 -220632 -148435 -68119 46797 146908 -94920 -51699 -191248 -304330 68014 -315071 29212
10280 177816 -200095 -10833 -283848 27878 -224431 35458 -6934 -118830 -101282 -173206 17890
10268 71828 90146 -42866 62635 12529 213899 84374 48786 57797 174110 -52746 108306
10256 178977 344062 200712 323024 105267 65747 -140270 -180643 -231908 43257 163147
$$ packed form
10340A29286J92745F4550J35957E8746J46513H2406O0609b055F5741J748a20413
10328D01680G4050d4495B35824d0081B22837e9792B34847q1881a53931A23415
10317A3072O9314K0438B9695K60972I9354a73420B491J86786A6207M1723i1426
10305f5845B16456i551k500n3006A6004c42006H6316a18746d499P57m8418I3915
10292b20632P2197f8119D6797J00111i4920M3221j39549j13082F8014c15071B9212
10280A77816b00095a0833k73015B7878b24431C5458f934j11896J7548p1924A7890
10268G1828J8318d2866F2635A2529K01370H4374l5588R011J16313e2746A08306
10256A78977J65085j43350J22312A05267l9520a40270m0373n1265D3257J19890
$$ plain form
10246 163147 -110429 -96605 35310 -73424 380200 -196901 85658 -10767 -147685 66638 -212960
10234 -257530 -180358 174707 72474 -188815 -230855 -29513 -159951 172320 14664 -129358
10223 -124393 59634 -62519 -193343 -88559 -110697 -337630 132670 91660 -90094 -144935 119243
10211 -128371 -235978 -427193 -3515 59914 -36060 -79796 80360 -40734 135007 -134029 -188521
10200 -188521 82344 152324 -190771 -437572 190430 48512 -19532 -345882 208829 131002
10190 131002 125625 -112171 76591 -97027 -190004 -128136 241007 -163246 -136765 163729 -456032
10178 -232639 -93471 -206933 -100364 148840 -247545 -112311 -7108 -214054 112451 -245092
10167 184694 150495 -365850 221006 -307770 12359 10861 -163506 -276448 -67198 106950
$$ packed form
10246A63147a10429J3824C5310g3424C80200a96901H5658a0767j36918F6638b12960
10234b57530P7172A74707G2474a88815m2040b9513j30438A72320A4664a29358
10223a24393E9634f2519j30824h8559k2138k26933A32670m1010i0094n4841A19243
10211a28371j07607j91215c515E9914c6060m3736H0360d0734A35007a34029n4492
10200a88521H2344O9980a90771k46801A90430D8512a9532l26350B08829p7827
10190A31002n377a12171G6591i7027r2977O1868B41007a63246K6481A63729d56032
10178b32639i3471j13462a00364A48840b47545a12311g108k06946A12451b45092
10167A84694l4199c65850B21006c07770A2359j498a63506j12942f7198A06950
$$ plain form
10156 -182215 58897 -173196 -77194 -15405 -336225 -398328 -49439 136510 306260 51562 -35785
10144 -265045 -412117 51278 -305982 -178180 -463033 -191115 -331482 -188048 -131912 -131379
10134 -131379 -56649 -258486 119547 195860 86255 -75592 128758 74753 -111666 219226
10123 92820 19432 8574 -142054 212812 -243612 97468 -143471 43200 88553 48679 60372
10112 60372 74178 -135533 -42512 -79556 -91233 -201787 -213801 -46133 168392 -259194 -179982
10101 -179982 62324 69600 19744 -10251 17236 95128 -177331 -19712 -265484 -164556 194055
10089 -618702 -62653 14638 23919 -43473 -85791 -124542 73879 131900 45978 192090 -29750
10077 -72801 14738 92006 209877 -397077 -77156 269763 -113942 169824 43802 130291 -69240
$$ packed form
10156a82215E8897a73196g7194a5405l20820o2103d9439A36510J69750E1562c5785
10144b65045j47072E1278c05982J27802k84853a91115j40367J43434N6136N33
10134a31379e6649k01837A19547P6313H6255g5592A28758n4005a11666B19226
10123I2820A9432H574a42054B12812b43612I7468a43471D3200M5353l9874J1693
10112F0372J3806a35533d2512l7044j1677j10554j2014d6133A68392b59194P9212
10101a79982F2324P276A9744a0251A7236P7892a77331a9712k45772J00928A94055
10089f18702f2653A4638R281d3473m2318l8751G3879N8021D5978J46112b9750
10077g2801A4738P7268J17871c97077g7156B69763a13942A69824D3802Q6489f9240
$$ plain form
10065 108778 -74891 39050 18610 24109 -45440 -13085 -10920 17334 -103279 84421 76662 -123926
10052 -77574 25925 -63677 -335039 -118594 456179 -172026 -285517 47057 3307 -378694 -62564
10040 -129710 -284639 -14569 -128646 -149500 27839 71593 -1051 -104685 -5145 182192 -23707
10028 53660 -150183 -230431 -165683 28504 -70521 24720 -232217 88652 -111063 -60417 -44078
10017 -44078 -194176 -267685 302808 -74679 -158306 -271573 -109032 47681 -4020 -322799 -200049
10006 -200049 -266803 33042 -21661 330944 -238398 20522 -206790 -359938 -369371 -154108 -20364
9994 -58568 -108395 -191251 -83427 92488 -32670 -27977 -309429 -106064 -72023 -418745 171618
9982 -359190 -49079 113706 -148121 243651 -160162 -76569 -39534 171706 31114 -44948 -128172
$$ packed form
10065A08778g4891C9050A8610N499d5440a3085K165A7334a03279H4421p759a23926
10052g7574B5925f3677k71362a18594D56179a72026j13491D7057C307c78694f2564
10040a29710j54929a4569j14077k0854B7839M3754a051j03634e145A82192b3707
10028E3660a50183q0248O4748B8504g0521B4720b32217H8652a11063N0646J6339
10017d4078j50098p3509C02808g4679q3627j13267a09032D7681d020l18779J22750
10006b00049o6754C3042b1661C30944b38398B0522b06790j53148r433a54108b0364
9994e8568m9827q2856h3427I2488c2670M693k81452a06064L4041l46722A71618
9982c59190d9079A13706a48121B43651a60162g6569L7035A71706C1114d4948q3224
$$ plain form
9971 -128172 -107786 144179 119925 350224 284511 -8607 -268955 144419 -31300 258321 -234832
9959 -157016 -295475 -111813 34780 -55185 69332 -35841 38082 113473 -173552 -239712 -273532
9948 -273532 187185 97171 -221574 166042 8698 -60331 -524921 -34657 -81344 -123240 -500972
9937 -500972 86135 44657 -437365 -188145 -425885 23298 192742 -264198 -39233 74298 -281333
9925 -126517 -55421 293922 -401755 -74919 231368 159447 -234585 -185244 -251551 -156469 48975
9913 -97064 54624 -183777 -60367 94727 28776 16293 -192759 282809 77843 -34903 -171719
9902 -171719 -199654 107014 -294479 -211824 155418 -65770 72798 -9777 -65850 -145663 -248510
9891 -248510 38546 43746 -161881 -47301 -7364 -95195 21765 -272042 -324749 -474185 -203612
$$ packed form
9971a28172K0386A44179k4254K30299o5713h607k60348A44419c1300B58321b34832
9959a57016j38459a11813C4780e5185F9332c5841C8082P5391a73552o6160l3820
9948b73532A87185r0014b21574A66042H698f0331m64590c4657m6687m1896l77732
9937e00972H6135m1478d37365a88145k37740B3298J69444b64198c9233G4298b81333
9925a26517e5421B93922d01755g4919B31368p1921b34585M9341o6307R5082D8975
9913i7064E4624a83777f0367I4727B8776j2483a92759B82809G7843c4903j36816
9902a71719k7935A07014b94479Q2655A55418f5770G2798i777n6073p9813j02847
9891b48510C8546N200a61881d7301g364q7831B1765b72042n2707j49436b03612
$$ plain form
9879 267133 -84197 53731 211430 -119843 326 -37154 6976 -209963 88548 17555 -277617
9867 62894 -333656 216551 39708 -240316 139656 -290690 85096 -2948 -160289 118167 3290
9855 -127093 57387 -138429 74078 -190189 -53822 -262783 -87769 -357087 -53615 -191582 100134
9843 -201773 -24759 -4667 -160947 -38389 -92575 94512 -28584 114566 -39882 -32339 -167605
9832 -167605 112735 -219256 79169 -217113 -35801 -199963 -33359 -142765 28846 -267805
9821 -118483 -272832 -209784 13717 -13782 -9638 89933 400411 -2167 27083 -112371 -795828
9810 -795828 -96377 -143130 -385955 23458 -134251 -116485 -183929 -187891 168209 -211743 -52016
9798 -282901 -239858 10423 -122276 -24776 37458 252516 -82788 -11206 -74950 -141388 -48312
$$ packed form
9879B67133h4197E3731J57699a19843C26c7154F976b09963H8548A7555b77617
9867F2894c33656B16551C9708b40316A39656b90690H5096b948j57341A18167C290
9855a27093E7387a38429G4078a90189e3822k08961h7769k69318e3615j37967A00134
9843b01773b4759d667j56280c8389n4186I4512b8584A14566c9882P543j35266
9832a67605A12735b19256G9169b17113c5801j64162c3359j09406B8846b67805
9821a18483j54349O3048A3717a3782M144H9933L10478b167B7083a12371o83457
9810g95828i6377m6753k42825B3458a34251J7766o7444l962A68209b11743e2016
9798b82901M3043A0423a22276b4776C7458K15058h2788a1206o3744o6438d8312
$$ plain form
9786 146620 -260695 -347759 205360 -136972 -199852 -60187 -89544 -169729 -59252 77537 -66805
9774 20335 -331556 -174509 -203599 27657 -94022 -292687 -281405 102762 -78499 -113165 121028
9762 47534 -38569 -35850 -127405 -71717 -257190 -93967 41325 124392 101050 70322 56984 -122680
9749 229648 -134690 33387 -103548 126612 -100933 24204 -264162 11062 29562 -303515
9738 -119421 160035 -216508 -60647 42489 -3740 -264759 53590 -163407 -231494 -125894 -348143
9727 -348143 -78607 -2551 -92010 -335703 -44013 21936 -448227 285655 63606 14773 -68836
9715 -241401 -199973 171667 -245180 -101805 102461 186358 -109662 50840 473740 45637
9704 -171367 275560 -270145 43121 -195788 -67960 48238 -124092 134771 344558 -83615
$$ packed form
9786A46620b60695q7064B05360a36972o2880f0187k9357q0185e9252G7537f6805
9774B0335c31556J57047k9090B7657i4022j98665J1282A02762g8499l4666A21028
9762D7534c8569K719r1555N5688j85473i3967D1325Q3067k3342l0728j3338a22680
9749B29648a34690C3387a03548A26612a00933B4204b64162A1062J8500c03515
9738a19421A60035b16508f0647D2489c740k61019E3590a63407o8087J05600k22249
9727c48143g8607b551q9459k43693d4013B1936d48227B85655F3606A4773f8836
9715b41401M1428A71667b45180a01805A02461Q3897a09662E0840M22900D5637
9704a71367B75560b70145D3121a95788f7960D8238a24092A34771K09787h3615
$$ plain form
9693 -188787 -20157 -161402 239567 105426 -242124 -201962 -193821 -142679 27111 -48491 -186757
9682 -186757 -100806 -77278 -113363 -441715 -447493 -225218 179769 38487 -363976 82477 101754
9671 101754 -170505 -149563 -295351 -89386 -44775 -158513 -74204 18558 -76421 201670 -153253
9659 148664 243755 71500 147967 18771 -68077 -104884 -114887 -145053 -100633 -94896 39465 -361688
9646 17702 12159 -31439 -202003 362288 -78203 -65309 86359 -215179 -371146 -179405 20150
9634 14137 -245469 99326 -267621 281967 88682 208796 141481 122873 -214578 -218440 104606
9622 -120185 49808 -116462 -158927 268097 -121892 107401 -83729 224364 82348 279064
9612 279064 -308403 136552 -253968 -262612 -3596 -193150 125597 -10488 -178438 148270 -18738
$$ packed form
9693a88787b0157j41245B39567A05426b42124M0162Q141N1142B7111d8491j38266
9682a86757Q5951K3528l6085l28352n778K22275A79769C8487c63976H2477J9277
9671A01754a70505K0942j45788h9386M4611j13738g4204A8558g6421B01670a53253
9659A48664R5091G1500P6467A8771f8077l6807j0003l0166M4420N737C9465c61688
9646A7702n543c1439j70564C62288g8203J2894H6359b15179j55967a79405B0150
9634A4137b45469I9326b67621B81967H8682J20114o7315j8608b14578l862A04606
9622a20185D9808a16462m2465B68097a21892A07401h3729B24364H2348J96716
9612B79064c08403A36552b53968q644c596j89554A25597a0488j67950A48270a8738
$$ plain form
9600 -218274 -162991 219000 -58403 100311 -445588 -33040 -364487 -161164 -353616 -69353
9589 -219155 223040 -83123 -238925 -237644 -101237 95612 -281844 106211 -6648 -115966 -81160
9578 -81160 -268742 -527369 1493 52732 -90519 -144807 94196 -297135 -12810 46351 297029
9567 297029 -336086 171776 -365101 -302473 324240 -69098 -6830 7652 -32472 -123396 -316899
9556 -316899 124326 190829 25707 -181369 102821 120930 -89877 -148311 -192791 -92655 45596
9544 -54259 -212907 -137350 -119770 68919 -40147 100247 -15225 -35542 224510 -134042 -256172
9533 -256172 -182929 -192081 -51340 -71260 -62971 -93233 105499 -27429 -171316 -145082 -128357 -328
9520 -51144 27818 -183665 -126493 -410293 -183540 -66846 -153822 155820 204071 186263 45608
$$ packed form
9600b18274N5283B19000e8403A00311d45588c3040l31447a61164j92452f9353
9589b19155B23040h3123j55802J281a01237I5612b81844A06211f648j09318L4806
9578h1160j87582k58627A493N1239i0519n4288I4196b97135a2810D6351K50678
9567B97029c36086A71776c65101O2628C24240f9098f830G652c2472r0924j93503
9556c16899A24326O6503B5707a81369A02821J8109h9877n8434m4480i2655D5596
9544e4259j58648P5557J7580F8919d0147A00247a5225k0317B24510a34042j22130
9533b56172P3243r152e1340j9920Q289l0262A05499b7429j43887K6234J6725c28
9520e1144B7818a83665N7172k83800a83540f6846q6976A55820M8251j7808D5608
$$ plain form
9508 39707 -8764 22908 -16406 -212451 -201246 -217953 -283803 -110107 243033 45263 72017
9497 72017 94195 -323532 -135541 -94947 238727 148610 26468 9622 15821 -50272 -486936
9486 -486936 37179 -51035 67720 83899 -117347 141314 -56106 -69737 383107 -19559 -180751
9475 -180751 232828 16272 7988 11347 -184345 106714 104906 -126708 376526 139191 -179654
9463 -5860 -117954 -257274 83185 106223 -19668 -243246 -125365 210492 56487 -216758 -16727
9451 150987 -83328 -54683 62444 32342 -178094 68969 103874 -159958 -31389 39099 184595
9440 184595 916 -181661 -142588 -285313 -118640 102603 -235971 241037 -174141 119617
9429 -54896 193960 -328329 -381598 -125814 26544 -225695 -108242 270902 35541 35025 -133624
$$ packed form
9508C9707h764B2908a6406j96045J1205j6707o5850a10107B43033D5263K6754
9497G2017K2178c23532a35541M0594B38727r0117B6468I622O199e0272m36664
9486d86936C7179e1035F7720J6179a17347A41314e6106j3631C83107a9559j61192
9475a80751B32828A6272G988L359a84345A06714j808a26708C76526A39191a79654
9463e860j12094j39320H3185K3038a9668k23578J17881B10492E6487b16758a6727
9451A50987h3328K8645F2444l0102a78094F8969L4905a59958c1389C9099J45496
9440A84595I16a81661L9073j42725a18640A02603b35971B41037a74141A19617
9429e4896A93960c28329n3269a25814B6544b25695a08242B70902C5541n16a33624
$$ plain form
9417 -235844 53020 63462 -206217 37571 -17429 -239755 -245163 -98113 72033 223591 -144620
9405 173823 -422397 22112 -332953 -50615 -164472 -45665 -21068 -210297 -10670 128754 404459
9394 404459 -64104 -50547 -28780 -261796 104131 7120 -132514 -291881 -77026 -547851 -251939
9382 93479 -148486 80713 -425200 119272 81787 -44261 -247274 234881 -45046 -149540 -337133
9371 -337133 -248321 -165921 -136241 23020 -173093 -149892 -151012 152984 -14371 -226302 -508566
9360 -508566 -247954 17372 271980 -1298 -456442 195632 -128458 -243717 52766 -101418
9349 -237012 -11119 -333762 -47590 401201 -111364 59141 -175540 -416751 194325 41258
9338 133327 -2747 -225267 -93619 -70917 -29933 6474 88067 -68921 -97296 -205432 -272324 36515
$$ packed form
9417b35844E3020J0442b06217C7571a7429k22326n408i8113G2033J51558a44620
9405A73823d22397B2112c32953e0615j13857d5665b1068j89229a0670A28754K75705
9394D04459f4104J3557K1767k33016A04131G120a32514j59367g7026m70825b51939
9382I3479a48486H0713d25200A19272l7485d4261k03013B34881d5046j04494j87593
9371c37133Q8812Q2400K9680B3020a73093K3201j120A52984a4371k11931k82264
9360e08566b47954A7372K54608a298m55144A95632a28458j15259E2766a01418
9349b37012a1119l22643d7590D01201a11364E9141a75540k41211A94325D1258
9338A33327b747k22520i3619K2702b9933F474Q1593f8921k8375j08136o6892C6515
$$ plain form
9325 -109993 -72876 220708 202687 -391078 -259108 299425 -71359 -165912 -172853 153100 8178
9313 93414 -78738 -141969 319254 213079 -37328 -106056 192351 46517 -286709 -152676 109807
9301 -12256 -50952 -7754 -13180 43021 -50672 -224412 -199460 8139 34757 41761 -305920 14384
9288 -241594 -140566 -190661 43050 203380 -195129 142724 -2935 76865 64114 -44062 -253281
9277 -253281 -270049 29702 -376310 108388 -18089 -145119 -23774 -30291 -44067 56405 159062
9266 159062 89183 -160967 198260 -271020 -177701 153141 162371 184397 -68884 -72129 -25681
9254 192544 68748 -81174 -182937 181671 160275 78246 45845 86593 -268442 -149955 143296
9242 -59140 8638 -158963 131604 40843 -18411 170402 180336 -361250 145790 -28986 -26727
$$ packed form
9325a09993L7117B20708j8021c91078J31970B99425g1359r4553o941A53100H178
9313I3414g8738o3231C19254j06175c7328o8728A92351D6517b86709J34033A09807
9301a2256l8696g754n426D3021e0672j73740K4952H139K6618P004c05920A4384
9288b41594J01028n0095D3050J60330a95129A42724b935G6865j2751d4062k09219
9277b53281j6768B9702c76310A08388a8089j27030b3774o517j3776E6405J02657
9266A59062o9879a60967A98260b71020R3319A53141R230K2026f8884l245b5681
9254A92544F8748h1174j01763A81671k1396G8246l2401M0748b68442J18487A43296
9242e9140H638a58963A31604D0843a8411A70402R934c61250A45790b8986K259
$$ plain form
9231 -26727 -212046 -71726 -14426 -474900 42491 -24479 57631 -88075 -49176 28261 -1108 -344565
9219 -344565 -210400 82147 -65832 -296979 12208 -166031 -15069 94309 -266828 242702 -541639
9207 149256 120452 -218427 -137177 -413201 -196414 -280579 -61824 -179015 61667 49550 -30713
9195 -175342 -198483 -157948 -28595 -67934 -89167 -230353 -131674 -23558 -3271 -145891 19154
9183 -221042 -90904 -250751 -207153 -288402 -34751 198010 -67890 -179238 -89303 -269936 -60705
9171 -371457 -325484 -350387 -123248 -104306 -52429 -41752 -71723 -109782 -140436 -265945 -87256
9159 47779 -243728 -266884 261875 -79572 -182792 -105205 83628 -23507 126688 203150 -16089
9147 336481 102836 -32419 -7764 -291495 57706 -37287 -143045 -86193 -158378 252372 44314
$$ packed form
9231b6727j85319g1726a4426m60474D2491b4479E7631h8075L8899B8261a108l43457
9219c44565J34165H2147f5832k31147A2208a66031a5069I4309b66828B42702e41639
9207A49256k8804b18427Q1250k76024a96414q4165f1824j17191F1667j2117c0713
9195a75342k3141M0535b8595l9339k1233j41186R8679b3558c271j42620A9154
9183b21042i0904j59847M3598q1249c4751A98010f7890j11348h9303j80633f0705
9171c71457M5973k4903a23248J8942N1877J0677k9971l8059l0654j25509h7256
9159D7779b43728k3156B61875g9572j03220P7587H3628b3507A26688P6462a6089
9147C36481A02836c2419g764k83731E7706c7287j05758N6852p2185B52372D4314
$$ plain form
9135 60618 -327848 279074 321190 -349747 -181369 -108282 -128150 42882 49469 32363 -144563
9123 -51188 68828 -295942 110158 -149079 -143362 -44327 -193373 -41847 -321399 58395 136209
9112 136209 -155057 -54755 291608 -87054 -94765 -183900 -16850 -81074 -8827 -77811 147719
9100 -81550 -87353 -63807 228391 -228999 -336894 -179898 -73760 172102 -65588 83543 -45542
9088 -39136 -266252 -28045 -308695 404877 -53794 53992 -270947 70372 62424 -94106 3013
9076 -270831 43347 36558 135899 -117284 -184278 -404933 157643 -61174 1541 -167511 64329
9064 -177806 -212355 -34578 256129 -80367 51695 55087 -458532 -117741 45982 69208 129314
9053 129314 -57777 176850 -166302 -184273 179486 -101921 -153877 -218947 79708 -79512 162214
$$ packed form
9135F0618c27848B79074M2116c49747J68378P3087j9868D2882O587j7106a44563
9123e1188F8828b95942A10158a49079N717d4327j49046d1847k79552E8395P7814
9112A36209a55057e4755B91608h7054p711q9135a6850o4224h827o8984A47719
9100h1550n803K3546B28391b28999j07895J56996g3760A72102f5588H3543d5542
9088c9136k27116b8045k80650D04877e3794E3992b70947G0372p948i4106C013
9076b70831D3347o789R9341a17284o6994k20655A57643f1174A541a67511F4329
9064a77806l4549c4578B56129h0367E1695L392d58532a17741D5982K3226O0106
9053A29314e7777A76850a66302j7971A79486a01921n1956o5070G9708g9512A62214
$$ plain form
9041 -24207 -2009 88792 146856 -277577 430878 -314115 189223 194602 -129037 -42041 -21181
9030 -21181 -360334 93115 -2649 121848 -51858 -100536 57212 -183026 -378007 140419 -458217
9018 -30844 3347 559421 -53994 -63958 -32165 -159837 254877 -47339 -217130 -259447 45877
9006 -273793 85339 78347 -326120 94700 -122822 -110886 -72454 -122241 -25899 -49601 -123288
8995 -123288 -174733 -15642 103845 -238363 125071 218103 59073 -97450 -60841 151708 -167526
8983 -74996 -184343 -228567 -221739 5085 -221526 -6366 -141781 -34746 -91601 -206026 2437 123603
8971 123603 -41918 91943 180718 -265478 37574 -328924 211762 -27262 -23006 -19530 -192378
8960 -192378 -84491 -86608 -159872 31585 -188360 -185147 28910 -474647 -41546 -37266 -103827 -289696
$$ packed form
9041b4207b009H8792N8064b77577D30878c14115A89223N379a29037d2041K0860
9030b1181l39153I3115b649A21848e1858m8678E7212a83026j94981A40419d58217
9018c0844C347N56074e3994r964L1793j27672B54877d7339j69791m2317D5877
9006b73793H5339o992c26120I4700a22822J1936L8432m9787b5899k3702p3687
8995a23288n1445a5642A03845b38363A25071R3032E9073i7450L6609A51708a67526
8983g4996j09347m4224O828E085b21526f366j35415c4746n6855j14425B437J21166
8971A23603d1918I1943Q8775b65478C7574c28924B11762b7262M256L476j72848
8960a92378h4491k117p3264C1585a88360L213B8910d74647d1546M280o6561j85869
$$ plain form
8948 -289696 -54296 203375 155066 -67261 -216081 -131628 -57260 -123982 -36623 -105904 135931
8936 -206860 443429 76448 528467 215172 288375 52887 16365 31870 -16155 -99455 40553
8924 113619 388520 544052 1004397 3209958 11177409 11229458 2603050 901365 353734
8914 563128 450064 220653 -49730 226878 -111798 -146795 216114 275944 60998 196126
8904 196126 -45976 -205134 -61002 -87636 -57334 -146229 91014 -132420 39166 71176 168771
8893 168771 -143231 352 86274 -343579 -86114 -60254 -217989 365849 23865 -46969 -427286
8882 -427286 97913 103817 114406 -326154 -192889 152282 -62202 -137321 138393 -7531 -91650
8871 -91650 -9452 -37395 369408 -31740 19993 -299515 256687 -83800 188513 -164244 96142
$$ packed form
8948b89696e4296B03375m8309f7261j48820Q4453e7260o6722c6623o9281A35931
8936b06860D43429G6448M52019B15172P3203E2887A6365J5505a6155q3300D0553
8924A13619K74901J55532M60345K205561P967451N2049B603050I01365C53734
8914E63128j13064B20653d9730B26878a11798l4997B16114N9830F0998J35128
8904A96126d5976j59158f1002k6634L0302q8895I1014a32420C9166L2010R7595
8893A68771a43231C52Q5922c43579h6114K5860j57735C65849B3865d6969l80317
8882d27286I7913N904J0589c26154J33265A52282f2202p5119A38393g531q4119
8871i1650i452k7943C69408c1740A9993b99515B56687h3800A88513a64244I6142
$$ plain form
8859 -279725 42900 60834 204506 11318 244544 -55025 -42848 59828 -301231 184364 -224066
8847 -44744 -236742 -343659 -173938 -262920 -361143 -45420 223837 -349791 -293501 -21912 -49050
8836 -49050 56255 125531 66823 -146294 -149702 -212771 -121356 -121385 -311002 -63196 -165178 -64682
8823 171406 -165171 195730 -141931 4500 71383 -53219 -25794 174013 -202017 -51833 -92504
$$ packed form
8859b79725D2900J7934J43672A1318K33226e5025J2177E9828c01231A84364b24066
8847d4744j91998j06917J69721q8982r8223d5420B23837c49791N6290b1912k7138
8836d9050E6255O9276n8708a46294l408o3069R1415k9j89617f3196j01982f4682
8823A71406a65171A95730a41931D500O6883e3219b5794A74013b02017e1833m0671
$$ [...]
##END NTUPLES=NMR SPECTRUM
##END=
