##TITLE=NES1064_159122.0005_001_9704441_LixE7HFyrJ
##JCAMPDX= 6.0         $$ Bruker NMR JCAMP-DX V2.0
##DATA TYPE= NMR SPECTRUM
##DATA CLASS= NTUPLES
##ORIGIN= BRUKER
##OWNER= Administrator
$$ 1.72 TOPSPIN		Version 2.1
$$ 2016-05-01 19:28:47.161 -0700  Administrator@X
$$ Compression mode = diff/dup
##.OBSERVE FREQUENCY= 400.02188249412
##.OBSERVE NUCLEUS= ^1H
##.ACQUISITION MODE= SIMULTANEOUS (DQD)
##.ACQUISITION SCHEME= undefined
##.AVERAGES= 8
##.DIGITISER RES= 22
##SPECTROMETER/DATA SYSTEM= spect
##.PULSE SEQUENCE= zg30
##.SOLVENT NAME= COFFEE_meoh
##.SHIFT REFERENCE= INTERNAL, COFFEE_meoh, 1, 14.98509
##AUDIT TRAIL= $$ (NUMBER, WHEN, WHO, WHERE, PROCESS, VERSION, WHAT)
$$ ##TITLE= Audit trail, TOPSPIN		Version 2.1
$$ ##JCAMPDX= 5.01
$$ ##ORIGIN= Bruker BioSpin GmbH
$$ ##OWNER= Administrator
$$ $$ E:\/data/COFFEE/nmr/NES1064_159122.0005_001_9704441_LixE7HFyrJ/10/pdata/1/auditp.txt
$$ ##AUDIT TRAIL=  $$ (NUMBER, WHEN, WHO, WHERE, PROCESS, VERSION, WHAT)
(   1,<2016-05-01 19:28:40.177 -0700>,<Administrator>,<X>,<go>,<TOPSPIN 2.1>,
      <created by zg
	started at 2016-05-01 19:27:34.302 -0700,
	POWCHK enabled, PULCHK disabled,
       configuration hash MD5:
       21 0F 79 D6 B3 7B B4 F6 88 20 88 DB 03 48 BD 9F
       data hash MD5: 64K
       87 1C 80 AC 4C 86 2F 75 B3 86 89 B6 C6 C0 4E DF>)
(   2,<2016-05-01 19:28:43.286 -0700>,<Administrator>,<X>,<proc1d>,<TOPSPIN 2.1>,
      <Start of raw data processing
       efp LB = 0 FT_mod = 6 PKNL = 1 PHC0 = 0 PHC1 = 0 SI = 32K 
       data hash MD5: 32K
       45 F4 04 2F AD 19 1F C9 2B CF E6 91 EA 6A C8 B8>)
(   3,<2016-05-01 19:28:43.567 -0700>,<Administrator>,<X>,<proc1d>,<TOPSPIN 2.1>,
      <pk PHC0 = 94.74609 PHC1 = 0 
       data hash MD5: 32K
       24 1A 5C E4 CE 1F 3D E2 3C 8D 65 CD 70 13 D7 8D>)
(   4,<2016-05-01 19:28:43.661 -0700>,<Administrator>,<X>,<proc1d>,<TOPSPIN 2.1>,
      <abs ABSG = 1 
       data hash MD5: 32K
       69 44 5F 74 27 20 D5 8D 84 72 9A 4B 1F F3 65 14>)
(   5,<2016-05-01 19:28:43.724 -0700>,<Administrator>,<X>,<proc1d>,<TOPSPIN 2.1>,
      <abs ABSG = 2 
       data hash MD5: 32K
       EF AC 0D F7 E3 10 91 E1 0E 70 DC FA 55 5B B6 D2>)
(   6,<2016-05-01 19:28:43.802 -0700>,<Administrator>,<X>,<proc1d>,<TOPSPIN 2.1>,
      <abs ABSG = 3 
       data hash MD5: 32K
       49 76 F7 01 CB F3 98 71 DB B7 FB 58 06 8D 06 F1>)
(   7,<2016-05-01 19:28:43.849 -0700>,<Administrator>,<X>,<proc1d>,<TOPSPIN 2.1>,
      <abs ABSG = 4 
       data hash MD5: 32K
       E7 7B A2 CA 0E 9F 5A 24 49 FF 92 D0 0E 2A AE 37>)
(   8,<2016-05-01 19:28:43.911 -0700>,<Administrator>,<X>,<proc1d>,<TOPSPIN 2.1>,
      <abs ABSG = 5 
       data hash MD5: 32K
       36 87 1A F1 A0 D1 E3 A6 9A 95 95 C4 E4 AE C4 81>)
$$ ##END=
$$ 
$$ $$ hash MD5
$$ $$ EA 80 88 08 9D 53 BE 59 11 E0 B1 C4 F1 60 51 8E
##$RELAX= 
##$RELAX= 
##$RELAX= 
##$RELAX= 
##$RELAX= 
##$RELAX= 
##$RELAX= 
$$ Bruker specific parameters
$$ --------------------------
##$DU= <E:\>
##$EXPNO= 10
$$ [...]
150 150 150 150 150 150 150 150
##$TP07= 0
##$TPNAME0= <>
##$TPNAME1= <>
##$TPNAME2= <>
##$TPNAME3= <>
##$TPNAME4= <>
##$TPNAME5= <>
##$TPNAME6= <>
##$TPNAME7= <>
##$TPOAL= (0..7)
0.5 0.5 0.5 0.5 0.5 0.5 0.5 0.5
##$TPOFFS= (0..7)
0 0 0 0 0 0 0 0
##$TUNHIN= 0
##$TUNHOUT= 0
##$TUNXOUT= 0
##$USERA1= <user>
##$USERA2= <user>
##$USERA3= <user>
##$USERA4= <user>
##$USERA5= <user>
##$V9= 5
##$VALIST= <valist>
##$VCLIST= <CCCCCCCCCCCCCCC>
##$VD= 0
##$VDLIST= <DDDDDDDDDDDDDDD>
##$VPLIST= <PPPPPPPPPPPPPPP>
##$VTLIST= <TTTTTTTTTTTTTTT>
##$WBST= 2048
##$WBSW= 25
##$XGAIN= (0..3)
0 0 0 0
##$XL= 0
##$YL= 0
##$YMAX_a= 608922
##$YMIN_a= -513784
##$ZGOPTNS= <>
##$ZL1= 120
##$ZL2= 120
##$ZL3= 120
##$ZL4= 120
##$ABSF1= 14.98509
##$ABSF2= -5.573092
##$ABSG= 5
##$ABSL= 3
##$ALPHA= 0
##$AQORDER= 0
##$ASSFAC= 0
##$ASSFACI= 0
##$ASSFACX= 0
##$ASSWID= 0
##$AUNMP= <proc_prof1d_extract_pilot.lims>
##$AXLEFT= 0
##$AXNAME= <>
##$AXNUC= <1H>
##$AXRIGHT= 0
##$AXTYPE= 0
##$AXUNIT= <>
##$AZFE= 0.1
##$AZFW= 0.1
##$BCFW= 0
##$BC_mod= 0
##$BYTORDP= 0
##$COROFFS= 0
##$CY= 15
##$DATMOD= 1
##$DC= 0
##$DFILT= <>
##$DTYPP= 0
##$F1P= 0
##$F2P= 0
##$FCOR= 0.5
##$FTSIZE= 32768
##$FT_mod= 6
##$GAMMA= 0
##$GB= 0
##$INTBC= 1
##$INTSCL= 1
##$ISEN= 128
##$LB= 0
##$LEV0= 0
##$LPBIN= 0
##$MAXI= 10000
##$MC2= 0
##$MEAN= 0
##$ME_mod= 0
##$MI= 0
##$NCOEF= 0
##$NC_proc= -8
##$NLEV= 6
##$NOISF1= 0
##$NOISF2= 0
##$NSP= 0
##$NTH_PI= 0
##$NZP= 0
##$OFFSET= 14.98509
##$PC= 1
##$PHC0= 94.74609
##$PHC1= 0
##$PH_mod= 1
##$PKNL= yes
##$PPARMOD= 0
##$PPDIAG= 0
##$PPIPTYP= 0
##$PPMPNUM= 2147483647
##$PPRESOL= 1
##$PSCAL= 4
##$PSIGN= 0
##$PYNMP= <proc.py>
##$REVERSE= no
##$SF= 400.02
##$SI= 32768
##$SIGF1= 0
##$SIGF2= 0
##$SINO= 400
##$SIOLD= 32768
##$SPECTYP= <>
##$SREGLST= <1H.CDCl3>
##$SSB= 0
##$STSI= 32768
##$STSR= 0
##$SW_p= 8223.68421052631
##$SYMM= 0
##$S_DEV= 0
##$TDeff= 65536
##$TDoff= 0
##$TI= <>
##$TILT= no
##$TM1= 0
##$TM2= 0
##$TOPLEV= 0
##$USERP1= <user>
##$USERP2= <user>
##$USERP3= <user>
##$USERP4= <user>
##$USERP5= <user>
##$WDW= 1
##$XDIM= 32768
##$YMAX_p= 437678771
##$YMIN_p= -634410
##$CURPLOT= <Network HP LaserJet P1505>
##$CURPRIN= <$Network HP LaserJet P1505>
##$DFORMAT= <normdp>
##$LAYOUT= <+/1D_H.xwp>
##$LFORMAT= <normlp>
##$PFORMAT= <normpl>
##$SURQMSG= 1
$$ End of Bruker specific parameters
$$ ---------------------------------
##NTUPLES= NMR SPECTRUM
##VAR_NAME=  FREQUENCY,     SPECTRUM/REAL,   SPECTRUM/IMAG
##SYMBOL=    X,             R,               I
##VAR_TYPE=  INDEPENDENT,   DEPENDENT,       DEPENDENT
##VAR_FORM=  AFFN,          ASDF,            ASDF
##VAR_DIM=   32768,         32768,           32768
##UNITS=     HZ,            ARBITRARY UNITS, ARBITRARY UNITS
##FACTOR=    0.250966925370066, 1,           1
##FIRST=     8223.43324360094, 27197,        -311641
##LAST=      0,             57836,           -164650
##MIN=       0,             -634410,         0
##MAX=       8223.43324360094, 437678771,    0
$$ Real data points
##PAGE= N=1
##DATA TABLE= (X++(R..R)), XYDATA
$$ [...]
23824 -226153 59550 291804 214383 -87190 72312 -90222 188499 8004 -164562 281020 63582
23812 53865 -40560 150999 -11881 -48505 -48767 -29890 134022 -228612 21557 166070 -43459
23800 -27765 76814 -22842 36850 -208417 -39859 191289 -315827 118162 -21733 84190 205787
23789 205787 -135335 -271833 189318 -310518 -510730 68799 -34059 157851 44638 -44144
23778 -43922 -207232 50861 -199877 115554 14351 -31400 -136381 103268 -1928 -75608 -283523
23767 -283523 -51573 418325 -167809 -417956 -89433 -64172 84880 -228041 -78994 -418322
23757 -418322 151948 -139156 -42715 -73446 -150309 -77776 31577 -11660 28529 149225 69982
23745 76654 -78328 -72947 -409835 17436 59599 -50471 89230 -79494 22012 23122 -228637 -11191
23732 102511 177602 -21131 186686 -28712 -16365 -129992 -343322 318357 -256882 -138257
23722 -138257 104540 91901 -178686 120153 33499 -140137 79425 -283185 91487 -155938
23711 -32273 -95358 130401 -223 410675 -37833 250797 326952 43686 -88237 68438 -131554
23699 25714 -48343 -145272 145958 84512 28351 -60918 -41989 -193254 44146 247568 59934
23687 -3571 -55201 -64059 -293965 37351 -464247 -150526 -18600 -138785 136782 -2630 -26609
23676 -26609 -121382 142889 380 181847 -387544 145728 -309531 160354 27252 -32185 -45111
23665 -45111 -34719 -77405 216112 -260033 -42659 -117736 53952 -103920 -96853 109891 367332
23654 367332 280791 -178818 -119157 94880 -118784 207647 32629 -163646 226632 -123664
23643 -36294 34842 26823 -160895 281518 176007 168400 137207 -159979 -144042 -130390 -140166
23632 -140166 84086 296596 -47433 -132242 179686 -5282 415850 -123487 149599 -13876 -8840
23621 -8840 -266074 -83378 -12677 359571 -51208 -70838 -215474 16544 -365072 60323 93939
23610 93939 198431 183515 160775 -358 -254860 -109990 -278956 61813 -198697 71183 -146642
23598 1775 -104792 91336 -229273 -158290 -88514 25730 -112392 -427345 -28260 -290461 -256349
23587 -256349 -73296 -33049 18996 -46673 149618 27588 -286100 45020 -45463 321127 -217542
23575 66076 156553 366037 114243 38828 -183073 8963 -144218 -114901 19613 91989 -252688
23563 -92742 103707 -99019 -276728 -177792 211677 301893 -165131 -16749 59301 -76198 210973
23551 -252859 131922 -101149 161644 -192630 -107385 130080 -85646 -260267 223612 -375628
23540 -166670 -176289 184927 20909 -57252 -17087 -91468 205343 -3659 189696 -30028 -389746
23529 -389746 -233059 80957 109263 136911 177003 -141791 132281 117328 223131 -57151 -166167
23518 -166167 121266 -207299 -286186 -162205 159362 -42187 -14926 -79366 42893 -28780 85909
23506 265428 42535 190350 -289172 -67688 74586 25118 -173848 122015 -110690 43332
23495 58051 -226020 181347 212029 69672 -206405 -90337 -122306 121962 209393 -32724 113384
23483 -197000 -82462 131951 210780 -191156 -73300 -64860 -121684 -227745 -188202 79220 -20499
23471 -76091 -171364 -97728 -151130 -130943 -112401 -199436 24198 90192 -101471 -166812 -32590
23459 74701 -55492 3453 184220 118443 -171177 -79093 89744 -117281 244230 166738 -134515
23447 38960 -71747 -227779 93502 -102347 33066 155922 171664 71885 18708 -229033 118789
23435 168294 63301 -35379 -398450 74511 23500 -39626 -299620 -611 -441545 35909 277654
23424 277654 -178716 -32619 117537 93873 -94473 -30096 20131 -151995 -81580 193641 25646
23412 149584 -363665 -116113 14366 -242484 -45984 -101488 -259978 -116736 -287935 -129668
23401 -128685 -242102 -35753 -279408 -140044 123428 -2412 94798 -5332 -82227 -121468 -2503
23389 -331958 -205088 7888 -114949 -213743 -71363 45461 -280088 2105 286273 75319 -26319
23377 70128 166188 -285060 78002 -75852 236035 -49895 -58579 17202 -83929 -298147 -110091
23365 -405230 -256873 -90799 -72271 3384 -297052 -49680 142424 74250 303458 -248357 71922
23353 211918 -55985 -28509 -365421 -56593 86658 -278549 226025 -40604 217308 57 -96992
23341 -180862 -300824 68077 -1766 -311708 -354640 353311 -26943 24149 -223685 -185436 -203904
23330 -203904 16183 228557 48288 195127 -80087 -55888 111920 183646 -311894 263696
23319 159670 -110667 44609 -197673 -20419 11923 91242 95219 -150872 -13670 40302 -14656
23307 -11983 343496 -85555 -71887 2844 -51575 191420 94418 6908 -254199 8525 -81350 360983
23294 187630 202881 60744 -70475 61637 175753 -105841 -70388 106370 149161 -114348 -19716
23282 -112726 166590 6258 -58859 -134825 316201 -131152 -9266 36684 -349050 150247 254229
23271 254229 240515 191051 -38918 -167617 -164749 49580 28038 12190 -55516 131383 39908
23259 -97861 88636 34489 -332267 -159342 -54961 -139258 -16976 317099 -75888 -47255 -28011
23248 -28011 -105680 -93173 -208599 -111172 -259979 -287661 -20970 -12629 -61029 77098 6152 206267
23236 206267 -125719 -33562 165478 -26611 136950 -142145 -92375 -58968 -45476 -32706 54110
23224 -33732 -88155 -31672 158310 183713 91129 20802 77806 -103229 49713 -88836 -478473
23213 -478473 -39389 -100161 -126753 -27212 18652 -277761 -274088 -250938 80598 -28981 -84150
23202 -84150 -351513 -74100 74628 -265178 127857 93707 -111973 -78808 215724 -205032
23191 387858 156877 244698 -92061 45637 -32444 295489 -139665 100782 -168944 -214771
23181 -214771 86977 -26126 -188451 6932 57930 84961 -17262 79463 152219 147602 -267000
23169 61061 49818 -65111 -37118 -169267 -218618 22613 112746 129548 -236196 -309361 23084
23157 -98013 154002 -212282 -83624 -143741 71178 -213612 -6702 58116 -145865 149731 218615
23146 218615 -125270 225259 -315588 -96350 -102483 -317972 -31885 -28331 124875 54182 -34317
23134 -43530 173153 142917 88389 -282898 -165402 -213030 340220 240081 -118956 -100687
23124 -100687 -8232 -158195 -167845 39952 -33806 204391 -334384 -173085 20220 -116326 -4025
23112 -69164 -151674 112568 68349 234584 -30940 -42650 78269 -3287 -17423 -158917 20098
23100 -172070 -359851 211959 69085 92692 -5742 50765 -209428 -14135 -196374 83516 -29762
23088 210712 -343588 -132491 -143226 -59875 265571 -149610 -371081 25691 90638 -204926
23077 -128217 60820 -278662 82968 -153971 -150765 -288508 -139733 161277 -114091 -37345
23066 298994 -172074 8642 -92298 42367 154889 -81485 -110133 11303 122126 -27684 139946
23054 137366 82474 -66103 24762 -157024 -159644 -192801 57707 -56788 148493 -66569 36035
23042 164090 263086 204354 -205596 -52812 -118959 152038 149426 -185210 -149875 -117509 -87647
23031 -87647 95958 -474039 -144797 38621 61673 -66520 -122165 -28172 -98893 -64236 154177
23019 -203330 71825 106534 -2647 13448 -133959 -315265 285702 -6381 76120 -298269 246320
23007 -178012 160371 191273 36682 -25874 -112764 92761 -325526 -318370 -149788 316200 -333979
22995 -32719 41341 -78925 249686 167534 -17967 124180 207368 65955 -108243 158245 170431
22984 170431 -241747 -41246 -19478 143933 -149892 266418 -98058 -131902 28506 138363
22974 138363 25011 -39496 78561 -160309 60579 34847 -100632 182613 293212 -148480
22963 222864 6201 -119111 9755 11435 -49845 208971 20644 -285708 145076 -80389 274122
22951 38916 -66140 -147624 72920 -189469 -340629 -156401 341290 65053 -27232 -254844 -49989
22939 -39709 -194173 13292 207064 -177658 -213923 -36062 163530 -91340 -175213 -107373 220407
22927 -186213 -229506 277274 51363 -74105 -326366 255886 -467496 42393 -54708 149884
22916 202009 -68462 -242275 153954 31032 -15872 113680 -291203 40318 66483 92700 140014
22905 140014 -29225 -140109 -41915 -50318 -278999 242075 -139349 286160 -9415 44489 -146554
22893 216914 -220142 -206720 -218921 -184352 -101636 -196287 -12157 -58440 -193558 11978 -45789
22881 -247692 120534 245013 42307 184067 50982 -27780 -95560 -478893 -90401 1944 43732
22870 43732 151164 -51045 43995 -169496 -179635 -157906 -273832 -68184 -205288 129300 69572
22859 69572 48589 -53001 -329771 -111716 -6652 -179874 -226749 -98331 -98454 -268631 27948
22847 66710 -40256 -44034 7138 71153 -12851 184234 1131 -21330 -31234 -8351 63222 -80553
22834 65218 -332824 -16229 164776 82531 -221634 199825 25048 94546 199403 105358 185027
22823 185027 -124165 159658 -90863 -96502 -104554 -191773 51567 -15707 -43705 -310814 -185496
22812 -185496 -68181 -290371 -52952 -161415 -5474 -140798 -367218 -43429 -74784 211415 31887
22800 -197438 -163681 94328 211684 178361 61309 -349922 29153 -303662 -15391 -28794 -368
22788 -75036 -10052 -109133 -270611 -223467 -292977 37847 -249678 -104417 212878 25860 172984
22777 172984 -54451 -392335 -290480 -54925 135707 -234350 306331 -25460 -94993 65886
22766 -556316 -34115 19778 66748 79092 -340149 -24064 -77296 -30698 175588 -57325 -202029
22755 -202029 72333 -121623 -86115 -130465 24767 -37569 234480 -265040 -236543 112226 -32194
22743 -68149 -55015 -345348 384843 -181342 -61911 -134628 215901 -274879 -114954 -212342
22733 -212342 -96124 -138310 -117947 504997 -399187 -4190 -105275 -68645 -152883 -81826 -38522
22721 -290837 -100944 12711 -46913 36270 186798 -127508 57788 187116 50597 -86277 -70074
22710 -70074 56971 -106116 38106 -112222 21077 -134161 38756 -95037 -92370 -64609 224550
22698 -104659 -154026 -117517 117359 -51995 -115894 -412914 91985 -295023 -117149 206813
22687 -62923 190209 11555 82167 -3971 -92228 175332 -33392 347527 117086 56813 -2410
22675 -18950 214024 378661 -44606 118914 -74132 -60451 -49012 142174 -49847 -12887 -199423
22664 -199423 -34783 43124 -21436 108771 -235336 -55563 23764 -233507 -310698 83988 36656
22652 43562 223945 -37288 131880 -447674 95513 112731 -136599 -310526 -116555 -75515
22642 -75515 -104196 -4564 118264 -220 32496 -15945 -67397 123985 154969 -24241 -255693 -145221
22630 -145221 152777 -62694 158398 146766 -123265 -373372 -114447 202061 -24523 187037
22619 -170308 8754 34771 -260662 120403 14097 -84115 -197738 -18695 128947 32050 68773
22608 68773 -272639 52505 273946 -42112 -138941 -140224 50880 -81223 -11694 91778 -190727
22596 -11517 -113473 84008 -73673 -142370 78665 187501 -185717 -5345 301376 250476 127152
22585 127152 -62907 -112948 171232 -398723 128953 -15066 -157240 172681 37775 82101
22575 82101 -187029 25168 -129560 -54549 293445 127547 -66382 -36711 -126374 62047 -29686
22563 81187 -121224 76061 -87133 78625 -239519 -214843 -24451 92738 -41378 112582 1997
22551 -129891 6220 18126 -276457 -137990 230625 -48503 -376030 -16228 -61634 48970 -165194
22539 36840 -211210 -25524 -50141 -4367 4033 -281459 24742 17787 191452 53301 -146978
22527 -233889 87322 -357491 -276784 71589 -125105 -259769 -35296 -63599 98938 -325027 -6590
22515 69590 1981 -174898 -9387 -107676 -103668 -64498 -68170 53481 -156911 -219628 -249448 -365352
22503 -365352 -295712 -22953 -16670 138264 -388245 -195422 472913 146809 7682 -153755 -271913
22492 -271913 128415 -98804 -87777 78639 119210 -255880 -214250 -261008 -213116 134181 175399
22481 175399 -318457 18134 22052 72998 -2985 -272477 -54487 -230615 -10103 111130 -113860
22469 -38311 -99786 81628 154681 -15846 -185190 -156197 171078 -307912 97948 285002 62330
22457 -80872 -53753 41252 200778 -113153 -124316 117008 296258 -107781 -441712 183770
22446 -197904 -226440 71298 -27138 -181578 105713 -189520 -321433 49221 -61756 19667 -155010
22434 -61253 -171458 254663 -116432 154433 -57144 26481 -388484 -328327 -55657 47087 -127219
22422 95934 14417 78821 -2786 147206 365142 244562 248487 59143 264289 284254 -206032
22410 46362 -224397 121870 169795 274663 -13047 -41909 16510 35546 -121248 195281 47535
22398 264785 182433 -13067 112168 -71008 26654 -238602 -102379 -49073 -162440 -129004 -78386
22387 -78386 225262 -59663 56017 341396 106221 -188673 -48727 57124 -200751 -104716 -7766
22375 -230286 38040 4011 -130714 186373 -278736 166322 -13161 -120300 -30368 -172509
22365 -172509 276480 48699 -446856 -175177 71616 -115447 -160200 154832 -50793 -423305
22355 -423305 86268 -435843 -62096 -12941 119924 -129623 71914 -257005 92149 -40401 -223844
22344 -223844 116198 -53279 -79716 -117873 -68803 25809 -61366 -29323 -295201 -69861 -27455
22332 277759 134064 -226353 -216245 -79773 233646 -255180 -179003 -219899 92478 -61384 -22667
22320 33477 -73593 -164121 -132548 -79321 79383 -244862 -279103 67658 12632 221209 234590
22309 234590 -116580 -219014 95427 -143674 -86085 -89600 -72052 385628 -66618 11739 216688
22298 216688 56694 -149940 -178685 58479 -295849 -3075 -84882 -178242 17364 -425896 -66819
22286 -161038 13719 116599 -106293 31114 -81300 -371933 -338302 -268887 -110412 182462
22275 209104 -288661 -376950 60654 -90240 143009 -268229 -35122 167327 -44162 99474 -81410
22263 -248632 -16759 26788 -25631 -190344 136233 -85108 253982 162869 -27924 296299 248384
22252 248384 -110030 40193 -34702 111015 -275288 86241 -116373 390046 -110798 -135548
22242 -135548 58364 -240872 -159564 -277435 -70065 -102354 -49284 -124570 -37422 216271 29232
22230 -166129 -170123 157695 1161 313725 216186 -406 -145108 25717 1628 -40911 100722 -39707
22217 85960 -5637 -12056 -50646 17484 -109612 -292358 -11240 96034 -207338 83284 7810 -183312
22204 208367 70851 -6999 -403077 -81351 -17225 -107491 46773 -131043 -385097 133118 -162662
22192 -84180 -210351 -88054 -106074 -460970 -209330 21915 -222208 20101 123956 220047 3924
22180 -12302 -219258 -307753 -16942 -2883 -47155 -15368 -35040 -201181 61659 -7752 -12538 20628
22167 -10455 -160374 -77368 277904 84646 -109269 8847 -112399 -240262 416126 156681
22156 -18287 749 72812 -192693 -288000 28637 153048 -146206 -205941 -200444 -354704 -259405
22145 -259405 37872 -239847 -101546 165945 113483 263347 122057 -632946 215775 13802
22134 -167363 125283 -34085 -70203 -118994 -134844 203983 65042 -147718 30137 -35286 -219646
22123 -219646 -106218 -70556 117254 -75929 162733 13529 -28418 -167982 -315907 363470
22112 -2525 -31234 -89994 -51875 -97400 218161 -104472 -244231 -104437 93551 81154 72610
22101 72610 299038 -81664 -235995 -57799 -165644 230261 -118546 -294944 171337 -166714
22090 -96409 -292820 -274202 -23511 110930 47809 90636 265182 -419161 57300 -47175 -56116
22079 -56116 151821 -319235 -117925 -438031 188776 -205508 -281678 267723 -260141 -17333
22068 -240266 -58267 -133493 -426812 -51377 -55395 -97633 -149684 -271911 23677 -225674 -53584
22056 -176199 -72458 -68421 25453 -176082 -114424 -81082 -99058 2259 56378 -152575 -225115
22045 -225115 194001 20851 -101400 -124400 -169360 -15846 -164575 -240328 220020 -1842 -108254
22034 -108254 124702 -286117 -21055 261329 93337 27451 106502 -214823 48641 -99483 98594
22022 -9149 101629 140314 143191 180958 175865 14574 49376 -272118 21804 -258767 -47401 -345910
22010 -345910 -108627 -180190 79992 50304 -227592 6022 -319283 -188379 67333 38142 -86011
21998 -168006 -97109 -196736 -154915 -116927 -91719 271729 -130692 -279422 76201 -115686 -62310
21987 -62310 303971 54402 174437 -168549 176490 206707 40157 34302 -15176 31704 -64359
21975 95669 -172765 -96415 -234066 -268389 119264 -178678 -111100 -224195 -187974 274141
21964 6375 -86555 148647 -36023 -86824 -63823 -25254 96192 95592 -102290 -15137 27722 160573
21952 160573 -72962 82604 -175715 -59610 -63252 -530869 -317806 -2802 -445149 -70049 81754
21940 -200161 -98979 101701 20417 44043 -172704 -167777 -165582 -83993 142699 58845 -69197
21928 -116198 -77902 -2451 -57906 -319235 -22645 26236 -169975 158242 31882 37991 -131682
21916 -6618 174783 -175043 -164823 -11948 -81172 -128690 2030 -28933 -86796 -66487 -118130 -186522
21904 -186522 55717 -140887 110358 -404546 144885 215525 48211 70998 2401 -103842 81689
21892 18392 19812 42434 -160617 -26438 -5901 107749 91704 -51048 -109421 23064 -185998
21880 -77395 -194408 -165268 -237766 119433 59556 -72896 17569 -88963 34459 198985 -47758
21868 -61824 -133228 -102459 -3792 -130834 92683 137272 52747 131071 -154800 198146 -71475
21856 -112956 60513 9027 308342 -109882 22080 -188370 -6698 213714 190468 50010 -210019
21844 -76845 47152 127348 5356 9429 88826 85906 61131 565946 -132036 32633 -429334 140961
21831 -130326 -191120 66808 206073 -28905 38218 28703 140886 -22275 72695 -211080 386025
21819 -249444 25508 27905 -554780 -159581 -51667 -114705 -132437 -95205 -188878 -65312 131722
21807 -188295 76756 -87470 -107831 224114 -246016 47887 -203498 -469863 12421 197282
21797 197282 -192738 -69199 16125 53942 -187981 -4375 252845 -139648 287080 -117469
21786 -294868 -188685 74160 279517 -43781 -77596 48463 135638 -1856 -28326 139256 48432
21774 -17297 231253 -29115 -7361 508513 -148741 47669 -318676 137011 10302 -171612 32584
21762 -256469 75300 -198092 -22870 -245972 -400836 -297781 -130598 41333 10761 9753 -100742
21750 -89510 -112964 339300 118655 234145 -170090 171082 -217344 -245824 -61475 -53736 -154814
21739 -154814 34150 -62730 93404 -217713 -59425 -155897 158516 -33422 -372308 -95047 -37103
21727 -32956 -133429 -79646 -141504 -347871 -190991 230211 168850 -115879 -303255 147072
21716 -393072 -382643 -181588 102454 -124247 209351 -229328 -96529 -56739 -66922 101721
21705 -156270 -227652 -68012 -162151 4932 -206166 108009 -24643 -258335 -21633 -114416 -143710
21694 -143710 -125415 -128725 -299638 169923 -178084 -1836 -119260 -187986 -15242 -175578 -79137
21682 89818 -156106 89530 -48125 319070 -129815 173322 46243 15062 -311019 8871 -240757
21670 261355 -241699 89264 16634 302452 -171288 -114873 305476 98194 -283153 -104295
21659 -28732 -37029 -6450 271511 -56728 7418 -119064 251795 206986 -37826 41036 -136759
21647 254937 -169655 316811 78584 -211625 -207467 -176191 173132 182813 109943 -86755 -191505
21636 -191505 -117468 -52501 277645 -376789 -328990 -246293 135383 -171583 64437 -140313
21625 106912 -23288 -356186 100597 -3032 -82119 -316944 50992 -332437 142268 -474802
21614 -134334 -148075 256183 -181937 -83528 -96879 -154979 331017 -175542 -260362 -63626 -190290
21603 -190290 28110 -64322 -10635 -94959 10933 -12897 184488 -117480 9326 -169251 -104445
21592 -104445 87428 -230438 -19831 76136 -286538 -276686 -62202 71727 -195812 -363613 398463
21580 -203813 -23965 -284791 -199779 -468242 25260 -28420 -50778 60691 -61537 -120569 -139144
21569 -139144 -7176 17033 162917 -276020 -230860 -195591 70005 -3798 -164550 -152866 -238942
21558 -238942 -195604 -42243 -63112 307 150804 -61221 33843 87466 -33192 129381 -184266
21546 -114379 213679 -42252 136428 -302809 123729 166893 -202239 106061 -40652 -42800
21536 -42800 -39425 -275284 180958 86840 96969 -229920 -51984 -23396 -174210 -106233 -91439
21525 -91439 15733 52593 158435 251151 -184853 358345 89906 -137209 -185874 178016 -139730
21513 55714 -74406 -17076 -164138 -13365 378292 -63595 84303 -185797 -196270 158764 -35312
21501 191854 19638 -165881 -133042 22005 -77530 -449460 -33125 -20751 73853 -345553 88052
21489 -210389 -175736 164169 224308 -374534 261643 -75736 -80707 -19123 51797 -26960 -148338
21478 -148338 -343464 8320 -85444 70743 82426 165818 -96528 -28339 -159229 -523265 69024
21466 71973 -17153 -170887 -62444 -102216 40770 -32822 39829 -180362 -176622 -538288 -323534
21455 -323534 138904 -272933 80994 -27953 -22173 203096 -363738 -108463 -18509 -195427
21445 -195427 44750 240978 396621 99899 78604 334755 -40395 278499 -10425 -33239 280185
21433 -203837 -32332 -194516 -270630 121665 -332907 192256 69028 -431316 -188420 52818
21422 180289 12676 -67941 -22686 -337575 -144153 -146333 33796 23623 25553 41927 -86163
21410 197446 -109352 69077 -55182 -400122 -74122 -123427 101989 -8339 7925 -344664 49945
21398 -59796 -320526 3145 -67788 36998 -265830 87083 -397808 111637 244367 62159 122310
21387 122310 -45199 -7679 116709 -343359 -15513 -70435 -378652 47291 -364758 -21946 149206
21375 30951 3803 -120676 -236786 68362 -135245 -196456 327174 -253939 -174165 94586 -51926
21363 -277614 275340 -43283 -296146 25657 237787 107029 -103116 88775 390629 110093
21352 -81911 454599 220333 -330370 -12832 -21407 13047 -263446 -48318 -844 -96788 -215506
21341 -215506 129540 -40899 141542 -184618 -224498 -289521 395651 176766 -33551 -65046
21331 -65046 -128374 -166324 170465 68432 -218626 81649 -261567 5127 83073 -81781 78910
21319 41696 11820 -122873 -232748 -187602 -30568 33224 112473 -147439 51706 -129479 -144424
21308 -144424 -239541 7460 -186314 -111729 92311 62431 -125544 -107938 36460 -141027 -37536
21296 -234816 -126864 -167304 -6398 137802 213176 -52381 25684 -389518 -126229 272337 -232045
21284 18826 -235489 -117725 92888 -183418 -122070 -1002 -208029 109505 46963 41738 -431215
21272 241674 -315164 93177 -339486 -9316 -58606 216776 -60378 121956 -238230 12844 -114152
21260 110147 5390 -66496 -259175 -542624 1577 131132 -165682 132106 -168230 -1476 9534
21248 215165 -23860 63134 45277 69682 -358531 -147902 -98786 -217779 350328 62092 -252869
21236 -118559 -14695 5930 12336 -118733 -110341 -130135 17323 -171795 7934 68568 -39976 242725
21223 -56652 -398800 116414 228146 131793 -161175 -1100 98160 -279329 -181622 -77008 68
21211 -340050 -81703 510506 -301286 -240363 -3449 -199758 -34535 -170003 -64400 36686 -294975
21199 -259624 22668 153791 -23583 -161874 2080 449463 65014 215438 -66094 77857 81422
21188 81422 92288 101179 87089 81226 34927 -61472 145925 -211495 -113980 114436 -318860
21176 -52737 -141919 -9010 -180228 -129649 180979 -201115 -115103 -30722 64235 -143598 -158074
21165 -158074 -39398 -224827 -246468 13682 230133 76698 -202951 -122675 5126 -248727 -257114
21154 -257114 81262 -38843 -248928 4348 229439 47683 113277 289909 84372 -198566 -46979
21142 36475 69943 -55865 -97808 62252 94271 -178137 -132374 13368 -82308 -19800 3868 -177101
21129 -214797 170586 -207008 -295457 -40660 -100272 45984 32739 -212876 75908 131458 -121396
21117 8462 87726 194586 -114171 -250373 4678 -145807 -9024 -80192 -558 -83623 210920 119505
21105 119505 -16285 -517101 -56512 70046 -91461 379566 114205 240376 -76447 171962
21094 -70116 -272145 -328281 203259 -202959 -172920 -166713 4233 -107257 -67456 51188 101387
21083 101387 -108520 161593 124081 -274479 -29054 -171554 -308908 -174197 84700 -110168
21072 -39485 -40963 -117094 -69810 -174710 109755 -297592 -185746 -40442 332192 270977 -88249
21060 -169799 -287003 65217 -113831 76748 -155524 -283006 -105122 -319841 -12405 -35797
21050 -35797 281633 83887 -382543 -188022 59973 -8931 -16992 -2802 67026 -365439 319006
21038 18233 -45817 -92464 -137230 23870 221965 -75981 129994 355240 -36988 -245685 329387
21026 206773 -133580 75381 123864 30460 34579 105398 -290002 -359704 92187 46641 -349502
21014 180465 -293434 -61653 85960 -86619 15260 -241870 99629 -238944 -280738 45404 160501
21003 160501 105008 -93364 -240746 43069 199508 -48541 106488 -238488 -170969 32168 -2797
20991 71285 -60962 104846 -125119 -196169 199341 -336764 18601 -22580 69949 -158235 46371
20979 -59543 -331285 -192245 -149078 -202711 33182 227954 -88510 -102487 187303 -210240 241367
20967 206515 32847 100013 -263911 11012 -189864 -77553 -98225 -86819 -32220 -245350 109311
20955 106589 -158037 31136 46755 29813 -153158 187143 -9991 -129665 -213663 105709 -132547
20943 -329919 121661 84785 263782 -161103 99319 98053 -271171 -24819 -175875 -21569 164560
20931 241588 222232 -176022 -4994 -16166 -287921 56403 33175 51948 -102436 -220713 -275504
20920 -275504 224661 -32939 -364410 -237756 -123366 -207405 -34414 989 280773 -183397 -79091
20908 -27997 -97228 189893 -22423 189685 14436 168660 -29820 -306854 -138956 -361367
20898 -361367 92970 -221041 -65453 -283576 -172351 -50894 198358 -64902 -274306 -167185
20888 -167185 55267 21211 -20801 -264107 -230479 -155538 -98552 -83495 -15511 -135594 -16909
20876 84897 -279348 -205254 -72103 -77627 -430076 -423050 -160120 -11751 -3268 -83679 223510
20864 108539 94281 287082 120059 283890 68377 -227923 -140485 66210 -77180 -189175
20854 -189175 120518 -53788 -57202 -144960 48938 -85649 -246519 -184389 230659 53566 -31080
20842 -267742 -161035 -53467 834 -34008 -160365 193119 -405948 -72957 60445 -258106 -382896
20831 -382896 149551 -203136 14551 -18719 41378 -91038 -173331 -263676 -299715 190746 -114292
20819 -335957 -256798 46966 145533 -270968 -193309 -126805 -118003 -196498 -9857 -7635 -240150 -440078
20807 -440078 -58789 -125287 249986 -280010 325665 252460 -185742 54606 -56840 198389
20796 138681 -164956 -94061 195864 -395849 -109202 -147088 -14769 150110 187700 -138451
20785 -29154 402219 -69832 -188326 -140034 -328678 -48887 9812 -176616 -172575 -902 111445
20773 -222560 82956 -39016 -379303 61938 -274104 -83461 -204202 -88605 -128597 32642 -30114
20761 -47192 -166777 68579 148609 -88267 144201 160864 32722 -32371 -47476 145887 11323
20749 -226805 -276410 -99466 87915 -141681 62478 -185098 -312040 445877 -184 91408 -231078
20737 -163355 31693 55983 -143147 60020 -15797 -145276 220392 -8413 157265 78404 -20575
20725 -162966 86886 56401 -234930 -146005 -202921 -20333 14797 8354 -361627 48936 -62849
20713 -252208 70181 113356 -33005 -49217 -47357 -306527 207278 -235097 -119167 264698 25042
20701 183562 60755 26566 -137230 -198078 6311 -264005 -315460 -50379 2838 -178025 -313846
20690 -313846 127770 18031 -104672 -59651 -21518 -221644 -42337 192303 -289595 -42469
20679 -190084 60401 3973 7504 -96317 -98729 133095 -382707 -348322 291140 -53787 162908
20667 -247101 159009 29131 -159395 -162422 42205 24694 -238737 248031 -242912 88580 5893
20655 47241 90501 252046 -16816 -52054 -263245 332254 196580 -130324 229133 -256013
20644 -322780 191251 -181156 -65903 120549 136146 -224393 17737 255362 -43912 29329
20633 78134 99709 -92242 -26188 146524 199264 -340095 28204 -180629 192360 -245608 248615
20621 -166877 162511 108623 -208480 -302965 -391368 223421 29459 -443122 -164223 -285419
20611 -285419 -267992 251246 -119418 -32345 92052 -244513 139069 77558 46791 230711
20601 230711 72145 -220308 -1072 325716 -213166 15838 -191216 102984 168510 -434021
20590 149076 -126938 59273 -207827 190321 52983 13077 123929 82131 73023 -181716 223293
20578 114650 148496 168740 141090 64847 -239196 210702 -40374 -31041 -247409 140895 -34671
20566 88927 -89158 -218360 -116849 -23793 73686 -54550 -99139 -212262 -16514 -99546 77636
20554 34375 72556 -28565 218384 68374 61046 -205499 -77746 -119119 -296219 43733 216034
20543 216034 91713 160075 -95888 240744 -136043 190557 37273 267946 -92028 -202976
20533 -202976 288961 -11636 -121534 172053 181419 -230470 -186930 33560 -183009 -523546
20523 -523546 -144431 -208190 9610 66504 -300247 94374 -219333 -223493 -190856 69679 -19546
20511 -155634 -180944 -191913 -55943 100908 191475 19588 -90808 -97634 -55736 32033 -76855
20499 125175 44813 193945 -38494 -91116 -177753 -149354 -126759 -14693 -54892 -129685 102501
20487 108181 19813 -126295 -38811 -87230 11660 -3778 -109757 47706 -255611 -31899 80537
20475 3115 21005 216953 -237312 -143103 -55542 86288 -185483 -200368 352901 56222 -423616
20463 -104776 92954 -90104 281682 -99749 -201761 5623 56955 12282 -74078 -84608 -8178
20451 -24955 41314 238241 -77453 -325972 -205263 186618 -4840 118986 -86260 -62835 125373
20439 -156488 -85105 -70475 -321485 -129524 -53655 -365698 -194608 -103661 78203 18384 -330091
20427 22807 292424 114164 -133785 -301661 -33265 -68653 208717 -148156 -45864 -93727
20417 -93727 29140 -178438 44797 134444 172511 114361 141240 79557 256735 48172 -170363
20405 -247109 -305281 -323807 -49998 -61587 293391 -142947 70293 -184216 349995 -26055 -65353
20394 -65353 7066 -51027 98554 -258307 -274545 123252 -78120 -310000 -243156 -85814 -118625
20383 -118625 192986 -180363 -56364 188818 -62264 -238577 -59280 -59253 70183 -191130 -159875
20372 -159875 -45752 75936 -159326 -50957 222342 -207856 -33103 311863 13916 -147517
20361 -622482 89452 193179 -104468 83825 -216894 -199684 -15269 -14689 -146305 90847 -138591
20349 -159904 -251600 363722 30080 -38587 127634 -36449 30008 -250009 -67245 87150 -304592
20337 84873 -104170 218563 -97951 -251128 -5015 61971 318746 -180800 -79910 -25324 120166
20325 24630 -296067 -210812 -203259 -338406 -67893 -28021 -197209 -22753 -151773 -97774 -150009
20314 -150009 -143095 82018 -124409 -242815 -6278 -31928 -82777 -118369 -113723 -56858 93725 -249908
20301 -30907 177946 82121 -145923 -174964 -31270 -200173 -330169 -233404 -147617 14127 89322
20290 89322 -72852 -212155 -134938 -89601 -110392 -131995 -93914 -202504 38186 267061 -119330
20278 -88614 -7041 290304 59944 121490 71478 120926 80436 51046 173220 -172202 12572
20266 197394 -114181 -99111 -128948 -226898 -210356 -163966 -65636 -372579 -107913 -289459 339715
20254 365366 40228 113904 105993 -314057 -129276 -11389 -113556 10307 52182 150108 -41062
20242 -201279 -111681 -119335 29267 46812 70432 51081 51944 -181111 40463 -180252 -224662 -114540
20230 -114540 8210 -8335 -461818 -2117 -21829 -32753 -462133 -34289 -169725 -109906 1599 224345
20218 224345 63425 130122 -105655 -71234 -147682 348158 -60634 189732 117058 242530 -331792
20206 221959 -2578 4653 -353278 -61 6393 143021 82353 -169356 104071 331446 82577 178245
20194 178245 -15823 -240154 -143328 110143 358734 2944 110438 -30551 -144552 -338508
20184 -338508 198324 46496 -117149 -219954 154185 153977 -107056 -128925 206998 228319 41854
20172 -91502 15261 -4052 -264206 67330 -34102 -153837 -143475 -85648 -288861 -60609 -32646
20161 -32646 230215 -90594 -218643 52822 -227830 119419 -75652 77810 -41330 78417 93635
20150 93635 -348222 234252 92123 -6147 57641 -162585 -256658 -42363 -42017 4 261556 33054
20137 -92872 -185241 152944 -191865 56710 -358559 -273022 -241368 134014 -232075 -51269 -27872
20126 -27872 -46048 -124131 39296 -36697 -11948 94039 -291353 53609 -29352 206116 344271
20115 344271 -195928 157012 -72858 -50077 59549 -280810 5421 89409 166501 49820 -348888
20103 80225 133498 -109317 -109315 161171 -7947 -44698 -411437 14145 -152660 -105110 -9972 -105328
20091 -105328 -310850 269710 81602 159643 -218877 -149816 147205 -148592 -252656 -224482
20081 -224482 8037 -25816 -55882 -97674 -49844 -85862 -481698 -210471 -400170 114684 -62967
20069 46657 137998 -108117 -279655 60343 -7381 -66611 -198671 -69303 -260777 -311694 276478
20057 184164 67899 243559 5094 -353477 186653 12747 -55544 -259 22896 -288996 -156255
20046 -156255 317851 59152 -211573 -86195 12894 29067 321571 139390 7220 347030 183435
20035 183435 -160150 -38223 312672 111702 119527 182298 124460 -230089 -194219 207110 -129062
20023 6157 123898 -182078 -124239 93741 -26587 186318 -221377 -34304 59523 -51964 89055
20011 -269562 -75336 31865 -375898 155616 45228 -327512 -121397 -204113 3167 -1744 -115787
20000 -115787 173805 132093 15141 -48768 181711 -189392 -191502 -96385 -83358 -89487 -22706
19988 -294746 -181059 -102699 -68056 53294 218247 -73115 -57860 249604 -105944 75902 108965
19977 108965 -169965 -212066 -261890 -149158 -159237 -100845 -102362 11960 -36160 218138 -320181
19965 129405 -376415 -6469 -266116 155930 -197376 -29846 584 -25480 84124 25226 -52234
19953 -127787 -150999 -203309 -65455 -137424 57525 39190 63848 -143757 -25401 -49395 -201809
19942 -201809 91839 142490 -119913 -114213 -184038 -89241 -140947 -122339 -61803 31190 -153699
19930 263974 239367 128767 99863 3355 -317075 -375581 22308 -142165 -180391 -20992 95284
19918 -17448 -295733 50803 81814 -162215 -68936 29515 -150309 -86774 -181366 -203066 96129
19906 61272 192009 -75536 94834 -379105 -61108 -260647 19145 -412523 -122135 34345 -258199
19894 -168626 1203 134760 -177614 -168310 -235069 15534 114648 217690 -35796 -23065 101858
19882 -99200 83880 140597 137551 -256890 -10594 263394 205081 -180277 -4967 145085 30198
19870 -111592 -136753 -504634 -125938 -153622 191666 -142663 -16123 108535 -98549 -150962
19860 -150962 -187670 223160 -97688 -11727 263888 -321066 27199 -185326 -110262 -35836 129197
19848 -130990 -267113 -132576 24660 -28571 -237472 27194 -21174 -374460 72241 -80399 -161702
19837 -161702 120712 71182 72016 110617 -410104 -77767 271214 119407 -13848 -202728 -233919
19826 -233919 85737 -93745 -25135 -36251 -78232 -111065 -145409 -114719 247214 241192 -6435 -145803
19814 -145803 92390 131322 -12279 -32666 -63523 54741 92949 -166812 158298 -112860 -16525
19802 283787 364957 -76871 -264197 187955 5516 25915 4041 287132 57257 -82999 223607
19790 138764 -511487 7964 -22293 96612 88846 63470 -476736 62617 206509 -132376 57374
19778 -203420 151349 105882 -75211 -98396 -125634 -262621 -110492 65157 318691 218215
19768 218215 -121136 52365 -332361 102832 -169228 51362 -223996 -329156 -47126 142214
19757 -344145 72530 -68 -235013 101301 -115927 297008 -218444 -132635 116450 204241 -214838
19745 176232 -149732 168481 71389 19222 -87255 729 72178 234162 -186295 -226736 91245
19733 -263007 -18536 117480 207250 111465 -286077 -82087 -164599 12472 -16509 -147288 -116897
19722 -116897 -82834 202065 -67086 17032 247461 52673 217575 -56699 114361 6261 155902
19711 155902 7568 61427 307160 -98149 58041 145034 32405 158180 -101582 24868 84504
19700 84504 60567 66998 10603 -65113 133968 87223 62972 20938 119143 20387 -78 -133976
19688 -133976 -344172 -49989 -268873 -190187 60358 -431746 174269 48256 -121768 -49577
19677 47305 -80113 -109662 -334721 -72124 -178885 -47433 -128504 -155326 -234572 218400 114706
19666 114706 -198933 -340050 -150645 245859 53430 -160675 -18791 -264307 -55358 -215774
19656 -215774 -135032 -75 -97180 -160446 -40678 -299104 -113725 -42583 -126340 -112563 376767
19644 -294174 -209644 -302717 323475 10638 -7102 -178514 95183 307060 -211321 -238303 -243933
19633 -243933 -125681 15052 -174418 -95428 -185343 -142521 -80932 -178755 -136327 110181 -20035
19621 -124208 -341605 54131 -302274 41066 -341537 -122627 -11195 19167 -183501 -141598
19611 -141598 278753 -261156 34728 -3303 -123435 -117223 5086 -100316 153563 75455 93501
19600 93501 245776 27177 -143261 101135 193613 118437 -157934 98415 -145643 -258515
19590 -258515 -133670 -420836 52680 22118 114358 13014 -301443 -231003 36255 118959 267257
19579 267257 7283 -182691 -205177 -164332 -27239 -159938 176727 -112155 -222026 -145893 72441
19567 28919 -181207 143191 192406 -77051 -220616 38139 95106 -37095 -158117 -139925 -63165
19555 -208478 6005 -178888 285535 -57187 -120381 -229170 67570 220299 -322593 -211320
19545 -211320 135336 107736 48566 -163932 87927 -30852 -60608 -31991 215919 -161310 -245780
19534 -245780 -308098 141472 -220905 -19796 26013 -128451 32228 -64028 244844 99300 157293
19523 157293 16947 -109664 -10250 2877 70278 128770 -325295 -54825 19776 -204427 205233
19511 -124888 -11823 -162196 -304266 176823 45186 -555974 -38706 36995 297732 -103315
19500 -152269 164619 -58194 -38309 -121899 -302392 98827 -155134 -80577 -59312 159071 -117864
19488 -193010 -113282 105838 88021 -191503 -46159 -121946 -121282 -150086 4213 321055 -341161
19476 -285334 190179 -115688 -31319 -253782 -449335 36908 -71400 38398 47682 -84343 27696
19464 46400 8683 -120269 10928 -222488 -212556 -190768 88389 -4132 -299714 -262998 -231111 -163631
19452 -163631 -93546 181622 -438840 199220 59053 12047 231418 -440952 -18189 -125310
19442 -125310 78102 -193301 -95789 -289375 50749 118874 -80507 -160648 46721 353370 -35991
19430 -59052 -126658 -211439 -44249 -153055 -50439 470568 -165984 96076 -189540 -128262 -6011
19418 -95762 131421 211092 -322565 475827 108363 90742 -291554 -81785 74117 204832
19408 204832 -142499 -308414 54512 50379 65027 221234 -133347 -103654 63493 -156339 -211397
19397 -211397 95775 95763 -147933 -104236 -140274 -277195 82456 120405 57456 234617 118177
19386 118177 -214240 98477 -45500 -305327 214873 -113351 6421 471166 -127713 -130129 -480738
19375 -480738 -41751 -20830 -34207 51400 -185393 -282358 227116 -106924 -36310 78243 -227113
19363 85875 75021 -71525 -256241 183739 318684 245443 38833 36472 -38483 -201567 1170
19351 87908 -237110 -326909 -134019 -24903 137868 -135719 -27966 -181400 -280912 -43681 -160713
19340 -160713 -218425 92427 -232043 -38607 -133906 -16543 -45734 -85988 -125403 -44245 -197620
19329 -197620 -49795 -72977 -322744 116296 -297061 -181856 -98689 -288405 -22602 113480
19318 -82794 258458 -24109 -113224 117028 59061 -237964 26881 -93321 33376 227064 70431
19306 -78617 -330795 60722 -131952 -426890 -233840 -11708 -103266 -142966 -103494 -258844 356679
19294 49500 -172523 157749 103381 -46580 -74417 134938 -76208 -386454 -205871 -197027 -228828
19283 -228828 -99360 41766 -390544 -562784 27734 -194416 -19831 252083 -19908 -560946
19273 -560946 27339 -260938 -140353 110206 -125899 -134139 -203294 -110742 -129834 -52903 -6603
19261 -100814 -333307 -168214 -300324 -9297 -72133 -34057 -7450 335240 10305 -127451 -22261
19249 -207792 287007 -57098 -268630 246596 -90966 -191618 -230296 -198585 -137236 -49735 -37437
19238 -37437 259466 -135279 45669 -254625 -147107 13214 -295839 169004 52061 -216711
19227 -154713 -218124 -85581 23451 -96122 70927 -283205 218523 -193119 -109871 49997 58873
19216 58873 -8308 49313 -133338 -257130 -207554 -174065 -119215 -109634 -231856 113584 57194
19205 57194 -110274 124143 -207043 55200 88686 147823 -68302 -337642 101611 29740 -153460
19193 175677 -285125 -143868 -227490 45811 32487 -102603 -3942 -2832 -313525 -96398 -239129
19182 -239129 -180474 -107097 378679 -219867 -69630 -8593 -51042 118661 -232069 -93285 -92544
19171 -92544 -120702 -70536 135059 -46085 -104476 -260744 -476 -48672 -196841 -215330 22133
19159 -135431 349349 -139615 -72821 38533 114811 -74965 -9972 -114489 10656 -299598 -150076
19148 -150076 -220461 121206 53306 24673 -107697 -232366 -58054 18108 -40196 -426650 73079
19136 -115163 111339 -478577 -241934 -199282 -66605 -103680 -87241 260488 -59163 -102645 20341
19124 40615 -113330 69275 -258802 117751 -144421 94504 -119312 -283224 36338 137633
19114 137633 -348955 92277 -210064 214001 -143265 -255053 117564 -384600 118866 302263
19104 302263 -73828 -213593 127949 205383 46587 30808 -114897 -298466 175599 -148369
19093 -206580 5644 123689 -60886 76916 -221444 -219935 -14901 -93789 -143660 -40902 -373365
19082 -373365 153719 -364406 291875 55139 102269 1876 -85016 -181977 -162661 87522 -93751
19070 -235447 67685 69149 67794 -42864 -182348 -224440 -267663 300309 194575 65986 -227610
19058 -202643 -342533 166652 -58641 -294116 -206691 25881 -201409 57656 -473502 -149627
19047 -385120 18798 352034 -300849 -250992 1622 -6045 -142606 38193 -93009 -8349 -9861 -66873
19035 -66873 -245689 42774 -336563 60588 79487 -113563 -193362 22446 78728 54114 -82020
19023 57326 143979 125138 32911 -67151 -171563 -105307 -222328 252611 18182 30134 66916
19012 66916 -106023 -242925 -144333 -32817 91193 -267025 97760 -42193 69148 54854 -22310
19000 -131872 -95191 6852 -173422 139790 -26113 -1289 16764 -208323 68358 -134029 -7063
18988 -27072 -82623 -96393 -157541 -427 -460722 -97691 -79858 -138049 -104218 -7888 -315828 -153419
18975 -156644 -134892 -63556 -35683 235154 -229877 212641 129489 -102833 90150 -11656 -105203
18964 -105203 -165841 -95872 10224 88883 -190993 -1945 126352 201673 185766 32048 -162259
18952 157220 43589 -58071 51007 85108 -140652 36132 -89208 -102656 -125246 -247209 230501
18940 -143865 -495866 -270826 -89467 37996 220451 -98895 -27354 177080 -333612 69819
18929 419320 -50958 -418800 38708 -142062 -23124 -199935 -47222 -127305 -51156 81327 -102580
18917 72780 -136417 -35238 8942 -186180 150993 8950 -175663 -344260 -233604 -140635 266211
18905 -15271 147535 109824 -78236 196368 1769 158101 -162244 -32308 -395684 191053 -183564
18893 178741 -174144 -247134 207803 404023 -229448 -22521 -108116 89114 -214794 158047
18882 2354 13989 -185606 19366 171953 167748 -110391 -388663 -37495 -76091 -115295 -388833
18871 -388833 1017 -7384 70059 138249 -90165 -317828 -215382 -19895 -16791 -127198 34894
18859 -145359 -66746 -83996 -6735 111658 -432665 -89832 -236501 133366 -130670 2089 -43839
18847 -166041 100519 148819 -55384 139786 -144055 -147924 -15439 -15194 -126783 -46193 69771
18835 14519 -189347 12218 -104169 182936 -277342 -109011 22350 -54657 -183588 -238672
18825 -238672 -26411 39171 215536 -11576 108414 110076 149729 139747 25625 -372966 -215941
18814 -215941 418098 -86120 175078 40754 -226171 145990 -86134 166999 -75774 -103209
18804 -103209 -52191 -152240 -223434 -183658 120468 187013 30596 -388016 72446 44462 -1883
18792 7730 -256034 84036 89711 -513457 -320976 -30181 40174 -137588 62979 -31023 -169025
18781 -169025 -264815 -103726 171181 165703 -105752 -128189 -82364 -124324 -143288 -354399 115910
18769 -277768 44852 -140255 49101 -167064 -1463 188958 -261480 1702 -240046 368051 213609
18758 213609 -25476 -166066 -86840 87516 -242930 -90002 338276 46593 130772 -221817 -283620
18747 -283620 -117577 36586 92356 -190595 -167278 -288444 -134810 -128592 -226936 -328383 -94772
18735 -54899 -129348 -51740 -126528 53473 41262 263491 -81060 -66077 -269109 -107944 -36657
18723 -74856 217788 -26382 13386 31286 -10614 59697 10711 259325 -108499 -276976 -441168
18712 -441168 -30060 88840 -293524 -146068 117446 -54709 -29319 -270379 -212765 -118973 -61231
18701 -61231 -148943 132772 54892 -408874 -54355 -296932 -166940 -66784 -432832 -350527 -160323
18689 -283735 -270582 -428602 108601 -67675 -45282 -30477 -1693 -45497 255799 116165 -60715
18677 286079 -233842 210833 -144515 172234 -279792 79113 -55957 -176091 -2752 -26437
18667 -26437 -79135 39015 -121966 -327342 50702 136332 63339 -271547 89220 -114094 342573
18655 -55486 -75751 -227401 301296 151686 -129273 -119559 -104774 71925 26845 183165 -362502
18643 -50334 117252 126967 56827 34923 19033 -43413 -248702 -49102 -151605 -209125 170736
18631 -144776 -231724 -184942 -98635 -73511 1294 -280384 -240682 104364 53187 -260666 105403
18619 -69050 -94621 -294730 39159 -71835 142746 -311580 -208899 -96699 25033 172798 2132
18607 33961 9087 -205695 -117868 80825 95004 8319 -71795 71611 84745 -104096 42084 134318
18595 134318 223835 46792 -134308 42808 -95034 98506 -51085 -254314 -42260 285196 345033
18584 345033 87616 -22196 -101271 67465 -133610 14113 102746 -86201 -341083 183491 -104647
18572 -12767 -156521 32051 224253 -82469 -13153 -26539 110423 -164050 -66590 85699 74509
18561 74509 -74485 -217223 -176388 -86964 38096 -251227 121689 -134655 92638 -254285 -310688
18550 -310688 -405882 -132884 37142 -21709 -218143 -183565 -64025 -19494 87267 307397 19058
18538 66220 79224 49064 -27482 -14339 18354 6092 -71352 145859 -9080 304157 -88902 -7392
18525 -312074 139197 216346 45686 177733 -174044 -14990 -136382 -27827 223110 149084
18515 149084 204358 77228 133398 -175186 -253827 -268084 -113851 -292420 -3677 74419 54051
18504 54051 -48144 20910 -165941 76359 296743 -77521 237871 191398 -227023 -81948 -187176
18493 -187176 -311557 -131566 -12414 -226010 -284004 164377 2291 9502 178588 -65067 247004
18481 -206461 -126558 -296747 -105163 -272550 -197731 -189570 -401647 132690 -152907 162078
18470 133682 -205618 9439 140387 -75915 -291086 113888 -171723 59712 16108 -159948
18459 -58051 233594 -228481 89062 149538 -237141 -385604 -145352 -291630 -15789 -105584
18449 -105584 131662 105737 258986 184443 -189364 100202 -297405 4171 -61704 271288
18438 11267 -251647 -113223 -94232 -165825 105046 -129100 81826 187397 -41637 88303 -151360
18426 -11349 43040 160360 -119530 -152325 -259964 -254085 -29222 -436315 -55218 -225227 192720
18414 -168847 78298 121246 270942 -174383 -89394 97047 40669 -42418 155416 9646 -197549
18402 -69502 11038 64926 -182552 -130372 29894 -79799 -62439 -4249 -17705 -143876 -279938
18391 -279938 -16908 392225 101674 -124040 -31912 16231 -351979 172482 -46612 -211264
18381 -211264 4976 8686 181939 -182617 95301 124016 -28034 73237 -61293 -10122 91567
18369 -97579 150605 302614 -110254 129331 -72361 -271605 582 -16254 -98410 -221234 122927
18357 210712 -75114 51404 -109263 -168843 -68203 80962 142678 17698 9371 -201786 216977
18345 -119665 -5505 26337 -97507 129248 -143458 97112 -309338 -103998 3384 -60628 -85985
18334 -85985 148402 -258719 -310215 -160089 162909 -12235 26125 -219914 74583 -43904 -68257
18323 -68257 228353 -138628 80281 -124409 -254933 -138025 90569 -211849 -191787 -44188
18312 2635 146598 229156 -73270 -20788 -136160 168150 -237320 65092 194498 -84155 -39809
18300 31710 62406 -177112 -185158 -45414 -169851 67250 14589 -398640 -268160 -162563 15833
18288 136322 114592 928 67364 126375 30202 -170868 -275259 167053 -93380 -163115 -35387
18276 -64240 -91918 -34555 142601 225213 -208029 -72989 -356782 48960 139857 314549 -270240
18264 224143 219249 81169 89570 136936 173422 125848 -91214 -8610 239260 -169361 64872 -200754
18251 -70527 74007 -27009 -33039 175552 -200169 245592 -118848 213410 -84105 -88886 -96857
18240 -96857 22423 -277852 -474942 -151390 121616 91243 -356159 40375 -166315 -116784
18230 -116784 -64239 -212527 19960 -31507 -260077 53512 105670 -88832 -281793 64762 6472
18218 17861 -233223 118641 -124823 -64834 -18868 -109448 -32722 97295 -250024 29515 167477
18207 167477 -107871 -3343 -269021 -98836 -91392 59897 -274609 -193861 -172304 82658 77530
18196 77530 85160 42751 -221254 -107298 88394 -76729 61671 277044 -125977 -127229 -74658
18185 -74658 -179347 -54619 259559 6128 163232 143502 -83340 -25198 -148694 -54747 -228120
18174 -228120 -113129 -8719 348944 25907 -323139 126152 47302 204895 179412 -116197
18163 54004 -164581 -1476 -91980 -128272 -82760 -170186 28313 -60578 -174913 -44584 -98293
18152 -98293 57244 -29597 -59545 -307063 195772 -163010 57270 -125541 -266278 158231
18141 -190836 155430 -221355 125810 181115 -296378 -94391 -1491 -180518 -29457 10026 -88196
18129 -264564 -60250 -5046 240924 -25050 198858 198354 87314 160861 60200 201436 -76427
18117 -42384 49188 -84172 32149 7064 196233 -198430 -110941 357369 145713 -193054 -105268
18106 -105268 -131789 159761 -125826 36588 261488 99671 -390895 -34423 -44102 6080 -83790
18094 -69435 -145179 64298 -28807 -93326 225298 117643 -143626 -157663 -34184 52126 84549
18083 84549 27805 -256848 -213515 -929 -13714 215881 7394 -83779 -36680 -450163 -21948 35153
18070 -57716 -179162 -119144 26011 235652 -134549 -80172 -459629 136338 -340962 -55498
18059 79531 178284 -99552 127414 -82260 1449 -164019 -15351 59134 281640 -137110 62826
18047 479018 -300675 21509 -111824 34107 160214 131576 107516 49418 -95437 12149 186917
18036 186917 -263731 241545 113053 19353 -157687 -7910 -357517 -210257 -32661 122461
18025 91618 167148 -132026 -69443 143733 -326031 -39278 -246821 -277755 176434 7879 -230599
18013 -277330 -319013 -82820 -186167 213730 -50868 -150561 -345007 17034 221884 303887 -117782
18001 -301232 233335 -138440 -4701 164621 29029 -33746 -215135 -148501 -219866 -152192 -157060
17990 -157060 7205 240903 186092 -991 -48971 -223452 163158 -19469 -127859 -65426 -312672
17979 -312672 95411 26481 -109310 130600 170754 64804 -274531 -104524 176656 1011 19431
17968 19431 114511 200513 262561 -33223 -104392 -230686 -175088 -141338 46459 106528 207695
17957 207695 228297 -87964 -23826 -17959 -11872 -42640 128015 -141589 66000 141332 43388
17945 -104003 -53393 -168484 154600 -81549 -9820 160006 83112 260921 -196411 312 223791
17934 223791 393 137816 27913 -291603 57134 -103259 -160205 -86650 149064 -80341 -558470
17923 -558470 107417 102417 49861 -340236 261475 12298 -169688 -126449 118718 -267616
17912 -222086 -149637 100199 -278098 113221 191468 -36920 137146 122582 65368 31363 177605
17901 177605 165773 -54535 61876 12528 27572 13239 213666 -18759 -146266 78969 -174816
17889 157796 -3741 -75020 -133186 -235411 50735 -84959 136940 140329 -93381 214119 5437
17877 85577 87326 128766 -155632 229109 199233 -205482 -345496 7142 153573 356524 -104085
17865 -43417 -89921 58516 -137168 293696 43839 247732 -73812 7120 -123583 100719 -49239
17853 -178462 393064 -366987 193616 83821 239026 -48734 -22810 4120 -190117 91873 49852
17842 49852 -95959 91859 9881 -184866 170459 47250 263615 192086 -179078 -166824 -180947
17831 -180947 -93327 192764 85207 17002 41489 -13520 -184703 206742 193000 -127461 125213
17819 97945 303674 79372 -132855 128546 -211277 192240 -120643 -70250 -165113 -168807 -93350
17808 -93350 -160372 -9770 16991 -236224 -30224 121196 246080 -35941 212661 173362 248770
17797 248770 85266 -227272 -78975 10107 90620 208420 -206243 230323 -208291 -43124
17786 -17107 190752 271138 88046 45012 -22217 36534 127463 206915 -323112 96166 182944
17775 182944 -83499 190061 -11447 -48765 386618 271691 268786 51936 40350 273436 203471
17764 203471 3599 368057 -47056 -231252 -47448 1065 203553 -43134 -239709 -233326 -64092
17752 128990 -435699 -203761 34416 113002 -60204 -104032 -115331 20389 -190838 141705 242561
17741 242561 -72827 170072 141468 -69933 436333 -325332 -295951 -132952 52473 107750 321412
17730 321412 -129939 -105688 -153701 168082 162852 -98443 101655 124192 -52207 207897 109210
17719 109210 51218 119277 61601 -81410 -173201 -38985 121119 -102502 -95842 461409 144082
17707 -76916 169904 163715 80085 415048 23577 204028 -151194 222112 14984 -354037 115959
17695 129533 -144724 -56393 59637 -220519 137171 -178013 379642 -145460 -138892 173212
17684 38044 288131 18597 106463 206091 57965 25739 -103 76446 67003 237683 144696 -39583
17671 -66674 285667 -226266 72962 36432 -97382 -117581 380102 302817 72869 33918 -46000
17659 -235011 229748 -9848 123089 -105429 -341391 -137410 142871 176642 280521 -79073
17648 81557 -164995 -27667 -23851 542797 58720 336472 -24857 -262942 245259 338643 -174927
17636 -440905 -16502 36200 87179 90350 -199897 -254673 134454 18273 62714 37648 78525
17625 78525 -205183 -75912 134924 -85832 604510 25533 65963 -344364 345860 -107697
17614 256321 -42346 27505 31630 177333 -10399 125599 -195650 54520 160904 156448 -458065
17602 245280 -102918 166883 356694 -22286 -71304 -68955 26734 35143 11843 -136035 -43150
17590 133164 305573 222480 -10855 -18354 205902 112932 64441 83899 29377 -100535 249966
17578 206455 222002 19691 -5488 -90037 168506 62208 288609 -109205 -126010 88596 16198
17566 371547 363385 71414 157414 103662 19711 338172 178959 -58607 81087 -245349 36831
17554 420643 179438 24719 -145894 59743 86176 17542 -140264 -129984 47001 211580 360361
17543 360361 23987 483593 208435 63763 31932 190989 278418 241906 298267 77614 318895
17532 318895 8987 -159047 -123297 205407 175412 166740 143373 -56414 501694 362973 324717
17521 324717 504136 6230 101213 298030 161751 -2474 -113745 -57732 233709 276276 111198
17509 120443 340780 279875 389330 -135921 122354 24211 289762 245856 5962 -104318
17498 355445 174518 110697 242347 22016 326518 100593 250871 56597 37012 -4024 40093
17486 256280 366168 7558 79953 273065 -182417 74895 -245661 255984 -169515 -127473
17476 -127473 -12222 109075 391645 32733 219777 200416 -43962 236124 281063 50300 120745
17465 120745 264353 205460 143117 -37312 321976 -80341 239475 67385 495383 46766 141636
17454 141636 226863 395028 178709 -38276 -170255 313968 99157 337936 309714 201286
17444 201286 18690 209732 173806 -11942 -29059 478138 330976 207111 295340 276855 287324
17433 287324 105549 -55058 104480 65572 243846 437892 148118 320049 358140 249670
17423 249670 482691 350396 413862 -4857 232344 123919 242089 274712 269229 515283 35051
17411 157154 144590 214897 397453 67792 238231 395997 212571 252571 83009 278541
17401 278541 146578 139278 -94653 104589 151762 434862 167589 289373 116045 204914
17391 204914 187171 262208 190504 82899 60267 140554 33191 212887 263482 293973 79262
17379 199678 284594 150066 -84005 124129 75316 30884 73224 76697 364577 49113 172136
17368 172136 275348 350919 294589 263792 327411 67754 -41142 -57934 317469 -43652 -41230
17357 -41230 122547 384849 141101 34767 122413 221199 -76550 268812 360769 218922 387196
17346 387196 -191517 180944 286812 362233 284805 398804 163510 151124 25345 32584 355104
17335 355104 320531 43166 242993 225874 374745 166716 72411 324877 190102 185045 193853
17324 193853 331022 143976 189250 226976 12870 59872 262865 -10290 320495 303271 -112046
17312 331983 162182 186463 273299 -87386 387383 517173 43840 523798 417141 145651
17301 422151 -101135 146562 586686 -73138 317951 385300 137090 218896 212573 255958 121062
17289 276829 300721 110810 207017 20999 335415 68404 128347 164014 388338 49266 428824
17278 428824 242395 469788 101255 503232 322180 180691 466505 193202 93552 185928
17268 185928 -4634 202096 38532 186929 206835 305964 482088 316485 235919 115793 -7898
17256 133623 283213 163707 36905 420488 411184 341949 257238 -60112 117079 374548 -112314
17244 197819 322827 403464 234738 432409 178544 188945 147243 370218 233540 130365
17234 130365 196449 228097 234051 282585 36598 145588 334783 14523 516641 317296 299721
17223 299721 338869 602099 114060 255890 45663 235273 241275 232224 435269 204381 225519
17212 225519 203346 502541 335885 384310 315282 146749 300681 580473 307354 195291
17202 195291 290998 321460 196559 364130 227586 504181 231017 476732 399901 267717
17192 267717 509327 373249 163180 186950 485447 497389 426292 375158 573093 279276
17181 123533 204235 328073 155421 211831 298731 125407 359625 355200 197057 127203 393992
17170 393992 200509 613458 272298 519341 296502 229855 -50505 203724 698989 320271
17159 443589 405205 168949 170794 426937 361742 110175 515310 531222 379556 196818
17149 196818 358782 536454 662029 303698 267278 487148 242178 399614 181341 415263
17139 415263 186540 647297 216690 425155 921103 222406 441489 732722 488421 165651
17128 436894 236266 367639 464759 380904 252611 679715 693651 355032 372006 428557
17118 428557 192361 299784 644003 632970 286122 273616 487320 512039 523890 194556
17107 599478 602077 122919 267007 575004 588656 786254 598819 417421 869826 702577
17097 702577 438135 25618 400885 570390 550463 671885 412386 512203 897748 319700
17086 592538 740205 617361 527171 618590 268739 748253 880577 459897 714991 535624
17076 535624 687679 332327 615477 451375 471000 717197 580831 820341 637880 582568
17066 582568 927786 517346 588117 637817 645873 576030 802794 1024273 728577 892671
17056 892671 513127 737718 671279 768666 617489 659472 975436 433260 579468 1004730
17046 1004730 433019 709974 424419 645879 722855 786630 688281 856019 946730 533763
17036 533763 962920 736472 826840 980823 679663 451921 807942 1073431 579915 677826
17026 677826 1116164 1151492 831257 788648 746551 926333 944764 896312 572175 868511
17016 868511 875707 1058428 1002186 803142 752850 1324288 1032311 734252 899902 1052176
17006 1052176 1077305 863674 983216 1160064 869669 934961 1137660 944431 943859 1117390
16996 1117390 1049410 1258539 1251880 869006 936148 917517 1056159 1018276 1348517 1092069
16986 1092069 1099722 822567 1016317 1181595 1180842 1003729 1375385 1076991 1035164 1246154
16976 1246154 1111675 1107068 1239049 1262399 1375063 1150971 1271155 932319 1436752 1232810
16966 1232810 1488094 1090738 1428987 1258406 1437194 1552562 1379249 1496199 1343161
16957 1343161 1279370 1458165 1410205 1220933 1338974 1543733 1506097 1395927 1630233 1499361
16947 1499361 1275093 1366818 1629672 1787847 1415872 1447345 1793789 1864507 1690558 1629763
16937 1629763 1771551 1628839 1753620 1776323 1966100 1799690 1885792 1891132 1702741 1654281
16927 1654281 1880422 1907178 1948706 2070448 1748720 2094394 1917620 1990525 1879938 2351809
16917 2351809 2190702 2123082 2176633 2393680 2084513 2342760 2105093 2412945 2511044 2468385
16907 2468385 2328044 2099873 2361542 2316995 2222664 2451499 2604814 2769875 2473973 2936654
16897 2936654 2431585 2579758 2550539 2815248 2743192 2611792 2850810 2907262 2862606 2969928
16887 2969928 2986219 3111742 3214939 3282237 2990028 3065094 3406490 3076236 3326774 3606686
16877 3606686 3485900 3724763 3504613 3315212 3742877 3324319 3830166 3542774 3978103
16868 3978103 3706060 3850337 3812312 4073302 3768321 4063973 4198492 4260601 4036375 4378313
16858 4378313 4364446 4224603 4390530 4695935 4543178 4594705 4577810 4861316 5084947 5071219
16848 5071219 5157204 5065023 5211538 5661985 5676070 5590966 5448477 5549503 5865073 5789258
16838 5789258 5943667 5929423 6154894 6352413 6428659 6668773 6697505 6885510 6766594 7012644
16828 7012644 7184975 7309901 7528344 7470402 7700392 7955187 7735473 8129555 8466883 8438612
16818 8438612 8543653 8817041 9081448 9081787 9273737 9493557 10157449 9887846 10113545 10328872
16808 10328872 10490783 10947866 10901462 11589899 11289303 12257938 12240437 12381695 12814923 13276943
16798 13276943 13184801 13668344 13933549 14427665 14688179 15274522 15476759 15619425 16282897
16789 16282897 16855404 16992294 17756699 18139127 18742326 18929215 19342549 20113030 20542864
16780 20542864 21198130 21657609 22165098 22954978 23743222 24301694 25298466 25819052 26648251
16771 26648251 27786178 28341971 29296780 30368528 31058246 32182203 33256666 34540931
16763 34540931 35516567 37105254 37932373 39258327 40664266 41901755 43473467 44839529
16755 44839529 46304666 48170395 49815327 51892008 53397543 55286505 57375122 59516170
16747 59516170 61423620 63615319 66094425 68141532 70470331 73017904 75817900 77955489
16739 77955489 80444764 83047793 85877404 88002763 90495274 93217663 95427352 97814438
16731 97814438 100091480 102352975 104209517 105914694 107759870 109174244 110319256 111050237
16723 111050237 111998351 112302716 112621630 112225433 112084445 111309758 110519762 109213014 107805005
16714 107805005 106382964 104733241 102591881 100244073 98151131 96104607 93836999 91011518
16706 91011518 88850108 85932165 83334790 80756225 78615866 75991571 73651330 70989648
16698 70989648 68605149 66034401 64158874 61946847 59945080 57718350 55683930 53890384
16690 53890384 52387860 50396863 48729941 47094490 45756138 43983416 42620510 41154437
16682 41154437 40042957 38251795 37317938 35941791 34744054 33647536 32615200 31577669
16674 31577669 30634527 29775776 28730091 28218188 27276821 26304007 26168054 24995522 24328876
16665 24328876 23779163 22980665 22180008 21505981 21229166 20641334 20199340 19413994 18728452
16656 18728452 18916719 18093088 17867295 17065701 16902127 16528167 16022623 15461964 15238607
16647 15238607 14630156 14425991 14189094 13994028 13716258 13146834 12894595 12856311 12586330
16638 12586330 12109567 11962682 11858429 11408626 11473668 11421027 10997086 10546597 10331312 9874292
16628 9874292 10104462 9907944 9452355 9718843 9521458 9257381 9077311 8926433 8301322
16619 8301322 8407229 8317061 7922057 8155725 7949714 7617355 7484807 7459347 7615654 7420582
16609 7420582 7247256 6805657 7007421 6950311 6589999 6784736 6312117 6340260 6355065 6586196
16599 6586196 5989565 6160670 6316545 5707596 6014110 5729839 5565633 5532306 5659634 5519551
16589 5519551 5277400 5178129 5288035 4887559 5079968 5007312 4881789 4644158 4938256 4599624
16579 4599624 4843385 4446634 4579727 4389073 4275980 4299630 4239829 4458458 4214884 3967642
16569 3967642 3938730 4153867 4101131 4046540 4073785 3825929 3622845 3678034 3434873 3799427
16559 3799427 3407252 3659836 3521892 3409896 3506430 3477870 3596085 3289964 3562597 3264317
16549 3264317 3194485 3180678 3205919 3012994 3049236 2926208 2903532 2686372 3005287 2754101
16539 2754101 2749085 3300730 2912501 2912230 2878007 2894962 2725020 2665914 2587723 2692506 2525151
16528 2525151 2501816 2867915 2514091 2384326 2363930 2531662 2353741 2514195 2147406 2325968
16518 2325968 2385321 2255551 2055412 2433373 1951137 2539366 2194936 2341058 2210309 2320208
16508 2320208 2327914 2090002 2207081 2150262 2150370 2437416 2080123 1961306 1887313 2147389 2167220
16497 2167220 2056043 2107583 1978805 1755027 1939360 1783228 1967615 1789706 1881868 1861583
16487 1861583 1875720 1965857 1503339 1807368 1888031 1643533 1671675 1867849 1847450 1771763
16477 1771763 1739542 1476338 1635639 1561978 1693820 1794977 1637321 1541542 1769352 1517457
16467 1517457 1610729 1639170 1244044 1256309 1523172 1545785 1388018 1588871 1602144 1663565
16457 1663565 1709398 1667446 1244769 1587245 1643561 1388373 1165485 1218294 1183325 1560026
16447 1560026 1456640 1341850 1130170 1333481 1289629 1192620 1433222 1362268 1256503 1405051
16437 1405051 1118885 1352899 1377652 1223292 1128822 1386963 1181736 1273616 1271116 1122424
16427 1122424 1016206 992296 1173585 911803 735725 1022486 930820 882692 884628 1058965
16417 1058965 1126722 1065580 982044 1019939 742397 883240 600137 1542076 937473 1080279
16407 1080279 1016881 1044296 1110302 1046850 889580 1029930 966555 793530 736659 878922
16397 878922 956048 1006550 1071252 767469 994470 916119 966218 736578 1081128 941849
16387 941849 924979 1103439 755890 663555 819708 570581 973185 626728 1015588 1205538
16377 1205538 761826 1131487 591682 859420 748623 883560 701564 809410 484724
16368 484724 1041242 491377 821469 730948 733486 769582 924464 710722 696011 574759
16358 574759 1002702 672900 912570 487760 830259 764879 697213 774559 697664 782772
16348 782772 593554 710121 813997 986005 845513 998497 665709 653213 586672 669046
16338 669046 233037 499807 623447 737088 592659 537474 838898 765361 764169 613323
16328 613323 372230 822589 484056 541244 611851 410063 573021 1025988 647910 572066
16318 572066 488923 773931 780871 488842 553641 692675 318660 316524 528851 521583 782390
16307 782390 683464 491396 856511 742958 512061 242538 655011 716073 411772 368753
16297 368753 515188 429385 567524 915367 546737 716201 511549 628146 509568 544631
16287 544631 505083 280610 584754 670272 585760 551309 380245 753722 316009 707238
16277 707238 457958 459901 602073 264396 496910 451201 670572 259198 242496 251116 338371
16266 338371 570769 541966 462046 644593 370773 599769 608052 404406 455570 474446 462948
16255 462948 429916 184391 666693 427458 560221 135822 296739 401535 249873 383883
16245 383883 108524 350736 487493 426538 317077 522885 488035 158012 328417 609896
16235 609896 424238 252306 435139 540170 339816 388930 302636 310263 341521 386653 267360
16224 267360 413768 124947 220236 196719 356222 226251 391805 235880 403539 520523
16214 520523 477452 203043 459978 475148 198815 178224 78060 216801 475791 688881
16204 688881 147111 527426 344044 714787 314630 303627 10709 109712 339471 433555
16194 433555 310615 -120641 807519 41538 492854 267945 357734 64846 99822 394423
16184 394423 312461 160746 419200 357338 376260 220996 232237 183809 352220 286038 257860
16173 257860 194619 191376 129862 11240 349221 265351 62039 321730 237004 239890 482549
16162 482549 332883 14293 439313 321790 198109 414088 123592 153439 452245 470888
16152 470888 351400 400834 139715 271561 373602 93479 283797 334952 146865 62523
16141 340529 205952 420279 238373 113052 235885 90812 271497 -64448 60559 140217
16131 140217 309242 128508 213470 -215606 47169 167819 193772 224214 78371 132871 140940
16120 140940 -65797 179815 36284 162128 135347 25875 112496 118992 504039 38297 244668
16109 244668 201963 113359 -222859 292608 -10065 315219 157758 721075 261175 363326
16099 363326 225487 330264 -86841 46380 349074 309768 418213 364986 23092 349525
16089 349525 18239 43243 -116152 -59395 216109 -22950 139321 190469 139794 362509 198386
16078 198386 90047 129536 210804 377539 7712 143622 174477 47388 25245 207732 -228607
16066 194689 -11979 -137107 102986 -26646 126643 217024 200136 6777 38016 -44733 -69458
16055 -69458 -21037 180033 155468 142766 206027 216620 294707 172357 -46529 96336 -65810
16043 15204 35673 17021 232867 113713 253780 143237 369993 172139 263131 -37071
16032 15809 184060 130735 -19621 -174151 517677 -45763 192187 -218531 -195863 179080
16021 206337 90712 113550 183473 222284 -54319 33387 -187892 -322269 -191916 -160240 102621
16009 -67182 458481 -8232 27231 68331 156914 -96942 28465 201850 262857 34528 152377
15998 152377 115750 20379 -23291 132483 53821 63589 135295 61647 -16813 32738 455375
15987 455375 461874 470135 530189 412892 403879 293677 172396 236488 1006 -183038 10763
15975 29667 164131 110102 -149788 -51827 -72699 14956 -73498 -29345 24552 -359081 217494
15963 -96925 -97272 -4176 65849 109410 43950 -30329 290666 292694 377716 -18643 -11725 271695
15950 125167 -115911 366116 147620 -100640 314638 -141922 10280 52803 313349 -169718
15939 -132202 -67945 -81557 130973 171605 30934 93082 -167944 68958 151426 -63654 435279
15927 63739 50693 259946 -41779 -162987 25934 79271 83825 163175 106385 144717 189361
15916 189361 -85822 -90573 88288 -137836 -97245 443810 134478 148105 127539 245427 128656
15905 128656 -158642 156649 110904 -6062 153804 -77013 -78253 183352 17170 362282 -7896
15893 69199 128788 -163363 -139945 -124837 -166592 88264 28150 152572 -16895 249898 -90329
15881 -50213 693 98228 5931 3215 432782 -123820 -72929 335812 63789 218895 81729 -182139
15868 8415 84609 355959 -267078 42718 -110614 107508 -38731 19693 152055 -39514 204586
15856 -160214 -83639 198472 -89617 -43555 219077 -124815 -82388 -163917 -250027 -147498 -192607
15845 -192607 -406654 126145 14601 80000 -242143 368355 233750 23733 -212245 -52770
15834 151712 33541 72505 -13322 -102478 65650 165307 -59856 -280250 -157792 105841 24925
15822 -32433 -105214 78330 -259764 -83272 10788 -313119 226254 -231439 103695 -94143 172944
15810 130387 -39958 20633 -244279 -37816 -32182 117885 -63278 123500 66397 8690 51615
15799 51615 -120751 9674 233572 -293879 -223733 127678 -158869 -355877 41883 -289124
15788 168518 -192370 -38364 106601 -68262 144104 227570 100209 -85526 56605 47798 64913
15777 64913 106615 132081 38813 150567 -271007 152345 71686 -202985 32432 -223025 51466
15765 -145717 -199810 -453131 -60511 -83656 -18476 114395 74007 -47994 154104 88572 -193056
15753 -179667 240721 104471 -102613 158705 191361 -30694 221509 308206 -127328 90118
15742 -300747 -288763 -232594 -94614 -15078 -222435 -53000 382176 -59582 -181292 -72822 -223079
15731 -223079 102397 62479 -24341 -20919 55371 370305 -265918 -205934 58634 -62439 123975
15719 -140896 -155021 44146 -105224 25814 125169 -164580 -145547 -3535 23778 280256 -197392
15707 69507 -190280 -180072 -152033 -100759 18760 49539 -232672 -187642 -164051 342574 285398
15696 285398 -168084 39511 -57789 120195 9021 53722 -21044 205521 310322 -166277 257124
15684 -182255 -10881 -307502 -173221 26864 49130 253695 -2751 76853 -37498 171334 7806
15672 328381 204576 -48478 218988 5510 183081 -74028 -319966 124155 198316 162962 102483
15661 102483 -110451 31256 -143567 93076 -97427 -207003 -33563 -74359 -87151 362591 -141941
15649 -311300 -40242 -28368 -341436 -141165 -168507 22829 -118007 -193250 133732 105060 -348617
15637 -67062 165459 -30797 -389247 -241147 -277125 95043 -128398 100404 70540 -169032
15626 -113004 -39855 -129488 27165 -84905 -122936 67893 -72694 -541215 -143127 -97527 51468
15614 -140732 4692 -127969 -115239 -448132 41430 -87176 -11865 383772 -338414 -189534 172369
15602 -173907 68150 -141914 88736 25622 -103122 -103849 31791 -107180 -12317 31300 -208176
15590 -225369 -229654 -119056 9548 -103449 -175156 135732 19145 -164401 -145122 164240 -68500
15578 -147015 232512 2814 -183193 -164404 394435 -228888 115564 134278 144117 366299 -80645
15566 -281913 -49939 183573 182325 -74152 82722 -158943 -296487 134150 -491054 117228
15555 -14196 -154495 56425 10088 -44376 34921 -3781 69279 -153161 426333 -142140 175889
15543 15460 76562 -65032 110835 -25186 67493 19746 -67435 90566 -38884 -58746 -82568
15532 -82568 -199117 324933 -21995 -151604 -46066 -27635 211269 -187411 -38410 -105350 -175686
15521 -175686 -278191 190677 26395 -70668 -177452 247031 209148 -127203 23917 -9309 -53078
15510 -53078 103211 18507 -378185 -116313 51227 86316 59261 61959 1114 124600 -110125
15498 -118504 -123106 94958 -85058 -65153 191479 215763 -352414 23370 -149704 -82810 332353
15486 -92636 -201657 -63029 -231949 26166 -84808 205056 215603 -52102 100712 3509 194101
15475 194101 -19839 7966 138103 83056 -169899 311340 -3410 272984 -30488 277282 116965
15463 187039 164726 130648 37668 -60605 210867 87854 -33491 -127408 11536 111799 12737
15451 -82021 -269922 179006 -166297 66574 -73559 -64251 16162 -30409 101562 136576 114245
15440 114245 333773 135258 -67583 -57802 -185196 -9340 -270385 192635 102688 -58490 -30918
15429 -30918 -201219 -81274 -7252 81840 129384 -236182 -120505 169791 -89353 -112073 671
15417 70277 148400 -152485 140021 -66734 116179 -128258 131795 120540 -33920 -1252 66573
15405 57221 238647 -132806 -81485 -7104 212418 -94271 -39328 -177299 -253207 158544 -103125
15393 56510 333474 34715 -167158 145161 -211282 146379 55779 -202547 44169 275046
15383 275046 73463 -160265 -44394 98112 246464 87186 278997 -92837 164190 61224 -118044
15371 310842 -10772 -241944 50644 111838 165984 21186 205826 182797 -33467 678 -257787
15359 92884 179831 120763 162852 -178738 -18294 192128 -18315 -689 109043 304836 62479
15347 -98529 -15791 -22891 25389 212251 242365 -61285 36137 -185359 101388 27030 38063
15336 38063 112874 156320 -244147 66484 164557 86325 -221627 -78856 36434 124903 -122477
15324 127300 59320 -81904 119559 472138 -57541 39821 260165 153120 229417 76039 -105630
15312 169461 -58727 329514 289081 -46952 157859 208937 33893 47228 141262 204996 -121934
15300 30467 126089 -228233 -91519 283327 210402 -4044 -17792 -33178 231448 344794 1472
15288 50923 20269 231036 49915 258685 93240 248718 71627 263887 -212722 -295465 1726
15276 44486 -47627 18692 140002 187668 120412 -37780 73640 -224554 -57423 228126 228148 -43285
15263 -288381 70553 341781 -307616 109916 39836 -301843 -95712 16867 342312 165528
15252 378675 270733 828679 1091275 726526 1044929 546913 137873 35842 252342 -85135
15241 133656 364131 -161539 11787 -186305 -11920 143822 -240291 299707 -255688 134607
15230 -38076 215503 -93806 -294898 -2161 -153484 73887 183502 373270 227272 235099 175165
15219 175165 73423 27605 309233 -96376 129231 77209 294583 19679 -37109 -349208 80789
15207 -75553 615282 -114719 4349 26731 69411 335818 -31449 192696 188419 115776 142312
15196 142312 -54746 96687 -101183 29537 171723 158518 44768 249412 70139 127537 -67535
15184 25127 126323 -1803 93569 100747 -51355 -288733 56324 131768 -177678 44868 48144 40711
15172 40711 83306 294220 177915 -103567 67532 10312 -63674 363588 49780 42891 90462
15161 90462 -20063 17465 -48775 -63042 234710 -195727 200780 375444 82684 64588 263885
15150 263885 330620 291063 118422 237975 185056 451430 98152 -268767 108083 -210160
15139 196631 -1851 107486 133221 418803 34954 47097 110441 147374 78138 -342386 27788
15127 329853 130864 48167 269779 200991 76135 103695 -66312 120918 296293 228024 111325
15115 -16158 -355701 316517 -68279 244794 132509 336599 -231221 172448 207143 438701
15105 438701 307202 95214 375741 -34170 28129 -31617 173210 18892 -105501 2326 34659
15094 34659 87626 104117 90839 -169407 326033 118332 265269 -91886 72827 109287 290073
15083 290073 -186133 177729 379834 -34501 292393 235337 249271 75605 158911 390196
15073 390196 64383 -396732 -87218 -49126 200532 64324 54146 289892 -38517 -65559 448703
15061 41012 -9880 57848 -138314 74173 321223 113883 -103432 244969 475564 174347
15050 112175 86014 231149 232820 86288 344289 218557 394024 235868 282381 52279 109956
15039 109956 311135 -93237 514216 192136 309310 304298 7909 497572 17167 194308 102803
15028 102803 193573 339326 9149 177856 613436 59155 94820 44229 340777 359882 -26919
15016 274353 -55149 222592 528501 125750 329965 296224 -15403 439170 225949 221453
15006 221453 303494 29709 -102465 482463 175426 262817 160303 74260 175377 230825
14996 230825 272699 232149 107630 179570 166554 151192 228382 -69891 273101 176589 254923
14985 254923 217897 421638 110030 131497 114372 418450 94816 254276 316248 128878
14974 487702 316603 650865 588786 340213 323526 212793 265754 466709 604416 206893
14963 391923 508787 484114 225077 417370 447101 -74378 289475 414788 532304 371607
14953 371607 483555 360384 657264 119073 172993 444442 230168 278594 103860 396211
14943 396211 455834 385191 561988 61468 664100 323185 500069 390788 396514 310099 412710
14932 412710 185575 248060 428922 502074 69091 146753 114322 287377 377868 358796 408571
14921 408571 282081 194754 512718 350072 329341 360987 464346 775609 175794 587787
14911 587787 388688 469643 634859 568150 436493 518367 141313 455387 565646 126421
14900 382088 -6769 308881 728426 120312 216073 214977 130433 142297 377652 463633 339239
14889 339239 116946 381557 186647 287701 242017 658542 237567 314175 355380 620963
14879 620963 611014 285475 406429 564119 470751 417317 291777 203946 342411 193093
14869 193093 391677 483541 530161 294948 267927 290261 184004 217610 469090 310216
14859 310216 217730 507445 232176 202398 256976 181415 268372 634322 720161 392325 243706
14848 243706 238500 535874 521691 432416 434853 136685 418082 612185 284728 476644 718017
14837 718017 498096 439017 490016 394918 394802 699724 385001 493571 359287 41473 256414
14826 256414 204277 607339 320802 669029 522489 607998 587921 575937 602683 270096
14815 314254 583259 475572 456053 360640 411376 769336 827104 567902 573397 584219 382862
14804 382862 397722 394213 497474 410622 627347 574262 452870 508897 664750 216260 417180
14793 417180 180882 510211 771292 216416 474450 460434 514820 272148 300421 297245
14783 297245 577722 670317 375402 502626 597895 657331 492434 677318 461023 552818
14773 552818 731914 510511 705252 588844 902764 753533 441659 522655 647205 653807
14763 653807 705247 293994 898319 802868 619916 792742 437476 512614 954738 678832
14753 678832 596598 578920 699593 750109 625919 493658 731461 872168 730349 815224
14743 815224 823194 326354 809726 654088 658784 563560 775085 520682 647112 673253 709805
14732 709805 681209 590483 591377 717227 963590 840048 773308 855400 632070 784419 1011107
14721 1011107 886230 1121293 895652 942215 701584 906437 754448 881868 645330 964428
14711 964428 615102 1070980 837957 747349 680165 601230 539763 653714 1081522 1075305 377804
14699 931819 918932 822947 930659 961309 668696 656391 1104558 881180 932440 645960
14689 645960 894909 1060428 963235 1199955 1145158 1072598 814942 1030166 823826 932187
14679 932187 761427 1048606 930693 959094 886509 954753 982251 722526 923983 994987
14669 994987 929711 1080009 989901 695820 1033025 796069 1059061 920001 1158165 916833
14659 916833 770097 1097374 1139007 1167866 872885 1183366 817840 1008517 1059676 1002281
14649 1002281 1065376 960263 729769 956673 1053596 1061121 806757 1348763 1154361 886641
14639 886641 791538 991865 1191686 1266848 1326227 1155115 1060333 1234759 1038234 1230049
14629 1230049 1307766 1074516 1409303 1376343 1137462 1290796 1452445 1517599 1207872 1130805
14619 1130805 1537928 1181852 992302 1314465 1085854 1483330 1356760 1337956 1283899 1436180
14609 1436180 1546817 1363187 1160293 1213909 1281926 1458697 1368217 1333041 1381077 1514349
14599 1514349 1340745 1402437 1206414 1599553 1604018 1323369 1517690 1621336 1597757 1760137
14589 1760137 1784220 1536502 1433303 1791192 1478983 1663179 2038421 1999785 1799779 1848757
14579 1848757 1635574 1740547 2124411 1879407 2015149 2012182 2147209 1841449 2082397 1909493
14569 1909493 2335339 2266871 2128786 2342307 2578268 2647532 2128006 2391912 2348364 2725075
14559 2725075 2494136 2935732 2730981 3205309 3200481 3451460 3938249 3892486 4781870 5951734
14549 5951734 8163729 13708239 23904830 39324816 30597302 15295780 8163760 4811546
14541 4811546 3324936 2417561 2361366 2185050 1993154 1805711 1908422 1956913 1817212 2002481
14531 2002481 1737686 1864725 2242648 2204368 2205075 1951519 2320573 2143732 2356213 2325918
14521 2325918 2169135 2498858 2532665 2347958 2762690 2292458 2700801 2448502 2616160 2213278
14511 2213278 2423764 2541064 2596184 2800755 2714092 2904574 2866970 2674061 2474982 3068396
14501 3068396 2923525 3066392 2868306 2953166 3249776 3018415 3218628 3147375 3046452 3188334
14491 3188334 3254587 3232037 3537856 3484348 3195696 3269750 3708067 3131013 3445425 3395277
14481 3395277 3508484 3632303 3594385 3701718 3650685 3644090 3695687 3653769 3866337 4280300
14471 4280300 3909791 3629213 4007208 4007352 3975853 4241392 4433296 4177097 4157644 4475992
14461 4475992 4344583 4752969 4288875 4631660 4699063 4536349 4646838 4740667 4791833 5252423
14451 5252423 4976577 4711676 5543894 5438426 5554527 5034502 5430550 5529315 5288851 5407331
14441 5407331 5243890 5608570 5688856 5848502 5937263 5984481 6016103 6216799 6105727 6210813
14431 6210813 6350226 6759356 6503679 6813801 6321272 6915148 6817969 6765990 7120516 7197833
14421 7197833 7705905 7387818 7640695 7689295 7808975 8192355 8220777 8203334 8183381 8259458
14411 8259458 8299991 8303588 8716896 8716403 8709882 8959385 8954492 9480594 9519894 9303661 9632980
14400 9632980 9705632 9994918 10242294 10522079 10335465 10513991 10954426 10880140 10740477 11760536
14390 11760536 11382924 11858605 11942290 12159780 12306817 12465555 12631592 12912671 13361673
14381 13361673 13618103 13836833 13971807 14438827 14735377 15049846 14867637 15260481 16080643
14372 16080643 16176578 16463588 16601279 17344355 17868237 17641182 18206387 18483232 18940828
14363 18940828 19159078 20028878 20625794 20625089 21335928 21452232 22066807 22495880 23249398 23671612
14353 23671612 24564322 25020284 25614454 26091575 26826562 27140877 28063127 28941993 29536794
14344 29536794 30351551 30932532 32002814 32741851 33851570 34558990 35676104 36517158 37635526
14335 37635526 38610777 39895843 40730266 42500259 43369348 44960324 46233171 47449955
14327 47449955 49380417 50983191 52929965 54159130 56188803 58223708 60042006 62305047
14319 62305047 64346238 67168270 69333857 71937357 74687896 77659425 80555227 83836026
14311 83836026 87065487 90876753 94562121 98436262 102321482 106973674 111540631 116487391
14303 116487391 121497285 127404676 133056646 139494007 145921370 152797771 160644298 168095030
14295 168095030 176344258 185129432 194536482 204064968 214800652 225319234 236672997
14288 236672997 248474987 261030662 273861512 287130761 300790061 314655108 329012195
14281 329012195 343055669 356970606 370908603 383990574 396871244 408788746 419358399
14274 419358399 428191705 434602313 437059246 437678771 437389008 434775301 429230960 423713287
14266 423713287 417978526 410989821 401835517 390459047 377104106 362505775 347798918
14259 347798918 332423988 317289628 302963988 288569319 274521106 261119366 248027654
14252 248027654 235387896 223278894 212430935 201777486 191579329 182000268 173235070
14245 173235070 164734004 157328257 149659151 142317517 135698227 129521574 123529042 118463000
14237 118463000 113456040 108103580 103756554 99281527 94682933 91168472 87753079 84261216
14229 84261216 80924239 77920842 74569607 72199029 69206799 66708232 64574313 62247567
14221 62247567 59834914 58011723 56090274 54290239 52496299 50590295 49097234 47623873
14213 47623873 46356146 44698791 43379041 42051861 40750377 39963090 39034140 37942184
14205 37942184 36452594 35615049 34669517 33715744 32995983 31947164 31371324 30529497 29470327
14196 29470327 28788160 28127967 27503842 26917336 25845734 24958147 24806229 24162486 23808773
14187 23808773 22986035 22759383 21961730 21896978 21013414 20771846 20116068 19807942 19278752
14178 19278752 18749784 18739840 17943737 18153065 17451881 17152890 16843885 16245575 16312495 15977507
14168 15977507 15690861 15189238 15188459 14831262 14656856 14329044 14045220 13641142 13739073 13274088
14158 13274088 13113555 12694778 12659285 12278592 12034287 12012100 11959082 11627651 11509546 11328630
14148 11328630 10934848 10900111 10549164 10705975 10411815 9883008 9965540 9603521 9760962 9833890
14138 9833890 9538599 9508989 9270419 9086342 9043990 8816367 8452989 8740706 8329190 8181775
14128 8181775 7987427 7924782 7781042 7685233 7872767 7540213 7783185 7163267 7167672 6969250
14118 6969250 7269296 7163274 7143882 6838015 6727046 6530265 6692065 6682888 6585468 6605795
14108 6605795 6253436 5911189 5995347 6154677 5998697 5754226 5596959 5975609 5733432 5427014
14098 5427014 5674503 5612656 5558167 5409454 5005972 5640269 5323314 5085790 4809408 4976762
14088 4976762 4891578 4878766 5013324 4750604 4695995 4757560 4635786 4671483 4502683 4381596
14078 4381596 4328941 4524635 4245209 4496519 4322014 4306656 4338994 4162439 4157935 4151658 4243300
14067 4243300 3812685 4258456 4192173 3884643 3847479 3858604 3535076 3948327 4012477 3913456
14057 3913456 3661146 3547366 3564680 3580571 3058977 3664092 3159596 3333204 3293299 3594100
14047 3594100 3456258 3305604 3103814 3107495 3107423 2807831 3280125 3125321 3120974 2894213 3080983
14036 3080983 3355400 3113112 2975815 3339834 2819545 2916462 3045019 2907036 2457344 2317393
14026 2317393 2715308 2578127 2930319 2550334 2534002 2420642 2393806 2747179 2472458 2425506
14016 2425506 2474112 2494242 2090836 2563568 2422632 2402023 2239532 2226522 2307931 2412686
14006 2412686 2411552 2290643 2247793 2272902 2450230 2159308 1975974 2012225 2024611 2050771 2640517
13995 2640517 2031463 2133441 2358260 2208049 2774936 2982090 4112748 6861960 14262738
13986 14262738 32349854 36373358 21261332 12661394 8227330 5933816 4491710 3987653
13978 3987653 3303040 2869040 3101331 2565566 2602341 2758904 2729387 2408982 2602033 2329532
13968 2329532 2412722 2355991 2068591 2050224 2134006 2076404 1968417 2061913 1965485 1973762 2016570
13957 2016570 1881247 2091240 1687070 1793908 1769389 1778978 2129544 1637952 1527253 1606991
13947 1606991 1822333 1635015 1666961 1770038 1774865 1816538 1585628 1638920 1947842 1494554
13937 1494554 1355560 1652180 1348826 1487536 1445093 1673994 1214892 1283858 1527876 1597397
13927 1597397 1497559 1691057 1253117 1450894 1261827 1193440 1538968 1390067 1359813 1703682
13917 1703682 1193429 1484376 1566541 1367219 1174163 1495952 1470344 1213409 1305338 1370290
13907 1370290 1400826 1272204 1199942 1195066 1224228 1367615 1259031 1480923 1436394 1218911
13897 1218911 1238965 1305844 1271503 1381073 1095146 1115693 1566162 1243406 1205697 1056657
13887 1056657 995090 1481106 1101631 754844 846220 1239826 1125389 1016156 1167287 1128564
13877 1128564 1238484 958964 1212079 933779 1294977 1208855 1108787 1078816 1047692 1069181
13867 1069181 1201414 1109837 875296 1144596 981950 894267 1042056 1183414 988647 950022
13857 950022 957243 1043529 629792 1081209 1338169 917259 1008066 998573 794909 993999 972495
13846 972495 1189259 1016953 895826 914132 843797 1252948 654393 665942 873722 1004425
13836 1004425 827896 550974 838594 872780 730305 842964 956423 882992 1077414 782365
13826 782365 911595 826562 1111713 387676 937400 856435 1002609 789120 662584 632791
13816 632791 636264 959098 691116 772806 882185 781339 871260 764160 681236 515709
13806 515709 679904 698994 609445 683640 561082 698254 891657 869250 584362 716871
13796 716871 657387 840889 1050591 631260 611321 654050 533234 798812 679359 914080
13786 914080 602487 529023 956790 690003 515218 839103 943901 956175 674203 745140
13776 745140 666040 385277 962262 371394 597690 692518 762701 803625 540854 964690
13766 964690 277892 634626 523247 909144 671653 695941 492632 693770 862405 648336
13756 648336 808781 647468 449059 704995 703120 703840 535513 611697 908594 651170 595008
13745 595008 743468 1178741 323976 635910 660648 578716 510138 539974 408920 613904
13735 613904 515672 450288 270075 539078 603652 551828 642633 642890 399760 422891 545211
13724 545211 432197 788352 547109 680897 630960 436697 396388 433450 618036 607691
13714 607691 767258 554073 519167 315595 495611 581538 318209 507884 722743 569856
13704 569856 538816 631964 507691 346937 449236 439697 605813 208193 811704 425110
13694 425110 582482 310885 291166 489716 747956 579009 639705 472460 727557 259666
13683 416551 543634 460229 342813 88518 478816 654935 506766 384137 675000 619992
13673 619992 307596 492560 582127 694381 360908 458343 98670 376758 257822 511658
13663 511658 369072 433305 493001 364665 474918 543527 299828 460778 434791 573558
13653 573558 758055 464047 611912 182942 564826 162558 49397 420937 375355 192759
13643 192759 178994 325367 117067 618154 484828 475436 624356 84356 457437 406100
13633 406100 265275 476055 194004 415377 553831 432225 435013 369506 155115 382896
13623 382896 234693 105554 418960 42709 284525 411731 157351 192671 195551 451514
13613 451514 412984 413693 333915 249520 390683 593908 738107 192554 151287 489550 362410
13602 362410 30186 426410 149916 377471 317227 173723 248932 550391 555186 491921 347488
13591 347488 496698 652952 361707 68677 156343 494016 404242 350442 341564 58069 267126
13580 267126 124835 280168 262479 169676 50266 497831 316592 235855 332434 279048 363551
13569 363551 37303 322255 348417 416013 396665 58194 454493 457501 231886 -164846 427165
13557 210800 409751 340952 208614 428328 60453 306228 335542 288410 266164 529235
13547 529235 342652 -127950 430885 207640 217692 314037 227033 264663 101716 94928 358211
13536 358211 264062 460759 292842 223095 240540 100692 255259 545377 97747 418205
13526 418205 124386 443190 418241 386147 357174 189273 352434 209617 17651 245893
13516 245893 471376 -4136 274022 -91298 571470 77579 392162 351843 318596 249412 231763
13505 231763 215118 160211 247603 433926 -179557 127364 33936 292304 -150725 362126
13494 320825 400582 141680 409965 358866 68146 296896 512472 -66313 76614 87213 264523
13483 264523 274479 397298 324965 228253 442402 460813 81944 301122 36451 128591 290711
13472 290711 -276124 127490 233840 -193084 287575 374321 415487 173009 -52190 113561
13461 192469 196716 447775 285880 -45905 432700 225698 271109 344056 -22873 -69443 -97229
13450 -97229 315003 536630 190063 34130 402072 323934 429766 8170 146955 405907
13440 405907 125396 357507 278594 223291 -15816 179214 128342 147169 322071 417552 130066
13428 366273 40505 370918 131813 274789 -38015 132067 144130 173272 196996 173176 -51566
13416 112240 210314 344433 692123 296527 337762 175084 -14704 228771 281323 195714
13406 195714 472545 573391 -142915 220198 257025 -7887 85986 -28744 336288 390155 216851
13395 216851 156910 48659 322322 311568 -54272 -66917 -75095 513738 -264018 171195 -136172
13383 422183 97457 255562 222597 107420 261458 186782 490379 72924 106228 446907
13373 446907 281417 -409 -115142 378853 131561 223569 212148 343256 229805 153104 194144
13362 194144 48062 75404 282613 238338 48376 88934 99612 380701 171930 84810 388519
13351 388519 217838 285727 -52644 229049 125428 211022 54979 81509 101226 177560 480465
13340 480465 210543 271057 50720 191603 285531 370711 609345 11667 68198 19710 55259
13329 55259 5888 9404 -204130 -235238 460337 208056 418641 105230 147351 260407 184468
13318 184468 124341 86310 212651 307206 237806 149598 60959 30501 316483 70445 13871
13306 -79629 205115 -756 144002 142181 -116687 564794 -6617 148569 245186 91567 257780
13295 257780 446281 349402 302892 163429 238171 -10742 216632 59258 381993 95287 55882
13284 55882 238119 292346 64087 105907 299471 -48916 421966 234704 42701 -56237 -27076
13272 45556 -237023 214889 182767 255326 52565 228702 241200 141170 -15314 -53824 507218
13260 180060 193080 -115978 -71765 246159 168976 173261 81171 -229178 174282 122797 -115471
13248 41575 -63317 41279 -160055 121212 282146 134472 32005 -251156 254045 60950
13237 12811 435709 141388 337832 -76128 42313 156941 2965 -10588 89218 126172 27031
13225 375530 -87405 -149281 -28249 -215843 331159 -114961 76942 163891 187311 244008 25344
13213 148365 67456 146013 298754 -57728 208841 172928 -146147 94456 273890 -122314
13202 3233 -342987 287286 113893 -20259 231323 -7248 52085 40834 87652 -15379 150648
13190 -26682 -3971 12251 69826 -421817 -30986 -155718 256726 277642 58611 -22028 270750
13178 -35671 260883 109241 468048 184995 298670 -96323 79454 22418 -212591 -152784
13168 -152784 27603 305966 266724 94505 -135904 -37113 -2726 -149499 192684 250684 112621
13156 138660 50241 -148184 145691 -4677 238336 268031 263263 189999 -173532 140794 212915
13145 212915 -117381 -105282 283675 94296 44631 -96277 -22922 107893 -253963 -34948 432699
13133 -63705 -29967 290723 18244 35854 26051 61093 310435 153597 -34392 67292 36137
13122 36137 82398 119994 -252092 99350 223234 312159 94118 78180 -41704 -28071 -114430
13111 -114430 136083 25244 181428 -247895 -248792 -181539 -111506 86504 -71608 18857 344927
13100 344927 -105583 7457 86692 -357310 148452 265914 290265 -67395 225534 209715 61875
13088 -18644 50039 172414 -90004 -104756 181639 139087 -206731 -141415 -32389 -78697 -12365
13076 42722 64797 -28206 81883 -51842 366306 77390 22656 73477 284663 58282 258370
13065 258370 26047 170188 -30716 75484 366 -110684 214772 166186 256844 134542 149639
13054 149639 -43314 166342 -112060 -14768 140273 236857 -16079 226676 35622 328777
13044 328777 95050 -119767 221489 -43729 243188 73381 48700 123558 142608 -5740 240259
13032 213258 254209 72478 217412 208505 -26541 228866 323621 -177236 128119 -59367 -45545
13021 -45545 227295 156054 30896 149856 -119154 139230 -197975 -166679 236031 239198 145948
13010 145948 8856 112198 397543 117525 26008 170548 59177 2732 -176510 -229463 -82910
12998 -268720 -56394 219759 -70702 258751 68620 -172090 -179810 1943 262793 162858 76082
12986 -113382 156874 42332 -79993 206066 -51334 -112808 83208 -115723 199302 6229 -186550
12974 -42739 113095 -110046 345728 -191539 39574 13630 133540 453793 21500 93305
12964 93305 166109 179009 -89046 121786 14839 174586 -124153 87164 -222439 253534 -231602
12952 139597 -43383 126569 -106777 83497 -201799 32612 -23698 136395 34983 35548 -96149
12940 -141672 142185 97363 308150 -115670 -78833 301339 -122909 117581 236624 166438
12930 166438 130611 85879 -132197 184389 103161 -67803 -9314 -321367 209662 224809 45938
12918 382285 -416869 3770 -118521 146101 111713 -112009 -6766 140753 -62954 -289242 -274222
12907 -274222 5828 115098 452602 34380 14767 25657 331626 -131084 -53995 156062 147092
12896 147092 144149 270839 -72051 158936 29054 -148402 277918 -176521 261904 191471
12886 191471 -107920 104819 -357783 -308882 -153270 -87476 378761 -141911 -95007 255489
12875 28226 246007 49276 -172135 -201822 -68751 -51654 3595 -312954 356253 346171 -21533
12863 144435 -197881 195237 384737 -140102 200160 89487 -99978 -112234 -78095 238388
12852 -94890 34909 74419 -57925 156457 46072 146609 140175 -54965 -158798 -101105 -5390
12840 102400 -175026 -235700 -201692 133468 -148056 45416 231386 -348272 21950 76073
12830 76073 168007 -273977 74627 -66184 5252 -189978 40802 116216 -159151 -179067 -33053
12818 171339 -14272 59311 117231 -27472 134673 118791 -401417 -205799 -242122 198758 -82760
12806 -145454 245382 68207 -153247 93046 80009 -130006 157441 128456 217237 161299 182875
12795 182875 24731 -52735 144705 190923 -192602 112813 -351742 -165200 72179 -61157
12784 57508 -36879 -187629 82226 54069 -69422 310791 43868 293347 12217 189237 55926
12772 -1682 -108512 -236170 -310775 -278254 -3727 -172539 -275365 -188646 50849 -63031 273256
12760 190889 -56970 -12253 232329 12963 -90525 138614 108928 -28420 -263549 -193667 -195185
12749 -195185 -41423 52772 -16108 123125 -241901 274809 -48140 -84914 -109784 -20427 60552
12737 185158 27448 -39402 6208 99967 63311 173253 -86003 -82698 22082 172261 144540
12726 144540 -219069 -44614 32186 62608 32830 290218 32221 -273076 41637 21587 72905
12715 72905 -365707 266571 102952 306967 342402 257629 176822 126999 55962 159809 91649
12704 91649 467561 -53557 39329 5438 -153003 -66813 353223 60634 -235600 173968 31871
12692 144192 195982 -74146 27147 74088 361087 -90570 134883 122041 61028 256666 -9748
12680 -46340 83547 -15764 39909 -57392 -10499 218734 -174600 35420 144948 137569 -163058
12668 -90880 70071 40238 46208 -38787 32790 66505 42252 -65074 -174606 -182225 47012 -73592
12655 189241 170228 -90338 -48963 108765 211695 -107417 250215 -144062 -137844 -64300 175483
12643 162926 67026 -12224 -151313 -225260 75751 -226770 184708 -249316 59667 -159950
12632 185608 28777 -35778 183079 -57822 12042 274065 -398 126066 135227 287533 140902
12620 -118824 164429 59242 -76689 -41341 -156593 -169066 -38087 89151 -169644 -170198 69065
12608 99517 183611 119253 378822 -141183 178388 -106816 136324 18226 -22458 159324
12597 201119 94484 57130 298674 29428 -61083 -227102 228200 -209833 260807 -71720
12586 -76222 134094 78045 -31311 24763 87894 -243175 -280856 88642 103287 169838 -294191
12574 -172410 -95747 101743 -87075 -159020 51408 -64265 -80261 -95695 57352 90906 -4981
12562 305266 77045 -61278 -223392 211965 -123521 22458 -353396 156464 -205425 -370462
12552 -370462 153088 227664 -211604 16215 -323301 -14086 50078 -134525 90838 182554 30503
12540 20596 245097 127840 -103941 230839 191184 48405 188711 -214670 -114579 -18647
12529 -159381 102366 -65522 246594 -159577 -176361 191367 -18132 140755 349428 -94922
12518 -238462 42589 53270 213278 -416953 -154104 -32697 -241478 246230 -64151 -106151
12508 -106151 -267778 318071 266450 -101618 -97677 45979 -186935 45155 -25611 117420 -182025
12496 156299 -19175 204922 228212 50518 -42279 -86047 158151 326821 -353983 -216448
12486 -216448 -330111 -1371 9062 -14669 202597 219624 -306065 -3801 -108868 -82075 -47800
12475 -47800 -115205 -397854 -54889 -5878 -38902 154126 -37256 40459 -40564 -936 -270100 -117182
12462 185849 89042 19764 23882 -10801 -178105 -31529 222376 144719 239488 81289 168632
12451 168632 15728 56027 -57688 -200585 123443 -88256 -259843 64620 241030 29347 -226144
12439 -180902 -182263 -143556 2573 46612 182861 24457 -187969 -219935 -7753 -9001 185972 -86545
12426 208597 -55497 -178970 -22673 126642 -149920 66391 -243843 -112772 125934 -16337
12415 -121811 193391 -302652 95375 20329 -83965 16681 5006 69553 50290 118352 -92748
12403 -59054 -158900 95314 66674 272304 138299 -12633 185420 200513 110805 96507 -129633
12391 270598 22525 -85569 -164421 64111 86265 -162 -181626 263179 140821 -128318 62493
12379 -2603 126842 112679 -353181 66409 37853 -219859 -72327 138656 -15700 286209 11982
12367 53973 -155901 166757 -48040 116834 -93383 -57533 -208328 -21162 53909 237940 -213396
12355 -54323 117522 -161832 -38116 81780 57828 196975 8850 -127915 -94526 -219879 -18684
12343 83828 -44143 100146 5384 -35662 -109757 153798 182505 61214 -86489 42566 110451
12332 110451 -162432 -159809 177106 6455 -143797 -165142 -255100 -232963 201699 -196117 -102106
12321 -102106 105606 -72799 -133826 -88829 264600 59836 21861 -125911 44500 2328 292031
12310 292031 -49953 -76413 292946 -121882 436730 -187534 83419 -5737 23581 173350 -93373
12298 -163637 13801 -55771 -109605 299487 -12415 -106093 -33552 -301880 -184540 -78036 -54851
12287 -54851 104849 13907 91738 129889 -5183 94740 266260 -87985 41284 -55001 353840
12275 289415 58019 177115 291434 -91927 -862 48923 211349 27413 288534 162734 -232448
12263 -94411 139366 237958 362731 -115296 -180379 77131 137611 99442 98242 94911 -116560
12251 -282227 -79009 138180 204647 74386 -312951 205161 -147583 -31647 249502 112155
12240 -43378 67044 14685 35965 -34460 124338 314681 68701 -35531 16880 350337 169869
12228 -66037 -31448 180577 254331 198425 326384 171618 -53784 14858 -159716 305454 156853
12217 156853 154556 430145 435797 -9830 33654 -171942 333 28217 230402 4580 470815 -149568
12204 240329 251312 102813 -125837 -308532 201396 39307 201297 189025 424528 36444
12193 132646 21262 -306163 224077 125623 10031 -50041 157834 -51277 132444 202010 89579
12181 194070 -197943 194012 110442 -48318 -65100 143854 -53730 156505 -34221 73769 -85644
12169 -310506 360688 331595 299409 247747 54902 220593 -58386 137231 32576 32523 45375
12158 45375 238011 -12272 -94682 -287883 263268 -38523 386058 -15308 -228047 307358
12147 27437 57987 -153433 -11838 -173456 474232 23652 196145 22225 20762 -63595 115682
12135 -117309 314848 -108135 101672 224184 -75669 124565 248386 -254071 -40876 110397
12124 -76803 185903 -80385 -457489 130375 38386 186381 -268374 -111819 55373 96544
12114 96544 -117387 -15246 128871 204016 -55300 78930 66656 -60316 -242556 -177426 334722
12102 110247 291369 -23544 -43653 -11801 159608 -123585 -105013 333469 -8450 -241877 -45845
12090 60299 -19191 97012 -27954 1572 21224 -153550 -169897 8451 45884 -202484 -107764 -78934
12078 -78934 136134 235059 63069 62428 211767 532093 820213 413413 118892 232056 130247
12067 130247 -83758 179592 -213590 41687 -65128 -86603 300993 23380 104552 53226 139244
12056 139244 99673 -104920 147161 153540 9412 -186675 88887 28270 -304649 -2701 196919
12044 -182955 -96749 127640 29436 -119430 124282 -129075 20149 324170 309967 199192
12034 199192 253571 218883 -38237 -189177 -194482 -152328 -75424 -246506 51835 195481 129891
12023 129891 -40598 -26575 325124 119975 -92673 158170 -81797 124993 63852 259002
12013 259002 -149142 -225797 52654 -141568 -109601 -326210 -327700 -277375 -38331 -235802 -118985
12002 -118985 -202260 143286 -77302 -70736 44654 -161604 -129503 -118773 -109057 -108234 -161980 -26442
11989 679 326372 -172715 19068 -6379 122667 -192331 230023 79020 -130810 -386132 -217119
11978 -217119 -127565 -300758 -210545 237773 214022 -197616 173437 -90910 -59121 155240
11967 63166 237418 60930 -240853 -8627 63358 -242247 60819 82730 3454 -100782 116347
11955 119909 -128979 -8774 -22435 -108596 -66387 160490 94008 -96428 114570 -26969 298796
11943 121425 -142739 138958 -111016 -25317 68592 -212406 -96179 -9276 74378 -114013 79875
11931 -100463 7867 -288063 -181443 87488 92173 -15641 -226256 37185 -227936 103371 80343
11920 80343 -77877 112584 -248835 54529 -166068 136223 189992 168113 -154723 164344
11909 -52622 105088 -56337 -110476 -63700 37518 90094 52706 -78275 -303679 -305657 -158078
11898 -158078 -161727 -20455 -139367 291689 -151000 -85670 259911 94561 480820 91685 -263560
11886 112874 204910 -261798 133408 -218214 279249 -121564 -203491 -35484 336226 64700
11875 -64759 95281 29424 -123816 -32774 -120831 -53618 -364012 -146760 196491 -60221 -138236
11864 -138236 -73538 -162878 -24578 -36593 -402682 -314251 -66649 149553 -119334 -44238 265209
11852 -309892 -275041 105085 -255965 140608 -116280 -121594 -40664 230812 -35408 -98404 -160519
11841 -160519 -20561 202655 148439 -202914 -204653 -187469 261799 16914 111173 114007 209852
11830 209852 345378 400824 -96374 -167772 121647 157745 193688 -33704 -38411 -117174 -1829
11818 3360 -13678 -469073 275503 174669 -119519 25825 42918 232188 79131 243857 83810
11806 -177608 -80827 -19916 -139375 -138107 -308150 -89071 -231938 -376833 -264715 -47800 112899
11794 -181263 341980 -46245 110928 -405973 -122882 -167204 114051 324725 -95575 -75998
11784 -75998 -252952 14288 -189147 125078 -75048 -218250 -108883 -133922 48071 -80184 76303
11772 -274092 -178552 123197 46383 73589 156175 31018 -175698 -121380 138441 19174 -85802
11760 -113655 179913 -127615 -138230 -58561 -74614 -150586 -37783 -131848 113688 101659 -128493
11748 258444 178482 -37152 -243004 63630 -117679 -199913 -194334 -48931 319733 171532 -166945
11736 -30204 -111760 295433 -152267 41935 -158883 -199464 -49643 -226253 -238252 273662 -142736
11724 80513 52324 177273 44228 83803 41796 163896 -76535 -59728 -53627 -130991 -90181
11713 -90181 101564 -70984 91230 95299 212571 174497 124337 -17578 -62489 60266 -64355
11701 -274294 -12169 278051 -34 -184658 -165893 -60277 -135222 -279738 -25059 149609 29197
11689 10773 349378 327121 131393 -61858 -127060 -21358 -150989 283713 19018 12165 257908
11678 257908 -47675 -271362 -37128 -136453 135490 159581 -121827 113201 14038 -191415
11667 -29676 -65650 -225770 103962 207580 327362 327637 -64977 132128 -25118 -509 99729
11655 -267301 -92060 -3994 341499 -296174 13829 143019 -292649 87344 138209 -83470 -295515
11644 -295515 26898 -39227 -95214 -131854 121729 -33436 -70536 -136838 145581 -353451 -73025
11632 402449 153628 45936 132552 63136 272435 212952 178803 117620 -125891 -32776 -289694
11621 -289694 -32338 -269567 30915 -209824 105419 41180 -24592 -84064 -196007 -48871 76847
11609 160296 -128105 -162102 303491 179938 92215 148617 -75126 103459 -46814 -45626 -117415
11598 -117415 -204402 -132671 -87013 24514 -41929 1375 -28611 13781 -34598 182390 -19925
11586 117753 138760 116978 26024 415472 40685 257513 34908 258692 -76647 225450 298140
11575 298140 -52085 36188 -382635 171479 65418 18040 252281 -89975 -75519 135534 143769
11564 143769 -176247 -97691 11106 50946 297577 32722 -18952 -128154 -120223 -313823 98650
11552 18737 127902 -54220 -41967 124986 176273 521829 183392 84893 41491 216010 72011
11540 142601 116394 -129632 -35689 -208553 -189956 269543 53262 -181423 -39912 309046
11529 107468 -107992 344100 115983 -17252 261876 172828 -263190 202283 -126441 -51651
11518 44559 -148766 -71207 67674 218495 149427 -58666 21099 -1558 241317 6879 63640
11507 63640 372876 20577 -24622 107383 139171 431455 -145144 65841 -292963 -114142
11496 -21416 -91215 41200 -109969 46771 -94844 177926 -212103 -77452 -109760 239975 -29649
11484 -5986 437930 -104225 122798 -139455 71569 89683 4961 312160 -33547 -153362 136694
11472 -30840 -105411 336979 113592 -42013 264108 -92000 36179 30147 320679 -128358 201407
11460 -28906 -173272 147952 59251 -162915 -196887 211742 -197107 6767 258723 -63322 -222295
11449 -222295 124623 51217 146549 163552 -5320 41153 -68900 -15689 -193590 -191863 75806
11437 8985 -112468 149771 -41483 -15635 -95331 275148 190636 -123929 286187 -27921 51215
11425 -64407 -109715 -162582 -25440 -375896 11125 223809 -223731 -260945 -58536 72529 -14043
11413 -213632 -150713 49829 122836 120966 64501 24600 410435 86958 -274810 168439 -102210
11401 -197863 361242 -123949 15288 -35969 -285841 -99416 195680 175154 -96327 172476
11390 -97243 13163 138341 19202 -10902 -33765 -226208 -151416 10680 -321940 454349 48200
11378 71783 -1023 -33419 163822 7302 31887 202421 297683 14878 -138322 -125696 41728
11366 -193027 296153 -150357 -174061 15256 -203295 30636 -69033 71579 -72813 -222266 16261
11354 -230621 -72357 -191942 -180190 251072 -106280 82916 87910 -59534 41989 320136 -114750
11342 370672 130771 41704 -116080 134531 -37254 -86465 -80200 29095 291619 119282 -79521
11330 73419 -3720 -366625 -50863 72376 45053 -504453 -110281 -139495 -28181 40130 237238
11319 237238 -29655 -200471 243849 209589 -120550 27199 -210868 -200627 34237 -266032
11308 -92511 52930 16011 -170174 32912 84038 -234940 -197297 278259 198132 -81717 43752
11296 136965 -76536 78280 25176 -44600 47365 37035 144902 -51272 42802 16119 -86426
11284 -224089 171011 228654 30067 110751 -86195 64561 -121180 -89533 -103298 62895 69987
11273 69987 -24464 -210880 204513 -48609 -272347 -119096 -237882 183059 -45641 254605
11262 -107093 -273930 -271187 58538 -20709 -119908 -64139 -132812 -106779 -70393 -125721 86257
11250 -489735 -157321 65226 171186 65827 -234008 -91531 166596 -104550 192697 -77284
11239 -485284 -303159 -311086 -164202 -81120 -130848 40743 -17903 -66649 -322548 -292296 76943
11227 276150 13692 1507 -31892 -270209 231636 -77508 -90177 217932 50052 64453 -210791
11215 47626 87036 192611 202693 360864 -40568 -14972 -37861 -999 -157322 67998 -309501
11203 -131969 -161149 171508 166021 -97120 75146 69078 -54111 -57701 -273892 138817 99607
11192 99607 -261556 22353 -33874 -168710 177630 50900 -147578 -64737 -150378 -78830 -102573
11181 -102573 -148987 -7929 -177585 62801 -238281 -223535 181158 -66885 -111342 67665 242763
11170 242763 -223911 -55655 -92349 -206441 23958 61681 -108533 16453 -43733 -77131 98867
11158 -16738 -190170 -213180 -595 -131338 -49457 235852 -269815 -57855 -72234 -120508 -41037
11146 259950 -298739 -16087 -162180 101598 -53283 -16106 62125 -369237 -126965 -43523
11135 144258 68519 -10853 307944 119160 -160436 -227174 -114800 -55121 -98682 141695
11124 -52051 -243216 -167367 -139650 -188358 36113 342721 292734 -73002 105239 -53085 -190461
11113 -190461 -102338 244962 -108849 -248621 51051 -176226 31437 28226 -68089 -108010 298798
11101 -137807 183604 264133 115623 324549 115214 238405 34973 505308 -216805 -113171
11091 -113171 52409 28863 246771 152230 60615 172378 114989 -45130 -124653 45453 408637
11080 408637 -11574 349897 259398 25730 57556 -92230 286922 -252575 -39702 149041 113139
11069 113139 31451 311004 232309 172631 471710 331739 500665 -14067 311949 224506
11059 224506 254167 731823 288243 259045 670890 612978 451380 417873 541747 575979
11049 575979 177525 307215 420669 299298 386414 617247 515031 441733 326287 710589
11039 710589 619175 537712 607399 535233 460826 302359 410920 166891 469403 420907 457799
11028 457799 527955 194137 486851 326468 288957 406747 249597 272845 236196 166704
11018 166704 250045 438137 814209 463912 452332 334964 453807 360388 399958 351296
11008 351296 607480 578868 201409 299659 154038 612222 549959 483492 133508 427661
10998 427661 331891 332239 232397 221734 405807 347222 567882 294914 356765 464350 501083
10987 501083 558079 387232 571038 693401 737048 747629 734327 863594 898590 956313 885101
10976 885101 1155811 1149804 1138479 1226124 1434855 1634654 1803047 1474907 1367606 1532069
10966 1532069 1568009 1057745 1320203 947560 1248565 1121790 1136641 1160369 1220471 1396400
10956 1396400 1404982 1142357 1332308 1469850 1081762 1034303 988009 843833 676340 769801
10946 769801 585576 222417 33916 142551 -161160 235097 160489 358581 396008 -72295
10935 78278 112757 302032 189281 -141872 264091 496002 232568 -214540 88719 73478
10925 73478 60746 234510 21282 121488 -175330 492281 -87847 -110524 -52919 167799 172304
10914 172304 9181 154955 35509 82480 -280626 18637 -164711 -110173 -165869 -328797 222446
10902 -32614 -36156 -303723 28393 51644 80800 -210791 57755 -1690 -128879 79640 273316
10891 273316 -167573 -127156 -324972 75152 187430 137292 -92934 126552 -158178 105162
10880 90806 -246716 204275 159012 -191186 -19118 -205688 46290 -4324 -64329 55797 109721
10869 109721 -28048 -23399 -154482 -184679 -147765 -70979 -264752 216869 9636 108553 74475
10858 74475 333080 247266 -48477 -14011 62553 -95948 -3534 -345101 -25919 249152 79441
10846 -10971 84715 -254640 59153 -51418 65183 -76326 -306935 60619 -6150 -39096 12687
10834 124492 -59597 -26737 -89573 27038 10463 91699 -36665 101823 165994 -64246 -27759
10822 -355641 -143299 200196 -376279 -27949 -125218 -156037 36506 -115521 134532 28976
10811 111606 -43691 -32644 95165 138595 -46048 -17815 -63741 65437 -54182 96941 -130443
10799 -183639 122810 67886 -196166 -368701 6482 -188075 80583 119765 -276603 14800 -202197
10787 -55484 -146855 103970 -68484 135146 71133 197517 -48779 12639 -84728 177423 -59279
10775 -148663 -304401 -35250 -39819 52262 234219 -150092 -225468 118793 -32324 -7258 -214180
10764 -214180 -309455 -273110 45905 -130981 -100925 42782 -114432 -273302 -104797 12697 -420807
10752 2029 -1133 -468523 -255938 -367702 69406 -316885 -19286 -100915 12465 -227736 -122278
10741 -122278 -230501 -62385 238640 199004 143591 128400 -17848 87641 -276563 226387 -194564
10729 129845 -300195 -85780 37132 -102599 136728 271530 -168372 -83669 321318 5026
10718 -42815 -109088 -451712 -61134 -123886 -45021 -112528 -25730 -115641 -136725 56250 128787
10707 128787 -51475 188443 202263 -161785 -176658 -267141 -215892 -103943 -61492 -145332 94407
10695 -171577 147232 180873 -151724 -288697 184463 61401 -97608 -140149 -310888 -474225
10685 -474225 -144083 -289770 -82629 -129307 76159 525 -61718 140459 93480 -53580 -173716
10674 -173716 316719 -138052 -203582 226310 263754 -32149 142910 -162623 -186068 -61338
10663 -73971 -37570 -97537 94610 -45022 199794 -123769 -286151 180495 -56608 53590 116677
10652 116677 -227418 46631 -141362 -206079 -287961 -91340 132373 -336847 124715 -63818
10641 257989 -428373 -123864 -233943 174114 -288146 -153511 308830 -40916 -115277 154900
10630 -51686 379809 -382645 98693 -96192 -218844 180062 -78848 -70921 -218079 -118251 89555
10618 -63522 183165 12094 -270490 -315182 -35638 -98993 143079 -20908 -130855 -63630 -144219
10607 -144219 -131869 -17598 -68983 -108983 -29834 -20603 -37829 -18706 114712 -209305 -48981
10595 -89673 -221169 175155 5450 -162771 -101058 165678 -47893 -240126 116714 -15627 -140879
10584 -140879 -174175 -129060 -383288 -266513 36174 -136174 43982 58181 -180227 163018
10573 -293450 -272349 -6475 -72849 160405 -90422 -61066 -250565 71900 -121477 -136549 -160293
10562 -160293 2330 80401 -248119 -110540 78291 43518 65025 -185343 -254004 -207776 95715
10550 27854 -88233 -199395 -54618 145804 -316057 65086 -257695 157318 -129908 -119316
10540 -119316 -223399 943 151374 -348926 -150386 166146 -109351 -72852 36020 -6510 -97191
10529 -97191 -9028 -100875 257502 -38503 158157 309374 278478 29636 19811 76220 119310
10518 119310 -21845 84838 -107405 90523 -28893 224423 -229144 -57622 95536 287837 -20228
10506 -173741 -117632 371338 107694 -81634 -209447 -56940 15308 196877 -39072 -89047 319129
10494 195703 -271249 -288082 -155169 -105344 104860 -140659 167750 64929 -44303 -297635
10484 -297635 11171 53622 184890 51967 -15047 377406 278173 255926 -53367 30828 -185083
10472 -327885 52720 317519 341568 329363 -72598 -67833 -109753 -36250 -329905 -17118 83282
10460 9146 148594 81506 -82925 50347 -102150 56806 -93009 187101 114520 -49304 309190
10448 -7359 310433 35773 67474 -14125 -92509 74128 -133137 209967 119845 -75949 80902
10436 -120820 -222778 -58877 68022 276158 -132290 91806 146277 -121178 -97226 39461 95310
10425 95310 -26551 187512 -22757 123210 -369373 61804 92800 174518 -247971 87296 15147
10413 82028 -249067 -231365 -174022 350406 55834 -15681 2720 37175 -221283 -267193 84513
10401 -204771 108015 -151801 -134407 -9870 184754 181215 -56538 -6807 210370 7043 220926
10390 220926 -5725 105308 -56570 108975 204105 -405757 -17063 34610 -230644 145959 23984
10378 -221389 -15046 -13027 39593 23522 174470 140954 265395 35299 362091 -16605 587214
10366 450021 271969 97770 89564 215695 254656 -304815 228607 118711 200320 404244
10356 404244 379113 82191 -10874 38371 -26784 106071 -37640 427982 77423 273341 -64074
10344 173221 168263 57040 414782 113851 304874 61328 -1090 314889 73197 131727 -20751
10332 182765 216799 199799 121385 3786 -37314 208287 -137825 -53097 178079 -152117 -141213
10321 -141213 107014 264322 -45987 110928 48509 -163509 252876 -230734 -9072 53553
10310 -95638 235486 359863 116810 119580 115189 -3577 -123237 -121413 19948 -48851 -175692
10299 -175692 144073 156083 -106359 123958 124553 -304972 127477 -108065 165941 -207942
10288 232047 60612 -49717 -35768 65070 26907 -75573 -271524 -67847 -106996 62658 -324466
10276 46927 13600 -21136 870 71612 211199 68140 229620 109116 69925 -114820 -124953
10265 -124953 -412590 195311 -269100 9575 4465 7780 291671 55043 275891 237166 188790
10254 188790 196248 296249 61556 -344087 66354 -247667 12766 192075 175305 -246726 -401693
10243 -401693 44334 12552 261361 86261 -395380 -291985 111506 -143240 -387477 166402
10232 -119122 -110406 -70743 179065 -149417 69796 -356124 -40126 265395 -122070 125281
10221 -29222 90584 -88043 -151344 -59891 -59924 -17926 63523 240272 37635 -240813 -271632 -235043
10209 -235043 269933 97283 -74232 244540 227196 -115524 -193963 -149930 243212 38923 202440
10198 202440 -22209 -161820 -194790 150630 105906 -423630 250374 128700 -71705 -63106 37767
10186 -299734 -55096 -235367 -7969 -114832 3963 -165213 -345828 8026 -10592 -71634 -199672
10175 -199672 -314218 45454 -227248 18666 141979 283291 -332291 -112570 -43311 -59479
10165 -59479 -2150 -136759 -411097 177360 -240200 67364 -153503 -51122 -48045 5373 -287396
10153 -30040 -13449 -109439 -81738 -18636 135393 -158699 286560 -8420 -294425 20295 58659
10142 58659 -45665 -63647 -282116 233965 -187839 -130711 -46533 -265969 119141 -189413
10131 215550 202512 -233175 -62621 -115851 -279621 -303589 -171244 -28231 -143339 -181546 111910
10119 27457 -26528 -211889 31435 -174534 -179153 -23230 -122851 -233164 -88792 -65357 -3351
10107 92268 -4158 -126332 222525 -130678 -89451 -101320 146880 -285626 -144694 -131107 -25175
10095 -110778 -320210 -103838 -180605 272073 205638 -68607 -126923 -339149 -150513 198145
10084 -93372 145739 -71026 162066 -176090 310269 -99343 -178534 -228126 -100324 -167289 49586
10072 -246642 -37353 -120201 -129980 224700 -158628 -196428 186729 177138 -96378 -78577 13867
10060 -34775 -59778 61605 127351 256604 -292093 170568 -192752 436421 -73776 24321 213449
10049 213449 -517263 187152 -383688 -285664 52853 -259179 -37651 -351465 -102822 43739
10038 -130471 19845 -40244 151478 -76625 -70338 162604 -87794 -497701 136066 -117687 111002
10026 50027 189775 -148429 -414219 122899 -166120 -431481 174832 -241038 -188649 -534883
10016 -534883 -37403 -246062 -65204 -212630 -202273 -65810 40810 88485 -237998 -126381 -249079
10005 -249079 8691 152599 47188 -83307 1757 -155427 -150764 -172209 33924 -106231 54837
9993 -8779 194331 20662 -110141 344807 -31303 -24316 82814 -228388 10930 -4544 180541
9981 -201342 1946 -140434 62061 -130779 -95442 -63592 -362997 107945 -56604 50618 -160028
9969 -168943 131537 -55493 -197292 47062 -87574 -71129 160402 18205 26748 -83625 103091
9957 211869 -152228 -111946 35155 -27963 -264423 -64843 -436689 -35740 57809 544120 -18952
9945 -179052 -306282 -188100 -532415 52217 60111 -325338 -7438 324585 29758 -212443 -36900
9933 81151 -211289 -272115 -74656 -311739 177402 166551 -307824 262176 -148359 -13598 -142917
9922 -142917 -5766 101208 -195802 -10711 121288 -5530 -35293 -351080 -196553 -130563 82198
9910 -124646 -218203 -56410 -196331 -303588 260957 -155834 161809 -66060 -106874 -133523 -312023
9899 -312023 14655 -144509 -294955 -35091 81128 -119679 -458598 24744 -257458 -265563 -276807
9888 -276807 -208649 123221 170450 67772 207037 -211917 251180 -62585 19008 -212656 171520
9876 -15164 99252 -21517 -388892 65038 -71487 -36653 79770 -92320 -67556 -14045 -168811
9865 -168811 -51294 146275 7127 184725 42163 -80136 -151822 -195124 -103550 -381356 -8677
9853 79282 -58528 -38529 63875 250688 -255458 340144 -81670 -294334 222532 225923 -34842
9841 -292500 -86430 -399793 160498 -334504 -210232 -348096 34162 91438 204689 246798
9831 246798 -155309 -19333 -342104 -483002 -121870 -120257 101259 144418 -255153 -213851 59828
9819 1290 -321737 127906 4146 43089 49879 76163 -395912 -118870 -278730 -86080 186333
9807 195578 -42527 165712 -231859 -299876 -25140 -275219 -181729 59115 162648 -431363 105470
9795 143826 -135222 124264 -214333 -70258 -135444 -103344 141546 -230451 -103175 -376671
9785 -376671 104968 12997 106612 -431663 -24737 161202 279782 307229 -145804 -17535 -219243
9774 -219243 -294672 83358 -397509 -271803 -207882 -128783 -178935 -49329 -229250 -500576 -46828
9762 -346122 -124808 -92388 -44657 133252 -46191 -80792 -11736 300289 34539 3449 -77847
9750 -218904 139113 7765 -144216 -224865 1826 -44785 213055 -230067 -135505 -217015 -78321
9738 -102600 -209268 -91829 -56598 -21212 23193 -46636 -105125 -254456 15569 41151 213715
9727 213715 -231013 -153231 637 -153953 -232055 -34528 410266 -104199 89242 -87497 303956
9715 -168641 -200891 -134571 49014 -48394 -111251 -297704 27012 173498 -12298 109908 -218120
9703 18322 -13606 -221805 84323 -275985 39156 -232357 75993 6476 166666 197836 -195473
9691 157088 136604 301673 -161104 -146046 -57153 -71499 -132856 162742 62387 72290 35683
9679 -71762 -130638 -32663 -134932 -170090 -189100 -50188 176560 131047 -32753 -79812 -323150
9668 -323150 7381 136357 349151 -87652 -451089 49548 -306817 177143 75016 -112652 80870
9656 166812 69358 -58417 -16348 141064 -97086 -241498 191354 -10338 -255108 -255413 64330
9644 30024 -193990 -70908 197911 -103234 -86414 -85270 -271507 -116732 60008 -78362 68603
9632 -117798 -105233 17288 179788 179195 191027 -332022 53699 -304324 176216 -318319 298527
9620 -114024 -58212 -100650 220803 117298 -49400 105875 -228002 -218464 124810 25240 -4271
9608 134538 -15417 84786 37348 -175261 58616 146308 -61931 -1574 -231126 -106654 -185181
9597 -185181 -32137 -329413 -47466 37414 -203086 -113491 -71243 47363 -129676 306460 133972
9585 -33745 -382808 325230 -347592 -196623 51454 -170506 -254575 -24607 -51951 32192 126922
9574 126922 -49458 114893 47315 -209658 -342084 -236042 127961 -54300 -305498 -36910
9563 -52926 153217 126056 -213517 -178923 270028 124702 -262409 289949 20984 -157452
9552 -46161 -228219 -200652 132456 -18899 -181368 -23090 166220 69872 -232001 -87661 -93112
9541 -93112 -99462 -217575 -341204 -9226 -246555 138843 -155628 -23492 -158497 212481 -33360
9529 -93858 -161976 -115831 138532 41624 -95117 -318793 277716 -402532 -168723 -273476 -42750
9517 138880 -67818 105109 -92998 -87760 -93080 -30868 -107880 -190909 9805 20183 119053 -106178
9504 -14946 645 -98068 -296546 -9563 -155645 32901 -208911 -150249 -460891 -107459 170120
9492 40570 7917 14542 -36393 65092 184301 -24450 -35745 -100760 -186809 46874 -175960 123225
9479 29677 -7434 58071 206374 -200176 -101032 -91075 -33970 -292344 -2512 63476 -324526 -82269
9466 199568 40618 -461257 -396261 -122708 139171 -295312 153287 117398 -37134 -204276
9456 -204276 -62923 -78485 95068 -350848 -186455 -203061 -94400 1980 237021 -14636 -127309
9445 -127309 -200284 284187 -182823 -154623 -167717 65484 -25367 -69183 -342063 74623 83736
9434 83736 -145246 318216 -319909 -75235 -154762 186874 -187587 -188217 199077 183836 -65301
9422 197701 168918 -35451 -61734 -12697 -193666 85727 -263888 83329 -54293 -146050 232866
9410 -50443 -190612 -241930 -14193 -445014 387662 -294920 162568 -68350 50736 -151087 -122500
9399 -122500 251944 -121614 85282 15682 42807 73585 -91354 -58114 -75812 -48359 161707
9387 -115106 353059 -115198 -160645 -48467 -108362 100118 -108205 -384987 -160892 71596
9376 184312 -149672 -16688 -111575 -124335 116201 -119080 -200630 14132 -134265 126504 -12854
9364 -147445 -254698 109156 109853 189057 211662 -36575 -157915 133963 212139 174336 -146416
9352 -155462 -217433 -534471 -86874 98743 424382 159229 -138852 -72452 16894 27163 -76141
9340 -116185 -156180 32708 -330167 -66458 -86904 -13308 17809 -39094 -306222 11046 -69757
9328 -2899 183428 131052 -289410 122190 -131727 -177287 107284 222421 161258 -28845 200865
9316 -279745 117593 -129130 -244774 59529 55735 136239 74389 -65798 -41071 -38217 -14854
9304 -25005 -30054 199081 360 -169856 -44420 -196357 -242597 265921 -242159 69041 -14781
9292 -235313 -209252 -137562 27394 87924 35432 102563 -118296 37435 -69449 57662 55985 -153636
9279 -155005 -15310 -33710 -319991 -30591 -94222 -6016 -219 -48989 -32204 -251283 59246 67878
9267 67878 109326 -112112 -139964 -398917 -72545 52536 29266 -232289 -31696 -60250 -114056
9256 -114056 -49283 -7528 -147770 -141335 -255996 -339175 -238693 -323265 -193801 -66717 183538
9244 -174653 -185779 -62684 129440 -130068 -78985 -170553 -34021 -25134 62912 -262210 -295664
9233 -295664 -202468 -537 -39687 -119957 180416 -87470 -92591 -154761 -184204 14153 2127 87328
9221 87328 77949 -181951 -209870 -112491 -266515 -348776 -100522 -88648 -117607 11789 -121632
9209 522631 -197280 -141148 193067 43928 -124768 -99776 19188 -355087 212051 96110 -210147
9197 1179 24781 -128508 96067 227826 -35739 60602 -200012 -306461 -32482 207969 -67462
9185 -241531 -4195 -110860 -190934 124549 38597 106404 -328727 -204508 225393 270912 -57725
9173 55852 -188733 58430 -192175 3969 74532 -151234 31369 -257756 111195 105565 72382
9162 72382 205406 -181510 600 185303 -136528 -140107 72437 -134186 -17101 65573 -154956
9150 -522039 313916 -99276 -199262 -83384 -145292 60607 69455 -152994 -87259 -93651 235262
9138 -215883 66075 -20126 -251178 -110898 -174397 -237358 -49757 204671 -111239 113906 -127106
9126 -42623 -130699 -186325 -289884 18987 -321276 -361303 159144 105408 -121199 249181 -100091
9114 27087 67588 -236173 155770 -236368 78423 94066 -324247 53917 -72382 -133504 -86228
9103 -86228 -231344 -11547 64044 -79027 43226 196568 80541 -57632 -268257 -198077 -57183
9091 -151040 99710 -19832 149012 369286 -174163 -1509 201673 -242131 93911 146994 87923
9080 87923 -257094 -241616 72683 -66600 155800 24728 281297 122882 -398518 -175363 -53026
9068 63195 17623 -82827 -81286 -541444 -200254 -25002 -348396 -213625 -150503 -88001 165315
9056 -76843 92837 -133976 152204 -180546 120700 -27145 230321 253015 -291918 -55611 -166923
9045 -166923 -541798 -189021 -32098 137400 -376048 -133047 23566 8054 232674 56694 -50047
9033 -19327 141852 71099 435061 -222906 235505 -247238 -82502 -95313 -157666 -159615 -151685
9022 -151685 205137 63100 15082 -235426 -279124 36619 -227409 54980 -224525 284577 -97799
9010 890 129962 20253 5146 -36864 336202 -47568 -145759 -163657 -227755 -113504 -259105 -151671
8998 -151671 -155229 -206961 110912 -156708 12970 146951 210546 58448 29046 -167642 -123037
8987 -123037 187549 -47952 -161186 69045 -134866 115526 71656 -388091 -3216 68651 67189
8976 67189 -227619 188081 181576 -9718 -164460 283554 -8381 391330 -252632 202177 73577
8964 -96269 51610 112823 -87982 -18119 -284897 -154633 -48430 -120687 986 135540 25525 40804
8952 40804 156716 153799 -95920 -62910 119756 -17414 91717 -46637 142908 -67807 80046
8940 129288 -103386 -101643 17297 95907 98754 -110739 93275 209325 54199 14782 24203 -197828
8927 212655 -225647 44911 198598 455867 480913 1688561 6159036 14175672 4168961
8917 1789198 1097163 604648 202245 76859 208803 -61918 193854 200859 127252 -37525 524636
8905 148370 -143236 -5787 -21358 36139 -11786 241683 -91217 -50566 -144658 -337820 -58001
8893 -91859 -126521 75599 -32140 -452136 13221 5159 -112612 -88735 -139495 -112302 251094
8881 9011 -275072 -308206 -2408 -182519 39277 -344930 -155247 69209 -237265 46124 117845
8870 117845 27301 -86779 -26096 61852 -74645 -46419 138610 -409673 -428673 -397944 228839
8858 167640 -73122 -160275 -175077 -28860 98992 -53079 175441 -182165 -19059 74083 -179264
8846 42065 152685 -118196 63219 -176761 87766 28649 287463 -75683 96957 -49648 -91463
8835 -91463 -222562 -46551 -155799 24271 -62576 51477 17059 -387880 -82062 -281892 104600
8823 -228949 513410 -78741 -200354 -2846 -304996 -6110 -89249 -437414 180241 137574 -113753
8811 11722 -59081 -93490 18985 41576 61089 187830 -20045 -101162 -14178 46142 -192046
8799 29988 12870 -117716 48311 -129747 40976 51218 201307 -260602 132853 212616 -478949
8787 131728 136277 79189 -267328 207447 -185966 34508 41962 -8977 -19705 -43837 -145429
8776 -145429 18794 -57790 68866 84208 -61922 120759 -202023 -16923 -186402 -64461 -92915
8765 -92915 -210446 -48492 -143155 187949 -48492 67154 188486 -20106 54644 -166487 119347
8753 226490 3735 -152561 82729 112085 202985 -204184 -349732 94047 49501 111951 -102624
8741 -42521 10325 -14364 -140258 -92755 -441837 -68082 10800 -196449 -56282 -63707 309533
8729 -253827 -185750 -46329 100096 -30801 -81196 -101013 -31782 78134 95540 83894 52536
8718 52536 176967 -192728 241454 237952 324950 47661 94081 288312 -245782 165973 -242272
8706 -308372 148605 22687 -311658 -225651 -154153 -85116 -298070 -12195 -245873 87982 -67572
8694 -100145 -57502 -83169 -50991 -302016 -56788 111308 -18181 -119084 56640 -193304 -237322
8683 -237322 216807 88511 120957 -116469 -334142 -81687 360904 13826 -179237 -364640
8673 -364640 -113257 74634 -112445 -166883 -83435 -128514 -97757 -289950 283140 276145 -245027
8661 -179923 -117946 -291404 313547 145581 -193776 -119561 -16527 -128108 -167974 83777 118556
8650 118556 5276 174902 24775 -107969 -134129 37150 50384 118482 -6453 8488 -29425 -176554
8638 -176554 149504 -51072 -347125 201702 -71407 68380 9809 -165319 72562 38266 22825
8627 22825 -310636 146714 132445 -72843 -97493 -315450 -216845 -172330 96694 -299876 280687
8615 -182973 -49273 221773 -157230 240978 230950 -230648 45857 -219422 269334 -202254
8604 -398313 -268911 195578 -115 111309 34864 86818 24726 -336479 -97303 -258342 47539
8592 76149 -146156 73005 280412 -5978 -78133 154105 -374894 77775 -62572 122910 97002
8581 97002 20005 -34761 -191563 230830 -204706 -184819 -49701 -17206 -218374 -182120 131096
8569 96232 -108505 -235478 15098 -5588 -64091 -348681 -98090 -10875 -100532 -193800 -187427 -59204
8556 39913 -60342 -343531 -36723 -152811 43123 -14876 -182412 -136031 -201521 -171134 237373
8544 -89709 -505999 116181 17544 225130 -110038 -90137 -113594 -166308 -277265 -93947 -197066
8533 -197066 72256 -359411 61577 37131 4144 -190531 66539 -230916 43085 -73018 -99091
8522 -99091 425888 -190525 -136824 -45435 250660 82958 113752 50106 -55801 119063 -62867
8510 -258320 82317 -84532 83036 -62890 42962 -132144 3260 -139562 -385064 -4585 194002
8498 70849 -17331 -105123 -96677 -295108 -150651 -71144 -95375 -81179 70679 -35270 84672 76947
8486 76947 -123765 -25086 98604 84196 97225 -26238 51692 -5457 145045 48973 226135
8475 226135 -167991 -163123 83000 40749 -255384 -146201 314535 -202753 -67800 -238274 -76139
8463 -128683 -74532 -83959 -386612 -256969 -209297 -70161 -256930 -277329 174582 -20945 -14716
8452 -14716 -180195 -216102 -216006 111173 65305 -37972 -67949 26314 -188966 -13495 259652 79952
8439 -152767 114100 110848 -71825 277278 7471 52738 -178870 -23588 -423274 -87192 -301970
8428 -301970 -426569 321 -49118 138769 57432 128040 118945 179144 40103 -275312 -139528
8417 -139528 -25011 -263338 -99897 63044 -255278 38541 16816 -37458 -104287 417861 -94323
8405 186362 -97621 -9073 -267117 151613 -191025 2375 32432 115767 -133734 -108779 -225243
8394 -225243 -200569 -84423 -11907 -325504 -158606 -88227 -168790 120583 -59018 65907 -460048
8382 -49986 255018 -50734 -108331 -194027 5936 201275 116767 19542 -34101 180771 -95195
8370 -187981 50846 -163342 124376 142106 39685 16112 22284 373072 -176824 102720 -25169
8358 -39651 91093 -132722 -206330 -241999 61744 52781 55639 -176331 -71029 -94453 -462776 211252
8345 -363031 -176021 24981 -201877 141083 -154000 -101374 -32194 -142949 214463 87513
8334 -107472 8635 -145224 343599 -180650 199453 -143325 -13677 -28311 1466 22416 240282
8323 240282 -86255 -107346 -13840 241862 -245703 -5414 -143517 139179 -40306 -113014 -423681
8312 -423681 147094 200267 -284971 -55259 77968 -78710 -3565 -215103 -339169 -161435 -96622
8301 -96622 661 55477 -202606 89588 24372 51243 -108693 -177085 9362 -291506 228927 81823
8288 202696 -311039 1463 -76708 156049 90305 -277062 94438 -284342 -294920 -85726 184815
8276 88700 -361552 -152735 -152979 -214898 -58101 -1584 -211314 5836 -111448 -46717 39563 24241
8264 24241 60629 47414 -110768 -210020 -96773 -32019 21426 213343 257248 -152291 184359
8252 46922 210929 -133758 -80511 40856 -97633 -83993 -17704 -105184 -58294 13387 325448
8241 325448 -129259 -187715 -63499 -144514 291337 42041 -88728 66562 77743 144821 109838
8230 109838 34250 54233 1746 -127391 -40417 99842 73003 232310 -182459 77881 -196247
8218 -160173 -294933 268896 -52098 -149068 -285012 -162579 167967 324524 37388 -445554
8207 -67919 -18065 -199941 -13910 17187 -331243 100306 -18256 288285 -419750 -48244 -110315
8196 -110315 -26418 -169814 238493 -107996 -330993 86140 -106176 -99238 117937 79113 -79042
8184 -353378 -93079 -76174 -169069 45935 324112 -425797 9788 -97839 -187247 -25420 -243785
8173 -243785 200009 6519 -209958 151715 -102167 80542 -90489 -117350 -202674 -118045 90151
8161 -188024 -296129 273428 -49285 -164384 107860 -121080 -233325 145656 34903 275814
8151 275814 238920 -222461 89919 -6080 -242455 -144286 -261262 -67833 34610 -316571 -257702
8140 -257702 102299 -91448 -266907 9363 -134499 23489 -162523 146694 -54911 -114926 66578
8128 -252216 134531 11282 252889 -128975 29794 -140248 101084 -54372 -82567 -131401 28829
8116 -125008 115562 -159028 -103819 78443 41349 40487 -2105 -143747 -64173 -6747 -72607 -193844
8104 -193844 -298251 -114243 -308203 75934 83537 -62055 -33983 -34655 -63716 -327891 -44451
8092 -156396 90194 -54718 46990 -39320 188584 -43848 -199490 56785 262854 -48217 -184126
8081 -184126 -212263 102463 171882 -188735 -260577 -45629 -17054 55167 -433517 2817 -368556
8069 -179372 43634 -34105 -351297 -256255 158407 -107292 -12324 -101721 153927 -86906 217698
8057 -154698 261687 -286564 12280 -200209 -143056 110524 -5683 153022 -95605 -794 -43468
8046 -43468 206012 35583 -74912 142489 131999 128544 -194756 20226 49922 -89626 -18995
8034 -50373 -114005 -297241 127265 -10319 -59566 -20770 -272326 -85552 5797 -3380 -12757 41130
8021 -197737 124929 -281397 102675 53556 215053 -119134 4858 -70687 -293036 -29627 176042
8009 128245 -342929 17740 -72587 -161880 104210 -217577 90279 -217772 259503 -41887 374608
7997 11219 136622 -95211 -217470 -158980 -3688 -56539 -30862 88306 -215158 -71302 136874
7985 -126689 -126034 23990 -343919 -113101 205109 -7839 79023 -126181 41334 188906 -164311
7973 -77988 -55921 335420 189829 -375159 -188354 73083 -105283 -15781 -70444 -19546 -136363
7962 -136363 -3341 -31228 144545 -139846 -135704 137666 -103852 -234367 63215 -106339 55767
7950 222497 6802 -72438 -101259 -151820 -79015 182773 144878 157259 -64419 -117118 -174077 -100593
7938 -100593 210770 -157876 -43029 -21341 166964 -85079 48815 334716 -321145 -100950
7927 -39276 25097 270152 21383 17523 290428 28807 -174485 -191381 -153891 -2961 75773 -97089
7914 -126948 -148022 -324665 130502 -94150 -379603 127076 166700 38777 -127569 239879
7903 -320062 126428 -118465 46029 -81089 -1902 -107995 -382982 227305 -25726 64600 137930
7892 137930 -188507 106538 -157649 -168793 -193888 -68260 -20697 84497 59959 -174199 7583
7880 -144513 305701 56747 4351 -166035 -102659 -77088 -161484 91117 -171797 59232 6882
7868 36427 -109972 -53296 71024 -77995 91700 -91357 -61543 253552 146825 -210766 159733
7856 -104114 162669 -159574 88724 -137960 -31504 -163455 9877 -237233 -41398 45511 8809
7844 -110551 51879 -74374 119251 247241 -420645 -89107 -349189 -200135 -119623 32655 67987
7833 67987 -124820 146668 -89793 -205482 132481 -14831 24157 -252811 190450 149655 -70294
7821 -16954 192322 -34787 303037 -230309 -128060 -133581 103947 641 41540 38134 61128 -147856
7808 -131984 204078 13485 -28892 -320551 -147868 -237579 -155029 -330334 -133104 -135915 128251
7796 371119 5562 185082 243701 52028 -195792 -218660 1068 -70588 -254061 -108521 -195141
7785 -195141 -50391 251788 -217278 -164203 -112888 188899 115893 -178052 -85979 6478 -17129
7773 -16359 79821 339470 23728 -126908 -66433 50741 -57589 -232210 -88922 -27482 -36855
7762 -36855 -328441 13720 3648 140700 107709 257604 58973 68378 -181538 173955 324101
7751 324101 119812 -114059 -52879 59795 -215235 148650 145169 -36034 83088 -30622 17225
7739 -99893 -99121 302593 -255287 42550 -120558 -217142 -266955 186191 -38037 -129288 164399
7727 26933 -71492 165748 -123194 -385150 30099 -234633 -80025 39703 218375 -16435 -283195
7716 -283195 -5872 -223455 46991 -93043 -31062 -204747 221940 148734 896 105557 53708
7705 53708 227294 24168 -9788 -239607 -220311 128228 -127653 81546 35014 -386969 45035
7693 -322823 100319 -23736 445615 258518 -68515 -251976 -88727 78516 -66589 -228196 -438746
7682 -438746 55267 -353225 -204519 141068 20593 -251535 -41804 -250934 277949 -145562
7671 390415 -106103 -152368 6597 -14183 -161536 -104425 13109 28513 -6231 61745 -94988 -99749
7659 -99749 92023 88187 252642 78345 -6902 -270812 47247 -83622 301958 76982 75902 -27374
7646 78037 237868 -170839 202735 -78711 -5718 82056 49201 -48057 8914 -21420 -147147
7635 -147147 5428 -194359 24454 -191121 -59872 -194219 -73222 -263375 -307839 -85445 201645
7623 140375 -88475 -177644 340278 49719 -135236 -26788 -235150 143051 -190470 -110278 -217901
7612 -217901 -137480 -172561 -16480 172796 146692 -324633 -338262 -53429 -182198 12123 -234565
7600 -14774 -137335 -136934 -256685 184090 -132904 -180934 -11029 -107390 284155 -72122 -228335
7589 -228335 96721 40809 177793 -49870 -70040 93109 -162782 -145728 -99336 -74568 8592
7577 -99029 -74451 -417595 -50783 74026 -83475 159727 -190900 2938 -146774 -105848 28079
7565 -204533 -43445 -303936 173596 -364210 196742 136324 -66296 58348 53272 -95649 34444
7553 -42143 -175102 -31932 134997 5966 -211415 -241968 140784 -101293 103865 51964 374760
7542 374760 -25827 143131 -47369 -155103 -173856 -120530 -78656 -159346 -141870 -87137 145064
7530 -25418 -106923 -55397 198293 -218018 267202 137021 42421 203970 125778 -16228 -30639
7519 -30639 -121321 -270184 146062 -203845 45807 105060 952 -159962 -304242 -15544 126632
7507 213044 -4615 -108173 183945 251859 -258147 21145 151869 -106892 -30647 115558 58458
7496 58458 -285610 -127643 90005 9628 6083 -171985 -130886 32989 135841 126859 -341065
7484 269176 -287190 121933 -24800 -18049 -13260 -216738 -36436 132872 -140584 -228563 -93909
7472 26927 39735 30508 155767 4066 -139857 74412 -172821 241643 -56624 103165 151858
7461 151858 -95331 -337866 -164057 132418 -168333 -103644 115928 -7555 -80972 -59252 39047
7449 -88892 -112914 -209098 -101838 -177289 -43575 390170 67973 333531 -158286 -112495 163013
7437 201104 -274370 -29897 44595 -218901 227889 31503 80829 -196148 238988 161491 -160506
7425 -53676 69312 -264863 -52181 -109298 -37992 -112651 33279 33856 -189117 -228662 -239164 190184
7412 -28800 11426 -216678 71980 28214 -158969 23478 -123878 -109947 416515 65673 -178515
7400 -38373 -158719 -112935 227950 -107599 -59212 256998 -5706 -144927 -95350 -364093 -125173
7388 77157 -1046 -255584 -362775 -98528 307986 68958 251352 -270048 78622 -30139 -120369
7377 -120369 -25666 -268860 -61787 -222828 -32894 -32694 -71304 -74683 -152793 5632 -145533 338854
7364 110977 -58898 -32084 -41539 -174032 95924 266760 -276591 -6366 -91468 -140961 268645
7352 -58163 160572 -172817 -217758 -369720 30126 -105595 -10739 123510 -150769 -243476 -44013
7340 288817 -264110 180928 -54905 212945 281590 -17786 150841 -13839 -129220 149054
7329 -408010 -181339 19273 215616 -250651 -176824 28965 98810 221177 -19737 -70690 -59813
7318 -59813 227739 -7453 -217558 310950 221191 -263797 -85248 -255427 99087 -9815 118808
7306 114087 -262939 34740 -104560 26175 -792 -45127 -116067 -66650 253782 -28754 98904
7294 -107725 48992 -44259 -128269 297114 65664 71921 37532 -300298 -295034 26444 7589 -160753
7281 -144562 -35758 -77798 -98017 -58600 -81475 -88990 -115014 87113 -32854 153172 71701 1066
7268 152724 119015 -58666 271253 -80849 65739 63316 46967 -464556 -59509 -53751 -30935 -273514
7256 -273514 -6057 273391 -59452 75104 20547 -62118 -88284 -3243 -64056 -212570 -7587 -260545
7244 -260545 188585 -35885 59817 185742 -194653 -190240 63812 -280069 60963 43939 -4494
7232 -82959 -101828 -264604 467261 -219500 -175962 100320 -67184 90964 173604 -6036 42658
7220 140207 -102613 24017 -36724 -539382 -282683 -190685 129750 262322 -7736 122974 77474
7209 77474 2866 88136 -189815 -46204 43487 93181 -210223 281292 56764 -30568 81273
7197 31909 -14096 -158008 -81197 -60692 208039 -193577 -2807 81544 -225494 16273 47018
7186 47018 263599 63997 177304 -93225 7103 210935 58405 5680 -100098 434075 19066
7174 39601 187195 -206106 98703 -133709 -43663 -228536 -323529 276732 171542 -208063
7163 353324 -28157 -188387 -26090 181648 123129 99329 -431988 -40176 -260847 49928 -294300
7151 113581 -392143 -255229 18614 -125795 -166021 44097 3710 -33449 -136187 -221940 -30843
7139 -167788 70728 291928 -355672 133014 -181692 130911 -1518 168262 115863 -77018 1775
7127 -126822 257001 23317 25551 -271340 -9214 -22558 -131656 27438 -140661 29909 -108741
7115 204089 -630 -200687 19039 335360 -250037 -13742 280882 71809 352563 -183858 225646
7103 -503092 -169611 -76380 -269057 124135 109284 153306 70937 131275 -82994 -204109 -471603
7092 -471603 -31357 -18425 -254578 -193812 -347052 136042 -269632 144401 -121266 -260263
7082 -260263 152995 -57470 19409 3580 123928 59876 119495 -22719 37428 -192920 90366
7070 -121834 77281 63060 -222605 -189536 -48023 -91131 55505 119731 46593 126144 -43864
7058 -112791 7511 -141562 -26394 -27531 -39719 60793 -82369 80047 103741 71670 120802 -19160
7045 -110554 -74049 -375672 -148918 292049 381055 -201936 -98301 -54595 20937 62279 -160377
7033 28297 267208 -110983 -2620 -27964 -37270 -262149 37898 -132194 -134052 158156 285825
7022 285825 15063 52827 -5237 -28413 290485 193533 204723 -10475 -223 -34805 -207047 11771
7009 -19601 74438 -4455 -158775 -144327 -105162 -26355 -148148 -174269 -207467 118519 -240426
6997 4784 -155070 2754 89710 -223051 16198 -61607 -51226 -21201 -453650 -162776 245916
6985 -164270 -110035 8345 13792 71018 180974 -269871 410163 -105835 -81222 110850 94350
6974 94350 103678 113467 -144516 -455563 -134998 -115105 -62780 198283 155041 241928 127243
6963 127243 -66108 -519987 -303673 -39905 145005 -96912 -245707 66946 85396 -57532 195683
6951 134787 319388 -148726 -100 -371028 -265698 150289 -90800 -196200 -11207 -6216 -264317
6940 -264317 -105887 -20833 2271 95014 -174013 157230 -284628 398624 -80322 -134207 267388
6928 -135691 -147405 -83511 111657 -8441 55024 -160650 -107123 24275 -121910 -323177 -438615
6917 -438615 125023 34857 -66234 51973 -112153 208883 -171214 383598 41807 52153 215792
6906 215792 169940 281175 -2820 97176 242982 -52554 40631 107516 89102 -196 125597 175800
6894 175800 -248466 47565 -56687 -99570 159166 277784 -139908 164508 68793 110569 314038
6883 314038 -131322 -11768 206978 17905 -97174 -215716 -200213 142411 -286945 -94695 153366
6871 -77233 2815 -242589 -236686 -207256 -132459 389235 33823 11043 99184 -78061 -94373 -13598
6858 217700 -159345 -19004 -342297 -244832 3476 -29154 212193 68900 -32857 21045 80951
6847 80951 217762 -36459 40374 -29585 -203977 -273101 -198801 -7847 -73868 -326690 -474194
6836 -474194 -169573 302120 -8319 63164 -274308 155495 -25486 -218322 -368687 -249808
6826 -249808 86521 2890 278241 152471 -52312 -221062 -75156 -75094 -73491 -97996 -219986 -129629
6814 -129629 -188082 -113163 334590 202064 -275637 -65938 -11795 235351 137843 -65721 85210
6802 -1015 -63795 252602 -99397 -43898 293984 -183908 -362117 196568 -14482 15783 -58798
6790 -62551 -177452 -140050 -173798 -40514 -34607 -117008 -195188 22255 97543 -100160 -80039 114098
6777 -5870 70888 6263 -30276 -31663 -338394 -42783 -80653 -414848 105373 169691 -61356 32666
6764 13428 -10049 346306 -290376 231956 -70944 165550 23436 -36251 -141443 -48687 -105363
6753 -105363 204913 100276 -141364 -25810 -45959 -117868 -159464 251634 -257076 61599 -96929
6741 -66475 -177624 -193223 -14054 -55040 -57993 -316857 156480 133271 -3606 133971 90698
6730 90698 -53977 -237687 26620 43890 306595 -119491 33904 -131976 -191906 226474 -61551
6718 -58059 -102112 -190607 -79079 129957 233590 80663 113637 103563 116897 -168150 -120823
6707 -120823 -67654 189048 117620 -101999 76318 217961 -206968 -27446 -255994 138491
6696 -52204 45840 -220053 48249 -47411 -93938 -153989 -293993 121227 -129364 -52983 96232
6684 -12587 59648 -55649 -58327 -231199 10046 8822 68889 -109474 21805 -44703 270111 199809
6672 199809 6640 -62555 -38206 -108924 -289831 152641 -340058 -161373 -1757 -29208 -78231
6661 -78231 -48475 -38312 14559 340672 250668 32244 14306 51568 89300 -24041 -33917 -182215
6649 -182215 -473750 -195107 29336 153204 227254 -41869 110780 161145 201740 20638 -164235
6637 -117455 -223754 -285513 116675 -10095 201174 -93486 -86551 -217185 -144608 -16575 100513
6625 185115 44153 -145692 -22280 40753 -241266 -106798 -69744 52044 -147572 -27227 17882
6613 51869 115414 36503 -759 -246002 -82692 -306371 55350 -253490 -42343 -220973 100043
6601 -403809 69975 -113429 107872 -97228 410093 -14865 -187184 -188065 -103288 -159630 -152512
6590 -152512 134561 56137 42144 -77873 199023 134438 -16908 -205524 -142080 -65316 83913
6578 236724 220070 95790 -171435 158688 -143983 -48676 -327429 278508 23419 69360 -154673
6566 -101226 -248163 -127000 6445 131713 63126 106425 209909 34865 83746 22676 -197426
6554 218689 336327 94478 -158597 23114 -161671 74635 -209187 117819 125921 -119030 47399
6542 308128 -81544 44102 -100878 237098 -5124 432618 -93463 20337 437221 -213273 76755
6530 -110111 136026 206509 32423 -91706 125699 -77046 35620 102048 -287555 -42355 -154324
6519 -154324 285786 -474086 -464619 31249 -201958 132316 15424 -98244 24276 43728 45036
6508 45036 -97925 -135508 -59969 181281 29721 261436 -66063 -151737 123053 264139 -111271
6496 10784 -48897 -8038 -136263 256579 209744 158244 -96832 9290 -114515 -252552 166039
6484 -45757 87925 184935 211239 -55477 190330 26319 -28195 -306646 -68362 131323 138624
6473 138624 -40624 -264121 -296336 31247 -494159 -127956 -309886 211775 242215 198905 91415
6461 -50606 -122480 -72904 35367 -143023 9576 -168783 -530703 16552 -334356 -52170 -8955
6449 252564 133444 -153484 249231 207273 170310 209581 -100777 194553 45341 -102403
6438 -114508 18572 50698 -144248 197439 -219936 -138078 -210839 372206 2004 165057 29428
6426 144232 -292450 112113 -16511 232255 -369 27833 -154017 112553 49637 -32578 9648
6414 30897 23722 80411 143147 -39050 242200 152606 33201 172282 -258398 26396 -187465
6402 91637 14574 359786 -129302 -38730 -134525 121957 -308040 -34337 -135073 42104 -40944
6390 -140980 -268768 -217331 13341 -78038 -57105 67120 78875 80526 -74729 104269 -284060
6378 -190159 49105 -122258 17330 133242 68633 -233401 80638 109794 370004 141965 -49140
6366 -7759 165811 -70605 50184 121320 -60948 -153001 -68509 -214843 83760 76007 156898 -84879
6353 -111561 -124582 110418 -35366 170379 -198394 -112908 277457 185346 21715 136834 -85931
6341 -367417 -429032 -3438 -217691 189880 22700 123927 283550 -344094 147847 191927 42518
6329 226217 -177980 43051 -110537 -187682 -35115 45382 150186 -431266 121614 91150 -164848
6317 36878 -116054 14553 -113677 -26219 -122400 153568 45342 85502 337846 -10001 -244035
6306 -244035 -47543 -1465 -341608 -254520 -163714 164604 115363 293781 -79279 258178 66186
6294 -206034 -26757 5698 362348 -25767 -84605 143771 177188 -157647 -89119 -97886 118779
6282 98401 -112502 150894 229235 128067 -212162 -79645 -95269 -9483 -201700 -210918 119846
6270 163481 -214075 80956 -64411 257610 -159986 243795 -13808 42749 237015 -547296
6259 -85054 -94279 -57696 -13978 19591 -208953 -41091 -561 248549 134084 -126746 38569 75864
6247 75864 513 -187448 18139 10678 157704 101195 51258 -29868 -239944 -294934 -255379 159773
6234 101593 -175729 12284 35815 282888 72937 -104006 -83272 20163 -72317 63744 21895
6222 -89397 143046 107360 -91440 35914 151350 240770 -277232 134099 -90912 -322871 -64143
6210 -54102 67914 40098 107446 93560 -133 68923 -17410 -194979 146876 101291 25765 2837
6197 -94937 144354 30729 -142878 36205 -339669 16073 3382 96980 -25319 102520 -34338
6185 -40527 289688 -88870 -280192 31901 321358 23333 -127056 -119241 -110116 -267325 77921
6173 29797 216805 -37007 -48528 145446 -90062 659 165130 -259360 49995 -137692 -64696
6161 -200282 37250 80832 267793 -65369 -297162 -25650 -81034 66408 -197185 -379033 349832
6149 -148930 292610 -51998 242763 -89569 -73937 145708 -17846 5674 -104641 133823 -168102
6137 -14034 -35389 -32226 96659 -97141 -116433 17123 52464 189632 -209855 -18306 -179976
6126 -179976 17745 362451 -81302 3081 -289780 -31216 -264569 207490 56024 112826 -59259
6114 73294 29647 25385 -101986 -9690 -92149 75657 -177600 58372 -64307 92793 -115896 115879
6101 63919 -101084 -49740 -99969 54691 185240 -131505 -303292 -140752 96884 -51064 -169644
6090 -169644 -200958 20927 -151628 126827 28426 -141428 55284 -96789 -272247 155132 -169373
6078 -63228 237424 73914 -26264 -3629 -11467 -87625 80397 53771 164012 47164 11210 12770
6066 12770 213093 43453 35549 168130 -7585 422514 58370 180656 -151460 181641 -99335
6054 -138730 293926 -246044 -114183 -164083 -15845 68976 75415 144722 46967 -35115 148329
6042 -305960 -76045 -107130 -68327 -163015 -121276 167051 -48105 -94082 39978 -187994 81414
6030 121798 287967 192563 248821 143716 35744 173710 -107613 -107684 135682 -79150 110703
6018 91726 -5973 202234 138658 26996 -319254 100173 -273379 219979 62276 -96502 -107449
6007 -107449 -183337 -3126 250128 -58356 -223537 1253 -304107 91083 -16605 -101736 -72326
5996 -72326 -47843 73522 -188096 345074 120814 12533 -239067 132454 -196724 -102770 87108
5984 234623 -87620 -64013 -152884 186160 -57453 13968 24424 -125582 111276 -103825 -182024
5973 -182024 -76633 -67476 209312 -164812 -179511 -55055 174542 -38494 97338 -7429 169527
5961 109504 63054 103818 -15821 -24316 -11948 -295679 -128212 387160 27635 113951 -115459
5949 -210548 215279 -214490 -42282 -122421 -261128 -98709 92460 -79321 89161 -47880 18750
5937 463763 13225 178567 121404 -111545 211851 -357140 -80395 -172966 162919 -18726 -90795
5926 -90795 203975 -109263 111513 108365 -1411 -4281 -170274 90694 -319570 -45080 28005
5914 -292538 146843 -249480 -162003 173503 -93224 450682 51530 73543 -251826 143377
5903 -35835 15389 -268578 -334228 -166440 25675 -51221 125013 -67148 -253558 201456 145058
5892 145058 -1942 79970 172191 -169245 46603 -51391 46014 32785 2869 -30930 15086 165485
5880 165485 63440 -52720 43670 60904 253772 89702 -150836 -210535 425919 -225421 171883
5868 -328658 -10900 -133925 -127346 60117 63413 -319460 185934 -139314 -36780 70779 -148449
5856 -164320 351189 -254608 76998 137421 14411 170697 -8421 253787 -155564 -58591 27577
5844 164533 37126 65141 222509 -135254 -46614 93057 -252808 -140438 -109460 276683 -94815
5832 -57934 -158878 22374 -109485 -103673 169483 206959 23933 -73432 -11543 75361 290473
5821 290473 174869 37966 -482324 -16961 96485 -51147 89783 -165127 -18870 34154 -339153
5809 -16457 20701 47607 321029 294150 -218162 -26505 152480 -25783 -144381 -27119 -83403
5798 -83403 8975 379594 -384676 145141 -194667 -72085 185818 60230 -99386 47253 -207529
5786 -118057 -19726 63472 -23452 175363 207010 67468 -34376 36532 -71673 -9083 184043
5774 -24914 138112 -164228 26398 -121641 89017 157322 45554 -13424 86029 -263566 96523
5762 -377981 -155970 44188 -122718 184505 83997 -132028 -129208 205835 -72400 137795 -71870
5750 -170099 -15510 115285 -241189 178488 104300 136639 -152360 296 120120 -238755 -58699
5738 2055 -303747 57836 -68210 -156448 101893 -42988 -6617 154424 -14870 -6707 -24290 86506
5725 -45398 56569 -11228 -199883 -50275 -58718 13930 -52864 361061 -150700 -63570 -286284
5714 -286284 -249649 -123779 -336672 -175540 -160317 56539 311709 -10733 393679 -24811 104589
5702 213189 -233194 -89523 179210 27097 54022 60352 -324356 -328908 -145746 -19600 8472
5690 38450 32841 -11126 207483 -170531 -179452 52116 36261 253789 -11931 83439 -149922
5678 61441 -47588 85540 -197901 14608 64138 109295 1201 -372354 84659 -155211 -274443
5667 -274443 295625 150459 -27006 -72550 9182 214893 -45007 207642 -100287 -123936 222551
5655 49790 -81267 -18459 195436 -158961 10518 -121938 -138029 -63335 -123635 -112067 -35769
5643 218807 -326915 -82402 102777 196450 -385931 322946 -255371 112366 60207 -81014
5632 245974 381667 97547 217887 -168713 -117149 43809 -19603 187477 81804 -220937 -39966
5620 377511 -238885 73530 -55578 61602 -128887 292303 185375 135423 -25440 -89219 44515
5608 -60177 94582 352204 98326 15647 -479016 -220484 188334 -201722 -205234 -49405 222391
5596 -130312 -21558 -7856 -62662 -67713 390315 -365555 308731 -24709 -295075 103285 106671
5585 106671 -294298 -198287 28572 -128640 176065 -228662 -14194 -124128 311110 -65866
5574 307376 133599 277192 98938 -105678 20113 20923 -248047 324116 -319673 304665 -137655
5562 -273943 -354700 -176863 -51141 31254 -138469 -314683 -40872 269581 -271005 104949
5551 90039 -154986 -125577 11367 205581 64728 59789 -125737 -102971 12385 -84582 -254897
5540 -254897 17016 33214 185658 -59071 25197 -186535 -128025 112619 224050 64511 192124
5529 192124 -133291 58111 -12182 -158529 11347 -37095 -122850 67115 214174 -89144 -108129
5518 -108129 -121810 -27765 206943 -177275 -8031 54707 57008 208891 195299 -57065 25772
5506 19545 180065 28131 -40223 -27634 259883 235323 89801 -180447 -276655 101398 -91989
5494 -206639 -60449 134828 -204697 60337 -17454 -74568 290354 -72569 241330 2881 -90913
5482 -8593 -133280 103416 -101810 122136 -207239 220560 330744 -58198 -85076 149784
5471 -37454 -183516 194757 70996 54935 -187320 412492 -25013 9509 2229 266760 143242
5460 143242 72913 54476 -150639 110922 -1723 190377 131232 -53092 58064 94104 -119689
5448 179487 66252 216731 -103729 16 18807 14990 -42724 320232 -136928 -61013 115401
5436 80910 -132275 235028 372867 126255 -260254 65554 -173006 -123167 122282 37535
5425 221773 -7940 160838 151586 39450 -109700 364550 82364 -163161 50854 142574 -124290
5413 -324817 206475 -44525 -86882 119908 54864 278645 -57269 59374 -293073 -106912 27131
5401 80280 -8945 35541 -14292 -37766 -112342 121711 19378 -118237 93176 -357143 39707
5389 -113416 46041 96077 -65930 24338 -181616 78754 186399 36714 187138 -100882 -39614
5377 -199056 -105265 215899 -32765 55026 -73296 118476 -209453 -183026 -116056 156612 -109085
5365 155367 55998 -160619 -85131 -178386 -219852 126794 -201507 -335265 136775 -278836
5354 -10022 -49996 -279767 24641 287797 210484 144670 -140239 77373 -102577 -72409 364375
5342 10724 -84462 -71907 -119399 -24694 -47700 -124486 -151152 -95158 321629 -36322 -16941 42576
5329 -216624 -264803 -141061 102452 46260 -141666 -249003 -223039 42569 322022 255164 -9096
5317 77373 214980 70311 -13826 -82515 -147571 -190363 -186813 156995 111163 -463764 -43362
5305 98713 -109224 -243260 117236 -29378 3645 101340 260514 181298 161264 281666 -88547
5293 -274267 71086 -153900 22765 204614 -45963 -34108 -155042 -24825 -159523 -61099 -355757
5282 -355757 52612 173743 -72575 -155538 -31537 -135482 -20953 -9996 59979 217129 60101
5270 -9102 28160 108977 412440 155665 -15662 115900 9990 -44003 -19778 407593 190460
5258 173952 182851 -88562 14710 52212 -97359 -168343 89177 174385 183200 49687 -33495 -294682
5246 -294682 -241402 334670 219905 -11842 -251880 -146681 245729 172061 -45128 -316154
5236 -316154 246462 -76732 -22463 -24032 7378 -129864 364592 44128 -63023 -132363 -222350
5225 -222350 221524 152265 -1360 -42620 -227351 29076 -27527 252660 39798 -194032 232104
5213 -138859 -271389 96028 -112978 -249124 20238 205524 219659 175454 15965 -57583 35074
5201 26799 65095 12740 378945 -112115 101800 -37005 -139047 -100317 28429 -27833 155407
5189 -205660 -212854 -82545 105162 -75600 129475 -131613 -182450 29190 347189 165618 -231217
5177 19705 292777 132198 346517 -285003 -203003 112144 56200 125144 22800 251324 -24125
5165 -17264 -139365 12335 -159309 86050 112046 -197283 -285813 -35023 -189839 -150520 -144931
5154 -144931 -43922 -125911 56591 223810 87624 -30633 268262 -146702 38215 286968 84579
5142 -171325 288435 -162182 -379 180040 161368 -141185 -448556 76670 -14354 -132885 -4309
5130 -136116 233023 118854 45572 70691 96186 -142907 -39315 53927 -240486 -160915 71337
5118 -189518 290549 146327 64022 143576 -311977 -150116 -289657 35713 -148175 306908
5107 -28261 233464 44116 -32557 -264129 4909 -65262 96136 -179065 -85647 69962 195599
5096 195599 -41036 -110735 -163011 45157 -321406 227374 -189012 24159 -152636 -270725 69845
5084 40362 104464 -85619 197560 -167035 184843 245621 -85542 236383 -323437 -38433 -93618
5073 -93618 -216935 148470 174818 -120515 10092 -282984 128174 -189238 167252 208599
5063 208599 -96590 121702 -60108 206237 256985 -59539 -138545 114875 22949 -87355 165528
5051 130461 119570 123001 -58056 482780 461989 37752 -196750 367905 -193411 27519 40059
5040 40059 -210178 -257182 -37302 63673 -120461 -63012 -174485 85294 47837 -203029 -97483
5028 -55595 113501 -343109 22276 11749 -233666 -269026 -162959 255444 -15585 -119525 118873
5016 129352 -19756 -17805 31480 -279212 53414 98925 -68026 -35952 -78461 28971 -73900 2000
5003 -149675 -77198 252802 -208311 139485 -214083 140985 -226230 4779 193826 240526
4993 240526 -130717 237345 164893 -47082 43729 205589 -240772 126419 -74352 -183060
4983 -183060 -196985 136446 -93390 443431 -2414 -64771 -348956 -48766 -48431 -116351 280992
4971 219604 -152671 -39781 -159281 -264085 182654 307989 115267 138738 -60282 118255
4960 130310 124687 -127845 139251 19099 8446 -261679 146099 -176468 -258148 -118605 18362
4948 21214 26265 -51552 167907 24429 9756 133796 161535 -15853 -180454 54879 -8084 166724
4935 166666 149808 -24905 189158 -64412 173827 170205 281709 54129 45552 46722 -539 -214721
4923 -214721 -339455 -1678 -126457 -153912 101052 57377 -754 109300 346271 37452 69525
4912 69525 -384217 -185924 182174 33458 233701 165585 -126715 -145647 -187402 95094 70629
4901 70629 200840 -38165 -300626 -6804 188762 -278520 35269 -307545 -204135 -133408 -121313
4890 -121313 146164 287783 -394665 -20776 55989 15627 96663 8428 -84724 -181347 99344
4878 -273256 248797 147233 17689 64141 28973 -109987 78724 -53744 109799 25715 -185880
4866 -287024 -26027 150299 -261754 14310 83458 -66402 -58895 -158150 25852 -21029 208848
4854 364152 -80470 80999 -1751 257443 -72300 164963 -177753 40270 -39413 -45269 -74385
4843 -74385 293349 -83599 -137583 175898 9510 -30269 -218353 291858 -170777 -68259 -85774
4832 -85774 -147369 -6912 32074 238274 -68234 114019 -166538 180130 -141149 184975 198933
4821 198933 88785 -89250 29150 -234063 -122683 72224 -5775 -16708 65686 180850 -31987
4809 90717 55535 352929 115693 61755 -206589 -73222 111038 212958 -157014 -94108 -19397
4797 285571 -88779 -141966 -218190 120875 -13303 -62954 36363 286173 -233737 17241 210734
4786 210734 167535 132392 192740 40277 -216716 -26817 53203 -110441 -185716 66432 97518
4775 97518 -324047 51359 186717 -15307 145942 86281 34063 -133573 -125002 29561 -34804
4763 -10840 -280954 32447 -47189 232787 71380 -116306 246359 206553 26479 -140585 50738
4751 -47115 117064 -96027 295693 -176383 -109457 -64414 -321728 274070 166804 240747 78083
4739 117185 12327 121658 52916 154005 -249264 260649 -33936 82322 444404 -23378 136451
4727 108055 -133800 -338656 -151201 136490 -242921 -283166 -438598 132727 205148 353065
4717 353065 48038 181286 -178703 46034 72827 190379 -25238 317632 241764 36106 171068
4706 171068 168549 205774 18766 -239725 137823 -98810 -158322 13858 -168144 -86117 -17990
4694 -46407 58911 -32443 -6307 266237 317724 -13255 15811 -4084 225593 -61137 265058 31843
4681 -78296 -22559 -417030 -102975 163866 20313 -149160 67938 130793 145570 -193631 13181
4669 150799 33947 -42556 -12145 10170 -53997 -310145 449214 113943 252804 90958 -79311
4657 167138 -61143 -67631 278040 -56822 61486 27857 -117397 155196 -148618 80284 73285
4646 73285 27763 60449 -15380 233511 149548 75908 114346 -103182 -52039 55244 -139829
4634 -32552 5004 7952 -106861 -128346 77494 -184413 -26151 -413345 -112850 114840 219979
4623 219979 83380 83380 258031 -267423 98964 418331 9146 -151459 24655 136919 202719 11728
4610 -175417 -40338 113019 240904 -50578 3049 196104 -88801 -379666 -274732 94317 -88997
4598 -65815 -29126 -55063 -122961 391092 96843 -178004 -1945 -129816 82154 71730 -184897
4586 -112982 -67905 -128452 255352 -25164 -84939 92629 150091 134434 -154950 36698 -45104
4574 -187049 -40323 -36162 -29346 -212399 -22861 -167345 161952 -128459 156876 -94408 -247965
4563 -247965 793 136206 116239 28477 -246597 -230415 -97555 109227 28637 314888 -143922
4551 -46253 10135 102549 -17840 28723 -207712 -204100 7751 -120744 -348577 365828 26177
4539 41970 -73816 217853 -152813 -167646 -219057 29743 85573 301176 -92517 217770 41184
4527 -92670 -110505 -29366 -189585 34673 -68298 247658 -138334 -92635 16121 -54824 -71813
4516 -71813 76058 251144 215038 115219 108328 221922 -90333 214770 122118 224590 86690
4504 -39049 170918 -88232 -169058 262067 -51267 -310750 131608 -23430 317195 14774 -44228
4492 -198414 21584 306620 -5631 121237 190075 135821 -52769 56333 -6902 -141544 59153
4480 143305 -62872 191821 86000 315534 59169 13864 -75963 -189815 -124807 124869 -137297
4468 278336 -105176 -188274 -196217 -50596 192227 -138115 134850 150326 98766 -69455 73749
4456 163020 -223897 -68007 568609 -334856 268754 -73867 -212184 173569 75730 108820
4446 108820 -74076 230233 56868 -100822 312875 -65349 64033 157398 -75231 -337744 -132276
$$ [...]
##END NTUPLES=NMR SPECTRUM
##END=
