##TITLE=NES1064_159122.0005_001_9704441_LixE7HFyrJ
##JCAMPDX= 6.0         $$ Bruker NMR JCAMP-DX V2.0
##DATA TYPE= NMR SPECTRUM
##DATA CLASS= NTUPLES
##ORIGIN= BRUKER
##OWNER= Administrator
$$ 1.72 TOPSPIN		Version 2.1
$$ 2016-05-01 19:41:50.099 -0700  Administrator@X
$$ Compression mode = diff/dup
##.OBSERVE FREQUENCY= 400.02188249412
##.OBSERVE NUCLEUS= ^1H
##.ACQUISITION MODE= SIMULTANEOUS (DQD)
##.ACQUISITION SCHEME= undefined
##.AVERAGES= 64
##.DIGITISER RES= 22
##SPECTROMETER/DATA SYSTEM= spect
##.PULSE SEQUENCE= noesygpps1d.comp
##.SOLVENT NAME= COFFEE_meoh
##.SHIFT REFERENCE= INTERNAL, COFFEE_meoh, 1, 14.96172
##AUDIT TRAIL= $$ (NUMBER, WHEN, WHO, WHERE, PROCESS, VERSION, WHAT)
$$ ##TITLE= Audit trail, TOPSPIN		Version 2.1
$$ ##JCAMPDX= 5.01
$$ ##ORIGIN= Bruker BioSpin GmbH
$$ ##OWNER= Administrator
$$ $$ E:\/data/COFFEE/nmr/NES1064_159122.0005_001_9704441_LixE7HFyrJ/12/pdata/1/auditp.txt
$$ ##AUDIT TRAIL=  $$ (NUMBER, WHEN, WHO, WHERE, PROCESS, VERSION, WHAT)
(   1,<2016-05-01 19:41:45.114 -0700>,<Administrator>,<X>,<go>,<TOPSPIN 2.1>,
      <created by zg
	started at 2016-05-01 19:30:15.786 -0700,
	POWCHK enabled, PULCHK disabled,
       configuration hash MD5:
       21 0F 79 D6 B3 7B B4 F6 88 20 88 DB 03 48 BD 9F
       data hash MD5: 64K
       34 59 1C 7F 43 DC 7E 06 08 13 CA D8 07 C4 9A F0>)
(   2,<2016-05-01 19:41:48.317 -0700>,<Administrator>,<X>,<proc1d>,<TOPSPIN 2.1>,
      <Start of raw data processing
       efp LB = 0.3 FT_mod = 6 PKNL = 1 PHC0 = 0 PHC1 = 0 SI = 128K 
       data hash MD5: 128K
       F2 95 88 5A CC CF C5 1F BF 6A 65 B2 FA CF 2A BA>)
(   3,<2016-05-01 19:41:49.177 -0700>,<Administrator>,<X>,<proc1d>,<TOPSPIN 2.1>,
      <pk PHC0 = -83.45764 PHC1 = 0 
       data hash MD5: 128K
       E6 23 DF 55 6F 48 42 A4 A4 6E FC 4A 7D 96 45 F2>)
(   4,<2016-05-01 19:41:49.567 -0700>,<Administrator>,<X>,<proc1d>,<TOPSPIN 2.1>,
      <abs ABSG = 1 
       data hash MD5: 128K
       41 D7 97 D4 F8 06 1F 1F 13 CA F6 7A 6F 51 70 3B>)
(   5,<2016-05-01 19:41:49.661 -0700>,<Administrator>,<X>,<proc1d>,<TOPSPIN 2.1>,
      <abs ABSG = 2 
       data hash MD5: 128K
       DD D1 E1 5E C8 2C 67 6B E7 DD E1 66 88 3F CE E0>)
(   6,<2016-05-01 19:41:49.755 -0700>,<Administrator>,<X>,<proc1d>,<TOPSPIN 2.1>,
      <abs ABSG = 3 
       data hash MD5: 128K
       28 D0 B6 6D C7 DA 87 33 A3 4B 16 95 CE 30 4D 7D>)
(   7,<2016-05-01 19:41:49.833 -0700>,<Administrator>,<X>,<proc1d>,<TOPSPIN 2.1>,
      <abs ABSG = 4 
       data hash MD5: 128K
       42 BC DB 3E 19 63 74 76 67 53 A2 5D 10 37 50 26>)
(   8,<2016-05-01 19:41:49.911 -0700>,<Administrator>,<X>,<proc1d>,<TOPSPIN 2.1>,
      <abs ABSG = 5 
       data hash MD5: 128K
       B4 F9 27 43 3A 74 3B B0 16 FC AA 06 61 6C 93 98>)
$$ ##END=
$$ 
$$ $$ hash MD5
$$ $$ 16 DC 88 20 5E 26 BA B5 F2 27 88 CA 7A EB 8B 81
##$RELAX= 
##$RELAX= 
##$RELAX= 
##$RELAX= 
##$RELAX= 
##$RELAX= 
##$RELAX= 
##$RELAX= 
$$ Bruker specific parameters
$$ --------------------------
##$DU= <E:\>
##$EXPNO= 12
$$ [...]
##$TP07= 0
##$TPNAME0= <>
##$TPNAME1= <>
##$TPNAME2= <>
##$TPNAME3= <>
##$TPNAME4= <>
##$TPNAME5= <>
##$TPNAME6= <>
##$TPNAME7= <>
##$TPOAL= (0..7)
0.5 0.5 0.5 0.5 0.5 0.5 0.5 0.5
##$TPOFFS= (0..7)
0 0 0 0 0 0 0 0
##$TUNHIN= 0
##$TUNHOUT= 0
##$TUNXOUT= 0
##$USERA1= <user>
##$USERA2= <user>
##$USERA3= <user>
##$USERA4= <user>
##$USERA5= <user>
##$V9= 5
##$VALIST= <valist>
##$VCLIST= <CCCCCCCCCCCCCCC>
##$VD= 0
##$VDLIST= <DDDDDDDDDDDDDDD>
##$VPLIST= <PPPPPPPPPPPPPPP>
##$VTLIST= <TTTTTTTTTTTTTTT>
##$WBST= 2048
##$WBSW= 25
##$XGAIN= (0..3)
0 0 0 0
##$XL= 0
##$YL= 0
##$YMAX_a= 5162391
##$YMIN_a= -11011258
##$ZGOPTNS= <>
##$ZL1= 120
##$ZL2= 120
##$ZL3= 120
##$ZL4= 120
##$ABSF1= 14.96172
##$ABSF2= -5.596461
##$ABSG= 5
##$ABSL= 3
##$ALPHA= 0
##$AQORDER= 0
##$ASSFAC= 0
##$ASSFACI= 0
##$ASSFACX= 0
##$ASSWID= 0
##$AUNMP= <proc_prof1d_extract.lims>
##$AXLEFT= 0
##$AXNAME= <>
##$AXNUC= <1H>
##$AXRIGHT= 0
##$AXTYPE= 0
##$AXUNIT= <>
##$AZFE= 0.1
##$AZFW= 0.1
##$BCFW= 0
##$BC_mod= 0
##$BYTORDP= 0
##$COROFFS= 0
##$CY= 15
##$DATMOD= 1
##$DC= 0
##$DFILT= <>
##$DTYPP= 0
##$F1P= 0
##$F2P= 0
##$FCOR= 0.5
##$FTSIZE= 131072
##$FT_mod= 6
##$GAMMA= 0
##$GB= 0
##$INTBC= 1
##$INTSCL= 1
##$ISEN= 128
##$LB= 0.3
##$LEV0= 0
##$LPBIN= 0
##$MAXI= 10000
##$MC2= 0
##$MEAN= 0
##$ME_mod= 0
##$MI= 0
##$NCOEF= 0
##$NC_proc= -2
##$NLEV= 6
##$NOISF1= 0
##$NOISF2= 0
##$NSP= 0
##$NTH_PI= 0
##$NZP= 0
##$OFFSET= 14.96172
##$PC= 1
##$PHC0= -83.45764
##$PHC1= 0
##$PH_mod= 1
##$PKNL= yes
##$PPARMOD= 0
##$PPDIAG= 0
##$PPIPTYP= 0
##$PPMPNUM= 2147483647
##$PPRESOL= 1
##$PSCAL= 4
##$PSIGN= 0
##$PYNMP= <proc.py>
##$REVERSE= no
##$SF= 400.020009350475
##$SI= 131072
##$SIGF1= 0
##$SIGF2= 0
##$SINO= 400
##$SIOLD= 131072
##$SPECTYP= <>
##$SREGLST= <1H.CDCl3>
##$SSB= 0
##$STSI= 131072
##$STSR= 0
##$SW_p= 8223.68421052631
##$SYMM= 0
##$S_DEV= 0
##$TDeff= 65536
##$TDoff= 0
##$TI= <>
##$TILT= no
##$TM1= 0
##$TM2= 0
##$TOPLEV= 0
##$USERP1= <user>
##$USERP2= <user>
##$USERP3= <user>
##$USERP4= <user>
##$USERP5= <user>
##$WDW= 1
##$XDIM= 131072
##$YMAX_p= 384891269
##$YMIN_p= -10905
##$CURPLOT= <Network HP LaserJet P1505>
##$CURPRIN= <$Network HP LaserJet P1505>
##$DFORMAT= <normdp>
##$LAYOUT= <+/1D_H.xwp>
##$LFORMAT= <normlp>
##$PFORMAT= <normpl>
##$SURQMSG= 1
$$ End of Bruker specific parameters
$$ ---------------------------------
##NTUPLES= NMR SPECTRUM
##VAR_NAME=  FREQUENCY,     SPECTRUM/REAL,   SPECTRUM/IMAG
##SYMBOL=    X,             R,               I
##VAR_TYPE=  INDEPENDENT,   DEPENDENT,       DEPENDENT
##VAR_FORM=  AFFN,          ASDF,            ASDF
##VAR_DIM=   131072,        131072,          131072
##UNITS=     HZ,            ARBITRARY UNITS, ARBITRARY UNITS
##FACTOR=    0.0627417313425164, 1,          1
##FIRST=     8223.62146879497, 2542,         -50205
##LAST=      0,             4509,            -49089
##MIN=       0,             -10905,          0
##MAX=       8223.62146879497, 384891269,    0
$$ Real data points
##PAGE= N=1
##DATA TABLE= (X++(R..R)), XYDATA
$$ [...]
67612 107107 105581 103752 101527 99184 97325 96237 95354 93873 91896 90389 89895 89849 89432 88571 87723 87042
67596 87042 86342 85674 85381 85533 85725 85582 85161 84685 84117 83330 82572 82402 82991 83801 84225 84392 84910 85832 86368
67577 86368 85880 84772 83964 83725 83548 83079 82629 82640 83114 83813 84626 85484 86181 86623 87053 87678 88215 88148 87375
67558 87375 86283 85146 83815 82145 80500 79569 79706 80572 81449 81831 81742 81554 81555 81751 82109 82880 84415 86505
67540 86505 88110 88115 86492 84428 83105 82506 81695 80157 78442 77421 77302 77648 78060 78459 78855 79267 79894
67523 79894 81036 82662 84350 85751 86880 87775 88155 87728 86729 85807 85280 84767 83697 82024 80289 79065
67507 79065 78551 78667 79279 80207 81158 81896 82486 83196 84131 85061 85680 85971 86259 86931 88004 88908 88821 87516 85836
67488 85836 85058 85646 86902 87904 88454 88873 89259 89380 89185 88996 89201 89983 91274 92642 93402 93239 92788 93144
67470 93144 94722 96934 99015 100736 102163 103181 103640 103708 103703 103756 103844 104012 104253 104327 103962 103160 102129 101055
67452 101055 100211 100087 101101 103159 105706 108133 109942 110735 110448 109508 108346 106747 104209 101032 98509
67437 98509 97634 97998 98384 98206 97903 98058 98666 99374 99917 100130 99868 99204 98463 97808 97019 96014 95342 95659 96755
67418 96755 97644 97792 97836 98712 100402 101984 102768 102912 102897 102865 102671 102284 101826 101360 100895 100564 100566 100864 101122 101095
67398 101095 101014 101428 102572 103982 104941 105271 105463 105943 106461 106518 106169 105973 106110 106035 105244 104085 103414 103618 104292
67379 104292 104877 105297 105894 106966 108488 110163 111645 112730 113400 113665 113411 112543 111290 110267 110098 110939
67363 110939 112354 113674 114504 114916 115174 115366 115429 115495 115946 116955 118142 118968 119397 119909 120844 122019 123078
67346 123078 123918 124567 124920 124898 124733 124786 125087 125293 125118 124563 123760 122835 122021 121654 121904 122616 123484 124227 124589
67327 124589 124493 124281 124541 125492 126794 128116 129553 131148 132398 132788 132674 132977 133965 134926 135239 135210 135480 136003
67309 136003 136101 135406 134379 133874 134323 135343 136144 136460 136984 138552 140910 142790 143341 143015 142736 142733 142658 142458
67291 142458 142500 143000 143904 145218 146981 148895 150404 151201 151397 151323 151412 152019 152987 153637 153637 153586 154137 154900 154990 154489
67271 154489 154338 154813 155186 155165 155590 157115 159123 160677 161801 162969 163923 163965 163112 162093 161383 161013 161149
67254 161149 161977 163024 163424 163011 162524 162570 163033 163669 164608 165905 167115 167740 167830 167878 168382 169719 172040 174941
67236 174941 177486 178922 179345 179470 179885 180682 181666 182661 183671 184875 186429 188189 189723 190667 190990 190900 190751
67219 190751 191043 192165 193847 195068 194979 193954 193416 194388 196332 197669 197504 196631 196613 198017 199949 201360
67203 201360 202248 203199 204178 204565 204283 204102 204623 205600 206646 207952 209777 211639 212702 212827 212673 212894 213727
67186 213727 215264 217446 219732 221389 222386 223522 225401 227673 229632 231155 232623 234157 235473 236401 237134
67171 237134 237904 238754 239671 240661 241639 242489 243283 244201 245242 246302 247532 249189 250967 251930 251576 250664 250521
67154 250521 251602 253224 254683 256098 257944 260231 262558 264672 266549 268094 269208 270202 271686 273846
67140 273846 276105 277755 278751 279643 280811 282085 283138 283976 284879 286045 287519 289381 291667 294024 295781
67125 295781 296590 296890 297443 298522 299858 301316 303183 305653 308418 311073 313643 316288 318733 320495 321694
67110 321694 323155 325513 328588 331864 335248 338928 342698 345903 348163 349851 351626 353674 355661 357401
67096 357401 359284 361844 364951 367704 369303 369926 370580 372120 374594 377494 380311 382710 384515 385922 387648
67081 387648 390454 394389 398724 402712 406210 409469 412533 415198 417481 419834 422750 426247 429899 433315
67067 433315 436462 439558 442775 446184 449868 453892 458047 461782 464638 466764 468905 471798 475646 480142
67053 480142 484855 489498 493991 498411 502927 507645 512486 517184 521409 524963 528009 531137 534953 539482
67039 539482 544132 548430 552601 557187 562259 567448 572673 578266 584167 589506 593478 596439 599633 603941
67025 603941 609284 615252 621747 628735 635743 642047 647376 652143 657006 662382 668403 675047 682107 689120
67011 689120 695635 701650 707680 714215 721193 728129 734741 741241 747992 755053 762205 769263 776214 783107
66997 783107 790018 797084 804481 812304 820564 829222 838219 847506 857129 867170 877496 887650 897126
66984 897126 905803 914024 922320 931105 940509 950372 960447 970664 981122 991806 1002555 1013429 1024818
66971 1024818 1036876 1049100 1060834 1072046 1083168 1094276 1104972 1115121 1125213 1135806 1147069
66960 1147069 1159042 1171863 1185328 1198560 1210655 1221596 1232258 1243542 1255760 1268753 1282295
66949 1282295 1296235 1310400 1324465 1338041 1351035 1363879 1377204 1391265 1405876 1420861 1436158
66938 1436158 1451410 1465969 1479622 1492969 1506663 1520591 1534246 1547639 1561260 1575240 1589156
66927 1589156 1602739 1616240 1629954 1643788 1657546 1671232 1684862 1698312 1711585 1724960 1738562
66916 1738562 1752056 1765082 1777797 1790513 1802957 1814370 1824531 1834206 1844287 1854772 1865036
66905 1865036 1874999 1885442 1896862 1908435 1918616 1926765 1933741 1940807 1948337 1955778 1962517 1968316 1973126
66892 1973126 1977052 1980641 1984701 1989475 1994166 1997667 1999721 2001147 2002919 2005312 2007943 2010261 2011727 2011822
66878 2011822 2010412 2008184 2006234 2004926 2003435 2000714 1996757 1992525 1988717 1985020 1980588 1974906 1967995 1960116
66864 1960116 1951543 1942572 1933550 1924826 1916621 1908859 1901185 1893263 1884913 1875832 1865466 1853595 1840906
66851 1840906 1828401 1816262 1803837 1790776 1777513 1764409 1751166 1737538 1723927 1710675 1697306
66840 1697306 1683243 1668810 1654707 1640795 1626414 1611777 1597937 1585130 1572182 1558102 1543442
66829 1543442 1529387 1516070 1502637 1488714 1474923 1461889 1449370 1436608 1423040 1408424 1392730
66818 1392730 1376395 1360537 1346350 1334056 1322666 1310906 1298170 1284494 1269999 1254865 1239711
66807 1239711 1225471 1212642 1200937 1189741 1178564 1166983 1154641 1141661 1128726 1116390 1104552
66796 1104552 1092905 1081539 1070672 1060042 1049090 1037655 1026043 1014521 1003133 991935 981001
66785 981001 970255 959632 949304 939369 929539 919538 909627 900173 890891 881161 871034 861247 852250
66772 852250 843880 836028 828785 821757 814069 805517 797037 789520 782665 775550 767895 760144 752611 745094
66758 745094 737283 729115 720764 712532 704639 697002 689345 681684 674379 667587 661041 654559 648397 642790
66744 642790 637553 632438 627511 622770 617775 612132 606024 599793 593305 586318 579264 573023 567940 563564
66730 563564 559376 555264 551234 547137 542820 538283 533567 528721 523868 519071 514204 509215 504476 500441
66716 500441 496962 493291 488912 484094 479503 475503 471955 468489 464824 460944 457112 453671 450703 447847
66702 447847 444447 439965 434464 428763 423967 420636 418358 416138 413100 408956 404133 399585 396147 393822
66688 393822 391819 389411 386509 383348 380075 376953 374479 372755 371011 368324 364756 361285 358630 356627
66674 356627 354724 352617 350321 347952 345594 343108 340091 336372 332477 329206 326686 324246 321381 318436
66660 318436 316110 314574 313347 311898 310137 308361 306817 305342 303485 301061 298432 296137 294375 293053
66646 293053 292099 291388 290485 288906 286641 284112 281722 279737 278385 277549 276470 274395 271604 269175 267613
66631 267613 266383 264951 263534 262420 261296 259871 258559 257746 256754 254462 250895 247420 245267 244475 244393
66616 244393 244510 244541 244212 243459 242503 241420 239868 237619 235132 233191 232019 231095 229847 228259 226762 225756
66600 225756 225333 225228 224878 223733 221693 219271 217201 215913 215360 215164 214758 213589 211551 209267 207650 206983
66584 206983 206598 205630 203936 202148 200951 200479 200301 199802 198647 197040 195515 194365 193391 192349 191451 191109
66568 191109 191299 191525 191338 190605 189340 187774 186594 186538 187427 188074 187571 186329 185365 184873 184134 182745 181194
66551 181194 180050 179184 178186 177079 176152 175383 174596 174013 174083 174704 175148 174936 174312 173639 172781 171476 169981 168795
66533 168795 167885 166743 165207 163703 162580 161665 160692 159757 159074 158579 158094 157667 157390 157020 156182 154899 153637
66516 153637 152710 151860 150561 148647 146548 144888 143892 143264 142659 142117 141854 141812 141758 141838 142558 144020 145519 146208
66498 146208 145947 145265 144708 144471 144440 144295 143661 142418 140790 139014 137164 135449 134343 134037 134032 133645 132815 132074
66480 132074 131897 132439 133653 135157 136123 135923 134935 134228 134340 134760 134709 134031 133140 132441 132044 131827 131575 131164
66462 131164 130627 129962 129012 127754 126582 125967 125847 125711 125255 124620 124007 123441 122969 122719 122680 122676 122592 122385 121931
66443 121931 121199 120500 120097 119697 118887 118097 118451 120356 122722 123933 123292 121313 119055 117437 116821 116833 116761
66426 116761 116354 116046 116258 116820 117273 117442 117444 117381 117214 116769 115787 114318 113074 112880 113549 113876 113066 111638 110497
66407 110497 109654 108574 107422 107085 107934 109203 109821 109460 108607 107885 107500 107212 106733 106131 105750 105683 105531 104839
66389 104839 103692 102706 102532 103364 104724 105641 105335 103992 102716 102548 103622 105248 106537 106860 106094 104664
66373 104664 103156 101796 100601 99948 100342 101443 102046 101519 100655 100550 101142 101534 101314 100757 99972 98730 97094
66356 97094 95549 94434 93785 93671 94083 94579 94667 94561 94953 95945 96829 97046 96730 96149 95213 93893 92648 91989
66338 91989 91906 92030 92123 92163 92123 91962 91799 91918 92575 93651 94451 94163 92835 91611 91513 92162 92344 91741 91351 92005
66318 92005 93185 93724 93179 92034 90893 89993 89362 89063 89168 89599 89944 89627 88558 87536 87507 88339 88887 88437
66300 88437 87556 87134 87180 87079 86726 86724 87570 89085 90656 91732 92125 92136 92357 93093 94008 94520 94408 93833 92893
66281 92893 91516 89752 87947 86523 85664 85227 84905 84551 84356 84504 84681 84256 83089 81796 81008 80719 80681
66264 80681 81061 82281 84363 86850 89166 90670 90679 89056 86696 84831 83801 83048 82287 81925 82141 82334 81967
66247 81967 81419 81390 81827 82033 81657 81003 80457 80143 80083 80232 80321 80169 80182 81051 82777 84423 85057 84586 83509
66228 83509 82262 81131 80371 79968 79499 78698 77977 77964 78635 79361 79772 80127 80759 81584 82252 82478 82155 81457 80904
66209 80904 80960 81519 82097 82519 82982 83413 83421 83100 83192 84007 84722 84367 83098 81891 81289 81129 81277 81860 82734 83385
66189 83385 83562 83511 83524 83638 83874 84291 84712 84839 84748 84815 85054 85029 84615 84329 84600 85115 85257 84866 84210 83444 82522
66168 82522 81487 80522 79792 79417 79492 79893 80227 80184 79834 79404 78916 78248 77424 76630 76043 75827 76116 76767 77285
66149 77285 77280 76930 76735 76804 76688 75966 74819 73891 73713 74374 75645 77211 78670 79471 79195 78044 76806 76055
66131 76055 75497 74467 72927 71540 70730 70216 69642 69160 69053 69199 69391 69842 70820 71904 72213 71461 70357
66114 70357 69808 70036 70639 71214 71711 72302 73066 73751 73842 73038 71681 70555 70140 70227 70319 70234 70137 70148 70176 70097 69874
66093 69874 69460 68814 68136 67850 68132 68589 68693 68538 68873 70272 72446 74459 75404 74860 73038 70766 69090
66076 69090 68525 68733 69056 69167 69027 68567 67880 67548 68215 69801 71557 72864 73569 73662 73197 72608 72483 72790
66058 72790 72854 72325 71643 71273 71022 70565 70179 70408 71302 72434 73444 74123 74249 73854 73488 73693 74308 74725 74741
66039 74741 74733 75012 75455 75804 75971 75987 75969 76140 76655 77371 78011 78476 78736 78622 78115 77748 78222 79563 81022 81935
66019 81935 82325 82547 82748 82914 83189 83734 84316 84347 83474 82116 81167 81085 81428 81523 81455 81870 82782 83281 82823 82226
65999 82226 82710 84283 85802 86480 86590 86714 87055 87694 88852 90578 92591 94699 97007 99560 102144 104579
65983 104579 106801 108543 109363 109202 108451 107321 105695 103854 102724 102905 103855 104566 104708 104591 104396 104073 103827
65966 103827 103995 104434 104580 104138 103176 101533 98782 95093 91589 89323 88133 86941 85097 83008 81425
65951 81425 80422 79355 77698 75701 74204 73893 74750 76093 77088 77307 77004 76803 77047 77466 77572 77293 77001
65934 77001 76995 77194 77335 77230 76834 76353 76281 76975 78025 78443 77709 76343 75179 74449 73887 73450 73393 73789 74428
65915 74428 75136 75753 75890 75183 73846 72504 71439 70493 69737 69648 70291 70922 70880 70473 70458 70936 71377 71579 71856
65896 71856 72190 71894 70552 68875 68127 68842 70428 71912 72754 72969 72827 72596 72400 72188 71862 71430 70926 70234
65878 70234 69129 67536 65635 63683 61926 60662 60144 60291 60653 60825 60774 60645 60434 60126 60041 60670 62079
65861 62079 63705 64895 65503 65821 66048 66080 65816 65448 65257 65187 64872 64200 63668 63884 64754 65508 65636 65493 65698
65842 65698 66205 66385 65918 65211 64871 65035 65321 65231 64590 63853 63928 65324 67382 68689 68453 67234 66207 66035
65824 66035 66630 67645 68825 70021 71209 72441 73691 74888 76203 77889 79570 80115 78799 76389 74444
65809 74444 73640 73400 73125 73029 73499 74343 75192 76146 77446 78770 79488 79521 79417 79510 79485 78940 78057 77452 77510 78058
65789 78058 78630 78913 78880 78560 77824 76544 74965 73632 72818 72207 71380 70448 69934 70154 70995 72223 73581 74628
65771 74628 74938 74671 74560 75100 75985 76630 77035 77845 79646 82358 85177 86934 86799 84986 82709 81113 80262
65754 80262 79342 77720 75468 72962 70461 68222 66620 65807 65413 64822 63760 62535 61671 61336 61130 60538
65738 60538 59634 59138 59567 60535 61238 61470 61677 62061 62243 62006 61804 62137 62801 63234 63321 63433 63810 64328 64756
65719 64756 64834 64210 62767 61024 59862 59733 60383 61332 62295 63091 63523 63527 63279 63029 62909 62916 62904 62676 62295 62213
65699 62213 62790 63752 64459 64752 65136 66072 67435 68770 69684 69848 69085 67788 66941 67281 68570 69901 70563
65682 70563 70450 69982 69943 71047 73172 75214 76183 76331 76763 78023 79570 80663 81172 81423 81711 82204 82897
65665 82897 83396 83146 82117 80959 80209 79736 79231 78832 78759 78672 78054 77093 76585 76924 77699 78326 78492 77863 76030
65646 76030 73165 70298 68462 67756 67532 67205 66535 65490 64347 63753 64149 65115 65754 65715 65381 65114 64775 64176
65628 64176 63497 63054 62956 63212 63853 64724 65432 65743 65832 65942 66040 66003 65918 65920 65950 65926 65969 66190 66392 66254 65706 64820
65606 64820 63518 61698 59603 57757 56460 55610 55077 55029 55752 57237 59077 60849 62534 64415 66431 67801
65590 67801 67681 66204 64508 63603 63516 63644 63491 62842 61733 60637 60271 60734 61202 61000 60645 61151 62516 63602
65572 63602 63475 62245 60598 59200 58582 58931 59721 60087 59817 59547 59839 60576 61391 62140 62655 62599 62000 61521
65554 61521 61773 62573 63287 63693 64141 64992 66193 67406 68385 69235 70252 71372 71915 71286 69899 68932 69051
65537 69051 69796 70335 70336 69910 69289 68889 69219 70290 71410 71873 71543 70552 68974 67178 65954 65730 66018 66187
65519 66187 66413 67260 68646 69905 70713 71285 71710 71728 71231 70495 69903 69793 70434 71639 72543 72363 71413 70794
65501 70794 71028 71519 71466 70775 69883 69132 68582 68111 67512 66725 66024 65704 65607 65327 64888 64738 65030 65411 65692 66172
65481 66172 66985 67571 67258 66142 65031 64642 65118 66159 67378 68549 69658 70627 71044 70483 69168 68020
65465 68020 67771 68255 68729 68723 68324 67845 67507 67375 67370 67405 67587 68153 69089 70019 70675 71299 72293 73546 74409 74397 73715
65444 73715 73018 72805 73102 73604 73996 74162 74290 74793 75996 77665 78932 78966 77794 76267 75097 74250 73439
65427 73439 72827 72820 73388 74100 74746 75444 76158 76632 76899 77338 78059 78701 79061 79448 80024 80234 79412 77798 76502
65408 76502 76392 77251 78000 77647 76075 74014 72241 70914 69911 69625 70780 73266 75815 77294 77891 78509
65392 78509 79423 80222 80772 81375 81996 82155 81842 81812 82572 83648 84349 84860 85976 87970 90314 92512 94719
65375 94719 97363 100522 103943 107509 111371 115616 119968 123985 127539 130999 134802 138844 142427 144914
65361 144914 146372 147425 148494 149315 149268 148084 146086 143798 141457 138978 136318 133676 131258 128944 126379
65346 126379 123416 120306 117337 114459 111476 108519 105975 103909 101888 99570 97213 95317 93984 92948
65332 92948 92038 91192 90122 88500 86566 85038 84265 83922 83732 83994 84983 86254 86964 86638 85314 83328 81411
65315 81411 80552 81080 82057 82286 81792 81594 82121 82676 82605 82164 81848 81619 81329 81374 82279 83841 85246 85976 86283
65296 86283 86807 87880 89134 89713 89177 88209 88000 88754 89303 88530 86707 84934 83723 82708 81546 80384
65280 80384 79381 78319 76874 75055 73311 72318 72483 73423 74107 73811 72836 72077 72075 72804 74080 75639 76926
65263 76926 77320 76682 75408 74004 72883 72369 72401 72365 71765 71023 71075 72082 73108 73242 72524 71598 70859 70264
65245 70264 69622 68833 68070 67838 68485 69535 70009 69613 69169 69545 70579 71480 71871 71929 71811 71587 71621 72344 73500
65226 73500 74104 73391 71586 69607 68166 67333 66793 66390 66340 66924 67988 68922 69241 69018 68631 68310 68142 68297
65208 68297 68864 69522 69765 69510 69157 68980 68798 68417 68086 68211 68795 69461 69948 70327 70700 70947 70880 70484 69913
65189 69913 69359 69103 69534 70789 72299 73025 72481 71378 70909 71403 72122 72410 72540 73077 73910 74468 74680 75071
65171 75071 75865 76668 77189 77773 78874 80397 81954 83427 84871 86126 87010 87763 88853 90301 91675 92782
65155 92782 93988 95719 97952 100351 102619 104544 105991 107115 108438 110473 113251 116266 118773 120133
65141 120133 120149 119282 118426 118286 118939 119957 120753 120794 119865 118357 117036 116209 115259 113344 110426 107281 104503
65124 104503 101885 98864 95297 91642 88521 86247 84627 83203 81717 80357 79482 79149 79034 78742 78118
65109 78118 77312 76729 76776 77468 78340 78961 79451 80301 81759 83613 85455 86913 87776 88268 89117 90881 93231
65092 93231 95353 97077 99053 101621 104100 105583 106057 106310 106999 108193 109646 111022 111919 111976 111070 109331
65076 109331 107072 104744 102748 101104 99489 97753 96127 94819 93670 92474 91317 90374 89633 89104 88972
65061 88972 89160 89092 88353 87313 86569 86040 85200 84064 83207 82757 82134 80987 79782 79098 78847 78622 78434 78568
65043 78568 78898 78857 78137 77074 76212 75706 75311 74852 74510 74555 74910 75192 75216 75264 75700 76527 77499 78501 79536
65024 79536 80475 81156 81704 82381 83010 82922 81703 79791 78137 77305 77093 77004 76983 77541 79107 81361 83410 84613
65006 84613 85043 85164 85439 86313 88092 90455 92500 93741 94810 96711 99601 102829 105901 108778 111413
64991 111413 113699 115877 118265 120515 121833 122022 121653 121123 120318 119399 119038 119377 119508 118548 116657 114434
64975 114434 111949 109038 106023 103361 100909 98256 95509 93025 90679 88186 85954 84754 84595 84738 84884
64960 84884 85495 86704 87725 87761 86965 86095 85612 85454 85322 84892 84010 82944 82215 81976 81857 81631 81618 82150 82956
64941 82956 83458 83442 83111 82688 82293 82070 82081 82182 82269 82538 83188 83974 84413 84412 84385 84754 85583 86681 87740 88432
64921 88432 88766 89357 90867 92949 94245 93792 92148 90677 89976 89517 88759 87977 87769 88207 88807 89071 88760
64904 88760 87858 86623 85570 85065 84986 84997 85086 85515 86266 86929 87214 87277 87364 87411 87227 86943 87026 87826 89187 90526
64884 90526 91284 91467 91659 92381 93406 93962 93621 92670 91499 90024 88097 86155 84917 84438 83957 82910 81706
64867 81706 81222 81701 82512 82986 83108 83224 83353 83147 82519 81894 81632 81454 80785 79574 78472 78176 78859 80191
64849 80191 81625 82591 82777 82414 82061 81927 81630 80879 80164 80464 82297 85229 88244 90486 91726 92328 92792
64832 92792 93280 93659 93939 94389 95071 95551 95342 94494 93540 92932 92685 92451 91769 90428 88747 87354 86494 85768
64814 85768 84812 83987 83983 84855 85880 86365 86230 85699 84803 83477 81934 80715 80302 80728 81544 82140 82161 81656 80901
64795 80901 80199 79812 79867 80234 80655 81021 81350 81495 81247 80851 80989 81958 83202 83973 84150 84035 83715 83164 82709
64776 82709 82814 83449 84200 84925 85769 86619 87127 87322 87617 88070 88193 87700 86919 86223 85470 84370 83123 82369
64758 82369 82584 83610 84692 85004 84409 83637 83430 83607 83421 82716 82144 82158 82442 82548 82544 82702 83048 83553 84249
64739 84249 84825 84585 83297 81724 80851 80908 81564 82676 84203 85633 86160 85539 84326 83285 82842 83045 83625
64722 83625 84074 83959 83302 82490 81919 81899 82713 84403 86489 88160 88858 88634 88047 87794 88203 88899 89120 88552
64704 88552 87689 87280 87686 88939 90969 93388 95378 96312 96348 96132 96099 96380 97005 97649 97479 95950 93707 92045
64686 92045 91441 91164 90423 89282 88249 87556 87123 86849 86568 86005 85089 84143 83558 83422 83573 83883 84417 85422
64668 85422 87180 89657 92359 94756 96803 98726 100408 101431 101776 101923 102105 101908 101007 99894 99448 99913
64652 99913 100628 100791 100249 99529 99185 99179 99006 98489 98233 98889 100112 100741 100165 99037 98415 98642 99354 100129 100622
64633 100622 100331 98887 96653 94642 93714 94043 95313 97136 99152 100965 102289 103212 104206 105736 107764
64618 107764 109745 111273 112635 114484 117013 119751 122268 124688 127306 130008 132464 134689 136990 139358
64604 139358 141312 142518 143311 144342 145777 147048 147503 147188 146801 146916 147473 148091 148588 148985 149256 149469 150009
64587 150009 151184 152644 153624 153780 153377 152641 151480 150023 148780 147931 146907 145093 142604 139966 137466
64572 137466 135264 133785 133346 133578 133785 133780 133839 133979 133909 133683 133805 134492 135401 136238 137146 138234 139177 139634 139717
64553 139717 139701 139493 138838 137907 137283 137289 137560 137371 136272 134359 132058 129793 127840 126311 125129 124034 122765
64536 122765 121294 119763 118215 116571 114970 113820 113323 113132 112728 111982 111115 110331 109797 109807 110526 111578 112263
64519 112263 112227 111670 110923 110189 109638 109366 109180 108773 108204 107835 107709 107377 106512 105349 104340 103642 103124 102549
64501 102549 101581 99954 97941 96379 95899 96268 96724 96766 96410 95900 95459 95210 95046 94704 94153 93709 93553 93349
64483 93349 92641 91461 90214 89206 88680 89074 90594 92539 93707 93809 93948 95264 97451 99114 99475 99177
64467 99177 99287 99972 100534 100550 100506 101196 102802 104825 106739 108410 109872 111120 112303 113800 115775 117742
64451 117742 118916 119069 118878 119346 120970 123422 125855 127481 128114 128321 128998 130610 132854 135124 137331 140153
64435 140153 144348 149870 155820 161300 166135 170595 174665 177973 180478 182813 185783 189743 194675 200520
64421 200520 207138 214148 221244 228608 236606 245031 252992 259680 265001 269324 272833 275315 276410 275897
64407 275897 273817 270526 266617 262623 258687 254450 249231 242454 234138 225030 216103 207835 200087 192688
64393 192688 185858 179834 174321 168712 162887 157436 152949 149349 146147 143170 140757 139287 138788 139013 139644
64378 139644 140359 140946 141531 142512 144103 146119 148298 150654 153268 155944 158373 160534 162543 164270 165517
64363 165517 166579 168098 170217 172360 174069 175598 177311 178864 179544 179296 179003 179737 181994 185558 189793
64348 189793 194077 198214 202486 207211 212426 218163 224746 232451 241061 250143 259665 269834 280386 290579
64334 290579 300070 309349 319093 329327 339472 348952 357556 365363 372510 379021 384836 390114 395392 401258
64320 401258 407928 415446 424285 435372 449563 467407 489414 516034 547251 582700 622503 667655
64308 667655 719308 777967 843490 915309 992175 1071946 1151977 1229355 1300294 1359697 1402212
64297 1402212 1424144 1424399 1404038 1365557 1312466 1248781 1178326 1104418 1029976 957465 888597 824306
64285 824306 765057 710980 661778 616882 575845 538460 504569 473936 446264 421129 398071
64274 398071 377078 358745 343478 330616 318835 307420 296592 286686 277664 269507 262265 255457
64262 255457 248182 240339 233053 227280 222590 218051 213797 210795 209329 208635 207978 207200 206179 204692 203026
64247 203026 201936 201596 201299 200604 200169 200895 202724 204744 206127 206504 205857 204585 203434 202881 202767 202844 203274
64230 203274 204132 204911 205228 205628 206841 208441 209175 208638 207735 207394 207706 208565 210167 212396 214542 216274 218296
64213 218296 221443 225632 230330 235490 241324 247591 253961 260791 268706 277552 286594 295699 305528 316543
64199 316543 328551 341361 355118 369765 384896 400507 417418 436683 459001 484965 515340
64188 515340 550700 591097 636430 686886 742878 804789 872887 947094 1026526 1109367 1192959
64177 1192959 1273400 1345162 1402129 1439760 1456083 1450743 1424170 1378331 1317346 1246231 1169166
64166 1169166 1089426 1010215 934286 862909 796196 734502 678623 628693 583845 543253 506734
64155 506734 474155 445116 419513 397572 378852 361952 345784 330560 316928 304729 293352
64144 293352 282887 273956 266462 259356 251808 244045 236844 230676 225622 221693 218774 216409 214053 211684
64130 211684 209951 209456 209874 209967 208693 206224 203618 201579 199881 198064 196141 194332 192542 190716 189469
64115 189469 189705 191530 194044 196383 198447 200391 201872 202325 201804 201071 200880 201501 202946 205284 208609 212902
64099 212902 218020 223631 229107 233756 237299 239938 241910 243242 244097 244874 245571 245388 243594 240602 237481
64084 237481 234439 230695 226138 222174 220167 219657 218993 217448 215769 214779 214487 214809 216237 219201 223308
64069 223308 227786 232371 237355 243076 249804 257868 267446 278314 290108 302734 316248 330492 345102
64056 345102 359657 373496 385602 395152 402123 406984 409893 410618 409171 405990 401393 395326 387876 379719
64042 379719 371773 364636 358432 352957 347720 342176 336216 330359 325177 320624 316174 311528 306933 302776
64028 302776 299093 295567 291920 288255 285015 282638 281192 280400 280021 280061 280574 281424 282455 283768 285548 287627
64012 287627 289469 290739 291716 293033 295174 298287 302329 307127 312335 317579 322723 327961 333605 339801
63998 339801 346420 353218 360162 367690 376484 386854 398433 410659 423479 437331 452530 469036
63986 469036 486929 506670 528521 551952 576055 600561 626089 653367 682563 713598 746828
63975 746828 783067 822945 866576 914039 966090 1024238 1090196 1165507 1251813 1351232 1466202
63964 1466202 1599069 1752141 1928160 2130344 2361723 2624350 2918853 3244138 3597344
63955 3597344 3974636 4372532 4788224 5218208 5656710 6095560 6525112 6934712 7312861
63946 7312861 7648361 7932263 8158835 8324876 8428540 8468670 8444319 8354452 8198723 7979340
63936 7979340 7702268 7376504 7012395 6620594 6211546 5794632 5377196 4964542 4560952
63927 4560952 4170688 3798213 3447790 3122822 2825290 2555668 2313450 2097720 1907243
63918 1907243 1740276 1594580 1467632 1356808 1259619 1174030 1098502 1031633 971987 918437
63908 918437 870405 827389 788400 752166 717899 685636 655817 628602 603469 579335 555270
63897 555270 531290 508292 486963 467030 447829 429262 411710 395253 379612 364835 351440
63886 351440 339667 329092 319195 309960 301703 294602 288575 283351 278448 273327 267787 262131 256874 252441
63872 252441 249122 246954 245526 244141 242356 240230 238048 236094 234713 234160 234216 234294 234137 234078 234363 234699 234813
63855 234813 235077 236001 237319 238126 237866 236666 234720 231894 228122 223783 219427 215337 211490 207696 203715
63840 203715 199494 195432 192127 189653 187348 184553 181340 178249 175536 173060 170800 169035 167903 167134
63826 167134 166415 165768 165364 165140 164859 164451 164034 163580 162821 161570 159992 158457 157257 156589 156640 157495 158964
63809 158964 160662 162332 163962 165535 166763 167279 167053 166453 165823 165137 164261 163426 163072 163149 162918 161778 160093
63792 160093 158807 158329 158203 157873 157277 156550 155612 154436 153381 152834 152670 152400 151728 150665 149225 147470 145745
63775 145745 144462 143629 142924 142215 141606 141035 140285 139460 138968 138881 138797 138546 138472 138690 138570 137520 135935 134745
63757 134745 134243 133943 133519 133200 133148 133076 132712 132213 131825 131506 131232 131349 132226 133649 134961 135805 136505 137697
63739 137697 139729 142451 145418 148302 151195 154505 158445 162686 166617 169898 172615 174933 176844 178227
63725 178227 178963 178975 178369 177630 177407 177896 178563 178662 177965 176864 175952 175731 176526 178312 180605 182837 184948 187324
63707 187324 190141 193075 195782 198345 200987 203576 205766 207462 208846 210000 210795 211170 211247 211186 211085 211003
63691 211003 210821 210143 208661 206701 205058 204106 203307 201889 199822 197894 196868 196838 197387 198136 199004 200023
63675 200023 201036 201631 201455 200582 199458 198375 197065 194965 191892 188318 184925 181982 179248 176369 173274
63660 173274 170234 167688 166013 165265 165108 165138 165354 166129 167612 169404 171135 173111 175897 179245 182040 183577
63644 183577 184492 186048 188812 192430 196453 200826 205662 211066 217273 224524 232675 241339 250613 261273
63630 261273 273935 288243 303256 318576 334791 352747 372576 393506 414528 434943 454091
63619 454091 470685 482940 489792 491861 490866 488139 484023 478630 472616 467013 462645 459892 458618 457959
63605 457959 456437 452732 446384 437654 426927 414543 401079 387368 374057 361274 348798 336520
63593 336520 324720 313934 304544 296579 289988 285046 282191 281338 281596 281947 282185 283038 285382 289452 294811
63578 294811 300930 307660 315047 322807 330296 337213 344069 351602 359893 368527 377588 387854 399776 412837
63564 412837 426348 440471 455896 472605 489290 503932 514736 520836 522601 521247 517891 512982
63552 512982 506809 500216 494353 489853 486663 484632 483771 483907 484497 484886 484423 482284 477643 470291 460820
63537 460820 449985 438038 424822 410344 395081 379802 365144 351339 338372 326427 315918
63526 315918 306843 298408 289764 281087 273356 267018 261445 255913 250554 245916 242082 238756 235907 233672
63512 233672 231745 229587 227373 226076 226221 226890 226410 223962 220239 216622 213990 212355 211276 210394 209590
63497 209590 208869 208268 207869 207815 208209 209015 210196 211982 214840 218959 223795 228315 231784 234195 235938 237327
63481 237327 238492 239387 239597 238420 235633 232083 229032 226827 224672 221820 218479 215371 212958 211527 211473
63466 211473 212867 214980 216920 218643 220766 223459 226249 229025 232469 237010 241952 246244 249908 254123
63452 254123 259939 267325 275526 283916 292327 300846 309652 319021 329209 340182 351603 363286 375628
63439 375628 389399 405040 422434 441470 462562 486209 512162 539352 566652 593321 618677
63428 618677 641663 660940 675242 683663 686016 683250 677309 670258 663452 657489 652593 648773 645739
63415 645739 642947 639689 635072 628112 618152 605182 589620 571883 552382 531809 511077 490941
63403 490941 471849 454159 438222 424113 411498 399981 389557 380661 373794 369158 366627 366023 367426
63390 367426 371148 377347 385721 395720 407096 420100 435082 451958 470119 488659 506551 522795
63378 522795 536733 548422 558612 568302 578258 588837 600068 611830 624029 636519 648649 658946
63366 658946 665679 668058 666741 662952 657336 649963 641191 632001 623450 616207 610628 606745 603950 601055
63352 601055 596888 590563 581153 567704 550092 529536 507780 485957 464613 444489 426537 411104
63340 411104 397561 384902 372468 360229 348790 339134 331872 326584 322133 317692 313170 308765 304537
63327 304537 300554 297016 294037 291576 289654 288325 287386 286563 286114 286819 289166 292959 298007 304700 313448
63312 313448 323840 334876 345805 356258 365653 373016 377510 378830 376985 372031 364186 353998 342175
63299 342175 329376 316295 303847 292920 283782 275859 268387 261361 255533 251367 248352 245698 243350
63286 243350 241716 240527 238801 236165 233501 231814 230947 230022 228800 228001 228328 229727 231598 233321 234521
63271 234521 235207 235804 236825 238414 240314 242269 244166 245802 246834 247224 247635 249114 252234 256563 261146
63256 261146 265519 270051 275111 280278 284879 289139 294122 300335 307113 313731 320530 328398 337628 347967
63242 347967 359438 372319 386452 401320 416897 433729 452065 471428 491212 511174 531195
63231 531195 551109 571048 591477 612553 633768 654541 674926 695496 716845 739448 763688
63220 763688 789552 816377 843171 869156 893822 916623 936874 953976 967576 977480 983515 985491
63208 985491 983273 976906 966604 952556 934855 913786 890040 864339 836956 808033 778400 749624
63196 749624 723079 699410 679111 663069 651983 645505 642543 642435 645449 652142 662525 675885 691180
63183 691180 707544 724591 742200 760004 777328 793912 810411 827764 846137 864925 883644
63172 883644 902232 920355 937036 951368 963219 972807 979816 983387 982849 978069 969113 955949 938638
63159 938638 917598 893576 867458 840090 812158 784203 756826 730828 706973 685649 666909
63148 666909 650757 637132 625679 615906 607733 601650 598192 597473 599338 603645 610182 618573 628615
63135 628615 640490 654120 668319 680991 690348 695757 697373 695303 689351 679435 666121 650810 635328
63122 635328 621074 608410 597012 586745 577873 570432 563923 558001 553106 549923 548298 547107 545303
63109 545303 542825 540391 538634 537599 536996 536769 537263 538762 540927 542929 544225 545031 545854 546774 547409 547540
63093 547540 547513 547970 549280 551239 553279 555035 556699 558686 560950 562920 564268 565403 566917 568766 570403
63078 570403 571657 573096 575506 579291 584379 590408 597023 604241 612522 622219 632978 644121 655633
63065 655633 668369 683102 699759 717829 737224 758376 781665 807043 834223 863000 893411
63054 893411 925660 959796 995416 1031813 1068563 1105760 1143535 1181476 1218819 1255092 1290361
63043 1290361 1324865 1358799 1392545 1426837 1462353 1499128 1536522 1573739 1610181 1645194 1677614
63032 1677614 1705771 1727943 1742737 1749157 1746635 1735115 1714956 1686667 1650831 1608413 1560945 1510193
63020 1510193 1457654 1404487 1351822 1300974 1253407 1210487 1173055 1141109 1114089 1091764 1074714
63009 1074714 1063732 1058921 1059629 1065080 1074686 1087937 1104494 1124418 1147879 1174492 1203258 1233247
62997 1233247 1264009 1295295 1326782 1358247 1389675 1420989 1451927 1482316 1512067 1540693 1567065
62986 1567065 1589924 1608363 1621644 1628808 1628792 1620743 1604057 1578437 1544311 1502995 1456029 1404418
62974 1404418 1348799 1290268 1230598 1171496 1113864 1057827 1003362 950850 901161 855185 813196
62963 813196 774690 738903 705445 674359 645771 619663 595914 574330 554610 536447 519685
62952 519685 504280 490134 477032 464747 453166 442376 432683 424415 417607 411868 406635 401521 396470
62939 396470 391726 387664 384417 381607 378618 375252 371968 369384 367668 366466 365178 363236 360406 357088
62925 357088 354120 352027 350574 349188 347570 345666 343341 340473 337277 334119 331069 327934 324733 321780
62911 321780 319294 317227 315484 314053 312804 311481 310057 308870 308249 308125 308154 308151 308240 308565 308991 309175 308921
62894 308921 308382 307838 307354 306839 306374 306229 306479 306844 307014 306909 306510 305755 304804 304151 304147 304564 304880 304820 304411 303784
62874 303784 303271 303418 304411 305600 306064 305630 304960 304686 304904 305455 306153 306663 306683 306432 306525 307187 307991 308560 309035
62855 309035 309544 309654 308874 307478 306320 305894 305892 305711 305031 303867 302299 300352 298078 295717 293711 292456
62839 292456 291975 291904 291879 291886 292205 293082 294440 295876 296990 297882 299239 301673 304932 308082 310548 312720 315348
62822 315348 318610 322011 325087 327927 331036 334790 339078 343407 347413 351201 355073 359019 362746 366191
62808 366191 369695 373617 378156 383654 390589 398959 408093 417538 427855 440010 454097 469234 484778
62795 484778 501171 519457 540354 564061 590736 620805 654745 692684 734333 779457 828425
62784 828425 882086 940866 1004135 1070701 1139715 1210649 1282411 1352962 1420026 1481834 1536959
62773 1536959 1583781 1620526 1645760 1658616 1658654 1645884 1620984 1585343 1540787 1489247 1432467 1371728
62761 1371728 1307813 1241472 1173986 1107149 1042625 981421 923945 870309 820385 773775 730082
62750 730082 689275 651666 617490 586691 559092 534553 512829 493484 476141 460755 447428
62739 447428 436013 426096 417376 409843 403511 398142 393383 389059 385283 382403 380938 381396 383860 387742
62725 387742 392102 396323 400456 404985 410444 417239 425607 435511 446678 458947 472621 488255 506054
62712 506054 525714 547098 570862 598076 629246 664097 702458 744873 792058 844046 900334
62701 900334 960622 1024807 1092198 1161201 1229950 1296796 1360072 1417862 1468387 1510369 1542728
62690 1542728 1564220 1573782 1571061 1556351 1530229 1493614 1447933 1394795 1335617 1271973 1206071 1140202
62678 1140202 1075663 1012779 952066 894691 841566 792572 747197 705464 667666 633515 602262
62667 602262 573642 548102 525973 506844 489929 474726 461069 448770 437476 426823 416606
62656 416606 406830 397660 389220 381377 373727 365867 357683 349438 341662 334893 329356 324858 321054 317706
62642 317706 314605 311464 308237 305417 303573 302482 301155 298976 296469 294601 293604 292874 291874 290648 289491
62627 289491 288517 287745 287332 287554 288607 290418 292521 294278 295580 297266 300420 305142 310406 315312 320039
62612 320039 325276 331210 337677 345113 354631 366924 381518 397364 413942 431563 450865 472406
62600 472406 496703 524246 555111 588565 623227 657832 691856 725296 757833 788347 815367
62589 815367 837918 855774 868865 876609 877904 871804 858260 838322 813742 786332 757516 728133
62577 728133 698408 668157 637359 606665 577219 549965 525286 503269 483899 466812 451278
62566 451278 436841 423715 412170 401801 391988 382967 375805 371160 368568 367079 366085 365247 364134 362451
62552 362451 360413 358431 356531 354387 351844 349113 346486 344148 342249 340883 339993 339455 339277 339561 340358
62537 340358 341772 344141 347865 352993 359141 365934 373359 381652 391009 401581 413676 427787 444337
62524 444337 463405 484768 508180 533574 561061 590884 623471 659301 698423 740116 783222
62513 783222 826795 870183 912529 952623 989443 1022600 1052009 1077366 1098219 1114409 1126173
62502 1126173 1133964 1138466 1140640 1141346 1140864 1138983 1135537 1130540 1123757 1114525 1102219 1086767 1068496 1047525
62488 1047525 1023480 995885 964813 931092 895880 860084 824276 788966 754577 721079 688081
62477 688081 655611 624577 596126 570631 547615 526515 507195 489765 474326 460933 449521
62466 449521 439795 431471 424590 419336 415567 412895 411277 411073 412379 414635 417168 419862 423119 427384
62452 427384 432899 439638 447255 455229 463315 471697 480560 489669 498589 507076 514999 521980 527425 530960
62438 530960 532732 533292 533182 532432 530312 525834 518763 510045 501035 492339 483624 474421 464908 455824 447834
62423 447834 440999 434848 428943 423317 418250 413707 409408 405478 402602 401225 400962 401151 401747 403142 405323
62408 405323 407717 409887 411877 413839 415781 417836 420390 423663 427383 431069 434513 437919 441737 446345
62394 446345 451655 457000 461666 465562 469145 472690 476035 479068 482024 485117 488318 491794 496165 501910
62380 501910 508728 515880 523048 530571 539038 549057 561305 576367 594458 615590 640039 668282
62368 668282 700342 735428 772421 810633 849986 890457 931297 970628 1005934 1035224 1057979
62357 1057979 1074987 1087325 1095615 1100076 1100885 1098228 1092210 1082984 1070926 1056459 1039635 1020087 997545
62344 997545 972339 945306 917278 888940 861126 834867 810813 788767 768135 748744 730857
62333 730857 714411 698784 683476 668594 654402 640818 627724 615425 604319 594332 585156 576914
62321 576914 570068 564773 560862 558360 557406 557503 557500 556688 555568 555227 556194 558159 560520 562838 564964 567035
62305 567035 569321 571947 574852 578104 581957 586426 591039 595240 598916 602421 606331 611358 618073 626315
62291 626315 635065 643386 651375 659807 668962 678235 686870 694513 700943 705782 708872 710620 711569 711745 710802
62276 710802 708848 706850 706073 707292 710709 716524 725267 737429 752968 771524 793178 818659 848590
62263 848590 882556 919030 956019 991666 1024426 1053124 1077035 1095822 1109391 1117874 1121659 1121186
62251 1121186 1116646 1108013 1095403 1079214 1059798 1037158 1011212 982401 951922 921246 891434 863012
62239 863012 836473 812564 791792 773810 757692 742966 730066 719620 711579 705269 700103 695963
62227 695963 693016 691389 690980 691413 692320 693786 696362 700440 705825 712152 719407 727687 736670 745862 755252
62212 755252 765179 775387 784655 791631 795858 797899 798673 798682 797689 795132 790985 786097 781421 777146 773079
62197 773079 769707 768165 768923 771115 773533 775943 779048 783473 789123 795268 800974 805580 809057 811877
62183 811877 814524 817404 821230 827055 835629 847010 860999 877571 896592 917531 939873 963565
62171 963565 988586 1014228 1039080 1061512 1079924 1093008 1100504 1103592 1103967 1102432 1098647 1092065 1082526
62158 1082526 1070046 1054689 1036875 1017301 996305 973661 949281 923930 899011 875796 854921
62147 854921 836358 819694 804528 790743 778384 767392 757640 749098 741644 734771 727810 720538 713312
62134 713312 706651 701017 696940 694840 694534 695376 697084 700000 704183 708581 711541 712011 710056 706477 702313
62119 702313 698546 695796 694143 693303 692824 691931 689490 684595 677231 668096 657870 646978 636026 625915
62105 625915 617289 610097 603928 598635 594481 591740 590308 589663 589235 588907 589099 590257 592326 594966 598178
62090 598178 602311 607400 612994 618851 625422 633268 642343 652260 663020 674919 687889 701534 715849
62077 715849 731257 747764 764678 781516 798697 816832 835630 853967 870770 885284 896660
62066 896660 903946 906756 905589 901340 894703 886030 875357 862370 846563 827703 806073 782241 756699
62053 756699 729765 701721 673050 644596 617353 591855 567867 544965 523312 503584 486262
62042 486262 471379 458813 448287 439093 430496 422603 416154 411145 406296 400449 394026 388438 384366
62029 384366 381289 378585 376345 374943 374334 374007 373419 372327 370858 369298 367717 365876 363630 361259 359193
62014 359193 357555 356254 355391 355316 356297 358335 361137 364085 366478 368202 370055 372987 377019 381218 384679
61999 384679 387227 389161 390612 391230 390328 387454 383007 378040 373240 368316 362799 357119 352338 348966 346653
61984 346653 344929 343596 342426 341205 340232 340117 340824 341483 341445 341020 340910 341423 342511 344031 345536 346258 345814
61967 345814 344680 343626 342942 342538 342441 342787 343560 344739 346512 348993 351968 355297 359290 364224 369721 375157
61951 375157 380635 387060 395148 404720 415030 425501 436063 447064 458953 471909 485679 499809
61939 499809 513989 528092 542017 555620 568694 580873 591695 601025 609313 617230 625060 632617
61927 632617 639640 646081 652133 658247 665101 673328 683226 694824 708170 723428 740764 760385 782714
61914 782714 808337 837640 870468 906138 943876 983441 1025380 1070547 1119329 1171497 1226793
61903 1226793 1285367 1347441 1412669 1479774 1546487 1609725 1666257 1713513 1749618 1772630 1780449
61892 1780449 1772015 1748321 1711712 1664351 1607888 1544343 1476518 1407220 1338462 1271463 1207013
61881 1207013 1145578 1087428 1032962 982814 937474 896906 860593 827895 798407 772132 749263
61870 749263 729645 712544 697154 683351 671677 662629 656225 652260 650655 651419 654410 659217 665200
61857 665200 671763 678853 687125 697331 709455 722693 736177 749321 761445 771675 779576 785581
61845 785581 790322 793692 795062 794424 792860 791717 791651 792859 795945 802019 811744 824762 840458 859012
61831 859012 881056 906186 932264 956411 976294 990169 996303 993262 981028 961400 936982 909855
61819 909855 881199 851891 823120 796347 772751 752831 736526 723575 713533 705631 699087 693799
61807 693799 690432 689595 691173 694618 699518 705570 712384 719815 728218 737878 748326 758772 769195 780489
61793 780489 793589 808943 826814 847446 870694 896006 923073 952250 984214 1019575 1058980
61782 1058980 1103145 1152523 1207147 1267092 1332895 1405374 1485266 1573117 1669135 1772886 1883320
61771 1883320 1999258 2119545 2242368 2364490 2481288 2587455 2677743 2747510 2793102 2812066
61761 2812066 2803327 2767542 2707257 2626320 2528943 2419452 2302509 2182663 2063210 1945928
61751 1945928 1832182 1723727 1622018 1527336 1439296 1357958 1283754 1216531 1155373 1099450 1048482
61740 1048482 1002331 960674 923245 889922 860265 833326 808238 784872 763674 744913 728233
61729 728233 712882 698324 684655 672440 662142 653703 646676 640606 635131 629927 624802 619796 614951
61716 614951 610043 604811 599394 594225 589419 584627 579641 574862 570921 567963 565539 563057 560080 556264
61702 556264 551425 545853 540373 535737 531917 528234 524327 520818 518794 518671 519837 521459 523401 526202
61688 526202 530368 535951 542750 550602 559359 568747 578453 588425 598932 610227 621987 633103 642041
61675 642041 647459 648544 644975 636892 624977 610331 593982 576551 558482 540494 523621 508804
61663 508804 496557 487066 480383 476436 474955 475693 478867 485206 495254 508486 523229 537522 549825
61650 549825 558867 563281 562028 555219 544136 530297 514789 498433 482021 466039 450556 435836
61638 435836 422840 412647 405376 399987 395110 389879 384161 378462 373705 370664 369350 369033 368955 368946 369320
61623 369320 370421 372339 374851 377451 379576 381027 382154 383461 384979 386062 385838 383873 380502 376615
61609 376615 373064 370156 367688 365471 363713 362759 362527 362535 362601 363251 365119 368071 371262 374130 376973 380433
61593 380433 384696 389449 394402 399574 405155 411331 418209 425742 433822 442476 451786 461493 471005 480103
61579 480103 489334 499396 510425 522354 535604 550779 567833 586309 606411 629038 654633 682761
61567 682761 713143 746295 782615 821436 861429 901327 939567 973753 1001386 1021022 1032207
61556 1032207 1034682 1028566 1015243 997149 976337 953798 930285 907088 885509 865936 847963 831274
61544 831274 816069 802652 790891 780235 770162 760476 751103 741731 731987 722046 712715 704611 697422
61531 697422 690327 683060 676248 670698 666684 663961 662219 661386 661638 663217 666226 670637 676534 684276 694332
61516 694332 707114 723010 742367 765254 791378 820431 852498 888109 928123 973539 1025065
61505 1025065 1082750 1146423 1216613 1294427 1380121 1472276 1568744 1667810 1767796 1866044 1959116
61494 1959116 2043727 2116790 2175176 2216759 2241886 2252856 2251948 2240924 2222496 2200903 2180344 2163695
61482 2163695 2153277 2151822 2161608 2183167 2215794 2259025 2312658 2375351 2443856 2513662 2579871 2637492
61470 2637492 2681558 2707490 2711642 2691988 2648729 2584265 2502437 2407930 2306179 2202832 2102357
61459 2102357 2007159 1918376 1837158 1764680 1701394 1647183 1602177 1566657 1540170 1521597 1510380
61448 1510380 1507077 1512469 1526874 1550707 1585018 1630687 1687158 1752135 1821773 1890275 1949713 1991785
61436 1991785 2010957 2006369 1981198 1940862 1891692 1839880 1790163 1745123 1706171 1675106 1654192
61425 1654192 1644747 1646490 1658746 1681811 1716571 1762972 1819120 1881243 1943513 1997814 2034889 2047189
61413 2047189 2031664 1990524 1929762 1856707 1777973 1698538 1621843 1550169 1484598 1424930 1370212
61402 1370212 1319690 1273220 1230908 1192668 1158229 1127364 1100008 1076291 1056330 1039755 1025577
61391 1025577 1012971 1002189 994268 989829 988600 990196 994851 1003200 1015777 1032884 1054423 1079639
61379 1079639 1107528 1137838 1171137 1207512 1245743 1284271 1322392 1359778 1395202 1426693 1452938
61368 1452938 1473817 1489537 1499944 1504905 1504789 1500185 1491416 1478532 1461598 1440803 1416438 1388869
61356 1388869 1358450 1325584 1291005 1255867 1221277 1187822 1155737 1125266 1096484 1069035 1042619
61345 1042619 1017644 994793 974005 954561 936319 920112 906623 895488 886036 878357 873000 869921
61333 869921 868428 868073 868982 871277 874775 879510 886067 895054 906444 919711 934361 950049 966416
61320 966416 983266 1000919 1019852 1039717 1058955 1075747 1089278 1099855 1108050 1114186 1118624 1122005
61308 1122005 1124924 1127669 1130470 1133612 1136956 1139631 1140707 1140089 1138412 1136085 1132844 1128254 1122231 1114918
61294 1114918 1106376 1096646 1085978 1074810 1063612 1052822 1042838 1033973 1026451 1020488 1016243 1013651 1012438
61281 1012438 1012436 1013849 1017148 1022646 1030257 1039626 1050431 1062374 1074785 1086376 1095701 1101946 1105106 1105395
61267 1105395 1102848 1097740 1091146 1084698 1079765 1077089 1077068 1080101 1086559 1096695 1110730 1129016 1152129
61254 1152129 1180852 1216020 1258244 1307808 1364894 1429876 1503437 1586541 1680259 1785033 1899296
61243 1899296 2018230 2133623 2235136 2312569 2358502 2370365 2350850 2306523 2245614 2176141 2104703
61232 2104703 2036042 1973545 1920139 1878449 1850082 1835418 1834528 1847849 1875396 1915679 1965850 2022320
61220 2022320 2080054 2131190 2165658 2174632 2154260 2106798 2038724 1957650 1870088 1781101 1695156
61209 1695156 1616358 1547290 1487971 1436521 1390816 1349302 1310764 1274335 1239921 1208020 1178978
61198 1178978 1152868 1129978 1110720 1094854 1081346 1069177 1057834 1046946 1036041 1024859 1013411
61187 1013411 1001499 988538 974037 957896 940271 921541 902401 883408 864481 845472 827099
61176 827099 810487 795721 781813 768331 756064 745704 736916 729334 723483 719830 717708 716149 715279
61163 715279 715916 718095 720782 722738 722848 719903 713057 702633 689944 676305 662598 649460 637247
61150 637247 625930 615564 606702 599831 594662 590535 587215 584608 582019 578588 574434 570492 567171 564011
61136 564011 560798 558193 556887 556697 556852 556691 555867 554346 552617 551559 551678 552688 554099 556099 559583
61121 559583 565339 573334 582819 593046 603765 614901 625873 635575 643115 648265 651073 651511 649801
61108 649801 646631 642518 637263 630561 622980 615825 610098 605924 602773 599853 596495 592674 589073 586310
61094 586310 584242 582288 580127 577771 575327 573114 571563 570512 569053 566683 564150 562508 561816 561548 561747
61079 561747 562705 563929 564582 564890 565994 568460 571948 576291 581773 588211 594952 602006 610164 619679 629770
61064 629770 639759 649782 660053 670373 680691 691301 702132 712662 722841 733265 744095 754713
61052 754713 764817 775062 786254 798764 812965 829309 847628 867272 888299 911559 937337
61041 937337 965016 994428 1026251 1060571 1096272 1132452 1169203 1206504 1243916 1282292 1324318
61030 1324318 1372302 1426783 1488213 1558245 1637753 1725055 1817988 1916942 2024741 2145242 2283985
61019 2283985 2448972 2648890 2891895 3187777 3549243 3988711 4516920 5149661 5915606
61010 5915606 6855180 8014366 9439157 11154051 13105748 15104149 16840616 18019114
61002 18019114 18519075 18455549 18092830 17704466 17494353 17587079 18011400 18648788 19220838 19390082
60992 19390082 18931442 17841447 16304205 14564384 12819204 11186364 9722311 8445464
60984 8445464 7350437 6420153 5636020 4980637 4435650 3982144 3603844 3288016 3023534
60975 3023534 2799869 2607946 2440734 2293206 2162673 2048415 1949590 1863712 1788057 1721828
60965 1721828 1665629 1619253 1581232 1550036 1524184 1501271 1478356 1453722 1427425 1400143 1372410
60954 1372410 1344963 1318720 1293985 1270272 1247015 1223888 1200439 1176100 1150662 1124206 1096603
60943 1096603 1067752 1038365 1009955 983965 961218 942021 926285 913642 903948 897510 894385 893797
60931 893797 894740 896704 899049 900311 899319 896831 894881 894450 894904 895738 897577 901047 905827 911391 917682
60916 917682 924392 930407 934752 937499 939065 939256 937714 934904 931846 929155 926900 925089 923618 921915
60902 921915 919250 915336 910147 903338 894394 883374 871121 858814 847573 838236 830925 824839 818953
60889 818953 812962 807160 801454 795031 787150 777836 767598 756837 745870 735261 725647 717222 709659
60876 709659 702594 696057 690328 685459 681051 676524 671609 666495 661441 656209 650006 642135 632721 622728
60862 622728 613292 605171 598765 594267 591431 589349 586914 583633 579839 576147 573073 571179 571029 572611
60848 572611 575095 577551 579710 581699 583204 583393 581683 578271 573854 569063 564153 558976 553266 547142
60834 547142 541271 536305 532214 528565 525383 523318 522802 523378 524096 524381 524273 523955 523289 521898 519605 516695
60818 516695 513659 510640 507276 503154 498289 493055 487785 482634 477691 472958 468271 463450 458515 453607
60804 453607 448815 444193 439817 435637 431439 427146 422965 418997 414967 410695 406611 403338 400899 398756
60790 398756 396563 394427 392523 390952 389936 389629 389624 389119 387706 385649 383417 381389 380007 379611 379978 380553
60774 380553 381305 382796 385244 388151 391200 394859 399584 404952 410180 415143 420177 425060 428876 430931
60760 430931 431349 430697 429459 427951 426442 425150 424292 424161 424966 426545 428338 429720 430313 429994 428695 426229
60744 426229 422339 416999 410692 404320 398768 394526 391507 389069 386355 382941 379187 375754 372852 370232
60730 370232 367745 365466 363299 360968 358547 356519 355158 354261 353636 353344 353223 352720 351586 350296 349370 348622
60714 348622 347521 345978 344298 342602 340792 338943 337344 336266 336002 336890 338925 341494 343853 345743 347296
60699 347296 348652 350071 352066 354875 358066 361194 364583 368724 373088 376405 378275 379751 382042 385257
60685 385257 388739 392041 395074 397700 399753 401379 402961 404769 406870 409168 411257 412359 411817 409661
60671 409661 406486 402781 398622 394106 389745 386138 383281 380517 377332 373990 371133 368890 366777 364546
60657 364546 362707 361971 362441 363662 365239 367039 368831 370081 370172 368718 365734 361701 357342 353063 348688
60642 348688 343960 339186 335105 332171 330248 328976 328108 327484 326987 326631 326549 326813 327388 328133 328689 328602 327908
60625 327908 327419 327937 329212 330238 330640 331141 332400 333952 334837 334899 334812 334937 334817 334001 332904 332452 333097 334495
60607 334495 336103 337769 339637 341692 343572 344730 344705 343427 341459 339766 338917 338586 338190 337892 338438 339917
60591 339917 341364 341948 341992 342364 343312 344587 346278 348672 351312 353100 353571 353418 353503 353928 354403 354991 355960
60574 355960 357240 358508 359737 361247 363258 365677 368347 371312 374771 378849 383479 388508 393917 399812
60560 399812 406070 412218 417953 423633 429812 436331 442423 447886 453584 460434 468337 476631 485384 495667
60546 495667 508615 524768 544377 567873 595704 627974 664460 704736 747843 791836 833894
60535 833894 871016 900547 920248 928454 924587 909414 884523 851739 813323 772428 732445 695598
60523 695598 662512 633286 608331 587925 571676 559174 550691 546476 545749 547270 550819 557205 566862
60510 566862 579412 594809 613959 637701 665935 698285 734934 776082 820900 867508 913569
60499 913569 956357 992669 1019609 1035677 1040886 1036148 1023144 1004695 984566 966523 953488 947298
60487 947298 948780 958044 974955 999176 1029335 1062198 1093149 1117683 1132385 1134906 1123802 1098945
60475 1098945 1061931 1015819 964278 910699 857577 806440 758288 714027 674323 639128 607723
60464 607723 579402 553978 531541 511869 494286 478149 463414 450623 440260 432142 425586 420061
60452 420061 415448 411667 408440 405655 403633 402686 402603 402888 403342 404131 405415 407311 410081 413907 418514 423477
60436 423477 428955 435682 444031 453463 463071 472305 480886 488279 493647 496326 496263 494148 491209 488664 487075
60421 487075 486252 485852 485980 487054 489333 492754 497111 502112 507387 512760 518538 525315 533463 543036 554143
60406 554143 567103 582069 598812 617095 637081 659077 682936 707992 733689 760035 787327
60395 787327 815533 844042 871938 898472 923309 946334 967163 984903 998669 1008463 1015340 1020560
60383 1020560 1024728 1027883 1030150 1031945 1033638 1035352 1037105 1038821 1040117 1040422 1039489 1037578 1034970 1031555
60369 1031555 1027168 1022195 1017525 1013905 1011558 1010506 1011085 1013888 1019098 1025867 1032478 1037205 1039047 1037586
60355 1037586 1032404 1022969 1009159 991542 970911 947677 921966 894241 865645 837698 811721 788430
60343 788430 767842 749486 732737 717057 702043 687457 673365 660198 648467 638305 629272 620738
60331 620738 612523 605126 599245 595071 592169 590052 588636 588013 588018 588311 588773 589529 590669 592187 594157 596647
60315 596647 599433 602100 604449 606581 608674 610983 614009 618088 622707 626719 629477 631352 632862 633766
60301 633766 633399 631444 627830 622121 613720 602775 590435 578066 566493 556034 546888 539226 533003
60288 533003 527930 523689 520216 517711 516310 515818 515889 516442 517628 519359 521240 523100 525321 528442 532725
60273 532725 538331 545540 554399 564353 574642 584961 595453 606219 617229 628591 640486 652792
60261 652792 665051 676778 687608 697222 705491 712559 718515 723093 726025 727565 728221 728084 727003 725512
60247 725512 725069 727079 731969 739305 748527 759407 772146 787240 804988 824956 846126 867765 889883
60234 889883 912718 936053 959357 982453 1005770 1029995 1055633 1082847 1111601 1141995 1174530
60223 1174530 1209939 1248697 1290725 1335538 1382535 1431208 1481328 1532975 1586175 1640516 1695364
60212 1695364 1750451 1805827 1861115 1915330 1967840 2019134 2070103 2120535 2168727 2212568 2250732
60201 2250732 2282885 2309197 2329868 2344962 2354638 2359740 2362082 2363815 2366324 2369970 2375031 2382534 2393848
60188 2393848 2409579 2429128 2451179 2474306 2497278 2519298 2540178 2560072 2578934 2596416 2612304
60177 2612304 2626718 2639744 2651170 2660692 2667959 2672066 2671394 2664494 2650997 2631249 2605281 2572772
60165 2572772 2534045 2490458 2443647 2394854 2345125 2295538 2246730 2198630 2151080 2104548 2059810
60154 2059810 2017168 1976361 1937142 1899637 1864221 1831327 1801249 1773857 1748510 1724473 1701362
60143 1701362 1679089 1657583 1636743 1616440 1596307 1575719 1554276 1532167 1509809 1487284 1464424
60132 1464424 1441203 1417756 1394173 1370662 1347804 1326314 1306644 1289131 1274356 1262930 1255052
60121 1255052 1250777 1250692 1255812 1266675 1282904 1303793 1329044 1358863 1393601 1433399 1477929 1526359
60109 1526359 1577636 1630684 1684223 1736698 1786856 1834302 1878989 1920091 1955803 1984331 2004790
60098 2004790 2017148 2021747 2018997 2009183 1992338 1968528 1938358 1902993 1863651 1821326 1776986 1731641
60086 1731641 1686102 1640895 1596486 1553355 1511905 1472632 1436410 1404223 1376490 1352899 1332961
60075 1332961 1316510 1303668 1294702 1289958 1289613 1293340 1300346 1309669 1320255 1331055 1341502 1351742 1361868
60062 1361868 1371043 1377975 1382197 1384094 1383636 1379940 1372351 1361190 1346969 1329588 1308871 1285382 1260075
60049 1260075 1233473 1205704 1177151 1148630 1121128 1095658 1073083 1053743 1037487 1024316 1014615
60038 1014615 1008519 1005550 1005357 1008470 1015807 1027682 1043771 1063783 1087692 1115507 1147252 1182982
60026 1182982 1222361 1264389 1307884 1351963 1395579 1436919 1473787 1504386 1527162 1540251 1541998
60015 1541998 1532275 1512755 1485770 1453261 1416732 1377491 1336640 1295218 1254573 1216264 1181385
60004 1181385 1150206 1122602 1098556 1078182 1061525 1048477 1038756 1031968 1027959 1027066 1029786 1036229 1046232
59991 1046232 1059924 1077680 1099396 1124295 1151711 1181680 1214428 1249451 1285485 1321261 1356007
59980 1356007 1389171 1419993 1447621 1471718 1492748 1511404 1527631 1540462 1548940 1552936 1552797 1548442
59968 1548442 1539369 1525544 1507783 1487102 1464165 1439643 1414750 1390980 1369397 1350510 1334712
59957 1334712 1322503 1314276 1310191 1310449 1315493 1325752 1341223 1361473 1386031 1414587 1446754 1481832
59945 1481832 1518999 1557683 1597548 1638128 1678700 1718629 1757737 1796297 1834776 1873510 1912287
59934 1912287 1950054 1985303 2016966 2044872 2069259 2090127 2107370 2121335 2132878 2142902 2152224
59923 2152224 2161962 2173700 2188994 2208827 2233681 2263977 2300068 2341690 2387535 2435583 2483818
59912 2483818 2530419 2573279 2609764 2637336 2654403 2660335 2654910 2638225 2611229 2575878 2534535 2489379
59900 2489379 2442428 2395699 2351078 2310194 2274379 2244287 2219433 2198635 2181324 2168055 2159490
59889 2159490 2155485 2155752 2160940 2172121 2189271 2211059 2236367 2265446 2299335 2338726 2383831 2435132
59877 2435132 2493720 2560837 2637186 2722708 2816894 2919158 3028768 3144376 3263652 3383214
59867 3383214 3498401 3602739 3688010 3745717 3769439 3756614 3708963 3631782 3532579 3419579 3300516
59856 3300516 3181890 3068410 2962695 2865825 2778665 2702671 2639401 2589634 2553422 2530660 2520959
59845 2520959 2522861 2533683 2550468 2571188 2595381 2624152 2659667 2704281 2759847 2827680 2908837
59834 2908837 3004137 3114061 3239024 3379696 3536714 3709952 3897840 4096764 4300424 4499893
59824 4499893 4684960 4846039 4975435 5068096 5122501 5141164 5129589 5094266 5041369 4976527 4904370
59813 4904370 4827448 4745744 4657529 4560744 4453940 4336842 4210680 4077896 3941258 3803152
59803 3803152 3665459 3529634 3396769 3267822 3143830 3025626 2913353 2806651 2705401
59794 2705401 2610001 2521046 2439137 2364990 2299118 2241303 2190961 2148236 2114143 2089316 2073104
59783 2073104 2064309 2062443 2067802 2080637 2100781 2127919 2161698 2201560 2246771 2296681 2350790 2408611
59771 2408611 2469625 2533211 2598237 2662465 2722205 2772470 2807730 2823226 2816430 2787874 2741050
59760 2741050 2681592 2615974 2550052 2488155 2433197 2387129 2350707 2323022 2302008 2285782 2273178
59749 2273178 2263014 2253564 2243250 2231396 2217872 2202353 2184451 2164357 2142844 2120796 2099123
59738 2099123 2079000 2061625 2047583 2036681 2028487 2022808 2019681 2019127 2021023 2025202 2031721 2041083 2054086
59725 2054086 2071366 2093236 2120052 2152565 2191817 2238803 2294282 2358566 2431277 2511414 2597781
59714 2597781 2689114 2783645 2878936 2972601 3063168 3150030 3232746 3310829 3384236 3453691 3520212
59703 3520212 3584300 3645500 3702714 3755027 3802376 3845449 3884975 3921221 3954100 3983412 4008814
59692 4008814 4029854 4046355 4058654 4067252 4072396 4074291 4073562 4071208 4068132 4065081 4063127 4064016 4069881 4082689
59678 4082689 4103822 4133936 4173068 4221054 4278111 4345023 4422681 4511357 4610356 4718230 4832865
59667 4832865 4951008 5067826 5177580 5275204 5357214 5421080 5464211 5484033 5478749 5447558 5390438
59656 5390438 5308577 5205046 5084391 4951352 4810435 4666494 4524561 4388430 4260014 4140536
59646 4140536 4031525 3933678 3845073 3761256 3676986 3587385 3488046 3375605 3249075 3110501
59636 3110501 2964128 2814971 2667738 2526159 2392836 2269747 2158678 2060690 1975305 1900981
59626 1900981 1836702 1782655 1739216 1705879 1681593 1665559 1657044 1654642 1656356 1660273 1664605 1667150
59614 1667150 1665563 1658664 1647209 1633043 1617648 1601774 1586091 1571464 1558431 1546816 1536183 1526430
59602 1526430 1517634 1509539 1501649 1493945 1487221 1482536 1480401 1480563 1482414 1485366 1488704 1491146 1490819 1486069
59588 1486069 1476469 1462860 1446284 1427157 1405728 1383016 1360706 1340084 1321530 1305109 1291192
59577 1291192 1280199 1272088 1266475 1263231 1262826 1266053 1273325 1284037 1296691 1310023 1324138 1340329 1359731
59564 1359731 1382413 1407740 1435215 1464791 1496784 1531723 1569996 1611328 1654755 1699252 1744112
59553 1744112 1788686 1832239 1874567 1916502 1959411 2004307 2051728 2102181 2155905 2211743 2266375
59542 2266375 2315174 2354457 2383468 2404387 2420100 2431734 2438223 2437926 2430148 2415105 2393151 2364629
59530 2364629 2330216 2290943 2247848 2201727 2152941 2101276 2046330 1988499 1929478 1871424 1815645
59519 1815645 1762323 1711408 1663458 1619536 1580468 1546350 1516879 1492208 1473249 1460848 1454844
59508 1454844 1454392 1459167 1469675 1486279 1508590 1536135 1568923 1606826 1648809 1693325 1739139 1785191
59496 1785191 1829894 1871063 1906431 1933972 1952139 1960302 1958763 1947980 1928137 1899879 1865027 1825863
59484 1825863 1784026 1740696 1697476 1656147 1617645 1582128 1550094 1522606 1500250 1482684 1469560
59473 1469560 1461271 1458349 1460588 1467150 1477244 1490389 1506212 1524215 1543567 1563014 1581242 1597413
59461 1597413 1611100 1621652 1627919 1628750 1623482 1611869 1593866 1569725 1540151 1506214 1469186 1430422
59449 1430422 1391158 1352280 1314337 1277729 1242793 1209881 1179523 1152294 1128173 1106203 1085306
59438 1085306 1065422 1047426 1031859 1018151 1005211 992420 979927 968313 958220 950097 944156 940614
59426 940614 939935 942545 948280 956466 966827 980118 997389 1018237 1039708 1057291 1067657 1070808 1069612
59413 1069612 1067398 1066346 1067852 1073369 1084214 1101054 1123859 1151444 1180291 1204844 1220634 1227423
59401 1227423 1228561 1227570 1226333 1226174 1228777 1235241 1245328 1258431 1274615 1294111 1316631 1341926 1370473
59388 1370473 1402893 1439110 1478749 1521897 1568804 1619237 1672863 1729983 1791111 1855911 1923245
59377 1923245 1992114 2061692 2130146 2194005 2249223 2292899 2324158 2343815 2353519 2355144 2350871 2343668
59365 2343668 2337242 2335107 2339613 2351981 2373090 2403851 2444873 2496120 2557010 2626563 2703257 2784855
59353 2784855 2868636 2951942 3032577 3108759 3178817 3241111 3294390 3338204 3372840 3398794 3416308
59342 3416308 3425314 3425564 3416677 3398128 3369388 3330251 3281162 3223168 3157388 3084579 3005507 2921852
59330 2921852 2836340 2751657 2669448 2590512 2515508 2444786 2377629 2312266 2246735 2179517 2109635
59319 2109635 2036970 1962717 1889042 1817914 1750521 1687803 1631103 1582014 1541772 1510658 1487381
59308 1487381 1468786 1450851 1430765 1408309 1385350 1364246 1346678 1333400 1324548 1320152 1320468 1325777
59296 1325777 1335907 1350177 1367681 1387258 1407236 1425831 1442085 1456098 1468157 1477956 1484920 1489078
59284 1489078 1491475 1493956 1498554 1506647 1518518 1533927 1553122 1576874 1605402 1637622 1671620 1705464
59272 1705464 1737514 1766455 1791356 1811336 1825004 1830608 1826986 1814009 1791993 1761289 1722857 1678723
59260 1678723 1631295 1582301 1532651 1483003 1434152 1387032 1342564 1301291 1263078 1227538 1194826
59249 1194826 1165539 1139758 1116797 1096203 1078324 1063487 1051196 1040698 1031770 1024378 1018099 1012582
59237 1012582 1008149 1005110 1002817 1000285 997549 995536 994600 994093 993544 993484 994706 997196 1000197 1003040 1005645
59222 1005645 1008418 1011885 1016399 1022160 1029471 1038787 1050383 1064252 1080585 1100069 1123340 1150377
59210 1150377 1180936 1215420 1254829 1299896 1350779 1407563 1470528 1539681 1614402 1693657 1776233
59199 1776233 1860552 1944507 2025701 2101780 2170480 2229500 2276488 2309368 2326992 2329639 2318627
59188 2318627 2295178 2259883 2213576 2158385 2097385 2033286 1967871 1902619 1839228 1779288 1723854
59177 1723854 1673674 1629605 1592580 1563205 1541506 1527045 1519332 1518268 1524265 1537887 1559464 1589068
59165 1589068 1626626 1671768 1723724 1781550 1844202 1909953 1975805 2037923 2092715 2137239 2168751
59154 2168751 2184653 2183475 2165872 2134500 2093050 2045350 1994800 1944030 1894874 1848818 1807350
59143 1807350 1771666 1742068 1718072 1699311 1686084 1678876 1677613 1681869 1691643 1707369 1729016 1755688
59131 1755688 1786309 1820120 1856084 1892413 1927499 1960991 1993095 2022893 2048210 2067249 2079562
59120 2079562 2085323 2084565 2077564 2065185 2048289 2027326 2002907 1976106 1947561 1916840 1883470 1848258
59108 1848258 1812992 1779084 1747076 1717241 1690017 1665906 1645353 1628479 1614437 1601327 1587383
59097 1587383 1572293 1557006 1542410 1528530 1514799 1500587 1485727 1471018 1458078 1448206 1441462 1437186
59085 1437186 1435070 1435236 1437562 1441684 1447524 1455166 1464249 1474016 1483871 1493319 1501477 1507345 1510649 1511738
59071 1511738 1510569 1506376 1498476 1486838 1471708 1453358 1432568 1410818 1389516 1369222 1349953 1332006
59059 1332006 1316190 1303272 1293447 1286350 1281417 1278128 1275794 1273287 1269351 1263347 1255388 1245587 1233539
59046 1233539 1218863 1201889 1183373 1163839 1143693 1123745 1105053 1088296 1073663 1061191 1050755
59035 1050755 1041976 1034613 1028910 1025025 1022286 1019623 1016650 1013815 1011548 1009860 1008736 1008289 1008460 1009015 1009915
59020 1009915 1011311 1013307 1016202 1020768 1027623 1036379 1046063 1056438 1068190 1081725 1096432 1111366 1126174
59007 1126174 1141147 1156804 1173553 1191387 1209802 1228349 1247258 1267182 1288583 1311964 1338558
58996 1338558 1369992 1407167 1450055 1498630 1553351 1614762 1683398 1760216 1846311 1941922 2046260
58985 2046260 2158367 2277222 2400687 2524964 2645361 2756900 2854041 2931060 2983687 3010234
58975 3010234 3010887 2986630 2939403 2872603 2790468 2696957 2595461 2489173 2381250 2274771 2172723
58964 2172723 2077526 1990290 1910961 1839571 1776823 1723126 1677643 1638859 1605618 1577088 1552208
58953 1552208 1529964 1509969 1492163 1476083 1461021 1446779 1433718 1422176 1412343 1404763 1400377 1399843
58941 1399843 1402910 1408561 1415692 1423804 1433236 1444750 1458893 1475842 1495726 1518731 1544870 1574115
58929 1574115 1606976 1644639 1688484 1739768 1799783 1869644 1949589 2038886 2136550 2241374 2350520
58918 2350520 2458279 2556719 2637702 2694758 2724442 2727193 2707034 2669858 2621762 2568709 2516640
58907 2516640 2470648 2433772 2406999 2390477 2384414 2389060 2404454 2430454 2466768 2512859 2568015 2631610
58895 2631610 2703330 2783265 2871804 2969260 3075480 3189806 3310866 3435465 3557454 3668537
58885 3668537 3761068 3830270 3874196 3892862 3888369 3865135 3828596 3783152 3731492 3675367 3615944
58874 3615944 3553393 3487026 3416481 3342494 3266327 3188799 3110188 3030810 2951379 2872792 2795720
58863 2795720 2720330 2646260 2572787 2499077 2424544 2349209 2273764 2199092 2125725 2053949 1984360
58852 1984360 1917845 1854885 1795218 1738450 1684722 1634532 1588129 1545382 1506091 1470175 1437616
58841 1437616 1408396 1382334 1358892 1337360 1317476 1299772 1285152 1274123 1266482 1261583 1258895 1258445
58829 1258445 1260707 1265912 1273631 1283350 1295367 1310689 1330104 1353772 1381529 1412885 1446636 1481147
58817 1481147 1515263 1548291 1578888 1604765 1623999 1636171 1641851 1641618 1636141 1626698 1614949 1602487
58805 1602487 1590972 1582195 1577351 1576596 1579888 1587966 1601920 1622069 1647934 1679160 1715831 1757940
58793 1757940 1805094 1856836 1912831 1972663 2035674 2100964 2167390 2233735 2299126 2363051 2424710
58782 2424710 2482520 2534440 2578535 2613056 2636459 2647806 2646953 2634048 2609157 2572729 2526160 2471516
58770 2471516 2410892 2346271 2279587 2212368 2145481 2079516 2015250 1953500 1894814 1839549 1787947
58759 1787947 1739862 1694770 1652256 1612166 1574139 1537647 1502806 1470450 1440980 1413803 1388423
58748 1388423 1365367 1345329 1328042 1312829 1299772 1289481 1282100 1277399 1275437 1276259 1279208 1283484 1289163
58735 1289163 1296841 1306486 1317659 1330822 1347531 1369353 1397481 1433380 1478854 1535086 1602202 1679681
58723 1679681 1766181 1858355 1950191 2033857 2101322 2145921 2163743 2154312 2120032 2064971 1994133
58712 1994133 1913014 1826634 1738684 1651846 1568611 1491126 1420510 1357167 1301692 1254822 1216700
58701 1216700 1187085 1166217 1154641 1152266 1158521 1173438 1197517 1230345 1270273 1315515 1364186 1412466
58689 1412466 1453653 1480156 1486613 1471315 1435836 1384146 1321525 1253194 1183420 1115611 1052553
58678 1052553 996086 946829 904578 868853 839088 814757 795562 781188 770783 763123 757405 753377
58666 753377 750531 747676 743601 737692 729681 719367 707092 694097 681843 670994 661254 652020 642951
58653 642951 634122 625873 618490 611998 606385 601953 599164 598099 598383 599648 601753 604553 607809 611466
58639 611466 615738 620815 626669 633089 639680 645961 651807 657615 663601 669115 673172 675572 676849 677182
58625 677182 676033 672981 668320 662758 657123 652425 649472 648080 647209 646178 645278 645067 645690 647136 649560
58610 649560 652826 656257 659242 661889 664760 668334 672906 678591 685133 692173 700052 709909 722504 737307
58596 737307 753190 769820 787916 808323 831205 856038 881936 908000 933591 958316 981599
58585 981599 1002328 1019174 1031289 1038659 1041805 1041229 1037171 1029898 1020137 1009065 997790 987030 977324
58572 977324 969196 962752 957428 952527 947911 943731 939700 935109 929584 923397 916983 910565 904283 898391
58558 898391 893154 888644 884504 879838 873614 865483 855917 845213 832812 818054 801264 783494 765545
58545 765545 747931 731439 716881 704342 693363 683703 675217 667192 658778 650104 642098 635143 628705
58532 628705 622322 616077 609949 603684 597549 592330 588222 584523 580858 577925 576509 576416 576914 577796 579492
58517 579492 582454 586782 592194 598164 604371 611053 618521 626331 633588 640218 647332 656103 666725 678653
58503 678653 691331 704541 718553 734172 752240 772988 796171 821533 848417 875050 899121
58492 899121 919232 935051 946103 951443 950825 945221 935729 922726 906544 888237 869161 850242
58480 850242 831928 814327 797195 780390 764465 750170 737361 725286 714028 704565 697071 690383
58468 690383 683785 678322 675480 675371 677051 679929 683865 688259 691955 694016 694091 692152 688266 682565 675254
58453 675254 666796 658073 649945 642667 636178 630754 626688 623502 620405 617593 616046 615962 616471 617115 618433
58438 618433 620659 623050 625098 627322 630164 633109 635669 638273 641377 644552 647254 649716 652288 654660
58424 654660 656575 658535 660902 663026 664226 665067 666702 669370 672493 675875 679933 684912 690594 696631
58410 696631 702675 708506 714460 721356 729557 738449 747172 755376 762989 769898 776320 782856 789700 796323
58396 796323 802310 807846 813018 817439 821077 824687 828868 833393 837988 842983 848669 854689 860610 866391
58382 866391 871848 876469 880299 884145 888392 892449 895865 899007 902149 904981 907689 911294 916052 920599
58368 920599 923678 925804 928296 931647 935804 941012 947174 953239 958451 963568 969753 976866 983947 990823
58354 990823 998209 1006649 1016185 1026590 1037270 1047547 1057652 1068689 1081019 1093569 1105326 1116464
58342 1116464 1127287 1137316 1146344 1155202 1164454 1173464 1181831 1190566 1200662 1211640 1222693 1234129
58330 1234129 1246436 1259176 1272181 1286695 1303793 1322748 1342511 1363649 1387141 1412326 1437876
58319 1437876 1463973 1491682 1520904 1550865 1582035 1615656 1651695 1688890 1726464 1764198 1801092
58308 1801092 1835402 1865817 1891481 1911480 1925631 1935316 1942289 1947251 1950629 1953877 1958611 1965192 1973418
58295 1973418 1983799 1996875 2012218 2029392 2048916 2071021 2094671 2119265 2145939 2175550 2206671
58284 2206671 2237458 2268248 2300487 2334349 2369453 2406683 2447081 2489927 2533932 2579292 2626662
58273 2626662 2675456 2725352 2778035 2835015 2894927 2955442 3016618 3079780 3144376 3208713 3272742
58262 3272742 3337318 3401837 3465451 3529666 3596809 3666851 3738542 3812654 3891137 3974107 4060743
58251 4060743 4152106 4249949 4353823 4462540 4577341 4700237 4830362 4965615 5106789 5256416
58241 5256416 5414578 5579744 5752735 5935842 6129001 6330929 6543137 6768694 7008002
58232 7008002 7260086 7526909 7811788 8114705 8434196 8772976 9136624 9527616 9945967
58223 9945967 10394853 10879958 11404167 11968906 12579999 13245983 13971249 14757241 15609547
58214 15609547 16536810 17543761 18633939 19820257 21125923 22575716 24195356 26020046
58206 26020046 28095061 30468549 33195411 36351460 40035435 44358634 49449405 55477886
58198 55477886 62671726 71310157 81719453 94273148 109351120 127230315 147976521
58191 147976521 171467858 197594699 226456505 258194749 292248967 326388947 356417455
58184 356417455 377233842 384891269 378307258 359469343 332196688 300527335 267701211
58177 267701211 235906673 206425788 179867051 156396238 135932126 118262834 103097585
58170 103097585 90112289 78999119 69486483 61330793 54315730 48263413 43031548 38497054
58162 38497054 34551782 31110532 28108031 25484761 23183620 21158545 19375097 17801208
58154 17801208 16405471 15164212 14061360 13080291 12202505 11413706 10703515 10059057 9466096
58145 9466096 8916952 8410640 7944732 7513308 7112998 6744234 6405277 6090712 5796982
58136 5796982 5524199 5271550 5035844 4815553 4611609 4423142 4246692 4080439 3925114
58127 3925114 3780056 3642373 3510723 3386085 3268136 3154570 3044705 2940139 2841203 2746174
58117 2746174 2654611 2568067 2486872 2409489 2335605 2266642 2202565 2141343 2082210 2026396 1974033
58106 1974033 1923391 1873895 1827068 1783714 1742935 1704551 1669718 1638388 1608720 1579701 1551911
58095 1551911 1525221 1498363 1471458 1446404 1424026 1403197 1383405 1365712 1350452 1336310 1322517
58084 1322517 1309671 1297650 1284883 1270504 1255205 1239235 1221582 1201939 1181519 1161211 1140706
58073 1140706 1120024 1099980 1080569 1060768 1040502 1020922 1002255 983317 963709 944464 925956
58062 925956 907175 887800 868980 851246 833568 815332 797458 780657 764335 748051 732401
58051 732401 717613 702979 688502 675518 664761 655397 646700 639054 632534 626241 619986 614868 611108
58038 611108 606959 601053 594418 588884 584761 581318 578299 575590 572376 567964 562817 557801 553125 548872
58024 548872 545726 544193 543729 543396 542803 541877 540531 539244 539119 540688 543341 546440 550227 555105 560932
58009 560932 567586 575456 584794 595398 607411 621594 638238 656605 675983 696562 718791 742688
57997 742688 768296 796010 825962 857843 891770 928584 968927 1012904 1061081 1114946 1175845
57986 1175845 1244197 1320203 1404552 1497945 1600564 1712234 1832284 1958828 2088831 2219056
57976 2219056 2346131 2465545 2571492 2657954 2719230 2749749 2745192 2704761 2631724 2531576 2410565
57965 2410565 2275788 2134765 1993748 1857036 1727997 1609318 1501802 1404454 1316665 1239158
57955 1239158 1172180 1114179 1063355 1019281 981934 950177 922551 898864 879845 865614 855310
57944 855310 847767 841947 837187 833552 831408 830357 829421 828517 828686 830431 833011 835996 840250 846632 854978
57929 854978 865334 878965 897061 919489 946061 978028 1017011 1063207 1115841 1174522 1238661
57918 1238661 1306070 1373396 1437423 1494710 1540510 1569796 1579665 1570046 1542473 1499293 1443841 1380081
57906 1380081 1311608 1241402 1172129 1105850 1043566 985722 932908 885390 842386 802764 766389
57895 766389 734032 706054 681793 660057 639631 619574 599713 580734 563324 547480 533043
57884 533043 520357 509747 500822 493001 486296 480829 475991 470997 466015 461870 458804 456265 453835 451701
57870 451701 450247 449732 450199 451214 451890 451681 450894 450001 448840 446979 444432 441354 437473 432484 426678 420521
57854 420521 413971 406890 399701 392948 386504 380022 373856 368814 365234 363025 362311 363202 365133 367218 369232
57839 369232 371609 374634 378213 382241 386540 390678 394471 398378 402767 407110 410677 413739 417271 421731
57825 421731 426957 433066 440390 448452 455831 461309 464650 466391 467583 469748 474252 481465 490961 502591
57811 502591 516841 534220 554912 579191 607598 640540 678066 720183 767203 819843 879100
57800 879100 945675 1019018 1096899 1175871 1251641 1318847 1371520 1404935 1417113 1408356 1380113 1335122
57788 1335122 1277906 1213717 1146665 1079347 1013790 951658 893567 839180 788251 741018 697715
57777 697715 658430 623390 592669 565633 541324 519405 500111 483423 468958 456515 445950
57766 445950 436659 428020 420346 414562 410852 408309 405969 403500 400883 398181 395745 393949 392627 391315
57752 391315 390009 389015 388227 387333 386641 386802 387661 388258 388099 387601 387205 386948 387076 388191 390496 393709 398004
57735 398004 404222 412789 423142 434517 446577 458849 470222 479495 485881 488704 487248 481409 472084
57722 472084 460570 447899 434816 421809 408902 395970 383496 372520 363623 356478 350539 345521
57710 345521 341029 336478 331806 327724 324892 323327 322796 323103 323715 323795 323129 322476 322594 323395 324379 325331 326161
57693 326161 326729 327376 329155 332862 338125 343920 349727 355830 362825 371250 381442 393389 406978 422687
57679 422687 441798 465665 495005 530120 571536 620332 678213 747420 830100 927191 1037312
57668 1037312 1155392 1271011 1368723 1432979 1455576 1439287 1394559 1333254 1265036 1196915 1133188
57657 1133188 1075160 1022131 973312 928494 887257 848571 811601 776340 743196 712365 683796
57646 683796 657433 633205 610883 590090 570498 552134 535483 521105 509039 498759 489736 481702
57634 481702 474382 467500 461300 456535 453546 451755 450396 449348 448783 448497 448161 448008 448636 450267 452682
57619 452682 455797 459799 464734 470345 476355 482710 489638 497670 507367 518755 531273 544542 558885
57606 558885 574721 591761 609293 626963 644733 662238 678776 693852 707134 717849 724838 727437
57594 727437 725940 720995 712922 701849 688269 673097 657122 640534 623140 605116 587385 570976
57582 570976 556085 542092 528577 515848 504278 493716 483947 475314 468290 462649 457656 452945 448696
57569 448696 444976 441402 437532 433199 428460 423633 419493 416974 416417 417209 418313 419089 419654 420613 422454
57554 422454 425118 428196 431579 435722 441150 447881 455511 463600 471628 478800 484343 488048 490241 491223
57540 491223 490958 489355 486678 483637 481119 479716 479405 479719 480288 481043 481986 483188 485151 488725 494216 500902
57524 500902 507835 514895 522650 531452 541176 551645 562745 574186 585789 598048 611845 627370
57512 627370 643746 659936 675672 691306 707088 722934 738638 753902 768118 780336 789595 795342
57500 795342 797567 796606 792771 786233 777241 766326 754206 741521 728736 716240 704436 693708 684249
57487 684249 675880 668188 661045 654900 650292 647125 644883 643542 643727 645686 648608 651364 653590 655663
57473 655663 657864 660065 662118 664166 666540 669563 673357 677705 682279 687194 693034 700125 708065 716276
57459 716276 724691 733624 743313 753952 765835 778990 792995 807564 822981 839493 856652 873856
57447 873856 891162 908786 926070 941812 955580 967850 978732 987344 992699 994531 993092 988787
57435 988787 982342 974745 966649 958216 949754 942014 935497 929900 924595 919343 914283 909532 905134 901225
57421 901225 898003 895719 894762 895437 897487 900174 903062 906489 911072 916932 923523 929997 935644 940312 944592
57406 944592 949294 954609 960053 965401 971263 978450 987048 996434 1005984 1015438 1024699 1033670 1042291 1050611
57392 1050611 1058806 1067178 1076002 1085302 1094976 1105156 1116191 1128073 1140128 1151563 1162206 1172530
57380 1172530 1183019 1193709 1204290 1214492 1224365 1234296 1244811 1256312 1268898 1282326 1296103 1309743
57368 1309743 1322995 1335754 1347793 1358902 1369441 1380346 1392242 1404829 1417565 1430639 1444643
57357 1444643 1459429 1473998 1487578 1500260 1512519 1524720 1537238 1550421 1564164 1578012 1591872
57346 1591872 1606070 1620443 1634050 1646287 1657790 1669723 1682536 1695977 1709896 1724371 1739192
57335 1739192 1753859 1768169 1782413 1796999 1812172 1827992 1844252 1860512 1876556 1892782 1909751
57324 1909751 1927425 1945195 1962728 1980403 1998785 2017876 2037084 2055839 2074117 2092391 2111110
57313 2111110 2130314 2149803 2169513 2189488 2209600 2229682 2249979 2271006 2292735 2314443 2335697
57302 2335697 2357103 2379587 2403121 2426739 2449738 2472415 2495611 2519832 2544908 2570239 2595377
57291 2595377 2620592 2646735 2674297 2702672 2730712 2757892 2784513 2810798 2836421 2861163 2885512
57280 2885512 2910130 2934962 2959341 2982880 3005785 3028270 3050071 3070823 3090623 3109902 3128857
57269 3128857 3147421 3165790 3184621 3204512 3225473 3247040 3268676 3289922 3310547 3330891 3351810
57258 3351810 3373788 3396225 3418047 3438894 3459223 3479330 3498941 3517902 3536587 3555286 3573719
57247 3573719 3591632 3609455 3627902 3647150 3666849 3686738 3706843 3727149 3747478 3767687 3787816
57236 3787816 3808081 3828836 3850342 3872448 3894711 3916884 3939011 3960911 3982076 4002364 4022327
57225 4022327 4042342 4061781 4079606 4095521 4110046 4123671 4136503 4148603 4160006 4170365 4179151
57214 4179151 4186398 4192910 4199607 4206956 4215052 4223857 4233239 4243046 4253265 4263977 4275196 4286909 4299143
57201 4299143 4311766 4324380 4336720 4349022 4361678 4374696 4387856 4401172 4414679 4427914 4440221
57190 4440221 4451567 4462497 4473288 4483641 4493254 4502018 4509544 4515162 4518717 4520844 4522147 4522657 4522463
57177 4522463 4522274 4522740 4523460 4523225 4521099 4516937 4511044 4503828 4495670 4486728 4476772 4465451 4452674 4438496
57163 4438496 4422764 4405209 4385902 4365362 4344140 4322443 4300242 4277636 4255110 4233476 4213525
57152 4213525 4195603 4179541 4165004 4151844 4140163 4130211 4122288 4116511 4112479 4109230 4105644 4100910 4094677
57139 4094677 4087005 4078258 4068738 4058219 4046057 4032103 4017444 4003996 3993308 3985828 3981154 3978586
57127 3978586 3977294 3976119 3973555 3968225 3959516 3947692 3933170 3915699 3894507 3869416 3841590 3813015
57115 3813015 3785419 3759950 3737681 3719960 3708098 3702920 3704782 3713963 3731034 3757050 3793663 3843173
57103 3843173 3908486 3993006 4100561 4235618 4403881 4612977 4872529 5193396 5586671 6063295
57093 6063295 6634169 7309680 8097998 9002886 10022515 11149885 12373770 13678684 15043518
57084 15043518 16439809 17830660 19170568 20406332 21480004 22334792 22923352 23216012
57076 23216012 23205829 22908390 22356356 21591151 20655499 19589476 18430005 17211687 15967136
57067 15967136 14726288 13515080 12354089 11257847 10235270 9290693 8424667 7634545
57059 7634545 6915625 6262857 5671943 5139118 4660353 4231166 3846980 3503438 3196493
57050 3196493 2922556 2678526 2461479 2268443 2096846 1945100 1812263 1696985 1597187 1511023
57040 1511023 1437782 1377505 1330243 1296438 1277485 1273857 1281051 1287840 1280599 1251041 1200409 1136692
57028 1136692 1068521 1001468 938251 880235 828081 781734 740558 703591 669846 638747 610376
57017 610376 585001 562449 542170 523755 506925 491114 475740 460941 447405 435222 423525
57006 423525 411634 400005 389524 380332 371974 364431 358285 353847 350643 347838 344792 341196 337098
56993 337098 332929 329228 326188 323676 321749 320865 321537 324034 328523 335164 343703 352985 361089 366120 366984
56978 366984 363664 357005 348252 338552 328660 318976 309870 301876 295476 290731 287269 284747 283164 282707
56964 282707 283574 286135 291019 298586 308444 319927 332954 347844 364079 379708 392260 399988 402136
56951 402136 398664 390345 378857 366121 353425 341443 330849 322373 316207 311852 308821 307250 307649
56938 307649 310274 314912 321278 329543 340472 354982 373330 394604 416811 437293 453103 461613
56926 461613 461483 453385 439634 423030 405888 389683 374948 361362 348290 335567 323710 313370
56914 313370 304715 297374 290741 284209 277294 269778 261807 253862 246631 240752 236471 233519 231457 230167
56900 230167 229894 230854 233004 236231 240523 245910 252397 260020 268767 278351 288282 298328 308729 319762
56886 319762 331162 342102 351505 358146 360675 358200 351122 341165 330310 319715 309705 300431 292182
56873 292182 285176 279515 275442 273378 273618 276240 281400 289425 300513 314643 332029 353306 378885
56860 378885 408166 439439 470139 496808 515454 523081 519351 506545 487908 466324 444224 423678
56848 423678 405958 391409 380126 372462 368690 368736 372711 381377 395635 415805 441746 473404 510871
56835 510871 554154 603054 656370 710206 757329 789575 801830 794012 769816 734337 692660 649223
56823 649223 607206 568267 533097 502148 475841 454447 438120 426888 420549 418839 421929 430562
56811 430562 445531 467219 495727 530879 571342 613425 651115 677889 689264 684398 665887 638141
56799 638141 605586 571672 538768 508359 481206 457549 437396 420682 407249 396871 389397 384837
56787 384837 383308 385023 390353 399766 413562 431579 452938 475861 497639 515047 525157 526252
56775 526252 518425 503577 484662 464491 444779 426051 408195 391081 374899 360149 347299 336347
56763 336347 326775 318021 309900 302445 295518 288804 282104 275355 268443 261229 253827 246641 240036 234092
56749 234092 228655 223457 218222 212830 207444 202363 197733 193482 189566 186160 183540 181797 180623 179442
56735 179442 177944 176490 175810 176182 177170 178291 179601 181299 183036 184113 184318 184141 184094 184195 184275 184459 185114
56718 185114 186373 187905 189144 189723 189687 189316 188820 188352 188211 188723 189835 191139 192433 193960 195903 197968
56702 197968 199776 201384 203153 205340 208117 211721 216291 221795 228395 236479 246003 256273 266911 278620
56688 278620 292362 308126 325172 343114 361870 380711 398322 413841 427101 437903 445984 451730
56676 451730 455969 458855 459920 459520 459236 460347 462728 465794 469649 474579 480108 485445 490466 495521 500561
56661 500561 505157 509155 512681 515619 517570 518242 517507 515306 511828 507476 502217 495302 486174 475446
56647 475446 464511 454367 445267 437217 430163 423767 417602 411640 406125 400963 395645 389810 383517 376945
56633 376945 370210 363592 357650 352977 349921 348512 348539 349756 352139 355837 360776 366473 372301 377673 381883
56618 381883 384222 384616 383778 382336 380124 376822 373008 369871 367880 366288 364062 360884 357138 353268 349320
56603 349320 344934 339709 333709 327545 321839 316821 312707 310190 310057 312322 316192 320914 326301 332341
56589 332341 338715 344916 350628 355803 360420 364294 367171 369170 371141 374235 378742 383510 386993 388860
56575 388860 390249 392470 395907 400229 405088 410160 414817 418264 420181 421084 422026 423915 426999 430807 434526
56560 434526 437529 439650 441047 441854 441958 441097 439214 436651 433956 431465 429069 426297 422493 417047 409732
56545 409732 400943 391393 381516 371231 360277 348643 336659 324792 313307 301986 290361 278518
56533 278518 267480 258325 250949 244276 237700 231712 226859 222759 218596 214175 209961 206330 203229 200390
56519 200390 197519 194432 191285 188510 186255 184131 181749 179289 177217 175655 174336 173005 171655 170559
56505 170559 170182 170736 171630 171820 170995 170027 169835 170226 170316 169764 169064 168793 169064 169626 170098 170271 170429 171132 172390
56486 172390 173489 173975 174356 175279 176501 177369 177972 179012 180652 182261 183273 183671 183650 183434 183436 184000 184880 185439
56468 185439 185415 185109 184915 185126 186004 187439 188630 188769 188066 187482 187417 187273 186408 184918 183358 182257 182018 182729
56450 182729 183852 184626 184988 185629 186972 188582 189844 190761 191792 193188 194758 196051 196641 196492 196095 195986
56434 195986 196125 196052 195667 195391 195544 195977 196434 196791 196813 196172 194999 194017 193763 193908 193630 192479 190688 188828
56416 188828 187334 186328 185720 185507 185893 186971 188325 189188 189083 188217 187282 186957 187446 188315 188869 188845 188604 188550
56398 188550 188619 188571 188476 188624 189191 190329 192278 194988 197886 200381 202386 203953 204828 204898 204766 205250 206441
56381 206441 207820 209049 210068 210637 210513 210044 209916 210365 211084 211773 212226 212108 211352 210556 210322 210407 210269 210232
56363 210232 211144 212994 214835 216148 217364 218900 220502 221772 222595 222859 222508 222015 222078 222761 223653 224872
56347 224872 226997 229913 232686 234828 236717 238549 239891 240710 241790 243604 245635 247426 249439 252118
56333 252118 254813 256495 257081 257442 258463 260580 263756 267320 270151 271635 272316 273315 275342 278370 281827
56318 281827 284899 287126 288938 291178 293988 296791 299473 302743 306986 311532 315632 319505 323855 328824
56304 328824 334006 339144 344373 350007 356270 362902 368946 373540 377059 380783 385236 389614 393110 395944
56290 395944 398619 401060 403164 405514 408800 413018 417802 423054 428709 434405 440013 446065 453186 461472
56276 461472 470852 481537 493652 506905 521143 536836 554597 574714 597484 623374 652471 684403
56264 684403 719344 758416 802525 851512 905111 964040 1029224 1100373 1176222 1255883 1339198
56253 1339198 1425922 1515258 1605997 1696394 1783975 1866090 1940768 2006753 2062811 2107405 2139068
56242 2139068 2156969 2161285 2153130 2133912 2104707 2066475 2020730 1969398 1913962 1855277 1794112 1731148
56230 1731148 1666383 1599461 1530877 1462075 1394157 1327352 1262029 1199287 1139997 1084007 1030783
56219 1030783 980260 932791 888943 849484 814704 783549 754367 726739 701522 678945 658070
56208 658070 638541 621395 607354 595590 584991 575444 567007 559131 551733 545812 541828 538534 534612
56195 534612 530503 527410 525429 523947 523029 523024 523473 523707 524029 525182 527231 529990 533889 539237 545187 550507
56179 550507 554916 558799 562332 565853 570303 576157 582597 588758 595046 602183 609888 617725 626350 636590
56165 636590 648091 660237 673570 688821 705330 722124 740013 760993 785924 814389 846536
56154 846536 883560 926628 976827 1036104 1106851 1190378 1286535 1394333 1511679 1634572 1757328
56143 1757328 1873528 1976829 2062739 2131346 2187566 2237359 2284096 2328969 2372510 2413201 2445876
56132 2445876 2464623 2467697 2458178 2440580 2418728 2395858 2373356 2348331 2314195 2264562 2196177 2109131
56120 2109131 2006608 1894692 1780464 1669395 1564967 1469953 1386202 1313406 1249934 1195077
56110 1195077 1149173 1111752 1081168 1056026 1035594 1019059 1005803 996058 989827 985576 981638 978434
56098 978434 977550 979060 981629 984863 989522 995610 1002260 1009468 1018014 1027695 1037504 1047548 1058983 1072053
56084 1072053 1085839 1099808 1113932 1127594 1140202 1152542 1165673 1178842 1190467 1200681 1210807
56073 1210807 1220776 1229460 1237216 1245685 1255168 1264707 1274568 1286142 1299396 1312977 1326872 1342435 1359663
56060 1359663 1377060 1394403 1413066 1433293 1453676 1473656 1494065 1514939 1535348 1555742 1577909
56049 1577909 1602161 1627034 1652124 1678721 1707258 1736619 1766392 1797332 1829245 1860898 1892372
56038 1892372 1925050 1959076 1993368 2028268 2065416 2104850 2145094 2186297 2230349 2277574 2326315
56027 2326315 2376140 2428471 2483649 2540352 2598301 2658574 2721005 2784300 2848888 2916564 2987284
56016 2987284 3059544 3133746 3211703 3293076 3376180 3462091 3553759 3651169 3751770 3855588 3965134
56005 3965134 4080275 4198398 4320027 4448840 4585519 4727146 4873536 5028400 5193099
55996 5193099 5365109 5544085 5733481 5934637 6145302 6365846 6600801 6852263 7117959
55987 7117959 7397982 7697146 8018536 8361166 8726401 9120161 9546368 10004856 10497989
55978 10497989 11032302 11611407 12234954 12907234 13639117 14439267 15312145 16267362 17321984
55969 17321984 18491093 19786462 21228105 22847112 24674775 26741890 29094070 31797079
55961 31797079 34925935 38566315 42834937 47887167 53903832 61090194 69691720 79989222
55953 79989222 92278742 106894926 124273956 144959553 169493107 198200799 230821691
55946 230821691 265903199 300244299 329097001 347563770 352578367 344120377 324849968
55939 324849968 298641854 269163833 239182898 210493723 184094325 160413225 139533388
55932 139533388 121353191 105660458 92175601 80607213 70691407 62190764 54886400
55925 54886400 48590446 43154802 38456631 34384792 30845795 27768227 25090224 22750440
55917 22750440 20696600 18891841 17304776 15901515 14653133 13541889 12553145 11668159
55909 11668159 10870306 10151039 9503672 8917259 8381631 7892494 7446659 7037426 6658986
55900 6658986 6310206 5990057 5694089 5418956 5165506 4933881 4720224 4521379 4337874
55891 4337874 4168866 4008820 3852767 3700812 3554502 3413105 3276626 3148188 3029883
55882 3029883 2919677 2815119 2716371 2623011 2531939 2441679 2355236 2275690 2202185 2132921 2068695
55871 2068695 2010497 1956589 1904652 1854012 1803495 1750353 1694007 1637976 1585565 1536316 1488928
55860 1488928 1444488 1404110 1366227 1329041 1293265 1259952 1228026 1196422 1166299 1138683 1112139
55849 1112139 1085103 1058389 1033167 1008627 983870 959970 937964 916810 895468 875008 856545
55838 856545 839074 821434 804464 789162 774652 760074 746600 735506 726046 717284 710232 706049
55826 706049 703788 702029 701154 701953 703425 703962 703437 702385 700472 697422 693963 690270 684994 677420 668900
55811 668900 660527 651158 639605 627085 615460 604586 593476 582681 573417 565479 558022 551382 546293
55798 546293 542265 538477 535299 533425 532591 532704 534951 539934 545655 549126 549306 547207 544216 541835 541961
55783 541961 545655 552216 560837 572510 589172 611604 638665 667040 690843 703618 703089 693402 681524
55770 681524 672356 668077 670085 679317 695521 717989 746303 779100 813165 845062 872660 893902
55758 893902 905641 905471 893766 872471 843010 806827 766620 725153 683659 642823 604181 568913
55746 568913 536351 505382 476330 449887 425420 402135 380852 362722 347075 332462 318929
55735 318929 307370 297398 287903 279118 272190 267088 262690 258490 254571 250367 245186 239591 234724 230686
55721 230686 226984 224009 222484 221991 221642 221583 222198 222427 220694 217195 213585 210707 208219 206100 204840 204355
55705 204355 204216 204686 206069 207416 207461 206569 206190 206619 206849 206443 206036 206157 206994 209068 212612 216458 219108
55688 219108 220842 223310 227105 231208 234785 238092 241518 245049 248762 252694 256262 258922 261311 264602
55674 264602 268886 273301 277513 281900 286536 291165 295855 300478 303879 304909 303958 302213 299830 296255
55660 296255 291933 288079 285038 282474 280973 281787 285138 290432 298001 308790 322272 336604 351278
55647 351278 367964 388315 412500 440299 472020 507655 546505 588239 632952 679342 723886
55636 723886 762603 792970 813864 824836 826233 819377 806149 788806 770194 753145 739264 728891
55624 728891 722238 719787 721572 727028 735615 746622 758203 767482 771821 769418 758985 740047 713606
55611 713606 681457 644738 604048 560814 517327 475286 435332 398045 364182 333803 306323
55600 306323 281643 260183 241638 224912 209552 196192 185227 176074 167980 160630 153704 146829
55588 146829 140228 134550 129897 125879 122580 120359 118697 116501 113677 111169 109301 107406 105356 104003
55574 104003 103623 103295 102490 102024 102719 104175 105526 106455 106817 106263 104953 103822 103471 103570 103817 104633 106299
55557 106299 108329 110272 112337 114625 116616 118057 119582 121755 124210 126332 128073 129516 130365 130562 130721
55542 130721 131276 131744 131478 130574 129453 128068 126218 124118 122065 119871 117218 114272 111533 109386 108069
55527 108069 107643 107684 107498 106962 106681 107064 107812 108655 109981 112297 115552 119438 123961 129353 135777 143299
55511 143299 151797 160769 169754 179101 189827 202604 217453 234480 254117 276511 301415 328889
55499 328889 359284 392184 426104 459539 491576 521149 546485 565652 576972 578766 569791 550637
55487 550637 523983 492812 458892 423293 387463 353002 320850 291298 264354 239731 217041
55476 217041 196422 178443 162996 148990 135614 123275 112769 104152 96967 90964 85942 81480
55464 81480 77451 74312 72246 70497 68158 65263 62489 60169 58162 56414 55066 54165 53672 53516 53384
55449 53384 52807 51749 50742 50141 49662 48968 48190 47539 46889 46187 45855 46288 47311 48451 49467 50279 50728
55432 50728 50692 50167 49093 47471 45724 44417 43500 42435 41223 40597 40917 41592 41908 41800 41409 40599 39406
55415 39406 38405 38124 38469 38964 39135 38549 37149 35740 35331 35733 35692 34634 33304 32279 31002 29033 27182
55398 27182 26405 26379 26136 25445 24639 23693 22562 21952 22655 24344 25966 27125 28190 29179 29481 28819 27833 27447
55380 27447 27987 28936 29322 28546 27051 25993 26047 26807 27449 27520 26968 25985 25141 24989 25219 24820 23429 21819
55362 21819 20711 19917 19157 18794 19042 19232 18725 17912 17498 17404 17186 16960 17052 17256 17323 17632 18475 19160 18848 17914
55342 17914 17439 17663 17931 17950 18070 18420 18686 18800 18997 19256 19365 19469 19845 20247 20187 19777 19624 19952 20523 21317
55322 21317 22554 24046 25191 25681 25720 25608 25562 25809 26350 26749 26683 26478 26636 27059 27273 27160 26847 26192 25085
55303 25085 24060 23873 24563 25510 26279 26828 27121 27182 27370 27937 28461 28350 27731 27135 26506 25319 23693 22603
55285 22603 22818 24128 25692 26728 26856 26209 25216 24101 22786 21468 20751 20809 20945 20560 20039 20004 20239 20180
55267 20180 19988 20223 20842 21432 22046 22823 23141 22297 20849 20109 20407 20908 21086 21198 21317 21102 20696 20693 20950
55248 20950 20548 19279 18127 17864 18154 18463 18829 19170 18801 17403 15782 14933 14902 15152 15496 16007 16436 16380
55230 16380 15832 15133 14602 14501 15036 15999 16716 16688 16162 15808 16043 16786 17602 17959 17677 17301 17684 18997 20460
55211 20460 21185 21049 20592 20363 20528 20899 21154 21122 20867 20395 19539 18436 17859 18525 20145 21684 22532 22911
55193 22911 23156 23224 22979 22444 21633 20595 19737 19617 20281 21205 21949 22469 22742 22628 22249 22027 22157 22404 22554
55174 22554 22731 23201 24130 25523 27082 28188 28435 28076 27592 27030 26291 25784 26067 26960 27746 28161 28396 28205
55156 28205 26999 25052 23632 23519 24109 24341 23867 22990 22121 21722 22171 23213 24051 24308 24381 24573 24532 23990
55138 23990 23419 23350 23533 23388 22965 22899 23590 24850 26213 27202 27522 27287 26922 26666 26422 26194 26228 26448 26238
55119 26238 25232 24031 23654 24471 26020 27724 29362 30889 32114 32730 32624 32183 32177 33080 34475 35370 35121
55102 35121 33919 32445 31335 30881 30891 30869 30685 30880 31921 33304 34053 33987 33790 33774 33419 32426 31448 31328 32102
55083 32102 33156 33982 34410 34527 34705 35339 36225 36620 36178 35452 35123 35099 34787 33943 32851 31910 31392 31481 32235
55064 32235 33498 34951 36212 36948 37144 37197 37447 37715 37629 37284 37106 37084 36737 35853 34692 33454 32142 31026
55046 31026 30573 30712 30787 30420 29899 29553 29404 29536 30081 30661 30658 30344 30879 32725 34818 35880 35825 35317 34689
55027 34689 34030 33760 34248 35121 35676 35779 35874 36344 37268 38516 39607 39876 39239 38513 38569 39508 40929 42487
55009 42487 43700 43847 42819 41704 41761 42982 44264 44801 44764 44726 44966 45325 45374 44819 43874 42985 42097 40764
54991 40764 39162 38256 38424 38692 38097 37202 37266 38397 39546 40154 40677 41486 42228 42534 42567 42567 42449 42169 42037
54972 42037 42380 43179 44143 44870 44952 44281 43292 42612 42451 42572 42773 43116 43735 44658 45730 46574 46937 47304 48716
54953 48716 51517 54704 57149 59109 61727 65284 68900 72047 75467 80178 86235 92941 99843 107113
54939 107113 115105 123808 132569 140190 145495 147968 147813 145370 140744 134077 126025 117732 110231 103748
54925 103748 97581 90906 83864 77647 73293 70580 68392 65987 63562 61671 60445 59517 58515 57556 57181
54910 57181 57713 58799 59889 61064 62900 65419 67845 69728 71758 74974 79634 85390 92084 99720 107915
54895 107915 116050 123796 130934 136844 140718 142113 140866 136850 130416 122738 114898 106856 98117 89164
54881 89164 81339 75346 70832 67418 65084 63336 61086 57918 54655 52194 50446 48919 47626 46784 46243
54866 46243 45865 46013 46930 47953 48117 47356 46463 45973 45706 45349 44815 43958 42539 40748 39324 38890 39358 40176
54848 40176 40903 41388 41633 41700 41623 41223 40224 38752 37532 37218 37605 37814 37274 36216 35145 34242 33492 33068
54830 33068 33245 34071 35373 36855 37986 38155 37405 36751 37190 38476 39525 39972 40612 42091 43886 44977
54814 44977 45000 44319 43437 42780 42673 43011 43164 42685 41953 41738 42294 43192 43919 44334 44705 45531 47166 49420 51688
54795 51688 53625 55490 57783 60880 65067 70359 76186 81882 87855 95519 105485 116441 126400 134487
54781 134487 140785 145149 147251 147493 146722 145050 141896 137227 131878 126449 120750 114627 108585 103230 98608
54766 98608 94458 90741 87591 85031 82954 81177 79496 77844 76336 74941 73314 71348 69620 68784 68664
54751 68664 68574 68478 69140 71129 74339 78583 83994 90612 98156 106368 115049 123520 130639 135687 138800 140292
54735 140292 140004 137707 133667 128384 122059 114696 106620 98521 91039 84435 78592 73284 68538 64751
54721 64751 62275 60898 59963 59021 58169 57745 57906 58387 58490 57474 55318 52965 51427 50781 50445 50186 50218
54704 50218 50467 50496 50316 50542 51436 52393 52685 52240 51387 50332 49295 48750 49044 49919 50730 51018 50716 49995 49151
54685 49151 48495 48172 48143 48381 48880 49453 49724 49409 48476 47172 46116 46214 47974 50905 53947 56507 58724
54668 58724 60816 62745 64548 66467 68553 70542 72262 73777 75137 76362 77661 79121 80147 79896 78398
54653 78398 76598 75089 73505 71511 69617 68465 67882 67245 66354 65308 63902 61919 59830 58503 58141
54638 58141 58049 57570 56856 56553 56991 57797 58216 57749 56616 55613 55471 56272 57401 57982 57502 56229 55028 54599
54620 54599 54927 55561 56189 56621 56471 55453 53995 53016 52921 53215 53191 52619 51687 50731 50170 50281 50885 51576 52335
54601 52335 53439 54762 55692 55867 55457 54612 53327 52013 51427 51586 51485 50440 49110 48599 49031 49733 50328
54584 50328 50904 51376 51508 51460 51592 51762 51442 50602 49924 49939 50413 50737 50618 50263 50040 50130 50387 50569 50762 51342
54564 51342 52349 53101 52854 51783 50942 51173 52360 53801 55052 56242 57644 59166 60346 60832 60785 60784 61396
54547 61396 62858 64953 66968 67958 67439 65878 64252 63115 62315 61519 60638 59721 58785 57850 56860 55566 53811
54530 53811 51934 50561 49997 50121 50761 51719 52556 52923 53115 53710 54676 55423 55708 55744 55404 54195 52227 50316
54512 50316 48858 47498 46277 46067 47245 48898 50052 50863 51786 52466 52471 52407 53139 54350 55023 55007 54958 55023 54826
54493 54826 54633 55313 56944 58524 59300 59467 59382 59050 58760 59291 61006 63400 65908 68483 70994 72817 73639
54476 73639 74118 75147 76778 78347 79242 79025 77296 74198 70943 69060 68930 69490 69512 68801 68015 67683 67759
54459 67759 67962 68143 68202 67965 67405 66943 67172 68120 68959 68650 66877 64290 61924 60526 60317 61095 62399 63624
54441 63624 64177 63733 62536 61327 60738 60721 60706 60273 59438 58359 57236 56565 56976 58475 60169 61093 61115 60773
54423 60773 60528 60543 60976 61969 63333 64541 65095 64804 63853 62805 62398 63043 64532 66271 67703 68464 68447 67898
54405 67898 67267 66813 66513 66423 66773 67578 68546 69530 70662 71796 72322 71865 70798 69680 68684 67919 67828 68641
54387 68641 69817 70615 70884 70784 70176 69027 68066 68161 69194 70300 71110 72019 73265 74625 76055 77838 79900
54370 79900 81687 82933 83877 84552 84526 83700 82739 82265 82095 81686 80940 80144 79407 78597 77662 76669 75602 74365
54352 74365 73004 71801 71168 71367 72223 73195 73902 74421 74844 74733 73569 71691 70250 70079 70963 72097 72800
54335 72800 72716 71885 70958 70884 71917 73137 73325 72201 70550 69269 68603 68280 68082 68124 68581 69260 69573 69037
54317 69037 67768 66389 65486 65246 65465 65686 65400 64441 63268 62665 63065 64186 65271 65622 65068 64067 63288
54300 63288 62935 62648 62129 61554 61178 60890 60547 60392 60624 60834 60508 59940 59977 60788 61571 61618 61098 60550 60260 60473
54280 60473 61632 63760 65901 66766 65991 64395 63059 62439 62400 62699 63214 63901 64774 65859 66949 67463 66927
54263 66927 65741 65061 65511 66302 66208 65212 64460 64488 64439 63393 61685 60278 59495 59127 59294 60252 61569 62370
54245 62370 62377 62013 61612 61240 61203 61868 62854 63188 62482 61336 60433 59899 59776 60356 61573 62672 63045 63008 63211
54226 63211 63593 63491 62676 61704 61089 60563 59511 57990 56899 56895 57439 57350 56332 55420 55709 57090 58567 59405
54208 59405 59578 59453 59508 60099 61052 61758 62006 62364 63267 64202 64523 64693 65922 68690 72291 75633 77843 78374
54190 78374 77436 76186 75668 75592 74893 73341 71697 70353 68858 66909 64872 63112 61681 60849 61065 62109
54174 62109 63078 63495 63676 63831 63634 62897 61884 60737 59437 58490 58633 59523 59767 58680 57020 55585 54154
54157 54154 52467 51121 50676 50761 50958 51687 53270 54902 55609 55613 55678 55629 54748 53333 52650 53345 54813 56209
54139 56209 57239 57914 58231 58345 58570 59048 59635 60086 60160 59791 59396 59692 60806 61889 62006 61106 59839 58830
54121 58830 58530 59257 60815 62418 63483 64189 64847 65208 64953 64433 64294 64707 65497 66593 67737 68288 68049
54104 68049 67856 68489 69363 69232 67983 66802 66651 67476 68882 70654 72466 73864 74830 75805 76995 78176
54088 78176 79244 80435 81838 83243 84584 86062 87643 88799 88938 87910 86116 84337 83293 83041 82903
54073 82903 82335 81611 81340 81602 82072 82700 83586 84384 84514 84008 83510 83440 83669 84006 84422 84809 85073 85570 86853
54054 86853 88881 90955 92542 93780 95117 96910 99329 102228 105073 107497 109938 113219 117469 121986
54040 121986 126190 130133 133908 137268 140178 143287 147320 152117 156600 159678 161100 161550 161973 162832 164015
54025 164015 165299 166516 167244 166918 165649 164393 163761 163090 161387 158789 156263 154095 151627 148461 144999
54010 144999 141558 137859 133723 129618 126073 123057 120292 117781 115678 113977 112565 111313 109940 108103
53996 108103 105765 103233 100761 98429 96407 94933 94049 93724 94177 95556 97305 98431 98552 98142 97670 97143
53980 97143 96669 96791 97783 99063 99694 99211 97730 95600 93292 91343 90101 89624 89874 90677 91475 91619 91107
53963 91107 90680 90953 91811 92844 93929 95104 96269 97351 98511 99896 101402 102940 104689 106817 109175
53948 109175 111544 114048 117075 120864 125232 129635 133495 136704 139843 143659 148302 153313 158306 163297
53934 163297 168295 172951 176748 179390 181005 182234 183938 186426 189067 191190 193212 196194 200298 204472
53920 204472 207876 210869 214222 218105 222338 226997 232113 237142 241324 244369 246340 247183 246849 245688 244305
53905 244305 243132 242382 242097 241911 241056 239015 236000 232450 228388 223671 218593 213665 208864 203603 197498
53890 197498 190814 184169 178117 172978 168708 164864 160952 156956 153360 150551 148320 146034 143276 140230
53876 140230 137368 134758 131913 128468 124718 121195 117942 114708 111683 109404 107918 106670 105368 104265
53862 104265 103364 102048 99996 97832 96274 95112 93710 92174 91321 91573 92484 93341 93771 93824 93821 94132 94733
53845 94733 95072 94659 93656 92575 91601 90624 89747 89264 89154 89072 88920 88980 89455 90239 91238 92543 94101 95515
53827 95515 96383 96733 96956 97364 97898 98268 98389 98691 99935 102614 106529 110933 114943 117932 119857 121408
53811 121408 123563 126721 130358 133688 136489 139140 142096 145527 149340 153302 157200 160959 164427 167050
53797 167050 168202 168019 167460 167268 167306 167233 167243 167475 167265 165884 163848 162497 162175 161682 159826 156719 153146
53780 153146 149353 145151 140767 136888 133915 131670 129750 127790 125434 122501 119309 116503 114439 112879
53766 112879 111335 109534 107477 105322 103334 101766 100525 99085 97039 94687 92809 91766 91110 90323 89596
53751 89596 89499 90004 90327 89902 89147 89010 89908 91340 92404 92555 91912 91018 90318 89848 89419 89005 88718 88466 88040
53732 88040 87648 87998 89468 91406 92637 92666 92104 91931 92597 93906 95466 97007 98360 99397 100137 100884 102040
53715 102040 103674 105344 106486 106960 107102 107317 107811 108639 109737 110853 111693 112240 112728 113265 113714 114007 114320
53698 114320 114844 115627 116748 118318 120144 121702 122785 123939 125939 128905 132194 135067 137220 138750 139868
53683 139868 140675 141098 141034 140613 140164 139837 139398 138588 137598 136971 137060 137658 138118 137835 136762 135525 134909 135130 135743
53664 135743 136274 136659 136982 137161 137176 137398 138311 139912 141586 142591 142621 141983 141328 141080 141070 140859 140436 140296 140771
53645 140771 141618 142471 143368 144472 145552 146136 146122 145960 146213 147106 148400 149553 150092 150063 149998 150383 151237 152315
53627 152315 153445 154526 155473 156381 157555 159096 160663 161844 162615 163225 163876 164755 166092 167868 169689 171290
53611 171290 172932 174984 177354 179738 182207 185049 188124 190901 193152 195172 197244 199330 201414 203794
53597 203794 206758 210105 213177 215347 216503 217136 217924 219178 220676 222005 222847 222973 222313 221208 220305 219922
53581 219922 219773 219539 219395 219716 220534 221593 222635 223296 223109 222083 220985 220539 220598 220564 220312 220015 219375 217882
53563 217882 215825 214184 213369 212786 211917 211172 211294 212473 214374 216592 218650 219900 219958 219117 218089 217445
53547 217445 217441 218089 219161 220304 221368 222517 223958 225756 227950 230544 233248 235611 237623 239858 242727
53532 242727 245889 248737 251222 253838 256944 260549 264686 269541 275109 281081 287237 293644 300256 306650
53518 306650 312565 318605 325910 334927 344842 354452 363277 371513 379282 386625 394169 403067 413968 426504
53504 426504 440070 454548 469886 485475 500576 515148 529697 544538 559688 575282 591445
53493 591445 607783 623592 638653 653303 667710 681623 694989 708290 721994 735998 749829
53482 749829 763174 776022 788516 800797 812903 824814 836720 849088 862192 875658 888815
53471 888815 901357 913280 924327 934018 942229 949220 955071 959588 962801 964937 965771 964639 961342 956510
53457 956510 950775 944078 936114 926992 917073 906588 895873 885542 875914 866460 856276 844953 832696
53444 832696 819839 806698 793684 781127 769026 757323 746259 736056 726400 716740 707085 698076
53432 698076 690193 683400 677688 673538 671391 670829 670657 669846 668228 666317 664726 663937 664381 666367 669793
53417 669793 674148 678973 684225 690070 696504 703427 711030 719779 729962 741455 753998 767564 782358
53404 782358 798573 816102 834450 853001 871580 890696 911037 932800 955723 979684 1004982
53393 1004982 1032041 1061080 1092025 1124481 1157820 1191589 1225811 1260603 1295656 1330560 1365552
53382 1365552 1401360 1438152 1475155 1511487 1546800 1580871 1613159 1643354 1672006 1699961 1727196
53371 1727196 1752619 1775037 1794107 1810409 1824811 1837737 1848806 1857147 1862086 1863430 1861116 1854921
53359 1854921 1844650 1830345 1812042 1789558 1762869 1732600 1699968 1666256 1632441 1599051 1566104
53348 1566104 1533293 1500463 1467939 1436244 1405674 1376295 1348221 1321586 1296256 1271770 1247664
53337 1247664 1223731 1199952 1176209 1152183 1127625 1102814 1078588 1055749 1034491 1014618 996203
53326 996203 979680 965261 952661 941499 931624 922899 914969 907443 900008 892230 883563 873791 863209
53313 863209 852185 840891 829652 819146 809831 801452 793559 786300 780260 775637 772077 769297 767442
53300 767442 766709 766958 767853 769230 771235 774249 778713 784848 792466 801101 810385 820308 831159 843261
53286 843261 856694 871241 886620 902674 919234 935874 952069 967537 982173 995727 1007984
53275 1007984 1019321 1030484 1041556 1051566 1059521 1065434 1069881 1072928 1074098 1073235 1070793 1067221 1062536
53262 1062536 1056576 1049279 1040590 1030439 1018903 1006086 991783 975599 957604 938601 919556 900889
53250 900889 882430 863903 845241 826562 808035 789844 772215 755405 739614 724842 710796
53239 710796 696982 682913 668243 652826 636769 620443 604372 588985 574442 560666 547581
53228 547581 535245 523642 512416 501148 490124 480480 473153 467791 463145 458494 454145 450389 446588
53215 446588 441712 435381 427913 419563 410215 399830 388769 377558 366527 355713 345031 334542
53203 334542 324517 315143 306192 297313 288742 281367 275782 271541 267586 263144 257868 251465 243851 235669
53189 235669 228038 221521 215643 209636 203371 197327 191873 186931 182348 178306 175176 173059 171597 170216
53175 170216 168423 165933 162784 159511 156906 155319 154270 153052 151612 150487 149966 149730 149353 148707 147731
53160 147731 146240 144230 142057 140134 138670 137759 137410 137347 137144 136677 136096 135290 133968 132441 131641 131993 132762
53143 132762 133013 132696 132338 132182 132247 132748 133692 134435 134430 134157 134494 135349 135772 135414 134985 135170 135907 136934 138215
53124 138215 139472 139946 139181 137619 136068 134957 134388 134463 135082 135743 135982 135788 135279 134272 132583 130513 128544
53107 128544 126647 124409 121898 119916 119137 119307 119599 119644 119833 120553 121430 121623 120776 119363 118053 117027 116129
53090 116129 115401 115077 115099 115059 114741 114447 114565 114944 115028 114592 114091 114085 114500 114774 114738 114919 115733 116747 117139 116699
53070 116699 115903 115178 114673 114692 115593 117001 117803 117347 116260 115665 115956 116735 117503 117965 117977 117679 117506 117696 117989
53051 117989 118091 118071 117969 117515 116730 116294 116636 117070 116645 115603 115115 115678 116661 117440 118134 119046 120136 121282
53033 121282 122365 122918 122386 121071 120180 120497 121496 122166 122293 122446 123064 124055 125188 126439 127924 129626 131253
53016 131253 132325 132552 132127 131598 131529 132332 134100 136277 137789 138046 137706 137898 138782 139472 139381 138850 138362 137845
52998 137845 137174 136719 136905 137563 138166 138437 138498 138633 139111 139997 140993 141765 142462 143495 144766 145700 146208 146950
52980 146950 148314 149744 150552 150865 151227 151728 152132 152435 152658 152404 151329 149914 149088 149129 149492 149687 149704 149566
52962 149566 149084 148263 147455 146936 146686 146741 147306 148242 148861 148628 147845 147246 147090 147074 147086 147503 148486 149403 149382 148392
52942 148392 147356 147137 147736 148569 149192 149506 149545 149467 149585 149994 150229 149612 147970 145686 143123 140434 137989
52925 137989 136465 136229 136891 137738 138444 139154 140040 141020 141860 142450 142939 143561 144273 144708 144669 144489 144602 144886 144826
52906 144826 144333 143969 144216 144879 145324 145010 143700 141549 139181 137333 136249 135634 135318 135579 136568 137757 138316
52889 138316 137963 137203 136790 137044 137629 137969 137938 138025 138580 139155 139048 138385 138111 138789 139990 141038 141806 142514 143232
52870 143232 143899 144379 144244 143004 140913 139148 138665 139179 139592 139109 137589 135312 132893 131108 130204 129550
52854 129550 128417 126836 125237 123573 121540 119501 118403 118632 119517 120143 120186 119744 118813 117338 115594 114124
52838 114124 113204 112487 111292 109373 107405 106532 107306 109208 111285 113062 114625 116080 117288 118095 118548 118850
52822 118850 119216 119717 120128 120040 119312 118346 117774 117909 118558 119243 119527 119283 118795 118475 118390 118183 117523 116442 115177
52803 115177 113976 113153 113039 113649 114638 115707 116827 117925 118703 119048 119274 119652 119926 119683 119044 118603 118732
52786 118732 119174 119329 118820 117856 117117 117146 117885 118929 120052 121069 121321 120038 117395 114521 112192 110219
52770 110219 108477 107699 108518 110342 112065 113459 114975 116524 117452 117699 117999 118770 119601 120091 120511 121304 122414
52753 122414 123444 124177 124720 125380 126531 128317 130368 131992 132775 132892 132912 133490 135038 137360 139669 141262
52737 141262 142141 142763 143373 143892 144308 144830 145726 147264 149498 151773 152837 151969 149829 147663 145946 144415
52721 144415 143133 142612 142868 143222 143224 143085 143006 142756 142177 141547 141139 140921 140937 141484 142613 143910 145051 146220
52703 146220 147724 149514 151271 152629 153170 152638 151363 150095 149224 148517 147747 147089 146656 146152 145280 144070
52687 144070 142543 140535 138217 136323 135374 135035 134663 134118 133544 132718 131279 129419 127713 126267 124636 122722
52671 122722 121240 120986 121910 123151 123925 124228 124724 126009 127981 129909 131061 131207 130595 129672 128939 128785 129230
52654 129230 129868 130288 130498 130823 131418 132051 132411 132526 132743 133286 133926 134227 134133 134100 134476 134928 134752 133679 132104
52635 132104 130548 129181 127961 126917 126092 125285 124090 122315 120411 119351 119809 121360 122781 123276 123141
52620 123141 123031 123089 123204 123698 124946 126510 127441 127477 127282 127378 127565 127613 127825 128560 129719 131087 132708 134459
52602 134459 135685 135710 134541 132794 131197 130341 130476 131162 131480 131011 130281 129974 130068 130137 130035 129725 128844 127168
52584 127168 125312 124226 124022 123952 123582 123325 123623 124206 124481 124272 123783 123148 122359 121511 120828 120468 120464 120733 121026
52565 121026 120960 120343 119463 118872 118846 119161 119426 119468 119238 118501 116973 114907 113234 112787 113457 114375 114931 115308 115986
52546 115986 117065 118213 119020 119247 118937 118486 118447 119083 120169 121334 122411 123409 124337 125238 126192 127105 127668
52529 127668 127760 127728 128022 128627 129092 129138 129013 129166 129669 130061 129802 128879 127875 127355 127302 127339 127324 127351 127208 126323 124501
52508 124501 122344 120647 119603 118848 118015 116921 115478 113847 112594 112287 112884 113788 114517 115067 115613 116177
52492 116177 116672 117053 117290 117334 117233 117239 117651 118522 119464 119806 119105 117638 116285 115791 116151 116819 117407 117993 118748
52473 118748 119560 120162 120551 120991 121575 122003 122023 121893 122063 122394 122191 121249 120358 120325 120865 121113 121061 121644 123295
52454 123295 125225 126477 127059 127509 127941 128159 128403 129232 130746 132530 134377 136508 138986 141380 143235 144543
52438 144543 145541 146323 146843 147137 147334 147549 147861 148282 148643 148599 147903 146649 145148 143629 142153 140735 139407
52421 139407 138059 136423 134386 132307 130833 130331 130613 131265 131986 132497 132428 131637 130568 129923 129981 130461 130997
52404 130997 131451 131786 132038 132515 133599 135176 136484 136808 136190 135325 134871 134943 135188 135238 135164 135407 136189 137168 137899
52385 137899 138449 139165 139983 140449 140420 140258 140324 140771 141875 143925 146557 148817 150221 151249 152471 153734 154648
52368 154648 155379 156404 157898 159875 162584 166119 169881 173016 175322 177276 179321 181602 184223 187181
52354 187181 190063 192340 194032 195712 197832 200411 203387 206861 210848 215086 219256 223212 226917 230292
52340 230292 233187 235495 237392 239433 242183 245673 249457 253274 257278 261464 265413 268930 272488 276612
52326 276612 281253 286276 292116 299197 307059 314874 322730 331547 341696 352538 363497 374863 387195
52313 387195 400497 414361 428490 442729 457006 471558 486858 502953 519107 534415 548621
52302 548621 562049 574912 586998 598001 607935 617150 625980 634319 641575 647118 650792 652896 653766
52289 653766 653528 652300 650453 648572 647118 646007 644502 641792 637875 633666 630011 626851 623680 620534
52275 620534 618033 616565 615957 616031 617026 619295 622917 627701 633383 639735 646725 654522 663131 672138 681167
52260 681167 690528 700990 712903 725891 739351 752772 765554 777120 787501 797365 807166 816545
52248 816545 824802 831652 837313 842059 846058 849410 852048 853647 853775 852222 849118 844795 839525 833299
52234 833299 825927 817521 808723 800174 791831 783216 774337 765908 758509 751926 745603 739419 733659 728374
52220 728374 723240 718091 713324 709552 706943 705161 703956 703492 703816 704319 704353 704368 705722 708998 713123 716684
52204 716684 719520 722360 725382 728075 730279 732337 734150 735016 734637 733516 732102 730320 728270 726700 726273
52189 726273 726862 727887 728869 729320 728699 726991 724915 723090 721299 718942 715802 712012 707697 703128 698840
52174 698840 695114 691618 688053 684827 682534 681004 679420 677277 674727 672100 669619 667550 666101 665076
52160 665076 663942 662364 660462 658563 656897 655441 653811 651429 648168 644818 642545 641784 641874 641787 641027 639816
52144 639816 638668 637940 637687 637765 637996 638205 638206 637922 637535 637373 637602 638215 639310 641202 644208 648482 654008 660473
52126 660473 667225 673773 680409 687917 696614 706126 716257 727473 740182 754062 768545 783537 799167
52113 799167 815166 831084 846856 862643 878295 893447 908064 922393 936519 950371 963973
52102 963973 977166 989207 999227 1007101 1013419 1018617 1022670 1025592 1027609 1028625 1028021 1025322 1020797 1015149
52088 1015149 1008849 1001924 994246 985859 977083 968370 960028 952123 944739 938122 932425 927558 923553 920767
52074 920767 919292 918424 917342 916270 916374 918446 922247 927211 933108 939802 946950 954424 962559 971530 980824
52059 980824 989735 998107 1006113 1013612 1020265 1026175 1031802 1037183 1041675 1044646 1046087 1046383 1045774 1044288 1041974
52044 1041974 1038923 1035056 1030056 1023545 1015304 1005401 994219 982298 969993 957269 943889 929849
52032 929849 915516 901294 887278 873325 859378 845496 831611 817558 803485 789987 777578
52021 777578 766115 755015 743994 733282 723026 712804 701970 690351 678351 666408 654545
52010 654545 642536 630286 617855 605213 592210 578841 565355 551923 538325 524136 509243
51999 509243 493989 478798 463842 449116 434676 420694 407369 394898 383407 372791 362697
51988 362697 352776 342984 333590 324963 317440 311260 306442 302625 299102 295101 290153 284201 277413 269899
51974 269899 261794 253591 246191 240284 235763 231959 228439 225303 222755 220775 219299 218302 217460 216052 213593
51959 213593 210423 207417 205194 203798 202946 202285 201492 200468 199463 198844 198698 198787 198814 198636 198327 198238 198870 200460
51941 200460 202719 205093 207170 208642 209151 208597 207605 207222 207957 209397 210873 212263 213942 216166 218827
51926 218827 221766 225018 228728 232942 237566 242407 247236 252010 257257 264184 274064 287336 303418 321499
51912 321499 341376 363317 387286 412422 437044 458718 474465 481620 478982 467258 448443 425035
51900 425035 399652 374670 351653 331124 313028 297251 283689 272191 262689 255111 248969 243371
51888 243371 237722 232262 227623 224111 221603 219855 218508 216982 214778 211903 208785 205869 203431 201546
51874 201546 199981 198318 196454 194732 193341 191823 189524 186297 182380 177883 172925 168149 164505 162342
51860 162342 161057 159682 157664 155177 152954 151728 151554 151734 151596 151099 150445 149532 148280 147191 146882 147169
51844 147169 147210 146510 145263 143884 142874 142981 144638 147074 148818 149368 149689 150741 152235 153280 153573 153396
51828 153396 152944 152346 152027 152419 153330 154086 154213 153701 152812 151968 151684 152155 152984 153605 153924 154249 154687 154933 154732
51809 154732 154246 153887 153888 154138 154376 154527 154804 155448 156415 157493 158621 159843 160870 161067 160096 158447 157163
51792 157163 157077 158315 160327 162291 163673 164538 165253 165917 166278 166140 165560 164630 163435 162319 161784 161933 162290
51775 162290 162398 162321 162410 162846 163606 164581 165508 166009 165979 165731 165588 165512 165286 164768 163879 162721 161890 162202 163713
51756 163713 165458 166573 167326 168457 169849 170520 169936 168698 167833 167878 168749 170117 171768 173818 176575 179943
51740 179943 183079 185049 185892 186636 188210 190695 193700 196990 200450 203750 206393 208005 208383 207410 205159
51725 205159 202095 198993 196590 195206 194552 193873 192440 190002 186779 183074 179033 174795 170690 167176 164594
51710 164594 162995 162140 161654 161246 160766 160078 159033 157712 156553 155991 155950 155900 155481 154852 154355 153969 153271 151925
51692 151925 150090 148294 146935 145977 145184 144501 144051 143798 143496 143058 142742 142795 143158 143719 144663 146264 148424
51675 148424 150736 152980 155290 157836 160495 162848 164348 164569 163555 161853 159966 157850 155214 152239
51661 152239 149654 148044 147388 147329 147525 147671 147535 147178 146838 146414 145386 143535 141492 140228 140049 140398 140602
51644 140602 140541 140535 140787 141081 141021 140551 140144 140327 141035 141645 141752 141676 142002 142788 143514 143756 143700 143933 144835 146238
51624 146238 147683 149065 150996 154286 158924 163848 167948 171136 174076 177070 179668 181414 182455 183198
51610 183198 183728 183940 183992 184269 184914 185634 185931 185382 183768 181208 178202 175349 172915 170746 168615 166541
51594 166541 164752 163432 162589 162123 161981 162230 162937 163978 165009 165686 165807 165190 163580 160929 157732 154851
51578 154851 152928 152066 152026 152436 152807 152707 152206 151985 152618 153775 154399 153858 152772 152506 153879 156460 159134
51561 159134 161163 162568 163609 164289 164492 164349 164154 164029 163929 163864 163791 163424 162602 161823 161849 162620 163182 163071 163114
51542 163114 164225 165796 166207 164877 162987 161970 162022 162468 162977 163746 164786 165733 166390 167012 167888 168944 169964
51525 169964 170995 172325 174055 175839 177217 178205 179518 182017 185931 190665 195389 199712 203714 207414
51511 207414 210353 211771 211209 208931 205749 202460 199487 196996 195082 193631 192202 190307 187853 185092
51497 185092 182160 178961 175574 172484 170146 168378 166424 163734 160623 158009 156408 155244 153385 150387
51483 150387 146980 144192 142312 140940 139756 138752 137859 136890 135896 135128 134578 134015 133581 133788 134663 135404 135282
51466 135282 134531 133894 133653 133615 133770 134316 135103 135711 136183 137070 138532 139865 140313 140063 140045 140944 142700 144824
51448 144824 146724 147771 147465 145878 143781 142087 141122 140473 139494 137885 135862 133879 132234 130903 129729
51433 129729 128689 127855 127115 126189 125106 124441 124734 125740 126645 127069 127510 128619 130407 132403 134325 136229
51417 136229 138181 140137 142106 144153 146234 148217 149956 151203 151672 151504 151442 152189 153617 154931 155491 155109
51401 155109 153734 151398 148531 145822 143581 141565 139551 137780 136715 136613 137321 138199 138317 137245 135724
51386 135724 135094 135926 137607 139312 140819 142221 143476 144563 145574 146283 146155 145207 144354 144342 144743 144549 143483
51369 143483 142121 140946 139930 138950 138026 137091 136032 134960 134058 133179 132031 130786 130036 130055 130505 130995 131538
51352 131538 132212 132700 132565 131869 131270 131425 132397 133642 134447 134284 132844 130045 126282 122545 119939 118864
51336 118864 118785 118848 118613 118252 118304 119177 120570 121361 120472 117999 115162 113143 112332 112683 114008 115656 116641 116766
51318 116766 117072 118536 120726 122438 123388 124466 126412 128945 131331 133284 135166 137553 140564 143370 144653
51303 144653 143954 142332 141190 140702 139995 138619 137078 135918 135075 134257 133356 132323 131180 130279 129952 129790
51287 129790 128869 126960 124947 123799 123581 123728 123809 123694 123390 123105 123232 123969 125154 126592 128241 129933 131349
51270 131349 132509 133872 135680 137527 138921 139941 140967 141943 142335 141748 140308 138474 136694 135245 134291
51255 134291 133979 134372 135254 136196 137068 138293 140275 142728 145029 147041 149007 150643 151110 150128 148446 146914
51239 146914 145615 144241 142760 141257 139658 138100 137118 136873 136627 135602 134059 132863 132233 131675 131077 131047
51223 131047 131994 133504 134938 136187 137555 139156 140800 142287 143589 144737 145707 146466 147142 148121 149783
51208 149783 152049 154236 155529 155545 154485 152891 151379 150340 149647 148792 147455 145815 144118 142218 139902
51193 139902 137507 135750 134940 134692 134487 134222 134073 134068 133950 133405 132395 131326 130810 131092 131766 132245 132488 133044
51175 133044 134341 136159 137876 139112 140030 141138 142838 145120 147589 149721 151074 151331 150485 149140 148321
51160 148321 148573 149325 149554 149084 148844 149683 151386 153131 154533 155738 156704 156977 156384 155497 155091 155338 155768
51143 155768 155870 155463 154523 153021 151031 148812 146634 144599 142722 141109 139956 139376 139226 139109 138653 137926
51127 137926 137491 137822 138753 139756 140738 142139 144177 146387 148130 149196 149675 149627 149270 149148 149680 150778 152284
51110 152284 154416 157247 160038 161798 162388 162423 162209 161558 160617 159996 159816 159460 158652 157994 157969 158100 157725 157010
51092 157010 156482 156057 155377 154784 155026 155975 156507 155914 154812 154316 154789 155734 156589 157233 157853 158630 159578 160536
51074 160536 161308 161875 162402 162961 163314 163106 162342 161566 161455 162197 163394 164547 165408 165884 165955 166005 166851 168972
51056 168972 171836 174469 176626 178890 181723 184992 188430 191821 194561 195792 195390 194255 193220 192205
51042 192205 190933 189851 189681 190431 191525 192623 193691 194513 194823 194851 195075 195508 195787 195930 196446 197674 199561
51025 199561 202116 205528 209787 214641 219983 225835 231905 237706 243159 248616 254160 259437 264355 269399
51011 269399 274925 280557 285605 289790 293285 296356 299310 302543 306290 310422 314734 319312 324412 330098
50997 330098 336202 342582 349237 356241 363684 371574 379736 387831 395642 403311 411279 420130 430518 443089
50983 443089 458307 476343 497137 520604 546830 576205 609282 646276 686700 729708 774871
50972 774871 822458 872864 925844 980369 1035118 1088976 1141164 1191032 1237822 1280555 1318111
50961 1318111 1349484 1374248 1392961 1407023 1417759 1425497 1429732 1430289 1428150 1425049 1422479 1421181 1421214
50948 1421214 1422171 1423466 1424720 1425743 1426022 1424503 1420125 1412353 1400888 1385189 1364707 1339358 1309310
50935 1309310 1274542 1235107 1191663 1145152 1096084 1044823 992557 941169 891866 844570 798978
50924 798978 755661 715705 679646 647249 618044 591699 568024 546954 528428 512137 497530
50913 497530 484265 472459 462298 453629 446138 439703 434256 429418 424663 419923 415856 413409 413014 414198
50899 414198 415999 417854 419948 422544 425260 427448 429239 431609 435238 439760 444351 448661 452904 457475
50885 457475 462859 469578 477733 486783 496155 505866 516147 526771 537386 548527 561636 577771 596627
50872 596627 617055 638386 661069 686275 715083 748028 785172 826603 872921 925259 984754
50861 984754 1051910 1126418 1207609 1295064 1388847 1489126 1595679 1707788 1824471 1944543
50851 1944543 2066433 2188131 2307387 2421750 2528369 2624028 2705752 2771528 2820559 2853144
50841 2853144 2870637 2875416 2870444 2858404 2841165 2820146 2797250 2775332 2757626 2746587 2743229 2747260
50829 2747260 2757481 2771843 2787378 2800421 2807083 2803805 2788052 2758812 2716182 2660200 2590411 2506924
50817 2506924 2411430 2306477 2193982 2075319 1952870 1830474 1711845 1599093 1493050 1394321
50807 1394321 1303394 1220317 1144994 1077636 1018374 966650 921518 882415 849133 821213 797846
50796 797846 778394 762527 749824 739587 731057 723571 716592 709920 703772 698251 692762 686331 678612
50783 678612 670303 662506 655783 649748 643409 636034 627886 619911 612533 605068 596700 587698 579161 571794
50769 571794 565568 560388 556335 553259 550881 549492 549837 552061 555417 559377 564442 571464 580652 591664
50755 591664 604198 618102 633378 650601 670843 694601 721175 749813 781180 816947 858070
50744 858070 904234 954872 1009892 1069198 1132234 1198334 1266957 1337231 1407782 1477415 1545554
50733 1545554 1611609 1674265 1731798 1782795 1826054 1860031 1883034 1894080 1893291 1881561 1860385 1832119
50721 1832119 1799902 1766874 1735398 1707080 1683214 1664960 1653109 1647844 1648739 1654840 1664745 1676637
50709 1676637 1688281 1697088 1700363 1695737 1681532 1656810 1621250 1575217 1519997 1457799 1391187 1322334
50697 1322334 1252896 1184558 1119354 1059035 1004180 954295 908930 868462 833675 804870 781602
50686 781602 763071 748516 737370 729410 724818 723959 727026 733805 743516 754759 766015 776602 786973
50673 786973 797715 808425 818025 826067 833111 839678 845471 849960 853398 856831 861244 866943 873621 880801
50659 880801 888319 896574 906245 917654 930616 945041 961535 981151 1004685 1032302 1063586 1097689
50647 1097689 1133553 1170358 1207770 1245563 1283014 1318786 1351418 1379836 1403490 1422242 1436210
50636 1436210 1445683 1451102 1452974 1451647 1447181 1439555 1428880 1415232 1398547 1379232 1358900 1339841
50624 1339841 1323399 1309237 1296441 1284900 1275210 1267684 1262087 1258205 1256088 1255708 1256790 1259035 1262242
50611 1262242 1266213 1270683 1275123 1278273 1278010 1272163 1259588 1240350 1215137 1184873 1150727 1114002 1075860
50598 1075860 1037347 999538 963317 929045 896787 866774 839315 814353 791452 770197 750307
50587 750307 731500 713618 696802 681179 666551 652833 640660 630951 623836 618545 614455 611745
50575 611745 610860 611830 614368 618357 623942 631297 640336 650590 661479 672965 685715 700279 716244
50562 716244 732685 749247 766270 784019 802436 821535 841207 860589 878474 894674 910302
50551 910302 926466 943352 960973 980037 1001511 1025803 1052935 1083139 1116702 1153503 1193217
50540 1193217 1235962 1282504 1333945 1391297 1454994 1524626 1599372 1678727 1762342 1849184 1937497
50529 1937497 2025804 2113201 2198244 2278302 2350579 2413345 2465650 2506458 2534707 2549752 2551009
50518 2551009 2537543 2508905 2466254 2412008 2348397 2276913 2199045 2116953 2033411 1951484 1874106
50507 1874106 1803401 1740271 1684913 1637666 1599167 1569953 1550279 1540182 1539367 1547231 1563278 1587242
50495 1587242 1618460 1655374 1695831 1737234 1775903 1806926 1825653 1829309 1816827 1787827 1742823
50484 1742823 1684167 1615576 1540482 1461534 1381487 1303281 1228720 1157911 1090592 1027472 969833
50473 969833 918316 872590 831893 795533 763128 734724 710594 690769 674889 662502 653221 646623
50461 646623 642379 640554 641408 644805 650191 657161 665622 675353 685973 697490 710402 724834 739908
50448 739908 754197 766596 776619 784263 789889 794150 797812 801690 806536 812571 819138 825403 831557
50435 831557 838881 848336 859512 871263 883027 895194 908437 923101 939090 956096 973990 993148
50423 993148 1014252 1037713 1063487 1091579 1122412 1156504 1193926 1234201 1276512 1319829 1363019
50412 1363019 1405003 1444804 1481495 1514408 1543316 1567997 1587508 1600255 1604938 1601056 1588404 1566668
50400 1566668 1535869 1496776 1450468 1397869 1340245 1279894 1219639 1161563 1106565 1055104 1007942
50389 1007942 966043 930107 900388 876830 859235 847343 840893 839690 843714 853096 867740 886789
50377 886789 908541 930976 952275 970850 985221 994121 996594 991920 979727 960493 935702 907085
50365 907085 875703 842033 806860 771580 737477 704991 673939 644247 616238 590301 566589
50354 566589 545059 525636 508264 492991 480088 469834 461947 455448 449526 444519 441553 441027 441947
50341 441947 443094 444490 447181 451787 457821 464362 470794 476838 482417 487749 493174 498633 503669 508156
50327 508156 512679 517894 523782 529879 536002 542417 549404 556969 564846 572512 579344 585175 590663 596773
50313 596773 603796 611219 618680 626724 636314 647760 660530 674122 688820 705453 724691 746928
50301 746928 772825 803809 841961 889090 944719 1003576 1054923 1086085 1088897 1064087 1019937 966948
50289 966948 913304 863673 820141 783351 753275 729647 711952 699287 690667 685464 683175 682760
50277 682760 682755 682228 681257 680285 679387 678390 677333 676464 675894 675472 674795 673248 670268 665844 660625 655387 650490
50260 650490 645862 641299 636682 632080 627840 624497 622583 622518 624570 628700 634554 641906 651037 662428
50246 662428 676218 692345 710987 732210 755150 778206 800260 821201 841072 859404 875770
50235 875770 890476 904192 917239 929596 941124 951172 958182 960335 956652 947249 932717 913587
50223 913587 890294 863345 833579 802500 772095 743883 718055 693752 670182 647362 625967
50212 625967 606689 589635 574181 559498 545298 531918 519599 508029 496823 486141 476513 468205
50200 468205 461043 454706 448939 443613 438839 434942 432098 430115 428651 427442 426169 424400 421936 418989
50186 418989 415807 412323 408405 404195 399930 395643 391281 386905 382471 377751 372822 368335 364849 362069
50172 362069 359226 356136 353419 351708 351041 351066 351411 351742 351802 351635 351666 352420 354110 356500 359097 361527 363730
50155 363730 365716 367309 368435 369557 371326 373653 375624 376687 377442 378866 381152 383897 387113 391409
50141 391409 397197 404283 412299 421184 431186 442692 456074 471491 488909 508517 531020 557255
50129 557255 587618 622105 660608 702685 747031 791604 834433 874365 911323 946173 980073
50118 980073 1013493 1045880 1076422 1104828 1130884 1153471 1170628 1180571 1182285 1175287 1159543 1135864
50106 1135864 1105911 1071504 1034031 994536 954005 913387 873519 835180 799051 765636 735271
50095 735271 708163 684238 663083 644232 627433 612527 599306 587738 578124 570757 565615 562583
50083 562583 561667 562583 564557 567023 570279 574873 580586 586663 592874 599596 606830 613856 620009 625169 629328
50068 629328 632277 633930 634439 633777 631679 628276 624235 620008 615303 609645 603130 596355 589876 583940 578508
50053 578508 573326 568223 563456 559527 556522 554011 551750 550135 549745 550708 552753 555663 559444 564196 569952
50038 569952 576452 583007 588866 593848 598430 603132 608007 612713 616824 620099 622813 625743 629342 632845
50024 632845 634780 634504 632755 630499 627935 624987 622148 620100 618888 618139 617946 618921 621464 625626 631745
50009 631745 640604 652651 667445 684126 702149 721232 740779 759780 777421 793577 808542 822351
49997 822351 834605 844933 853372 860046 864511 865603 861949 852606 837351 816582 791011 761463 729007
49984 729007 695167 661634 629558 599346 571260 545777 523013 502234 482617 464324 448236
49973 448236 434601 422601 411311 400545 390618 381796 374195 367785 362237 357115 352366 348291 344947
49960 344947 341985 339221 336906 335157 333540 331462 328716 325402 321653 317640 313613 309777 306325 303654
49946 303654 302124 301498 301090 300627 300545 301183 302183 303017 303728 304817 306712 309571 313160 316574 318511 318320
49930 318320 316498 313925 311035 308155 306059 305437 306046 307051 308079 309320 310711 311775 312347 312789 313186
49915 313186 312866 311113 308059 304540 301262 298446 296170 294579 293598 292714 291428 289949 289051 289104 289506 289325
49899 289325 288203 286310 283759 280737 278068 276802 277030 277692 277836 277525 277241 276995 276531 275952 275595 275577 275848
49882 275848 276414 277128 277555 277516 277474 277950 278813 279536 279907 280001 279720 278903 277799 276958 276710 277113 278220 279964 281872
49863 281872 283382 284402 285233 286054 286819 287574 288438 289308 289918 290161 290119 289906 289732 289949 290656 291446 291892 292075
49845 292075 292328 292709 293186 294075 295724 297836 299581 300368 300092 298836 296869 294773 293007 291395 289592 287987
49829 287987 287500 288457 290232 292053 293585 294712 295443 296211 297603 299463 300802 300937 300289 299781 299857 300379 301076
49812 301076 301685 301878 301461 300553 299409 298217 297112 296154 295187 293975 292581 291367 290552 290049 289708 289396 288818
49795 288818 287759 286577 285993 286238 286854 287448 288097 288747 288860 288110 286992 286203 285768 285288 284775 284606 284813 284953
49777 284953 284712 284203 283661 283227 283094 283445 284100 284497 284220 283423 282684 282500 282976 283893 285001 286229 287614 289103
49759 289103 290640 292460 294996 298260 301459 303539 304134 303810 303340 302913 302145 300829 299493 299032 299797 301238
49743 301238 302593 303723 304922 306120 306757 306511 305685 304751 303953 303514 303809 304962 306717 309096 312851 318644
49727 318644 325867 332762 337739 340269 340587 339086 336233 332708 329287 326583 324905 324239 324366 325113 326560
49712 326560 328955 332418 336773 341573 346170 349918 352550 354387 356066 358056 360448 363006 365217 366491
49698 366491 366631 366118 365664 365534 365523 365530 365883 367129 369748 374021 379830 386651 394106 402456 411890 421177 427746
49681 427746 429739 427724 423922 420079 416674 413885 412341 412620 414702 418380 423754 430761 438365 444674
49667 444674 447910 447155 442450 434670 425304 415918 407561 400720 395724 392919 392439 394070 397405 401976 407321
49652 407321 413369 420961 431512 445552 461400 475447 483958 484982 479074 468586 456195 443703
49640 443703 431861 420988 411428 403425 396939 391862 388175 385635 383547 381252 378811 376882 375903 375690
49626 375690 375812 375975 375988 375705 375292 375286 376108 377604 379264 380810 382346 383965 385466 386643 387730 389300 391584
49609 391584 394028 395771 396622 397300 398554 400282 401796 402867 404057 405931 408308 410580 412570 414754 417526
49594 417526 420519 422844 424009 424499 425330 427070 429381 431519 433104 434295 435384 436497 437670 438975 440420
49579 440420 441880 443223 444467 445724 447081 448650 450661 453358 456696 460212 463347 465895 468033 469859
49565 469859 471135 471689 471879 472300 473064 473744 474060 474215 474423 474527 474345 474015 473701 473305 472833 472644 472939 473299
49547 473299 473331 473448 474328 475793 477041 477981 479509 482262 485906 490025 495006 501435 509137 517378 525655
49532 525655 533673 540856 546612 551106 555236 559746 564617 569290 573194 576078 578136 579825 581383 582642
49518 582642 583523 584404 585534 586291 585741 583989 582303 581500 580737 578428 574117 568841 563775 559099 554388 549544
49502 549544 544852 540327 535473 529809 523423 516879 510796 505568 501306 497847 494878 492202 489860 487915
49488 487915 486226 484551 482747 480764 478617 476555 475075 474464 474390 474264 473888 473402 472692 471446 469885 468830
49472 468830 468660 468696 468119 467096 466415 466134 465326 463293 460538 458267 457226 457200 457408 457169 456400 455633 455492 456043
49454 456043 456849 457670 458811 460530 462394 463696 464501 465874 468871 473494 478786 483737 487925 491468 494771
49439 494771 498307 502384 507043 512420 519150 527909 538193 547868 554492 557206 557129 556064 555250 555268 556462
49424 556462 558926 562354 566315 570657 575426 580549 585892 591529 597579 603841 609985 616241 623535 632638
49410 632638 643309 654557 665687 676860 688640 701252 714309 727101 738960 749566 759163 768452
49398 768452 778006 787673 796693 804513 811354 817847 824169 829689 833495 835150 834915 833351 830861 827646
49384 827646 823992 820310 816780 813163 809195 805081 801251 797710 794114 790564 787763 786095 785048 784067
49370 784067 783534 784133 785412 785841 784522 782164 780042 778532 777106 775380 773559 771926 770361 768448 765876
49355 765876 762650 759001 755165 751269 747508 744337 742239 741285 741191 741809 743180 744942 746157 746162 745342 744623
49339 744623 744287 743774 742677 741525 741272 742203 743595 744454 744490 744326 744802 746134 747775 749000 749493 749410 749101
49322 749101 748898 749026 749540 750394 751653 753576 756358 759856 763681 767567 771635 776348 782246 789703 798742
49307 798742 808966 819498 828938 835649 838488 837498 833723 828271 821683 814169 806068 797717 789043 779746
49293 779746 770074 761109 753990 748833 744640 740387 736059 732447 730056 728561 727491 727134 728331 731404
49279 731404 735581 739593 742675 744941 746886 748675 749950 750342 750018 749466 748733 747270 744779 741795 738982
49264 738982 736095 732196 726816 720380 713549 706696 700116 694103 688625 683349 678215 673541 669367 665143
49250 665143 660384 655287 650478 646460 643523 641781 640915 640186 638985 637243 635210 633214 631719 631124 631251
49235 631251 631498 631806 632915 635294 638428 641741 645611 650697 656663 662479 667810 673202 678912 684444 689455
49220 689455 694389 699836 705826 712160 719069 727095 736489 746963 757985 769200 780673 792763 805696
49207 805696 819260 832985 846498 859520 871779 883278 894550 906236 918451 930803 942976
49196 942976 954830 965996 975897 984378 992020 999577 1007305 1014931 1022114 1028859 1035617 1042996 1051235 1060079
49182 1060079 1069332 1079354 1090636 1102898 1115046 1126173 1136323 1146233 1156566 1167477 1178581 1189262
49170 1189262 1199231 1208895 1218983 1229815 1241187 1252910 1265022 1277398 1289636 1301671 1314221 1328215
49158 1328215 1343817 1360225 1376441 1392086 1407486 1423094 1438963 1454826 1470652 1486803 1503537
49147 1503537 1520528 1537147 1553045 1568236 1582856 1597292 1612309 1628473 1645328 1661679 1676841
49136 1676841 1691223 1705587 1720262 1735290 1750807 1766893 1783434 1800626 1819379 1840792 1865339
49125 1865339 1892933 1923667 1958312 1998384 2046297 2105268 2178032 2264452 2359744 2455268 2542493
49114 2542493 2618388 2688246 2762016 2844772 2928431 2993269 3020191 3004221 2957495 2899305 2842422
49103 2842422 2787111 2725802 2652117 2566308 2474598 2385081 2303998 2234268 2176134 2128518 2089911
49092 2089911 2058586 2032890 2011721 1994555 1980850 1969722 1960411 1952675 1946384 1940969 1935678 1930176
49080 1930176 1924547 1918921 1913478 1908588 1904472 1900835 1897276 1893861 1890740 1887412 1883060 1877625 1871824 1866007
49066 1866007 1859732 1852750 1845696 1839313 1833438 1827303 1820567 1813590 1806915 1800818 1795192 1789558 1783285 1776141
49052 1776141 1768576 1761322 1754786 1748903 1743305 1737520 1731268 1724843 1718974 1714145 1710224 1706960 1704523 1703268
49038 1703268 1703217 1704127 1705942 1708766 1712367 1715992 1718827 1720654 1722099 1724199 1727483 1731431 1735050 1738025 1740939
49023 1740939 1744258 1747609 1750434 1752937 1755842 1759405 1763267 1767237 1771599 1776527 1781718 1787001 1792966 1800496
49009 1800496 1809704 1819648 1829250 1838283 1847318 1856792 1866421 1875506 1883553 1890429 1896231 1901402 1906818 1913262
48995 1913262 1920656 1928158 1935124 1941631 1947912 1953752 1958850 1963398 1967758 1971610 1973999 1974423 1973589 1972836 1972945
48980 1972945 1973673 1974362 1974731 1974915 1974965 1974702 1974212 1974165 1975257 1977437 1980054 1982739 1985751 1989385 1993480 1997754
48964 1997754 2002257 2007178 2012419 2017665 2022698 2027403 2031597 2035140 2038118 2040699 2042903 2044773 2046641 2048949
48950 2048949 2051767 2054710 2057402 2059930 2062800 2066493 2071051 2076164 2081784 2088557 2097349 2108286 2120612
48937 2120612 2133669 2147737 2163623 2181750 2202033 2224509 2249621 2277784 2308898 2342387 2377582
48926 2377582 2414021 2451467 2489662 2528164 2566629 2605260 2644695 2685354 2727077 2769515 2812497
48915 2812497 2855746 2898607 2940465 2981255 3021136 3059893 3097131 3132991 3168148 3203035 3237508
48904 3237508 3271318 3304466 3336954 3368652 3399660 3430354 3460760 3490219 3518133 3544833 3571224
48893 3571224 3597602 3623276 3647398 3669737 3690424 3709339 3726137 3740740 3753395 3764270 3773292
48882 3773292 3780385 3785541 3788536 3788895 3786345 3781044 3773137 3762311 3748169 3730861 3710974 3688829 3664293
48869 3664293 3637325 3608298 3577651 3545519 3511886 3476863 3440714 3403810 3366644 3329607 3292578
48858 3292578 3255011 3216701 3178315 3140949 3105317 3071611 3039979 3010745 2984044 2959528 2936705
48847 2936705 2915563 2896662 2880459 2866736 2855012 2845491 2839044 2835946 2835079 2834984 2835429 2837298 2841015 2845900
48833 2845900 2851269 2857466 2865367 2875284 2886730 2898959 2911456 2924189 2937620 2952190 2967647 2983237
48821 2983237 2998673 3014427 3030855 3047563 3063997 3080041 3095556 3109898 3122609 3134273 3145988
48810 3145988 3158178 3170540 3182930 3195564 3208331 3220574 3231756 3241959 3251630 3261149 3270691 3280188
48798 3280188 3289394 3298102 3306230 3313563 3319792 3325148 3330614 3336949 3343703 3349811 3354955 3359670 3364211 3368090
48784 3368090 3370834 3372538 3373447 3373606 3373197 3372694 3372334 3371757 3370436 3368084 3364471 3359246 3352250 3343664 3333485
48769 3333485 3321111 3305844 3287644 3267180 3245182 3221975 3197465 3171371 3143518 3114123 3083775
48758 3083775 3053099 3022477 2992089 2961992 2932033 2901845 2871196 2840368 2810124 2781250 2754087
48747 2754087 2728404 2703782 2680160 2658034 2638067 2620604 2605585 2592756 2581801 2572400 2564453 2558289
48735 2558289 2554545 2553817 2556356 2561764 2568807 2575890 2582129 2587854 2593746 2599664 2604730 2608429 2611076 2613179
48721 2613179 2614855 2616055 2616906 2617530 2617737 2617173 2615715 2613626 2611349 2609101 2606575 2603177 2598775 2594018 2589558
48706 2589558 2585143 2579976 2573929 2567879 2562693 2558435 2554835 2552067 2550573 2550333 2550819 2551658 2553031 2555339 2558757
48691 2558757 2563339 2569523 2578334 2591012 2608594 2632034 2662670 2702362 2753259 2817782 2898860 2999607
48679 2999607 3122279 3267364 3433052 3614242 3801104 3979096 4131627 4243616 4303669 4305242
48669 4305242 4248198 4139839 3993208 3823241 3643728 3466198 3299124 3146858 3010067 2888070
48659 2888070 2780653 2687535 2607109 2536771 2474373 2418874 2369776 2326457 2287962 2253039 2220445
48648 2220445 2189459 2160003 2132130 2105644 2080334 2056225 2033256 2011040 1989243 1967966 1947479
48637 1947479 1927803 1908882 1890945 1874309 1858915 1844322 1830126 1816309 1803301 1791731 1781848
48626 1781848 1773038 1764205 1754791 1745172 1736004 1727555 1719825 1712822 1706378 1700075 1693756 1687856 1682952 1679271
48612 1679271 1676837 1675622 1675154 1674466 1673037 1671460 1670641 1670558 1670412 1669764 1668823 1667712 1666192 1664252 1662364 1660859
48596 1660859 1659511 1657941 1656087 1653992 1651511 1648523 1645260 1642105 1639110 1635934 1632247 1628092 1623799 1619672
48582 1619672 1615820 1612329 1609492 1607691 1606973 1606842 1606495 1605174 1602292 1597565 1591145 1583502 1575004 1565779 1556089
48567 1556089 1546524 1537542 1529011 1520546 1512148 1504162 1496641 1489129 1481146 1472644 1463891 1455151 1446589 1438318
48553 1438318 1430364 1422641 1415086 1407778 1400875 1394419 1388266 1382207 1376131 1370022 1363823 1357400 1350756 1344199
48539 1344199 1338188 1333019 1328597 1324434 1319841 1314425 1308582 1303179 1298449 1293526 1287538 1280946 1275169 1270925
48525 1270925 1267553 1264018 1259881 1255129 1249780 1244147 1238945 1234630 1230917 1227271 1223436 1219121 1213711 1206952
48511 1206952 1199703 1193371 1188619 1185008 1181769 1178497 1175161 1171869 1168710 1165618 1162455 1159318 1156533 1154137
48497 1154137 1151713 1149058 1146686 1145234 1144607 1144149 1143448 1142442 1140931 1138630 1135734 1132963 1130891 1129553 1128657
48482 1128657 1127839 1126730 1125205 1123599 1122385 1121577 1120744 1119588 1118179 1116635 1114919 1113031 1111073 1109029 1106729
$$ [...]
##END NTUPLES=NMR SPECTRUM
##END=
