##TITLE=NES1065_159122.0003_002_9705170_9dfmSsBsMY
##JCAMPDX= 6.0         $$ Bruker NMR JCAMP-DX V2.0
##DATA TYPE= NMR SPECTRUM
##DATA CLASS= NTUPLES
##ORIGIN= BRUKER
##OWNER= Administrator
$$ 1.72 TOPSPIN		Version 2.1
$$ 2016-04-30 17:26:15.052 -0700  Administrator@X
$$ Compression mode = diff/dup
##.OBSERVE FREQUENCY= 400.02188249412
##.OBSERVE NUCLEUS= ^1H
##.ACQUISITION MODE= SIMULTANEOUS (DQD)
##.ACQUISITION SCHEME= undefined
##.AVERAGES= 8
##.DIGITISER RES= 22
##SPECTROMETER/DATA SYSTEM= spect
##.PULSE SEQUENCE= zg30
##.SOLVENT NAME= COFFEE_meoh
##.SHIFT REFERENCE= INTERNAL, COFFEE_meoh, 1, 14.98509
##AUDIT TRAIL= $$ (NUMBER, WHEN, WHO, WHERE, PROCESS, VERSION, WHAT)
$$ ##TITLE= Audit trail, TOPSPIN		Version 2.1
$$ ##JCAMPDX= 5.01
$$ ##ORIGIN= Bruker BioSpin GmbH
$$ ##OWNER= Administrator
$$ $$ E:\/data/COFFEE/nmr/NES1065_159122.0003_002_9705170_9dfmSsBsMY/10/pdata/1/auditp.txt
$$ ##AUDIT TRAIL=  $$ (NUMBER, WHEN, WHO, WHERE, PROCESS, VERSION, WHAT)
(   1,<2016-04-30 17:26:07.786 -0700>,<Administrator>,<X>,<go>,<TOPSPIN 2.1>,
      <created by zg
	started at 2016-04-30 17:25:01.536 -0700,
	POWCHK enabled, PULCHK disabled,
       configuration hash MD5:
       21 0F 79 D6 B3 7B B4 F6 88 20 88 DB 03 48 BD 9F
       data hash MD5: 64K
       95 4C 4B 6C 3A A9 C9 0A 41 41 7C 79 D3 FA 4B C3>)
(   2,<2016-04-30 17:26:11.036 -0700>,<Administrator>,<X>,<proc1d>,<TOPSPIN 2.1>,
      <Start of raw data processing
       efp LB = 0 FT_mod = 6 PKNL = 1 PHC0 = 0 PHC1 = 0 SI = 32K 
       data hash MD5: 32K
       68 BA 8A 06 04 D8 C6 55 45 02 F0 EA 16 7E D2 29>)
(   3,<2016-04-30 17:26:11.317 -0700>,<Administrator>,<X>,<proc1d>,<TOPSPIN 2.1>,
      <pk PHC0 = 93.54858 PHC1 = 0 
       data hash MD5: 32K
       ED A9 20 00 C3 8D 25 76 25 8A 3A 4E 0C 66 71 8F>)
(   4,<2016-04-30 17:26:11.427 -0700>,<Administrator>,<X>,<proc1d>,<TOPSPIN 2.1>,
      <abs ABSG = 1 
       data hash MD5: 32K
       6C A7 AE 35 99 F3 8C B6 42 5D C2 93 04 42 C7 46>)
(   5,<2016-04-30 17:26:11.505 -0700>,<Administrator>,<X>,<proc1d>,<TOPSPIN 2.1>,
      <abs ABSG = 2 
       data hash MD5: 32K
       DD D7 7E B9 DE E5 3E EA 36 DC 79 AC 6E C6 36 14>)
(   6,<2016-04-30 17:26:11.567 -0700>,<Administrator>,<X>,<proc1d>,<TOPSPIN 2.1>,
      <abs ABSG = 3 
       data hash MD5: 32K
       8B BF B5 89 91 67 B7 91 6C 48 BE 53 85 79 60 A6>)
(   7,<2016-04-30 17:26:11.630 -0700>,<Administrator>,<X>,<proc1d>,<TOPSPIN 2.1>,
      <abs ABSG = 4 
       data hash MD5: 32K
       0A 4F 74 73 F8 9B 6B A4 C5 DD 68 3A 90 7B B8 11>)
(   8,<2016-04-30 17:26:11.692 -0700>,<Administrator>,<X>,<proc1d>,<TOPSPIN 2.1>,
      <abs ABSG = 5 
       data hash MD5: 32K
       64 15 4F 66 64 53 1E 5B 05 BB 6F 40 D5 BF 1C 8E>)
$$ ##END=
$$ 
$$ $$ hash MD5
$$ $$ 1A 5D C6 37 56 A9 D5 47 08 F9 42 16 BF 9A 49 F9
##$RELAX= 
##$RELAX= 
##$RELAX= 
##$RELAX= 
##$RELAX= 
##$RELAX= 
##$RELAX= 
$$ Bruker specific parameters
$$ --------------------------
##$DU= <E:\>
##$EXPNO= 10
$$ [...]
##$TP= (0..7)
150 150 150 150 150 150 150 150
##$TP07= 0
##$TPNAME0= <>
##$TPNAME1= <>
##$TPNAME2= <>
##$TPNAME3= <>
##$TPNAME4= <>
##$TPNAME5= <>
##$TPNAME6= <>
##$TPNAME7= <>
##$TPOAL= (0..7)
0.5 0.5 0.5 0.5 0.5 0.5 0.5 0.5
##$TPOFFS= (0..7)
0 0 0 0 0 0 0 0
##$TUNHIN= 0
##$TUNHOUT= 0
##$TUNXOUT= 0
##$USERA1= <user>
##$USERA2= <user>
##$USERA3= <user>
##$USERA4= <user>
##$USERA5= <user>
##$V9= 5
##$VALIST= <valist>
##$VCLIST= <CCCCCCCCCCCCCCC>
##$VD= 0
##$VDLIST= <DDDDDDDDDDDDDDD>
##$VPLIST= <PPPPPPPPPPPPPPP>
##$VTLIST= <TTTTTTTTTTTTTTT>
##$WBST= 2048
##$WBSW= 25
##$XGAIN= (0..3)
0 0 0 0
##$XL= 0
##$YL= 0
##$YMAX_a= 614861
##$YMIN_a= -517171
##$ZGOPTNS= <>
##$ZL1= 120
##$ZL2= 120
##$ZL3= 120
##$ZL4= 120
##$ABSF1= 14.98509
##$ABSF2= -5.573092
##$ABSG= 5
##$ABSL= 3
##$ALPHA= 0
##$AQORDER= 0
##$ASSFAC= 0
##$ASSFACI= 0
##$ASSFACX= 0
##$ASSWID= 0
##$AUNMP= <proc_prof1d_extract_pilot.lims>
##$AXLEFT= 0
##$AXNAME= <>
##$AXNUC= <1H>
##$AXRIGHT= 0
##$AXTYPE= 0
##$AXUNIT= <>
##$AZFE= 0.1
##$AZFW= 0.1
##$BCFW= 0
##$BC_mod= 0
##$BYTORDP= 0
##$COROFFS= 0
##$CY= 15
##$DATMOD= 1
##$DC= 0
##$DFILT= <>
##$DTYPP= 0
##$F1P= 0
##$F2P= 0
##$FCOR= 0.5
##$FTSIZE= 32768
##$FT_mod= 6
##$GAMMA= 0
##$GB= 0
##$INTBC= 1
##$INTSCL= 1
##$ISEN= 128
##$LB= 0
##$LEV0= 0
##$LPBIN= 0
##$MAXI= 10000
##$MC2= 0
##$MEAN= 0
##$ME_mod= 0
##$MI= 0
##$NCOEF= 0
##$NC_proc= -8
##$NLEV= 6
##$NOISF1= 0
##$NOISF2= 0
##$NSP= 0
##$NTH_PI= 0
##$NZP= 0
##$OFFSET= 14.98509
##$PC= 1
##$PHC0= 93.54858
##$PHC1= 0
##$PH_mod= 1
##$PKNL= yes
##$PPARMOD= 0
##$PPDIAG= 0
##$PPIPTYP= 0
##$PPMPNUM= 2147483647
##$PPRESOL= 1
##$PSCAL= 4
##$PSIGN= 0
##$PYNMP= <proc.py>
##$REVERSE= no
##$SF= 400.02
##$SI= 32768
##$SIGF1= 0
##$SIGF2= 0
##$SINO= 400
##$SIOLD= 32768
##$SPECTYP= <>
##$SREGLST= <1H.CDCl3>
##$SSB= 0
##$STSI= 32768
##$STSR= 0
##$SW_p= 8223.68421052631
##$SYMM= 0
##$S_DEV= 0
##$TDeff= 65536
##$TDoff= 0
##$TI= <>
##$TILT= no
##$TM1= 0
##$TM2= 0
##$TOPLEV= 0
##$USERP1= <user>
##$USERP2= <user>
##$USERP3= <user>
##$USERP4= <user>
##$USERP5= <user>
##$WDW= 1
##$XDIM= 32768
##$YMAX_p= 432518270
##$YMIN_p= -693664
##$CURPLOT= <Network HP LaserJet P1505>
##$CURPRIN= <$Network HP LaserJet P1505>
##$DFORMAT= <normdp>
##$LAYOUT= <+/1D_H.xwp>
##$LFORMAT= <normlp>
##$PFORMAT= <normpl>
##$SURQMSG= 1
$$ End of Bruker specific parameters
$$ ---------------------------------
##NTUPLES= NMR SPECTRUM
##VAR_NAME=  FREQUENCY,     SPECTRUM/REAL,   SPECTRUM/IMAG
##SYMBOL=    X,             R,               I
##VAR_TYPE=  INDEPENDENT,   DEPENDENT,       DEPENDENT
##VAR_FORM=  AFFN,          ASDF,            ASDF
##VAR_DIM=   32768,         32768,           32768
##UNITS=     HZ,            ARBITRARY UNITS, ARBITRARY UNITS
##FACTOR=    0.250966925370066, 1,           1
##FIRST=     8223.43324360094, 41892,        87950
##LAST=      0,             -281544,         -99247
##MIN=       0,             -693664,         0
##MAX=       8223.43324360094, 432518270,    0
$$ Real data points
##PAGE= N=1
##DATA TABLE= (X++(R..R)), XYDATA
$$ [...]
19511a05731k40105a00547M1422i872l3673k62135J35522C9614d05407E1593E022
19499b21183A54031C579K29376o1480a30606d778E2542p991c83062A12209C8209
19487A969d25694a92339K2442L4231f4581p9984k9258b0416A75348F8046k6733
19476D1313P4947J0194a15753n3808g1346j96881B54983p9346L5715f8540F3017
19464c4923k51893a05373B61273a10141L9767B43173a93823f4944j0599j90332
19454b65875M4173L6843A9272b32598e0557k09992r0506J59715K9619B5670f7951
19442A50776B5160a19034A32172N7787f2884E0671a60301B46929c73363B48678
19431a54640N5416p6342E2369b57182A0509i4028K3821c4426k22068B64383B1728
$$ plain form
19511 -105731 -345836 -100547 -59125 -9872 -43545 -305680 -170158 39614 -405407 51593 5022
19499 -221183 154031 3579 232955 171475 -130606 -4778 52542 44551 -383062 112209 38209
19487 1969 -425694 -192339 -169897 -135666 -64581 -144565 -173823 -20416 175348 68046 41313
19476 41313 116260 126454 -115753 -169561 -71346 -268227 254983 175637 211352 -68540 63017
19464 -34923 -286816 -105373 261273 -110141 -70374 243173 -193823 -64944 -75543 -265875
19454 -265875 -221702 -184859 19272 -232598 -50557 -260549 -351055 -191340 -161721 25670 -67951
19442 150776 25160 -119034 132172 189959 -62884 50671 -160301 246929 -373363 248678
19431 -154640 -99224 -175566 52369 -257182 10509 -94028 -70207 -34426 -256494 264383 21728
19419g129k07751a00250A92820n298a62868L6363B98716a92575R5489A0668R0951
19408A01619a95377p8551a5440j57787D7935b3775A44249b56023A26086b70159
19397a85790B1823g7695q4944D0227b37639G3347b22109Q9194I6542J43309B696
19385a68073A22062d0159B72951a7820j25743K9324m9511p0809a00568A9998f1050
19373A41996a712m4385k8415B51547P49q3783g5364B00941b70595c1885k60899
19362b92784a22620A98099J31247i7466J083l8115A01479b18758n2987a16709
19351d9225C034b28693A13649C4619M5222P5346J94376G0027K9115a28892j6937
19340a45829B73605k9885a30704l6963o9166C04153a37676j11914A90149E1650
$$ plain form
19419 -7129 -214880 -100250 192820 187522 -162868 -126505 298716 -192575 -97086 10668 101619
19408 101619 -195377 -273928 -15440 -173227 47935 -23775 144249 -256023 126086 -270159
19397 -185790 21823 -77695 -162639 40227 -237639 73347 -222109 -132915 96542 239851 2696
19385 -168073 122062 -40159 272951 -17820 -143563 -114239 -163750 -234559 -100568 19998 -61050
19373 141996 -1712 -46097 -74512 251547 252296 168513 -75364 200941 -270595 -31885 -292784
19362 -292784 -122620 198099 329346 -97466 -96383 -134498 101479 -218758 -271745 -116709
19351 -49225 3034 -228693 113649 34619 79841 155187 349563 70027 99142 -128892 -145829
19340 -145829 273605 243720 -130704 -167667 -236833 304153 -137676 -249590 190149 51650
19329a06707I5315a83637h3989A03324a72564B57706E3819J25602G1239L09233
19319C80472A21787c8557k2105r5029D1370K6384b55379F0079b20720f8735j33587
19308b02322C5470d0492A90097b51551i1657B32932B9020h3163a4080C07444b13341
19296G9104d8801m25073D3750O2046k7871a90206P7982j89482a44157b5965k55523
19285b81488J18787A12094E2667P7972a81556A4287a2816j47787A53142a03792
19274d7115B4698b11168L7672A5130e4086j49634K2764C6084c18638a53773j49599
19263c03372R7318k31209a98575j06343B61333H7617J25309c28529F3802b26138
19252a60588c1507r2139k50244J47293c3584A36934a08530B46612a20653o0237
$$ plain form
19329 -106707 95315 -183637 -83989 103324 -172564 257706 53819 179421 71239 380472
19319 380472 121787 -38557 -60662 -155691 41370 67754 -255379 60079 -220720 -68735 -202322
19308 -202322 35470 -40492 190097 -251551 -91657 232932 29020 -83163 -14080 307444 -213341
19296 79104 -48801 -473874 43750 105796 77925 -190206 -112224 -301706 -144157 -25965 -281488
19285 -281488 -162701 112094 52667 130639 -181556 14287 -12816 -160603 153142 -103792
19274 -47115 24698 -211168 -173496 15130 -54086 -203720 -180956 36084 -318638 -153773 -303372
19263 -303372 -206054 -437263 -198575 -304918 261333 87617 212926 -328529 63802 -226138
19252 -160588 -31507 -123646 -373890 -226597 -33584 136934 -108530 246612 -120653 -180890
19242a80890a4535r5978k50665B6622d0502n1007k51591a43091C3163K3854N3717
19231A10734c3590B73132A29944a23117j30669C9813b8889A95670O4330i8122
19220e0478j70138j21760d7771j13503F6353a45687G9652a13047j8776E1925K4957
19209G6882J76543F5708h0384B8816N9021e2075b3023j9781A46252d69562A37299
19197b03386D2849a48400f4853D3036c97846A12080a80693f5391e604A31092c12194
19185g09l8457B4297g5128l09853a28080E9928f1602F6633g210r8j13159p2246
19173a92713A73713b29189a12323l9783a5353k87339k5345J8981J44258l5765
19163b00563G7828b16399B7142J03475b93533M0262a03169f811A40367b00038
$$ plain form
19242 -180890 -14535 -110513 -361178 26622 -40502 -91509 -343100 -143091 33163 57017 110734
19231 110734 -33590 273132 129944 -123117 -253786 39813 -28889 195670 260000 -98122
19220 -50478 -220616 -342376 -47771 -161274 66353 -145687 79652 -113047 -131823 51925 76882
19209 76882 253425 65708 -80384 28816 87837 -52075 -23023 -42804 146252 -469562 137299
19197 -203386 42849 -148400 -64853 43036 -397846 112080 -180693 -65391 -5604 131092 -312194
19185 -709 -39166 24297 -75128 -384981 -128080 59928 -61602 66633 -7210 -7308 -120467 -192713
19173 -192713 173713 -229189 -112323 -152106 -15353 -302692 -328037 -309056 -164798 -200563
19163 -200563 77828 -216399 27142 130617 -293533 -253271 -103169 -6811 140367 -200038
19152F0281M8413a15766c1226a4131r8978m1799b4982E3695c62682D830c6308
19140a39820A43958g0952k44912D5856f9942a3372D9049Q959c4459j08567G3289
19128A04235q16c66559A11971i5559l9804M3851A30379c66143a07479j9646N6868
19117g0257i549G2381G128a0243k05938g0756l228r2047H2493a71057A05658K8093
19105A33751b98299Q8508a376o6266e346j56605A03968l1113A3145i1538k6797
19094a18335k2451m3569j24737I9211J68360c6817a7438B07162J05240c6301l62504
19083c98805a36090H8052Q510k6548b63178a1702F5453J7804c9412C36897b44819
19071a80633D315L1257a48009m0617l1274h1384A2430J40362a98068F9090R8211
$$ plain form
19152 60281 108694 -115766 -31226 -14131 -113109 -154908 -24982 53695 -362682 4830 -36308
19140 -139820 143958 -70952 -315864 45856 -69942 -13372 49049 58008 -34459 -143026 73289
19128 104235 103419 -366559 111971 -95559 -135363 -91512 130379 -366143 -107479 -127125 -70257
19117 -70257 -9549 72381 7128 -10243 -216181 -70756 -73984 -166031 82493 -171057 105658 133751
19105 133751 -298299 -209791 -1376 -67642 -5346 -161951 103968 72855 13145 -91538 -118335
19094 -118335 -140786 -184355 -309092 99211 267571 -36817 -17438 207162 312402 -36301 -398805
19083 -398805 -136090 88052 96562 70014 -263178 -11702 65453 83257 -39412 336897 -244819
19071 -180633 4315 35572 -148009 -188626 -219900 -81384 12430 152792 -198068 69090 167301
19060A67301b74760i6077J3241G1191c44249g8432m35E32365h7868H677a7012
19048B20461a99973k30623c0318K66G7633J92037i3406L3651A0181a29651C5506
19036I9403k816J15553a99049A08792g7428j5987A88118L3820c9603j04177j14533
19025b58313C04b18169J03675B81530r0577a38348G5883A7247J29106C6611d7436
19013B54628A6210J54285J62517g0208g294n1991E17421G9322f2523C65171f30
19001b62486m3380R3469q7715g5985A25518a66375L2689M6678l3096q8856h569
18989b12185j32448J34743A25492a32715H3269a12287A16081J83330I4819m0495
18979E4324c05846a4701j63965g5601K1779g955k64650h404F1129N1119b34708
$$ plain form
19060 167301 -274760 -96077 -82836 71191 -344249 -78432 -78867 532365 -87868 8677 -17012
19048 220461 -199973 -430596 -30318 -30052 77633 269670 -93406 -59755 10181 -129651 35506
19036 99403 96587 212140 -199049 108792 -77428 -93415 188118 221938 -39603 -143780 -258313
19025 -258313 304 -218169 -114494 281530 190953 -138348 75883 17247 146353 36611 -47436
19013 254628 16210 170495 333012 -70208 -7294 -59285 517421 79322 -62523 365171 -630
19001 -262486 -305866 -212397 -300112 -75985 125518 -166375 -133686 -87008 -120104 -208960 -8569
18989 -212185 -344633 -209890 125492 -132715 83269 -112287 116081 299411 94819 54324
18979 54324 -305846 -14701 -178666 -75601 -53822 -7955 -272605 -8404 61129 112248 -234708
18967B21049i6173k3486b886j82249E2164a24618D6912J32298N6650G114e3166
18955b57246A38307h8727J2624j02695j8297Q9421L5139A38966a79578A85057
18944I410a23971e4963H8490b73427c3659j91350B64334j18156a62459P4396H7469
18932f0701D908i5928j70137A63896q158a14161d8086o8293j6861o0226A10766
18920A10142b21502j26005k1189g3480B41332g0878A79529e8126a6359A5805M8218
18909F4023J86404H5069b3843A5308K15530f0289k48891f10A72282d071l10186
18898c14257E9418e1643A44151a10196r6412B26015a7519j08392j17514a838j8630
18887b0468O415k85634b1739A00957B6140L6705a5370a229r4127A19337A7610
$$ plain form
18967 221049 -96173 -119659 -2886 -185135 52164 -124618 46912 179210 235860 7114 -53166
18955 -257246 138307 -88727 -76103 -178798 -197095 -107674 -72535 138966 -179578 185057
18944 9410 -123971 -54963 88490 -273427 -33659 -225009 264334 146178 -162459 -88063 87469
18932 -60701 4908 -95928 -266065 163896 155738 -114161 -48086 -116379 -133240 -193466 110766
18920 110142 -221502 -347507 -368696 -73480 241332 -70878 179529 -58126 -16359 15805 64023
18909 64023 250427 85069 -23843 15308 230838 -60289 -309180 -610 172282 -4071 -314257
18898 -314257 59418 -51643 144151 -110196 -206608 226015 -17519 -125911 -243425 -1838 -20468
18887 -20468 -14053 -299687 -21739 100957 26140 62845 -15370 -1229 -95356 119337 17610
18875c01138l8194a37362j25143M6225f9410L2058E0983i6253k39624A69519q0558
18864H8961a76925c5908C18279B3669a73876A12998k1449b03936b4426f892l00192
18853c07084A85881c6335o592r9422E8823K28456b0720j01729A55248a63518m26461
18842e89979A2320b42968K2338A01298n190a05955B56844G8989a40636O1099j14370
18831a93907h2201J6592q3756c1526A90984e4853n1659K6643c6619k56805e9514
18819c14374K3610I5552C667a14506A29213Q5590J05922A59507a75102A25007
18808a2762I3350P3585i5811B72653l0313a00987d2786A0709a4529j74045A00947
18796E311a81405A62269J2647q1450F80a39625A92954N2415b68016N7199f9022
$$ plain form
18875 -301138 -339332 -137362 -262505 -216280 -69410 -37352 50983 -96253 -335877 169519 88961
18864 88961 -176925 -35908 318279 23669 -173876 112998 91549 -203936 -24426 -6892 -307084
18853 -307084 185881 -36335 -42927 -142349 58823 287279 -20720 -122449 155248 -163518 -589979
18842 -589979 12320 -242968 -220630 101298 96108 -105955 256844 78989 -140636 -79537 -193907
18831 -193907 -82201 -65609 -149365 -31526 190984 -54853 -106512 -79869 -36619 -293424 -59514
18819 -314374 -290764 95552 3667 -114506 129213 214803 320725 159507 -175102 125007
18808 -12762 93350 166935 -95811 272653 242340 -100987 -42786 10709 -14529 -188574 100947
18796 5311 -181405 162269 174916 93466 680 -139625 192954 245369 -268016 -210817 -69022
18784G300b7733j59002r5093k6454J34152C5485b2456n7156b9632o8304C0983
18772a70087L7517A48403o1803J13519b79289B4682b50953F1983f4515C5679O4982
18761A00661c07480N0302a7486j75430n1399g5983k86978C3885i909D0357j1583
18750B8774J60027E4232M3153c17143j48607i7639m0902j01992F9748c06532F819
18738i5845J8600r9983d1828j42150a9241l99715a84522i1954k51640J57666d5786
18726a92496j9022B5193g5302A67817b58111R6655A14526i3071K0184b0141A09029
18714b03535d9764A7325N4302a46661m9073F0897d24740a99061A64918a22756
18703A1122a3629k28860R8039k3753j04093A65723q1428a26434A43940e490A21153
$$ plain form
18784 7300 -27733 -186735 -281828 -308282 -174130 35485 -22456 -79612 -29632 -97936 30983
18772 -170087 -132570 148403 86600 200119 -279289 24682 -250953 61983 -64515 35679 100661
18761 100661 -307480 -257178 -17486 -192916 -244315 -75983 -362961 33885 -9909 40357 28774
18750 28774 188801 54232 97385 -317143 -465750 -97639 -138541 -240533 69748 -306532 6819
18738 -95845 -77245 -177228 -41828 -183978 -19241 -418956 -184522 -91954 -343594 -185928 -45786
18726 -192496 -211518 25193 -75302 167817 -258111 -161456 114526 -93071 -72887 -20141 109029
18714 -203535 -49764 17325 71627 -146661 -195734 60897 -424740 -199061 164918 -122756
18703 11122 -13629 -242489 -144450 -168203 -272296 165723 84295 -126434 143940 -5490 121153
18691G6646a59828n0430G0402b03946P4691b3733k1226j70680i5733k33073k5382
18680c54188A3261N4234a4190j41168e5036j40070P5979N0201j88511f5693F6606
18668a32137A23283A6447i0008j03464j40652Q9782D0296L9858B8934g3761j49755
18657b23516A0123c3167D5221f8036K6010R174h571j33026c7045j3216B28650
18645a13779B31424r3178k2351d65843A28646i9500C42779F0172b18176G4557
18634g2319d182k46957B9782L22274D4243h3186r6929P9469d0952G4923L83949
18623D58872i3951m5662k48594a44838j00059i0049r0980r5164F2012b44510a9989
18611a14238o6156I7184J81809A0320R3350b70091D7768o129c28792A18848a77317
$$ plain form
18691 76646 -159828 -210258 70402 -203946 -129255 -23733 -44959 -215639 -95733 -328806 -354188
18680 -354188 13261 67495 -14190 -155358 -55036 -195106 -119127 -68926 -257437 -65693 66606
18668 -132137 123283 16447 -90008 -193472 -334124 -244342 40296 80154 28934 -73761 -223516
18657 -223516 10123 -33167 45221 -68036 -42026 -32852 -8571 -141597 -37045 -50261 228650
18645 -113779 231424 138246 115895 -465843 128646 -99500 342779 60172 -218176 74557
18634 -72319 -4182 -251139 29782 352056 44243 -83186 -180115 -100646 -40952 74923 458872
18623 458872 -93951 -139613 -388207 -144838 -244897 -90049 -181029 -276193 62012 -244510 -19989
18611 -114238 -180394 97184 278993 10320 103670 -270091 47768 41639 -328792 118848 -177317
18599a93369k0946A15865b44035B0514a71206A01451a87406O2039N8390J1543
18589e5434C4741A1694a46817j72484P0678A64803j3708a28600o6020D8409a96837
18577b4383A29816N1500A8940a21676j2303K8584m6915k5007c2395B7728J28202
18566A55930a51723f3101A14311b21005A87390a05742L7834j9648j26927C35858
18555a35327A00411J43002a00653J5799j45775d0932n237n7942C74217d6625H4334
18543D4233J79177C3381j0022J37107b1308l4348j61815A06350A3714J01199K8358
18532A43271a29761B1735f4214C5804b35562B506a38131G0501b29035O8175q0595
18521b41455A7694a6877p6173p4273o1966h699r1131j53280n9035B96665E0248
$$ plain form
18599 -193369 -214315 115865 -244035 20514 -171206 101451 -187406 -125367 -66977 -55434
18589 -55434 34741 11694 -146817 -319301 -248623 164803 151095 -128600 -194620 48409 -196837
18577 -24383 129816 181316 18940 -121676 -133979 -105395 -152310 -177317 -32395 27728 155930
18566 155930 -151723 -63101 114311 -221005 187390 -105742 -67908 -87556 -214483 335858
18555 -135327 100411 243413 -100653 -84854 -230629 -40932 -46169 -104111 374217 -46625 84334
18543 44233 223410 33381 23359 160466 -21308 -55656 -217471 106350 13714 114913 143271
18532 143271 -129761 21735 -64214 35804 -235562 2506 -138131 70501 -229035 -160860 -241455
18521 -241455 17694 -16877 -93050 -167323 -229289 -8699 -99830 -253110 -312145 296665 50248
18509h7201I2096a86966j25039a7728A11152E476a36978N2311k14704C87599a12293
18497a5109j5595k40470A10219b33026B59767A346a89680B14620a36856B10925
18486c3014E4999a49185F9068c4346B9035g5508G0503b52116C16401h9689A63396
18474E6788K7343b07710A09580b36998N1703n950A52826i986A69128i0264k3789
18463a14053A15834d7045j24332a0908l3410l0222c4192B6470a72996n5894d9574
18451b16569M8837k2654A42894m8050j6735a67141A32023K3014a75995j63648
18441c39643R0797A0314d22590A67461a30177G5493i4124n5532L9620B4346L2567
18430E6913J31214C9957i2937G8634a3o4450j0698A4908g1451A51903k4675c45245
$$ plain form
18509 -87201 92096 -186966 -312005 -17728 111152 5476 -136978 -84667 -299371 387599 -112293
18497 -15109 -30704 -271174 110219 -233026 259767 1346 -189680 214620 -136856 210925
18486 -33014 54999 -149185 69068 -34346 29035 -75508 70503 -252116 316401 -89689 163396
18474 56788 84131 -207710 109580 -236998 -185295 -191245 152826 -9986 169128 -90264 -114053
18463 -114053 115834 -47045 -171377 -10908 -44318 -74540 -34192 26470 -172996 -228890 -49574
18451 -216569 -167732 -190386 142894 94844 78109 -167141 132023 155037 -175995 -339643
18441 -339643 -248846 10314 -422590 167461 -130177 75493 -94124 -149656 -110036 24346 56913
18430 56913 188127 39957 -92937 78634 -13 -64463 -75161 14908 -71451 151903 127228 -345245
18417a12143B80628a08755c4772C65161j27862E349M4165j6013h3308j81550B93951
18405a39985A96448F0365c5926B03729d6295I3934N5707G1832a22067R099M5409
18394f7559j68427C4509L0252b93747f9719j3524j31811h2332j42375f6398D02454
18382d1728B63066a10889f096A22449a50388A06557D1753a81558M1572A31764
18371A48393Q0071b3269m22715K18559A85668C3464d9054e454C73671g6236A50615
18359a77135F0205e0105G3503R626e51859g529B61395b95377A2087N1575P6804
18348A40466F8793a78876K1234A32339n7165a91894i2261o5463b0369A93310g5260
18336A49572a8194m4688I2507R9030a9055A18650a15372F8899J97109j6218a7384
$$ plain form
18417 -112143 280628 -108755 -34772 365161 237299 5349 49514 33501 -83308 -264858 293951
18405 -139985 196448 60365 -35926 203729 -46295 93934 149641 71832 -122067 -112968 -67559
18394 -67559 -235986 34509 64761 -293747 -69719 -83243 -215054 -82332 -224707 -66398 402454
18382 -41728 263066 -110889 -6096 122449 -150388 106557 41753 -181558 -139986 131764
18371 148393 228464 -23269 -445984 -227425 185668 33464 -49054 -5454 373671 -76236 150615
18359 -177135 60205 -50105 73503 83129 -551859 -7529 261395 -295377 12087 63662 140466
18348 140466 68793 -178876 -157642 132339 75174 -191894 -92261 -157724 -20369 193310 -75260
18336 149572 -18194 -62882 92507 191537 -19055 118650 -115372 68899 266008 249790 -17384
18324G7669k3134b20443B1984g4152k70302h8003A9045b83773M253a377l13894
18313c15271C8561d8225l05096Q0285B26373B1560K6317a69206d0296C35088H6083
18301D14167E7823a12172G4755b73154f0673B31355h7297A26592C3379d41283
18290a32909H4541a50767A55256P2213j1757c1105k67866E8337J4818a99909c5428
18278I1803a74672C4118K71970I5406f8409A8677O4129a01906A36941b48671a04196
18266D4418h6275A52634h9476B1048b23774i7473l2144q9102F4678h484k14872
18255b23356N4878A66405a84049A72924C0178i6246L536H0685c6379l4587k08019
18244b78985A04193J0082c10697a54283B98037j45998a32889b0867D8436e2194
$$ plain form
18324 77669 54535 -220443 21984 -74152 -344454 -88003 19045 -283773 -279520 -1377 -315271
18313 -315271 38561 -48225 -353321 -273036 226373 21560 47877 -169206 -40296 335088 86083
18301 414167 57823 -112172 74755 -273154 -60673 231355 -87297 126592 33379 -441283
18290 -132909 84541 -150767 155256 227469 215712 -31105 -298971 58337 73155 -199909 -35428
18278 91803 -174672 34118 306088 95406 -68409 18677 82806 -101906 136941 -248671 -104196
18266 44418 -86275 152634 -89476 21048 -223774 -97473 -129617 -218719 64678 -8484 -223356
18255 -223356 -168478 166405 -184049 172924 30178 -96246 -92710 80685 -36379 -70966 -278985
18244 -278985 104193 114275 -310697 -154283 298037 152039 -132889 -20867 48436 -52194
18233d3091j17377j90062J58571A08321a81994C20467b62279E7954a47372A15209
18222H0154b00972j3777f6375D21698A11131K6062J25221F9689c536k64333A26398
18210a20489i954I1772e358m7397j19874Q0172A82789D1618R5364l6983c64076
18198b88774D2741O1896a3385k21103A79036b6248p5452A33618J10825a14412
18187d920G7857c76858c196m8384r9291f3585A25163b1304j09840H8481A987a72590
18174c3925R659B68430n7621J69862a26696K9834j67542q2412L4349j3617G9772
18162a5542I330b50872j18203J46495I4456m6137a46938G8088g7278J0649j01872
18151a68501A93653m8654a35231o1527F2295J11080j9498K37342a01673C5295
$$ plain form
18233 -43091 -160468 -350530 -191959 108321 -181994 320467 -262279 57954 -147372 115209
18222 80154 -200972 -214749 -66375 421698 111131 137193 262414 69689 -3536 -267869 126398
18210 -120489 -9954 91772 -5358 -52755 -172629 -92457 182789 41618 136982 99999 -364076
18198 -288774 42741 104637 -13385 -234488 179036 -26248 -101700 133618 244443 -114412
18187 -4920 77857 -376858 -3196 -51580 -150871 -63585 125163 -21304 -131144 88481 1987 -172590
18174 -33925 -24266 268430 210809 380671 -126696 -96862 -264404 -346816 -312467 -326084 79772
18162 -15542 9330 -250872 -369075 -222580 94456 48319 -146938 78088 -77278 -66629 -168501
18151 -168501 193653 144999 -135231 -196758 62295 173375 153877 391219 -101673 35295
18140a52868L5987e1863A07804a49680B01713b00449H5657a18747a9388b416B86369
18128b45005h2534l4498A87870a69090h2603n3674H0485C7758d2687C5029c0867
18116a92351b7531p3895N997k300A4236R1136b23165p8684f679k08814O6528A31014
18103E0627a42085l1544c6223C16081j48597B9491J61347d6022k36569a29112
18092f4748k70519a02116n746M8587j95608B1215g9684l50979J10768D5688B1141
18080b0838A6298d3246l9051L6860B1335K4174j2730b55442O6981b5536A970b10403
18067A18134f702j30862O7258H6293J27J22620b99162A36233L3844F9467a46199
18055a85353a2553m55705a97069h5755d0249k45063e1149m572j85749N0755F535
$$ plain form
18140 -152868 -116881 -51863 107804 -149680 201713 -200449 85657 -118747 -19388 -2416 286369
18128 -245005 -82534 -117032 187870 -169090 -82603 -136277 80485 37758 -42687 35029 -30867
18116 -192351 -27531 -101426 -95429 -97729 14236 105372 -223165 -301849 -6679 -215493 -148965 131014
18103 50627 -142085 -173629 -36223 316081 167484 29491 190838 -46022 -282591 -129112
18092 -64748 -335267 -102116 -107862 -59275 -254883 21215 -79684 -430663 -319895 45688 21141
18080 -20838 16298 -43246 -82297 -45437 21335 45509 32779 -255442 -188461 -25536 1970 -210403
18067 118134 -6702 -137564 -70306 86293 86420 209040 -299162 136233 170077 69467 -146199
18055 -185353 -12553 -468258 -197069 -85755 -40249 -285312 -51149 -55721 -241470 -190715 6535
18043a12729A5937K73413J9569F3385d13370B67893H2523a59299m5957o0927l2558
18032b98741a38586c2130H7606N7507N3697k5700D1918g6110F9897K34492b77315
18020D2425a43612j10939M1794J05114G6974a44017A41979a25615a0269k90977
18010c01246I5883a61324e7245C15044P1074F5512e1106A99987G3247a75074B91259
17998B09389f6762A76783a21227A3140J0050a93933Q32k7973R2887A08359C6583
17986A78348d1587D1526g9095A0988a53400l8351C00309b9088k29736P7171K5850
17975a55803F0281k9534L62272a53106o0868C9368b20081B22356l1996b64246
17964B4575K3260b9434P098o7116q6491A49952n3539J1025R6748m2898M7243a53453
$$ plain form
18043 -112729 15937 289350 308919 63385 -413370 267893 82523 -159299 -205256 -266183 -298741
18032 -298741 -138586 -32130 87606 145113 198810 173110 41918 -76110 69897 304389 -277315
18020 42425 -143612 -254551 -212757 -107643 76974 -144017 141979 -125615 -10269 -301246
18010 -301246 95883 -161324 -57245 315044 386118 65512 -51106 199987 73247 -175074 291259
17998 209389 -66762 176783 -121227 13140 23190 -193933 -193101 -221074 -128187 108359 36583
17986 178348 -41587 41526 -79095 10988 -153400 -191751 300309 -29088 -258824 -181653 -155803
17975 -155803 60281 30747 393019 -153106 -213974 39368 -220081 222356 190360 -264246
17964 24575 47835 -29434 -22336 -89452 -175943 149952 96413 107438 204186 161288 208531 -153453
17951A78335c51567J54300H0984J54533r764O2324E100a33648B53905h381j09520
17940a17901H194a00426D5202J0385L5897K38130F573J63539p5521b06870e5295
17928D1025p275b28362H8246b90604A74359B657M9443A1858h4845L0758B2435
17916h7990l1235A91247f4563o415A27474A4367J21288b14574A12569e0663J1773
17905c8890A528Q4577J93489h1850A94585b92560d9115B36520a47762A4420i7991
17893A03211a10945j15584n8327G4110a72682e5728A32151P6893c23487A65933
17882i2582j84181B06522M7077A4056a38498n2765G349K2169O4575f8252j60020
17871b28272B6175R3281h779l4287B20780g1685A06482c6032C0209K4794f0966
$$ plain form
17951 178335 -351567 -197267 80984 235517 225753 288077 5100 -133648 253905 -8381 -117901
17940 -117901 8194 -100426 45202 55587 91484 329614 6573 170112 94591 -206870 -55295
17928 41025 33750 -228362 88246 -290604 174359 2657 52100 11858 -84845 -54087 22435
17916 -87990 -119225 191247 -64563 -70978 127474 14367 135655 -214574 112569 -50663 -38890
17905 -38890 1528 86105 279594 -81850 194585 -292560 -49115 236520 -147762 14420 -97991
17893 103211 -110945 -226529 -284856 74110 -172682 -55728 132151 209044 -323487 165933
17882 -92582 -276763 206522 253599 14056 -138498 -191263 7349 29518 94093 -68252 -228272
17871 -228272 26175 119456 -8779 -43066 220780 -71685 106482 -36032 30209 55003 -60966
17859C3986f2169n7005B79336E2309J06348l9555J81804q7721F9753b825C20273
17847e6803Q178G3371a28014F4475i0802A55502f2646k01655H5383J51304a26275
17835H2706c79634i6986J3981C14800c76163a05047j21046B67156a71059P3809
17825i7250n114A64562I973A850R930a21865d6178A59444i9107K8054A90032D022
17812G1318g8325K4921k2820A45460a93404R0251K0159M0418j0424C41805i5372
17800A50883b00384A52733R5542q1204G580O8882i9730d1392k20275H4175n165
17789G9010K3447C1428Q0740e247o9441j10568B89000n9435K6584j24236a74365
17777A02100f1163B26603G0858b33775R8383A65297i4497j99177f4669j22554
$$ plain form
17859 33986 -62169 -119174 279336 52309 158657 119102 300906 213185 69753 -2825 320273
17847 -56803 -48625 73371 -128014 64475 -90802 155502 -62646 -264301 85383 236687 -126275
17835 82706 -379634 -96986 -83005 314800 -376163 -105047 -226093 267156 -171059 -97250
17825 -97250 -102364 164562 9973 1850 11780 -121865 -46178 159444 -99107 -71053 190032 4022
17812 71318 -78325 -53404 -76224 145460 -193404 -103153 -82994 -42576 -53000 341805 -95372
17800 150883 -200384 152733 248275 167071 7580 76462 -99730 -41392 -261667 84175 79010
17789 79010 102457 31428 112168 -5247 -74688 -185256 289000 229565 256149 131913 -174365
17777 102100 -61163 226603 70858 -233775 -135392 165297 -94497 -293674 -64669 -187223
17767a87223H6594K07363E3916O3168a84315D04205A7696a62050O0812G3272R2135
17756A65407c8330j75168D1200a57161A78094O5273E8924j9715J34126b5845B0652
17744C40191q3162c83706A95L4393d8098E55624B1443c6903k69897a4805C19156
17732A58923G4013P5836J44433i1381A82644F2082J16855a8803j21632J9680B21672
17720B796a59702A75664m4022R2690K8538N0937A29069a42679A03893e284H60
17708A23719K5545B6736L6298k376M32491B9490K50765A12828J21341c17650B30453
17696b5157H4786O3878d7704A57264b4533B74881n953a82599G9545c8100a1828
17684A58464b6435B29823a53056H3387e5255j32806E98194B44844K09474a76997
$$ plain form
17767 -187223 86594 293957 53916 117084 -184315 404205 17696 -162050 -101238 73272 165407
17756 165407 -38330 -213498 41200 -157161 178094 243367 58924 39209 173335 -25845 20652
17744 340191 257029 -383706 195 34588 -48098 555624 21443 -36903 -306800 -14805 319156
17732 158923 74013 149849 294282 -91381 182644 62082 178937 -18803 -140435 -120755 221672
17720 2796 -159702 175664 131642 224332 252870 303807 129069 -142679 103893 -5284 860
17708 123719 149264 26736 63034 60658 493149 29490 280255 112828 234169 -317650 230453
17696 -25157 84786 148664 -47704 157264 -24533 274881 268928 -182599 79545 -38100 -11828
17684 158464 -26435 229823 -153056 83387 -55255 -188061 598194 244844 454318 -176997
17673B00146q5299N8182A6822J80313j965a52685C43371k2459H8038b01139h3839
17661A47155a28523B04746e15899c010B72849B6773a22402A02791J06378B0675
17650f9022H2655b96344i1201C46911a76787F3456a19323A05194K59268c0255
17639B59913F2175K61275j20522r2200f2136a4290A23606E9883a04656B9420D40
17627C07115r9466H7723L70068d0924D5115g3437A87048K21112j56274N0087J95587
17616D97560f2676E879c40007A02601A117a58812A06570J91778b21868A7114n198
17605A1916J16250N8697B76Q1465K24977D5320O0601a6213A56683k7161a48268
17593H6573J90051q7597j1982k1485a14774A75605a33286n8067i0875H8817M6192
$$ plain form
17673 200146 114847 173029 16822 197135 195170 -152685 343371 320912 88038 -201139 -83839
17661 147155 -128523 204746 -515899 -3010 272849 26773 -122402 102791 209169 20675
17650 -69022 82655 -296344 -91201 346911 -176787 63456 -119323 105194 364462 -30255
17639 259913 62175 323450 202928 110728 -62136 -14290 123606 59883 -104656 29420 440
17627 307115 207649 87723 457791 -40924 45115 -73437 187048 408160 251886 301973 497560
17616 497560 -62676 5879 -340007 102601 1117 -158812 106570 298348 -221868 17114 11916
17605 11916 128166 186863 276 81741 306718 45320 105921 -16213 156683 129522 -148268
17593 86573 276624 189027 177045 155560 -114774 175605 -133286 -191353 -90875 88817 135009
17582A35009A8257N8239a32742A42491P2659q7171a0691F0422A271K66931g1249
17570B46033c3678C8066b86534C2931O9283R5793j1825K11769e9113A24892a31204
17558A52674P9396B7122N72295k86609a16780H8071K12455G2688N4322J73635
17548C00645q9735K0710C9616a32249B17530L9770e6404A30825Q7094J72687g8654
17536A139a75566L7797E17243g1107j17477A49751P53f5142E6507M47858k13905
17525B90460P1811a25817B71179E7871O13354G4066J29859k142K39592r9649j56845
17514A84881J00205b0333C81218F5005A7282J71888K20653j99623M2628L0902
17504B83730A10689m0909L70649j90039F139K53883I8822J59652p7281B7327b37530
$$ plain form
17582 135009 18257 76496 -132742 142491 215150 127979 -10691 60422 1271 268202 -71249
17570 246033 -33678 38066 -286534 32931 102214 198007 186182 397951 -59113 124892 -131204
17558 152674 232070 27122 599417 312808 -116780 88071 300526 72688 127010 300645
17548 300645 210910 231620 39616 -132249 217530 257300 -56404 130825 217919 390606 -78654
17536 1139 -175566 -137769 517243 -71107 -188584 149751 150504 -65142 56507 504365 290460
17525 290460 362271 -125817 271179 57871 671225 74066 203925 201783 441375 341726 184881
17514 184881 285086 -20333 381218 65005 17282 189170 409823 210200 252828 283730
17504 283730 110689 69780 440429 250390 6139 260022 98822 258474 181193 27327 -237530
17492C11566j03711q9445J08907J23881F9463J90808G9420J56937A6499o220J03736
17481A14015B5571P5971K50953D8529J79806n8430B6847P7529a58586C63509j61810
17470B01699I3611J86845b05451B31425J00710j29177F3447p541b03457A40988
17459A6778a71918A03673O9950D0065K90422f567H6246N3069O9190J22509o8014
17448B63000K1068q3578A1811J12051J20645n9749d6785A70727G1983j5982K5032
17437H1033J72065O8478n5850C1307J39284g5740E472M22796B11608K4090b1377
17425C10775K7218n0248A40430N4176q3772r338K23363p3557j3815I8505J00553
17414A99058K01983j34617k6683k3066K01876j86405K9276N0475J80768k10695
$$ plain form
17492 311566 207855 118410 227317 351198 69463 260271 79420 236357 16499 10279 114015
17481 114015 25571 101542 352495 48529 228335 169905 26847 104376 -158586 363509 201699
17470 201699 93611 280456 -205451 231425 332135 202958 63447 55906 -203457 140988
17459 16778 -171918 103673 173623 40065 330487 -6567 86246 139315 208505 331014 263000
17448 263000 284068 200490 11811 123862 244507 184758 -46785 170727 71983 56001 81033
17437 81033 253098 321576 265726 31307 170591 -75740 5472 428268 211608 235698 -21377
17425 310775 337993 287745 140430 194606 110834 101496 324859 251302 237487 98505 199058
17414 199058 401041 266424 239741 216675 418551 232146 261422 311897 492665 281970
17404B81970C5782a28035C07104A21233K05977a651C09274A41544b136B2018e4990
17392A98937f5237A00257O0074K495J09993J71226A76905a80313A59360J21171
17382B80531O759A34040N6565j5331J90495A49570P0190N3617A04975J40984j22690
17371A23269E6250J20738J78012G8856j0105P7754C8723R0860B0802a23083a2074
17359A05683h6284I9380m8899J27645J498K0971i2367B70776a41928k7960N4787
17348a15101C31262a28514A61853N8183I8556K68660N9869c1388B56676j3874
17338B42802N580K04841A35535K68103E7722L14328B5012K36418A18083J9053
17328A37136m0060K43671l1682l1889G1155J01201A9104f46B77494N1457k3287
$$ plain form
17404 281970 35782 -128035 307104 121233 327210 -1651 309274 141544 -2136 22018 -54990
17392 198937 -65237 100257 160331 162826 272819 444045 176905 -180313 159360 280531
17382 280531 287290 134040 190605 175274 365769 149570 219760 273377 104975 245959 123269
17371 123269 56250 176988 355000 78856 68751 146505 38723 129583 20802 -123083 -12074
17359 105683 -86284 99380 50481 178126 179624 200595 -92367 270776 -141928 -169888 -115101
17348 -115101 331262 -128514 161853 220036 98556 367216 427085 -31388 256676 242802
17338 242802 248382 453223 135535 403638 57722 372050 25012 261430 118083 137136
17328 137136 97076 340747 309065 277176 71155 172356 19104 -646 277494 328951 305664
17317C05664b19276h7119B43989p5190F3403d0586C30987A63920b48204E614J25468
17306A31082K437c6840A1909L04667o442A43912A5534K85571j34563J88064j7393
17295C37213i617B46943H1666J55612M1201J14602m2076J86860F9211M6320R1725
17284B07256D4039J67843C3754g2868A48273Q6647L21187B34775O2975o8996O7424
17273B96178Q6853A48730J92862A65414J84191m765j56231L34352D577L17996
17263C22573C4317P6101c4193A03934h6836B96190o0244A1740J67924K2993M9473
17252B52130H8287Q3418J51984j56280J41117A52447L21989A67527J75K63521
17242D31223j26863A07855N08734k47966j7574j13489E4029M20567K8939h4709
$$ plain form
17317 305664 -219276 -87119 243989 168799 63403 -40586 330987 163920 -248204 5614 131082
17306 131082 133519 -36840 11909 316576 310134 143912 15534 301105 166542 354606 337213
17295 337213 -9617 246943 81666 237278 278479 393081 351005 537865 69211 115531 207256
17284 207256 44039 211882 33754 -72868 148273 234920 556107 234775 297750 228754 296178
17273 296178 383031 148730 341592 165414 349605 344840 188609 522961 4577 322573
17263 322573 34317 110418 -34193 103934 -86836 296190 235946 11740 179664 202657 252130
17252 252130 88287 171705 323689 167409 308526 152447 474436 167527 167702 431223
17242 431223 304360 107855 616589 368623 351049 237560 54029 474596 503535 -84709
17231B78411K0646L6136j29391J32252n0422P8110o1904a948A65088J72575j04441
17220B33222J11479r9487g4018B94880J49583k20063L6405A14248a1206B44632
17209A24620N60135A71622J25774D4299L56710j62366J17386E6096L13614H4086
17198I9014A218R0899N34289j36286r5849j35827a4039A89112R102H8120J38224
17187B26344K24127A95804j4132J82145j78322L20503j63565A14294M65366B48062
17176D17274o1917k5234j56732J53257n6960M4016G6821P8526L12355A32302K35637
17165C67939P4849A61727O1324L30937B44084R5035J09709m5366J03090p8952
17155D27600N5887J39629A29481Q9551H9359R2050J21397N6237A13566K96450
$$ plain form
17231 278411 299057 335193 205802 338054 287632 365742 303838 -1948 165088 337663 233222
17220 233222 344701 245214 -74018 294880 444463 224400 260805 114248 -11206 244632
17209 124620 684755 171622 297396 44299 401009 238643 356029 56096 369710 84086
17198 99014 1218 92117 626406 490120 394271 258444 -14039 189112 198214 88120 226344
17187 226344 450471 195804 181672 363817 185495 505998 342433 114294 579660 248062
17176 417274 355357 330123 173391 326648 269688 313704 76821 155347 467702 132302 367939
17165 367939 442788 161727 223051 553988 244084 339119 448828 403462 506552 427600
17155 427600 483487 623116 129481 219032 89359 181409 302806 359043 113566 410016
17145D10016J32060k66948K19081B39934K61137j36848q3687J9885m0059o5767
17135A94595K28502j65911J14697L1108j91245M20386O2563A90909L62318k65415
17125B87812j39683L49329k15289J57116J17342k33557J773j08807O1136j26313
17115A50859L97108J22595C29822K40247n4489B16697K88959j84744J95772j70938
17105C45746m0843j0706J6001K93535j06427Q0616B82181L76140Q0219l06375
17095D32165M2431j59260L30275J50012B15177K00423J71767J20991n6857k42630
17085D08871o2107M00868j59830P9696C04214K90861J63643A98034P2495L26152
17075E96681J8321l7753J47520j92119j38599J40212j42129Q0346J31646N7155
$$ plain form
17145 410016 542076 275128 494209 239934 501071 364223 280536 300421 260362 194595
17135 194595 423097 257186 371883 402991 211746 632132 694695 190909 553227 287812
17125 287812 148129 497458 282169 439285 556627 323070 324843 216036 277172 150859
17115 150859 547967 670562 329822 570069 515580 216697 505656 320912 516684 345746
17105 345746 304903 294197 310198 603733 497306 577922 282181 658321 738540 432165
17095 432165 474596 315336 645611 795623 215177 415600 587367 708358 651501 408871
17085 408871 346764 747632 587802 667498 304214 595075 758718 198034 270529 596681
17075 596681 615002 577249 724769 532650 394051 534263 392134 472480 604126 661281
17065F61281k48231J66065J82519O5018r8721m9856k5215m8730m5876J31639J17968
17054H07861k27053j52183R2024q708J26083k0158J21282j68213k65586M15591
17044G20940j05580q93j23218M38682j43901p9706J12248k60488M34852l76661
17034F16275q411p9996J75879p3398k03936M32390j33693N3170J5138m7068l7582
17023G08768p6568K57059m1179P1539l55190M06414j06797P2140j78271J31492
17013H89407k03986J28418K10441L6397l62226L19109j31185Q5668Q4428E14220
17002H72416N8293J60586R2634m25962M08955N9073n48261L4862J78864O6940
16992I58400N8868L0992k35503l4653O0583J67445k744M3320k12333J76071l3235
$$ plain form
17065 661281 413050 579115 761634 826652 727931 678075 652860 604130 558254 689893 807861
17054 807861 580808 428625 520649 511941 638024 617866 739148 570935 305349 720940
17044 720940 615360 614467 491249 929931 786030 706324 818572 558084 992936 616275
17034 616275 607864 527868 703747 630349 426413 858803 725110 778280 793418 746350 708768
17023 708768 632200 889259 848080 919619 564429 970843 864046 936186 757915 889407
17013 889407 685421 813839 1024280 1060677 698451 1017560 886375 972043 1056471 514220
17002 872416 930709 1091295 1183929 757967 1166922 1225995 677734 712596 891460 958400
16992 958400 1017268 1048260 812757 778104 838687 1006132 1003388 1046708 834375 1010446 977211
16981I77211n686l2502J98387j04105J55010L1275Q5576n05096K67319K08477
16971A275866k41701K33352J90232k56605K511J28100k41578Q1127l957m3803
16961A123544J68572j1311j75970M57064o0004r3776Q3215p3445J20246j68491
16951A369644J96268Q7786r7010k79827J80138K9016n3557j38304R3658o7982
16941A319830L27586k66862M7483K51252J85259l0818k02831m5640L62836l47982
16931A600113k2519K26994k43515L95776k21316N2295m0274M04671k49806j83345
16921A719074K06104j61526K45887k10597L69455J63759l5903l17401K86733m91123
16911A774462K57637J87217K7871N4821j71304L14016o4368j87973M30646k174
$$ plain form
16981 977211 971525 939023 1137410 1033305 1188315 1219590 1305166 800070 1067389 1275866
16971 1275866 1034165 1267517 1457749 1201144 1203655 1331755 1090177 1171304 1167347 1123544
16961 1123544 1292116 1280805 1104835 1561899 1501895 1408119 1491334 1417889 1538135 1369644
16951 1369644 1565912 1653698 1556688 1276861 1456999 1486015 1432458 1294154 1387812 1319830
16941 1319830 1647416 1380554 1428037 1679289 1864548 1833730 1630899 1585259 1948095 1600113
16931 1600113 1577594 1804588 1561073 1956849 1735533 1787828 1747554 2152225 1902419 1719074
16921 1719074 1925178 1763652 2009539 1798942 2168397 2332156 2296253 1978852 2265585 1774462
16911 1774462 2032099 2219316 2247187 2302008 2130704 2444720 2380352 2192379 2623025 2620851
16901B620851m0227k62267K44339j60484J87340J50325j98419m175M18866k64804
16891B691345M38262l70208k09509N27508O7720j80649M7456k467Q4319K8266
16881C122043J38325j67905J71171K57281k15214l35972N44597N1776k69442K91467
16871C588127J3802J0659M96645o22960J55257L84851P9424J38855j33771J55440
16861D266329j45429J20244L12575J79119j35078k81316M82981J7623L91059k81583
16851D926524l1685Q5817M32314J34054j45123K4728J52390K05364j19218K73013
16841E938178q2510L9244L70887P960J27914j863J40159J66391n7402K32449M03101
16830G284508L86172J55443L8996J8923N14862k18402L40028n3000M95315j04921
$$ plain form
16901 2620851 2580624 2318357 2562696 2402212 2589552 2739877 2541458 2537283 2956149 2691345
16891 2691345 3129607 2759399 2549890 3077398 3145118 2964469 3011925 3009458 3093777 3122043
16881 3122043 3260368 3092463 3263634 3520915 3305701 2969729 3514326 3566102 3296660 3588127
16871 3588127 3601929 3612588 4109233 3486273 3641530 4026381 4105805 4244660 4110889 4266329
16861 4266329 4120900 4241144 4553719 4732838 4597760 4316444 4799425 4817048 5208107 4926524
16851 4926524 4894839 4980656 5412970 5547024 5401901 5426629 5579019 5784383 5665165 5938178
16841 5938178 5855668 5894912 6265799 6273759 6401673 6399810 6539969 6706360 6648958 6881407 7284508
16830 7284508 7670680 7826123 7865119 7884042 8398904 8180502 8520530 8467530 8962845 8857924
16820H857924K54350q7522M20894M75716O9210L02297O522M02582L38542L72345
16810A1412860k95214P49300J95430L81670K41620L24320P3120O47273K06833
16801A3937212L42048K43022M52801N83292J39643N79971N91505K39224P80346
16792A7889064K22243P81324L87494R4301Q30845Q77451P46881P15966P72800
16783B3318369N10753O58689J081651O43656R56485R33475J573587J19316J275222
16774C1071203R55918J014376J134808J402485J010661J494800J376187J508502
16766D0968940J196216J902805J112731J820122J995755J760152J539742K415808
16758E4712271K164561J980117J916785K248201K647467K048983K733378K376665
$$ plain form
16820 8857924 9112274 9024752 9445646 9921362 9990572 10292869 10299391 10701973 11040515 11412860
16810 11412860 11117646 11866946 12062376 12444046 12685666 13009986 13083106 13730379 13937212
16801 13937212 14279260 14522282 14975083 15558375 15698018 16277989 16869494 17108718 17889064
16792 17889064 18111307 18892631 19280125 19374426 20205271 21082722 21829603 22545569 23318369
16783 23318369 23829122 24487811 25569462 26213118 27169603 28103078 29676665 29795981 31071203
16774 31071203 32027121 33041497 34176305 35578790 36589451 38084251 39460438 40968940
16766 40968940 42165156 44067961 45180692 47000814 48996569 50756721 52296463 54712271
16758 54712271 56876832 58856949 60773734 63021935 65669402 67718385 70451763 72828428
16750G2828428K672627K880510K503518K842176K893632K159264L285991K486733
16742I4552879K353814K711721K656293K125115K128650K255043J144872K036101
16734A11964488Q50952J162648Q98626M85854M04957k69458m71387n75968q76052
16725A13574660j071370j477865j746151j932204j888655k333171k095022k689327
16717I8340895k194511k669749k642156k797948k858183k608875k730865k443579
16709G7395029k331949k547293k512641k234761k255295k278371k061515k503729
16701E8669475j469044k425548j845939j971653j302150j586606j784565j463234
16693D4820736j578505j563357j262616j272583j425304r92662j331685j200380
$$ plain form
16750 72828428 75501055 78381565 80885083 83727259 86620891 88780155 92066146 94552879
16742 94552879 96906693 99618414 102274707 104399822 106528472 108783515 109928387 111964488
16734 111964488 112815440 113978088 114876714 115362568 115767525 115498067 115026680 114450712 113574660
16725 113574660 112503290 111025425 109279274 107347070 105458415 103125244 101030222 98340895
16717 98340895 96146384 93476635 90834479 88036531 85178348 82569473 79838608 77395029
16709 77395029 75063080 72515787 70003146 67768385 65513090 63234719 61173204 58669475
16701 58669475 57200431 54774883 52928944 50957291 49655141 48068535 46283970 44820736
16693 44820736 43242231 41678874 40416258 39143675 37718371 36725709 35394024 34193644
16685C4193644o74609j036489j212644p65963r75973j180641o34548n16825j132295
16676B6063657o66974r02431m77969k87729p30906r90646p90471n50955r1692
16667B0573884n60933p07005l43910l89299n86293n66482p41354J5597j7212o27196
16657A6049797p61583r0749m18794j48282p28227j89497n7363k34716j15744n23559
16647A2781283m44859m16455k9777k95523k88745L55887n37851J9691n03000n20181
16637A0120470K87937k49366m7539l74531j22157m31812k66380J97469o54551
16628H459540l3466J49033l21446Q0534l10425o2757l67540j32603J54884m37089
16618G178665j26941Q8548J44716j03031o17672K49766j81576k09957m3049j31139
$$ plain form
16685 34193644 33519035 32482546 31269902 30503939 29527966 28347325 27712777 27195952 26063657
16676 26063657 25396683 24494252 24016283 23728554 22997648 22007002 21216531 20665576 20573884
16667 20573884 20012951 19305946 18962036 18572737 17986444 17419962 16678608 16694205 16676993 16049797
16657 16049797 15288214 15197465 14778671 14630389 13902162 13712665 13655302 13420586 13304842 12781283
16647 12781283 12336424 11919969 11890192 11594669 11305924 11661811 11123960 11143651 10640651 10120470
16637 10120470 10408407 10159041 10111502 9736971 9614814 9183002 8916622 9114091 8459540
16628 8459540 8426074 8575107 8253661 8334195 8023770 7961013 7593473 7460870 7615754 7178665
16618 7178665 7051724 7140272 7284988 7181957 6564285 6814051 6632475 6422518 6379469 6248330
16608F248330L1504j83351j9689L3752J2412l69328o8522Q0469r8562j28852k90465
16597E247698j18685O1497J0593K762m39436L46649j26443j73777J3615R4192
16587D918665m79967L18630k42714j61515J48932k6334j01454m25083L72533o4275
16577D257418n084j61388l30180K57681m10357L43772n04003L86942j75588N9645
16567C718858j61869M20542k05382l50955n9037O1520P7216j18522J95189K9597
16557C607157O4067n00456K09470j8635j68549K00993k67699J00643p1809k7350
16547C127832j28075J92209l42562P5870M1413k57475J56538m20509P0561L66639
16537B882441J58166m83113j2415K02107K7519j88628L08135k42693l5867r0430
$$ plain form
16608 6248330 6279834 6096483 6076794 6110546 6122958 5753630 5685108 5765577 5667015 5538163 5247698
16597 5247698 5129013 5190510 5201103 5203865 4764429 5111078 4984635 4810858 4824473 4918665
16587 4918665 4438698 4757328 4514614 4353099 4502031 4475697 4374243 3949160 4321693 4257418
16577 4257418 4252334 4090946 3760766 4018447 3608090 3951862 3447859 3834801 3659213 3718858
16567 3718858 3556989 3977531 3772149 3421194 3362157 3423677 3500893 3382371 3577560 3607157
16557 3607157 3671224 3170768 3380238 3361603 3193054 3394047 3126348 3226991 3155182 3127832
16547 3127832 2999757 3191966 2849404 2925274 2966687 2709212 2865750 2445241 2515802 2882441
16537 2882441 3040607 2557494 2545079 2747186 2774705 2586077 2894212 2651519 2615652 2525222
16527B525222K01737J14519j79010l46992J01547N4433j68719n6493J91805J84678
16517B622727M3380q9587n41182M67702Q3619j45215l57212M82887m95714P8657
16507B150062M3733M6897J31751k64944M25904m83447m18498P15389j06744N1033
16497B291136k42720j90062J03884p0034J67287l7541j36156L02669N4983k11524
16487B031922r821Q8551m70589L61112L41661n17121J94945R0994p5779p6903
16477A958972j90505J65144l9654j35223M25951k96688k86411M02162L87897n02659
16467A888986l9058j461J29297j53658o8094O1895M526l3803k35378M4686l8271
16456A559667J34698r5670M2503K88098k81672l82984J27869K3967J29834J61182
$$ plain form
16527 2525222 2726959 2841478 2662468 2315476 2417023 2471456 2302737 2246244 2438049 2622727
16517 2622727 2666107 2576520 2035338 2503040 2586659 2441444 2084232 2567119 2071405 2150062
16507 2150062 2193795 2240692 2372443 2107499 2533403 2049956 1631458 2346847 2240103 2291136
16497 2291136 2048416 1858354 1962238 1892204 2059491 2021950 1885794 2188463 2243446 2031922
16487 2031922 2022101 2110652 1640063 2001175 2342836 1825715 2020660 2111654 2035875 1958972
16477 1958972 1768467 1933611 1893957 1758734 2184685 1887997 1601586 2003748 2391645 1888986
16467 1888986 1849928 1848467 1977764 1824106 1756012 1817907 1822433 1788630 1553252 1597938 1559667
16456 1559667 1694365 1598695 1641198 1929296 1647624 1264640 1392509 1416476 1546310 1707492
16446A707492k5082j54503m0375J20691J19126n3801k38192L7643j61951N72389
16436A883437j17391j65209j00651J65438l53827L29055j9358m00478M16475j46364
16426A491127P3662j06205j97673J23328J1366J33757n4921j161J00129n6004
16416A517405J91000m80106J17087J83407m58869K51222p1395N39238n69597N7065
16406A276457K48731l59903J02645J19085k43069L87645k60465M7114J71618L7909
16396A527767j18198l917k29511J79792n9805Q4188J70465n1835j01039j0188
16386A387719J00074j47932J47317k43689J14502j46457L2222P3192N7399m7461
16376A326886p9735K8502l8755l2476K4720J84892l82527P09016o84978M60434
$$ plain form
16446 1707492 1682410 1527907 1487532 1608223 1727349 1673548 1435356 1472999 1311048 1883437
16436 1883437 1766046 1600837 1500186 1665624 1311797 1640852 1621494 1221016 1637491 1491127
16426 1491127 1564789 1458584 1260911 1384239 1395605 1529362 1474441 1473280 1573409 1517405
16416 1517405 1708405 1228299 1345386 1528793 1069924 1321146 1249751 1788989 1219392 1276457
16406 1276457 1525188 1165285 1267930 1387015 1143946 1531591 1271126 1318240 1489858 1527767
16396 1527767 1409569 1405652 1176141 1355933 1296128 1380316 1550781 1498946 1397907 1387719
16386 1387719 1487793 1339861 1487178 1243489 1357991 1211534 1243756 1316948 1374347 1326886
16376 1326886 1247151 1275653 1236898 1204422 1229142 1414034 1031507 1740523 1055545 1515979
16366A515979n19893M98185k89793M8252k36915K98013r8530j74514M15567k82655
16356A173696q9783L71783m1477k86570L19795j43257j07504Q1959k4548O2776
16346A316870J60162j15937n4019m18821L62490K3571k73055K49792l23234k7300
16336I00519L88954k8638j85632N41869l71477P3055o0816K04151m30270K63397
16326A295112j05129J83899j67399r6626j78026L06671m4116L88706m11871K43355
16316A414576j50832k14258J00489r0850j25101J30621K12885o0731R7511r8532
16306A215778l70810N41943j88158n25643L18002K24490P61J32325j60047k73146
16296I15495N1594K77922l47890K56177n5180J20961j33500j47917j30026K97554
$$ plain form
16366 1515979 996086 1494271 1204478 1252730 1015815 1313828 1215298 1040784 1456351 1173696
16356 1173696 1083913 1455696 1414219 1127649 1447444 1304187 1196683 1278642 1254094 1316870
16346 1316870 1477032 1361095 1307076 888255 1250745 1274316 1001261 1251053 927819 900519
16336 900519 1289473 1260835 1075203 1617072 1245595 1318650 1257834 1461985 1031715 1295112
16326 1295112 1189983 1373882 1206483 1109857 931831 1238502 1194386 1583092 1171221 1414576
16316 1414576 1263744 1049486 1149975 1059125 934024 1064645 1277530 1216799 1314310 1215778
16306 1215778 844968 1386911 1198753 673110 991112 1215602 1216363 1348688 1188641 915495
16296 915495 967089 1245011 897121 1153298 1098118 1219079 1085579 937662 807636 1105190
16286A105190k5829j30921k81139L58891J69295k99806K88593j76568j88763L27883
16276A146826l50721M39089O781k84202P3169J15895l97876K33503l87610L91764
16266I86618k72043O47589k77102l35984J66557K28579q1512k43711P4920k04639
16256F89272J75038n4690J01562K10292k70608j88007L87836j29335J02171o6965
16246I56566M2260k18425K7510j92307K12415K92341m65200J83273o8231J94325
16236I64527j03757p8553L19108l19647m9282L8360l6208P302K53563j84442J56324
16225I67295j22409j11780J0010N0079P831j15733K14373j80025K55718k75464
16215F99895l019J79600n4414L28669l74272N5535j91494M3047O5087L3473p9568
$$ plain form
16286 1105190 1079361 948440 667301 1026192 1195487 895681 1184274 1007706 818943 1146826
16276 1146826 796105 1235194 1241975 957773 1030942 1146837 748961 982464 594854 986618
16266 986618 714575 1362164 1085062 749078 915635 1144214 1062702 818991 893911 689272
16256 689272 864310 809620 911182 1121474 850866 662859 1050695 921360 1023531 956566
16246 956566 998826 780401 807911 615604 828019 1120360 655160 838433 770202 964527
16236 964527 860770 782217 1101325 781678 732396 770756 734548 741850 995413 810971 967295
16225 967295 844886 733106 743116 793195 801026 685293 899666 719641 975359 699895
16215 699895 696876 876476 822062 1150731 776459 831994 640500 683547 748634 782107 702539
16204G02539j17872J63701N2975p6018j40702L84191l98348L06740J7753j64856
16194G30103J30752j43647J38418j79503K04230j07621r7863j97273J03834J07822
16184F89252O1643r4776O6316j80910R0219Q3854K37242l10406k20350L87372
16174H09456B68539J72659L06581C61447M25473M6486l38422k366M49172A85949
16163C73848J30638B40582M27907A12335N76945C36312K51793o8293k47103K23837
16153D96546p0040J97877m1616j04204J771l8988J44112J28771L03971m35213
16143E82987j49812m430K7234K0791j17671R1503J11375j14126O4728J94162l43993
16132C62748j21187Q7579K60993k64377K76142j74542K9626A93471L34430k11896
$$ plain form
16204 702539 584667 748368 801343 725325 584623 968814 570466 877206 894959 730103
16194 730103 860855 717208 855626 676123 880353 772732 674869 477596 581430 689252
16184 689252 750895 656119 722435 541525 631744 715598 952840 642434 422084 809456
16174 809456 268539 441198 747779 361447 786920 833406 494984 492618 941790 185949
16163 373848 504486 240582 668489 112335 689280 336312 588105 519812 272709 496546
16153 496546 426506 624383 582767 478563 480334 441346 585458 714229 1018200 582987
16143 582987 433175 428745 455979 476770 359099 450602 561977 447851 512579 706741 362748
16132 362748 241561 329140 590133 325756 601898 427356 456982 193471 527901 316005
16122C16005J69715J1177J2971A34408b1074A33774K07720J28726R044A29206
16111A19935M39732K12262B99885J52538j33569L4140J14189L2173k25509m8446
16101B25401J20405j36180J15129K7995J29379k3890N921A2910K8480L54803j44269
16090B51924L40797A48524K50929j00710J62778A92519K46445p3551A04135J82123
16080B86258R4267j57498L0551H4223L74704A49555n5465N7416Q2318Q0143o0892
16069B53075n6236l8041o4227J27404E0670f002C70669m7196P567j01286M7684
16058B77438K46502G439L71611j85368D2433n911i6996B24151Q3386C0163e3199
16046C743J43349j6102L7476K83779q5027H7008J32820c1493A50005D8293a62126
$$ plain form
16122 316005 485720 496897 509868 134408 -21074 133774 341494 470220 479264 129206
16111 119935 559667 771929 299885 452423 318854 352994 467183 499356 273847 225401
16101 225401 345806 209626 324755 352750 482129 458239 464160 12910 41390 396193 251924
16090 251924 592721 148524 399453 298743 461521 192519 438964 365413 104135 286258
16080 286258 380525 223027 253578 84223 458927 149555 94090 151506 233824 313967 253075
16069 253075 196839 158798 94571 221975 50670 -6002 370669 323473 331040 229754 277438
16058 277438 523940 7439 379050 193682 42433 36522 -96996 224151 307537 30163 -53199
16046 3743 147092 130990 168466 452245 367218 87008 219828 -31493 150005 48293 -162126
16034B44767E0196J40226B6949a92981G2210K49063A4354K04928j06501c2039
16023d1105A18312J86647b593B8691c0413A18162a55310r2257A57041b1992H2902
16011B42061Q2338j53400J59368a00756B87174r9004p4699O579j3558K00228a61816
15999C55735I1421O4440a08919l749G5019j93b09555A50813G858b3182m1598D38235
15986B90038K85502j83390P1952I5107L28328p589p6978H1563B8946J27534R9571
15975B56051b01833L9137H0255k8448L25204b08908A73529b0016D55485k22596
15965B32889A04625h0144n815B14757m2912J69559a21450F5741f2141b7993C11511
15953A47694a12397H2576i9103E2415N3735J94258q6916i991C92802J1281d37483
$$ plain form
16034 244767 50196 190422 26949 -192981 72210 321273 14354 219282 112781 -32039
16023 -41105 118312 304959 -2593 28691 -30413 118162 -155310 -247567 157041 -21992 82902
16011 242061 324399 170999 330367 -100756 287174 188170 113471 120050 106492 306720 -161816
15999 355735 91421 155861 -108919 -112668 75019 74826 -209555 150813 7858 -23182 -64780 438235
15986 290038 575540 392150 464102 95107 423435 415846 338868 81563 28946 156480 256051
15975 256051 -201833 -162696 80255 51807 377011 -208908 173529 -20016 455485 232889
15965 232889 104625 -80144 -85959 214757 171845 341404 -121450 65741 -62141 -27993 311511
15953 147694 -112397 82576 -99103 52415 106150 300408 213492 -9991 392802 404083 -437483
15941C48391A32231b27164J01157o6986o2009f152C74417A73632o3411a06600
15930B69333L219c6558k37933G053J64808J9427k7283A0828b3430F7123J29122
15919A96245A3605O0025C22J18216a58203B96323g1795D2228a63948f0059j9801
15908g9860G6716Q7955J39206A06374g2793D9631L288c4446A38150a93446h4770
15896G5993a18896c8021B16154M38K59044A2674J20484B2601K95527b56988A1491
15884g6933m0036C1770c7556m545j30994c1998A58217J52079b25809f288C5045
15872d1182a1599A18869L14912f7737r9986g7017D4568i2875C65907a261j73663
15861a74924D2834b28687c7201j87661M8907c7157A07159K14380B2595J66407
$$ plain form
15941 348391 132231 -227164 -126007 -192993 -255002 -6152 374417 173632 110221 -106600
15930 269333 272552 -36558 -274491 7053 171861 191288 164005 10828 -23430 67123 196245
15919 196245 13605 73630 322 118538 -158203 296323 -71795 42228 -163948 -60059 -79860
15908 -79860 76716 164671 303877 106374 -72793 49631 52919 -34446 138150 -193446 -84770
15896 75993 -118896 -38021 216154 216592 475636 12674 133158 22601 318128 -256988 11491
15884 -76933 -116969 31770 -37556 -42101 -173095 -31998 158217 310296 -225809 -6288 35045
15872 -41182 -11599 118869 433781 -67737 -167723 -77017 44568 -92875 365907 -1261 -174924
15861 -174924 42834 -228687 -37201 -224862 -175955 -37157 107159 321539 22595 189002
15851A89002c36040A01482J15057b16757o7962N8137E4936e481b7C1655a01128
15839a0206n1401j88829N5662M37q5392A55154E4830N3108C4166K6172a84145
15827a0115H4794K5004c39983L4398B50131a64109c1505k42961j53476a29933
15816I0120A2494a9249C076a45781H1338L13262j37153A06916K75087f1230k06167
15805b67397A98748f787j52963l07350B8828a15853C4444h1148c7687J1165j43677
15794a70199j41287A35987a45293B58023E7826N7772c6168A2693K1311N2451b14220
15782a14791b3883A51735a66908J5491B26237a80842M10G1320d7059C4142a52889
15770i291n5993p9824B52210B0859K08895D8496M7627Q7327E7775J6400K0294
$$ plain form
15851 189002 -336040 101482 216539 -216757 -284719 -226582 54936 -5481 -27 31655 -101128
15839 -10206 -61607 -250436 -194774 -194337 -279729 155154 54830 107938 34166 60338 -184145
15827 -10115 84794 109798 -339983 -305585 250131 -164109 -31505 -274466 -427942 -129933
15816 90120 12494 -19249 3076 -145781 81338 394600 257447 106916 382003 -61230 -267397
15805 -267397 198748 -6787 -159750 -467100 28828 -115853 34444 -81148 -37687 -26522 -170199
15794 -170199 -311486 135987 -145293 258023 57826 115598 -36168 12693 34004 86455 -214220
15782 -114791 -23883 151735 -166908 -151417 226237 -180842 -180432 71320 -47059 34142 -152889
15770 -9291 -65284 -145108 252210 20859 229754 48496 96123 183450 57775 74175 94469
15759I4469d20720B18612a90473B07029k3714J1511e5806A58308a87639Q236Q8937
15748i0466A70090g2598B07131f3366j86069A23799a37310n7927B36037J38667
15738C74704h6623J7093A4781b18162O1168G5658M6874a1765k4311n2398E3576
15726C03583g1522H0891h1747D9742c84859e2708A57481F1735L21998j36626A16723
15714a62084L1528d420n4979o104G0210O9830d82165e1970o9762B09373J02233
15703C11606i8275A80580c59087a54152f4378G498a05907H9993a21846D3265c02291
15691A33414i7418C7091P8941b11932E3817a9970k66899a23728l1046k81215c7812
15679c49920g7535N8b0093D7053c7971A46156C5491a25350A96550b24883B36720
$$ plain form
15759 94469 -420720 218612 -190473 207029 183315 194826 -55806 158308 -187639 -179403 -90466
15748 -90466 170090 -72598 207131 -63366 -249435 123799 -137310 -195237 236037 374704
15738 374704 -86623 -69530 14781 -218162 -156994 75658 122532 -11765 -36076 -88474 53576
15726 303583 -71522 80891 -81747 49742 -384859 -52708 157481 61735 383733 247107 116723
15714 -162084 -130556 -4420 -59399 -65503 70210 140040 -482165 -51970 -121732 209373 311606
15703 311606 -98275 180580 -359087 -154152 -64378 7498 -105907 89993 -121846 43265 -302291
15691 133414 -97418 37091 116032 -211932 53817 -19970 -286869 -123728 -154774 -435989 -37812
15679 -349920 -77535 -77477 -20093 47053 -37971 146156 35491 -125350 196550 -224883 236720
15667b9999I63P713f7815A92367i4396B093g6586A97626E6660a36066n1564A13622
15654H023N914P5741b75584A69710b19364D7434A4893a84791L27D7413c31194
15642d1207B05949B0529J18076K7085G1094a25409N0756j01116B18589F341J1633
15631A7974d4326o7913m9997A34234b49075k2277L0153c5550j2622A20668A3047
15619A82009f699j20721o4485B3956c80864A12661J4020e0042C408a00029d7344
15607G3278b25507F6680a85322L0915g0109K7084A65799L9697a80701A02750a37165
15595G8426h576B78784G547J13904J38513J69570c4829a654k5745B11664a09898
15583A8762c3786k08840q8919J34553A63469D3940b5314A49322P1959A2160h8441
$$ plain form
15667 -29999 963 8676 -67815 192367 -94396 2093 -76586 197626 56660 -136066 -187630 113622
15654 8023 13937 89678 -275584 169710 -219364 47434 14893 -184791 -184464 47413 -331194
15642 -41207 205949 20529 138605 165690 71094 -125409 -74653 -175769 218589 6341 17974
15631 17974 -44326 -112239 -162236 134234 -249075 -271352 -241199 -35550 -48172 120668 13047
15619 182009 -6699 -127420 -191905 23956 -380864 112661 126681 -50042 3408 -100029 -47344
15607 73278 -225507 66680 -185322 -154407 -70109 -43025 165799 205496 -180701 102750 -137165
15595 78426 -8576 278784 7547 121451 259964 429534 -34829 -1654 -27399 211664 -109898
15583 18762 -33786 -242626 -331545 -196992 163469 43940 -25314 149322 221281 12160 -88441
15571A1882J7146K38341p8203b01426H4712A2777a04263A08820a01654A44394
15560C09803c6941F2343c28721h3091L9400A05801l1153b70788G5232k37N7849
15549A32844d84G0046f4470F8913P1451b19800E35830i4902A21015n9313J02672
15538A64374a19029c6631H0269J39L04197A4729a2194A40519F9695d58953C4629
15526h5732D00620a1652j60508c946A31859e5097j8619B17712a31170D8674a27278
15514a24191j5883d2206l6701l3465A03588b18735c3112r014A43108c9080j82866
15503b21946H1741Q3732M3812a2314H0386J7698h8105j21278O2904l3318B59228
15491d5128F1692L7694N2415b9961H3992a33734J0633b0050k11855N6210L7511
$$ plain form
15571 11882 29028 267369 189166 -201426 84712 12777 -104263 108820 -101654 144394
15560 309803 -36941 62343 -328721 -83091 -43691 105801 74648 -270788 75232 74995 132844
15549 132844 -484 70046 -64470 68913 140364 -219800 535830 -94902 121015 61702 164374
15538 164374 -119029 -36631 80269 80408 384605 14729 -12194 140519 69695 -458953 34629
15526 -85732 400620 -11652 -172160 -3946 131859 -55097 -73716 217712 -131170 48674 -127278
15514 -124191 -140074 -42206 -78907 -112372 103588 -218735 -33112 -42126 143108 -39080 -221946
15503 -221946 81741 165473 209285 -12314 80386 98084 -88105 -209383 -146479 -179797 259228
15491 -45128 61692 99386 151801 -29961 83992 -133734 -123101 -20050 -231905 -175695 -138184
15480a38184C0054a18597Q503l9459A82487d3874k7137E6333K46069A06482o551
15469I9931c843B17639D4174b95627E4471J13554h8626j32115Q6643H9857L0353
15458A20210C605N7403j7554f4707l7607j6135A22297l7207j5508a30227A78537
15446i2327l2631d1440B24720I2219J60055m473d4820B51314N2948A07596a42411
15434a7710B46387a97735B60388j20966d5204A00309J87770a82764L6524O0815
15424h5425A89198a58188l1818d3670A30543b20161C5441f5321l39H6518J61878
15413B48396j14363q497a13705k05136F5911b49912B06932I9557a65793m9973
15403b15766B03051b15259G2623a08376B40736i4974j8555E34257a38789l333
$$ plain form
15480 -138184 30054 -118597 -110094 -149553 182487 -43874 -71011 56333 302402 106482 99931
15469 99931 -3843 217639 44174 -295627 54471 168025 -88626 -220741 -134098 89857 120210
15458 120210 3605 61008 43454 -64707 -102314 -118449 122297 85090 69582 -130227 178537
15446 -92327 -124958 -41440 224720 92219 252274 247801 -44820 251314 304262 107596 -142411
15434 -17710 246387 -197735 260388 139422 -45204 100309 288079 -182764 -146240 -85425
15424 -85425 189198 -158188 -190006 -43670 130543 -220161 35441 -65321 -65660 86518 248396
15413 248396 134033 125536 -113705 -318841 65911 -249912 206932 99557 -165793 -215766
15403 -215766 203051 -215259 72623 -108376 240736 -94974 -113529 534257 -138789 -142122
15393a42122O3790G5937B3736J37836C0999a94985K5228b8276A16777R0910E3987
15381E8190J06746K6064d4971J8927B3298i9459k56001I9288b51832C34538E7559
15369B13222O0974c9945B06679j212e745C13432F2122B5068J38190F4376b4276
15357i4414E2598L5368f19l2232e76D2896h1475E4126K9927J53794n5671P6697
15345B58873J3553h048A1419J19293C0254K70810a7244k0193j16560B56241a49540
15333G7423J81636g0541E569K69954c1418A74727k4597e7491A29711J99082A21258
15321f5476A69211R1578b36026a01046B82087a13068C7541J43800A1963d9331
15310A2864e3423I5482a16171A11677l9152A7940J09077b65040e1132k52496e854
$$ plain form
15393 -142122 -78332 75937 23736 161572 30999 -194985 -169757 -28276 116777 207687 53987
15381 58190 164936 191000 -44971 -26044 23298 -99459 -355460 99288 -251832 334538 57559
15369 213222 274196 -39945 206679 205467 -5745 313432 62122 25068 163258 64376 -24276
15357 -94414 52598 87966 -619 -32851 -576 42896 -81475 54126 84053 237847 182176 258873
15345 258873 272426 -8048 11419 130712 30254 301064 -17244 -37437 -153997 256241 -149540
15333 77423 259059 -70541 5569 275523 -31418 174727 150130 -57491 129711 328793 121258
15321 -65476 169211 260789 -236026 -101046 282087 -113068 37541 181341 11963 -49331
15310 12864 -53423 95482 -116171 111677 72525 17940 127017 -265040 -51132 -303628 -5854
15298A88501a19280G9341f9690D337K058R6628a58149a8365A1427R195a09379
15286a64570j61937j01910D3125J47593D955a57405E1941J45395q9415h4630B19801
15274B51290c94408J75423B38163B8729f4511B85845H7150a60445E3105a18933
15263A58447o2903b29444A05586J05621B0015L04047a35745G9904e4436F0711
15252B49375J49603p2317R37594j49897j70613N24346D93818l2238A97693D9610
15241B70650B4395c76759I7539D340L4478K7815A8998P0080J0777r189b29821
15229a16174A71993a03788c6380p7162A42939l3956a8885A31531A5158P912a02868
15217A72311k2375h7426j69204B14063k0410k8930K7007D7949a52457c1396A11270
$$ plain form
15298 188501 -119280 79341 -69690 4337 6395 103023 -158149 -18365 11427 20622 -109379
15286 -164570 -326507 -428417 43125 190718 4955 -157405 51941 197336 107921 -84630 219801
15274 251290 -394408 -218985 238163 28729 -64511 285845 87150 -160445 53105 -118933
15263 158447 95544 -229444 105586 211207 20015 324062 -135745 79904 -54436 60711
15252 249375 398978 326661 1264255 1114358 943745 1468091 493818 461580 197693 49610
15241 270650 24395 -376759 97539 4340 38818 66633 18998 89078 99855 90666 -229821
15229 -116174 171993 -103788 -36380 -113542 142939 108983 -18885 131531 15158 23070 -102868
15217 172311 149936 -87426 -256630 214063 193653 164723 191730 47949 -152457 -31396 111270
15205C01179B9685Q9013l606l447m524J84644a48380p7501E01376a44675d1308
15193A00446R0721p8531e7782j39643f6054j87532H5820J04220a50458A13408
15182B33808p7906p7501J14127J09609a73662F5686c0100n7907B23733B9801O4594
15171I4395b47222B28159L1089J48315A47396l2594J42709l1288J41051A17374
15160D6905a18475A37071h274A83915q0784a15748I1788M3977M3123C5290K77074
15149C12364o7483j07229j0043c7251H7010a56538g3320A72676n775a71753I2929
15137C77592G8515L03834C3312f1142E8695i9851A38600f2157D8661J58735J68788
15126C76184j55513A2772b80263R6960B09444o3759D3293J11128J7626e3671D75352
$$ plain form
15205 301179 29685 118698 115092 111645 107121 291765 -148380 -225881 501376 -144675 -41308
15193 100446 191167 112636 -57782 -197425 -66054 -253586 85820 190040 -150458 113408
15182 233808 155902 78401 192528 302137 -173662 65686 -30100 -88007 223733 29801 94395
15171 94395 -247222 228159 259248 407563 147396 114802 257511 226223 367274 117374
15160 46905 -118475 137071 -8274 183915 103131 -115748 91788 135765 178888 35290 312364
15149 312364 244881 137652 127609 -37251 87010 -156538 -73320 172676 166901 -171753 92929
15137 377592 78515 382349 33312 -61142 58695 -99851 138600 -62157 48661 207396 376184
15126 376184 220671 12772 -280263 -183303 209444 145685 43293 154421 172047 -53671 475352
15114A03483k1487L7442a69547r7293A24810n7045L9645h3797C16778A33527K47621
15103C81148D2370J18460b8611I6897a17150C6159K42117a8141A63974k5479M9135
15092A87630J9915J78433I6781J18950L2560Q6219p910c81910C40093b7353A90242
15080A89113E3509B6164J87912M6595A25632b01813e7187B22969j6491l9144h9336
15068D6283J42627a2546A21208l6858J01447c20238D53860j00567A63694h5520
15057A79768C3128J94639R7489o1340h8424B83301H8947b6777A69646m9758M8359
15046A68247p0113K71621j40194I6095K69550j76714L16800k15151A31064J37645
15036B68709J14984A18381J7303m4772R2442m3127l6502K38592q9155k2534n5204
$$ plain form
15114 103483 81996 119438 -169547 -266840 124810 67765 107410 -83797 316778 133527 381148
15103 381148 42370 160830 -28611 96897 -117150 36159 278276 -18141 163974 138495 187630
15092 187630 207545 385978 96781 215731 248291 334510 326600 -381910 340093 -27353 190242
15080 189113 53509 26164 214076 260671 125632 -201813 -57187 222969 206478 167334 -89336
15068 46283 188910 -12546 121208 84350 185797 -320238 453860 353293 163694 -85520
15057 179768 33128 227767 325256 263916 -88424 283301 88947 -26777 169646 119888 168247
15046 168247 98134 369755 229561 96095 365645 188931 505731 290580 131064 268709
15036 268709 383693 118381 135684 90912 183354 140227 103725 342317 253162 230628 175424
15025A75424m8843J72870K44913A49410J55214A02456J11765K97617j18601q2957
15015C10280G2519K47394J12223K96288a38003E15359A12576O6432R5703A23015
15004D48068J28412B35149o5991J26178l7599N9082q6967M9238J23463a63185
14993C18819I1250J62005j11507J48992J23503K4846j81741i1047I6400J37275
14983B33675J78182n8091a24058c4326D13577M81611m4569C43273m5441J48231
14973D46063O8897j74528n0770I4075K39324Q9644j89400K42471A83566J60690
14963C44256J76166E8961L27838N4491n05r7128b8370C9410M94062B25835p0145
14952A55690K74061j47851J04758A83924j714J2906n6978o5108L32959I4797J13434
$$ plain form
15025 175424 126581 299451 544364 149410 304624 102456 214221 511838 393237 310280
15015 310280 72519 319913 432136 728424 -138003 515359 112576 179008 274711 123015
15004 448068 576480 235149 169158 295336 257737 316819 229852 279090 402553 -163185
14993 318819 91250 253255 141748 290740 414243 439089 257348 -91047 96400 233675
14983 233675 411857 353766 -124058 -34326 413577 895188 850619 343273 297832 446063
14973 446063 514960 340432 289662 94075 333399 423043 233643 476114 183566 344256
14963 344256 520422 58961 386799 441290 440785 343657 -28370 39410 533472 225835 155690
14952 155690 429751 281900 386658 183924 182210 195116 138138 73030 405989 94797 208231
14941B08231I9190L25974L2817B23611p5856j5283J16237q6018L00535p2258j92809
14930A98159K42839j03531A40652L19318L90119k56753j28974M83600l06132B58985
14919E63025J0777j96118K03458J82070j43372J76736k30307j92376l6326J76867
14909E14434k41446J63604r9849q1989K18381A75677L35944M4554p4950m613j70048
14898C06564r1002q1915J18509R6768j1033P7979J73834A51386J5576N87636B62121
14886C32303j35353M37378j03358j13956J44412j16088J03167G1277K70644j70281
14876A71640M19896j49971J75214q0597K9890j68039J6912p3345m8794J16416
14866D09222L50188k45547J79035J70795C38131J76926O2172j37155A21573M58107
$$ plain form
14941 208231 99190 425164 457981 223611 147755 132472 248709 162691 463226 390968 198159
14930 198159 440998 337467 140652 459970 850089 593336 464362 947962 641830 258985
14919 563025 573802 377684 581142 763212 619840 796576 566269 373893 337567 514434
14909 514434 272988 436592 336743 254754 473135 175677 511621 556175 481225 476612 306564
14898 306564 215562 133647 252156 348924 337891 415870 589704 151386 166962 754598 262121
14886 332303 196950 634328 530970 417014 561426 445338 548505 71277 341921 171640
14876 171640 591536 441565 616779 536182 566072 398033 414945 341600 292806 409222
14866 409222 759410 513863 692898 863693 338131 515057 577229 440074 121573 579680
14856E79680B0925L97929j03563J11079r0318L8103R363o8567J25858K2041J4675
14845D77525C6443O01265q9035k46590K19062r2465K05537j42139J7092L1525
14835E40695n608k29378K05216l7510R7134A30464K56258N1982J46812k41111
14825C44405J42256l4708M0830M3717j92793L56387j70945k33369L68008j52157
14815E11631m8980J12614J63613l10977k04054L60070R2994C31250L31659k25541
14805D37368j37749J72547Q5709J18380k55925J42781n7092J65122k47603N30640
14795I54178m70133L13621k22461r5475O7245k1719J1872J52957p599k6436N3561
14784G09611j188j70392K38636k69199p9021L0186r181K24006j42678P8301K68254
$$ plain form
14856 579680 20925 418854 315291 426370 336052 374155 383518 314951 440809 462850 477525
14845 477525 36443 637708 548673 302083 521145 428680 634217 492078 509170 540695
14835 540695 535087 305709 510925 473415 570549 130464 386722 438704 585516 344405
14825 344405 486661 451953 492783 536500 343707 700094 529149 295780 663788 511631
14815 511631 462651 575265 738878 427901 223847 583917 676911 331250 662909 437368
14805 437368 299619 472166 557875 676255 420330 563111 506019 671141 423538 954178
14795 954178 484045 797666 575205 479730 546975 525256 537128 690085 682486 656050 709611
14784 709611 708423 538031 776667 507468 428447 458633 449452 673458 530780 609081 877335
14773H77335k3559C81626J28083J3173j49271N19061l62061n8174K06008M9873
14763G28318o1503K0802j27639J73179k38374R3765p8694J29321J16463k38205
14753E17433N9808j9132j19870K4884L05738k97546n3654K25050j67796K30447
14743G05362r7873k19676N40029k50294J6273j18278j84290P8373R4473p7113
14733D86986L47751j95709J06559n4032L24077j13893l89715L42645C77676O87155
14723A064831j63240j13284J97838j7103p8356J16146l8768P1170L6658m63005
14713F12887J49784o6498M3236J27027n4873O7141L5949j13651J20721K46498
14703A168221l50166L55120j05450j56467q3032k16724L42754j20629K47989K52177
$$ plain form
14773 877335 853776 381626 509709 522882 373611 892672 530611 472437 678445 728318
14763 728318 666815 687617 559978 733157 494783 588548 509854 639175 755638 517433
14753 517433 577241 558109 438239 463123 768861 471315 417661 642711 474915 705362
14743 705362 607489 387813 927842 677548 693821 575543 391253 469626 564099 486986
14733 486986 834737 639028 745587 691555 1015632 901739 512024 854669 377676 1064831
14723 1064831 901591 788307 986145 969042 890686 1006832 968064 1039234 1075892 612887
14713 612887 762671 696173 739409 866436 811563 878704 914653 801002 921723 1168221
14703 1168221 818055 1173175 1067725 911258 828226 611502 954256 833627 1081616 1333793
14693A333793l55417k2954n7455J58198p6350j0372l34095J83440k5226K74591
14683A068153E27679L25269l8489j00540J85340k23680K99189r5111C83481P42680
14673A126161k19073K39955j51762k39962L52607j36874L41664k73260k4555j13873
14663I01028K63711r3807J45652k77878J31036k45170J98407q2826K21956j04792
14653A057317K19123l08001L61412q6144j43893N4889k57410m9468K28205J77724
14643A253754k30315K32317j58293j7675J72919k5341m3693n1887K19583k14030
14633A137339j77274M67666k67711K95534m53587J29025k35241K06653M09089
14624A511493p7862o1007p0333j59056K06337Q6976j87023J43159p1991n7389
$$ plain form
14693 1333793 978376 955422 897967 1056165 979815 969443 635348 818788 793562 1068153
14683 1068153 527679 852948 814459 713919 899259 675579 974768 879657 383481 1126161
14673 1126161 907088 1147043 995281 755319 1107926 971052 1312716 1039456 1014901 901028
14663 901028 1164739 1070932 1216584 938706 1069742 824572 1022979 940153 1162109 1057317
14653 1057317 1276440 968439 1329851 1243707 1099814 1154703 897293 847825 1076030 1253754
14643 1253754 1023439 1255756 1097463 1079788 1252707 1227366 1183673 1131786 1351369 1137339
14633 1137339 960065 1427731 1160020 1455554 1001967 1130992 895751 1102404 1511493
14624 1511493 1433631 1372624 1302291 1143235 1349572 1436548 1249525 1392684 1320693 1263304
14614A263304K66787n2711J3486k14566J13165j2251J87947o6112J58733R6880
14604A754662l65191N784J29937j44278K83457j93644J60576P8525q7644k46654
14594A375530J57117J63805K31317n83086K14929J43825J159R4979p0740J55497
14584A884332j66426n0678L48815j04240R3119j89837J16904q0776J02802J57015
14574B111030l09690M04288j47698K63098m7346k35512L5402M8105n6894J78221
14564B243004J51522J08295l5332K53322K3412J63192l8152q1722K76450K24645
14554C288636N63256Q0287O89620M59670J348325K066984L870195Q166144R474221
14545C0007338N10951j1012626q208072m392079k489788r31168p41236j86273
$$ plain form
14614 1263304 1530091 1477380 1490866 1276300 1389465 1377214 1565161 1499049 1657782 1754662
14604 1754662 1389471 1395255 1525192 1380914 1664371 1470727 1631303 1709828 1622184 1375530
14594 1375530 1532647 1696452 1927769 1344683 1559612 1703437 1704596 1799575 1728835 1884332
14584 1884332 1717906 1667228 2016043 1911803 2004922 1815085 1931989 1851213 1954015 2111030
14574 2111030 1801340 2205628 2057930 2321028 2273682 2038170 2073572 2121677 2064783 2243004
14564 2243004 2394526 2502821 2467489 2720811 2744223 2907415 2869263 2787541 3063991 3288636
14554 3288636 3851892 3932179 4621799 5081469 6429794 8496778 12366973 20533117 30007338
14545 30007338 30518289 19505663 11297591 6905512 4415724 3484556 2743320 2557047
14537B557047n15291O9111K22300l00661J18578N127r5839k21178o9462J75753
14527A945485K58924J6202O4440k03208o7247L4198M87482m27166M41272K4325
14517B574707o6153R566J34059m3216j93824J39116r7900J84305O6368N1524j68783
14506B589769J17506K09706k37126M09230l01131l9152J20000J66677r6572P7752
14496C016659j18005m3361m576M11153Q6531k26701k5195J47152q2619L24387
14486C485425k91911R3759K27182l4658o9203L55725J28821k30733P0016l7779
14476C696644L41044m3539m26659O7739L75844q5743M77313j7170l77182M6262
14466D054553L5450K92960J17861p2912K16325q9150L36571m90711K92763j75634
$$ plain form
14537 2557047 2041756 2110867 2333167 2032506 2151084 2156211 2060372 1839194 1769732 1945485
14527 1945485 2204409 2220611 2285051 2081843 2014596 2048794 2536276 2109110 2550382 2574707
14517 2574707 2508554 2518120 2652179 2608963 2415139 2554255 2456355 2640660 2707028 2758552 2589769
14506 2589769 2707275 2916981 2679855 3089085 2787954 2748802 2868802 3035479 2938907 3016659
14496 3016659 2898654 2855293 2850717 3261870 3348401 3121700 3096505 3243657 3161038 3485425
14486 3485425 3193514 3287273 3514455 3479797 3410594 3766319 3895140 3664407 3734423 3696644
14476 3696644 4037688 3994149 3567490 3635229 4011073 3925330 4402643 4385473 4008291 4054553
14466 4054553 4090003 4382963 4500824 4427912 4644237 4555087 4891658 4400947 4693710 4518076
14456D518076J66284P4338J20870O5895j47542P341J55206L80913N3792j15906
14446E279267J43170o8390M7370q4669L18360P3539j68548K31385O7655P9177
14436E918316K36899M3806j98410K82492M49789k10137L51064j53089j72435J50567
14426F698862L84844k85644O21136j15428K41369R3j55712J87390M33909K98907
14416H309726K44885l13392J48224J65569r6149p2225L52999R4634K06375n3669
14406H986977K80317K05048R0845M4982K89797r1364M44497l9927Q8966K06652
14396A0506790M39473o2036K56012J26191K71510L50596J85527l1312J19778P14790
14386A2877319k9439M27846J90826M653L99318O9645O05291J47763K6063N30335
$$ plain form
14456 4518076 4684360 4758698 4879568 4945463 4797921 4805262 4960468 5341381 5395173 5279267
14446 5279267 5422437 5354047 5401417 5316748 5635108 5708647 5540099 5771484 5839139 5918316
14436 5918316 6155215 6199021 6000611 6283103 6732892 6522755 6873819 6720730 6548295 6698862
14426 6698862 7083706 6798062 7419198 7303770 7545139 7545232 7389520 7576910 8010819 8309726
14416 8309726 8554611 8241219 8389443 8555012 8458863 8386638 8739637 8834271 9040646 8986977
14406 8986977 9267294 9472342 9563187 9608169 9897966 9806602 10251099 10211172 10300138 10506790
14396 10506790 10946263 10884227 11140239 11266430 11537940 11888536 12074063 12042751 12162529 12877319
14386 12877319 12847880 13275726 13466552 13471205 13870523 13940168 14545459 14693222 14719285 15249620
14376A5249620M62658J00235J47235M96504p1875N41050J96761L35459O24530
14367A8082177K06861M36547L43491N21171K81434P5739R47707J65781O71901
14358B1732809N10461N19482M82782J70336J054137o3330R67778L89795O53924
14349B6418174O42789P79657Q42444N86124P65328N04077J033161J062296P77282
14340C3411332R88463O75099J222181J055391P95111J082320J646345P63413J549944
14331D3189599J358261J456920J142625J420527J786200J702153J615917J576398
14323E5248600K261746J798458J830031K364611K432470K009724K493894K896132
14315G3335666K998229K645920K992679L515678L410820L637260L883842L866069
$$ plain form
14376 15249620 15712278 15812513 15959748 16456252 16384377 16925427 17122188 17457647 18082177
14367 18082177 18289038 18725585 19069076 19590247 19871681 19947420 20895127 21060908 21732809
14358 21732809 22243270 22762752 23245534 23415870 24470007 24406677 25374455 25764250 26418174
14349 26418174 27060963 27840620 28683064 29269188 30034516 30538593 31571754 32634050 33411332
14340 33411332 34399795 35074894 36297075 37352466 38147577 39229897 40876242 41639655 43189599
14331 43189599 44547860 46004780 47147405 48567932 50354132 52056285 53672202 55248600
14323 55248600 57510346 59308804 61138835 63503446 65935916 67945640 70439534 73335666
14315 73335666 76333895 78979815 81972494 85488172 88898992 92536252 96420094 100286163
14307A00286163M319423M544613M804350N027592N407707N407584O356579O248487
14299A42402498O554967O909996P647028P837559Q283620Q718178R440675R829354
14291B07623875R887472J1087317J1396038J1788253J2000673J2884665J3006522
14284B89674815J3354222J3553591J3744374J3775926J3696603J3245800J2832053
14277C83877384J1808299J1016137R466891P525371N374743K992675M56770k43727
14269D32274543j903817m757292n908288n208769o312470p969265j0163043j1647394
14261C78404205j3200362j3784726j4607056j4487049j4337084j3974455j3807673
14254B80205800j3169520j3077836j2666279j1648804j1468844j0878737r627747
$$ plain form
14307 100286163 104605586 109150199 113954549 118982141 124389848 129797432 136154011 142402498
14299 142402498 148957465 155867461 163514489 171352048 179635668 188353846 197794521 207623875
14291 207623875 217511347 228598664 239994702 251782955 263783628 276668293 289674815
14284 289674815 303029037 316582628 330327002 344102928 357799531 371045331 383877384
14277 383877384 395685683 406701820 416168711 423694082 429068825 432061500 432518270 432274543
14269 432274543 430370726 425613434 419705146 414496377 408183907 400214642 390051599 378404205
14261 378404205 365203843 351419117 336812061 322325012 307987928 294013473 280205800
14254 280205800 267036280 253958444 241292165 229643361 218174517 207295780 197668033
14247A97668033r736963r213760q217963q091839p309719p701919o634401o791294
14239A33970175n529762n706879m783096n456889m594952m805371m028592l925399
14231I5139235l977949l428615l278200l212825l310663k887807k949450k392274
14223F9701452k503516k541402k018900k058545k250555j783930k042166j733104
14215E2769334j684782j334314j366512j674700j061368j946453j187531j000855
14207D1512819j171347j046716j017321j100874j328605p85426n56788j108501
14199C3397241q06956j295277q81598m00777o35435j079213m31095p14939p19427
14190B6432524p83258k85611r22095n16126j17199p67390o44514n09792m69107
$$ plain form
14247 197668033 187931070 178717310 170499347 162407508 155097789 147395870 140761469 133970175
14239 133970175 128440413 122733534 117950438 112493549 107898597 103093226 99064634 95139235
14231 95139235 91161286 87732671 84454471 81241646 77930983 75043176 72093726 69701452
14223 69701452 67197936 64656534 62637634 60579089 58328534 56544604 54502438 52769334
14215 52769334 51084552 49750238 48383726 46709026 45647658 43701205 42513674 41512819
14207 41512819 40341472 39294756 38277435 37176561 35847956 35062530 34505742 33397241
14199 33397241 32590285 31295008 30413410 30012633 29377198 28297985 27866890 27151951 26432524
14190 26432524 25649266 25363655 24441560 23925434 23808235 23040845 22396331 21886539 21417432
14181B1417432m36189m15534n62328l47525m03700o49854j43621k28641q40716
14172A7389324R0565m81680l61259k02499k59219o10156k68434k09523k14052
14163A4873067m38982J15354n9594o14219j17246k29552n39881l16130j24395
14154A2548422l95747M4774k97944k70349L36437n96324j24935j65660j58772
14145A0919902J29528n33350k69523k73958J33138l73131j72149K53014j70999
14136I642472n81254J43283J85619m48485k8182j93877j78706j03075j29520k53306
14126H054969K08798j34686k17360m76483M1849J21415n1733k17081m7631J4645
14116G296702k89212O3344j72314j8562j61828O6633m02622q4380K33570l9712
$$ plain form
14181 21417432 20981243 20565709 20003381 19655856 19252156 18602302 18458681 18230040 17389324
14172 17389324 17479889 16998209 16636950 16434451 16175232 15565076 15296642 15087119 14873067
14163 14873067 14434085 14549439 14489845 13875626 13758380 13528828 12988947 12672817 12548422
14154 12548422 12152675 12197449 11899505 11629156 11965593 11369269 11244334 11078674 10919902
14145 10919902 11049430 10516080 10246557 9972599 10105737 9732606 9560457 9813471 9642472
14136 9642472 9061218 9204501 9390120 8941635 8913453 8719576 8540870 8437795 8308275 8054969
14126 8054969 8263767 8129081 7911721 7435238 7477087 7598502 7546769 7329688 7282057 7296702
14116 7296702 7007490 7070834 6898520 6879958 6718130 6784763 6382141 6297761 6531331 6491619
14106F491619m12833J96770l62449J71410m7703k82866j53117L85526m32637q9369
14096E464351q8269K2274K4932o1972O8439m68933O40727o89514J62074o9115
14086E004994k2549J02073k72323m93814M51363n7960J09052K9230m85924R8934
14076D463076k8656M2701j68688K22504j33820k9136j30979j66432J11696P565
14066D189831p8942j68772M9302Q5548l24827K82828J65925m77575L2063M0055
14056C795436j581k38499J47291j93982N4971j8847j10608j46106L26257l58459
14046C255873K2663o581q7493k7892J10619l03014j1645k13668K99107k06784
14036B831185K95224m5126Q3364K97385n88270k2288L3704K8084n263j3454K24424
$$ plain form
14106 6491619 6078786 6275556 5913107 6084517 6036814 5753948 5600831 5986357 5553720 5464351
14096 5464351 5376082 5398356 5423288 5361316 5429755 4960822 5601549 4912035 5074109 5004994
14086 5004994 4982445 5084518 4812195 4318381 4769744 4711784 4820836 4850066 4364142 4463076
14076 4463076 4434420 4477121 4308433 4530937 4397117 4367981 4237002 4070570 4182266 4189831
14066 4189831 4110889 3942117 3991419 4076967 3752140 4034968 4200893 3723318 3755381 3795436
14056 3795436 3793855 3555356 3702647 3508665 3563636 3544789 3434181 3288075 3614332 3255873
14046 3255873 3278536 3271955 3184462 3156570 3267189 2964175 2952530 2738862 3037969 2831185
14036 2831185 3126409 3081283 3164647 3462032 2873762 2851474 2885178 2913262 2907999 2894545 3118969
14025C118969m13450K17504k08734P1357j21954J47278j27213j86023k98393L02452
14015B501793j0156K5540k01998K2790R5085l8538j15588o8777M07500k25601
14005B392050q0415N225j00348K45309k61448J42130j65611K16037J41360j16658
13995B417631n01618L63721K1082L21321J47284R39675J274118K388249N403188
13986A2774651J0561825P347708o509466q193274n520260l138516j544936q28252
13978D949480r46407j68684l47198o19931P6054l01640q329p7025j89127K34595
13968B601788j32008p3126j96506j83251J41175j18197J88359m02580L53836j69096
13958B010394Q8900k92788J15408J4735M5085R8826O5192o36721K29884L93199
$$ plain form
14025 3118969 2705519 2923023 2714289 2785646 2663692 2810970 2683757 2497734 2199341 2501793
14015 2501793 2491637 2517177 2315179 2337969 2433054 2394516 2278928 2210151 2617651 2392050
14005 2392050 2311635 2316860 2216512 2461821 2200373 2342503 2176892 2392929 2534289 2417631
13995 2417631 1916013 2279734 2300816 2622137 2769421 3709096 4983214 7371463 12774651
13986 12774651 23336476 30684184 24174718 15981444 10461184 7322668 5777732 4949480
13978 4949480 4003073 3834389 3487191 2867260 2943314 2641674 2633345 2556320 2367193 2601788
13968 2601788 2469780 2396654 2200148 2016897 2158072 2039875 2228234 1825654 2179490 2010394
13958 2010394 2099294 1806506 1921914 1936649 1981734 2080560 2145752 1509031 1738915 2132114
13948B132114m54528o9107K65441L71j82503J67119k22170J07717J98183n27261
13938A415376O2713K93364N2155o6711J14874k43675R9423m23210K67988m5331
13928A526966K13845o0958J78717l57818R506Q5829o5910o0483K55762l39347
13918A386109N2544K18783k82257Q1986r4995j08610J34936J05882k05259O0056
13908A349175j9491r0337K21033K29756p08860M97787J2531m44823K33819k67817
13898A012773R2527L65728j33336L8186j88849R9874K95541m39225J85531j43415
13888A185335K64423j62508j04537K22795p4835j88058J55142J21946l47465j50491
13878I21747j82161L64045k12309M05799N0635k34739n9640r2682K29838J76808
$$ plain form
13948 2132114 1677586 1608479 1873920 1874291 1691788 1858907 1636737 1744454 1942637 1415376
13938 1415376 1478089 1771453 1823608 1756897 1871771 1628096 1727519 1304309 1572297 1526966
13928 1526966 1740811 1679853 1858570 1500752 1510258 1596087 1530177 1469694 1725456 1386109
13918 1386109 1438653 1657436 1375179 1457165 1362170 1253560 1388496 1494378 1289119 1349175
13908 1349175 1329684 1239347 1460380 1690136 981276 1479063 1491594 1046771 1280590 1012773
13898 1012773 1105300 1471028 1337692 1375878 1187029 1286903 1582444 1143219 1328750 1185335
13888 1185335 1449758 1287250 1182713 1405508 1330673 1142615 1297757 1419703 1072238 921747
13878 921747 739586 1103631 891322 1297121 1347756 1113017 1053377 960695 1190533 1367341
13868A367341l68053j09851N5224J77906k51695J24016K93522l05145J23876p8195
13858A028946j98234K55000j54296L5235J79437J0213k31712O1821R9580l32654
13848G53336J24846L30749l63663K98937k22114L62434k98847l53463O44048l21860
13838I54403J01638k75849L58010E25383J64883K32479K0455j69710J88910O4570
13828A026970l09437M01319k53875M43421n73998J7050J7602k19327R8241J33672
13818G81638R5466k87237L24547j72265p8552O0643P9671J00896K55154m6213
13808A113748l99234m0075J19900K37719k17284j38714L44257B93874Q3335L50045
13798G27254J36753k0837D08994L53351j58344R2718j4614M36452n2390l60785
$$ plain form
13868 1367341 999288 889437 944661 1122567 870872 994888 1288410 983265 1107141 1028946
13858 1028946 830712 1085712 931416 966651 1146088 1156301 924589 986410 1085990 753336
13848 753336 878182 1208931 845268 1144205 922091 1284525 985678 632215 1276263 954403
13838 954403 1056041 780192 1138202 525383 690266 922745 943200 773490 962400 1026970
13828 1026970 717533 1118852 864977 1308398 734400 751450 769052 549725 647966 781638
13818 781638 877104 589867 914414 742149 663597 724240 803911 904807 1159961 1113748
13808 1113748 714514 674439 794339 1032058 814774 676060 1020317 293874 377209 727254
13798 727254 864007 843170 408994 762345 604001 696719 682105 1118557 1066167 705382
13788G05382r2900K34043l91382J42207k03113L99565K24833k32581N7303j64537
13778F78820N4582K65509j82731l17728m7830K46074J37898j42213Q9258C02916
13767F92173j9944Q1811j45281J61041q2267R1656R8387l83293L33276m2319l32330
13756D52910M20502j98349l04056k259K09191J01831M1082J71282l54698j8061
13746E19375M17239k39517l31297N1492M09548M1783m26172L31366j45664j6623
13736F11530m7268m9235J84834j11364M1982j97874j53975K13221O0921j36999
13726D15773J71148M8882J09859k7128j98279K342B11686M43184J11791B37296
13715C87878K46589q7044K23170j17115A34237O16402k30770l9272L9673J34209
$$ plain form
13788 705382 612482 846525 455143 597350 394237 793802 1018635 786054 843357 678820
13778 678820 733402 998911 816180 498452 450622 696696 834594 692381 781639 302916
13767 692173 672229 754040 608759 769800 687533 779189 877576 494283 827559 785240 452910
13756 452910 873412 675063 371007 368748 577939 679770 720852 892134 537436 519375
13746 519375 936614 697097 365800 417292 826840 868623 442451 773817 628153 611530
13736 611530 564262 515027 699861 588497 630479 432605 278630 491851 552772 415773
13726 415773 586921 635803 745662 718534 520255 522597 211686 654870 766661 237296
13715 387878 634467 547423 770593 653478 134237 750639 519869 480597 520270 654479
13705F54479M4121B21844M84272k70797J38351r5864m7150H8235M39825J77409
13695G05469k72987J33871k11666L88736k20092M483q3609j09589K456K24495
13685E61567J43555p1812k04031J53831k63545J63307o0515M39R9677j40287Q2959
13674D65145J11119O6953k33077P8829j34078N7107p3241J46939O0344j03007
13664D43033q3145L91407k55872M0626j91543o2159r7306M45826j57216j60107
13654C13544J08778j65761L57669J5605k01149J32930q2285B28978p1869N87365
13644G44474B62612M93512k93597I6366L90714A96736K73160Q6440j81649l0641
13634C44046A32543J8775M8472J12586M11333j80415j16548K27412j76696O1199
$$ plain form
13705 654479 698600 221844 706116 435319 573670 477806 430656 88235 528060 705469
13695 705469 432482 566353 354687 743423 523331 527814 444205 334616 337072 561567
13685 561567 705122 633310 429279 583110 319565 482872 422357 422796 522473 382186 465145
13674 465145 576264 643217 410140 488969 354891 411998 338757 485696 546040 443033
13664 443033 359888 751295 495423 536049 344506 282347 185041 630867 473651 313544
13654 313544 422322 256561 614230 629835 428686 561616 479331 228978 157109 744474
13644 744474 262612 756124 462527 96366 487080 196736 469896 556336 374687 344046
13634 344046 132543 151318 199790 312376 723709 543294 426746 654158 477462 538661
13624E38661k68250L23355B60310J46773N3985n5880p7234P3355j29967N5322
13614C26664k1012N3569j55092K11568P2671j92888N15451B94089J27545m3876
13604C77758j16662K77269P7624j92291A76167K14817K58837j25456A39329M14821
13594E54150j77965j72484L91579k51918N438J39739j92454r5580K83653B02482
13583A97785J65719j42070K88271A35642C5689M07237d3414D14919J06277A13503
13572A46548K5603F3914M56447j81023N2573R2512A85578J41323P4249n6609A01789
13560D64137j48387A14988N2797J61460q2226J7795j9833O9174k4669c2993B38412
13548C94959F0995L83969B11363L56120q3770p1221j86169G0817K30694M29606
$$ plain form
13624 538661 270411 593766 260310 407083 461068 405188 327954 401309 271342 326664
13614 326664 305652 359221 204129 415697 488368 295480 810931 294089 421634 377758
13604 377758 261096 538365 615989 423698 176167 390984 649821 524365 139329 554150
13594 554150 376185 203701 595280 343362 348800 488539 296085 200505 484158 202482
13583 197785 363504 221434 509705 135642 35689 442926 -43414 414919 521196 113503
13572 146548 172151 63914 520361 339338 391911 484423 185578 326901 401150 344541 101789
13560 464137 315750 114988 167785 329245 247019 264814 244981 314155 289486 -32993 238412
13548 394959 60995 444964 211363 567483 483713 412492 226323 70817 301511 731117
13538G31117A98150K14158A74757J15453J35379c2037C30788K18754A52633J46509
13528B99142J51877B12484K61614o8049C5572L88515A93304l951p8064L39022
13518D50311A61533N4090P5380r3553l8912E0733M04464j62879J83545m2583d6064
13506A89115L3804f2178D41204j79137J67247B03254R2822g5084D28748j34249
13496B94499K7918A44149F0455J31418M49148j91225k0921A46789M0975Q9124
13486B76888J78250j02346P6803D5915J94954J25665j27453k8054n5999J47486
13476C02514J88303j3326k34613K14968J2887A85562M2466J13981j53221J08508
13466B97296K3925a8535D35025A63141M51459j66323N2925A15486R6170O4171
$$ plain form
13538 731117 198150 412308 174757 290210 425589 -32037 330788 549542 152633 299142
13528 299142 451019 212484 474098 406049 35572 424087 193304 189353 111289 450311
13518 450311 161533 215623 291003 197450 158538 50733 455197 292318 475863 433280 -46064
13506 189115 222919 -62178 441204 262067 429314 203254 296076 -75084 428748 294499
13496 294499 322417 144149 60455 191873 641021 449796 428875 146789 187764 276888
13486 276888 455138 352792 429595 45915 240869 366534 239081 211027 155028 302514
13476 302514 490817 477491 242878 457846 470733 185562 228028 342009 188788 297296
13466 297296 321221 -18535 435025 163141 614600 448277 501202 115486 211656 275827
13456B75827j8022a08055C35915O7262J4187g6741F6837Q9510J83510k9233J28932
13445D39556k8920j80472r5813J35716a35010A75856c6603E00878m6871I9482
13434A00872J01492L14628A55665P6056p5410K06237f4426M027c117B17925L61685
13423E79610B09303Q7488j28795J38484N6883I249P6646L32866b3454E4665K69352
13412C24017l7053r6752k4401c5892j10065A18427P9581b32451D16264p6568A51658
13400B84510C8562a3279B22448J49713K3259a8801I8273O736M28068j93502A15881
13388C55738e319K406B47287o9084c96864a2567j60130B51485P1530J16286A81549
13376B02605J10466j32452N281O8153j02718F9455N680A0661K79432e73m1453
$$ plain form
13456 275827 257805 -108055 335915 403177 417364 -76741 66837 156347 339857 310624 439556
13445 439556 410636 230164 134351 270067 -135010 175856 -36603 500878 454007 99482
13434 100872 202364 516992 155665 231721 156311 362548 -64426 -60399 -3117 217925 579610
13423 579610 209303 296791 167996 306480 363363 9249 85895 418761 -23454 54665 324017
13412 324017 286964 190212 165811 -35892 -145957 118427 198008 -232451 416264 339696 151658
13400 284510 38562 -13279 222448 372161 395420 -18801 98273 105009 533077 339575 115881
13388 355738 -5319 -2913 247287 178203 -396864 -12567 -172697 251485 323015 439301 181549
13376 202605 313071 180619 185900 254053 151335 69455 75135 10661 290093 -573 -42026
13365d2026C63735A06757K13397M8981h4411A57190O5134r5383K48445j7379L7994
13354C96001H648M33972G9545K55169q8260J7345m2981K0089L45586F3756K81874
13343C45630o4395c2111C47217B0113L62824A82483J35257o3194J05168A17019
13332C43515H9100b4291A16051J065R3034J38371R473A73524A7760K92587A43728
13320A69912J17162o8591H3858K96487F478j166J06385K72510M6431j56885R849
13309B83602m4320J30043A59164F6099L3309O7081f4619C0331L0866i2547M0760
13298e1787A93713b561A02910Q5753J66452N3132A06818N6336M2566o6208B6229
13286i6091A90093L6130Q6949a24351B15009K8274F6341M32719A09265a08910
$$ plain form
13365 -42026 363735 106757 320154 369135 -84411 157190 222324 126941 375386 358007 396001
13354 396001 8648 442620 79545 334714 246454 263799 220818 240907 586493 63756 345630
13343 345630 281235 -32111 347217 20113 382937 182483 317740 254546 359714 117019
13332 343515 89100 -24291 116051 117116 210150 348521 357994 173524 17760 310347 143728
13320 169912 287074 218483 83858 380345 6478 5312 111697 384207 430638 273753 283602
13309 283602 239282 369325 159164 66099 99408 166489 -64619 30331 61197 -92547 -51787
13298 -51787 193713 -2561 102910 188663 355115 408247 106818 163154 205720 139512 26229
13286 -96091 190093 226223 313172 -124351 215009 243283 66341 499060 109265 -108910
13275c9778C91965j15448J43019b301B11124b18278C15796h4867o811A02539b59019
13263A9670K92355n1036A5224b4247I9640Q2088K3938k5618j0779P241l9227O8371
13251B05654J02626J28300a09441B35194R2045A41335e4317k4010A48484M4217
13241A92701J82263b0394j49245G5075c18961A77778J15838f9883A78321K28738
13231D07059A45429o9435c4569B53394l7450J34044h3297A17169m4861P5458A7613
13219C63529h3093F7606J43424O7642j03130b51258C23233I260L956K08765I0200
13207E7336P6140K94015j10187b9558j85126C0883P3983f0167C86924a18012B47197
13195a69897A71267K5969b6691A3109g8182D71724B660P0374a74390l0267A48547
$$ plain form
13275 -39778 391965 276517 419536 -2301 211124 -218278 315796 -84867 -91678 102539 -259019
13263 19670 312025 260989 15224 -24247 99640 181728 205666 180048 169269 176510 137283 205654
13251 205654 308280 436580 -109441 235194 327239 141335 -54317 -78327 148484 192701
13241 192701 374964 -20394 -169639 75075 -318961 177778 293616 -69883 178321 407059
13231 407059 145429 75994 -34569 253394 215944 349988 -83297 117169 72308 147766 17613
13219 363529 -83093 67606 211030 278672 175542 -251258 323233 9260 13216 221981 90200
13207 57336 133476 427491 317304 -29558 -214684 30883 104866 -60167 386924 -118012 247197
13195 -169897 171267 197236 -26691 13109 -78182 471724 2660 73034 -174390 -204657 148547
13183b74557a1731A14898K04431G1870O1245L9581d5715D43199i6061I8619e3587
13171A70059H800L46979j37921H2452A4595P2308D2612a20296p4013a0574o3611
13160g4185B56121A4576J96654o8884c1653Q454B51112C9697K34413i996C41007
13148C47517A69698l4784J4474a20171E8836h1720H8763N7335N4188Q526D7830
13136C45698A67064J65620j39556a46167A17667R1278E3438J71517p8479f4710
13125A63797d6507J3263D00532c44793A46517Q6894A00920k1493a1905I7333c7477
13113F079d02519D018a6188A58799p3190h7984A18444D7411a3534G0047J23400
13102A93447J8921a44737A31629c4345A24229c8230C13507J80818k24930Q635
$$ plain form
13183 -274557 -11731 114898 319329 71870 133115 172696 -45715 443199 -96061 98619 -53587
13171 170059 8800 355779 217858 82452 14595 86903 42612 -120296 -194309 -10574 -74185
13160 -74185 256121 14576 211230 142346 -31653 -23199 251112 39697 274110 -9996 341007
13148 347517 169698 134914 149388 -120171 58836 -81720 88763 146098 200286 208812 47830
13136 345698 167064 332684 193128 -146167 117667 208945 53438 224955 146476 -64710
13125 163797 -46507 -33244 400532 -344793 146517 233411 100920 79427 -11905 97333 -37477
13113 6079 -402519 4018 -16188 158799 85609 -87984 118444 47411 -13534 70047 193447
13102 193447 212368 -144737 131629 -34345 124229 -38230 313507 494325 269395 278030
13092B78030D1741J33302m4176J19212e511C04159E4342K40404H1813f7138j28161
13081a95299A73202a03981E14004i6191A9972J4219P9574M5774n5557c2242r4271
13070a26513A15705a88964B27151P5637r2802J55466A38033h6154F651J4125J56744
13059A77520J04096J97745j93955a09922A99680N0589O0843g9556A68019c9938
13048a67731C31683c8533A94612L5220K2789H2861J6812J44658L834j03540R4835
13037B39460H9444c9847j45009A22975d2572B16851C4608a34291A25938a64337
13026E9402a32877H3294J17709F4421J74011n5270f0456A4244N3398a3331j028
13015a4359A84473B5508a00377A4258e3185A58133D1067H690J88003f55E2669
$$ plain form
13092 278030 41741 175043 130867 250079 -5511 304159 54342 294746 81813 -67138 -195299
13081 -195299 173202 -103981 514004 -96191 19972 34191 113765 159539 103982 -32242 -126513
13070 -126513 115705 -188964 227151 302788 209986 365452 138033 -86154 6651 20776 177520
13059 177520 281616 479361 285406 -109922 199680 250269 311112 -79556 168019 -39938
13048 -167731 331683 -38533 194612 229832 252621 82861 99673 244331 248165 144625 239460
13037 239460 89444 -39847 -184856 122975 -42572 216851 34608 -134291 125938 -164337
13026 59402 -132877 83294 201003 64421 238432 183162 -60456 14244 67642 -13331 -14359
13015 -14359 184473 25508 -100377 14258 -53185 158133 41067 8690 196693 -655 52669
13003D7281N560R5385K66844c29618E3962c9586E8928P6488h6214A36674P9444
12992B16118A7469c3536E7187c2890B4969J84j1838J33514M7964b28737G1225
12980a36206o1304e234C15839A48071F0706A4429a85956B46304B3714K1538K4749
12969G0001b3408D5700J60347r2574b72139E3214L0994G030M3562J40504E3171
12957D3681J83986m493F3005h2785F1455Q07a48244g2435P249F3821J22853D8629
12944B16275K04471A96635k3512p986g2624G4684i7911n9804m9007A44329l1831
12933A12498C0999c3023E9211A7594H237J39980Q4880I5416C2876K2380L5275
12922I0531a99431A55136c32313A9359J01297n5476c0353l4445A36311M1078J3015
$$ plain form
13003 47281 52841 148226 415070 -329618 53962 -39586 58928 135416 -86214 136674 216118
12992 216118 17469 -33536 57187 -32890 24969 25153 13315 146829 194793 -228737 71225
12980 -136206 -197510 -5234 315839 148071 60706 14429 -185956 246304 23714 45252 70001
12969 70001 -23408 45700 206047 113473 -272139 53214 84208 7030 50592 191096 53171
12957 43681 227667 223174 63005 -82785 61455 62262 -148244 -72435 -65186 63821 186674 48629
12944 216275 420746 196635 173123 165137 -72624 74684 -97911 -157715 -206722 144329 112498
12933 112498 30999 -33023 59211 17594 8237 148217 233097 95416 32876 55256 90531
12922 90531 -199431 155136 -332313 19359 120656 65180 -30353 -64798 136311 177389 190404
12911A90404J524b42976a2103k26I0225a50520A83131P4525b05367A17083a64223
12899B08525k3213G9575J2240J76281b88327B65328G4487f8937o3541c1179H1430
12887a3608E0231J41602d3362A40256O1021a22409I6302L10851A46803b19922
12876e9289k31496R3776B33319g2426a4199A06808R2678E1092O3667a72031A22440
12864A03268h1782b0419k8020k946a0438B16803o7465K31812A7809c6792q46j01422
12852a39060j44364C34505A04376L4855a30478j46111C07049A13028b27571e8363
12841A87403i8204j34292R9714C74952A56836K5061g0246p584A24333c78411i5365
12829a7265B4440a89778J7928r2179B71069a07978f028q7257H2597J7044i5035
$$ plain form
12911 190404 191928 -242976 -12103 -12329 90225 -150520 183131 257656 -205367 117083 -164223
12899 208525 185312 79575 91815 268096 -288327 265328 74487 -68937 -132478 -31179 81430
12887 -13608 50231 191833 -43362 140256 201277 -122409 96302 407153 146803 -219922
12876 -59289 -290785 -197009 233319 -72426 -14199 106808 199486 51092 114759 -172031 122440
12864 103268 -81782 -20419 -48439 -51385 -10438 216803 149338 381150 17809 -36792 -37638 -139060
12852 -139060 -283424 334505 104376 139231 -130478 -276589 307049 113028 -227571 -58363
12841 187403 -98204 -232496 -132782 374952 156836 181897 -70246 -77830 124333 -378411 -95365
12829 -17265 24440 -189778 -171850 -264029 271069 -107978 -6028 -93285 82597 99641 -95035
12817a41127F5812E890i417F1151b1040j97123A48584A822L4830h7397A14485
12805i576A87810p9065a70347I1268L04754A97471c242j8463B02028g3496A3693
12793a11813B15275J01377q3187a84898C26306H6447K3976i1706m2835e9440l04419
12782c63859i3478A23411D9412c3180j75633C7380c7825j37230d7322k09740C1378
12770I5569b42279C5127J93083B9631J6448a92032B5850e2142B84429b42789q6173
12759c28962C57512a60096d3928m6909j8211b4926j16293o3591j4164g0580r436
12748h0016A02314A0600b9144B33379H2052L3944l1768b04614I6635k5154J98071
12737B69552a13870E0956c9672r7160B31261I6516P3520h8874k66787B00730a63732
$$ plain form
12817 -141127 65812 5890 -9417 61151 -21040 -218163 148584 1822 36652 -87397 114485
12805 -9576 187810 108745 -170347 91268 396022 197471 -3242 -21705 202028 -73496 13693
12793 -111813 215275 316652 233465 -184898 326306 86447 110423 -91706 -134541 -59440 -363859
12782 -363859 -93478 123411 49412 -33180 -208813 37380 -37825 -175055 -47322 -257062 31378
12770 95569 -242279 35127 228210 29631 46079 -192032 25850 -52142 284429 -242789 -328962
12759 -328962 357512 -160096 -43928 -90837 -109048 -24926 -141219 -204810 -218974 -70580 -80016
12748 -80016 102314 10600 -29144 233379 82052 115996 84228 -204614 96635 71481 269552
12737 269552 -113870 50956 -39672 -136832 231261 96516 170036 -88874 -355661 200730 -163732
12725a82190B06631a48171d419k27414I8279D6525M762P8959K15439g5920F6437
12713E4739b08545e0590q0361B0789d177A15254C9143N02126A5764a2659A82839
12701C7157J90652j06914E7676J57899I3424K39014c22439c7189A81108A2734
12690A78539j5732a30322C53895a21557N1960A59288a24143A7254J00061I297
12679A81423J60980A42239F9133e0999A28398a8613A03358l9953c7870C23342
12668h3974J0338q7523j55266A8595c5915j8273I9332a4780B32072h777B46880
12656E40723D5707K20714m4642H6397M315J42357K09760A63055a9765l28658B66437
12644A3350J00898c8915A63609O5802B1593e5628j73995C1527K0859a52222F3216
$$ plain form
12725 -182190 206631 -148171 -4419 -231833 98279 46525 51287 130246 345685 -75920 66437
12713 54739 -208545 -50590 -130951 20789 -4177 115254 39143 541269 15764 -12659 182839
12701 37157 227809 120895 57676 215575 93424 332438 -322439 -37189 181108 12734
12690 178539 162807 -130322 353895 -121557 -69597 159288 -124143 17254 117315 9297
12679 181423 342403 142239 69133 -50999 128398 -18613 103358 63405 -37870 323342
12668 -83974 -73636 -161159 -316425 18595 -35915 -54188 99332 -14780 232072 -8777 246880
12656 540723 45707 266421 221779 86397 90712 233069 442829 163055 -19765 -348423 266437
12644 13350 114248 -38915 163609 229411 21593 -55628 -229623 31527 52386 -152222 63216
12632h9395k0904H1224O1461b46491A87700J04761I9163a4735j07219c3422A71680
12620B00893p5435n6093a34794B7473J2530O8207c6988D4909P9080i5490d210
12608b35994D06327i0108G5489J5675a61779A40581J75877e7537B22027J1858
12598B33885o071b70841A5510L05894A17506d1778A54477B3518K13919c04284
12587C076J5711a32064j23874k4939A81299a53648d9146o279E2252a30295l16667
12576d46962A49146P1556p7982A2922a03205A66176h4164j38740C20528a25216
12565d3618A88853a60054H388e1567G03e073G0506K01544a29476D8763c00954
12553a61074k8186k3241A28362N2058a12592b4205B69640D2460J0567e7184A54106
$$ plain form
12632 -89395 -110299 81224 142685 -246491 187700 292461 99163 -14735 -121954 -33422 171680
12620 200893 125458 69365 -134794 27473 40003 108210 -36988 44909 123989 -95490 -4210
12608 -235994 406327 -90108 75489 91164 -161779 140581 316458 -57537 222027 233885
12598 233885 227814 -270841 15510 321404 117506 -41778 154477 23518 237437 -304284
12587 3076 18787 -132064 -255938 -280877 181299 -153648 -49146 -55425 52252 -130295 -446962
12576 -446962 149146 220702 142720 12922 -103205 166176 -84164 -222904 320528 -125216
12565 -43618 188853 -160054 8388 -51567 703 -5073 70506 272050 -129476 48763 -300954
12553 -161074 -189260 -212501 128362 180420 -112592 -24205 269640 42460 53027 -57184 154106
12541A79441q1026K66648j01124a70826j64067H5027a4292A44623E6027f672A10835
12529a86761L9319O8242b8102D693b34135j743A0878N1759j2973b76451J02155
12518a74296B90208i685B82425j01248J05276g0482o8606k11160A19639J4639
12508A34278l5095J49140F454J96456H6079c7052H3197l8819b2927l37062a23003
12496A9116n13a49101M9627A30128c05989a31989A20339n475n6580a03688C72739
12484a27268B65454b00134q2224a04963a6486A12477J73982h0180B06988Q4011
12474B90999j16931J28870a46227m9369L7563l0846a4128B13654J12399d8768
12463h4011D1704J79360a16727j79335f1462j21722C29637d6833j82706A12689
$$ plain form
12541 179441 98415 365063 263939 -170826 -334893 85027 -14292 144623 56027 -6672 110835
12529 -186761 -147442 -79200 -28102 4693 -234135 -235878 10878 62637 49664 -276451 -174296
12518 -174296 290208 -9685 282425 181177 286453 -70482 -139088 -350248 119639 134278
12508 134278 99183 248323 6454 202910 86079 -37052 83197 44378 -22927 -359989 -123003
12496 19116 18603 -149101 -99474 130128 -305989 -131989 120339 114864 58284 -103688 372739
12484 -127268 265454 -200134 -282358 -104963 -16486 112477 286459 -80180 206988 290999
12474 290999 174068 302938 -146227 -195596 -158033 -188879 -14128 213654 326053 -48768
12463 -84011 41704 221064 -116727 -296062 -61462 -183184 329637 -46833 -229539 112689
12452f821F1940p04i5690c1503j25307k9326B36358G8406O7277b7972A15748B4328
12439g3797A58692i4286D99023b4028m128l10938a10005A6868b61886B1998K09312
12428B31310b27321D44957f5188b2290m5379H7962k7814c23559B85205c5886A0287
12416E8910a69082e2049a0669k5821F3470a47101j8958D1399O3153a91779c0912
12404e9103B05684a14534N2319f319B98199H6419C3484L0928a04119c8944A50520
12392e2987J7638F4239b05379p8579J7802I3286J99966b79332H3534a7982j38991
12381a56973D9507a30886d9802E1978J58309a1823c051F8881J06116g1454J0769
12370f0685J9565G3766A9325K94731i9659B815L02105E2659a56970M9931K2918
$$ plain form
12452 -6821 61940 61236 -95690 -31503 -156810 -186136 236358 78406 145683 -27972 115748 24328
12439 -73797 158692 -94286 499023 -24028 -28156 -339094 -110005 16868 -261886 21998 231310
12428 231310 -227321 444957 -65188 -22290 -67669 87962 60148 -323559 285205 -35886 10287
12416 58910 -169082 -52049 -10669 -36490 63470 -147101 -166059 41399 104552 -191779 -30912
12404 -59103 205684 -114534 -62215 -6319 298199 86419 33484 64412 -104119 -38944 150520
12392 -52987 -35349 64239 -205379 -283958 -266156 93286 293252 -279332 83534 -17982 -156973
12381 -156973 49507 -130886 -49802 51978 210287 -11823 -3051 68881 174997 -71454 -60685
12370 -60685 -41120 73766 19325 314056 -99659 2815 304920 52659 -156970 -107039 -84121
12359h4121a0740m22A65922p9073a4095j19714L749a9731k34558A39528D9317
12347a74502E760a58756A88066E7411N3175k1078d7476C71878A6556M12027A43563
12335A04120e1903M758A24504J27689G2710b86792B05412a54028A79233h1876
12324a14758F8551K4397h3851j3634b6017n491k7921A78466D4214J47437c16780
12312c2166B75705L4384c24299A92464p5214a49354A59291c47406a11439F4542
12301E9023R8149d4869a4892k06327R9673b4606G4041K54053A41082r06E7106
12289g4316A87874C488K2990K30040D6151J98290B5606Q2366f2524A09427O1989
12278A71416F3101o57a69930D1753a21947B35677f5254G032f2947m989B89158
$$ plain form
12359 -84121 -10740 -11162 165922 86849 -14095 -133809 -130060 -19731 -254289 139528 49317
12347 -174502 5760 -158756 188066 57411 110586 89508 -47476 371878 16556 428583 143563
12335 104120 -51903 -47145 124504 252193 72710 -286792 205412 -154028 179233 -81876
12324 -114758 68551 92948 -83851 -97485 -26017 -31508 -59429 178466 44214 191651 -316780
12312 -32166 275705 310089 -324299 192464 117250 -149354 159291 -347406 -111439 64542
12301 59023 157172 -44869 -14892 -221219 -121546 -24606 74041 328094 141082 140176 57106
12289 -74316 187874 3488 26478 256518 46151 244441 25606 107972 -62524 109427 171416
12278 171416 63101 62444 -169930 41753 -121947 235677 -65254 7032 -62947 -67936 289158
12266a58059H6401J88879g6482q0716G4179b57798A15082a42139a3292A4813J45193
12255A60006G3856k2348i9161a4010B17910K5747q114q9344g4375c2532m989j51574
12243a89095A74129a4110C31160E7183M5414m2282f1996B97495j39458C2597K45472
12232B78069r5814a69876c042k17285h3824A2743J08198l5028j2239J61317o9559
12221A65432a35931A90792k5318J015F9820K41036B4952C039K51303A0161K51137
12210B61298O9082a05675H3817Q2204J03130A27922E0427a28441j64864B51172
12199B94170k8176J75037h5662A61001k0080C6780K51915d0910D40921a11308
12188a78935A16394J41429A08074J05266b20679B87460A35642J86690j05741P5716
$$ plain form
12266 -158059 86401 275280 -76482 -157198 74179 -257798 115082 -142139 -13292 14813 160006
12255 160006 73856 51508 -99161 -14010 217910 243657 235543 146199 -74375 -32532 -37521 -189095
12243 -189095 174129 -14110 331160 57183 102597 60315 -61996 297495 158037 32597 278069
12232 278069 182255 -169876 -3042 -220327 -83824 12743 120941 85913 73674 234991 165432
12221 165432 -135931 190792 165474 166489 69820 310856 24952 3039 254342 10161 261298
12210 261298 330380 -105675 83817 166021 269151 127922 50427 -128441 -293305 251172
12199 294170 265994 441031 -85662 161001 140921 36780 288695 -40910 440921 -111308
12188 -178935 116394 257823 108074 213340 -220679 287460 135642 322332 216591 292307
12178B92307a87269C09325a86904A74328o1230J24854G7053a97173C69796a46560
12167f2105A37389d0778B51633K6325n7265G4079J85120m1079b5952m2162C19793
12155a86234A95792a3027n6976j70396H2339c7708B33108O1827m7207C0979b1200
12143A13227K13254A26994a0119L466B24442I6378a4386p6588c2030A67514a61564
12131B2779J76354I1479F021d908n136j35128e0329n3174I4382i0663B01419p2172
12119A29247L9889L523F9994L14749i4882B69474A6051f230B62219N223e5866
12107B2746J60802l1841L6486k5483d4916A72939p772a5812i90j31029C9669a05644
12094c85690A85140g3989A58877a23028A8503a54537b2171C43525d7995j4328
$$ plain form
12178 292307 -187269 309325 -186904 174328 113098 237952 77053 -197173 369796 -146560
12167 -62105 137389 -40778 251633 277958 220693 74079 259199 218120 -25952 -68114 319793
12155 -186234 195792 -13027 -70003 -240399 82339 -37708 233108 294935 247728 30979 -21200
12143 113227 326481 126994 -10119 -6653 224442 96378 -14386 -90974 -32030 167514 -161564
12131 22779 199133 91479 6021 -4908 -10044 -145172 -50329 -103503 94382 -90663 201419 129247
12119 129247 169136 172659 69994 384743 -94882 269474 16051 -6230 262219 267442 -55866
12107 22746 183548 151707 188193 162710 -44916 172939 165167 -15812 -990 -132019 39669 -105644
12094 -385690 185140 -73989 158877 -123028 18503 -154537 -22171 343525 -47995 -62323
12084f2323k25509A95604b61653G1373c73317d344F9845H191K20070a36350I4809
12072a80582P5478A16249a68243c6063H3188J35610a77110L8292B67619d68200
12061B75202F4321M1999B709P9970J64728K36303j28046g6147j08817F7187k0796
12050D6391e885L17A44557f8349C943b09580A2090R2637b36043P5716e9570o5632
12038a25202e8481n6275A68840f9223J6521A07857a40384C29541f2888A0055a99753
12026b64855D6284a92294P3686a5795k4695A65316k4823l4144J0709a74831i010
12014b414n1827B6968R6629b88830e0335C61352c7770B7367f1008j88668b741
12002b70226A73527j8291l6106a87298h1643A79754l7414J05353a18572d6285
$$ plain form
12084 -62323 -287832 195604 -261653 71373 -373317 -4344 69845 8191 228261 -136350 94809
12072 -180582 -105104 116249 -168243 -36063 83188 218798 -177110 -138818 267619 -468200
12061 275202 64321 106320 2709 82679 247407 483710 355664 -76147 -184964 67187 46391
12050 46391 -5885 -5568 144557 -68349 3943 -209580 12090 104727 -236043 -160327 -59570 -125202
12038 -125202 -58481 -114756 168840 -69223 -52702 107857 -140384 329541 -62888 10055 -199753
12026 -264855 46284 -192294 -118608 -15795 -40490 165316 140493 106349 117058 -174831 -9010
12014 -2414 -54241 26968 123597 -288830 -50335 361352 -37770 27367 -61008 -249676 -2741
12002 -270226 173527 155236 119130 -187298 -81643 179754 142340 247693 -118572 -46285
11991b53320B3566c420o9782n5584j31666A43110a49396A03516a0809j67701p0613
11980b49123E5018J16700b24704c565m2315l0970K7625l31490C8159J34136o2944
11969A09351a5551j36308A50481a29852K0061e254k01266R3572l2987D8596L2825
11958H1421b58363A87527K2354i3836D1039R5365b75321C20677b17791F3870J6818
11947H0688q397a47472d0060E3131a38125D723a1696j24931B64277b2619q3639
11936a06258C20724C7637L3866b1442C18019h1525H5000L7143B1184e8471F8114
11924E753b98780J19510B2406a572d45H8568a14031j9520A67158J58343d039k2607
11912b6646A91131A1201O027d1867j17071m2252H0415h9333j56872h2971B19128
$$ plain form
11991 -253320 23566 -3420 -73202 -128786 -260452 143110 -149396 103516 -10809 -178510 -249123
11980 -249123 55018 171718 -224704 -3565 -45880 -76850 -49225 -380715 38159 172295 109351
11969 109351 -15551 -151859 150481 -129852 -109791 -5254 -206520 -112948 -145935 48596 81421
11958 81421 -258363 187527 209881 -93836 41039 136404 -275321 320677 -217791 63870 80688
11947 80688 72291 -147472 -40060 53131 -138125 4723 -11696 -136627 264277 -22619 -106258
11936 -106258 320724 37637 71503 -21442 318019 -81525 85000 122143 21184 -58471 68114
11924 5753 -298780 -179270 22406 -1572 -445 88568 -114031 -133551 167158 325501 -4039 -26646
11912 -26646 191131 11201 17228 -41867 -158938 -201190 80415 -89333 -246205 -82971 219128
11900e5908j55383A45028K07291c44091A23901C667c4951i082F9174e3631H4558
11888H2245J47330a33456B0793b31209f9942b3558j38962B64617a50557k03959
11878c54516N1813i7826j07740P7167i089B77441i959b806l592l98952a99429
11866D2783b00786P4755B44612a19510M1340q1089D6019a44650O5099C17425a36684
11854A51491l6047J7195b1796A85295o2835b06480R5566B8639d377n1518j03993
11843a59888l3320H1670A2457a61870I6311b14868B33784D4427a75983p7188b4193
11831b0363k7221j06368d5989I7489a41440r0123e6050j21585g9341j93850A83534
11819A06549J71430J6798b8888A09773k6787G935h1744j60611K240g5660J8204
$$ plain form
11900 -55908 -211291 145028 352319 -344091 123901 3667 -34951 -9082 69174 -53631 84558
11888 82245 229575 -133456 20793 -231209 -69942 -23558 -162520 264617 -150557 -354516
11878 -354516 -302703 -97826 -205566 -128399 -9089 277441 -9959 -2806 -6398 -405350 -199429
11866 42783 -200786 -126031 244612 -119510 -78170 -159259 46019 -144650 -79551 317425 -136684
11854 151491 115444 132639 -21796 185295 122460 -206480 -110914 28639 -4377 -55895 -159888
11843 -159888 -193208 81670 12457 -161870 96311 -214868 233784 44427 -175983 -253171 -24193
11831 -20363 -47584 -153952 -45989 97489 -141440 -231563 -56050 -177635 -79341 -273191 183534
11819 106549 277979 294777 -28888 109773 82986 7935 -81744 -242355 -240115 -75660 -57456
11808e7456j81246R9947k47107f5718r2654d7238A40243R7025a1870N265p7705
11797h4310L4458A94975a89201G7562k4165h3469j0893j28058E5027q43M1775
11786I5959b07680f7369j21004A01955a13735N2753A8431J4425a7878A48976b0102
11774a4582A01185a39276N2471p1812p1534G4996M1525a93831d0529A9826a04447
11762A29807b01971C2081b58680f4638H0826j8674J16607c1202n5926n7410K4769
11751a19769k12077d8913k62544E5581b54620A940K07497a88581R3047B07066
11740B71238F5656b64824a12212C8950J22095a21130C6567b99113e3908A13315
11729H3443e4150m0594j64999A08374a50496q6523G3659K9187J25269f9207A05118
$$ plain form
11808 -57456 -238702 -138755 -385862 -65718 -158372 -47238 140243 237268 -11870 -6605 -84310
11797 -84310 -49852 194975 -189201 77562 53397 -83469 -94362 -222420 55027 54184 95959
11786 95959 -207680 -67369 -188373 101955 -113735 -60982 18431 32856 -17878 148976 -20102
11774 -14582 101185 -139276 -86805 -158617 -230151 74996 116521 -193831 -40529 19826 -104447
11762 129807 -201971 32081 -258680 -64638 80826 62152 178759 -31202 -87128 -144538 -119769
11751 -119769 -331846 -48913 -311457 55581 -254620 1940 209437 -188581 -95534 207066
11740 271238 65656 -264824 -112212 38950 161045 -121130 36567 -299113 -53908 113315
11729 83443 -54150 -94744 -259743 108374 -150496 -237019 73659 102846 228115 -69207 105118
11717A58992B2648K20891c0792A8418b71185B75663D2100J14442f8644A56250
11706A08361G354R9190J98409j35402h8926B87887J63350A60129J14717j18788
11696A56058d45757C55696a6376j97562E7258c49574a14698d6244D31802b77744
11685C46315b1857o2208F1774M41244F7416L44843j73532a6255j68982O7846G6839
11673B05736d6041B1220J86763b77294F227a99773C07883q179i6785G0791a69409
11661d5036D1637K1146a35441D7725Q4097C3412a75143B80723r6672o3958a2348
11649a12122I2958A5507Q4516c05100a29414e5191A13807a22714L072J3705k92736
11638c98673F493N3933c54132h1121A3502g6733K7292n5866M7968A84495p7747
$$ plain form
11717 158992 22648 243539 -30792 18418 -271185 275663 42100 156542 -68644 156250
11706 108361 7354 106544 304953 169551 -88926 287887 451237 160129 274846 156058
11696 156058 -445757 355696 -16376 -213938 57258 -349574 -114698 -46244 431802 -277744
11685 346315 -21857 -84065 61774 503018 67416 412259 238727 -16255 -185237 -117391 76839
11673 205736 -46041 21220 207983 -277294 6227 -199773 307883 299704 -96785 70791 -169409
11661 -45036 41637 62783 -135441 47725 131822 33412 -175143 280723 184051 120093 -12348
11649 -112122 92958 15507 100023 -305100 -129414 -55191 113807 -122714 -119642 -105937 -398673
11638 -398673 6493 60426 -354132 -81121 13502 -76733 -49441 -105307 -57339 184495 106748
11627A06748J54411K19201I5785C2166b07707b7676C5973R8142a82353j20186
11617c02539a29547C75000F322L6989A0656a67017g1523F8544a35212a8878j89427
11606b08305O6550b2418r6949b0725A78713b47331e6993A38875q299J43673C5110
11594i9470k9814A32924h423B91787g3475j58965B19010a67657F004h7830a1432
11582B08260d8102l0851E1825J83317b17321K7414Q7114A75115c0982l14085A00091
11570A45425b63708m8866b1979p2184A42692a07283d257A24472J31225a09498
11559A12117f7794l6941b0150j29088j55887G0631P3159j7637B7673M412J9742
11548E1827J57470n9367o1889a12068A39209a48290C06154I788M6291a2435E99353
$$ plain form
11627 106748 261159 480360 95785 32166 -207707 -27676 35973 134115 -182353 -302539
11617 -302539 -129547 375000 6322 43311 10656 -167017 -71523 68544 -135212 -18878 -208305
11606 -208305 -141755 -22418 -119367 -20725 178713 -247331 -56993 138875 130576 274249 35110
11594 -99470 -129284 132924 -8423 291787 -73475 -232440 219010 -167657 6004 -87830 -11432
11582 208260 -48102 -78953 51825 235142 -217321 -189907 -102793 175115 -30982 -345067 100091
11570 145425 -263708 -312574 -21979 -94163 142692 -107283 -4257 124472 255697 -109498
11559 112117 -67794 -104735 -20150 -149238 -305125 70631 143790 126153 27673 32085 51827
11548 51827 209297 149930 88041 -112068 139209 -148290 306154 9788 56079 -12435 599353
11536A31262J6127J0152P9923c36837f8885A96616J20453j9651c459k60162a3445
11524h9438j31998F3358a14426B6870a12969b8549H7810K73113a8089B99228A02582
11512A60806D7397L09180b00626e0215k3480A12921i5319C07757I2162C7069b63120
11500A41959a30963B40970J21404a38752H4956b88422E4099a34908I4391N8348
11490A52739J30262Q1624a79518C56537c6757A4611h3763E540M94714j29788A52786
11478B57978L0594E2231M41802C1576L18738F6309J19151n7578k9343c3490M645
11467b8845A9993d6223B83502a13764H2614b45577A04779M93743G1952K16382
11457B88334A36496J04564b9506A85153L3724p2246i1346j49336A67997h6305
$$ plain form
11536 131262 147389 157541 237464 -336837 -68885 196616 317069 297418 -3459 -263621 -13445
11524 -89438 -221436 63358 -114426 26870 -112969 -28549 87810 360923 -18089 299228 102582
11512 160806 47397 356577 -200626 -50215 -73695 112921 -95319 307757 92162 37069 -263120
11500 141959 -130963 240970 362374 -138752 84956 -288422 54099 -134908 94391 152739
11490 152739 283001 364625 -179518 356537 -36757 14611 -83763 5540 500254 370466 152786
11478 257978 288572 52231 494033 31576 350314 66309 185460 127882 98539 -33490 -28845
11467 -28845 19993 -46223 283502 -113764 82614 -245577 104779 598522 71952 288334
11457 288334 136496 241060 -29506 185153 218877 146631 -91346 -240682 167997 -86305
11446d8698E8309K5306a42004b2967A65321J46072a11991j22523Q1178J055J8985
11435a33296B54461k9576a64386B04601B193c7173r6653F4027L5051C3611J18274
11424A51885F1745q05c4125B58957A09074K18342a49936j95f843B26227G3251
11412b33252C9059a6498b752H2314B9596b60770R0603K950J6705b8714D5063H325
11399G6373c62068c0709N530j52206m5591a5492q8795G6180K35767A42115c55932
11387g8267k27532O465a0196G6777a71388k44816E7561L8442J59810m2379a0150
11375A51435a40654K4405E4783R3426M8790j0108a95520m9697G9957J3503b19307
11363H4895g0434A19894C3755g1094j89162a20962m7821B14003a24968C37P8876
$$ plain form
11446 -48698 58309 83615 -142004 -22967 165321 311393 -111991 -234514 -153336 -152281 -133296
11435 -133296 254461 224885 -164386 204601 2193 -37173 -133826 64027 99078 33611 151885
11424 151885 61745 60940 -34125 258957 109074 327416 -149936 -150131 -6843 226227 73251
11412 -233252 39059 -16498 -2752 82314 29596 -260770 -170167 -167217 -150512 -28714 45063 8325
11399 76373 -362068 -30709 -25179 -177385 -222976 -15492 -104287 76180 311947 142115 -355932
11387 -78267 -305799 -299334 -10196 76777 -171388 -416204 57561 96003 255813 213434 -10150
11375 151435 -140654 -116249 54783 148209 196999 186891 -195520 -245217 79957 93460 -219307
11363 84895 -70434 119894 33755 -71094 -260256 -120962 -168783 214003 -124968 337 79213
11352G9213e9048j91272c180H609J47646P5198i4346e261A96749a42011b6693
11340a72159c4030k08290e518A27618K30787H7616a8976B08693a6005j45828C34340
11328h7228D1528J08405f3919l2355a9959A33602e5773C8231N5118a03999r8211
11317b02210k9231J9882k6238a14389j08845l9671J09448E7865b5184C95115c9264
11305G2004J17153d5088p8299A36986D0372h7759L5971j1246B68192A28660a97430
11293b10608j5539b6518G0608e2370K922k87092A48633a44943q2648A18871c61441
11281D1904h5351A7450J67215a46471j76410a25368d3518A0029c2805I9729f4579
11269a53230A6064b01431B93952h1175A68521J05043j17844B6770a62825A04153
$$ plain form
11352 79213 -59048 -250320 -3180 8609 156255 231453 -94346 -5261 196749 -142011 -26693
11340 -172159 -34030 -242320 -5518 127618 358405 87616 -18976 208693 -16005 -161833 334340
11328 -87228 41528 149933 -63919 -96274 -19959 133602 -55773 38231 93349 -103999 -202210
11317 -202210 -231441 -211559 -237797 -114389 -223234 -262905 -153457 57865 -25184 395115 -39264
11305 72004 189157 -45088 -123387 136986 40372 -87759 -51788 -63034 268192 128660 -197430
11293 -210608 -226147 -26518 70608 -52370 -49448 -336540 148633 -144943 -227591 118871 -361441
11281 41904 -85351 17450 184665 -146471 -322881 -125368 -43518 10029 -32805 99729 -64579
11269 -153230 16064 -201431 293952 -81175 168521 273564 155720 26770 -162825 104153
11258i388k18495f1673j37429M7637M7405k17371k6151h9496C43831A19056l7327
11247H1729d67325a04235L5493q1608D47263H9778Q7183q2994c73200b9504o9974
11236i9478j33762a10432A02660a19317r3473G5510g47k29126k02124K10260k48376
11225d70113J02415R8312d5800C2013a76884n729E3632a16192B7674g2135a8217
11213b4810C62587a61507B28484C4454J29066B5732J99255c62946B91621a73859
11202G9466K2097a84031l5318i1156n3879j2696N4771A8421R1825g5910m021A28524
11189d44415G0749f8450c3676A01272a01286n4874p4049c2674l7573E9336f8872
11177b86761J38871n839H4091R389a02183J1004B88904f5607k0617j54534B9801
$$ plain form
11258 -9388 -227883 -61673 -199102 -151465 -104060 -321431 -347582 -89496 343831 119056 81729
11247 81729 -467325 -104235 -68742 -150350 447263 89778 176961 93967 -373200 -29504 -99478
11236 -99478 -233240 -110432 102660 -119317 -212790 75510 -747 -229873 -431997 -221737 -470113
11225 -470113 -367698 -269386 -45800 32013 -176884 -182613 53632 -116192 27674 -72135 -18217
11213 -24810 362587 -161507 228484 34454 163520 25732 224987 -362946 291621 -173859
11202 79466 101563 -184031 -219349 -91156 -145035 -157731 -102960 18421 110246 -75910 -79931 128524
11189 -444415 70749 -68450 -33676 101272 -101286 -156160 -230209 -32674 -70247 59336 -68872
11177 -286761 -147890 -153729 84091 93480 -102183 -91179 288904 -65607 -86224 -240758 29801
11165a06238C4895J00073I373L18914H1626a03546J7994j10931C3305a26877R775
11154a17102k32882e3741k99987D2466b98441r273B59070E2512a77610e5542k29176
11143b84718J24587q6032J15380j2313A08290d3574l77347I3233b11614a5912
11132a71464p6832b5017k21903c7170j35368c4781A00429j6271J00883G3979f271
11120c9056D2976m606B191M7643b1775m6987E0724K33466h2515O61l81229C25623
11107b05382A4196R5313C1218r444j485d0408G8288A9388K17437a42697A16461
11095F0650J21720a55936B32509D842Q0809J64874I0046J74431J2440N3590A57369
11083D51937b5048H6838K75975c23354B35917k1308O7824I6985K29982j57626
$$ plain form
11165 -106238 34895 134968 9373 328287 81626 -103546 -85552 -196483 33305 -126877 -117102
11154 -117102 -349984 -53741 -353728 42466 -298441 -307714 259070 52512 -177610 -55542 -284718
11143 -284718 -160131 -246163 -130783 -143096 108290 -43574 -420921 93233 -211614 -15912
11132 -171464 -248296 -25017 -246920 -37170 -172538 -34781 100429 84158 185041 73979 -6271
11120 -39056 42976 38370 2191 49834 -21775 -68762 50724 284190 -82515 -81854 -463083 325623
11107 -205382 14196 109509 31218 21774 20289 -40408 78288 19388 236825 -142697 116461
11095 60650 182370 -155936 232509 4842 85651 250525 90046 264477 276917 330507 157369
11083 451937 -25048 86838 362813 -323354 235917 214609 282433 96985 326967 169341
11073A69341p9032N6651m1638J38669f4272G9285N2189o4702b60806f3505G3813
11061F14804B79254K19757j65396H2420L42652j11491q6752J11426A65826K01888
11051C67714J98729j06904K94891j15531C08795k9628K46047I5119O87647k96735
11041D86031J34363k46921M1988o6304P5692q6856k2986L04192k02421A37404
11030E77896k12514N5213L85735l83267K51891B28119K46818N9845j73115J64068
11020E25735j41213K33658k28985A55554N5080L84426j14572K92361B13540K89223
11010E02763j28670L2353J19801J65101B47541O213O3965J93094j90745P1026
11000C91094J65465j38285N0170B04534K37325J90844p6488j86493j06334K32203
$$ plain form
11073 169341 90309 146960 105322 243991 -64272 79285 131474 66772 -260806 -63505 73813
11061 614804 279254 499011 333615 82420 425072 313581 226829 338255 165826 367714
11051 367714 566443 459539 754430 638899 308795 279167 525214 95119 782766 486031
11041 486031 620394 373473 415461 349157 424849 337993 315007 619199 416778 137404
11030 577896 365382 420595 806330 423063 674954 228119 474937 534782 361667 525735
11020 525735 384522 618180 389195 155554 210634 595060 480488 772849 213540 502763
11010 502763 374093 406446 526247 691348 247541 253754 317719 510813 320068 391094
11000 391094 556559 418274 468444 204534 441859 632703 556215 369722 263388 495591
10990D95591j03301j8586N8416J01138q595R1789j37729j05381K94298K34739
10980I02379j97720J56579l36945L36932j63568M01598j6203j45820L64529J51592
10970A453353L53517j43582l2743K1131j68284j62039l2976n8234l5357N0256
10960A245042j66957J57320L3218j87003M61019j10054q5367q313n7504j49552
10950A131849m57898L97775l16533J02720C27541J20432A35546D0843K01480H7000
10939B69001A14924J82830j05235M3202g5051C22570m6329a79201G7376A5112
10928I2501C3818l828K0786K60251f6282B27465E8058c28038i6511A4089O00676
10917F14765g4027j59613a6106B31548a0692k3256B10998p4865K33824A2647a51173
$$ plain form
10990 495591 392290 373704 432120 533258 524663 616452 478723 373342 667640 902379
10980 902379 704659 861238 524293 861225 697657 1099255 1083052 937232 1301761 1453353
10970 1453353 1806870 1663288 1630545 1651676 1483392 1321353 1288377 1230143 1194786 1245042
10960 1245042 1078085 1235405 1268623 1081620 1542639 1432585 1347218 1338905 1281401 1131849
10950 1131849 673951 1071726 755193 857913 327541 447973 135546 40843 242323 87000
10939 269001 114924 297754 192519 235721 -75051 322570 276241 -179201 77376 15112
10928 92501 33818 29990 50776 311027 -66282 227465 58058 -328038 -96511 14089 614765
10917 614765 -74027 -233640 -16106 231548 -10692 -33948 210998 136133 369957 12647 -151173
10905i1005A33152J3111c8887G2013J52103b98823C681b23631j20602A520a00973
10893i8943j5961k6594H3239K14976e6903j85727B3207f4056G5487a88401j42406
10882c30807h5845j58625b7249j45452B58080a3265p3923k20304A60006P9603
10872B39609a22718c3967k10332c80C065b72778B3347K28346a9458B9908a32537
10860A90902H0384K7501a48818L8958B6460c10992J53737N0380A07989i8768j63074
10849b61842A2018J50334J00415d0221F4655L4607b39907R2296F5691b99567A49112
10837g0912o2219j91724h2329l3887d8336m439k26284f1926C3703c29951O2849
10826b67102j54307g1215r624A21843k7978a05542k99048a5020n4859A97265a87859
$$ plain form
10905 -91005 133152 146263 -38887 72013 224116 -298823 3681 -223631 -344233 1520 -100973
10893 -98943 -114904 -141498 83239 298215 -56903 -242630 23207 -64056 75487 -188401 -330807
10882 -330807 -85845 -244470 -27249 -172701 258080 -13265 -87188 -307492 160006 239609
10872 239609 -122718 -33967 -244299 -380 3065 -272778 23347 251693 -19458 29908 -132537
10860 190902 80384 107885 -148818 -109860 26460 -310992 -157255 -106875 107989 -98768 -261842
10849 -261842 12018 162352 262767 -40221 64655 99262 -239907 -147611 65691 -299567 149112
10837 -70912 -133131 -324855 -82329 -116216 -48336 -52775 -279059 -61926 33703 -329951 -267102
10826 -267102 -421409 -71215 -80839 121843 93865 -105542 -404590 -15020 -69879 197265 -187859
10814D40357B2812c65753a8648D4160Q671L6927a48486o1774h5877B51779g314
10802I505j770c41840a59832A78358b78873A16889l7579h53B8304M9147a87187
10790a28074j77953n5679d0961h819l4024E2319b87842d1544C2096J16691A486
10778D3440a899B50820F939K36917M4909H3055c45543j00909K14569B21718e028
10766a68012I409a43389H4609N8456n9219a829k94741A48686N9496b17377a0382
10754I4944a69768A02370A3367a28274A28297M9912b84977B59830a44319A18110
10743B0739a76636B06150C8658a09651A36713a81783Q6626M3168A26717a8421
10732A55777a39020q7629f0732A31285a9671H9968c8733h468j82319G7666A7677
$$ plain form
10814 440357 22812 -365753 -18648 44160 52831 89758 -148486 -210260 -85877 251779 -7314
10802 9505 7735 -341840 -159832 178358 -278873 116889 79310 -853 28304 77451 -187187
10790 -128074 -306027 -361706 -40961 -8819 -42843 52319 -287842 -41544 32096 148787 1486
10778 43440 -1899 250820 6939 243856 288765 83055 -345543 -446452 -231883 221718 -5028
10766 -168012 9409 -143389 84609 143065 83846 -1829 -296570 148686 208182 -217377 -10382
10754 94944 -169768 102370 13367 -128274 128297 178209 -284977 259830 -144319 118110
10743 20739 -176636 206150 38658 -109651 136713 -181783 -95157 -51989 126717 -18421
10732 155777 -139020 -226649 -60732 131285 -19671 89968 -38733 -8468 -190787 77666 17677
10720a46624l9370O4172n6380B71405q4859i8502E4862a39502j4883B77943I8340
10708b95347H8750J40043b3828A36058R7953D962J47887L0874g2824k90464A99224
10696b03514I4193a39405I740b9566j60073l5314C2716J86585b17501A6331c06555
10684b17552A46173a00986k4754C9258b41718a16363j96364h4776D8268b71874
10673a3821A72834a7918k52890J04117B09008b06748B86316a22887q4076F3707
10662a96991Q290R1742j14677a1520j53179n0038g6864D7846A0438A245g6753
10650b66797b7598k11818A16071k7866J3949J16789h0674c2413C1721M19i5840
10638h4467j54326I6464d2022n817H1973A616a57439j80228j22897A72354i9903
$$ plain form
10720 -146624 -185994 -121822 -178202 271405 186546 -98502 54862 -139502 -154385 277943 98340
10708 -295347 88750 228793 -23828 136058 234011 4962 152849 183723 -72824 -363288 199224
10696 -203514 94193 -139405 9740 -29566 -189639 -224953 32716 219301 -217501 16331 -306555
10684 -217552 146173 -100986 -125740 39258 -241718 -116363 -312727 -84776 48268 -271874
10673 -13821 172834 -17918 -270808 -166691 209008 -206748 286316 -122887 -206963 63707
10662 -196991 -188701 -96959 -211636 -11520 -164699 -214737 -76864 47846 10438 1245 -76753
10650 -266797 -27598 -239416 116071 88205 102154 218943 -80674 -32413 31721 32140 -95840
10638 -84467 -238793 96464 -42022 -47839 81973 1616 -157439 -337667 -460564 172354 -99903
10626g1198I5403J08403a77947j9322o3056g4202l21884d5495j09610A12922c02634
10614E0636J43680c53194i4792G2709N5172a23808o5358d8266j46264A18577i5855
10602H9165d9097A25847J30784c48850a22915A01311a70239A02243I5c206p2243
10591g5449B7202a24756k35518A58076a36581B00249a6648B5037Q922a892j62471
10580a64363b6833E61a39295A33116B122e0667A00028J96605b0402q032j16878
10569a45312j09963B58540c45663B10407C1702K17415n6802C4983M39a63216a2443
10557A38439l9981a45824C7601h5764K329f819j19155A1620a0059B24693d48236
10545C0889J9599R7364K7070d47248a1094o1880A86257A8643J42946a0562o3355
$$ plain form
10626 -71198 95403 203806 -177947 -197269 -260325 -74202 -396086 -45495 -155105 112922 -302634
10614 50636 194316 -353194 -94792 72709 127881 -123808 -189166 -48266 -194530 118577 -95855
10602 89165 -49097 125847 256631 -348850 -122915 101311 -170239 102243 95 -3206 -75449
10591 -75449 27202 -124756 -360274 158076 -136581 200249 -16648 25037 33959 -1892 -164363
10580 -164363 -26833 561 -139295 133116 2122 -50667 100028 296633 -20402 -28434 -145312
10569 -145312 -255275 258540 -345663 210407 31702 249117 192315 34983 35422 -163216 -12443
10557 138439 98458 -145824 37601 -85764 -83435 -6819 -125974 11620 -10059 224693 -448236
10545 30889 50488 147852 174922 -447248 -11094 -72974 186257 18643 161589 -10562 -73917
10534g3917r7767H8423J36843A7531c41855J54351c3454C08726b0889l7055q658
10523f6602k37339i8661j20517B2465b01427k119L7919B36102D3975J91486c17068
10511a83664J1207c9298j26666A94496b1206q1357J9381j68137k18031A38598
10500b02729i9455j64227B23412A05434K08423a30626j63678A1431d86422i0365
10489a21214B92166c25431a17827G561a57625H6760a48619B4121L25630D1901
10478B39623L3347j05209O1905p9474C0144J07600L07450c03911b5287A77412
10467B8771b87564i8008d7014C6995a20581A99232E839J69009p8898b60526B29499
10455a79549J610g3760I2058K50822A29273L857j9455b23227D1138B48a18829
$$ plain form
10534 -73917 -171684 88423 225266 17531 -341855 -187504 -33454 308726 -20889 -57944 -66602
10523 -66602 -303941 -98661 -219178 22465 -201427 -203546 -165627 236102 43975 235461 -317068
10511 -183664 -172457 -39298 -165964 194496 -21206 -102563 -83182 -251319 -469350 138598
10500 -202729 -99455 -263682 223412 105434 313857 -130626 -294304 11431 -486422 -90365
10489 -121214 292166 -325431 -117827 7561 -157625 86760 -148619 24121 349751 41901
10478 239623 272970 167761 229666 150192 30144 137744 445194 -303911 -25287 177412
10467 28771 -287564 -98008 -47014 36995 -120581 199232 5839 174848 95950 -260526 229499
10455 -179549 -177939 -73760 92058 342880 129273 133130 113675 -223227 41138 248 -118829
10443H2383b03353j77524a54022c0767A71321j5347c9421A40049D4848J73936
10433B18784d57322R3105R3048B75670a22147A70512a79317D6477K74827A31432
10422H4878c6327k09955A83573a5761E8249d5978I908e0073m1430B4794f690H587
10409A0267b182B702b27031A41336o4596i0107n9582H3659b45584I1639J32729
10398B24368d8302A7201N5919A989J2979a60346G3965J7508J61655n4420F6741
10386D26705A21023a7031C63123a6178j75598O917n9584A26443o2400f9577A3240
10374b58150O2369M9168B21460D4113L63931E0608J63822G8055J14929R8369j7887
10363B73466J50319A0360L35730G6801J42226a6352A95676J409p6297L05791B3448
$$ plain form
10443 82383 -203353 -380877 -154022 -30767 171321 155974 -39421 140049 44848 218784
10433 218784 -457322 -364217 -271169 275670 -122147 170512 -179317 46477 321304 131432
10422 84878 -36327 -246282 183573 -15761 58249 -45978 9908 -50073 -91503 24794 -6690 8587
10409 10267 -2182 2702 -227031 141336 76740 -90107 -149689 83659 -245584 91639 224368
10398 224368 -48302 17201 73120 1989 14968 -160346 73965 91473 253128 198708 66741
10386 426705 121023 -17031 363123 -16178 -191776 -184859 -244443 126443 64043 -69577 13240
10374 -258150 -195781 -146613 221460 44113 408044 50608 214430 78055 192984 291353 273466
10363 273466 423785 10360 346090 76801 219027 -16352 195676 197085 120788 426579 23448
10351B53245N7793j05154K327g7726A53003J57091A53422J59865c5729B04020
10340A04085J19386O7670b29687A06689P6418r0774K39706C2893j463i2044b0988
10328a20031H3273d519A60751c40908d4663B1253K06080f1922A87102f7012C41968
10316A69633a05572E0164R5038P8157i2711B25878L3390b53680b0647C5461a60678
10304B7489b3715n759P298A9501a07508F4152c405j21377A80933a68925K8172
10293a40753n7345H737a70458P7890b4858F6058h957k6233n6655d0440q0545p8410
10281a99395F136a44871J3455j5268R714m7039c6500k9124A1118a66268c746j23456
10269a27202l84360a88826e5382j33536D539h0113a7440q7595M0460D82669D7535
$$ plain form
10351 253245 311038 205884 208211 -77726 153003 310094 153422 313287 -35729 204020
10340 104085 223471 291141 -229687 106689 183107 92333 332039 32893 31430 -92044 -20988
10328 -120031 83273 -4519 160751 -340908 -44663 21253 227333 -61922 187102 -67012 341968
10316 169633 -105572 50164 145202 223359 -92711 225878 259268 -253680 -20647 35461 -160678
10304 27489 -23715 -29474 -22176 19501 -107508 64152 -3405 -124782 180933 -168925 -140753
10293 -140753 -198098 8737 -170458 -92568 -24858 66058 -8957 -35190 -91845 -40440 -120985 -199395
10281 -199395 6136 -144871 -131416 -146684 -136970 -184009 -36500 -65624 11118 -166268 -3746 -127202
10269 -127202 -511562 -188826 -55382 -188918 4539 -80113 -17440 -105035 -64575 482669 47535
10257A05240K40651j0861J68416j07453j21997G0249J12000b03812G1140O1098
10247A32238O4312p8009K91807c19220a17010j4762o5267p1231L4338k29857f0084
10235A41666F4074g7304J6605B19112a30534n4704e5847B63525G7747b45813g9062
10223c1217D31432a18362a8830H5445B2000J73678b15695B11317d52181a28966
10212f3404j81257a3240j22674F6573O4196a63590O3923F577c29046a22857J2256
10201a10601J8j88833f0210j8719A4225c8771k10931e7178A08650m4590K74659
10190C38719A32001l7405h3517n5027D6147K05563B193b71670a28599B14401F3506
10178e7426E321b10525j83966a72502D9125a17966a3043c514A21183A933d402
$$ plain form
10257 105240 345891 335030 503446 395993 273996 70249 182249 -203812 71140 132238
10247 132238 196550 118541 410348 -319220 -117010 -131772 -197039 -268270 -233932 -463789 -60084
10235 141666 64074 -77304 -60699 219112 -130534 -185238 -55847 263525 77747 -245813 -79062
10223 -31217 431432 -118362 -18830 85445 22000 195678 -215695 211317 -452181 -128966
10212 -63404 -244661 -13240 -135914 66573 130769 -163590 -99667 6577 -329046 -122857 -110601
10201 -110601 -110583 -299416 -60210 -78929 14225 -38771 -249702 -57178 108650 64060 338719
10190 338719 132001 94596 -83517 -138544 46147 251710 2193 -271670 -128599 214401 63506
10178 -57426 5321 -210525 -394491 -172502 49125 -117966 -13043 -3514 121183 1933 -4402
10166g7570C6845d2702C1617R1463b60980a13956a9433C60399E208a19122e4271
10154b3062A27674c02j07594e3106F4600b45178F7852b75429P3607J4072B5588
10142e24488B2659a57788j57500A27450b78762B4228L1463d05808C7239d9290
10131A11727k2906h7921I2569A7964a35655k59604g6980m08905d1256A12607g5848
10119d1906o5481B19684h0279D2840a41765M4758A98012b51540a15497d0842r3160
10108a34002H955b38292A18663C1015a54459A51216a17334G9363a00467I0490
10097B9009J8425e00831a21396b4074l1892B70940b41206B75122c20473l1341
10087c51814a29991C16973b00891j40871A77900b90925i4024b5453A6225J85366
$$ plain form
10166 -77570 36845 -42702 31617 123080 -260980 -113956 -19433 360399 5208 -119122 -54271
10154 -23062 127674 -302 -107896 -53106 64600 -245178 67852 -275429 -201822 -187750 25588
10142 -524488 22659 -157788 -315288 127450 -278762 24228 55691 -405808 37239 -49290
10131 111727 88821 -87921 92569 17964 -135655 -395259 -76980 -485885 -41256 112607 -75848
10119 -41906 -107387 219684 -80279 42840 -141765 -97007 198012 -251540 -115497 -40842 -134002
10108 -134002 8955 -238292 118663 31015 -154459 151216 -117334 79363 -100467 90490
10097 29009 47434 -500831 -121396 -24074 -55966 270940 -241206 275122 -320473 -351814
10087 -351814 -129991 316973 -200891 -341762 177900 -290925 -94024 -25453 16225 201591
10077B01591g8289F8017K15860E9709k4747a84717C1338m492D311b07353F2197
10065A9144a03436j60587b3020j1280B81519D6759J19192k2639a65998A0601b03476
10053b28602Q3774F0849a76232H6362e8878k67892q9051A48252l1587c54944C02454
10041A89511d5998A23398a53299L1439p7301p3759J11390e7783G2173B0550J21271
10030A41821Q6705a39769E4409c6633C0235a80648a8798A90557J8875c62396m3136
10019d05532a36714j15598J3992B0808a58590C4887d30638B80735a3791E3231
10008e8619D3717b5592r4196j66622A53910p0650G068Q8515l4116k787M2050a39184
9995d70010A74228b56336A05102B9733L6354d4680h334o9221k6262m6843k1520
$$ plain form
10077 201591 -78289 68017 283877 59709 34962 -184717 31338 26846 4311 -207353 62197
10065 19144 -103436 -264023 -23020 -34300 281519 46759 165951 143312 -165998 10601 -203476
10053 -228602 -144828 60849 -176232 86362 -58878 -326770 -415821 148252 116665 -354944 302454
10041 189511 -45998 123398 -153299 -121860 -199161 -272920 -161530 -57783 72173 20550 141821
10030 141821 228526 -139769 54409 -36633 30235 -180648 -18798 190557 209432 -362396 -405532
10019 -405532 -136714 -252312 -238320 20808 -158590 34887 -430638 280735 -13791 53231
10008 -58619 43717 -25592 -119788 -286410 153910 83260 7068 95583 61467 58680 100730 -139184
9995 -470010 174228 -256336 105102 29733 66087 -44680 -8334 -77555 -103817 -150660 -172180
9984a72180G7451J08860b48966m8610d9712D98657c3303A21202a62918o9192g2042
9972A00515b784q9235m219C633J15702c82134G3856a11130B8791a15156k03932
9961c19088J05379a04649d9789B61496c21775E1485c60055E8648i3999j61143
9951b55142c3876j4821D2669e1941J8550A4372a72215E5149K9270j0245c16674
9939I816O3945a29417j49308A60544p6836J32882A543b56475A11458c23614A70864
9927A4910L1286a12841o2418b7329j38893r4335C251a66590G1103b25330o8607
9916b93937C4554Q219a03925n7513f0109E2841M7972B9975b26836a9215k73688
9905b92903J05566A81250c20693D03237A78250g2362B8541Q3580f9470E433g7787
$$ plain form
9984 -172180 77451 186311 -248966 -297576 -49712 498657 -33303 121202 -162918 -232110 -72042
9972 100515 -2784 -92019 -96238 3633 119335 -382134 73856 -111130 28791 -115156 -319088
9961 -319088 -213709 -104649 -49789 261496 -321775 51485 -360055 58648 -93999 -255142
9951 -255142 -33876 -48697 42669 -51941 -33391 14372 -172215 55149 84419 74174 -316674
9939 9816 73761 -129417 -278725 160544 83708 216590 1543 -256475 111458 -323614 170864
9927 14910 46196 -112841 -175259 -27329 -166222 -260557 3251 -166590 71103 -225330 -293937
9916 -293937 34554 42773 -103925 -161438 -60109 52841 100813 29975 -226836 -19215 -292903
9905 -292903 -187337 181250 -320693 403237 178250 -72362 28541 112121 -69470 5433 -77787
9893a35091k499j23664f9898I6003c83694O2904a46601J1536j78213i5789r8637
9882a94426M8624c0663j77300B06275a35985F7822a38086g78A80538c51999a36670
9870a4589q6602G5232d74010B25703j04377b792k26556C0531b29422g3778F2165
9858h8086j3845b8731a704I4832a88995B15044M5410a4030k62704Q9072K9405
9847a58257K1928f01k23539C2044d4503B32669a99231C4347a09978c5131k19519
9836b54650e1304k20052j51127a71312p6687P0003P3950B4292R4579h3278d236
9824A7323a0514j13280p957b5684q3905j56272B5713a81695G4326M4077O9945
9813A88348p6139N0736a94347Q8387o529B5679f5377K849r8513A43092D0340b66368
$$ plain form
9893 -135091 -137590 -261254 -69898 96003 -383694 -320790 -146601 -135065 -313278 -95789 -194426
9882 -194426 -145802 -30663 -207963 206275 -135985 67822 -138086 -778 180538 -351999 -136670
9870 -14589 -101191 75232 -474010 225703 121326 -2792 -229348 30531 -229422 -73778 62165
9858 -88086 -101931 -28731 -1704 94832 -188995 215044 260454 -14030 -276734 -187662 -158257
9847 -158257 -136329 -601 -224140 32044 -44503 232669 -199231 34347 -109978 -35131 -254650
9836 -254650 -51304 -271356 -422483 -171312 -247999 -177996 -104046 24292 118871 -83278 -4236
9824 17323 -10514 -123794 -131751 -25684 -109589 -265861 25713 -181695 74326 118403 188348
9813 188348 112209 162945 -194347 -105960 -112489 25679 -65377 -62528 -161041 143092 40340 -266368
9800e54023g628G4579h603D8220h5783C1367J48539a32013k734B22920a32861
9788g6041H0341k801b14131P8363p3693M3019B4096d4135k52562e7246j91167
9777b48413d1175A43049b67805A15193C606K95074L6012b02547M4124l107E0357
9765a20392f78k00755B5352J16577O4822a39472b9416j07617d0784I3041a28810
9753c42026j99146g8408m8853A45334a92195I8812b34446o8656b1919j9302a8733
9741g9009B44119b47907B0447b4832k23599i2763E45296A48721g7765j18185e8935
9729A24268C7341A6153b39683r8044J14776B04161b5875A46313F579L6170c25589
9717E4301e3539j3160J8421I7572e7863F8279b8685A30783a81436C20J71404d10870
$$ plain form
9800 -554023 -7628 74579 -8603 48220 -85783 31367 179906 -132013 -134747 222920 -132861
9788 -76041 80341 77540 -214131 -135768 -209461 -166442 24096 -44135 -296697 -57246 -248413
9777 -248413 -41175 143049 -267805 115193 3606 298680 334692 -202547 -158423 -161530 50357
9765 -120392 -678 -201433 25352 141929 206751 -139472 -29416 -137033 -40784 93041 -128810
9753 -342026 -541172 -78408 -127261 145334 -192195 98812 -234446 -303102 -21919 -41221 -18733
9741 -79009 244119 -247907 20447 -24832 -248431 -92763 545296 148721 -77765 -195950 -58935
9729 124268 37341 16153 -239683 -337727 -222951 204161 -25875 146313 6579 42749 -325589
9717 54301 -53539 -66699 -48278 97572 -57863 68279 -28685 130783 -181436 320 171724 -410870
9704f1425a2506k7667J5349l7000o5966M4362j83137j8811f6064L2568k55377
9693b88873q6712a00765G5073b30297B43312a18767D7283a14063A89135b47714
9682b26047A57376a40093C15055D3175E12P0992k8711b80872b8564j92463k0574
9671b41601A26498b41230i0941r8209L7595J9215C07382b48565N9451d1488j48355
9660a89843K9619j32047F0351j3299a36017N1139j46247B3212b16522j6168Q8217
9649a44473k05034e8365k49569i2003C0008d4245G0056c884B936R8024a09260
9637a72047j78593a08735A60260c346k63337f8692B12092a28096M5929j85651
9627b67818A09141b91089h4296C87868A73688f2758K6021L659k2819l0780K4257
$$ plain form
9704 -61425 -12506 -40173 -24824 -61824 -127790 -83428 -266565 -285376 -66064 -33496 -288873
9693 -288873 -375585 -100765 75073 -230297 243312 -118767 47283 -114063 189135 -247714
9682 -226047 157376 -140093 315055 43175 512 71504 42793 -280872 -28564 -221027 -241601
9671 -241601 126498 -241230 -90941 -189150 -151555 -132340 307382 -248565 -189114 -41488 -189843
9660 -189843 -160224 -292271 60351 47052 -136017 -84878 -231125 23212 -216522 -232690 -144473
9649 -144473 -349507 -58365 -307934 -92003 30008 -44245 70056 -3884 2936 100960 -109260
9637 -172047 -350640 -108735 160260 -3346 -266683 -68692 212092 -128096 -82167 -267818
9627 -267818 109141 -291089 -84296 387868 173688 -62758 -36737 -33078 -55897 -86677 -62420
9616f2420k78909B65746j09036b43077A58288d8054o2755l9602q5344g4965G8632
9604A64550d0523k77462A49313J92181c1216o3740B20001E7220c67037G5504K28960
9593C04464a00325p9711I7211a22192n5477A60501a07549m4932M4747n1914i604
9581A47131b7097g381A2235i5860j17351j2014R0855e7447j91328M3637K3396
9570a81742o1206B39639a68480N6431J8610q1312C0682L63745H6920k7910e7161
9558i507A56335c5582k91863J31935L3459B66836A13246l6084b29004O8534K3618
9547a36852A33175a16753j49368g3635p6419J099D5943b40521Q7508j1154M7980
9536a16187D9844J38128o2185m3739a40542O1503j41609a7499E5709A879d0552
$$ plain form
9616 -62420 -341329 265746 156710 -243077 158288 -48054 -110809 -150411 -235755 -74965 78632
9604 164550 -40523 -317985 149313 341494 -31216 -94956 220001 57220 -367037 75504 304464
9593 304464 -100325 -180036 97211 -122192 -177669 160501 -107549 -152481 -107734 -159648 -9604
9581 147131 -27097 -7381 12235 -95860 -213211 -225225 -134370 -57447 -248775 -205138 -181742
9570 -181742 -242948 239639 -168480 -112049 -93439 -174751 30682 394427 86920 59010 -57161
9558 -9507 156335 -35582 -327445 -195510 -162051 266836 113246 77162 -229004 -160470 -136852
9547 -136852 133175 -116753 -266121 -73635 -150054 -148955 45943 -240521 -153013 -164167 -116187
9536 -116187 49844 187972 125787 82048 -140542 -79039 -220648 -17499 55709 1879 -40552
9524e6501o4366p007M9756j65865o4288b7431k8961j36119D582J15897B8379K4470
9512E2849i6295j7305D2411L5200Q0399C7821a47679b4301N495C05364j3429A28431
9499A48741b7388P031o7638G7459b48417j36823h6727j33455D869a17582C3839
9487a02441b1309n44894J89596B31375a15754j69734A1589a2649B16473b12851
9476a78593b5283B19129b74457g8267A2384N6209d15489A11264a19286f489k7255
9465c3744p451l5073q9980n6920c2865j03090B14029i4699F266K4055i3340d0320
9452b4015A04520a12022b6330D7772e4135l0378j06708R2665j86465J30223d142
9440b0333l2524j62182k0937B44830h3734P291k35927J52322e6541o8627d3996
$$ plain form
9524 -56501 -120867 -127874 -78118 -243983 -308271 -27431 -56392 -192511 4582 120479 28379 52849
9512 52849 -96295 -113600 42411 77611 158010 37821 -147679 -24301 -18806 305364 291935 128431
9499 148741 -27388 -20357 -87995 77459 -248417 -385240 -86727 -220182 4869 -117582 33839
9487 -102441 -21309 -566203 -376607 231375 -115754 -285488 11589 -12649 216473 -212851
9476 -178593 -25283 219129 -274457 -78267 12384 68593 -415489 111264 -119286 -6489 -33744
9465 -33744 -41195 -76268 -166248 -223168 -32865 -135955 214029 -94699 6266 30321 -93340 -40320
9452 -24015 104520 -112022 -26330 47772 -54135 -84513 -191221 -98556 -285021 -154798 -4142
9440 -20333 -52857 -215039 -235976 244830 -83734 -76443 -312370 -160048 -56541 -125168 -43996
9428F7812K92722A9107b2462j27804A50465a43381C13460I6013i1869l391m146
9417i9406c702k55322J27939A78303c3135j63077j71592a14838e7015D1020a2640
9405b04697h9825B64513b36941j0137c8303B1492e53886i9170O535j15009Q1438
9394a26206F5159J14044E3430a5336B23640a57471K6341d410r7450L8617k04651
9383b67894E3986P5175f5197b3750q0405A65483b28216B85831c056j80032A13041
9371G6775d7143A46387e749o5037F375a07620E3252d3452j04917j07598E9227
9359f5996P857o7001D36322e6176j17971b2273j1055J0020A21767f7260F0389
9347D9519c2089G1634a59194r6032A75682B8130J18869F2396N1211a4185n1070
$$ plain form
9428 67812 360534 19107 -22462 -150266 150465 -143381 313460 96013 -91869 -95260 -99406
9417 -99406 -3702 -259024 -131085 178303 -33135 -196212 -367804 -114838 -57015 41020 -12640
9405 -204697 -89825 264513 -236941 -247078 -38303 21492 -553886 -99170 -92635 -207644 -126206
9394 -126206 65159 179203 53430 -15336 223640 -157471 -131130 -4410 -101860 -63243 -267894
9383 -267894 53986 129161 -65197 -23750 -104155 165483 -228216 285831 -3056 -183088 113041
9371 76775 -47143 146387 -5749 -70786 6375 -107620 53252 -43452 -148369 -255967 59227
9359 -65996 -58139 -125140 436322 -56176 -174147 -22273 -33328 -23308 121767 -67260 60389
9347 49519 -32089 71634 -159194 -255226 175682 28130 146999 62396 113607 -14185 -65255
9336f5255K5481l33121h4101q9904D4166f6314j81259A58210m7220K7364f364
9324c7000j09438j59120N8389D0122A9414b83746A30061l648a78981J122B31334
9312f4078l36048D5065A2946b00018H5056c94866h0229j7897o8544d1110j16664
9301a57774P2509J3402k68127d8763j5232k16706J34810K1125A29906g6572k6103
9290a02675B73512A18870a49068B03138e2880A64492K5619E2417i1744A04905
9279b75747j69633J53377J05148O5453n2177A05749k8513g4953L0323r2733j8546
9268a55909A9211b30124A9194h2877k10234B37115a45344l7312d9120E7343P9205
9257A36548g3155l790G641b39173B91870E7171g7975l8830N6491L217J9364j0343
$$ plain form
9336 -65255 -39774 -372895 -84101 -174005 44166 -66314 -247573 158210 110990 138354 -6364
9324 -37000 -146438 -305558 -247169 40122 19414 -283746 130061 126413 -178981 -177859 231334
9312 -64078 -400126 45065 12946 -200018 85056 -394866 -80229 -98126 -166670 -41110 -157774
9301 -157774 -85265 -71863 -339990 -48763 -63995 -280701 -145891 -124766 129906 -76572 -102675
9290 -102675 273512 118870 -149068 203138 -52880 164492 190111 52417 -91744 104905
9279 -275747 -445380 -292003 -186855 -121402 -173579 105749 77236 -74953 -44630 -137363 -155909
9268 -155909 19211 -230124 19194 -82877 -293111 237115 -145344 -182656 -49120 57343 136548
9257 136548 -73155 -76945 7641 -239173 291870 57171 -77975 -116805 -60314 -57097 -37733 -48076
9245d8076J7528k54988a17094j62483D1693J341b13065f0502j38304R6170c1036
9233B51261A10125B7146b28892B87518b37573E9028k4420a91569D9749A7636c6797
9221b2676B94690E7561R7109c208A63859B1077J4276c28221b6888j11179a1007
9209a54604L2987e7132k29530g8018j52148h1329A24853l242J56922j14245B6134
9197D2994a44556c3033j82254B5358b15308B82326H3332e1979B97523b2138n949
9186b8087k25575d1682j58447R0574l9598j433J3416M9611k29200A66202p8610
9175H7592J77906g9358o9615l2005A24848O336b8952k6800A83217c41563A95644
9163a9340l3676q0194n1988G9538C0112a04072A84647n8573g3536l32753c0046
$$ plain form
9245 -48076 -30548 -285536 -117094 -279577 41693 43034 -213065 -60502 -198806 -102636 -31036
9233 251261 110125 27146 -228892 287518 -237573 59028 34608 -191569 49749 17636 -36797
9221 -22676 294690 57561 154670 -3208 163859 21077 35353 -328221 -26888 -138067 -11007
9209 -154604 -121617 -57132 -286662 -78018 -230166 -81329 124853 121611 278533 164288 26134
9197 42994 -144556 -33033 -215287 25358 -215308 282326 83332 -51979 297523 -22138 -28087
9186 -28087 -253662 -41682 -200129 -109555 -149153 -150586 -137170 -87559 -316759 166202 87592
9175 87592 265498 -79358 -148973 -180978 124848 131184 -28952 -55752 183217 -341563 195644
9163 -19340 -53016 -133210 -185198 79538 30112 -104072 184647 126074 -73536 -406289 -30046
9151I5553i0814A48640i8086a5315A81011o2886a59783b9298j07193j7405b4798
9139a51555d3131k52443h2518G5448g9758h932l13709a10118A76185c47473B05208
9127b22857O7348H4224C0080A2939K54531D5313h3638I2282b25512A12901a12995
9115C7797Q9557b67650b0490k80056a42730A42650b56175j2218k0481Q5594F0283
9103a11899A86808i7332A13281K1323b09602b8265j65618L4342O6007H1856b21423
9091a59161b2009A1149b61301e5668b3952k96510P6401j8736I0775E649b68344
9079a47106B23929M6458e48679a36263n4962B45228a44034j6476A93828g4676
9068a71479B17616a31792B44546c06931e9125A89717J07773b5656B6001c4893
$$ plain form
9151 95553 -90814 148640 -98086 -15315 181011 118125 -159783 -29298 -136491 -153896 -24798
9139 -151555 -43131 -295574 -82518 75448 -79758 -8932 -322641 -110118 176185 -347473 205208
9127 -222857 -155509 84224 30080 12939 267470 45313 -83638 92282 -225512 112901 -112995
9115 37797 127354 -267650 -20490 -300546 -142730 142650 -256175 -268393 -288874 -203280 60283
9103 -111899 186808 -97332 113281 134604 -209602 -28265 -193883 -159541 -93534 81856 -221423
9091 -159161 -22009 11149 -261301 -55668 -23952 -320462 -244061 -262797 90775 5649 -268344
9079 -147106 223929 270387 -548679 -136263 -191225 245228 -144034 -160510 193828 -74676
9068 -171479 217616 -131792 244546 -306931 -59125 189717 297490 -25656 26001 -34893
9057b20430A700P0964e2456A02058a96745H7731m0176g2927k08196E9181B6081
9045a40875L1188n9100D0766b52268j22718p8924A36990h1584A12088d9562j23456
9034a73018B52796G1560a59294P6074H567K10729E3538a41539j51156p5844A29286
9022c1967D6106g0976l4750j58786a19109k82305a02169H9430i9274B4987a82137
9010a24334H0220j1703B6728J18158B0402b43049j90758c6417j79846Q5400j4563
8999a45426l089f7353b1594A27987b60244e8633l4170k63192a67529A22602a33559
8987a44048G1663M0423G518O5809a42271B29093a10650j27220H2284b14168K673
8976b11495P0414m5149l300Q9154A46530H83e3347A32821o2475J81280c6243F5049
$$ plain form
9057 -220430 1700 72664 -52456 102058 -196745 87731 47555 -72927 -281123 59181 26081
9045 -140875 -109687 -168787 40766 -252268 -374986 -453910 136990 -81584 112088 -49562 -173018
9034 -173018 252796 71560 -159294 -83220 8567 219296 53538 -141539 -292695 -368539 129286
9022 -31967 46106 -70976 -105726 -264512 -119109 -401414 -102169 89430 -99274 24987 -182137
9010 -124334 80220 68517 26728 144886 20402 -243049 -433807 -36417 -216263 -130863 -145426
8999 -145426 -148515 -67353 -21594 127987 -260244 -58633 -92803 -355995 -167529 122602 -133559
8987 -144048 71663 112086 7518 73327 -142271 229093 -110650 -237870 82284 -214168 -211495
8976 -211495 -141081 -186230 -189530 -100376 146530 883 -53347 132821 70346 251626 -36243 65049
8963G1961i0994b5198j93903O2816L5561A4371a02951m7380k550n1840a0629I3975
8950a26214E8163k2847K32179f25260A84533a7394I6559a60383E7022e1574H2983
8938C5977J3058a05901D8484a27496B27116J78287j75836F5947L8629J99856A19732
8926C43449j15668K58179j74592L15220N66939K577516P604888j813934C534690
8916A826698H64914q9899B47218B7705a2897F6484Q9132R004m7528L14055j38721
8905B92426J8489r9305f7685B58699a6331j44782j99454b1358C5727a83470Q314
8894a75156A15221e04848M5674a11282d67A12465b08591d281j46032g0554B21931
8882H4634b34001E0409J50706f6357I8490J67332O648G7000b32407J10416c940
$$ plain form
8963 71961 -90994 -25198 -219101 -156285 -120724 14371 -102951 -150331 -152881 -204721 -10629 93975
8950 -126214 58163 35316 267495 -625260 184533 -17394 96559 -160383 57022 -51574 82983
8938 35977 49035 -105901 48484 -127496 227116 405403 229567 65947 104576 304432 119732
8926 343449 227781 485960 311368 626588 1193527 3771043 11375931 9561997 3534690
8916 1826698 864914 775015 247218 27705 -12897 66484 155616 164620 117092 431147 292426
8905 292426 310915 211610 -67685 258699 -16331 -161113 -360567 -21358 35727 -183470 -175156
8894 -175156 115221 -504848 -459174 -111282 -467 112465 -208591 -4281 -150313 -70554 221931
8882 84634 -234001 50409 201115 -66357 98490 265822 272470 77000 -232407 -121991 -3940
8870C04799b7651A31073a66597k0767B13927g1024n1980A97277H0360c7740j01269
8859a39009G2639B1045d11429a7764j63658c9399l1421j6314D0071J7758K94789
8848C52618i1545H4665k4769b9495A43868a06249B67700A1096c09811A10336K02210
$$ plain form
8870 304799 -27651 131073 -166597 -187364 213927 -71024 -123004 197277 80360 -37740 -139009
8859 -139009 72639 21045 -411429 -17764 -181422 -39399 -70820 -87134 40071 57829 352618
8848 352618 -91545 84665 59896 -29495 143868 -106249 267700 11096 -309811 110336 312546
$$ [...]
##END NTUPLES=NMR SPECTRUM
##END=
