##TITLE=NES1065_159122.0003_002_9705170_9dfmSsBsMY
##JCAMPDX= 6.0         $$ Bruker NMR JCAMP-DX V2.0
##DATA TYPE= NMR SPECTRUM
##DATA CLASS= NTUPLES
##ORIGIN= BRUKER
##OWNER= Administrator
$$ 1.72 TOPSPIN		Version 2.1
$$ 2016-04-30 17:39:18.802 -0700  Administrator@X
$$ Compression mode = diff/dup
##.OBSERVE FREQUENCY= 400.02188249412
##.OBSERVE NUCLEUS= ^1H
##.ACQUISITION MODE= SIMULTANEOUS (DQD)
##.ACQUISITION SCHEME= undefined
##.AVERAGES= 64
##.DIGITISER RES= 22
##SPECTROMETER/DATA SYSTEM= spect
##.PULSE SEQUENCE= noesygpps1d.comp
##.SOLVENT NAME= COFFEE_meoh
##.SHIFT REFERENCE= INTERNAL, COFFEE_meoh, 1, 14.96211
##AUDIT TRAIL= $$ (NUMBER, WHEN, WHO, WHERE, PROCESS, VERSION, WHAT)
$$ ##TITLE= Audit trail, TOPSPIN		Version 2.1
$$ ##JCAMPDX= 5.01
$$ ##ORIGIN= Bruker BioSpin GmbH
$$ ##OWNER= Administrator
$$ $$ E:\/data/COFFEE/nmr/NES1065_159122.0003_002_9705170_9dfmSsBsMY/12/pdata/1/auditp.txt
$$ ##AUDIT TRAIL=  $$ (NUMBER, WHEN, WHO, WHERE, PROCESS, VERSION, WHAT)
(   1,<2016-04-30 17:39:13.442 -0700>,<Administrator>,<X>,<go>,<TOPSPIN 2.1>,
      <created by zg
	started at 2016-04-30 17:27:43.880 -0700,
	POWCHK enabled, PULCHK disabled,
       configuration hash MD5:
       21 0F 79 D6 B3 7B B4 F6 88 20 88 DB 03 48 BD 9F
       data hash MD5: 64K
       4C 3D 5E 1F 59 15 A6 39 91 3A 3F C5 23 85 0B AE>)
(   2,<2016-04-30 17:39:16.739 -0700>,<Administrator>,<X>,<proc1d>,<TOPSPIN 2.1>,
      <Start of raw data processing
       efp LB = 0.3 FT_mod = 6 PKNL = 1 PHC0 = 0 PHC1 = 0 SI = 128K 
       data hash MD5: 128K
       8F 3C 13 91 88 0D AE F2 A3 C8 BA 07 30 81 F4 99>)
(   3,<2016-04-30 17:39:17.630 -0700>,<Administrator>,<X>,<proc1d>,<TOPSPIN 2.1>,
      <pk PHC0 = -84.32556 PHC1 = 0 
       data hash MD5: 128K
       55 9C BF FD 73 4E C3 E2 FD 49 30 E9 65 A2 24 19>)
(   4,<2016-04-30 17:39:18.036 -0700>,<Administrator>,<X>,<proc1d>,<TOPSPIN 2.1>,
      <abs ABSG = 1 
       data hash MD5: 128K
       C4 94 5F A7 5A BD 26 D2 20 02 6B 9F 4E C3 05 FF>)
(   5,<2016-04-30 17:39:18.130 -0700>,<Administrator>,<X>,<proc1d>,<TOPSPIN 2.1>,
      <abs ABSG = 2 
       data hash MD5: 128K
       24 57 26 C3 95 38 45 CF 4B 77 9E F0 93 56 32 E6>)
(   6,<2016-04-30 17:39:18.208 -0700>,<Administrator>,<X>,<proc1d>,<TOPSPIN 2.1>,
      <abs ABSG = 3 
       data hash MD5: 128K
       50 D7 3B 5F FF 48 19 AF 9F 41 FA D9 C2 51 E5 AE>)
(   7,<2016-04-30 17:39:18.302 -0700>,<Administrator>,<X>,<proc1d>,<TOPSPIN 2.1>,
      <abs ABSG = 4 
       data hash MD5: 128K
       55 D4 2D 36 17 8E AF 5F 29 DC E4 DB 06 1D 8D A4>)
(   8,<2016-04-30 17:39:18.380 -0700>,<Administrator>,<X>,<proc1d>,<TOPSPIN 2.1>,
      <abs ABSG = 5 
       data hash MD5: 128K
       B3 39 76 05 B6 B5 DB A9 65 BB D7 57 23 37 24 43>)
$$ ##END=
$$ 
$$ $$ hash MD5
$$ $$ 84 35 A7 FC 22 90 7D 49 39 B3 E1 9D 1F C1 A1 F0
##$RELAX= 
##$RELAX= 
##$RELAX= 
##$RELAX= 
##$RELAX= 
##$RELAX= 
##$RELAX= 
##$RELAX= 
$$ Bruker specific parameters
$$ --------------------------
##$DU= <E:\>
##$EXPNO= 12
$$ [...]
##$TP07= 0
##$TPNAME0= <>
##$TPNAME1= <>
##$TPNAME2= <>
##$TPNAME3= <>
##$TPNAME4= <>
##$TPNAME5= <>
##$TPNAME6= <>
##$TPNAME7= <>
##$TPOAL= (0..7)
0.5 0.5 0.5 0.5 0.5 0.5 0.5 0.5
##$TPOFFS= (0..7)
0 0 0 0 0 0 0 0
##$TUNHIN= 0
##$TUNHOUT= 0
##$TUNXOUT= 0
##$USERA1= <user>
##$USERA2= <user>
##$USERA3= <user>
##$USERA4= <user>
##$USERA5= <user>
##$V9= 5
##$VALIST= <valist>
##$VCLIST= <CCCCCCCCCCCCCCC>
##$VD= 0
##$VDLIST= <DDDDDDDDDDDDDDD>
##$VPLIST= <PPPPPPPPPPPPPPP>
##$VTLIST= <TTTTTTTTTTTTTTT>
##$WBST= 2048
##$WBSW= 25
##$XGAIN= (0..3)
0 0 0 0
##$XL= 0
##$YL= 0
##$YMAX_a= 5399835
##$YMIN_a= -11228934
##$ZGOPTNS= <>
##$ZL1= 120
##$ZL2= 120
##$ZL3= 120
##$ZL4= 120
##$ABSF1= 14.96211
##$ABSF2= -5.596072
##$ABSG= 5
##$ABSL= 3
##$ALPHA= 0
##$AQORDER= 0
##$ASSFAC= 0
##$ASSFACI= 0
##$ASSFACX= 0
##$ASSWID= 0
##$AUNMP= <proc_prof1d_extract.lims>
##$AXLEFT= 0
##$AXNAME= <>
##$AXNUC= <1H>
##$AXRIGHT= 0
##$AXTYPE= 0
##$AXUNIT= <>
##$AZFE= 0.1
##$AZFW= 0.1
##$BCFW= 0
##$BC_mod= 0
##$BYTORDP= 0
##$COROFFS= 0
##$CY= 15
##$DATMOD= 1
##$DC= 0
##$DFILT= <>
##$DTYPP= 0
##$F1P= 0
##$F2P= 0
##$FCOR= 0.5
##$FTSIZE= 131072
##$FT_mod= 6
##$GAMMA= 0
##$GB= 0
##$INTBC= 1
##$INTSCL= 1
##$ISEN= 128
##$LB= 0.3
##$LEV0= 0
##$LPBIN= 0
##$MAXI= 10000
##$MC2= 0
##$MEAN= 0
##$ME_mod= 0
##$MI= 0
##$NCOEF= 0
##$NC_proc= -2
##$NLEV= 6
##$NOISF1= 0
##$NOISF2= 0
##$NSP= 0
##$NTH_PI= 0
##$NZP= 0
##$OFFSET= 14.96211
##$PC= 1
##$PHC0= -84.32556
##$PHC1= 0
##$PH_mod= 1
##$PKNL= yes
##$PPARMOD= 0
##$PPDIAG= 0
##$PPIPTYP= 0
##$PPMPNUM= 2147483647
##$PPRESOL= 1
##$PSCAL= 4
##$PSIGN= 0
##$PYNMP= <proc.py>
##$REVERSE= no
##$SF= 400.02000919313
##$SI= 131072
##$SIGF1= 0
##$SIGF2= 0
##$SINO= 400
##$SIOLD= 131072
##$SPECTYP= <>
##$SREGLST= <1H.CDCl3>
##$SSB= 0
##$STSI= 131072
##$STSR= 0
##$SW_p= 8223.68421052631
##$SYMM= 0
##$S_DEV= 0
##$TDeff= 65536
##$TDoff= 0
##$TI= <>
##$TILT= no
##$TM1= 0
##$TM2= 0
##$TOPLEV= 0
##$USERP1= <user>
##$USERP2= <user>
##$USERP3= <user>
##$USERP4= <user>
##$USERP5= <user>
##$WDW= 1
##$XDIM= 131072
##$YMAX_p= 329253434
##$YMIN_p= -10844
##$CURPLOT= <Network HP LaserJet P1505>
##$CURPRIN= <$Network HP LaserJet P1505>
##$DFORMAT= <normdp>
##$LAYOUT= <+/1D_H.xwp>
##$LFORMAT= <normlp>
##$PFORMAT= <normpl>
##$SURQMSG= 1
$$ End of Bruker specific parameters
$$ ---------------------------------
##NTUPLES= NMR SPECTRUM
##VAR_NAME=  FREQUENCY,     SPECTRUM/REAL,   SPECTRUM/IMAG
##SYMBOL=    X,             R,               I
##VAR_TYPE=  INDEPENDENT,   DEPENDENT,       DEPENDENT
##VAR_FORM=  AFFN,          ASDF,            ASDF
##VAR_DIM=   131072,        131072,          131072
##UNITS=     HZ,            ARBITRARY UNITS, ARBITRARY UNITS
##FACTOR=    0.0627417313425164, 1,          1
##FIRST=     8223.62146879497, -1977,        -47928
##LAST=      0,             -446,            -48678
##MIN=       0,             -10844,          0
##MAX=       8223.62146879497, 329253434,    0
$$ Real data points
##PAGE= N=1
##DATA TABLE= (X++(R..R)), XYDATA
$$ [...]
67713 49218 49779 50142 49876 49314 48980 48796 48359 47732 47387 47425 47514 47682 48519 50311 52474 54266 55683 57189
67695 57189 58800 60025 60713 61385 62504 63812 64770 65423 66417 68194 70517 72811 74587 75437 75080 73764
67679 73764 72321 71382 70729 69789 68593 67733 67393 67076 66410 65675 65245 65008 64685 64353 64245 64238 63907 62979 61530
67660 61530 59974 59006 59178 60240 61189 61288 60758 60161 59586 58957 58705 59374 60670 61658 61892 61753 61635 61539 61611
67641 61611 62436 64424 67316 70590 73958 77219 80005 81995 83194 83815 84099 84342 84752 85160 85206 85004 85225
67624 85225 86329 88055 89895 91692 93466 95032 96187 96983 97442 97217 95984 93985 91831 89880 88108
67609 88108 86386 84535 82284 79650 77270 75881 75451 75184 74409 73135 71750 70576 69786 69377 69078 68519
67593 68519 67614 66583 65575 64534 63489 62676 62218 62002 61994 62423 63437 64774 65982 66802 67132 66845 65985
67576 65985 65076 64832 65391 66117 66360 66282 66617 67630 68635 68778 68140 67670 67991 68660 68821 68337 67880 67998 68493
67557 68493 68821 68780 68598 68550 68734 69131 69609 69870 69585 68742 67774 67250 67400 67995 68638 69073 69206 68996 68499 67939
67537 67939 67536 67263 66912 66414 65895 65367 64599 63422 62022 60810 60180 60437 61690 63542 65105 65650 65175
67520 65175 64223 63300 62714 62713 63385 64467 65583 66604 67505 68033 67954 67497 67127 66911 66637 66506 67032 68087 68762
67501 68762 68549 68079 68200 68777 69079 68963 68957 69239 69261 68570 67555 67068 67564 68742 69887 70434 70350 70006 69702
67482 69702 69408 69020 68629 68352 68123 67970 68328 69609 71480 72963 73390 73017 72678 73052 74284 75997 77621
67465 77621 78894 80123 81719 83512 84811 85162 84753 84047 83397 83080 83237 83556 83381 82458 81339 80776 80931
67448 80931 81477 82215 83246 84633 86233 87770 88887 89229 88757 87843 86824 85665 84375 83503 83644 84468
67432 84468 84830 84069 82728 81757 81415 81368 81552 82398 84152 86382 88292 89330 89412 88718 87508 86067 84692
67415 84692 83624 82985 82792 82997 83502 84107 84538 84625 84437 84201 84045 83873 83471 82756 81998 81794 82648 84361 86018
67396 86018 86851 87076 87564 88640 89654 89960 89906 90362 91473 92405 92394 91593 90764 90458 90762 91453 92070 92040 91192
67377 91192 90139 89774 90324 91208 91870 92376 93002 93606 93803 93618 93545 94009 95098 96815 99121 101572 103340
67360 103340 103955 103858 103871 104230 104496 104359 104146 104372 105033 105583 105527 104909 104216 103890 103923 103953 103758 103612 103997 104971
67340 104971 106019 106632 106881 107271 108083 108999 109399 108932 107788 106525 105751 105882 107005 108797 110609 111806
67324 111806 112162 111954 111666 111648 111985 112559 113181 113821 114726 116064 117394 117807 116885 115317 114257 114238 114988 116063
67306 116063 117161 117936 118167 118199 118721 119889 121137 122048 122868 123871 124738 125039 124940 124919 125111 125429 126032 127054
67288 127054 128062 128435 128232 128103 128319 128486 128340 128256 128790 130140 132204 134714 137106 138758 139646 140431 141603
67271 141603 142851 143500 143292 142482 141496 140807 140843 141665 142863 144030 145167 146413 147620 148490 148947 149118 149112 149088
67253 149088 149332 149962 150725 151375 152035 152916 153869 154612 155248 156158 157438 158792 159872 160450 160419 160032 159958 160628
67235 160628 161667 162450 163122 164389 166283 167910 168704 169260 170417 172042 173389 174344 175563 177347 178975
67220 178975 179484 178807 177855 177520 177915 178651 179610 181103 183215 185394 187075 188453 190248 192744 195529 198172
67204 198172 200605 202699 204026 204402 204266 204115 203859 203165 202209 201614 201762 202554 203739 205118 206494 207841
67188 207841 209526 211935 214793 217238 218713 219521 220342 221453 222603 223472 224065 224693 225697 227155 228859
67173 228859 230621 232524 234705 236962 238831 240115 241171 242555 244541 247031 249764 252461 254852 256704
67159 256704 257878 258374 258438 258591 259397 261107 263580 266527 269704 272827 275488 277293 278149 278432 278953 280543
67143 280543 283359 286587 289074 290418 291217 292253 293676 295191 296702 298441 300553 302903 305270 307521
67129 307521 309558 311363 313142 315213 317634 320096 322345 324595 327385 330996 335085 338918 341957 344273
67115 344273 346466 349191 352708 356787 360963 364815 368068 370577 372459 374258 376781 380464 384930 389336
67101 389336 393255 396956 400757 404392 407362 409712 412061 414862 418042 421442 425194 429448 434068 438797
67087 438797 443447 447723 451230 454023 456847 460358 464297 467947 471278 475065 479763 484872 489629 493812
67073 493812 497581 501000 504211 507752 512135 517200 522340 527360 532664 538540 544657 550407 555479 559981
67059 559981 564338 569199 575060 581674 588112 593807 599380 605940 613624 621315 627981 633842 639928 646834
67045 646834 654338 661967 669370 676154 681972 687050 692212 698053 704388 710894 717921 726113 735346 744707
67031 744707 753625 762450 771678 781136 790317 799138 807833 816338 824345 831947 839735 848201 857415 867287
67017 867287 877653 887983 897595 906507 915753 926382 938273 950337 961765 972684 983602 994636
67005 994636 1005510 1016049 1026449 1037084 1048201 1059781 1071694 1083953 1096732 1110035 1123434
66994 1123434 1136339 1148535 1160314 1172106 1184188 1196810 1210315 1224869 1240139 1255445 1270325
66983 1270325 1284850 1299350 1313906 1328254 1342244 1356294 1371165 1387137 1403561 1419437 1434462
66972 1434462 1449253 1464496 1480132 1495561 1510509 1525420 1540944 1557142 1573269 1588416 1602414
66961 1602414 1616146 1630834 1646980 1664041 1681105 1697734 1714107 1730565 1747156 1763523 1779135
66950 1779135 1793786 1807937 1822360 1837314 1852235 1866448 1879917 1893032 1905905 1918348 1930476
66939 1930476 1942798 1955562 1968339 1980430 1991470 2001562 2011116 2020647 2030446 2040227 2049327 2057404
66927 2057404 2064762 2071931 2079207 2086704 2094440 2102061 2108800 2114103 2118141 2121401 2124021 2125934 2127449 2129063
66913 2129063 2130693 2131631 2131410 2130290 2128721 2126733 2124160 2121132 2118003 2114906 2111634 2107856 2103241 2097521
66899 2097521 2090739 2083438 2076331 2069661 2062961 2055570 2047266 2038373 2029214 2019624 2009097 1997399 1984904
66886 1984904 1972244 1959798 1947617 1935639 1923670 1911309 1898210 1884510 1870633 1856714 1842518
66875 1842518 1828047 1813767 1800022 1786533 1772791 1758621 1744065 1728960 1713134 1696880 1680800
66864 1680800 1665157 1649684 1634000 1617916 1601402 1584705 1568472 1553257 1538753 1523918 1508117
66853 1508117 1491797 1475796 1460322 1444965 1429433 1413833 1398348 1383052 1368073 1353585 1339493
66842 1339493 1325356 1310789 1295846 1280956 1266563 1252847 1239652 1226655 1213655 1200706 1187922
66831 1187922 1175250 1162620 1150263 1138584 1127582 1116607 1104904 1092369 1079559 1067035 1054912
66820 1054912 1043144 1031961 1021728 1012381 1003279 993798 983915 974009 964180 954046 943240 931814
66808 931814 920060 908259 896872 886677 878225 871107 864121 856313 847624 838491 829155 819649 810194
66795 810194 801217 792985 785399 778169 771062 764020 757147 750555 744139 737605 730787 723794 716746 709585
66781 709585 702367 695440 688900 682095 674247 665640 657575 650905 645129 639250 633053 627015 621347 615780
66767 615780 610180 604686 599209 593397 587328 581693 576928 572515 567549 561847 556130 551144 546854 542578
66753 542578 537805 532855 528645 525672 523255 520011 515172 509215 503204 497831 493232 489245 485454 481216
66739 481216 476184 470774 465792 461571 457755 453862 449775 445658 441698 438031 434713 431699 428962 426513
66725 426513 424171 421496 418294 415019 412263 409923 407375 404449 401604 398975 395893 391802 387185 383097
66711 383097 379990 377471 375038 372596 370354 368600 367526 366893 365917 363797 360438 356412 352341 348593 345445
66696 345445 343103 341474 340251 339254 338392 337262 335280 332414 329433 327068 325161 322982 320312 317811 316203
66681 316203 315283 314007 311600 308421 305529 303464 301680 299275 295967 292134 288221 284548 281567 279712
66667 279712 278870 278421 277931 277476 277100 276407 275049 273304 271750 270485 269041 267048 264695 262478 260708 259357
66651 259357 258277 257464 257022 256816 256315 255016 253022 250878 248848 246724 244466 242533 241220 240081 238492
66636 238492 236521 234764 233449 232254 230904 229394 227612 225301 222606 220168 218463 217380 216618 216108 215821
66621 215821 215541 215192 215083 215506 216263 216864 217006 216576 215400 213401 210942 208677 207007 205896 205135 204484 203598
66604 203598 202160 200266 198430 197059 196038 194984 193802 192828 192374 192299 192156 191767 191420 191353 191216 190433 189024
66587 189024 187652 186662 185563 183821 181785 180289 179502 178809 177779 176617 175587 174569 173516 172797 172679
66572 172679 172848 172903 173036 173648 174482 174687 173831 172380 171035 170007 169127 168319 167626 166970 166188 165339 164717 164491
66554 164491 164397 163856 162441 160298 158122 156631 155960 155606 155000 154117 153469 153491 153983 154215 153624 152354 150992
66537 150992 149791 148354 146245 143715 141550 140270 139804 139912 140538 141542 142452 142872 142976 143235 143706 143899
66521 143899 143398 142330 141108 140014 139173 138672 138396 137942 137070 136232 136255 137302 138483 138783 138176 137459 137088
66504 137088 136699 135928 135138 134857 134840 134267 132858 131231 130056 129335 128767 128347 128239 128330 128323 128139 127827 127241 126177
66485 126177 124814 123711 123314 123728 124811 126199 127263 127495 126972 126145 125168 123850 122317 121204 120935 121204
66469 121204 121419 121311 120859 120039 119018 118285 118094 118026 117537 116716 116037 115514 114663 113297 111792 110581 109864 109884
66451 109884 110882 112553 113988 114454 113949 112853 111474 110173 109443 109399 109473 109047 108220 107578 107415 107534 107592 107274
66433 107274 106323 104911 103811 103623 103892 103586 102542 101787 102175 103309 104231 104692 105145 105788 106218 106056 105383
66416 105383 104482 103541 102814 102762 103698 105275 106513 106462 104978 102907 101409 100959 100984 100556 99328 97704 96267
66399 96267 95275 94655 94164 93541 92757 92208 92401 93315 94277 94621 94310 93757 93239 92687 91946 91003 89999 89146 88573
66380 88573 88122 87452 86560 86056 86574 87925 89162 89543 89161 88506 87827 87185 86850 87126 87783 88030 87260 85670
66362 85670 84040 83084 83068 83847 84981 85897 86222 86110 86049 86237 86312 85862 85026 84319 83988 83898 84043 84679 85732
66343 85732 86564 86749 86786 87466 88699 89575 89625 89365 89335 89229 88479 87279 86436 86317 86509 86542 86487 86690 87203 87634
66323 87634 87420 86264 84488 82942 82331 82583 83049 83306 83471 83793 84215 84514 84548 84266 83656 82863 82150 81594
66305 81594 81026 80433 80180 80593 81467 82245 82606 82621 82377 81748 80664 79453 78703 78803 79648 80780 81780 82458
66287 82458 82719 82484 81882 81337 81172 81163 80844 80261 80014 80415 81026 81342 81496 81822 82044 81546 80335 79084 78114
66268 78114 77015 75542 74315 74099 74777 75558 76004 76295 76546 76482 75991 75539 75687 76402 77145 77543 77718 78005
66250 78005 78530 79092 79314 78912 77934 76745 75712 74900 74149 73396 72718 72052 71148 69916 68707 68058 68207 68982
66232 68982 70013 70906 71304 71071 70491 70081 70048 70073 69704 68916 68153 67867 68023 68096 67610 66786 66568 67753 70045
66213 70045 72150 72940 72381 71275 70378 70001 70218 71042 72264 73358 73737 73126 71725 70058 68603 67454
66197 67454 66386 65284 64441 64293 64933 66006 67025 67685 67960 68117 68566 69454 70429 70991 71166 71561 72630
66180 72630 74085 75199 75552 75255 74508 73285 71605 70006 69366 70087 71538 72565 72593 72054 71655 71479 71062
66163 71062 70152 69051 68168 67545 66997 66501 66296 66602 67322 68060 68473 68588 68716 69034 69430 69868 70611 71816
66145 71816 73060 73625 73222 72123 70671 69108 67838 67321 67483 67672 67483 67300 67707 68677 69684 70368 70715
66128 70715 70765 70562 70337 70368 70610 70728 70488 69954 69306 68720 68381 68421 68782 69269 69623 69531 68837 67980 67901 69063
66108 69063 70714 71652 71639 71548 72070 72910 73455 73661 73835 73949 73700 73071 72346 71628 70707 69449 68019 66678
66090 66678 65598 64918 64730 64881 64943 64572 63888 63444 63769 64845 66014 66485 66027 65166 64637 64728 65171 65545 65657
66071 65657 65585 65483 65405 65253 64880 64278 63622 63129 62948 63128 63537 63777 63417 62489 61607 61389 61795 62246 62331 62228
66051 62228 62456 63385 64906 66382 66967 66286 64898 63890 63938 64887 66239 67701 69094 70067 70270 69742 68872
66034 68872 68032 67451 67330 67742 68393 68795 68826 68901 69441 70361 71267 71964 72516 72876 72787 72167 71365 70848 70679 70459
66014 70459 69801 68799 67984 67839 68376 69166 69762 70044 70192 70374 70572 70636 70444 69980 69366 68876 68782 69114 69592
65995 69592 69866 69785 69441 69024 68772 68944 69666 70742 71749 72402 72820 73424 74594 76356 78240 79475 79529 78589
65977 78589 77412 76612 76184 75837 75545 75517 75713 75734 75304 74586 73885 73234 72516 71848 71490 71383 71092 70331 69362
65958 69362 68643 68276 67983 67590 67231 67058 67003 66933 66803 66479 65653 64294 63071 62848 63631 64388 64261 63680 63867
65939 63867 65278 66974 67642 66883 65328 63832 62886 62640 63067 64003 65195 66357 67101 67006 66065 64989 64680
65922 64680 65261 65971 66147 65992 66101 66574 67013 67246 67497 67842 67930 67454 66577 65639 64675 63506 62246 61407 61433
65903 61433 62220 63199 63853 64125 64252 64259 63815 62755 61549 60922 61030 61334 61371 61298 61523 62098 62747 63236 63440 63246
65883 63246 62697 62153 61958 61990 61802 61165 60243 59256 58231 57073 55703 54214 53087 53053 54326 56075 57126
65866 57126 57215 57061 57191 57362 57387 57809 59155 60913 61951 61807 60970 59965 58860 57755 57109 57188 57511 57299
65848 57299 56354 55249 54723 55090 56120 57283 58106 58438 58399 58098 57501 56673 55966 55776 56160 56876 57754 58770
65830 58770 59760 60307 60151 59572 59183 59354 59957 60621 61069 61186 60966 60517 60049 59786 59878 60349 61001 61461 61544 61595
65810 61595 62211 63498 64836 65561 65613 65314 64886 64534 64710 65701 66999 67669 67371 66619 66046 65962 66571 67868
65792 67868 69078 69022 67558 66045 65747 66299 66449 65838 65172 64876 64602 64093 63661 63589 63766 64134 64841 65678 66020
65773 66020 65688 65278 65251 65269 64986 64919 65802 67339 68403 68420 67901 67500 67155 66488 65685 65510 66426 67915 68874
65754 68874 68700 67846 67166 66867 66485 65798 65233 65117 65055 64493 63569 62896 62690 62571 62100 61067 59367 57161
65736 57161 55138 54137 54366 55331 56571 58025 59616 60950 61656 61713 61270 60473 59585 58951 58592 58108 57192
65719 57192 56042 55076 54474 54169 54035 53915 53711 53670 54316 55877 57930 59811 61147 61831 61857 61470 61151 60999
65701 60999 60404 58830 56761 55264 54628 54115 53204 52493 52922 54475 56157 57126 57475 57833 58499 59126 59200 58715
65683 58715 58259 58360 58867 59202 59167 59145 59380 59442 58739 57393 56200 55733 55825 55986 56040 56179 56619 57415 58446 59365
65663 59365 59684 59217 58474 58341 59195 60459 61174 60906 59984 58992 58230 57673 57208 56827 56623 56684 56905 56986 56768
65644 56768 56548 56884 57983 59448 60710 61523 61951 62030 61684 60943 60070 59452 59402 59931 60641 60972 60650 59797 58514
65625 58514 56652 54244 51905 50392 49799 49583 49388 49407 49842 50443 50831 51014 51307 51918 52825 53866 54780 55326
65607 55326 55607 56051 56832 57473 57375 56623 55882 55545 55399 55224 55324 56163 57637 58998 59481 58876 57526 55964
65589 55964 54643 53896 53909 54589 55505 56205 56608 56913 57065 56633 55480 54233 53674 53797 53896 53558 53043 52667 52354
65570 52354 52047 51959 52014 51520 50037 48294 47577 48253 49474 50328 50684 50757 50606 50403 50685 51717 52914 53458
65552 53458 53374 53489 54322 55465 56166 56136 55664 55252 55333 56128 57533 59180 60661 61651 61928 61573 61117 61105 61391
65533 61391 61201 60187 59001 58448 58392 58094 57499 57473 58537 59909 60300 59373 57986 57110 56918 56978 56897 56546 55934
65514 55934 55187 54623 54523 54731 54700 54088 53241 52878 53388 54566 55969 57224 57987 58033 57630 57559 58340 59557 60316
65495 60316 60295 59961 59728 59405 58652 57597 56660 56019 55609 55501 55918 56817 57733 58154 57978 57567 57357 57385 57166
65476 57166 56212 54684 53351 52796 52873 53137 53535 54367 55642 56799 57107 56186 54269 52196 51063 51499 53113
65459 53113 54784 55538 55138 54050 53111 53082 54078 55362 55968 55594 54689 53765 53036 52693 53010 53957 55075 55992
65441 55992 56786 57675 58643 59581 60447 61051 61069 60573 60181 60288 60487 60214 59659 59429 59530 59399 58953 58874 59648 60903
65421 60903 62011 62861 63651 64282 64450 64194 63960 64133 64677 65157 65006 63938 62328 61018 60569 60776 61090 61329
65403 61329 61738 62511 63558 64644 65476 65721 65339 64922 65333 66787 68535 69645 69924 69965 70444 71567 73022
65386 73022 74221 74728 74707 74890 75851 77311 78497 79182 79982 81445 83199 84453 85162 86273 88694 92340
65370 92340 96257 99505 101842 103801 106238 109565 113243 116194 117837 118581 119137 119635 119726 119359 118968 118822
65354 118822 118566 117674 116187 114785 114153 114300 114514 113915 112156 109629 107044 104874 103151 101577 99683 97109
65338 97109 94021 91138 89027 87469 85781 83726 81721 80149 78943 77970 77391 77327 77487 77457 77124 76551 75678
65321 75678 74466 73163 72077 71231 70548 70219 70493 71177 71730 71904 71991 72410 73323 74660 76204 77633 78727
65304 78727 79536 80069 79877 78411 75889 73367 71704 70741 69726 68245 66498 64902 63742 63013 62347 61276
65288 61276 59846 58802 58823 59726 60722 61358 61773 62129 62248 61926 61227 60274 59085 57822 56948 56871 57524 58498
65270 58498 59420 60030 60043 59295 58043 56889 56273 56126 56072 55879 55659 55681 56008 56333 56212 55511 54558 53860 53688
65251 53688 54006 54683 55611 56638 57549 58225 58718 59092 59241 58978 58302 57503 56882 56369 55582 54370 53195 52785
65233 52785 53364 54450 55432 56094 56440 56385 55968 55680 56051 56872 57300 56872 56049 55551 55474 55320 54665 53521 52263
65214 52263 51477 51716 53052 54972 56908 58747 60564 62089 62866 62858 62460 61908 61145 60295 59790 59783 59790 59199 57923
65195 57923 56420 55260 54823 55168 55971 56745 57234 57491 57563 57439 57392 57935 59152 60372 60872 60669 60327 60158
65177 60158 59960 59444 58616 57805 57469 57787 58285 58170 57289 56426 56318 56726 56977 57035 57367 57959 58220 57873 57241
65158 57241 56597 55914 55392 55484 56101 56475 56204 55873 56152 56813 57211 57319 57650 58349 58977 59149 58945 58742 58960
65139 58960 59858 61211 62314 62671 62561 62616 62968 63211 63060 62550 61679 60418 59176 58742 59460 60726 61499 61217
65121 61217 60131 58971 58316 58137 57923 57370 56875 57099 58136 59444 60546 61429 62210 62860 63445 64260 65435
65104 65435 66660 67542 68103 68710 69672 71048 72663 74212 75481 76615 77938 79385 80401 80628 80454 80607
65088 80607 81433 82852 84797 87183 89485 90871 91024 90504 90064 89817 89384 88709 88324 88652 89303 89336 88187
65071 88187 86119 83737 81274 78540 75452 72368 69863 68262 67409 66818 66105 65319 64745 64325 63578 62321
65055 62321 61203 60998 61473 61567 60734 59504 58462 57393 55944 54569 54009 54095 53878 52981 52093 51958 52511 53350
65037 53350 54497 56155 58013 59357 59888 60065 60521 61326 61909 61645 60508 59167 58386 58341 58612 58815 58986
65020 58986 59271 59505 59375 58907 58526 58615 59141 59683 59752 59151 58199 57543 57600 58175 58693 58746 58322 57710 57373 57777
65000 57777 58978 60392 61295 61671 62235 63477 64955 65773 65578 64818 64171 64027 64486 65510 66886 68196 69001
64983 69001 69092 68630 68067 67815 67889 67936 67721 67424 67293 67177 66732 66031 65555 65511 65526 65170 64438 63561 62666 61890 61525
64962 61525 61675 61967 61930 61531 60991 60259 59121 57767 56787 56522 56781 57293 58020 58919 59793 60592 61526 62614
64944 62614 63411 63490 62969 62281 61591 60766 59798 58911 58245 57695 57100 56434 55822 55527 55852 56811 57935 58572 58451
64925 58451 57840 57234 57028 57414 58304 59297 59969 60322 60833 61925 63505 65057 66071 66316 65860 64997 64113 63434
64907 63434 62871 62170 61270 60454 60108 60362 60975 61557 61809 61589 60867 59815 58910 58763 59646 61176 62512 63012
64889 63012 62729 62303 62296 62649 62832 62506 61846 61225 60868 60975 61821 63273 64416 64209 62639 60759 59536 59050
64871 59050 58934 59011 59195 59300 59385 59907 61025 62079 62307 61840 61441 61482 61820 62513 63864 65611 66813 66827 65904
64852 65904 64583 63024 61241 59513 58105 56963 56082 55865 56619 57889 58819 59094 59105 59199 59258 59129 59061 59414
64834 59414 60128 60760 61004 60934 60718 60315 59569 58519 57399 56377 55468 54704 54173 53816 53483 53318 53719 54608
64816 54608 55021 53936 51462 48851 47391 47605 49286 51713 53841 54990 55559 56581 58360 60035 60683
64801 60683 60285 59376 58358 57618 57692 58647 59643 59763 59080 58336 57814 57167 56314 55823 56245 57473 58886 59864
64783 59864 60167 60023 59788 59408 58536 57394 57004 57952 59305 59655 59019 58778 59665 60858 61435 61725 62517 63605
64765 63605 64026 63463 62570 61916 61314 60409 59447 59083 59542 60287 60588 60286 59818 59497 59130 58559 58222 58652 59550
64746 59550 60043 59949 60126 61213 62610 63258 63068 62989 63827 65449 67060 67867 67554 66486 65453 64911 64535 63784
64728 63784 62749 62076 62087 62415 62575 62481 62224 61660 60527 58884 57280 56408 56595 57524 58483 58921 58819 58518
64710 58518 58400 58730 59577 60656 61440 61655 61539 61409 61234 60880 60542 60480 60489 60175 59680 59591 60058 60575 60817 61078
64690 61078 61573 61854 61402 60457 59725 59482 59500 59670 60145 60831 61276 61176 60622 59786 58721 57602 56758 56292 56015
64671 56015 55929 56418 57624 59021 60010 60697 61551 62423 62528 61531 60067 58945 58275 57784 57602 58189 59586 61276
64653 61276 62790 64049 64992 65381 65215 65025 65412 66419 67589 68488 68937 68882 68387 67796 67604 68010 68656 68919
64635 68919 68454 67524 66862 67086 68108 69137 69417 68947 68412 68465 69220 70341 71388 72073 72405 72689 73233 73995
64617 73995 74589 74692 74386 74150 74552 75762 77218 77988 77777 77413 77906 79094 79806 79443 78714 78530 78820 79044
64599 79044 79323 80200 81472 82172 81838 81072 80595 80400 80216 80183 80560 81138 81580 82068 82997 84094 84478 83783 82760
64580 82760 82450 83056 83864 84167 83957 83736 83900 84423 85098 85875 86840 87942 88971 89820 90558 91141 91374 91408 92003
64561 92003 93787 96289 98162 98570 98026 97722 98293 99465 100671 101644 102424 102991 103076 102410 101160 99951 99220
64544 99220 98703 97846 96674 95757 95201 94203 91995 88877 85906 83742 82204 80835 79452 78126 76952 75916
64528 75916 74839 73513 72074 71042 70721 70704 70370 69719 69288 69288 69332 69033 68383 67414 66070 64669 63984 64474
64510 64474 65663 66668 67110 67206 67141 66771 65955 64895 64011 63620 63776 64440 65643 67312 68873 69402 68558 67125
64492 67125 66155 65732 65242 64730 65052 66441 67849 68346 68381 68913 69914 70675 71142 71840 72683 72968 72633 72454
64474 72454 72704 72592 71527 70180 69683 70287 71326 72096 72233 71632 70555 69620 69226 69150 69050 69126 69855 71283
64456 71283 72987 74611 76013 77071 77777 78437 79355 80394 81179 81677 82100 82314 81884 80803 79689 79118 79206
64439 79206 80014 81849 84761 88071 90897 93051 95045 97297 99661 101727 103282 104383 105219 105964 106574
64424 106574 106742 106269 105620 105852 107699 110783 113978 116503 118403 119976 121127 121597 121633 121941 122875 123974
64408 123974 124487 124126 123123 121785 120315 119024 118283 118118 118054 117501 116231 114364 112050 109350 106386 103418
64392 103418 100705 98328 96202 94213 92346 90652 89136 87749 86546 85776 85614 85819 85849 85413 84776 84378
64376 84378 84363 84694 85519 87025 88932 90571 91676 92778 94550 96966 99398 101403 103028 104383 105331 105731
64360 105731 105741 105657 105645 105770 106170 106943 107897 108590 108759 108713 109240 110955 113663 116506 118868 121018 123665 127006
64342 127006 130581 133992 137283 140508 143461 146144 149057 152527 156065 158939 161233 163717 166701 169663
64328 169663 172177 174640 177683 181270 184865 188346 192282 197312 203535 210688 218665 227654 237835 249212
64314 249212 261905 276454 293537 313310 335291 359052 384797 413055 444027 477484 513016
64303 513016 549900 586738 621676 653003 679275 699054 711170 715373 712132 701630 683646 658830
64291 658830 629518 598552 567486 536433 505361 474873 445760 418460 393172 370013 348824
64280 348824 329123 310522 293080 277154 263016 250676 239874 230150 221042 212295 203870 195774
64268 195774 188068 180999 174959 170170 166404 163004 159192 154585 149598 145191 141964 139583 137314 135047
64254 135047 133455 133108 133741 134520 134810 134593 134286 134278 134571 134825 134855 134978 135698 137120 138933 140919 143072 145223
64236 145223 146989 148297 149526 150882 151981 152425 152437 152466 152415 151869 150999 150579 150899 151217 150646 149220 147673
64219 147673 146465 145549 144994 145249 146570 148544 150524 152392 154641 157666 161182 164473 167173 169769 173248
64204 173248 178163 184046 189883 195207 200591 206902 214247 221902 229292 236790 245423 255916 268184 281686
64190 281686 296125 311749 329041 348290 369561 393042 419146 448082 479439 512420 546410
64179 546410 581058 615700 648921 678770 703327 721079 731079 732964 726801 712910 691949 665141
64167 665141 634147 600555 565607 530437 496266 464150 434607 407546 382432 358617 335923
64156 335923 315039 296988 281968 269108 257539 247199 238192 229909 221589 213454 206431 200675 195151
64143 195151 188965 182470 176694 172145 168571 165544 162769 160002 157126 154348 152049 150403 149266 148368
64129 148368 147492 146484 145232 143679 141840 139855 137969 136391 135152 134254 133885 134351 135722 137648 139498
64114 139498 140624 140728 140265 140373 141963 144775 147607 149559 150808 152170 154280 157281 160929 164775 168529
64099 168529 172454 177218 183216 190172 197409 204156 209657 213524 216204 218654 221248 223429 224618 224971
64085 224971 224794 223855 221950 219750 218287 217671 217081 216065 215255 215754 218292 223029 229585 237048 244498 251857
64069 251857 259920 269365 280018 291236 302486 313266 322802 330350 335694 339001 340204 338913 335054
64056 335054 329430 323398 317870 312665 307027 300813 294933 290390 287146 284360 281611 279300 277771 276595
64042 276595 275113 273292 271619 270312 269023 267244 264730 261586 258186 255009 252333 250067 247898 245482
64028 245482 242479 238739 234739 231575 230064 229914 230118 230147 230372 231273 232715 234253 235778 237472 239311 241022
64012 241022 242544 244182 246186 248466 250886 253665 257221 261641 266528 271456 276424 281756 287711 294343
63998 294343 301653 309582 317812 325892 333785 342148 351776 362744 374421 386420 399234 413669 429838
63985 429838 447083 464897 483532 503591 525353 548829 574224 601912 631914 663784 697133
63974 697133 732078 769184 809305 853656 903686 960506 1024628 1096571 1177689 1270150 1376308
63963 1376308 1498506 1639468 1802337 1989965 2204283 2446430 2717136 3016582 3343894
63954 3343894 3696986 4072936 4468411 4879689 5302231 5730089 6155509 6569034 6960102
63945 6960102 7317978 7632907 7897248 8105943 8255826 8344345 8369000 8327941 8220803 8048987
63935 8048987 7815747 7526670 7189946 6815572 6413853 5994488 5566568 5138595 4717971
63926 4717971 4310540 3920810 3552510 3208822 2892205 2604132 2344945 2113895 1909456
63917 1909456 1729719 1572506 1435268 1315308 1210338 1118687 1038818 968919 907292 852965
63907 852965 805499 764115 727332 693561 661832 631884 603768 577491 552800 529169 506086
63896 506086 483408 461246 439510 417933 396745 376946 359423 343905 329201 314481 299978
63885 299978 286400 274080 262934 252923 244159 236584 229811 223418 217292 211634 206678 202531 199266
63872 199266 196985 195542 194257 192226 189143 185667 182786 180941 179991 179744 180062 180522 180488 179766 178803 178086
63856 178086 177629 177334 177487 178478 180139 181756 182719 182903 182371 181086 179096 176743 174358 171761 168403 164178
63840 164178 159880 156452 153839 151035 147420 143575 140406 137903 135397 132757 130524 128849 127138 125040
63826 125040 123086 121889 121225 120450 119418 118492 117922 117637 117404 116821 115442 113334 111157 109330 107500 105344
63810 105344 103430 102490 102201 101505 100023 98304 96754 95230 93815 93072 93208 93743 94329 95144 96093 96384 95538
63793 95538 94258 93648 93900 94331 94460 94470 94725 95340 96126 96608 96215 94776 92819 91148 90262 90265 90969 91819 92106
63774 92106 91668 91132 91052 91104 90647 89785 89253 89352 89613 89558 89216 88792 88381 88200 88590 89453 90079 89922 89334 89133
63754 89133 89556 90014 89950 89566 89471 89792 90024 89798 89446 89502 89922 90262 90581 91541 93441 95653 97365 98531 99673
63735 99673 101047 102485 103865 105229 106520 107686 109035 111062 113801 116676 119057 120691 121593 121815 121456
63720 121456 120709 119860 119294 119365 119975 120472 120289 119619 119101 118992 119069 119275 119906 121085 122566 124183 126006 127938
63702 127938 129632 131026 132461 134054 135434 136372 137129 137734 137476 135737 133027 130563 128974 127948 127013
63687 127013 126060 125150 124421 124210 124705 125393 125457 124912 124733 125573 126960 128229 129699 132150 135378 138077 139269
63670 139269 139188 138546 137557 136129 134594 133584 133212 132845 131872 130449 129377 129377 130434 131717 132160 131370 130051
63653 130051 129370 129900 131280 132819 134116 135140 136151 137672 140184 143546 147052 150300 153732 157966 162933
63638 162933 168071 173161 178488 184333 190814 198144 206499 215691 225480 236209 248493 262169 276286
63625 276286 290450 305564 322731 341851 361785 381373 399653 415416 427490 435704 440985 444237
63613 444237 445420 443974 439889 434146 428200 423116 419088 415710 412622 409779 406945 403242 397568 389508
63599 389508 379526 368262 356005 342924 329431 316027 303051 290821 279853 270552 262799 256159
63587 256159 250501 246104 243093 241143 239967 239833 241244 244193 248140 252687 257842 263454 268906 273816
63573 273816 278783 284785 291882 299153 306129 313670 322929 333827 345233 356543 368483 382177 397844
63560 397844 414640 431427 447274 461318 472539 479961 483104 482215 478062 471583 463785 455882 449193
63547 449193 444538 441728 439835 438012 435917 433385 429981 425100 418423 410041 400120 388620 375467 360996
63533 360996 346137 332013 319266 307684 296527 285176 273507 261784 250378 239653 229990 221708
63521 221708 214818 208879 203242 197576 192112 187202 182703 178046 173063 168461 165138 163111 161403 159099
63507 159099 156293 153935 152838 152963 153566 153912 153839 153595 153233 152409 150960 149469 148937 149870 151971 154707 157806
63490 157806 161115 164352 167251 169767 171924 173731 175449 177680 180738 184049 186570 187779 187941 187449 186340
63475 186340 184616 182627 180788 179130 177424 175683 174280 173585 173610 174043 174525 174920 175399 176319 178036 180764
63459 180764 184502 188892 193250 197007 200182 203271 206648 210373 214653 220039 226782 234237 241403 248044
63445 248044 254917 262903 272282 282905 294653 307479 321285 336055 352026 369514 388594 409098
63433 409098 430889 454088 479010 505733 533519 560660 585122 605422 620815 630817 635133 634284
63421 634284 629899 623937 617692 611650 606025 601037 596743 592921 589109 584624 578641 570445 559511 545428
63407 545428 528209 508952 489645 471612 454361 436601 418247 400678 385031 371117 358347
63396 358347 346926 337520 330206 324451 319904 316677 314883 314389 315097 317193 321016 326834 334674 344260
63382 344260 355161 367057 379748 392862 405858 418520 431175 444244 457874 472247 487901
63371 487901 505268 524028 543306 562287 580247 596165 608924 617908 623014 624192 621564 616104
63359 616104 609553 603310 597711 592519 587614 582922 578130 572910 567121 560387 551775 540389 526103 509307
63345 509307 490216 469147 447411 427102 409451 393839 378857 364065 350224 338037 327342
63334 327342 317712 309284 302551 297484 293247 288845 283865 278619 273677 269294 265156 260731 255993 251705
63320 251705 248724 247042 245881 244792 244250 244857 246376 248060 249809 252362 256214 260808 265074 268408 270795
63305 270795 272203 272355 271121 268853 266171 263529 260977 258199 254744 250440 245724 241489 238375 236137
63291 236137 233781 230445 226195 221985 218870 217250 216715 216455 215793 214580 213231 212301 211867 211382 210262 208524
63275 208524 206664 205085 203953 203564 204409 206602 209525 212312 214590 216524 218299 219869 221184 222372 223557
63260 223557 224683 225712 226933 228944 232263 236892 242259 247638 252704 257673 262895 268396 273878 279058
63246 279058 283934 288866 294549 301778 310909 321509 332792 344434 356739 369946 383780 397953
63234 397953 412788 428917 446419 464645 482877 500825 518470 535815 552882 569618 585687
63223 585687 600809 615509 631081 648351 666783 685266 703430 721568 739483 756341 771744
63212 771744 786022 798947 808881 813972 813896 809773 802620 792578 779543 763800 745848 726184 705479
63199 705479 684519 663786 643546 624560 608141 595079 584853 576424 569621 565329 564416 566986 572619
63186 572619 580874 591435 604062 618543 634495 651286 668490 686463 706009 727210 748955 769928
63174 769928 789814 809191 828511 847695 866550 884889 902014 916654 927911 936042 941857 945386
63162 945386 945545 941130 931840 918188 900773 879995 856406 830928 804491 777567 750338 723355
63150 723355 697742 674454 653420 633810 615222 598206 583468 570961 560205 551195 544343 539572
63138 539572 536127 533473 531856 531622 532403 533448 534483 535778 537456 539104 540067 539799 537962 534556 530041
63123 530041 525087 520135 515322 510774 506654 502878 499060 494955 490844 487361 484982 483694 483069 482642 482301
63108 482301 482325 482948 483939 484798 485367 485995 486961 487990 488644 489167 490584 493729 498290 503057 507097 510428 513409
63091 513409 515888 517368 517883 518167 518815 519790 521002 522910 526031 530059 533990 537135 539660 542185 545192
63076 545192 548894 553327 558413 564046 570175 576769 583770 591221 599322 608234 618010 628880 641334 655548
63062 655548 670972 686938 703541 721429 740799 761150 782137 804162 827984 854143 882878
63051 882878 914043 946845 980043 1012829 1045336 1078092 1111235 1144476 1177547 1210358 1242894
63040 1242894 1275192 1307414 1339743 1372292 1405072 1437919 1470421 1502111 1532646 1561513 1587533
63029 1587533 1608980 1624265 1632321 1632425 1624163 1607609 1583162 1551245 1512658 1469194 1423123 1375885
63017 1375885 1327990 1280414 1235155 1193861 1156606 1122803 1092767 1067586 1047852 1033342 1023717
63006 1023717 1018828 1018539 1022955 1032631 1047812 1067564 1090328 1115233 1142221 1171068 1201178 1232330
62994 1232330 1264646 1297593 1329885 1360828 1391126 1421842 1453022 1483730 1512907 1539689 1563107
62983 1563107 1582042 1595475 1602655 1603117 1596576 1582595 1560343 1529108 1489220 1442196 1389859 1333602
62971 1333602 1274577 1214051 1153191 1092828 1033722 976794 922781 871914 824236 779994 739376
62960 739376 702108 667690 635918 606803 580098 555336 532355 511427 492730 475976 460704
62949 460704 446718 434031 422495 411777 401739 392591 384522 377375 370923 365311 360798 357040 353125
62936 353125 348573 343879 339743 336091 332340 328304 324311 320584 317079 313794 310729 307613 304289 301293
62922 301293 299375 298380 297300 295569 293611 291922 290364 288687 287027 285456 283658 281552 279667 278351
62908 278351 277145 275535 273788 272405 271206 269733 268171 267019 266125 264955 263694 263146 263477 263954 264163
62893 264163 264620 265771 267057 267529 267073 266504 266668 267693 268972 269664 269427 268833 268881 269974 271548 272773 273329
62876 273329 273381 273114 272575 271780 270803 269875 269402 269639 270253 270559 270389 270352 270964 271882 272427 272544 272702 272928 272569
62857 272569 271201 269289 267653 266581 265747 264780 263531 261917 259941 257956 256522 255771 255138 254004 252520
62842 252520 251491 251463 252182 252953 253280 253076 252540 252076 252134 252854 253909 254885 255776 256902 258375 259962 261576
62825 261576 263586 266404 269860 273314 276405 279452 282907 286638 290053 292938 295731 298818 301912 304539
62811 304539 306909 309794 313566 317830 322133 326583 331550 337113 343064 349174 355279 361437 368263 376722
62797 376722 387211 399199 412133 426366 442658 461069 481104 502844 527152 554610 584966
62786 584966 617964 654188 694589 739544 788772 841945 898875 959168 1022000 1086302 1150964
62775 1150964 1214802 1276389 1333963 1385503 1429042 1463073 1486699 1499470 1501228 1492136 1472738 1443918
62763 1443918 1406829 1362757 1312842 1258031 1199528 1139139 1078711 1019178 960670 903709 849716
62752 849716 799914 754160 711468 671443 634512 600864 569964 541381 515428 492473 471999
62741 471999 452975 435093 419101 405795 395042 385966 377795 370303 363592 357775 352827 348592 344917
62728 344917 341923 340099 339965 341607 344629 348480 352689 356900 361066 365743 371928 380343 390964 403348
62714 403348 417215 432614 449710 468621 489324 511605 535368 561284 590823 625232 664566
62703 664566 708173 755959 808553 866091 927500 991379 1057133 1124665 1193100 1260336 1323886
62692 1323886 1381793 1432639 1475121 1507961 1530118 1540830 1539514 1525963 1500758 1465264 1420982
62681 1420982 1369033 1310523 1247313 1181957 1116640 1052402 989561 928603 870329 815401 764171
62670 764171 716899 673721 634359 598283 565260 535407 508596 484140 461393 440383 421580
62659 421580 405077 390292 376423 363082 350444 338900 328574 319172 310313 301960 294421 288000
62647 288000 282769 278689 275665 273359 271146 268461 265210 261777 258624 255925 253522 251190 248891 246661
62633 246661 244317 241540 238461 235872 234524 234286 234322 234079 233757 233829 234469 235530 236729 237764 238580 239625
62617 239625 241535 244422 247758 251055 254352 257914 261922 266687 272726 280237 288768 297806 307517 318592
62603 318592 331532 346467 363493 382775 404336 428034 453723 481183 510021 539917 570906
62592 570906 603062 635812 667748 697134 722505 742970 758275 768603 774050 774258 768726 757467
62580 757467 741122 720487 696257 669319 640915 612202 583739 555667 528342 502525 478805
62569 478805 457006 436444 416771 398336 381637 366736 353470 341984 332608 325230 319166 313734
62557 313734 308693 304134 300241 297146 294596 291806 288125 283892 280096 277052 274069 270672 267444 265193
62543 265193 263906 263117 262749 262914 263301 263584 264175 265779 268369 271336 274541 278472 283355 288876 294864 301636
62527 301636 309577 318974 330321 344085 360017 377326 395756 415913 438385 463196 490383 520438
62515 520438 553707 589811 628016 667735 708236 748221 786132 820689 850935 876115 895767
62504 895767 909582 916979 917322 910866 899013 883219 864028 841589 816576 789997 762406 734028
62492 734028 705525 677971 651989 627357 603515 580111 557132 534878 513900 494681 477273
62481 477273 461352 446510 432370 418643 405348 392826 381235 370241 359494 349222 339976 331960
62469 331960 324979 318870 313505 308535 303695 299349 296211 294456 293580 293189 293434 294491 296180 298364 301340
62454 301340 305399 310274 315391 320482 325655 330944 336158 341223 346415 352092 358221 364210 369241 372790
62440 372790 374784 375293 374256 371687 368004 363833 359381 354211 347733 339782 330761 321416 312610 305079
62426 305079 299197 294896 291805 289353 286843 283792 280375 277309 275068 273350 271564 269717 268488 268394 269217
62411 269217 270425 271939 274159 277271 280783 283913 286306 288273 290436 293261 296796 300669 304414 307967
62397 307967 311830 316531 321987 327602 332951 338023 342855 347299 351343 355255 359195 362995 366570 370232
62383 370232 374276 378530 382743 387226 392701 399544 407522 416219 425476 435587 447366 461811 479273
62370 479273 499116 520711 544601 572128 603906 639243 677020 716368 756244 795170 831964
62359 831964 866265 897859 925892 949360 968051 982431 992685 998500 999777 997013 990780 981171
62347 981171 967908 950839 930212 906683 881154 854496 827269 799670 771748 743732 716319
62336 716319 690606 667462 646786 627651 609352 592099 576398 562078 548360 534711 521115
62325 521115 507537 493769 480004 467062 455648 445670 436643 428551 421859 416751 412762 409283 406173
62312 406173 403715 402139 401337 400981 400821 400822 401043 401403 401665 401785 402222 403672 406363 409755 413115 416296 419726
62295 419726 423698 427963 432133 436147 440149 444112 447979 452075 456960 462726 468700 474105 478900 483806
62281 483806 489513 496048 502901 509611 516123 522667 529485 536860 545314 555474 567598 581404 596658
62268 596658 613815 633843 657401 684452 714633 747630 783113 820529 859063 897529 934211
62257 934211 967281 995721 1019618 1039287 1054312 1063852 1067724 1066743 1061951 1053853 1042397 1027299 1008209
62244 1008209 984899 957653 927469 895757 863863 832882 803686 776891 752757 731311 712590
62233 712590 696640 683217 671638 661203 651807 643923 637869 633256 629351 625817 622757 620162 617831
62220 617831 615894 614860 614846 615231 615481 615949 617290 619339 621254 622720 624300 626374 628404 629618 629958 629859
62204 629859 629396 628228 626327 624236 622529 621413 621022 621698 623592 626185 628630 630687 633057 636644 641703
62189 641703 647830 654559 661621 668734 675583 682177 688945 696327 704491 713580 723935 735839 749310
62176 749310 764453 781867 802329 826167 853132 882660 913897 945588 976401 1005292 1031299
62165 1031299 1053237 1070255 1082738 1092027 1099022 1103501 1104900 1103147 1098435 1090725 1080019 1066774 1051605
62152 1051605 1034878 1017046 999075 981911 965607 949478 933240 917602 903703 892227 883128
62141 883128 875892 869930 864888 860671 857172 854044 850829 847178 842929 838248 833898 831026 830317 831500
62127 831500 833996 837713 842761 848621 854227 858791 861997 863452 862755 860345 857617 855785 855019 854898 855054
62112 855054 854907 853322 849304 842956 835264 827019 818385 809375 800235 791350 783178 776244 770770 766289
62098 766289 762071 758039 754873 753056 752253 751842 751712 752210 753509 755423 757777 760606 763994 767933 772452
62083 772452 777735 784015 791376 799675 808647 818135 828303 839598 852403 866738 882328 898925 916481
62070 916481 934964 954057 973012 990738 1006058 1018040 1026179 1030381 1030736 1027347 1020360 1010144 997381
62057 997381 982861 967067 949886 930782 909342 885776 860985 836113 811906 788344 764977
62046 764977 741749 719462 699216 681379 665373 650585 637172 625714 616288 608402 601744 596446
62034 596446 592333 588435 583755 578379 573291 569056 565126 560700 555919 551817 549096 547246 545015 541627
62020 541627 537383 533060 528910 524473 519334 513787 508507 503750 499217 494712 490528 486958 483740 480299
62006 480299 476528 473007 470439 468996 468188 467228 465534 463108 460478 458115 455872 453084 449286 444652 439684
61991 439684 434621 429350 423773 418055 412427 406941 401537 396351 391790 388225 385636 383636 381814 380033
61977 380033 378407 377099 376178 375563 375061 374557 374188 374219 374664 375248 375876 376937 378834 381303 383628 385610 387950
61960 387950 391448 396078 401145 406176 411315 416856 422808 429081 435873 443567 452259 461667 471591 482279
61946 482279 494116 507028 520489 534186 548425 563702 580048 597021 614193 631365 648425
61935 648425 665367 682490 700216 718585 737157 755519 773576 791295 808577 825746 843837
61924 843837 863920 886214 910246 935883 963814 994978 1029824 1068316 1110395 1156239 1206214
61913 1206214 1260763 1320273 1384879 1454349 1528211 1606090 1688015 1774394 1865564 1961276 2060646
61902 2060646 2162630 2266237 2370047 2471625 2567812 2655683 2733002 2797754 2847616 2880212
61892 2880212 2893844 2887927 2862952 2820241 2761638 2689151 2604788 2510748 2409640 2304298 2197305
61881 2197305 2090738 1986269 1885296 1788877 1697656 1611999 1532129 1458052 1389388 1325541 1266189
61870 1266189 1211563 1162094 1117786 1078033 1042041 1009244 979329 952158 927859 906874 889633
61859 889633 876124 865859 858167 852465 848402 845976 845460 846958 850008 853755 857527 861074 864308 867030
61845 867030 868967 869875 869596 868192 866031 863566 861017 858457 856201 854825 854710 855888 858457 862890 869654
61830 869654 878670 889323 900829 912380 923049 931801 937691 940063 938743 934227 927574 919883 911836
61817 911836 903796 896254 890003 885836 884091 884473 886375 889513 894228 901028 909949 920645 933115 947936
61803 947936 965597 985929 1008386 1032590 1058380 1085706 1114821 1146312 1180506 1217083 1255695
61792 1255695 1296821 1341503 1390348 1443232 1500030 1561161 1627365 1699348 1777753 1863147 1955905
61781 1955905 2056354 2165023 2282460 2408837 2544116 2688603 2842787 3006517 3178673
61772 3178673 3357690 3541863 3728874 3915471 4097928 4272418 4434606 4579327 4701227
61763 4701227 4795644 4858793 4887718 4880905 4839056 4764840 4661819 4533721 4384489 4218474 4040322
61752 4040322 3854678 3665791 3477167 3291587 3111433 2938653 2774194 2617969 2469896
61743 2469896 2330722 2201303 2081427 1970063 1866676 1771497 1684416 1604469 1530760 1463202
61733 1463202 1401750 1345426 1292733 1242836 1195836 1152093 1111808 1075132 1042053 1012086 984522
61722 984522 959129 936188 915642 896596 878091 860198 843885 829732 817127 804935 792695
61711 792695 780801 769613 758886 748235 737749 727711 717969 708088 698112 688628 679920 671457 662486
61698 662486 652870 643048 633487 624475 616253 608943 602407 596401 590843 585759 581139 577077 573869 571592
61684 571592 569696 567424 564628 561803 559320 557043 554743 552415 549982 547120 543645 539740 535481 530401
61670 530401 523929 516025 507058 497273 486844 476405 467007 459374 453453 448707 444588 440748 437245 434711
61656 434711 433978 435272 438010 441513 445605 450221 454732 458118 459707 459446 457499 454001 449217 443554 437314
61641 437314 430694 424037 417778 412049 406699 401835 397939 395148 392808 390219 387599 385819 385233 385273 385218
61626 385218 384864 384298 383449 382267 381026 380075 379410 378840 378494 378765 379673 380574 380667 379685 377957 375910 373701
61609 373701 371337 368964 366861 365156 363775 362754 362361 362605 362721 361674 359388 357148 356365 357108 358224
61594 358224 358812 359123 359925 361497 363599 366171 369591 374138 379495 384995 390334 395823 401919 408649 415662
61579 415662 422730 429897 437143 444344 451782 460357 470921 483527 497682 513055 529499 546610 563996
61566 563996 582060 601770 623309 645483 666850 687001 706287 724724 741717 756634 769120
61555 769120 778971 786098 790592 792489 791736 788724 784584 780436 776530 772631 768881 765570 762261 758188
61541 758188 753591 749737 747241 745147 742100 737751 732546 726908 721317 716624 713394 711129 708813 706083
61527 706083 703418 701429 700552 701146 703215 706159 709476 713651 719719 728010 738027 749560 763204 779514
61513 779514 798305 819101 841876 867159 895755 928417 965305 1005721 1048954 1095515 1146879
61502 1146879 1203791 1265501 1331002 1400180 1473133 1548982 1626195 1703654 1780479 1855029 1924954
61491 1924954 1988365 2044329 2092190 2131109 2160489 2180386 2191287 2193922 2189514 2179794 2166546 2151277
61479 2151277 2135403 2120324 2107152 2096513 2088692 2083593 2080504 2078283 2076025 2073254 2069213 2062343 2050896
61466 2050896 2034001 2011908 1985317 1954726 1920399 1882709 1842577 1801703 1762244 1725910 1693287
61455 1693287 1664107 1638094 1615389 1596284 1581013 1569969 1563887 1563433 1568582 1578612 1592847 1611402
61443 1611402 1635108 1664756 1700336 1740852 1784470 1828623 1870059 1905175 1930817 1945191 1948358
61432 1948358 1941970 1928394 1909831 1888104 1865110 1843145 1824455 1810402 1801182 1796416 1795889 1799796
61420 1799796 1808547 1822466 1841455 1864529 1889388 1912452 1929515 1936830 1932079 1914804 1886198 1848585
61408 1848585 1804897 1758166 1711014 1665436 1622926 1584501 1550312 1519450 1490766 1464083 1440308
61397 1440308 1420161 1403133 1388040 1374288 1362179 1352130 1344228 1338718 1336429 1338242 1344269 1353888
61385 1353888 1366571 1382486 1402262 1426415 1455061 1488004 1524936 1565619 1609942 1657806 1708884
61374 1708884 1762605 1818388 1875669 1933501 1990237 2043943 2093151 2137032 2174867 2205751 2228993
61363 2228993 2244418 2251932 2250959 2240765 2221389 2194007 2160283 2121474 2078136 2030450 1978792 1924128
61351 1924128 1867887 1811434 1755696 1701315 1648935 1599033 1551656 1506634 1464019 1424017 1386549
61340 1386549 1351352 1318523 1288590 1261898 1238307 1217580 1199661 1184384 1171343 1160393 1151936
61329 1151936 1146349 1143392 1142538 1143584 1146575 1151354 1157732 1165899 1176129 1188009 1200502 1212916 1225384
61316 1225384 1238222 1251136 1263289 1273900 1282597 1289376 1294450 1298073 1300438 1301838 1302929 1304591 1307347
61303 1307347 1311011 1314970 1318624 1321574 1323630 1324883 1325604 1325869 1325347 1323577 1320398 1316040 1310896 1305349 1299626
61288 1299626 1293646 1287093 1279866 1272423 1265476 1259369 1254018 1249473 1246178 1244473 1244046 1244246 1244885 1246429 1249313
61273 1249313 1253314 1257770 1262202 1266430 1270105 1272422 1272489 1269952 1265285 1259586 1254142 1249998 1247689 1247283 1248760
61258 1248760 1252382 1258730 1268339 1281393 1297855 1317945 1342369 1371901 1406812 1446976 1492560 1544253
61246 1544253 1602502 1666864 1736381 1810201 1886961 1963434 2034458 2094661 2140083 2168288 2177984
61235 2177984 2169468 2145208 2109097 2064884 2015541 1963832 1912614 1864277 1820323 1781799 1749746
61224 1749746 1724915 1707352 1696677 1692578 1694451 1700243 1705921 1706532 1698134 1678912 1648796 1608601 1559937
61211 1559937 1505710 1449934 1396451 1347707 1304604 1267028 1234275 1205410 1179735 1156840 1136069
61200 1136069 1116381 1097294 1079672 1064883 1053243 1043862 1035914 1029250 1023636 1018238 1012396 1006390 1000924
61187 1000924 996173 991740 987239 982438 977039 970853 964094 957167 950231 943291 936562 930332 924488 918606
61173 918606 912573 906798 901691 897165 892777 888236 883639 879298 875403 871914 868765 866088 863975 861916
61159 861916 858737 853323 845338 835035 822612 808137 792054 775331 758882 743075 727963 713779
61147 713779 700906 689354 678549 667861 657266 647308 638345 630016 621588 612705 603577 594582 586041
61134 586041 578346 571827 566228 560669 554552 548360 543238 539806 537743 536533 536227 537235 539581 542660
61120 542660 545794 548906 552543 557273 563092 569405 575446 580593 584369 586422 586607 585021 581920 577718
61106 577718 573029 568487 564407 560765 557530 554821 552615 550579 548424 546305 544649 543615 542903 542086 541003
61091 541003 539851 538957 538489 538436 538845 539966 541979 544686 547721 551030 554857 559204 563652 567782 571533
61076 571533 575040 578460 581993 585688 589113 591650 593341 595044 597510 600702 604248 608046 612004 615731
61062 615731 619085 622647 627024 631936 636655 641080 645670 650448 654876 658830 662979 668020 674061 680959
61048 680959 688739 697435 706927 717213 728585 741347 755623 771564 789508 809896 833284 860360
61036 860360 891505 926153 963002 1001028 1040106 1080592 1122717 1166769 1213734 1265590 1324844
61025 1324844 1393472 1472022 1559773 1655968 1760879 1875872 2003258 2146816 2312175 2506191
61015 2506191 2736390 3011712 3343515 3745524 4234132 4830604 5562598 6461518 7557253
61006 7557253 8873052 10415077 12148427 13968844 15700902 17144965 18154298 18692716
60998 18692716 18838570 18744845 18588244 18524764 18647486 18947825 19303353 19515751 19389626 18809200
60988 18809200 17771606 16369594 14747105 13054539 11416574 9915274 8588960 7443663
60980 7443663 6468228 5644624 4952568 4372260 3886537 3480906 3142026 2857396 2616589
60971 2616589 2411659 2235911 2083108 1948252 1828317 1721684 1627182 1543770 1470407 1405759
60961 1405759 1348388 1297452 1252687 1213405 1177902 1144171 1110851 1077353 1043629 1010222 978121
60950 978121 948011 919730 892619 866155 840025 813958 787906 762293 737769 714797 693626
60939 693626 674463 657428 642479 629585 618878 610417 603908 598848 594950 592276 590906 590491 590198
60926 590198 589255 587670 586244 585648 585618 585384 584773 584435 584987 586336 587944 589338 590185 590293 589767 588862 587483
60909 587483 585128 581576 577324 573086 569090 565118 561026 556903 552833 548770 544609 540236 535578 530668
60895 530668 525619 520498 515422 510781 507034 504181 501717 499239 496778 494339 491475 487622 482703 477171
60881 477171 471663 466785 462915 459913 457226 454613 452641 452164 453436 455964 459037 462123 464942 467573
60867 467573 470439 473824 477350 480210 481940 482732 482965 482696 481812 480561 479678 479844 480959 482096 482329 481567
60851 481567 480432 479438 478609 477827 477093 476292 475146 473560 471649 469184 465496 460304 454250 448188 442268
60836 442268 436160 429835 423532 417266 411045 405458 401293 398443 395807 392471 388574 384891 381970 379866
60822 379866 378284 376760 374995 373192 371782 370724 369439 367588 365530 363744 362126 360212 357885 355557
60808 355557 353762 352871 353081 354356 356274 358131 359358 359931 360360 361229 362680 364405 366176 368169 370554
60793 370554 372967 374761 375802 376620 377780 379380 381244 383159 384757 385566 385511 385152 385148 385632 386282 386720 386611
60776 386611 385678 384042 382470 381843 382306 383148 383567 383352 382877 382684 383148 384275 385724 387080 388144 388775 388554
60759 388554 386971 384174 381264 379434 378801 378378 377271 375625 374245 373573 373339 373065 372484 371447 369859 367851
60743 367851 365745 363606 361104 358067 354907 352187 349954 347836 345663 343646 342069 341168 341197 342175 343622
60728 343622 344996 346356 348137 350276 352186 353677 355202 356871 357893 357551 356262 355020 354121 353063 351509
60713 351509 349609 347364 344390 340577 336459 332680 329414 326555 324143 322244 320607 318777 316598 314400
60699 314400 312636 311375 310180 308477 306093 303427 301082 299329 298009 296885 295958 295335 294928 294431 293702
60684 293702 293123 293433 295041 297522 299994 301970 303700 305646 307977 310680 313826 317359 320846 323820 326342
60669 326342 328825 331342 333439 334704 335205 335337 335568 336426 338386 341472 345172 348934 352660 356537 360573
60654 360573 364498 368026 371081 373807 376424 378973 381122 382342 382405 381560 380159 378343 376273 374403 373109
60639 373109 372112 370659 368353 365480 362430 359181 355639 352211 349628 348140 347184 345932 344010 341611 339124
60624 339124 336884 335189 334287 334190 334569 334885 334694 333829 332357 330429 328233 326101 324538 323962 324288 324919 325270
60607 325270 325287 325298 325407 325246 324406 322881 320938 318668 315907 312644 309338 306716 305232 304746 304717 304662 304334
60590 304334 303542 302065 300040 298261 297681 298480 299898 301142 302153 303276 304522 305548 306249 306912 307848 309213
60574 309213 311162 313790 316814 319674 322081 324220 326292 328190 329760 331152 332701 334707 337455 341158
60560 341158 345551 349807 353290 356358 360075 365083 371007 377011 382752 388732 395889 404935 415978 428712
60546 428712 443037 459507 479078 502484 529965 561563 597403 637464 681094 726794 772419
60535 772419 815478 853300 883116 902370 909334 903696 886630 860253 826979 789238 749523 710326
60523 710326 673740 640999 612360 587510 566158 548257 533732 522244 513502 507673 505115 505706
60511 505706 508817 514130 522118 533480 548472 567203 590302 618704 652759 691930 735282 781670
60499 781670 829240 875177 916320 949982 974199 987749 990393 983148 968128 948125 926265 905645
60487 905645 888869 877813 873842 878104 891428 913950 944830 982205 1023423 1065486 1105275 1139319
60475 1139319 1163672 1174772 1170804 1152049 1119921 1076147 1023102 964258 903510 843955 787481
60464 787481 735131 687296 643734 604061 568325 536820 509447 485686 465165 447739 432993
60453 432993 420176 408799 398918 390744 384359 379863 377268 375980 374867 373190 371156 369277 367525 365558
60439 365558 363519 362078 361710 362299 363528 365349 367955 371411 375438 379560 383384 386684 389189 390525 390630
60424 390630 390101 389750 389781 389768 389481 389293 389630 390453 391547 392917 394566 396248 397894 400047 403448 408300 414234
60407 414234 420813 427786 435104 443050 452131 462449 473376 484326 495662 508291 522460 537425
60395 537425 552323 566844 581021 594846 608237 621056 633052 644030 654059 663194 671167 677828
60383 677828 683749 689764 695771 700647 703582 704970 705783 706581 707486 708549 709619 710126 709552 708016 706103
60368 706103 704293 702852 701997 701773 701811 701588 700987 700382 700173 700331 700366 699632 697736 694686 690622 685555 679614
60351 679614 673423 667673 662208 656006 648403 639939 631666 623975 616504 608898 601119 593144 584879 576439
60337 576439 568149 560170 552343 544478 536678 529386 523078 517816 513050 508117 503005 498305 494285 490375
60323 490375 485847 480654 475268 470039 465143 460871 457447 454687 452286 450336 449164 448789 449003 449818 451350
60308 451350 453357 455470 457928 461489 466512 472578 479175 486208 493542 500458 505976 509615 511548 512100
60294 512100 511275 508761 504375 498467 491794 484932 477986 471023 464474 458769 453836 449418 445729 443246
60280 443246 441906 441077 440407 440139 440466 441163 442140 443830 446659 450502 455041 460406 467007 474851 483279 491389
60264 491389 498583 504912 511031 517744 525421 533866 542609 551070 558516 564355 568652 572092 575266 578244
60250 578244 580896 583292 585686 588487 592343 597835 604839 612641 621008 630702 642572 656475 671580
60237 671580 687446 704271 722282 741418 761666 783314 806736 832152 859600 888961 920122
60226 920122 953290 989053 1027899 1069848 1114810 1163097 1215057 1270129 1326736 1383354 1439467
60215 1439467 1495205 1550158 1602881 1651715 1695963 1736023 1772404 1804917 1832989 1856409 1875280
60204 1875280 1889465 1898695 1903315 1904470 1903379 1900843 1897592 1894543 1892403 1891486 1892274 1895681 1902407 1912449
60190 1912449 1925764 1943039 1965225 1992553 2024498 2060452 2099853 2141895 2185740 2230880 2276649
60179 2276649 2321499 2363470 2401520 2435735 2466064 2491378 2510042 2520965 2523819 2518613 2505475 2484670
60167 2484670 2456603 2421825 2381092 2335344 2285659 2233418 2180333 2128013 2077480 2029335 1984301
60156 1984301 1943279 1907018 1876070 1850944 1831833 1818225 1809266 1804559 1804136 1807725 1814595 1824153 1835933
60143 1835933 1848735 1860483 1869455 1875199 1877725 1876296 1869749 1857872 1841821 1823087 1802497 1780351
60131 1780351 1757203 1734211 1712791 1694059 1678620 1666844 1659223 1656396 1658951 1667428 1682477 1704753
60119 1704753 1734662 1772417 1818388 1873099 1936741 2008912 2088939 2176252 2270317 2370369 2475291
60108 2475291 2583604 2693466 2802855 2909847 3012603 3109144 3197333 3275102 3340559 3392005
60098 3392005 3428219 3448694 3453325 3442015 3415051 3373708 3319860 3254903 3179723 3095935 3006427
60087 3006427 2914205 2821134 2728207 2636551 2547740 2463421 2385127 2314115 2250955 2195501 2147676
60076 2147676 2108032 2077211 2055141 2041126 2034427 2034313 2039851 2050143 2064520 2082131 2101610 2121637
60064 2121637 2141498 2160593 2177689 2191242 2200175 2203791 2201349 2192544 2178185 2159511 2136839 2109636
60052 2109636 2077824 2042128 2003137 1961030 1916431 1870590 1824374 1777980 1732158 1688794 1649661
60041 1649661 1615256 1585529 1561049 1542583 1530036 1522774 1520794 1524728 1534828 1550812 1572775 1601449
60029 1601449 1637323 1679979 1728470 1781851 1839103 1898888 1959530 2019039 2075132 2125763 2169746
60018 2169746 2206474 2234863 2253088 2259767 2255076 2240293 2216493 2184203 2144296 2098672 2049804 1999811
60006 1999811 1950119 1901758 1855657 1812675 1773593 1739207 1710252 1687093 1669534 1657051 1649258
59995 1649258 1646161 1648105 1655665 1669568 1690432 1718388 1753050 1793932 1840803 1893519 1951604 2014135
59983 2014135 2079825 2146956 2213308 2276507 2334652 2386479 2430971 2467119 2494146 2511693 2519512
59972 2519512 2517258 2504974 2483624 2454692 2419194 2377560 2330631 2280355 2229198 2179136 2131554
59961 2131554 2087812 2049283 2016832 1990691 1970952 1957790 1951113 1950468 1955625 1967024 1985363 2010834
59949 2010834 2042890 2080503 2122443 2167499 2214687 2263205 2312039 2359812 2405174 2447169 2485093
59938 2485093 2518309 2546537 2570078 2589400 2604703 2616216 2624650 2630803 2634877 2636810 2637428 2638759 2643030
59925 2643030 2651667 2665374 2684808 2710981 2745250 2788987 2842901 2906516 2978579 3057975 3143875
59914 3143875 3234971 3329106 3423853 3516873 3605317 3685428 3753352 3806295 3842697 3861720 3863150
59903 3863150 3847587 3816226 3770474 3712142 3643905 3569024 3490537 3410902 3332270 3256561 3185137
59892 3185137 3118714 3057782 3002983 2955070 2914686 2882213 2857767 2841423 2833540 2834634 2844637 2862537
59880 2862537 2887218 2918577 2957407 3004138 3058168 3118401 3183874 3253499 3325551 3397822 3468120
59869 3468120 3534333 3594055 3644458 3682693 3706425 3714086 3704798 3678306 3635243 3577541 3508323 3431095
59857 3431095 3349020 3264952 3181736 3101865 3026783 2956845 2892004 2832227 2777287 2726790 2680758
59846 2680758 2639892 2604948 2576007 2552507 2533742 2519072 2507878 2499699 2494536 2492959 2495952 2504597
59834 2504597 2519650 2541194 2568832 2602249 2641358 2685787 2734493 2786077 2839207 2892358 2943295
59823 2943295 2989254 3027806 3057452 3077493 3087600 3087668 3078093 3060153 3035953 3007652 2976554 2943087
59811 2943087 2907703 2871397 2835023 2798425 2760748 2721530 2681037 2639577 2597072 2553536 2509585
59800 2509585 2466103 2423526 2381659 2340091 2298644 2257480 2217007 2177670 2139787 2103587 2069420
59789 2069420 2037872 2009592 1985088 1964850 1949603 1940307 1937760 1942222 1953500 1971471 1996505 2029361
59777 2029361 2070781 2121304 2181390 2251546 2332241 2423865 2526730 2640662 2764152 2893683
59767 2893683 3023753 3147237 3255774 3340640 3394502 3413251 3396655 3347951 3273232 3180769 3079495
59756 3079495 2976930 2878127 2786347 2704089 2632981 2573058 2522956 2481200 2447098 2420385 2400401
59745 2400401 2386001 2376140 2370229 2367900 2368772 2372649 2379799 2390728 2405737 2424938 2448684 2477578 2511860
59732 2511860 2551155 2595261 2645013 2701899 2766828 2839739 2920565 3010092 3109563 3219671 3340355
59721 3340355 3471508 3613621 3767677 3934510 4114103 4305188 4505289 4711172 4919284
59712 4919284 5125981 5327637 5520837 5702561 5870389 6022812 6159610 6281887 6391598
59703 6391598 6490962 6582062 6666628 6745919 6820807 6891893 6959315 7022417 7080047 7131444 7176692
59692 7176692 7216080 7249295 7275659 7295074 7308412 7316949 7321787 7323878 7324329 7324500 7325994 7330794 7341371
59679 7341371 7360508 7390843 7434400 7492414 7565532 7654209 7758827 7879474 8015701 8166541
59669 8166541 8330505 8505388 8688154 8875062 9061593 9242025 9409434 9556742 9677880
59660 9677880 9767707 9821163 9833399 9801288 9724642 9605846 9448788 9258493 9041348 8804928
59650 8804928 8557248 8306067 8058401 7819937 7594471 7383767 7187611 7003468 6826022
59641 6826022 6647589 6459870 6256111 6032571 5789017 5528555 5256882 4980986 4707777
59632 4707777 4443268 4192294 3958254 3742741 3545700 3366391 3204379 3059512 2931052
59623 2931052 2817249 2716022 2625881 2546049 2475879 2414482 2360823 2313806 2272128 2234283 2198879
59612 2198879 2164966 2132140 2100499 2070487 2042497 2016469 1991924 1968455 1946029 1924767 1904595
59601 1904595 1885204 1866217 1847308 1828314 1809376 1790916 1773379 1757021 1741938 1728093 1715138
59590 1715138 1702336 1688858 1674185 1658234 1641251 1623757 1606528 1590347 1575666 1562528 1550850
59579 1550850 1540709 1532335 1525831 1520968 1517423 1515400 1515889 1519920 1527437 1537175 1547913 1559629 1573197
59566 1573197 1589221 1607589 1628113 1651025 1676640 1704870 1735358 1767899 1802445 1838872 1877027
59555 1877027 1917002 1959121 2003631 2050586 2100032 2152104 2206902 2264524 2325359 2390098 2459141
59544 2459141 2531864 2606480 2680492 2751187 2815994 2872897 2920882 2959988 2990835 3014044 3029964
59533 3029964 3038722 3040465 3035576 3024593 3007675 2984311 2954003 2917346 2876001 2831343 2783524 2732240
59521 2732240 2678085 2622678 2567676 2514252 2463401 2416122 2373188 2335217 2303146 2278171 2261052
59510 2261052 2251870 2250695 2258188 2275355 2303011 2341599 2391088 2450727 2519180 2595161 2677687 2765459
59498 2765459 2856362 2947829 3037335 3122090 3198513 3262596 3310912 3341211 3352433 3344633 3318836
59487 3318836 3276574 3219519 3149690 3069847 2983282 2893323 2803187 2715945 2634055 2558863 2490902
59476 2490902 2430686 2378967 2336403 2303353 2279916 2265764 2260000 2261584 2269835 2284085 2302872 2324068
59464 2324068 2346000 2367996 2389607 2409668 2426443 2438438 2444746 2444706 2437477 2422059 2397741 2364575
59452 2364575 2323339 2275038 2220679 2161641 2099795 2036725 1972999 1908725 1844654 1782084 1721745
59441 1721745 1663486 1607275 1553774 1503625 1456769 1412827 1371629 1332992 1296551 1262364 1231213
59430 1231213 1203663 1179147 1156749 1136712 1120440 1108890 1101581 1097416 1096068 1098218 1104661 1115316
59418 1115316 1128917 1143382 1156439 1166109 1171000 1170744 1166453 1160525 1155602 1153629 1155860 1163249 1176097
59405 1176097 1193144 1211428 1227420 1238447 1243317 1242184 1236271 1227635 1218680 1211449 1207059 1205841 1208052
59392 1208052 1214367 1225505 1241473 1261493 1284778 1311139 1340718 1373466 1409191 1447993 1490322
59381 1490322 1536596 1586898 1640948 1698233 1758232 1820668 1885401 1951910 2019022 2085485 2150768
59370 2150768 2215191 2279476 2344557 2411840 2483233 2560627 2645470 2738889 2842128 2956669 3083902
59359 3083902 3224616 3378647 3544840 3721293 3905699 4095555 4288201 4480690 4669583
59350 4669583 4851053 5021438 5177882 5318428 5441614 5546176 5631205 5696374 5741895 5768270
59340 5768270 5775867 5764425 5732974 5680567 5607040 5512741 5397719 5262059 5107412 4937524 4756697
59329 4756697 4568110 4374126 4177733 3982809 3792940 3610532 3436949 3272882 3118393
59320 3118393 2973113 2836678 2708915 2589826 2479660 2378915 2287844 2206008 2132652 2067408
59310 2067408 2010343 1961501 1920751 1887643 1860654 1836676 1812248 1785634 1757312 1728472 1699857
59299 1699857 1672204 1646804 1624865 1606694 1591995 1580572 1572204 1566299 1562296 1560214 1560278 1562176 1565200
59286 1565200 1569071 1574098 1580570 1588504 1598093 1609945 1624641 1642291 1662687 1685674 1711150 1738738
59274 1738738 1767640 1796834 1825389 1852607 1877846 1900180 1918212 1930259 1934966 1931975 1922077 1906406
59262 1906406 1885332 1858341 1825209 1786996 1745449 1701664 1655878 1608508 1560668 1513458 1467319
59251 1467319 1422418 1379216 1338297 1300012 1264646 1232577 1203808 1177628 1153222 1130531 1110112
59240 1110112 1092304 1076960 1063932 1053384 1045538 1040306 1037220 1035575 1034789 1034821 1036160 1039284 1044316 1051339
59226 1051339 1060718 1072719 1087062 1103286 1121421 1141819 1164421 1188810 1215050 1244019 1276702
59215 1276702 1313554 1354770 1400842 1452523 1510378 1574637 1645463 1723308 1808988 1903274 2006202
59204 2006202 2116897 2234348 2358232 2488408 2623392 2759749 2893264 3020340 3137938
59195 3137938 3242543 3329944 3396271 3438982 3456850 3449470 3417173 3361359 3284622 3190419 3082602
59184 3082602 2965112 2841797 2716207 2591396 2469846 2353487 2243781 2141854 2048650 1964931
59174 1964931 1891048 1826790 1771587 1724870 1686106 1654573 1629415 1610044 1596292 1588014 1584695 1585587
59162 1585587 1590011 1597343 1606781 1617373 1628132 1637901 1645269 1648997 1648632 1644489 1637031 1626434 1612753
59149 1612753 1596215 1577289 1556657 1535169 1513585 1492308 1471543 1451741 1433644 1417812 1404395
59138 1404395 1393470 1385253 1379700 1376211 1374203 1373931 1376356 1382050 1390458 1400304 1410574 1420999 1431822
59125 1431822 1443240 1454999 1466342 1476365 1484451 1490397 1494162 1495700 1495115 1492760 1488921 1483496 1476275
59112 1476275 1467522 1457947 1447970 1437348 1425810 1413866 1402591 1392626 1383715 1375290 1367214 1359792 1353321
59099 1353321 1347907 1343628 1340551 1338515 1337083 1335975 1335587 1336887 1340586 1346371 1353193 1360334 1368015 1376889
59085 1376889 1387340 1399515 1413632 1429687 1446966 1464476 1481897 1499577 1517424 1534360 1549123
59074 1549123 1561125 1570200 1576011 1578214 1576901 1572315 1564249 1552212 1536184 1516883 1495292 1472165
59062 1472165 1447957 1422941 1397440 1372052 1347496 1324048 1301377 1279149 1257511 1236683 1216481
59051 1216481 1196729 1177772 1159858 1142209 1123553 1103639 1083494 1064006 1045025 1026285 1008430
59040 1008430 992427 978358 965521 953582 942992 934161 926783 920194 914055 908396 903212 898393 893981
59027 893981 890141 886723 883170 879175 875227 872071 869699 867436 865137 863634 863616 864669 866030 867797 870598
59012 870598 874303 878064 881619 885677 890805 896687 902785 909017 915441 921954 928826 936960 947058 958926
58998 958926 972116 986883 1003931 1023512 1045309 1069040 1094694 1122422 1152680 1186308 1223903
58987 1223903 1265176 1309314 1355835 1404549 1454757 1504982 1553568 1599213 1640967 1678084 1709830
58976 1709830 1735032 1751963 1759249 1757008 1746723 1729944 1707559 1680326 1649447 1616233 1581539 1545878
58964 1545878 1509869 1474334 1440159 1408241 1379321 1353648 1330927 1310750 1292943 1277407 1263936
58953 1263936 1252408 1242937 1235542 1229757 1224883 1220612 1217311 1215673 1216146 1218569 1222275 1226769 1232428 1240330
58939 1240330 1251126 1264205 1278264 1292586 1307464 1323468 1340826 1359688 1380517 1403788 1429532
58928 1429532 1457698 1488955 1524663 1565863 1612656 1664819 1722682 1786800 1856722 1930354 2004583
58917 2004583 2076240 2142541 2201183 2250536 2289873 2319467 2340699 2356140 2369081 2382520 2398564
58906 2398564 2418772 2444686 2477593 2517964 2565560 2620077 2681389 2749285 2823494 2904118 2991766
58895 2991766 3087042 3190067 3300542 3418013 3541943 3671634 3806031 3943298 4080449 4213607
58885 4213607 4338809 4452687 4552741 4637557 4706911 4761325 4801315 4827262 4839913 4840415 4829579
58874 4829579 4807593 4774817 4732363 4681239 4621227 4551368 4471636 4383547 4289040 4189296 4084903
58863 4084903 3976633 3865630 3753069 3640048 3527634 3416616 3307179 3199181 3092829
58854 3092829 2988963 2888566 2792159 2699681 2610879 2525743 2444603 2367932 2296047 2228958 2166422
58843 2166422 2108128 2053866 2003598 1957401 1915350 1877494 1843950 1814882 1790210 1769313 1751255
58832 1751255 1735392 1721652 1710188 1700981 1694094 1690157 1690110 1694222 1701606 1711029 1722114 1735511 1751875
58819 1751875 1771069 1792521 1815967 1841376 1868203 1895231 1921456 1946937 1972529 1998904 2026108
58808 2026108 2053972 2082630 2112606 2144669 2179737 2218725 2262276 2310692 2364182 2423084 2487776
58797 2487776 2558456 2635085 2717412 2805032 2897605 2995116 3097655 3204749 3315049 3426825
58787 3426825 3538558 3648814 3755863 3857918 3953726 4042451 4122907 4193149 4250885 4294047
58777 4294047 4321094 4331273 4324760 4302170 4263843 4209983 4141565 4060622 3969375 3869566 3762894
58766 3762894 3651505 3537445 3421966 3305931 3190555 3077077 2965906 2856897 2750519
58757 2750519 2648085 2550665 2458349 2370717 2287465 2208350 2133092 2061768 1994988 1933318 1876778
58746 1876778 1825029 1777704 1734343 1694415 1657741 1624562 1594853 1567912 1543041 1520298 1500156
58735 1500156 1482630 1467261 1453782 1442332 1433149 1426657 1423771 1425499 1432141 1443409 1459514 1481406
58723 1481406 1509395 1541737 1575036 1605784 1631125 1648382 1654808 1648439 1629128 1598454 1558683 1512056
58711 1512056 1460879 1407601 1354241 1301795 1250593 1201258 1154977 1112774 1074953 1041499 1012720
58700 1012720 989163 971127 958623 951664 950176 953724 961719 973876 989930 1008745 1028085 1045448
58688 1045448 1058676 1065593 1063724 1051359 1028973 999091 964578 927443 889258 851869 816952 785156
58676 785156 756433 731227 710583 694779 682450 671675 661695 653060 646306 641087 636620 632344 627905
58663 627905 623016 617681 612326 607378 602946 599062 595992 593988 592944 592617 593000 594158 595874 597847 600141
58648 600141 603021 606334 609413 611606 612515 611705 608745 603928 598634 594487 592109 590932 590159 589614 589619 590426
58632 590426 592024 594325 597158 600091 602606 604628 606610 608856 611000 612546 613846 616045 619940 625199
58618 625199 630885 636415 641795 647266 653120 659775 667663 676901 687148 697789 708343 718922 730351
58605 730351 743585 758875 775678 793490 812449 832938 855008 878533 903678 930789 959943
58594 959943 991015 1024023 1058938 1095101 1131230 1166160 1199386 1230809 1260098 1286394 1308617
58583 1308617 1326140 1339167 1348212 1353114 1352944 1347115 1336226 1321492 1303699 1283259 1260943 1237852
58571 1237852 1214666 1191506 1168555 1146209 1124544 1103185 1081900 1060917 1040513 1020700 1001470
58560 1001470 982944 965115 947767 930790 914244 897991 881684 865224 848858 832632 816185
58549 816185 799296 782316 765879 750513 736719 724950 715130 706489 698249 690342 683267 677502 673267
58536 673267 670554 668993 667863 666471 664424 661401 656944 650750 642969 634018 624262 614045 603772 593736
58522 593736 584121 575392 568322 563171 559163 555236 551238 547906 545819 544895 544945 546067 548138 550345 551795
58507 551795 552522 553537 555779 559351 563923 569512 576374 584278 592442 600445 608756 618039 628227 638650
58493 638650 648755 658200 666482 673025 677594 680154 680514 678702 675522 671965 668045 663011 656861 650743
58479 650743 645532 640806 635743 630315 625051 620222 615918 612406 609758 607522 605406 603859 603302 603142 602292
58464 602292 600442 598085 595520 592585 589283 585897 582415 578509 574145 569691 565333 560932 556491 552326
58450 552326 548743 545967 544307 543861 544069 544122 543831 543588 543518 543371 543289 543878 545186 546335 546675 546819 547993 550631
58432 550631 554068 557352 559955 561896 563657 565957 569191 573009 576717 580153 583911 588532 593643 598159
58418 598159 601444 604074 607186 611158 615273 618785 621875 625263 629220 633438 637691 642095 646709 651311
58404 651311 655698 659902 664115 668670 674023 680311 686865 692563 696790 699812 702206 704325 706482 709191
58390 709191 712916 717728 723397 729628 736083 742401 748408 754237 760105 766067 771988 777665 783002 788199
58376 788199 793696 799738 806013 811961 817370 822410 827186 831628 835840 840204 845059 850557 856859 864048
58362 864048 871774 879348 886394 893186 900208 907690 915664 924153 933107 942355 951797 961451 971252 981090
58348 981090 991108 1001635 1012632 1023582 1034153 1044743 1056022 1068084 1080266 1091735 1102120
58337 1102120 1111740 1121377 1131695 1142736 1154079 1165576 1177659 1190747 1204582 1218476 1232153 1246082
58325 1246082 1260993 1277218 1294540 1312561 1331175 1350725 1371687 1394170 1417751 1441798 1465954
58314 1465954 1490336 1515374 1541424 1568409 1595781 1622880 1649315 1674962 1699663 1723128 1745213
58303 1745213 1766205 1786713 1807133 1827176 1846128 1863798 1881115 1899487 1919582 1941170 1964163
58292 1964163 1989180 2016706 2046165 2076410 2106909 2138057 2170563 2204949 2241423 2279715 2319223
58281 2319223 2359792 2402120 2446935 2493976 2542463 2592406 2644687 2699688 2756501 2813766 2870875
58270 2870875 2928179 2986424 3046250 3108015 3171882 3238016 3306597 3377599 3450871 3526603 3605285
58259 3605285 3686843 3770331 3855000 3941350 4030570 4123406 4220220 4321676 4428499 4540842 4658689
58248 4658689 4782608 4913212 5050238 5193242 5343008 5501166 5668557 5845040 6030774
58239 6030774 6226433 6432181 6647744 6873735 7111756 7363051 7628262 7908673 8206313
58230 8206313 8522532 8857823 9213540 9592546 9997705 10430873 10893958 11389913 11922333
58221 11922333 12495119 13112856 13780506 14502741 15285057 16135621 17064382 18080229 19190868
58212 19190868 20405779 21737344 23199168 24806611 26580907 28551486 30754188 33230360
58204 33230360 36029342 39210033 42840048 46997766 51778514 57298707 63697329 71142440
58196 71142440 79841532 90041984 102018280 116057799 132438003 151357109 172805622
58189 172805622 196439835 221538747 247047714 271638280 293753999 311711099 323929295
58182 323929295 329253434 327224262 318176328 303141467 283614577 261262473 237655037
58175 237655037 214081816 191477789 170436370 151268612 134077188 118827301 105403037
58168 105403037 93645402 83377322 74421612 66611993 59796661 53838572 48616647 44026851
58160 44026851 39980880 36403904 33233343 30417388 27911927 25677910 23681151 21892936
58152 21892936 20289059 18848173 17551313 16382034 15325697 14368585 13498064 12703149
58144 12703149 11974313 11303114 10682584 10107571 9574074 9078387 8617270 8188488 7790421
58135 7790421 7421125 7078080 6758734 6460899 6182711 5922517 5678845 5450312 5235538
58126 5235538 5033210 4842127 4661183 4489442 4326268 4171259 4024103 3884552 3752267
58117 3752267 3626411 3505712 3389459 3278346 3173712 3075854 2983576 2895445 2810941 2730246
58107 2730246 2653419 2580106 2509689 2441477 2374997 2310303 2247854 2188024 2130950 2076815 2025832
58096 2025832 1977900 1932646 1889918 1849862 1812440 1777329 1744448 1714091 1686224 1659945 1633982
58085 1633982 1607535 1580499 1553129 1525771 1498724 1472093 1445810 1419829 1394197 1368863 1343644
58074 1343644 1318423 1293234 1268168 1243457 1219613 1197082 1175679 1154680 1133648 1112861 1092840
58063 1092840 1073782 1055624 1038337 1021876 1006052 990632 975447 960256 944762 928950 913254
58052 913254 898228 884160 871043 858699 846832 835186 823754 812639 801681 790578 779568
58041 779568 769604 761425 754614 747917 740518 732698 725205 718293 711545 704525 697300 690220 683399 676686
58027 676686 670062 663664 657295 650416 642918 635565 629200 623833 619038 614968 612180 610507 609021 607360
58013 607360 606274 606388 607128 607602 608102 609880 613595 618678 624357 630708 638416 647784 658317 669223 680260
57998 680260 692109 705792 721641 738875 756367 773767 791769 811399 833271 857458 883778
57987 883778 912007 942014 973918 1008170 1045333 1085618 1128596 1173440 1219504 1266531 1314173
57976 1314173 1361465 1406909 1449003 1486317 1517078 1539047 1550185 1549416 1536684 1512512 1477805 1434071
57964 1434071 1383548 1328826 1272213 1215376 1159466 1105456 1054240 1006500 962651 922931 887421
57953 887421 855918 828059 803691 782957 765904 752255 741698 734085 729002 725401 722123 718711
57941 718711 715381 712329 709468 706718 704032 701190 698028 694806 691854 688895 685433 681925 679856 680203
57927 680203 682419 685396 689112 694851 704065 717334 734166 753372 773742 794670 815990 837020
57915 837020 856023 870912 880340 883936 881747 873839 860345 841642 818551 792428 764774 736476
57903 736476 707699 678769 650828 625189 602179 581054 560989 541834 523945 507523 492237
57892 492237 477402 462653 448473 435759 424706 414485 404304 394422 385692 378399 372106 366471
57880 366471 361613 357653 354451 351973 350540 350479 351782 354206 357540 361675 366500 371735 376835 381236 384911
57865 384911 388527 392784 397652 402454 406457 409100 409876 408578 405680 402055 398171 393839 388783 383092
57851 383092 377072 370955 364911 359124 353783 349144 345541 343110 341564 340544 340081 340366 341189 342133 343369
57836 343369 345660 349305 353518 357175 359885 362051 364164 366397 368699 370950 373084 375285 378027 381754
57822 381754 386499 391814 396920 400944 403307 404103 403937 403245 402003 400325 399112 399763 403204 409375 417597
57807 417597 427291 438375 451193 466206 483720 503880 526796 552476 580575 610308 640687 670728
57795 670728 699326 725049 746272 761618 770306 772219 767722 757371 741727 721394 697157 669996
57783 669996 640976 611190 581702 553337 526427 500809 476100 452080 428995 407560 388428
57772 388428 371464 355782 340766 326786 314540 303951 294324 285408 277616 271086 265312 260005 255638
57759 255638 252676 250791 249322 248145 247501 247321 247287 247349 247622 247942 248062 248208 248926 250480 252830 255969 259656
57742 259656 262984 265122 266645 269302 274042 279861 285100 289374 293659 298834 304784 310867 316675 322125
57728 322125 327135 331395 334507 336356 337343 337996 338289 337624 335688 333003 330324 327773 325020 322107 319567
57713 319567 317677 316093 314368 312542 311084 310598 311615 314280 317967 321520 324214 326358 328769 331805
57699 331805 335131 338250 341005 343666 346766 350738 355518 360636 365971 372199 380127 389660 399978 410752
57685 410752 422660 436427 451899 468547 486577 507040 530948 558841 591201 628770 672322
57674 672322 722597 780760 848566 927687 1018909 1121963 1235317 1355110 1473986 1581638
57664 1581638 1667461 1723666 1747116 1739595 1707015 1657671 1599769 1539320 1479552 1421748 1366290
57653 1366290 1313192 1262345 1213739 1167349 1122748 1079135 1036127 994347 954866 918047 883289
57642 883289 849977 818296 788943 762347 738463 717139 698259 681574 666679 653321 641525
57631 641525 631367 622806 615837 610574 606980 604631 603002 602045 602263 604123 607476 611724 616560 622394
57617 622394 629973 639652 651191 664189 678568 694570 712442 732262 753946 777282 801944 827621
57605 827621 854072 880942 907532 932913 956315 977281 995465 1010473 1021991 1029872 1033912 1033616
57593 1033616 1028437 1018239 1003455 984767 962840 938409 912363 885417 857640 828603 798233
57582 798233 767434 737613 709546 682923 657163 632399 609390 588597 569722 552269 536198
57571 536198 521713 508580 496053 483605 471570 460826 451856 444221 437046 429960 423393 417905 413419
57558 413419 409370 405528 402304 400134 398838 397864 396997 396492 396537 396949 397465 398061 398825 399751 400843 402265 404120
57541 404120 406176 408042 409653 411380 413639 416532 419896 423539 427317 431132 434982 439087 443958 450347
57527 450347 458879 469469 481170 493002 505049 518366 533563 549853 565970 581784 598455 617002
57515 617002 637299 658645 680746 703718 727446 751426 775145 798256 820394 841068 859746
57504 859746 875878 888936 898696 905384 909192 909647 905775 897085 884166 868216 850215 830719 810233
57491 810233 789394 768758 748630 729194 710662 693166 676528 660306 644162 628199 612906
57480 612906 598835 586425 576021 567840 561767 557311 553894 551174 549059 547627 547180 548184 550905 555089
57466 555089 560258 566250 573235 581208 589822 598890 608835 620403 634015 649459 666126 683441 701213
57453 701213 719709 739271 759769 780533 800983 821173 841510 861942 881615 899337 914264
57442 914264 926162 935145 941222 944015 942921 937624 928492 916418 902287 886652 869800 851894 832982
57429 832982 813125 792718 772538 753260 734932 717181 699898 683452 668153 653838 640339
57418 640339 628100 617891 609803 602953 596397 590073 584617 580401 577107 574180 571398 568929 566977 565489
57404 565489 564144 562664 561135 559954 559349 559113 558991 559204 560273 562334 564883 567292 569349 571221 573181
57389 573181 575519 578509 582165 586129 589973 593598 597221 601095 605393 610229 615563 621054 626278 631177
57375 631177 636147 641571 647427 653471 659648 666069 672648 679062 685159 691116 697036 702704 708048 713606
57361 713606 720024 727133 734069 740428 746715 753406 760116 766166 771564 776793 781922 786675 791283 796528
57347 796528 802707 809114 814828 819684 824294 829459 835655 842693 849669 855649 860655 865723 871801 878941
57333 878941 886695 894804 903185 911614 919896 928123 936453 944907 953685 963301 973914 984825 995228
57320 995228 1005352 1016266 1028536 1041595 1054518 1066908 1078892 1090651 1102310 1114069 1126199
57309 1126199 1138910 1152249 1166014 1179806 1193341 1206718 1220239 1234084 1248380 1263474 1279710
57298 1279710 1296872 1314180 1331037 1347620 1364583 1382320 1400601 1418855 1436767 1454710 1473445
57287 1473445 1493163 1512876 1531087 1547129 1561572 1575309 1588648 1601518 1614114 1626756 1639212
57276 1639212 1650643 1660427 1668803 1676497 1683909 1690953 1697602 1704235 1711271 1718663 1726052 1733306 1740585 1747963
57262 1747963 1755379 1763095 1771749 1781656 1792274 1802749 1812859 1823140 1834207 1846188 1858737 1871283
57250 1871283 1883384 1895075 1906840 1919042 1931570 1944277 1957471 1971449 1985769 1999535 2012522
57239 2012522 2025462 2039125 2053525 2068128 2082375 2095829 2108289 2120049 2131742 2143689 2155700
57228 2155700 2167694 2180085 2193244 2206907 2220494 2233798 2247007 2260211 2273202 2285712 2297668
57217 2297668 2309316 2321165 2333498 2345837 2357312 2367824 2378359 2389616 2400731 2410107 2417450 2424269
57205 2424269 2432234 2441593 2451376 2460614 2469048 2477026 2485148 2493804 2502767 2511321 2519036 2526263 2533728 2541743
57191 2541743 2550025 2558072 2565438 2571805 2577216 2582250 2587527 2592921 2597706 2601684 2605706 2610605 2615939 2620505
57177 2620505 2623976 2627191 2630689 2633813 2635887 2637578 2640172 2643800 2647318 2649990 2652384 2655332 2658738 2661889
57163 2661889 2664427 2666557 2668543 2670397 2671869 2672485 2671882 2670313 2668511 2666824 2664913 2662639 2660784 2660325 2661226
57148 2661226 2662533 2663551 2664503 2666119 2669014 2673387 2678900 2684874 2690911 2697266 2704326 2711980 2719935 2728421
57134 2728421 2737954 2748458 2759211 2769692 2779894 2789834 2799452 2809165 2819876 2832117 2845757 2860840
57122 2860840 2878124 2898392 2921740 2948015 2977514 3010643 3047310 3087382 3131602 3181420 3237918
57111 3237918 3301529 3372921 3453711 3546134 3652456 3774914 3915936 4078171 4264583 4478963
57101 4478963 4726508 5013922 5349018 5740342 6197234 6730359 7352131 8076370 8917098
57092 8917098 9887192 10997397 12255342 13664036 15220231 16913361 18724931 20627814
57084 20627814 22585800 24554515 26483875 28320793 30011195 31502058 32744610 33698320
57076 33698320 34334113 34635778 34599927 34235313 33561786 32608865 31413888 30019772 28472379
57067 28472379 26817689 25099405 23357422 21626921 19937596 18313048 16770846 15323281
57059 15323281 13978081 12738635 11604298 10571431 9634764 8788064 8024124 7335125 6713667
57050 6713667 6153483 5649062 5194936 4785748 4416922 4084816 3786208 3517948 3277261
57041 3277261 3062120 2871172 2703441 2558193 2434833 2332780 2251666 2191716 2153222 2134298
57031 2134298 2128176 2122891 2104790 2063926 1997592 1909859 1808370 1701073 1594472 1493069 1399310
57020 1399310 1313917 1236610 1166846 1104098 1047818 997419 952232 911418 873994 839191 806724
57009 806724 776612 748788 723072 699383 677695 657766 639181 621688 605301 590032 575799
56998 575799 562651 550770 540097 530227 520913 512382 504880 498144 491781 486078 481949 479973 479787 480519
56984 480519 481557 482751 484167 485862 487708 489103 488970 486321 480923 473360 464566 455423 446677 438897
56970 438897 432315 426791 422027 417824 414230 411613 410573 411594 414593 418910 423930 429731 436942 445897
56956 445897 455934 465637 473674 479337 482298 482183 478624 471726 462245 451249 439750 428623 418563
56943 418563 409783 401935 394693 388464 384238 382616 383291 385714 390008 396840 406426 418102 430961 444473
56929 444473 458034 470115 478497 481649 479731 474006 465509 454578 441541 427314 413028 399290
56917 399290 386098 373368 361239 349913 339441 329807 320960 312687 304658 296838 289768 284168 280146
56904 280146 276951 273660 270065 266790 264555 263484 263165 263299 264031 265678 268279 271567 275284 279370 283896
56889 283896 288988 294816 301468 308706 315982 322789 328907 334115 337803 339204 338181 335579 332513 329357
56875 329357 325712 321391 317042 313531 311002 309075 307896 308437 311525 317005 324277 333344 344842 359141
56861 359141 375853 394220 413522 432920 451196 466870 478474 484843 485575 481433 473979 464568 453847
56848 453847 442298 430897 420892 413089 407664 404611 404117 406621 412716 422970 437580 456308 478863
56835 478863 505205 535146 567619 600504 631076 656501 674227 682619 681513 671974 655386 633009
56823 633009 606346 577504 548731 521639 496999 475157 456447 441288 430083 423121 420502 422159
56811 422159 427982 437982 452286 470872 493125 517457 541466 562652 579051 589307 592497 588386
56799 588386 577857 562677 544640 525058 505034 485706 467900 451794 437310 424757 414810 407917
56787 407917 403970 402529 403172 405711 410333 417438 426970 437797 448059 456264 461878 464738 464298 459800
56773 459800 451078 438783 423805 406833 388625 370422 353624 338969 326180 314497 303454 293139
56761 293139 283911 276018 269417 263691 258150 252210 245840 239547 233848 228813 224143 219582 215088 210735
56747 210735 206599 202731 199087 195503 191894 188520 185863 184136 183017 181975 180795 179674 178928 178761 179256
56732 179256 180372 181848 183238 184179 184613 184728 184776 184977 185469 186211 186948 187428 187674 187968 188522 189188 189516 189104
56714 189104 187957 186556 185505 185045 184937 184888 184957 185367 186026 186503 186609 186719 187378 188726 190517 192544 194835
56697 194835 197474 200442 203726 207410 211674 216728 222730 229597 236893 244141 251312 258870 267226 276221
56683 276221 285294 294089 302653 310947 318357 324025 327715 330122 332093 333701 334406 334072 333409 333269 333825
56668 333825 334748 335925 337637 340128 343287 346741 349970 352451 354009 355038 356020 356788 356681 355509 353877
56653 353877 352285 350321 347265 343236 339144 335493 331778 327350 322427 317828 313926 310288 306353 302071
56639 302071 297756 293689 290087 287158 284844 282650 280096 277289 274700 272459 270348 268499 267520 267626 268215
56624 268215 268760 269766 272196 276038 280026 282808 283972 283895 283060 281750 280100 278234 276398 274880 273669
56609 273669 272309 270386 268033 265581 262934 259796 256462 253735 251916 250492 248959 247424 246166 245239
56595 245239 244812 245286 246631 248150 249457 251237 254418 258881 263595 267719 270946 273058 273947 274078 274235
56580 274235 274701 275221 275771 276788 278489 280599 282911 285699 289230 293244 297140 300435 302896 304528 305622
56565 305622 306617 307756 309016 310350 311779 313217 314575 316019 317801 319777 321497 322874 324298 325961
56551 325961 327506 328542 329059 329049 328188 326277 323624 320503 316515 310995 303959 296196 288479 281052 273789
56536 273789 266455 258817 250856 242960 235640 229020 222878 217181 212286 208460 205406 202489 199375 196393
56522 196393 194237 193218 192757 191734 189491 186403 183370 180958 179232 178199 177951 178343 178918 179303 179481 179548
56506 179548 179414 178885 177907 176638 175350 174243 173217 171889 170059 168175 167052 167033 167689 168479 169398 170752
56490 170752 172501 174113 175022 175044 174483 173991 174198 175192 176420 177254 177549 177512 177256 176871 176786 177572 179304 181510
56472 181510 183849 186392 189065 191289 192580 193200 193843 194917 196491 198621 201154 203330 204272 203963 203223
56457 203223 202579 201722 200305 198705 197518 196669 195632 194355 193446 193406 194093 195039 195968 196896 197931 199145 200497
56440 200497 201784 202700 202959 202458 201422 200399 199841 199585 198974 197652 195961 194333 192652 190620 188478 186795
56424 186795 185670 184696 183695 182965 182743 182901 183266 183746 184074 183975 183719 183940 184694 185302 185431 185714 186765 188170
56406 188170 189074 189405 189795 190526 191246 191617 191622 191313 190831 190630 191049 191724 192034 192186 193154 195355 198092 200553
56388 200553 202729 204906 206909 208474 209947 211914 214258 216201 217266 217755 218242 218981 219885 220740 221289 221350
56372 221350 220984 220436 219931 219661 219901 220825 222118 223021 222898 221786 220328 219289 219095 219637 220476 221283 222134
56355 222134 223309 224922 226866 228990 231033 232428 232617 231815 231164 231835 233968 236709 239182 241188 243020
56340 243020 244929 246923 248908 250884 253000 255422 258014 260168 261188 261038 260567 260792 262027 263903 266110
56325 266110 268737 271763 274674 276978 278950 281428 284806 288567 291942 294709 297161 299554 301937 304406
56311 304406 307208 310578 314661 319517 324940 330332 335102 339307 343587 348400 353574 358791 364114 369747
56297 369747 375466 380686 385030 388599 391757 394917 398424 402309 406160 409497 412295 414929 417720 420849
56283 420849 424652 429487 435261 441515 448161 455670 464295 473619 483289 493855 506320 521039 537559
56270 537559 555489 575024 596671 620894 648107 678607 712402 749420 789986 834778 884235
56259 884235 938415 997554 1062373 1133491 1210775 1293437 1380507 1470897 1563268 1656228 1748584
56248 1748584 1839028 1925535 2005384 2075950 2135438 2182930 2218053 2240721 2251090 2249512 2236489
56237 2236489 2212737 2179348 2137842 2089847 2036609 1978851 1917214 1852758 1786836 1720439 1653876
56226 1653876 1587109 1520206 1453404 1387029 1321588 1257860 1196664 1138503 1083509 1031702 983178
56215 983178 938076 896440 858175 823179 791509 763328 738559 716698 697159 679687 664219
56204 664219 650475 638081 627088 617882 610400 603875 597567 591374 585491 579957 574902 570744 567582
56191 567582 564762 561689 558883 557462 557613 558275 558491 558464 559018 560527 562729 565250 567992 571179 575224 580339
56175 580339 586222 592375 598756 605775 613574 621841 630512 640174 651342 663719 676565 689491 702509
56162 702509 715643 729125 743899 761340 782332 806859 834442 864701 897632 933875 974874
56151 974874 1022491 1078352 1143744 1219958 1308125 1408346 1518925 1636381 1755943 1872266
56141 1872266 1980481 2077226 2160959 2231644 2290682 2341072 2386522 2429258 2468448 2500987 2523801
56130 2523801 2535417 2536106 2527558 2512517 2493766 2472446 2447007 2413783 2368608 2308332 2231796 2140233
56118 2140233 2037005 1926734 1814422 1704949 1602642 1510665 1430538 1362230 1304669 1256297
56108 1256297 1215643 1181836 1154607 1133637 1118005 1106421 1097810 1091450 1086752 1083396 1081600 1081785 1083861
56095 1083861 1087250 1091690 1097510 1104871 1113183 1121762 1130725 1140819 1152493 1165640 1180057 1195551 1211495
56082 1211495 1226847 1241044 1254608 1268543 1283226 1298134 1312533 1326131 1339002 1351146 1362394
56071 1362394 1372740 1382646 1392900 1404199 1416958 1431330 1447181 1463993 1481166 1498577 1516621
56060 1516621 1535537 1554974 1574590 1594786 1616354 1639497 1663728 1688772 1715012 1742868 1772204
56049 1772204 1802603 1833829 1865700 1897926 1930487 1963878 1998586 2034535 2071497 2109858 2150427
56038 2150427 2193534 2238762 2285600 2333863 2383403 2433907 2485264 2537824 2591946 2647443 2703783
56027 2703783 2760810 2819099 2879534 2942583 3008094 3075812 3146101 3219870 3297689 3379174 3463616
56016 3463616 3550998 3641986 3736969 3835620 3937592 4043207 4153166 4267931 4387637 4512359
56006 4512359 4642191 4777310 4918305 5066134 5221426 5384035 5553738 5731193 5917695
55997 5917695 6114048 6320248 6536396 6763466 7002962 7256198 7524252 7808367 8110095
55988 8110095 8430992 8772327 9135222 9521191 9932709 10373090 10845613 11352899 11897492
55979 11897492 12483013 13114373 13796982 14536240 15338002 16209253 17158394 18195534 19332893
55970 19332893 20584759 21967179 23498432 25200290 27098755 29223915 31610434 34299545
55962 34299545 37341231 40795467 44733439 49239897 54416071 60382432 67281806 75282963
55954 75282963 84582763 95404794 107992349 122590339 139407483 158553304 179950548
55947 179950548 203226665 227597827 251790336 274078374 292501718 305239894 311016549
55940 311016549 309376139 300739325 286246093 267467320 246085637 223631359 201323664
55933 201323664 180021566 160253087 142281678 126180893 111902072 99326990 88303136
55926 88303136 78665374 70249731 62901940 56481572 50863397 45937665 41609321 37796231
55918 37796231 34427797 31444441 28796332 26440661 24339559 22460244 20775527 19262433
55910 19262433 17900130 16669708 15555353 14544490 13626379 12790931 12028711 11331350 10691749
55901 10691749 10104094 9563506 9065358 8605079 8178867 7784124 7418671 7079924 6765390
55892 6765390 6473573 6203518 5953535 5721020 5503321 5298001 5102313 4913490 4730001
55883 4730001 4552098 4380891 4217289 4061779 3914442 3774733 3641627 3514337 3392689
55874 3392689 3276771 3166644 3062514 2964625 2872685 2785731 2702834 2623583 2547655 2474360 2402963
55863 2402963 2333222 2265261 2199207 2135276 2074012 2016041 1961578 1910322 1861773 1815524 1771512
55852 1771512 1730122 1691830 1656484 1623116 1590649 1558622 1527008 1495676 1464421 1433376 1402929
55841 1402929 1373234 1344151 1315714 1288308 1262265 1237556 1214045 1191798 1170928 1151239 1132339
55830 1132339 1114167 1097233 1082186 1069176 1057735 1047257 1037480 1028461 1020262 1012829 1006069 999737
55818 999737 993229 985707 976667 966299 955210 943834 932205 920187 907791 895191 882493 869498
55806 869498 855741 840873 825100 809283 794518 781508 770199 759973 750240 740949 732556 725559
55794 725559 720181 716425 714197 713218 712945 712738 711956 709809 705404 698367 689386 679827 670842 663029 656842
55779 656842 652800 651211 651999 654919 659488 664532 668252 669271 667580 664242 660357 656608 653669 652486
55765 652486 653934 658255 664920 672923 681145 688592 694432 697890 698165 694481 686302 673615 657126 638080
55751 638080 617645 596407 574535 552398 530697 509937 490071 470940 452828 436248 421263
55740 421263 407391 394260 382081 371266 361730 352877 344291 336213 329161 323183 317785 312605 307849
55727 307849 303819 300238 296435 292179 287953 284292 281199 278362 275647 273107 270688 268304 266134 264541
55713 264541 263595 262867 261793 260177 258324 256754 255856 255740 256289 257240 258214 258767 258610 257808 256708 255629 254657
55696 254657 253705 252677 251569 250568 250026 250304 251571 253781 256742 260053 263160 265721 267923 270200 272676
55681 272676 275122 277459 279947 282807 285967 289299 292839 296565 300148 303101 305007 305582 304813 303203 301547
55666 301547 300134 298371 295441 291238 286456 281855 277726 273928 270198 266429 262783 259604 257191 255858
55652 255858 256186 258857 263974 270774 278335 286508 295945 307304 320670 335703 352066 369591 388048
55639 388048 406773 424708 441031 455625 468622 479522 487298 491457 492448 490856 486863 480948 474412
55626 474412 468536 463617 459490 456532 455301 455416 455767 455874 456211 457038 457583 456546 452794 445505 434402
55611 434402 420160 404010 386607 367726 347269 326001 305022 285067 266624 250144 235658
55600 235658 222571 210309 198883 188503 179063 170375 162518 155483 148818 142124 135739 130435 126555
55587 126555 123735 121312 118715 115764 112983 111314 111107 111541 111456 110529 109281 108225 107632 107913 109535 112393
55571 112393 115764 118925 121465 123049 123428 122801 121761 120727 119695 118525 117100 115206 112734 110092 107982
55556 107982 106658 105815 105327 105549 106607 107894 108736 109247 110044 111330 112659 113606 114256 114955 115811 116548 116754
55539 116754 116264 115387 114653 114279 113903 112933 111124 108766 106370 104219 102185 99977 97629 95636 94503 94225
55523 94225 94445 95008 95985 97138 97858 97918 97954 98805 100610 102859 105169 107607 110378 113647 117690 122840 129113
55506 129113 136146 143678 151877 161101 171477 182864 195116 208234 222274 237101 252136 266366
55494 266366 278809 289057 297211 303156 306110 305154 300131 291783 280949 267917 252753 236103 219366
55481 219366 203891 190109 177487 165205 152790 140310 128310 117560 108542 100930 93776 86512
55469 86512 79699 74454 71120 68791 66300 63341 60327 57388 54058 50108 46229 43438 41915 40769
55455 40769 39022 36551 33950 31776 30202 29178 28591 28236 27961 27902 28340 29194 29919 30091 29890 29800 29960 30054
55437 30054 29757 29001 27866 26514 25340 24916 25514 26752 27860 28291 28017 27300 26387 25469 24755 24383 24157
55420 24157 23575 22321 20778 19801 19848 20438 20650 20089 19196 18658 18711 19019 19060 18610 18004 17935 18770 19979 20493
55401 20493 19789 18484 17680 17869 18630 19216 19196 18636 17945 17602 17767 18088 18048 17620 17426 18072 19445 20780 21403
55382 21403 21292 20879 20460 19933 19084 17953 16773 15640 14500 13532 13250 13901 14877 15117 14263 13151 12936
55365 12936 13851 15119 15951 16294 16500 16618 16318 15391 13975 12283 10418 8602 7344 7107 7840 9052 10313
55348 10313 11464 12397 12857 12610 11687 10459 9520 9417 10180 11134 11516 11384 11542 12317 12889 12309 10937 10171
55330 10171 10725 11794 12181 11752 11322 11428 11771 11854 11749 12002 12941 14261 15299 15694 15732 15998 16645 17100 16637
55311 16637 15239 13779 13191 13509 13852 13422 12367 11507 11322 11542 11731 11824 11876 11708 11276 11134 11978 13693
55293 13693 15359 16259 16428 16157 15545 14770 14313 14416 14695 14672 14519 14791 15600 16429 16725 16372 15633 14925 14589
55274 14589 14626 14669 14460 14211 14298 14712 15145 15457 15668 15561 14820 13629 12701 12465 12462 11817 10207 8245 6974
55255 6974 6989 7936 8843 8982 8377 7473 6586 5898 5658 5977 6537 6953 7320 7916 8477 8339 7392 6324 5799
55236 5799 5933 6710 8203 10036 11258 11332 10855 10757 11163 11628 12084 12827 13681 13980 13498 12721 12078 11438 10673
55217 10673 10227 10673 11904 13116 13589 13345 13074 13454 14488 15527 16025 16145 16398 16846 17063 16873 16676 16805
55199 16805 16961 16590 15618 14471 13493 12702 12104 11985 12663 13993 15225 15493 14612 13353 12764 13145 13797 13836
55181 13836 13024 11778 10619 9886 9812 10496 11757 13175 14366 15120 15373 15248 15078 15124 15199 14789 13676 12311
55163 12311 11456 11505 12223 12969 13095 12294 10837 9478 8937 9354 10270 11114 11638 11935 12254 12858 13893 15216
55145 15216 16330 16635 15845 14243 12562 11600 11739 12667 13543 13626 12892 12065 11970 12813 14047 14903 14989 14405 13430
55126 13430 12357 11594 11614 12520 13751 14543 14693 14689 15106 16098 17468 18886 19925 20301 20351 20945 22501 24266
55108 24266 24993 24284 22943 22059 22152 23140 24664 26248 27435 28001 27957 27426 26741 26516 27083 27796 27449 25684
55090 25684 23560 22365 22224 22285 21995 21657 21790 22432 23179 23619 23624 23382 23180 23137 23189 23371 23890 24728 25434 25618
55070 25618 25498 25648 26227 26748 26621 25730 24506 23612 23428 23601 23233 21822 19970 18850 18984 19870 20770 21442
55052 21442 22010 22488 22741 22730 22518 22118 21481 20665 19926 19611 19880 20550 21247 21815 22370 22888 23003 22545 22059
55033 22059 22333 23449 24686 25423 25714 25829 25724 25229 24537 24132 24308 24933 25662 26251 26739 27354 28211 29075
55015 29075 29573 29576 29222 28624 27839 27098 26739 26803 27040 27450 28485 30500 33235 36067 38548 40560 42134 43391
54997 43391 44506 45475 45997 45771 44833 43541 42343 41625 41514 41636 41295 40162 38647 37408 36642 36052 35317
54980 35317 34384 33426 32764 32681 33093 33545 33792 34182 35188 36631 37762 38051 37601 36842 36217 36151 36868 38014
54962 38014 38732 38402 37210 35896 35080 34947 35416 36352 37588 38868 39978 41005 42402 44658 47859 51711
54946 51711 55982 60729 66008 71707 77847 84768 92637 100965 109044 116729 124291 131433 136973 139797
54932 139797 139814 137688 133882 128315 120904 112093 102713 93450 84620 76414 69215 63471 59268 56237 53985
54917 53985 52418 51481 50808 49949 48837 47749 46869 46211 45909 46207 47124 48458 50200 52598 55716 59285
54901 59285 63169 67634 72954 79074 85828 93182 100946 108549 115435 121471 126576 130142 131250 129448
54887 129448 124972 118334 110153 101388 93220 86372 80731 75753 71060 66538 62153 57929 53990 50402
54873 50402 47033 43762 40833 38833 38218 38812 39799 40265 39885 39097 38639 38875 39578 40235 40456 40258 40107 40570
54855 40570 41700 42849 43354 43336 43419 43672 43361 41988 40133 38819 38319 38051 37406 36158 34215 31593 28814
54838 28814 26785 25991 26099 26477 26731 26572 25695 24177 22701 21893 21629 21410 21196 21354 21941 22609 23234 24076
54820 24076 25123 25824 25819 25516 25606 26196 26802 27036 26997 27044 27463 28332 29493 30624 31488 32174 33044 34451 36406
54801 36406 38405 39680 39892 39641 39966 41303 43280 45594 48539 52321 56389 60092 63721 68280 74314
54786 74314 81570 89719 98673 107978 116575 123520 128622 132112 134025 134135 132201 128092 122071 115154 108719
54771 108719 103314 98230 92662 86980 82303 79126 76962 75254 73917 72902 71882 70763 70090 70530 72030
54756 72030 73808 75138 76040 77243 79565 83224 87719 92416 97201 102383 108068 113943 119742 125582 131587
54741 131587 137457 142770 147571 152265 156796 160125 160720 157650 151265 142904 133914 124847 115574 106049
54727 106049 96764 88362 81026 74453 68366 62837 58060 54042 50612 47651 45187 43289 41909 40838
54713 40838 39887 39083 38650 38686 38971 39145 39019 38571 37784 36743 35839 35580 36056 36784 37183 37031 36386 35325 33987
54694 33987 32719 31949 31924 32685 34125 35856 37158 37414 36709 35816 35572 36322 37911 39930 41893 43379 44157
54677 44157 44214 43731 43169 43222 44348 46224 47874 48487 48046 47123 46326 46025 46342 47134 48035 48722 49178 49605 50201
54658 50201 51079 52301 53755 55089 55971 56476 57065 58100 59463 60839 62308 64489 67871 72111 76283
54643 76283 79876 83329 87392 92319 97953 104254 111168 118100 124108 128677 131752 132995 131748 128092
54629 128092 123274 118574 114172 109578 104710 99895 95209 90615 86605 83913 82471 81280 79435 76857
54615 76857 73923 70905 67921 65051 62307 59770 57784 56654 56154 55708 55051 54300 53398 52080 50495 49290
54599 49290 48827 48764 48558 47942 46777 45044 43257 42254 42206 42336 42043 41708 41863 42126 41735 40802 40187 40250 40494
54580 40494 40443 40201 39995 39792 39567 39488 39583 39624 39548 39674 40228 40893 41138 40826 40284 39811 39374 38876 38553 38850 39754
54559 39754 40452 40071 38786 37844 38240 39684 41103 41855 42083 42114 42012 41701 41176 40571 40209 40442 41251 42193
54541 42193 43028 44121 45790 47512 48382 48301 48181 48941 50791 53494 56773 60344 64001 67828 71938 75938
54525 75938 79105 81165 82377 82807 82101 80188 77548 74489 70785 66477 62435 59470 57260 54854 52046
54510 52046 49588 48071 47219 46402 45411 44526 44058 43927 43642 42698 41177 39862 39532 40187 41128 41716 41883 42020
54492 42020 42578 43724 45140 46169 46311 45572 44332 43111 42546 43199 45025 47217 48969 50215 51324 52247
54476 52247 52463 51703 50287 48715 47358 46547 46551 47281 48312 49258 49892 49957 49353 48552 48335 48849 49355 49211 48751
54457 48751 48826 49713 50890 51696 51885 51598 51161 50922 50998 51171 51166 50987 50814 50667 50421 50080 49753 49406 48880 48178
54437 48178 47477 46799 45977 45006 44124 43405 42593 41620 41036 41511 42964 44511 45345 45384 45023 44639 44558 45219 46946
54418 46946 49493 52055 53837 54596 54682 54684 54980 55456 55700 55582 55601 56460 58273 60376 61937 62615 62687 62814 63664
54399 63664 65396 67306 68255 67656 65885 63683 61529 59833 59162 59679 60566 60674 59750 58470 57328 56150
54383 56150 54875 54045 54022 54246 53865 52864 51982 51651 51578 51373 51106 51087 51471 52246 53295 54292 54785 54625 54229
54364 54229 54257 55046 56360 57593 58178 57998 57491 57215 57271 57332 57307 57685 58973 60938 62723 63673 63810 63490 62883
54345 62883 61923 60579 59002 57502 56449 56063 56157 56190 55741 54933 54220 53839 53659 53485 53254 52832 51960 50594
54327 50594 49126 48031 47415 47129 47223 47887 48915 49560 49141 47658 45723 44093 43325 43565 44311 44624 43993
54310 43993 43037 42947 44132 45691 46387 45876 44763 43706 42865 42160 41666 41541 41721 41932 41943 41733 41430 41251
54292 41251 41487 42393 43937 45659 46929 47422 47328 47097 47042 47207 47456 47551 47265 46633 46057 45938 46185 46262 45773
54273 45773 44769 43430 41791 40061 38930 39158 40843 43349 45867 47862 49102 49641 49800 49832 49571 48733
54257 48733 47564 46760 46615 46708 46680 46855 47675 48849 49559 49403 48685 47934 47556 47822 48682 49519 49605 48946 48369
54238 48369 48582 49469 50444 51132 51559 51953 52571 53499 54452 54963 54878 54424 53675 52386 50546 48733 47556 47038
54220 47038 46822 46668 46332 45343 43568 41872 41516 42726 44409 45401 45536 45256 44701 43674 42259 40964 40190
54203 40190 39819 39470 38990 38578 38423 38356 38127 38025 38848 40876 43169 44396 44327 43973 44225 44963 45662 46132 46224
54184 46224 45483 43834 42253 41877 42609 43375 43701 44164 45093 45763 45424 44478 43910 43940 43936 43456 42720 42031 41410
54165 41410 40899 40688 40706 40559 40152 39978 40468 41302 41754 41521 40890 40207 39517 38715 37753 36677 35754 35535 36465
54146 36465 38293 40057 40806 40245 38768 37097 35904 35410 35236 34834 34212 33947 34396 35224 35979 36738 37829
54129 37829 39166 40327 41145 41708 41865 41348 40473 40130 40697 41440 41441 40889 40950 42354 44508 46115 46440 45860
54111 45860 45310 45348 45710 45659 44737 43157 41594 40693 40696 41375 42243 42964 43631 44504 45501 46140 46128 45756 45486 45328
54091 45328 44934 44243 43693 43637 43857 43892 43810 44343 46124 48885 51623 53588 54900 56038 57007 57382 57112 56723
54073 56723 56507 56015 54805 53425 53041 54098 55836 57153 57549 57125 56172 55103 54428 54366 54643 54984 55623
54056 55623 56934 58620 59825 60210 60504 61617 63490 65249 66452 67726 70005 73463 77491 81481 85244
54041 85244 88750 91900 94775 97823 101528 105963 110824 115729 120362 124467 128012 131215 134179 136602
54027 136602 138163 139117 140095 141290 142333 143096 144087 145610 146938 146934 145387 143199 141202 139320 137049 134252
54011 134252 131143 127824 124256 120500 116576 112205 107113 101687 96972 93829 92246 91543 91042 90422 89651
53996 89651 88773 87703 86168 83991 81472 79282 77829 76912 76138 75380 74600 73552 72108 70719 70072 70311
53980 70311 70981 71678 72306 72690 72584 72196 72110 72393 72314 71378 70118 69410 69440 69923 70939 72732 74890 76519
53962 76519 77291 77678 78094 78467 78748 79184 79827 80389 80846 81648 82991 84461 85749 87150 88863 90407 91415
53945 91415 92610 95097 98838 102619 105595 108179 111248 115098 119482 124205 129268 134651 140297 146184
53931 146184 152206 158126 163739 168953 173608 177395 180165 182213 184091 186174 188501 191011 193772 196954
53917 196954 200651 204838 209525 214822 220628 226258 230656 233160 233973 233742 232898 231598 230087 228736 227724
53902 227724 226919 226043 224794 222981 220739 218406 215878 212333 207106 200658 194126 187979 181817 175500 169617
53887 169617 164512 159631 154413 149245 144880 141306 137903 134481 131418 128826 126253 123388 120528 118167
53873 118167 116467 115290 114469 113847 113239 112414 111097 109050 106375 103615 101298 99478 97941 96675 95765
53858 95765 94970 93878 92484 91146 89930 88458 86552 84614 83178 82417 82211 82330 82360 81781 80416 78595
53842 78595 76767 75213 74204 74022 74584 75381 76063 76770 77664 78505 78969 79051 78799 78021 76680 75330 74667 74832
53824 74832 75547 76653 78052 79359 80238 80995 82204 83794 85076 85755 86317 87295 88714 90470 92734 95660
53808 95660 99052 102649 106406 110314 114263 118277 122512 126782 130468 133230 135496 137880 140434 142808
53794 142808 144869 146754 148543 150280 152093 153877 155064 155217 154731 154392 154265 153547 151592 148627 145277
53779 145277 141781 137923 133470 128530 123649 119586 116738 114658 112368 109282 105659 102112 98980 96253
53765 96253 93808 91570 89595 88143 87394 87030 86345 84959 83146 81341 79613 77882 76341 75301 74771
53750 74771 74526 74504 74800 75325 75730 75685 75020 73679 71848 70102 69076 68839 68801 68378 67598 66956 66807 67109 67646
53731 67646 68320 69109 69833 70153 69977 69762 70167 71329 72724 73859 74816 75895 76987 77703 77998 78227 78587
53714 78587 78932 79167 79416 79601 79366 78698 78326 78976 80380 81483 81697 81652 82534 84821 87846 90478 92116
53697 92116 92972 93570 94202 95002 96336 98658 101851 105048 107435 109088 110754 112914 115360 117610 119353
53682 119353 120416 120705 120452 120268 120624 121321 121749 121641 121302 121058 120793 120218 119401 118685 118142 117441 116391 115348
53664 115348 114822 114830 114898 114714 114436 114285 114115 113627 112900 112454 112743 113706 114826 115578 115853 115970 116265 116668 116878
53645 116878 116934 117354 118462 119794 120538 120491 120205 120121 119953 119200 117977 116997 116810 117360 118324 119649 121603 124345
53627 124345 127521 130330 132070 132657 132575 132327 132094 131923 131992 132453 133170 133930 134860 136303 138232 140130 141539
53610 141539 142486 143212 143788 144257 144927 146127 147797 149681 151845 154592 157814 160850 163204 165120 167239
53595 167239 169921 173074 176351 179234 181174 182088 182620 183516 184773 185728 186006 185943 185965 185986 185672 185041 184444 184128
53577 184128 184088 184228 184395 184272 183542 182246 180826 179749 179147 178829 178497 177989 177401 176980 176791 176434 175289 173169
53559 173169 170731 169100 168939 169830 170651 170626 169949 169334 169170 169448 170309 172094 174648 177050 178455 178916 179065
53542 179065 179281 179599 180213 181464 183363 185642 188220 191144 194073 196436 198263 200250 202772 205429 207902
53527 207902 210681 214348 218611 222723 226621 230979 236239 242211 248660 255634 263053 270476 277606 284645
53513 284645 291922 299443 307039 314750 322822 331510 341038 351580 363022 374913 386885 399129 412205
53500 412205 426415 441470 456824 472215 487818 503942 520604 537408 553751 569121 583345
53489 583345 596765 610240 624663 640241 656330 672135 687415 702304 716777 730795 744800
53478 744800 759395 774352 788504 801039 812518 824226 836800 849891 862903 875520 887585
53467 887585 898908 909344 918806 927136 934223 940156 945032 948596 950407 950372 948859 946160 942109 936316
53453 936316 928561 918959 908046 896757 885967 875847 865911 855822 845819 836109 826221 815421
53441 815421 803623 791437 779381 767462 755522 743533 731443 719148 706913 695506 685627 677296
53429 677296 670099 663844 658708 654810 651976 649964 648644 647935 647767 648204 649429 651490 654219 657454 661189
53414 661189 665508 670523 676417 683315 690992 699016 707406 716829 727840 740160 753158 766845 781796
53401 781796 798125 815187 832528 850563 869879 890391 911723 934115 958315 984643 1012779
53390 1012779 1042472 1073847 1106794 1140560 1174355 1208063 1242035 1276329 1310512 1344220 1377688
53379 1377688 1411611 1446476 1481933 1516877 1550315 1582163 1612997 1642992 1671463 1697632 1721520
53368 1721520 1743720 1764473 1783286 1799348 1811999 1820863 1825946 1827771 1827151 1824641 1820193 1813216 1802828
53355 1802828 1788147 1768710 1744765 1717000 1686061 1652559 1617483 1582129 1547350 1513162 1479299
53344 1479299 1445919 1413467 1382111 1351743 1322484 1294803 1268994 1244741 1221186 1197236 1171924
53333 1171924 1144940 1117067 1089780 1064068 1039718 1016001 992918 971430 952360 935433 919613
53322 919613 904264 889692 876628 865498 856297 848813 842504 836202 828476 818712 807659 796596 786004
53309 786004 775425 764584 754169 745174 737772 731320 725340 720051 715932 713168 711727 711578 712580 714457
53295 714457 717211 721279 726817 733002 738621 743508 748941 756425 766357 778084 790838 804249 818238
53282 818238 832916 848522 865062 881974 898451 914128 929172 943764 957807 971140 983603
53271 983603 994802 1004170 1011510 1017156 1021466 1024441 1026022 1026369 1025495 1022972 1018452 1012237 1004867 996311
53257 996311 986125 974319 961434 947661 932553 915974 898789 882057 865763 848895 830726
53246 830726 811598 792366 773444 754642 735771 717163 699502 683248 668308 654258 640696
53235 640696 627241 613382 598734 583517 568483 554172 540501 527199 514352 502203 490657
53224 490657 479392 468376 457935 448390 439983 433022 427603 423113 418519 413386 408216 403526 398953
53211 398953 393603 387017 379338 370778 361404 351426 341218 330891 320295 309618 299645 291078 283760
53198 283760 276878 269861 262789 256004 249638 243710 238398 233921 230114 226341 221953 216871 211642 206896
53184 206896 202754 198774 194524 190123 186151 183096 180982 179546 178486 177434 175936 173843 171658 170128
53170 170128 169360 168673 167471 165922 164503 163169 161465 159346 157374 156036 155306 154968 154965 155154 155086 154423 153347
53153 153347 152277 151340 150463 149794 149565 149500 148813 146996 144430 142072 140664 140240 140273 140150 139662 139049 138559 138052
53135 138052 137240 136235 135594 135747 136605 137708 138528 138624 137886 136712 135607 134449 132572 129792 126978 125198
53119 125198 124537 124150 123324 122008 120492 119077 118084 117709 117667 117346 116455 115280 114218 113411 112916 112850 113073 113017
53101 113017 112227 110931 109874 109582 109942 110360 110157 108942 106849 104412 102173 100438 99363 98996 99066 98994 98384
53084 98384 97425 96591 96092 95793 95585 95569 95940 96864 98343 100004 101140 101199 100241 98779 97372 96513 96632 97714
53066 97714 99049 99789 99730 99197 98261 96678 94668 93111 92647 92993 93442 93657 93635 93307 92670 92127 92243 93170
53048 93170 94592 96077 97195 97543 97134 96707 97166 98531 99824 100166 99747 99481 99859 100402 100304 99496 98874 99352
53030 99352 100819 102318 103286 104192 105736 107782 109479 110272 110399 110524 111238 112799 114868 116539 117147 117101 117489
53013 117489 118783 120404 121677 122598 123378 123782 123499 122871 122725 123525 125023 126595 127589 127554 126591 125452 124884
52996 124884 124877 124912 124855 125126 125933 126846 127352 127421 127272 126947 126502 126266 126484 126824 126721 126125 125465 124939 124398 124030
52976 124030 124501 125988 127537 128004 127453 126993 127272 127803 127925 127742 127697 127752 127579 127335 127570 128428 129510 130572
52958 130572 131810 133276 134534 135227 135623 136201 136973 137613 138057 138559 139201 139762 140139 140532 141048 141410 141316 140911
52940 140911 140639 140608 140383 139494 138022 136486 135212 134081 132975 132217 132254 132978 133681 133753 133195 132399 131691 131227
52922 131227 131092 131215 131301 131086 130570 129896 129103 128180 127261 126555 126157 126088 126392 126955 127293 126819 125425 123689 122420
52903 122420 122083 122554 123254 123512 122993 121872 120603 119546 118883 118701 118905 119105 118871 118143 117223 116362 115647 115318
52885 115318 115815 117233 118898 119786 119443 118372 117514 117387 117770 118168 118474 119054 120164 121574 122960 124473
52869 124473 126519 129037 131418 133225 134594 135644 135904 134775 132474 130077 128511 127710 126874 125431 123596
52854 123596 122034 121030 120088 118436 115877 112971 110383 108292 106563 105192 104267 103632 102976 102213 101505 100902
52838 100902 100217 99336 98289 96960 95093 92838 90940 90029 89862 89673 89210 88972 89324 89804 89613 88529 87015
52821 87015 85541 84188 82915 81866 81245 81048 81069 81025 80563 79395 77654 76093 75603 76435 77974 79301 79894
52804 79894 79837 79586 79624 80195 81171 82221 83185 84233 85592 87176 88619 89644 90261 90594 90701 90641 90607 90800
52786 90800 91202 91573 91726 91733 91863 92363 93306 94489 95443 95697 95252 94720 94843 95830 97257 98559 99449 99906 100001
52767 100001 99920 99988 100476 101346 102294 103030 103534 104072 104941 106119 107172 107660 107619 107490 107562 107668 107505 107030 106438
52748 106438 105964 105845 106239 106994 107712 108235 108825 109603 110129 109973 109498 109599 110653 112175 113506 114361 114661 114360
52730 114360 113677 113141 113085 113355 113734 114328 115254 116236 116907 117444 118520 120552 123194 125610 127167 127815 127876 127537
52712 127537 126735 125648 125017 125533 126862 127786 127574 126834 126674 127314 127959 127918 127396 127153 127693 128886 130159 130937
52694 130937 130988 130443 129597 128804 128473 128853 129696 130444 130902 131391 132059 132466 132291 132094 132808 134542 136452 137782
52676 137782 138486 138782 138644 137986 136954 135762 134469 133075 131616 130039 128227 126289 124537 123084 121692
52661 121692 120130 118357 116270 113711 110975 108899 108006 107838 107528 106807 106059 105581 105291 105139 105269 105728 106413
52644 106413 107382 108858 110831 112967 115013 116892 118326 118826 118348 117570 117172 117119 117037 117012 117441 118230 118745 118684
52626 118684 118533 118940 119967 121146 121948 121990 121139 119764 118684 118451 118730 118636 117615 115758 113446 111097 109254
52609 109254 108393 108425 108727 108886 109183 110134 111775 113693 115601 117574 119756 122125 124552 126837 128613 129463
52593 129463 129277 128367 127132 125774 124493 123794 124265 125882 127736 128713 128440 127469 126555 125936 125308 124270 122633
52576 122633 120534 118451 116959 116221 115779 115057 113936 112598 110995 108984 106946 105718 105598 105785 105149 103366
52560 103366 101032 98893 97280 96139 95294 94645 94313 94515 95193 95902 96304 96582 97092 97750 98087 97943 97747
52543 97747 97999 98659 99158 98934 98005 97069 96949 97774 98845 99446 99651 100072 100938 101788 102070 101720 101108 100642 100474
52524 100474 100366 99816 98573 97053 95926 95289 94612 93668 92999 93134 93643 93525 92442 91086 90294 90224 90561
52507 90561 91116 91808 92279 92010 90972 89809 89206 89225 89478 89653 89628 89212 88248 86999 86050 85679 85618 85591 85740
52488 85740 86329 87256 88114 88620 88757 88670 88576 88592 88487 87876 86807 85893 85557 85464 85049 84359 83949 84117 84703 85455
52468 85455 86208 86789 87229 87948 89204 90410 90537 89291 87437 85948 85242 85270 85852 86753 87788 88930 90005
52451 90005 90454 89921 88999 88683 89002 88943 87903 86492 85577 85226 85033 84803 84440 83817 83366 84194 86841 90253
52433 90253 92731 93652 93679 93598 93722 94191 95027 95845 96169 96093 96125 96390 96571 96617 96841 97231 97284 96715 95826 94968 94132
52412 94132 93228 92289 91238 89984 88988 89133 90612 92410 93388 93560 93751 94314 94778 94745 94588 95113 96773 99251
52394 99251 101570 102711 102456 101678 101533 102369 103654 104866 105936 106823 107282 107395 107809 108845 109720 109377 107996
52377 107996 106972 107313 108708 110381 112064 113653 114657 114827 114997 116331 118741 120827 121608 121641 122216 123906
52361 123906 126208 128236 129485 130192 131135 132831 134900 136583 137856 139453 141692 143948 145585 146838 148311
52346 148311 150136 152102 154165 156306 158166 159390 160107 160715 161527 162966 165588 169311 172995 175500 176969
52331 176969 178533 181020 184557 189046 194236 199543 204595 209886 216140 223217 230481 238082 246860 256951
52317 256951 267543 278207 289406 301347 313436 325436 338183 352336 367161 381478 395292
52306 395292 409596 424852 440538 456038 471228 486195 500956 515461 529385 541981 552619
52295 552619 561494 569457 577104 584377 590976 596757 601738 606002 609591 612252 613376 612537 610053 606780
52281 606780 603392 600141 597175 594683 592688 591043 589634 588321 586747 584636 582398 580999 581013 582051 583365
52266 583365 584827 587020 590473 595099 600433 606228 612649 619983 628296 637484 647509 658438 670185
52253 670185 682375 694542 706378 717730 728414 738217 747116 755395 763427 771259 778429 784350 788836
52240 788836 792113 794288 795126 794539 793012 791157 789057 786422 783254 779728 775532 769964 762928 755259 747790
52225 747790 740640 733719 727336 721767 716670 711528 706399 701617 697005 692098 687113 683017 680465 679146
52211 679146 678303 677498 676732 676270 676583 678137 680908 684205 687149 689259 690615 691698 693151 695447 698544
52196 698544 701898 704836 706880 707849 707923 707650 707630 708073 708743 709373 709896 710266 710318 709971 709351 708555 707437 705849
52178 705849 703983 702224 700648 698889 696615 693975 691387 688922 686115 682500 678181 673705 669483 665638
52164 665638 662315 659748 657776 655660 652713 648988 645071 641362 637867 634565 631577 628891 626272 623554
52150 623554 620788 618015 615149 612231 609633 607842 607056 606975 606849 605736 603064 599195 595300 592446 590740
52135 590740 589445 587866 586015 584466 583718 583806 584474 585597 587311 589782 593007 596936 601686 607458 614252
52120 614252 621818 629919 638609 648222 659091 671208 684077 697062 710019 723531 738252 754049
52108 754049 770045 785656 801278 817694 834986 852296 868621 883543 897176 909799 921707
52097 921707 933072 943597 952484 959142 963851 967353 969855 970931 970468 969062 967129 964147 959308 952656
52083 952656 945078 937419 930102 923375 917278 911510 905928 901033 897304 894171 890562 886537 883396 881899
52069 881899 881391 881168 881694 883658 886661 889885 893516 898403 904580 911195 917823 924838 932436 940192 947797
52054 947797 955431 963097 970241 976350 981426 985567 988577 990278 990819 990416 989058 986723 983578 979757 975137
52039 975137 969456 962468 953979 943975 932776 920824 908356 895474 882380 869170 855580 841409
52027 841409 827047 813077 799478 785843 772283 759363 747063 734636 721728 708936 696893
52016 696893 685441 674082 662631 651052 639183 627040 614869 602582 589746 576466 563562
52005 563562 551343 538881 525249 510854 496735 483015 468991 454430 439784 425226 410426
51994 410426 395392 380706 366722 353193 339930 327290 315746 305353 295794 286643 277517 268399
51982 268399 259895 252765 247064 242074 237101 231999 226832 221492 215838 209912 203845 197800 192043 186839
51968 186839 182225 178116 174565 171558 168616 165096 161008 157085 153903 151315 148954 146854 145335 144537
51954 144537 144295 144236 143819 142617 140756 138824 137155 135510 133639 131829 130523 129657 128767 127652 126596 125957
51938 125957 125791 125896 126043 126142 126257 126434 126496 126128 125179 123800 122297 121079 120680 121413 122854 123978 124102 123447
51920 123447 122630 121918 121240 120563 119863 118930 117592 116007 114333 112304 109609 106592 104084 102436 101211 99900
51904 99900 98561 97536 96939 96711 96930 97723 98943 100098 100629 100293 99420 98782 99003 99977 101000 101490 101369
51887 101369 100863 100269 100045 100676 102175 103948 105410 106527 107522 108387 109037 109711 110790 112312 114042 115905
51871 115905 117898 119668 120716 121102 121511 122482 123982 125924 128708 132892 138533 145143 152172 159380 166946
51856 166946 175379 185180 196474 209075 222996 238478 255331 272384 287844 299955 307299 309040
51844 309040 305449 297993 288376 277465 265354 252206 238655 225545 213694 203722 195595 188501 181714
51831 181714 175460 170318 165958 161331 156238 151790 148933 147224 145569 143507 141211 138797 136401 134499
51817 134499 133387 132493 130992 129006 127568 127323 127917 128693 129388 129930 130173 130138 130164 130520 131118 131798 132581 133458
51799 133458 134231 134879 135763 137103 138419 138924 138482 137798 137555 137651 137495 136912 136482 136912 138213 139598 140128 139401
51781 139401 137766 136104 135339 135795 136821 137257 136511 135058 133773 132977 132416 131959 131840 132201 132852 133631 134701
51764 134701 136228 137946 139295 139868 139610 138675 137326 135972 135107 135041 135624 136319 136683 136881 137550 138986 140604
51747 140604 141454 141297 140866 141022 141872 142842 143365 143282 142737 141971 141234 140791 140878 141566 142584 143363 143484 143143 142964
51728 142964 143259 143675 143651 143012 141963 140785 139777 139263 139242 139164 138459 137284 136289 135594 134485 132406 129838
51711 129838 127766 126533 125723 125018 124598 124538 124347 123439 121852 120179 118893 117916 116794 115101 112819 110556
51695 110556 109290 109632 111252 113178 114612 115401 115819 116160 116537 116839 116853 116492 115897 115196 114272 113006 111619
51678 111619 110489 109658 108849 107935 107140 106747 106948 107902 109514 111112 111893 111900 112110 113318 115264 117102 118308
51661 118308 118786 118573 117942 117511 117721 118345 118829 118949 118785 118353 117724 117309 117517 118288 119360 120799 122703 124601
51643 124601 125783 126267 126863 128179 130014 131668 132433 131895 130383 129093 129053 129872 130195 129482 128546 128111 127749
51626 127749 126775 125410 124292 123446 122566 121916 122004 122469 122252 121005 119652 119189 119508 119754 119466 118915 118459 118001
51608 118001 117250 116273 115533 115383 115751 116406 117336 118519 119492 119604 118867 118152 118378 119691 121562 123307 124318
51591 124318 124234 123307 122381 122128 122458 122963 123664 124861 126422 127744 128410 128484 128140 127444 126658 126314 126663 127257
51573 127257 127327 126567 125407 124553 124329 124478 124627 124852 125656 127330 129588 131997 134528 137377 140397 143074
51557 143074 145123 146776 148412 150122 151712 152945 153708 154106 154449 155013 155767 156494 157209 158204 159604 161066
51541 161066 162128 162692 163016 163293 163501 163692 164162 165126 166296 167052 167130 166989 167288 168103 168859 169043 168687 168144
51523 168144 167665 167319 167046 166548 165354 163331 160992 159021 157537 156092 154334 152396 150555 148862 147228
51508 147228 145689 144375 143305 142373 141559 140998 140785 140769 140700 140553 140567 140776 140714 139894 138486 137137 136074 134821
51490 134821 133039 131214 130153 130069 130533 131033 131186 130609 129154 127245 125539 124227 123089 122136 121631 121383
51474 121383 120658 119129 117461 116518 116298 116065 115325 114229 113101 112014 110965 110073 109420 108915 108506 108446 109063
51457 109063 110269 111485 112177 112378 112550 112979 113527 113970 114326 114743 115267 115891 116647 117466 118126 118579 119178 120166
51439 120166 121082 121102 120124 119057 118763 119002 118810 117745 116359 115391 114918 114509 113985 113605 113467 113096 111951 110159
51421 110159 108446 107339 106737 106343 106141 106274 106695 107237 107826 108387 108676 108484 107870 107000 105949 104911 104332
51404 104332 104397 104526 103903 102423 100654 98863 96703 94065 91658 90264 89762 89360 88611 87761 87144 86652 85976
51387 85976 85152 84648 84852 85567 86094 85887 85058 84209 83875 84180 84891 85617 86086 86446 87169 88385 89510 89900
51369 89900 89722 89679 89916 89885 89371 89014 89370 90015 90133 89663 89325 89633 90378 90991 90962 89945 87917 85345 82898
51350 82898 80880 79152 77681 76854 77146 78616 80798 82950 84341 84535 83656 82413 81735 82161 83433 84685
51334 84685 85171 84904 84498 84373 84305 83874 83149 82683 82918 83833 85105 86335 87094 87053 86349 85668 85700 86491 87475
51315 87475 88249 89061 90303 91642 92118 91263 89789 88805 88564 88391 87706 86660 85711 85134 85119 85914 87468 89157
51297 89157 90131 89882 88410 86135 83831 82289 81684 81405 80786 79858 79185 79166 79769 80787 81992 83088 83807
51280 83807 84104 84214 84613 85928 88437 91471 93674 94322 94140 94413 95648 97559 99970 102895 105845 107959
51264 107959 109040 109755 110528 110981 110800 110475 110551 110610 109757 107930 106105 105209 105321 105898 106281 105954 104775 103148
51246 103148 101668 100467 99215 97861 96996 97172 98165 99229 99899 100162 99969 99140 97902 97088 97363 98483
51230 98483 99632 100402 101071 101995 103177 104546 106183 107969 109289 109543 108843 107834 106921 106061 105307 105064 105548
51213 105548 106333 106783 106800 106861 107353 108142 108805 109094 109094 109111 109515 110504 111819 112679 112293 110606 108460 106851 106049
51194 106049 105539 104750 103551 102028 100104 97654 94847 92118 89863 88364 87863 88414 89613 90756 91426
51179 91426 91812 92332 93103 93879 94444 94892 95502 96404 97436 98348 99100 99872 100777 101655 102242 102434 102331 102124 102080
51160 102080 102461 103238 103894 103733 102435 100293 97939 96020 94993 94928 95383 95659 95366 94701 94159 94079 94490 95268
51142 95268 96340 97738 99455 101270 102793 103786 104357 104747 105022 105138 105187 105356 105686 106050 106343 106474 106304 105845
51124 105845 105492 105674 106301 106919 107408 108073 108932 109453 109318 109029 109334 110372 111772 113332 115077 116812 118172
51107 118172 119158 120154 121308 122309 122888 123191 123449 123620 123551 123294 123038 122891 122923 123178 123421 123099 121918 120431
51089 120431 119681 120124 121136 121734 121612 121328 121557 122394 123449 124462 125621 127254 129363 131639 133873 136086
51073 136086 138196 139760 140345 140065 139480 138947 138309 137289 135909 134385 132836 131348 130111 129181 128232 126870
51057 126870 125204 123828 123183 123200 123546 123954 124215 124224 124200 124574 125470 126509 127326 127988 128717 129527 130435 131720 133527
51038 133527 135396 136672 137310 137743 138090 138030 137558 137305 137814 138955 140367 142070 144200 146376 147859 148427
51022 148427 148755 149803 151957 154852 157831 160458 162598 164220 165368 166348 167665 169544 171726 173999 176657
51007 176657 179966 183349 185824 187442 189643 193756 199600 206002 212299 218725 225597 232854 240470 248697
50993 248697 257618 266835 275892 284825 294141 304376 315776 328292 341855 356729 373494 392508
50981 392508 413467 435855 459808 486145 515394 547123 580546 615495 652442 691646 732719
50970 732719 775150 818965 864645 912436 961785 1011353 1059462 1104684 1146261 1184060 1218031
50959 1218031 1247686 1272282 1291582 1306197 1316974 1324277 1328279 1329860 1330642 1331853 1333555 1335291 1337110
50946 1337110 1339486 1342385 1345069 1346828 1347446 1346697 1343828 1337807 1327868 1313546 1294473 1270440 1241580
50933 1241580 1208179 1170351 1128200 1082290 1033763 983901 933687 883806 834860 787450 742119
50922 742119 699316 659348 622302 588055 556551 528076 503150 482023 464309 449192 435970
50911 435970 424360 414364 405994 399145 393571 388934 384997 381796 379476 377873 376476 374948 373451 372278
50897 372278 371364 370551 370195 370996 373100 375781 378227 380351 382628 385452 388948 393179 398129 403569 409341
50882 409341 415783 423513 432648 442543 452471 462388 472812 484113 496206 509030 523119 539461 558701
50869 558701 580609 604552 630523 659496 692656 730468 772767 819579 871438 928915 992345
50858 992345 1062174 1139200 1223979 1316135 1414522 1517955 1625568 1736671 1850585 1966441
50848 1966441 2082626 2196323 2304069 2402951 2491110 2567211 2630008 2678736 2713602 2735625 2746267
50837 2746267 2747508 2741871 2731943 2719959 2708140 2699006 2694740 2696208 2703010 2714374 2729374 2746192 2761813
50824 2761813 2772894 2776705 2771106 2754047 2723626 2678572 2618549 2544146 2456808 2358578 2251596
50813 2251596 2137807 2019171 1897970 1776746 1658045 1544298 1437621 1339302 1249499 1167681
50803 1167681 1093418 1026690 967562 915768 870631 831297 797115 767818 743260 722977 706239
50792 706239 692556 681781 673491 666629 660148 653806 647967 642783 637962 633154 628124 622619 616584 610479
50778 610479 604835 599400 593357 586520 579691 573397 566850 558861 549554 540455 532873 526821 521681 517364
50764 517364 514343 512872 512682 513468 515269 518232 522261 527077 532533 538780 546277 555812 568294 584134
50750 584134 602788 623281 645360 669893 697947 729787 765079 803843 846659 893922 945347
50739 945347 1000461 1059265 1122039 1188515 1257491 1327352 1396831 1465193 1531744 1595351 1654491
50728 1654491 1707551 1752851 1788564 1813110 1825917 1827599 1819335 1802510 1779197 1752458 1725471 1700334
50716 1700334 1678068 1659511 1645621 1636925 1633318 1634520 1640042 1648441 1657211 1663896 1666950 1665105 1656386
50703 1656386 1638470 1610082 1571555 1523965 1468238 1405409 1337494 1267580 1198670 1132377 1068893
50692 1068893 1008229 951250 899271 852995 812347 777214 747681 723396 703338 686634 673216
50681 673216 663330 656836 653415 653081 655878 661220 668086 675811 684262 693284 702485 711594 720597 729365
50667 729365 737504 744715 751126 757121 763073 769238 775685 782308 789115 796591 805529 816426 829195 843549
50653 843549 859560 877766 898826 923125 950629 981108 1014435 1050457 1088536 1127543 1166507
50642 1166507 1205007 1242709 1278832 1312490 1343271 1370949 1394835 1414040 1428293 1437906 1442957 1443234
50630 1443234 1439084 1431580 1421496 1408689 1392882 1374615 1355110 1335667 1317486 1301501 1287823 1275746
50618 1275746 1264850 1255722 1249025 1244269 1240357 1237218 1236056 1237707 1241388 1245288 1247944 1248735 1247393 1243389
50604 1243389 1235722 1223199 1205022 1181139 1151919 1117702 1079028 1037225 994202 951459 909642
50593 909642 869133 830563 794450 760834 729780 701938 677933 657328 638853 621911 607360
50582 607360 596474 589426 585189 582699 581580 581715 582694 584105 586082 589021 592800 596755 600604 604887
50568 604887 610162 616154 622247 628576 635968 644812 654685 665396 677763 692740 710017 728093 745698
50555 745698 762669 779454 796305 813187 830103 847085 864045 880994 898449 917431 938924
50544 938924 963384 990688 1020514 1052850 1088309 1127929 1172541 1222360 1277313 1337712 1404286
50533 1404286 1477391 1556372 1639926 1726986 1816922 1908922 2001527 2092964 2181611 2265795 2343318
50522 2343318 2411688 2468999 2514324 2547053 2566112 2570162 2558547 2531798 2491310 2438818 2376256
50511 2376256 2305749 2229423 2149276 2067392 1986128 1907796 1834148 1766383 1705615 1653002 1609277
50500 1609277 1574485 1548485 1531613 1524548 1527542 1539987 1560700 1588336 1621366 1657746 1694660 1728501
50488 1728501 1755237 1771153 1773645 1761486 1734596 1693852 1641105 1578988 1510340 1437749 1363504
50477 1363504 1289577 1217357 1147636 1081091 1018608 960842 907698 858691 813863 773918 739347
50466 739347 709718 683998 661385 641686 625118 611945 602199 595531 591303 588967 588384 589759 593255
50453 593255 598647 605318 612587 620127 628047 636598 645902 655950 666545 676974 686048 692966 698157
50440 698157 702862 707807 712756 717446 722420 728548 736066 744550 753610 763184 773280 783916 795368
50427 795368 808175 822802 839495 858380 879476 902648 927869 955532 986307 1020621 1058495
50416 1058495 1099803 1144363 1191700 1241020 1291504 1342394 1392682 1440985 1485921 1526476 1561849
50405 1561849 1591159 1613471 1628010 1634182 1631438 1619267 1597280 1565372 1523980 1474350 1418423 1358329
50393 1358329 1295987 1233086 1171142 1111405 1054931 1002877 956491 916605 883285 856209 835279
50382 835279 820607 812053 809113 811230 817976 828947 843694 861651 881765 902111 920251 934126
50370 934126 942521 944737 940312 929211 911960 889318 862087 831469 799186 766753 734765 703268
50358 703268 672652 643666 616561 590869 566237 543053 521973 503234 486697 472174 459332
50347 459332 447574 436546 426645 418603 412631 408331 405341 403555 402772 402765 403837 406738 411635 417520 423061
50332 423061 427828 432386 437430 443221 449658 456445 463152 469458 475422 481408 487770 494695 502121 509540
50318 509540 516035 520892 524202 526643 528747 530590 532171 533736 535761 538775 543125 548593 554339 559529
50304 559529 563965 567814 570908 572905 574079 575341 577343 580114 583793 589091 596564 605914 616426 627659
50290 627659 638997 648716 654219 653524 646407 634258 619188 603309 588419 575877 566459 560152 556206
50277 556206 553734 552330 551914 552047 551970 551498 551343 552142 553613 555128 556660 558517 560448 561764 562245 562279 562098
50260 562098 561511 560427 558988 557112 554540 551497 548633 546026 542929 538933 534786 531466 528788 525637
50246 525637 521449 516920 513183 510647 508755 506679 504208 502122 501645 503353 506642 510343 513745 516883
50232 516883 519983 522952 525483 527487 529265 531205 533307 535075 535907 535499 533784 530712 526437 521622 517092
50217 517092 513001 508728 503782 498486 493517 489054 484741 480279 475715 471232 466955 462954 459213 455649
50203 455649 452342 449652 447933 447285 447821 450032 454544 461470 470280 480370 491644 504495 519282 535799
50189 535799 553179 570408 587017 603081 618476 632449 644203 653725 661636 668349 673726 677528
50177 677528 679710 680114 678214 673452 665676 655059 641614 624969 604739 581231 555728 529919 504895
50164 504895 480810 457587 435652 415640 397637 381219 366297 353475 343331 335600 329214 323009
50152 323009 316333 309217 302218 295983 290853 286833 283826 281654 279928 278265 276758 275919 275961 276434 276778
50137 276778 276960 277247 277565 277453 276619 275176 273350 271317 269398 268089 267735 268337 269787 272077 275101 278585
50121 278585 282502 287389 293788 301339 308834 315381 321168 326897 332804 338651 344481 350796 357889 365392
50107 365392 372738 379811 386917 394274 401736 408934 415608 421872 428152 434708 441281 447453 453336 459498
50093 459498 466123 472775 479207 485913 493484 501935 511175 521681 533966 547714 562282 577961 595859
50080 595859 616473 639269 663973 691430 722687 757850 796365 837808 881601 926226 969521
50069 969521 1009869 1046838 1080788 1112303 1141902 1169778 1195667 1219143 1239978 1257922 1272239
50058 1272239 1281810 1285718 1283447 1274579 1258750 1236113 1207615 1174666 1138582 1100352 1060669 1020046
50046 1020046 979019 938349 899029 862091 828394 798497 772496 749979 730291 712967 697933
50035 697933 685362 675438 668182 663377 660549 659030 658004 656598 654200 650774 646691 642091 636591 629796
50021 629796 621909 613535 605059 596492 587791 578899 569466 558979 547362 535196 523193 511628 500400
50008 500400 489390 478545 467796 457174 447033 437984 430495 424562 419736 415462 411445 407675 404158
49995 404158 400721 397213 393775 390737 388213 385961 383636 381100 378418 375686 372922 370060 367037 363871
49981 363871 360629 357354 354169 351473 349694 348664 347484 345381 342539 339724 337272 334952 332730 331025
49967 331025 330112 329834 330200 331701 334622 338552 343081 348644 356090 365642 376862 389547 404027 420451
49953 420451 438329 456976 476013 495175 513910 531493 547437 561723 574683 586711 597943
49942 597943 608193 617308 625493 633027 639599 644186 645622 643086 636112 624598 609015 590253 568971
49929 568971 545321 519593 492916 466944 442922 421279 401996 385000 370203 357444 346529
49918 346529 337208 329145 322028 315712 310101 304959 300032 295305 290974 287182 283881 280862 277712 273859
49904 273859 269074 263920 259387 255968 253320 250919 248699 246861 245352 243862 242203 240438 238670 236874
49890 236874 234965 232923 230928 229375 228557 228237 227770 226880 226095 226125 226904 227626 227674 227232 226871 226895 227203 227517
49872 227517 227535 227079 226401 226195 227021 228635 230164 231027 231503 232329 233873 235919 238042 239900 241207 241821 242044
49855 242044 242535 243631 244950 245924 246531 247136 247792 248204 248375 248709 249307 249647 249305 248562 247920 247322 246290 244651
49837 244651 242769 241188 240270 239966 239597 238234 235783 233435 232463 232716 233000 232846 233109 234615 237022 239464
49821 239464 241689 243941 246065 247460 247914 247977 248328 249026 249573 249636 249520 249803 250545 251066 250751 249833 249048 248642
49803 248642 248168 247277 246205 245330 244667 244011 243207 242112 240591 238753 236914 235205 233584 232280 231693 231609
49787 231609 231098 229638 227908 226983 227084 227588 227982 228228 228394 228417 228192 227549 226351 224914 224052 224284 225247 226294
49769 226294 227342 228610 229850 230511 230519 230253 229902 229470 229304 229894 231142 232524 233978 235953 238493 240985
49753 240985 242985 244660 246191 247358 247981 248248 248360 248329 248314 248661 249405 250229 250988 251691 251830 250548 247874
49736 247874 245139 243680 243608 244261 245198 246295 247396 248567 250245 252671 255551 258604 261882 264986 266744
49721 266744 266454 264878 263158 261280 258657 255754 253851 253312 253397 253813 255194 257675 260197 261862 262955
49706 262955 263948 264373 263625 262275 261560 261810 262208 262055 261512 261043 260739 260470 260258 260268 260608 261303 262408 264043
49688 264043 266282 268906 271324 272963 273874 274692 275834 276941 277352 276974 276378 276147 276378 276785 277054 277140 277435
49671 277435 278608 281047 284421 287896 290696 292340 292588 291578 290015 288778 288138 287655 287050 286853 287859
49656 287859 290182 293277 296942 301834 308826 318190 329708 343321 359103 376407 393278 406926 414888
49643 414888 415979 410603 400396 387400 373240 358917 345239 333075 323037 315139 309104 304830
49631 304830 302228 300678 299125 296883 294136 291516 289427 287884 286817 286234 286140 286432 286903 287336 287682 288095
49615 288095 288739 289559 290432 291492 293106 295425 298179 300989 303713 306326 308704 310696 312389 314111 316227
49600 316227 318938 322162 325525 328690 331753 335121 338805 342106 344331 345697 347162 349376 352174 355187
49586 355187 358563 362754 367756 372924 377559 381432 384631 387153 388998 390634 392994 396663 401174 405449
49572 405449 408966 412200 415773 419551 422896 425624 428245 431171 434119 436565 438583 440867 443913 447456
49558 447456 450826 453656 455995 457859 459057 459620 460055 460860 461974 463094 464491 466937 470584 474396 477081
49543 477081 478374 479021 479709 480528 481426 482661 484559 487174 490357 493931 497628 501147 504484 508035 512160
49528 512160 516795 521662 526645 531746 536786 541439 545570 549345 553103 557251 562155 567824 573776 579453
49514 579453 584764 589951 594935 599141 602068 603735 604413 604116 602554 599459 594862 589207 583288 577816 572884
49499 572884 568004 562813 557476 552220 546833 541010 534952 529117 523517 517794 511966 506550 501831 497541
49485 497541 493492 489978 487189 484650 481734 478409 475026 471608 467889 463897 459913 455943 451799 447738
49471 447738 444378 441782 439184 436018 432739 430198 428515 427133 425758 424622 423791 422776 421126 419057
49457 419057 417122 415496 413928 412359 411207 410839 410944 410676 409466 407622 406065 405573 406229 407502 408801
49442 408801 409994 411453 413566 416219 418930 421515 424479 428600 434238 441029 447987 453723 456896 457036
49428 457036 454958 452075 449211 446334 443355 440680 438806 437754 437224 437092 437471 438487 440243 442898 446503
49413 446503 450861 455742 461146 467140 473589 480298 487341 495005 503394 512314 521490 530699 539693 548226
49399 548226 556216 563794 571189 578671 586446 594412 602097 609025 615092 620335 624501 627226 628696 629667
49385 629667 630626 631243 630927 629668 628016 626421 624961 623717 623026 623203 624227 625829 627749 629734 631442
49370 631442 632617 633339 633871 634144 633687 632265 630544 629796 630900 633730 637444 641226 644727 648136 651912
49355 651912 656258 660710 664519 667548 670559 674345 678816 683272 687420 691706 696709 702570 709076 715895
49341 715895 722609 728836 734575 740266 746343 752776 759122 764916 770026 774719 779458 784447 789391 793834
49327 793834 797702 801269 804674 807837 810876 814158 817722 821038 823703 826070 828794 831939 835034 837835
49313 837835 840573 843371 845921 847972 849777 851785 854064 856249 857950 858989 859435 859675 860399 862111 864489
49298 864489 866460 867176 866891 866747 867759 870076 873092 876015 878367 880260 882328 885239 889144 893707 898683
49283 898683 904103 909765 914957 919147 922736 926578 930849 934931 938449 941758 945159 948173 950090 950911
49269 950911 951161 950957 949779 947204 943432 938964 934085 928836 923267 917533 911854 906455 901391 896353 890869
49254 890869 884905 879197 874686 871520 868831 865583 861491 856904 852016 846717 841280 836557 833001 829768
49240 829768 825373 819181 811711 803597 794970 786007 777390 769720 763009 757220 752856 750402 749479 749214 749304
49225 749304 750041 751326 752357 752535 752166 752052 752780 754630 757728 761883 766445 770665 774185 777116 779826
49210 779826 782802 786509 791166 796603 802429 808295 814003 819566 825202 831142 837362 843656 850030 856770
49196 856770 864049 871612 879019 886073 892940 899974 907510 915684 924253 932666 940469 947692 954840 962509
49182 962509 970991 980107 989421 998599 1007579 1016403 1025091 1033814 1042975 1052822 1063061 1073235 1083471
49169 1083471 1094460 1106599 1119494 1132524 1145651 1159430 1174359 1190370 1206852 1223129 1239067
49158 1239067 1255268 1272435 1290500 1308589 1325878 1342222 1357902 1373181 1388342 1403757 1419586
49147 1419586 1435610 1451617 1467726 1484073 1500404 1516307 1531689 1546730 1561603 1576484 1591597
49136 1591597 1606784 1621174 1633776 1644539 1654565 1665259 1677382 1690797 1704763 1718554 1732093
49125 1732093 1746049 1761119 1777349 1794421 1812479 1832294 1854599 1879630 1907198 1936699 1966906
49114 1966906 1996227 2023598 2049079 2073424 2097047 2119215 2137846 2150106 2153806 2148799 2137070 2121276
49102 2121276 2103156 2083190 2061416 2038214 2014378 1990751 1968000 1946764 1927887 1912241 1900182
49091 1900182 1891271 1884736 1880106 1877241 1875875 1875457 1875493 1875706 1875868 1875691 1874996 1873811 1872261 1870510 1868760 1867062
49075 1867062 1865094 1862437 1859063 1855248 1850958 1845795 1839695 1833307 1827325 1821674 1815684 1808903 1801478 1793836
49061 1793836 1786279 1778883 1771563 1764181 1756629 1748812 1740588 1731868 1722808 1713711 1704742 1695893 1687187 1678650
49047 1678650 1670077 1661191 1652236 1644074 1637491 1632593 1629019 1626400 1624374 1622491 1620523 1618698 1617308 1616226
49033 1616226 1615116 1614010 1613265 1613000 1612884 1612558 1612046 1611727 1611978 1612824 1613865 1614627 1615093 1615704 1616760 1618107 1619580
49016 1619580 1621412 1623865 1626744 1629758 1633182 1637634 1643162 1649068 1654790 1660630 1667424 1675617 1684753 1693771
49002 1693771 1701870 1709219 1716788 1725380 1734947 1744972 1755173 1765473 1775504 1784636 1792523 1799283 1805212
48989 1805212 1810578 1815553 1819961 1823219 1824947 1825571 1825867 1826048 1825823 1825148 1824206 1822748 1820370 1817594 1815735
48974 1815735 1815224 1814926 1813711 1812054 1811277 1811794 1813025 1814774 1817671 1822180 1827926 1834262 1840969 1848137 1855773
48959 1855773 1863732 1871846 1880024 1888432 1897523 1907596 1918340 1929166 1939995 1951344 1963523 1976183
48947 1976183 1988820 2001409 2014305 2027727 2041657 2056110 2071197 2086907 2103037 2119505 2136688
48936 2136688 2155330 2175990 2198609 2222735 2248219 2275504 2305115 2337065 2370920 2406236 2442595
48925 2442595 2479418 2516181 2552887 2590054 2628132 2667170 2707002 2747389 2787905 2828001 2867395
48914 2867395 2906169 2944328 2981560 3017598 3052587 3086727 3119712 3150853 3179762 3206662 3232012
48903 3232012 3255982 3278416 3299234 3318838 3337993 3357181 3376052 3393773 3410103 3425884 3442165
48892 3442165 3458923 3475030 3489447 3502093 3513370 3523271 3531423 3537831 3543070 3547536 3550858 3552348 3551840
48879 3551840 3549662 3545814 3539655 3530675 3519252 3506180 3491575 3474662 3454683 3431592 3405671 3376969
48867 3376969 3345551 3312043 3277360 3241870 3205193 3166962 3127387 3086936 3045853 3004292 2962729
48856 2962729 2921815 2881897 2842950 2805055 2768657 2734246 2701954 2671649 2643316 2617272 2594016
48845 2594016 2573890 2556768 2542098 2529390 2518747 2510785 2506001 2504329 2505359 2508750 2514256 2521622 2530765
48832 2530765 2541919 2555226 2570217 2586106 2602707 2620693 2640703 2662417 2684744 2706832 2728683
48821 2728683 2750863 2773826 2797509 2821424 2845095 2868396 2891405 2914002 2935884 2957091 2978243
48810 2978243 2999949 3022054 3043744 3064299 3083453 3101091 3117019 3131195 3143907 3155548 3166398
48799 3166398 3176769 3187132 3197811 3208641 3219198 3229365 3239443 3249690 3259955 3269955 3279751
48788 3279751 3289654 3299725 3309603 3319025 3328250 3337688 3347222 3356265 3364608 3372817 3381536 3390613 3399236 3406790
48774 3406790 3413256 3418872 3423781 3428046 3431562 3433795 3433933 3431542 3426875 3420356 3412013 3401640 3389268 3375120
48760 3375120 3359240 3341590 3322495 3302637 3282435 3261603 3239413 3215301 3189272 3162025 3134710
48749 3134710 3108270 3082801 3057713 3032631 3007904 2984081 2961248 2939281 2918546 2899858 2883624
48738 2883624 2869478 2856963 2846243 2837887 2832197 2829016 2828028 2828831 2830788 2833209 2835800 2838665 2841700 2844243
48724 2844243 2845548 2845513 2844725 2843798 2842891 2841905 2840959 2840384 2840226 2839984 2839191 2838226 2838194 2839715 2842098 2843974 2844573 2844000
48706 2844000 2842419 2839625 2835552 2830583 2825083 2819075 2812805 2807179 2803059 2800312 2798062 2795748 2793409 2791078
48692 2791078 2788674 2786570 2785569 2785959 2787077 2788262 2789844 2792753 2797455 2803911 2812568 2824842 2842415 2866320
48678 2866320 2896812 2933814 2977057 3025614 3077241 3128065 3173001 3206784 3225096 3225239 3206325 3169275
48666 3169275 3116795 3053043 2982729 2909974 2837663 2767645 2701248 2639407 2582381 2529757 2480987
48655 2480987 2435832 2394175 2355632 2319619 2285685 2253469 2222411 2191891 2161706 2132136 2103480
48644 2103480 2075819 2049238 2023847 1999370 1975107 1950716 1926860 1904625 1884262 1864823 1845164
48633 1845164 1825146 1805725 1787891 1771602 1755849 1739777 1723550 1707946 1693325 1679413 1666033
48622 1666033 1653452 1641796 1630643 1619636 1609094 1599480 1590558 1581648 1572715 1564624 1558218 1553581 1550287
48609 1550287 1547954 1546338 1545170 1544177 1543141 1541922 1540585 1539536 1539255 1539811 1540868 1542098 1543319 1544241 1544590
48594 1544590 1544638 1545104 1546197 1547174 1547287 1546823 1546675 1547124 1547675 1548041 1548556 1549375 1549903 1549548 1548762 1548752 1550190 1552590
48576 1552590 1555014 1557037 1558760 1560122 1560528 1559245 1556018 1551239 1545534 1539242 1532342 1524846 1517132 1509747
48562 1509747 1502916 1496418 1490081 1484200 1479252 1475217 1471456 1467381 1463038 1458981 1455684 1453228 1451369 1449689
48548 1449689 1447709 1445024 1441426 1437016 1432327 1428277 1425648 1424337 1423336 1421697 1419384 1416992 1414960 1413498
48534 1413498 1412996 1413761 1415226 1416068 1415427 1413585 1411266 1408799 1406357 1404397 1403117 1401756 1399241 1395476 1391372
48519 1391372 1387563 1383783 1379679 1375521 1371714 1368119 1364370 1360519 1356809 1353067 1348880 1344310 1339959 1336266
48505 1336266 1333100 1330035 1326614 1322340 1316914 1310699 1304644 1299517 1295430 1292097 1289180 1286195 1282614 1278538
48491 1278538 1274911 1272561 1271169 1269695 1267670 1265541 1263773 1262290 1260960 1260019 1259588 1259270 1258676 1258075 1257990 1258270
48475 1258270 1258093 1256986 1255413 1254196 1253588 1253139 1252362 1251361 1250723 1250794 1251100 1250607 1248687 1245729 1242709 1240231
48459 1240231 1238144 1235942 1233355 1230509 1227729 1225185 1222693 1219850 1216402 1212330 1207572 1201868 1195148 1187885
48445 1187885 1180745 1173921 1167093 1159970 1152558 1144904 1136945 1128777 1120830 1113602 1107228 1101339 1095211 1088123
48431 1088123 1079872 1070971 1062180 1053771 1045466 1037040 1028697 1020756 1013289 1006177 999254 992296 985115 977808
48417 977808 970665 963749 956845 949957 943416 937324 931269 925012 919126 914386 910688 907106 903049 898906
48403 898906 895404 892727 890525 888525 886834 885676 885084 884899 884921 884848 884121 882120 878844 875341 873050 872490
48387 872490 872721 872235 870251 867154 863995 861818 861159 861752 862666 862983 862337 860784 858412 855386 852226 849645
$$ [...]
##END NTUPLES=NMR SPECTRUM
##END=
