##TITLE=NES1065_159122.0003_002_9705170_9dfmSsBsMY
##JCAMPDX= 6.0         $$ Bruker NMR JCAMP-DX V2.0
##DATA TYPE= NMR SPECTRUM
##DATA CLASS= NTUPLES
##ORIGIN= BRUKER
##OWNER= Administrator
$$ 1.72 TOPSPIN		Version 2.1
$$ 2016-05-01 20:01:02.317 -0700  Administrator@X
$$ Compression mode = diff/dup
##.OBSERVE FREQUENCY= 400.02188249412
##.OBSERVE NUCLEUS= ^1H
##.ACQUISITION MODE= SIMULTANEOUS (DQD)
##.ACQUISITION SCHEME= undefined
##.AVERAGES= 8
##.DIGITISER RES= 22
##SPECTROMETER/DATA SYSTEM= spect
##.PULSE SEQUENCE= zg30
##.SOLVENT NAME= COFFEE_meoh
##.SHIFT REFERENCE= INTERNAL, COFFEE_meoh, 1, 14.98509
##AUDIT TRAIL= $$ (NUMBER, WHEN, WHO, WHERE, PROCESS, VERSION, WHAT)
$$ ##TITLE= Audit trail, TOPSPIN		Version 2.1
$$ ##JCAMPDX= 5.01
$$ ##ORIGIN= Bruker BioSpin GmbH
$$ ##OWNER= Administrator
$$ $$ E:\/data/COFFEE/nmr/NES1065_159122.0003_002_9705170_9dfmSsBsMY/10/pdata/1/auditp.txt
$$ ##AUDIT TRAIL=  $$ (NUMBER, WHEN, WHO, WHERE, PROCESS, VERSION, WHAT)
(   1,<2016-05-01 20:00:55.271 -0700>,<Administrator>,<X>,<go>,<TOPSPIN 2.1>,
      <created by zg
	started at 2016-05-01 19:59:49.005 -0700,
	POWCHK enabled, PULCHK disabled,
       configuration hash MD5:
       21 0F 79 D6 B3 7B B4 F6 88 20 88 DB 03 48 BD 9F
       data hash MD5: 64K
       62 85 A3 B6 25 5F 9D 47 4A 19 E0 41 9B CB 06 32>)
(   2,<2016-05-01 20:00:58.333 -0700>,<Administrator>,<X>,<proc1d>,<TOPSPIN 2.1>,
      <Start of raw data processing
       efp LB = 0 FT_mod = 6 PKNL = 1 PHC0 = 0 PHC1 = 0 SI = 32K 
       data hash MD5: 32K
       B7 19 17 A0 82 4A B6 97 DD A0 5A 4E 73 41 32 BF>)
(   3,<2016-05-01 20:00:58.614 -0700>,<Administrator>,<X>,<proc1d>,<TOPSPIN 2.1>,
      <pk PHC0 = 93.97156 PHC1 = 0 
       data hash MD5: 32K
       3B DF 92 6F 85 DA 54 03 25 9E CC 7F 05 5F 48 42>)
(   4,<2016-05-01 20:00:58.724 -0700>,<Administrator>,<X>,<proc1d>,<TOPSPIN 2.1>,
      <abs ABSG = 1 
       data hash MD5: 32K
       B4 2C 4B 8C FD A4 ED 9D F2 B4 70 27 6E 65 53 D3>)
(   5,<2016-05-01 20:00:58.786 -0700>,<Administrator>,<X>,<proc1d>,<TOPSPIN 2.1>,
      <abs ABSG = 2 
       data hash MD5: 32K
       68 47 A5 7E D2 89 12 46 48 D0 29 97 59 DF 4A EB>)
(   6,<2016-05-01 20:00:58.849 -0700>,<Administrator>,<X>,<proc1d>,<TOPSPIN 2.1>,
      <abs ABSG = 3 
       data hash MD5: 32K
       D0 96 18 93 50 03 B8 92 0A E6 EB A2 BD B2 E8 4E>)
(   7,<2016-05-01 20:00:58.911 -0700>,<Administrator>,<X>,<proc1d>,<TOPSPIN 2.1>,
      <abs ABSG = 4 
       data hash MD5: 32K
       50 09 1D 46 4E 6B DC 2A 4B 0E 04 30 EE 10 FA C6>)
(   8,<2016-05-01 20:00:58.974 -0700>,<Administrator>,<X>,<proc1d>,<TOPSPIN 2.1>,
      <abs ABSG = 5 
       data hash MD5: 32K
       0D 1B D0 FD 99 1E FD 5E B9 A5 46 29 C5 23 96 E4>)
$$ ##END=
$$ 
$$ $$ hash MD5
$$ $$ 9D 04 78 7F 42 24 B3 51 4A 5E 12 C7 11 7C DD 36
##$RELAX= 
##$RELAX= 
##$RELAX= 
##$RELAX= 
##$RELAX= 
##$RELAX= 
##$RELAX= 
$$ Bruker specific parameters
$$ --------------------------
##$DU= <E:\>
##$EXPNO= 10
$$ [...]
150 150 150 150 150 150 150 150
##$TP07= 0
##$TPNAME0= <>
##$TPNAME1= <>
##$TPNAME2= <>
##$TPNAME3= <>
##$TPNAME4= <>
##$TPNAME5= <>
##$TPNAME6= <>
##$TPNAME7= <>
##$TPOAL= (0..7)
0.5 0.5 0.5 0.5 0.5 0.5 0.5 0.5
##$TPOFFS= (0..7)
0 0 0 0 0 0 0 0
##$TUNHIN= 0
##$TUNHOUT= 0
##$TUNXOUT= 0
##$USERA1= <user>
##$USERA2= <user>
##$USERA3= <user>
##$USERA4= <user>
##$USERA5= <user>
##$V9= 5
##$VALIST= <valist>
##$VCLIST= <CCCCCCCCCCCCCCC>
##$VD= 0
##$VDLIST= <DDDDDDDDDDDDDDD>
##$VPLIST= <PPPPPPPPPPPPPPP>
##$VTLIST= <TTTTTTTTTTTTTTT>
##$WBST= 2048
##$WBSW= 25
##$XGAIN= (0..3)
0 0 0 0
##$XL= 0
##$YL= 0
##$YMAX_a= 575746
##$YMIN_a= -485380
##$ZGOPTNS= <>
##$ZL1= 120
##$ZL2= 120
##$ZL3= 120
##$ZL4= 120
##$ABSF1= 14.98509
##$ABSF2= -5.573092
##$ABSG= 5
##$ABSL= 3
##$ALPHA= 0
##$AQORDER= 0
##$ASSFAC= 0
##$ASSFACI= 0
##$ASSFACX= 0
##$ASSWID= 0
##$AUNMP= <proc_prof1d_extract_pilot.lims>
##$AXLEFT= 0
##$AXNAME= <>
##$AXNUC= <1H>
##$AXRIGHT= 0
##$AXTYPE= 0
##$AXUNIT= <>
##$AZFE= 0.1
##$AZFW= 0.1
##$BCFW= 0
##$BC_mod= 0
##$BYTORDP= 0
##$COROFFS= 0
##$CY= 15
##$DATMOD= 1
##$DC= 0
##$DFILT= <>
##$DTYPP= 0
##$F1P= 0
##$F2P= 0
##$FCOR= 0.5
##$FTSIZE= 32768
##$FT_mod= 6
##$GAMMA= 0
##$GB= 0
##$INTBC= 1
##$INTSCL= 1
##$ISEN= 128
##$LB= 0
##$LEV0= 0
##$LPBIN= 0
##$MAXI= 10000
##$MC2= 0
##$MEAN= 0
##$ME_mod= 0
##$MI= 0
##$NCOEF= 0
##$NC_proc= -8
##$NLEV= 6
##$NOISF1= 0
##$NOISF2= 0
##$NSP= 0
##$NTH_PI= 0
##$NZP= 0
##$OFFSET= 14.98509
##$PC= 1
##$PHC0= 93.97156
##$PHC1= 0
##$PH_mod= 1
##$PKNL= yes
##$PPARMOD= 0
##$PPDIAG= 0
##$PPIPTYP= 0
##$PPMPNUM= 2147483647
##$PPRESOL= 1
##$PSCAL= 4
##$PSIGN= 0
##$PYNMP= <proc.py>
##$REVERSE= no
##$SF= 400.02
##$SI= 32768
##$SIGF1= 0
##$SIGF2= 0
##$SINO= 400
##$SIOLD= 32768
##$SPECTYP= <>
##$SREGLST= <1H.CDCl3>
##$SSB= 0
##$STSI= 32768
##$STSR= 0
##$SW_p= 8223.68421052631
##$SYMM= 0
##$S_DEV= 0
##$TDeff= 65536
##$TDoff= 0
##$TI= <>
##$TILT= no
##$TM1= 0
##$TM2= 0
##$TOPLEV= 0
##$USERP1= <user>
##$USERP2= <user>
##$USERP3= <user>
##$USERP4= <user>
##$USERP5= <user>
##$WDW= 1
##$XDIM= 32768
##$YMAX_p= 430563464
##$YMIN_p= -709419
##$CURPLOT= <Network HP LaserJet P1505>
##$CURPRIN= <$Network HP LaserJet P1505>
##$DFORMAT= <normdp>
##$LAYOUT= <+/1D_H.xwp>
##$LFORMAT= <normlp>
##$PFORMAT= <normpl>
##$SURQMSG= 1
$$ End of Bruker specific parameters
$$ ---------------------------------
##NTUPLES= NMR SPECTRUM
##VAR_NAME=  FREQUENCY,     SPECTRUM/REAL,   SPECTRUM/IMAG
##SYMBOL=    X,             R,               I
##VAR_TYPE=  INDEPENDENT,   DEPENDENT,       DEPENDENT
##VAR_FORM=  AFFN,          ASDF,            ASDF
##VAR_DIM=   32768,         32768,           32768
##UNITS=     HZ,            ARBITRARY UNITS, ARBITRARY UNITS
##FACTOR=    0.250966925370066, 1,           1
##FIRST=     8223.43324360094, 125530,       -92324
##LAST=      0,             115041,          -78499
##MIN=       0,             -709419,         0
##MAX=       8223.43324360094, 430563464,    0
$$ Real data points
##PAGE= N=1
##DATA TABLE= (X++(R..R)), XYDATA
$$ [...]
19509A14475n6687a66176f1893k9748n0740N4111o1827j22997J11290b9223l3811
19498f3034j3778C0338a33133C2279a42797G7435K1648c05020a15010D9387b76076
19486G7126d8692A9704f157n00955J32110A76512d76423A13117c22693G1172f9068
19474b51514B39583h1205j538p0292A7301b45848A9577K4370d3256h709j7576
19463b6285m55642D4552A2399c38675E3623a71854f5340a410D2057c0491i204
19451c4826j52451f1643j71680D0612a73976G8684f1933B11431c61077I4135J96750
19440B90885B5226g8462m6089r6313h9414I5841b05211A79123a97584Q5927C72830
19428B1877a06468I9754K5115J15807b42093f3096p6330J9566C285f9913k21836
$$ y = [114475, 57788, -166176, -61893, -91641, -142381, -88270, -150097, -273094, -161804, -29223, -63034, -76812, 30338, -133133, 32279, -142797, 77435, 99083, -305020, -115010, 49387, -276076, 77126, -48692, 19704, -6157, -507112, -375002, 176512, -476423, 113117, -322693, 71172, -69068, -251514, 239583, -81205, -82743, -153035, 17301, -245848, 19577, 43947, -43256, -8709, -26285, -481927, 44552, 12399, -338675, 53623, -171854, -65340, -1410, 42057, -30491, -9204, -34826, -187277, -61643, -233323, 40612, -173976, 78684, -61933, 211431, -361077, 94135, 290885, 25226, -78462, -124551, -220864, -89414, 95841, -205211, 179123, -197584, -111657, 372830, 21877, -106468, 99754, 124869, 240676, -242093, -63096, -139426, -119860, 3285, -69913, -291749]
19417b91749F3073O2972a93129a6442H9883M9045g1852J5773r8971e1137j58244
19406b09381i9496E4420a27117p4982B55766b1550j11010D0029J13151j9286J56899
19395B90793O5795i7556r0820b9422I9633J11678b37031i9570A72156f7851j23888
19384a91739F5a17092c037k15255a9200F0559P1102B0042J21135b33053A20808
19372F8560e1242k45182O0353A42614J3745a0553m5753B51065H0467j1287K4922
19361I4102D0781h8182o3672j14295A82403o6728b01950A69303b87142B54345
19350i2613G6017a24708A61931a49151b1851F554a0916B6154c3365k9992G8206
19338a95547K3350m6540A30232J0188a19990j67743C67316b21240H8045g7931
$$ y = [-291749, 63073, 126045, -193129, -16442, 89883, 138928, -71852, -56079, -155050, -51137, -209381, -99496, 54420, -127117, -202099, 255766, -21550, -132560, 40029, 153180, 133894, 290793, 356588, -97556, -188376, -29422, 99633, 211311, -237031, -99570, 172156, -67851, -191739, 65, -117092, -3037, -218292, -19200, 60559, 131661, 20042, 141177, -233053, 120808, 68560, -51242, -296424, -236071, 142614, 156359, -10553, -56306, 251065, 80467, 69180, 94102, 40781, -88182, -151854, -266149, 182403, 115675, -201950, 169303, -287142, 254345, -92613, 76017, -124708, 161931, -149151, -21851, 6554, -10916, 26154, -33365, -63357, 78206, -195547, -172197, -218737, 130232, 140420, -119990, -287733, 367316, -221240, 88045, -77931]
19327a44123d4674A286i3546j67470d0978j12683j2697l000E6035f4681l18291
19316c82972a76657j01786Q3572Q8847G1354b5849A09083A2825J82367j4559q5224
19305I5409b05547j01427i4920k5661A17142E1856K62766l2338B8118a12806D3161
19293G8918a83862L6587O4283f885k17387B9496a39990H0130a97953l078G5928
19281b206k29437h2905j16397D5334b52859e1727j18916M9066A35622b46479B3072
19269d6140E1516N3033a09864L0132l94337a53468A68517A3404A135b95651Q2987
19258b12664q0384a15484a8030k72787g3751A03338a40569E852R6372a43803K7281
19247a16522I3910c0986B79355h6707A22973C7689b5470j08212m2680d6037l13999
$$ y = [-144123, -44674, 1286, -93546, -261016, -40978, -153661, -166358, -169358, 56035, -64681, -382972, -176657, -278443, -194871, -106024, 71354, -25849, 109083, 12825, 195192, 180633, 95409, -205547, -306974, -94920, -120581, 117142, 51856, 314622, 282284, 28118, -112806, 43161, 78918, -183862, -147275, -82992, -6885, -224272, 29496, -139990, 80130, -197953, -201031, 75928, -2206, -231643, -82905, -199302, 45334, -252859, -51727, -170643, -121577, 135622, -246479, 23072, -46140, 51516, 104549, -109864, -79732, -474069, -153468, 168517, 13404, 1135, -295651, -212664, -293048, -115484, -18030, -290817, -73751, 103338, -140569, 5852, 102224, -143803, -116522, 93910, -30986, 279355, -86707, 122973, 37689, -25470, -133682, -176362, -46037, -360036]
19236c60036a20231B02985c11329A7319a87164a0714n1190B694a39851k5731C6009
19224B58390g3772A8782d62459C63731D6798b52668A4820J05201J5376E8751j4401
19213D4350b36185E2566K21382A3427J40291K559a27872N6118B94272G2063a25526
19201B14138I961a00006p9213C9077f8089c2521A13985a47376A02034k1637C1850
19189i2275m8468M2518q4510M4747k5054A13603b47968e7843A48008a93160b9615
19177b32499N1440h224B2592N4158B1841c26711J06918P1917A12779B1699a81672
19165a96673o4069l2627I3814D117P883c00669a11303j3698J9284k26044h3276
19153A01810b70515P6998i2662A55631g4347K1412H3171a34882D0329b65726i1396
$$ y = [-360036, -120231, 202985, -311329, 17319, -187164, -10714, -61904, 2694, -139851, -165582, 36009, 258390, -73772, 18782, -462459, 363731, 46798, -252668, 14820, 120021, 135397, 58751, 44350, -236185, 52566, 273948, 13427, 153718, 156277, -127872, -71754, 294272, 72063, -125526, 214138, 9961, -100006, -179219, 39077, -68089, -32521, 113985, -147376, 102034, 80397, 31850, -92275, -140743, -98225, -182735, -137988, -163042, 113603, -247968, -57843, 148008, -193160, -29615, -232499, -181059, -8224, 22592, 76750, 21841, -326711, -219793, -147876, 112779, 21699, -181672, -196673, -260742, -293369, 93814, 4117, 12000, -300669, -111303, -125001, -105717, -331761, -83276, 101810, -270515, -193517, -92662, 155631, -74347, -52935, 83171, -134882, 40329, -265726, -91396]
19141e10481C273b50962g2426D9778b7172j39949D0811a5011l7161C82980B3231
19129I4123M1791a80947K1413H8481d41162b3122j76381d1090k39653P2767M284
19118b03692j29258E7808J45890a97261O2784n8465a8176A32165d8310q6736f3715
19106a42932A84348a72990A08184P8744q3536b09010O5949O2150j66127a22349
19095F150b9193j96315I1839b64431J695H0061K03551a4123k51772J23783N0011
19084i2101J0532k9720A29245f074r5626j53233A22554B2679g8337j3715B5012
19072a39629f0531A93846D6111A7790K7491a77096Q5511k2446j25674R8818b3377
19060B5280f8918n8108L9676A6458a50044B02681a67684j56987D937A99N27965
$$ y = [-510481, 3273, -250962, -72426, 49778, -27172, -167121, 40811, -15011, -52172, 382980, 23231, 94123, 135914, -180947, -159534, 88481, -441162, -23122, -199503, -41090, -280743, -207976, -203692, -332950, 57808, 203698, -197261, -134477, -192942, -18176, 132165, -48310, -135046, -63715, -142932, 184348, -172990, 108184, 186928, 103392, -209010, -143061, -80911, -247038, -122349, 6150, -29193, -225508, 91839, -264431, -262736, 80061, 283612, -14123, -265895, -142112, -92101, -81569, -111289, 129245, -6074, -101700, -254933, 122554, 22679, -78337, -92052, 25012, -139629, -60531, 193846, 46111, 17790, 45281, -177096, -91585, -114031, -239705, -140887, -23377, 25280, -68918, -127026, -87350, 16458, -150044, 202681, -167684, -324671, 4937, 199, 528164]
19049E28164A26690f2007o5575A04223e8576r4521d5558A3624J40320j4273B591
19037C3652N4097b4454r3004C01155a52937E2386N3771c2648A76188K5957a19383
19025B2743a78676d3160k08226A8244J63410a38971A87868p9734G218e5126J8745
19014c6381m06088a4822k19698a12582h317j83760A13940C2021a89654f0697I9700
19002a17905B0783a57769e6624j84371F528K62838E5486f588A06431b0916E5168
18990b7760A064a48176G3028f5879F542J22091R8333r2136J87873b65220N5162
18979b10058O8079K7409C9357a7158p4742j7503A60413b2170j62089A8203Q1491
18968I9694K07491j04764c0200j67781j6829H9723K4867c8049A6915f1218m33956
$$ y = [528164, 126690, -62007, -127582, 104223, -58576, -153097, -45558, 13624, 153944, 139671, 2591, 33652, 87749, -24454, -117458, 301155, -152937, 52386, 106157, -32648, 176188, 202145, -119383, 22743, -178676, -43160, -251386, 18244, 181654, -138971, 187868, 108134, 7218, -55126, -36381, -442469, -14822, -234520, -112582, -8317, -192077, 113940, 32021, -189654, -60697, 99700, -117905, 20783, -157769, -56624, -240995, 6528, 269366, 55486, -6588, 106431, -20916, 55168, -27760, 1064, -148176, 73028, -65879, 6542, 128633, 226966, 134830, 322703, -265220, -210058, -141979, -114570, 39357, -17158, -91900, -109403, 160413, -22170, -184259, 18203, 99694, 307185, 202421, -30200, -197981, -214810, 89723, 114590, -38049, 16915, -61218, -495174]
18957d95174A3703a46092B3775b51578J6921j087D20304k01322a76057b1411B0119
18945c6293j8000A26015b57259a7472A78359a1296p18A11718a1631B36547n8274
18934A78273d4916J4269j19149j34216B6276a14087k52515A77452b81970B54394
18923b41960J12287c0058j95764R1919B8818O065N0042c4953N096q4862j29760
18912b44479h3505F5546j615K9697b0529C17632n7762J4216A11190b17231f7776
18900A302b20536A19426a47461N4360j48877B46645c14466a12015p9028A05752
18889e9380G574a33236A38179f9300F8093a24466k9893n6449g6632A47016J02583
18878B49599f493G4699a02674j65122C09896j17438o5634f9373k64681c6967k74423
$$ y = [-495174, 13703, -146092, 23775, -251578, -234657, -235744, 420304, 218982, -176057, -21411, 20119, -36293, -54293, 126015, -257259, -17472, 178359, -11296, -12014, 111718, -11631, 236547, 178273, -44916, -30647, -149796, -284012, 26276, -114087, -366602, 177452, -281970, 254394, -241960, -129673, -30058, -225822, -133903, 28818, 34883, 84925, -34953, -29857, -114719, -244479, -83505, 65546, 63931, 93628, -20529, 317632, 259870, 274086, 111190, -217231, -67776, 1302, -220536, 119426, -147461, -93101, -241978, 246645, -314466, -112015, -191043, 105752, -59380, 7574, -133236, 138179, -69300, 68093, -124466, -154359, -210808, -76632, 147016, 249599, -6493, 74699, -102674, -267796, 309896, 192458, 126824, -69373, -334054, -36967, -311390]
18867c11390h6433k21348D1015i8887A19380C4848a43483K7159j104j47205a11483
18855b46875A56690d8364G9912c7706o0362l385q630m0140A46074a49304D1790
18843b7708k53915J8966g4090J1745b6830k62596a18517j27534Q3629A03528a9825
18831A54318a04405q488k65465R7033a9676A28317J64198b60056Q4364b7435q3413
18820a10848c1802C9127h2195B52078A04590a00857j41722G5958J99495H2244
18809B6047G351J5342i0186I3523m4899L4325J6340a71852d2880j03229M2536
18798a03573D61110D1397I925J5641f8865G0800O2501n5813C6229b12316E6783
18786a80302B5412c5420A96516a0859C05601c9102j23212g8810k78248G8346N0891
$$ y = [-311390, -86433, -307781, 41015, -98887, 119380, 34848, -143483, -116324, -117428, -264633, -111483, -246875, 156690, -48364, 79912, -37706, -98068, -101453, -110083, -150223, 146074, -149304, 41790, -27708, -281623, -262657, -74090, -62345, -26830, -289426, -118517, -246051, -162422, 103528, -19825, 154318, -104405, -112893, -378358, -281325, -19676, 128317, 292515, -260056, -175692, -27435, -110848, -31802, 39127, -82195, 252078, 104590, -100857, -242579, 75958, 275453, 82244, 26047, 7351, 22693, -90186, 93523, 48624, 82949, 99289, -171852, -42880, -146109, -103573, 461110, 41397, 9925, 25566, -68865, 70800, 133301, 77488, 36229, -212316, 56783, -180302, 25412, -35420, 196516, -10859, 305601, -39102, -162314, -78810, -357058, 78346, 129237]
18775A29237N0555o726J01116b7187j11832A2209i0797j21500O6827A5039b33221
18763b8697k40278c7969m4304j43725f6473F2354a58708e1028B09781g776A23851
18751b57845e3408l7893M0677l7752j7693J0685r2941I6158a47332a3315A18072
18739A3369a14342o1487q4687R8543A16087j2642B6699f9600m1125D3796J43349
18728A87145b8418k93359A74203d7888A70411p7327a41310k5665J8120A64862
18717a41959B1700J09854a99178G5674f0801j8589n5513a9065j69242Q350d6377
18705e2728C3574a50587r1497K0365i5112a6839H3197N056n854f7262C22446a78383
18692b93983m15436C37N1064c85558F4298J09896B7678b63028c7752F3816A1301
$$ y = [129237, 179792, 173066, 274182, -27187, -139019, 12209, -90797, -212297, -145470, 15039, -233221, -28697, -268975, -37969, -82273, -225998, -66473, 62354, -158708, -51028, 209781, -7776, 123851, -257845, -53408, -91301, -50624, -88376, -106069, -95384, -188325, 96158, -147332, -13315, 118072, 13369, -114342, -175829, -260516, -161973, 116087, 103445, 26699, -69600, -110725, 43796, 187145, -28418, -321777, 174203, -47888, 170411, 93084, -141310, -166975, -148855, 164862, -141959, 21700, 131554, -199178, 75674, -60801, -79390, -134903, -19065, -188307, -179957, -46377, -52728, 33574, -150587, -242084, -221719, -95112, -16839, 83197, 88253, 82399, -67262, 322446, -178383, -293983, -709419, 337, 51401, -385558, 64298, 174194, 27678, -263028, -37752, 63816, 11301]
18680d0797A67841a9111k3551l2233J6070j4469B36295a57538r0847A83842e4481
18668A15214a33616e0750C52405e33659d2211k1725j42487a3091j01328o8544
18658a82963j33718R7520A17275f777j40890A7757L7583O1374a76994Q7328r4663
18647a84329c9559a9751j73745D6093F63O1420a26274D1190b84732O8048Q9031
18636a27653r036l53293e7405m769A4571b797j75983A01260a23124I0491P3538
18625A64029a51833M728d6818m6274j18898N605d6958C06610b02686D4217a68620
18613B60308j20527a0034l9982G6748b516r9357I230a89165h4607C35641b19408
18601A00253m8974j8247a23817B85459a5283k12701L4240i6099o3228M8072G5682
$$ y = [-40797, 167841, -19111, -42662, -74895, -58825, -73294, 236295, -157538, -248385, 183842, -54481, 115214, -133616, -50750, 352405, -533659, -42211, -63936, -206423, -13091, -114419, -182963, -316681, -219161, 117275, -6777, -147667, 17757, 55340, 116714, -176994, -89666, -184329, -39559, -19751, -193496, 46093, 663, 62083, -126274, 41190, -284732, -216684, -127653, -136689, -489982, -57405, -62174, 14571, -2797, -178780, 101260, -123124, 90491, 164029, -151833, -147105, -46818, -93092, -211990, -206385, -46958, 306610, -202686, 44217, -168620, 260308, 139781, -10034, -50016, 76748, -2516, -101873, 9230, -189165, -84607, 335641, -219408, 100253, 51279, 33032, -123817, 285459, -15283, -227984, -193744, -96099, -159327, -111255, 75682]
18589B3639b09265J8814c8758p0274j68487o5453J22946r9745b2762l06887P0137
18578b59512B13662h1384B5880g0010k8767A63794b94268Q7264e9026A86305b45197
18566E7251c14812g2558G4864a35031A8711i3146I522K03468J93107b95794b1444
18554c76920E8430J83348g2935p2592O239j9956b6643j17760A6216J12231b34365
18542h9416H8262f8211I99b9746I1662H147b88923A93540c1487j23430k28608
18531c83525b8915I5771a87010A18037b82154A3746a87957g8096R703l41225H482
18519b9424k37116L9194d2877J3714A98904O406a33099A22346J44878h2188C28862
18507g4528e566k7924A28914a37134p4486I471b28815H2799a72803j70033A5004
$$ y = [23639, -209265, -190451, -38758, -109032, -277519, -342972, -220026, -319771, -22762, -329649, -259512, 213662, -81384, 25880, -70010, -98777, 163794, -294268, -207004, -59026, 186305, -245197, 57251, -314812, -72558, 74864, -135031, 18711, -93146, 9522, 212990, 406097, -295794, -21444, -376920, 58430, 241778, -72935, -145527, -139288, -159244, -26643, -144403, 16216, 128447, -234365, -89416, 88262, -68211, 999, -29746, 91662, 8147, -288923, 193540, -31487, -154917, -383525, -28915, 95771, -187010, 118037, -282154, 13746, -187957, -78096, -68393, -409618, 8482, -29424, -266540, -227346, -42877, -29163, 198904, 205310, -133099, 122346, 267224, -82188, 328862, -74528, -5566, -33490, 128914, -137134, -211620, 9471, -228815, 82799, -172803, -342836, 15004]
18495c30456R4921J12427j12651B21635b21710f1100k05685B23492I8590L2391
18485A30981f7707E4795J84072a5517n9363j55508F8787B3819N8345a54063n9607
18474b13670l1152F8781a96255Q6677b8072A31686l1409a21081n9134p001I4943
18462b05444j12558F2719B7775i2113L2546j7293I1977a57017C6245O8095a24373
18450d7219E1150J2650h1511F8443a79513A20834e13897B65096D4164J6589h2106
18438f0169A29354a20686j16834A29779a41672D5873b14411c9882A23457b75907
18427i2852p0897N8863j47373A94674q8000g1971j53228F0453a83864f7554H7564
18415a44035h063m6534j75936K5359j18784M1176A20518c9211F1538c8574A79667
$$ y = [-330456, -235535, -123108, -235759, 221635, -221710, -61100, -266785, 223492, 98590, 130981, -67707, 54795, 238867, -15517, -74880, -230388, 68787, 23819, 82164, -154063, -213670, -244822, 68781, -196255, -109578, -28072, 131686, 100277, -121081, -180215, -187216, 94943, -205444, -318002, 62719, 27775, -92113, -59567, -76860, 91977, -157017, 36245, 104340, -124373, -47219, 51150, 63800, -81511, 68443, -179513, 120834, -513897, 265096, 44164, 60753, -82106, -60169, 129354, -120686, -237520, 129779, -141672, 45873, -214411, -39882, 123457, -275907, -92852, -163749, -104886, -252259, 194674, 106674, -71971, -225199, 60453, -183864, -67554, 87564, -144035, -8063, -54597, -230533, -205174, -323958, -282782, 120518, -39211, 61538, -38574, 179667]
18403B70308j25873e2326K5110r7535f696C1356J35742d20924c6496I036K29956
18392B38992j17718J74828a31218j47129J23834k2131A62886b0029B4489L37832
18382C62321e0475A20220f9600m8072L9784A6729J48604E4369j6253j5585M4201
18371F6732L7024m8602a36345B04914a38758D0522d17410C0337b0922r2441r6657
18360b10020i514A47052a42196A39419F1289d6724A85695a55261g6928j73217
18350b50145A49777g8376G3438a46332M780N9031D587O8257M0614a65065F1093
18338i8862H9072N7734L45790A8889a24003a2576A68162D8307j5236L0429b01865
18326C29156D1564b09464K5537F0366a86159C46926A18028D2780b0072j76039
$$ y = [270308, 144435, -52326, -27216, -124751, -6696, 31356, 167098, -420924, -36496, 9036, 238992, 121274, 296102, -131218, -278347, -154513, -176644, 162886, -20029, 24489, 362321, -50475, 120220, -69600, -117672, -77888, 16729, 165333, 54369, 38116, 22531, 66732, 103756, 55154, -136345, 204914, -138758, 40522, -417410, 30337, -20922, -113363, -210020, -9514, 147052, -142196, 139419, 61289, -46724, 185695, -155261, -76928, -250145, 149777, -78376, 73438, -146332, -141552, -82521, 4587, 72844, 113458, -165065, 61093, -98862, 89072, 146806, 492596, 18889, -124003, -12576, 168162, 48307, 33071, 63500, -201865, 329156, 41564, -209464, -183927, 60366, -186159, 346926, 118028, 42780, -20072, -196111]
18316a96111g6593k62647j36021A14546d471F6487d2676m1222m3390m0704o7601
18305b35593p3725h6741A55357a53508o7846C9798M8219b0400q9508E3705p316
18294D6389F831a6336k54362f5327D9973K9421f5538k67797B79679g0379j03402
18283a73781G9035A7958a03695C6121a81346j2056e8002K7788C65346r1814K7592
18272C01124F8186c18669a59330D6668b66644h9272b6222A56313P4272a00177
18261B44679g9290D2947a02512i893C7405d574A12530a0982j42800e2073k50428
18250c02501A1121K70628D7636i2628f785l4317A59876G2088Q8659a33518E6254
18238a40636D7777d4275B94903j29268b33664I1453B5726K30303c1297B9251a29302
$$ y = [-196111, -76593, -339240, -475261, 114546, -4471, 66487, -42676, -83898, -127288, -167992, -235593, -309318, -86741, 155357, -153508, -221354, 39798, 88017, -20400, -109908, 53705, 46389, 6831, -16336, -270698, -65327, 49973, 79394, -65538, -333335, 279679, -70379, -173781, 79035, 17958, -103695, 36121, -181346, -193402, -58002, -30214, 365346, 273532, 301124, 68186, -318669, -159330, 46668, -266644, -89272, -26222, 156313, 230585, -100177, 244679, -79290, 42947, -102512, -9893, 37405, -4574, 112530, -10982, -153782, -52073, -302501, 11121, 281749, 47636, -92628, -6785, -41102, 159876, 72088, 160747, -133518, 56254, -140636, 47777, -44275, 294903, 165635, -233664, 91453, 25726, 256029, -31297, 29251, -129302]
18226a70646B7693e7073G8853a72238J8478k2492A21753j9176a03730A1519b6722
18214c77913F2686g4445A9275a87718j10418A03210a9791A19759N2117e4658a276
18202B26453a66552G6254R5924D3318f798j90286I3376K6208b28437A06891d280
18190a74382M8659j7035I4782i3101j39451G1049l3151M0061d1967r5469j71338
18179c08774O7973A6446g906q6338G219K2240M7094a34507a1208F951a40052A05529
18166H3563C0116K55859D8487J07110b73150A90263a5425j28918M3878c0843l829
18155c4672l05915e2605C03960c21551A12213M9680n069j825a73442M4045J0679
18144a18718j00334K7399i5469C0410b03770k98067a07795L9937n4303j38673
$$ y = [-170646, 27693, -57073, 78853, -172238, -153760, -176252, 121753, 102577, -103730, 11519, -26722, -377913, 62686, -74445, 19275, -187718, -298136, 103210, -19791, 119759, 171876, -54658, -1276, 226453, -166552, 76254, 172178, 43318, -6798, -197084, 93376, 119584, -228437, 106891, -4280, -174382, -125723, -142758, 94782, -93101, -232552, 71049, 37898, 77959, -41967, -137436, -308774, -240801, 16446, -7906, -94244, 7219, 29459, 76553, -134507, -11208, 6951, -140052, 105529, 83563, 30116, 285975, 48487, 155597, -273150, 190263, -15425, -144343, -100465, -30843, -34672, -340587, -52605, 303960, -321551, 112213, 161893, 156824, 154999, -173442, -129397, -118718, -219052, -191653, -95469, 30410, -203770, -501837, -107795, -67858, -122161, -260834]
18134b60834A35055F0610a82994b7472A04296m0252d9065A06839b18741d6465
18123A22238a56195I1708b73879J2610C37243c62502A40717D4042c1970h176H4203
18111I7177d6811k45045e9393C1239h3810j29549f105A03526N1229a31190d020
18099B4673f290A28348b22417D3606h724k07941I3315M0471A9753b01434K9167
18088a72267r7852G4735a15282A60699a55000d1485A8960e0353d962j00714A76365
18076d89185J43734J70126G1384b20503b3587j91382A29941E9538A4973d01121
18065B125h3547b4780F5624e3937o1840A71898j6850a76371C35259b59206a3351
18053a88119A6852J6000P038N382c29710b9221J3049p9401I2476a52726P6128
$$ y = [-260834, 135055, 60610, -182994, -27472, 104296, 64044, -49065, 106839, -218741, -46465, 122238, -156195, 91708, -273879, -261269, 337243, -362502, 140717, 44042, -31970, -8176, 84203, 97177, -46811, -291856, -59393, 31239, -83810, -213359, -6105, 103526, 154755, -131190, -4020, 24673, -6290, 128348, -222417, 43606, -8724, -216665, 93315, 133786, 19753, -201434, -172267, -270119, 74735, -115282, 160699, -155000, -41485, 18960, -50353, -4962, -105676, 176365, -489185, -345451, -175325, 71384, -220503, -23587, -214969, 129941, 59538, 14973, -401121, 2125, -83547, -24780, 65624, -53937, -115777, 171898, 155048, -176371, 335259, -259206, -13351, -188119, 16852, 32852, 39890, 45272, -329710, -29221, -16172, -95573, 92476, -152726, -76598]
18042g6598B28279b54769p2461H8737c3500j31700A84934b21922a03657B5997
18031E865c69244J14899i9617k5888M7356B51238A6105a27540k1234A34606B924
18019A83871g2667l21050E128R7112m4555L2577J42727I4734a94732j07170b8189
18007A91518b7349B52712j5328I3720e5158J4913c498l55311a0527k86843i3799
17995b32077A46013j2487D861Q057N2774N3620H678M8269b59125F4285F419a72803
17982C5832c61938h5588l0028j07189D72123b03001c5608k17128O0742A24199
17971A35751O9406q9295a78058I1343l430C1915a84A74588b25556a8875G2279
17959a67548H1029a09096L7058n1213A6846c9226A50919F949a88796D524J48495
$$ y = [-76598, 228279, -254769, -327230, 88737, -33500, -165200, 184934, -221922, -103657, 25997, 5865, -369244, -254345, -99617, -125505, -78149, 251238, 16105, -127540, -148774, 134606, 2924, 183871, -72667, -393717, 5128, 102240, 57685, 90262, 232989, 94734, -194732, -301902, -28189, 191518, -27349, 252712, 237384, 93720, -55158, -40245, -3498, -358809, -10527, -297370, -93799, -232077, 146013, 133526, 4861, 12918, 65692, 119312, 8678, 56947, -259125, 64285, 6419, -172803, 35832, -361938, -85588, -115616, -222805, 472123, -203001, -35608, -252736, -191994, 124199, 135751, 205157, 115862, -178058, 91343, 87913, 31915, -184, 174588, -225556, -18875, 72279, -167548, 81029, -109096, -72038, -123251, 16846, -39226, 150919, 6949, -188796, 4524, 153019]
17948A53019J29686a23020A22771b8735j46746p3845P3811A03532l698D4540b06635
17936a15934o2642A08543b99535a04388c5521C16817a62937D7524h8324C0131
17925a19754r374e2921k5985m5609B1295L26050q0214a13926A55467K4906B818
17913a31351A65025E829J39257o6220M357B2654a03408l3293B04012d685A03223
17901B79823G2337M4701J10942j11659a39983o5495A8530c2949m9621B07989c2711
17889B97001A32673b7402E9942b54142h4068d619r3154H9320a22516a4761l13322
17878c28083A177J84354f9488A06388l6857a09060b6994j02537C7271K15761A18197
17866b8520E4915a42240N8980A60736G56J93341H8143b32890B6407N0765j5172
$$ y = [153019, 282705, -123020, 122771, -28735, -175481, -249326, -175515, 103532, 99834, 44540, -206635, -115934, -178576, 108543, -299535, -104388, -35521, 316817, -162937, 47524, -88324, 30131, -119754, -129128, -52921, -78906, -124515, 21295, 347345, 267131, -113926, 155467, 180373, 2818, -131351, 165025, 5829, 145086, 78866, 83223, 22654, -103408, -136701, 204012, -4685, 103223, 279823, 72337, 117038, 227980, 116321, -139983, -205478, 18530, -32949, -82570, 207989, -32711, 297001, 132673, -27402, 59942, -254142, -84068, -4619, -97773, 89320, -122516, -14761, -328083, 1177, 185531, -69488, 106388, 69531, -109060, -26994, -129531, 37271, 253032, 118197, -28520, 54915, -142240, -83260, 160736, 756, 194097, 88143, -232890, 26407, 77172, 62000]
17855F2000J89922a5489o9250k55278P8846I9867L8074f0415j23082A4916a87929
17843c3511A77970b72788f4012A55536c3669A09495J5155c3902C63224a40458
17832D52644a4779H1962a3148E671N7383a87201A43349a03441l7157q1167f2590
17820B03969H1605J6111b523C1087a92484e0512A6700b56328E8094O4080m1519
17809H0655R5678G0504a03131p705B07966d205I655a81966C9576a12006m6326
17798a58332e1633A45911c6055E0581k1220a69902B67868c2348F1861b0548r6856
17787a17404D8978a04624b0613A11950K4818g3297B39544A14019A521O0640M2401
17776A04562f3641A43728c12182B03600b7238l00612f08H6891g9277L9484k67241
$$ y = [62000, 251922, -15489, -84739, -340017, -261171, 99867, 137941, -60415, -183497, 14916, -187929, -33511, 177970, -272788, -64012, 155536, -33669, 109495, 124650, -33902, 363224, -140458, 452644, -14779, 81962, -13148, 5671, 63054, -187201, 143349, -103441, -140598, -221765, -62590, 203969, 81605, 97716, -2523, 31087, -192484, -50512, 16700, -256328, 58094, 122174, 80655, 176333, 70504, -103131, -110836, 207966, -4205, 9655, -181966, 39576, -112006, -158332, -51633, 145911, -36055, 50581, 29361, -169902, 267868, -32348, 61861, -20548, -117404, 48978, -104624, -20613, 111950, 136768, -73297, 239544, 114019, 1521, 62161, 104562, -63641, 143728, -312182, 203600, -27238, -327850, -608, 86891, -79277, -39793, -307034]
17765c07034L916A01012h7565a9383A69003A4642a04413B62471H0297A3414a17731
17753b81150a38288H6654i3054j8561B3889J73368b384k12345B52833j0014l7525
17742B05294C390K15626J3849A2476h7782j65887H4901a27769k5719a5714A35917
17730b5848A18675c10535i389j17193B08660a39698H0511i4434K9025C1360Q7874
17719A19234Q6770m1881a58022I0464a31612j46104i385A70652M5800a85046J4079
17708a70967L6601k42133A81132L3428b82137F5386j8285N6951a4492F76h6261
17696A11238b18948A72415J75792A8321G248J10763a32271L4404o0376l5728E2639
17684G124K7772L06315B6446b35837J12364F1178c27387A5824h5328m8397A61494
$$ y = [-307034, -303118, 101012, -87565, -19383, 169003, 14642, -104413, 262471, 80297, 13414, -117731, -281150, -138288, 86654, -93054, -111615, 23889, 197257, -2384, -214729, 252833, 242819, 205294, 3390, 219016, 232865, 12476, -87782, -253669, 84901, -127769, -153488, -15714, 135917, -25848, 118675, -310535, -9389, -126582, 208660, -139698, 80511, -94434, -65409, 31360, 119234, 206004, 164123, -158022, 90464, -131612, -277716, -9385, 170652, 216452, -185046, -170967, -134366, -376499, 181132, 214560, -282137, 65386, 47101, 104052, -14492, 676, -86261, 111238, -218948, 172415, 348207, 18321, 7248, 118011, -132271, -97867, -158243, -193971, 52639, 7124, 34896, 341211, 26446, -235837, -123473, 61178, -327387, 15824, -85328, -133725, 161494]
17672D08726e3038G7537J82861k6573b30575D7354a06200k3008C6652M6331C4222
17660c7593j11478b2934j98995A72967K1996D3535d5419C77127a10286B8983a33255
17648g8503B52717a416B14566N2419A11587J64358E4254J1488a90675f6916k5019
17637i1935q5526P1288B23582d7018B58126M1387b4792j04704C9412P8302b677
17625a37687B16605D313O0354p307Q3660R7061i9330A94282j7547J03416A00789
17613D3659a60096n5352n9897A13742c3467A7010f1305F03002k61094g7445a6876
17601c5500k27736C19181a21164D36466c00774D0275N730a18209B10777H4943
17590C8691J53648B6134N4377i4140G3507c1833p6228J4454c1964k2439A12684
$$ y = [408726, -53038, 77537, 260398, 233825, -230575, 47354, -106200, -129208, 36652, 82983, 34222, -37593, -149071, -22934, -221929, 172967, 194963, 43535, -45419, 377127, -110286, 28983, -133255, -78503, 252717, -1416, 214566, 266985, 111587, 275945, 54254, 65742, -190675, -66916, -91935, -177461, -106173, 223582, -47018, 258126, 299513, -24792, -129496, 39412, 117714, -2677, -137687, 216605, 4313, 64667, 57360, 141020, 238081, -99330, 194282, 176735, 280151, 100789, 43659, -160096, -215448, -275345, 113742, -33467, 17010, -61305, 603002, 341908, -77445, -16876, -35500, -263236, 319181, -121164, 436466, -300774, 40275, 46005, -118209, 210777, 84943, 38691, 192339, 26134, 80511, -94140, 73507, -31833, -108061, -93607, -31964, -54403, 112684]
17578A14051R9611h3799j06231F5222R5604h1303b4836C56590A6663O8772R3243
17567A78678p8871C736b34642B30893D0979L63299F6498C0577c2377A28411a59268
17555D19159G3918K64759C0337j1262L97947n7844h1381k28944A80456K8398a08289
17543A69562q7m0857L80518j34788h3575k56583A02454M3939b0370F5302A6795
17531A31914J17258D5653K0355a4360C90107E8604K10726a73841A42040K97373
17521D39413J53128k93506L12568B88157b1885B07081F4689K47244A42490e001
17510A60988F0076J34276Q6582k3813i182A99194N81465k11560k28935q4331j23882
17499A31951J04644c1386b371B17545I0266J37606J80569H1631J62078j03877
$$ y = [114051, 213662, -83799, -190030, 65222, 160826, -81303, -24836, 356590, 16663, 85435, 178678, 99807, 3736, -234642, 230893, 40979, 404278, 66498, 30577, -32377, 128411, -159268, 419159, 73918, 338677, 30337, 19075, 417022, 359178, -81381, -310325, 180456, 208854, -108289, 169562, 169475, 128618, 509136, 374348, -83575, -340158, 102454, 146393, -20370, 65302, 16795, 131914, 249172, 45653, 66008, -14360, 390107, 58604, 269330, -173841, 142040, 439413, 592541, 299035, 611603, 288157, -21885, 207081, 64689, 311933, 142490, -5001, 160988, 60076, 194352, 280934, 257121, -9182, 199194, 780659, 569099, 340164, 255833, 131951, 236595, -31386, -2371, 217545, 90266, 227872, 408441, 81631, 243709, 139832]
17489A39832J82219a09016F3566c7576A88498L39771A19542m8054l3962c05679
17478A630a09681A63747D0108a60927e9527A80400m8571M6460k0772a79717Q5270
17467i4447B77708a49002A64998J97537c3246A39796R9093b1055k763H3563J78710
17456B62273p6383D0070J88958c21493I6909j8732K972K69428k6103A02287N7148
17445A59435O315J57164J24626A58338K30669A46202m0393M10133k36807l3506
17435B45629I7776Q9913g1668D17626n3336i4705F21274j96402k11360p9770l2618
17424A01124J96571l3964p0826q487E1806N9998L02723i0888C90102j7089J35404
17413E08417j63625j68802K08582A17551R929K14917j32549l6881R449K05136
$$ y = [139832, 322051, -109016, 63566, -37576, 188498, 528269, 119542, 71488, 37526, -305679, 1630, -109681, 163747, 40108, -160927, -59527, 180400, 131829, 178289, 157517, -179717, -94447, 277708, -149002, 164998, 362535, -33246, 139796, 238889, -21055, -23818, 83563, 262273, 185890, 40070, 229028, -321493, 96909, 78177, 81149, 350577, 324474, 102287, 159435, 165750, 322914, 447540, 158338, 389007, 146202, 105809, 515942, 279135, 245629, 97776, 187689, -71668, 417626, 364290, -94705, 621274, 424872, 213512, 133742, 101124, 297695, 263731, 192905, 184418, 51806, 111804, 414527, -90888, 390102, 373013, 508417, 344792, 175990, 384572, 117551, 127480, 342397, 209848, 172967, 182416, 387552]
17403C87552a624A84067B8948a9964B61070g8754C79413h611D1997N5209a72129
17391B87351J10368B0439b04049I5876K70449a10934B18232B6711K1602J29297
17381A77610J81232j50495J34253B7991f2196A22324h9702A96803o6859J2637
17371A42581L1288C8733J65912D452R1680J16938I1473J84052h890A16724d3621
17359a38044D3382b237I7210L2352K29173j70578O5732O1220J35312e6619E1842
17347a62600d6263C92692A25959K25970A7240J5249J57742E0513a0014A28023
17336A31027f3166D7464f4184D1591J03081e2201C70776A83039E0023P6531O6277
17325A92831a82990A46866a05612B51708E5962R0132O1797c17498f0416D5146
$$ y = [387552, -1624, 184067, 28948, -19964, 261070, -78754, 379413, -8611, 41997, 97206, -172129, 287351, 397719, 20439, -204049, 95876, 366325, -110934, 218232, 26711, 48313, 177610, 358842, 208347, 342600, 27991, -62196, 122324, -89702, 196803, 129944, 142581, 173869, 38733, 204645, 4452, 96132, 213070, 91473, 275525, -8890, 116724, -43621, -138044, 43382, -2237, 97210, 129562, 358735, 188157, 253889, 315109, 450421, -56619, 51842, -162600, -46263, 392692, 125959, 351929, 17240, 32489, 190231, 50513, -10014, 128023, 131027, -63166, 47464, -64184, 41591, 144672, -52201, 370776, 183039, 50023, 126554, 192831, -182990, 146866, -105612, 251708, 55962, 146094, 207891, -317498, -60416, 45146]
17314a25316C58881A21327m653m4305K02697q6859q5452a26582A72381K07994
17304C80375A7129F346a33771B68965o8925G5047i7487G4625J51307a36129B79972
17292A65273O131R7446O2035j34716q2334J35904G6612M5540J43299a23546B3908
17280B28288J16684a7921j66338C95937A72506Q996M760c3091E39064B58123K48800
17269E06923B36525n9611K01418E4078K21693p6161Q6678p9834o629C2239J41059
17258A73298G5538a32659A78259J33237K4362l2413j27444J52033Q897b23391
17247B50115a34450B76126A0097M04479A72598J21386F9184L35830j51861J53047
17237D06200q4461k8167K2410P2945a27540A46548d1844H9069K06481o1518O0057
$$ y = [-125316, 358881, 121327, 116674, 72369, 275066, 188207, 102755, -126582, 172381, 380375, 17129, 6346, -133771, 268965, 200040, 75047, -97487, 74625, 225932, -136129, 279972, 165273, 171404, 268850, 330885, 196169, 113835, 249739, 76612, 122152, 265451, -123546, 23908, 228288, 344972, -17921, -184259, 395937, 172506, 181502, 186262, -33091, 539064, 258123, 506923, 236525, 176914, 378332, 54078, 275771, 199610, 286288, 206454, 199825, 32239, 173298, 75538, -132659, 178259, 311496, 335858, 303445, 176001, 328034, 336931, -223391, 250115, -134450, 276126, 10097, 414576, 172598, 293984, 69184, 405014, 253153, 406200, 321739, 293572, 315982, 388927, -127540, 146548, -41844, 89069, 295550, 234032, 294089]
17226B94089p3858K7863A09251R0208B9087K3938K33618o8875N3290K02077M4313
17215E17448J68729B49398K27915j4043j03777A21242N8441K11259j52413J35583
17205C74112N3825A19787M16917m753A7500b6656C42734O1810j35430K6128j3806
17194B81436k4918J4210B6611f6460A23111e0091D80008r5314K41748j44878j07329
17183C74235m0524K30165k73975j8450p8107l5762J37398C7628L04293k8757j8667
17172B94497P8978l2406R0830A31491K96413n6591j00651l9204i370C50480j36643
17161B13837K05169H9765J69913J28934j14872P7907M879A77529K6175M44M6323
17150B50471R0740q9377K14726n0313J03704c48B71491L0339n6048K87386J47589
$$ y = [294089, 220231, 248094, 109251, 199459, 29087, 53025, 286643, 217768, 271058, 473135, 517448, 686177, 249398, 477313, 463270, 359493, 121242, 179683, 390942, 238529, 374112, 427937, 119787, 536704, 531951, 17500, -26656, 342734, 404544, 269114, 295242, 281436, 256518, 270728, 26611, -66460, 123111, -50091, 480008, 384694, 626442, 481564, 374235, 333711, 563876, 289901, 271451, 193344, 157582, 294980, 37628, 341921, 313164, 294497, 373475, 341069, 431899, 131491, 427904, 371313, 270662, 231458, -9370, 350480, 213837, 419006, 89765, 259678, 388612, 273740, 351647, 356526, 177529, 203704, 204148, 250471, 341211, 251834, 466560, 416247, 519951, -348, 271491, 301830, 245782, 533168, 680757]
17139F80757G5400K37953E8036M66165k51955J61335N684A80435L6858L15940
17129E33233j04733q7574J00971J26329k79763K87753q2073J53173B87883K50708
17119E38591k60570A06217L31415P3475j53968K19264B42711M60962C43942N2209
17109C96151r4461K2002P0463j0710K16483k02882J00422j57580K12647B36984
17098G10218C04777J031j08355K62613j33394J13104A90283K66378O7743q1582
17088D42822L9766j42731K93732B52331L23042J2675k53839M0649K37606k39147
17078C73317N85009D79141p864M6264N6081r8636k22752M47343k94048J03686
17068E09215J29410Q077j87640L71106k79959J83317k78830K19759O6351Q3393
$$ y = [680757, 75400, 313353, 58036, 524201, 272246, 433581, 439265, 180435, 217293, 533233, 428500, 340926, 441897, 568226, 288463, 576216, 494143, 647316, 287883, 538591, 278021, 106217, 437632, 511107, 357139, 576403, 242711, 703673, 343942, 396151, 301690, 323692, 394155, 383445, 599928, 397046, 497468, 339888, 552535, 236984, 710218, 304777, 305808, 197453, 460066, 326672, 439776, 190283, 456661, 524404, 442822, 482588, 339857, 633589, 252331, 575373, 588048, 334209, 374858, 612464, 373317, 958326, 479141, 471277, 517541, 573622, 474986, 252234, 699577, 405529, 509215, 638625, 646702, 459062, 830168, 550209, 733526, 454696, 674455, 740806, 824199]
17058H24199j11592B58569J48842J14342m4558q7764M5188m7095L36111j86876
17048E36759O0590p1674n6237L31281l02306K98360B10149L98618m2580k68817
17038B97370L75593o1533n9198j37336K85397J52560J3990m05073K24391o0340
17028F25821k5787L3877J80145l01324L04357J30966k14097Q004R1061k08903
17018F24120K10837o4809K2602k1021j436J42924l95858j9873L49866O8689l69463
17007E46578M12386K08374l55836j57126l3721O6144J01087M22402l73760o4142
16997G72386J85561j89738L18203j3910j09029j23346n6667J58417j90951L37861
16987A088787j60351P8607j54903J36743o8583L23156m58211p2263K80107j41250
$$ y = [824199, 712607, 258569, 407411, 521753, 477195, 389431, 434619, 387524, 723635, 536759, 597349, 525675, 469438, 800719, 498413, 796773, 210149, 608767, 566187, 297370, 672963, 611430, 552232, 414896, 700293, 852853, 866843, 461770, 686161, 625821, 600034, 633911, 814056, 512732, 817089, 948055, 733958, 741962, 833023, 624120, 834957, 770148, 792750, 771729, 770293, 913217, 517359, 497486, 847352, 916041, 546578, 958964, 1167338, 811502, 654376, 620655, 686799, 787886, 1210288, 836528, 772386, 957947, 768209, 1086412, 1072502, 963473, 840127, 783460, 941877, 750926, 1088787, 928436, 1007043, 852140, 988883, 920300, 1243456, 785245, 712982, 993089, 851839]
16977H51839N84831m58349R7190k6390K0280n9709K38604l28776o4538J22184
16967I77166j03014K56559M3021j17266j55149O7330k53355L42272J73524N4351
16957A285439j26310R1897m0421P6316K28686k90507J09061O295n60Q3148l52848
16946A070196L95685J65570l78559K90171k14600j1416J05123m15516M91256R6002
16936A593912J32423j28852j24042J99506o7987j31041l95453K75445M60816J83058
16926A997785o00349k5966J97963n8990j1432J98035M3533K21661o3345J20567
16916B019462m93200M12340K20850m36416Q9881K74878j60729L20571l46013K57142
16906B158766k70521J03023J83875J09569k99785O77703j53116l37327K32144
$$ y = [851839, 1436670, 978321, 1075511, 1049121, 1069401, 1009692, 1248296, 919520, 854982, 977166, 874152, 1130711, 1173732, 1056466, 901317, 968647, 715292, 1057564, 1231088, 1285439, 1159129, 1251026, 1210605, 1286921, 1515607, 1225100, 1334161, 1340456, 1339896, 1423044, 1070196, 1465881, 1631451, 1252892, 1543063, 1328463, 1317047, 1422170, 1006654, 1497910, 1593912, 1726335, 1597483, 1473441, 1672947, 1604960, 1473919, 1078466, 1353911, 1814727, 1997785, 1397436, 1371470, 1569433, 1510443, 1499011, 1697046, 1740579, 1962240, 1898895, 2019462, 1526262, 1938602, 2159452, 1723036, 1812917, 2087795, 1927066, 2247637, 1901624, 2158766, 1888245, 1991268, 2175143, 2284712, 1984927, 2662630, 2509514, 2172187, 2404331]
16897B404331j51136L5347K10697k16358J42346J39972K67723l73397O9015J12091
16887B640631K2256K14440j39501q2240P6394L02472n68546K36391O44525j60803
16877C186019k47900J11618j10702L14537j29796o1930M59964j7491k83941J6584
16867C236962J93028n6062M29944L69057l02506J36963m19092J80903K74249k04673
16857C838773J24408N6173N06776n52354M33796K30409j70787K91669j05221N18878
16847E172520n30412M65211J73966J19686k40987j12894K70482J26637M37889
16838E882098k22077J95779M59163l17238K74836j27159M31955l3345P2150L84395
16828G000557n5256J83896N16831r3736j34978O38053K893K32472K38723L77120
$$ y = [2404331, 2253195, 2288542, 2499239, 2282881, 2425227, 2565199, 2832922, 2459525, 2528540, 2640631, 2662887, 2877327, 2737826, 2655586, 2731980, 3034452, 2465906, 2702297, 3346822, 3186019, 2938119, 3049737, 2939035, 3253572, 3123776, 3061846, 3521810, 3504319, 3220378, 3236962, 3429990, 3373928, 3803872, 4172929, 3870423, 4007386, 3588294, 3769197, 4043446, 3838773, 3963181, 4019354, 4526130, 3973776, 4407572, 4637981, 4467194, 4758863, 4653642, 5172520, 4642108, 5107319, 5281285, 5400971, 5159984, 5047090, 5317572, 5444209, 5882098, 5660021, 5855800, 6314963, 5997725, 6272561, 6145402, 6577357, 6544012, 6616162, 7000557, 6945301, 7129197, 7646028, 7552292, 7417314, 8055367, 8058260, 8290732, 8529455, 8906575]
16818H906575l74224M06795q4556P05060K25320k0926j36582P45876J89013J85227
16808A0747578K7923N28837O41105R272J31176L43847N51354K40006M72785R2659
16798A3786542L19707N11193M84196L10782Q24401n072P44103L60019N69709P78909
16788A8684489L03850M90679M35121O82735O28730P39633P51534O84358P87361
16779B4188490O90931J212331Q37283O86438J044735J002351J056478J042156
16771C1761193J025784J261245J162344J299427J525208J182338J731374J225439
16763D2174352J576303J496600K004580J891414K052270J669612K105123K139398
16755E7109652K206656K001883K434321K611727K136233K835939K260718K696337
$$ y = [8906575, 8532351, 8939146, 8854590, 9559650, 9784970, 9764044, 9627462, 10373338, 10562351, 10747578, 10775501, 11304338, 11945443, 11954715, 12085891, 12429738, 12981092, 13221098, 13693883, 13786542, 14106249, 14617442, 15101638, 15412420, 16236821, 16231749, 16975852, 17335871, 17905580, 18684489, 18988339, 19479018, 19914139, 20596874, 21225604, 21965237, 22716771, 23401129, 24188490, 24879421, 26091752, 26929035, 27615473, 28660208, 29662559, 30719037, 31761193, 32786977, 34048222, 35210566, 36509993, 38035201, 39217539, 40948913, 42174352, 43750655, 45247255, 47251835, 49143249, 51195519, 52865131, 54970254, 57109652, 59316308, 61318191, 63752512, 66364239, 68500472, 71336411, 73597129, 76293466]
16747G6293466K484639K846502K588049K369533K825285K478638K680694K129255
16739I6696061K080333K116196J612095K013724J394582J480154J121749M73793
16731A08988687L33735K55898l84248k48180p50180o91150j518270j400296j196498
16722A03389498k236269j860878k218701k129704k440460k427890k429446k525416
16714H5120734k823581k274671k542497k608853k403094k478889k414018k108315
16706F5466816k539796j899534k058485k169337j849257j971290j797297k040906
16698D9140914j165023j517906j948753j591262j343299j429262j146019j211734
16690C7787656j861588m82445j277109j075417r59264q43695j056131j114523
$$ y = [76293466, 78778105, 81624607, 84212656, 86582189, 89407474, 91886112, 94566806, 96696061, 98776394, 100892590, 102504685, 104518409, 105912991, 107393145, 108514894, 108988687, 109322422, 109578320, 109194072, 108945892, 108195712, 107504562, 105986292, 104585996, 103389498, 101153229, 99292351, 97073650, 94943946, 92503486, 90075596, 87646150, 85120734, 82297153, 80022482, 77479985, 74871132, 72468038, 69989149, 67575131, 65466816, 62927020, 61027486, 58969001, 56799664, 54950407, 52979117, 51181820, 49140914, 47975891, 46457985, 44509232, 42917970, 41574671, 40145409, 38999390, 37787656, 35926068, 35443623, 34166514, 33091097, 32131833, 31288138, 30232007, 29117484]
16682B9117484r41995o90050j079712o32406o29648r05531m82670r67206m40862
16673B2347404p19843n53514l33022p94224o57166j66578o30282m50267j41013
16664A7901495n69549n73826k82120m41073n15990m52117k75289j33032n18286
16655A4140213k18200n75947j06550l11899l05252l48569l31783p615m37957j98208
16645A1298233l49872j21695m4800j87415l26541r6267j42831m75974J6756m48381
16635I121213j86291N7166j9211k63232q8881l25335J56091j84301k18990k96489
16625G751740j9756j80041l35433m9590j37966L54102p42598R48k3942q4461j53924
16614F379079j92681o103O8353m85371J01920J71440o4837j88261j64937j18133
$$ y = [29117484, 28175489, 27485439, 26405727, 25773321, 25143673, 24238142, 23755472, 22788266, 22347404, 21627561, 21074047, 20741025, 19946801, 19289635, 19123057, 18492775, 18042508, 17901495, 17331946, 16758120, 16476000, 16034927, 15518937, 15066820, 14791531, 14658499, 14140213, 13922013, 13346066, 13239516, 12927617, 12622365, 12273796, 11942013, 11934398, 11496441, 11298233, 10948361, 10826666, 10781866, 10594451, 10267910, 10171643, 10028812, 9552838, 9569594, 9121213, 8934922, 8992088, 8972877, 8709645, 8620764, 8295429, 8451520, 8267219, 8048229, 7751740, 7731984, 7551943, 7216510, 7166920, 7028954, 7383056, 6640458, 6641406, 6617464, 6533003, 6379079, 6186398, 6180295, 6248648, 5763277, 5865197, 6036637, 5971800, 5783539, 5618602, 5500469]
16604E500469O8338q6839j99667P0033j560l42800l75612J28779M42614m63749
16594D740006J30752j47901j68326J88858n21399K34810q6828p1179M61688m60747
16584D299734p5843J81782k74594Q3591k21682R67k79125M11482n4064j64942
16574C907306l79886J32481Q9979K18104k35673j47684j8658p5133P3924K22252
16564C787012j14902k99713p4322O8213l914m37510K12955j7770l3910K9947N808
16553C121894K353N5122k01276K90928n17614M66349j53555j35396J09405k32581
16543B805629j0542K3802K6667l11041j36341O7894m8424N7265n5283K96330k28528
16532B487428M90602m59139K24174l48194J57258r0332j81662K79653k67635N2593
$$ y = [5500469, 5568807, 5481968, 5282301, 5352334, 5350774, 5007974, 4632362, 4761141, 5203755, 4740006, 4870758, 4722857, 4554531, 4743389, 4221990, 4456800, 4369972, 4298793, 4760481, 4299734, 4223891, 4405673, 4131079, 4214670, 3992988, 3993955, 3714830, 4126312, 4072248, 3907306, 3527420, 3659901, 3749880, 3967984, 3732311, 3584627, 3565969, 3490836, 3564760, 3787012, 3672110, 3372397, 3298075, 3366288, 3362374, 2924864, 3137819, 3120049, 3086139, 3116086, 3121894, 3124247, 3179369, 2978093, 3269021, 2751407, 3217756, 3064201, 2928805, 3038210, 2805629, 2795087, 2818889, 2845556, 2534515, 2398174, 2466068, 2417644, 2474909, 2419626, 2715956, 2487428, 2978030, 2518891, 2743065, 2394871, 2552129, 2461797, 2280135, 2559788, 2292153, 2344746]
16522B344746l2716K9118l26989J18435K46071m35697L02060l6039K61449k04172
16512B266266N9687j07433k59988M21214N770k81671M4065p0681j40351J56147
16502B093025l94808M87677N160j84883j6276j21423K24635k67051N31492l10432
16492B047116k19587K70266l82013J91135k33431L48193j5834j58732k33294K22414
16482A836233j38767K47147l03390J23086O1007J42740p4728j29020p8747l05428
16472A380133M07559j88101K00274o4743R2761j88956M6761P4978m9306j20299
16462A591061r685Q6888l52397J78785L52403l46337J6490K29293m92376M27549
16452A681674k2468o936j90932j02493K50773j83180J72972m6418m27396N91267
$$ y = [2344746, 2312030, 2341148, 2014159, 2132594, 2378665, 1942968, 2245028, 2208989, 2470438, 2266266, 2325953, 2218520, 1958532, 2379746, 2385516, 2103845, 2147910, 2077229, 1936878, 2093025, 1698217, 2185894, 2191054, 2006171, 1989895, 1868472, 2093107, 1826056, 2357548, 2047116, 1827529, 2097795, 1715782, 1906917, 1673486, 2021679, 2005845, 1847113, 1613819, 1836233, 1697466, 1944613, 1641223, 1764309, 1825316, 1968056, 1893328, 1764308, 1685561, 1380133, 1787692, 1599591, 1799865, 1735122, 1827883, 1638927, 1685688, 1760666, 1711360, 1591061, 1581376, 1668264, 1315867, 1494652, 1847055, 1500718, 1517208, 1746501, 1254125, 1681674, 1659206, 1652270, 1461338, 1358845, 1609618, 1426438, 1599410, 1552992, 1125596, 1716863]
16442A716863j10290o8775k25977K83551j64698R264J15909n11998K57270K74430
16432A575549l03763K33692L22938l57790k66825M69286k54088j30970K83345
16423A571374J71677k48089j68699J38401m0716k987M4860L1992o1619k76712
16413A159482K64235R9857j29411l83090L15893j86526j30211J70057J70179j06091
16403A244374J9218K45753m0529n2798L2294k06077R093K93991k08601K7472q4785
16392A279405p6598q5817Q5012n503L50547p2362k66379K79417k17334J13279
16382A383667r5167J30706k74215Q5857n0951N1870R7533K0085j12370j40175
16372A096840J3848J02010j0432M5886K24274m82529R6165R3496j53409P9601
$$ y = [1716863, 1606573, 1537798, 1311821, 1595372, 1430674, 1439938, 1555847, 1043849, 1301119, 1575549, 1271786, 1505478, 1828416, 1470626, 1203801, 1673087, 1418999, 1288029, 1571374, 1743051, 1494962, 1326263, 1464664, 1423948, 1420961, 1465821, 1497813, 1436194, 1159482, 1423717, 1523574, 1394163, 1011073, 1326966, 1140440, 1010229, 1180286, 1350465, 1244374, 1263592, 1509345, 1468816, 1416018, 1448312, 1242235, 1251328, 1545319, 1336718, 1364190, 1279405, 1202807, 1116990, 1202002, 1196499, 1547046, 1474684, 1208305, 1487722, 1270388, 1383667, 1288500, 1419206, 1144991, 1230848, 1179897, 1231767, 1329300, 1349385, 1237015, 1096840, 1110688, 1212698, 1202266, 1248152, 1472426, 989897, 1086062, 1179558, 1026149, 1105750]
16362A105750k27937K94996J75548k14851J04500j90645K28207m3674m0669j40121
16352A051104K37001j23704j73979l9534K25916o6188L0035k11922J02288J56002
16342A187019Q3021K38550j69229m42571L89915l5369k01915J615O3743J48189
16332A262968j17635n1697j11733j30658L24645j12768K51159p2430o3003J10409
16322A289257j55687J28741k24125K82125j40724k53442K89865r4828l52738L99489
16312A167933n7717j81423K70584l98352K90026k40542J52074K63987q316l80151
16302H78103J20714k70463K59730J854J36646k47027m3576j71842N23445m45134
16292G42450L87283m75046M66567J06216n33197M23065l82153K61517p0384q5945
$$ y = [1105750, 877813, 1172809, 1348357, 1133506, 1238006, 1047361, 1275568, 1231894, 1191225, 1051104, 1288105, 1164401, 990422, 950888, 1176804, 1110616, 1140651, 928729, 1031017, 1187019, 1270040, 1508590, 1339361, 896790, 1286705, 1251336, 1049421, 1051036, 1114779, 1262968, 1145333, 1093636, 981903, 851245, 1175890, 1063122, 1314281, 1241851, 1178848, 1289257, 1133570, 1262311, 1038186, 1320311, 1179587, 926145, 1216010, 1121182, 768444, 1167933, 1110216, 928793, 1199377, 801025, 1091051, 850509, 1002583, 1266570, 1258254, 878103, 998817, 728354, 988084, 989938, 1126584, 879557, 835981, 664139, 1187584, 742450, 1129733, 654687, 1121254, 1227470, 694273, 1117338, 735185, 996702, 926318, 840373]
16282H40373J65978J39305o2115o6984k5308r8104q3312K5044J28289j26868r5243
16271G41055L94823k05700l778j218J3037j00759J59098l21155N29790k54297
16261I50896J97849E64283K80461K55653k17096J41372m31665L78869n2748l97951
16251E21178M53800r5110N5245j15673K41512k13508j06571J5095j56162J73138
16241G72944j44395k59150P32649j20859m83838J94815L2185L55408j92817k69030
16231F17912M41892m94080J41051J46840J40300j98168P95J01291k00892K35378
16221I32319o7489k72567L13905k67354l0921m7287J11857J28587k32414J23773
16211F92409j27163m3103J30727K25375k26543B91994O57028n3186k07733K3670
$$ y = [840373, 1006351, 1145656, 1083541, 1016557, 991249, 893145, 809833, 834877, 963166, 836298, 741055, 1135878, 930178, 926400, 925182, 938219, 837460, 996558, 675403, 1205193, 950896, 1148745, 564283, 844744, 1100397, 883301, 1024673, 593008, 971877, 919129, 521178, 974978, 879868, 935113, 819440, 1060952, 847444, 740873, 755968, 599806, 772944, 628549, 369399, 1102048, 981189, 497351, 692166, 724351, 1079759, 886942, 617912, 1059804, 565724, 706775, 853615, 993915, 795747, 796542, 897833, 696941, 932319, 864830, 592263, 906168, 638814, 607893, 560606, 672463, 801050, 568636, 692409, 565246, 522143, 652870, 878245, 651702, 291994, 949022, 895836, 688103, 711773]
16201G11773P2986j19457j90259L24726B61494J79143J86160K4212k01025K021
16191D52005J13386J74122k77214L37342l56917j51043K83327k71271P0707M68956
16181H43400k44111J95404l58981j2179K05542B45100K64062j35299M45981l60385
16171D59459j07226L64799J78206l20659J87680j75073K88932D03938M4264N7990
16161E06192o7360K92580k48535o8468L67361j89641j77997j05723A44167K64625
16151D08792J0874p6843K95818Q149j54658p5618j4929J49472j71297K9848n4461
16140C55147M76170l90367M9473k02510H2313K72798j56108J70704K46196B92096
16129A26688J37017L02763A87305N57034l17655A37577M2666L17932k25991O7863
$$ y = [711773, 784759, 665302, 475043, 799769, 261494, 440637, 626797, 651009, 449984, 452005, 565391, 739513, 462299, 799641, 442724, 291681, 575008, 303737, 374444, 843400, 599289, 794693, 435712, 423533, 629075, 245100, 509162, 373863, 819844, 459459, 352233, 717032, 895238, 574579, 762259, 587186, 876118, 403938, 448202, 506192, 438832, 731412, 482877, 414409, 781770, 592129, 414132, 308409, 144167, 408792, 419666, 342823, 638641, 646790, 492132, 416514, 401585, 551057, 379760, 409608, 355147, 831317, 440950, 490423, 287913, 82313, 355111, 199003, 369707, 615903, 292096, 126688, 263705, 566468, 187305, 744339, 426684, 137577, 180243, 498175, 272184, 340047]
16119C40047j41203J23970J13093R226j47919A05998K43196J09289r7368K90752
16109F51867A85984J12873o7498p9335L64251M1538k31718J04438j16272o0406
16099B53855K86652K6326j49087r5161j38971L00457k33077Q9150J88139B47995
16088E8618J63455k6260M8211H9813J43124b9563A19061M7628J41645N40438C04401
16076B35330K82190k14813H8115L05024j11311n1494E5161L20293j44479p7256
16066A53719K01352j66015K3922m7452J82805I5449D1209P3668O4954f295A90064
16054B4244J39645K00080a32228B32864j8432l9406E3188H985J41697l6353J67005
16043B81334k9366K1587A8644e0344A34803K3601B0910K27264a5035B88444q4112
$$ y = [340047, 198844, 322814, 435907, 445133, 297214, 105998, 349194, 458483, 361115, 651867, 185984, 298857, 231359, 152024, 516275, 557813, 326095, 430533, 314261, 253855, 540507, 566833, 417746, 322585, 183614, 484071, 250994, 340144, 528283, 247995, 58618, 222073, 195813, 244024, 89813, 232937, -29563, 119061, 166689, 308334, 848772, 304401, 235330, 517520, 302707, 88115, 393139, 281828, 230334, 55161, 375454, 230975, 153719, 355071, 189056, 212978, 165526, 348331, 95449, 41209, 114877, 179831, -6295, 190064, 24244, 163889, 363969, -132228, 232864, 214432, 175026, 53188, 8985, 150682, 114329, 281334, 251968, 273555, 18644, -50344, 134803, 158404, 20910, 248174, -15035, 288444, 204332]
16032B04332a7542C42790H1043e9774I1929B3254A537K75139G4603P9394J7826
16021A71823r824o1586b761A09847L47193a17089A23049J52160E3065J76958D7578
16009C76241I9043C3091h8557B53017q3624a30577j60343F9062e0659k16361a03851
15997G754e6568o2439A72356B2822i6984B92900A45159e3577A07784O4703L26099
15986D98586k00998R8615K87968k93701C7052N1706a57587C2038A4821J91223
15976B06044N0707B375O7082J46232c9082B61442A4837K44571H2153Q1725N3701
15965B17579o9875o1856a98324C16887a61787A36016a65951j1673A10276b31110
15954g9601j28118I1725B6238a4931C04029A11104j2569A0684K39997g6516A17247
$$ y = [204332, -17542, 342790, 81043, -59774, 91929, 23254, 1537, 276676, 74603, 153997, 171823, 161999, 100413, -2761, 109847, 457040, -117089, 123049, 275209, 53065, 230023, 47578, 376241, 99043, 33091, -88557, 253017, 169393, -130577, -290920, 69062, -50659, -267020, -103851, 7754, -56568, -119007, 172356, 22822, -96984, 292900, 145159, -53577, 107784, 172487, 498586, 297588, 396203, 684171, 390470, 37052, 88758, -157587, 32038, 14821, 206044, 256751, 2375, 69457, 215689, -39082, 261442, 14837, 259408, 82153, 163878, 217579, 147704, 85848, -198324, 316887, -161787, 136016, -165951, -177624, 110276, -231110, -79601, -207719, 91725, 26238, -14931, 304029, 111104, 98535, 10684, 250681, -76516, 117247]
15942a999E44801a28169p7062N0625e7150C5480K14374A17017C1663c3677j47230
15931a80907e7399j54897K6186A0752b509j0045B56782I5298Q1459p3110j5509
15920H8138e9912K0342B44285E2035a633A56048i0944b423A61709a51142B66001
15908A55117a13892A15839C4789J59674g6638C3499K68606n1650a75751f0621
15897C54040C2996J91364c08696G5814K37116F032a26916E4234J76468F1997Q7558
15886A49555a33628A82606j6389e677A55188a55923A20386l2549d21265H5698
15875I6736j8682d72615A94457F932J6691J34791a69103m0837I2545J33822a92984
15863a23780n0452I6066a11633b2558G8665K7082i6273F3914L1600e0645B8732
$$ y = [-1999, 544801, -128169, -205231, -154606, -57150, 35480, 249854, 117017, 31663, -33677, -180907, -57399, -212296, -186110, 10752, -2509, -12554, 256782, 95298, 176757, 103647, 88138, -59912, -39570, 244285, 52035, -1633, 156048, -90944, -2423, 161709, -151142, 266001, 155117, -113892, 115839, 34789, 194463, -76638, 33499, 302105, 250455, -175751, -60621, 354040, 32996, 224360, -308696, 75814, 312930, 6032, -126916, 54234, 230702, 61997, 149555, -133628, 182606, 166217, -5677, 155188, -155923, 120386, 87837, -421265, 85698, 96736, 78054, -472615, 194457, 6932, 23623, 158414, -169103, -209940, 92545, 226367, -192984, -123780, -174232, 96066, -111633, -22558, 78665, 105747, -96273, 63914, 95514, -50645, 28732]
15851c2243k18787J22754p4959I5593A3251J63792D3986b30566C0695K15951c2666
15839c0146j09919A49398l4238m4025b62160B32876o0858M1046h2792k42745J7144
15828c08393d2396j43737B52283a48478g0528B17542j02950b3113j84202G6575
15817A31657i4349l16697B3377J33734J9234C0844J31613J1672b1258M073A92148
15805h9056K0308a6022n5949j2521A05933A7608a88600h0672n9982I593J44871
15794A54464D6604a05321A54796I362e9910C06457b00251P2610l2379E61144d3464
15782a66970H8646i3241b3864C4197Q5961e8852A30461F0116A5201a78230D9735
15770f176j38525B50661b08243A6331N2284R8765a33486A05726K37840H5964J06132
$$ y = [-32243, -251030, -128276, -203235, 95593, 13251, 177043, 43986, -230566, 30695, 246646, -32666, -30146, -140065, 149398, 115160, 71135, -262160, 232876, 172018, 213064, -82792, -325537, -308393, -42396, -186133, 252283, -148478, -70528, 217542, 114592, -23113, -207315, 76575, 131657, -94349, -411046, 23377, 157111, 176345, 30844, 162457, 174129, -21258, -17185, 192148, -89056, -68748, -16022, -71971, -84492, 105933, 17608, -188600, -80672, -140654, 9593, 154464, 46604, -105321, 154796, 9362, -59910, 306457, -200251, -127641, -160020, 561144, -43464, -166970, 88646, -93241, -23864, 34197, 120158, -58852, 130461, 60116, 15201, -178230, 49735, -6176, -144701, 250661, -208243, 16331, 68615, 167380, -133486, 105726, 343566, 85964, 192096]
15759A92096a59172A48170h0294a17k23372C47850a16209j11952N4711B5141i3137
15747B36335a94451b718A78783D1744h0507F8800I385J80913a04764A3090a30184
15735A2578i4343l8112c2814B06028F3798k2097a32818j55223c6491E4408N0538
15724A04946e828j63366j33454a05044E2029B5940b08280K8493A2141a09302j78076
15713b87378J10354p2677a2215A95466h904r8421B1155b77443e2905b3957q1060
15702a05017m365b5493k8012B35520h2655A36382f1731j17057c7779B87757a86389
15690E4329E32c13389a24963A41006b48512C4699h7771L993H4649a85407D1701
15678A02293a20447K9116D3115K0171M13249B7756L9728g5587B12530B3839A1394
$$ y = [192096, -159172, 148170, -80294, -117, -223489, 347850, -116209, -228161, -173450, 25141, -93137, 236335, -194451, -2718, 178783, 41744, -80507, 68800, 9385, 190298, -104764, 13090, -130184, 12578, -94343, -132455, -32814, 206028, 63798, 41701, -132818, -288041, -36491, 54408, 104946, -5828, -169194, -302648, -105044, 52029, 25940, -208280, -179787, 12141, -109302, -287378, -177024, -249701, -12215, 195466, -8904, -107325, 21155, -277443, -52905, -23957, -105017, -109382, -25493, -53505, 235520, -82655, 136382, -61731, -178788, -37779, 287757, -186389, 54329, 532, -313389, -124963, 141006, -248512, 34699, -87771, -83778, 84649, -185407, 41701, 102293, -120447, -91331, 43115, 63286, 476535, 27756, 67484, -75587, 212530, 23839, 11394]
15666c55205h2383j92037D4822d7730j6171k53308B7812f147C18632b14230j20726
15655c34956C9826J84518a04346E5689J37845a25466Q335d5736j96338B48979
15644E8918K0434j5925a9927B73997H0816b34884K4320g6751j79796H2095c2987
15632I2049a29999j28568h1737J6581j03615P8381K1333l4763K3768A22896a67100
15620D5146J97855I8697g5789A28704g1721I1055J22448c84647b9572j6047k8902
15609g4521j16372A78414b43014L9024r4664A34705e6347A19732b35093A20730
15598A85c2764B4648J06619f1769A02500k7162P5048F1764O2924c37638A54781
15586E4145c31237J23680G4130F976i6399j18407C43482F7796a05915H7343b28827
$$ y = [-355205, -82383, -274420, 44822, -47730, -63901, -317209, 27812, -6147, 318632, -214230, -334956, 39826, 224344, -104346, 55689, 193534, -125466, -117131, -45736, -242074, 248979, 58918, 79352, 63427, -19927, 273997, 80816, -234884, -210564, -76751, -256547, 82095, -32987, 92049, -129999, -258567, -81737, -65156, -168771, -90390, -69057, -103820, -80052, 122896, -167100, 45146, 243001, 98697, -75789, 128704, -71721, 91055, 213503, -384647, -29572, -45619, -74521, -190893, 178414, -243014, -203990, -298654, 134705, -56347, 119732, -235093, 120730, 185, -32764, 24648, 131267, -61769, 102500, 75338, 150386, 61764, 124688, -337638, 154781, 54145, -331237, -207557, 74130, 6976, -96399, -214806, 343482, 67796, -105915, 87343, -228827]
15574b15844B31201d9277j09875d0001e146J295A93283n6113i4805D1494J53176
15563A94670b86117d1861j55165C2961a05915A39397F2465a83952j14316O6460
15553b31808e1964l7786B74370e3335m7540r029H800R2723m9179R9868a26372
15541b3819F5493I709O3606O9464B9665h6017B64226a61238j11f7445k31877e7282
15528B7298b06316F0647b81849C0931L82677a08195K6042B76592N7669P6711E4606
15516b24020F9112Q4320c23402B13914a11210j09930B21857a74690O6179A21006
15505c0214j89594r2000B60094N3179b27922Q4612D9592K49020i0619j41234A25168
15493A1114f7301q2456k29652b3217A00515J64806j00687l7515h893l19020c2282
$$ y = [-215844, 231201, -49277, -159152, -40001, -5146, -3851, 193283, 137170, -94805, 41494, 194670, -286117, -41861, -197026, 32961, -105915, 139397, 62465, -183952, -298268, -231808, -51964, -89750, 274370, -53335, -100875, -109904, 8800, 101523, 52344, 152212, -126372, -23819, 65493, 9709, 73315, 142779, 29665, -86017, 264226, -161238, -161349, -67445, -299322, -57282, 27298, -206316, 60647, -281849, 30931, 413608, -108195, -82153, 276592, 334261, 410972, 54606, -224020, 69112, 153432, -323402, 213914, -111210, -221140, 221857, -174690, -108511, 121006, -30214, -219808, -311808, 260094, 313273, -227922, -143310, 49592, 298612, -90619, -231853, 125168, 11114, -67301, -149757, -379409, -23217, 100515, 265321, 164634, 127119, -8893, -327913, -32282]
15481B8791a43081L5785B3912f4188E6724b28118B09286K8071H1291M7859F463
15469D3718C881b28975E1330a45319A49091a1727k73563A56379b49080A88327
15458c8329C3126g815j00527B2218r111b80888c1656l6888j15421j9439O3511
15447a39893f7938J9636o7588E5054N7106J53192G5612N7118N1942b3250C18504
15435D4873J13335B8403o203i5121B09958b7354A57996O9728r739b27009R6044
15424a30965C0102K7840K78724j16473j5526b59180e3787o0316b2426A66175O5159
15413B31334a41656e1268m9686C6428Q5902A5913a21904E3637j836a09715F7413
15401B16136a72219O0791L8559n9882A71342b29170A21238g8153L7122j37216
$$ y = [28791, -143081, -107296, 23912, -64188, 56724, -228118, 209286, 237357, 81291, 129150, 6463, 43718, 3881, -228975, 51330, -145319, 149091, -11727, -285290, 156379, -249080, 188327, -38329, 33126, -7815, -108342, 22218, 13107, -280888, -31656, -68544, -183965, -203404, -139893, -67938, -48302, -115890, 55054, 112160, 265352, 75612, 132730, 184672, -23250, 318504, 44873, 158208, 28403, 22200, -95121, 209958, -27354, 157996, 227724, 217985, -227009, -130965, 30102, 57942, 336666, 220193, 204667, -259180, -53787, -114103, -22426, 166175, 231334, -141656, -51268, -100954, 36428, 122330, 15913, -121904, 53637, 51801, -109715, 67413, 216136, -172219, -111428, -72869, -132751, 171342, -229170, 121238, -78153, -41031, -178247]
15391a78247H6751L4942D4388a62271b5978o3726j56034I3399d2601L180j847
15380d1268A59919L3116K974C9642a59723H071L5589J92358j11149E7566j9335
15369C8231K37860C9859N6737d5975l36595a81582f3508A02942c74751b7758r0263
15358a18021A31664a10464A06429a16931A32804e8754b6538C57989A64445a60388
15347a0104j01682A74128R7667p8022N6878o3620r2273O9820h7415B30281c4151
15335d98B46937b7501l5354B16078F4198J75722a94262i0046G7791O2925L5340
15324A76056Q7682E7917a40541I3857i0118C98761a76989C16178A8954h3468E8614
15312E3651J86961b03594F5194e7582P949A41453e159A53021P091L5894o6259
$$ y = [-178247, 86751, 121693, 44388, -162271, -25978, -89704, -245738, 93399, -42601, -39421, -41268, 159919, 193035, 196009, 39642, -159723, 8071, 43660, 236018, 124869, 57566, 38231, 276091, 39859, 96596, -45975, -382570, -181582, -63508, 102942, -374751, -27758, -118021, 131664, -110464, 106429, -116931, 132804, -58754, -26538, 357989, 164445, -160388, -10104, -111786, 174128, 271795, 193773, 250651, 187031, 94758, 164578, -87415, 230281, -34151, -498, 246937, -27501, -62855, 216078, 64198, 239920, -194262, -90046, 77791, 140716, 176056, 263738, 57917, -140541, 93857, -90118, 398761, -176989, 316178, 18954, -83468, 58614, 53651, 240612, -203594, 65194, -57582, -49633, 141453, -5159, 153021, 160112, 196006, 129747]
15301A29747f5284B08041k7622J78895A52748b61773a1466A44370K06694d9174
15290B45943a00744d3678E7123K71628F2023k5218M1142b485A42110a11907c1401
15278d2409J0719m9868B7362J97575F9817b03602g0669H0698J43515j03662f448
15266C24384b94800F2183c00112B4955K83415b7238j64100I3345R3688B4976R4376
15255A19352a68068h227D3303K70229M53227M54525k09382L3290j59706A8993
15244D75156a28723C01381g8316A01478a42844j61730A28313L395f103B24053
15233i5530B56765M0371j33298e8420E8341R984a92448C14999D0498R3014F1039
15221B65895H0277a75303A52846b69088a18178B36632o9625l2089N8992i8434
$$ y = [129747, -65284, 208041, 180419, 359314, 152748, -261773, -11466, 144370, 351064, -49174, 245943, -100744, -43678, 57123, 328751, 62023, 36805, 77947, -2485, 142110, -111907, -31401, -42409, -31690, -81558, 27362, 224937, 69817, -203602, -70669, 80698, 224213, 120551, -6448, 324384, -294800, 62183, -300112, 24955, 308370, -27238, -191338, 93345, 187033, 24976, 119352, -168068, -8227, 43303, 313532, 766759, 1221284, 1011902, 1045192, 885486, 18993, 475156, -128723, 301381, -78316, 101478, -142844, -304574, 128313, 131708, -6103, 224053, -95530, 256765, 297136, 163838, -58420, 58341, 68325, -192448, 314999, 40498, 133512, 61039, 265895, 80277, -175303, 152846, -269088, -118178, 236632, 167007, 134918, 193910, -98434]
15210A0034J44349i1323A61800b08246A57501a23146A3504J86819c7939q6021
15200a23960n0383C06237b2652j36807A10153b86780C8001a36493A7759N3912
15190G1671K00117q5157q2547f0328a2751F4864Q1752j3036a03512j26363F2015
15178B5701K61898D6782a49463c1172A89687a5617A24063e1272p4730a9830F7339
15166F492J4925R3175J28968h7876B58080A21568K45567b01534B78813i601j07570
15155a17171F8456K25393j775j05781d8758B14028a70302A49036i1373A08105
15144g4887I7866a09510k7787G0788i1597r0599A2144i9329q3942h8319G3108
15132A83646a3502B31125C1802b3991D378J08253D4855A7507K77830m336G0544
$$ y = [10034, 154383, -91323, 161800, -208246, 157501, -123146, 13504, 200323, -37939, -123960, -174343, 306237, -22652, -159459, 110153, -286780, 38001, -136493, 17759, 71671, 271788, 186631, 104084, -60328, -12751, 64864, 146616, 133580, -103512, -229875, 62015, 25701, 287599, 46782, -149463, -31172, 189687, -15617, 124063, -51272, -126002, -19830, 67339, 6492, 21417, 114592, 243560, -87876, 258080, 121568, 367135, -201534, 278813, -9601, -117171, 68456, 293849, 292074, 186293, -48758, 214028, -170302, 149036, -91373, 108105, -74887, 97866, -109510, -137297, 70788, -91597, -182196, 12144, -99329, -183271, -88319, 73108, 183646, -13502, 231125, 31802, -23991, 4378, 112631, 44855, 17507, 295337, 291001, 70544]
15120B03569q9609E928e5673M697B08936c9987I5778a42047C17283f8719A59222
15108D1441e2518B82070a8088A2172J17700a8808D42670B1170a70775j06830B95489
15096A10123d351A66222E6476a33948A12683K0828b60097B11229b6891A38809
15085A39722J36393a7820B49570a74103B28980m4878A4471a5869D28611A97239
15074G2398J32144O1374l867b0488B12312a05277H0790d0805A84152G6722O3688
15063A40410a82833C1712e0725C4942M7218a60736f4762C49663F2399M1244e6723
15051A03352b0988C06560L7625p1050j01472a19820I0582O36649B89402P5417
15041C64819A51697J62156k3104J08691A64113J30648i9161B88527j33154P2221
$$ y = [203569, 113960, 5928, -55673, -50976, 208936, -39987, 95778, -142047, 317283, -68719, 159222, 41441, -52518, 282070, -18088, 12172, 129872, -18808, 442670, 21170, -170775, -277605, 295489, 110123, -4351, 166222, 56476, -133948, 112683, 133511, -260097, 211229, -26891, 138809, 139722, 276115, -17820, 249570, -174103, 228980, 184102, 14471, -15869, 428611, 197239, 72398, 204542, 265916, 262049, -20488, 212312, -105277, 80790, -40805, 184152, 76722, 140410, -182833, 31712, -50725, 34942, 82160, -160736, -64762, 349663, 62399, 103643, -56723, 103352, -20988, 306560, 344185, 273135, 171663, -119820, 90582, 727231, 289402, 364819, 151697, 313853, 290749, 399440, 164113, 294761, -99161, 288527, 155373, 227594]
15031B27594I6007L30203j8502j41899G7963J07795K3149K35333k02493l5896
15021B05851K22450q2867d7662B03218F8756K21028J18187a21902B48198D2768
15010B6297K96920o8454j0752h229E3237L55095B6548L58974a1620B67998J63525
14999D31523j20597H6924J32988d4587C27721K57939A09836E1683K01803J09378
14989C62864a15670C47823m4923J65609M1812O6091K0584k56921N8682L8732F2597
14977C55925j02552J51639r6616j0517G6298J34821K56993A41382L80562A74513
14966F68884j59364j60176r9340D0582L33275o7161J7226l637K56458B03079L47822
14955E50901B12035M5363l1466P8989j24231l720l6677M331m7825L32880j44657
$$ y = [227594, 96007, 426210, 407708, 265809, 77963, 185758, 208907, 444240, 241747, 205851, 428301, 345434, -47662, 203218, 68756, 289784, 407971, -121902, 248198, 42768, 26297, 323217, 254763, 244011, -8229, 53237, 408332, 26548, 385522, -11620, 267998, 431523, 310926, 86924, 219912, -44587, 327721, 585660, 109836, 51683, 253486, 362864, -115670, 347823, 302900, 468509, 510321, 576412, 596996, 340075, 398757, 437489, 62597, 355925, 253373, 405012, 308396, 297879, 76298, 211119, 468112, 141382, 521944, 174513, 668884, 509520, 349344, 250004, 40582, 373857, 306696, 323922, 320285, 576743, 203079, 550901, 212035, 257398, 225932, 304921, 180690, 176970, 140293, 144624, 96799, 429679, 285022]
14944B85022K11051h3504C56292A40922K04886Q5324j59710j13771B4714J33378
14934A58092p251G2070L45769j68501o574L22194k07604o2274M1761M51934j59275
14923F29500k57656J36389L73308m3586k80332r7361l6749K16676J30475j52578
14913F18086m2869J59876j35484n6753A15485K58472A02385L54263J14503B56377
14902B26368L78149B35493K09131q7230k7038D0366L42949A23881L31818A88259
14891B3072K58128p5575R6032K4053Q0190l8629J52686k03892K67203j76824K19178
14880F25622C12343O609m2964J02183j8756R1195A07765M39401j60626n6367r9499
14869B30674k8783L00266B12064L02611q080k15098J77056j66956k1719j20235
$$ y = [285022, 496073, -83504, 356292, 140922, 345808, 431132, 271422, 157651, 24714, 158092, 150841, 72070, 417839, 249338, 242764, 564958, 357354, 295080, 336841, 788775, 629500, 371844, 508233, 881541, 837955, 557623, 460262, 423513, 640189, 770664, 618086, 575217, 735093, 599609, 542856, 115485, 373957, 102385, 456648, 571151, 256377, 226368, 604517, 235493, 444624, 357394, 330356, 40366, 383315, 123881, 455699, 188259, 23072, 281200, 205625, 301657, 325710, 405900, 367271, 519957, 316065, 583268, 406444, 625622, 312343, 318952, 275988, 378171, 359415, 450610, 107765, 547166, 386540, 330173, 230674, 201891, 502157, 212064, 514675, 506595, 291497, 468553, 301597, 279878, 159643]
14859A59643N0384a00157M0949F24081l02939J64750q5458r7578A33200M98550
14849F31750C07707L9742K37051j05081k0610j61776J6749N92175B77805K03987
14839D81792R6156j63297k06297L55897M8837j88341j13473J28953A13159J64674
14829B77833J93189N9806j3530K37019B66024J05813A64913L9644Q4487p8194
14819B10850j03980M15100r8809J1575L5897E4801M05788l2055p2786K2274L48285
14808G26307A73242M08694B24295K93770n9232r1412K65666k36039L09230j45738
14798E60540J15274k73989j85705L91309k52754L78627C53716O8538J36328k2432
14788E36150j62013N21492m27816K8716L1879I9409L37637m7731L37349B64584
$$ y = [159643, 210027, -100157, -59208, 624081, 321142, 485892, 400434, 302856, 133200, 631750, 307707, 347449, 584500, 479419, 458809, 297033, 313782, 905957, 277805, 481792, 577948, 414651, 208354, 564251, 613088, 424747, 311274, 440227, 113159, 277833, 471022, 530828, 517298, 754317, 266024, 371837, 164913, 204557, 289044, 210850, 106870, 521970, 423161, 434736, 470633, 54801, 460589, 428534, 355748, 378022, 726307, 173242, 581936, 224295, 518065, 458833, 367421, 633087, 397048, 706278, 560540, 675814, 401825, 216120, 607429, 354675, 733302, 353716, 422254, 558582, 536150, 374137, 895629, 467813, 496529, 528408, 99409, 437046, 389315, 726664, 264584]
14777D83461k5292J10888j0910P1948j60877B28601L14363j97580L33169B35176
14766C74180J04880j09132J07761p7017A40338N70780B54802K07181r2562r2996
14756B76425J02499M3849L36937k1894j78862B34428N02410B65896M04768C21945
14745E74738L2536L1342J31845B74696K2446K41845J02285J27783l02583P7633
14735E44105k6595j68633J70647O2094k34549O03723j06511j35903j16008K75837
14725H68207j06864o6134q6697Q2868o1952K61633o922j90511K74351j05880J14616
14714I76715k90968r3890K03781j08102N8852Q4193k51337m6894n3310M07348
14704H86388j79761O0998j61339J68544K46076m67508M05703q4595j06894J27214
$$ y = [483461, 458169, 569057, 558147, 630095, 469218, 228601, 542964, 345384, 678553, 235176, 374180, 479060, 369928, 477689, 400672, 140338, 711118, 254802, 461983, 369421, 276425, 378924, 422773, 759710, 737816, 558954, 234428, 736838, 265896, 670664, 321945, 574738, 607274, 638616, 770461, 274696, 297142, 538987, 641272, 769055, 466472, 544105, 517510, 348877, 519524, 581618, 347069, 950792, 844281, 708378, 592370, 868207, 761343, 695209, 608512, 691380, 629428, 891061, 884139, 693628, 967979, 862099, 976715, 685747, 591857, 795638, 687536, 746388, 830581, 579244, 532350, 479040, 886388, 706627, 767625, 606286, 774830, 1020906, 553398, 959101, 874506, 767612, 894826]
14694H94826n2353l2063k7410L9589C70447J94756J16777l13268M16434k31461
14684E53685L25075J16373o1583j30902C96957K61496R1863p059n5143Q0338L521
14673G71973j34177J97582K77356m43439N0132L0724Q4887Q657o6903n4198m8480
14662F74114K51080J17169m63221K60972L88331n71648K96644l3952j50505j39070
14652F29914K00480M8408m7381n5594N75744F14599K74788J6754K32678k0157
14642A118662j35926m3205J5919q660Q6810m985J42145j5051j3424l6936P7266
14631A182615k47632M4151J28357k18788N0420L39633n1597j51791N1983j26211
14621A001140L9020L05905J37006m51530J76558J09570r4421Q8207j64234j10800
$$ y = [894826, 842473, 810410, 783000, 822589, 370447, 565203, 681980, 368712, 785146, 553685, 878760, 995133, 933550, 802648, 396957, 658453, 750316, 743257, 688114, 768452, 771973, 637796, 835378, 1112734, 669295, 719427, 750151, 835038, 843695, 776792, 722594, 674114, 925194, 1042363, 579142, 840114, 1228445, 656797, 953441, 919489, 768984, 629914, 830394, 878802, 831421, 775827, 1351571, 614599, 889387, 906141, 1138819, 1118662, 982736, 939531, 955450, 946790, 1033600, 1028615, 1170760, 1155709, 1142285, 1105349, 1182615, 934983, 979134, 1107491, 888703, 939123, 1278756, 1227159, 1075368, 1127351, 1001140, 1040160, 1346065, 1483071, 1031541, 1208099, 1317669, 1223248, 1311455, 1147221, 1036421]
14611A036421J69507N8197M3121L3031j82056j5853k30647O72090j42971j96733
14601A244107k4302K42552k5621j6442l5080j68208K96333j65718l0659R2006
14591A408968J87260m02905J73428o5488M00968k99406K3888Q6043O6586O0508
14581A639850j84292n4459J60548j11420r234L93412l64167L85712j18999J18478
14571A855429k47743R151K08926j76676N08930J10152j75759M809L7766J56006
14561B290991P3747R1780k30745L53217J93118J38792o4494J45256M73448M88837
14551C953947P12396J612644K204200N779949R357146Q276879m559243j2289224
14543A5048694p339174l289306j177906q74630p898l75270k93660N8827J88289
$$ y = [1036421, 1205928, 1264125, 1307246, 1340277, 1158221, 1142368, 911721, 1583811, 1440840, 1244107, 1219805, 1462357, 1436736, 1420294, 1385214, 1217006, 1513339, 1347621, 1316962, 1408968, 1596228, 1193323, 1366751, 1301263, 1702231, 1402825, 1426713, 1512756, 1579342, 1639850, 1455558, 1401099, 1561647, 1450227, 1440993, 1834405, 1470238, 1855950, 1736951, 1855429, 1607686, 1616837, 1825763, 1649087, 2158017, 2268169, 2092410, 2097219, 2134985, 2290991, 2364738, 2456518, 2225773, 2578990, 2772108, 2910900, 2846406, 2991662, 3465110, 3953947, 4666343, 6278987, 8483187, 14263136, 23620282, 31897161, 27337918, 15048694, 7709520, 4420214, 3242308, 2367678, 2359780, 1984510, 1690850, 1749677, 1937966]
14534A937966J57133l78252O5032L56307k42115M3240j24846J1077N53402o70485
14524A708459k4604N68891R104M6215k91200K11543l6433j25584P832J31578L6023
14513B241824L23919m83699L38265l33050L26174l15565M77809m12368K88732
14504B452041P9288j6436J02442N2159k76523M65298k32329q6254J27809K43044
14494B910539k1617J22328k97816K08153K17175l9417l22400J10321q701J82086
14484C060651K2951K0890K6761Q9436q4073j56558K19323L32172l82138j10848
14474C038567L10612L65598l98805J96480p8256R7543j94251K0934L34405j99645
14464C493182L05862P5222k49307K87990j64429n6820L46090K7372j821l163K60564
$$ y = [1937966, 2095099, 1716847, 1781879, 2138186, 1896071, 1939311, 1814465, 1825542, 2378944, 1708459, 1683855, 2252746, 2261850, 2308065, 2016865, 2228408, 2191975, 2066391, 2074223, 2205801, 2241824, 2565743, 2082044, 2420309, 2087259, 2413433, 2097868, 2575677, 2163309, 2452041, 2531329, 2514893, 2617335, 2669494, 2392971, 2858269, 2625940, 2539686, 2667495, 2910539, 2888922, 3011250, 2713434, 2921587, 3138762, 3099345, 2776945, 2887266, 2878565, 3060651, 3083602, 3104492, 3131253, 3220689, 3136616, 2980058, 3199381, 3531553, 3149415, 3038567, 3349179, 3714777, 3315972, 3512452, 3434196, 3531739, 3337488, 3358422, 3692827, 3493182, 3799044, 3874266, 3624959, 3912949, 3748520, 3691700, 4037790, 4065162, 4063341, 4060178, 4320742]
14453D320742j38446K36212j05257m12984N65922J87392r8377R7835p0583q0036
14443D502420N39030m7307J68131l71292J37506n542M30218l64029P4622L52965
14433E416722J30224o2978J61127Q8870K64079j88971J09477K46769n2364L5443
14423F148398K04707j52958R6872J67639K73446M5558L63226l31622K78126J88527
14413G281919J14478K1108K7651L47946N0834k33235J72839L43650J3712j32475
14403H008427P04622k22670J60260L99747J01292o7062K56874K86834K47621o1878
14393I814067K74329K50466r9523n9105L74623L41006j22064R2798L76248N40363
14383A1783208k81313J58022N63999m605M56411M63655m6811K29399J66760K69630
$$ y = [4320742, 4182296, 4418508, 4313251, 3900267, 4466189, 4653581, 4555204, 4653039, 4582456, 4502420, 5041450, 4994143, 5162274, 4790982, 4928488, 4922946, 5353164, 4989135, 5063757, 5416722, 5546946, 5483968, 5645095, 5733965, 5998044, 5809073, 5918550, 6165319, 6112955, 6148398, 6353105, 6200147, 6297019, 6464658, 6738104, 6783662, 7146888, 6815266, 7093392, 7281919, 7396397, 7417505, 7445156, 7793102, 7843936, 7610701, 7783540, 8127190, 8140902, 8008427, 8713049, 8490379, 8650639, 9050386, 9151678, 9084616, 9341490, 9628324, 9875945, 9814067, 10088396, 10338862, 10239339, 10180234, 10554857, 10895863, 10773799, 10866597, 11242845, 11783208, 11501895, 11659917, 12223916, 12219311, 12675722, 13139377, 13092566, 13321965, 13488725, 13758355]
14373A3758355L83043J43313O16191j02754M46322L30406L14804K5464O28844
14364A6543988M37749O13116n6876P01052M08964K95405P24560K6440O35280L53691
14354B0683369N06971K31170P83646O07187O40008L02109P51950Q85952l8784
14345B5353578J303564J64836J159236N33375R48652N73997J110998P46779P67062
14336C2662077J218093R73691R50913P52479J514993J206509R44275J370812J194390
14327D2788232J366904J740135J325005J952235J396382K096626J740360J686165
14319E6092044K334188J926134K166839K412413K911240K308333L296658K387184
14311G5835033K965816L605905L758337L668457M062735M640491L884203N097939
$$ y = [13758355, 14141398, 14284711, 14900902, 14798148, 15244470, 15574876, 15889680, 15915144, 16543988, 16981737, 17594853, 17537977, 18239029, 18647993, 18943398, 19667958, 19694398, 20329678, 20683369, 21190340, 21421510, 22205156, 22812343, 23452351, 23754460, 24506410, 25392362, 25353578, 26657142, 26821978, 27981214, 28514589, 29463241, 30037238, 31148236, 31895015, 32662077, 33880170, 34853861, 35804774, 36557253, 38072246, 39278755, 40223030, 41593842, 42788232, 44155136, 45895271, 47220276, 49172511, 50568893, 52665519, 54405879, 56092044, 58426232, 60352366, 62519205, 64931618, 67842858, 70151191, 73447849, 75835033, 78800849, 82406754, 86165091, 89833548, 93896283, 98536774, 102420977, 107518916]
14303A07518916N134832N075744N637113O400666O274921O936011P467092P795177
14295A58240472Q435394Q652579R555302J0058302J0153337J1471388J1707883
14288B28274657J2278077J2897176J3599701J4029114J4275070J5037955J4372440
14281C24764190J5023950J4652060J4150054J3469859J2756306J1466988R892991
14274D16176398P896557M861641J628868l69802j000128k366100l334958m135667
14266D19356809p047484r627199j1180625j3000693j3888345j4766224j4866862
14259C34979377j5366254j5272248j4325755j4126575j3993753j3417047j2620655
14252B35857090j2257503j1496923j1076138j0140171r949758r059840q758841
$$ y = [107518916, 112653748, 117729492, 123366605, 129767271, 136042192, 142978203, 150445295, 158240472, 166675866, 175328445, 184883747, 194942049, 205095386, 216566774, 228274657, 240552734, 253449910, 267049611, 281078725, 295353795, 310391750, 324764190, 339788140, 354440200, 368590254, 382060113, 394816419, 406283407, 416176398, 424072955, 428934596, 430563464, 430193662, 429193534, 426827434, 423492476, 419356809, 412309325, 402682126, 391501501, 378500808, 364612463, 349846239, 334979377, 319613123, 304340875, 290015120, 275888545, 261894792, 248477745, 235857090, 223599587, 212102664, 201026526, 190886355, 180936597, 171876757, 163117916]
14245A63117916p901336p581155p100679o790111o188845o112154n235619n537546
14237A10670471m510548n077401m315941m093247l861849l638179l166799l379713
14229G8626794l220025k959150l044358k090900l073069k099194k441083k325591
14221E7373424j716560k080964j614651j771848j336899j779135j627072j511473
14213D3934822j243342r13715j740900j449985q75415j009619o31518j349901
14205C4720427j262804q15649m03171j273920n22732r68634q28450p30023p23220
14196B7191824q85731n36402r09120o91730l51757m81294n72047n74269o54798
14187B1534676m15192n81641n81776k86355k68276p2291r90890r2107p37179m32997
$$ y = [163117916, 155216580, 147635425, 140534746, 133744635, 127555790, 121443636, 116208017, 110670471, 106159923, 101082522, 96766581, 92673334, 88811485, 85173306, 82006507, 78626794, 75406769, 72447619, 69403261, 67312361, 64239292, 62140098, 59699015, 57373424, 55656864, 53575900, 51961249, 50189401, 48852502, 47073367, 45446295, 43934822, 42691480, 41777765, 40036865, 38586880, 37711465, 36701846, 36070328, 34720427, 33457623, 32641974, 32238803, 30964883, 30442151, 29473517, 28645067, 27915044, 27191824, 26306093, 25769691, 24860571, 24168841, 23817084, 23335790, 22763743, 22189474, 21534676, 21119484, 20537843, 19956067, 19669712, 19401436, 19329145, 18338255, 18246148, 17508969, 17075972]
14177A7075972k46500n23503q5602j32934o20887k27037k71086j64500l18127
14168A4485796m22144l3658l08043l21554o74038J62945l29111l18095l7599j4298
14158A2190201o21482k28529Q5268j79061l05628k211n00105l13808J4525n22
14148A0138648l55881k7499j54901p6035k88510j93255K00795k31108m58656K16429
14138H770027k72111p153k21280L1377p0469m59377j33044N24j61090P9034l26420
14127G230018m0992j71560j50994M7759J03545j07489j56411k03582J42511M8594
14117F741399n72630K15921l46535n8086O829r9738P0009k42768j55991K85755
14107E844165k50347J03809m38545Q0574m3890k9603K90096n40670M2713J91206
$$ y = [17075972, 16829472, 16305969, 16220367, 16087433, 15466546, 15239509, 14968423, 14803923, 14485796, 14063652, 14029994, 13721951, 13400397, 12726359, 12889304, 12560193, 12242098, 12204499, 12190201, 11568719, 11340190, 11425458, 11246397, 10940769, 10938558, 10438453, 10124645, 10139170, 10138648, 9782767, 9755268, 9600367, 9524332, 9235822, 9042567, 9243362, 9012254, 8553598, 8770027, 8497916, 8490763, 8269483, 8300860, 8230391, 7771014, 7637970, 7638494, 7477404, 7556438, 7230018, 7189026, 7017466, 6866472, 6914231, 7017776, 6910287, 6753876, 6550294, 6692805, 6741399, 6168769, 6384690, 6038155, 5980069, 5986898, 5887160, 5957169, 5714401, 5558410, 5844165, 5593818, 5697627, 5259082, 5339656, 5295766, 5266163, 5556259, 5015589, 5058302, 5249508]
14097E249508l89988K10947k86359J38905k08277k85655J81421j41990l7508J59241
14087D590245k67006j65861R9129J76280m50670N6164r968j92127M52850k58948
14077D030088l4807O679j13561k10015K23698o9066k29899L4919N20284m73439
14067C684881o0653J79349o64849N78060l85436J53005R1157J00664m50446J05164
14057C330896k7557O7981M0475l39865L5841O4691k02401J89038m1346m68540
14047B649213L62906j11474j65475J27151M0431K19861j35219n20149K62144k1959
14037B707430N3508j89817Q546N6496L15468k98104J13870k98110j24133M1542
14027B386696j47641P0701k83150K49519L23345q7415p4069k74607L37452k80901
$$ y = [5249508, 4859520, 5070467, 4784108, 4923013, 4714736, 4429081, 4610502, 4468512, 4431004, 4590245, 4323239, 4157378, 4256507, 4432787, 3982117, 4038281, 4028313, 3836186, 4289036, 4030088, 3995281, 4001960, 3888399, 3678384, 3902082, 3833016, 3603117, 3638036, 4158320, 3684881, 3624228, 3803577, 3138728, 3716788, 3331352, 3484357, 3575514, 3676178, 3225732, 3330896, 3303339, 3371320, 3411795, 3071930, 3107771, 3172462, 2970061, 3159099, 3117753, 2649213, 3012119, 2900645, 2735170, 2862321, 2902752, 3122613, 2987394, 2467245, 2729389, 2707430, 2760938, 2571121, 2579667, 2636163, 2951631, 2653527, 2767397, 2469287, 2345154, 2386696, 2239055, 2309756, 2026606, 2276125, 2599470, 2512055, 2437986, 2163379, 2500831, 2219930]
14017B219930k93740j29941M25436q7794j18282j30791J70888J3234N2661j63099
14007A958502J17237O9794J07918k90958l20599J35983K19355K26938k79485q3438
13997A861247K0353M6392R9789j74002M55982l8935L91977O45741J214821L943416
13987H466781P470761J0957465L085326r524533q621568m198249k099404j151332
13979D385247o21065n06708k78815k28969Q2398k04267j56451J72973n22640L19225
13969B440928l56092J73599q5554k43015J29147R7726j83614k4006k5247m7830
13959A876042n2842p7502m8559o2816k5466J27579R509N9768r2210n2279J88441
13948A849665k60530j38047L07117j24483M014m16799J91872l9116J84078l53072
$$ y = [2219930, 1926190, 1796249, 2221685, 2133891, 2015609, 1884818, 2055706, 2068940, 2121601, 1958502, 2075739, 2145533, 2253451, 1962493, 1641894, 1777877, 1997232, 2224170, 1944685, 1861247, 1881600, 1927992, 2027781, 1853779, 2309761, 2270826, 2662803, 3308544, 4523365, 8466781, 15937542, 26895007, 29980333, 20455800, 11834232, 7635983, 5536579, 4385247, 3764182, 3257474, 2978659, 2749690, 2832088, 2627821, 2471370, 2644343, 2121703, 2440928, 2084836, 2258435, 2172881, 1929866, 2059013, 2156739, 1973125, 1949119, 1923872, 1876042, 1823200, 1745698, 1697139, 1634323, 1608857, 1736436, 1745945, 1805713, 1713503, 1661224, 1849665, 1589135, 1451088, 1758205, 1633722, 1637736, 1220937, 1412809, 1373693, 1557771, 1204699]
13938A204699L10760o09442N52868M8102k97722M04818k17748p1393o9193K56488
13928A512237J47213l93955J15526o758J55486k60146j4495k54980K93370q3050
13918A210448k28594J93047J43652j53838l3365j07285j46894J87514K14315j44651
13908A134349k9307M9939J80748k09692J75120j28815n1955R5988k70937K529
13898I47967K68928J5984k16322q2764Q5342k56858L90605K80995n21278K7681
13888I40280J60441l5620m0940J7375k9227k76044K58946k2954J45570j85040
13878I32787K74692l16790K81564k92198L48262l67361L42656l15676L5432q9043
13868H34325J36087M4034J8189j18051M8252J38222l1540M9417J5773k32610L3663
$$ y = [1204699, 1515459, 906017, 1458885, 1506987, 1209265, 1614083, 1396335, 1324942, 1255749, 1512237, 1659450, 1265495, 1381021, 1374263, 1529749, 1269603, 1255108, 1000128, 1293498, 1210448, 981854, 1174901, 1318553, 1164715, 1131350, 1024065, 877171, 1064685, 1279000, 1134349, 1105042, 1154981, 1335729, 1126037, 1301157, 1172342, 1120387, 1216375, 945438, 947967, 1216895, 1232879, 1016557, 933793, 1019135, 762277, 1152882, 1433877, 912599, 940280, 1100721, 1065101, 1024161, 1041536, 1012309, 736265, 995211, 972257, 1117827, 932787, 1207479, 890689, 1172253, 880055, 1228317, 860956, 1203612, 887936, 923368, 834325, 970412, 1014446, 1032635, 914584, 962836, 1101058, 1069518, 1118935, 1134708, 902098, 935761]
13857I35761m3010J06556k00722J56851j88981M01696k24411j34362J41188J35717
13847A086283j58115j23876K32820n9481j97186J16540o0270L00448E58958K58823
13837H17781O1542j41364L06260j90262k81100L36056k99529K85212l27377J00676
13827F67895L45839j13186j95596R3674j10419L64062j70340k72032K31117O4025
13817I05039k84549K94769l37130o886K8651K11483k15440j3522K73303l13000
13807E42718J52230l27973K00698J881J51935N5659K7983j82202o3134L8771M28630
13796A027196E02582J93766P7050J80425k01815m3931j53281j9010K86311C67400
13785F69021j00059R7619n1575J07613l00952J83403J06625j98182J40607k19105
$$ y = [935761, 892751, 999307, 798585, 955436, 766455, 1168151, 943740, 809378, 950566, 1086283, 928168, 804292, 1037112, 977631, 780445, 896985, 836715, 1137163, 558958, 817781, 879323, 737959, 1044219, 853957, 572857, 908913, 609384, 894596, 567219, 667895, 1013734, 900548, 704952, 798626, 688207, 1052269, 881929, 609897, 841014, 905039, 620490, 915259, 578129, 571243, 599894, 811377, 595937, 582415, 855718, 542718, 694948, 366975, 567673, 569554, 721489, 777148, 805131, 622929, 559795, 598566, 1027196, 502582, 696348, 773398, 953823, 752008, 708077, 554796, 535786, 822097, 367400, 669021, 568962, 666581, 615006, 722619, 421667, 605070, 711695, 513513, 654120, 435015]
13775D35015L44438j87405p7592K75345k69615J74322L70767D51811n6296M5936
13765D41451J96431l3091J12128l20655J62712L3837M0226K41460j77530m9313
13755F47656R8624k71384j44456J66185m8434j10663M2488K40341k21554K97496
13745F96299C28255K63312K24409C47895J59467K26040j55233j15410M3027k06950
13735B98836J34713k8670N468K47806B86253K21018B04890J53926L32797J5040
13725G06653j75150j00860j3821j16904L37272q2793K83205l16042j19222J21496
13715E23834L83054k78364K3844B9748K31128K02708A40739J80536J19021P1511
13705E11807K9436q4366N8635K280j89275J03260J40645B58952L66945j95389
$$ y = [435015, 779453, 592048, 514456, 789801, 520186, 694508, 1065275, 451811, 395515, 441451, 637882, 604791, 716919, 396264, 558976, 592813, 633039, 874499, 696969, 647656, 746280, 474896, 330440, 496625, 448191, 337528, 380016, 620357, 398803, 696299, 328255, 591567, 815976, 347895, 507362, 733402, 578169, 462759, 505786, 298836, 433549, 404879, 410347, 658153, 286253, 507271, 204890, 358816, 691613, 706653, 531503, 430643, 416822, 299918, 637190, 554397, 837602, 521560, 402338, 523834, 906888, 628524, 652368, 29748, 260876, 463584, 140739, 321275, 440296, 511807, 541243, 456877, 515512, 517792, 328517, 431777, 572422, 258952, 625897, 430508]
13695D30508A48924L92754j76754o0541n1308Q9910j2217J51304J55168p2958
13685E64282k25939J32926K1406q1712J0324j05355M65878A26713L67445j21331
13675C72827A75140L71846p3972P9266j2377B42236K4979J12430P5880B09622
13664C78199J96071l6804H6903J80762J63321l2388J05176B24713P7758L76857
13654F79328k71134j70543L9380J06453J9355J54700A56179d958D58037B673O8476
13643G1149J56489p5942J96982n325j00617L0930j23495O0963L54417j74164j7664
13632C73723j06004r9547J77680Q9097A70940J42752J02829A15638P3643K21345
13622D10626H9477C6142K99005R9865j56683p39K58241j17685j63235J58480j49937
$$ y = [430508, 148924, 541678, 364924, 304383, 253075, 342985, 330768, 482072, 637240, 564282, 338343, 471269, 492675, 410963, 421287, 315932, 781810, 126713, 494158, 372827, 175140, 546986, 473014, 552280, 539903, 242236, 267215, 379645, 455525, 209622, 378199, 574270, 537466, 86903, 267665, 430986, 398598, 503774, 224713, 302471, 679328, 408194, 237651, 277031, 383484, 402839, 557539, 156179, -4958, 458037, 2673, 71149, 227638, 151696, 348678, 343353, 242736, 273666, 150171, 211134, 565551, 391387, 373723, 267719, 168172, 345852, 434949, 170940, 313692, 416521, 115638, 189281, 410626, 89477, 36142, 335147, 435012, 278329, 277590, 535831, 418146, 254911, 413391, 263454]
13611B63454L9518M0448O3266j4079o7721R5408L3490I781J59846K09565J5332
13600C94524n9711r2743K40715B11120k1773q1566M14525A33217J27561J53241
13590D14019o042j8192K34150B10616l4544n8178K81843A86942J54527K8232L80239
13579G49940l39540A55334F3175K42215K87220c513C44207E5114M07952B06138
13568C83969A46481K86053B13739I9284L35573j46377J10189A22841N4647J58556
13558C36044A44587g4642A29170K49625r1521n2825a84121B78398K17930D8432
13547B16775A05444N74754A33359a7181B83033L5234p0779J49066l0197A50401
13536D18121n1875A39273D8417L66738D1969J52772M9829K28462B13444J11183
$$ y = [263454, 302972, 343420, 406686, 392607, 324886, 420294, 453784, 9781, 169627, 379192, 394524, 334813, 242070, 482785, 211120, 189347, 107781, 522306, 133217, 260778, 414019, 407977, 389785, 623935, 210616, 176072, 117894, 399737, 186942, 341469, 369701, 749940, 410400, 155334, 63175, 305390, 592610, -3513, 344207, 55114, 463066, 206138, 383969, 146481, 432534, 213739, 99284, 434857, 288480, 398669, 122841, 177488, 336044, 144587, -74642, 129170, 378795, 287274, 234449, -184121, 278398, 496328, 48432, 216775, 105444, 680198, 133359, -17181, 283033, 318267, 247488, 396554, 366357, 150401, 418121, 366246, 139273, 48417, 415155, 41969, 194741, 244570, 473032, 213444, 324627]
13526C24627k1644O1320A70689F7430K37323R8660j23907J4019j1059O9834a80938
13514B4087J53873h9428C67868I9635J3138K2026K8618L19938j49989H6981L55145
13503D42126L505j25697k2154A1763M73820o3156C6323L63820K11524B90298C0069
13491C79148C0921N4363J19738o5368K11110A7853J99271o0619K6252K99593r2185
13480C90165m9991j38801J50995j66682J42957m7031E5864J75708M3610I3258
13469A43592e6881D34817B03480J72032d7365A51920i7248I5117J38204m1876
13459A91445a32880B82340I0834J05316J91487j11920r6o2903m127L04801A50582
13447B35839q1428g3651A09239e4712B31589K0754M9875h2915B92761A39001J06944
$$ y = [324627, 302983, 364303, 170689, 67430, 304753, 403413, 279506, 293525, 282466, 352300, -180938, 24087, 177960, -89428, 367868, 99635, 112773, 134799, 163417, 483355, 333366, 86981, 442126, 445631, 319934, 297780, 11763, 485583, 422427, 36323, 400143, 611667, 290298, 30069, 379148, 30921, 85284, 205022, 139654, 350764, 17853, 217124, 156505, 182757, 482350, 390165, 340174, 201373, 352368, 185686, 328643, 281612, 55864, 231572, 275182, 93258, 143592, -56881, 434817, 203480, 375512, -47365, 151920, -97248, 95117, 233321, 191445, -132880, 282340, 90834, 196150, 387637, 275717, 275621, 212718, 208591, 513392, 150582, 235839, 154411, -73651, 109239, -54712, 231589, 252343, 302218, -82915, 292761, 139001, 245945]
13436B45945N1732N5105A10796K52744j34387d8336A61617J00925A24783K5265
13426A50048B0433J1381Q9594k4805J64639O4939d182B66092K0834j22144J59374
13415C24156A37424h8136E1283b962A50658J07092J26083m7529A30168K32857
13405C63025A0748L63088A04727j9283J42378K1589N3106O5244j30964R6095A54045
13393H1288A8686J36737K3438J10698J26415l0917E2183M2158k3105c6763D01450
13381A18797K12325j13921J22223L2425n717j41643a50238A47281k1773a31909
13370A01046M0397F6620K17336B5221M40353b5530C7340K00478r062j08287K05195
13359C25664H4661a23692A32003b2327A55103J92123j63679D7758J616e1356B01440
$$ y = [245945, 297677, 352782, 110796, 363540, 229153, -48336, 161617, 262542, 124783, 150048, 20433, 31814, 121408, 96603, 261242, 326181, -4182, 266092, 286926, 164782, 324156, 137424, -88136, 51283, -2962, 150658, 257750, 383833, 336304, 130168, 363025, 10748, 373836, 104727, 85444, 227822, 249411, 302517, 367761, 236797, 332892, 154045, 81288, 18686, 155423, 178861, 289559, 415974, 385057, 52183, 94341, 71236, -36763, 401450, 118797, 331122, 217201, 339424, 371849, 366132, 224489, -150238, 147281, 125508, -131909, 101046, 141443, 66620, 283956, 25221, 465574, -25530, 37340, 237818, 228756, 120469, 325664, 84661, -123692, 132003, -22327, 155103, 347226, 183547, 47758, 49374, -51356, 201440]
13347A40806n8422L81729B28172J6846A06712L57718B28747J66053K60323B41769
13336A40423K43787j70464F3277K55189a79960C41216A55810B3403K00746A04939
13325B7662a09528D06697L8664E0624K37826c12401A16912N674H517J39081M8572
13314A96170c2050J4171n1518C87045g9918A94915H6672a48830A97029N7889A26120
13302A77698k3283n6741O6071p2063M07021A47570m4866M53533g4951C91821a25993
13290B49225o3345a01640A32775K95716G9611J58573J92290A6068P7759k4283
13280F9544J13489c24229A57797A1534K24083a67502D03301H6540J20676H782
13269I5431j6796J27757E9850J54349H9970k0173K5370l5745N9539a735E7674
$$ y = [140806, 82384, 464113, 228172, 245018, 106712, 464430, 228747, 394800, 655123, 241769, 140423, 384210, 213746, 63277, 318466, -179960, 341216, 155810, 23403, 224149, 104939, 27662, -109528, 406697, 445361, 50624, 288450, -312401, 116912, 122586, 8517, 147598, 196170, -32050, -17879, -69397, 387045, -79918, 194915, 86672, -148830, 197029, 254918, 126120, 177698, 154415, 97674, 163745, 91682, 498703, 147570, 102704, 556237, -74951, 391821, -125993, 249225, 185880, -101640, 132775, 428491, 79611, 238184, 430474, 16068, 93827, 69544, 183033, -324229, 157797, 11534, 235617, -167502, 403301, 86540, 207216, 8782, 95431, 78635, 206392, 59850, 214199, 89970, 69797, 95167, 59422, 118961, -1735, 57674]
13257A98635b21171J8808B60019q8650J61535D0693J46869g614A01201f4631F4840
13245B88214c2302B12281d7721o1771C92071H0173J58556G7771J22419R3971K7541
13234C21702E6956J37664a8399D3935O5644i8086g824k08647a531A08596N4640
13223A63236D8547Q0617b6796B31567D2230a10671d2427A70244e0916q5188p0831
13212b06935A84200Q4401J26354j58390j14850a25836A35378m1518J13284j2394
13202A94750l7616h6391j10039B11359N9059d4982A64436d7549B82211M3616F2269
13190A58184j0421n4813c8972m1373A28676A0103c4664A61299h5387B1014b4595
13178A54624a37054A6156J32392K13188H5843k49J81382J0239A14272a04336C49908
$$ y = [198635, -221171, -202363, 260019, 171369, 332904, 40693, 187562, -7614, 101201, -64631, 64840, 288214, -32302, 212281, -47721, -109492, 392071, 80173, 238729, 77771, 200190, 294161, 321702, 56956, 194620, -18399, 43935, 109579, -98086, -7824, -216471, -1531, 108596, 163236, 48547, 129164, -26796, 231567, 42230, -110671, -42427, 170244, -50916, -136104, -206935, 184200, 268601, 394955, 236565, 121715, -125836, 135378, 93860, 207144, 194750, 157134, -86391, -196430, 211359, 270418, -44982, 164436, -47549, 282211, 325827, 62269, 158184, 147763, 92950, -38972, -80345, 128676, 10103, -34664, 161299, -85387, 21014, -24595, 154624, -137054, 16156, 148548, 361736, 85843, 85594, 266976, 277215, 114272, -104336, 349908]
13166i4470C67952j75011C3548K03148E6803a05554G7748f0137H1557N6975B0729
13154b57345a04653L9078j78382A39976h0742a6958o8914I6308a98449A21425
13143B36108a08004A79426O6923j13805K22640E3427J22803C8511J50929K0197
13133B09637H7574L73493G4311K66759E7768K05765G255K38578i9238C94233b6873
13121A1760L60143B3527J53314r487D6318i9550D053L2689b10296d6161B0022
13109C61803A41656O5681e5018I941i9778H9740a10033A11269Q4524a66779A32818
13097I0141f7401C2553c23245C2924h0146A61341J20502m2402a72971H7859J20665
13086B08524b1061C13107J0358p6650c46976C1248g587k89693c7990C12953c15096
$$ y = [-94470, 367952, 192941, 33548, 236696, 56803, -105554, 77748, -60137, 81557, 138532, 20729, -257345, -104653, -65575, -243957, 139976, -80742, -16958, -85872, 96308, -198449, 121425, 236108, -108004, 179426, 246349, 132544, 355184, 53427, 176230, 38511, 189440, 209637, 87574, 461067, 74311, 341070, 57768, 263533, 7255, 245833, -99238, 394233, -26873, 11760, 371903, 23527, 176841, 167354, 46318, -99550, 4053, 36742, -210296, -46161, 20022, 361803, 141656, 207337, -55018, 9941, -99778, 89740, -110033, 111269, 195793, -166779, 132818, 90141, -67401, 32553, -323245, 32924, -80146, 161341, 281843, 239441, -172971, 87859, 208524, -21061, 313107, 323465, 246815, -346976, 31248, -7587, -297280, -37990, 312953, -315096]
13074d0712A82687i8834A3958J90739B4993f6489A13013E1628I170P7397a48835
13062D8331b43390C34644b9314p3694A03540a6341j3545A16345a42072A35544
13051A39336J38999b29999i4827q2623B55763a36194b7234B97152j0381A24536
13040A39715K8794a37205A14785P3556J09705q8801M4284H1908L21105A48645
13029a17644B30361M6021j29730k5972A246d2642M223B8357K00799N6794k8410
13018B57540O1212a83703A11867P2772C2548N4893j2904I595K7439R0615d727
13006C97994a45873A2526Q4651c3541A68245K3691i5546k3242B12036a9349I5173
12994B9173M3747K58474j10608b4799D0148J28225a7352B33742D2561J2908N6125
$$ y = [-40712, 182687, -98834, 13958, 204697, 24993, -66489, 113013, 51628, 9170, 86567, -148835, 48331, -243390, 334644, -29314, -103008, 103540, -16341, -29886, 116345, -142072, 135544, 139336, 278335, -229999, -94827, -177450, 255763, -136194, -27234, 297152, 286771, 124536, 139715, 168509, -137205, 114785, 188341, 298046, 209245, 253529, 81908, 403013, 148645, -117644, 230361, 276382, 146652, 120680, 1246, -42642, -38419, 28357, 229156, 285950, 257540, 318752, -183703, 111867, 184639, 32548, 87441, 74537, 9595, 37034, 127649, -4727, 397994, -145873, 12526, 97177, -33541, 168245, 191936, -95546, -118788, 212036, -19349, 95173, 29173, 72920, 331394, 220786, -24799, 40148, 168373, -17352, 233742, 42561, 55469, 111594]
12983A11594D628J90598a04277b4153B08914b0124j70982B37077b8460H4835h5406
12971A51135E3350j6270J01601Q456E742O0651P6471M618e0040q845k2418C74289
12958a65042B03655i8659B27791F7488K14262M1377D3244d2142H6914c9200l18596
12947c57796i3662H4498F867f830n8722B8401g6984H9849c83485a53224D24059
12935A87854C1083c2195j60279q5107I1796J44019J4347a67055F1221a67341B17402
12923a32331F9908k785B2255D827d2624l0482m5098b4122j16157C67013F263a90163
12910A22198a213A32546J5119J13186G7954M626J08564e6226j64359A06833b18600
12898a61530l2954i0340I5431i1304C4536A1424J1983a05249q6419A16880K3839
$$ y = [111594, 4628, 195226, -104277, -24153, 208914, -20124, -191106, 237077, -28460, 84835, -85406, 151135, 53350, 37080, 138681, 147137, 5742, 66393, 142864, 147482, -50040, -58885, -81303, 374289, -165042, 203655, -98659, 227791, 67488, 281750, 323127, 43244, -42142, 86914, -39200, -357796, -93662, 84498, 6867, -6830, -65552, 28401, -76984, 89849, -383485, -153224, 424059, 187854, 31083, -32195, -192474, -277581, 91796, 235815, 250162, -167055, 61221, -167341, 217402, -132331, 69908, 67123, 22255, 4827, -42624, -73106, -118204, -24122, -140279, 367013, 6263, -190163, 122198, -1213, 132546, 147665, 260851, 77954, 82580, 191144, -56226, -220585, 106833, -218600, -161530, -194484, -90340, 95431, -91304, 34536, 11424, 23407, -105249, -191668, 116880, 140719]
12887A40719E2806a53340G611O5050b5698A81852K9519M7760a61974B0415J17547
12876A37962J8035o1755a24059C02992j39107c24685F6633J46981K832M6108e8228
12864B48995g0119B85117A28514d5013m8333B19579a30771A44044K2622p2521
12854I4145a59570B37573b27794G9328c6202r1371j94988J00704Q0314B20786
12843c33451g320G5558g8457A97832A7394a9035F9977J29713a05637d5818j38522
12832a84340A16283b42242a7445C62399A0034P8147d5769l2938k21206I3453J44401
12821B37854a23958D5267b95445Q4383n4989B00695q5041E2924a94972a4472j76515
12810a90987f0617B4719n343J90448a03620k24511A68034c1630j66165D3188J08777
$$ y = [140719, 52806, -153340, 7611, 72661, -25698, 181852, 211371, 259131, -161974, 20415, 137962, 155997, 94242, -124059, 302992, 163885, -324685, 66633, 213614, 216446, 262554, -58228, 248995, -70119, 285117, 128514, -45013, -93346, 219579, -130771, 144044, 166666, 94145, -159570, 237573, -227794, 79328, -36202, -127573, -322561, -221857, -141543, 220786, -333451, -7320, 75558, -78457, 197832, 17394, -19035, 69977, 199690, -105637, -45818, -184340, 116283, -242242, -17445, 362399, 10034, 88181, -45769, -78707, -299913, 93453, 237854, -123958, 45267, -295445, -211062, -266051, 200695, 115654, 52924, -194972, -14472, -190987, -60617, 24719, 19376, 209824, -103620, -328131, 168034, -31630, -197795, 43188, 151965]
12799A51965o0442i530A14134N2831b42654d9298H8111K2717b38559A15881b38108
12787a82220A75812q1801l1019b87346d0047B64058j11155C3183J31793q0764
12777H4212N3841C8868K9746K94470g9781K4333I7289g83m7739j18887B42185
12765c04484a49963p3635R8321p8758B2510K09752K1313D8435a83347c5412A6716
12753A3804J12864a6472j0986M353C16472d94061H4071c10284A94212A5810K09262
12742B25072G5838K00390a75518B92689F7501K03167H822b21473B4080J50729
12732A74809c1042B77871G3049h0795F8277f9550B9808K76530d7519o2386C4156
12720B08350J4496G2097J06953a24146O0270G9739Q8146J84875d7495F2184N2984
$$ y = [151965, 91523, -9530, 114134, 166965, -242654, -49298, 88111, 110828, -238559, 115881, -238108, -182220, 175812, 94011, 62992, -287346, -40047, 264058, 152903, 33183, 164976, 84212, 138053, 38868, 68614, 363084, -79781, -55448, 97289, -783, -48522, -167409, 242185, -304484, -149963, -223598, -125277, -204035, 22510, 232262, 253575, 48435, -183347, -35412, 16716, 13804, 126668, -16472, -27458, -23105, 316472, -494061, 84071, -310284, 194212, 15810, 225072, 75838, 276228, -175518, 292689, 67501, 270668, 8822, -221473, 24080, 174809, -31042, 277871, 73049, -80795, 68277, -69550, 29808, 306338, -47519, -109905, 34156, 208350, 222846, 72097, 179050, -124146, -63876, 79739, 167885, 352760, -47495, 62184, 115168]
12709A15168J49736H0687a8982k20311i6909B71750d0433k03178h0181B15637
12698B11993b1444B49635b94363A03407b32955I157M50155A84013f5204c1843
12687a19079b9462D9645O4986J14353a53148C21667d7266H4467Q7258G7706c4047
12675D6666c4064j29268A24424j4580M3283g3200j41217A2599J85847C3419b42316
12663e1005G5201B585J35411h5456j91044A03840a26725a4921C57395C7154Q7904
12652A25058a32088F2556i7514a0182I6688J80112A4386b15046e1822F8634J2620
12641H1254J04681d6371j25684I8765l5326Q3613b22323C85479a70705B17594
12630C41828j03039l8950B0346N9680h4705B12037F565a58311g0019A08614C761
$$ y = [115168, 264904, 80687, -18982, -239293, -96909, 271750, -40433, -243611, -80181, 215637, 211993, -21444, 249635, -294363, 103407, -232955, 9157, 459312, 184013, -65204, -31843, -119079, -29462, 49645, 114631, 228984, -153148, 321667, -47266, 84467, 171725, 77706, -34047, 46666, -34064, -163332, 124424, 109844, 153127, -73200, -214417, 12599, 198446, 33419, -242316, -51005, 75201, 2585, 137996, -85456, -276500, 103840, -126725, -14921, 357395, 37154, 125058, -132088, 62556, -97514, -10182, 96688, 276800, 14386, -215046, -51822, 68634, 81254, 185935, -46371, -172055, 98765, 63439, 147052, -222323, 385479, -170705, 217594, 341828, 238789, 199839, 20346, 80026, -84705, 212037, 6565, -158311, -70019, 108614, 3761]
12618B28791E3073a35360C7420b6417n6313B54025c3177n199n3177G9350i7739
12606A38871e7479a9292j7443M215A75511k5653L2572a68577I7289K38508a3795
12594B01872E5456J44988K18876A14129J88767A15996d02886B62953B1621c1496
12583B16730b837A75216q294C1931P2316r70J4733B7718b36221K5106d1829l5972
12571g7801j66996I8133d2043H7448a19078M1493A36580K1349A0059e6659j56645
12560b13304B31145a04201G8636b90431J21425k0023e9564A00170i5597l5973
12550a31570O2974A97060a43200F2672b13701j72016f0391k1969b7491B1650R9598
12539A21248k7594K08110E2719I09b12988M9454A14542l3413Q1501f7249C2995
$$ y = [228791, 53073, -135360, 37420, -26417, -82730, 254025, -33177, -38376, -91553, 79350, -97739, 138871, -57479, -19292, -36735, -32520, 175511, 149858, 182430, -168577, 97289, 335797, -13795, 201872, 55456, 200444, 419320, 114129, 302896, 115996, -402886, 262953, 21621, -31496, 216730, -2837, 175216, 166922, 31931, 104247, 103277, 118010, 27718, -236221, -211115, -41829, -77801, -244797, 98133, -42043, 87448, -119078, -77585, 136580, 157929, 10059, -56659, -213304, 231145, -104201, 78636, -290431, -169006, -189029, -59564, 100170, -95597, -131570, -68596, 197060, -143200, 62672, -213701, -385717, -60391, -82360, -27491, 21650, 121248, 93654, 301764, 52719, 909, -212988, -163534, 114542, 81129, 162630, -67249, 32995]
12527a78475E3100g44A97157a39228A12108a237A57513m5795J5330h2066l14785
12516c96851g2333l8120J4032E6457B7845f5882j59316C20674d33611F353J37482
12505A43835C2664C68i0148G2517e54m9925E1511d866r2356B6683b79655B39962
12492B414M7258f7854j65327h4412L4691B7162a03768A24499L9537j5680a16330
12480e9978k8040A79949Q0618b01218j60342H3747b07239D5961R3461n4615a62572
12468E4483b81865a9384k1340n3483c1039c112A5488K2212b59146h7039G0412
12456b3906j50060B2148N703f7959J0449k54067a54125I6106B3007b8372B01044
12444c59015E7971B6279d9257B24710B0241Q6264m0945J6077b5595F0027a65479
$$ y = [-178475, 53100, -744, 197157, -139228, 112108, -1237, 157513, 111718, 127048, -82066, -396851, -72333, -110453, -96421, 56457, 27845, -65882, -225198, 320674, -433611, 6353, 143835, 32664, 368, -90148, 72517, -554, -50479, 51511, -4866, -97222, 26683, -279655, 239962, 2414, 49672, -67854, -233181, -84412, -49721, 27162, -103768, 124499, 164036, 148356, -116330, -59978, -88018, 179949, 260567, -201218, -361560, 83747, -207239, 45961, 139422, 84807, -162572, 54483, -281865, -19384, -40724, -94207, -31039, -3112, 15488, 37700, -259146, -87039, 70412, -23906, -173966, 22148, 27851, -67959, -57510, -311577, -154125, 96106, 23007, -28372, 201044, -359015, 57971, 26279, -49257, 224710, 20241, 106505, 65560, 81637, -25595, 60027, -165479]
12432b7584a2056A13063Q4157b88462n1474A91962B426M1592L3323N5136i7440
12420a4210o5465j48633g750B03453e6964J6851a4234A60906d17971a56018A86740
12408B03511F4393a28847B68250E3846a883j47932j13364H1786M1557N9302b33509
12396A78724b5402A21262L8952F0229C072J04949J3250J92907A05983i7767G3933
12384c9932j70079R5045C64337I4565M1772J18594a64771j5934D28i4854b3767
12372A76031g4561j5465j74845G247c42413E6909c07371A55203l7892P6580b22497
12360b9644J1062D00e3553j09483K7191J5502C5256L66590b63153e0116r1942
12349a42058E1799b02278G2061b9127j23342c8725A02860L2021d1633K368I9381
$$ y = [-27584, -12056, 113063, 197220, -288462, -339936, 191962, 2426, 44018, 77341, 132477, -97440, -14210, -79675, -228308, -7750, 203453, -56964, -40113, -14234, 160906, -417971, -156018, 186740, 203511, 64393, -128847, 268250, 53846, -1883, -149815, -263179, 81786, 123343, 182645, -233509, 178724, -25402, 121262, 160214, 60229, 3072, 108021, 121271, 314178, 105983, -97767, 73933, -39932, -210011, -114966, 364337, 94565, 136337, 254931, -164771, -180705, 428, -94854, -23767, 176031, -74561, -90026, -264871, 7247, -342413, 56909, -307371, 155203, 117311, 193891, -222497, -29644, -18582, 400, -53553, -163036, -135845, -120343, 35256, 401846, -263153, -50116, -142058, 51799, -202278, 72061, -29127, -152469, -38725, 102860, 134881, -41633, -39265, 99381]
12337C7116J50215a94740B82918g596o7644L4048J6450B41129K7515f1184C35837
12325C5310d75357a70235B43732H1343O6571J05794h5145h701C28550j34928J51077
12314C44699A7380K7865d0541I0775f7067H9567Q5020D7758R719Q7573e9972l8126
12302i8098k162n2693j65564b138k4401k90116g6191j02990B43393r4234b95528
12290a25682e0918j32199B38467q9600b24659A9393a50460p3433i4387M6608D10535
12278g8572C69142J24600I2799I889a35600B92738g8962F9859J31875h1458J8945
12267f2513B21980d8838B16940d7787D5781a49905J8613B02019G3656N5212a62873
12255C16787G9832g6302A25319a88222B2367K46755A18905g2675I0026K91933
$$ y = [37116, 187331, -194740, 282918, -7596, -75240, -41192, -24742, 241129, 268644, -61184, 335837, 35310, -475357, -170235, 243732, 81343, 147914, 253708, -85145, -8701, 328550, 193622, 344699, 17380, 45245, -40541, 90775, -67067, 89567, 174587, 47758, 57477, 145050, -59972, -98098, -100260, -152953, -318517, -2138, -26539, -316655, -76191, -179181, 243393, 149159, -295528, -125682, -50918, -183117, 238467, 148867, -224659, 19393, -150460, -223893, -94387, -47779, 410535, -78572, 369142, 493742, 92799, 9889, -135600, 292738, -78962, 69859, 201734, -81458, -62513, 221980, -48838, 216940, -47787, 45781, -149905, -131292, 202019, 73656, 128868, -162873, 316787, 79832, -76302, 125319, -188222, 22367, 269122, 118905, -72675, 90026, 381959]
12245C81959F7472J904g5289L2245k8303C67799B7251R2866a8229m7438G2999
12233B18657a04556L2884j15552K0594B10253j0029d3566B4572J44222n0513J11511
12222B29792m1949K6474l1018C0897J3784J36412j6561a26873B30119B6215N7276
12211H3491P2739a11324G6437K65416A18074C8087L5133L3013a29155m3879C51228
12199A03367O4747m6568L65206D6759J015M7735d5282k22960g187D0049K59927
12188B99976O5087A66912g1778C88459K1882j73707j2014o1232O193E4027J09835
12177A63862m4248J60465b41340D8803a8486j03091H6610B7616J24811J03343
12167B55770m7756a32636A95195a13462d4837A09944J21265C8472a18152B31850
$$ y = [381959, 67472, 69376, -75289, -43044, -71347, 367799, 27251, 120117, -18229, -65667, 72999, 218657, -104556, -71672, -187224, -166630, 210253, 200224, -43566, 24572, 168794, 118281, 229792, 187843, 214317, 183299, 30897, 44681, 181093, 164532, -126873, 230119, 26215, 83491, 156230, -111324, 76437, 341853, 118074, 38087, 73220, 106233, -129155, -173034, 351228, 103367, 168114, 121546, 486752, 46759, 47774, 95509, -45282, -268242, -7187, 40049, 299976, 365063, 166912, -71778, 388459, 410341, 236634, 224620, 163388, 169581, 54027, 163862, 119614, 280079, -241340, 48803, -18486, -121577, 86610, 27616, 152427, 255770, 208014, -132636, 195195, -113462, -44837, 109944, 231209, 38472, -118152, 231850]
12156A02226J61348A09490B5115J98471G7994P8002E9969a51114a3714G1130a13634
12144A31339A8633J59954a79390A0460e960A39150a5995B07641p5835n911j428
12133A24467E2678P3701e2074A75403i820B1375K9630E286a46563B1958a17368
12121e0869B576g1752A07232C5000c9485G78J21258C7743K47110a79418A65148
12109c5910A68357q2652b28126R5896A85576O3966a73121A63600R1983H0026f3639
12097g6429o988A22467M1431b9124n3634r3472A28666J29019f3456D4608a21655
12085I4614o743R486a9698o3367D0766a43437H3491M7687b8533m6335o2840D056
12072c8043H17c0889n8448k4834m1948j1176B84276D7589a91920k4784g1813j35661
$$ y = [102226, 263574, 109490, 25115, 223586, 77994, 155996, 59969, -151114, -13714, 71130, -113634, 131339, 18633, 178587, -179390, 10460, -5960, 139150, -15995, 207641, 131806, 125895, 124467, 52678, 126379, -52074, 175403, -9820, 21375, 51005, 5286, -146563, 21958, -117368, -50869, 2576, -71752, 107232, 35000, -39485, 778, 122036, 37743, 284853, -179418, 165148, -35910, 168357, 85705, -228126, -132230, 185576, 249542, -173121, 163600, 255583, 80026, -63639, -76429, -83417, 122467, 163898, -29124, -82758, -176230, 128666, 257685, -63456, 44608, -121655, 94614, 87871, 97357, -19698, -83065, 40766, -143437, 83491, 131178, -28533, -74868, -137708, 4056, -38043, 817, -30889, -89337, -114171, -156119, -167295, 284276, 47589, -191920, -216704, -71813, -207474]
12060b07474A86332g629e70E66979B61414J96402a51855A09518O1761a7475A13346
12048b90731A14034C3747J35907n8132a4964B57302C0834b86394C1805J95207
12038B27012A5486a71895D6043b41425B60371h1811B38566a23707I0995N5899
12028A46894L7163J18626a30035k73124a50196k5133M8106n1296A49216j3367
12018A35849L2670N8923A0907c14086o7541A39057M937c5747f198p0649j3271
12007i0118a2845F7384H31P541L00750A2317P2821K93247a65554e8129m897A09038
11994B48787C0969b4548M36j13599B74617b39456Q3946L2065k40403J21177a6276
11982a65054g262n3204E2772K89667a59105B01882J2757i0162F304a2548n6441
$$ y = [-207474, 186332, -7629, -570, 566979, 261414, 457816, -151855, 109518, 171279, -17475, 113346, -290731, 114034, 33747, 169654, 111522, -14964, 257302, 30834, -286394, 31805, 227012, 15486, -171895, 46043, -241425, 260371, -81811, 238566, -123707, 90995, 146894, 184057, 302683, -130035, -403159, -150196, -175329, -127223, -178519, 149216, 135849, 168519, 227442, 10907, -314086, -381627, 139057, 143994, -35747, -6198, -76847, -90118, -12845, 67384, 831, 8372, 309122, 12317, 85138, 378385, -165554, -58129, -63026, 109038, 248787, 30969, -24548, -24112, -137711, 274617, -239456, -155510, -123445, -363848, -242671, -16276, -165054, -7262, -60466, 52772, 342439, -159105, 201882, 214639, -90162, 6304, -12548, -68989]
11971f8989k75742J63987g7949L3714B39989b7601d379G9935C9258a53516C33620
11959a93261A99962a7959j23266N1784A06009b43750h7190j6043F7297c8256j16838
11948a55094q9540h318D9650a81277o8075d1499r8018A61091G7518L9101b36653
11936A6941P1816a40100j19954B1484a13513A90197j1941J6703D2960f154k83123
11925b89277J35224F6287d19655I9324L9179c92587I0455a58624A18810a2577
11914a59734k98844I9730a15271n9071A79142K7428I2704d9235A11489g062K635
11903d427l7638B14500a6430j22404B27930c16292b1031E234N0J36703J26293
11892B68280c1362a1427B34989a23256D9300B4323a43257R998E1529b18441J05977
$$ y = [-68989, -344731, -180744, -77949, -44235, 239989, -27601, -4379, 79935, 39258, -153516, 333620, -193261, 199962, -17959, -141225, -89441, 106009, -243750, -87190, -103233, 67297, -38256, -155094, -244634, -8318, 49650, -181277, -249352, -41499, -139517, 161091, 77518, 116619, -236653, 16941, 88757, -140100, -260054, 21484, -113513, 190197, 178256, 194959, 42960, -6154, -289277, -154053, 66287, -419655, 99324, 138503, -392587, 90455, -158624, 118810, -12577, -159734, -458578, 99730, -115271, -174342, 179142, 206570, 92704, -49235, 111489, -7062, -4427, -42065, 214500, -16430, -138834, 227930, -316292, -21031, 5234, 5284, 141987, 268280, -31362, -11427, 234989, -123256, 49300, 24323, -143257, -133259, 51529, -218441, -112464]
11881a12464K5369l30738a40601K9799A70281a62675P8868A18182K0195F65O0133
11870F0798B2468b0055D52642g3687l04691O6034a14207j04795j44883J77124
11860a86761A54384a27185q8727D8589b05151A11561a24306N0574A89034e5008
11849a88604j84816F7072Q8004k0385e7311F1503J42510a61065A45681c20241
11838A14451b26904P5383J8219D0435b25823H0686j6271a39695l61143A27679
11827B74732L986j31294a27130j26116A23760F539a9592j68928a1824m5199B8237
11815b38929e5442o8903H3099B5828b08875H5910c29113J23654k1365A20892f2252
11803e2163C19308H3751h5500B61913a16392B3746J83589b39885I8854g4816H1347
$$ y = [-112464, -87095, -417833, -140601, -110802, 170281, -162675, -83807, 118182, 138377, 665, 60798, 22468, -20055, 452642, -73687, -378378, -312344, -114207, -219002, -363885, -186761, 154384, -127185, -215912, 48589, -205151, 111561, -124306, -73732, 189034, -55008, -188604, -373420, 67072, 155076, 134691, -57311, 61503, 204013, -161065, 145681, -320241, 114451, -226904, -151521, -133302, 40435, -225823, 80686, 64415, -139695, -500838, 127679, 274732, 278718, 147424, -127130, -253246, 123760, 6539, -19592, -188520, -11824, -57023, 28237, -238929, -55442, -124345, 83099, 25828, -208875, 85910, -329113, -205459, -226824, 120892, -62252, -52163, 319308, 83751, -85500, 261913, -116392, 23746, 207335, -239885, 98854, -74816, 81347]
11791F30K68699c03293E1547P638N7330d2791E3735a21350o6111B91418h9730
11779b70041B3005b26515H068K69678F8966a50125I1674l4651h6955j03790O8047
11768a22698B38442h4046J7335C18016B8642h6184E6043R8798O5718G9007e1083
11756a15975b0454k1090o8762M4433A78919e726k80836J12528B56290a18235C04577
11744b69240P8262A86323a41770B69762a35437D9859a24526m8293e4166j29982
11734a84148A29923Q8135a15617L5367A45540i8084B31284c8035A72378a48114
11723H8618O454a85869C11415f681m1964j2193K4223j84926B66083n7232C9608
11711c42479H850I87K69566c13595L0173Q1139A60618p2779R4009J91222d5215
$$ y = [630, 269329, -303293, 51547, 59185, 116515, -42791, 53735, -121350, -187461, 291418, -89730, -270041, 23005, -226515, 8068, 277746, 68966, -150125, 91674, 57023, -86955, -190745, -122698, 238442, -84046, -66711, 318016, 28642, -86184, 56043, 154841, 220559, 79007, -51083, -115975, -20454, -41544, -110306, -65873, 178919, -5726, -286562, -174034, 256290, -118235, 304577, -269240, -190978, 186323, -141770, 269762, -135437, 49859, -124526, -172819, -54166, -184148, 129923, 218058, -115617, -80250, 145540, -98084, 231284, -38035, 172378, -148114, 88618, 95072, -185869, 311415, -6681, -48645, -60838, -36615, -221541, 266083, 208851, 39608, -342479, 8850, 987, 270553, -313595, -283422, -202283, 160618, 87839, 181848, 373070, -45215]
11699a19149C05845l7875A6126a54276A32780m0526I035K78487A03673J87113
11689B90786H6643L59171G1018a56857B9957e6954K3560f96E5767J93026H5044
11677a68002B40679a87601F0239J97209c9517j91367M9884F9506J797c25692a33481
11665a43304B1860g7417I842c50039C4155j3572R4918c14225A56069c6631A93542
11653B82117C1945K75734H8845a04806A36116a4762k04108B73907b01073f1940
11642C83225a2631C0549c2674m2115I4700c02176F1169k578b21664e3771l4459
11631h8230c6910l49618D5744N2383J705a87462B81945a45000G1293H852d2390
11619I866J89843F6221J23877p6085a56684H2000K4433L9871a2351k0407B7297
$$ y = [-119149, 305845, 267970, 16126, -154276, 132780, 92254, 9035, 287522, 103673, 290786, 86643, 445814, 71018, -156857, 29957, -56954, -33394, -696, 55767, 248793, 85044, -168002, 240679, -187601, 60239, 257448, -39517, -230884, -181000, 69506, 71303, -325692, -133481, -143304, 21860, -77417, 9842, -350039, 34155, 20583, 115501, -314225, 156069, -36631, 193542, 282117, 31945, 307679, 88845, -104806, 136116, -14762, -218870, 273907, -201073, -61940, 383225, -12631, 30549, -32674, -74789, 94700, -302176, 61169, 58591, -221664, -53771, -88230, -36910, -386528, 45744, 98127, 99832, -187462, 281945, -145000, 71293, 8852, -42390, 9866, 199709, 66221, 190098, 114013, -156684, 82000, 106433, 146304, -12351, -32758, 27297]
11607H8923g069q6989i26j79479d8949A8575J33973a3244C70468F2324Q0426a09879
11594f5842r594k64797B57404E2861i1962J4524k59592I2465D5230J10405A1749
11582E3771b8108A75049e8795B5431i2264J3039r7696A22467M8437E5811a02328
11570c06026B47700H1033e6633A821i9704B43107h7478l8157K6256b97A41024
11558g3419E9611a3120B30934g0679A40003a44416G717J1136a93958F9498b6848
11546A64410o1995E0746J27846e40144G3088j1977i1749Q348D6059J19794A1858
11534C34329a37717a0268n9201G8695J59782a19034K6456D409i1264D9368J7534
11523F6902L67352a99344O4924j7007G1032a737E2349A5202L1412h9002B46937
$$ y = [88923, -7069, -94058, -926, -180405, -48949, 18575, 152548, -13244, 370468, 62324, 142750, -109879, -65842, -75436, -340233, 257404, 52861, -91962, -77438, -337030, 92465, 45230, 155635, 11749, 53771, -28108, 175049, -58795, 25431, -92264, -79225, -176921, 122467, 170904, 55811, -102328, -306026, 247700, 81033, -56633, 1821, -99704, 243107, -87478, -125635, -99379, -297, 141024, -73419, 59611, -13120, 230934, -70679, 140003, -144416, 7717, 18853, -193958, 69498, -26848, 164410, 102415, 50746, 178592, -540144, 73088, 61111, -91749, -83401, 46059, 165853, 11858, 334329, -137717, -10268, -69469, 78695, 238477, -119034, -92578, 4409, -91264, 49368, 66902, 434254, -199344, -134420, -151427, 71032, -1737, 52349, 15202, 46614, -89002, 246937]
11511a88121m7f8219A56507o5821g1763A40939H20Q1355c96354g8332A18452O6417
11499A84869f6258j7358k1169B20588G9537J79768k6788a41190H9264K25476i4677
11487A39181J26303H6712N7844b20239f4118I8607K62251A17904a10743A58321
11476A54182e0025o1351a6685B08700F6525f8064A61341b7028a1991p5540B47348
11464A28664a72231A97908F4538c7723B46197A9190R5748h8421I3974f0253o0255
11453a20508B03101L6800q4805d2329D5399N0017P0121a78321B40361h0168A18779
11441c253E6685d9155C3759a09572M1583R341A0217K05487a4125B03794A6123
11429f9248j7738l413j01854I0816c34196Q3654A43630i4761A0657N0400B0786
$$ y = [-188121, -188168, -68219, 156507, 90686, -71763, 140939, 820, 82175, -396354, -78332, 118452, 184869, -66258, -83616, -104785, 220588, 79537, 259305, 232517, -141190, 89264, 314740, -94677, 139181, 265484, 86712, 144556, -220239, -64118, 98607, 360858, 117904, -110743, 158321, 154182, -50025, -111376, -16685, 208700, 66525, -68064, 161341, -27028, -11991, -87531, 247348, 128664, -172231, 197908, 64538, -37723, 246197, 19190, 114938, -88421, 93974, -60253, -120508, 203101, 239901, 155096, -42329, 45399, 95416, 165537, -178321, 240361, -80168, 118779, -3253, 56685, -49155, 33759, -109572, -67989, -58648, 10217, 215704, -14125, 203794, 16123, -69248, -86986, -90399, -192253, 90816, -334196, -250542, 143630, -94761, 10657, 61057, 20786]
11417A77449F9853c21866B3577b91080b5601l41784D9623j3477g6604G1344a49191
11405a24480e3900I5474c17846A71305J14765E0663i1300j06282A52654c42646
11394i9121F0429c55994g8136o473F5331h9806B66952a86493A9448a73143o7411
11383b40554f4118B11556p1621g0350L2365A01986N5551c06278F333Q7153a35262
11371A9027a43370A63550b09663a3321A09829D3832b26655o9033R810R2080G2018
11359a5117j63147D0231L8052a56205o3936J9237F8985a85687O6662c3639A03578
11347c80887a61625N0402J1679G0037j1535J06739h0134q8381d0118p2639k64456
11336c77213a05343a6070D6472h2499j02534I0597J60061m3817a54338A39993
$$ y = [177449, 69853, -321866, 23577, -291080, -25601, -367385, 49623, 36146, -76604, 71344, -149191, -124480, -53900, 95474, -317846, 171305, 286070, 50663, -91300, -197582, 152654, -342646, -99121, 60429, -355994, -78136, -84609, 65331, -89806, 266952, -186493, 19448, -173143, -240554, -64118, 211556, 139935, -70350, -37985, 101986, 157537, -306278, 6333, 93486, -135262, 19027, -143370, 163550, -209663, -13321, 109829, 43832, -226655, -295688, -285878, -193798, 72018, -15117, -178264, 40231, 78283, -156205, -220141, -200904, 68985, -185687, -119025, -33639, 103578, -380887, -161625, -111223, -99544, 70037, 58502, 165241, -80134, -168515, -40118, -112757, -377213, -105343, -16070, 46472, -82499, -185033, 90597, 250658, 206841, -154338, 139993]
11325h1900B69802b6377j30801N1848a9738r0946B97066E1690R8028D3089N3226
11314I6315C6200J44243a48913C80407b81133Q7411j07631M7918E2076e16998
11303a43789A17236a1313k41477a3838j8657a5061j77923J5898J3321O7004d8131
11291f6527m61095B04993H0764a9965k69695A2033b19044C737K22507a503A35408
11279A59749a86651h3740J9892E6130a95565D40151A91290G5971e3028A0879J79306
11268A90185l4699b43215e3874H7379k9134d0594B32056H702a05438C8849a55958
11256A89197B4976a00711M1912l0314n7794c9687p3091E8198g7018A7428O8518
11245H5946b46407d1728l71942A90312G2888d6532q620p1220B59538j2076i652
$$ y = [-81900, 269802, -26377, -157178, -105330, -19738, -110684, 297066, 51690, 149718, 43089, 96315, 36200, 180443, -148913, 380407, -281133, -193722, -301353, -253435, 52076, -516998, -143789, 117236, -11313, -252790, -13838, -32495, -15061, -192984, -177086, -163765, -96761, -48131, -66527, -527622, 204993, 80764, -19965, -289660, 12033, -219044, 3737, 226244, -1503, 135408, 159749, -186651, -83740, -63848, 56130, -195565, 440151, 191290, 75971, -53028, 10879, 190185, 155486, -243215, -53874, 87379, 58245, -40594, 232056, 8702, -105438, 38849, -155958, 189197, 24976, -100711, -58799, -89113, -146907, -39687, -112778, 58198, -77018, 17428, 85946, -246407, -41728, -413670, 190312, 72888, -46532, -55152, -126372, 259538, 247462, -9652]
11233E6522E889h3139E6145b10403F5449h1570p4008c4599j25417A38577k6147
11222A12430c25418d0791j14354j559A21607e1712D3503i1789k3157B410a70618
11210B38210Q4647c0553k22870k85773B7605K13041J0848e7223A3236J24946c6941
11198b32701r514a17304A14256d6005I5000N7551a68698r3880A6875b19363n103
11187b24466B0168a44408A01697c8386a476m1094j44421o7424k43414A02769i1115
11175a397m7204E3945I593a922I9889b54885B2033b12651B40993a905p5507B50594
11162a74408j56467i2844J5649o2279j32718P3988R4202M4244H1086K94268C0423
11150B2675J41266b93748i6759B0950b66815A8890c14888j7709B00684n671i9821
$$ y = [56522, 5889, -83139, 56145, -210403, 65449, -81570, -155578, -34599, -160016, 138577, 112430, -325418, -40791, -155145, -156704, 121607, -51712, 43503, -91789, -114946, 2410, -170618, 238210, 322857, -30553, -253423, -539196, 27605, 240646, 251494, -57223, 13236, 138182, -36941, -232701, -242215, -117304, 114256, -46005, 95000, 152551, -168698, -262578, 16875, -219363, -224466, 20168, -144408, 101697, -38386, -1476, -42570, -186991, -254415, -497829, 102769, -91115, -1397, -48601, 53945, 9593, -1922, 99889, -254885, 22033, -212651, 240993, -1905, -77412, 250594, -174408, -330875, -92844, -77195, -139474, -272192, -198204, -104002, -59758, 81086, 375354, 30423, 22675, 163941, -293748, -96759, 20950, -266815, 18890, -314888, -332597, 200684, 195013, -99821]
11138b02138f4270o8774E3150j1813e5928B98178I6482b7527A15313J6755A6919
11126A37826E6099f1059k29458O0089M2387n6024A62875a0512j02188B2435d2674
11114I6975c64346e148o3171j68442A32321j7873D6802c1865j6359C82873a44024
11102A2861J67845D2813c7215C09557A2779J73910H2619P5765L6674i5881A49844
11090a43430F9794I421J5064b0358A44683i0438C01483d856B60199i6703B94040
11078A37790k7010a95935B33425a8546B85708H5274L09660j2805H3484l7219M33562
11067D79827A07216R8772G9591K88014k5407k3784A18748J58850K10524a18918
11056B53047J32175J66413j32739N0623B20903L29552k09412P8247j81716K61291
$$ y = [-202138, -64270, -133044, 53150, 41337, -55928, 298178, 96482, -27527, 115313, 132068, 16919, 137826, 56099, -61059, -290517, -230428, -188041, -244065, 162875, -10512, -112700, 22435, -42674, 96975, -364346, -5148, -68319, -236761, 132321, 114448, 46802, -31865, -48224, 382873, -144024, 12861, 180706, 42813, -37215, 309557, 12779, 186689, 82619, 158384, 195058, -95881, 149844, -143430, 69794, 9421, 24485, -20358, 144683, -90438, 301483, -4856, 260199, -96703, 294040, 137790, 110780, -195935, 233425, -18546, 285708, 85274, 394934, 382129, 83484, 46265, 479827, 107216, 205988, 79591, 367605, 342198, 318414, 118748, 277598, 488122, -118918, 253047, 385222, 551635, 418896, 469519, 220903, 550455, 341043, 419290, 237574, 498865]
11046D98865O8173q3307B13503L12208A90303r961K60322K61040k00195H6350
11035C55879J64062k58712j11677J88794p5012K93094R7056j86562k622k469p0801
11024C91030o2161K08384M7622j8964A72811J26301D0901Q7839P7491M3410H4857
11012A72706Q9352L5047j44439L62239J11655j96083m5114A4856M48834j76346
11002B87344R549j23262K03987m5750J78653o0673J52429B13924J88842k7578
10992C75188J18080A76024K13102r2734K53473J8194k54395K77741o3770K48076
10982G75711j73003J53640k23658l5962P4215j10704M51882K55982r2922p5157
10972A000024O02800l69223K13830L06541j86456k26000k17980L21922m7855n6544
$$ y = [498865, 567038, 483731, 213503, 525711, 190303, 180342, 440664, 701704, 501509, 86350, 355879, 519941, 261229, 149552, 338346, 263334, 556428, 653484, 466922, 464300, 461831, 391030, 328869, 537253, 584875, 565911, 172811, 299112, 40901, 128740, 206231, 249641, 84857, 172706, 262058, 297105, 152666, 514905, 626560, 430477, 385363, 14856, 463690, 287344, 296893, 173631, 377618, 331868, 510521, 449848, 602277, 213924, 402766, 375188, 493268, 176024, 389126, 296392, 549865, 568059, 313664, 591405, 527635, 775711, 602708, 756348, 532690, 496728, 570943, 460239, 912121, 1168103, 1075181, 1000024, 1602824, 1233601, 1447431, 1753972, 1567516, 1341516, 1123536, 1445458, 1397603, 1341059]
10962A341059n46579K41451N1045p281M1274r9727K81231L14487n60926J25662
10952A181696l04025K931j43727Q4417m06190R1079o592k34574k3731H6761K53941
10941C40702J00937j80575j7439j16419p748M6917l2966D8133N9655a04491C2050
10929a36788M540H5953b3906D234K83251n3246d3687e25j06842C779J38901B2551
10916c56692a505H7113d3262B74808a60044A82923N1350c1467A37785a90434h3944
10904b27475N3371A79752k6657c09811Q3315N5600e3808j59990a2487k23406d576
10892F4853a3609q4950H374a50082L7911l15510a99640d2240p6148E933c64535
10880B6576J95002b17955J1895A88546J28412g3489A40654m2572m8658g0357L1588
$$ y = [1341059, 794480, 1035931, 1086976, 1079695, 1120969, 1021242, 1302473, 1616960, 1056034, 1181696, 877671, 880602, 736875, 821292, 415102, 506181, 499589, 265015, 241284, 86761, 340702, 441639, 261064, 243625, 127206, 119458, 166375, 133409, 48133, 107788, -104491, 32050, -136788, -132248, 85953, -23906, 4234, 287485, 234239, -43687, -525, -107367, 3779, 142680, 22551, -356692, -1505, 87113, -43262, 274808, -160044, 182923, 234273, -31467, 137785, -190434, -83944, -227475, -174104, 179752, 153095, -309811, -226496, -170896, -53808, -213798, -12487, -235893, -4576, 64853, -13609, -98559, 8374, -150082, -112171, -427681, -199640, -42240, -118388, 5933, -364535, 26576, 221578, -217955, -206060, 188546, 316958, -73489, 140654, 98082, 49424, -70357, -38769]
10869c8769B4301F093b33888l6961B61360b2039n2764H1849h9590L4174j12519
10858a67935A34395a12522F4791J63510a23952M8858A09869b54486N5083A94698
10847c73129e831j90834D6343a78106A53696p5523M8647d2598M933j53770F489
10835C08686d43594b4222A99323K882J1789i6172g858B74360C6984e0m9746B67447
10822a81790O3310A07377J55771a67613k3237J684C1546b04046A90479K23086
10812D13565A08317c05673A37639b02406j2248c8179k16508R5430G8454k1869
10802E6585J50039a09280H0239b39077j9896L3478B97488a31700a2751m6573i696
10790B0271J41815b87694b1741B12879b70188D4796b53996d4608k32546C3250
$$ y = [-38769, 24301, 6093, -233888, -270849, 261360, -22039, -74803, 81849, -89590, -55416, -167935, 134395, -112522, 64791, 228301, -123952, -75094, 109869, -254486, -199403, 194698, -373129, -5831, -196665, 46343, -178106, 153696, 78173, 126820, -42598, -37665, -191435, 6489, 308686, -443594, -24222, 199323, 202205, 213994, -96172, -7858, 274360, 36984, -50, -49796, 267447, -181790, -118480, 107377, 263148, -167613, -190850, -189166, 31546, -204046, 190479, 413565, 108317, -305673, 137639, -202406, -214654, -38179, -254687, -159257, 78454, 56585, 206624, -109280, 80239, -239077, -258973, -225495, 297488, -131700, -12751, -59324, -9696, 20271, 162086, -287694, -21741, 212879, -270188, 44796, -253996, -44608, -277154, 33250]
10779b3345m5896C2945J3012L3740f8523A37159n4699g4655j16608D6858a09507
10767c45940J35713m6576Q5016A79664p2622M245E850K42562b07236C80746c2963
10755b11900q4491G3572J09278d2711E3745c06733B82020M6308c34297g3204E1989
10743A39004b61198G8003a79654Q7096j19918f4832B24329b52740a23831A90699
10732C89555A00759b19174a00038B9193J97298c51577A16316a3376n6660J6061
10722e3975n0985J0772j6998A07915a51807I8858c93400h7499A7738b66865g7096
10710a68424D14290A2074J25106h6755j4922B46881c90318O3002J26973I0403
10699B77427b8870j48379E4128b21159N9864J8803e9952q9551A2006a77385D9308
$$ y = [-23345, -69241, 32945, 45957, 79697, -68523, 137159, 82460, -74655, -191263, 46858, -109507, -345940, -210227, -256803, -171787, 179664, 107042, 111287, 5850, 248412, -207236, 380746, -32963, -211900, -296391, 73572, 182850, -42711, 53745, -306733, 282020, 328328, -334297, -73204, 51989, 139004, -261198, 78003, -179654, -92558, -212476, -64832, 224329, -252740, -123831, 190699, 389555, 100759, -219174, -100038, 29193, 226491, -351577, 116316, -13376, -70036, -53975, -104960, -94188, -111186, 107915, -151807, 98858, -393400, -87499, 17738, -266865, -77096, -168424, 414290, 12074, 137180, -86755, -101677, 246881, -390318, -327316, -200343, 90403, 277427, -28870, -177249, 54128, -221159, -161295, -142492, -59952, -149503, 12006, -177385, 49308]
10687H9187M5183b13249g0523k95381B0336J36785A0755K07301g3375j40479A35947
10675h0010B65133a7693j44415b2847F6847a39957B33132g4207l78780c9112a4417
10663b21923f7816k6352l9228j46937D1123O0569M3667b19961O1849F0946b02839
10651a17270C0703K8021J77914I4136J9790a00273B3059R5572A5023c2265j8260
10640e0525n8184B29228m7000a96378L7820f225j07863a704k5416j54881b8013
10628a56672b6546j59999D6987b17492a00021q2432Q2613r7488G9270g4635A15497
10616E9510B1636c38230A17689c87266e4633D8655J28149c20721A33121J21477
10606B54598b31812l6865O6205k1648l4213B61094d8326D9658c5796A7323L9529
$$ y = [89187, 134370, -213249, -70523, -365904, 20336, 157121, 10755, 218056, -73375, -213854, 135947, -80010, 265133, -17693, -162108, -22847, 66847, -139957, 233132, -74207, -452987, -39112, -14417, -221923, -67816, -94168, -133396, -280333, 41123, 101692, 145359, -219961, -158112, 60946, -202839, -117270, 30703, 58724, 236638, 94136, 113926, -100273, 23059, 118631, 15023, -32265, -50525, -108709, 229228, 182228, -196378, -158558, -6225, -114088, -1704, -27120, -182001, -28013, -156672, -26546, -186545, 46987, -217492, -100021, -182453, -99840, -197328, 79270, -74635, 115497, 59510, 21636, -338230, 117689, -387266, -54633, 48655, 176804, -320721, 133121, 254598, -231812, -268677, -202472, -224120, -258333, 261094, -48326, 49658, -35796, 17323, 56852]
10595E6852A5775i8396k39514g8222G4935A3772J0715a73167B85993d675A9394
10583d6488l509k28703b493j93843O3238A41380J47640h1981A23797a83155h8299
10571D5549b40621A52148M1657a84953D7897c30089A29606g5568k38201E951a04279
10559H996c26973A53762b66050J23496I8281a63582A453e9512E0476b98299a20720
10547A39575C2518k448M7556J36568j6067b6842B07079f4273j47152B8696R037
10536C7733K25588b41551e2399k3633B1100d6717k03597C95576a15171m7519A23593
10524a04070C3606c5415C3272Q9443h1928H3432g115j342j04225D8977K9578b92352
10511a42285j52916B0768h0875A84562p0164h3103j96745A44574E6613A2589J39958
$$ y = [56852, 15775, -98396, -337910, -78222, 74935, 13772, 24487, -173167, 285993, -4675, 19394, -46488, -49997, -278700, -2493, -196336, -133098, 141380, 289020, -81981, 123797, -183155, -88299, 45549, -240621, 152148, 193805, -184953, 47897, -330089, 129606, -75568, -313769, 5951, -104279, 8996, -326973, 153762, -266050, -142554, 98281, -163582, 1453, -59512, 50476, -298299, -120720, 139575, 32518, 30070, 77626, 214194, 198127, -26842, 207079, -64273, -211425, 28696, 37733, 263321, -241551, -52399, -76032, 21100, -46717, -250314, 395576, -115171, -162690, 123593, -104070, 33606, -35415, 33272, 122715, -81928, 83432, -7115, -8457, -112682, 48977, 78555, -292352, -142285, -295201, 20768, -80875, 184562, 114398, -83103, -279848, 144574, 56613, 12589, 152547]
10500A52547G5862J10770a12099P953A33721a37613D8517b128j31843A30774a43481
10488e6509l37536J35893i9633A23742O8169J79216a03577A45063R9087J06101
10478C50251A34063F5703K01352c0905C6076a67242B30845b25925A26531f5216
10467A26488a2779B35575a03460a7273m93925c7471k4708H3646b21220J10029
10457a11191J4857H2705J35571b05803g9628A53007g4834A45579f4990k6986k6999
10446a18975K3549L7121l07929M8065J58424g8839L2781G9273J64737F828J2756
10435A9584b17598a08189A00441e8746q9131B70681h8746m2158j50126b9828j94184
10424b24012c3403A77257G8947J92140b8528q7174k47223a34492M2567B23391
$$ y = [152547, 75862, 186632, -112099, -104146, 133721, -137613, 48517, -2128, -133971, 130774, -143481, -56509, -394045, -258152, -99633, 123742, 191911, 371127, -103577, 145063, 244150, 350251, 134063, 65703, 267055, -30905, 36076, -167242, 230845, -225925, 126531, -65216, 126488, -12779, 235575, -103460, -17273, -511198, -37471, -62179, 83646, -221220, -111191, -96334, 82705, 218276, -205803, -79628, 153007, -74834, 145579, -64990, -91976, -118975, -95426, -58305, -366234, -318169, -159745, -78839, -46058, 79273, 244010, 6828, 19584, -217598, -108189, 100441, -58746, -147877, 270681, -88746, -130904, -281030, -29828, -224012, -33403, 177257, 78947, 271087, -28528, -115702, -362925, -134492, -91925, 223391]
10413F3051g7304k15434I6777a50576A2920J5524L13755a94346A04945A0598J30206
10402A40804P5888d6902G3177J05822a29582b1727k3633o0063r314M9673n2136
10391a17200j99647c3561C6987a90551f3582A64101K5172J83659c41175A81854
10380G7862O6557i4224H1222J74541j05494F9228a12215D45273A94822E0003Q0894
10369A30897b6720B29960M8217A12044M35952A86268l5920P5779J21650F7989
10358D39138j75785p5036p5569c1559B84239m7540A3606J39887J46877j45663
10348A54707O3830K878K76454G8057K04039b7999A61261b25676E222J26469Q276
10337A39967M631e3317k9863B0709h1538K5300D1894b46592A88065a84105H3130
$$ y = [63051, -77304, -292738, 96777, -150576, 12920, 28444, 342199, -194346, 104945, 10598, 140804, 216692, -46902, 73177, 178999, -129582, -21727, -45360, -105423, -114737, -65064, -117200, -316847, -33561, 36987, -190551, -63582, 164101, 189273, 372932, -341175, 181854, 77862, 144419, -94224, 81222, 255763, 150269, 69228, -112215, 445273, 194822, 50003, 130897, -26720, 229960, 278177, 112044, 547996, 186268, 150348, 226127, 347777, 67989, 439138, 263353, 188317, 112748, -31559, 284239, 236699, 13606, 153493, 300370, 154707, 218537, 221415, 497869, 78057, 282096, -27999, 161261, -225676, 5222, 131691, 139967, 144598, -53317, -83180, 20709, -81538, -56238, 41894, -246592, 188065, -184105, 83130]
10325E319Q4299M1829h8627A65657B6009J77037B6158L93966A87273K91734b71348
10313g0121p2158B76603j34853a85291d4315J183m4286B20449A01113e2023E6385
10301b34886I3033C1523c73517e6709A31678n0502N8890J37080a6245B25264c9967
10289b627j6934A9506b71291L6800g6455j12880N0592F2749J2135O5519J6407
10278A56810e1294o7782q1944C3153J35477C0702a93700k8369A00975k3524a74769
10266c58766H4697a96388F6337N0885a3213C40153k9447j38872G2345L00245m314
10255C68276H8077J81232o5518C9768b30057B13644F2355P3338b27172E9132e8295
10243b47164a1686B824g4731j11130h6282A84352b5473j2455a2145m5850k90728
$$ y = [5319, 89618, 131447, -88627, 165657, 26009, 203046, 26158, 420124, 187273, 479007, -271348, -70121, -142279, 276603, 141750, -185291, -44315, -43132, -87418, 220449, 101113, -52023, 56385, -234886, 93033, 31523, -373517, -56709, 131678, 81176, 140066, 277146, -16245, 225264, -39967, -2627, -19561, 19506, -271291, -234491, -76455, -189335, -138743, 62749, 74884, 140403, 156810, -51294, -119076, -201020, 33153, 168630, 30702, -193700, -222069, 100975, 77451, -174769, -358766, 84697, -196388, 66337, 117222, -13213, 340153, 310706, 171834, 72345, 372590, 368276, 88077, 269309, 203791, 39768, -230057, 213644, 62355, 135693, -227172, 59132, -58295, -247164, -11686, 2824, -74731, -185861, -86282, 184352, -25473, -37928, -12145, -57995, -348723]
10232c48723K8596a25774M15p2409b2533B482J11957l9115a71223n5272N058B54261
10219A17302M5111a90509C4436a36347L5726J4577B8192a60541d3442D706J57810
10208A62516d56684C409b48438b1012r6881H5948C7026K63661b13500I3103c10250
10196A59915c51865b8022m9187A96847o0756C0924d30056h5492D3640i7500D7946
10184c13566d583l3429m0092C8715K07044j14760a8491j26560A38843d0336E7440
10172a35803G1031a66026l2078d153j66740G434J55802b21417B7092J96792b18896
10160F6059h8787j26103b5415j00300K8854j2377B9785b28377A03773a78962b138
10148e5515B70805A8505a52794N8613j37160B6888b93571M9619A42772D9308j5907
$$ y = [-348723, -320127, -125774, -125359, -197768, -22533, 2482, 114439, 75324, -171223, -226495, -221437, 254261, 117302, 162413, -190509, 34436, -136347, -100621, -86044, 28192, -160541, -43442, 4706, 162516, -456684, 3409, -248438, -21012, -117893, 85948, 37026, 300687, -213500, 93103, -310250, 159915, -351865, -28022, -77209, 196847, 136091, 30924, -430056, -85492, 43640, -97500, 47946, -313566, -4583, -38012, -78104, 38715, 245759, 130999, -18491, -145051, 138843, -40336, 57440, -135803, 71031, -166026, -198104, -4153, -170893, 7434, 163236, -221417, 27092, 223884, -218896, 66059, -88787, -214890, -25415, -125715, -96861, -109238, 29785, -228377, 103773, -178962, -2138, -55515, 270805, 18505, -152794, -94181, -231341, 26888, -293571, -243952, 142772, 49308, 33401]
10137C3401J02169R4419b89022h6833b3456m2517j6970a3786q341k55751C0251
10125a37035d8391b0092O626e218k02086N5115j33713A51007i4188A17688e027
10113E3989J31080a80413A49576i5165j38931l8232h7713A83204c62161A54316
10102B178d4489b411j46616H3430b22928a04506c1019k52243e1449A53013J75218
10091C28231a19730B12980g6512A22051f6453a1115c134B32444a47772d6936l0295
10080g7231E0719c5613m4515A5722a69476A51949a69932m4085F5586B781a80761
10068b9734n6827G0747a20n4219a6441k08163E4753a81535I4371a19224G243a94146
10055a67561B01678f6716j2922O956H2240b21953k5147a03634n8627q449B01467
$$ y = [33401, 135570, 229989, -289022, -86833, -23456, -65973, -82943, -13786, -22127, -277878, 30251, -137035, -48391, -20092, -13466, -5218, -207304, -152189, -285902, 151007, -94188, 117688, -5027, 53989, 185069, -180413, 149576, -95165, -234096, -272328, -87713, 183204, -362161, 154316, 2178, -44489, -2411, -149027, 83430, -222928, -104506, -31019, -283262, -51449, 153013, 328231, -119730, 212980, -76512, 122051, -66453, -11115, -3134, 232444, -147772, -46936, -77231, 50719, -35613, -80128, 15722, -169476, 151949, -169932, -214017, 65586, 2781, -180761, -29734, -86561, 70747, -120, -54339, -16441, -224604, 54753, -181535, 94371, -119224, 7243, -194146, -167561, 201678, -66716, -79638, -72682, 82240, -221953, -247100, -103634, -162261, -170710, 201467]
10043a27162B59339c13890f2492F7516a08169A77008G2462b70744A96537b16093
10032b28337o1153b3706m2364D2242h7452G1231j1137f8030b2560j50227A93375
10020A04664a57956l04649K21547H2751J9389K9327J53389e4994E0629a23182
10009b29354E2931J17048F6397b16136J06614D5149b61465I9173a48592F0226
9998a8223f679c132l81302a2591k38078A28032h9884b1123A45346m8592b68609
9986i0747F3064h3795n5228A62826b49387B65513C7223K875g5902E7717c64560
9974D2758f6691p148A12793k7724h0672E17064a40452o8286A3100c26243J47466
9963a78777j74150a31410A30311d1758B0000b38578b2590j98760j58532J33775
$$ y = [-127162, 259339, -313890, -62492, 67516, -108169, 177008, 72462, -270744, 196537, -216093, -228337, -289490, -23706, -66070, 42242, -87452, 71231, 60094, -68030, -22560, -172787, 193375, 104664, -157956, -462605, -241058, 82751, 102140, 131467, 284856, -54994, 50629, -123182, -229354, 52931, 169979, 66397, -216136, -109522, 45149, -261465, 99173, -148592, 60226, -18223, -6679, -3132, -384434, -12591, -250669, 128032, -89884, -21123, 145346, 96754, -268609, -90747, 63064, -83795, -139023, 162826, -249387, 265513, 37223, 40098, -75902, 57717, -364560, 42758, -66691, -73839, 112793, 85069, -80672, 517064, -140452, -208738, 13100, -326243, -178777, -352927, -131410, 130311, -41758, 20000, -238578, -22590, -221350, -379882, -246107]
9953b46107a1426B2930a04770k30701g7285j08678A87438a38252C15944d3589
9942b66777g4691j41265O8787A16763A5126b75060J03169o5981N332P0604B64731
9930a60361d0908k1460A54721b8196n8410O852a6661c514E0319j3177d62082a39146
9917a65675n3386A01963c00779a0982a111j67462G7967g7173k26863B3149a97526
9905b44033N9732g4019l4545n2359G5766b15636J1231A17013d5639C52690C9578
9893h4891a9672o9437B79513a10988k5426A4648M4377Q4602a1019j93343e0841
9881a48370A94326D6536J73648a49414O2567n4525j44297B77551c7449I746J80862
9870A90608h1778K2972j98718h1A35830a45969F5345a23082r0005A07059a86995
$$ y = [-246107, -11426, 22930, -104770, -335471, -77285, -185963, 187438, -138252, 315944, -43589, -266777, -74691, -215956, -147169, 116763, 15126, -275060, -171891, -237872, -232540, -161936, 264731, -160361, -40908, -62368, 154721, -28196, -86606, -79754, -16661, -3514, 50319, 37142, -462082, -139146, -165675, -219061, 101963, -300779, -10982, -1111, -168573, 77967, -77173, -304036, 23149, -197526, -244033, -184301, -74019, -108564, -160923, 75766, -215636, -204405, 117013, -45639, 352690, 39578, -84891, -19672, -89109, 279513, -110988, -136414, 14648, 59025, 143627, -11019, -204362, -50841, -148370, 194326, 46536, 220184, -149414, -86847, -141372, -285669, 277551, -37449, 9746, 190608, -81778, -58806, -257524, -81, 135830, -145969, 65345, -123082, -213087, 107059, -186995]
9858a91771A67129Q1545b55514J21976B43538i1573L775l23869R3600A03105a26087
9846B43315a24764k08622J01338B66097h6821A64025J08256i4674I7263D4433
9835c62913H5502B8430c01936C7439a57405M9370E2692a40509F4462b21734L691
9824b18043A53301b85435A32223a4416k37450G8119a66301b8661j85650B6337
9813A59941n3548b78007A22282b04226A17918A2992J34289a64920M0748M5318
9803g8854j60286J943e7627j3480b7934A37001d23967a58871K7021n4581P8862
9792a07569B96009C0472J74785a58114A19312n353d19198a29891A27533D8066
9781B33266J67050j48089a04277j45234a03365E4467a35115q876A64743K9933
$$ y = [-191771, 167129, 248674, -255514, -133538, 243538, -91573, -87798, -411667, -318067, 103105, -126087, 243315, -124764, -333386, -232048, 266097, -86821, 164025, 272281, -94674, 97263, 44433, -362913, 85502, 28430, -301936, 37439, -157405, -108035, 52692, -140509, 64462, -221734, -218043, 153301, -285435, 132223, -14416, -251866, 78119, -166301, -28661, -214311, 26337, 159941, 106393, -278007, 122282, -204226, 117918, 12992, 147281, -164920, -124172, -78854, -239140, -237197, -57627, -71107, -27934, 137001, -423967, -158871, -131850, -186431, -107569, 296009, 30472, 205257, -158114, 119312, 113959, -419198, -129891, 127533, 48066, 233266, 400316, 252227, -104277, -249511, -103365, 54467, -135115, -143991, 164743, 194676]
9771A94676n4679K09322a68641l4155Q7422B25312a08331r4312A07580a29915
9760c71242A57417n1592M1214N6937C826a77397A25437i6610j512A40028A5068
9748b56377q7858a32082B37333h5735j07464F4284J486b00267a7691j79287d6736
9736b35507a14178c5754G0094J57423d31985i433j18483B21910a23877j7111P301
9725a33687L6552A06574c54470a4897M993B30645F785J03413i4346C7783O044
9714D3827a3168k02162O1189k44456J47154k0152a32131F7076a39261D5393a61228
9702A15695f8494B54749f0692B75899e9170j78517L4005e2154E1035K60751a6322
9690b13722G9269g7870a9825l1278O848G0591a89048j61614A18532B3482M3360
$$ y = [194676, 139997, 349319, -168641, -202796, -115374, 225312, -108331, -202643, 107580, -129915, -371242, 157417, 105825, 147039, 203976, 3826, -177397, 125437, -96610, -98122, 140028, 15068, -256377, -344235, -132082, 237333, -85735, -193199, 64284, 65770, -200267, -17691, -196978, -46736, -235507, -114178, -35754, 70094, 227517, -431985, -9433, -127916, 221910, -123877, -140988, -133687, -97135, 106574, -354470, -14897, -9904, 230645, 6785, 110198, -94346, 37783, 43827, -13168, -215330, -154141, -398597, -251443, -271595, -132131, 67076, -139261, 45393, -161228, 115695, -68494, 254749, -60692, 275899, -59170, -237687, -203682, -52154, 51035, 311786, -16322, -213722, 79269, -77870, -19825, -51103, -44255, 70591, -189048, -350662, 118532, 23482, 66842]
9679F6842J20386a07512r192j04459a3436q0878F5464h1961j48850N3035Q2711
9668i5065G1348a46741j51033B7698c29740K0852a19570A40810J03313O9922a1721
9656H5007A6871b21733d17A51916J65589a61543e7298C18712a25236a3718m17713
9645d31431a57883I1503a60467A02364a73968B0015a64008H2239b56310D831O9966
9634G4797a59205c9426o0635a1949k61208D1997K17091a5946j86713h1846J5651
9623f6195I5876c60203k7657J4816J09272J10483D010J75111m2484b40906A37940
9611h1546j47457A03732a52016c441I8456a2974o1005b2614m47247a07575B43600
9599i2454A34937h9711j6638j98012g1318H2040Q7104b24152d8209j03229m5025
$$ y = [66842, 187228, -107512, -116704, -221163, -13436, -94314, 65464, -81961, -230811, -177776, -95065, 71348, -146741, -297774, 27698, -329740, -308888, -119570, 140810, 244123, 314045, -11721, 85007, 16871, -221733, -417, 151916, 317505, -161543, -57298, 318712, -125236, -13718, -431431, -157883, 91503, -160467, 102364, -173968, 20015, -164008, 82239, -256310, 4831, 74797, -159205, -39426, -100061, -11949, -273157, 41997, 259088, -15946, -202659, -81846, -66195, 95876, -360203, -387860, -373044, -263772, -153289, 4010, 179121, 136637, -240906, 137940, -81546, -229003, 103732, -152016, -3441, 98456, -12974, -73979, -22614, -469861, -107575, 243600, -92454, 134937, -89711, -106349, -304361, -71318, 82040, 169144, -224152, -48209, -151438, -196463]
9588a96463g6720A19641D8900k2789M8541j923d1596J8733C54819B9669L7679
9577F7348h1181A55876E544c40415a23489I1145b81370d4926D0642K88227a42215
9565d8115A16106b12800f9245H8926a13496J3120p8258G4700g781j21618j60078
9554b89477m6807B74173a61335A76963a72431J5572D8808a84327O2166B2954b0247
9542D0731a52034M4533A94883M2447c36542g9084a5168j9048j71929A41374a18215
9530d5130j8992a2141j15275B0810f6376k7708l4453O0032l10670a26096A40030
9518A68820i1604k31150A7284a62667O0098d6276j97690f3149A41928a43042A61173
9506A37488o660b77567A46745a939B59979j12641j6091a23380o8808C6560h6382
$$ y = [-196463, -76720, 119641, 48900, 26111, 74652, 72729, -41596, -22863, 354819, 29669, 67348, -81181, 155876, 5544, -340415, -123489, 91145, -281370, -44926, 40642, 328869, -142215, -48115, 116106, -212800, -69245, 88926, -113496, -100376, -178634, 74700, -7781, -129399, -289477, -336284, 274173, -161335, 176963, -172431, -156859, 48808, -184327, -122161, 22954, -20247, 40731, -152034, -107501, 194883, 237330, -336542, -79084, -15168, -34216, -206145, 141374, -118215, -45130, -64122, -12141, -127416, 20810, -66376, -94084, -128537, -68505, -379175, -126096, 140030, 168820, -91604, -322754, 17284, -162667, -102569, -46276, -243966, -63149, 141928, -143042, 161173, 137488, 130828, -277567, 146745, -1939, 259979, 147338, 131247, -123380, -192188, 36560, -86382]
9494G2934c61329B27561a3823m9479o9477r5069r6520A6066d8530n0800o6197
9483a65527D4497K87745G3960d1615I6996b43336q2615J41563m6406C77463a38075
9471c2341B43046J95536B09975i6650D3115j3053b89361A98732a19824c1869k03834
9460b35703a06611L3511j21422A60479a91573d6725A641J77281a86536C6028P8240
9449A14268a56514A19671a86399A65664d22713a11977p7144c1700I2474b59431
9438f3350F3049a79616F5752b59549g9389p5051j47496J45175A64783J5788J26821
9427C07392c26867e5560I5263a14879n3619k2619n2176g2264E9882J42935a09717
9415H5374d2870j83918B6999Q2497K4825L2112b46526H4615J67389a50249B52049
$$ y = [72934, -361329, 227561, -13823, -63302, -132779, -227848, -324368, 16066, -48530, -99330, -165527, 44497, 332242, 73960, -41615, 96996, -243336, -325951, -184388, -230794, 377463, -138075, -32341, 243046, 438582, 209975, -96650, 43115, 30062, -289361, 198732, -119824, -31869, -235703, -106611, -73100, -194522, 160479, -191573, -46725, 1641, 178922, -186536, 36028, 114268, -156514, 119671, -186399, 165664, -422713, -111977, -189121, -31700, 92474, -259431, -63350, 63049, -179616, 65752, -259549, -79389, -154440, -301936, -156761, 164783, 180571, 307392, -326867, -55560, 95263, -114879, -168498, -191117, -243293, -72264, 59882, 202817, -109717, 85374, -42870, -226788, 26999, 109496, 134321, 166433, -246526, 84615, 252004, -150249, 252049]
9403a28195F4033f7989C6890a42486o7211A3504J65704F3467J36647c02180a08593
9391E6174b75927a7157j68889c0798B46155b69750A1420b4554l30304g3054j64957
9380b38011C669e9113A19925e6023j98937A91904J851k0200B6164a30767B8358
9368e4964l7472B42492b15859K1386A96847l9717a68280d7222m1409j44625B05707
9356G7142k0181L838k6690a8342j84803O2594c4654B19263k0961c24028C2233
9344A69969c8985H4533a27919F5405b34144A94050E5624K8519J0771l5305R1070
9333A50679g5749j07382F9397a44586k47884b2262n0018C5699e0423j02780q7195
9322b40398C596K22135A02966B8185b43130Q2691N7199B0793c36841A8809b31961
$$ y = [-128195, 64033, -67989, 36890, -142486, -209697, 13504, 179208, 63467, 200114, -302180, -108593, 56174, -275927, -17157, -186046, -30798, 246155, -269750, 11420, -24554, -354858, -73054, -238011, 3669, -59113, 119925, -56023, -254960, 191904, 193755, 173555, 26164, -130767, 28358, -54964, -92436, 242492, -215859, -194473, 196847, 157130, -168280, -47222, -88631, -233256, 205707, 77142, 56961, 60799, 34109, -18342, -203145, -140551, -34654, 219263, 198302, -324028, 32233, 169969, -38985, 84533, -127919, 65405, -234144, 194050, 55624, 84143, 94914, 59609, 150679, -75749, -183131, 69397, -144586, -392470, -22262, -72280, 35699, -50423, -153203, -240398, 3596, 225731, 102966, 28185, -243130, -160439, -103240, 20793, -336841, 18809, -231961]
9310B17607a12594m7699C03065a24734C25047a18813B34195r0181b20283H3594
9299b17513Q3652j0574K7384A00891a72015H0452J64020f2197o392L3423A8915
9287b65023E3224J28525E2294K45036A4528b15008A09173Q2217a7325m03288G7145
9275e4003a0247B3777a14203B1017J34604j9728a05671B52460a46486A1216b42395
9263f6108C6688P7982a1698B07276f5450C10785a95682O2938B06203E2647M0991
9252I3638J21769g4579r6806Q0247A93566b51968H737a53200J0908B2554g7635
9240A26226O9256a23131K4651m439j4866l14827b6229j61863a8412j50879j29740
9229b99031i2240d4354r9246b8448B4304J36429h238E2702a69815j6080a4352
$$ y = [217607, -112594, -160293, 303065, -124734, 325047, -118813, 234195, 144014, -220283, 83594, -217513, -133861, -144435, -117051, 100891, -172015, 80452, 244472, -62197, -68589, -35166, 18915, -265023, 53224, 181749, 52294, 297330, 14528, -215008, 109173, 191390, -17325, -420613, 77145, -54003, -10247, 23777, -114203, 21017, 155621, 135893, -105671, 252460, -146486, 11216, -242395, -66108, 36688, 114670, -11698, 207276, -65450, 310785, -195682, -132744, 206203, 52647, 93638, 215407, -74579, -171385, -91138, 193566, -251968, 8737, -153200, -142292, 22554, -77635, 126226, 195482, -123131, -98480, -102919, -117785, -432612, -26229, -188092, -18412, -169291, -299031, -92240, -44354, -143600, -28448, 24304, 160733, -8238, 52702, -169815, -185895, -14352]
9217a61952c9586J2444o6452k2873j75078L253F4776e5578j12246j0207k54130
9206d32161D3954a42666A04800m4957b84222B1019J07016b41351g3977L54j05652
9195a79275A88193N227a10392A03126a17856B09179G3088a18639A0720L7814c32501
9183a182k6127j83961E3924b98752F5624b08879K9035e058j3891j25771J8801
9172a25919j08623h3533b6060k5000j72956M0367b9693j26667A16170N2138b11128
9160a70884D3095b86699a04799k6051j80098C6071a29012F1981B9970a75159A2814
9148F8079i935j37964K0666C2744c10293J25922C15432c0188k28614e1948j41321
9137a93269M3377J7846B5567b25158J3050F5969j7460a20145e9292j83475e8049
$$ y = [-161952, -39586, -27142, -93594, -116467, -291545, -288292, 64776, -55578, -167824, -178031, -432161, 43954, -142666, 104800, 59843, -284222, 21019, 128035, -241351, -73977, -73623, -179275, 188193, 193420, -110392, 103126, -117856, 209179, 73088, -118639, 10720, 48534, -332501, -1182, -27309, -211270, 53924, -298752, 65624, -208879, -179844, -5058, -18949, -144720, -125919, -234542, -83533, -26060, -51060, -224016, -183649, -29693, -156360, 116170, 168308, -211128, -170884, 43095, -286699, -104799, -130850, -310948, 36071, -129012, 61981, 29970, -175159, 12814, 68079, -9935, -147899, -127233, 32744, -310293, -184371, 315432, -30188, -258802, -51948, -193269, -149892, -132046, 25567, -225158, -212108, 65969, 48509, -120145, -59292, -242767, -58049]
9125B9732a41623d9060C7846c01581a6804C99820b59098h5167e746o2358c0522
9113B23388H3713b06356c8597j37270B04507b58369l0805B62237a89685P2032
9103a17653j03844a4189m7958j50082n4560e4743k52735h5431A58107g2736a673
9091i9767o8600B7554c1439j05313n7557g3797B434b68244B8189c31034A12072
9079c26728g2714k7888A81030g5104j7704k32672C27706A08672P636C0732a02004
9067B746J25425a4740A15674c680F3196d7602B31574h6928k02123g0115C5530
9055b58193J10659q3338N9825Q425C6682a93396p9021O9023G0775i4317R785H2214
9042c4230j49840G7194N6551K4182R173d5219K0209k6832A0778J940J63431K2316
$$ y = [29732, -141623, -49060, 37846, -301581, -16804, 399820, -259098, -85167, -5746, -68104, -30522, 223388, 83713, -206356, -38597, -175867, 204507, -258369, -289174, 262237, -189685, -117653, -221497, -14189, -62147, -212229, -266789, -54743, -307478, -85431, 158107, -72736, -1673, -99767, -168367, 27554, -31439, -136752, -194309, -73797, 2434, -268244, 28189, -331034, 112072, -326728, -72714, -100602, 181030, -75104, -92808, -325480, 327706, 108672, 116308, 30732, -102004, 2746, 128171, -14740, 115674, -3680, 63196, -47602, 231574, -86928, -289051, -70115, 35530, -258193, -147534, -230872, -171047, -162622, 36682, -193396, -272417, -203394, 70775, -94317, -84532, 82214, -34230, -184070, 77194, 133745, 157927, 167100, -45219, -25010, -51842, 10778, 12718, 176149, 198465]
9030A98465h4689I5782b44530B59242B3175b5035j60924M5847j436b6734A76779
9018a28599d6160p6216e4388G1732E795b19504C4100c49637C8394R125a8096B1666
9005B41166c19722a36803b6222k11789A71636C5560c02845h5703l5205F0599b26415
8993E9524g7193I5232K14866O6808f6972k81136H3979e132k79253A73665J3893
8982A87558F3611P3786R5790b17103f0407m2633d0348j31633J2970e8900b6052
8970A94916a15180A52491a59000A44405d05649K5885J17246A05045D0321e4804
8959b19437k25947A13828C4776b38461h9253B2782K93324C3032K7662f9883p4594
8948a44477p5687A8604J5636a84979k5480C86116e2288C5346J03526K3773a62575
$$ y = [198465, -84689, 95782, -244530, 259242, 23175, -25035, -185959, -140112, -141548, -26734, 176779, -128599, -46160, -122376, -54388, 71732, 5795, -219504, 34100, -349637, 38394, 47519, -18096, 21666, 241166, -319722, -136803, -26222, -238011, 171636, 35560, -302845, -85703, -120908, 60599, -226415, 59524, -77193, 95232, 310098, 376906, -66972, -348108, 83979, -5132, -284385, 173665, 187558, 63611, 137397, 233187, -217103, -60407, -103040, -40348, -171981, -159011, -58900, -26052, 194916, -115180, 152491, -159000, 144405, -405649, -379764, -262518, 105045, 40321, -54804, -219437, -445384, 113828, 34776, -238461, -89253, 22782, 316106, 33032, 60694, -69883, -144477, -220164, 18604, 34240, -184979, -210459, 386116, -52288, 35346, 138872, 162645, -162575]
8936I36J45131a18248A82776I1274J19144b27428m6337E442a63265g7056B92778
8924B09485J50673L18649J082037L363024O795258m095043B509356D87707A36366
8914A27322c8390H9854Q708g0125B31360b85485f2720C80364m6776E6284M8111
8903A04395E754a94284A97969a12307F1966L5362b09001l2306J13701C1149a25882
8891b23701B3219c45043a60267f5838j23318j1308A82298F0707b25602A41602
8880a1524m236C645a15456m3315A27978d9401B5043a26527C5655g0367h121H5969
8867B3542J99637D6859a63610b0059A26434J92199I5731b15657k9820B47052B840
8855c4500A39507h6805k7224M7804k58830C7741J25137c43209B44934a11313i87
$$ y = [936, 146067, -118248, 182776, 91274, 210418, -227428, -273765, 5442, -163265, -77056, 292778, 209485, 360158, 678807, 1760844, 5123868, 11919126, 7824083, 2509356, 487707, 136366, 127322, -38390, 89854, 98562, -70125, 231360, -285485, -62720, 380364, 333588, 56284, 104395, 5754, -194284, 197969, -112307, 61966, 97328, -209001, -241307, -127606, 31149, -125882, -223701, 23219, -345043, -160267, -65838, -189156, -200464, 182298, 60707, -225602, 141602, -11524, -15760, 3645, -115456, -158771, 127978, -49401, 25043, -126527, 35655, -70367, -8121, 85969, 23542, 223179, 46859, -163610, -20059, 126434, 318633, 95731, -215657, -245477, 247052, 2840, -34500, 139507, -86805, -114029, -66225, -325055, 37741, 162878, -343209, 244934, -111313, -987]
8843A44965b51279O7618N723A06345b38441R0797b8835i240r5725A79229L4498
8832B13727c0642A69985c2299j04164n5197G5569J01918a15976L0208A69708c34833
8820A59668b8804A21872c92173B264a65671j00396F4766e3288B09862d8034B27513
8808a44020J5941b4166j29296A8512a83118c4427H3935f8433A14236Q649C4426
$$ y = [144965, -251279, -183661, -177938, 106345, -238441, -147644, -28835, -9240, -104965, 179229, 213727, -30642, 169985, -32299, -136463, -191660, 75569, 177487, -115976, -85768, 169708, -334833, 159668, -28804, 121872, -392173, 2264, -165671, -266067, 64766, -53288, 209862, -48034, 227513, -144020, -128079, -24166, -153462, 18512, -183118, -34427, 83935, -68433, 114236, 122885, 34426]
$$ [...]
##END NTUPLES=NMR SPECTRUM
##END=
