##TITLE=NES1066_159122.0006_002_9705126_dtTAlxomYf
##JCAMPDX= 6.0         $$ Bruker NMR JCAMP-DX V2.0
##DATA TYPE= NMR SPECTRUM
##DATA CLASS= NTUPLES
##ORIGIN= BRUKER
##OWNER= Administrator
$$ 1.72 TOPSPIN		Version 2.1
$$ 2016-10-25 16:13:56.825 -0500  Administrator@X
$$ Compression mode = diff/dup
##.OBSERVE FREQUENCY= 400.02188249412
##.OBSERVE NUCLEUS= ^1H
##.ACQUISITION MODE= SIMULTANEOUS (DQD)
##.ACQUISITION SCHEME= undefined
##.AVERAGES= 64
##.DIGITISER RES= 22
##SPECTROMETER/DATA SYSTEM= spect
##.PULSE SEQUENCE= noesygpps1d.comp
##.SOLVENT NAME= COFFEE_meoh
##.SHIFT REFERENCE= INTERNAL, COFFEE_meoh, 1, 14.96118
##AUDIT TRAIL= $$ (NUMBER, WHEN, WHO, WHERE, PROCESS, VERSION, WHAT)
$$ ##TITLE= Audit trail, TOPSPIN		Version 2.1
$$ ##JCAMPDX= 5.01
$$ ##ORIGIN= Bruker BioSpin GmbH
$$ ##OWNER= Administrator
$$ $$ E:\/data/COFFEE/nmr/NES1066_159122.0006_002_9705126_dtTAlxomYf/12/pdata/1/auditp.txt
$$ ##AUDIT TRAIL=  $$ (NUMBER, WHEN, WHO, WHERE, PROCESS, VERSION, WHAT)
(   1,<2016-04-30 13:19:42.849 -0700>,<Administrator>,<X>,<go>,<TOPSPIN 2.1>,
      <created by zg
	started at 2016-04-30 13:08:13.396 -0700,
	POWCHK enabled, PULCHK disabled,
       configuration hash MD5:
       21 0F 79 D6 B3 7B B4 F6 88 20 88 DB 03 48 BD 9F
       data hash MD5: 64K
       66 24 12 1A 0C D9 F6 AD E9 03 FF D8 4F 94 1B BC>)
(   2,<2016-04-30 13:19:46.396 -0700>,<Administrator>,<X>,<proc1d>,<TOPSPIN 2.1>,
      <Start of raw data processing
       efp LB = 0.3 FT_mod = 6 PKNL = 1 PHC0 = 0 PHC1 = 0 SI = 128K 
       data hash MD5: 128K
       3C 70 10 57 78 D1 BF EF CD C0 E7 BE FF 69 DB 87>)
(   3,<2016-04-30 13:19:47.349 -0700>,<Administrator>,<X>,<proc1d>,<TOPSPIN 2.1>,
      <pk PHC0 = -84.53979 PHC1 = 0 
       data hash MD5: 128K
       85 1C F9 89 E0 E1 9A AE 7C D7 58 9F 0A 78 CC 6B>)
(   4,<2016-04-30 13:19:47.771 -0700>,<Administrator>,<X>,<proc1d>,<TOPSPIN 2.1>,
      <abs ABSG = 1 
       data hash MD5: 128K
       43 46 BC 90 15 FA 39 B5 25 53 42 5E 8A EB 0C 93>)
(   5,<2016-04-30 13:19:47.880 -0700>,<Administrator>,<X>,<proc1d>,<TOPSPIN 2.1>,
      <abs ABSG = 2 
       data hash MD5: 128K
       B4 11 1A 92 68 D6 BD 8E 73 11 6D 4E EC A9 EA 6E>)
(   6,<2016-04-30 13:19:48.005 -0700>,<Administrator>,<X>,<proc1d>,<TOPSPIN 2.1>,
      <abs ABSG = 3 
       data hash MD5: 128K
       27 F7 B1 6A 6E D5 1B CE 21 71 8C 06 17 D6 E6 3A>)
(   7,<2016-04-30 13:19:48.286 -0700>,<Administrator>,<X>,<proc1d>,<TOPSPIN 2.1>,
      <abs ABSG = 4 
       data hash MD5: 128K
       B2 5A B2 28 B2 99 73 72 50 41 98 28 5A B7 F2 70>)
(   8,<2016-04-30 13:19:48.411 -0700>,<Administrator>,<X>,<proc1d>,<TOPSPIN 2.1>,
      <abs ABSG = 5 
       data hash MD5: 128K
       D6 92 F4 F1 01 40 D2 46 1E 92 5D 22 A2 45 E5 74>)
(   9,<2016-04-30 13:19:50.208 -0700>,<Administrator>,<X>,<audit>,<TOPSPIN 2.1>,
      <user comment:
       ICON-NMR User ID: COFFEE
       data hash MD5: 128K
       D6 92 F4 F1 01 40 D2 46 1E 92 5D 22 A2 45 E5 74>)
$$ ##END=
$$ 
$$ $$ hash MD5
$$ [...]
##$TP07= 0
##$TPNAME0= <>
##$TPNAME1= <>
##$TPNAME2= <>
##$TPNAME3= <>
##$TPNAME4= <>
##$TPNAME5= <>
##$TPNAME6= <>
##$TPNAME7= <>
##$TPOAL= (0..7)
0.5 0.5 0.5 0.5 0.5 0.5 0.5 0.5
##$TPOFFS= (0..7)
0 0 0 0 0 0 0 0
##$TUNHIN= 0
##$TUNHOUT= 0
##$TUNXOUT= 0
##$USERA1= <user>
##$USERA2= <user>
##$USERA3= <user>
##$USERA4= <user>
##$USERA5= <user>
##$V9= 5
##$VALIST= <valist>
##$VCLIST= <CCCCCCCCCCCCCCC>
##$VD= 0
##$VDLIST= <DDDDDDDDDDDDDDD>
##$VPLIST= <PPPPPPPPPPPPPPP>
##$VTLIST= <TTTTTTTTTTTTTTT>
##$WBST= 2048
##$WBSW= 25
##$XGAIN= (0..3)
0 0 0 0
##$XL= 0
##$YL= 0
##$YMAX_a= 5454304
##$YMIN_a= -10762524
##$ZGOPTNS= <>
##$ZL1= 120
##$ZL2= 120
##$ZL3= 120
##$ZL4= 120
##$ABSF1= 14.96118
##$ABSF2= -5.597002
##$ABSG= 5
##$ABSL= 3
##$ALPHA= 0
##$AQORDER= 0
##$ASSFAC= 0
##$ASSFACI= 0
##$ASSFACX= 0
##$ASSWID= 0
##$AUNMP= <proc_prof1d_extract.lims>
##$AXLEFT= 0
##$AXNAME= <>
##$AXNUC= <1H>
##$AXRIGHT= 0
##$AXTYPE= 0
##$AXUNIT= <>
##$AZFE= 0.1
##$AZFW= 0.1
##$BCFW= 0
##$BC_mod= 0
##$BYTORDP= 0
##$COROFFS= 0
##$CY= 15
##$DATMOD= 1
##$DC= 0
##$DFILT= <>
##$DTYPP= 0
##$F1P= 0
##$F2P= 0
##$FCOR= 0.5
##$FTSIZE= 131072
##$FT_mod= 6
##$GAMMA= 0
##$GB= 0
##$INTBC= 1
##$INTSCL= 1
##$ISEN= 128
##$LB= 0.3
##$LEV0= 0
##$LPBIN= 0
##$MAXI= 10000
##$MC2= 0
##$MEAN= 0
##$ME_mod= 0
##$MI= 0
##$NCOEF= 0
##$NC_proc= -3
##$NLEV= 6
##$NOISF1= 0
##$NOISF2= 0
##$NSP= 0
##$NTH_PI= 0
##$NZP= 0
##$OFFSET= 14.96118
##$PC= 1
##$PHC0= -84.53979
##$PHC1= 0
##$PH_mod= 1
##$PKNL= yes
##$PPARMOD= 0
##$PPDIAG= 0
##$PPIPTYP= 0
##$PPMPNUM= 2147483647
##$PPRESOL= 1
##$PSCAL= 4
##$PSIGN= 0
##$PYNMP= <proc.py>
##$REVERSE= no
##$SF= 400.020009563699
##$SI= 131072
##$SIGF1= 0
##$SIGF2= 0
##$SINO= 400
##$SIOLD= 131072
##$SPECTYP= <>
##$SREGLST= <1H.CDCl3>
##$SSB= 0
##$STSI= 131072
##$STSR= 0
##$SW_p= 8223.68421052631
##$SYMM= 0
##$S_DEV= 0
##$TDeff= 65536
##$TDoff= 0
##$TI= <>
##$TILT= no
##$TM1= 0
##$TM2= 0
##$TOPLEV= 0
##$USERP1= <user>
##$USERP2= <user>
##$USERP3= <user>
##$USERP4= <user>
##$USERP5= <user>
##$WDW= 1
##$XDIM= 131072
##$YMAX_p= 481590866
##$YMIN_p= -36009
##$CURPLOT= <Network HP LaserJet P1505>
##$CURPRIN= <$Network HP LaserJet P1505>
##$DFORMAT= <normdp>
##$LAYOUT= <+/1D_H.xwp>
##$LFORMAT= <normlp>
##$PFORMAT= <normpl>
##$SURQMSG= 1
$$ End of Bruker specific parameters
$$ ---------------------------------
##NTUPLES= NMR SPECTRUM
##VAR_NAME=  FREQUENCY,     SPECTRUM/REAL,   SPECTRUM/IMAG
##SYMBOL=    X,             R,               I
##VAR_TYPE=  INDEPENDENT,   DEPENDENT,       DEPENDENT
##VAR_FORM=  AFFN,          ASDF,            ASDF
##VAR_DIM=   131072,        131072,          131072
##UNITS=     HZ,            ARBITRARY UNITS, ARBITRARY UNITS
##FACTOR=    0.0627417313425164, 1,          1
##FIRST=     8223.62146879497, -9680,        -100584
##LAST=      0,             -8094,           -103432
##MIN=       0,             -36009,          0
##MAX=       8223.62146879497, 481590866,    0
$$ Real data points
##PAGE= N=1
##DATA TABLE= (X++(R..R)), XYDATA
$$ [...]
61124H68888j799j282J36J616K219K105K467M037O120P485P837P777P602O959
61110I22167N762M631M085L755K884J231p76k460l213k897k240k407l654m812
61096I22056m737l912l827m891n903n661m333k865j784j127j054j796l117m291
61082H72758m703m279l422k582j803o76J015K624L134K586K370L559N331N798
61068H81710M326K257J200J324J736J970K477L723N497P298Q894J0206J0841J0385
61054I53844R252Q798J0190J3254J6687J9294K0742K1334K1573K2015K3133K5087
61042A165203K7733L0906L4332L7413L9607M1220M3311M6573N0708N5177O0004
61031A632187O5559P2004P9394Q7887R7429J07887J20071J36071J57827J86117
$$ plain form
61124 868888 867089 865807 865943 867559 869778 871883 874350 878387 884507 891992 899829 907606 915208 922167
61110 922167 927929 932560 936645 940400 943284 944515 943739 941279 938066 935169 932929 930522 926868 922056
61096 922056 917319 913407 909580 904689 898786 893125 888792 885927 884143 883016 881962 880166 877049 872758
61082 872758 868055 863776 860354 857772 855969 855293 856308 858932 862066 864652 867022 870581 875912 881710
61068 881710 886036 888293 889493 890817 892553 894523 897000 900723 906220 913518 922412 932618 943459 953844
61054 953844 963096 971894 982084 995338 1012025 1031319 1052061 1073395 1094968 1116983 1140116 1165203
61042 1165203 1192936 1223842 1258174 1295587 1335194 1376414 1419725 1466298 1517006 1572183 1632187
61031 1632187 1697746 1769750 1849144 1937031 2034460 2142347 2262418 2398489 2556316 2742433
61021B742433K22030K69043L32101M14591N17125O38521P75661R22562J073250
61012G907317J227066J385589J535881J636021J627792J477895J213715R16283
61004A8927559O72442N28677M83407N09777N72385O22483N95441M36587J41883
60995B3490641k28596n84063q55694j024663j110984j144629j146016j123631
60987A6272365j080331j019184r45766q67314p90498p19910o58136o06295n63839
60978I021092n28219m95563m62131m25583l85555l43621l02525k65010k33047
60969E579838k07845j89892j78416j71057j64822j57875j50445j43940j39343
60960D076203j36614j35428j35946j38297j41515j43592j42960j39667j34794
$$ plain form
61021 2742433 2964463 3233506 3565607 3980198 4497323 5135844 5911505 6834067 7907317
61012 7907317 9134383 10519972 12055853 13691874 15319666 16797561 18011276 18927559
61004 18927559 19600001 20128678 20612085 21121862 21694247 22316730 22912171 23348758 23490641
60995 23490641 23262045 22677982 21822288 20797625 19686641 18542012 17395996 16272365
60987 16272365 15192034 14172850 13227084 12359770 11569272 10849362 10191226 9584931 9021092
60978 9021092 8492873 7997310 7535179 7109596 6724041 6380420 6077895 5812885 5579838
60969 5579838 5371993 5182101 5003685 4832628 4667806 4509931 4359486 4215546 4076203
60960 4076203 3939589 3804161 3668215 3529918 3388403 3244811 3101851 2962184 2827390
60951B827390j29065j22470j15121j07736j01046r4994q8713q1349p2992o5122
60941A848782n9873n8233n8740n8415n5308n0061m4802m0852l7755l4302k9978
60930A320463k5354k1340j8268j5726j3179j0701q969q561r271j0149j0139q841
60918A159965o682m385k265k21J607K631K576K115K186K824L161K704K075K204
60904A170495L175M098M039K947J695J181J352J312N12n79j317j916k890l903
60890A180201m120l667l648m508n395n608n568n824o016n701n468o125p273p674
60876A103606o886n647m797m583m934n654o308o541o567o872p575q517r702j0990
60862A008033j1628j0940r400q307q306q877r297r345r047q364p426o530n831
$$ plain form
60951 2827390 2698325 2575855 2460734 2352998 2251952 2156958 2068245 1986896 1913904 1848782
60941 1848782 1788909 1730676 1671936 1613521 1558213 1508152 1463350 1422498 1384743 1350441 1320463
60930 1320463 1295109 1273769 1255501 1239775 1226596 1215895 1206926 1198365 1189094 1178945 1168806 1159965
60918 1159965 1153283 1148898 1146633 1146412 1148019 1150650 1153226 1155341 1157527 1160351 1163512 1166216 1168291 1170495
60904 1170495 1173670 1177768 1181807 1184754 1186449 1187630 1188982 1190294 1190806 1190227 1188910 1186994 1184104 1180201
60890 1180201 1176081 1172414 1168766 1164258 1158863 1153255 1147687 1141863 1135847 1130146 1124678 1118553 1111280 1103606
60876 1103606 1096720 1091073 1086276 1081693 1076759 1071105 1064797 1058256 1051689 1044817 1037242 1028725 1019023 1008033
60862 1008033 996405 985465 976065 967758 959452 950575 941278 931933 922886 914522 907096 900566 894735
60849H94735n385n406n953o560o795o862p003o616n149l486l167m220n124n144
60835H17865n194n898o430o033n355n168m971m056k937k418k067j092j07n05k309
60820G63325m004m426l683k363r88k87q51k334l712m327m040k813j123m08j661
60805G26305l708m300l069j976k521l987m960n198n157m889m464m596n756p175
60791F64549p644o953n806m824m266m285m718n035n053n250n793n937n168m299
60777E89518m358m977m971m247l668l210j668J219L771M252L000J791J715K464
60763E80631L292L745L506K412R57K18R04K579M091M682M516M168L840L234K150
60748F24925Q71k04j137k234l267l473k648j814k160l379l905l025j995k413l995
$$ plain form
60849 894735 889350 883944 877991 871431 864636 857774 850771 844155 839006 835520 832353 828133 823009 817865
60835 817865 812671 806773 800343 794310 788955 783787 778816 774760 771823 769405 767338 766246 766139 765634 763325
60820 763325 759321 754895 751212 748849 747861 747574 746723 744389 740677 736350 732310 729497 728374 727966 726305
60805 726305 722597 718297 715228 713252 710731 706744 701784 696586 691429 686540 682076 677480 671724 664549
60791 664549 656905 649952 644146 639322 635056 630771 626053 621018 615965 610715 604922 598985 593817 589518
60777 589518 585160 580183 575212 570965 567297 564087 562419 563638 567409 571661 574661 576452 578167 580631
60763 580631 583923 587668 591174 593586 594543 594761 595665 598244 602335 607017 611533 615701 619541 622775 624925
60748 624925 625796 625592 624455 622221 618954 615481 612833 611019 608859 605480 601575 598550 596555 594142 590147
60733E90147m997m663m133m542n323n245m371l797l752l189j558J13M13p48k207
60718E42148k905k734k213j851j770j712j467j250j421j792j629o09M96N47o60
60703E21178k020k208j051K38M34k27l20Q06K108K426K202K528L037K425J108
60688E32664J337L873O263N923L697K490L141L727K957K110K835M586N495M885
60674E85983L717K849J997N73j177k288k094q96L10O58Lj098j875j916j365o35
60658E82746P6Q19J374J135n4j239j255j86P76Q80L73n28k014l679m306l512k567
60641E68839k753l700m341m500m427l683k018o95j176k889l938l841l767m098
60627E23013l740k271q68l39Q4J134K058J892R74J73m27j045j324r17k53J65N36
$$ plain form
60733 590147 585150 580487 576354 571812 566489 561244 556873 553076 549324 546135 544577 544690 545103 544355 542148
60718 542148 539243 536509 534296 532445 530675 528963 527496 526246 524825 523033 521404 520795 521291 521838 521178
60703 521178 519158 516950 515899 516137 516571 516344 516024 516830 518938 521364 523566 526094 529131 531556 532664
60688 532664 534001 537874 544137 550060 553757 556247 559388 563115 566072 568182 571017 575603 581098 585983
60674 585983 589700 592549 594546 595119 593942 591654 589560 588664 588974 589632 589635 588537 586662 584746 583381 582746
60658 582746 582822 583641 585015 586150 586096 584857 583602 583416 584192 585072 585445 584917 582903 579224 574918 571406 568839
60641 568839 566086 562386 558045 553545 549118 545435 543417 542722 541546 538657 534719 530878 527111 523013
60627 523013 519273 517002 516134 515795 515879 517013 519071 520963 521937 522110 521683 520638 519314 518397 518144 518309 518845
60610E18845J075J372J220J210J606J592P30J76J042K341K172M40j126j523j439
60595E29733j688k086k272k416k692k866k725k285j508m90J97J27q1N99J982K681
60579E14210J899M29l00M39K318M230M992M433L698L699L686K542J061J283L478
60564E52097N530N836N196N055N456N801O224O907P192O825P104R243J2399J4995
60550F55860J7307K0853K5434K8967L0542L1793L4462L8203M1698M4550M6837
60539A016506M7727M6095M2071L6653K9900K0835R518j785j0240j4973j7474j9767
60527A185066k2605k5251k6490k5724k3497k1243k0231k0283j9708j7022j2720
60516I50292q748o028l313R50O393J1322J5196J9219K4326K9849L4767L9227M3738
$$ plain form
60610 518845 519920 521292 522512 523722 525328 526920 527650 527826 528868 531209 533381 533821 532695 531172 529733
60595 529733 528045 525959 523687 521271 518579 515713 512988 510703 509195 508705 508902 509029 508948 509547 511529 514210
60579 514210 516109 516538 516238 516677 518995 523225 528217 532650 536348 540047 543733 546275 547336 548619 552097
60564 552097 557627 563463 568659 573714 579170 584971 591195 598102 605294 612119 619223 628466 640865 655860
60550 655860 673167 694020 719454 748421 778963 810756 845218 883421 925119 969669 1016506
60539 1016506 1064233 1110328 1152399 1189052 1218952 1239787 1249305 1247520 1237280 1222307 1204833 1185066
60527 1185066 1162461 1137210 1110720 1084996 1061499 1040256 1020025 999742 980034 963012 950292
60516 950292 941544 935516 932203 933153 939546 950868 966064 985283 1009609 1039458 1074225 1113452 1157190
60503A157190M7371M8002M4529L8204L1517K6158K2020J7734J2143N697N60j086
60491A450039J066N557J0900J6531K1978K6106K7854K7200K4641K0102J3124L921
60479A649019o439j6780k6142l3467l7935l9836m0530m1220m2113m2820m2889
60468A278848m1949m0034l8075l7193l7158l6353l3824l0435k7353k4427k1237
60457I10810j8771j8384j9408j9571j7974j6028j5005j4257j2732j0896r899r613
60445G28272q860p170n292m181m271n403o707o800n003k225MJ158J717J990J904
60430F79133J691J745J857J598J279J398J258l88k991m122k427O15K736L439L499
60415F90320L275K962L510N483P540P896O988O901Q290R851J1034J3020J6153
$$ plain form
60503 1157190 1204561 1252563 1297092 1335296 1366813 1392971 1414991 1432725 1444868 1450565 1451125 1450039
60491 1450039 1451105 1456662 1467562 1484093 1506071 1532177 1560031 1587231 1611872 1631974 1645098 1649019
60479 1649019 1642580 1625800 1599658 1566191 1528256 1488420 1447890 1406670 1364557 1321737 1278848
60468 1278848 1236899 1196865 1158790 1121597 1084439 1048086 1014262 983827 956474 932047 910810
60457 910810 892039 873655 854247 834676 816702 800674 785669 771412 758680 747784 737885 728272
60445 728272 719412 712242 706950 702769 698498 693095 686388 679588 674585 672360 672364 673522 675239 677229 679133
60430 679133 680824 682569 684426 686024 687303 688701 689959 689571 686580 682458 680031 680646 683382 686821 690320
60415 690320 693595 696557 700067 705550 713090 720986 727974 734875 743165 753016 764050 777070 793223
60402G93223J8530J8646J7826J8313K0148K1808K2989K4586K6337K6782K5752
60391A034940K4847K4842K4442K2555K0241J9121J9013J8449J6893J5144J3942
60380A254429J3274J2830J2279J1270R944R126R226R276P989N593L661L150L604
60367A365651M288N034N699N854N555N593O295O693N655L501J790J498J920J440
60353A426466q80m546q321j1517j4404j7197j9224j9708j9180j9085j9873k0482
60341A252049k0187j9878k0634k1801k1701j9964j8027j7247j7528j7959j7898
60330A039225j7114j5611j3844j2619j2230j2053j1388j0387r629r010p621m955
60318I02764j811K75N51j73l78N75J896K613L066M622P871J1554J3557J2668R218
$$ plain form
60402 793223 811753 830399 848225 866538 886686 908494 931483 956069 982406 1009188 1034940
60391 1034940 1059787 1084629 1109071 1131626 1151867 1170988 1190001 1208450 1225343 1240487 1254429
60380 1254429 1267703 1280533 1292812 1304082 1314026 1323152 1332378 1341654 1349643 1355236 1358897 1362047 1365651
60367 1365651 1369939 1374973 1380672 1386526 1392081 1397674 1403969 1410662 1416317 1419818 1421608 1423106 1425026 1426466
60353 1426466 1425586 1421040 1412719 1401202 1386798 1369601 1350377 1330669 1311489 1292404 1272531 1252049
60341 1252049 1231862 1211984 1191350 1169549 1147848 1127884 1109857 1092610 1075082 1057123 1039225
60330 1039225 1022111 1006500 992656 980037 967807 955754 944366 933979 924350 915340 907719 902764
60318 902764 900953 901228 901779 901606 901228 901803 903699 906312 909378 914000 921871 933425 946982 959650 968868
60303I68868M495k9l314n307o887q801j0731j1920j2473j3147j3794j3152j0858
60290H62950q686q640j0268j1172j0119q337p456p445p267o499n321l682j651
60277G66407j46o4q85j238p39j03N83K246N020P429Q206P952P972Q359Q286P666
60261H26951P187P041O798O493O621O970O564N103L480K469J821J189R62J494
60247H91143K182K214J817J838K470L162L726M642O299Q592J1194J3536J4672
60234I67487J4142J3155J3800J6611J9868K1991K3687K6604L0630L3927L5479
60223A217381L6163L7023L7876L8345L9153M1371M4840M8250N0524N1471N1421
60212A693818N1019N1166N2337N3907N4712N4272N3114N2069N1792N2554N3689
$$ plain form
60303 968868 973363 973334 970020 964713 957826 949025 938294 926374 913901 900754 886960 873808 862950
60290 862950 854264 845624 835356 824184 814065 805728 798272 790827 783560 777061 771740 768058 766407
60277 766407 766261 766197 765312 764074 763335 763232 763815 766061 771081 778510 786716 794668 802640 810999 819285 826951
60261 826951 834138 841179 847977 854470 861091 868061 874625 879728 883208 885677 887498 888687 889649 891143
60247 891143 893325 895539 897356 899194 901664 904826 908552 913194 919493 928085 939279 952815 967487
60234 967487 981629 994784 1008584 1025195 1045063 1067054 1090741 1117345 1147975 1181902 1217381
60223 1217381 1253544 1290567 1328443 1366788 1405941 1447312 1492152 1540402 1590926 1642397 1693818
60212 1693818 1744837 1796003 1848340 1902247 1956959 2011231 2064345 2116414 2168206 2220760 2274449
60201B274449N3489N0739M6426M2893M0988L9244L6263L2842L0834L0800L1761
60190B710728L2670L3024L2447L0962K9652K9970L2060L4513L6090L6993L8091
60179C077200L9439M0124L9275L6813L3307K9412K5452K1318J6694J1454N862
60168C376350M19m489q902j3212j7686k2040k5611k7899k8854k8723k8005k7526
60156C143822k8054k9516l0816l0687k8756k5916k3877k3968k5755k7147k6643
60145B842687k5338k5528k7482k9178k9642l0489l2970l5164l4275l0722k7799
60134B514100k7572k9105l0610l1328l1067k9796k8266k7468k6971k5331k2622
60123B203964k0733k0362j9598j6739j2878j0032p991m878n9N434J0892J6445
$$ plain form
60201 2274449 2327938 2378677 2425103 2467996 2508984 2548228 2584491 2617333 2648167 2678967 2710728
60190 2710728 2743398 2776422 2808869 2839831 2869483 2899453 2931513 2966026 3002116 3039109 3077200
60179 3077200 3116639 3156763 3196038 3232851 3266158 3295570 3321022 3342340 3359034 3370488 3376350
60168 3376350 3376769 3372280 3363378 3350166 3332480 3310440 3284829 3256930 3228076 3199353 3171348 3143822
60156 3143822 3115768 3086252 3055436 3024749 2995993 2970077 2946200 2922232 2896477 2869330 2842687
60145 2842687 2817349 2791821 2764339 2735161 2705519 2675030 2642060 2606896 2572621 2541899 2514100
60134 2514100 2486528 2457423 2426813 2395485 2364418 2334622 2306356 2278888 2251917 2226586 2203964
60123 2203964 2183231 2162869 2143271 2126532 2113654 2103622 2095631 2090753 2090694 2096128 2107020 2123465
60111B123465K1666K5381K7425K9263L2283L6254L9801M1714M1561L9530L6184
60100B494527L2115K7737K3457J9647J6053J1686N910o33o827j2390j7733k2861
60088B570688k7339l1093l4237l6316l6905l6812l7560l9282m0328l9372l6968
60077B174476l4423l2097k9543k6671k3880k1418j9239j7250j5198j2660r653
60066A932444o949n262m341l496k781k975m303n889o746o956p473q987j1298j3739
60052A841249j5852j7549j8923k0156k1470k2809k3672k3688k3350k3659k4795
60041A605326k5618k4874k2521j9460j6449j3755j1445r238o378k412J914N376
60029A460466P866J0515J4029J7679K0401K2325K4642K8111L1982L4428L4141
$$ plain form
60111 2123465 2145131 2170512 2197937 2227200 2259483 2295737 2335538 2377252 2418813 2458343 2494527
60100 2494527 2526642 2554379 2577836 2597483 2613536 2625222 2631132 2630499 2623672 2611282 2593549 2570688
60088 2570688 2543349 2512256 2478019 2441703 2404798 2367986 2330426 2291144 2250816 2211444 2174476
60077 2174476 2140053 2107956 2078413 2051742 2027862 2006444 1987205 1969955 1954757 1942097 1932444
60066 1932444 1925495 1920233 1915892 1912396 1909615 1906640 1902337 1896448 1889702 1882746 1875273 1866286 1854988 1841249
60052 1841249 1825397 1807848 1788925 1768769 1747299 1724490 1700818 1677130 1653780 1630121 1605326
60041 1605326 1579708 1554834 1532313 1512853 1496404 1482649 1471204 1461966 1455588 1453176 1455090 1460466
60029 1460466 1468332 1478847 1492876 1510555 1530956 1553281 1577923 1606034 1638016 1672444 1706585
60018A706585L1678K8987K7320K5928K3300J9112J4125Q572K054m986j1096j5666
60006A855913j9647k3749k6948k7826k6590k4813k3667k3380k3769k4187k3201
59995A588136j9543j3781q261m995l686j957K398R086J5286J8460J9199K0430
59983A620772K3756K7769L0516L2083L3547L4617L4142L2238L0083K7866K4736
59972A952125K0789J7293J4667J1845Q174M312P13l161p304j0357j1521j1951
59960A985624j2981j4009j3612j1958j0547r980r387p837n072j084L782Q484J2296
59947A913719J6050K1007K6510L0293L1477L1837L3480L6426L9327M1358M2470
59936B263954M2587M1790M0777M0194L9766L8860L7486L5974L4029L1188K8014
$$ plain form
60018 1706585 1738263 1767250 1794570 1820498 1843798 1862910 1877035 1885607 1887661 1882675 1871579 1855913
60006 1855913 1836266 1812517 1785569 1757743 1731153 1706340 1682673 1659293 1635524 1611337 1588136
59995 1588136 1568593 1554812 1546551 1541556 1537870 1535913 1538311 1547397 1562683 1581143 1600342 1620772
59983 1620772 1644528 1672297 1702813 1734896 1768443 1803060 1837202 1869440 1899523 1927389 1952125
59972 1952125 1972914 1990207 2004874 2016719 2024893 2029205 2029918 2026757 2019453 2009096 1997575 1985624
59960 1985624 1972643 1958634 1945022 1933064 1922517 1912537 1903150 1895313 1890241 1889157 1892939 1901423 1913719
59947 1913719 1929769 1950776 1977286 2007579 2039056 2070893 2104373 2140799 2180126 2221484 2263954
59936 2263954 2306541 2348331 2389108 2429302 2469068 2507928 2545414 2581388 2615417 2646605 2674619
59925B674619K5790K5029K5115K5521K6506K8473L1313L4525L7297L8590L8084
59914C010862L7060L7153L7955L7074L3214K7890K3202J9103J4215Q401K805k231
59902C286703p499j3149j8100k1528k3599k4455k3951k2772k2281k2518k1713
59891C065138j8815j5233j2734j0820p828l851o73R46K128L901O099Q593J2085
59878C028936J6883K1956K6020K8806L0802L2644L5262L9578M5257N0635N4647
59867C411426N8041O1840O5559O8174O9980P1795P2613O9881O2432N1648L9273
59856D102662K5534J0417m407j6399k4620l0304l5037l9196m2288m3914m4060
59845C858388m2862m0596l7851l5231l2782k9741k5200j9152j2675o790j305M802
$$ plain form
59925 2674619 2700409 2725438 2750553 2776074 2802580 2831053 2862366 2896891 2934188 2972778 3010862
59914 3010862 3047922 3085075 3123030 3160104 3193318 3221208 3244410 3263513 3277728 3286129 3288934 3286703
59902 3286703 3279204 3266055 3247955 3226427 3202828 3178373 3154422 3131650 3109369 3086851 3065138
59891 3065138 3046323 3031090 3018356 3007536 2999708 2995857 2995184 2996130 2998258 3002159 3008258 3016851 3028936
59878 3028936 3045819 3067775 3093795 3122601 3153403 3186047 3221309 3260887 3306144 3356779 3411426
59867 3411426 3469467 3531307 3596866 3665040 3735020 3806815 3879428 3949309 4011741 4063389 4102662
59856 4102662 4128196 4138613 4134206 4117807 4093187 4062883 4027846 3988650 3946362 3902448 3858388
59845 3858388 3815526 3774930 3737079 3701848 3669066 3639325 3614125 3594973 3582298 3575508 3574203 3579005
59833C579005J1995J9875K8228L7561M8095N9013O9491P9975R1460J03724J15096
59822D243518J24062J30229J33641J33972J30783J23934J13531J00085Q4988P0098
59812E388841N6336M3241L0327J8225P785j272r993j8850k7583l6199m5211n4922
59800E350725o5076p5067q3943r0594r4793r7755j00591j02508j01849r8925r6155
59789D343469r4925r3811r0848q6231q1609p7697p3951o9851o5156n9436n2687
59778C497267m5979m0160l4347k7227j9599j3817j0583p998m311J59M527R068
59766C307000J4151J8701K1259K1927K2003K2103K1760K0390J7665J3323P599
59755C507881J423m712j1495j9138k5698k8835k9009k8995l0070l0789l0193k9970
$$ plain form
59833 3579005 3591000 3610875 3639103 3676664 3724759 3783772 3853263 3933238 4024698 4128422 4243518
59822 4243518 4367580 4497809 4631450 4765422 4896205 5020139 5133670 5233755 5318743 5388841
59812 5388841 5445177 5488418 5518745 5536970 5544755 5543483 5533490 5514640 5487057 5450858 5405647 5350725
59800 5350725 5285649 5210582 5126639 5036045 4941252 4843497 4742906 4640398 4538549 4439624 4343469
59789 4343469 4248544 4154733 4063885 3977654 3896045 3818348 3744397 3674546 3609390 3549954 3497267
59778 3497267 3451288 3411128 3376781 3349554 3329955 3316138 3305555 3297557 3293246 3293405 3297932 3307000
59766 3307000 3321151 3339852 3361111 3383038 3405041 3427144 3448904 3469294 3486959 3500282 3507881
59755 3507881 3509304 3504592 3493097 3473959 3448261 3419426 3390417 3361422 3331352 3300563 3270370 3240400
59743C240400l1803l4324l4929l3665l2928l3507l3433l1325k8634k7184k6151
59732B892517k3440j9187j5805j4462j3441j0694o536k669M37L754P627J1190
59720B809291J4011J7098K1525K7025L2811L9108M6756N5601O4394P2343P9763
59709C279726Q6834R2728R6660R9124J01211J02964J03294J01511R8223R4469
59699D256744R0506Q5815P9986P3298O6564O0708N6320N3305N0867M8108M4771
59688D966992M1362L8441L5851L2746K8507K3530J8967J5657J3553J2259J1870
59677E239735J2855J5219J8211K1126K4083K7788L2719L8881M6124N4163O2253
59666E593157O9399P5270Q0528Q5756R0237R2258R0718Q5969P8995P0253N9749
$$ plain form
59743 3240400 3208597 3174273 3139344 3105679 3072751 3039244 3005811 2974486 2945852 2918668 2892517
59732 2892517 2869077 2849890 2834085 2819623 2806182 2795488 2788952 2786283 2786720 2790474 2798101 2809291
59720 2809291 2823302 2840400 2861925 2888950 2921761 2960869 3007625 3063226 3127620 3199963 3279726
59709 3279726 3366560 3459288 3555948 3655072 3756283 3859247 3962541 4064052 4162275 4256744
59699 4256744 4347250 4433065 4513051 4586349 4652913 4713621 4769941 4823246 4874113 4922221 4966992
59688 4966992 5008354 5046795 5082646 5115392 5143899 5167429 5186396 5202053 5215606 5227865 5239735
59677 5239735 5252590 5267809 5286020 5307146 5331229 5359017 5391736 5430617 5476741 5530904 5593157
59666 5593157 5662556 5737826 5818354 5904110 5994347 6086605 6177323 6263292 6342287 6412540 6472289
59655F472289M7753L4756K0769N412j1039k7150m1498n4020o5659p6683q6001
59644F218929r2444r6228r8581j00196j00729r9929r8609r8128r9249j01951j06103
59633E126782j11666j18220j24807j30475j34724j37252j37651j35679j31613
59624C964695j26030j19320j11679j03454r5193q7397q0411p4418o9240o4242
59614C033311n8888n3608m9685m8033m8078m8066m6509m3435m0353l8921l9353
59603B518382m0103l9380l7018l4473l2861l1533k9113k5449k1860j9494j8350
59592B188748j7945j8089j8351j7531j4781j1147r077j0055j3253j6646j8853
59581B023020j9600j9178j8276j7936j8782k0205k0892k0246j8764j7031j4992
$$ plain form
59655 6472289 6520042 6554798 6575567 6580979 6569940 6542790 6501292 6447272 6381613 6304930 6218929
59644 6218929 6126485 6030257 5931676 5831480 5730751 5630822 5532213 5434085 5334836 5232885 5126782
59633 5126782 5015116 4896896 4772089 4641614 4506890 4369638 4231987 4096308 3964695
59624 3964695 3838665 3719345 3607666 3504212 3409019 3321622 3241211 3166793 3097553 3033311
59614 3033311 2974423 2920815 2871130 2823097 2775019 2726953 2680444 2637009 2596656 2557735 2518382
59603 2518382 2478279 2438899 2401881 2367408 2334547 2303014 2273901 2248452 2226592 2207098 2188748
59592 2188748 2170803 2152714 2134363 2116832 2102051 2090904 2081827 2071772 2058519 2041873 2023020
59581 2023020 2003420 1984242 1965966 1948030 1929248 1909043 1888151 1867905 1849141 1832110 1817118
59570A817118j2431r490o408l322o43J000J765L011N881R886J3610J6620J9703
59557A856300K3323K6827K9544L1807L4370L7390M0457M3192M5410M6935M7899
59546B263454M8905N0550N2674N4288N4023N0747M4386L6595L0073K6529K5359
59535B737583K4704K3414K1490J9056J5850J1729O953J750l779r197j3811j7508
59523B818234k0992k4896k9081l3082l6761m0089m2659m3947m4000m3539m3274
59512B415914m3188m2359l9664l5050l0100k6788k5424k4328k1711j7407j2447
59501B097448p717l594j95K960P078J2826J8994K3452K5642K7228K9986L3723
59489B267831L6632L7093L4761L0428K5276J9911J3971P094K49m749p494r843
$$ plain form
59570 1817118 1804687 1795197 1788789 1785467 1784824 1785824 1787589 1790600 1796481 1806367 1819977 1836597 1856300
59557 1856300 1879623 1906450 1935994 1967801 2002171 2039561 2080018 2123210 2168620 2215555 2263454
59546 2263454 2312359 2362909 2415583 2469871 2523894 2574641 2619027 2655622 2685695 2712224 2737583
59535 2737583 2762287 2785701 2807191 2826247 2842097 2853826 2860779 2862529 2858750 2849553 2835742 2818234
59523 2818234 2797242 2772346 2743265 2710183 2673422 2633333 2590674 2546727 2502727 2459188 2415914
59512 2415914 2372726 2330367 2290703 2255653 2225553 2198765 2173341 2149013 2127302 2109895 2097448
59501 2097448 2089731 2086137 2085942 2088902 2095980 2108806 2127800 2151252 2176894 2204122 2234108 2267831
59489 2267831 2304463 2341556 2376317 2406745 2432021 2451932 2465903 2472997 2473246 2468497 2461003 2451160
59477B451160j3739j8807k3000k5148k5712k5349k4024k1830j9484j7405j5075
59466B221587j2044r018p214o824o714n632l356q62L09q91m017p200q722q720
59452B140682r022j1202j5104j9270k2413k4211k5113k5928k7467k9874l2165
59441A898913l2991l2170l1136l1263l2052l1656k9218k5893k3374k2085k1416
59430A585659k0976k0693j9978j7940j4782j2065j0959j0652r114n252J07N263
59418A448618R115J1417J2032J0488O705K018j190j442L78K002K272K144L241
59405A507798O005R452J2104J2749J0882P052K669r77l338m215l360r89J861M274
59391A561967O503R403J3047J6617J9529K1851K3757K5453K7712L1454L6505M1616
$$ plain form
59477 2451160 2437421 2418614 2395614 2370466 2344754 2319405 2295381 2273551 2254067 2236662 2221587
59466 2221587 2209543 2200525 2193311 2186487 2179773 2174141 2170785 2169923 2170232 2169341 2165324 2158124 2149402 2140682
59452 2140682 2131660 2120458 2105354 2086084 2063671 2039460 2014347 1988419 1960952 1931078 1898913
59441 1898913 1865922 1833752 1802616 1771353 1739301 1707645 1678427 1652534 1629160 1607075 1585659
59430 1585659 1564683 1543990 1524012 1506072 1491290 1479225 1468266 1457614 1448500 1443248 1443355 1448618
59418 1448618 1457733 1469150 1481182 1491670 1498375 1500393 1499203 1497761 1498139 1500141 1502413 1504557 1507798
59405 1507798 1513803 1523255 1535359 1548108 1558990 1566042 1568711 1567734 1564396 1560181 1556821 1555832 1557693 1561967
59391 1561967 1568470 1577873 1590920 1607537 1627066 1648917 1672674 1698127 1725839 1757293 1793798 1835414
59379A835414M6011N0097N4189N7604N9711O1008O2158O2531O0863N7057N2414
59368B459057M8135M4501M1379L8494L5100L0454K5051K0672J8683J8869K0250
59357B800645K2449K5842L0820L7411M5112N2713N8809O2974O6086O8988P1415
59346C343264P2968P4398P6723P9103P9024P5035O8448O1656N5560M9332M2227
59335D077738L4672K7639K1608J6275J0846M565k712j0406j7836k4926l2010l8925
59323D066528m4838m9076n1913n4250n6692n9150o1312o3242o5344o7804p0401
59312C422506p2949p5625p8410q0389q0296p7942p4528p1196o7827o3844n9589
59301B619911n5957n2979m9769m5992m2321l9110l5584l1102k6536k3500k2339
$$ plain form
59379 1835414 1881425 1931522 1985711 2043315 2103026 2164034 2226192 2288723 2349586 2406643 2459057
59368 2459057 2507192 2551693 2593072 2631566 2666666 2697120 2722171 2742843 2761526 2780395 2800645
59357 2800645 2823094 2848936 2879756 2917167 2962279 3014992 3073801 3136775 3202861 3271849 3343264
59346 3343264 3416232 3490630 3567353 3646456 3725480 3800515 3868963 3930619 3986179 4035511 4077738
59335 4077738 4112410 4140049 4161657 4177932 4188778 4193343 4190631 4180225 4162389 4137463 4105453 4066528
59323 4066528 4021690 3972614 3920701 3866451 3809759 3750609 3689297 3626055 3560711 3492907 3422506
59312 3422506 3349557 3273932 3195522 3115133 3034837 2956895 2882367 2811171 2743344 2679500 2619911
59301 2619911 2563954 2510975 2461206 2415214 2372893 2333783 2298199 2267097 2240561 2217061 2194722
59290B194722k1677j9977j7087j4107j2067j0963r989q593p101o104n499m573
59278B056985k979r63J441M560Q129J1065J2802J4148J5982J7762J8286J7358
59266B174576J5585J2903Q727L585r36m255p622j2240j7601k2368k6021k8829
59254B095504l0988l2693l4429l6221l7062l6116l4172l2793l2124l0720k7878
59243A730308k4996k3890k4436k4739k3468k1252j9575j8834j7992j6037j3278
59232A501811j0870r328q085o386m193k014m11J47l99j153o74J392L553M175L627
59217A471192L727N236P002P816Q009Q602R711J0688J1388J2447J4367J6988J9965
59204A607138K3300K7249L1898L6798M1095M4311M7222N1424N7496O3920O8518
$$ plain form
59290 2194722 2173045 2153068 2135981 2121874 2109807 2098844 2088855 2080262 2073161 2067057 2061558 2056985
59278 2056985 2054006 2053043 2054484 2059044 2067173 2078238 2091040 2105188 2121170 2138932 2157218 2174576
59266 2174576 2190161 2203064 2211791 2215376 2214440 2210185 2202563 2190323 2172722 2150354 2124333 2095504
59254 2095504 2064516 2031823 1997394 1961173 1924111 1887995 1853823 1821030 1788906 1758186 1730308
59243 1730308 1705312 1681422 1656986 1632247 1608779 1587527 1567952 1549118 1531126 1515089 1501811
59232 1501811 1490941 1481613 1473528 1467142 1462949 1460935 1460524 1460671 1460272 1459119 1458445 1459837 1463390 1467565 1471192
59217 1471192 1474919 1480155 1487157 1494973 1502982 1511584 1521295 1531983 1543371 1555818 1570185 1587173 1607138
59204 1607138 1630438 1657687 1689585 1726383 1767478 1811789 1859011 1910435 1967931 2031851 2100369
59193B100369P0769P1926P2950P3350P2274O9673O5519N8849M8821L6519K4453
59182B765472J4078M784m340j2774j9351k4063k8066l2033l5328l6970l6758l5234
59170B519417l2951l0157k7020k3812k0764j7760j4371j0305n817j327L285Q544
59158B346962J4351J9688K3840K7317L0756L3410L3784L1731K8803K6286K3824
59147B640752K0376J5717J0428N178N21l204o462j0333j4988j8819j9957j8374
59135B600835j5732j3309j0939q045m841k115j88J548M034P492J0960J3160J3892
59122B596752J4130J4552J4668J3816J2314J0795Q943N965K096j418l990o408
59110B682215r725j3968j8174k1222k2615k2986k3685k5331k6908k7031k5896
$$ plain form
59193 2100369 2171138 2243064 2316014 2389364 2461638 2531311 2596830 2655679 2704500 2741019 2765472
59182 2765472 2779550 2784334 2779994 2767220 2747869 2723806 2695740 2663707 2628379 2591409 2554651 2519417
59170 2519417 2486466 2456309 2429289 2405477 2384713 2366953 2352582 2342277 2336460 2335133 2338418 2346962
59158 2346962 2361313 2381001 2404841 2432158 2462914 2496324 2530108 2561839 2590642 2616928 2640752
59147 2640752 2661128 2676845 2687273 2692451 2692972 2689768 2683306 2672973 2657985 2639166 2619209 2600835
59135 2600835 2585103 2571794 2560855 2552810 2547969 2545854 2545666 2547214 2551248 2558740 2569700 2582860 2596752
59122 2596752 2610882 2625434 2640102 2653918 2666232 2677027 2685970 2691935 2694031 2692613 2688623 2682215
59110 2682215 2672490 2658522 2640348 2619126 2596511 2573525 2549840 2524509 2497601 2470570 2444674
59099B444674k5073k5477k6525k7251k7183k6064k3901k1626k0483k0360j9808
59088B180923j8154j6332j5099j3772j1677r589q552q285p897p344o885o045m527
59075B046765l356l515m129l727k851l339n187o301n783n372o792r385j1476j2645
59061A962907j3487j4211j4639j4806j4586j3440j1525j0141j0130j0542j0082
59050A825318r065q726r173r487r448r695j0277j0559j0683j1656j3654j5471
59038A697424j6145j6023j5731j5175j4220j3417j3159j2901j1888j0152q104
59027A550509n881l860k945l302l477k112j48J30j724l615l725k681k120k175
59013A512874j573L11K583M010M266L879L461L251L273L674M729O270P447P673
$$ plain form
59099 2444674 2419601 2394124 2367599 2340348 2313165 2287101 2263200 2241574 2221091 2200731 2180923
59088 2180923 2162769 2146437 2131338 2117566 2105889 2096300 2087748 2079463 2071566 2064222 2057337 2051292 2046765
59075 2046765 2043409 2039894 2035765 2032038 2029187 2025848 2020661 2014360 2008577 2003205 1996413 1987028 1975552 1962907
59061 1962907 1949420 1935209 1920570 1905764 1891178 1877738 1866213 1856072 1845942 1835400 1825318
59050 1825318 1816253 1807527 1798354 1788867 1779419 1769724 1759447 1748888 1738205 1726549 1712895 1697424
59038 1697424 1681279 1665256 1649525 1634350 1620130 1606713 1593554 1580653 1568765 1558613 1550509
59027 1550509 1544628 1540768 1537823 1534521 1531044 1528932 1528784 1528914 1527190 1523575 1519850 1517169 1515049 1512874
59013 1512874 1511301 1511612 1514195 1518205 1522471 1526350 1529811 1533062 1536335 1540009 1544738 1551008 1558455 1566128
58999A566128P777R378J2641J5550J6212J5369J5642J8540K3172K7752L1425L4460
58987A794046L7581M1597M6943N3221N9513O5487P1694P8526Q5323R0772R3840
58976B518543R4191R2269Q9093Q5335Q0193P1963O0230M6884L4309K3100J2196
58965C208306O86j1272k2792l2570l9261m2793m5073m8211n1947n4070n3549n1905
58953B755549n0929n0325m8712m5988m3381m1520l9700l7087l3716l0149k6930
58942B307112k4522k3005k1505j8734j4606j0781q891q539p803n597k715l52J530
58929B161592L678O024P751Q810J0448J3808J8825K4816L1470L8564M5447N1663
58917B422896N7703O4100P0227P5036P8653Q1697Q3010P9929P1639O0705N0036
$$ plain form
58999 1566128 1573905 1583283 1595924 1611474 1627686 1643055 1658697 1677237 1700409 1728161 1759586 1794046
58987 1794046 1831627 1873224 1920167 1973388 2032901 2098388 2170082 2248608 2333931 2424703 2518543
58976 2518543 2612734 2705003 2794096 2879431 2959624 3031587 3091817 3138701 3173010 3196110 3208306
58965 3208306 3208992 3197720 3174928 3142358 3103097 3060304 3015231 2967020 2915073 2861003 2807454 2755549
58953 2755549 2704620 2654295 2605583 2559595 2516214 2474694 2434994 2397907 2364191 2334042 2307112
58942 2307112 2282590 2259585 2238080 2219346 2204740 2193959 2185068 2176529 2168726 2163129 2160414 2160062 2161592
58929 2161592 2165270 2171294 2179045 2187855 2198303 2212111 2230936 2255752 2287222 2325786 2371233 2422896
58917 2422896 2480599 2544699 2614926 2689962 2768615 2850312 2933322 3013251 3084890 3145595 3195631
58906C195631L9683K8295J6720P891L156P85j214k441j304K401P345J2578J8302
58893C327828K4808L1563L7693M2856M7580N2982O0072O8961P8468Q6730R2414
58882C951955R5479R6639R6035R2436Q4221P1402N6305M1637K8112J4599N35j2797
58870D616558k3684l1796l7983m2976m7089n0807n4784n9115o3155o6154o7852
58859D071163o8531o8832o9410p0409p1344p1725p1618p1363p1032p0581p0198
58848C296120o9993o9508o8167o6136o4154o2628o1387o0318n9516n8663n6954
58837B598696n3946n0147m6460m3392m0922l8771l6576l4091l1399k8692k5814
58826B168486k2358j8320j4202j0359o719l315n90J253K810M957P737J0072J0629
$$ plain form
58906 3195631 3235314 3263609 3280329 3288220 3291376 3292161 3290947 3288506 3287202 3289603 3296948 3309526 3327828
58893 3327828 3352636 3384199 3421892 3464748 3512328 3565310 3625382 3694343 3772811 3859541 3951955
58882 3951955 4047434 4144073 4240108 4332544 4416765 4488167 4544472 4586109 4614221 4628820 4629355 4616558
58870 4616558 4592874 4561078 4523095 4480119 4433030 4382223 4327439 4268324 4205169 4139015 4071163
58859 4071163 4002632 3933800 3864390 3793981 3722637 3650912 3579294 3507931 3436899 3366318 3296120
58848 3296120 3226127 3156619 3088452 3022316 2958162 2895534 2834147 2773829 2714313 2655650 2598696
58837 2598696 2544750 2494603 2448143 2404751 2363829 2325058 2288482 2254391 2222992 2194300 2168486
58826 2168486 2146128 2127808 2113606 2103247 2096528 2093213 2092623 2093876 2096686 2101643 2109380 2119452 2130081
58813B130081R062O545M855M585M439K799j49k541l058k194j261j056j742k986
58799B147379l597j996K094P013J0958J3818J6635K0019K3955K8432L3065L6753
58787B334528L8936M0770M3734M7393N0033N1291N2498N4245N5335N4656N2549
58776B875968M9522M5043L8730L1575K4758J8055J0652K958l687q903j3661j8850
58764C052160k4341k9447l3581l6472l8369m0032m1925m3634m4676m5578m7208
58753B626897m9106m9574m7713m4583m1898m0297l9278l8175l6584l4295l1493
58742B173901k8792k6646k4912k3382k2358k2121k2086k1250j9443j7356j5208
58731A930347j2273q262m387k068q95J146N370J1177J7335K3575L0316L7425M4093
$$ plain form
58813 2130081 2139143 2145688 2150543 2155128 2159567 2162366 2162217 2159676 2156618 2154424 2153163 2152107 2150365 2147379
58799 2147379 2143782 2141786 2143880 2150893 2161851 2175669 2192304 2212323 2236278 2264710 2297775 2334528
58787 2334528 2373464 2414234 2457968 2505361 2555394 2606685 2659183 2713428 2768763 2823419 2875968
58776 2875968 2925490 2970533 3009263 3040838 3065596 3083651 3094303 3097261 3093574 3084671 3071010 3052160
58764 3052160 3027819 2998372 2964791 2928319 2889950 2849918 2807993 2764359 2719683 2674105 2626897
58753 2626897 2577791 2528217 2480504 2435921 2394023 2353726 2314448 2276273 2239689 2205394 2173901
58742 2173901 2145109 2118463 2093551 2070169 2047811 2025690 2003604 1982354 1962911 1945555 1930347
58731 1930347 1918074 1909812 1905425 1903357 1902462 1903608 1908978 1920155 1937490 1961065 1991381 2028806 2072899
58718B072899M9744N4456N8454O1450O2334N9188N0230L5500J7594Jj5379k8675
58706B477796m0240m9343n4955n7182n7291n6581n5537n3911n1334m7762m3460
58695A910200l8795l4179l0043k6234k1458j4191m804M197J0834J5803K0671K4780
58683A816781K5722K2621J6987J0066J467q791j8825k6833l3033l8294m2006m2983
58671A682879m1673l9777l8138l6355l4212l2053k9977k7916k6416k6180k6868
58660A323314k7389k7271k6751k5744k3902k1755k0450k0125j9444j7185j3589
58649A079709r931p434o624p064p543p169o287n858o145o624o863o603n345l071
58635I87148j124j085k645l769l163j464J54J241J565P22j021k388k396j385l03
$$ plain form
58718 2072899 2122643 2177099 2235553 2297003 2359337 2418525 2468755 2504255 2521849 2521850 2506471 2477796
58706 2477796 2437556 2388213 2333258 2276076 2218785 2162204 2106667 2052756 2001422 1953660 1910200
58695 1910200 1871405 1837226 1807183 1780949 1759491 1745300 1740496 1744693 1755527 1771330 1792001 1816781
58683 1816781 1842503 1865124 1882111 1892177 1893644 1884853 1866028 1839195 1806162 1767868 1725862 1682879
58671 1682879 1641206 1601429 1563291 1526936 1492724 1460671 1430694 1402778 1376362 1350182 1323314
58660 1323314 1295925 1268654 1241903 1216159 1192257 1170502 1150052 1129927 1110483 1093298 1079709
58649 1079709 1069778 1062344 1055720 1048656 1041113 1033944 1027657 1021799 1015654 1009030 1002167 995564 990219 987148
58635 987148 986024 984939 982294 978525 975362 973898 974052 975293 976858 977580 976559 974171 971775 970390 970087
58620I70087L95P89J107J603K145J795j84k812l973k908j041J06N79J038J528
58605I70254K099L382N349O453N420L235K087K841M682O756Q868J0794J2188J3222
58591A057630J4400J5714J6747J7483J8259J8945J9036J8500J7802J7089J6126
58580A247731J5018J4182J3433J1919R415P057O133O418O315M799K736J787K200
58567A349143K506J514k35j655k804m107m756l633j683j274k849m274m280m463
58553A317150o416q945j0030j0142j1199j3189j4252j3840j3446j4068j4914j5062
58541A171647j4701j4267j3675j2873j1964j0571q265n806m604m795n125n049
58529A059952n477o977q693r695j0039r811q501o262m534m306m725m569m189m672
$$ plain form
58620 970087 970482 971271 972378 973981 976126 977921 977737 974925 970952 968044 967003 967109 967688 968726 970254
58605 970254 972353 975735 981084 987537 992957 996192 998279 1001120 1005802 1012558 1021426 1032220 1044408 1057630
58591 1057630 1072030 1087744 1104491 1121974 1140233 1159178 1178214 1196714 1214516 1231605 1247731
58580 1247731 1262749 1276931 1290364 1302283 1311698 1318755 1324888 1331306 1337621 1342420 1345156 1346943 1349143
58567 1349143 1351649 1353163 1352928 1351273 1348469 1344362 1339606 1335973 1334290 1333016 1330167 1325893 1321613 1317150
58553 1317150 1310734 1301789 1291759 1281617 1270418 1257229 1242977 1229137 1215691 1201623 1186709 1171647
58541 1171647 1156946 1142679 1129004 1116131 1104167 1093596 1085331 1079525 1074921 1070126 1065001 1059952
58529 1059952 1054475 1047498 1038805 1029110 1019071 1009260 1000759 994497 989963 985657 980932 976363 972174 967502
58515I67502n671n565l671j143M57P04L05J66P01J678K664L576M636N818O823
58500I78980P781R297J1461J3381J4356J4929J6065J7532J7986J6700J4638J3471
58488A146577J3827J4785J4910J3577J1112P954M298P18j638k310k484l806o368
58475A211152q837j0363j1153j1126r660p210n763o526q154q423o938n119l981
58462A107899l304k716k358k309k222j833j244o19j47l21j734m213o576p429o350
58447A064524m318k948l041l861m151l714l359l388l126k285j687j910k257j957
58433A022522j480j440j049Q43L624N465N780N628N636N289M600M718N942O597
58419A072675N142K403N09L54J307K756M457N635N244L541K265K721M410N960
$$ plain form
58515 967502 961831 956266 952595 951452 951909 952613 952918 953084 953785 955463 958127 961703 966339 972157 978980
58500 978980 986761 996058 1007519 1020900 1035256 1050185 1066250 1083782 1101768 1118468 1133106 1146577
58488 1146577 1160404 1175189 1190099 1203676 1214788 1222742 1227040 1227758 1226120 1223810 1221326 1217520 1211152
58475 1211152 1202315 1191952 1180799 1169673 1160013 1152803 1147040 1140514 1132360 1123937 1116999 1111880 1107899
58462 1107899 1104595 1101879 1099521 1097212 1094990 1093157 1091913 1091294 1091147 1090826 1089092 1084879 1078303 1070874 1064524
58447 1064524 1060206 1057258 1054217 1050356 1046205 1042491 1039132 1035744 1032618 1030333 1028646 1026736 1024479 1022522
58433 1022522 1021042 1019602 1018553 1019396 1023020 1028485 1034265 1039893 1045529 1050818 1055418 1060136 1066078 1072675
58419 1072675 1077817 1080220 1080729 1081083 1082390 1085146 1089603 1095238 1100482 1104023 1106288 1109009 1113419 1119379
58405A119379O745P037P148P180P405Q141R146R650R247Q506Q472R566J1099J1852
58391A240573J1131R378P799P315P916R016J0262J1662J2888J3004J1395Q922
58379A361261P541Q416J0683J2434J2848J2804J3287J3822J3134J1175R493R330
58367A496228J0130J0651J0843J1471J2276J2053J0873J0586J2203J4072J3973
58356A625359J2197J0857J0692J0442R449Q943J0057J2098J3758J4861J5791J6243
58344A770747J5877J5518J6365J8193J9521J9559J8928J8417J8054J7701J7611
58333A966491J7874J7914J7270J6512J6753J8294K0246K1653K2560K3641K5019
58322B184227K5998K6117K5991K6672K8440L0691L2800L4565L6009L7416L9427
$$ plain form
58405 1119379 1126124 1133161 1140309 1147489 1154894 1163035 1172181 1181831 1191078 1199584 1208056 1217622 1228721 1240573
58391 1240573 1251704 1261082 1268881 1276196 1284112 1293128 1303390 1315052 1327940 1340944 1352339 1361261
58379 1361261 1368802 1377218 1387901 1400335 1413183 1425987 1439274 1453096 1466230 1477405 1486898 1496228
58367 1496228 1506358 1517009 1527852 1539323 1551599 1563652 1574525 1585111 1597314 1611386 1625359
58356 1625359 1637556 1648413 1659105 1669547 1678996 1687939 1697996 1710094 1723852 1738713 1754504 1770747
58344 1770747 1786624 1802142 1818507 1836700 1856221 1875780 1894708 1913125 1931179 1948880 1966491
58333 1966491 1984365 2002279 2019549 2036061 2052814 2071108 2091354 2113007 2135567 2159208 2184227
58322 2184227 2210225 2236342 2262333 2289005 2317445 2348136 2380936 2415501 2451510 2488926 2528353
58311B528353M2246M4655M4880M2914M1048M1461M3865M6193M6971M6217M4609
58300C013412M2835M1573M1174M1217M0962M0258L9592L9375L9775M1043M3290
58289C464506M5986M8328N0152N1936N3859N5564N7037N9076O2381O6552P0504
58278D085881P3744P6854Q0601Q4801Q8331R0268R0787R0788R0941R1452R2572
58267E037020R4631R7409J00053J01956J03452J05375J08238J12018J16350J20691
58257F097193J24649J28436J32714J37819J43496J49489J55989J63376J71888
58248G405049J81589J92098K02488K12188K21975K33104K45561K58302K71352
58239I423706K86165L03358L21705L40262L60121L82814M08183M35034M63059
$$ plain form
58311 2528353 2570599 2615254 2660134 2703048 2744096 2785557 2829422 2875615 2922586 2968803 3013412
58300 3013412 3056247 3097820 3138994 3180211 3221173 3261431 3301023 3340398 3380173 3421216 3464506
58289 3464506 3510492 3558820 3608972 3660908 3714767 3770331 3827368 3886444 3948825 4015377 4085881
58278 4085881 4159625 4236479 4317080 4401881 4490212 4580480 4671267 4762055 4852996 4944448 5037020
58267 5037020 5131651 5229060 5329113 5431069 5534521 5639896 5748134 5860152 5976502 6097193
58257 6097193 6221842 6350278 6482992 6620811 6764307 6913796 7069785 7233161 7405049
58248 7405049 7586638 7778736 7981224 8193412 8415387 8648491 8894052 9152354 9423706
58239 9423706 9709871 10013229 10334934 10675196 11035317 11418131 11826314 12261348 12724407
58230A2724407M92857N25044N60440O00316O45222O94398P47342Q04850Q67495
58221A8662371R34506J005688J083135J169586J266461J375304J499684J643804
58213B8640539J810934K005351K234122K504730K823623L200918L654925M208130
58205E1083272M879449N682578O628767P729068R002530J0490665J2251082J4308465
58197A22055876J6601190J8996499K1380565K3731183K6087574K8444963L0670069
58190B87967919L2477607L3435430L2995963L0621006K6025151J9415535J1533056
58183D74471667L419775l954319r977458j4460385j7515877j9387494k0333282
58176C92262627k0583685k0337879j9766037j9009308j8178935j7353309j6574640
$$ plain form
58230 12724407 13217264 13742308 14302748 14903064 15548286 16242684 16990026 17794876 18662371
58221 18662371 19596877 20602565 21685700 22855286 24121747 25497051 26996735 28640539
58213 28640539 30451473 32456824 34690946 37195676 40019299 43220217 46875142 51083272
58205 51083272 55962721 61645299 68274066 76003134 85005664 95496329 107747411 122055876
58197 122055876 138657066 157653565 179034130 202765313 228852887 257297850 287967919
58190 287967919 320445526 353880956 386876919 417497925 443523076 462938611 474471667
58183 474471667 477891442 473937123 463959665 449499280 431983403 412595909 392262627
58176 392262627 371678942 351341063 331575026 312565718 294386783 277033474 260458834
58169B60458834j5851843j5170943j4505384j3821612j3085283j2272832j1381994
58162A64368943j0432216r456235q491112p572298o728539n977609n325678m770196
58154A05615060m303203l914545l596326l346850l170127l070726l048007l092566
58146G8072710l185271l299546l407641l488055l529147l527591l485092l406401
58138E0743966l298299l168288l023163k868065k706276k539936k371378k203635
58130B8564926k039336j879831j726211j580618j445392j321137j206928j102390
58122A6263083j008156r24047q48152p78402p14114o55451o02368n54807n12844
58113I664742m75656m41157m07845l76556l49173l25838l04559k83671k63515
$$ plain form
58169 260458834 244606991 229436048 214930664 201109052 188023769 175750937 164368943
58162 164368943 153936727 144480492 135989380 128417082 121688543 115710934 110385256 105615060
58154 105615060 101311857 97397312 93800986 90454136 87284009 84213283 81165276 78072710
58146 78072710 74887439 71587893 68180252 64692197 61163050 57635459 54150367 50743966
58138 50743966 47445667 44277379 41254216 38386151 35679875 33139939 30768561 28564926
58130 28564926 26525590 24645759 22919548 21338930 19893538 18572401 17365473 16263083
58122 16263083 15254927 14330880 13482728 12704326 11990212 11334761 10732393 10177586 9664742
58113 9664742 9189086 8747929 8340084 7963528 7614355 7288517 6983958 6700287 6436772
58104F436772k45425k29818k15831k02342j88938j76088j64555j54446j44921
58095D714408j35218j25775j17715j11231j05400r9782r5106r1735q8469q4012
58085C659965p8957p5039p2682p0632o8060o5503o3334o0762n7282n4054n2592
58074B941068n2712n2872n2149n0789m9125m7197m5294m3734m2079l9767l7620
58063B427730l7277l8699l9629l8494l6627l6386l7864l8978l8388l6765l5130
58052B013493l3481l1700l0501l0429l0612k9729k7933k6733k6813k7017k5982
58041A692563k4098k2924k2964k3051k2089k0538j9526j9192j8823j8339j8547
58030A462472j9680k0708k0603j9715j9135j9188j9284j9027j8663j8313j7488
$$ plain form
58104 6436772 6191347 5961529 5745698 5543356 5354418 5178330 5013775 4859329 4714408
58095 4714408 4579190 4453415 4335700 4224469 4119069 4019287 3924181 3832446 3743977 3659965
58085 3659965 3581008 3505969 3433287 3362655 3294595 3229092 3165758 3104996 3047714 2993660 2941068
58074 2941068 2888356 2835484 2783335 2732546 2683421 2636224 2590930 2547196 2505117 2465350 2427730
58063 2427730 2390453 2351754 2312125 2273631 2237004 2200618 2162754 2123776 2085388 2048623 2013493
58052 2013493 1980012 1948312 1917811 1887382 1856770 1827041 1799108 1772375 1745562 1718545 1692563
58041 1692563 1668465 1645541 1622577 1599526 1577437 1556899 1537373 1518181 1499358 1481019 1462472
58030 1462472 1442792 1422084 1401481 1381766 1362631 1343443 1324159 1305132 1286469 1268156 1250668
58019A250668j5719j3297j1076r650q966q508p781o652n499m982n446o465o884
58006A139743n554k266J889N226O840P221P572Q584J0093J1704J3363J5255J7335
57993A237005J9198K0316K0529K0471K1581K5171L1162L7817M3210M7095N1128
57982A574683N7033O4793P2933Q0312Q7046R3533R9216J02901J04022J02841R9300
57971B538613R2378Q0931O5047M6335K7139R364o386k0782l4598m7311n7264o3440
57959B630026o6595o8195o8767o8042o6343o4799o3947o3040o1075n7988n4390
57948A926845n0613m6648m2713l9167l5855l2044k7410k2757j9421j7940j7545
57937A574732j7067j6114j5087j4230j3268j2273j2147j3492j5288j5632j3982
$$ plain form
58019 1250668 1234949 1221652 1210576 1200926 1191960 1183452 1175671 1169019 1163520 1158538 1153092 1146627 1139743
58006 1139743 1134189 1131923 1133812 1139038 1145878 1153099 1160671 1169255 1179348 1191052 1204415 1219670 1237005
57993 1237005 1256203 1276519 1297048 1317519 1339100 1364271 1395433 1433250 1476460 1523555 1574683
57982 1574683 1631716 1696509 1769442 1849754 1936800 2030333 2129549 2232450 2336472 2439313 2538613
57971 2538613 2630991 2711922 2776969 2823304 2850443 2859807 2853421 2832639 2798041 2750730 2693466 2630026
57959 2630026 2563431 2495236 2426469 2358427 2292084 2227285 2163338 2100298 2039223 1981235 1926845
57948 1926845 1876232 1829584 1786871 1747704 1711849 1679805 1652395 1629638 1610217 1592277 1574732
57937 1574732 1557665 1541551 1526464 1512234 1498966 1486693 1474546 1461054 1445766 1430134 1416152
57926A416152j1815j0655j0194q923o038j854L149Q677J4065J8485K2094K6132
57914A459275L1189L5961L8391L7836L5370L2072K7770K1693J3762M823m092j2199
57902A721851j8858k3655k6842k9331l1921l4577l6665l7718l7667l6575l4712
57891A373330l2995l2616l3772l5073l4847l2879l0405k8541k7344k6315k5090
57880A033453k3429k1238j8961j7439j6946j6851j6568j6194j5751j4520j2052
57869H43504r436q335q859r518r331q819q551p969o525n107n167o755q398q842
57855G31892q217p505p497q274r108q920p407n745n539o900q186p812n879l723
57841F31180k441k202k503k521j436R08L644N526O148O160O262O297N651M329
$$ plain form
57926 1416152 1404337 1393682 1383488 1374565 1368527 1366673 1369822 1378499 1392564 1411049 1433143 1459275
57914 1459275 1490464 1526425 1564816 1602652 1638022 1670094 1697864 1719557 1733319 1738142 1734050 1721851
57902 1721851 1702993 1679338 1652496 1623165 1591244 1556667 1520002 1482284 1444617 1408042 1373330
57891 1373330 1340335 1307719 1273947 1238874 1204027 1171148 1140743 1112202 1084858 1058543 1033453
57880 1033453 1010024 988786 969825 952386 935440 918589 902021 885827 870076 855556 843504
57869 843504 834068 825733 816874 807356 798025 789206 780655 772686 766161 761054 755887 749132 740734 731892
57855 731892 723675 716170 708673 700399 691291 682371 674964 669219 663680 656780 648594 640782 634903 631180
57841 631180 628739 626537 624034 621513 620077 620985 624629 630155 636303 642463 648725 655022 660673 665002
57827F65002L168K828K977K859K405K167K192J779P81L87J681L821M776L970L060
57812G03853L736N835Q311J1105J4808J9014K2450K4850K7444L1183L5503L9491
57800I47583M3373M7747N1831N3703N2393M8870M4554L9530L2775K3892J4043
57789A400294N109j904p551j3100j8982k4253k7641k8978k9196k9134k8966k8838
57777A166860k9272l0435l1555l1736l1003l0022k9093k8074k6970k5815k4138
57766H48747k1512j8639j6902j6494j6024j4446j2494j1466j1246j0515q634o448
57754F83927n256n605p011q434r021q787q473q534q503p767o544n618n406n747
57740E83221o298o535n822m180k616j932j533l95J182J999K059K751M603O204
$$ plain form
57827 665002 668170 670998 673975 676834 679239 681406 683598 685377 686158 686545 688226 692047 696823 700793 703853
57812 703853 707589 713424 721735 732840 747648 766662 789112 813962 841406 872589 908092 947583
57800 947583 990956 1038703 1090534 1144237 1196630 1245500 1290054 1329584 1362359 1386251 1400294
57789 1400294 1405403 1403499 1395948 1382848 1363866 1339613 1311972 1282994 1253798 1224664 1195698 1166860
57777 1166860 1137588 1107153 1075598 1043862 1012859 982837 953744 925670 898700 872885 848747
57766 848747 827235 808596 791694 775200 759176 744730 732236 720770 709524 699009 690375 683927
57754 683927 678671 673066 666055 657621 648600 639813 631340 622806 614303 606536 599992 594374 588968 583221
57740 583221 576923 570388 564566 560386 557770 555838 554305 553910 555092 557091 559150 561901 566504 572708
57726E72708O163N008M199M003L517K328J003n8j300l177n161o077n481m383m391
57711E68901n932p760q488q266q237q647q577p596o521o179o343o465o548o523
57697D66819n703l814j915j344k112l175l769l622k386j21K013K842K845L555
57683D50113N225O453O539O905R386J3979J9208K4220K9590L6215M4127N2454
57671G04414O0055O5875O8915O8185O3016N3484M0502K5488J0213l207j2994j8898
57659A125048k2210k3979k3763k0921j6565j2907j0840r492q345q330j0092j2423
57647I45181j3562j3399j3256j3762j4062j3180j1391r941r754j0606j1410j1272
57635G99586j0340r497r288r425r334q764p790o758o430p495r485j0827j0596
$$ plain form
57726 572708 578871 583879 588078 592081 595598 597926 598929 598871 597571 594394 589233 583156 577675 573292 568901
57711 568901 562969 555209 546721 538455 530218 521571 512994 505398 498877 492698 486355 479890 473342 466819
57697 466819 461116 457302 455387 454043 451931 448756 444987 441365 438979 438858 440871 443713 446558 450113
57683 450113 455338 461791 468330 475235 484621 498600 517808 542028 571618 607833 651960 704414
57671 704414 764469 830344 899259 967444 1030460 1083944 1124446 1149934 1160147 1156940 1143946 1125048
57659 1125048 1102838 1078859 1055096 1034175 1017610 1004703 993863 984371 976026 967696 957604 945181
57647 945181 931619 918220 904964 891202 877140 863960 852569 842628 832874 822268 810858 799586
57635 799586 789246 779749 770461 761036 751702 742938 735148 728390 721960 714465 704980 694153 683557
57622F83557r709r679j0592j1186j0736r800r011q017o134l423p07J190J874J413
57608E99040M01j66M46K035L646M578N097N968P349Q496Q785Q661R058R908R983
57593F83285Q529O473N457N985P006P129N747L203M43j570k680l788n840q561
57579G10818j0679j1396j1136j0822j0947j1426j1830j1548j0310q829q432r616
57567E83847j1298j1905j1045r746r135r240r124q081o513n534n642o152o154
57554D74278n721n555n646n051l156n85J422K052J295p7q11j68J114J490M43j147
57538D54177k603m271o156p001n857l636j980j275j021j303k343l171k487o69
57524D10404Q81K186M379O908P275M578J282K05J265K541L164L651M392N387O774
$$ plain form
57622 683557 673848 664169 653577 642391 631655 621855 612844 604827 598693 595270 594563 595753 597627 599040
57608 599040 599441 599275 599721 601756 605402 609980 615077 621045 628394 636890 645675 654336 663394 673302 683285
57593 683285 691814 698287 703744 709729 716735 723864 729611 732814 733257 731687 729007 725219 719379 710818
57579 710818 700139 688743 677607 666785 655838 644412 632582 621034 610724 601895 593463 583847
57567 583847 572549 560644 549599 539853 530718 521478 512354 504273 497760 492226 486584 480432 474278
57554 474278 468557 463002 457356 452305 449149 448564 449986 452038 453333 453256 452445 452277 453391 454881 455324 454177
57538 454177 451574 447303 441147 434146 428289 424653 422673 421398 420377 419074 416731 413560 411073 410404
57524 410404 411285 413471 417850 424758 432033 436611 437893 438098 439363 441904 445068 448719 453111 458498 465272
57509D65272Q316R013Q443P667P640P775P468P893J0186J2705J2586R784P140
57496E81888O261N819M501L171K905K940K115Q14p9j030l008n547p102o962n791
57481E80895m596m087m639o016p330p890p727p026n834m722m663n548n881m905
57467E00031l953m496n837o146m997l379j857m27L44j80j146r63L11J034O02L31
57451D69272J157K092J899J006P29J492K779M247N935P640Q769Q836P943O926
57437E30722O806P563P744O091L422J818J892K146J267l10j709l121n013o825
57423E52493p654p610p434p280o842o383o560p289p737p449o883o745p208p800
57409D51619p796o821n308m152l751l703l676l939m576m765l629j571q2j72j462
$$ plain form
57509 465272 473588 482601 491044 498711 506351 514126 521594 529487 539673 552378 564964 574748 581888
57496 581888 588149 593968 598469 601640 604545 607485 609600 610414 610335 609305 606297 600750 593648 586686 580895
57481 580895 576299 572212 567573 561557 554227 546337 538610 531584 525750 521028 516365 510817 504936 500031
57467 500031 496078 491582 485745 479599 474602 471223 469366 468939 469283 469103 467957 466994 467305 468339 468941 469272
57451 469272 470429 472521 474420 475426 476155 477647 480426 484673 490608 498248 507017 515853 523796 530722
57437 530722 537528 545091 552835 558926 562348 564166 566058 568204 569471 569161 567452 564331 559318 552493
57423 552493 544839 537229 529795 522515 515673 509290 502730 495441 487704 480255 473372 466627 459419 451619
57409 451619 443823 437002 431694 427542 423791 420088 416412 412473 407897 403132 399503 397932 397850 397678 396216
57394C96216k806l377l151k558j844q37M55J316R81j47p32k28M31K69m04o41k26
57377C82717L84Q55J090J013R19J503K755L452K670J341J198K430L528L393K559
57362D11807K102K250K397J966J054M64R27K019K432J901K036M112O699P099M956
57347D54221K738K310K765K364J145M24P28J458K069K516K749K614K111J305L10
57332D81827l46J70J953L900M841M660L834K495P66m88k90J166K735L721M267
57317E15211M435L845K529J433J518K703M016M572M322L984M263M887M609K750
57303E65077O51P57L725P033P423M639J902K247N057P054O493N183N800Q189R718
57288F40948Q987P591P625Q757R001P687O268O298P776R623J0839J0956J0147
$$ plain form
57394 396216 393410 390033 386882 384324 382480 381643 382098 383414 384395 384248 383516 383288 383719 383988 383584 382943 382717
57377 382717 383101 383956 385046 386059 386978 388481 391236 394688 397358 398699 399897 402327 405855 409248 411807
57362 411807 413909 416159 418556 420522 421576 422040 422967 424986 427418 429319 431355 435467 442166 449265 454221
57347 454221 456959 459269 462034 464398 465543 465967 466695 468153 470222 472738 475487 478101 480212 481517 481827
57332 481827 481481 481651 483604 487504 492345 497005 500839 503334 504100 503612 503322 504488 507223 510944 515211
57317 515211 519646 523491 526020 527453 528971 531674 535690 540262 544584 548568 552831 557718 562327 565077
57303 565077 565728 566485 570210 577243 584666 589305 591207 593454 598511 605565 612058 617241 623041 631230 640948
57288 640948 649935 657526 665151 673908 682909 690596 696864 703162 710938 720561 731400 742356 752503
57275G52503R285R251R907J0364J0295J0204J0226R768Q772Q155Q233P894O476
57262H71333N388O204P901P920N788L683L184L515L677M255N788P062O751N672
57248I48121N532O307O664O511P080Q545R506R221Q607Q524Q590Q361Q334Q871
57234A058774R289Q938Q270Q010Q136Q428R152J0346J1361J1966J2956J4635J5742
57221A196003J5139J3708J3095J3284J3113J2620J2926J3861J3768J2083J0380
57210A339980J0187J1226J2515J3755J4744J4720J3593J2814J3637J5109J5152
57199A487432J3365J1558J1473J3025J4879J5927J5954J5483J5337J5937J6861
57188A647231J7324J7183J7099J7649J8671J9664K0455K1164K1735K1985K2117
$$ plain form
57275 752503 761788 771039 780946 791310 801605 811809 822035 831803 840575 848730 856963 864857 871333
57262 871333 876721 882925 890826 898746 904534 908217 911401 914916 918593 922848 928636 935698 942449 948121
57248 948121 953653 959960 966624 973135 980215 988760 998266 1007487 1016094 1024618 1033208 1041569 1049903 1058774
57234 1058774 1068063 1077001 1085271 1093281 1101417 1109845 1118997 1129343 1140704 1152670 1165626 1180261 1196003
57221 1196003 1211142 1224850 1237945 1251229 1264342 1276962 1289888 1303749 1317517 1329600 1339980
57210 1339980 1350167 1361393 1373908 1387663 1402407 1417127 1430720 1443534 1457171 1472280 1487432
57199 1487432 1500797 1512355 1523828 1536853 1551732 1567659 1583613 1599096 1614433 1630370 1647231
57188 1647231 1664555 1681738 1698837 1716486 1735157 1754821 1775276 1796440 1818175 1840160 1862277
57177A862277K2752K4112K5443K5737K4946K3996K3525K3267K2943K2992K3751
57166B125741K4440K4041K2848K2143K2272K2237K1435K0756K1202K2319K2859
57155B372293K2565K2465K3554K5763K8130K9606K9777K9206K8944K9463L0354
57144B672120L1150L2006L3113L4121L4834L6084L8893M2753M5704M6623M6706
57133C094107M8064N1239N4886N7921O1040O5701P1916P8010Q2592Q6152R0275
57122C841903R5828J02431J09376J16358J23437J30988J39731J50187J62051J74747
57112E147037J88692K05315K25690K49899K77995L10785L49251L94083M46497
57103G795244N08943N84216O74394P81532R09003J061093J241041J450062J688050
$$ plain form
57177 1862277 1885029 1909141 1934584 1960321 1985267 2009263 2032788 2056055 2078998 2101990 2125741
57166 2125741 2150181 2174222 2197070 2219213 2241485 2263722 2285157 2305913 2327115 2349434 2372293
57155 2372293 2394858 2417323 2440877 2466640 2494770 2524376 2554153 2583359 2612303 2641766 2672120
57144 2672120 2703270 2735276 2768389 2802510 2837344 2873428 2912321 2955074 3000778 3047401 3094107
57133 3094107 3142171 3193410 3248296 3306217 3367257 3432958 3504874 3582884 3665476 3751628 3841903
57122 3841903 3937731 4040162 4149538 4265896 4389333 4520321 4660052 4810239 4972290 5147037
57112 5147037 5335729 5541044 5766734 6016633 6294628 6605413 6954664 7348747 7795244
57103 7795244 8304187 8888403 9562797 10344329 11253332 12314425 13555466 15005528 16693578
57094A6693578J954053K245164K554915K872980L186470L481882L746611L969765
57086D0705418M142244M256244M303983M276284M162884L956058L656186L275151
57078G2734452K834713K360730J876324J396870R29072M75028L8998l68592p33749
57069H1543846j046342j306224j522988j709237j872327k011128k119939k194600
57061F7761061k234058k237057k199916k118733j992422j822799j613630j371987
57053E2170459j110313q45437n95076l75184j98500p2236L955L6135L0771r236
57043D9035338q4262j95352l42091n21210p25584r44305j164178j371769j555411
57034D2131176j707108j823497j905098j954738j976400j974142j950717j907466
$$ plain form
57094 16693578 18647631 20892795 23447710 26320690 29507160 32989042 36735653 40705418
57086 40705418 44847662 49103906 53407889 57684173 61847057 65803115 69459301 72734452
57078 72734452 75569165 77929895 79806219 81203089 82132161 82607189 82646187 82277595 81543846
57069 81543846 80497504 79191280 77668292 75959055 74086728 72075600 69955661 67761061
57061 67761061 65527003 63289946 61090030 58971297 56978875 55156076 53542446 52170459
57053 52170459 51060146 50214709 49619633 49244449 49045949 48973713 48977668 49013803 49044574 49035338
57043 49035338 48951076 48755724 48413633 47892423 47166839 46222534 45058356 43686587 42131176
57034 42131176 40424068 38600571 36695473 34740735 32764335 30790193 28839476 26932010
57026B6932010j846419j771805j688182j597813j501646j402486j304989j212211
57018A4606459j124109j040085r60962q87528q18931p54001o92957o36495n84134
57009G107257n34765m88120m44500m03676l65121l28923k95691k65972k40241
57000C740248k18628k00119j82900j66167j50569j36375j22766j09888r9701r2956
56990B260179q6955p8683o9089o1608n7025n2772m7497m3309m2337m3378m3602
56979A633924m2103m0167l8982l8402l7483l5301l1687k7787k5362k4864k4692
56968A267094k2811j8668j3344q554n731n115n176l851r36J517J763L40j160k315
56954A183053l766n687p626r496j1575j3661j5100j5583j5172j3895j1975j0156
$$ plain form
57026 26932010 25085591 23313786 21625604 20027791 18526145 17123659 15818670 14606459
57018 14606459 13482350 12442265 11481303 10593775 9774844 9020843 8327886 7691391 7107257
57009 7107257 6572492 6084372 5639872 5236196 4871075 4542152 4246461 3980489 3740248
57000 3740248 3521620 3321501 3138601 2972434 2821865 2685490 2562724 2452836 2353135 2260179
56990 2260179 2173224 2094541 2025452 1963844 1906819 1854047 1806550 1763241 1720904 1677526 1633924
56979 1633924 1591821 1551654 1512672 1474270 1436787 1401486 1369799 1342012 1316650 1291786 1267094
56968 1267094 1244283 1225615 1212271 1203717 1197986 1192871 1187695 1183844 1182908 1184425 1186188 1186528 1185368 1183053
56954 1183053 1179287 1173600 1165974 1156478 1144903 1131242 1116142 1100559 1085387 1071492 1059517 1049361
56942A049361q949p883o319m590l314j915Q39M783Q175R844J0398J0758J0589
56929A071777Q898N444Q45m229r249j3599j6754j8629j9444j9392j8701j7738
56917I49229j6905j6572j7011j7880j8008j6545j4409j3580j4504j5362j4587
56906G73866j3030j2550j3285j3780j3283j2313j1086r021o240m178l820m281
56894F56999l838j843J051L888N961O901P017P256Q162R030Q615O630M070K121
56880G22020J069K64j048k829m159m324l783l432k976j055K500N769P144P741
56866G22901R977J4262J8643K1641K3675K5239K5282K2498J7323J1577O513K141
56854I21672j933n738q886j0752j0932r923q882q184o706l282J530O143J0168
$$ plain form
56942 1049361 1040412 1032529 1026210 1021620 1018306 1016391 1017230 1022013 1030188 1040032 1050430 1061188 1071777
56929 1071777 1080675 1086119 1086964 1082735 1073486 1059887 1043133 1024504 1005060 985668 966967 949229
56917 949229 932324 915752 898741 880861 862853 846308 831899 818319 803815 788453 773866
56906 773866 760836 748286 735001 721221 707938 695625 684539 675518 669278 665100 661280 656999
56894 656999 653161 651318 652369 656257 662218 669119 676136 683392 691554 700584 709199 715829 719899 722020
56880 722020 723089 723353 722305 719476 715317 710993 707210 703778 700802 699747 702247 708016 715160 722901
56866 722901 732878 747140 765783 787424 811099 836338 861620 884118 901441 913018 919531 921672
56854 921672 919739 914001 905115 894363 883431 873508 864626 856442 849736 846454 847984 854127 864295
56841H64295J4815K0775K6900L1707L5410L9290M3178M4686M1449L3590K3454
56830A219549J3262L679n380j3410j9334k2496k3190k2269k0673j9088j7636j5826
56818A057188j3172r776o030j982K445O783J0410J3616J7374K1594K4353K3572
56806A146375J9058J2477N651o07o312j1607j6195j9360k0619k0440j9815j9122
56794A049484j8090j6903j6264j5839j3923r735n032k099p92Q45L451N586O103
56781I66792N501M477K698j94l690p244j0857j4024j5326j4343j2966j3418j5437
56768H71969j6851j6603j5782j5697j6206j6380j5851j4988j4363j4341j4776
56757G00131j4865j3921j2320j1198j0945j0753r878q696q000p884q003q370r182
$$ plain form
56841 864295 879110 899885 926785 958492 993902 1033192 1076370 1121056 1162505 1196095 1219549
56830 1219549 1232811 1236490 1231110 1217700 1198366 1175870 1152680 1130411 1109738 1090650 1073014 1057188
56818 1057188 1044016 1034240 1028210 1026228 1028673 1035456 1045866 1059482 1076856 1098450 1122803 1146375
56806 1146375 1165433 1177910 1183561 1182954 1176642 1165035 1148840 1129480 1108861 1088421 1068606 1049484
56794 1049484 1031394 1014491 998227 982388 968465 958730 953698 951599 950807 951652 955103 960689 966792
56781 966792 972293 976770 979468 979274 975584 968340 957483 943459 928133 913790 900824 887406 871969
56768 871969 855118 838515 822733 807036 790830 774450 758599 743611 729248 714907 700131
56757 700131 685266 671345 659025 647827 636882 626129 616251 607555 599555 591671 583668 575298 566116
56744E66116j0085j0444j0239r901r343q064o548o380q263j0615j1212r850q232
56731D46940p382o524m960l608l611m285l904k258j041j458k613k899k113j464
56717C98820j844k824l200k202k61J146P44j119k666k659j774j483j949j973r03
56702C75853L62O97K57k6J05J41j9K91J374K409K451J735J352J858K893M160N799
56685D01692P599Q788R235J0036J2013J4282J5436J5698J6446J7716J7865J6210
56673E63016J4346J3831J3940J3015J1134R744R255Q703P752P323P852Q381Q023
56660F96315P158O475N812M928M538N464P135P972P202N492L922L007K786K983
56646G71189L009K314J095J66k9J3n07j850l707n644p250q088p896o831n430m318
$$ plain form
56744 566116 556031 545587 535348 525447 516104 508040 501492 495112 486849 476234 465022 455172 446940
56731 446940 439558 433034 428074 424466 420855 416570 412666 410408 409367 407909 405296 402397 400284 398820
56717 398820 396976 394152 390952 388750 388489 389635 390379 389260 386594 383935 382161 380678 378729 376756 375853
56702 375853 376215 376912 377169 377143 377248 377389 377370 377661 379035 381444 383895 385630 386982 388840 391733 395893 401692
56685 401692 409291 418079 427314 437350 449363 463645 479081 494779 511225 528941 546806 563016
56673 563016 577362 591193 605133 618148 629282 639026 648281 656984 664736 672059 679911 688292 696315
56660 696315 703473 709948 715760 720688 725226 730690 737825 745797 752999 758491 762413 765420 768206 771189
56646 771189 774198 776512 777607 777773 777744 777757 777250 775400 771693 766049 758799 750711 742815 735984 730554 726236
56630G26236m039m889o660q584r786r839q889p385n808m483l390k215q38L65R94
56615F50790J334K106L302L796K594K98j311j211k28M4r59k410l314l583l785
56600F47463m240m740n070n329n584n532m955m352m588n672o366n466l196q98
56586E81475N04J226J774K115J974J525J331J680K284K610K412K113K542L949
56572F09514N297N068L180J541K097M593O936P655P242O929O932O511N314L961
56558F82770L160K771K091Q66l20q63r02r53r12j11J515K869K822J551K19m66
56542F96107q11j368k243l335m658o075p138p535p551p815q613r626j0328j0526
56528F08485j0591j1090j2093j2943j2856j1717j0120q801q196q413r113r587
$$ plain form
56630 726236 722197 717308 710648 702064 692278 682439 673550 666165 660357 655874 652484 650269 649431 649796 650790
56615 650790 652124 654230 657532 661328 663922 664220 662909 661698 661470 661514 660555 658145 654831 651248 647463
56600 647463 643223 638483 633413 628084 622500 616968 612013 607661 603073 597401 591035 585569 582373 581475
56586 581475 581979 583205 584979 587094 589068 590593 591924 593604 595888 598498 600910 603023 605565 609514
56572 609514 614811 619879 623059 624600 626697 631290 638226 645881 653123 660052 666984 673495 678809 682770
56558 682770 685930 688701 690792 691658 691338 690475 689573 688620 687708 687597 689112 691981 694803 696354 696573 696107
56542 696107 695296 693928 691685 688350 683692 677617 670479 662944 655393 647578 638965 629339 619011 608485
56528 608485 597894 586804 574711 561768 548912 537195 527075 518274 510078 501665 492552 482965
56516D82965r316q572q045p918p711p046o043m974m010l414l282l011j794L7J002
56501D08868K76j303k635l859n429o515n855l917k570k389j874N6K121K404J010
56486C78389k68m59k29k40n5Q91K118K679K403J945J766J607R73j93j328j653
56470C88346q34N87J524J302K05r75j644j553o48P00J618J571J185J448K082J630
56454C96544l29k030j537O87K339K208J316J074J452J595J325J196J451J721J617
56439D10629J130M88J0l0L48P18O39M4p77j343j175k16Q09J018M45o8k91r65k307
56420D09106l173k589j309o09k66Q30K277K264L30j536j461j64K21q74j796r17
56404D00334J275K683J989K47k26J260K710J983j81j067L28K149K615K300K542
$$ plain form
56516 482965 473649 465077 457032 449114 441403 434357 428314 423340 419330 415916 412634 409623 407829 407866 408868
56501 408868 409144 407841 405206 401347 395918 389403 383548 379631 377061 374672 372798 372854 374975 377379 378389
56486 378389 378121 377662 377433 377193 377138 378029 380147 382826 385229 387174 388940 390547 391520 391327 389999 388346
56470 388346 387512 388099 389623 390925 391130 390155 388511 386958 386310 387010 388628 390199 391384 392832 394914 396544
56454 396544 396215 394185 392648 393335 395674 397882 399198 400272 401724 403319 404644 405840 407291 409012 410629
56439 410629 411759 412247 412257 412227 412575 413293 413932 413976 413199 411856 410681 410465 411274 412292 412737 412669 412378 411413 409106
56420 409106 405933 403344 402035 401426 401160 401990 404267 406531 406861 405325 403864 403700 403921 403047 401251 400334
56404 400334 401609 404292 406281 406528 406302 407562 410272 412255 412074 411007 411335 413484 416099 418399 420941
56389D20941L096K833J805J092J181J777K649L326K693M68j350m24K545M257K894
56374D49783N9j783j988j092P18L096M773M793L835L025K255R60p8N30K436L523
56358D74845K639R99L10N22L00r07k125k120q26P70J835K490L239L915L757K598
56342D92241J319P51O82N96P77J818L233L708K888J988K184L120L557L080K494
56327E24436K608L206L444L033K671L073L830L789K659J507J310J648J649J579
56313E60442K398L973M962M671L901L684M094M761N511O044N829M953M279M183
56299F23685L983L307L130M473O858R095J0829J2150J2398J0983R050Q692J0246
56286G28879J1900J2165J1409J0593R921R408R449J0039J0434J0431J0947J2445
$$ plain form
56389 420941 424037 426870 428675 429767 430948 432725 435374 438700 441393 441861 440511 440087 442632 446889 449783
56374 449783 449842 448059 446071 444979 445697 448793 453566 458359 462194 465219 467474 468434 468356 468886 471322 474845
56358 474845 477484 478483 478793 479315 479615 478708 476583 474463 473637 474407 476242 478732 481971 485886 489643 492241
56342 492241 493560 494311 494993 495589 496366 498184 501417 505125 508013 510001 512185 515305 518862 521942 524436
56327 524436 527044 530250 533694 536727 539398 542471 546301 550090 552749 554256 555566 557214 558863 560442
56313 560442 562840 566813 571775 576446 580347 584031 588125 592886 598397 604441 610270 615223 619502 623685
56299 623685 627668 630975 634105 638578 645436 654531 665360 677510 689908 700891 709941 718633 728879
56286 728879 740779 752944 764353 774946 784867 794275 803724 813763 824197 834628 845575 858020
56274H58020J3842J4151J4268J5711J8228K0186K1094K2206K4596K8020L1889
56263A082211L6186M0987M6128N1716N8140O5228P2321P9490Q7574R6564J05082
56252A821627J12256J19051J26660J34337J40057J42772J42886J40895J36906
56243C017447J31202J23916J14120J00644Q4222O7469N2199L7832K3019P739p052
56232C752757k0900l3795m5380n5240o3586p0615p5758p8695q0634q3097q5731
56221C059326q6864q6309q5852q6421q6525q4469q0738p6914p3362o9479o5459
56210B176934o2203n9812n7494n4844n1948m8604m4825m1864m1090m1721m1304
56199A631225l8742l5334l2409k9729k6986k4968k3982k2722k0408j8638j9129
$$ plain form
56274 858020 871862 886013 900281 915992 934220 954406 975500 997706 1022302 1050322 1082211
56263 1082211 1118397 1159384 1205512 1257228 1315368 1380596 1452917 1532407 1619981 1716545 1821627
56252 1821627 1933883 2052934 2179594 2313931 2453988 2596760 2739646 2880541 3017447
56243 3017447 3148649 3272565 3386685 3487329 3571551 3639020 3691219 3729051 3752070 3759809 3752757
56232 3752757 3731857 3698062 3652682 3597442 3533856 3463241 3387483 3308788 3228154 3145057 3059326
56221 3059326 2972462 2886153 2800301 2713880 2627355 2542886 2462148 2385234 2311872 2242393 2176934
56210 2176934 2114731 2054919 1997425 1942581 1890633 1842029 1797204 1755340 1714250 1672529 1631225
56199 1631225 1592483 1557149 1524740 1495011 1468025 1443057 1419075 1396353 1375945 1357307 1338178
56188A338178k0587k0129j7364j4722j3708j3214j2003j0632r830q784o515l729
56176A186961j816r70n09l40p32j139n58J178L394N589P491Q613Q895R467J1487
56161A237011J4317J6228J7020J8484K1845K6118K9878L3519L8633M5801N4151
56150A553005O2908P2195Q2185R2296J01638J09729J16283J20509J21249J18149
56140B550146J12527J06613J01740R7543R3160Q8715Q4876Q1167P5787O7515N7075
56129C516864M6205L6015K6805J8723J1460L587o696j9771l4145m7931o0163p0501
56117C420452p8314q2741q3469q1173p7216p2883o8531o3504n7296n0853m6024
56106B658448m3405m1486l8574l4859l1633k9049k5989k2111j8495j5822j3287
$$ plain form
56188 1338178 1317591 1297462 1280098 1265376 1251668 1238454 1226451 1215819 1205989 1197205 1190690 1186961
56176 1186961 1185145 1184175 1183666 1183326 1182594 1181455 1180897 1182075 1185469 1191058 1198549 1207162 1216057 1225524 1237011
56161 1237011 1251328 1267556 1284576 1303060 1324905 1351023 1380901 1414420 1453053 1498854 1553005
56150 1553005 1615913 1688108 1770293 1862589 1964227 2073956 2190239 2310748 2431997 2550146
56140 2550146 2662673 2769286 2871026 2968569 3061729 3150444 3235320 3316487 3392274 3459789 3516864
56129 3516864 3563069 3599084 3625889 3644612 3656072 3659659 3652963 3633192 3599047 3551116 3490953 3420452
56117 3420452 3342138 3259397 3175928 3094755 3017539 2944656 2876125 2812621 2755325 2704472 2658448
56106 2658448 2615043 2573557 2534983 2500124 2468491 2439442 2413453 2391342 2372847 2357025 2343738
56095B343738j0225p568o365n734l975j261N32Q50J460L739O600Q170Q386Q609
56081B346956R549J0955J2762J5060J7181J8140J8171J8565J9961K1775K3384
56070B532459K4769K5805K6169K6341K7518K9946L2351L3679L4463L5635L6921
56059B866056L7425L7179L7125L7935L9655M2055M4527M6090M6371M6400M7588
56048C328406N0207N3482N6656N9174O0475O0859O2056O5477P0013P3246P4808
56037D014859P6887Q0809Q4907Q6858Q6795Q6682Q7475Q8522Q9311R0268R1660
56026D965033R3065R4446R6837J01168J06860J12300J16590J20269J24238J28558
56016F059364J32668J36445J40522J45620J52114J60250J70014J80499J90308
$$ plain form
56095 2343738 2333513 2325945 2319580 2313846 2309871 2308610 2309142 2309992 2311452 2315191 2321791 2329961 2338347 2346956
56081 2346956 2356505 2367460 2380222 2395282 2412463 2430603 2448774 2467339 2487300 2509075 2532459
56070 2532459 2557228 2583033 2609202 2635543 2663061 2693007 2725358 2759037 2793500 2829135 2866056
56059 2866056 2903481 2940660 2977785 3015720 3055375 3097430 3141957 3188047 3234418 3280818 3328406
56048 3328406 3378613 3432095 3488751 3547925 3608400 3669259 3731315 3796792 3866805 3940051 4014859
56037 4014859 4091746 4172555 4257462 4344320 4431115 4517797 4605272 4693794 4783105 4873373 4965033
56026 4965033 5058098 5152544 5249381 5350549 5457409 5569709 5686299 5806568 5930806 6059364
56016 6059364 6192032 6328477 6468999 6614619 6766733 6926983 7096997 7277496 7467804
56007G467804J99196K08586K19546K31023K41351K51003K62226K75894K90435
55998I647064L04447L18859L35580L55142L76697L99640M24079M50197M78015
55989A3089720N07673N39503N74105O12476O55418P02602P53184Q07753Q68415
55980A9110849R36329J010552J090644J179306J280881J397753J529831J677418
55972B9213563J843397K032739K251069K504010K797584L139740L541961M018920
55964E1342983M586660N263500O074665P055202Q246965R693862J1440184J3526996
55956A17231017J5978038J8777324K1851676K5069054K8252843L1199368L3673347
55949B92032667L5362668L5824656L4517936L0993702K5182775J7577839R139875
$$ plain form
56007 7467804 7667000 7875586 8095132 8326155 8567506 8818509 9080735 9356629 9647064
55998 9647064 9951511 10270370 10605950 10961092 11337789 11737429 12161508 12611705 13089720
55989 13089720 13597393 14136896 14711001 15323477 15978895 16681497 17434681 18242434 19110849
55980 19110849 20047178 21057730 22148374 23327680 24608561 26006314 27536145 29213563
55972 29213563 31056960 33089699 35340768 37844778 40642362 43782102 47324063 51342983
55964 51342983 55929643 61193143 67267808 74323010 82569975 92263837 103704021 117231017
55956 117231017 133209055 151986379 173838055 198907109 227159952 258359320 292032667
55949 292032667 327395335 363219991 397737927 428731629 453914404 471492243 480632118
55942D80632118R58748o116962j1669205j5670240j8317076j9873521k0585703
55935C89358159k0663382k0289021j9624970j8810983j7957896j7142385j6402805
55928B58466717j5738013j5114976j4485969j3807084j3049608j2204298j1281992
55921A62784777j0310312r325408q362782p452523o618197n875409n230126m680034
55913A04929986m218785l839672l537607l310909l161945l093635l102578l174238
55905G7490617l283969l402592l503108l566514l584857l559829l497761l405024
55897D9686963l286911l148997k997828k839487k677489k512378k343828k173530
55889B7706515k005797j845160j693635j550857j416524j291847j178399j076284
$$ plain form
55942 480632118 481590866 475473904 463804699 448134459 429817383 409943862 389358159
55935 389358159 368694777 348405756 328780786 309969803 292011907 274869522 258466717
55928 258466717 242728704 227613728 213127759 199320675 186271067 174066769 162784777
55921 162784777 152474465 143149057 134786275 127333752 120715555 114840146 109610020 104929986
55913 104929986 100711201 96871529 93333922 90023013 86861068 83767433 80664855 77490617
55905 77490617 74206648 70804056 67300948 63734434 60149577 56589748 53091987 49686963
55897 49686963 46400052 43251055 40253227 37413740 34736251 32223873 29880045 27706515
55889 27706515 25700718 23855558 22161923 20611066 19194542 17902695 16724296 15648012
55881A5648012r84060r00207q24250p56324o96021o41990n92780n47683n06355
55872I198342m68007m31842l98279l68697l43423l20843k99275k78936k61039
55863F028001k45563k31046k16389k01716j87589j74462j62829j52748j43182
55854D312477j32984j22773j14611j09449j06059j02965j00098r7772r5225r1428
55844C239113q6648q2023p7953p3887o9527o5315o1957n9980n9461n9492n8368
55833B484502n5144n0821m7222m5015m3586m2447m1713m1330m0980m0679m0493
55822A995072l9678l7294l3836l1116l0105k9929k9355k8224k6839k5065k2880
55811A660751k0872j9299j7499j5149j3321j3026j3377j2685j0972r946j0446
$$ plain form
55881 15648012 14663952 13763745 12939495 12183171 11487150 10845160 10252380 9704697 9198342
55872 9198342 8730335 8298493 7900214 7531517 7188094 6867251 6567976 6289040 6028001
55863 6028001 5782438 5551392 5335003 5133287 4945698 4771236 4608407 4455659 4312477
55854 4312477 4179493 4056720 3942109 3832660 3726601 3623636 3523538 3425766 3330541 3239113
55844 3239113 3152465 3070442 2992489 2918602 2849075 2783760 2721803 2661823 2602362 2542870 2484502
55833 2484502 2429358 2378537 2331315 2286300 2242714 2200267 2158554 2117224 2076244 2035565 1995072
55822 1995072 1955394 1918100 1884264 1853148 1823043 1793114 1763759 1735535 1708696 1683631 1660751
55811 1660751 1639879 1620580 1603081 1587932 1574611 1561585 1548208 1535523 1524551 1514605 1504159
55800A504159j1573j2549j3839j5717j7155j7224j6570j6253j6019j5048j3958
55789A338254j4457j6942j9858k1719k2520k2709k2008k0185j8066j6632j5553
55778A127605j3728j1113q836p537o689n874n706o773q461r530r430q308o287
55765A019333l639j219M19K299O159J1938J7222J9898K0523K1259K3071K4895
55753A162158K5206K3361J9472J3970P615J291m476r488j3475j6360j8848k1881
55741A168545k5226k7453k7801k7349k7597k8414k8343k6696k4406k2697k1648
55730H80915k0628j9668j9745k1511k3944k4677k2131j7378j3401j2227j3104
55719F72501j3785j3188j2092j1504j1214j0373q852p525p314q211r241r277q072
$$ plain form
55800 1504159 1492586 1480037 1466198 1450481 1433326 1416102 1399532 1383279 1367260 1352212 1338254
55789 1338254 1323797 1306855 1286997 1265278 1242758 1220049 1198041 1177856 1159790 1143158 1127605
55778 1127605 1113877 1102764 1093928 1086391 1079702 1073828 1068122 1061349 1052888 1043358 1033928 1025620 1019333
55765 1019333 1015694 1014475 1014894 1017193 1023352 1035290 1052512 1072410 1092933 1114192 1137263 1162158
55753 1162158 1187364 1210725 1230197 1244167 1251782 1253073 1248597 1239109 1225634 1209274 1190426 1168545
55741 1168545 1143319 1115866 1088065 1060716 1033119 1004705 976362 949666 925260 902563 880915
55730 880915 860287 840619 820874 799363 775419 750742 728611 711233 697832 685605 672501
55719 672501 658716 645528 633436 621932 610718 600345 591493 583968 576654 568443 559202 549925 541853
55706E41853o516n832o386p358p514o345m597l756m669o464p255o261m780m439
55692D59681n075n288m778m691n428n581m044j947j236j844j858l74J233J408
55678D20178O58Q21K589M705N571M928L727K817K293J928J612J150J57j239j885
55663D50010n88K236M532M628K845Q48j42m9N73J103J072L80o68j715k505k546
55647D60014j266J027K953L677M252O377R978J3141J4544J4990J6227J9059K3033
55634E88006K7183L0606L2865L4275L5417L6051L5129L2227K8343K4789K1750
55623I26641J8550J4772J0555O180K221j37O1K311M888O482P048O898N752L200
55609A015422j92k992m339n036o882j0799j5794k0025k2760k4891k7385k9765
$$ plain form
55706 541853 535337 529505 523119 515761 508247 501902 497305 493549 488880 482416 475161 468900 464120 459681
55692 459681 454606 449318 444540 439849 434421 428840 424796 422849 421613 419769 417911 417537 418770 420178
55678 420178 420836 421657 424246 428951 434522 439450 443177 445994 448287 450215 451827 452977 453134 451895 450010
55663 450010 449422 451658 456190 460818 463663 464511 464369 464320 464893 465996 467068 467448 466780 465065 462560 460014
55647 460014 458748 459775 462728 466405 470657 477034 487012 500153 514697 529687 545914 564973 588006
55634 588006 615189 645795 678660 712935 748352 784403 819532 851759 880102 904891 926641
55623 926641 945191 959963 970518 976698 978919 978782 978843 981154 986042 992524 999572 1006470 1012222 1015422
55609 1015422 1015230 1012238 1007899 1002863 995981 985182 969388 949363 926603 901712 874327 844562
55597H44562l0774l0235k9404k9276k9258k8118k5861k3909k3362k3778k3877
55586E46710k2948k1140j8914j6815j5507j5117j4650j2960j0512r108r344r445
55574C70250p564m491k787l629n805p646q651r069r144r213r535r637q802p418
55560B66859o777p138p174o018m657m458n317o252o817o814n582k979m49L55k69
55545A96513o12M0Q02Q49L56l24j112j702j677j248r92q49m46k50j149k784l731
55528A81684l651l763m617m974l771j972j214j605k021j912j625j358r39m18k
55513A47842M55J096J488J164O19R22K408M269N434N462M807M741O617J0471J4433
55498B12228J6285J5672J4379J4486J6703K0267K3794K6190K7354K8045K8811
$$ plain form
55597 844562 813788 783553 754149 724873 695615 667497 641636 617727 594365 570587 546710
55586 546710 523762 502622 483708 466893 451386 436269 421619 408659 398147 389039 379695 370250
55574 370250 362686 358195 355408 351779 345974 338328 329677 320608 311464 302251 292716 283079 274277 266859
55560 266859 260082 252944 245770 239752 235095 230637 225320 219068 212251 205437 199855 196876 196427 196782 196513
55545 196513 195901 195941 196743 197592 197948 197624 196512 194810 193133 191885 190893 190044 189598 189348 188199 185415 181684
55528 181684 178033 174270 169653 164679 160908 158936 157722 156117 154096 152184 150559 149201 148262 147844 147842
55513 147842 148297 149393 150881 152045 152664 153586 155994 160263 165697 171159 175966 180707 187324 197795 212228
55498 212228 228513 244185 258564 273050 289753 310020 333814 360004 387358 415403 444214
55487D44214K9150K8130K5530K1777J7100J1592O016J425k214o106j0764j4898
55475E50952j6920j7076j7231j8611k0513k1390k0694j9332j8556j8717j9040
55464C42872j8543j7066j5459j4671j4672j4506j3393j1636j0178r480r204q883
55452A85181q423p798o816n549m456l715k915k052k154l887n964o377n236m837
55438A15002o442q362q271o237m212l219k570j602q26r96j889k516k220j407j229
55423F3004k344l907m331l241j920j374j043k48J26j063k953l486k349j349j697
55408C1825k589k970l046l168k611p32J522K454J561k51j912k876k948k263j279
55393A0717k81Q21J817J907P10q79j572j141l30K91P10R76J134J480K052K099
$$ plain form
55487 444214 473364 501494 527024 548801 565901 577493 583509 584934 582720 576614 565850 550952
55475 550952 534032 516956 499725 481114 460601 439211 418517 399185 380629 361912 342872
55464 342872 324329 307263 291804 277133 262461 247955 234562 222926 212748 203268 194064 185181
55452 185181 176758 168960 162144 156595 152139 148424 145509 143457 141303 137416 131452 125075 119839 115002
55438 115002 108560 100198 91927 85690 81478 78259 75689 74087 73261 72265 70376 67860 65640 64233 63004
55423 63004 60660 56753 52422 49181 47261 45887 44844 44596 44722 43659 40706 37220 34871 33522 31825
55408 31825 29236 26266 23220 20052 17441 16709 18231 20685 22246 21995 20083 17207 14259 11996 10717
55393 10717 10436 11257 13074 14981 15691 14812 13240 12099 11769 12060 12770 13746 14880 16360 18412 20511
55377B0511Q88r60j857j170N2N24J96r8J07N92R24Q58M95M30J319K915L843L011
55359C2580J043k80m2R79J471R11m75k243l637l594j793M95J433N29j123k363
55343B3891k887k645j473J49J038P44K78N48Q30j17j962l012k386p42R61K420
55327A5635L521M086M287M411M055K498O4j840k342j867j088j70N59M18n34j205
55311C0488j019q04j360k064j935j233q72p58L3J593K724K304N32j225j551k60
55295B4593J285J544O92L27J111J847J497P16L79j43j648l103k852j238j33j25
55279B4749j27L14L45k51l92L90J026P91O09J378K215J561o38k918l957l503k064
55262A9528m70N59Q07M08o34k137l086k372m40R24Q67L75M60P16M90K82Q08J642
$$ plain form
55377 20511 21399 20439 18582 17412 17464 17988 18184 18086 18193 18785 19709 20567 21062 21492 22811 25726 29569 32580
55359 32580 33623 33343 33301 34280 35751 36662 36187 33944 30307 26713 24920 25415 26848 27377 26254 23891
55343 23891 21004 18359 16886 17035 18073 18817 19095 19643 20473 20356 18394 15382 12996 12254 13215 15635
55327 15635 19156 23242 27529 31940 35995 38493 38557 36717 34375 32508 31420 31250 31809 32227 31693 30488
55311 30488 29469 28665 27305 25241 23306 22073 21201 20443 20476 22069 24793 27097 27629 26404 24853 24593
55295 24593 25878 27422 28114 28441 29552 31399 32896 33612 33991 33848 32200 29097 26245 25007 24874 24749
55279 24749 24622 24936 25281 25030 24638 25028 26054 26845 27454 28832 31047 32608 31970 29052 25095 21592 19528
55262 19528 19058 19617 20424 20832 20198 18061 14975 12603 12163 13087 13954 14329 14789 15505 15995 16277 17085 18727
55244A8727K006K068K293K196J094m50j294j446j757k319k520k464k761k907j528
55229H938J348L711L922K511J054K35j74l96n41q64j295j140N5J596K270J688
55213B2918N24l61n86k24M01R38J231J266Q79q8j135j167K52K087K817K072O97
55196C2521m42j128j237m87Q84J761J122p10k144j784L10K666L572K352j52k257
55180C4847k737j636M3J322J797J459M38q34j563j224l03K4q48k227k960k683
55164B2915j984j428r77l67M16J318K409L488L776K624N16j191j757j742j923
55149B6093k007j153N58J932K088J350M69l46j118j432q59J98Q35Q45R47J670
55133C0070K547K655J635k9j485k162k109j798j539j231q39o34o42k48Q90J940
$$ plain form
55244 18727 20733 22801 25094 27290 28384 27934 26640 25194 23437 21118 18598 16134 13373 10466 8938
55229 8938 10286 13997 17919 20430 21484 21719 21545 21149 20608 19744 18449 17309 17364 18960 21230 22918
55213 22918 23442 23081 22495 22271 22672 23610 24841 26107 26986 26898 25763 24596 24848 26935 29752 31824 32521
55196 32521 32079 30951 29714 29227 30111 31872 32994 32284 30140 28356 28666 31332 34904 37256 37104 34847
55180 34847 32110 30474 30517 31839 33636 35095 35533 34699 33136 31912 31609 31633 30785 28558 25598 22915
55164 22915 20931 19503 18526 18159 18575 19893 22302 25790 29566 32190 32706 31515 29758 28016 26093
55149 26093 24086 22933 23491 25423 27511 28861 29330 28984 27866 26434 25575 25773 26608 27453 28400 30070
55133 30070 32617 35272 36907 36878 35393 33231 31122 29324 27785 26554 25715 25081 24439 24191 25081 27021
55117B7021J884J171J205K084K244Q54p96j170o24m27n45R6J529K445K043R89
55101D0003L22M07J144K221K846K151L49j258j789j626j417j024j29P93Q92M8
55085D3933j001j448q28R28L119M128K685m21k604k018N14K528K562J229j52j055
55069E2099j574j528o28P31J656J737J219K42j199k459k440j097J83M00K28O46
55053D8216J185Q55J12K54J046O72j472l538l477j525N52J704K078J837P33j037
55037D8195k430k446j151L88J220J420J696K215K319J720J257J690K309J797K32
55022F0431j023j291j133q69j45P44P00l04p35J45R83N97O2Q32K078J884L81n23
55004F2814k06M5m81q32l13L21K59k18p69j758l050l321j752M81J585J465J551
$$ plain form
55117 27021 28905 30076 31281 33365 35609 36463 35667 34497 33873 33446 32901 32997 34526 36971 39014 40003
55101 40003 40325 40732 41876 44097 46943 49094 49443 48185 46396 44770 43353 42329 42200 42993 43885 43933
55085 43933 42932 41484 40656 41584 44703 48831 51516 51095 48491 46473 46987 49515 52077 53306 53154 52099
55069 52099 50525 48997 48369 49100 50756 52493 53712 53954 52755 50296 47856 46759 46942 47342 47570 48216
55053 48216 49401 50256 50368 50622 51668 52340 50868 47330 43853 42328 42880 44584 46662 48499 49232 48195
55037 48195 45765 43319 42168 42556 43776 45196 46892 49107 51426 53146 54403 56093 58402 60199 60431
55022 60431 59408 58117 56984 56115 55970 56714 57414 57110 56375 56520 57503 58100 58162 58994 61072 62956 63337 62814
55004 62814 62608 62653 62172 61340 61027 61348 61607 61389 60620 58862 55812 52491 50739 51220 52805 54270 55821
54987E5821K549L450K917J008p99j137k04M53k04j333j367l34N7j063k217j473
54971E6124R85L048L174J749J03r42j396j566j614j550j387j241j169j077r27
54956E2314q42p03K9J471K597K225P35k24O4N85L30k77l44J46Q63J999L513M325
54938F8806L558K113J723K709L896M568N250O508Q041R215R577Q814P070N267
54924A47115M174L230J401p91j555n50J92j128l644n098m740l844l766m554n312
54909A21130n199m106k771k118k245k445k424k779l722m157l036j120j24k66R9
54894H4717K130M774N944M898K900J900K892N324P710Q846Q602P611O377M958
54880A59583L355J727J08j705l754n611o663o678o040n504n643o311o689o076
$$ plain form
54987 55821 58370 61820 64737 65745 64946 63809 63605 64058 63854 62521 61154 60820 60877 59814 57597 56124
54971 56124 57109 60157 63331 65080 65183 64241 62845 61279 59665 58115 56728 55487 54318 53241 52314
54956 52314 51472 50769 50798 52269 54866 57091 57826 57602 57666 58251 58581 58304 57960 58106 58969 60968 64481 68806
54938 68806 72364 74477 76200 78909 82805 87373 92623 99131 107172 116387 125964 134778 141848 147115
54924 147115 151289 154519 155920 155129 153574 153024 153216 152088 148444 143346 138606 134762 130996 126442 121130
54909 121130 115931 111825 109054 106936 104691 102246 99822 97043 93321 89164 86128 85008 84884 84618 84717
54894 84717 86847 91621 97565 102463 105363 107263 110155 115479 123189 132035 140637 148248 154625 159583
54880 159583 162938 164665 164773 163068 159314 153703 147040 140362 134322 128818 123175 116864 110175 104099
54866A04099m632l075j806p22N9n8j274k634k857j877r50r49j129k09J641K759
54850H6386K106N15o74j496k845m471m838l260j071j6k19n63m83m66r51j563j561
54833F4530o04Q38J617P72j288k870k841j982j744k114j802l79R89J228O04j05
54817E4849o88j132j006j36P32Q04N01R33K320L630L834K899J466O8j104j978
54801F5992k476k568k339j903j266l87N04R12P57Q12J820L245L757L104K566L068
54785G5598L743L308K189K088L611N426N966N161M178M087N071O596P935Q678
54771A43635Q784Q212O736M448K123O02j8j97k43l65j063k630m367n163m910m521
54755A51063m425m094l335k989l573m142l521k098j372j929k857l176k865k263
$$ plain form
54866 104099 99467 96392 94586 93864 93923 93865 92591 89957 87100 85223 84273 83324 82195 81986 83627 86386
54850 86386 88492 89007 88333 86837 83992 79521 74683 71423 70352 70336 70117 69554 69071 68605 67654 66091 64530
54833 64530 63926 64764 66381 67153 65865 62995 60154 58172 56428 54314 52512 52133 53122 54350 54954 54849
54817 54849 54161 53029 52023 51887 52619 53423 53924 54857 57177 60807 64641 67540 69006 69074 67970 65992
54801 65992 63516 60948 58609 56706 55440 55053 55557 56469 57226 58038 59858 63103 66860 69964 72530 75598
54785 75598 79341 82649 84838 86926 90537 95963 101929 107090 111268 115355 120426 127022 134957 143635
54771 143635 152419 160631 167367 171815 173938 174540 174522 174325 174082 173717 172654 170024 165657 160494 155584 151063
54755 151063 146638 142544 139209 136220 132647 128505 124984 122886 121514 119585 116728 113552 110687 108424
54741A08424j276K78K024L265L752L882M134M555M900N187N869P196Q386P927
54727A68503N209J628n37n12J65m67k551m566n385n399n380n083l748j723n88
54712A39566j285k826l491k949k398k804l814m594m923n019m820m116l103k215
54698I1209j557j013p72j145j870k120j506o10k86o25r58p54k73j67n18m81P11
54681G7265K447K954J323j069j918p32O10K34j566l035l071j816K21K541M180
54666G8568M068K346N99K14R47J593J570J340J529K299L378M182M082L084K081
54651A11880J904K280K364K086K047K147J446k67j831k275k140k337k533j837
54637A12934n83n9o06j276j515j899k715l040k141r36r27k085k793j953k62P96
$$ plain form
54741 108424 107148 107426 109450 112715 116467 120349 124483 129038 133938 139125 144994 152190 160576 168503
54727 168503 173712 175340 174803 174291 174456 173989 171438 166872 161487 156088 150708 145625 141877 140154 139566
54712 139566 138281 135455 131964 129015 126617 123813 119999 115405 110482 105463 100643 96527 93424 91209
54698 91209 89652 88639 87867 86722 84852 82732 81226 80616 80330 79705 78747 77993 77720 77553 77035 76554 77265
54681 77265 79712 82666 83989 82920 81002 80270 80880 81114 79548 76513 73442 71626 71847 74388 78568
54666 78568 82636 84982 85581 85795 86742 88335 89905 91245 92774 95073 98451 102633 106715 109799 111880
54651 111880 113784 116064 118428 120514 122561 124708 126154 125887 124056 121781 119641 117304 114771 112934
54637 112934 112351 112292 111686 110410 108895 106996 104281 101241 99100 98164 97237 95152 92359 90406 90144 90940
54621I0940O83Q4j83r9j73m97m46M44J491J377j53j635j469N0R41j77k516m135
54603H4527l991k630j126j1O58Q89P74O49O77N18r5o02k13P42R63Q4n38L64J978
54584H3617K290O14j697k932k483p68J326K687K565J298k0o84p35m15o2l35j424
54567H2842k208j461N0K17j297k368j522lN97R09K206L581L042Q29p10m33M88
54550H4759R13J206J804K121J721J225J231J368J178R54J036J131J006R73J105
54535A03731R00L01J11O63J074O78K01M07M44j023l413m478k977j00J984K168
54519A00671R02o36j577j984k586l734m766m687l165o09K194M083L908J798m55
54504H9357j214q82r70j659j597j58J505J980J214J19m57OJ454K733K354N08o75
$$ plain form
54621 90940 91623 91707 91524 91425 91252 90755 90309 90753 92244 93621 93468 91833 90364 90414 91355 91178 88662 84527
54603 84527 80536 77906 76780 76769 77427 78316 79090 79739 80416 80934 80839 80237 80024 80766 81729 81813 81275 81639 83617
54584 83617 85907 86521 84824 81892 79409 78641 79967 82654 85219 86517 86497 85813 85078 84663 84601 84266 82842
54567 82842 80634 79173 79223 79440 78143 75775 74253 74250 74847 75756 77962 81543 84585 85414 84704 84271 84759
54550 84759 85672 86878 88682 90803 92524 93749 94980 96348 97526 98480 99516 100647 101653 102626 103731
54535 103731 104631 104932 105043 105706 106780 107458 107659 108066 108510 107487 104074 99596 96619 96519 98503 100671
54519 100671 101573 100937 99360 97376 94790 91056 86290 81603 78438 77829 80023 84106 88014 89812 89357
54504 89357 88143 87261 86291 84632 83035 82877 84382 86362 87576 87695 87238 87244 88698 91431 93785 94293 93618
54487I3618J41J481J088o89j244N91K908L370K131J171J588K700L405L222J987
54472A17468l14k941m321l389r06J132J387K69q55j098o05j2L02M60Q07J435J953
54455A10772J805Q55m18j375j731j577j023j09J041K081K540J986M35j269j816
54440A12197p67O22N66j165k970l397k633j618m97J088K706L287K574J421N28
54425A11942k13q51j014p70r17j636j823p35N66O58P7O86K813M577M389K764J134
54408A21647R9m78n99l66l45p98j088n66L68Q65P70M20j86j150j982k068j646
54391A12897j404j301p04M54J489J909J754J079p4j221j812k023k334k409j463
54376A04837K58J475J641J615K094K496K040J065M51L40J88k84q03r34l87P89
$$ plain form
54487 93618 93759 95240 96328 95639 94395 94986 97894 101264 103395 104566 106154 108854 112259 115481 117468
54472 117468 117154 114213 109892 106503 105597 106729 108116 108385 107530 106432 105827 105815 106117 106577 107384 108819 110772
54455 110772 112577 113432 113014 111639 109908 108331 107308 107199 108240 110321 112861 114847 115282 114013 112197
54440 112197 111430 112052 112618 111453 108483 105086 102453 100835 100338 101426 104132 107419 109993 111414 111942
54425 111942 111729 110878 109864 109094 108177 106541 104718 103983 104549 105207 105284 105970 108783 113360 117749 120513 121647
54408 121647 121746 121268 120669 120303 119958 119160 118072 117506 117874 118739 119509 119929 119743 118593 116611 114543 112897
54391 112897 111493 110192 109488 109942 111431 113340 115094 116173 116099 114878 113066 111043 108709 106300 104837
54376 104837 105095 106570 108211 109826 111920 114416 116456 117521 117972 118312 118500 118216 117413 116479 116092 116881
54360A16881K018K556K251J538O57m22j254j024K82J657K368K596K439J460j23
54345A33880j010n74Nn52j709k186k067k283k582j778O7J362J109rr64j495j569
54328A17645r26J80P69L79j65J03Q76R71r9j572k387k293j861j559j148l16L83
54311A08980k9j338j925q62N50L10j618l273l133j506L85J693K220K314K584L025
54295A08377K595N33k044l010j791kO24o0j122j667j251j69M51p0n74O59L005
54278A04484L593J131j995k685r19R09J435J396J737K332K670K590K140J497J089
54263A21404J076Q42l38k131l305k996j387P04K342K828K178J106J33r50k260
54248A19246k967k214n88L66J28k69J55J027J340P97K8j89M06J366J825J190l78
$$ plain form
54360 116881 118899 121455 123706 125244 125901 125479 124225 123201 123483 125140 127508 130104 132543 134003 133880
54345 133880 132870 132296 132301 131749 130040 127854 125787 123504 120922 119144 119211 120573 121682 121673 120709 119214 117645
54328 117645 116719 116899 117668 118047 117882 117985 118861 119832 119733 118161 115774 113481 111620 110061 108913 108597 108980
54311 108980 108951 107613 105688 104826 105376 105686 104068 100795 97662 96156 96541 98234 100454 102768 105352 108377
54295 108377 110972 111505 109461 106451 104660 104658 105282 105222 104100 102433 101182 101013 101464 101394 100820 101479 104484
54278 104484 108077 109208 107213 104528 103609 104518 105953 107349 109086 111418 114088 116678 118818 120315 121404
54263 121404 122480 123322 122984 120853 117548 114552 113165 113869 116211 119039 121217 122323 122456 121506 119246
54248 119246 116279 114065 113477 113843 113971 113702 113857 114884 116224 117021 117049 116860 117266 118632 120457 121647 121269
54231A21269k257l984n254n533m332k077j53K89n84j597j813j331r19j040j330
54216H9354j042L6J306J985J877J454J335J730K126J603j81k280l213k535j227
54201I2328l96j04J89O75J179J671K191K533K500K225J892J391O78J84L44R48
54185A10428J326J074L50l81n99j49L38p0j356k288j924r02n68j257k101k263
54169I9658j774j206j068j350j415o44N60J040M71j00J42N51K81j00N19J915K781
54152A00261K534J667O26n24j471j871k029k336k280j191K66O76j77j234j800
54137I1117j876j106P75K441J917m35j881r62O76J072O90R06J361P79m60n56J107
54120I5565L098L702K561N62j074j574j107m32J26Q70J719J795P28n36r82r12
$$ plain form
54231 121269 119012 115028 109774 104241 99909 97832 97679 97968 97384 95787 93974 92643 91724 90684 89354
54216 89354 88312 88348 89654 91639 93516 94970 96305 98035 100161 101764 101583 99303 96090 93555 92328
54201 92328 91932 91828 92017 92692 93871 95542 97733 100266 102766 104991 106883 108274 108952 109136 109480 110428
54185 110428 111754 112828 113178 112797 112198 112049 112387 112317 110961 108673 106749 105847 105279 104022 101921 99658
54169 99658 97884 96678 95610 94260 92845 92201 92761 93801 94272 94172 94314 94865 95146 95046 95565 97480 100261
54152 100261 102795 104462 105088 104564 103093 101222 99193 96857 94577 93386 93652 94328 94151 92917 91117
54137 91117 89241 88135 88910 91351 93268 92833 90952 89990 90666 91738 92428 93334 94695 95474 95014 94458 95565
54120 95565 98663 102365 104926 105488 104414 102840 101733 101301 101427 102297 104016 105811 106539 106003 105021 104109
54104A04109j131j372o33J104K618K800J729M21M4J047K578L059J862L3r62p06
54088A16600K87J389J933J401L17J45J322K189J034j392k743j932N2J768K522
54073A24892K338K008K816M816N781L523r24m096m153k361m75J283K923L436K302
54058A44109Q22N11J086J372J347J860K851L365L185L121L651M341M780N190N808
54043A87399O426O863P278P683P582O694N783O137Q020R893R703P074L887K374
54029B82796K788L451L003J935J598K258K789K116M45j093j708j657j758k376
54015B94587l114l512l766m391n341n975o062o220o919p396o292l535r75n54k093
54000B28442l521l395k448k234k932l402l044k469k267k207k094k293k821k838
$$ plain form
54104 104109 102978 101606 100973 102077 104695 107495 109224 109645 109689 110736 113314 116373 118235 118268 117306 116600
54088 116600 116887 118276 120209 121610 121927 122072 123394 125583 126617 125225 122482 120550 120602 122370 124892
54073 124892 127230 129238 132054 136870 142651 146174 145250 141154 137001 134640 134165 135448 138371 141807 144109
54058 144109 144931 145442 146528 147900 149247 151107 153958 157323 160508 163629 167280 171621 176401 181591 187399
54043 187399 193825 200688 207966 215649 223231 229925 235708 241845 249865 259758 269461 276535 280422 282796
54029 282796 285584 289035 292038 293973 295571 297829 300618 302734 303179 302086 300378 298721 296963 294587
54015 294587 291473 287961 284195 279804 274463 268488 262426 256206 249287 241891 235599 232064 231089 230535 228442
54000 228442 224921 221526 219078 216844 213912 210510 207466 204997 202730 200523 198429 196136 193315 190477
53986A90477j913r63j032j765k067j710j221p00N0N04j29j587k758l116k872j966
53970A67232k76J344J769J401J667K503K154N1j812j466M56J899K019J512J230
53955A81683J582K579L400K818R52k10P57K678L457K943K657L282M101M616N057
53940B22352N346N153N065O150Q004Q744P552N866N386N992O567O924P770R250
53926C16121J0555J0894J0230R096Q175P973Q512R289R713R495Q632P246N674
53913D31605M470M024M141M061L045J073r44j897j667j315j870l171m262m643
53899D32650m546m315m192m620n905p412p834o682m989m215m824o175p383p850
53885C51708p420o469n732n675o111o513o597o413o110n886n990o480o933o668
$$ plain form
53986 190477 188564 187601 186569 184804 182737 181027 179806 179106 179156 179660 179531 177944 175186 172070 169198 167232
53970 167232 166956 168300 170069 171470 173137 175640 177794 177845 176033 174567 175023 176922 178941 180453 181683
53955 181683 183265 185844 189244 192062 193014 192804 193561 196239 199696 202639 205296 208578 212679 217295 222352
53940 222352 227698 232851 237916 244066 252070 260814 268366 274232 279618 285610 292177 299101 306871 316121
53926 316121 326676 337570 347800 356896 365071 373044 381556 390845 400558 410053 418685 425931 431605
53913 431605 436075 440099 444240 448301 451346 452419 451475 449578 447911 446596 444726 441555 437293 432650
53899 432650 428104 423789 419597 414977 409072 401660 393826 387144 382155 377940 373116 366941 359558 351708
53885 351708 344288 337819 332087 326412 320301 313788 307191 300778 294668 288782 282792 276312 269379 262711
53871B62711n384l616k344k081k366k456k409l051m623o026n964m527l082k649
53857B12133l012l314l037k260j447j054j031p87j0O28J81j261k644l287l396
53842A86402l190k472j366o05n86p55n63l70p23j293j368j034r53j082n44R63
53826A70461K448K763J986J217J185J590J767J603J594K198L406M803N775N724
53812B08520M605L403L545N322P224P455O008M601M569N494O036N508M283L103
53798B79676K421K297K610L251L975M183L350J946J300J863K208P56j911l822
53784C04103m434n065o289o847n960m991n360o192n763m280l367l357l062k079
53770B37057j409j541j705j518j796k939l828l359k115j525k010k801l081k531
$$ plain form
53871 262711 257327 253711 251367 249286 246920 244464 242055 239004 234381 228355 222391 217864 214782 212133
53857 212133 209121 205807 202770 200510 199063 198009 196978 196191 196181 196809 196990 195729 193085 189798 186402
53842 186402 183212 180740 179374 178769 178183 177428 176865 176495 175772 174479 173111 172077 171124 170042 169498 170461
53826 170461 172909 175672 177658 178875 180060 181650 183417 185020 186614 188812 192218 197021 202796 208520
53812 208520 213125 216528 220073 225395 232619 240074 246082 250683 255252 260746 266782 272290 276573 279676
53798 279676 282097 284394 287004 290255 294230 298413 301763 303709 305009 306872 309080 309836 307925 304103
53784 304103 299669 294604 288315 281468 275508 270517 265157 258965 253202 248922 245555 242198 239136 237057
53770 237057 235648 234107 232402 230884 229088 226149 222321 218962 216847 215322 213312 210511 207430 204899
53756B04899j242J10M16p88k548l472l265k713k407k199j792j249p98o47r54j556
53740A79795j806j205j88K65j10m98j35P31J351J526J655J803J397N2j556k108
53724A80969r58J168K901L493L186K577K025J670J572J484R39q5q01m47O02J173
53708B01468Q83P15J623L067L606K802J823J990L352M929N854N852N004L734K845
53693B49547K852L214K826J508M09N54J538K186K145K044K189J872M41j511k575
53678B69239k086q25q9l50j053j385r15L90K208L699L901K776J478R99Q63j9j427
53661B77404j908j000p4l28r82n14J020K142K074J393P14o3r39j307q18k8K40
53644B77026k46j070j505q73P39K070J893P85P41K507M318M086J980o1p73l52
$$ plain form
53756 204899 203657 203767 204183 203395 200847 197375 194110 191397 188990 186791 184999 183750 182952 182305 181351 179795
53740 179795 177989 176784 176596 176861 176751 176253 176118 176849 178200 179726 181381 183184 184581 184633 183077 180969
53724 180969 180011 181179 184080 187573 190759 193336 195361 197031 198603 200087 201026 200941 200140 199693 200295 201468
53708 201468 202351 203066 204689 207756 211362 214164 215987 217977 221329 226258 232112 237964 242968 246702 249547
53693 249547 252399 255613 258439 259947 260356 260910 262448 264634 266779 268823 271012 272884 273325 271814 269239
53678 269239 267153 266328 266239 265889 264836 263451 262536 262926 265134 268833 272734 275510 276988 277987 278850 278831 277404
53661 277404 275496 274496 274422 274094 273112 272598 273618 275760 277834 279227 279941 279878 278939 277632 276814 276786 277026
53644 277026 276780 275710 274205 273332 274071 276141 278034 278819 279560 282067 286385 290471 292451 292390 291617 291265
53628B91265P37K309L707L804K471J213J512K923L681L063K228K403L029K674
53614C27019J518J554L862O705P498O059M569M478M928M634L877L754M410N074
53600C89939N314N306N224N089M908M415L166J486O80J444K593K384P47p76j022
53585D30897r4J412K843L208J754q69k979l605l106k098q32K73O57O08J047J922
53569D31038J966O87n63l92O86J139N08m54j200j810k262k163j332m9J175J808
53553D28782J643J323J915L387M253L381J528K18k39m46k73R60K777L649L180
53538D56038K923M399P180R533J0265R459Q011O959O909P702Q849J0285J2203
53525E60715J4154J5093J4650J3703J3383J4020J5252J6533J7292J7298J7221
$$ plain form
53628 291265 292002 294311 298018 301822 304293 305506 307018 309941 313622 316685 318913 321316 324345 327019
53614 327019 328537 330091 333953 340658 348156 354215 358784 363262 368190 372824 376701 380455 384865 389939
53600 389939 395253 400559 405783 410872 415780 420195 423361 424847 425527 426971 429564 431948 432695 431919 430897
53585 430897 430803 432215 435058 438266 440020 439151 436172 432567 429461 427363 426531 426804 427461 428069 429116 431038
53569 431038 433004 433691 433128 432736 433422 434561 435069 434615 433415 431605 429343 427180 425848 425799 426974 428782
53553 428782 430425 431748 433663 437050 441303 444684 446212 446430 446191 445745 445472 446432 449209 452858 456038
53538 456038 458961 463360 470540 480073 490338 499797 507808 514767 521676 529378 538227 548512 560715
53525 560715 574869 589962 604612 618315 631698 645718 660970 677503 694795 712093 729314
53514G29314J8058J9622K0505K0132J9971K1775K5198K8201K9486K9515K9358
53503I91135K9514K9954L0578L1264L1935L2560L2844L2206L0660K9400K9713
53492A331763L1312L2573L2561L2049L2287L3329L4058L3493L1750K9807K8489
53481A683471K7652K6546K5214K4954K6702K9157K9585K6784K2474J9333J8210
53470A960082J7791J6452J3828J0743Q116O027L801J006j866m069n679p286q788
53457B010158r468r488j0271j2732j5972j8511k0085k1402k2644k3270k3103k2686
53445A800526k2607k3076k3967k4636k4064k1977j9617j8468j8431j8177j7070
53434A568436j5599j4022j1974r773q627q835q796o799l052Q54L706N100M914
$$ plain form
53514 729314 747372 766994 787499 807631 827602 849377 874575 902776 932262 961777 991135
53503 991135 1020649 1050603 1081181 1112445 1144380 1176940 1209784 1241990 1272650 1302050 1331763
53492 1331763 1363075 1395648 1428209 1460258 1492545 1525874 1559932 1593425 1625175 1654982 1683471
53481 1683471 1711123 1737669 1762883 1787837 1814539 1843696 1873281 1900065 1922539 1941872 1960082
53470 1960082 1977873 1994325 2008153 2018896 2027012 2033039 2036840 2037846 2035980 2031911 2026232 2018946 2010158
53457 2010158 2000690 1991202 1980931 1968199 1952227 1933716 1913631 1892229 1869585 1846315 1823212 1800526
53445 1800526 1777919 1754843 1730876 1706240 1682176 1660199 1640582 1622114 1603683 1585506 1568436
53434 1568436 1552837 1538815 1526841 1517068 1508441 1499606 1490810 1484011 1480959 1481813 1485519 1490619 1495533
53421A495533L587K577L273N382P345Q358R254J1293J4807J9164K3381K6547K8272
53408A658773K9055K9937L1557L3744L5944L7773L9269M0975M3582M7039N0309
53397B077957N2695N5178N9355O4955O9567P1341P1027P0615P0857P1054P0777
53386B805378P0546P0868P1549P2157P2556P2687P2262P0864O8176O4129N9266
53375C570438N4739N1345M8513M4867L9930L4641K9887K5277J9894J3685P328
53364C940544R53o125j4236k2549k9728l5023l8578m1106m3477m6139m8610m9908
53352C566018m9936n0026n1443n3616n4715n4045n2954n3077n4496n6178n7462
53341B978070n8224n8014n6228n3166n0057m7840m6532m5861m5631m5211m3633
$$ plain form
53421 1495533 1499120 1501697 1504970 1510352 1517697 1526055 1535309 1546602 1561409 1580573 1603954 1630501 1658773
53408 1658773 1687828 1717765 1749322 1783066 1819010 1856783 1896052 1937027 1980609 2027648 2077957
53397 2077957 2130652 2185830 2245185 2310140 2379707 2451048 2522075 2592690 2663547 2734601 2805378
53386 2805378 2875924 2946792 3018341 3090498 3163054 3235741 3308003 3378867 3447043 3511172 3570438
53375 3570438 3625177 3676522 3725035 3769902 3809832 3844473 3874360 3899637 3919531 3933216 3940544
53364 3940544 3941497 3935372 3921136 3898587 3868859 3833836 3795258 3754152 3710675 3664536 3615926 3566018
53352 3566018 3516082 3466056 3414613 3360997 3306282 3252237 3199283 3146206 3091710 3035532 2978070
53341 2978070 2919846 2861832 2805604 2752438 2702381 2654541 2608009 2562148 2516517 2471306 2427673
53330B427673m0763l7800l5922l5026l4402l4015l4097l3965l2534l0125k8455
53319B050569k8408k8714k7632k5198k2994k2072k2014k1821k0841j8660j5129
53308A797086j1134q624q862j0619j0967q352m339j720j221q41J500N591R640
53295A747138J2614J4975J7356J9524K1034K2151K3615K5716K8038K9899L0784
53284A992844L0520K9412K8162K7301K6663K5628K3858K1564J9126J6689J4171
53273B255938J1427Q376N172K303K25j271l059n745q952j1874j4367j6972j9885
53260B201316k2403k3800k4342k4988k6298k8041k9744l1186l2288l2957l3117
53249A892152l2669l1536l0132k9544l0501l2043l2190l0365k8441k8661l1058
$$ plain form
53330 2427673 2386910 2349110 2313188 2278162 2243760 2209745 2175648 2141683 2109149 2079024 2050569
53319 2050569 2022161 1993447 1965815 1940617 1917623 1895551 1873537 1851716 1830875 1812215 1797086
53308 1797086 1785952 1777328 1768466 1757847 1746880 1738528 1734189 1732469 1731248 1730407 1731907 1737498 1747138
53295 1747138 1759752 1774727 1792083 1811607 1832641 1854792 1878407 1904123 1932161 1962060 1992844
53284 1992844 2023364 2052776 2080938 2108239 2134902 2160530 2184388 2205952 2225078 2241767 2255938
53273 2255938 2267365 2275741 2280913 2283216 2283441 2282170 2279111 2273366 2264414 2252540 2238173 2221201 2201316
53260 2201316 2178913 2155113 2130771 2105783 2079485 2051444 2021700 1990514 1958226 1925269 1892152
53249 1892152 1859483 1827947 1797815 1768271 1737770 1705727 1673537 1643172 1614731 1586070 1555012
53238A555012l3691l4983l4800l3569l1540k9191k7334k6269k5433k4359k3420
53227A230423k3077k2831k1757j9976j8887j9605k1518k2845k2567k1451k0935
53216I94974k1258k1311k0361j9239j9342k0891k2754k3698k3314k1939k0329
53205G60538j9209j8581j7700j6318j5536j6406j8145j8951j8534j8269j8662
53194E64227j8302j6107j3197j1395j0945j0882j0803j0960j1089j0491r115p735
53182D23206p052p245q040q681q353p303o808p375p830p171o222o185o423n471
53168C23047l642k682l010l277k677j846j207l59M16m8j658k553j702m85n33j430
53152B96354j928k166l114m668n852o344o446n946m440k480j182p07j64R90K255
$$ plain form
53238 1555012 1521321 1486338 1451538 1417969 1386429 1357238 1329904 1303635 1278202 1253843 1230423
53227 1230423 1207346 1184515 1162758 1142782 1123895 1104290 1082772 1059927 1037360 1015909 994974
53216 994974 973716 952405 932044 912805 893463 872572 849818 826120 802806 780867 760538
53205 760538 741329 722748 705048 688730 673194 656788 638643 619692 601158 582889 564227
53194 564227 545925 529818 516621 505226 494281 483399 472596 461636 450547 440056 430941 423206
53182 423206 416154 408909 400869 392188 383835 376532 369724 362349 354519 347348 341126 334941 328518 323047
53168 323047 319405 316723 313713 310436 307759 305913 304706 304347 304763 304715 303057 300504 298802 298317 297784 296354
53152 296354 294426 292260 289146 284478 278626 272282 265836 259890 255450 252970 251788 251081 250917 251907 254162
53137B54162K829K380J130k84j169j341j154p64n4N53J52j096j617n95N18o8j841
53120B51741k802k332j612j511j691j730j662j303m79J19k94r29j95J604K139
53105B39063K02k585m057m038l570k980k011j019o10n64j77O45J399J707J303
53090B22708j23k287l873l673k000l23K81j65j005j497j258p32q63j774k326j677
53074A99413o60n52r91m20J453K981K769J432N35O74J300J925K518K842K275N75
53058B18069j514k861l005k413j746j180o20k38l10o88q96q19q42j073r70q5J186
53041A99995J974J877J138K53l69m58j05K81M48O11J032J490J493R05M7o55r26
53024B09031o85j14M50Q33J054R44K52p07j014k69O61P37K68N76K201M109M894
$$ plain form
53137 254162 256991 259371 260501 260217 259048 257707 256553 255789 255735 256288 256440 255344 253727 253132 253650 253582 251741
53120 251741 248939 246607 244995 243484 241793 240063 238401 237098 236619 236738 236444 235515 235320 236924 239063
53105 239063 239265 236680 232623 228585 225015 222035 220024 219005 218395 217831 217654 218299 219698 221405 222708
53090 222708 222585 220298 216425 212752 210752 210429 210710 210545 209540 208043 206785 206053 205190 203416 201090 199413
53074 199413 198753 198201 197210 196790 198243 201224 203993 205425 205960 206634 207934 209859 212377 215219 217494 218069
53058 218069 216555 213694 210689 208276 206530 205350 204730 204492 204182 203494 202598 201779 200937 199864 198894 198809 199995
53041 199995 201969 203846 204984 205237 204868 204410 204305 204586 205034 205645 206677 208167 209660 210565 210612 209957 209031
53024 209031 208346 208232 208682 209515 210569 211513 211765 211058 210044 209775 210436 211173 211441 212017 214218 218327 223221
53007B23221M253K933J657N19n71j218p93N18J486J210M48O82J851K272J121k18
52991B39371j89P04J012P66J131K045K085Q94L0P47K252K962K513J663R82N82
52975B59550O37J259K012K241J784J013K51n37j491k447k713j591M38J440j18
52960B61728l139m688l346p38Q80J314J652J845P73j496l069k377lK044K359J135
52944B54874l18p56o9O81N39k9L03J792K944K242N4j782k096j422r42r63r85q17
52926B53250r25j503j904j506p66p00j440k108k124j852j627j051J88J465J924
52911B39321J588J004K29r13j795j368J80J110j1k556m448m303k611r31k29j44
52895B24123J39O72Q60O46P56J351J422K69j100j190j86L95l8o41q86j249j775
$$ plain form
53007 223221 227474 230407 232064 232583 232012 230794 230001 230519 232005 233215 233663 234345 236196 238468 239589 239371
52991 239371 239182 239886 240898 241664 242795 244840 246925 247819 247849 248596 250848 253810 256323 257986 258968 259550
52975 259550 260187 261446 263458 265699 267483 268496 268747 268210 266719 264272 261559 259968 260406 261846 261728
52960 261728 258589 253901 250555 249817 250697 252011 253663 255508 256281 254785 251716 249339 249336 251380 253739 254874
52944 254874 254556 253800 253731 254412 254951 254922 255225 257017 259961 262203 262257 260475 258379 256957 256015 255052 254067 253250
52926 253250 252325 250822 248918 247412 246646 245946 244506 242398 240274 238422 236795 235744 235932 237397 239321
52911 239321 240909 241913 242142 241229 239434 238066 238246 239356 239345 236789 232341 228038 225427 224496 224267 224123
52895 224123 224262 224934 225794 226440 227196 228547 229969 230238 229138 227948 227762 228157 228119 227478 226592 225343 223568
52878B23568j500r5J262J538J318J556J938J716J240J258J346N91n77q12PN18
52862B34872j05j251k136k739l184l395l606m143m332k949k59J579Q92j561l639
52847B04044l906k199O56K966L061J076r47j556j474j878k281j575k14L95Q0k03
52831A96045k56o66j107n42P90J345P07K96J037J861J474K92m76o21o99p64m68
52814A98248N3L52L71K80q5r31k031k907l235k731j316K91R21N29O09K160L999
52797A94577M164K542R14M60L73p23k676l709k360P01L066K953R30j157k353k782
52781A94920k218k18K204L029J998J084J170M53k223m524l617n46J240Q63M02
52766A94017P59M68r02j446k66O48m30k076j929j40J314J557J195O92J66K06J174
$$ plain form
52878 223568 222068 221973 223235 224773 226091 227647 229585 231301 232541 233799 235145 235736 235159 234347 234354 234872
52862 234872 234767 233516 231380 228641 225457 222062 218456 214313 209981 207032 206773 208352 209244 207683 204044
52847 204044 200138 197939 198595 201561 204622 205698 204751 203195 201721 199843 197562 195987 195773 196168 196248 196045
52831 196045 195789 195123 194016 193474 194264 195609 196316 196612 197649 199510 200984 201276 200800 200179 199480 198716 198248
52814 198248 198301 198653 199024 199304 199219 198288 196257 193350 190115 187384 186068 186359 187280 187809 188418 190578 194577
52797 194577 198741 201283 202197 202657 203030 202307 199631 195922 193562 194263 197329 200282 201212 200055 197702 194920
52781 194920 192702 192484 194688 197717 199715 200799 201969 202422 200199 195675 192058 191512 192752 193615 194017
52766 194017 194776 195244 194342 192896 192630 193278 192848 190772 188843 188703 190017 191574 192769 193461 193627 193833 195007
52749A95007K059J492k28j352q64O75K296L470L797K973J461M51P04J739K344
52734B16024J836P76N11J700L339L721K444Q77M30J042J706J812J437R27O88R00
52718B40170J108O40l04p76n79o72j572k346k033j041k67K87J047J766K104K561
52702B40093L706M937N085L899K029J12j221j253l03j39j765l380k354J038L605
52687B54089L090M54j886k620j949p84k18q17j939k389j943j426j363j491j666
52672B37142k111k535k159q84L66Q35N68j43j066j674j494r24p62r52q86q80j775
52655B20666l045k971j200N29Q94O52Q12Q05j68j249j003L25J194R73N36Q18J748
52638B20316K501K160M39j697k602j722k20N95P30P19M14l92r43l90P21J050L37
$$ plain form
52749 195007 197066 198558 198330 196978 196114 196789 199085 202555 206352 209325 210786 211237 211941 213680 216024
52734 216024 217860 218636 219147 220847 224186 227907 230351 231228 231658 232700 234406 236218 237655 238582 239270 240170
52718 240170 241278 241918 241614 240838 240259 239587 238015 235669 233636 232595 232328 232615 233662 235428 237532 240093
52702 240093 243799 248736 253821 257720 259749 259861 258640 257387 257084 256945 255180 251800 249446 250484 254089
52687 254089 257179 257633 255747 253127 251178 250394 250176 249359 247420 245031 243088 241662 240299 238808 237142
52672 237142 235031 232496 230337 229453 229819 230654 231222 231079 230013 228339 226845 225921 225159 224207 223321 222441 220666
52655 220666 217621 214650 213450 213979 214873 215525 216337 217142 216974 215725 214722 215047 216241 217214 217750 218568 220316
52638 220316 222817 224977 225416 223719 221117 219395 219175 219770 220500 221219 221633 221241 220298 219908 220629 221679 222016
52621B22016m50o32m45k47j36l55j115j894j764n93P52J528J820K011K163K131
52605B24790J822J203L66l27m65l6N57P50J29j255k582k670j202O92J504Q65k83
52588B23858q55o41k26j82m00l19O7r4j193k068j322M69J353Q71O96J760K525
52571B24299J334r65k302k223j828j670j339o93r9L15M85N0q05q47M35J499Q69
52554B16515k91J58J701J738k76j883j346N5L82l50j111j678k260k535k262j845
52538B04712j459o68L73O65M9j78O11J034k10k124k719j633J9J544K891L529K713
52521B09149P97r27j655j480o99L12Q30L94m42p48l76J79O66R61O19m39j114k55
52503B05772J593K582J776P1j127j328j031j003j519j862r33J111K394J407r66
$$ plain form
52621 222016 221566 220934 220489 220242 220106 219751 218636 216742 214978 214385 215137 216665 218485 220496 222659 224790
52605 224790 226612 227815 228181 227854 227389 227353 227910 228660 228789 227534 224952 222282 221080 221772 223276 224141 223858
52588 223858 223003 222362 222136 221954 221554 221235 221302 221208 220015 217947 216625 217094 218447 219318 220014 221774 224299
52571 224299 225633 224668 222366 220143 218315 216645 215306 214613 214514 214829 215314 215364 214559 213712 214147 215646 216515
52554 216515 216224 216382 218083 219821 219545 217662 216316 216371 216753 216403 215292 213614 211354 208819 206557 204712
52538 204712 203253 202585 202958 203623 203672 203494 204105 205139 204929 202805 200086 198453 198472 200016 202907 206436 209149
52521 209149 209946 209019 207364 205884 205185 205497 206327 206721 206279 205531 205155 205334 206000 206961 207580 207141 206027 205772
52503 205772 207365 209947 211723 211794 210667 209339 208308 207305 205786 203924 202991 204102 206496 207903 206937
52488B06937k523k417j625j060o85l15PN32J434J905J025m44p33K22N36n68j391
52471B00837n70N75K09q54l55J743K938J596j128l205l933l569k130L25K824L947
52455A99250L233J599M42M85J363K068J898J096N41P95J636K445K786K573J993
52440B24203J399J078R83Q68O77N77O56Q71J288J939K358J873O87J38J250L332
52424B44177M583M073K506J021kp29j143j138r89j166j657j928j536n96L64P69
52408B46609K84r19k167k764k486j545j90J367K761L501L311K312R16l19r41q64
52392B48866l29N12J654K696K831J873Q09N68O90J87n93k75J242K242J490m5m84
52375B63934Q34L219N698P279P101N374L631L014K915K309J706K282L595L873
$$ plain form
52488 206937 204414 201997 200372 199312 198627 198312 198319 198851 200285 202190 203215 202771 202038 202260 202796 202228 200837
52471 200837 200267 200842 201051 200197 199842 201585 204523 206119 204991 201786 197853 194284 192154 192479 195303 199250
52455 199250 202483 204082 204524 205009 206372 208440 210338 211434 211975 212770 214406 216851 219637 222210 224203
52440 224203 225602 226680 227663 228531 229208 229785 230441 231312 232600 234539 236897 238770 239457 239595 240845 244177
52424 244177 248760 252833 255339 256360 256358 255629 254486 253348 252359 251193 249536 247608 246072 245476 245840 246609
52408 246609 246893 245974 243807 241043 238557 237012 236822 238189 240950 244451 247762 250074 250990 250671 249730 248866
52392 248866 248537 249049 250703 253399 256230 258103 258912 259480 260170 260357 259764 259489 260731 262973 264463 264418 263934
52375 263934 264768 267987 273685 280964 288065 293439 297070 300084 302999 305308 307014 309296 312891 316764
52361C16764K614J353J482K667L896M817N400N274M234K765J570J050J492K938
52347C58316M702N865O561P666Q943Q916P325O209P394J0004J1954J2890J3929
52334D70674J5151J5401J4553J4173J5450J7829K0156K1997K3304K3847K3720
52323F76255K3686K4375K5696K7300K8924K9965K9582K7823K6004K5312K5548
52312I70470K5691K5144K3925K2282K0782K0158K0294J9857J7722J4419J1425
52301A192169R368P837O550N651M845L350J016j267k560k692j963q10K1k75j699
52286A219541l252l939l483j926P00L836O230P066O941P120Q114R529J0953J2337
52272A279767J3672J4880J6033J7268J8475J9458K0113K0210J9370J7803J6635
$$ plain form
52361 316764 319378 320731 322213 324880 328776 333593 338993 344267 348501 351266 352836 353886 355378 358316
52347 358316 363018 368883 375444 383110 392053 400969 408294 414503 421897 431901 443855 456745 470674
52334 470674 485825 501226 515779 529952 545402 563231 583387 605384 628688 652535 676255
52323 676255 699941 724316 750012 777312 806236 836201 865783 893606 919610 944922 970470
52312 970470 996161 1021305 1045230 1067512 1088294 1108452 1128746 1148603 1166325 1180744 1192169
52301 1192169 1201537 1209374 1215924 1221575 1226420 1229770 1230786 1229519 1226959 1224267 1222304 1221494 1221515 1221240 1219541
52286 1219541 1216289 1212350 1208867 1206941 1207641 1211477 1217707 1224773 1231714 1238834 1246948 1256477 1267430 1279767
52272 1279767 1293439 1308319 1324352 1341620 1360095 1379553 1399666 1419876 1439246 1457049 1473684
52261A473684J6711J7344J7026J5287J3037J1131R524P916O236M235J586j263
52249A592454l238m107m870o211p538q259q957j0234j1318j1123j0128r670r769
52236A487032r282q192p964r131j0036q958o416m320l564l492l189k359j148M7
52222A409028O69N53K78N25J206J713J782J589J297J137J591K764L792L762L169
52207A434855L386M616N427M807L630L243L508L317K543K189K556K571J427m9
52193A478026m61K52P95K41r89j954k366k708l535m866o051o175m914l225k697
52178A439373l830n235n116l413j885k016l483m963n825o389o907p076o671n972
52164A370592n291m463l160j559l34l8o51j686k561k921k751k276j684j068n98
$$ plain form
52261 1473684 1490395 1507739 1524765 1540052 1553089 1564220 1573744 1581660 1587896 1592131 1593717 1592454
52249 1592454 1589216 1585109 1580239 1574028 1566490 1558231 1549274 1539040 1527722 1516599 1506471 1496801 1487032
52236 1487032 1477750 1469558 1461594 1452463 1442427 1433469 1427053 1422733 1419169 1415677 1412488 1410129 1408981 1409028
52222 1409028 1409697 1410250 1410528 1411053 1412259 1413972 1415754 1417343 1418640 1419777 1421368 1424132 1427924 1431686 1434855
52207 1434855 1438241 1442857 1448284 1453091 1456721 1459964 1463472 1466789 1469332 1471521 1474077 1476648 1478075 1478026
52193 1478026 1477565 1477817 1478612 1478853 1477864 1475910 1473544 1470836 1467301 1462435 1456384 1450209 1445295 1442070 1439373
52178 1439373 1435543 1430308 1425192 1421779 1419894 1417878 1414395 1409432 1403607 1397218 1390311 1383235 1376564 1370592
52164 1370592 1365301 1360838 1357678 1356119 1355785 1355747 1355096 1353410 1350849 1347928 1345177 1342901 1341217 1340149 1339551
52149A339551n04p50r18p16m99q48j590j674l16J932L585L701K821K457L784O711
52133A356727R992J2276J3202J3555J4396J6126J8333K0291K1412K1602K1538
52122A539450K2373K4621K7398K9317L0088L0545L0970L0282K7550K3704K0864
52111A837162K0115K0596K0762J9771J7596J4483J0776O948L445N59j470k494
52099A968249k682k565k791l881n959q389r962j0003r246q915r044q585p281o276
52085A872670o262o043m052p39J881K833L228M572P147J0365J3670J6472J8001
52072A933743J8080J7653J7795J8334J8207J7112J6018J5836J6107J5572J3782
52061B118239J1572R876Q584O892M477J708j209m476p821j0135j0892j1381j3465
$$ plain form
52149 1339551 1339047 1338297 1337379 1336663 1336164 1335316 1333726 1332052 1331736 1333668 1337253 1340954 1343775 1346232 1350016 1356727
52133 1356727 1366719 1378995 1392197 1405752 1420148 1436274 1454607 1474898 1496310 1517912 1539450
52122 1539450 1561823 1586444 1613842 1643159 1673247 1703792 1734762 1765044 1792594 1816298 1837162
52111 1837162 1857277 1877873 1898635 1918406 1936002 1950485 1961261 1968209 1971654 1972213 1970743 1968249
52099 1968249 1965567 1963002 1960211 1956330 1950371 1941982 1932020 1922017 1912771 1903856 1894812 1886227 1878946 1872670
52085 1872670 1866408 1860365 1856313 1855574 1857455 1860288 1863516 1868088 1875235 1885600 1899270 1915742 1933743
52072 1933743 1951823 1969476 1987271 2005605 2023812 2040924 2056942 2072778 2088885 2104457 2118239
52061 2118239 2129811 2139687 2148271 2155163 2159640 2161348 2160139 2155663 2147842 2137707 2126815 2115434 2101969
52048B101969j7145k0449k1992k2589k3711k5333k6377k6673k7243k8653l0059
52037A831745l0242k8963k6986k5258k4292k3976k3653k2643k1001j9662j9577
52026A565492k0718k1895k1732k0028j8209j8009j9505k0969k1008k0259k0198
52015A342962k0852k0949k0135j9652k0389k1511k1893k2004k3280k6040k8938
52004A097319l0375k9846k8011k5962k4405k3246k2141k1433k1934k3493k4632
51993H21841k4219k2808k1540k0474j9093j7779j7357j7477j6935j5651j4794
51982F13714j4663j3978j1876r389p984p763p888q011q218q317q092p878q027
51969D91630q267q296q482r119r475q673p163o255o363o691o610o272n794m834
$$ plain form
52048 2101969 2084824 2064375 2042383 2019794 1996083 1970750 1944373 1917700 1890457 1861804 1831745
52037 1831745 1801503 1772540 1745554 1720296 1696004 1672028 1648375 1625732 1604731 1585069 1565492
52026 1565492 1544774 1522879 1501147 1481119 1462910 1444901 1425396 1404427 1383419 1363160 1342962
52015 1342962 1322110 1301161 1281026 1261374 1240985 1219474 1197581 1175577 1152297 1126257 1097319
52004 1097319 1066944 1037098 1009087 983125 958720 935474 913333 891900 869966 846473 821841
51993 821841 797622 774814 753274 732800 713707 695928 678571 661094 644159 628508 613714
51982 613714 599051 585073 573197 563808 555824 548061 540173 532162 523944 515627 507535 499657 491630
51969 491630 483363 475067 466585 457466 447991 439318 432155 425900 419537 412846 406236 399964 394170 389336
51955C89336l354k021j479j736k487l524m555n123m959m174l016j782r21o43m25
51940C49137M80J949K956K784J742N13n57j347j708j742j819k034k020j567r80
51925C45787n15K0P97J466J519R21J54j10O59K348L889M188L632L881N670P741
51909C82047Q777R500J1516J4534J6231J5072J2015Q919O387L829Q70k190m890
51896D82617o781p450p090o869p883r669j0492r406p464o422o704p178o725n432
51882C77052m185l598l592l734l730l613l580l671l697l584l627m048m410m019
51868C23964k875j671p08L75J389J075j318m475o162n702m263k793j083P95J530
51853B98078O6k655m472m270k754j266n83p70j454k090k328k255k101j780r84
$$ plain form
51955 389336 385982 383961 382482 380746 378259 374735 370180 365057 360098 355924 352908 351126 350205 349562 349137
51940 349137 349617 351566 354522 357306 359048 359561 359004 357657 355949 354207 352388 350354 348334 346767 345787
51925 345787 345272 345292 346089 347555 349074 349995 350149 350039 350698 353046 356935 361123 364755 368636 374306 382047
51909 382047 390824 400324 411840 426374 442605 457677 469692 478611 484998 488827 489697 487507 482617
51896 482617 475836 468386 461296 454427 446544 436875 426383 416977 409513 403091 396387 389209 382484 377052
51882 377052 372867 369269 365677 361943 358213 354600 351020 347349 343652 340068 336441 332393 327983 323964
51868 323964 321089 319418 318710 319085 320474 321549 320231 315756 309594 303892 299629 296836 295753 296548 298078
51853 298078 298144 295489 291017 286747 283993 282727 282144 281374 279920 277830 275502 273247 271146 269366 268382
51838B68382K74J489J975J341m8j048n74J060K114J180j141k872k803j473r8Q04
51822B68562J392J651J185r8j442j801r42K14O06J58m03o77r43j319j346p45o3
51805B63989J06J14Q45K306L336K911J338j17n72k57R7K32K95m1j582m035n202
51788B63763l064J266M017K913k57j955r32J073J910J032p47k238k489j394M7
51773B62945O73N34P05J726K831K890J685J11o45j36Q47J035J88n62k20Q12J578
51756B76997J921K009J246q98l307l992k706j271j003j149n35N51J089J065J392
51741B71409K503L775M284L642K377J579J863K629K885K640K653K969K851K285
51727C10344K148K374J519j064l848n032m610l444j655O08J932J058j086k573
$$ plain form
51838 268382 268656 270145 272120 273461 273413 272365 271791 272851 274965 276145 275004 272132 269329 267856 267758 268562
51822 268562 269954 271605 272790 272692 271250 269449 268507 268721 269327 269485 269082 268405 267462 266143 264797 264052 263989
51805 263989 264095 264209 265054 267360 270696 273607 274945 274828 274256 273999 274096 274328 274623 274582 273000 268965 263763
51788 263763 260699 261965 265982 268895 268638 266683 265751 266824 268734 269766 269019 266781 264292 262898 262945
51773 262945 263618 264152 264857 266583 269414 272304 273989 274100 273455 273319 274166 275201 275389 274827 274607 275419 276997
51756 276997 278918 280927 282173 281275 277968 273976 271270 269999 268996 267847 267312 267863 268952 270017 271409
51741 271409 273912 277687 281971 285613 287990 289569 291432 294061 296946 299586 302239 305208 308059 310344
51727 310344 312492 314866 316385 315321 311473 306441 301831 298387 296732 297340 299272 300330 299244 296671
51713B96671l205m013m638l602j360m43j687k674j426L67q9k301l050r57J841
51698B69434K790J808L61p82j742k416k409j847j300r26m08K38M36r6q06r65n57
51681B60813r6J97M47N06n9j143j852j576q31m85m40J4P01M25j184k644k264l09
51663B50220J404J832J575J345P89n76k030k300j144M88J648K050J782J153Q00
51648B59036J010R98k46k198l062k142q24n76j019r58k47N42J422K485K719J103
51632B58043j309k170q31R58J606J381J074O95L17P87K368L760L649K397J186
51617B73911K64p24j367p89R34K740L821M107L854L524L707M367M527L513K012
51602C08401J098P63M06J69M61O63j87j566j886q28K06J68n41j435k855m732n773
$$ plain form
51713 296671 293466 289453 284815 281213 279853 279410 277723 275049 273623 273990 273901 271600 268550 267593 269434
51698 269434 272224 274032 274393 273611 271869 269453 267044 265197 263897 262971 262563 262801 263237 263141 262335 261370 260813
51681 260813 260717 260914 261361 261867 261808 260665 258813 257237 256406 255921 255481 255495 256196 256621 255437 252793 250529 250220
51663 250220 251624 253456 255031 256376 257165 256589 254559 252259 251115 251603 253251 255301 257083 258236 259036
51648 259036 260046 261044 260798 258600 255538 253396 252572 251996 250977 250019 249772 250314 251736 254221 256940 258043
51632 258043 256734 254564 253733 254691 256297 257678 258752 259447 259764 260551 262919 266679 270328 272725 273911
51617 273911 274175 273451 272084 271295 272229 274969 278790 282897 286751 290275 293982 298349 302876 306389 308401
51602 308401 309499 310262 310668 310837 311298 311961 311774 310208 308322 307494 307700 307868 307327 305892 303037 298305 292532
51585B92532m940k950j371q22r01j218j530j255R2J911K789J969J51j349j892
51570B81216j793j602j469j336j313j447j251j53J396K156J848J717K686L742
51556B84397L339J715M52J61R6j10l8K09%k75N61K147K375M74j522j673q92j084
51538B90332j921j540K38J576J401O41L93M76L17L7k1N1O7J46K54r0j175k440
51520B88742k890k127p57K07L94M52J116K116K624K754L646N578P049O654N047
51505C20605L909L562K943J617L43l58r17j659k249k586l211m291n028m651l464
51490C04565k411k103k515l200l472k960k181k040k588k870k268j295q27j137
51476B72698k072l416m627m867l992k978k763l045k946k474k519l326l796k631
$$ plain form
51585 292532 287592 284642 283271 282449 281548 280330 278800 277545 277637 279548 282337 284306 284457 283108 281216
51570 281216 279423 277821 276352 275016 273703 272256 271005 270852 272248 274404 276252 277969 280655 284397
51556 284397 287736 289451 289903 290064 290160 290050 290012 290221 290221 289946 290507 292654 295029 295503 293981 292308 291416 290332
51538 290332 288411 286871 287109 288685 290086 290727 291120 291596 291913 291950 291929 291980 292047 292193 292447 292357 291182 288742
51520 288742 285852 283725 282968 283175 283569 284021 285137 287253 289877 292631 296277 301855 308904 315558 320605
51505 320605 324514 328076 331019 332636 332979 332621 331704 330045 327796 325210 321999 317708 312680 308029 304565
51490 304565 302154 300051 297536 294336 290864 287904 285723 283683 281095 278225 275957 274662 273835 272698
51476 272698 270626 267210 262583 257716 253724 250746 247983 244938 241992 239518 236999 233673 229877 227246
51462B27246J2K354K622Q63j080j561q12j78j30M1O20Q00L6r35j221j011q48l93
51444B26425Q84K279K366R33o63j271j114r33q59o44m42p14j510k232k182j268
51428B19055k05J58j97l95K31J285J963K098J984J495L31r89j369o02K79M67K97
51411B25886L49M81M71Q22K014L373L718K956K135J881J668Q69j75o23k40M08
51395B45993N86n7j418k956l814l293j528L88J243Q31J12M1M16K57q19k090k723
51378B31169k597j970r67N9L09n57j716k192k203k492k678j660K23R52l98j911
51362B11371j107J667L484K400l36j984j404R1O31r6p94m29L93K67j100k473k659
51345B07922j689k56J176K144J937N13r01j004K7R27R48K90o49j465j595r65o08
$$ plain form
51462 227246 227258 229612 232234 233097 232017 230456 229644 229466 229336 229377 229997 230797 230833 229898 228677 227666 226818 226425
51444 226425 227309 229588 231954 232887 232224 230953 229839 228906 228047 227403 226961 226247 224737 222505 220323 219055
51428 219055 218850 219008 218811 218416 218647 219932 221895 223993 225977 227472 227803 226814 225445 224843 225122 225589 225886
51411 225886 226235 226716 227187 228009 230023 233396 237114 240070 242205 244086 245754 246623 246448 245825 245585 245993
51395 245993 246579 246522 245104 242148 238334 235041 233513 233901 235144 235975 236087 236128 236544 236801 235982 233892 231169
51378 231169 228572 226602 225635 225694 226003 225446 223730 221538 219335 216843 214165 212505 212728 213680 213282 211371
51362 211371 210264 211931 215415 217815 217479 215495 214091 214182 214813 214717 213923 213494 213887 214154 213054 210581 207922
51345 207922 206233 205977 207153 209297 211234 211747 210846 209842 209869 210796 211744 212034 211385 209920 208325 207360 206752
51328B06752j444k683k682j292P0P24J376K170J943L23j100r40k9J88M3P54J954
51311B06127K074Q51l41n85l37l3O54J799K727L068L213L370L104K280J442P85
51295B30198k44j647k208j059Q18J694J263P11Q09R72L58q78j898k321k603l193
51279B20772l644k920p99J394K028J021j58m65l99p74j247r00K04J108J406J628
51263B18255K004J855P16o83j246r39o08n59k10O74J229O62l90m64Q15K292K870
51246B26273K738K596K411J752R19P48J299J612J062J99j80j87m63j008j114m49
51230B38208L44M40j89q74j072p89k18N37J248J423Q50O7j69J77N00M93M78O05
51212B42059M22l30j111j208o11K14R85J498J378O53K15Q94K265L072K684J374
$$ plain form
51328 206752 205308 202625 199943 198651 198721 199445 200821 202991 204934 205257 204157 203217 203188 203376 203419 204173 206127
51311 206127 208201 209052 208711 208126 207789 207756 208410 210209 212936 216004 219217 222587 225691 227971 229413 230198
51295 230198 229954 228307 226099 225040 225858 227552 228815 229526 230335 231307 231665 230787 228889 226568 223965 220772
51279 220772 217128 214208 213409 214803 216831 217852 217694 217229 216830 216056 214809 213909 214113 215221 216627 218255
51263 218255 220259 222114 222830 222147 220901 219962 219354 218795 218585 219259 220488 221150 220760 220296 221111 223403 226273
51246 226273 229011 231607 234018 235770 236689 237437 238736 240348 241410 241609 241429 241242 240779 239771 238657 238208
51230 238208 238552 238992 238803 237929 236857 236068 235850 236387 237635 239058 239908 239975 239806 239983 240483 240976 241454 242059
51212 242059 242481 242151 241040 239832 239221 239435 240420 241918 243296 243949 244164 245058 247323 250395 253079 254453
51196B54453m91k632m252m369k971j104L16J011P24p44k626l416k568j172m15
51181B29744k40p1m3o38j669k305j878k99J795L054K332J75j346r39M45J191J209
51164B30517J516K309K693K157J129P0q87j346o44J037K310J857j07k022k525
51149B38064j654n75j05K48J403L123M110L884L522L937M347L408J263o59j448
51134B62868j350q33j89Q5m63j526k351k693k660j871M6K167K779J511j30p93
51118B54597q26j234k003k303j757q29j02K99P66J831L450M661M441K991J612
51103B65594J181J495K140L087M016L949K344J0j694k152j617o00K42K32n45r79
51087B76703k61Q54Q73m74j874k031r38N35J716K416K650K406J745J017P98J366
$$ plain form
51196 254453 253962 251330 247078 242709 239738 238634 238950 239961 240685 239941 237315 233899 231331 230159 229744
51181 229744 229504 229433 229390 228752 227083 224778 222900 222601 224396 227450 229782 229957 228611 227672 228117 229308 230517
51164 230517 232033 234342 237035 239192 240321 240391 239504 238158 237514 238551 240861 242718 242611 240589 238064
51149 238064 236410 235835 235730 235978 237381 240504 244614 248498 252020 255957 260304 263712 264975 264316 262868
51134 262868 261518 260685 260496 260581 260118 258592 256241 253548 250888 249017 249063 251230 254009 255520 255390 254597
51118 254597 253771 252537 250534 248231 246474 245645 245543 245842 246608 248439 251889 256550 260991 263982 265594
51103 265594 266775 268270 270410 273497 277513 281462 283806 283816 282122 279970 278353 277753 277995 278227 277682 276703
51087 276703 276442 277296 278169 277695 275821 273790 272852 273387 275103 277519 280169 282575 284320 285337 286135 287501
51071B87501K127J972N38j142j660p33O14J299J162Q05P69R44O75m42j751j840
51055B90838q9K263L195K070K91l44N13J846K670K835K605K085J410J041J385
51040C14614K072K147J135l20j168j051m29K50R59J671J923J159n15k058k138
51025C18251k47K710N117O026N789N192M401L088J410L81J100L703O985R091R031
51010C82028P711P017P651Q465Q316P740P915Q722R007Q465P962Q124Q848J0093
50996D98064J1873J3330J3294J2054J1267J1643J2160J2086J2272J3498J5003
50985F36544J5919J6910J8927K1399K3252K5057K8371L3231L7962M1578M4969
50974I44119M9467N5278O1656O7752P3027P7378Q1024Q3855Q5241Q5012Q4206
$$ plain form
51071 287501 289628 291600 292138 290996 289336 288603 289217 290516 291678 292483 293252 294196 294871 294429 292678 290838
51055 290838 290749 293012 296207 298277 298568 298224 298737 300583 303253 306088 308693 310778 312188 313229 314614
51040 314614 316686 318833 319968 319648 318480 317429 317000 317250 318209 319880 321803 322962 322447 320389 318251
51025 318251 318004 320714 325831 331857 337646 342838 347239 350327 351737 352118 353218 356921 363906 372997 382028
51010 382028 389739 396756 404407 412872 421188 428928 436843 445565 454572 463037 470999 479123 487971 498064
50996 498064 509937 523267 536561 548615 559882 571525 583685 595771 608043 621541 636544
50985 636544 652463 669373 688300 709699 732951 758008 786379 819610 857572 899150 944119
50974 944119 993586 1048864 1110520 1178272 1251299 1328677 1409701 1493556 1578797 1663809 1748015
50963A748015Q3906Q3786Q2689Q0270P7005P2863O7373O0929N4714M9100M3379
50952B504029L7259L1482K6629K2511J9154J7270J7131J7897J8543J8547J7291
50941B747743J3911Q491K490k804p504j2223j6958k1858k8066l6419m5618n3108
50929B548077n7815o1032o4472o8345p1604p3279p3137p1513o9096o6718o4939
50918A806127o3601o1962n9420n6165n2855m9694m6242m2495l9481l8080l7535
50907A258597l6158l3377l0165k7396k5014k2941k1488k0229j7911j4388j1447
50896I98083j0608j1042j1018j0434j0282j0283r034o427m044k787j740nJ866
50883I12245L008L624M328N054N632O543Q135R822J1079J2661J5616J9516K2899
$$ plain form
50963 1748015 1831921 1915707 1998396 2078666 2155671 2228534 2295907 2356836 2411550 2460650 2504029
50952 2504029 2541288 2572770 2599399 2621910 2641064 2658334 2675465 2693362 2711905 2730452 2747743
50941 2747743 2761654 2770145 2772635 2769831 2762327 2750104 2733146 2711288 2683222 2646803 2601185 2548077
50929 2548077 2490262 2429230 2364758 2296413 2224809 2151530 2078393 2006880 1937784 1871066 1806127
50918 1806127 1742526 1680564 1621144 1564979 1512124 1462430 1416188 1373693 1334212 1296132 1258597
50907 1258597 1222439 1189062 1158897 1131501 1106487 1083546 1062058 1041829 1023918 1009530 998083
50896 998083 987475 976433 965415 954981 944699 934416 925382 918955 914911 912124 910384 910379 912245
50883 912245 915253 918877 923205 928259 933891 940434 948569 958391 969470 982131 997747 1017263 1040162
50870A040162K5357K7941L1413L5382L9502M4336N0415N7390O4911P3493Q3463
50859A573765R3702J02779J11158J20961J33237J46516J58528J68371J76398J82969
50849B968384J88241J92508J95458J95392J90536J81204J69621J57288J43812
50840D582444J28659J12801R7633Q3262O9245N6415M6530M0153L6211L3896L3670
50829E320919L5818L9054M1453M2037M0638L6766K9751J9820P979n324k0627l8287
50817E549997n7467p6679r4778j11171j25487j37524j47294j54778j59870j62733
50807D322216j63835j63246j60392j55050j48318j41833j36153j30475j23915
50798B998999j16400j08281r9938r1921q4760p8250p1535o4337n7573n2316m8688
$$ plain form
50870 1040162 1065519 1093460 1124873 1160255 1199757 1244093 1294508 1351898 1416809 1490302 1573765
50859 1573765 1667467 1770246 1881404 2002365 2135602 2282118 2440646 2609017 2785415 2968384
50849 2968384 3156625 3349133 3544591 3739983 3930519 4111723 4281344 4438632 4582444
50840 4582444 4711103 4823904 4921537 5004799 5074044 5130459 5176989 5217142 5253353 5287249 5320919
50829 5320919 5356737 5395791 5437244 5479281 5519919 5556685 5586436 5606256 5614235 5608911 5588284 5549997
50817 5549997 5492530 5415851 5321073 5209902 5084415 4946891 4799597 4644819 4484949 4322216
50807 4322216 4158381 3995135 3834743 3679693 3531375 3389542 3253389 3122914 2998999
50798 2998999 2882599 2774318 2674380 2582459 2497699 2419449 2347914 2283577 2226004 2173688 2125000
50787B125000m6178m4429m3168m1883m0305l8825l7792l6819l5441l4005l3104
50776A693051l2570l1978l1784l2728l4243l4708l3491l1663l0361k9483k8410
50765A341632k6920k4911k2129j8805j5748j3149j0095o041k026N36J716K876
50753A206936M946P826J1226J5203J9795K4900L0587L6886M3243M8710N2993N7033
50741A560284O2320O9547P7862Q5471R1198R5430R9292J03035J05892J07324J07484
50730B565139J06191J02615R6650Q9517Q2114P3654O3092N1181L9701K9186J8997
50719C318037R557K740l88p68K86K534N815Q915J0827J2397J5039J7936J8091
50706C421018J3730O496p72p762j6743k8982m2463n3996o2577o9453p5517q0235
$$ plain form
50787 2125000 2078822 2034393 1991225 1949342 1909037 1870212 1832420 1795601 1760160 1726155 1693051
50776 1693051 1660481 1628503 1596719 1563991 1529748 1495040 1461549 1429886 1399525 1370042 1341632
50765 1341632 1314712 1289801 1267672 1248867 1233119 1219970 1209875 1203834 1201808 1202344 1204060 1206936
50753 1206936 1211882 1219708 1230934 1246137 1265932 1290832 1321419 1358305 1401548 1450258 1503251 1560284
50741 1560284 1622604 1692151 1770013 1855484 1946682 2042112 2141404 2244439 2350331 2457655 2565139
50730 2565139 2671330 2773945 2870595 2960112 3042226 3115880 3178972 3230153 3269854 3299040 3318037
50719 3318037 3327594 3330334 3329946 3329178 3329464 3331998 3337813 3346728 3357555 3369952 3384991 3402927 3421018
50706 3421018 3434748 3441244 3440472 3432710 3415967 3386985 3344522 3290526 3227949 3158496 3082979 3002744
50694C002744q3256q5298q6756q6793q4780q1590p8317p4653o9844o4408n9441
50683B147608n4684m8973m2320l5872k9921k3669j7168j1748p965m843j841Q7
50671A868691M34P17K589N453P344P547O965O379N824N430N493N724N607N597
50657A939794O863R690J3255J7207K2254K8505L4383L8235M0557M3344M7398N1406
50645B292891N4059N5955N8531O1550O2910O1076N6769N1721M6597M1047L5181
50634B878287K9704K4559J8644J1454M186j442n014p497r819j2052j3797j4712
50622B902501j4609j3399j1229q641o460n257m675l407l75L968P814R523Q746
50609B864500O031J982l093r177j6510k5171l4429m2900m9551n4293n7526n9669
$$ plain form
50694 3002744 2919488 2834190 2747434 2660641 2575861 2494271 2415954 2341301 2271457 2207049 2147608
50683 2147608 2092924 2043951 2001631 1965759 1935838 1912169 1895001 1883253 1875288 1870445 1868604 1868691
50671 1868691 1869125 1869842 1872431 1877884 1885228 1892775 1899740 1906119 1911943 1917373 1922866 1928590 1934197 1939794
50657 1939794 1946657 1956347 1969602 1986809 2009063 2037568 2071951 2110186 2150743 2194087 2241485 2292891
50645 2292891 2346950 2402905 2461436 2522986 2585896 2646972 2703741 2755462 2802059 2843106 2878287
50634 2878287 2907991 2932550 2951194 2962648 2966834 2965392 2960378 2952881 2943062 2931010 2917213 2902501
50622 2902501 2887892 2874493 2863264 2854623 2848163 2842906 2838231 2834824 2834449 2838417 2846231 2855754 2864500
50609 2864500 2870531 2872513 2869420 2860243 2843733 2818562 2784133 2741233 2691682 2637389 2579863 2520194
50597B520194o1241o2749o4080o4567o3931o2628o0892n8272n4654n1082m8792
50586A867306m7727m6727m4805m1743l7923l4234l1718l0389k8776k5474k0930
50575A476860j6814j3907j1565r171o919m920k592M81L775O484Q543J0534J2862
50562A453651J5365J7531J8807J9036J8811J9283K1238K4342K7397K9365L0191
50551A695017L0746L1914L3821L6051L8510M1651M5696N0131N4339N8368O2715
50540B178959O7782P3954Q1765R1302J01676J11728J21128J30259J39242J47643
50530C245438J54968J60792J64673J66464J66441J64398J59023J49124J35287
50521D666608J19276J01937Q2903O2279M1204K0392m82k1265m0417n6479o9417
$$ plain form
50597 2520194 2458953 2396204 2332124 2267557 2203626 2140998 2080106 2021834 1967180 1916098 1867306
50586 1867306 1819579 1772852 1728047 1686304 1648381 1614147 1582429 1552040 1523264 1497790 1476860
50575 1476860 1460046 1446139 1434574 1425403 1418484 1413564 1410972 1411453 1415228 1421712 1430255 1440789 1453651
50562 1453651 1469016 1486547 1505354 1524390 1543201 1562484 1583722 1608064 1635461 1664826 1695017
50551 1695017 1725763 1757677 1791498 1827549 1866059 1907710 1953406 2003537 2057876 2116244 2178959
50540 2178959 2246741 2320695 2402460 2493762 2595438 2707166 2828294 2958553 3097795 3245438
50530 3245438 3400406 3561198 3725871 3892335 4058776 4223174 4382197 4531321 4666608
50521 4666608 4785884 4887821 4970724 5033003 5074207 5094599 5094117 5072852 5032435 4975956 4906539
50510D906539p9646q6726r0232r1122r0790q9043q4424p6513o6682n6233m4867
50499D050261l1594j6646j900J0423J9236K5035K8935L1116L0203K4387J3140
50488D182596k391k0404l9297n7623p3967q7463r8182j06668j13166j17508j19632
50477C346295j19979j19304j18254j16997j15156j12012j07058j00577r3724q7726
50467B255508q2739p7662p1321o3890n6805n1140m6430m1421l5662k9988k5363
50456A673087k1681j7992j3724r321n759l617k716k318j531J42K119K791R82k474
50442A597988n134n289l420j070J071L224N267O642P480Q900J1658J5210J8450
50429A660977K0900K2886K4948K7441L0416L3647L6971M0715M5353N0714N6046
$$ plain form
50510 4906539 4826893 4740167 4649935 4558813 4468023 4378980 4294556 4218043 4151361 4095128 4050261
50499 4050261 4018667 4002021 4000121 4010544 4029780 4054815 4083750 4114866 4145069 4169456 4182596
50488 4182596 4180205 4159801 4120504 4062881 3988914 3901451 3803269 3696601 3583435 3465927 3346295
50477 3346295 3226316 3107012 2988758 2871761 2756605 2644593 2537535 2436958 2343234 2255508
50467 2255508 2172769 2095107 2023786 1959896 1903091 1851951 1805521 1764100 1728438 1698450 1673087
50456 1673087 1651406 1633414 1619690 1610369 1604610 1600993 1598277 1595959 1594428 1594570 1596689 1599480 1600462 1597988
50442 1597988 1592854 1587565 1584145 1583075 1584146 1587370 1592637 1599279 1606759 1615659 1627317 1642527 1660977
50429 1660977 1681877 1704763 1729711 1757152 1787568 1821215 1858186 1898901 1944254 1994968 2051014
50418B051014O0995O5938P1056P5719P9183Q1454Q2862Q3177Q1732P8324P3459
50407B884913O7756O1470N4499M6600L7535K7188J5468K286j2096k6495l9216
50396C119908m9385n7538o4590p0542p4640p6392p5885p3334o8946o3206n6833
50385B388617n0286m3511l6187k8105j9463j0937l318L094Q407J2341J3909J2362
50373B246923Q153K544l633j0451j8106k6092l3248l8666m2600m6289n0565n4697
50361A933273n7109n7289n6390n5715n5400n4856n3788n2105m9534m6224m3181
50350A351682m1260l9961l8022l5012l1550k8141k4652k0891j7003j3193r714
50339A052283p076n605m786l599j625O92K791M520N865O635O566N650M518M440
$$ plain form
50418 2051014 2112009 2177947 2249003 2324722 2403905 2485359 2568221 2651398 2733130 2811454 2884913
50407 2884913 2952669 3014139 3068638 3115238 3152773 3179961 3195429 3197715 3185619 3159124 3119908
50396 3119908 3070523 3012985 2948395 2877853 2803213 2726821 2650936 2577602 2508656 2445450 2388617
50385 2388617 2338331 2294820 2258633 2230528 2211065 2200128 2196810 2199904 2208311 2220652 2234561 2246923
50373 2246923 2255076 2257620 2253987 2243536 2225430 2199338 2166090 2127424 2084824 2038535 1987970 1933273
50361 1933273 1876164 1818875 1762485 1706770 1651370 1596514 1542726 1490621 1441087 1394863 1351682
50350 1351682 1310422 1270461 1232439 1197427 1165877 1137736 1113084 1092193 1075190 1061997 1052283
50339 1052283 1045207 1039602 1034816 1031217 1029592 1030284 1033075 1037595 1043460 1050095 1056661 1062311 1066829 1071269
50325A071269O178Q521Q994O824M254L788N045N882N742N858O472O317N181M727
50311A155052N737O640N986M827N055O694Q314R254R883J0347J0614J1325J3301
50298A263029J6407K0048K4421L0033L6185M1315M5006M8573N3133N7436N7894
50287A693480N0883L5894J7006N47r737j5125j9193k3537k7008k8241k7270k4951
50275A622748k2260k0360k0057k0970k1990k2523k2538k1901k0821k0495k1728
50264A387105k3051k1983j8403j4798j2829j1439r148o308m009k227n31P57J564
50251A264700L066O113R573J1956J3908J7123K1224K3870K4111K3727K4654K6712
50239A470737K8554K9512K9520K8255K5595K2382J9833J8281J7034J5332J3004
$$ plain form
50325 1071269 1077447 1085968 1094962 1101786 1106040 1109828 1114873 1120755 1126497 1132355 1138827 1145144 1150325 1155052
50311 1155052 1160789 1167429 1173415 1178242 1183297 1189991 1198305 1207559 1217442 1227789 1238403 1249728 1263029
50298 1263029 1279436 1299484 1323905 1353938 1390123 1431438 1476444 1525017 1578150 1635586 1693480
50287 1693480 1744363 1780257 1797263 1797810 1788073 1772948 1753755 1730218 1703210 1674969 1647699 1622748
50275 1622748 1600488 1580128 1560071 1539101 1517111 1494588 1472050 1450149 1429328 1408833 1387105
50264 1387105 1364054 1342071 1323668 1308870 1296041 1284602 1275454 1269146 1265137 1262910 1262379 1263136 1264700
50251 1264700 1267766 1273879 1283452 1295408 1309316 1326439 1347663 1371533 1395644 1419371 1444025 1470737
50239 1470737 1499291 1528803 1558323 1586578 1612173 1634555 1654388 1672669 1689703 1705035 1718039
50228A718039J0292P321L771r77p056j3636j9521k4213k7998l1130l3643l5858
50216A545391l8153m0049m0366l8717l6117l3656l1488k9623k8688k8771k8312
50205A171451k5664k1636j8976j9004j9997j9587j7757j6475j6810j7648j7329
50194I60568j5739j4192j3706j3976j4139j3930j3761j3942j4249j4237j3574
50183H05123j2194j0643j0192j1830j4713j6476j5664j3309j1336j0122q770p257
50171F62617o686p199p285n894m024l195l307l185k525j978j670r83J98J260K001
50156F18145K849L634L436K127J081J540L113M625N639O205N997N025M628O141
50142F74185Q652R840R397R820J2781J6354J7496J6381J6185J8832K2995K6773
$$ plain form
50228 1718039 1728331 1735652 1739423 1738446 1731390 1717754 1698233 1674020 1646022 1614892 1581249 1545391
50216 1545391 1507238 1467189 1426823 1388106 1351989 1318333 1286845 1257222 1228534 1199763 1171451
50205 1171451 1145787 1124151 1105175 1086171 1066174 1046587 1028830 1012355 995545 977897 960568
50194 960568 944829 930637 916931 902955 888816 874886 861125 847183 832934 818697 805123
50183 805123 792929 782286 772094 760264 745551 729075 713411 700102 688766 678644 669874 662617
50171 662617 655931 648732 641447 635553 631529 628334 625027 621842 619317 617339 615669 614686 614884 616144 618145
50156 618145 620994 624628 628064 630191 631272 632812 635925 640550 646189 652394 658391 663416 668044 674185
50142 674185 682837 692677 702074 711894 724675 741029 758525 774906 791091 809923 832918 859691
50130H59691L0343L4767L9671M3861M7641N2642N9250O5619O9634P0887P0247
50119A444253O8559O6544O5178O5107O5752O5643O3674N9821N4897M9872M5094
50108B114394L9696L2160K1966J0427o26j0546j9608k7525l3370l7039l9661m2071
50096B008197m3588m2964m0099l6395l3637l2588l2391l1225k8197k4614k2503
50085A639996k1783k0094j6100j1765r930j0509j0810r424p970q478j0686j2882
50073A489565j4361j5610j6702j6887j5988j5151j5659j7388j8973j9323j8604
50062A304919j7668j6873j5917j4699j3802j3691j3875j3404j1995j0022p540
50051A155433m303q96J210J452J224K163L892M593L726K895L561M882M730K412
$$ plain form
50130 859691 890034 924801 964472 1008333 1055974 1108616 1167866 1233485 1303119 1374006 1444253
50119 1444253 1512812 1579356 1644534 1709641 1775393 1841036 1904710 1964531 2019428 2069300 2114394
50108 2114394 2154090 2186250 2208216 2218643 2218017 2207471 2187863 2160338 2126968 2089929 2050268 2008197
50096 2008197 1964609 1921645 1881546 1845151 1811514 1778926 1746535 1715310 1687113 1662499 1639996
50085 1639996 1618213 1598119 1582019 1570254 1560324 1549815 1539005 1529581 1521611 1513133 1502447 1489565
50073 1489565 1475204 1459594 1442892 1426005 1410017 1394866 1379207 1361819 1342846 1323523 1304919
50062 1304919 1287251 1270378 1254461 1239762 1225960 1212269 1198394 1184990 1172995 1162973 1155433
50051 1155433 1151130 1150234 1151444 1152896 1154120 1156283 1160175 1164768 1168494 1171389 1174950 1179832 1184562 1186974
50037A186974n27k240k491k397k952m354o370q501r851r739q795q691j0121j1735
50023A098210j1925j1069j0885j1786j2346j1553j0068q705o988m325j356J112
50011I98316L663P271J1340J4398J6457J9017K2653K6217K8833L1087L3524L5259
49999A248035L5063L2942K9899K6875K4595K3492K2943K1355J8096J4524J2037
49988A509856R679N039k781j2222k1105k8239l3228l6018l7182l7868l8899m0299
49976A236733m1707m2712m2689m1061l8023l4626l1898l0143k8990k7640k5303
49965H51941k2133j9582j8971j9663j9567j7619j4783j2368j0511q950q154q574
49953F71066r458r594q918q401q376q051o834n394m948n809o928o864n253l378
$$ plain form
50037 1186974 1186447 1184207 1181716 1179319 1176367 1172013 1165643 1157142 1147291 1137552 1128757 1120066 1109945 1098210
50023 1098210 1086285 1075216 1064331 1052545 1040199 1028646 1018578 1009873 1002885 998560 997204 998316
50011 998316 1001979 1009250 1020590 1034988 1051445 1070462 1093115 1119332 1148165 1179252 1212776 1248035
49999 1248035 1283098 1316040 1345939 1372814 1397409 1420901 1443844 1465199 1483295 1497819 1509856
49988 1509856 1519535 1524574 1521793 1509571 1488466 1460227 1426999 1390981 1353799 1315931 1277032 1236733
49976 1236733 1195026 1152314 1109625 1068564 1030541 995915 964017 933874 904884 877244 851941
49965 851941 829808 810226 791255 771592 752025 734406 719623 707255 696744 687794 679640 671066
49953 671066 661608 652014 643096 634695 626319 618268 611434 606040 601092 595283 588355 581491 576238 572860
49939E72860k955m157n223m453k181j44O69P24N97P1j017j982k118j841k101k782
49923E43967k622j027P92J143k1j132j108n73n92j091j313j326j957l291m303
$$ plain form
49939 572860 569905 565748 560525 556072 553891 553747 554416 555140 555737 555808 554791 552809 550691 548850 546749 543967
49923 543967 541345 540318 541110 542253 542232 541100 539992 539419 538827 537736 536423 535097 533140 529849 525546
$$ [...]
##END NTUPLES=NMR SPECTRUM
##END=
