##TITLE=NES1066_159122.0006_002_9705126_dtTAlxomYf
##JCAMPDX= 6.0         $$ Bruker NMR JCAMP-DX V2.0
##DATA TYPE= NMR SPECTRUM
##DATA CLASS= NTUPLES
##ORIGIN= BRUKER
##OWNER= Administrator
$$ 1.72 TOPSPIN		Version 2.1
$$ 2016-04-30 13:06:44.177 -0700  Administrator@X
$$ Compression mode = diff/dup
##.OBSERVE FREQUENCY= 400.02188249412
##.OBSERVE NUCLEUS= ^1H
##.ACQUISITION MODE= SIMULTANEOUS (DQD)
##.ACQUISITION SCHEME= undefined
##.AVERAGES= 8
##.DIGITISER RES= 22
##SPECTROMETER/DATA SYSTEM= spect
##.PULSE SEQUENCE= zg30
##.SOLVENT NAME= COFFEE_meoh
##.SHIFT REFERENCE= INTERNAL, COFFEE_meoh, 1, 14.98509
##AUDIT TRAIL= $$ (NUMBER, WHEN, WHO, WHERE, PROCESS, VERSION, WHAT)
$$ ##TITLE= Audit trail, TOPSPIN		Version 2.1
$$ ##JCAMPDX= 5.01
$$ ##ORIGIN= Bruker BioSpin GmbH
$$ ##OWNER= Administrator
$$ $$ E:\/data/COFFEE/nmr/NES1066_159122.0006_002_9705126_dtTAlxomYf/10/pdata/1/auditp.txt
$$ ##AUDIT TRAIL=  $$ (NUMBER, WHEN, WHO, WHERE, PROCESS, VERSION, WHAT)
(   1,<2016-04-30 13:06:35.755 -0700>,<Administrator>,<X>,<go>,<TOPSPIN 2.1>,
      <created by zg
	started at 2016-04-30 13:05:29.708 -0700,
	POWCHK enabled, PULCHK disabled,
       configuration hash MD5:
       21 0F 79 D6 B3 7B B4 F6 88 20 88 DB 03 48 BD 9F
       data hash MD5: 64K
       0C E7 69 B5 02 5F 94 8E EA 37 D3 24 AA 86 1B 2C>)
(   2,<2016-04-30 13:06:39.552 -0700>,<Administrator>,<X>,<proc1d>,<TOPSPIN 2.1>,
      <Start of raw data processing
       efp LB = 0 FT_mod = 6 PKNL = 1 PHC0 = 0 PHC1 = 0 SI = 32K 
       data hash MD5: 32K
       F3 D6 09 99 CA 30 E8 44 40 B1 82 9B 93 2F DF 7B>)
(   3,<2016-04-30 13:06:39.927 -0700>,<Administrator>,<X>,<proc1d>,<TOPSPIN 2.1>,
      <pk PHC0 = 94.1803 PHC1 = 0 
       data hash MD5: 32K
       14 92 6A DD C9 BD 0D 83 46 C8 47 92 CE A5 A6 E0>)
(   4,<2016-04-30 13:06:40.067 -0700>,<Administrator>,<X>,<proc1d>,<TOPSPIN 2.1>,
      <abs ABSG = 1 
       data hash MD5: 32K
       8C 18 21 71 E1 6F FC 48 BC 01 C4 DC 3C 16 6A F3>)
(   5,<2016-04-30 13:06:40.130 -0700>,<Administrator>,<X>,<proc1d>,<TOPSPIN 2.1>,
      <abs ABSG = 2 
       data hash MD5: 32K
       E5 9F AF F7 BB 6C A0 DC C0 6B 7E B2 AA FD ED B9>)
(   6,<2016-04-30 13:06:40.208 -0700>,<Administrator>,<X>,<proc1d>,<TOPSPIN 2.1>,
      <abs ABSG = 3 
       data hash MD5: 32K
       FC EA CE 7F 68 A6 B9 70 CB A3 02 41 E8 76 F8 0E>)
(   7,<2016-04-30 13:06:40.302 -0700>,<Administrator>,<X>,<proc1d>,<TOPSPIN 2.1>,
      <abs ABSG = 4 
       data hash MD5: 32K
       68 7E 93 F7 62 3D C9 1D D5 5A 61 86 06 2C 70 F8>)
(   8,<2016-04-30 13:06:40.380 -0700>,<Administrator>,<X>,<proc1d>,<TOPSPIN 2.1>,
      <abs ABSG = 5 
       data hash MD5: 32K
       11 47 5E 95 A3 65 A7 B4 EA AC 2D 18 B6 A8 11 E8>)
$$ ##END=
$$ 
$$ $$ hash MD5
$$ $$ 51 42 3A AF 07 5F BA BC D4 98 F7 61 E7 F6 E3 8B
##$RELAX= 
##$RELAX= 
##$RELAX= 
##$RELAX= 
##$RELAX= 
##$RELAX= 
##$RELAX= 
$$ Bruker specific parameters
$$ --------------------------
##$DU= <E:\>
##$EXPNO= 10
$$ [...]
150 150 150 150 150 150 150 150
##$TP07= 0
##$TPNAME0= <>
##$TPNAME1= <>
##$TPNAME2= <>
##$TPNAME3= <>
##$TPNAME4= <>
##$TPNAME5= <>
##$TPNAME6= <>
##$TPNAME7= <>
##$TPOAL= (0..7)
0.5 0.5 0.5 0.5 0.5 0.5 0.5 0.5
##$TPOFFS= (0..7)
0 0 0 0 0 0 0 0
##$TUNHIN= 0
##$TUNHOUT= 0
##$TUNXOUT= 0
##$USERA1= <user>
##$USERA2= <user>
##$USERA3= <user>
##$USERA4= <user>
##$USERA5= <user>
##$V9= 5
##$VALIST= <valist>
##$VCLIST= <CCCCCCCCCCCCCCC>
##$VD= 0
##$VDLIST= <DDDDDDDDDDDDDDD>
##$VPLIST= <PPPPPPPPPPPPPPP>
##$VTLIST= <TTTTTTTTTTTTTTT>
##$WBST= 2048
##$WBSW= 25
##$XGAIN= (0..3)
0 0 0 0
##$XL= 0
##$YL= 0
##$YMAX_a= 616908
##$YMIN_a= -521759
##$ZGOPTNS= <>
##$ZL1= 120
##$ZL2= 120
##$ZL3= 120
##$ZL4= 120
##$ABSF1= 14.98509
##$ABSF2= -5.573092
##$ABSG= 5
##$ABSL= 3
##$ALPHA= 0
##$AQORDER= 0
##$ASSFAC= 0
##$ASSFACI= 0
##$ASSFACX= 0
##$ASSWID= 0
##$AUNMP= <proc_prof1d_extract_pilot.lims>
##$AXLEFT= 0
##$AXNAME= <>
##$AXNUC= <1H>
##$AXRIGHT= 0
##$AXTYPE= 0
##$AXUNIT= <>
##$AZFE= 0.1
##$AZFW= 0.1
##$BCFW= 0
##$BC_mod= 0
##$BYTORDP= 0
##$COROFFS= 0
##$CY= 15
##$DATMOD= 1
##$DC= 0
##$DFILT= <>
##$DTYPP= 0
##$F1P= 0
##$F2P= 0
##$FCOR= 0.5
##$FTSIZE= 32768
##$FT_mod= 6
##$GAMMA= 0
##$GB= 0
##$INTBC= 1
##$INTSCL= 1
##$ISEN= 128
##$LB= 0
##$LEV0= 0
##$LPBIN= 0
##$MAXI= 10000
##$MC2= 0
##$MEAN= 0
##$ME_mod= 0
##$MI= 0
##$NCOEF= 0
##$NC_proc= -8
##$NLEV= 6
##$NOISF1= 0
##$NOISF2= 0
##$NSP= 0
##$NTH_PI= 0
##$NZP= 0
##$OFFSET= 14.98509
##$PC= 1
##$PHC0= 94.1803
##$PHC1= 0
##$PH_mod= 1
##$PKNL= yes
##$PPARMOD= 0
##$PPDIAG= 0
##$PPIPTYP= 0
##$PPMPNUM= 2147483647
##$PPRESOL= 1
##$PSCAL= 4
##$PSIGN= 0
##$PYNMP= <proc.py>
##$REVERSE= no
##$SF= 400.02
##$SI= 32768
##$SIGF1= 0
##$SIGF2= 0
##$SINO= 400
##$SIOLD= 32768
##$SPECTYP= <>
##$SREGLST= <1H.CDCl3>
##$SSB= 0
##$STSI= 32768
##$STSR= 0
##$SW_p= 8223.68421052631
##$SYMM= 0
##$S_DEV= 0
##$TDeff= 65536
##$TDoff= 0
##$TI= <>
##$TILT= no
##$TM1= 0
##$TM2= 0
##$TOPLEV= 0
##$USERP1= <user>
##$USERP2= <user>
##$USERP3= <user>
##$USERP4= <user>
##$USERP5= <user>
##$WDW= 1
##$XDIM= 32768
##$YMAX_p= 436603693
##$YMIN_p= -641880
##$CURPLOT= <Network HP LaserJet P1505>
##$CURPRIN= <$Network HP LaserJet P1505>
##$DFORMAT= <normdp>
##$LAYOUT= <+/1D_H.xwp>
##$LFORMAT= <normlp>
##$PFORMAT= <normpl>
##$SURQMSG= 1
$$ End of Bruker specific parameters
$$ ---------------------------------
##NTUPLES= NMR SPECTRUM
##VAR_NAME=  FREQUENCY,     SPECTRUM/REAL,   SPECTRUM/IMAG
##SYMBOL=    X,             R,               I
##VAR_TYPE=  INDEPENDENT,   DEPENDENT,       DEPENDENT
##VAR_FORM=  AFFN,          ASDF,            ASDF
##VAR_DIM=   32768,         32768,           32768
##UNITS=     HZ,            ARBITRARY UNITS, ARBITRARY UNITS
##FACTOR=    0.250966925370066, 1,           1
##FIRST=     8223.43324360094, -131146,      -117058
##LAST=      0,             -46193,          -238458
##MIN=       0,             -641880,         0
##MAX=       8223.43324360094, 436603693,    0
$$ Real data points
##PAGE= N=1
##DATA TABLE= (X++(R..R)), XYDATA
$$ [...]
$$ plain form
19526 -28209 -199229 74748 15084 -363016 -228092 -475934 53503 442888 32216 -268607
19515 118531 -63551 -359394 -149018 -107659 -279728 -177608 -182982 -103294 -7060 -85258 -177085
19504 -177085 197172 -121131 -54400 -257896 -114876 -74779 -53441 227333 184961 38095
19493 -34457 -83540 -169089 21495 -300195 31342 -47281 -10720 -99878 -137815 -280898 -195522
19482 -195522 -143596 19941 131472 167229 -332485 -5104 265966 -106906 24193 -88842 -51446
19471 -51446 -10258 -30062 -142563 -210158 19088 -247505 -218507 -16269 -306460 -231583 -52471
19459 -257186 -32121 -40719 253468 -116635 -65464 -107631 -1599 79214 -433914 -45224 -139395
19448 -139395 -33225 -200734 111303 127455 -64062 177742 -22683 -89965 -153379 -70933 55000
$$ packed form
19526b8209j71020G4748A5084c63016J34924k47842E3503L89385C2216b68607
19515A18531f3551k95843a49018M1359j72069J02120n374P9688g060p8198r1827
19504a77085A97172a21131e4400k03496a14876M0097K1338B27333m2372C8095
19493c4457m9083q5549B1495c00195C1342d7281a0720q9158l7937j43083Q5376
19482a95522N1926A9941J11531L5757c32485e104B65966a06906B4193h8842L7396
19471e1446a0258j9804j12501o7595A9088b47505K8998a6269k90191P4877e2471
19459b57186c2121q598B53468a16635N1171m2167a599G9214d33914d5224r4171
19448a39395c3225j67509A11303J6152f4062A77742b2683o7282o3414g0933E5000
$$ plain form
19436 -17286 -324055 79111 -90913 -23445 -48838 125333 85506 365666 49604 -9997 54367
19424 -346055 -58517 236010 -404973 -163087 225596 177883 55798 176564 -218512 -67556
19413 -140515 -42552 -47320 101635 120584 72730 -144965 73320 -108576 -232769 137707 -137131
19401 -54381 -27263 -173098 97896 238415 58307 101756 256794 -78478 200757 68498 -166793
19389 -35221 -245872 -239635 -253072 164648 -181403 -109824 -42695 72756 -179116 -21190 -66757
19378 -66757 -186943 -268111 25250 -137112 2676 -241816 253191 -347876 -111938 132646
19367 -278127 -189736 -155308 -187011 37470 29138 -254400 41670 247167 69702 -139639 -433696
19356 -433696 115425 -73244 2521 -144897 21065 135077 -80075 -76265 8415 -64476 -236525
$$ packed form
19436a7286l06769G9111i0913b3445k5393A25333l9827K80160D9604i997E4367
19424c46055e8517B36010d04973a63087B25596m7713E5798J20766b18512f7556
19413a40515d2552m768A01635J8949m7854a44965G3320a08576j24193A37707a37131
19401e4381K7118j45835I7896J40519E8307M3449J55038g8478B00757F8498a66793
19389c5221k10651O237j3437A64648a81403P1579d2695G2756a79116b1190m5567
19378f6757j20186q1168B5250a37112B676b41816B53191c47876a11938A32646
19367b78127Q8391L4428l1703C7470q332b54400D1670K05497F9702a39639k94057
19356d33696A15425g3244B521a44897B1065J14012h0075L810H415f4476j72049
$$ plain form
19345 -236525 -149869 -113506 13927 133488 -50081 91738 -225251 -291657 100308 -106157 26316
19333 -265753 -211163 35713 -237952 -29892 69742 73693 105434 60237 23961 188023 -94282
19321 -189357 93169 -160704 -15667 -80676 -38832 19943 -192035 -45052 -125993 50868 125844
19310 125844 99761 21928 46703 104323 -294049 37757 -168355 -135307 -59650 -145375 -135214
19299 -135214 -148755 -204639 88338 26377 -195336 -290594 -287451 80383 -65733 -15934 -21006 274139
19286 233914 232370 -155887 -201363 -103941 -212468 -27919 -7322 191697 200784 -318765 -190829
19275 -190829 81197 -33698 -67425 -54562 163205 -168580 32256 187236 121494 98416 -122164
19263 -68571 -269377 -23584 196102 -253711 163833 -70073 -123685 -136426 -285226 377450
$$ packed form
19345b36525Q6656L6363A3927J19561e0081I1738b25251o6406A00308a06157B6316
19333b65753N4590C5713b37952b9892F9742L951L1741m5197B3961J64062i4282
19321a89357I3169a60704a5667o5009c8832A9943a92035d5052q0941E0868P4976
19310A25844k6083B1928K4775N7620b94049C7757a68355L3048e9650q5725J0161
19299a35214j3541n5884H8338B6377a95336r5258L143H0383f5733a5934n072B74139
19286B33914j544a55887m5476R7422j08527b7919g322A91697R087c18765J27936
19275a90829H1197c3698l3727J2863A63205a68580C2256J54980o5742k3078a22164
19263f8571k00806b3584A96102b53711A63833g0073n3612j2741j48800C77450
$$ plain form
19252 -106283 77466 109849 -164619 51323 78719 -163757 -80223 217854 -203037 215443
19241 176437 32567 -67341 -297727 72051 51289 -229924 -9611 82196 -43620 101375 -280404
19229 50696 -242794 -28234 -60000 -93233 -102384 168519 -392573 -335134 339386 267020 -174790
19217 -18460 -202074 -72158 -22355 86770 27761 -88535 -155425 -162941 -84307 -500422 88223
19205 -239741 -48524 -420801 42221 -84507 -224192 29866 -135289 3173 -186878 205771 42204
19193 -51185 -55408 16913 -18265 130890 -118054 228666 35408 -148308 -255564 -24296 -148985
19182 -148985 -303681 -152659 -291164 -167818 -38916 130084 -472994 -158915 -80871 -213756
19172 -213756 -322452 -359635 -2715 -204036 -109552 -34051 -305376 78628 -175202 139278 -104342
$$ packed form
19252a06283G7466L2383a64619E1323K7396a63757h0223B17854b03037B15443
19241A76437C2567f7341k30386G2051k0762b29924i611H2196d3620A01375b80404
19229E0696b42794b8234l1766l3233r151A68519c92573N7439C39386p2366a74790
19217a8460j83614g2158b2355H6770B7761h8535o6890p516P8634m16115H8223
19205b39741d8524l72277D2221h4507j39685B9866a35289C173a86878B05771D2204
19193e1185m223A6913a8265A30890a18054B28666C5408a48308j07256b4296j24689
19182a48985j54696J51022j38505J23346c8916A30084d72994a58915P8044j32885
19172b13756j08696l7183b715k01321R4484c4051k71325G8628a75202A39278a04342
$$ plain form
19160 -210211 -277436 -167282 -163695 124377 -108260 282367 111850 -138280 -180479 -121484
19150 -121484 -184325 31100 30507 34182 -228390 -249606 -369462 -139636 -403167 319196 -18268
19138 -86112 -59987 -54218 -204459 20406 -61709 -281382 173466 -260431 -72384 -514028 107734
19126 194067 -83626 -130873 -213202 149302 -185052 -12685 -338567 5535 79879 -389246 64562
19114 8132 -88695 44881 -15351 57796 -22875 89147 -70947 -123219 -49156 29255 -103544 167902
19101 -57289 -67621 -71692 53481 -70515 -16379 -74599 -12789 -20351 103333 -70412 -159997 29843
19088 36527 152302 -124819 -97230 105799 -94713 348523 7243 -476933 147083 -69814 99309
19076 93129 25184 27857 -25480 154803 -9945 -41497 -150903 182628 113306 -14893 -488765
$$ packed form
19160b10211o7225J10154L587A24377a08260B82367A11850a38280m2199N8995
19150a21484o2841C1100n93L675b28390k1216j19856a39636k63531C19196a8268
19138h6112K6125N769j50241B0406f1709k19673A73466b60431g2384m41644A07734
19126A94067h3626m7247q2329A49302a85052a2685l25882E535P4344c89246F4562
19114H132h8695D4881a5351E7796b2875H9147g0947n2272d9156B9255a03544A67902
19101e7289j0332m071E3481g0515a6379n8220a2789p562A03333g0412q9585B9843
19088C6527J15775a24819K7589A05799i4713C48523G243d76933A47083f9814I9309
19076I3129B5184K673b5480A54803i945l1552j09406A82628o9322a4893m73872
$$ plain form
19065 -488765 -384116 70012 -137417 -203932 -154796 55827 -45407 -2703 -100429 -29002 -12905
19053 -95277 -57649 141225 -24942 -200754 -127331 -116910 -71152 -153425 17772 -31859 -75000
19042 -75000 -34085 -83571 -483436 -237612 46363 -51052 34742 -92659 -149722 -71784 174859
19030 -163671 239539 116370 -180639 -89924 50701 -118061 -284007 34220 147826 -48130
19019 114867 279387 231606 164854 -51244 -20281 213445 113401 -33530 113763 258682
19009 258682 91719 156364 12916 -30805 93980 67596 244108 -251512 -177592 -11279 -262867
18998 -262867 -120473 -229589 -169861 29851 -68603 26576 -196914 -57876 231720 37723 -359663
18986 99571 -134736 -46951 50028 -59580 -95254 34746 68526 -69666 -9933 -33077 -46085 7152
$$ packed form
19065d88765J04649G0012a37417o6515M9136E5827d5407b703r7726b9002a2905
19053i5277L7628A41225b4942j75812P3423J0421M5758q2273A7772c1859m3141
19042g5000c4085m9486l99865b37612D6363e1052C4742i2659n7063g1784A74859
19030a63671B39539A16370a80639h9924E0701a18061j65946C4220J13606d8130
19019A14867J64520m7781o6752e1244b0281B13445j00044c3530A13763J44919
19009B58682I1719O4645A2916c0805I3980k6384J76512b51512P3920a1279k51588
18998b62867a20473j09116N9728B9851f8603B6576a96914e7876B31720C7723c59663
18986I9571a34736d6951E0028e9580l5674C4746L3780f9666i933k3144j3008G152
$$ plain form
18973 -255381 -241962 -368408 -132486 194482 100222 -197724 -50240 15292 -60792 -131949 34207
18961 76997 64301 -21247 265875 -223277 -50579 -32152 144802 -74785 -115791 -408165 -92410
18949 192468 187584 -193625 -120673 -136895 -535821 54068 -27785 325888 -67680 -91423 128994
18937 -7366 -79182 147159 -1458 74488 -126338 -170737 -155758 -140859 22898 -17653 -83040 8740
18924 -47826 -142498 -124653 39753 -19487 -29011 14220 -320181 183753 10987 135075 16445
18912 112515 123000 127126 269428 -64380 -47962 -161311 -90394 -200477 -177347 161936 -198314
18900 -35090 -275310 144449 5652 109625 -356239 103211 58474 -221618 -34534 -117356 90146
18888 58347 -263475 -251326 -246200 26255 -162908 -310119 -331577 267868 48010 -33401 -337344
$$ packed form
18973b55381J3419j26446a32486A94482r4260a97724e0240A5292f0792p1157C4207
18961G6997j2696b1247B65875b23277e0579J8427A44802g4785m1006k92374i2410
18949A92468m884a93625P2952j6222l98926E4068b7785C25888f7680k3743A28994
18937g366p1816A47159a458G4488a26338m4399J4979J4899B2898a7653o5387H740
18924d7826r4672J7845C9753a9487r524A4220c20181A83753A0987J24088A6445
18912A12515J0485M126J42302f4380J6418j13349P0917j10083K3130A61936a98314
18900c5090k40220A44449E652J03973c56239A03211m4737b21618c4534q2822I0146
18888E8347b63475J2149N126B6255a62908j47211k1458B67868D8010c3401l03943
$$ plain form
18877 -337344 -30142 23867 154468 -173308 -209533 -152315 -57746 -36632 -108821 -195731 64173
18865 -230503 -154852 -141077 -196680 52626 156725 -88535 -279838 69684 112714 -101682 247548
18853 -128242 240045 28331 -88755 -20572 -224909 108918 -226696 -175039 -19985 271863
18842 7654 -116602 -42806 -38727 -195319 -203807 -187476 7226 -185745 -79924 -116999 287248 76893
18829 135903 -69986 394778 -27188 121546 221560 26103 51036 148270 51561 237842 -106277
18817 -156242 334507 126948 -70312 156730 154588 20682 146245 272685 -100218 -227359
18807 -227359 -9088 -49339 203050 -131734 -153121 84032 -287168 -209232 -64196 7376 -38509
18795 -205653 -301796 -245350 119749 -154393 -44954 -49176 140806 13645 -251970 -241688 57541
$$ packed form
18877c37344c0142B3867J30601a73308l6225N7218e7746K1114p2189q6910F4173
18865b30503P5651J3775n5603E2626J04099h8535j91303F9684M3030a01682B47548
18853a28242B40045B8331h8755b0572k04337A08918b26696N1657a9985B71863
18842G654a16602d2806M079j56592q488J6331G226a85745g9924l7075B87248G6893
18829A35903f9986C94778b7188A21546J00014B6103K4933R7234E1561J86281a06277
18817a56242C34507A26948g0312A56730k142B0682J25563J26440a00218j27141
18807b27359i088m0251B03050a31734k1387H4032b87168P7936f4196G376c8509
18795b05653r6143N6446A19749a54393d4954m222A40806A3645b51970J0282E7541
$$ plain form
18783 39668 -48055 46118 -159399 -383171 -107281 -173291 -151990 -268317 150136 22870 -39979
18771 139281 -24207 -5585 -77015 186973 15302 -21758 -227619 259449 -124057 30356 -81869
18759 -62731 51652 -70876 -258805 -1004 -25853 -81277 -33654 -281254 42312 280557 -72385
18747 -154632 -219514 58981 -87798 32940 36381 -176687 -117607 24372 111770 -32558 42236
18735 101676 31565 -158858 -55931 -78942 21118 -175480 -321773 -40564 7967 -21499 -78791
18724 -78791 -148293 13897 -11122 64977 -52927 135777 -74559 61501 105195 -452539 -213188
18712 -116587 -70878 -11676 -80416 -206648 71286 -161754 206915 43818 -190057 -180803 -186112
18701 -186112 -246098 51801 -159620 -347196 501662 -140467 70396 -30380 252994 -376717
$$ packed form
18783C9668d8055D6118a59399k23772a07281o6010K1301j16327A50136B2870c9979
18771A39281b4207e585p1430A86973A5302b1758k05861B59449a24057C0356h1869
18759f2731E1652g0876j87929a004k4849n5424c3654k47600D2312K38245g2385
18747a54632o4882E8981h7798C2940L441a76687N9080B4372Q7398c2558D2236
18735A01676C1565a58858e5931k3011B1118a75480j46293d0564G967b1499n7292
18724g8791o9502A3897a1122F4977e2927A35777g4559F1501M3694d52539b13188
18712a16587M5709a1676o8740j26232G1286a61754B06915D3818a90057R254n309
18701a86112n9986E1801a59620j87576E01662a40467G0396c0380B52994c76717
$$ plain form
18690 -167790 32171 23995 -297547 -225917 112978 -45212 -354454 -270046 -57100 115659 307183
18679 307183 -45922 44595 -409722 -198390 404650 -17286 106007 -174881 -65031 -163203
18669 -163203 13930 -184502 160771 -17870 -40893 -93980 -43866 -195479 153111 -143120
18658 174661 -112635 4245 145798 -163930 -61634 -184127 -327534 -102684 232737 44686
18647 -236950 -250262 -39722 -177126 38486 -52273 -36938 -76482 -202497 -162796 18749 -62967
18635 -59290 -345627 -77201 146615 -300567 -114448 10000 -395275 -4786 -392865 -43686 17180
18623 -211006 -93827 -184096 -54286 21435 -118175 -103410 -184171 59435 -105288 206756 -194323
18611 -76235 25545 81894 24857 -26750 -382949 -77092 -122134 214721 -127196 59430 -48921
$$ packed form
18690a67790C2171q176b97547P1630A12978d5212l09242Q4408e7100A15659J91524
18679C07183d5922D4595d09722a98390D04650a7286A06007a74881f5031r8172
18669a63203A3930a84502A60771a7870k3023n3087d3866j51613A53111a43120
18658A74661a12635D245J41553a63930f1634j22493j43407a02684B32737D4686
18647b36950j3312c9722j37404C8486e2273J5335l9544j26015L9701A8749f2967
18635e9290k86337g7201A46615c00567a14448A0000c95275d786l88079d3686A7180
18623b11006i3827r0269e4286B1435a18175J4765q0761E9435a05288B06756a94323
18611g6235B5545N6349B4857b6750l56199g7092m5042B14721a27196E9430d8921
$$ plain form
18599 63243 -60728 -74414 -62558 -271577 -183783 -88016 -98561 -151458 -109433 8165 -120282
18587 180766 87180 122530 -47090 -5954 -69771 376564 60528 -13573 29059 -156950 23436
18575 279615 -32180 -134967 169623 -37064 171661 127066 -119226 298698 237291 89877
18564 -37927 -150068 -154572 83931 137591 -236828 153920 65313 120989 -472026 29293 49839
18553 49839 -118046 -153180 96276 -249125 2606 48975 -58086 -176665 -276328 -57692 -140274
18542 -140274 -135669 49469 -69825 -94846 -128921 -248168 40081 50159 137898 -87393 -132897
18531 -132897 -37278 166074 -131040 -128197 159496 155485 -44833 -198695 69245 -49529 77473
18519 -40437 -22880 -48092 -84544 253289 -235453 10777 96673 111375 -224398 -77173 4462
$$ packed form
18599F3243f0728j3686J1856k09019Q7794h8016j0545n2897M2025H165a20282
18587A80766H7180L5350d7090e954o3817C76564F0528a3573B9059a56950B3436
18575B79615c2180j02787A69623c7064A71661m4595a19226B98698o1407H9877
18564c7927j12141m504H3931N3660b36828A53920F5313N5676d72026B9293K0546
18553D9839a18046l5134I6276b49125B606M6369e8086j18579r9663e7692q2582
18542a40274M605D9469f9825k5021l4075j19247D0081J0078Q7739h7393m5504
18531a32897c7278A66074a31040K843A59496m011d4833j53862F9245d9529G7473
18519d0437J7557k5212l6452B53289b35453A0777Q5896J4702b24398g7173D462
$$ plain form
18507 -176413 158856 78733 -145939 -128457 -363417 -96049 -153228 -126084 -306191 -188985
18497 -188985 8263 108979 -74199 192745 -538012 -136765 -176533 -255646 -141740 -92134 33970
18485 -157066 -428425 330378 -329032 -320206 -108793 -351312 -329779 20921 -318685 61816
18474 -103559 19507 208928 13111 35418 140479 233978 -254196 161876 55272 -97551 -125258
18463 -125258 -134847 -67662 -512048 -82958 -81770 -203159 192273 166111 73580 63015 -140715
18451 309736 217653 -218575 145025 8099 -211371 103958 -152814 -281492 -169847 167252
18440 -235486 -140063 -295121 214868 -152822 -191037 33058 114485 -103405 -17550 -147820
18430 -147820 2262 109010 -368067 -498608 -172028 102975 392810 -31279 -116266 -422904
$$ packed form
18507a76413A58856G8733a45939J7482k34960i6049n7179K7144j80107J17206
18497a88985H263J00716g4199A92745e38012a36765l9768p9113J13906M9606C3970
18485a57066k71359C30378c29032Q826a08793k42519K1533B0921c18685F1816
18474a03559A9507J89421A3111K2307J05061R3499b54196A61876E5272i7551k7707
18463a25258r589O7185m44386h2958J188j21389A92273k6162G3580j0565a40715
18451C09736r2083b18575A45025H099b11371A03958a52814j28678J11645A67252
18440b35486R5423j55058B14868a52822l8215C3058Q1427a03405a7550j30270
18430a47820B262J06748c68067j30541a72028A02975K89835c1279q4987l06638
$$ plain form
18420 -422904 -173052 237738 -231952 -140771 -17919 -108072 -74900 -260813 -8108 68495 -126686
18408 27827 276006 179872 22030 91996 -173794 -171518 -147030 153879 60943 -187582 -162184
18397 -162184 110314 87715 -2407 207778 10038 -374072 -327971 132625 83739 -63398 -338958
18386 -338958 123078 -267318 -31215 -299998 136493 -54719 50596 357533 -19579 -6797 -100920
18375 -100920 -34854 -303548 -132039 -68005 157163 -234733 55369 -182110 -275592 80554
18364 146339 -60531 255781 -143702 -389796 -81020 139491 -145740 292172 -150552 -96964
18354 -96964 64845 142215 -263029 223814 -123031 -478223 165752 152815 91109 72582 -60279
18342 -188690 10230 -88755 139031 -16971 75447 50408 -135476 -84600 -341046 -63454 -264378
$$ packed form
18420d22904a73052B37738b31952R1181a7919r0153L3172j85913h108F8495a26686
18408B7827K48179r6134B2030O9966a73794K276K4488A53879F0943a87582K5398
18397a62184A10314k2599b407B07778A0038c74072M6101A32625m8886f3398k75560
18386c38958A23078b67318c1215k68783A36493e4719E0596L06937a9579f797r4123
18375a00920c4854k68694a32039O4034A57163b34733E5369a82110r3482H0554
18364A46339f0531B55781a43702k46094h1020A39491a45740B92172a50552N3588
18354i6964F4845P7370b63029B23814a23031l55192A65752j2937o1706j8527f0279
18342a88690A0230h8755A39031a6971G5447k5039a35476N0876k56446f3454k00924
$$ plain form
18331 -264378 -342158 215959 107569 119285 17768 -434796 -96967 169374 -79914 -260671
18321 -260671 110275 75119 17073 -497031 -94607 123334 176844 127753 -61197 134907 -156991
18309 -137152 -193199 43862 215558 36210 100849 -96955 128820 -142117 160609 109114 48152
18297 -34122 23118 3964 295374 -102565 -194964 39788 96432 27198 -60809 109137 59556
18286 59556 -364347 -249374 -13829 170447 -223055 -161447 -68957 261444 53640 -305951
18275 134996 76002 56427 -251270 -513428 134849 55054 -173936 -91101 2622 102020 -79484
18263 17231 225314 -38414 -23188 55242 -116211 553 -111004 -256941 146199 84678 -121684
18251 -38283 20384 238206 227964 -213578 -233235 36379 -58131 321629 248803 2130 103581
$$ packed form
18331b64378p7780B15959A07569J1716A7768d34796i6967A69374g9914j80757
18321b60671A10275l5156A7073d97031i4607A23334N3510m9091f1197A34907a56991
18309a37152n6047D3862J71696C6210O4639i6955A28820a42117A60609n1495D8152
18297c4122B3118C964K91410a02565r2399C9788N6644B7198f0809A09137m9581
18286E9556c64347J14973a3829A70447b23055O1608f8957B61444E3640c05951
18275A34996n8994j9575b51270k62158A34849E5054a73936Q2835B622R9398g9484
18263A7231K08083c8414J5226E5242a16211E53a11004j45937A46199o1521a21684
18251c8283B0384K17822j0242b13578j9657C6379e8131C21629p2826B130J01451
$$ plain form
18240 103581 -142448 48053 107024 -441768 -34830 130730 77161 -264504 -119868 -138051
18230 -138051 -102452 -61723 299 370826 -112357 77768 109312 -6451 141960 -193879 69620
18218 -6940 100250 -38887 -47432 -44930 344471 -245621 -93586 -99753 -82885 -113367 -146432 49975
18205 141892 -280789 179472 3021 28872 -328643 -137628 85935 -249840 -238116 114199
18194 103804 -27661 -164240 -100209 130429 -224553 235957 436116 -29643 -15191 74654
18183 55015 196971 201916 217262 -36805 -230655 -256386 41934 -150573 -43264 -194260 37053
18171 126872 -370736 27567 -203734 -1880 320586 -68836 206568 -235237 -122872 -53883
18160 190805 -616 83529 -15578 57154 -189895 -124647 -62600 -294079 -98953 192671 -214813
$$ packed form
18240A03581a42448D8053N8971d41768c4830A30730n3569b64504a19868j8183
18230a38051L5599M0729B99L70527a12357G7768L1544f451A41960a93879F9620
18218f940A00250c8887q545K502C44471b45621i3586o167J6868l0482l3065D9975
18205A41892b80789A79472C021K5851c28643a37628H5935b49840J1724A14199
18194A03804b7661j36579O4031A30429b24553B35957K00159b9643J4452G4654
18183E5015J41956M945J5346c6805j93850k5731D1934a50573d3264j50996C7053
18171A26872c70736B7567b03734a880C20586f8836B06568b35237J12365e3883
18160A90805f16H3529a5578E7154a89895O5248O2047k31479i8953A92671b14813
$$ plain form
18148 -190301 204767 -293900 40230 -34698 -250087 -7326 -157055 -118281 209814 -337425
18137 182147 -305400 66235 181250 226002 -195960 -71972 -186989 -104540 126994 -85561
18126 -60139 -296236 117698 -14776 -49019 301322 -35630 179519 -184021 54044 -257326
18115 99884 -11206 -17782 42212 -187372 92297 -168783 54700 189055 1582 -139766 -143098
18104 -143098 -102060 -78523 -273651 -138782 3603 -141879 -347529 117747 359053 131579
18093 -107740 94930 -57710 92111 181843 -94687 163914 379350 130657 190667 -227241 -3191
18081 14220 147892 199525 36049 71098 46981 -409397 -5006 -71824 -131566 283030 23454
18069 -233897 105448 42377 -224534 -118461 -148364 262316 -132080 17769 119038 195695
$$ packed form
18148a90301B04767b93900D0230c4698k15389g326j49729L8774B09814c37425
18137A82147c05400F6235J15015M4752a95960g1972j15017Q2449A26994h5561
18126f0139k36097A17698a4776l4243C01322c5630A79519a84021E4044b57326
18115I9884a1206o576D2212a87372I2297a68783E4700J34355A582a39766l332
18104a43098M1038K3537j95128J34869C603a41879k05650A17747K41306A31579
18093a07740I4930e7710I2111Q9732i4687A63914K15436A30657O0010b27241c191
18081A4220J33672N1633C6049L5049k4117d09397e006o6818n9742B83030B3454
18069b33897A05448D2377b24534J06073k9903B62316a32080A7769J01269P6657
$$ plain form
18059 195695 -106159 -21281 362590 -74219 -376580 -44843 378280 -103560 201770 -33571
18048 -28434 39832 -28394 -129184 81289 39409 70997 1762 -116224 306601 -154648 63817
18036 -54602 -160323 -9392 -331253 -61903 -247577 -139074 -126416 133944 -132216 145886
18025 -376604 -142605 -305641 -138859 -358063 -123610 135064 -206027 -98862 -54494 91013
18014 -61132 200269 -228792 322263 -99647 37291 167166 7516 154971 -325028 -244972 188812
18002 184411 117892 47616 -123205 -189664 -148859 -15705 -40812 -166189 149604 -25651 -47058
17991 -47058 -260660 -5395 218698 -108880 22862 -88738 -111884 81112 -222521 12332 -35052
17979 -164523 118499 36725 119133 152449 -73891 -44567 176384 -273219 157518 -137905
$$ packed form
18059A95695a06159b1281C62590g4219l02361d4843C78280a03560B01770c3571
18048b8434C9832b8394j00790H1289C9409L1588A762a16224C06601a54648F3817
18036e4602j05721i392l21861f1903j85674J08503J2658A33944a32216A45886
18025c76604a42605j63036a38859k19204a23610A35064b06027i8862M4368I1013
18014f1132B00269b28792C22263i9647C7291J29875G516J47455c25028Q0056A88812
18002A84411o6519D7616a23205o6459M0805a5705k5107j25377A49604b5651k1407
17991d7058k13602e395B18698a08880B2862h8738k3146H1112b22521A2332c5052
17979a64523A18499C6725Q2408L3316g3891K9324A76384b73219A57518a37905
$$ plain form
17968 -157160 63713 86085 -365985 -280166 -120169 -85633 -240627 -107610 104769 195616
17958 195616 194745 36867 42044 -14093 -47016 394279 28278 127988 -292514 182123 -152843
17946 -103116 320972 -39311 -90790 -411782 -214056 214062 11938 171071 42206 -64355
17935 53279 97706 -127205 -26175 -189289 -2499 218056 62390 9986 318260 42544 21666
17924 21666 73338 104696 73158 -126959 -231557 394860 -62339 78545 5746 21982 -104804
17912 -162765 -48425 -161061 214975 91007 -120718 68909 82414 348941 -16428 48945 -88298
17900 286368 215549 -20125 -167341 83728 52827 32744 -316804 90131 -125 -95285 -51831
17889 -51831 313810 59819 -305232 -295998 -207702 100708 115166 -66051 9228 -49786 148470
$$ packed form
17968a57160F3713K2372c65985Q5819a20169L4536j54994a07610A04769R0847
17958A95616q71C6867N177a4093l2923C94279B8278R9710b92514A82123a52843
17946a03116C20972c9311n1479l20992J97726B14062A1938J59133D2206f4355
17935E3279M4427a27205b6175j63114b499B18056F2390I986L08274D2544k0878
17924B1666N1672L1358l1538a26959j04598C94860f2339G8545E746J6236a04804
17912a62765d8425j12636B14975I1007a20718F8909J3505K66527a6428D8945h8298
17900B86368p0819b0125j47216H3728l0901k0083c16804I0131a25r5160M3454
17889e1831C13810E9819c05232R234Q8296A00708J4458f6051I228d9786A48470
$$ plain form
17877 -15089 -47165 327121 -63570 -185013 109251 -302398 126536 -82729 129013 172640
17867 172640 -28331 213249 97269 -18772 -73347 -165538 192128 83207 -165717 -77176 -43062
17856 -43062 369733 254397 221577 -95714 2764 243176 -207581 -138347 -386928 -50696 315925
17844 56894 -89013 50388 118300 106023 -125980 159447 243131 -119391 -69342 -53874 330419
17832 41755 121593 -24743 141678 -143491 -1328 333763 -45780 152690 -9439 197659 125519
17821 125519 20990 8130 -201222 -237346 -14553 10803 40231 23220 -306543 174006 27718
17809 -133983 -106094 -145247 6393 -74086 -30408 95777 142924 -127323 48722 115757 -71716
17797 146710 4005 -315998 -176512 316262 43428 -124975 -86228 164963 115735 -156678
$$ packed form
17877a5089l2076C27121f3570j21443A09251c02398A26536h2729A29013M3627
17867A72640b8331B13249I7269a8772n4575r2191A92128H3207a65717g7176L4114
17856d3062C69733j15336l2820i5714B764K40412b07581O9234k48581e0696C15925
17844E6894h9013E0388O7912j2277a25980A59447Q3684a19391N0049J5468C30419
17832D1755P9838b4743A41678a43491a328C33763d5780A52690i439A97659p2140
17821A25519B0990H130b01222l6124a4553A0803K9428j7011c06543A74006B7718
17809a33983K7889l9153F393g4086c0408I5777M7147a27323D8722O7035g1716
17797A46710D005c15998J39486C16262D3428a24975L8747A64963m9228a56678
$$ plain form
17786 -204687 -132231 56460 299239 28309 258695 -27866 -8895 35548 225196 15054 343084
17775 343084 -19223 221621 5254 74768 -111716 85013 -185031 -157160 -123172 -308018 44715
17763 45045 48565 329822 -204249 -105012 118508 -106223 -120049 -162290 -176657 78656 -3075
17751 -195358 -134174 309365 317670 -13300 96976 242197 195090 82279 33070 92891 -148025
17739 81308 128353 -76049 98955 -101842 240014 18883 167484 -67637 -96265 89610 259233
17728 259233 71892 -31775 219503 -74507 -3772 -76557 211249 110858 -291769 204657 155658
17717 155658 220521 -182942 181657 -200133 -145928 -155940 276426 159644 243970 -143093
17706 107773 -28234 86208 -138638 189246 -22738 146032 205052 -370170 -108723 -33071
$$ packed form
17786b04687P2456E6460K42779B8309K30386b7866h895C5548J89648A5054L28030
17775C43084a9223B21621E254O9514a11716H5013a85031K7871L3988j84846D4715
17763D5045L520K81257b04249R9237A18508a06223j3826m2241j4367G8656c075
17751a95358O1184C09365Q305a3300I6976J45221m7107H2279C3070N9821a48025
17739H1308M7045g6049I8955a01842B40014A8883J48601f7637k8628H9610J69623
17728B59233G1892c1775B19503g4507c772p2785B11249j00391b91769B04657m8999
17717A55658O4863a82942A81657b00133N4205j0012B76426j16782Q4326a43093
17706A07773b8234H6208a38638A89246b2738A46032N9020c70170a08723c3071
$$ plain form
17695 71230 -57936 82217 -78941 95403 64408 -107881 -41265 -4 -92492 -67812 62582 -172528
17682 191304 339249 36960 -39301 -33421 127240 130114 114265 127050 -50425 287414 309661
17671 309661 -19330 -100358 65173 -195956 -66544 40719 68205 153444 207007 104410 -98023
17659 -94908 6862 64937 -101309 233923 82961 -27421 351498 136550 178983 195993 277234
17648 277234 115846 34890 90288 -79492 -125672 92636 227912 -87119 -190074 -228686 -183143
17637 -183143 94231 181919 -113487 4159 -12026 -25814 -142991 38438 118556 63787 -66830
17625 151488 59145 196386 283096 127545 155325 140347 -90965 27989 -23849 -127340 52360
17613 -64591 -262976 294560 68655 116789 127011 78736 97264 -62384 -247321 26672 48203
$$ packed form
17695G1230e7936H2217g8941I5403l0995a07881d1265dr2488K4680F2582a72528
17682A91304J47945C6960c9301N880A27240K874j5849J2785e0425B87414K2247
17671C09661a9330q1028F5173a95956f6544D0719K7486Q5239N3563j02597i8023
17659i4908F862N8075a01309B33923H2961b7421C51498A36550M2433J7010Q1241
17648B77234A15846C4890N5398g9492m6180I2636J35276h7119j02955l8612M5543
17637a83143I4231Q7688a13487D159a2026j3788j17177C8438Q0118n4769f6830
17625A51488E9145J37241Q6710A27545K7780j4978i0965B7989b3849j03491E2360
17613f4591j98385B94560F8655M8134J0222m8275J8528f2384j84937B6672K1531
$$ plain form
17602 48203 179977 297072 -70086 -31050 38613 -63705 -180658 -81401 -23060 252458 -77550
17590 -61902 -274897 -125983 -82846 306622 -100479 -4141 174427 139896 3570 182668 -102261
17578 42525 -20157 20058 -118029 166912 188518 549685 -225901 80322 102591 82736 -20477
17566 -134302 28518 315318 -168287 352055 62742 -157161 63764 204999 2021 186073
17556 186073 -219277 85214 -34644 283658 -106456 142786 270773 -219228 10518 324743
17546 324743 165360 -169161 51285 160025 219086 -99841 48693 221733 176070 -11206 -211984
17535 -211984 327540 10465 -251446 82198 46320 -4923 122720 -68253 12387 55058 213894
17524 213894 339769 100034 -1737 169745 67991 321768 319542 -13824 173583 -225675 53367
$$ packed form
17602D8203J31774J17095g0086c1050C8613f3705j16953h1401b3060B52458g7550
17590f1902k12995a25983M3137C06622a00479d141A74427l4531C570J79098a02261
17578D2525b0157B0058a18029A66912K1606L61167b25901H0322K2269j9855b0477
17566a34302B8518K86800a68287C52055F2742a57161F3764J41235B021J84052
17556A86073b19277H5214c4644B83658a06456A42786J27987b19228A0518L14225
17546C24743j59383a69161E1285J08740N9061i9841D8693J73040m5663a1206k00778
17535b11984C27540A0465b51446H2198l5878d923A22720f8253A2387M2671J58836
17524B13894J25875A00034a737A69745F7991K53777k226a3824A73583b25675E3367
$$ plain form
17512 353688 115338 -170318 -378286 208527 90579 116599 -112442 86204 -74002 -259421
17502 -259421 248953 182140 -49294 116838 247687 200383 -25213 261255 -34357 -163583
17492 -163583 367385 618511 42399 260796 16998 237873 41523 334966 263422 -155955
17481 273016 141900 -30093 269000 358264 350993 -65515 155394 264788 33719 264878 301476
17470 301476 540268 92564 285753 441348 294624 95606 176500 -114746 -139351 -60432
17459 173479 82356 207033 64781 56146 460188 231443 204547 186247 330436 152470 664212
17448 664212 347463 297637 290579 402643 358620 166903 552708 103852 99672 281428 324738
17437 324738 42653 357545 462296 -23143 164774 -143535 54514 160096 110104 303517
$$ packed form
17512C53688A15338a70318k07968B08527I0579K6020a12442H6204g4002j85419
17502b59421B48953o6813d9294A16838J30849m7304b5213B61255c4357j29226
17492a63583C67385K51126D2399K18397A6998K20875D1523K93443p1544a55955
17481B73016j31116c0093B69000Q9264p271f5515A55394J09394C3719K31159L6598
17470C01476K38792I2564J93189J55595j46724I5606Q0894a14746k4605f0432
17459A73479H2356J24677F4781q635M04042k28745k6896j8300J44189A52470N11742
17448F64212l16749m9826p058J12064m4023A66903L85805A03852m180J81756M3310
17437C24738D2653L14892J04751b3143A64774a43535E4514J05582m9992J93413
$$ plain form
17427 303517 -66232 212736 174073 319582 103144 406876 258892 68542 104229 40271
17416 30323 188314 23893 255604 159010 258787 178142 -44089 246504 67064 27805 421392
17405 421392 301673 146352 240852 135774 -86071 312967 260723 -3995 293818 270740 83546
17393 46589 159335 455045 185664 152146 63797 4226 -14349 -12200 -19001 226896 400731
17382 400731 32385 385721 -37717 46686 -29063 9209 412556 129677 77354 8045 -180863
17370 -57429 516694 213052 90463 334916 -237509 219023 78803 266688 327711 158388
17359 191544 88583 259884 321582 -98621 -29921 250475 202960 316281 188760 605415
17349 605415 454247 238903 205517 165689 281939 207730 318284 -29643 124312 205038
$$ packed form
17427C03517f6232B12736l8663J45509A03144L03732j47984F8542L5687D0271
17416C0323J57991B3893K31711r6594R9777q0645d4089B46504F7064B7805L93587
17405D21392j19719A46352R4500j05078h6071C12967n2244c995B93818k3078H3546
17393D6589J12746K95710A85664l3518F3797D226a4349K149o801B26896J73835
17382D00731C2385L53336c7717D6686b9063I209M03347A29677n2323H045a80863
17370e7429E16694B13052I0463K44453b37509B19023G8803J87885O1023A58388
17359A91544H8583J71301O1698i8621b9921B50475m7515J13321j27521M16655
17349F05415j51168k15344l3386l9828J16250p4209J10554b9643A24312Q0726
$$ plain form
17339 205038 113876 345188 244809 395119 276824 559240 100023 184780 -113879 191484
17328 39434 94293 254671 49815 174922 -80215 126150 -149747 216974 161804 85389 -4642
17316 153624 220400 143002 -286529 81986 399331 74672 228177 150264 -87169 98941 324321
17305 324321 134314 311843 307905 248204 58240 57732 258681 372991 84095 -260880 -137798
17294 -137798 296384 209132 242810 308691 57310 -98024 1687 157031 374517 -182848 333064
17282 290420 353803 418139 -25664 247655 432130 135714 50268 -11482 -185912 54132 55790
17271 55790 286700 226946 154009 257959 286421 199644 417485 143781 87213 242478 138192
17260 138192 -102889 255101 261524 179896 280567 319935 573879 -62787 81437 12406 126917
$$ packed form
17339B05038r1162K31312j00379J50310j18295K82416A00023Q4757a13879A91484
17328C9434N4859J60378D9815J25107h0215A26150a49747B16974n5170p6415d642
17316A53624O6776p7398b86529H1986L17345G4672J53505p7913h7169I8941K25380
17305C24321A34314J77529l938n9701E8240n08K00949J14310H4095b60880J23082
17294a37798B96384q7252L3678O5881E7310i8024A687J55344K17486a82848C33064
17282B90420O3383O4336b5664B47655J84475A35714E0268a1482j74430E4132J658
17271E5790K30910n9754p2937J03950K8462q6777K17841A43781n6568J55265j04286
17260A38192a02889B55101O423q1628J00671L9368K53944f2787H1437A2406J14511
$$ plain form
17249 126917 -90426 91993 309185 502517 79581 143889 101427 483783 103356 375931
17239 375931 357083 479035 220715 292457 44609 1081 -97518 189415 625498 154907 365462
17228 365462 197562 160284 106209 593147 119948 114860 306693 70725 165276 301538 149088
17216 246304 473269 428165 139549 221791 -63578 193380 -116567 12355 303182 112946
17205 213862 258769 -88689 269693 704349 35222 290556 207105 307174 225598 263538 108347
17193 203582 -83755 304488 -108955 269010 159051 351212 102969 347812 555663 143823
17182 346952 370770 504438 197900 230940 117087 512432 151407 163054 18134 292591
17172 292591 501214 14207 482231 356545 411221 127908 87082 396175 379092 -89246
$$ packed form
17249A26917i0426I1993K17192J93332G9581O4308m2462L82356A03356K72575
17239C75931j8848J21952B20715P1742D4609A081i7518A89415M36083A54907K10555
17228C65462j67900l7278n4075M86938A19948n088J91833G0725R4551J36262A49088
17216B46304K26965m5104A39549Q2242f3578A93380a16567A2355K90827A12946
17205B13862M4907h8689B69693M34656C5222K55334q3451J00069q1576L7940A08347
17193B03582h3755C04488a08955B69010j09959J92161A02969K44843K07851A43823
17182C46952K3818J33668A97900L3040j13853L95345A51407J1647A8134K74457
17172B92591K08623A4207M68024j25686N4676A27908m0826L09093j7083h9246
$$ plain form
17161 200905 333972 264984 303437 328307 451535 345048 165928 666469 171070 378339
17151 378339 314807 -25428 193634 141135 457353 44318 281655 373290 280354 711540 71835
17139 356629 627064 281995 653088 97594 28994 465154 376116 308722 408984 73693
17128 438184 259815 390342 377602 583894 271802 306377 443235 278394 543752 285469
17118 285469 502565 218605 763969 395808 677109 432534 204930 382417 378555 440413
17108 440413 335859 658541 666392 219673 139648 795918 487971 527122 598580 520473 252930
17096 285849 277869 448556 445249 388986 669667 521398 461437 386251 424447 693729 383618
17085 383618 64193 426433 333309 299179 511164 253980 625268 443349 258851 938757
$$ packed form
17161B00905J33067o8988L8453K4870J23228j06487A65928N00541A71070K07269
17151C78339o3532b5428A93634n2499L16218D4318K37337R1635r2936M31186G1835
17139C56629K70435B81995L71093I7594B8994M36160q9038o7394J00262G3693
17128D38184j78369J30527j2740K06292B71802L4575J36858j64841K65358k58283
17118B85469K17096B18605N45364l68161K81301k44575B04930J77487l862O1858
17108D40413j04554L22682P851B19673q0025O56270l07947L9151P1458p8107B52930
17096B85849p980J70687l307n6263K80681j48269n9961p5186L8196K69282l10111
17085C83618F4193L62240r3124l4130K11985B53980L71288j81919j84498O79906
$$ plain form
17075 938757 613006 657996 734179 670736 539042 466056 424645 605907 739584 678838 453286
17064 453286 -81615 771655 433219 549745 745202 657707 822840 432611 430456 642378
17054 642378 391152 407058 543297 595953 721089 686688 390923 490232 567801 694627
17044 694627 420828 675962 566379 711192 377304 360842 486852 769597 642576 980041
17034 980041 703791 652718 631791 528987 735307 566950 981561 687307 724761 479838
17024 479838 908959 721500 801236 408634 901991 810898 410551 884222 712001 711691
17014 711691 1064348 686769 799346 516049 669747 800011 401348 764384 652016 964566
17004 964566 793921 548881 859863 484662 591191 890770 671897 714975 873624 932238
$$ packed form
17075I38757l25751M4990P6183o3443j31694p2986m1411J81262J33677o0746k25552
17064D53286h1615G71655l38436J16526J95457q7495J65133l90229k155K11922
17054F42378k51226J5906J36239N2656J25136l4401k95765R9309P7569J26826
17044F94627k73799K55134j09583J44813l33888j6462J26010K82745j27021L37465
17034I80041k76250n1073k0927j02804K06320j68357M14611k94254L7454k44923
17024D79838M29121j87459P9736l92602M93357r1093m00347M73671j72221l10
17014G11691L52657l77579J12577k83297J53698J30264l98663L63036j12368L12550
17004I64566j70645k45040L10982l75201J06529K99579k18873M3078J58649N8614
$$ plain form
16994 932238 894132 694640 1161261 576970 1003051 1239461 777293 1070979 903306 1010345
16984 1010345 818408 1273151 955249 1048874 859266 887685 842907 762991 655089 1267573
16974 1267573 849829 939887 1082730 1097728 1004469 1020892 1165777 746835 1048581 1151140
16964 1151140 953011 899762 1185513 1063066 1458392 776205 1150340 949071 1058825 1196373
16954 1196373 1060169 1279874 947696 1371542 1576692 1381797 1541933 1049325 1488644
16945 1488644 1321685 1104129 1297526 1100541 1188339 1224658 1394407 1606545 1301892 1768111
16935 1768111 1292596 1479746 1550326 1191055 1869392 1491509 1257958 1599211 1617557 1692109
16925 1692109 1700583 1568976 1354731 1787819 1662233 1486007 1650378 1475016 1556063 1585221
$$ packed form
16994I32238l8106j99492M66621E76970M26081K36410m62168K93686j67673J07039
16984A010345j91937M54743l17902R3625j89608K8419m4778p9916j07902O12484
16974A267573m17744R0058J42843J4998r3259J6423J44885m18942L01746J02559
16964A151140j98129n3249K85751j22447L95326o82187L74135k01269J09754J37548
16954A196373j36204K19705l32178M23846K05150j94895J60136m92608M39319
16945A488644j66959k17556J93397j96985Q7798L6319J69749K12138l04653M66219
16935A768111m75515J87150P0580l59271O78337l77883k33551L41253J8346P4552
16925A692109Q474j31607k14245M33088j25586j76226J64371j75362Q1047K9158
$$ plain form
16915 1585221 1603404 1772789 1519744 1753833 1954536 1911973 1632048 1998800 1766153 1747014
16905 1747014 1811365 2006356 2104156 1956355 2339808 1852003 1958592 2228043 2001732 2210091
16895 2210091 2350604 2359188 2200577 2494359 1896774 2229568 2428947 2117006 2261932 2486124
16885 2486124 2346208 2398828 2492717 2443397 2467640 2512700 2987549 2849804 2684538 2718144
16875 2718144 2920063 2846051 2781720 3035172 2962849 3391154 3003162 3271504 3318385 3441592
16865 3441592 3204425 3142202 3241116 3217164 3664224 3414916 3470219 3727852 3849893 3936757
16855 3936757 3696182 3902771 4063455 3902763 4073666 4320616 4122117 4112266 4569327 4184811
16845 4184811 4559979 4425722 4670242 4922989 4968295 5016509 5079630 5205785 4960653 5070904
$$ packed form
16915A585221J8183J69385k53045K34089K00703m2563k79925L66752k32647j9139
16905A747014O4351J94991R7800j47801L83453m87805J06589K69451k26311K08359
16895B210091J40513Q584j58611K93782n97585L32794J99379l11941J44926K24192
16885B486124j39916N2620R3889m9320K4243M5060M74849j37745j65266L3606
16875B718144K01919p4012o4331K53452p2323M28305l87992K68342M6881J23207
16865C441592k37167o2223R8914k3952M47060k49308N5303K57633J22041Q6864
16855C936757k40575K06589J60684j60692J70903K46950j98499r851M57061l84516
16845D184811L75168j34257K44520K52747M5306M8214O3121J26155k45132J10251
$$ plain form
16835 5070904 5165990 5239301 5676537 5714516 5900055 5907156 6052565 6204522 6068645 6227348
16825 6227348 6575459 6635259 7020412 6878830 7085467 7016827 7183363 7562348 8086774 7686189
16815 7686189 8303732 7956519 8496960 8681410 9076384 8774642 8936248 9483949 9806249
16806 9806249 9845173 10001723 10172702 10624503 10863701 10941316 11053434 11570137 12080477 12156286
16796 12156286 12469223 12893008 13128769 13385588 13972636 14253655 14844475 15358933 15514895
16787 15514895 15364319 16570875 16868729 17535646 18143594 18422120 18849635 19551550 20242688
16778 20242688 20770642 21513271 22170045 23011127 23938811 24687501 25520471 26483399 27370895
16769 27370895 27970124 29406714 30325825 31425834 32372967 33584645 35040705 36316851
$$ packed form
16835E070904R5086P3311M37236L7979J85539P101J45409J51957j35877J58703
16825F227348L48111N9800L85153j41582K06637o8640J66536L78985N24426m00585
16815G686189O17543l47213N40441J84450L94974l01742J61606N47701L22300
16806I806249L8924J56550J70979M51801K39198P7615J12118N16703N10340P5809
16796A2156286L12937M23785K35761K56819N87048K81019N90820N14458J55962
16787A5514895j50576J206556K97854O66917O07948K78526M27515P01915O91138
16778B0242688N27954P42629O56774Q41082R27684P48690Q32970R62928Q87496
16769B7370895N99229J436590R19111J100009R47133J211678J456060J276146
$$ plain form
16761 36316851 37869299 39487923 40881413 42406974 44410212 46257606 47748072 49813920
16753 49813920 51891297 53960220 56339199 58939480 61207906 64214943 66885214 69429788
16745 69429788 72554184 75494127 78618593 81583631 85179021 88383410 92147396 95595025
16737 95595025 98728484 102430989 105916450 109301022 112697171 115729163 118791557 121359778
16729 121359778 123879507 125984945 128090300 129574258 130643570 131195365 131471285 131346021
16721 131346021 130523989 130074262 128422277 127054242 125027901 122507618 119785181 117180876
16713 117180876 114096649 110682957 107645398 104156451 100440468 96832551 93556499 90257104
16705 90257104 86830466 83639520 80358484 77252355 74264009 71562679 68432463 65596606
$$ packed form
16761C6316851J552448J618624J393490J525561K003238J847394J490466K065848
16753D9813920K077377K068923K378979K600281K268426L007037K670271K544574
16745F9429788L124396K939943L124466K965038L595390L204389L763986L447629
16737I5595025L133459L702505L485461L384572L396149L031992L062394K568221
16729A21359778K519729K105438K105355J483958J069312N51795K75920j25264
16721A31346021q22032m49727j651985j368035k026341k520283k722437k604305
16713A17180876l084227l413692l037559l488947l715983l607917l276052l299395
16705I0257104l426638l190946l281036l106129k988346k701330l130216k835857
$$ plain form
16697 65596606 63291400 60613240 58455522 55901108 53666256 51794017 49325255 47773714
16689 47773714 46041562 43978371 42621873 40909084 39343161 38010737 36593751 35522568
16681 35522568 33952159 32843990 31896692 30760355 29743395 28697768 27831982 27064035
16673 27064035 26190174 25399854 24305883 23750805 22864945 22099043 21596016 20922892 20320606
16664 20320606 19819703 19319179 18895945 18193032 17513334 17049764 17159741 16493878 16171571
16655 16171571 15360671 15096146 14836738 14290203 13833919 13429527 13048923 13012310 12867723
16646 12867723 12410585 12355809 11916745 11902147 10918210 11143831 10821672 10807094 10518167 9957752
16636 9957752 9981269 9823589 9323369 9065362 9177683 9205571 8833999 8822820 8137164 8202795
$$ packed form
16697F5596606k305206k678160k157718k554414k234852j872239k468762j551541
16689D7773714j732152k063191j356498j712789j565923j332424j416986j071183
16681C5522568j570409j108169r47298j136337j016960j045627q65786p67947
16673B7064035q73861p90320j093971n55078q85860p65902n03027o73124o02286
16664B0320606n00903n00524m23234p02913o79698m63570J09977o65863l22307
16655A6171571q10900k64525k59408n46535m56284m04392l80604l6613j44587
16646A2867723m57138n4776m39064j4598r83937K25621l22159j4578k88927n60415
16636I957752K3517j57680n00220k58007J12321K7888l71572j1179o85656O5631
$$ plain form
16626 8202795 8093017 7937453 7927375 7675287 7332627 7315969 7224675 7171622 6617929 6794846
16616 6794846 6565339 6681719 6565723 6310092 6001626 6341430 6052414 5680761 6154194
16607 6154194 5681887 5550012 5547977 5550540 5231264 5419818 5161819 5099928 4943599 5188322
16597 5188322 4615055 4831941 5086610 4955783 4695905 4881810 4729670 4407945 4593384
16588 4593384 4376380 4477293 4299669 4221448 4122964 4282142 4370469 3849715 3658065 3970604
16578 3970604 3672200 3798305 3640550 3704743 3806801 3428893 3816327 3680470 3448346 3479966
16568 3479966 3758055 3350768 3028814 3157848 3255824 3149502 3030663 3298547 3056764 2833418
16558 2833418 2968044 2995782 2698226 2879720 2856519 2834862 2753762 2913610 2644806 3073128
$$ packed form
16626H202795j09778j55564j0078k52088l42660j6658r1294n3053n53693J76917
16616F794846k29507J16380j15996k55631l08466L39804k89016l71653M73433
16607F154194m72307j31875k035K563l19276J88554k57999o1891j56329K44723
16597E188322n73267K16886K54669j30827k59878J85905j52140l21725J85439
16588D593384k17004J00913j77624p8221r8484J59178Q8327n20754j91650L12539
16578C970604k98404J26105j57755O4193J02058l77908L87434j35857k32124L1620
16568C479966K78089m07287l21954J29034R7976j06322j18839K67884k41783k23346
16558B833418J34626K7738k97556J81494k3201k1657q1100J59848k68804M28322
$$ plain form
16548 3073128 2490233 2766861 2831970 2738468 2544203 2450871 2679204 2585694 2719491 2386269
16538 2386269 2328118 2732110 2383225 2326342 2189426 2170022 2539958 2090596 2418217 2102680
16528 2102680 2289355 2291701 2152430 2013632 2418362 1872725 2326772 2093434 1995683 2210721
16518 2210721 1900738 1931343 2070698 1813123 1932848 1770700 1994878 2114083 1605752 2011505
16508 2011505 2050307 1687860 1668247 1905842 1673977 1626320 1763794 1729153 1404266 2032624
16498 2032624 1633211 1563445 1557817 1884097 1414134 1681977 1923323 1564424 1495278 1807052
16488 1807052 1429214 1542602 1527511 1533159 1608573 1440562 1555383 1595938 1668641 1260216
16478 1260216 1350190 1746266 1368617 1431569 1409763 1492979 1367646 1719623 1446478 1428447
$$ packed form
16548C073128n82895K76628O5109r3502j94265r3332K28333r3510J33797l33222
16538B386269n8151M03992l48885n6883j36916j9404L69936m49362L27621l15537
16528B102680J86675K346j39271j38798M04730n45637M54047k33338r7751K15038
16518B210721l09983L0605J39355k57575J19725j62148K24178J19205n08331M05753
16508B011505L8802l62447j9613K37595k31865m7657J37474l4641l24887O28358
16498B032624l99413o9766n628L26280m69963K67843K41346l58899o9146L11774
16488A807052l77838J13388j5091N648P5414j68011J14821M0555P2703m08425
16478A260216Q9974L96076l77649O2952k1806Q3216j25333L51977k73145j8031
$$ plain form
16468 1428447 1485352 1722477 1376184 1607985 1328853 1087972 1307961 1522480 1546612 1335813
16458 1335813 1320155 1351042 1398694 1128392 1435253 849320 1292125 1172745 1269339 1036954
16448 1036954 1025004 1287160 1293902 1228342 1032415 1462093 1440868 1237010 1142597 1084228 1322323
16437 1322323 1158675 1071001 1406265 1199021 1027414 1118241 865550 1423164 1127199 1206035
16427 1206035 1153929 994603 894554 1115376 1182068 1054236 785663 1022109 1063394 1149313
16417 1149313 1206997 841036 998443 828193 937772 1103497 819333 1062844 611932 885574
16407 885574 798996 1112310 1067322 1065681 667418 837169 1285449 1027826 1262701 844227
16397 844227 785996 914578 936904 984722 943705 960073 939343 1065545 781266 954548 790923
$$ packed form
16468A428447N6905K37125l46293K31801k79132k40881K19989K14519K4132k10799
16458A335813j5658L0887M7652k70302L06861n85933M42805j19380R6594k32385
16448A036954j1950K62156O742o5560j95927M29678k1225k03858r4413n8369K38095
16437A322323j63648q7674L35264k07244j71607R0827k52691N57614k95965P8836
16427A206035n2106j59326j00049K20822O6692j27832k68573K36446M1285Q5919
16417A149313N7684l65961J57407j70250J09579J65725k84164K43511m50912K73642
16407H85574q6578L13314m4988j641l98263J69751M48280k57623K34875m18474
16397H44227n8231J28582K2326M7818m1017J6368k0730J26202k84279J73282j63625
$$ plain form
16386 790923 785772 702322 916792 1066020 553463 1177518 1129485 649304 938832 691465
16376 691465 775573 816272 420971 998103 807417 1218392 823258 691415 699415 902728
16366 902728 903253 819383 735922 895520 913886 774128 1007365 412714 927349 843024 771565
16355 771565 877299 754513 682115 840874 529159 679021 846708 830740 1045450 1052612
16345 1052612 647894 714045 766622 885443 825456 446262 699479 796716 585013 716537
16335 716537 526004 449405 738051 627818 926436 738602 1026632 630119 876884 1153538
16325 1153538 769548 606498 684337 370823 877075 556458 752398 712404 732079 660525
16315 660525 509760 620009 597939 665438 627756 571570 600296 487828 609255 942077
$$ packed form
16386G90923n151q3450K14470J49228n12557O24055m8033m80181K89528k47367
16376F91465Q4108M0699l95301N77132j90686M10975l95134j31843Q000K03313
16366I02728N25q3870q3461J59598J8366j39758K33237D12714N14635q4325p1459
16355G71565J05734j22786p2398J58759l11715J49862J67687j5968K14710P162
16345A052612m04718O6151N2577J18821n9987l79194K53217R7237k11703J31524
16335G16537j90533p6599K88646j10233K98618j87834K88030l96513K46765K76654
16325A153538l83990j63050P7839l13514N06252l20617J95940l9994J9675p1554
16315F60525j50765J10249k2070O7499l7682n6186K8726j12468J21427L32822
$$ plain form
16305 942077 753722 316930 426563 569306 660090 535922 585302 482563 795958 702621
16295 702621 693085 685044 678676 699454 459795 653837 497373 947196 282558 472442 638255
16284 638255 334084 686971 387468 585563 616701 582250 767596 507098 597182 779246
16274 779246 571637 370201 495213 378189 552056 516807 307756 296344 305735 374839
16264 374839 515822 462093 465872 405493 556736 200088 256142 556657 511884 565334 631922
16253 631922 593907 521307 538613 418969 568259 420409 631273 534688 245355 422203
16243 422203 577698 608531 111052 718675 303077 884268 583081 623575 240799 312740
16233 312740 636350 571161 726394 495610 497564 481880 221724 648529 624108 613222 573665
$$ packed form
16305I42077j88355C16930J09633J42743R0784j24168M9380j02739L13395r3337
16295G02621r536q041o368K0778k39659J94042j56464M49823B82558J89884J65813
16284F38255l04171L52887k99503J98095L1138l4451J85346k60498R0084J82064
16274G79246k07609k01436J25012j17024J73867l5249k09051j1412R391O9104
16264C74839J40983n3729L779o0379J51243B00088N6054L00515m4773N3450O6588
16253F31922l8015p2600J7306j19644J49290j47850K10864r6585B45355J76848
16243D22203J55495L0833A11052O07623C03077N81191l01187M0494B40799P1941
16233C12740L23610o5189J55233k30784J954j5684B21724M26805k4421j0886l9557
$$ plain form
16222 573665 244717 658221 594185 660806 446485 229537 102519 635959 703769 178638
16211 420880 455965 258790 534643 278472 172677 536778 543088 338766 114378 354741
16201 354741 480567 736928 450054 143748 339465 379254 154491 266374 261865 365028
16191 365028 617982 477882 261397 155423 159515 323429 407093 291047 339394 253643
16181 253643 420276 192526 407870 471494 -177765 235889 221372 608342 185121 371897
16171 371897 320949 219784 411933 104963 171158 149397 154112 82399 335303 527353 327556
16160 327556 -146341 320175 229605 332856 210507 458885 201040 385768 250332 360524
16150 360524 270589 209685 209338 222534 201925 -19159 335050 529755 74162 655134 374867
$$ packed form
16222E73665B44717M13504o4036O6621k14321k16948A02519N33440O7810A78638
16211D20880L5085j97175K75853k56171j05795L64101O310k04322A14378K40363
16201C54741J25826K56361k86874A43748J95717L9789A54491J11883m509J03163
16191C65028K52954j40100k16485j05974M092J63914Q3664j16046M8347q5751
16181B53643J66633A92526K15344O3624a77765B35889j4517L86970A85121J86776
16171C71897n0948j01165J92149A04963O6195k1761M715p1713K52904J92050j99797
16160C27556a46341C20175r0570J03251j22349K48378B01040J84728j35436J10192
16150C60524q9935o0904l47J3196k0609a9159C35050J94705G4162N80972k80267
$$ plain form
16139 374867 235906 209362 217866 120368 214483 562015 58012 266154 116342 182806 145155
16128 145155 -159670 339128 335182 164704 244190 321147 134795 158633 15249 -135604 -143393
16117 -143393 136086 129458 172968 -9045 116419 112048 489084 246640 189951 -32173 2388
16105 181790 140045 -32002 127349 286914 396967 128532 115570 -140747 444984 319833
16095 319833 -6226 -87296 454315 278314 -128720 250735 244377 -8321 137836 -14400 142608
16083 319034 105880 168238 256421 -70527 312409 494033 112082 147395 233675 479852
16073 479852 367144 215777 135615 -127083 119888 70621 52016 -168636 6832 229553
16063 229553 30067 52865 38441 197599 -114339 34907 192531 219912 178093 -163247 106522
$$ packed form
16139C74867j38961k6544Q504r7498R4115L47532E8012K08142A16342O6464l7651
16128A45155a59670C39128l946A64704P9486P6957A34795K3838A5249a35604p789
16117a43393A36086o628M3510i045A16419m371L77036k42444n6689c2173B388
16105A81790m1745c2002A27349J59565J10053A28532j2962a40747D44984j25151
16095C19833f226q1070D54315j76001a28720B50735o358h321A37836a4400A42608
16083C19034A05880O2358Q8183g0527C12409J81624A12082L5313Q6280K46177
16073D79852j12708j51367q0162a27083A19888m9267j8605a68636F832K22721
16063B29553C0067K2798j4424J59158a14339C4907J57624K7381m1819a63247A06522
$$ plain form
16051 220268 24429 -109492 -143025 45566 268670 183873 139837 195947 339547 -328916 93554
16039 271524 186669 26191 -157786 130883 31532 22445 181602 59010 -8568 111830 214071
16028 214071 195893 14576 152252 313069 -44951 59316 7835 136380 91779 -432722 57714
16016 87629 43037 -40964 164004 79896 202487 55507 266334 448031 255206 13785 96139
16005 96139 -146439 -31346 -252739 147342 482381 254315 59219 192528 -214441 453937
15994 40078 -77469 346805 180269 -30636 115972 -48494 235519 164211 513276 196459
15983 460370 374183 -34117 -86970 367408 447062 111648 -221983 280542 203752 -116698
15972 30162 -222883 -263886 -98279 -305597 -127775 -48673 -94986 57302 -37037 45826 147750
$$ packed form
16051B20268B4429a09492l3533D5566K23104q4797m4036N6110J43600c28916I3554
16039B71524q4855B6191a57786A30883C1532r087J59157E9010h568A11830J02241
16028B14071j8178A4576J37676J60817d4951E9316G835J28545m4601d32722E7714
16016H7629D3037d0964A64004G9896J22591E5507K10827J81697j92825A3785Q2354
16005I6139a46439c1346k21393A47342L35039k28066E9219J33309b14441D53937
15994D0078g7469C46805j66536c0636A15972d8494B35519p1308L49065A96459
15983D60370q6187c4117n2853C67408P9654A11648b21983B80542p6790a16698
15972C0162b22883m1003i8279k07318a27775d8673m6313E7302c7037D5826J01924
$$ plain form
15961 147750 61622 -103118 295829 199421 30432 62404 152310 -68082 -134329 -139461 -152961
15950 -152961 -270808 -103417 -109556 -31733 24208 17046 409668 126596 144181 -104704 102201
15938 349673 -170238 -75697 434043 -257397 -105531 -81501 235673 8514 -132928 221577
15927 -85766 53855 -327816 72942 85439 -208049 25047 -240554 148120 200522 9003 209800
15916 209800 -303777 -64762 100605 -2078 140929 -246824 1687 -34180 -4898 -231347 -176699
15905 -176699 -65084 106308 -51360 -58305 -354035 109747 29967 -191812 300813 81833 -100677
15893 -236601 -137664 -103273 298776 83298 -390433 168982 -55021 144235 -117984 169130
15882 147712 -55116 129820 127392 -54544 35670 -104754 97782 83940 21065 -52562 -41950
$$ packed form
15961A47750F1622a03118B95829r6408C0432L1972Q9906f8082o6247n132j3500
15950a52961j17847a03417o139c1733B4208p162L92622A26596J7585a04704A02201
15938C49673a70238g5697D34043b57397a05531K4030B35673H514a32928B21577
15927h5766E3855c27816G2942J2497b08049B5047b40554A48120N2402I003K00797
15916B09800c03777f4762A00605b078A40929b46824A687c4180d898k26449N4648
15905a76699f5084A06308e1360o945k95730A09747B9967a91812C00813H1833a00677
15893b36601R8937L4391B98776H3298c90433A68982e5021A44235a17984A69130
15882A47712e5116A29820k428e4544C5670a04754I7782j3842B1065e2562J0612
$$ plain form
15871 -41950 360658 37939 101134 -49813 64451 -1672 46026 65090 -1429 234844 -172106
15859 -82217 134604 -135973 236914 -314137 -123964 63686 156535 152824 78224 282779 80060
15847 -202570 150589 -67056 -50730 -63931 -99527 -196546 -245256 -355805 26475 5464 128916
15836 128916 -260147 134139 137368 192852 -221676 -19646 125839 -49736 -399504 -161885
15825 71233 -40455 -127803 113462 -210547 -135070 -124273 -53799 -281552 -67712 79439 84287
15814 84287 -71820 -139966 41264 -64607 237394 -189106 91878 271143 -66308 239976 -93722
15802 -109830 -7967 20247 28813 -80328 -222480 175695 148550 131900 -15175 -193009 -121006
15791 -121006 -286779 89410 42257 -56862 189409 -162654 140170 -234515 -117661 -260756
$$ packed form
15871d1950C60658C7939O3195d9813F4451a672D6026J9064a429B34844a72106
15859h2217A34604a35973B36914c14137a23964F3686R2849l711p4600K04555H0060
15847b02570A50589f7056J6326j3201l5596r7019m8710j10549B6475E464J23452
15836A28916b60147A34139L229N5484b21676a9646A25839d9736l49768a61885
15825G1233d0455q7348A13462b10547P5477J0797e3799k27753f7712G9439M848
15814H4287g1820o8146D1264f4607B37394a89106I1878J79265f6308B39976i3722
15802a09830g967B0247Q566h0328j42152A75695k7145j6650a5175j77834P2003
15791a21006j65773H9410D2257e6862A89409a62654A40170b34515J16854j43095
$$ plain form
15781 -260756 165733 -115016 70216 218204 -223111 69727 -210906 138077 167900 -184173
15770 -96481 27008 -95479 -176952 127631 -135011 -69803 -51094 -23460 -55975 -239559 21474
15758 264613 288635 215478 -299714 -3228 175662 266877 -188716 176924 -254187 112182
15747 101016 -188031 -216622 177677 -96767 388146 -45323 49556 219648 134258 27792 284552
15736 284552 267838 -54433 -160474 -335854 14524 150031 -60411 -34179 -288821 33889 -189318
15724 -50787 -171333 209499 21642 -68814 231547 -165436 101973 100435 -36234 -74409 96983
15712 -230934 228556 -279100 344958 58050 50819 -27678 -346527 18432 -48387 -184664 -130184
15701 -130184 -179424 13379 -3948 230226 -97366 12353 -174174 143729 -91027 -173166 342250
$$ packed form
15781b60756A65733a15016G0216J47988b23111F9727b10906A38077K9823a84173
15770i6481B7008i5479q1473A27631a35011O5208J8709b3460l2515j83584B1474
15758B64613K4022p3157b99714c228A75662R1215a88716A76924b54187A12182
15747A01016a88031k8591A77677i6767C88146d5323D9556J70092q5390B7792K56760
15736B84552j6714e4433j06041j75380A4524J35507f0411K6232k54642C3889a89318
15724e0787j20546B09499B1642f8814B31547a65436A01973j538c6234l8175I6983
15712b30934B28556b79100C44958E8050p231b7678l18849A8432d8387j36277N4480
15701a30184m9240A3379c948B30226i7366A2353a74174A43729i1027q2139C42250
$$ plain form
15689 151336 138187 40060 43581 56773 -56974 -176986 -35110 -258492 -61393 121827 -9223
15677 -248416 -122071 25284 -307967 38213 -203476 84507 65988 -205879 192710 92370
15666 -23493 -127644 -74902 198732 -168731 56426 -189566 8486 -189384 132172 -341707
15655 39427 -149233 454287 -191828 -150651 50973 -355637 113871 -135167 -155916 188152
15644 206825 -40085 43701 -224197 6571 -205979 -23062 -262851 -54436 29800 132164 -339078
15632 -187792 58150 -140827 28936 -74968 -87997 301884 -54143 112636 -31970 95284 -231806
15620 -201967 -124157 146884 -261128 242677 240148 -85410 -188573 95129 40125 -19960 -154270
15609 -154270 285610 12386 173393 -58273 -68454 -161731 -214840 -118831 -428284 93904 -13669
$$ packed form
15689A51336j3149D0060L521J3192e6974j20012c5110k23382f1393A21827i223
15677b48416a22071B5284c07967C8213b03476H4507j8519b05879A92710I2370
15666b3493j04151N2742A98732a68731E6426a89566H486a89384A32172c41707
15655C9427a49233D54287a91828M1177E0973c55637A13871a35167k0749A88152
15644B06825d0085D3701b24197F571b05979b3062k39789e4436B9800J02364c39078
15632a87792E8150a40827B8936g4968j3029C01884e4143A12636c1970I5284b31806
15620b01967P7810A46884b61128B42677k529h5410j03163I5129D0125a9960j34310
15609a54270B85610A2386J61007e8273j0181r3277n3109R6009l09453I3904a3669
$$ plain form
15597 -69679 -15074 255247 54776 53387 -37466 -282300 -281338 38144 -261531 258077 95186
15585 199485 128462 -196652 295083 -166947 -463338 -84909 11110 -77660 30651 215504
15575 215504 133340 -74227 -61459 152325 139119 100344 -198068 37774 -124860 184186 -42744
15563 445773 64379 -164496 17122 45486 -222920 34919 220166 21180 90253 135607 -9074
15551 -137393 -315029 2686 -181159 102813 -172419 72626 7508 80456 6598 245392 -45559
15539 -66156 -3497 2019 314422 -30134 -134359 129069 -16483 261335 -83009 -65408 32327
15527 87317 98273 113690 -148213 -45431 -368053 -17126 170851 -65924 -22663 -193932 155469
15515 154289 -66364 92741 -229015 -181945 64850 -130893 235613 166421 -237688 177184
$$ packed form
15597f9679a5074B55247E4776j389c7466k44834R62C8144b61531B58077I5186
15585A99485p1023a96652B95083a66947k96391h4909A1110g7660C0651J84853
15575B15504q2164g4227J2768A52325j3206l8775a98068C7774a24860A84186d2744
15563D45773F4379a64496A7122K8364b22920C4919J85247B1180O9073M5354i074
15551a37393j77636B686a81159A02813a72419G2626G508P2948F598K38794d5559
15539f6156c497B019L12403c0134j04225A29069a6483B61335h3009J7601C2327
15527H7317J0956J5417a48213d5431l22622a7126A70851f5924b2663j71269A55469
15515A54289f6364I2741b29015M7070F4850a30893B35613o9192b37688A77184
$$ plain form
15504 -14413 -143926 -240013 99795 -187535 -298237 150901 -62728 -69801 -4775 -165516 153190
15492 -83383 -34333 -265241 280203 423198 76618 -387573 137583 -151951 -77176 -240488
15482 -240488 20559 -304659 -325551 313471 -291767 240182 -249844 53092 173901 -15127
15471 -119387 16243 184538 -144938 143628 91089 80354 -89302 99027 119626 161529 40655
15459 -16344 -29891 166873 -97053 -270344 330036 -210998 -59752 -342108 -267246 141822
15448 217511 -80203 -8271 -43966 -284283 -157467 32880 -20521 -459 207804 204064 69067 204923
15436 204923 -57659 93674 34555 1405 74798 -152797 -129351 -70433 141945 -233377 14406
15424 -66196 -40184 -11998 254256 1293 -97538 -213666 195360 68914 102935 -182450 337244
$$ packed form
15504a4413j29513r6087I9795a87535j10702A50901f2728p073d775j60741A53190
15492h3383c4333k30908B80203J42995G6618c87573A37583a51951P4775j63312
15482b40488B0559c04659k0892C13471b91767B40182b49844E3092J20809a5127
15471a19387A6243J68295a44938A43628n2539j0735h9302I9027K0599M1903D0655
15459a6344j3547A66873i7053j73291C30036b10998e9752k82356P4862A41822
15448B17511h0203h271l5695k40317J26816C2880b0521d59B07804l740F9067J35856
15436B04923e7659I3674C4555A405P3393a52797K3446N8918A41945b33377A4406
15424f6196K6012a1998B54256A293i7538j16128A95360F8914L4021a82450C37244
$$ plain form
15412 -67213 178565 -276117 -142570 226883 142966 -201142 8605 -130549 140129 4820 -277858
15400 -104885 -121233 -83237 -155310 174142 126916 -72820 32868 145027 -62420 -248053 1707
15388 -62510 -43199 277719 52828 126971 15005 132205 -63952 -189881 -138582 -131811 -61106
15376 -4600 11357 -45121 17809 27911 -41274 39635 -16316 133712 139302 -160163 44136 151089
15364 151089 100315 160327 -17657 113891 199451 -123485 117554 -286622 -25432 -205149
15354 -205149 -88780 -166504 -65147 -99269 10701 184808 109813 78091 -193414 151738 75423
15342 -157558 68505 -52884 270926 319420 222088 -169726 -200016 -8258 345980 -145128 48151
15330 -41754 179816 -30459 7065 24099 10779 -181800 274338 197189 11108 242608 -139809
$$ packed form
15412f7213A78565b76117J33547B26883q3917b01142H605a30549A40129D820b77858
15400a04885j6348L7996p2073A74142m7226g2820C2868J12159f2420j85633A707
15388f2510J9311B77719E2828P4143A5005J17200f3952j25929N1299O771f1106
15376d600A1357d5121A7809J0102d1274C9635a6316A33712N590a60163D4136J06953
15364A51089n0774O0012a7657A13891Q5560a23485A17554b86622b5432j79717
15354b05149h8780p7724f5147l4122A0701J74107p4995l1722a93414A51738G5423
15342a57558F8505e2884B70926M8494r7332a69726l0290h258C45980a45128D8151
15330d1754A79816c0459G065J7034A0779a81800B74338p7149A1108K31500a39809
$$ plain form
15318 -44503 -84478 -401014 186078 56927 -221411 -319010 231574 113915 20713 9196 73112
15307 73112 200344 -47331 243005 -154666 -188953 158635 -63974 113139 -42745 426434
15296 34753 52416 -66681 183170 100365 291058 -166006 179968 57714 -127491 -13579 50988
15284 95452 270737 80555 -129249 7524 98895 -397986 65493 86895 -34427 72497 12486
15272 236408 -64227 -300987 186893 41335 201663 267140 172231 91512 156095 471808 270373
15261 270373 189629 51624 215871 47232 14826 173871 -79653 120572 268317 645797
15251 645797 671301 774557 959164 691906 532919 321720 118862 137023 23942 254089
15241 254089 75506 -110936 20397 -126778 -122885 20767 26307 -2871 -302478 -119677 84733
$$ packed form
15318d4503l9975l16536A86078E6927b21411r7599B31574A13915B0713I196O3916
15307G3112J27232d7331B43005a54666l4287A58635f3974A13139d2745D26434
15296C4753J7663f6681A83170q2805J90693a66006A79968E7714a27491a3579E0988
15284I5452J75285H0555a29249G524R1371c97986F5493K1402c4427G2497A2486
15272B36408f4227k36760A86893D1335J60328O5477r4909q0719O4583L15713k01435
15261B70373q0744E1624J64247D7232A4826J59045g9653A20572J47745L77480
15251F45797K5504J03256J84607k67258j58987k11199A18862J8161B3942K30147
15241B54089G5506a10936B0397a26778L893B0767N540b871k99607a19677H4733
$$ plain form
15229 -9430 -194652 112450 -59998 -20747 131222 -12215 -231299 78929 45339 42618 290107
15218 290107 103028 -451278 94159 60 90187 -261953 244568 61162 -64989 267585 266674
15207 266674 -29336 144145 7294 -82678 199670 99822 -67813 -121344 21331 21657 -78357 -24257
15194 81067 113392 -19979 56984 -23192 -103082 21987 99929 97488 150693 -256998 -95347 189201
15181 -206539 -174717 80025 -138847 63030 12667 179431 34033 121014 70271 403771 355484
15170 355484 174453 54663 207137 103223 -70541 207146 131762 183148 65276 -329098
15159 199308 -185613 155641 305168 335432 59740 206070 108110 142303 -57382 234777
15148 -121870 -161239 69999 -92394 156676 -22914 198073 157804 -28441 149012 327791 193400
$$ packed form
15229i430j85222A12450e9998b0747A31222a2215k19084G8929l3590k721K47489
15218B90107A03028d51278I4159F0R0127b61953B44568F1162f4989B67585r11
15207B66674b9336A44145G294h2678A99670I9822f7813n3531B1331L26g8357b4257
15194H1067L2325a9979E6984b3192p9890B1987P7942k441N3205b56998i5347A89201
15181b06539L1822H0025a38847F3030A2667J66764C4033Q6981n0743L33500m8287
15170C55484A74453E4663J52474A03223g0541B07146p5384N1386F5276c29098
15159A99308a85613A55641J49527L0264E9740J46330r7960L4193e7382B34777
15148a21870l9369F9999i2394A56676b2914A98073m0269b8441A49012J78779j34391
$$ plain form
15137 193400 112642 -194410 2551 127118 -132998 -169667 235003 216512 195777 334684 -31383
15125 104494 361387 -63348 -32715 166991 168548 102138 -1089 98135 295417 95426 302009
15114 302009 160532 222904 -242219 -130923 2889 251810 74720 120753 270049 284925 -79498
15102 53742 234090 167398 88608 325433 125733 163686 -189056 33905 -39379 -42351 9152
15090 434986 -195164 244578 -189748 332373 -81665 159105 59234 341874 250699 466674
15080 466674 84258 139471 -29867 -35451 -4786 340768 169714 16471 17945 222551 280228
15069 280228 31282 196760 112927 37721 149631 339035 194974 101725 132503 195461 126306
15058 126306 -71808 265831 -86844 224889 -190149 328244 196086 402162 319754 107480
$$ packed form
15137A93400q0758a94410B551J24567a32998l6669B35003j8491k0735J38907c1383
15125A04494K56893f3348L0633A66991J557o6410a089I8135J97282I5426K06583
15114C02009j41477O2372b42219J11296B889K48921G4720M6033J49296J4876g9498
15102E3742J80348o6692p8790K36825A25733L7953a89056C3905c9379k972I152
15090D34986a95164B44578a89748C32373h1665A59105E9234K82640r1175K15975
15080D66674H4258N5213b9867n584d786C40768A69714A6471J474K04606N7677
15069B80228C1282J65478q3833C7721J11910J89404j44061r3249L0778O2958o9155
15058A26306g1808B65831h6844B24889a90149C28244j32158K06076q2408A07480
$$ plain form
15047 261515 244372 92786 39586 35385 268818 290034 493048 186517 365479 100833 538147
15036 538147 43952 308595 23393 247922 194795 237715 318422 -244420 75461 26206 249486
15025 249486 205941 91065 436071 229237 304014 211064 401353 -39225 110855 272343
15015 272343 341262 -10842 82233 424817 338643 86942 57826 406419 118925 34778 152295
15004 152295 471462 91651 246650 198856 341133 351835 263663 124812 180758 90725 299169
14993 299169 457275 187578 325988 152435 362960 126879 10901 308061 105309 401546
14983 401546 93421 147468 500996 253548 258422 210658 261216 676782 -61365 112344 307467
14972 307467 203126 389640 422568 477809 222051 188196 192386 426830 141149 86837 142402
$$ packed form
15047B61515j7143I2786C9586m201K33433K1216K03014A86517J78962A00833M37314
15036E38147D3952K64643B3393K24529n3127M2920Q0707b44420G5461B6206K23280
15025B49486m3545I1065L45006k06834P4777r2950J90289c9225A10855J61488
15015B72343O8919a0842H2233L42584q6174H6942k9116L48593A18925C4778J17517
15004A52295L19167I1651J54999m7794J42277J0702q8172A24812N5946r0033K08444
14993B99169J58106A87578J38410A52435K10525A26879A0901K97160A05309K96237
14983D01546I3421N4047L53528k47448M874m7764N0558M15566f1365A12344J95123
14972C07467j04341J86514L2928N5241B22051l3855M190K34444A41149n4312N5565
$$ plain form
14961 142402 446888 -44197 154256 -18961 287039 604390 615198 108965 438675 370131
14951 370131 59912 737341 451192 336277 383591 159633 130093 273753 -60992 586151
14940 439980 60064 321640 561916 354751 -159996 186105 549636 26025 461666 -81990
14929 254330 289701 120267 308379 171280 139179 289180 499315 425120 428689 515346 544792
14918 544792 456597 432160 -28793 339731 302083 480155 496226 351212 445689 297020 411262
14907 411262 353942 359889 528867 177104 78840 313642 189343 306816 261827 320053 160404
14896 160404 289717 49884 486844 33828 369810 340797 593983 185511 378932 254375
14886 254375 301134 286575 402560 231025 244482 549719 548842 472047 305505 603355 187980
$$ packed form
14961A42402L04486d4197A54256a8961B87039L17351J0808A08965L29710o8544
14951C70131E9912O77429k86149j14915M7314A59633k9540J43660f0992E86151
14940D39980F0064K61576K40276k07165a59996A86105L63531B6025M35641h1990
14929B54330L5371A20267J88112j37099l2101J50001K10135p4195L569Q6657K9446
14918E44792q8195k4437b8793C39731l7648J78072J6071j45014R4477j48669J14242
14907D11262n7320N947J68978A77104G8840K34802j24299J17473m4989N8226j59649
14896A60404J29313D9884M36960C3828L35982k9013K53186A85511J93421j24557
14886B54375M6759j4559J15985j71535J3457L05237q77p6795j66542K97850A87980
$$ plain form
14874 535637 453397 206082 339134 370687 454964 568982 427504 429801 664378 -224997
14863 529327 348270 724096 558387 292529 421175 404415 360352 208695 354090 213324
14853 213324 278347 546548 734758 156817 56791 325682 579471 227755 463188 409507
14843 409507 392365 302657 298372 249602 301065 131168 261101 725807 226873 614779 550059
14832 550059 379118 456566 377714 199191 690443 756696 467015 497876 433830 368099 403606
14821 403606 -10412 688670 492600 491507 624574 432407 245209 434641 880165 299376
14810 298161 315855 332969 805139 686619 353652 360350 419475 565468 852452 221969
14799 98310 758682 651546 664353 404664 62912 632391 414431 575358 442818 577989
$$ packed form
14874E35637q2240B06082J33052L1553Q4277J14018j41478K297K34577b24997
14863E29327j81057L75826j65709k65858J28646j6760m4063j51657J45395j40766
14853B13324O5023K68201J88210A56817E6791K68891K53789B27755K35433n3681
14843D09507j7142q9708m285m8770N1463A31168J29933M64706B26873L87906o4720
14832E50059j70941P7448p8852j78523M91252O6253k89681L0861o4046o5731L5507
14821D03606a0412F88670j96070j093J33067j92167j87198J89432M45524B99376
14810B98161J7694J7114M72170j18520l32967O698N9125J45993K86984B21969
14799I8310O60372j07136J2807k59689F2912N69479k17960J60927j32540J35171
$$ plain form
14789 577989 456818 583260 452803 448912 250120 326151 679876 571221 656722 525820
14779 525820 815299 727942 766639 266617 357626 494478 550675 478316 635273 506718
14769 506718 633223 391680 581819 553768 858846 747301 864955 623374 560091 763837
14759 763837 413494 742280 468405 774914 798370 128416 720772 559526 558418 327809
14749 327809 352011 690969 530197 736455 573640 568121 689419 618688 869054 647350
14739 647350 800346 996798 558124 575419 858971 643280 653883 678249 892110 645837
14729 645837 495732 807065 711842 936321 726512 631008 416932 844689 741716 644227
14719 644227 679619 908811 917396 889699 859867 787251 1086655 648375 653318 872655 731201
$$ packed form
14789E77989j21171J26442j30457l891j98792P6031L53725j08655Q5501j30902
14779E25820K89479q7357L8697B66617R1009J36852N6197p2359J56957j28555
14769E06718J26505k41543J90139k8051L05078j11545J17654k41581o3283K03746
14759G63837l50343L28786k73875L06509K3456A28416N92356j61246j108k30609
14749C27809K4202L38958j60772K06258j62815n519J21298p0731K50366k21704
14739F47350J52996J96452m38674J7295K83552k15691J0603K4366K13861k46273
14729F45837j50105L11333r5223K24479k09809r5504k14076M27757j02973r7489
14719F44227L5392K29192Q585k7697k9832p2616K99404m38280M943K19337j41454
$$ plain form
14708 731201 909378 444649 955909 1133024 874122 790097 1023210 1110601 752238 849933
14698 849933 707369 987433 796332 585854 841155 760236 958678 832532 654773 1143137
14688 1143137 956775 1098548 1049414 821680 815081 733303 815549 787202 1047329 1100779 993716
14677 993716 473632 1159767 847163 970552 908785 1186280 957425 619751 833012 1078517
14667 1078517 1112281 713579 843515 1119521 910593 1175638 1044381 891512 1051325 968583
14657 968583 978027 842347 882630 1023633 910119 1094722 1114537 836974 844743 1038826 930799
14646 930799 1000869 1341781 1207310 989319 1114435 957740 1403662 1062030 1017870 913398
14636 913398 1098070 1135191 1315728 1216207 1128130 1227021 1229143 1050646 1210579 1043275 1172860
$$ packed form
14708G31201J78177D44649N11260J77115k58902q4025K33113Q7391l58363R7695
14698H49933j42564K80064j91101k10478K55301q0919J98442j26146j77759M88364
14688A143137j86362J41773m9134k27734o599q1778Q2246k8347K60127N3450j07063
14677I93716D73632O86135l12604J23389o1767K77495k28855l37674K13261K45505
14667A078517L3764l98702J29936K76006k08928K65045j31257j52869J59813q2742
14657I68583R444j35680M0283J41003j13514J84603J9815k77563P769J94083j08027
14646I30799P0070L40912j34471k17991J25116j56695M45922l41632m4160j04472
14636I13398J84672L7121J80537r9521q8077R8891K122j78497J59933j67304J29585
$$ plain form
14625 1172860 1122827 1802574 1224729 1152571 1433345 1439464 1181431 1309470 1458474 1141159
14615 1141159 1462364 1416504 1700230 1672290 1411127 1620422 1631353 1293709 1309904 1441425
14605 1441425 1400584 1341349 1262055 1429890 1341835 1482335 1668336 1360409 1383248 1597053
14595 1597053 1448246 1327311 1690914 1557057 1456029 1958071 1692587 1807060 1619235
14586 1619235 1639111 1837319 1516987 1575194 1870039 1604696 1574480 2057033 1755072 1995210
14576 1995210 1897761 2058744 2030140 2051567 1861135 2048635 1906487 1952620 1886436 2177189
14566 2177189 2391890 2117997 2595349 2589381 2741240 2431531 2378647 2974887 2914591 2784296
14556 2784296 3054359 3083815 3139755 3647647 4186685 4680594 6112822 8867333 13817707
$$ packed form
14625A172860n0033O79747n77845p2158K80774O119k58033J28039J49004l17315
14615A141159L21205m5860K83726k7940k61163K09295J0931l37644J6195J31521
14605A441425m0841n9235p9294J67835q8055J40500J86001l07927K2839K13805
14595A597053j48807j20935L63603j33857j01028N02042k65484J14473j87825
14586A619235J9876J98208l20332N8207K94845k65343l0216M82553l01961K40138
14576A995210r7449J60983k8604K1427j90432J87500j42148M6133o6184K90753
14566B177189K14701k73893M77352n968J51859l09709n2884N96240o0296j30295
14556B784296K70063K9456N5940N07892N39038M93909J432228K754511M950374
$$ plain form
14547 13817707 21264107 28753483 26318868 19039314 11965232 8298650 6280874 4591660
14539 4591660 3596981 2757236 2378368 2383248 2430054 2124214 2070486 1959159 2133997 2056617
14529 2056617 2353065 2049982 2054689 1999827 2198528 2268489 2249627 2226901 2262396 2460595 2462890
14518 2462890 2459607 2243996 2481556 2568817 2506596 2393996 2655367 2565884 2533153 2428249
14508 2428249 2561505 2678886 2648329 2831035 2776088 2803228 2593386 2864971 3071379 2942140
14498 2942140 2905630 3007245 2965016 3216169 3132198 3431392 3154519 3282552 3581724 3307603
14488 3307603 3440072 3153263 3391509 3573699 3649046 3605699 3466332 3897179 3741707 3724496
14478 3724496 3646538 4080440 3977677 4028761 3747058 3879596 4219971 4279281 3774174 4232332
$$ packed form
14547A3817707P446400P489376k434615p279554p074082l666582k017776j689214
14539D591660r94679q39745l78868M880M6806l05840n3728j11327J74838p7380
14529B056617K96448l03083M707n4862J98701O9961j8862k2726L5495J98199K295
14518B462890l283k15611K37560Q7261o2221j12600K61371q9483l2731j04904
14508B428249J33256J17381l0557J82706n4947K7140k09842K71585K06408j29239
14498B942140l6510J01615m2229K51153q3971K99194k76873J28033K99172k74121
14488C307603J32469k86809K38246J82190P5347m3347j39367M30847j55472j7211
14478C724496p7958M33902j02763N1084k81703J32538L40375N9310n05107M58158
$$ plain form
14468 4232332 4149418 4162458 3525664 4398482 4026910 4478658 4038260 4517870 4660948 4412843
14458 4412843 4323802 4851371 4616525 4826285 4608460 4952135 4537085 5012989 5040295 5055568
14448 5055568 5313320 5315498 5692839 5425806 5717113 5598281 5694550 5914055 5499022 5880559
14438 5880559 6063685 5972351 6012497 6493620 6085049 6256490 6543972 6614928 6493360 6663149
14428 6663149 6988350 6758161 6467421 7182736 6808386 7331645 7200695 7440654 7383457 7376152
14418 7376152 7769033 7635239 8193551 7997900 8169598 8421165 8282150 8320372 8769073 8716140
14408 8716140 9239146 8635889 9071892 9135677 9509194 9304876 9845100 9660755 9861379 10305695
14398 10305695 10246965 10772789 10646944 10768725 11253853 11529050 11215400 11750028 11917780
$$ packed form
14468D232332q2914J3040o36794Q72818l71572M51748m40398M79610J43078k48105
14458D412843q9041N27569k34846K09760k17825L43675m15050M75904K7306J5273
14448E055568K57752K178L77341k67033K91307j18832R6269K19505m15033L81537
14438E880559J83126r1334M0146M81123m08571J71441K87482P0956j21568J69789
14428F663149L25201k30189k90740P15315l74350N23259j30950K39959n7197p305
14418G376152L92881j33794N58312j95651J71698K51567j39015L8222M48701n2933
14408H716140N23006o03257M36003O3785L73517k04318N40224j84345K00624M44316
14398A0305695n8730N25824j25845J21781M85128K75197l13650N34628J67752
$$ plain form
14389 11917780 12157117 12103959 12470325 12499307 13164390 13258072 13450242 13531499 13717413 14002185
14379 14002185 14470171 14744710 14867896 15297334 15352628 15914707 16414953 16602233 16710217
14370 16710217 17138475 17345274 17935447 17931304 18577538 18498120 19555681 19757419 19920033 20406989
14360 20406989 21491147 21522781 22040580 22537147 23062283 23249549 24234947 24875632 25468581
14351 25468581 25756067 26356726 27330007 27790232 28230520 29204414 30100148 31065568 31599023
14342 31599023 32291663 33985652 34180371 34995854 35838577 37413350 38110666 39214485 40334864
14333 40334864 41683460 42704056 44059043 45519897 47203103 48060862 50195389 51755166
14325 51755166 53084147 54992902 56794846 58702549 61105596 63188799 65469277 67741611
$$ packed form
14389A1917780K39337n3158L66366K8982O65083R3682J92170Q1257J85914K84772
14379A4002185M67986K74539J23186M29438N5294N62079N00246J87280J07984
14370A6710217M28258K06799N90173m143O46234p9418J057561K01738J62614M86956
14360B0406989J084158L1634N17799M96567N25136J87266R85398O40685N92949
14351B5468581K87486O00659R73281M60225M40288R73894Q95734R65420N33455
14342C1599023O92640J693989J94719Q15483Q42723J574773O97316J103819J120379
14333D0334864J348596J020596J354987J460854J683206Q57759K134527J559777
14325E1755166J328981J908755J801944J907703K403047K083203K280478K272334
$$ plain form
14317 67741611 70266241 72497072 75675457 78219457 81624465 85201355 88592326 91994645
14309 91994645 95864530 99829686 104202637 108616505 113388706 118220146 123470989 129163241
14301 129163241 135088633 141579291 148357351 155083312 162900204 170946235 179061426 187794877
14293 187794877 197643947 207307300 217978907 228939873 240332504 252376913 264966214
14286 264966214 278017791 291300240 304922987 319404296 333722688 347742625 361962306
14279 361962306 375907590 389055756 401661244 413108426 422902324 430703229 435838890
14272 435838890 436603693 434279007 431148783 426099043 421332788 416678620 411526332 404066359
14264 404066359 397009048 389961080 381759079 372404585 360348151 346309964 332012215
$$ packed form
14317F7741611K524630K230831L178385K544000L405008L576890L390971L402319
14309I1994645L869885L965156M372951M413868M772201M831440N250843N692252
14301A29163241N925392O490658O778060O725961P816892Q046031Q115191Q733451
14293A87794877R849070R663353J0671607J0960966J1392631J2044409J2589301
14286B64966214J3051577J3282449J3622747J4481309J4318392J4019937J4219681
14279C61962306J3945284J3148166J2605488J1447182R793898P800905N135661
14272D35838890P64803k324686l130224n049740m766255m654168n152288p459973
14264D04066359p057311p047968q202001r354494j2056434j4038187j4297749
$$ plain form
14257 332012215 317124094 302469914 287963170 274004991 260434481 247747702 235468580
14250 235468580 223991951 212784277 202312033 192353694 183027433 174191846 166119782
14243 166119782 158179400 150709240 143585734 137205086 130886080 125113841 119821379 114591004
14235 114591004 109762348 104961828 100447663 96626994 93063981 89306644 85523635 82675283
14227 82675283 79030317 76322005 73561183 70702680 67987794 65734357 63444207 61283067
14219 61283067 59222308 57283203 55467819 53148025 51885495 50268469 48945729 47392671
14211 47392671 45739496 44453384 43345345 42126623 41025724 39970105 38498160 37499091
14203 37499091 36517560 35601643 34473414 33583432 32925064 31927121 31030247 30297282 29538609
$$ packed form
14257C32012215j4888121j4654180j4506744j3958179j3570510j2686779j2279122
14250B35468580j1476629j1207674j0472244r958339r326261q835587q072064
14243A66119782p940382p470160p123506o380648o319006n772239n292462n230375
14235A14591004m828656m800520m514165l820669l563013l757337l783009k848352
14227H2675283l644966k708312k760822k858503k714886k253437k290150k161140
14219F1283067k060759j939105j815384k319794j262530j617026j322740j553058
14211D7392671j653175j286112j108039j218722j100899j055619j471945r99069
14203C7499091r81531r15917j128229q89982o58368r97943q96874p32965p58673
$$ plain form
14194 29538609 28798806 28001674 27399990 26871427 26180984 25214918 24894008 24369904 23798070
14185 23798070 23356159 22960468 22116811 21808456 21032178 20635692 20317266 20289576 19431861
14176 19431861 19078596 18441625 18505640 17806166 17617364 17303417 17262501 16651208 16476188 15779187
14166 15779187 15866660 15372375 14979593 14875212 14731145 13999045 14116330 13924984 13790313
14157 13790313 13073979 13102632 13023703 12822941 12456847 12242602 11924657 11942355 11823379 11322365
14147 11322365 11289985 11156962 11083235 11081278 11074328 10633077 10470082 10061262 9958801 10004326
14137 10004326 9689738 9682873 9196303 9393167 9119807 9161407 8837929 9114517 8718183 8388442
14127 8388442 8030451 8486507 8080618 7887539 8277440 8096708 7812306 7617753 7708365 7676914
$$ packed form
14194B9538609p39803p97132o01684n28563o90443r66066l20910n24104n71834
14185B3798070m41911l95691q43657l08355p76278l96486l18426k7690q57715
14176A9431861l53265o36971O4015o99474j88802l13947m0916o11293j75020o97001
14166A5779187Q7473m94285l92782j04381j44067p32100J17285j91346j34671
14157A3790313p16334K8653p8929k00762l66094k14245l17945J7698j18976n01014
14147A1322365l2380j33023p3727j957o950m41251j62995m08820j02461M5525
14137A0004326l14588o865m86570J96864k73360M1600l23478K76588l96334l29741
14127H388442l57991M56056m05889j93079L89901j80732k84402j94553R0612l1451
$$ plain form
14117 7676914 7363854 7399450 7503910 6940654 7031157 6938171 6852395 6955735 6431704 6756642
14107 6756642 6538639 6312166 6088884 6018270 6069124 5963455 6008134 5984892 5977362 5744846
14097 5744846 5937810 5724077 5690601 5690434 5369000 5452253 5194420 5314227 5094099 5195957
14087 5195957 4825114 5112755 5495531 5166133 4559195 5014792 4980057 4978720 4683372 4723375
14077 4723375 4736915 4154967 4457758 4589046 4191639 4511177 4051589 4128367 4456479 4053389
14067 4053389 4031118 4331721 4232018 3798884 4015706 3933610 4228780 3692866 3994280 3758350
14057 3758350 3990413 3930880 3676633 4014526 3603143 3776402 3545432 3195478 3453400 3567467
14047 3567467 3518295 3539674 3237643 3308383 3598750 3473349 3045197 3248304 3265249 3280672
$$ packed form
14117G676914l13060L5596J04460n63256R0503r2986q5776J03340n24031L24938
14107F756642k18003k26473k23282p0614N0854j05669M4679k3242p530k32516
14097E744846J92964k13733l3476j67l21434Q3253k57833J19807k20128J01858
14087E195957l70843K87641L82776l29398o06938M55597l4735j337k95348M0003
14077D723375J3540n81948L02791J31288l97407L19538m59588P6778L28112m03090
14067D053389k2271L00603r9703m33134K16822q2096K95170n35914L01414k35930
14057C758350K32063n9533k54247L37893m11383J73259k30970l49954K57922J14067
14047C567467m9172K1379l02031P0740K90367j25401m28152K03107J6945J5423
$$ plain form
14037 3280672 3273579 3067057 3237312 3318680 2907504 3063702 3232898 2740201 3131789 3027879
14027 3027879 2879763 2785197 2771122 2766938 2795622 2620433 2704802 2685927 2405153 2314638 2389010
14016 2389010 2411648 2545375 2772411 2741667 2603149 2612854 2310803 2214740 2415160 2372925
14006 2372925 1977261 2232059 2461354 2250808 2235302 2323599 2043670 2169373 2245112 2111812
13996 2111812 2045001 2110996 2268017 2308640 2556254 2575654 2949032 4683272 7549751 14959620
13986 14959620 24903907 27356123 21744356 15626138 11453284 9200002 6950267 5660113
13978 5660113 4903898 3990421 3689132 3046469 2802266 3093361 2652272 2597609 2379106 2830458
13968 2830458 2562795 2347492 2182297 2014993 2270824 2059149 1983268 1771781 2303190 2131760
$$ packed form
14037C280672p093k06522J70255Q1368m11176J56198J69196m92697L91588j03910
14027C027879j48116r4566j4075m184K8684j75189Q4369j8875k80774r0515P4372
14016B389010K2638J33727K27036l0744j38518R705l02051r6063K00420m2235
14006B372925l95664K54798K29295k10546j5506Q8297k79929J25703P5739j33300
13996B111812o6811O5995J57021M0623K47614J9400L73378J734240K866479P409869
13986A4959620R944287K452216n611767o118218m172854k253282k249735j290154
13978E660113p56215r13477l01289o42663k44203K91095m41089n4663k18503M51352
13968B830458k67663k15303j65195j67304K55831k11675p5881k11487N31409j71430
$$ plain form
13958 2131760 2090683 2029161 2275484 1964685 2122550 1753972 1819629 1707887 1750820 1745253
13948 1745253 1800221 1640195 1769386 1902655 1878548 1843888 1807807 1733024 1507155 1811626
13938 1811626 1911072 1769050 1803600 1670966 1753057 1885226 1728295 1735032 1523325 1874300
13928 1874300 1601456 1612464 1455663 1455405 1348503 1373175 1598423 1534753 1348813 1389216 1515763
13917 1515763 1158108 1305562 1613344 1623124 1300522 1320074 1317926 1367865 1207480 1626975
13907 1626975 1911449 1639835 1336596 1476920 1404197 1118895 1512608 1163345 977104 1341791
13897 1341791 1243540 1560880 1404525 861640 1222533 1063928 1258170 1406954 943232 1009457
13887 1009457 1365666 1058534 1222478 1240554 1376919 980805 799371 1211400 1256891 1037525
$$ packed form
13958B131760m1077o1522K46323l10799J57865l68578O5657j11742M2933n567
13948A745253N4968j60026J29191J33269k4107l4660l6081p4783k25869L04471
13938A811626R9446j42022L4550j32634Q2091J32169j56931O737k11707L50975
13928A874300k72844J1008j56801k58j06902K4672K25248o3670j85940M0403J26547
13917A515763l57655J47454L07782R780l22602J9552k148M9939j60385M19495
13907A626975K84474k71614l03239J40324p2723k85302L93713l49263j86241L64687
13897A341791r8251L17340j56355n42885L60893j58605J94242J48784m63722O6225
13887A009457L56209l07132J63944J8076J36365l96114j81434M12029M5491k19366
$$ plain form
13877 1037525 1362436 912804 1064131 1048127 1337949 1088859 1239391 997762 1097004 1322893
13867 1322893 899300 1317692 1216010 973763 990938 997357 998850 1136075 1084898 961971
13857 961971 929864 793700 1032902 1085927 1382708 952440 808680 1066970 864806 929128
13847 929128 961575 1165153 1225760 810499 854349 1175366 920633 996752 781608 889531
13837 889531 941912 1079382 897628 1034463 893623 717352 905296 825367 963585 672227
13827 672227 707956 566051 576103 865272 965259 1022321 1137288 733251 857681 1017973
13817 1017973 870145 775211 753738 1009953 1160261 1000905 1025112 861159 488861 912825
13807 912825 664303 1032859 880584 876632 637701 655384 597414 883108 882421 945963 1005975
$$ packed form
13877A037525L24911m49632J51327j6004K89822k49090J50532k41629R9242K25889
13867A322893m23593M18392j01682k42247J7175O419J493J37225n1177j22927
13857I61971l2107j36164K39202N3025K96781m30268j43760K58290k02164O4322
13847I29128L2447K03578O0607m15261M3850L21017k54733P6119k15144J07923
13837H89531N2381J37470j81754J36835j40840j76271J87944p9929J38218k91358
13827F72227L5729j41905J0052K89169R9987N7062J14967m04037J24430J60292
13817A017973j47828r4934k1473K56215J50308j59356K4207j63953l72298M23964
13807I12825k48522L68556j52275l952k38931J7683n7970K85694o87O3542O0012
$$ plain form
13796 1005975 674683 634357 661842 754139 842226 843601 639879 445028 858300 719360
13786 719360 865761 482489 596699 848881 694176 512500 649815 528510 838817 583724
13776 583724 566201 936613 646842 1009827 493237 929119 577709 883120 659114 604963
13766 604963 830757 842202 895866 679809 769091 402183 594862 778048 693605 671543
13756 671543 471307 532842 625184 879494 352120 596273 611376 470574 936677 366195
13745 725821 752161 535835 670602 913371 597994 534260 593257 748288 569130 389754
13735 389754 383547 782017 258968 421604 616726 861583 577605 351398 769052 477578
13725 477578 460736 530877 506749 557824 534673 670569 676931 659833 965273 657942 419625
$$ packed form
13796A005975l31292m0326K7485R2297Q8087J375k03722j94851M13272j38940
13786G19360J46401l83272J14210K52182j54705j81676J37315j21305L10307k55093
13776E83724j7523L70412k89771L62985D93237M35882l51410L05411k24006n4151
13766F04963K25794J1445N3664k16057Q9282l66908J92679J83186q4443k2062
13756F71543k00236O1535R2342K54310C52120K44153J5103j40802M66103C66195
13745G25821K6340k16326J34767K42769l15377o3734N8997J55031j79158j79376
13735C89754o207L98470B58968J62636J95122K44857k83978k26207M17654k91474
13725D77578j6842P0141k4128N1075k3151J35896O362j7098L05440l07331k38317
$$ plain form
13714 419625 638304 515734 648283 478278 490693 854231 767216 694439 448519 820829
13704 820829 733904 631231 744168 664415 724698 409586 343148 460139 415342 560658
13694 560658 431005 533179 308400 205900 728058 577238 539845 391237 455116 493644
13684 493644 301918 555449 473081 149763 508584 380728 416465 467747 719640 623416
13674 623416 572328 586250 515702 496391 589706 806857 463537 368899 270798 440801 398780
13663 398780 526039 456275 370511 418151 246373 602192 714712 920535 461157 536534
13653 536534 432912 222779 344117 376279 264462 514478 609129 237227 611611 335311
13643 335311 492656 548258 517132 283122 169782 527731 360363 219688 418279 397808
$$ packed form
13714D19625K18679j22570J32549j70005J2415L63538q7015p2777k45920L72310
13704H20829q6925j02673J12937p9753O0283l15112o6438J16991m4797J45316
13694E60658j29653J02174k24779j02500N22158j50820l7393j48608O3879L8528
13684D93644j91726K53531q2368A49763L58821j27856L5737N1282K51893r6224
13674F23416n1088J3922p0548j9311R3315K17151l43320r4638r8101J70003m2021
13663C98780J27259o9764q5764M7640j71778L55819J12520K05823m59378P5377
13653E36534j03622k10133J21338L2162j11817K50016R4651B37227L74384k76300
13643C35311J57345N5602l1126k34010j13340L57949j67368j40675J98591k0471
$$ plain form
13633 397808 510044 450968 400835 491362 432662 322595 642913 181383 327428 201415
13623 201415 295093 140993 283541 389344 386780 519472 516114 409956 384083 58322 658075
13612 658075 755288 334173 515660 168330 487985 68026 442885 532074 702720 594993
13602 594993 424798 355082 140407 362688 344792 270125 364593 374143 490353 289968 231480
13591 231480 420692 550226 326797 267049 232942 101861 519182 474481 371041 210397
13581 210397 288763 251981 184696 418831 59793 350760 308230 155439 383743 592358
13571 592358 119734 588388 94838 207866 67994 598851 342668 202662 293768 -63041
13560 540181 457330 -339836 242937 294715 567568 369547 577068 287626 234772 -14894
$$ packed form
13633C97808J12236n9076n0133R0527n8700j10067L20318A81383J46045j26013
13623B01415R3678A40993J42548J05803k564J32692l358j06158k5873E8322N99753
13612F58075R7213C34173J81487A68330L19655F8026L74859Q9189J70646j07727
13602E94993j70195o9716A40407K22281j7896p4667R4468R550J16210k00385n8488
13591B31480J89212J29534k23429n9748l4107A01861M17321m4701j03440j60644
13581B10397P8366l6782o7285K34135E9793K90967m2530j52791K28304K08615
13571E92358A19734M68654I4838J13028F7994N30857k56183j40006R1106f3041
13560E40181q2851c39836B42937N1778K72853j98021K07521B87626n2854a4894
$$ plain form
13549 430932 281534 142304 646941 -35782 152022 628940 632001 596496 519132 302658
13539 302658 328961 383248 262222 532069 62897 441248 218019 352140 201868 340873
13529 340873 326370 69847 447689 355041 484966 588393 493274 270286 320424 40043 551354
13518 551354 228602 319430 243982 563001 363783 532390 292798 378277 249621 176205
13508 176205 453498 234888 252141 108600 -135995 241632 171941 491215 14322 404458
13498 404458 279457 302054 171492 244730 354778 -34752 320392 -158403 -6898 395763
13487 305448 228333 114607 280123 339708 157979 59332 221689 155259 -21798 453510
13476 122730 191052 282900 134582 134054 151419 -190877 540648 192458 23975 56147 253268
$$ packed form
13549D30932j49398j39230N04637c5782A52022M76918L061l5505p7364k16474
13539C02658K6303N4287j21026K69847F2897L78351B18019J34121j50272J39005
13529C40873j4503F9847L77842r2648J29925J03427r5119k22988N0138D0043N11311
13518E51354B28602R0828p5448L19019j99218J68607k39592Q5479j28656p3416
13508A76205K77293k18610J7253A08600a35995B41632o9691L19274A4322L90136
13498D04458j25001K2597j30562P3238J10048c4752C20392a58403f898C95763
13487C05448p7115j13726J65516N9585A57979E9332J62357o6430b1798D53510
13476A22730O8322R1848A34582n28J7365a90877E40648A92458B3975L2172J97121
$$ plain form
13465 253268 235478 -66018 326956 439295 125049 61857 411806 182527 406968 344832
13455 344832 351071 222414 223276 255173 100491 251330 236286 518907 -83634 194079 263586
13444 263586 172043 171955 52244 12570 497061 231701 341469 182531 118534 463494 186655
13432 62189 302574 92005 169234 165827 388131 407576 67981 617600 178377 549317 781
13420 111419 406267 498645 433615 537606 238467 581378 174295 56744 214562 207773
13410 207773 218381 339793 245770 391626 36271 -146126 -102594 514959 185118 369857
13400 369857 158532 177848 428808 34694 312006 293481 366049 232538 -131260 181724
13389 317529 458122 1604 385640 -122101 219685 108959 78578 366190 -107300 96269
$$ packed form
13465B53268j7790f6018C26956J12339A25049F1857L49949A82527K24441o2136
13455C44832O239j28657Q62L1897A00491J50839j5044K82621h3634A94079O9507
13444B63586r1543q8E2244A2570M84491B31701J09768j58938o3997L44960A86655
13432F2189K40385I2005P7229l407K22304J9445F7981N49619A78377L70940G81
13420A11419K94848R2378o5030J03991B38467L42911A74295E6744J57818o789
13410B07773J0608J21412r4023J45856C6271a46126M3532E14959A85118J84739
13400C69857A58532J9316K50960C4694K77312j8525P2568j33511a31260A81724
13389C17529J40593A604L84036a22101B19685A08959l0381K87612a07300I6269
$$ plain form
13378 69037 384302 -53619 343669 243598 573392 107342 237531 137218 69912 12269
13367 447628 211041 143663 293697 53918 314545 52077 -59713 83836 259854 209949 322553
13356 322553 109558 138812 27622 386353 268550 492420 279753 102297 243722 138819
13346 138819 408239 277687 -6974 102178 61035 121728 447671 279519 289786 373649 165730
13334 268388 -46707 -88637 237841 289703 108252 467186 106912 -179774 57655 384661
13324 384661 33913 462460 119628 154363 185692 272580 53532 617065 243231 54748 95509
13313 95509 229703 177350 -10645 178987 463411 281209 91775 382064 -53472 -102746 -80260
13302 -80260 277850 193123 -17680 413297 86431 -84501 -50506 262180 321242 214418 -25796
$$ packed form
13378F9037L15265e3619C43669j00071L29794A07342J30189j00313o7306A2269
13367D47628B11041o7378J50034E3918K60627E2077e9713H3836J76018m9905J12604
13356C22553A09558K9254B7622L58731j17803K23870k12667A02297J41425j04903
13346A38819K69420j30552f974A02178m1143O0693L25943j68152J0267Q3863A65730
13334B68388d6707m1930B37841N1862A08252L58934A06912a79774E7655L27006
13324C84661C3913M28547A19628L4735L1329Q6888E3532N63533B43231E4748M0761
13313I5509J34194n2353a0645A78987K84424j82202I1775K90289e3472m9274K2486
13302h0260B77850q4727a7680D13297H6431h4501L3995B62180N9062j06824b5796
$$ plain form
13290 205889 319622 83550 -191134 234616 118172 236774 226030 -47947 128281 -24805
13279 220078 -173828 294248 -225226 88464 176104 201967 139944 77397 110136 403885 -179297
13267 76180 46779 10915 246087 -26329 193535 -373322 113206 228088 252057 431774
13257 431774 118292 335293 55219 203039 125277 68140 -99303 -152968 47018 181867 -98108
13245 190506 11230 -86841 224468 -205002 -31381 52059 143406 64582 223545 207848 236736
13234 236736 58959 -114889 117694 439580 349490 68221 239030 23844 292776 60339
13223 126156 -11604 -120137 102108 20839 139266 182650 355855 60330 144501 59563 248750
13212 248750 -30779 296928 46238 161028 169963 153920 -29784 267890 -142785 349503 255157
$$ packed form
13290B05889J13733H3550a91134B34616j16444J18602j0744d7947A28281b4805
13279B20078a73828B94248b25226H8464Q7640K5863o2023o2547L2739K93749a79297
13267G6180k9401A0915K35172b6329A93535c73322A13206J14882K3969J79717
13257D31774A18292K17001E5219J47820p7762n7137i9303n3665D7018J34849i8108
13245A90506A1230h6841B24468b05002c1381E2059R1347F4582J58963j5697K8888
13234B36736E8959a14889A17694L21886r0090F8221J70809B3844K68932F0339
13223A26156a1604j08533A02108B0839J18427M3384J73205F0330Q4171E9563J89187
13212B48750c0779B96928D6238J14790Q935j6043b9784B67890a42785C49503r4346
$$ plain form
13201 255157 47600 -22099 50863 139183 -8013 150229 -191268 180561 141807 154693 219906
13190 219906 147310 -125306 6601 54311 153664 -12534 -31905 179869 100181 -203923 208135
13178 352196 61233 -237767 -100449 102168 213747 217968 77811 192347 239547 -123364
13167 218188 53500 -73371 154264 -99774 321878 188674 -183587 -28964 397008 13975
13156 116764 372222 -108385 214930 -253423 -168489 74873 149048 -26919 315 149362 438156
13145 438156 27722 51220 238886 61698 94070 210344 312241 93591 209347 -224657
13134 194654 226327 290285 -83271 164788 164044 382906 -162535 -80020 -53956 -238331 -94840
13122 111394 149678 -74307 -45780 90058 -85054 7356 204789 -76775 163936 -32830 -170920
$$ packed form
13201B55157D7600b2099E0863Q8320h013A50229a91268A80561l8754J2886O5213
13190B19906p2596a25306F601M7710R9353a2534j9371A79869p9688b03923B08135
13178C52196F1233b37767a00449A02168J11579M221G7811J14536M7200a23364
13167B18188E3500g3371A54264i9774C21878j33204a83587b8964C97008A3975
13156A16764K55458a08385B14930b53423Q4934G4873P4175b6919C15J49047K88794
13145D38156B7722K3498J87666F1698L2372J16274J01897I3591J15756b24657
13134A94654L1673O3958h3271A64788p44K18862a62535h0020K6064j84375i4840
13122A11394L8284g4307K8527I0058h5054G356J97433g6775A63936c2830j38090
$$ plain form
13111 -170920 289547 119356 264979 -125811 256512 -112656 140551 36543 -222125 -91931
13100 154305 -81863 209132 136116 -152350 114158 241528 160203 104192 -42586 -197929
13090 -197929 -160097 261667 275891 189061 9876 94362 334801 64792 53302 271260 150340
13079 150340 185218 -57825 154906 164857 213262 -33395 -43633 125498 30680 78638 126454
13068 126454 107725 -10922 299161 128452 -122193 -96044 -30758 52519 243863 -53755 -114018
13057 -114018 -220422 118235 -49275 155110 -162915 146765 97379 414065 127525 33762
13046 -87414 -174155 -129538 122982 273684 258852 -90176 82900 82447 209463 261590 46083
13034 32347 138632 -38919 40943 -172262 204999 110183 180390 77139 -227117 105231 126674
$$ packed form
13111a70920B89547A19356J45623a25811B56512a12656A40551C6543b22125i1931
13100A54305h1863B09132p3016a52350A14158J27370q1325n6011d2586j55343
13090a97929L7832B61667J4224q6830I876Q4486K40439F4792j1490K17958j20920
13079A50340L4878e7825A54906R951M8405c3395j0238A25498C0680M7958M7816
13068A26454j8729a0922B99161A28452a22193K6149c0758E2519J91344e3755o0263
13057a14018j06404A18235d9275A55110a62915A46765m9386L16686A27525C3762
13046h7414q6741M4617A22982J50702j4832i0176H2900m53J27016N2127D6083
13034C2347J06285c8919D0943a72262B04999r4816P0207G7139b27117A05231K1443
$$ plain form
13023 126674 183127 104299 -177044 -202891 135329 62318 21242 287286 158342 187894 68881
13011 -269765 157538 127297 369158 175452 -113988 227709 307610 266261 -149052 179581
13000 5106 188034 64511 -180623 161434 -336481 -85618 180072 -102085 -115075 109977
12989 -57255 89274 -106293 15723 -21688 351716 114932 165264 27390 -176612 -174908 -103878
12978 -103878 115135 182083 137596 99754 242214 -17165 -94064 -163224 194710 20801 84090
12967 84090 386392 -280336 39941 -209344 310480 -127971 59568 29218 115240 -7245 329296
12955 -251704 137214 59907 -14557 108598 -50262 -29663 382540 106268 -30812 -20441 -109814
12944 -109814 -162548 -439322 119065 -104873 95000 257706 31884 -102593 -2843 284581
$$ packed form
13023A26674N6453p8828a77044k5847A35329F2318B1242K66044j28944K9552F8881
13011b69765A57538l0241K41861A75452a13988B27709P9901m1349a49052A79581
13000E106J82928F4511a80623A61434c36481h5618A80072a02085j2990A09977
12989e7255H9274a06293A5723b1688C51716A14932N0332B7390a76612J704P1030
12978a03878A15135O6948m4487l7842J42460a7165p6899o9160A94710B0801O3289
12967H4090L02302b80336C9941b09344C10480a27971E9568B9218Q6022g245C29296
12955b51704A37214E9907a4557A08598e0262K0599C82540A06268c0812J0371q9373
12944a09814n2734k76774A19065a04873I5000J62706C1884a02593b843B84581
$$ plain form
12933 76668 5300 -48151 -52920 -20690 232648 248179 101161 -146637 326240 -114181 -97620
12922 -97620 -23304 30060 137480 190217 -9705 51562 37324 217802 -317098 -115380 -212069
12911 -212069 -2784 -11394 106198 256849 151095 -69671 -323210 -70962 188005 18933 142582
12900 142582 -249480 -82713 191868 -52881 307296 41505 23783 -236050 123144 -24202
12889 296223 66766 86980 -176459 186017 61213 60652 25321 107299 133457 -308492 232988
12877 291614 48683 155019 138839 71334 -167873 272939 68517 145113 -179608 -148273 -300864
12866 -300864 51023 27065 253962 -256715 -383760 -154272 -71688 391707 20865 -179953
12855 -185719 -449541 -135020 153062 50869 -306 -152785 108390 126741 -10071 74445 -133708
$$ packed form
12933G6668E300d8151m769b0690B32648J5531A01161a46637C26240a14181J6561
12922i7620b3304C0060J07420N2737i705E1562j4238J80478c17098a15380r6689
12911b12069b784q610A06198J50651j05754f9671k53539g0962A88005A8933J23649
12900A42582b49480h2713A91868e2881C07296D1505j7722b36050A23144b4202
12889B96223F6766K0214a76459A86017F1213n61B5321Q1978K6158c08492B32988
12877B91614D8683J06336j6180o7505a67873B72939F8517P6596a79608L1335j52591
12866c00864E1023k3958K26897b56715j27045a54272g1688C91707B0865a79953
12855a85719k63822a35020A53062E0869c06j52479A08390J8351a0071G4445a33708
$$ plain form
12843 78628 -69869 288401 35152 65121 210904 102351 218908 247488 150651 -96288 -24129
12831 -40322 -127483 373067 116985 429718 205871 47274 -21197 263755 249486 -134764
12820 -178234 -297308 -47544 358312 -6884 -31054 11931 68206 181695 250994 76138 287242
12809 287242 65356 184827 -26550 -125530 -138765 -171002 -114598 -224769 2655 175805 24256
12797 64392 140733 135418 -46642 153120 229290 -195122 -33339 -288965 -22583 41540 93171
12786 93171 35950 -210280 -154302 -279804 72703 193132 140952 -105119 -144931 -27956 35191
12774 -1055 37518 -287277 110422 -300999 -9931 -26007 -5112 33795 293376 -29766 -70442
12763 -70442 75080 165791 -14064 81431 116260 -95535 367244 275063 69692 89558 91467 169292
$$ packed form
12843G8628f9869B88401C5152K9969J45783A02351J16557K8580r6837i6288b4129
12831d0322q7161C73067A16985L12733B05871D7274b1197B63755j4269a34764
12820a78234j19074d7544C58312f884k4170A1931N6275J13489O9299G6138K11104
12809B87242F5356J19471b6550r8980j3235l2237N6404j10171B655J73150B4256
12797F4392P6341n315d6642A53120P6170a95122c3339k55626b2583D1540N1631
12786I3171C5950b10280N5978j25502G2703J20429n2180a05119l9812b7956C5191
12774a055C7518b87277A10422c00999i931j6076e112C3795K59581b9766m0676
12763g0442G5080R0711a4064H1431L4829i5535C67244r2181F9692J9866J909P7825
$$ plain form
12751 169292 -30218 220185 152207 -117353 -91229 -208092 21033 162791 101480 -422754
12740 164233 -208338 280591 256588 257291 131457 204344 139025 62695 92267 -210533 -261212
12729 -261212 -216804 -156635 164344 -129443 2609 -125276 524838 -253949 260583 -19418
12718 -240533 103612 -223670 -233135 104128 -27214 34311 -88141 495083 276789 108835
12707 -15917 187341 154303 25056 242526 167270 227761 47328 147402 -28964 -180370 -183224
12696 -183224 -48726 62157 -424003 97297 -90015 -33768 -52326 22244 -48500 116339 -53539
12684 170740 177942 105807 -3287 138130 -165405 75758 155916 219971 528820 249932 94259
12672 -42226 153865 -19664 315148 -306550 33643 108026 88831 233940 280745 -187803 -147545
$$ packed form
12751A69292c0218B20185o7978a17353K6124j16863B1033J41758o1311d22754
12740A64233b08338B80591k4003P03j25834P2887o5319F2695K9572b10533n0679
12729b61212M4408O0169A64344a29443B609a25276E24838b53949B60583a9418
12718b40533A03612b23670r465A04128b7214C4311h8141D95083k18294A08835
12707a5917A87341l3038B5056K17470p5256O0491D7328J00074b8964j51406k854
12696a83224d8726F2157d24003I7297i0015c3768j8558B2244d8500A16339e3539
12684A70740P202p2135c287A38130a65405G5758Q0158O4055L08849B49932I4259
12672d2226A53865a9664C15148c06550C3643P4383j9195J45109M6805a87803M0258
$$ plain form
12661 -147545 222152 96585 362100 73115 -93896 -101562 298574 176537 47359 -56924 -129163
12650 -129163 185603 -77202 -103029 -146370 216924 -391343 -147649 69640 224300 -148714
12639 197785 -4012 157790 15718 368583 134566 87751 -41543 108554 -76333 152206 -21068
12627 278732 176674 207666 279194 193906 208390 -90986 349959 164350 308878 -323313
12616 -96440 -439 165169 -41827 98442 151639 -346303 -100127 43547 -177663 -41750 -81706
12605 -81706 -25528 -107572 207316 244018 319988 -88294 -81965 145612 219038 -142823 253250
12593 212105 9713 106291 105117 96394 -34265 64956 -35332 347239 227890 -89319 75889 -192088
12580 12680 -18057 164907 59331 -515873 105691 86304 -23800 -156462 36812 -170770 -7800
$$ packed form
12661a47545B22152I6585K65515G3115i3896p666B98574j22037D7359e6924p2239
12650a29163A85603g7202k5827m3341B16924c91343a47649F9640J54660a48714
12639A97785d012A57790A5718L52865A34566m6815d1543A08554g6333A52206b1068
12627B78732j02058L0992P1528q5288J4484i0986C49959A64350J44528c23313
12616i6440d39A65169d1827I8442N3197c46303a00127D3547a77663d1750l9956
12605h1706b5528q2044B07316L6702P5970h8294O329A45612P3426a42823B53250
12593B12105I713R6578j174q723c4265F4956c5332C47239j19349h9319G5889a92088
12580A2680a8057A64907E9331e15873A05691j9387b3800j32662C6812a70770g800
$$ plain form
12568 124168 -63291 42803 -108637 -106073 96986 44945 -14285 -18247 76736 516082 -214528
12556 137830 -29650 115555 -51607 -31172 333436 -409776 -146439 -146458 28171 -96057 121799
12544 108636 -142770 -25671 271861 -136745 127748 -70660 -67320 -111071 172056 -429044
12533 37099 -56833 -163402 75412 365322 -9199 175746 -138695 46743 297737 -16881 143981
12521 27161 240270 -41102 -39387 -6691 48013 43454 1690 64284 120765 -169547 294991 20534
12508 333809 -9396 -7923 262421 -42950 -69172 -279423 -1972 -122891 316793 -82508 109146
12496 -197865 273409 41974 -22208 -131094 -110504 -466527 256500 -88200 -133508 9179 -356038
12484 -282857 -130865 127213 245075 -51514 -42524 236497 -15977 306087 226020 -132912
$$ packed form
12568A24168f3291D2803a08637K564I6986D4945a4285l962G6736M39346b14528
12556A37830b9650A15555e1607K0435C33436d09776a46439j9B8171i6057A21799
12544A08636a42770b5671B71861a36745A27748g0660L340m3751A72056d29044
12533C7099e6833j06569G5412K89910i199A75746a38695D6743K50994a6881A43981
12521B7161K13109d1102J715f691D8013m559A690O2594N6481a69547B94991B0534
12508C33809i396J473B62421d2950k6222k10251a972j20919C16793h2508A09146
12496a97865B73409D1974b2208j08886K0590l56023B56500h8200m5308I179c56038
12484b82857a30865A27213J17862e1514Q990B36497a5977C06087q0067a32912
$$ plain form
12473 269527 -8417 65404 -88914 79677 -25191 172379 81341 -82571 -90825 247301 132029
12462 132029 9264 141745 116186 -178748 -13619 -142624 -156422 -216126 -96673 -64913 -196617
12451 -196617 -214683 -146778 -422465 -18805 72942 -28249 -55896 -63665 215566 -64767 -9904
12439 140375 -44458 63430 131084 -109654 -139456 238992 -44994 -274207 -204282 -184554 290134
12427 -50794 32134 -99953 -73626 -16144 -42527 -186175 -7118 -279698 -235985 -348974 -687 104041
12414 -26382 -285131 -130137 225989 43469 92990 36830 185120 131763 -29891 35072 36192
12403 36192 16751 70689 57343 70382 -48690 46675 -36628 -197599 -26735 285548 250156
12392 250156 -115420 -97728 284729 -381934 -198808 111769 101189 -160997 47212 45197
$$ packed form
12473B69527h417F5404h8914G9677b5191A72379H1341h2571q254B47301j15272
12462A32029I264J32481k5559a78748a3619j29005j3798n9704i6673L1760j31704
12451a96617j8066O7905k75687a8805G2942b8249k7647p769B15566f4767i904
12439A40375d4458F3430O7654a09654k9802B38992d4994k29213O9925J9728B90134
12427e0794C2134i9953K6327a6144k6383j43648g118k72580M3713j12989f87A04041
12414b6382k58749a30137B25989D3469M9521C6830J48290n3357b9891C5072J120
12403C6192A6751N3938j3346J3039d8690D6675c6628j60971b6735B85548l5392
12392B50156a15420J7692B84729c81934J83126A11769j0580a60997D7212k015
$$ plain form
12382 45197 -63110 -98789 -140045 -424188 111175 -82250 72157 -105909 -106491 -33892 179190
12370 10699 76837 187062 -95722 9002 28118 91436 75440 -16924 -97138 175295 93205
12359 93205 36729 -39113 1818 -102430 184849 -297873 19404 34027 -173755 222876 256664
12348 256664 -99822 70202 155322 287021 204920 -176370 179467 -167586 -92008 -67118 -154340
12337 -154340 -316325 -111452 94068 -60571 313938 -143564 140876 21466 67812 76587 -207797
12325 -130699 -270445 420896 305483 -58037 -221415 -131383 -40896 -330859 -69274 -41461
12315 -41461 220930 23358 -213637 -490648 -73 151646 91515 2030 -294365 -55591 -63811 -161670
12303 -161670 -118061 -275373 -206881 157596 3907 -72379 104562 162460 66623 -343138 -293370
$$ packed form
12382D5197f3110l5679m1256k84143A11175h2250G2157a05909n82c3892A79190
12370A0699O6138J10225i5722I002J9116O3318j5996a6924q0214A75295q2090
12359I3205C6729c9113A818a02430A84849b97873A9404J4623a73755B22876L3788
12348B56664i9822G0202Q5120J31699q2101a76370A79467a67586P5578K4890q7222
12337a54340j61985a11452I4068f0571C13938a43564A40876B1466M6346Q775b07797
12325a30699j39746D20896j15413e8037j63378R0032d0896k89963f9274K7813
12315d1461B20930B3358b13637k77011g3A51646o0131B030b94365e5591q220r7859
12303a61670M3609j57312O8492A57596C907g2379A04562N7898F6623c43138M9768
$$ plain form
12292 -293370 34615 293853 191731 -49010 453027 -16626 45732 43439 -110698 -103678 -141317
12281 -141317 -382495 161635 191789 333640 322434 -116699 -53957 64264 -34970 -154549
12271 -154549 436930 -200680 -132467 191885 -270422 266907 -96160 126861 64265 174249
12261 174249 -51101 -201358 -73349 -250101 -98402 103960 -69998 5435 126302 132687 136690
12250 136690 -182922 121646 159293 286987 82210 275706 -32218 138602 -89437 169578
12239 -193836 -63440 -101596 285369 -130005 96573 -147516 306178 -28538 60544 241170
12229 241170 391908 -27721 179689 73309 239319 143247 142297 112504 292866 -26528 -95109
12218 -95109 48922 106032 190904 299158 432046 -36085 75386 381344 226069 -85393 85377
$$ packed form
12292b93370C4615K59238j02122d9010D53027a6626D5732k293a10698P020l7639
12281a41317k41178A61635L0154J41851j1206a16699e3957F4264c4970j19579
12271a54549D36930b00680O8213A91885b70422B66907i6160A26861o2596J09984
12261A74249e1101j50257g3349j76752i8402A03960f9998E435J20867O385M003
12250A36690a82922A21646L7647J27694H2210J93496c2218A38602h9437A69578
12239a93836f3440l8156B85369a30005I6573a47516C06178b8538F0544J80626
12229B41170J50738b7721A79689G3309J66010r6072r50k9793J80362b6528o8581
12218i5109D8922N7110Q4872J08254J32888c6085G5386L05958j55275h5393H5377
$$ plain form
12206 101641 -142877 294480 267629 422018 222783 194273 62544 144065 211579 -79419 122875
12194 335576 103044 -163526 304218 173630 296490 279091 -170237 54804 90594 80029
12184 80029 -67829 29217 382079 158300 -130519 226346 72200 -89760 -154406 162486 57708
12172 51182 55398 32251 33640 -64414 160974 115421 -55498 238870 213373 366508 211064
12161 211064 225973 6399 105780 -28798 -67699 77573 150747 -92465 320621 87962 138288
12150 138288 -117118 1099 44901 -50969 133754 42731 107316 49242 79135 98456 16544
12138 191749 124135 -39255 -180398 241772 -171250 150270 204165 -180446 138742 -52163
12127 365215 208926 -200231 -118348 -319193 -19227 -90402 -56497 72512 -40704 10727 119346
$$ packed form
12206A01641a42877B94480k6851J54389j99235k8510F2544Q1521O7514g9419A22875
12194C35576A03044a63526C04218j30588J22860j7399a70237E4804L5790j0565
12184H0029f7829B9217L52862A58300a30519B26346G2200h9760o4646A62486E7708
12172E1182M216k3147J389f4414A60974m5553e5498B38870k5497J53135j55444
12161B11064J4909F399R9381b8798l8901G7573P3174i2465C20621H7962N0326
12150A38288a17118A099M3802e0969A33754D2731O4585D9242K9893J9321A6544
12138A91749o7614c9255j41143B41772a71250A50270N3895a80446A38742e2163
12127C65215j56289b00231Q1883k00845a9227p1175L3905G2512d0704A0727J08619
$$ plain form
12116 119346 -50992 112331 35965 389803 336646 200532 296106 200147 -212279 -154967 64280
12104 204846 347217 -161160 127064 -335686 173737 257505 -26700 81425 14584 -245671
12093 -43446 -209671 179896 -178934 39069 161129 -136784 421868 18881 -55145 226093
12082 -16838 -71619 -3111 -130437 -241617 -68879 93916 25606 -84203 -127863 -42135 22482
12070 249107 260940 -8076 179086 -117842 35213 -142980 107860 38899 126340 135248 -243333
12058 18666 -476039 -206328 174487 -18508 88557 14919 185588 -318762 -8909 -312364 -91017
12046 -93534 -89281 -10706 138686 222576 27155 127757 109009 51479 -16859 119249 44065
12034 -22819 -153096 43962 -41729 49118 -85340 196483 -230652 7735 -73722 -95569 860 243239
$$ packed form
12116A19346e0992A12331C5965L53838n3157j36114R5574r5959b12279N7312F4280
12104B04846J42371a61160A27064c35686A73737Q3768b6700H1425A4584b45671
12093d3446j66225A79896a78934C9069J22060a36784D21868A8881e5145B26093
12082a6838n4781c111j27326j11180f8879I3916B5606h4203m3660d2135B2482
12070B49107J1833h076A79086a17842C5213a42980A07860C8899Q7441Q908b43333
12058A8666d76039b06328A74487a8508H8557A4919J70669c18762h909l03455i1017
12046i3534M253a0706A38686Q3890B7155J00602j8748E1479a6859A19249D4065
12034b2819j30277D3962d1729D9118h5340A96483b30652G735g3722k1847H60K42379
$$ plain form
12022 243239 -179062 -10078 -260608 99006 -322351 191673 -24001 -132054 -74805 16341
12011 -32774 109454 98425 -237955 -71895 134290 223707 -27681 358 -79623 -131210 71308
11999 -7999 159199 123915 153171 -49229 459365 9018 222082 -213360 -294295 166166 42838
11987 114030 -139294 210751 188775 -114980 -211067 13128 354018 161832 143450 -337984
11976 -153346 -102867 -133723 142748 83946 -106536 -50572 -270449 225004 144086 116752 338099
11965 338099 -212039 -113541 -211406 99895 -61651 -57720 68118 150613 -15649 76711 -197187
11953 55327 -64219 -41859 -188698 300139 -174375 -131246 -116065 -83701 -45453 225041 53532
11941 3473 135285 -371475 -91941 28774 -20577 -2396 -202554 349181 -400465 -215982 -29752
$$ packed form
12022B43239a79062a0078k50530I9006c22351A91673b4001j08053N7249A6341
12011c2774A09454j1029b37955g1895A34290Q9417b7681C58g9623n1587G1308
11999g999A59199l5284K9256d9229D59365I018K13064b13360q0935A66166D2838
11987A14030a39294B10751k1976a14980r6087A3128L40890A61832j8382c37984
11976a53346N0479l0856A42748n8802a06536e0572k19877B25004q0918k7334K21347
11965C38099b12039R8498r7865I9895f1651L931F8118Q2495a5649G6711a97187
11953E5327f4219K2360j46839C00139a74375M3129J5181L2364L8248B25041E3532
11941C473J31812c71475i1941B8774b0577b396k00158C49181d00465J84483b9752
$$ plain form
11929 2000 254086 198176 -78194 1961 28354 116498 164915 -241612 72900 63317 -54866 -30674
11917 -30674 129248 -344573 -173800 6683 86877 120283 -130011 -66239 -40223 281570 -139593
11905 291608 -86221 -45132 262737 117500 369535 205805 -446001 -116645 -313195 54066
11894 -141720 10923 -205704 206906 -52409 -251221 -219466 -68209 15353 111426 221623 -191054
11882 165664 -119367 -23677 134664 -189507 47023 -231985 115315 52211 -129281 95705
11871 -39037 -167146 -160847 -391943 -260016 90507 -129867 -20889 11958 -126114 37099 -136849
11859 350845 188651 8947 -308919 -257887 -304188 79758 225766 -135763 -6789 -43193 325902
11847 -240183 203834 -57489 38767 109700 63239 -3656 125380 -226383 -32231 -32731 73541
$$ packed form
11929B000K52086n5910g8194A961K6393Q8144M8417b41612G2900r583e4866K4192
11917c0674A29248c44573J70773F683Q0194L3406a30011O3772K6016B81570a39593
11905B91608h6221M1089B62737A17500K52035j63730d46001a16645j96550E4066
11894a41720A0923b05704B06906e2409j98812L1755f8209A5353R6073J10197a91054
11882A65664a19367b3677A34664a89507D7023b31985A15315E2211a29281I5705
11871c9037j28109O299k31096J31927I0507a29867b0889A1958a26114C7099a36849
11859C50845j62194H947c08919N1032m6301G9758J46008a35763f789l6404C25902
11847b40183B03834e7489C8767P0933m6461c656A25380b26383c2231n00G3541
$$ plain form
11835 -137949 -258797 -328188 -144318 -80347 82914 -48122 119801 -126532 -53599 -166810
11825 -166810 -29689 60325 -2113 -85458 -105055 -89395 -32584 42702 -146928 59048 166384
11814 166384 -172793 58820 12637 81891 -121884 101297 -33168 16585 -80776 -70281 96380
11802 -431978 -64348 -163582 -103148 105354 -149241 159809 -378166 -62241 -91364 45681 -20194
11790 143564 -228013 210812 -228340 30360 101853 275433 56370 20970 70614 226050
11780 226050 -122053 114972 240826 -121908 -157151 215828 383396 -159442 170877 -144707
11769 73950 240578 400193 -190381 63997 -90325 -338450 -169742 -59200 71130 -126893
11758 -463988 -376653 -71706 139330 164599 271868 200945 120631 -219493 -59704 -8938 169697
$$ packed form
11835a37949j20848o9391a44318O3971H2914d8122A19801a26532e3599j13211
11825a66810b9689F0325b113q3345j9597J5660c2584D2702a46928E9048J07336
11814A66384a72793E8820A2637O9254a21884A01297c3168A6585h0776J0495I6380
11802d31978f4348r9234O0434A05354a49241A59809c78166f2241k9123D5681b0194
11790A43564b28013B10812b28340C0360P1493J73580E6370B0970M9644J55436
11780B26050a22053A14972J25854a21908l5243B15828J67568a59442A70877a44707
11769G3950J66628J59615a90381F3997i0325k48125J68708e9200G1130a26893
11758d63988Q7335g1706A39330K5269J07269p0923q0314b19493e9704h938A69697
$$ plain form
11746 -266728 -15245 115776 -134005 31669 -216673 45743 62439 274614 -114433 -109792 -218537
11735 -218537 -149622 -263605 -217004 -67284 -252954 153131 249346 25287 -125732 -202037 189684
11723 -82725 222005 -196083 144592 -10801 21695 -82509 101144 97819 179310 124911 -133139
11711 160941 121728 90940 -104318 -45613 -112401 201408 -337742 178916 -86589 2629 378430
11700 378430 183176 219805 239892 244871 183714 197039 61072 532 75827 -168325 39233 -112327
11687 -7370 88471 215187 -178084 -96857 53532 -27065 145988 -99788 -224963 143087 -76086
11675 183191 246759 280952 -34922 77913 286155 -295123 204057 -36113 -116666 209000 -13282
11663 -196816 -35090 -89895 4267 -61347 239201 -105513 -20777 159518 159032 -152657 219067
$$ packed form
11746b66728a5245A15776a34005C1669b16673D5743J6696K12175a14433M641j08745
11735b18537O8915j13983M6601f7284j85670A53131R6215B5287a25732p6305A89684
11723h2725B22005a96083A44592a0801B1695h2509A01144l325Q1491n4399a33139
11711A60941l9213l0788a04318d5613o6788B01408c37742A78916h6589B629L75801
11700C78430A83176L6629K0087M979o1157J3325F1072E32P5295a68325C9233a12327
11687g370H8471J26716a78084Q1227E3532b7065A45988i9788j25175A43087g6086
11675A83191O3568L4193c4922G7913K08242b95123B04057c6113q0553B09000a3282
11663a96816c5090n4805D267f1347B39201a05513b0777A59518m86a52657B19067
$$ plain form
11651 -172012 -154246 215065 -73391 47314 -85054 -160430 -103559 -148353 -63050 267793 33822
11639 234240 -315262 262408 199367 -101268 48533 -81726 123317 167920 -94669 3859 -342122
11627 -66333 364998 200947 -38490 84007 -96369 271319 253164 -228540 79574 121500 -19126
11615 -90628 135501 -257673 8224 187691 -215407 193919 118980 10839 -123657 -116115 71185
11603 93963 36993 -121758 137321 364501 94118 283400 -75919 -317659 -168701 237617
11592 -161419 -112441 5163 15995 102232 -106851 -52330 70244 219269 -13806 180105 -276060
11580 282912 -147847 81011 9015 26257 63438 265062 -373744 -219644 166830 383331
11570 383331 -59613 118262 46701 47470 91597 -12460 35004 201376 -140542 365231 56289
$$ packed form
11651a72012J7766B15065g3391D7314h5054p5376N6871m4794f3050B67793C3822
11639B34240c15262B62408o3041a01268D8533h1726A23317M4603i4669C859c42122
11627f6333C64998j64051c8490H4007i6369B71319j8155b28540G9574M1926a9126
11615i0628A35501b57673H224J79467b15407A93919p4939A0839a23657P542G1185
11603I3963C6993a21758A37321K27180I4118J89282g5919k41740J48958B37617
11592a61419M8978E163J0832Q6237a06851e2330G0244J49025a3806A80105b76060
11580B82912a47847H1011I015J7242L7181K01624c73744J54100A66830K16501
11570C83331e9613A18262D6701P69M4127a2460C5004J66372a40542C65231E6289
$$ plain form
11558 63500 138680 -82513 161284 -86666 1085 -202746 84688 146218 127577 116278 -74720
11546 -39814 -186992 -295165 -137663 166457 200434 420305 69353 44337 167890 216524
11536 216524 160710 19262 197487 9294 271348 129311 347563 112529 138440 136287 185276
11525 185276 180361 5935 -19063 -44094 -337771 232260 -46300 91614 -271770 139498 180907
11514 180907 239171 -66674 -20338 293257 271823 73735 -10388 203362 232526 286273 -30674
11502 -1393 601451 95412 60321 -262856 288316 39430 149613 230029 118858 153512 -81748
11490 84581 -43419 -154072 124803 168501 -46599 -2655 -11490 223976 -17072 244041 333642
11479 333642 161599 222150 -349160 409176 240341 234958 -725 299734 -89532 109764 -87920
$$ packed form
11558F3500P5180h2513A61284h6666A085b02746H4688O1530j8641j1299g4720
11546c9814j47178j08173a37663A66457L3977K19871F9353k5016J23553M8634
11536B16524n5814A9262J78225I294K62054A29311K18252A12529K5911k153M8989
11525A85276m915E935a9063k5031k93677B32260d6300I1614b71770A39498M1409
11514A80907N8264f6674b0338B93257k1434G3735a0388B03362K9164N3747c0674
11502a393F01451I5412l5091b62856B88316C9430J10183Q0416j11171L4654h1748
11490H4581d3419j10653A24803M3698d6599b655q835B23976a7072B44041Q9601
11479C33642A61599O0551c49160D09176j68835n383g25B99734h9532A09764h7920
$$ plain form
11467 31492 -79978 -136010 952 232337 200805 93918 216370 67376 -38922 -143295 82164
11455 -322400 78910 172171 73004 -4546 74764 -60130 -87914 -372369 97214 -118436 188837
11443 116916 57110 179155 81679 92470 -64902 -184799 116728 -78894 -147960 87206 88000
11432 88000 -218223 299088 248479 -171479 -43134 221108 114966 -122443 -205428 -184216
11422 -184216 -126449 -72550 157253 248668 -104493 -56902 -168525 127435 20469 -59888 28318
11410 146680 86298 19506 -190123 -67494 -36184 76594 210455 -124674 71856 51612 57623
11399 57623 78627 60688 57964 33694 145133 95077 -134767 -298965 -65236 160862 122054
11388 122054 -59940 -184879 -10919 -224406 48466 -38454 -266728 11644 -124764 75243 161836
$$ packed form
11467C1492g9978n6032I52K31385l1532I3918J22452F7376c8922j04373H2164
11455c22400G8910R3261G3004d546G4764f0130k7784k84455I7214a18436A88837
11443A16916E7110J22045H1679J0791f4902j19897A16728g8894o9066H7206P94
11432H8000b18223B99088n0609a71479d3134B21108j06142a22443q2985K1212
11422a84216N7767N3899A57253R1415a04493M7591j11623A27435B0469e9888B8318
11410A46680o0382A9506a90123f7494L1310G6594J33861a24674G1856k0244O011
11399E7623K1004j7939k724k4270J11439n0056a34767j64198f5236A60862l8808
11388A22054e9940j24939a0919k13487D8466c8454k28274A1644a24764G5243Q6593
$$ plain form
11377 161836 43925 -139748 -197010 -63858 -181581 -128238 273365 20912 21795 178053 -93033
11365 169723 -169207 33112 -12377 -2220 47769 -82867 -292927 -102370 -51665 93824 147
11353 -12156 -156311 -19663 -16640 -34994 -220205 -142787 -25893 422213 -219499 127164 -88643
11341 -27229 -104625 47211 136906 -66545 -95160 132484 185600 -71328 -156771 66783 94912
11330 94912 77199 62306 158240 47648 -250617 -105301 -30970 12599 113920 -9320 71400
11318 437579 -26807 104721 194642 185614 157675 117384 117726 -192064 5943 -189130 -410 32673
11305 -35977 -122757 -3272 -156774 -106390 127575 -248043 70500 241753 -75632 77612 -136982
11293 66613 -115732 -282832 -125578 -277031 169837 114532 -214191 -29862 52947 163056
$$ packed form
11377A61836D3925a39748n7262f3858j17723N3343B73365B0912Q83J56258i3033
11365A69723a69207C3112a2377b220D7769h2867k10060a02370N0705I3824A47
11353a2156j44155a9663L023j8354j85211P7418b5893D22213b19499A27164h8643
11341b7229p7396D7211Q9695f6545k8615A32484N3116g1328q5443F6783K8129
11330I4912j7713j4893R5934D7648b50617a05301c0970A2599J01321i320G1400
11318D37579b6807A04721Q9921r028k7939m0291L42a92064E943a89130d10C2673
11305c5977q6780c272j53502N0384A27575b48043G0500J71253g5632G7612a36982
11293F6613a15732j67100a25578j51453A69837n5305b14191b9862E2947J10109
$$ plain form
11283 163056 199967 -138281 -28157 -58857 -83188 191504 59433 82443 88030 52315 -82395
11271 -194224 -13554 83666 -109260 -109009 103945 96899 -151979 -7223 -139272 -164066 -22729
11259 81248 -179757 -142960 12653 -70837 198741 -197821 36098 -21126 -123556 -307925 10478
11247 -54363 -136256 -30446 -196729 65493 6132 306515 -187248 -5541 -189682 -11689 -137431
11236 -137431 56918 17418 -30271 -275487 137118 54916 -73983 -60203 252978 -309191 -143729
11224 -202104 -261705 -291383 225763 50222 -48075 87241 -66865 -142849 -67263 -249863 -120499
11212 22992 -68915 -154666 -354882 -297597 122059 -272585 -277875 -40551 63527 101588 50417
11200 125463 -51192 86208 -140053 -345803 110235 162746 212590 -21961 -347319 -248468 -56987
$$ packed form
11283A63056L6911a38281b8157l0700k4331A91504E9433K3010N587l5715h2395
11271a94224a3554H3666a09260K51A03945p046a51979g223j32049k4794b2729
11259H1248a79757L6797A2653g0837A98741a97821C6098b1126j02430j84369A0478
11247e4363q1893c0446j66283F5493F132L00383a87248e541j84141a1689j25742
11236a37431E6918A7418c0271k45216A37118E4916g3983J3780B52978c09191a43729
11224b02104n9601k9678B25763E0222d8075H7241f6865p5984f7263j82600a20499
11212B2992f8915q5751k00216N7285A22059b72585n290d0551F3527L8061E0417
11200A25463e1192H6208a40053k05750A10235N2511M9844b1961l25358R8851e6987
$$ plain form
11188 -68685 -39465 -210070 24903 202267 -191969 95875 -37739 -187851 88744 84363 -157452
11176 -353392 120558 38895 -109201 -253534 -303909 27234 -386258 -74187 199331 1867 52582
11165 52582 130921 -14394 -156799 -479508 -153990 14675 -62126 -320207 -8496 131248 -96134
11153 -10489 -101025 -187095 11272 -230893 -136346 181614 -18497 67137 101553 20912 187331
11142 187331 -534278 -157989 -163663 -245117 -132704 57183 -155563 51571 43389 22473 -150125
11130 27480 -44136 66978 29971 145708 20644 88857 -138268 110079 97744 -68424 -64727
11119 -64727 23219 -128253 57150 -251520 -203632 -258699 51528 -193606 -108308 -98811 30592
11107 -26646 -157841 71525 25140 -25968 115561 263840 68552 280427 78088 174354 372095
$$ packed form
11188f8685K9220j70605B4903J77364a91969I5875c7739j50112H8744m381a57452
11176c53392A20558C8895a09201j44333n0375B7234c86258g4187A99331A867N0715
11165E2582P8339a4394j42405l22709a53990A4675f2126k58081h496A31248i6134
11153a0489r0536q6070A1272b30893R4547A81614a8497F7137L4416B0912J66419
11142A87331e34278a57989n674q1454J12413E7183a55563E1571q182k0916a50125
11130B7480d4136F6978B9971J15737B0644O8213a38268A10079j2335f8424L697
11119f4727B3219a28253E7150b51520M7888n5067E1528a93606Q5298R497C0592
11107b6646j31195G1525B5140b5968A15561J48279F8552K11875G8088R6266J97741
$$ plain form
11096 372095 19506 126871 -206151 157369 377508 71573 165158 159506 170635 169276 70513
11084 -136741 203492 -27945 273056 -23021 204106 130013 515742 -1092 149748 85713 -275710
11072 195916 83801 282048 203655 -100491 454451 499721 417348 188070 336107 185071
11062 185071 352639 449145 407981 257328 316525 367359 364384 531476 174675 237100 544518
11051 544518 594346 327318 565796 420591 831046 597821 547792 498466 361967 609517
11041 609517 388805 639030 573871 547781 438247 264102 383462 315325 334089 288889
11031 288889 427703 411139 589659 558524 578544 309255 368112 597263 442908 420244
11021 420244 416828 628587 375666 -80141 506540 279268 578926 384748 111884 596844
$$ packed form
11096C72095A9506J07365b06151A57369K20139G1573R3585n652J1129j359G0513
11084a36741B03492b7945B73056b3021B04106p4093L85729a092A49748o4035b75710
11072A95916H3801J98247p8393a00491D54451M5270q2373A88070J48037j51036
11062A85071J67568R6506m1164j50653N9197N0834k975J67092A74675O2425L07418
11051E44518M9828k67028K38478j45205M10455k33225n0029m9326j36499K47550
11041F09517k20712K50225o5159k6090j09534j74145J19360o8137J8764m5200
11031B88889J38814j6564J78520l1135K0020k69289N8857K29151j54355k2664
11021D20244l416K11759k52921h0141E06540k27272K99658j94178A11884M84960
$$ plain form
11011 596844 589599 355347 411363 46615 636395 348270 386264 313105 196195 394885 138386
10999 229951 699061 460136 898120 595020 662363 428440 453975 599853 728056 401362
10989 401362 503668 448560 521244 619703 528045 640615 432730 895809 981589 695537
10979 695537 837428 710202 1116527 1305336 1509389 1779134 1399153 1745231 2188371 1813710
10969 1813710 1930361 1767753 1874350 1739965 1231251 1076337 1208033 1281805 1435771 1006212
10959 1006212 1226737 932078 1300668 1449866 1310832 1187906 1202751 1030693 1290309 848699
10949 848699 719309 193217 392640 428682 207427 238383 36562 249396 430314 112246
10938 68088 -29081 276841 -83736 56557 324047 84466 -105592 7961 87528 34661 -96701
$$ packed form
11011E96844p245k34252N6016D6615N89780k88125L7994p3159j16910J98690A38386
10999B29951M69110k38925M37984l03100O7343k33923K5535J45878J28203l26694
10989D01362J02306n5108P2684R8459r1658J12570k07885M63079Q5780k86052
10979F95537J41891j27226M06325J88809K04053K69745l79981L46078M43140l74661
10969A813710J16651j62608J06597j34385n08714j54914J31696P3772J53966m29559
10959A006212K20525k94659L68590J49198j39034j22926J4845j72058K59616m41610
10949H48699j29390A93217J99423L6042B07427L0956C6562K12834J80918A12246
10938F8088b9081B76841h3736E6557K67490H4466a05592G961P9567C4661i6701
$$ plain form
10926 48782 -29803 -211247 -96384 49942 -220491 193347 -266729 51556 -141479 155658
10915 -26396 -36249 21583 -217561 85108 154740 -157704 72361 -137220 120034 -15528 168951
10903 -102002 -213889 39866 -215132 23871 168041 -46567 -116028 -444357 70745 -184539
10892 -83781 199637 -177156 -44052 117733 106879 -12726 196511 -168799 161843 123876
10882 123876 -275703 130115 -357400 141189 -198802 326893 -352200 66224 -101951 -103860
10872 -103860 -10681 56688 -15973 -227246 -29470 115887 -248686 -200204 -98279 -239097 119907
10860 270702 -38346 4569 -69719 -53177 20802 202542 -227773 143214 72211 -172710 27491
10848 108222 -15906 127675 43438 -191239 -52990 136471 -96987 -197979 -100596 52545 97684
$$ packed form
10926D8782b9803j81444i6384D9942b20491A93347b66729E1556a41479A55658
10915b6396r853B1583b17561H5108O9632a57704G2361a37220A20034a5528A68951
10903a02002j11887C9866b15132B3871J44170d6567o9461l28329G0745a84539
10892h3781A99637a77156d4052A17733j0854a2726A96511a68799A61843l7967
10882A23876b75703A30115c57400A41189a98802C26893c52200F6224a01951j909
10872a03860a0681E6688a5973k11273b9470A15887b48686M8482i8279j40818A19907
10860B70702c8346D569f9719J6542B0802J81740b27773A43214p1003a72710B7491
10848A08222a5906A27675D3438a91239e2990A36471i6987j00992R7383E2545M5139
$$ plain form
10837 97684 -43143 72804 132599 -160008 -17092 147193 -257728 -31580 198075 103781 138227
10826 138227 42586 -7648 189351 -151321 148187 9608 -125398 8967 179274 -10660 54029
10814 -293012 -8150 -43847 -36493 -273739 -76093 -26678 -76227 174930 48527 -49826 -74745
10803 -74745 -257085 -91283 -34748 19241 31785 69104 40256 140724 -55016 12542 -354683
10791 -85035 437851 -41734 -252528 152083 -79123 -38190 182956 -221924 67078 -286148
10780 37623 -102207 173947 -47075 117230 143548 -274473 4558 35036 -113599 -73764 -135990
10769 -135990 -118088 188814 -163521 -276575 40134 -33597 -74922 4549 -50774 63911 -93676
10757 -22876 -62547 132 108648 31434 -55473 -283050 -145288 -66019 -189620 135034 -52727
$$ packed form
10837I7684d3143G2804N9795a60008a7092A47193b57728c1580A98075r4294L4446
10826A38227D2586g648A89351a51321A48187I608a25398H967J70307a0660E4029
10814b93012h150l5697P354k37246g6093b6678m9549A74930D8527d9826k4919
10803g4745j82340i1283c4748A9241J2544L7319k8848J00468e5016A2542c54683
10791h5035D37851d1734k10794A52083g9123c8190A82956b21924F7078b86148
10780C7623a02207A73947d7075A17230K6318b74473D558L0478a13599L9835o2226
10769a35990J7902A88814a63521j13054D0134c3597m1325D549e0774F3911i3676
10757b2876l9671A32J08516C1434e5473k27577J37762f6019j23601A35034e2727
$$ plain form
10745 -243583 -116877 -224253 -187636 -113976 -65376 -147343 9287 85049 -424292 -31071 -33639
10734 -33639 122306 22731 -53577 -312870 73511 -76880 -55708 -47474 -200793 -39063 137541
10722 -231857 87242 -117376 7963 111599 69722 42250 -104031 -38813 -68261 -56975 -303984
10711 -303984 -206250 -201084 -147889 -102722 -19946 -3002 24479 -145746 4148 -298838 -72111 57701
10698 145216 -117280 -20954 -199780 -274067 -162842 -298691 81241 47282 60834 -185910
10687 42792 -296597 126240 -118869 -166722 88152 81736 41224 -6533 -280646 40953 46618
10676 46618 -82203 -82225 -199266 31665 -94616 35820 -519595 -130492 136561 137630 54619 75310
10664 75310 281579 35828 -86695 -45091 -450854 6391 -54878 61572 198681 5108 -109036
$$ packed form
10745b43583a16877j07376L6617P3660M8600q1967I287P5762d24292c1071k568
10734c3639A22306B2731e3577k59293G3511g6880K1172Q234j53319c9063A37541
10722b31857H7242a17376G963J03636m1877k7472a04031c8813k9448J1286k47009
10711c03984R7734N166N3195M5167a9946c002B4479a45746D148b98838g2111E7701
10698A45216a17280b0954j78826p4287J11225j35849H1241l3959J3552a85910
10687D2792b96597A26240a18869m7853H8152o416m0512f533k74113D0953N665
10676D6618h2203k2j17041C1665i4616C5820e19595a30492A36561J069E4619K0691
10664G5310K06269C5828h6695M1604m05763F391e4878F1572J37109E108a09036
$$ plain form
10652 178110 -104951 142052 -99161 161070 -77953 397 84231 -6742 -348437 -53334 47698
10640 -135087 161510 176698 -292668 -134895 -103388 83279 -153001 -51508 101304 -107597
10629 -209915 -231006 -83699 -499572 -55375 -113394 153171 -420735 -53830 -57634 125896 107810
10618 107810 -20464 142141 34960 272 -14863 -110256 53421 134355 -70358 115656 112095 -115018
10605 78422 -62109 -177313 210958 -296404 -141179 -183521 -42788 -243946 162228 61025
10594 -108148 -153948 130678 -184129 -51629 -192459 32629 92029 179286 -184475 -90156 -102766
10583 -102766 -135665 146068 -57477 273986 -341361 236470 -66788 263772 -44748 -224921
10573 -224921 23456 -4616 -133031 196701 -108220 -238143 -106886 -127310 215888 -106136
$$ packed form
10652A78110a04951A42052i9161A61070g7953C97Q3834f742l41695e3334D7698
10640a35087A61510J5188b92668a34895L1507H3279a53001e1508A01304a07597
10629b09915k1091h3699m15873e5375n8019A53171d20735e3830l804A25896j8086
10618A07810b0464A42141C4960B72a4863r5393E3421Q0934g0358A15656l561a15018
10605G8422f2109j15204B10958b96404a41179m2342d2788k01158A62228F1025
10594a08148m5800A30678a84129e1629j40830C2629N9400Q7257a84475i0156j2610
10583a02766l2899A46068e7477B73986c41361B36470f6788B63772d4748j80173
10573b24921B3456d616j28415A96701a08220j29923a06886k0424B15888a06136
$$ plain form
10562 -35484 -137434 -17715 -123475 -18676 231309 -35655 -67290 -73361 246696 -77011 -92415
10551 -92415 15686 -229028 -190337 -219845 152265 43760 -13473 37296 104197 -129128 151534
10539 -220581 263231 -318469 -227245 -24621 312688 72154 9223 -15822 106172 -59502 -114046
10528 -114046 -136439 -45254 -203819 142865 72295 198778 5163 -10198 -111478 54165 99257
10517 99257 45695 110830 59675 141734 250514 221959 234873 -283551 -100733 -416692 173200
10505 -23279 87502 15607 -141318 73380 -155456 -399126 54429 -4591 167552 -132504 57732
10493 19099 194338 -169112 393144 -88265 -178732 69505 124618 98439 257413 -5910 70465
10481 321818 207585 315785 284832 219163 114651 6444 273119 -136961 -218519 -291890 -82870
$$ packed form
10562c5484j01950a7715j05760a8676B31309c5655l1635o071B46696g7011j5404
10551i2415A5686b29028L8691k9508A52265D3760a3473C7296O6901a29128A51534
10539b20581B63231c18469R1224b4621C12688G2154I223a5822A06172e9502n4544
10528a14046k2393d5254j58565A42865p0570J26483E163a0198j01280E4165M5092
10517I9257D5695O5135n1155Q2059J08780k8555J2914b83551a00733l15959A73200
10505b3279H7502A5607a41318G3380a55456k43670E4429d591A67552a32504E7732
10493A9099J75239a69112C93144h8265r0467F9505N5113k6179J58974e910G0465
10481C21818j14233J08200l0953o5669j04512F444K66675a36961q1558p3371h2870
$$ plain form
10469 -5423 70175 -85660 -596 5239 -7224 -264790 18544 6390 -411486 -98468 -252958 57965
10456 81683 -19680 -134782 31304 -247556 253267 292213 23092 -108758 10805 47326 -7794
10444 -423574 -229411 868 -94708 -31968 -125180 12633 -93990 -99143 -271572 -80213 75851 -82103
10431 359400 -38964 -173916 89189 171160 -143163 -32644 -155515 -426924 -24717 257372
10420 -140402 -2779 130196 409812 -107118 -155179 -60899 -151778 -231193 -22875 159608 -120287
10408 -138888 -5954 -98591 -97631 -38501 -252818 -65657 -13384 208362 21781 -328636 109881
10396 -275044 -363592 -74701 102212 98800 -218259 151338 88190 337547 -152473 -46797 -258236
10385 -258236 306525 175639 -278099 224547 -86279 180601 4740 199020 419369 71298
$$ packed form
10469e423G0175h5660e96E239g224k57566A8544F390d11486i8468j54490E7965
10456H1683a9680j15102C1304b47556B53267L8946B3092a08758A0805L6521g794
10444d23574J94163H68i4708c1968r3212A2633i3990n153j72429h0213G5851h2103
10431C59400c8964j34952H9189Q1971a43163c2644j22871k71409b4717B57372
10420a40402b779A30196K79616a07118m8061f0899r0879p9415b2875A59608a20287
10408a38888e954r2637R60c8501k14317f5657a3384B08362B1781c28636A09881
10396b75044q8548g4701A02212l412b18259A51338o3148K49357a52473d6797k11439
10385b58236C06525j30886b78099B24547h6279A80601D740J94280K20349G1298
$$ plain form
10374 163176 176879 9300 160971 65289 206520 344623 264491 106249 55137 45009 158132
10363 158132 196400 499432 94506 -209966 8971 453768 126977 216321 181851 307218 12329
10351 257511 -9781 590284 170925 334930 210706 111784 99087 558016 431579 31994
10340 425084 14545 210690 93423 473492 88507 -9946 -126040 23099 253901 -13827 95900
10328 6823 59919 43422 129151 62633 33427 -36866 200220 336262 185177 294433 -139412
10316 -174117 104618 180963 210435 131719 51158 -30859 71297 -116717 264062 254787 65567
10304 62186 -401808 172260 -63817 54882 -277954 90887 107065 24314 -226970 -134007 -210388
10293 -210388 -43425 -395595 -115444 -88007 260321 -91517 -162655 57802 -266523 -276253 249541
$$ packed form
10374A63176J3703I300J51671F5289J41231J38103q0132A06249n1112j0128J13123
10363A58132L8268L03032I4506b09966H971M44797A26977Q9344l4470J25367A2329
10351B57511i781E90284A70925J64005j24224r8922j2697M58929j26437C1994
10340D25084A4545J96145I3423L80069H8507i946j16094B3099K30802a3827I5900
10328F823N3096j6497Q5729F2633k9206c6866B00220J36042j51085J09256a39412
10316a74117A04618P6345K9472p8716E1158c0859G1297a16717B64062r275F5567
10304F2186d01808A72260f3817E4882b77954I0887J6178B4314b26970R2963p6381
10293b10388d3425l52170a15444K7437B60321i1517p1138E7802b66523r730B49541
$$ plain form
10281 -99151 -99621 7071 10324 -173927 -43864 38751 57368 61215 -24214 149925 133664 -127402
10268 -344910 15600 128501 101707 161810 -93461 202348 149181 -55619 49780 271594 -41145
10256 303378 313765 -57665 57268 153224 -515752 -21550 73600 -221309 -72822 -74586 -16985
10244 -86987 -86068 60020 238250 40367 21973 9638 -141885 -9761 -84200 113374 -117282 -170056
10232 -170056 -245858 -93405 25385 49155 -324328 -78152 -107029 -106272 61035 76591 -3757 173813
10219 -28892 146917 -277397 -303157 -295985 -169471 -247672 8419 -60717 237274 -139190 -75309
10208 -75309 -221233 14111 17055 -65635 28401 -96142 -219135 -175657 216359 220800 -161345
10196 196253 -123392 -220850 245052 69768 -144160 -133478 57621 4371 72047 -376949 -137300
$$ packed form
10281i9151m70G071L253a73927d3864C8751J8617L847b4214A49925j6261a27402
10268c44910A5600J12901k6794O0103i3461B02348n3167e5619D9780K21814d1145
10256C03378J0387e7665E7268R5956e15752b1550G3600b21309g2822j764a6985
10244h6987R19F0020J78230D0367j8394I638a41885i761p4439A13374a17282n2774
10232a70056p5802i3405B5385K3770c24328g8152k8877P57F1035J5556c757A73813
10219b8892A46917b77397k5760P172J26514p8201H419f0717B37274a39190O3881
10208g5309j45924A4111K944f5635B8401i6142j22993M3478B16359M441a61345
10196A96253a23392r7458B45052F9768a44160J0682E7621D371O7676c76949a37300
$$ plain form
10184 -315644 -211257 73717 109791 -279632 -159084 -139525 -111556 124978 -21091 -1356 -141898
10173 -141898 153249 -96038 -172378 12301 73166 -525217 -284134 -75260 -55336 135341 -237839
10161 -193300 -163217 -63492 -245332 -234524 127833 -160674 -223392 -13589 101777 -99985 -166950
10150 -166950 -219995 -29886 -232227 -11190 -216266 22159 -35086 320239 5583 -153317 -345252
10139 -345252 26861 -24637 132496 -213706 228607 133517 -373222 -274108 8220 -80433 -83196
10128 -83196 -187026 -65239 81307 1748 -22347 -346320 -273488 -131456 103902 -180367 146106
10116 -51873 198192 -162500 202571 -133702 69191 -4147 -90049 -405243 -75087 -68513 -32499
10104 650664 -209837 -139287 -227584 -351214 152463 91951 -199652 203393 55892 -1418 -59983
$$ packed form
10184c15644J04387G3717L6074b79632J20548J9559K7969A24978b1091a356j40542
10173a41898A53249i6038p6340A2301O0865e25217K41083g5260J9924A35341b37839
10161a93300L0083f3492j81840J0808A27833a60674o2718a3589A01777i9985o6965
10150a66950n3045b9886k02341a1190k05076B2159c5086C20239E583a53317j91935
10139c45252B6861b4637A32496b13706B28607r5090c73222R9114H220h0433k763
10128h3196j03830f5239H1307A748b2347l23973P2832a31456A03902a80367A46106
10116e1873A98192a62500B02571a33702F9191d147q5902l15194g5087O574c2499
10104F50664b09837P0550q8297j23630A52463o0512a99652B03393E5892a418n8565
$$ plain form
10093 -59983 -39966 -18456 -116202 -127096 -8343 163496 125673 -7220 40566 -83487 65744 -46185
10080 -164818 -165975 -29796 -49420 -64248 -50212 -140822 74465 117735 27628 -340808 16745
10068 -279043 10911 -116660 -72336 -157830 78148 -66646 -155543 64555 118988 71663 181411
10057 181411 78465 -368772 -3956 35660 -49271 -90135 42054 -46902 90134 -111893 -145567
10046 -145567 -73317 -151908 -51814 -231952 235256 -254899 12289 212640 -510023 -148421
10035 -72895 76986 -7973 64252 69240 -464199 -37533 -108117 154163 -136078 -38620 139078
10023 -116371 101406 -4898 53655 -278757 66377 -252295 55563 -220765 156036 388076
10013 388076 -5330 -46538 185352 97266 57901 -176975 258902 58521 238378 -25963 -98461
$$ packed form
10093e9983K0017a8456r7746j0894h343A63496l7823g220D0566h3487F5744d6185
10080a64818j157b9796j9624j4828J4036r0610G4465M3270B7628c40808A6745
10068b79043A0911a16660M4324q5494G8148f6646q8897F4555N4433m7325J09748
10057A81411G8465c68772c956C5660d9271m0864D2054d6902I0134a11893l3674
10046a45567P2250p8591e1814j80138B35256b54899A2289K00351e10023a48421
10035g2895G6986g973F4252M988d64199c7533p0584A54163a36078c8620A39078
10023a16371A01406d898E3655b78757F6377b52295E5563b20765A56036K32040
10013C88076e330m1208A85352q8086l9365a76975B58902E8521J79857b5963p2498
$$ plain form
10002 -98461 46308 147775 -51787 -161697 -82805 63987 285386 -154045 -50150 -55391 -102292
9991 -102292 -13143 103698 -135734 -224143 -219455 166873 270738 -313315 -58425 98006 63163
9980 63163 -10464 -234560 -23323 9583 144174 -246675 -14696 64529 -69930 -108643 91685
9968 -219856 -4902 -332673 -132336 -44385 364487 -137788 -125605 305285 38028 -263087 -215091
9957 -215091 -128015 -22118 177211 46153 106702 366227 -39024 47316 -59709 -224236 3021
9945 5451 102265 -130936 -118894 -103740 -246678 17227 -46705 -36968 -154442 192328 -221652
9933 -226468 -225953 -36834 279041 -228932 106249 -198362 -335930 44573 309626 -58989 55816
9921 167272 127004 -159524 -166928 215284 19524 -97722 -72674 -248455 -242185 -25038 153669
$$ packed form
10002i8461D6308J01467e1787j09910P8892F3987K21399a54045e0150n241m6901
9991a02292a3143A03698a35734q8409M688A66873J03865c13315e8425I8006l4843
9980F3163a0464k24096b3323I583J34591b46675a4696F4529f9930l8713I1685
9968b19856d902l27771a32336d4385C64487a37788J2183C05285C8028b63087M7996
9957b15091Q7076b2118A77211D6153O0549K59525c9024D7316e9709j64527C021
9945E451R6814a30936J2042J5154j42938A7227d6705R737j17474A92328b21652
9933b26468N15c6834B79041b28932A06249a98362j37568D4573K65053e8989E5816
9921A67272m0268a59524p404B15284A9524i7722K5048j75781O270b5038A53669
$$ plain form
9909 14788 197331 173983 -312487 60140 -71954 -228625 213603 -97647 -375286 63764 74053
9898 74053 247986 -98042 174752 -56595 43669 46549 2490 -113693 -350254 -324326 -58716
9886 -286194 -157978 218198 153472 38978 160295 -179042 4455 -219474 116733 -242653
9875 -69075 -44674 187305 -251391 -407575 -23034 -95637 -292610 -37866 -142612 -153545 -272395
9864 -272395 -45630 -242690 -350034 -87058 53713 63450 -293127 -503447 -346931 52644 268508
9853 268508 -362456 -114288 52232 120985 21541 -90511 -128256 196040 -91798 282780 -257049
9841 6565 -40126 125714 -30920 -449781 212300 -109850 -392182 38825 29449 161850 -356635
9829 54424 -229919 -20533 97044 -286279 -222408 -295072 -214255 182200 -98219 178458 -20451
$$ packed form
9909A4788J82543k3348c12487F0140g1954j56671B13603i7647k77639F3764J0289
9898G4053J73933i8042A74752e6595D3669K880B490a13693k36561K5928e8716
9886b86194J28216B18198o4726C8978J21317a79042D455b19474A16733b42653
9875f9075K4401A87305b51391j56184b3034p2603j96973c7866j04746j0933j18850
9864b72395d5630j97060j07344h7058E3713R737b93127k10320J56516E2644K15864
9853B68508c62456a14288E2232O8753B1541i0511l7745A96040i1798B82780b57049
9841F565d0126A25714c0920m18861B12300a09850k82332C8825r376J32401c56635
9829E4424b29919b0533I7044b86279O3871p2664Q0817A82200i8219A78458b0451
$$ plain form
9817 -68400 180495 -65382 18878 -152027 248653 -329027 -255018 -27962 -244949 -9504 -119272
9806 -119272 -338787 -145042 -145914 -106228 -56311 454743 240365 430975 -22369 353014 111127
9794 -153940 -239102 -34814 -65377 145184 -265393 -13058 -30609 -285880 -77499 -88951 170950
9782 147210 -151910 202935 60793 42623 -1192 62452 -10712 -23670 -61564 95563 -18713
9770 75243 244832 131335 -189705 -138879 171208 117840 78894 -591 177621 75772 -121834
9758 161600 76322 -133247 -179933 -407180 -189 -87887 -196309 21408 -118002 -475458 -28246
9746 -298234 -46526 92847 -32163 -40528 -20707 -149747 -90424 -294387 -77284 -1323 -158260
9735 -158260 211168 -122594 -172818 -50537 112016 -121850 -208930 122255 -258037 94125
$$ packed form
9817f8400A80495f5382A8878a52027B48653c29027P4009b7962k16987i504j09768
9806a19272k19515a45042q72L9686M9917D54743k14378J90610b2369C53014A11127
9794a53940q5162c4814l0563A45184b65393a3058j7551k55271g7499j1452A70950
9782A47210a51910B02935F0793j8170a192F2452a0712j2958l7894I5563a8713
9770G5243J69589j13497a89705N0826A71208n3368l8946e91A77621G5772a21834
9758A61600G6322a33247m6686k27247a89q7698j08422B1408a18002l57456b8246
9746b98234d6526I2847c2163q365J9821j29040N9323k03963g7284a323j56937
9735a58260B11168a22594n0224e0537A12016a21850q7080A22255b58037I4125
$$ plain form
9724 9492 222968 -104177 87046 -60841 -277522 -35296 -178682 -74745 228810 -157103 -333535
9713 -333535 -239459 217601 -213043 46253 -317904 -392625 -431421 -75458 -221036 160430 -156800
9701 241557 -152182 -70077 -91479 -289246 -98151 -27437 -106260 119253 180132 -62182 -91893
9690 -91893 -155083 -87745 111038 -40848 -17765 120833 -53251 -91381 -245898 54684 -231202
9678 -196600 163497 -134554 -243366 48889 -145299 -436771 -100583 -453256 -47675 30166
9667 -203820 -133079 -22046 -39649 -77313 -131072 -225465 -53064 -86101 358992 230861 -190317
9655 14564 -225083 -140711 -440186 29305 -40304 -207069 68847 -14148 -5597 -303796 -245608
9644 -245608 -58255 105686 -95496 -22494 -22312 -215180 200831 173069 4502 41049 -70616 6783
$$ packed form
9724I492K13476a04177H7046f0841k16681c5296j43386g4745B28810a57103j76432
9713c33535R4076B17601b13043D6253c17904p4721l8796g5458j45578A60430a56800
9701B41557a52182g0077k1402j97767i8151b7437p8823A19253O0879f2182k9711
9690i1893o3190O7338A11038d0848a7765A20833e3251l8130j54517E4684b31202
9678a96600A63497a34554j08812D8889a45299k91472a00583l52673d7675C0166
9667b03820P0741b2046j7603l7664n3759r4393e3064l3037C58992j28131a90317
9655A4564b25083Q4372k99475B9305d0304j66765F8847a4148e597k98199N8188
9644b45608e8255A05686i5496b2494J82j92868B00831k7762D502L6547g0616F783
$$ plain form
9631 191225 119157 3828 -139314 -104871 151571 -155083 -178587 10107 84646 136180 44832
9619 46196 84555 66039 -288980 92155 -94489 -110399 274205 -175269 43169 -50861 -201562
9608 -201562 115064 -8136 279209 147291 43667 70909 -273476 -100063 52811 152198 42997
9596 35695 4558 -112562 222999 -117151 159860 -77839 -36561 -140873 111102 -121930 -67524
9585 -67524 -189809 -286994 -117910 -206645 273741 -177365 -240836 -31473 -299647 72892 168294
9574 168294 -224085 304244 159758 -91355 -43136 -218251 47975 -70848 -9168 -37392 -14700
9562 -34490 -21257 -148404 -170221 -24224 -124962 -298648 64073 -410690 68727 39674 12909
9550 37333 -342971 158551 -220286 -365460 31517 -25758 -74582 -270937 -30582 164023 172894
$$ packed form
9631A91225p2068C828a39314L4443A51571a55083k3504A0107P4539N1534D4832
9619D6196L8359j8516b88980I2155i4489j5910B74205a75269D3169e0861j50701
9608b01562A15064h136B79209j31918D3667K7242b73476a00063E2811R9387D2997
9596C5695D558a12562B22999a17151A59860g7839c6561j04312A11102a21930N4406
9585f7524j22285r7185a17910q8735B73741a77365o3471c1473k68174G2892R5402
9574A68294b24085C04244j44486i1355d3136j75115D7975g0848i168k8224a4700
9562c4490J3233j27147k1817b4224j00738j73686F4073d10690F8727k9053A2909
9550C7333c42971A58551b20286j45174C1517b5758m8824j96355c0582A64023Q871
$$ plain form
9539 172894 133901 -170723 15055 -126042 113139 162228 128428 -120690 30927 -29574 -232349
9528 -232349 -76969 -116099 -255582 -67062 -144396 -244406 261588 -224809 54408 270588 -59573
9516 -64166 247883 -245711 -310884 -52669 31115 9908 -352181 202152 -237539 -69653 -77513
9505 -77513 -23551 1654 26198 -262531 -82137 21802 -361447 -290385 -27743 19256 229989
9494 229989 -226720 -393269 -92011 -49297 -126619 763 38323 -218120 228217 288288 221440
9483 221440 48846 70070 -95797 -101834 82964 94436 -126463 -98624 31592 -338476 -416273
9472 -416273 90874 138349 -221441 -272825 -146228 -290117 134023 -189023 -30986 150047
9461 25803 107144 46070 180479 -20997 231936 -34961 -176131 -201468 -28550 -232699 418096
$$ packed form
9539A72894l8993a70723A5055a26042A13139M9089l3800a20690C0927b9574k02775
9528b32349g6969l9130j39483f7062p7334j00010B61588b24809E4408K16180e9573
9516f4166B47883b45711o5173e2669C1115I908c52181B02152b37539f9653p860
9505g7513b3551A654K4544b62531h2137B1802c61447P1062b7743A9256K10733
9494B29989b26720j66549i2011M2714p7322G63L7560b18120B28217O0071o6848
9483B21440D8846K1224i5797o037H2964J1472a26463K7839C1592c38476p7797
9472d16273I0874M7475b21441n1384J26597j43889A34023a89023c0986A50047
9461B5803Q1341D6070J34409b0997B31936c4961j41170k5337b8550k04149D18096
$$ plain form
9449 101319 188988 -106268 -124872 -343104 -237400 -22711 -103383 -430783 272319 -247596
9438 -163290 -288790 -261533 66819 -86688 14385 13703 -11909 -39660 157351 -336136 -636802
9427 -636802 -133964 -84779 -124660 -141679 -54196 23481 -199655 75832 88166 -234345 446330
9415 70711 6215 -197481 64962 -178254 -19828 -161007 -81882 -74633 -64061 -223938 -315391
9404 -315391 181607 9072 -126144 -141371 -151800 -14986 -147832 -197507 -393163 -37672 -213293
9393 -213293 -108659 -1664 -111340 41554 -266398 -80262 -80774 175550 19777 63730 -26930
9381 -74271 303003 55784 -161277 25130 32229 122126 -96116 -330130 -22215 -74515 94607
9369 -294945 -250918 -141418 131467 -321246 156339 -111481 -86281 -140306 -167613 179655
$$ packed form
9449A01319Q7669a06268j8604k18232J05704b2711q0672l27400B72319b47596
9438a63290j25500K7257F6819h6688A4385o82a1909k7751A57351c36136l00666
9427f36802a33964M9185l9881j7019e4196B3481a99655G5832J2334b34345D46330
9415G0711F215a97481F4962a78254a9828j41179P9125P249J0572j59877r1453
9404c15391A81607I072a26144j5227j0429a4986j32846m9675j95656c7672j75621
9393b13293J04634a664j09676D1554b66398h0262n12A75550A9777M3953b6930
9381g4271C03003E5784a61277B5130P099Q9897i6116k34014b2215n2300I4607
9369b94945M4027J09500A31467c21246A56339a11481K5200n4025k7307A79655
$$ plain form
9358 -117328 -235109 39145 263380 -30019 -421765 -38993 -220636 -463404 -260170 -24629
9347 -192980 -272177 -5168 -207227 113361 25613 98963 -233280 -145719 -237182 -289081 -114415
9335 -174470 -80281 35445 374967 46115 -308120 -96324 -208013 62538 -156234 -174292 77498
9323 -84453 -298673 -213880 78054 -205839 176084 -62411 273076 -370982 -69889 -284981 -46597
9311 -142029 -149402 122667 -107037 -220196 50761 -156621 -210469 -107760 -22339 -269188 -165056
9300 -165056 -25390 28048 110925 2393 -131435 53568 -76088 233962 -467923 -260595 72438
9288 -364660 -200132 -181842 172522 -190995 -106038 139948 -62211 -61150 -251976 68896 38079
9277 38079 165765 -202736 -28410 -53482 -4060 62207 94562 -51227 -156445 -69468 -24375
$$ packed form
9358a17328j17781C9145K24235c0019l91746c8993j81643k42768K03234b4629
9347a92980p9197e168k02059A13361B5613P3350b33280Q7561r1463n1899a14415
9335a74470h0281C5445L39522D6115c08120i6324j11689F2538a56234j8058G7498
9323h4453k14220Q4793G8054b05839A76084f2411B73076c70982f9889k15092d6597
9311a42029p373A22667a07037j13159E0761a56621n3848J02709b2339k46849J04132
9300a65056b5390B8048Q2877B393a31435E3568g6088B33962d67923K07328G2438
9288c64660J64528J8290A72522a90995Q4957A39948f2211J061j90826F8896l0817
9277C8079J27686b02736b8410k5072d060F2207L2355e1227j05218f9468b4375
$$ plain form
9265 -59466 -137593 198299 -262732 -10308 -8336 -455068 161953 -110880 -249944 22413 99841
9254 99841 197263 92894 129961 -45378 12495 -46801 59734 -191932 -94822 54562 44386 -190866
9241 -38099 -7777 230845 -189315 76630 -150332 -90987 -26096 -286714 53184 -190016 -86495
9229 -81529 259757 -359685 -121212 53018 -190651 22038 -161044 -28189 118159 -244870
9218 -19575 -149844 84918 -22843 -137807 135996 -181087 212766 -12315 -17029 -189030 -218883
9207 -218883 234400 -65046 22717 353389 -103845 45515 -112167 153154 51496 -60327 234914
9195 -47292 103178 -220757 263598 -219390 141756 -405377 -137061 16987 19222 -90379 -102420
9184 -102420 -80608 -164448 -181422 -507428 -303747 -48869 -158187 113972 88586 -256825 -30526
$$ packed form
9265e9466p8127A98299b62732a0308J972m46732A61953a10880j39064B2413P7428
9254I9841R7422I2894L7067d5378A2495d6801E9734a91932i4822E4562j0176a90866
9241c8099g777B30845a89315G6630a50332N9345b6096k60618E3184a90016h6495
9229h1529B59757c59685a21212E3018a90651B2038a61044b8189A18159b44870
9218a9575j30269H4918b2843j14964A35996a81087B12766a2315m714j72001k9853
9207b18883B34400f5046B2717L30672a03845D5515a12167A53154E1496f0327B34914
9195d7292A03178b20757B63598b19390A41756d05377a37061A6987K235i0379j2041
9184a02420K1812q3840j6974l26006K03681d8869j09318A13972k5386b56825c0526
$$ plain form
9172 -316654 -207179 216824 -99337 30141 -303700 6213 -186056 301101 -113665 28687 -196458
9160 -151539 -305258 139227 -87748 -169263 -254380 65271 -8376 164719 269708 124559 36729
9148 8598 10 54125 33771 -144120 -161431 -51537 -25346 -136654 -99952 -261006 -30206 -334016
9136 -334016 -207460 151396 -22224 -91896 103169 -225197 31030 -71081 26450 -139875 105332
9124 -30798 86784 -63755 -67554 92156 -58179 184852 298591 -205244 -110962 182090 -195130
9112 154268 61488 1272 92888 -2004 -111620 69406 -242821 -11395 -33039 26426 -52543 -74221
9100 -74221 29699 -93863 215055 19912 -153283 101861 -23648 -196284 -221295 181043 -74686
9088 -188342 -47859 5735 -138490 -94814 76904 168277 -66598 103437 2035 9313 -78060 -88151
$$ packed form
9172c16654J09475B16824i9337C0141c03700F213a86056C01101a13665B8687a96458
9160a51539j53719A39227h7748q1515q5117F5271h376A64719J04989A24559C6729
9148H598A0N4115k0354a44120j7311e1537b5346j11308L6702j61054c0206l03810
9136c34016J26556A51396b2224o9672A03169b25197C1030g1081B6450a39875A05332
9124c0798H6784f3755l799I2156e8179A84852J13739b05244R4282A82090a95130
9112A54268F1488A272R1616b004j09616F9406b42821a1395k1644B6426e2543k1678
9100g4221B9699i3863B15055A9912a53283A01861b3648j72636k5011A81043g4686
9088a88342d7859E735a38490M3676G6904R1373f6598A03437B035P278g8060j0091
$$ plain form
9076 -88151 -79749 -175858 -62634 32606 -153766 287772 -122361 -147983 -65219 90685 135930
9065 135930 -202445 145813 -362617 47097 -88694 -80092 -63928 -11786 91265 -72214 -65576
9054 -65576 -309305 124134 -339862 -45325 66244 -51494 37364 -102743 78803 -36842 -301815
9043 -301815 116261 126498 68113 135259 -4519 1037 -31130 -2269 -57047 115822 -314746 20763
9030 -395711 116034 84079 -138967 -400926 164881 -122416 40076 2408 -143833 -125681 119463
9018 206095 -23194 47655 29517 -180211 -42283 253396 -27767 84654 -185936 -533 -87632
9007 -87632 237740 -244864 -72100 10730 -50665 -134545 54162 -13171 181343 220764 -66159
8995 -120716 -158424 -117254 139903 -199816 158341 -265608 129270 -138385 -18869 -171942
$$ packed form
9076h8151Q402r6109f2634C2606a53766B87772a22361k5622f5219I0685M5245
9065A35930b02445A45813c62617D7097h8694Q602J6164a1786I1265g2214O638
9054f5576k43729A24134c39862d5325F6244e1494C7364a02743G8803c6842k64973
9043c01815A16261J0237n8385O7146d519A037c1130b269n4778A15822c14746B0763
9030c95711A16034l1955a38967k61959A64881a22416D0076B408a43833J8152A19463
9018B06095b3194D7655j8138a80211d2283B53396b7767H4654a85936e33q7099
9007h7632B37740b44864g2100A0730e0665q3880E4162a3171A81343L9421f6159
8995a20716l7708M1170A39903a99816A58341b65608A29270a38385a8869j53073
$$ plain form
8985 -171942 -32369 301955 45663 -344098 -144161 -351416 149665 -67662 -560377 -143075
8974 -376005 99208 -245425 317622 -132488 -130145 -675 -154001 69984 -60643 -162966 -42593
8962 -127157 65732 149233 -199112 -221745 -105448 -195170 -22628 27619 -52977 -97292 -13372
8950 -296457 250137 -152985 -252043 20598 -126055 -174555 386584 29002 342408 10929 123054
8939 123054 298752 15986 -230939 -326616 -185358 172450 363636 -45663 22527 39935 -58610
8927 -82277 -32915 11843 447017 -91535 1364680 4678078 10897465 7870635 4210052 2330654
8917 2330654 1545053 1282372 402212 523475 22878 42382 102442 89010 -244597 -181187
8907 -181187 282655 397225 25296 63573 -88901 39983 299016 -120907 -29070 29407 -301094
$$ packed form
8985a71942c2369C01955D5663c44098a44161k07255A49665f7662m92715a43075
8974c76005I9208b45425C17622a32488K343f75j53326F9984f0643j02323d2593
8962a27157F5732Q3501a99112k2633a05448q9722b2628B7619e2977m4315a3372
8950b96457B50137a52985r9058B0598a26055m8500C86584B9002L13406A0929J12125
8939A23054J75698A5986b30939r5677J41258A72450J91186d5663B2527J7408e8610
8927h2277c2915A1843M35174i1535A364680L313398O219387l026830l660583j879398
8917B330654p85601k62681D02212J21263B2878J9504O0060j3432b44597O3410
8907a81187B82655J14570B5296L8277h8901C9983K59033a20907b9070B9407c01094
$$ plain form
8895 -393771 -35640 -118177 -337398 6762 2944 77984 -58754 -27041 190966 -30975 -55556 288357
8882 -135248 -35027 32972 -129110 -100998 -285172 -114735 -80270 44654 -23157 100475 103423
8871 103423 -143443 60459 -71247 60485 -175521 -134046 -215500 -129390 60755 -389532 175365
8859 -124255 -114928 44931 -37104 -96364 -200944 -123950 -269413 -34761 -245602 -120503 -178061
8848 -178061 167674 -47525 38761 -42114 -746 -47386 130528 -131034 -55606 -124596 -107536
$$ packed form
8895c93771c5640q2537k19221F762B944P5040e8754b7041A90966c0975k4581B88357
8882a35248c5027C2972a29110K8112j84174a14735L4465D4654b3157A00475K948
8871A03423a43443F0459g1247F0485a75521M1475q1454Q6110F0755c89532A75365
8859a24255R327D4931c7104n9260j04580P6994j45463c4761k10841a20503n7558
8848a78061A67674d7525C8761d2114g46m6640A30528a31034e5606o8990J7060
$$ [...]
##END NTUPLES=NMR SPECTRUM
##END=
