##TITLE=NES1066_159122.0006_002_9705126_dtTAlxomYf
##JCAMPDX= 6.0         $$ Bruker NMR JCAMP-DX V2.0
##DATA TYPE= NMR SPECTRUM
##DATA CLASS= NTUPLES
##ORIGIN= BRUKER
##OWNER= Administrator
$$ 1.72 TOPSPIN		Version 2.1
$$ 2016-04-30 20:40:26.458 -0700  Administrator@X
$$ Compression mode = diff/dup
##.OBSERVE FREQUENCY= 400.02188249412
##.OBSERVE NUCLEUS= ^1H
##.ACQUISITION MODE= SIMULTANEOUS (DQD)
##.ACQUISITION SCHEME= undefined
##.AVERAGES= 8
##.DIGITISER RES= 22
##SPECTROMETER/DATA SYSTEM= spect
##.PULSE SEQUENCE= zg30
##.SOLVENT NAME= COFFEE_meoh
##.SHIFT REFERENCE= INTERNAL, COFFEE_meoh, 1, 14.98509
##AUDIT TRAIL= $$ (NUMBER, WHEN, WHO, WHERE, PROCESS, VERSION, WHAT)
$$ ##TITLE= Audit trail, TOPSPIN		Version 2.1
$$ ##JCAMPDX= 5.01
$$ ##ORIGIN= Bruker BioSpin GmbH
$$ ##OWNER= Administrator
$$ $$ E:\/data/COFFEE/nmr/NES1066_159122.0006_002_9705126_dtTAlxomYf/20/pdata/1/auditp.txt
$$ ##AUDIT TRAIL=  $$ (NUMBER, WHEN, WHO, WHERE, PROCESS, VERSION, WHAT)
(   1,<2016-04-30 20:40:19.333 -0700>,<Administrator>,<X>,<go>,<TOPSPIN 2.1>,
      <created by zg
	started at 2016-04-30 20:39:13.364 -0700,
	POWCHK enabled, PULCHK disabled,
       configuration hash MD5:
       21 0F 79 D6 B3 7B B4 F6 88 20 88 DB 03 48 BD 9F
       data hash MD5: 64K
       2E 5A 38 A2 E1 BC D3 F1 2C 5E 0E D9 23 B3 20 E0>)
(   2,<2016-04-30 20:40:22.427 -0700>,<Administrator>,<X>,<proc1d>,<TOPSPIN 2.1>,
      <Start of raw data processing
       efp LB = 0 FT_mod = 6 PKNL = 1 PHC0 = 0 PHC1 = 0 SI = 32K 
       data hash MD5: 32K
       A2 84 66 F6 06 1A 23 D7 EC 86 D1 3A 78 30 60 8E>)
(   3,<2016-04-30 20:40:22.708 -0700>,<Administrator>,<X>,<proc1d>,<TOPSPIN 2.1>,
      <pk PHC0 = 92.29614 PHC1 = 0 
       data hash MD5: 32K
       1F D9 DE 27 36 BF 68 D7 58 42 A7 AD 5B A1 F5 96>)
(   4,<2016-04-30 20:40:22.833 -0700>,<Administrator>,<X>,<proc1d>,<TOPSPIN 2.1>,
      <abs ABSG = 1 
       data hash MD5: 32K
       02 5A 8F AE 0E 4B 7D 0D 76 41 46 36 B8 77 F4 16>)
(   5,<2016-04-30 20:40:22.896 -0700>,<Administrator>,<X>,<proc1d>,<TOPSPIN 2.1>,
      <abs ABSG = 2 
       data hash MD5: 32K
       4F BE 5C C9 44 9B D0 6D 65 B3 99 E6 79 D6 3B 7E>)
(   6,<2016-04-30 20:40:22.958 -0700>,<Administrator>,<X>,<proc1d>,<TOPSPIN 2.1>,
      <abs ABSG = 3 
       data hash MD5: 32K
       58 48 E3 37 7E EA 74 1E AC B9 9D 3C E0 0C 10 5D>)
(   7,<2016-04-30 20:40:23.021 -0700>,<Administrator>,<X>,<proc1d>,<TOPSPIN 2.1>,
      <abs ABSG = 4 
       data hash MD5: 32K
       B6 E7 CE F2 94 69 38 A4 59 0F B0 A2 C1 35 AC 2C>)
(   8,<2016-04-30 20:40:23.067 -0700>,<Administrator>,<X>,<proc1d>,<TOPSPIN 2.1>,
      <abs ABSG = 5 
       data hash MD5: 32K
       C2 D3 32 4E 73 12 8B 2D 6B 79 53 1D 15 3F 13 80>)
$$ ##END=
$$ 
$$ $$ hash MD5
$$ $$ 71 EF B3 22 24 84 E4 E7 7D F7 A0 A2 84 45 B9 CD
##$RELAX= 
##$RELAX= 
##$RELAX= 
##$RELAX= 
##$RELAX= 
##$RELAX= 
##$RELAX= 
$$ Bruker specific parameters
$$ --------------------------
##$DU= <E:\>
##$EXPNO= 20
$$ [...]
##$TP= (0..7)
150 150 150 150 150 150 150 150
##$TP07= 0
##$TPNAME0= <>
##$TPNAME1= <>
##$TPNAME2= <>
##$TPNAME3= <>
##$TPNAME4= <>
##$TPNAME5= <>
##$TPNAME6= <>
##$TPNAME7= <>
##$TPOAL= (0..7)
0.5 0.5 0.5 0.5 0.5 0.5 0.5 0.5
##$TPOFFS= (0..7)
0 0 0 0 0 0 0 0
##$TUNHIN= 0
##$TUNHOUT= 0
##$TUNXOUT= 0
##$USERA1= <user>
##$USERA2= <user>
##$USERA3= <user>
##$USERA4= <user>
##$USERA5= <user>
##$V9= 5
##$VALIST= <valist>
##$VCLIST= <CCCCCCCCCCCCCCC>
##$VD= 0
##$VDLIST= <DDDDDDDDDDDDDDD>
##$VPLIST= <PPPPPPPPPPPPPPP>
##$VTLIST= <TTTTTTTTTTTTTTT>
##$WBST= 2048
##$WBSW= 25
##$XGAIN= (0..3)
0 0 0 0
##$XL= 0
##$YL= 0
##$YMAX_a= 612847
##$YMIN_a= -517358
##$ZGOPTNS= <>
##$ZL1= 120
##$ZL2= 120
##$ZL3= 120
##$ZL4= 120
##$ABSF1= 14.98509
##$ABSF2= -5.573092
##$ABSG= 5
##$ABSL= 3
##$ALPHA= 0
##$AQORDER= 0
##$ASSFAC= 0
##$ASSFACI= 0
##$ASSFACX= 0
##$ASSWID= 0
##$AUNMP= <proc_prof1d_extract_pilot.lims>
##$AXLEFT= 0
##$AXNAME= <>
##$AXNUC= <1H>
##$AXRIGHT= 0
##$AXTYPE= 0
##$AXUNIT= <>
##$AZFE= 0.1
##$AZFW= 0.1
##$BCFW= 0
##$BC_mod= 0
##$BYTORDP= 0
##$COROFFS= 0
##$CY= 15
##$DATMOD= 1
##$DC= 0
##$DFILT= <>
##$DTYPP= 0
##$F1P= 0
##$F2P= 0
##$FCOR= 0.5
##$FTSIZE= 32768
##$FT_mod= 6
##$GAMMA= 0
##$GB= 0
##$INTBC= 1
##$INTSCL= 1
##$ISEN= 128
##$LB= 0
##$LEV0= 0
##$LPBIN= 0
##$MAXI= 10000
##$MC2= 0
##$MEAN= 0
##$ME_mod= 0
##$MI= 0
##$NCOEF= 0
##$NC_proc= -8
##$NLEV= 6
##$NOISF1= 0
##$NOISF2= 0
##$NSP= 0
##$NTH_PI= 0
##$NZP= 0
##$OFFSET= 14.98509
##$PC= 1
##$PHC0= 92.29614
##$PHC1= 0
##$PH_mod= 1
##$PKNL= yes
##$PPARMOD= 0
##$PPDIAG= 0
##$PPIPTYP= 0
##$PPMPNUM= 2147483647
##$PPRESOL= 1
##$PSCAL= 4
##$PSIGN= 0
##$PYNMP= <proc.py>
##$REVERSE= no
##$SF= 400.02
##$SI= 32768
##$SIGF1= 0
##$SIGF2= 0
##$SINO= 400
##$SIOLD= 32768
##$SPECTYP= <>
##$SREGLST= <1H.CDCl3>
##$SSB= 0
##$STSI= 32768
##$STSR= 0
##$SW_p= 8223.68421052631
##$SYMM= 0
##$S_DEV= 0
##$TDeff= 65536
##$TDoff= 0
##$TI= <>
##$TILT= no
##$TM1= 0
##$TM2= 0
##$TOPLEV= 0
##$USERP1= <user>
##$USERP2= <user>
##$USERP3= <user>
##$USERP4= <user>
##$USERP5= <user>
##$WDW= 1
##$XDIM= 32768
##$YMAX_p= 434948563
##$YMIN_p= -682464
##$CURPLOT= <Network HP LaserJet P1505>
##$CURPRIN= <$Network HP LaserJet P1505>
##$DFORMAT= <normdp>
##$LAYOUT= <+/1D_H.xwp>
##$LFORMAT= <normlp>
##$PFORMAT= <normpl>
##$SURQMSG= 1
$$ End of Bruker specific parameters
$$ ---------------------------------
##NTUPLES= NMR SPECTRUM
##VAR_NAME=  FREQUENCY,     SPECTRUM/REAL,   SPECTRUM/IMAG
##SYMBOL=    X,             R,               I
##VAR_TYPE=  INDEPENDENT,   DEPENDENT,       DEPENDENT
##VAR_FORM=  AFFN,          ASDF,            ASDF
##VAR_DIM=   32768,         32768,           32768
##UNITS=     HZ,            ARBITRARY UNITS, ARBITRARY UNITS
##FACTOR=    0.250966925370066, 1,           1
##FIRST=     8223.43324360094, -193721,      -77790
##LAST=      0,             9361,            71781
##MIN=       0,             -682464,         0
##MAX=       8223.43324360094, 434948563,    0
$$ Real data points
##PAGE= N=1
##DATA TABLE= (X++(R..R)), XYDATA
$$ [...]
19538F4775h1412j56447K6086E0653a31971n413a8909B89455b17999k5052C82459
19526b66674B43755D3628a13139b9243A37858h9617j29482j6978P1229F9571a27185
19514a50108b1991A57481K5316B7181l637c8119L563H4292J36840a41882G2071
19502b12244g0533L3992F37c02229a3386C26664g7014l28301B5119h3722o9410
19491a53132A01230f5285m8359N505A55424b87573D38943h2527c0122A13276a53837
19479a29313d1279j55930O4409F2335a6082k4365I2276c55623j7265H2592b07867
19467a18606F767J24338a9031i97l34018a09438A0433f9044j55905l4172H6292
19455H6254b42494d4733A65794L067a26037B48183b60769a15181m2792A90490
$$ y = [64775, -81412, -237859, -211773, 50653, -131971, -137384, -18909, 289455, -217999, -243051, 382459, -266674, 243755, 43628, -113139, -29243, 137858, -89617, -219099, -236077, -164848, 69571, -127185, -150108, -21991, 157481, 182797, 27181, 23544, -38119, -34556, 84292, 221132, -141882, 72071, -212244, -70533, -36541, 637, -302229, -13386, 326664, -77014, -405315, 25119, -83722, -153132, 101230, -65285, -113644, -108139, 155424, -287573, 438943, -82527, -30122, 113276, -153837, -129313, -41279, -197209, -132800, 62335, -16082, -40447, 92276, -355623, -372888, 82592, -207867, -118606, 6767, 131105, -19031, -997, -335015, -109438, 10433, -69044, -224949, -259121, 86292, 86254, -242494, -44733, 165794, 168861, -126037, 248183, -260769, -115181, -157973, 190490]
19444g9506j81177M4832A58575a72658D7021j1919K3540c40204H7126J95134e1347
19432a19241J9193b5499m85260b09062B67365j27152a77327B56302a56429I4802
19421c25119g6167m4552c46A22128a34090j4974E3720a62745j56276d2402A72168
19409a86561j16962J23053P3177N0217k35486Q0392N1631a1160k37407b2883A37711
19397b26626k40413a93050H0365g306k89459b5175A21059A1028a38582A74805
19386B00039a99350O6623N7946j42966J0896L2963D2131c20023B8073b8374A72799
19374A87095G6335o109i6936m5155j16967aB29037b97789i3844J8681k21121A55437
19361G6883a35926A89914D4820L2442J03894n5561j5436a5209A60785a07666K3858
$$ y = [-79506, -260683, -215851, 158575, -172658, 47021, 35102, 58642, -340204, 87126, 282260, -51347, -119241, -100048, -25499, -510759, -209062, 267365, 140213, -177327, 256302, -156429, 94802, -325119, -76167, -120719, -346, 122128, -134090, -149064, 53720, -162745, -319021, -42402, 172168, -186561, -303523, -180470, -107293, -57076, -292562, -212170, -160539, -11160, -248567, -22883, 137711, -226626, -467039, -193050, 80365, -7306, -296765, -25175, 121059, 11028, -138582, 174805, 200039, -199350, -132727, -74781, -217747, -206851, -173888, 42131, -320023, 28073, -28374, 172799, 187095, 76335, 70226, -96936, -142091, -259058, -1, 229037, -297789, -93844, -75163, -296284, 155437, 76883, -135926, 189914, 44820, 77262, 181156, 125595, 110159, -15209, 160785, -107666, -83808]
19350h3808j16628K6173r2638r836J20161j82858A10557b29790p1862a3168o5878
19339g9046r6304B15997j00716J01669D0334O275e1143k15874B2198J19725c62630
19327c03625A17121e3780D1364J28906d9286l65088a96728R0675B28272b97470
19316E2535K6028i3982A18082J55181A04216a01866K1754k9079d1596G4351c02537
19304a14428G3003a23107k1699l6885C51522I5906N1946K0592E4024i8821B77691
19292H3170D0810i0400R202k11985C15264j23301I5157a77190E9084K13818b79381
19280B8950e2940j41954j3766A232e4162A22797d21179A5009b03834B29763a99474
19268A02950a92268G5182C6578Q983g133j51196r3032O3259B62947a59507J1146
$$ y = [-83808, -200436, -174263, -266901, -276737, -156576, -339434, 110557, -229790, -301652, -13168, -79046, -175350, 215997, 115281, 216950, 40334, 46609, -51143, -267017, 22198, 141923, -362630, -303625, 117121, -53780, 41364, 170270, -49286, -414374, -196728, -106053, 228272, -297470, 52535, 78563, -93982, 118082, 273263, 104216, -101866, -80112, -109191, -41596, 74351, -302537, -114428, 73003, -123107, -144806, -181691, 351522, 95906, 147852, 168444, 54024, -98821, 277691, 83170, 40810, -90400, -81198, -293183, 315264, 191963, 95157, -177190, 59084, 272902, -279381, 28950, -52940, -194894, -208660, 1232, -54162, 122797, -421179, 15009, -203834, 229763, -199474, 102950, -192268, 75182, 36578, 45561, -7133, -158329, -251361, -188102, 262947, -159507, -148361]
19257a48361g1270D9208N9996b66136B4620f52741B7477g3859A8284f7739j27803
19246a95542N9699C3446A2838C159a73925L6928n5543e4010k71250B69851i7784
19234h373A07157b81317G9613c4493B17185d51558d6370j30787I2385b41424M0511
19223b00913O4098C4772d32361C0735h9120B0697K50088H8175a80064H8152a07539
19211A84096p3507q864a59965C2721a97220h5263J568n2968A34461a53841a5515
19199h1178j82685A57300b72542I553a88448g7821G9563a71739d8933j89782O3187
19188a75528Q1227j31439A86579Q0469a8864k23765B6924a18238l31329a17519
19177A78853c2212n3012B3604a88086C341a10544j50416A22586i0362a3744o0792
$$ y = [-148361, -71270, 49208, 109204, -266136, 24620, -652741, 27477, -73859, 18284, -67739, -195542, -135843, 33446, 12838, 3159, -173925, -136997, -192540, -54010, -325260, 269851, -97784, -8373, 107157, -281317, 79613, -34493, 217185, -451558, -46370, -177157, 92385, -241424, -200913, -136815, 34772, -432361, 30735, -89120, 20697, 270785, 88175, -180064, 88152, -107539, 184096, 110589, 101725, -159965, 32721, -197220, -85263, -83695, -136663, 134461, -153841, -15515, -81178, -263863, 157300, -272542, 9553, -188448, -77821, 79563, -171739, -48933, -238715, -175528, -94301, -225740, 186579, 267048, -18864, -242629, 26924, -118238, -449567, -117519, 178853, -32212, -85224, 23604, -188086, 3341, -110544, -260960, 122586, -90362, -13744, -74536]
19166g4536C8053e2375n9381m2710A30647j6045a41571n0973A42767F6219b06221
19154a07023G6804b47203O3445c5295n02399J24108b1240k84775E7936a61612
19143A24357c8937k2926A35387J56393i0888A53893d3426d37I7471R8179a91235
19131A6485h9312k88216E8830b19503i1530p1272q7824A19664b72187j07276H9493
19119E4256a32020b565r5587B80816I789J65485a76842A57043J1201f8497A52363
19107c14871J30373I7465a4984j33322j18494G2416a05229G265J26644b01074
19096H9182c50843D1693M2947a19988C0404f9888B2556L86914c9546H2750J21362
19085B04112C055L4464J48171e4652f166B29834A11385n0693k4654K0362h9201
$$ y = [-74536, 38053, -52375, -111756, -154466, 130647, 114602, -141571, -192544, 142767, 66219, -206221, -107023, 76804, -247203, -183758, -35295, -537694, -413586, -21240, -306015, 57936, -161612, 124357, -38937, -61863, 135387, 291780, -90888, 153893, -43426, -437, 97471, 195650, -191235, 16485, -89312, -377528, 58830, -219503, -91530, -162802, -250626, 119664, -272187, -379463, 89493, 54256, -132020, -2565, -98152, 280816, 9789, 175274, -176842, 157043, 168244, -68497, 152363, -314871, -184498, 97465, -14984, -148306, -266800, 72416, -105229, 7265, 133909, -201074, 89182, -350843, 41693, 84640, -119988, 30404, -69888, 22556, 409470, -39546, 82750, 204112, 3055, 37519, 185690, -54652, -6166, 229834, 111385, 60692, 36038, 56400, -89201]
19073a12726H0669a938q4963I5181N8839b51243I9620b64469E1503J003a16472
19061D0457a65568G4598N8418A9574a01344C1544J13862E3022f2697j13092a5293
19049c6713l8103B9205g2027c017A18341j1721b21697J03081r8947Q1134h38j32647
19037a33485B73033C1183e33169a80338C2195K8228K62368j60993c690j62389
19027a66079F3609a22862j31503A69514i653B8763a34433l9489m9251P2475A16807
19015a85740k9348j92358e4882p4102A11961d091p7094E994K49776j08424a31159
19003b46115a06428j97722C28538q1098j18046g6408l70627G4093e1210l8205
18993h9415C17151a88987A41162o142b18621C77669j51992F2580N6661b37045
$$ y = [-112726, 80669, -1938, -86901, 95181, 154020, -251243, 99620, -264469, 51503, 52506, -116472, 40457, -165568, 74598, 133016, 19574, -101344, 31544, 145406, 53022, -62697, -175789, -15293, -36713, -74816, 29205, -72027, -3017, 118341, 106620, -221697, -118616, -217563, -136429, -838, -133485, 273033, 31183, -533169, -180338, 32195, 60423, 322791, 161798, -3690, -166079, 63609, -122862, -254365, 169514, -9653, 28763, -134433, -173922, -223173, -150698, 116807, -185740, -215088, -407446, -54882, -128984, 111961, -4091, -81185, 5994, 255770, 147346, -131159, -246115, -106428, -304150, 328538, 247440, 129394, -76408, -447035, 74093, -51210, -89415, 317151, -188987, 141162, 135020, -218621, 377669, 225677, 62580, 119241, -237045]
18982c7594a0993A73655g1568q2303J3498k36772k254A95733P9195a99257L1467
18971a67790f4875A04593O1264D2299a4881H4171a772B62760H8377j064K4297
18960A11610c949j6810A7734K2881K3085c38224e4927a9845A66329D4617b19727
18948a27710M7042l7423b7695A78674b03757h1193A31090h1298G2280e5628j13693
18937a69321g7211n118A44563a76865A0866b69720M4364R8025B38317b37415k1677
18926b59092m012J05940N2009L8795r3094P6008o7445l8725C0708a20155o9838
18915a89993C33250I6084f5091L0432j14581I1912C2454c8397G7656b25389g275
18903i9404C12514G8982N1032J86921g3294B13972I6739J8259b12858f5419k49740
$$ y = [-37594, -10993, 173655, -71568, -153871, -140373, -377145, -379399, 195733, 274928, -199257, -167790, -64875, 104593, 165857, 42299, -14881, 84171, -1772, 262760, 88377, 87313, 111610, -3949, -20759, 17734, 40615, 63700, -338224, -54927, -19845, 166329, 44617, -219727, -127710, -80668, -118091, -27695, 178674, -203757, -81193, 131090, -81298, 72280, -55628, -169321, -77211, -82329, 144563, -176865, 10866, -269720, -225356, -127331, 238317, -237415, -259092, -263104, -157164, -105155, -66360, -159454, -83446, -150891, -189616, 30708, -120155, -189993, 333250, 96084, -65091, -34659, -149240, 91912, 32454, -38397, 77656, -225389, -7275, -99404, 312514, 78982, 130014, 316935, -73294, 213972, 96739, 114998, -212858, -65419, -315159]
18892c15159J4764i4607D9669a73904D7198a58464B07003b54617r9581a07041
18881e08615a10055p899e4928j09189A24549a51115j51550h5341L6448j56399
18871b05292A90418a02174K5362k01565h3639r0074B1691c15662J34054c836k36490
18860b40326A18206m6064h8695j45301p981C52173h0609j79794I8026R6665a42757
18848d7068B38558b60708C36172a73516O9613f421H9081a92335j9178A01619i2283
18836A13278Q2626b907j79637C42868j29871a31578M4615A614i9834F7124c47858
18824F1861J16466c53098g5264A23074J45863F6409J36323Q1824A04598p656K2342
18813A19284g2676A07039J18569J305d5969b2454j73943r4062A31347l1683O1083
$$ y = [-315159, -300395, -94607, 49669, -173904, 47198, -158464, 207003, -254617, -354198, -107041, -508615, -110055, -117954, -54928, -164117, 124549, -151115, -302665, -85341, -48893, -205292, 190418, -102174, -76812, -278377, -83639, -173713, 21691, -315662, -181608, -3836, -240326, 118206, 72142, -88695, -233996, -241977, 352173, -80609, -260403, 98026, 194691, -142757, -47068, 238558, -260708, 336172, -173516, -103903, -6421, 89081, -192335, -211513, 101619, -92283, 113278, 195904, -2907, -182544, 342868, 212997, -131578, -86963, 1614, -99834, 67124, -347858, 61861, 178327, -353098, -75264, 123074, 268937, 66409, 202732, 284556, 104598, 96942, 119284, -72676, 107039, 225608, 226913, -45969, -22454, -196397, -290459, 131347, 99664, 160747]
18802A60747a57740A62793c16377J09313c380F2963b19187B7080J59507B1427
18791a2507M189n4359B33154a31599c3384n189j3207r46A86433b60168A57305
18779b14141A48671h2459b002A12087a24822j8975B45388b78076b4008e368j17917
18768a23285F0708a16775j17040B89577b41325O6553P5707d6205B7273K1500d29810
18756b07776I8454k8719a0504A17067a00718A07679L1040a02922B01358A6768
18745D1436c74083r0780A03509g4450D5550a11627A80348H2874h3897B01087b60943
18733h5380m1616j50056A39992d8739A44950e7614j7426I7017K6634b33710e2572
18721A89668b324k18706E9995o985D963c57912a57737d8138l0162B98960e5287
$$ y = [160747, -157740, 162793, -316377, -207064, -3380, 62963, -219187, 27080, 186587, 21427, -12507, -8318, -62677, 233154, -131599, -33384, -38573, -51780, -52726, 186433, -260168, 157305, -214141, 148671, -82459, -2002, 112087, -124822, -143797, 245388, -278076, -24008, -5368, -123285, 60708, -116775, -233815, 289577, -241325, -174772, -99065, -46205, 27273, 48773, -429810, -207776, 98454, 69735, -10504, 117067, -100718, 107679, 138719, -102922, 201358, 16768, 41436, -374083, -464863, 103509, -74450, 45550, -111627, 180348, 82874, -83897, 201087, -260943, -85380, -126996, -277052, 139992, -48739, 144950, -57614, -75040, 97017, 123651, -233710, -52572, 189668, -2324, -221030, 59995, 53010, 4963, -357912, -157737, -48138, -78300, 298960, -55287]
18709b96247f8664j76283B69771a73680A88201i810I0468b13619r6688J38791
18699a71516j82011G6529a89938J1223J7381b0047j15952j16379k1441A0265e1847
18687c35995f6380A74795b95939B47581a04446C8915A8696d6989A71374J8094
18677A89468F5860h0670k6335A38149i7075M0278C5251M5201a96249H430e3710
18665a66599C14543a55255D82255a83291g0743p8183A66021D8101a83566A84779
18654c9347n6932M6301a4109j19036D6673c1590j40340n8356A1907K76498c52459
18642a97315L2233A52192a1474E6191e3733G6270Q9634J23375a50993b7847k0017
18631d7864J4464A38713b2911B47444a4774C0931K1844b98635A62664a56393j15134
$$ y = [-296247, -68664, -244947, 269771, -173680, 188201, -9810, 90468, -213619, -310307, -171516, -353527, 76529, -189938, -178715, -161334, -20047, -135999, -252378, -273819, 10265, -51847, -335995, -66380, 174795, -295939, 247581, -104446, 38915, 18696, -46989, 171374, 189468, 65860, -80670, -107005, 138149, -97075, -56797, 35251, 80452, -196249, 8430, -53710, -166599, 314543, -155255, 482255, -183291, -70743, -148926, 166021, 48101, -183566, 184779, -39347, -96279, -49978, -14109, -133145, 46673, -31590, -171930, -230286, 11907, 288405, -352459, -197315, -165082, 152192, -11474, 56191, -53733, 76270, 165904, 289279, -150993, -27847, -47864, -33400, 138713, -22911, 247444, -14774, 30931, 52775, -298635, 162664, -156393, -271527]
18620b71527F8389j2496a99303h1173B08642J4607p0858Q248d4182B47291I9188
18608c33246A31053a49243N4963A5431J42874D4834N4252m6541h2670M080r1824
18597a70414g3610I3669g5122p3330N4538j54883R5672d1181k16469D8770h5557
18585B43126A18803E6072a14272n9708I176L12575I5459h6572c6173o5308L7390
18574f4091C0221a16600k32532A23120c15931b5461l40336j39897b21788A69866
18563c3858C01003a54489q3746h5720o7016o563k1904b5561G2898a88514J1555
18552a76959E3193b67530h8391l580k73634A46503I84i6704B0110b9151H6401
18540B09601a60448H630J16734Q3795E9275d1323n5661r8851c5534B53998h2006
$$ y = [-271527, 68389, 55893, -199303, -81173, 208642, 223249, 152391, 160639, -44182, 247291, 99188, -333246, 131053, -149243, -94280, 15431, 158305, 44834, 99086, 52545, -82670, -78590, -170414, -73610, 93669, -75122, -148452, -93914, -248797, -153125, -41181, -257650, 48770, -85557, 243126, 118803, 56072, -114272, -173980, 9176, 321751, 95459, -86572, -36173, -101481, -64091, 30221, -116600, -349132, 123120, -315931, -25461, -365797, -505694, -221788, 169866, -33858, 301003, -154489, -238235, -85720, -152736, -159299, -181203, -25561, 72898, -188514, -176959, 53193, -267530, -88391, -91971, -365605, 146503, 984, -96704, 20110, -29151, 86401, 209601, -160448, 8630, 125364, 209159, 59275, -41323, -96984, -195835, -35534, 253998, -82006]
18528b63352B44376b48165C21483b83854J18670A80129a49605J0554H8015a29597
18517h9060p8756B17150a99882Q4758H7492a92083B17278a27324B95971A30464
18506i5076A31471b22635c7916j20049A63169b53428e1297q6237N9703k90334
18496c68165a4054j20129e3458F0773b5257j31039H6547J1239f2012b6292A50886
18484g4910C23685D2173K46166b5584A39924a91035J8775B27575a40737A65901
18473c5340j00064B36852a00197k09263A73619b41718J3676A53897i2131j7148
18463a09279F9802B3528f6132q9525B08001a64184l5065O2192f7096j76247P2435
18452a70908e7372A44336g7169B4255Q4107J22835i3846j03048a1317C9402c5384
$$ y = [-263352, 244376, -248165, 321483, -283854, -165184, 180129, -149605, -139051, 88015, -129597, -89060, -167816, 217150, -199882, -115124, 87492, -192083, 217278, -127324, 295971, 130464, -95076, 131471, -222635, -37916, -157965, 163169, -253428, -51297, -137534, -77831, -368165, -14054, -134183, -53458, 60773, -25257, -156296, 86547, 97786, -62012, -26292, 150886, -74910, 323685, 42173, 288339, -25584, 139924, -191035, -172260, 227575, -140737, 165901, -35340, -135404, 236852, -100197, -309460, 173619, -241718, -228042, 153897, -92131, -109279, 69802, 23528, -66132, -155657, 208001, -164184, -199249, -137057, -67096, -243343, -170908, -57372, 144336, -77169, 24255, 108362, 231197, -93846, -196894, -11317, 39402, -35384]
18440b54392a7631k51016J08369E1226G85b12574q8008e154B25394a4600k67756
18429b82356q9753a55977K9604A20278a14196j16405J04225F2598K5551a94325
18418F1801d5958A45368F3387J2217d1208A94692e9854A11571J27411A6947a51507
18406d3471o4943a3021k74372I5733b20779A35742E6337g4065p6212f7699B12580
18394F7257L5571R1040G0632J65634n9444i9904F0724a66638G9570K7696b16767
18382f5635K0362j64317G9359B5608L6135a31951A37746L4550K07878F4108a47133
18370h6287j45834O0186c4597A66497g4734J6797A04314C422c92038a92655i0232
18358f3183D5356a27639K019D1020h6276E0073a19518D6840a97417g0663a5457
$$ y = [-254392, -17631, -268647, -160278, 51226, 785, -212574, -300582, -5154, 225394, -14600, -282356, -372109, -155977, -126373, 120278, -114196, -230601, -126376, 62598, 88149, -194325, 61801, -45958, 145368, 63387, 75604, -41208, 194692, -59854, 111571, 238982, 16947, -151507, -43471, -108414, -13021, -287393, 95733, -220779, 135742, 56337, -74065, -150277, -67699, 212580, 67257, 102828, 193868, 70632, 236266, 176822, -99904, 60724, -166638, 79570, 107266, -216767, -65635, -45273, -209590, 79359, 25608, 61743, -131951, 137746, 172296, 380174, 64108, -147133, -86287, -232121, -171935, -34597, 166497, -74734, -57937, 104314, 3422, -392038, -192655, -90232, -63183, 45356, -127639, -125620, 41020, -86276, 50073, -119518, 46840, -197417, -70663, -15457]
18346H6291Q6278B716a07679I7643C2728b87404F1000b08515E4550a79492E6735
18334A04676E744a01796q5178k65835A71785F3081a82963g9770k30336C37104
18323H5674J50004a35245e5277l37962I0902C2714J78643C4927J03169a23216
18312b59753h5120a6453k9719j31807H3653b31075A33135c30144m8923J01362
18302b77705A62045i4936k49952E3995c79904d1939F3061Q2768m4171g7517n2645
18291a30162M7257D07051E1755C304b30885P5134k0120d7633o1496c4589l7600
18280g2189d829k45607R3659N7771d4654l25722g6237k53497B04965J78136A4993
18268D4030a54460r5610N6437N5233J5398j18603B7324a5559m7201q6697A72531
$$ y = [86291, 172569, 2716, -107679, 97643, 32728, -287404, 61000, -208515, 54550, -179492, 56735, 104676, 5744, -101796, -186974, -452809, 171785, 63081, -182963, -79770, -310106, 337104, 85674, 235678, -135245, -55277, -393239, 90902, 32714, 211357, 34927, 138096, -123216, -259753, -85120, -16453, -46172, -177979, 83653, -231075, 133135, -330144, -379067, -277705, 162045, -94936, -344888, 53995, -379904, -41939, 63061, 145829, 101658, -77517, -130162, -82905, 407051, 51755, 3304, -230885, -155751, -175871, -47633, -109129, -34589, -72189, -4829, -250436, -156777, -99006, -44654, -370376, -76237, -329734, 204965, 383101, 14993, 44030, -154460, -250070, -193633, -138400, -123002, -241605, 27324, -15559, -62760, -149457, 172531]
18256B50490D0757L4371a67735a7263F1900a79649c1329k36401a14899A6386J0158
18245B6544b08571j12736A79319C4660i7199A03305O91730A77989l74b75526a1740
18233a57322e0788C39556a18256L5678D1734a56070P1111H4715a09499D48335
18222a60642k3709j47308e8083B96400b73392K5538a19800M8817i307l20839J43622
18211a86524i0976B15785b47005h3785k145C0387h8614M2816k45216c74j32710
18200a33084e5337B38914a7860B2180O5808b9143r9424j6834A4577O7797d8051
18188a21783F552J23050a78947L9798l0302l0515A36259k8782J65016F1411c85
18176c156j57821N1900M2609B6945a88057l6144g1294B20K537a41055d9758C25049
$$ y = [250490, 40757, 75128, -167735, -17263, 61900, -179649, -31329, -267730, -114899, 16386, 26544, -208571, -321307, 179319, 34660, -97199, 103305, 795035, 177989, 177615, -275526, -11740, -157322, -50788, 339556, -118256, -82578, 41734, -156070, -84959, 84715, -109499, 448335, -160642, -184351, -331659, -58083, 296400, -273392, -247854, -119800, -70983, -9307, -330146, -186524, -90976, 215785, -247005, -83785, -85930, 30387, -88614, -45798, -291014, -374, -133084, -55337, 238914, -17860, 22180, 87988, -29143, -128567, -145401, 14577, 82374, -48051, -121783, 6552, 129602, -178947, -139149, -169451, -199966, 136259, 107477, 272493, 61411, -385, -3156, -160977, -109077, -66468, 26945, -188057, -224201, -71294, 220, 2757, -141055, -49758, 325049]
18163b39529B76081C7356J22203a24292j17186A46571N9602l0139b7710G0452
18152C54012f9111B2913a70755a1980A72026a16576j4688A25714A8310a6739A14580
18140c7275C7482L36912a00816j39546R2042L2555E504b35593a10330A14564b86766
18128A35187J7752L699h4812j4927j08232D5312N4844A4040M4108J11692E2957
18116b49123b1370A09131K757J3112J33311F7654c65560J75368M3508l1093e3914
18104d39287C16819C4390g743A38424K1093c39229c6486B5184a56249j20347e6977
18092C523a03529H5184Q3312b0861I7487a3671C42723a22897e6184b2989C7788
18080b8258A95012L6016F2480c66644a2308l06361I4280b51759p9325i1795n1442
$$ y = [-239529, 276081, 37356, 159559, -124292, -241478, 146571, 206173, 176034, -27710, 70452, 354012, -69111, 22913, -170755, -11980, 172026, -116576, -131264, 125714, 18310, -16739, 114580, -37275, 37482, 374394, -100816, -240362, -148320, -115765, 5504, -235593, -110330, 114564, -286766, 135187, 152939, 156638, -84812, -99739, -207971, 45312, 100156, 14040, 58148, 169840, 52957, -249123, -21370, 109131, 111888, 125000, 258311, 67654, -365560, -190192, -146684, -177777, -53914, -439287, 316819, 34390, -7743, 138424, 159517, -339229, -36486, 25184, -156249, -276596, -56977, 3523, -103529, 85184, 168496, -20861, 97487, -13671, 342723, -122897, -56184, -22989, 37788, -28258, 195012, 231028, 62480, -366644, -12308, -318669, 94280, -251759, -331084, -91795, -143237]
18069a43237A18259D9238a45418G7391h7284C60044b05631A52094a306A24519
18058e1088F5845c2031B59519l5068l2245F736Q420R09k801i567E1820a19718
18045c19259I433b9016q572I8029k4397a8888L567A93083p6257b07864A18210
18033b17591c5617j92128I105a27343j49842g2549D1695j174a44395B2185J06266
18022A28451l1913h0919k2212a6844k93761M0253A15549l0343Q0687A8622P2780
18011I1402J86593d0493B39859K8374h6605A14974M51J50908a2907B75098i4624
17999a79139N6901M4006C1432c9598k81778J38188C4361f2178K3549n943j26997
17988a71569A67K2695R3799J40085j22305c02927A24774M9279o2008a59329K8508
$$ y = [-143237, 118259, 49238, -145418, 77391, -87284, 360044, -205631, 152094, -1306, 124519, -51088, 65845, -32031, 259519, 224451, 192206, 6736, 15156, 16065, 13264, -9567, 51820, -119718, -319259, 9433, -29016, -37588, 98029, 73632, -18888, -15321, 193083, 116826, -207864, 118210, -217591, -35617, -227745, 9105, -127343, -277185, -72549, 41695, 40521, -144395, 22185, 128451, 96538, -80919, -103131, -16844, -310605, -270352, 115549, 85206, 165893, 18622, 91402, 277995, -40493, 239859, 268233, -86605, 114974, 115425, 266333, -12907, 275098, -94624, -179139, -122238, -78232, 31432, -39598, -321376, -183188, 34361, -62178, -38629, -44572, -171569, 167, 22862, 116661, 256746, 134441, -302927, 124774, 174053, 112045, -159329, -130821]
17977a30821n6283B31160A03575g4739j47572J07403F6794a62715I6157f5857
17966b1991q1098o0505b4916C3672j6638a62333m4842Q0440A20771c1443A07172
17954c42885A57350f0674K7982C56614A76581J45460D9122i212j47383f8403A64155
17942B43248D8597a89811A24647O8196i4389C3881b6993A91172b387k18374F6034
17930e26190B06386K33356A04453J90747a59340A48316a14188n7758B13496A0408
17919a48612c5431j51710E7935L00181A41417k9754m7054A8756a30244F7881a83330
17907e9896N505J5360B17367F7278E764J24303h6882B71833D8754R4953A1177
17895A31604a7766r9480j13129C3618h9310I8903a01023A59182b47933A44087
$$ y = [-130821, -187104, 231160, 103575, -74739, -222311, -114908, 66794, -162715, 96157, -65857, -21991, -103089, -163594, -24916, 33672, 17034, -162333, -207175, -126735, 120771, -31443, 107172, -342885, 157350, -60674, -32692, 356614, 176581, 322041, 49122, -9212, -156595, -68403, 164155, 243248, 48597, -189811, 124647, 192843, -94389, 33881, -26993, 191172, -2387, -220761, 66034, -526190, 206386, 439742, 104453, 295200, -159340, 148316, -114188, -171946, 213496, 10408, -148612, -35431, -187141, 57935, 358116, 141417, 111663, 64609, 18756, -130244, 67881, -183330, -59896, -54391, -39031, 217367, 67278, 5764, 130067, -86882, 271833, 48754, 143707, 11177, 131604, -17766, -117246, -230375, 33618, -89310, 98903, -101023, 159182, -247933, 144087]
17884B26605a72489H6370a25544P860K8513B19734o976L7809a41167A04419b21254
17872B71782D041L9812b1656B45696a04673C0644O0582i4981j21335B21286r7517
17861A23769N4738P0750o5111a05147b0462B13047b24983D8670N0410h2449k08247
17850b90696B25683n7125J71768A17836c8346l17284E6890b9109A89867a18010
17839A39233E6776a87181C35472a65777b7644A53013m4881J36895B3401M1605
17829F5006h6482D3520M2084E710c77648B21986e5066j21318A37023f2388A5973
17817b17891A07083C0367b03958f1821D9163J28299a77986b9822E1387a94617
17806A37624O2548f3022C54494D3514a72721A268d4639K1393E3334M7395c8570
$$ y = [226605, -172489, 86370, -125544, -117684, -89171, 219734, 212758, 250567, -141167, 104419, -221254, 271782, 4041, 43853, -21656, 245696, -104673, 30644, 91226, -94981, -216316, 221286, 123769, 178507, 249257, 184146, -105147, -20462, 213047, -224983, 48670, 99080, -82449, -290696, 225683, 168558, 340326, 117836, -38346, -355630, 56890, -29109, 189867, -118010, 139233, 56776, -187181, 335472, -165777, -27644, 153013, 108132, 245027, 23401, 65006, -86482, 43520, 85604, 5710, -377648, 221986, -55066, -176384, 137023, -62388, 15973, -217891, 107083, 30367, -203958, -61821, 49163, 177462, -177986, -29822, 51387, -194617, 137624, 200172, -63022, 354494, 43514, -172721, 1268, -44639, -23246, 53334, 100729, -38570]
17794e3794l12705f1894C1551d71047g0472A06111P4448a29778e1255B16115b8452
17782g3239B9067K67588a11286A79145J82546A00201k0881a29118m0799D8788
17771B27271e6432A56215A9674N1318b57064A76246d02675A21960a04538I1947
17760B04059K3835b4748B97432A37132E7190M695l877c67j89185C05170c6528
17748g4272A48749a55205k7096B51639j24986L8343A7924J84495I3126D0219k181
17737C8038K20323b87582F4826K2534P4497G5839a9317j21988f8780j3488A3638
17725a88221A66851L1059a34045A99878a28465j42302g2451B74890I0368Q6686
17715A77054a06830I349K14584f9971A61407G5691J02721F1664a19114J9158E2063
$$ y = [-53794, -366499, -61894, 31551, -471047, -70472, 106111, 180559, -129778, -51255, 216115, -28452, -73239, 29067, 296655, -111286, 179145, 361691, 100201, 79320, -129118, -169917, 48788, 227271, -56432, 156215, 19674, 70992, -257064, 176246, -402675, 121960, -104538, 91947, 204059, 227894, -24748, 297432, 137132, 57190, 61885, 58008, -367, -189552, 305170, -36528, -74272, 148749, -155205, -182301, 251639, 126653, 164996, 17924, 202419, 93126, 40219, 38038, 258361, -287582, 64826, 87360, 161857, 75839, -19317, -141305, -68780, -82268, 13638, -188221, 166851, 197910, -134045, 199878, -128465, -270767, -72451, 274890, 90368, 177054, -106830, 9349, 223933, -69971, 161407, 75691, 178412, 61664, -119114, -99956, 52063]
17703G6894b57516b0600I0316d6524j74352A368J05324a05501A90622a55170C918
17691a07985A25762K7941F492j414K11329B5277g7976j6847A13508d628A33674
17679B4465a94093A6092e3962E3106e7465A08453g3438q5450A941K37496r9190
17668A40247d0635b179q1060D8748J77408F0118J60024o2607a34184G8611i2571
17656a34014A56571c37674B85590I533f4090B2285b78451B58073R9706A11570
17645B70044G476J09576c5658J6873H9371J00564A3496a51277A32285j480m5257
17634H5548e7534k38027F0435h00B0364L65049H1276a67577N9045A38471J45072
17623B83543q9876m9908o6200b52480A23996D9483p316i0377A8510b0468j41606
$$ y = [76894, -257516, -20600, 90316, -46524, -220876, 1368, 106692, -105501, 190622, -155170, 3918, -107985, 125762, 153703, 6492, 5078, 216407, 25277, -77976, -94823, 113508, -4628, 133674, 24465, -194093, 16092, -53962, 53106, -57465, 108453, -73438, -158888, 1941, 239437, 140247, -40635, -2179, -83239, 48748, 226156, 60118, 220142, 157535, -134184, 78611, -92571, -134014, 156571, -337674, 285590, 9533, -64090, 22285, -278451, 258073, 357779, 111570, 270044, 7476, 117052, -35658, -18785, 89371, 189935, 13496, -151277, 132285, 130805, 85548, -57534, -295561, 60435, -800, 20364, 385413, 81276, -167577, -108532, 138471, 283543, 193667, 143759, 77559, -252480, 123996, 49483, 42167, -90377, 18510, -20468, -162074]
17612a62074A19471J05604D0315K44791g8868D44426b62863d492B95127A10622
17601C1515J53796p3455C60b85308a28328B87716n1959a04096A49920F0779K12746
17590B73525H2129J38200D7928M4841J3552J05005q4240d9209D2404J59511E2746
17578a00395A43288a37424d1313A10889J09004c832j70511B26678Q54c8018B03111
17566a06894B83036E5808K41006q3951b56702E7499g237A98264j4481j3391R5012
17555B65404L3477C9288R9661N6244a03530A8391K65361K05619A07291J2882d8776
17543A48236M7415M9475o1688k7932l1210m0794j830K1653N841Q5401q3739M9335
17531A60163G326J60816C8405A2490J63810p2790a82288B3679K14345k0232o7549
$$ y = [-162074, 119471, 225075, 40315, 285106, -78868, 444426, -262863, -4492, 295127, 110622, 31515, 185311, 111856, 360, -285308, -128328, 287716, 235757, -104096, 149920, 60779, 273525, 82129, 220329, 47928, 92769, 106321, 211326, 127086, -49209, 42404, 201915, 52746, -100395, 143288, -137424, -41313, 110889, 219893, -3832, -174343, 226678, 227532, -38018, 203111, -106894, 283036, 55808, 296814, 212863, -256702, 57499, -7237, 198264, 183783, 170392, 265404, 298881, 39288, 138949, 195193, -103530, 18391, 283752, 489371, 107291, 120173, -48776, 148236, 195651, 245126, 183438, 155506, 124296, 83502, 81672, 103325, 109166, 194567, 110828, 160163, 7326, 168142, 38405, 12490, 176300, 103510, -182288, 23679, 238024, 217792, 150243]
17520A50243O9574L2894a0990C51664A14633J82454l1449f772j66407E27713j33465
17509C94248c3715a2160o9526A42787m3404d3613I4668a07024B37266H7493C1810
17497C61012j62994C1581L1548A5916Q7082m5016K50739j20272j8406P3292F7404
17485d4291A06448K16675A18050E6851c73834A41029F5009M09723A86211n4197
17475A32014b811D87037I5775d6376C75933A22331C0466J84731h5528j13092B16578
17463B17484b29147A366M29135E9149c184A22617A7196L59744B1282J11310K3847
17452A56439p2321O3600J64599K10813B39328J04221j24442E6482L20008j41458
17442B35032J21521A34156K06217D2541J70670j4261L7645m0569f7805A79172
$$ y = [150243, 219817, 252711, -10990, 351664, 114633, 297087, 265638, -6772, -173179, 527713, 394248, -33715, -12160, -81686, 142787, 99383, -43613, 94668, -107024, 237266, 87493, 31810, 361012, 198018, 31581, 63129, 15916, 102998, 57982, 308721, 188449, 170043, 243335, 67404, -44291, 106448, 323123, 118050, 56851, -373834, 141029, 65009, 474732, 186211, 132014, -2811, 487037, 95775, -46376, 375933, 122331, 30466, 215197, -85528, -198620, 216578, 217484, -229147, 1366, 430501, 59149, -3184, 122617, 17196, 376940, 21282, 132592, 156439, 84118, 147718, 312317, 523130, 239328, 343549, 219107, 56482, 376490, 235032, 356553, 134156, 340373, 42541, 213211, 198950, 236595, 196026, -67805, 179172]
17431C02795A42905J72095j10598J8872L57857E7650O8368J5067e6255C13975
17420A54493R4867e2657F77170c2594H3277N8512K02924A52955a93703Q3686l8259
17409a48276B22264L54043H9644B9962J19976m3542L26503o9094r3864C3406o535
17398B6871K94429H0040R0656L007g9998H2384L05605f2719k3494A26209J77877
17387C04086A50741a12603m4244E06703i7542A77780K8995a2502B05141J60058
17377C65199r0981G4430L5205a101B12787C0276d4562C82181a10268j40662A13369
17365c0711B80368a55418B47811r4236B9234M78232B16622a91499A12575a23340
17354A11770M9266l8336c3918D2996b4779A04470c4536I3961N9829Q0306m8769
$$ y = [302795, 142905, 315000, 204402, 223274, 581131, 57650, 126018, 141085, -56255, 313975, 154493, 249360, -52657, 677170, -32594, 83277, 141789, 344713, 152955, -193703, -110017, -148276, 222264, 576307, 89644, 29962, 149938, 106396, 432899, 363805, 269941, 33406, 26871, 321300, 80040, 170696, 173703, -79998, 82384, 387989, -62719, -86213, 126209, 304086, 150741, -112603, -156847, 506703, -97542, 177780, 206775, -12502, 205141, 365199, 274218, 74430, 109635, -1101, 212787, 30276, -44562, 382181, -110268, -250930, 113369, -30711, 280368, -155418, 247811, 153575, 29234, 507466, 216622, -191499, 112575, -123340, 111770, 161036, 122700, -33918, 42996, -24779, 104470, -34536, 93961, 153790, 234096, 185327]
17343A85327F5405J35025K37002C1106K98735q4680q6970K09076A3268O4148J38445
17332B15861l6349l7779a33049k2562C05061l1495J3936k9689l2321k281H7642
17320D32065a76577B57913J08188B1139K03695E346c0802B63320j28038b44880
17309A63378b45505C6805L89481q2215j0557i7479B68230L4173b6086a2077A20632
17297A73775J00044B5544L00272q1725q6951d2488B60897J59330A75073L4055
17287B09128K8791r6767K06864J1659A36849M8067J37170a03681D82325l7062
17277D45263j22104L3981p2142J3650A46864Q4954J95922E826J86012J42837a6888
17265B6140K70294h3731D22221A66905m2556P1910b7064C97723a7735E314M19348
$$ y = [185327, 65405, 200430, 437432, 31106, 329841, 245161, 158191, 367267, 13268, 77416, 215861, 179512, 141733, -133049, -155611, 305061, 273566, 287502, 257813, 225492, 223211, 87642, 432065, -176577, 257913, 366101, 21139, 224834, 5346, -30802, 263320, 135282, -244880, 163378, -245505, 36805, 426286, 344071, 333514, -97479, 268230, 302403, -26086, -12077, 120632, 173775, 273819, 25544, 325816, 244091, 157140, -42488, 260897, 420227, 175073, 209128, 237919, 141152, 348016, 359675, 136849, 184916, 322086, -103681, 482325, 445263, 323159, 357140, 284998, 298648, 146864, 231818, 427740, 5826, 191838, 334675, -16888, 26140, 296434, -83731, 422221, 166905, 124349, 196259, -27064, 397723, -17735, 5314, 424662]
17254D24662B09312j03198M7082J06738j03550b8378A51339K3438J8885C1576
17243A09499j1543J26788m7620A0413M4714K42388G33M01389A82173N2092c7211
17231A88429J0325q1489d6352A885Q9144J43594L9938J61351I1221B7336K58077
17220B85413J79917A86584k8777Q256o7542N6308F6536a0607C44868A23914L95642
17209E19556B47559O8531n5108m3274m6975A4672M43K42949m62o1826K38510k3289
17197D10997A22082M02290j76211K19490k21829Q1554p2608C9565L92607l2536
17187C99636I4015K50579l3628Q5566I8191J94312M1281m8006A28062J43543k3469
17176B48136J11324K4551n0763L4896I8433J71257K03376B20853O8065p4795K96474
$$ y = [424662, 209312, 106114, 153196, 259934, 156384, -28378, 151339, 174777, 193662, 31576, 109499, 97956, 224744, 177124, 10413, 55127, 297515, 733, 402122, 182173, 234265, -37211, 188429, 198754, 117265, -46352, 1885, 91029, 234623, 274561, 435912, 91221, 27336, 285413, 465330, 186584, 157807, 166063, 98521, 154829, 66536, -10607, 344868, 123914, 519556, 247559, 316090, 260982, 217708, 170733, 14672, 15115, 258064, 257602, 195776, 434286, 410997, 122082, 524372, 348161, 567651, 345822, 427376, 354768, 39565, 432172, 399636, 94015, 344594, 310966, 396532, 98191, 292503, 333784, 285778, 128062, 271605, 248136, 359460, 384011, 333248, 368144, 98433, 269690, 473066, 220853, 288918, 214123, 510597]
17165E10597A41711M5210K37144j34391Q2439O1188f2212B80324K76178k48446
17155C08056O8874q4961L101o2723L8722J52322J9177q9922j55288N24059C60254
17143A12718E5079K14175l4860M3153M05817R7510A45724R6914J26350J3927l2640
17132C50275M9859O876A93325L68479D3705J31762L16214L2787A89600K98061
17122D87661j15109j36901J51621A71280R2802O837M09220M3586C51688J85585
17112E37273k41421K90444p4612o0673J25215B10594K35538k02377J37427j22630
17102B58552K06694m8954m1251j6719L42696C28272J19164o8709L21993l18566
17092C82154J45952k48819J29210p8170k2562k5376L21674A90216J29745O2734
$$ y = [510597, 141711, 186921, 424065, 289674, 372113, 433301, -62212, 280324, 556502, 308056, 376930, 291969, 295070, 232347, 271069, 423391, 442568, 352646, 197358, 721417, 360254, 112718, 55079, 269254, 234394, 277547, 683364, 780874, 145724, 242638, 368988, 382915, 350275, 400134, 407010, 193325, 561804, 43705, 175467, 491681, 524468, 189600, 487661, 372552, 235651, 387272, 171280, 264082, 270919, 680139, 723725, 351688, 537273, 295852, 586296, 511684, 451011, 576226, 210594, 446132, 243755, 381182, 258552, 465246, 416292, 375041, 358322, 701018, 328272, 447436, 378727, 700720, 382154, 528106, 279287, 408497, 330327, 307765, 282389, 604063, 190216, 319961, 382695]
17082C82695N6698q85L58474o3291j43199B76375J99445K46427K656B86728P9131
17071C65859L45821m0704j71659J21966n2713L56902l74136j21332J36769N7070
17061F23843k76455J09357L40873k51267k1926e1501F44761l17227K29123Q3166
17051F39823C12746k538J67464j9402N35977m29304J11812k5388j35482J17256
17041F33141j77012N7102j06166L48204K20727D71290k25017Q4848N70020k54734
17031F46407B36216M81915k76586J67178Q1884N798J11202j50201R1073p5590
17021F72889J74275R6228j87513j28708N6895J8207n1483J20357P167j47230r4537
17010E36547M86140p2582M1240k56692J4915M6145K6884j01058k09591K33143
$$ y = [382695, 439393, 438508, 796982, 733691, 590492, 276375, 475820, 722247, 724903, 286728, 365859, 711680, 670976, 499317, 621283, 568570, 925472, 551336, 430004, 566773, 623843, 347388, 456745, 797618, 546351, 524425, -51501, 644761, 327534, 556657, 639823, 312746, 310208, 477672, 458270, 994247, 564943, 676755, 651367, 515885, 633141, 456129, 513231, 407065, 755269, 975996, 471290, 246273, 331121, 901141, 646407, 236216, 718131, 441545, 608723, 690607, 696405, 807607, 657406, 748479, 672889, 847164, 943392, 755879, 627171, 684066, 702273, 650790, 771147, 778314, 631084, 536547, 1022687, 950105, 991345, 734653, 749568, 795713, 822597, 721539, 511948, 745091]
17000G45091J71455j54041j64520M13737k85289K38518J02252n9804j36358q1190
16990G89851M47386l26604j26503M11033O1268l46722k1859o1118K07824j48551
16980H86005J43585j21417l69655M88006J48082k73153K90930j80511j13797M8745
16970I46820K10030L06954o11152L39760l3655p7656P0363j48668K82006q0999
16960A203803j03645J35548R8829j33850q3169J51K98377k22231M4261J4976R6124
16949A349174l39208K65836K15813j48370p6997o2948J72388j25585J46213j72994
16939A223322p3393M8777J70632O8719K20246n19215M57453o4422j02535K52600
16929A682184j46344j85275O2456Q9883J50832M6016j52163R4689j70583J39672
$$ y = [745091, 916546, 762505, 597985, 1011722, 726433, 964951, 1067203, 1007399, 871041, 789851, 1237237, 910633, 784130, 1195163, 1256431, 909709, 887850, 826732, 1034556, 886005, 1029590, 908173, 538518, 1026524, 1174606, 901453, 1192383, 1011872, 898075, 946820, 1156850, 1463804, 852652, 1192412, 1158757, 1081101, 1151464, 1002796, 1284802, 1203803, 1100158, 1235706, 1334535, 1200685, 1117516, 1117667, 1416044, 1193813, 1238074, 1253050, 1349174, 1009966, 1275802, 1491615, 1343245, 1266248, 1203300, 1375688, 1250103, 1396316, 1223322, 1149929, 1198706, 1369338, 1438057, 1658303, 1139088, 1596541, 1532119, 1429584, 1682184, 1535840, 1350565, 1413021, 1502904, 1653736, 1699752, 1547589, 1642278, 1471695, 1611367]
16919A611367K60172k79259L82216n22175L78331O2711m92818N49571J52546l65464
16909A737198M5217K13111O5935q1513j43065K10846P988J38835r6921J21114
16899B218745L29547l40745k793j69806K67463m7234r5367J50230q397j03469
16889B198174K63694k1188R4701O6848J27590l68613L23240j12980N37654k53154
16879B855966M7946j55509J12996K45103j86328O0560O6242O4695J00401l4677
16869C177395J81321j16924J14103p125L56434k21235k34275M46524K3357k58462
16859C461113M69794M1790q1760n0675N2585M72979l55036K69353k2326J1837
16849D269654p0214L09231N7532j52779J72266M31710r1171M32229k36712k15485
$$ y = [1611367, 1871539, 1592280, 1974496, 1452321, 1830652, 1893363, 1400545, 1950116, 2102662, 1737198, 1782415, 1995526, 2061461, 1979948, 1836883, 2047729, 2055717, 2194552, 2097631, 2218745, 2548292, 2207547, 2204754, 2034948, 2302411, 2255177, 2159810, 2310040, 2301643, 2198174, 2461868, 2440680, 2535381, 2602229, 2729819, 2361206, 2684446, 2571466, 3109120, 2855966, 2903912, 2748403, 2861399, 3106502, 2920174, 2980734, 3046976, 3111671, 3212072, 3177395, 3358716, 3241792, 3355895, 3348770, 3705204, 3483969, 3249694, 3696218, 3719575, 3461113, 3930907, 3972697, 3890937, 3840262, 3892847, 4365826, 4010790, 4280143, 4257817, 4269654, 4199440, 4508671, 4566203, 4413424, 4585690, 5017400, 4926229, 5358458, 5121746, 4906261]
16839D906261K92798L02909p0725m9508o0163L95841j51143J68037M11817O6419
16829F212543p5787K29067J19653J85877L94513J65997K56189m5927J58936l00890
16819G300171L19341M33823r870R930J97966N13797L6477J65879J26236K08518
16809I302268L39043J95905P8716L39876O7430N89325J56467J28921L37520L29242
16799A1864713J13649N07112M88447K83252M28941M56291L15786K14957L88513
16790A5061661O30167L36237O60138J86435N72792L29660N36058P01496N65124
16781A9579768M47590P23181N28125J192943K63784R80879Q14805Q11136O60961
16772B6003172J043132J110747Q55244R91733J145028J257496J216006J266730
$$ y = [4906261, 5199059, 5501968, 5431243, 5381735, 5321572, 5717413, 5566270, 5734307, 6146124, 6212543, 6136756, 6365823, 6485476, 6671353, 7065866, 7231863, 7488052, 7442125, 7601061, 7300171, 7619512, 8053335, 8043465, 8053395, 8251361, 8765158, 8801635, 8967514, 9093750, 9302268, 9641311, 9837216, 9915932, 10255808, 10323238, 10912563, 11069030, 11197951, 11535471, 11864713, 11978362, 12485474, 12973921, 13257173, 13686114, 14142405, 14458191, 14673148, 15061661, 15691828, 16028065, 16688203, 16874638, 17447430, 17777090, 18313148, 19014644, 19579768, 20027358, 20750539, 21278664, 22471607, 22735391, 23716270, 24531075, 25342211, 26003172, 27046304, 28157051, 29012295, 30004028, 31149056, 32406552, 33622558, 34889288]
16764C4889288J393143J363949J607197J273539J789914J390048J654967K110612
16756D7472657K134300K041357J909208K312047K445679K518300K165213L001242
16748F6000003K516116L237955L076028L082289L070772L076977L284100L604105
16740I0948345L478550L450084L952128L024943L751325L397963L090364L111128
16732A18204830K872324K443830K496894J813757J797281R94927Q58148M19074
16724A31901065J0565q33276n10427j449170j466623j838828k446255k671767
16716A20695284k714010l143966l080946l767364l288838l915512k778291l701140
16708I4305217l832097l231823l115422l378899l086551k984458k753741l028232
$$ y = [34889288, 36282431, 37646380, 39253577, 40527116, 42317030, 43707078, 45362045, 47472657, 49606957, 51648314, 53557522, 55869569, 58315248, 60833548, 62998761, 66000003, 68516119, 71754074, 74830102, 77912391, 80983163, 84060140, 87344240, 90948345, 94426895, 97876979, 101829107, 104854050, 108605375, 112003338, 115093702, 118204830, 121077154, 123520984, 126017878, 127831635, 129628916, 130623843, 131481991, 131901065, 131911630, 131078354, 130567927, 129118757, 127652134, 125813306, 123367051, 120695284, 117981274, 114837308, 111756362, 107988998, 104700160, 100784648, 98006357, 94305217, 90473120, 87241297, 84125875, 80746976, 77660425, 74675967, 71922226, 68893994]
16700F8893994k647930k776493k398748k687723j891489k351089k097333k132528
16692D9910661k018735j666575j770097k010210j238317j613474j309223j572335
16684C6711695j008236j389763j292105j295497p07559j315143n28119j445293
16676B7729980p49086m99868r84945j107112p88043q13875m67130o96401m68176
16667B1155344r57603k78116o86733m56540n05856j28335p65257o40537l97381
16658A6338986l90657j98475o75503m68763k14082k9006r30287n1854k72145o40566
16648A2467648j70046m8527n24879k36614p3622m92201j44848n24481M16609p54275
16638I914764q0992J30312l39876k82355l32510M7181j15739l43994j80613k26926
$$ y = [68893994, 66246064, 63469571, 61070823, 58383100, 56491611, 54140522, 52043189, 49910661, 47891926, 46225351, 44455254, 42445044, 41206727, 39593253, 38284030, 36711695, 35703459, 34313696, 33021591, 31726094, 31018535, 29703392, 29175273, 27729980, 26980894, 26481026, 25496081, 24388969, 23600926, 22787051, 22319921, 21623520, 21155344, 20197741, 19919625, 19232892, 18776352, 18270496, 18142161, 17376904, 16736367, 16338986, 15948329, 15749854, 15074351, 14605588, 14391506, 14362500, 13432213, 13380359, 13108214, 12467648, 12297602, 12249075, 11724196, 11487582, 11413960, 10921759, 10776911, 10252430, 10669039, 9914764, 9833772, 9964084, 9624208, 9341853, 9009343, 9056524, 8940785, 8596791, 8416178, 8189252]
16628H189252n6821j31209k79168P6303q06091M07872K59276l44413l00270k2646
16618F992085l35048n6628k4909j64748k35457J03319n4391M1643o79998M8176
16608E634044l15779L40353J26145n50673j23476J81583o60023M69185m4453j31704
16598D925202R5093m85516N1272O9808j48566P5677R9819k37593Q4566k79186
16588D250576k1210J03219J5961o4294m46790J98820m10497J67512J53537j59892
16578C786942j17868j63358r2784o1250P8583Q8158l02980N77452l99759k44098
16568C149038m7374J34383l04154J61505k3333O7818p3187k03629J90459q1212
16558B970314q8602l6555p8676j97914J58486k85145L85946j56631l7639j97738
$$ y = [8189252, 8132431, 8001222, 7722054, 7798357, 6992266, 7400138, 7659414, 7315001, 7014731, 6992085, 6657037, 6600409, 6575500, 6410752, 6175295, 6278614, 6224223, 6265866, 5585868, 5634044, 5318265, 5658618, 5784763, 5234090, 5110614, 5292197, 4632174, 5101359, 5056906, 4925202, 5020295, 4534779, 4586051, 4655859, 4507293, 4582970, 4682789, 4445196, 4529762, 4250576, 4229366, 4332585, 4348546, 4284252, 3837462, 4036282, 3625785, 3793297, 3946834, 3786942, 3669074, 3505716, 3412932, 3351682, 3430265, 3518423, 3215443, 3792895, 3393136, 3149038, 3101664, 3236047, 2931893, 3093398, 3070065, 3137883, 3064696, 2861067, 3051526, 2970314, 2881712, 2845157, 2766481, 2568567, 2727053, 2441908, 2827854, 2671223, 2633584, 2435846]
16548B435846K28465j90638P7560l60618K22298P3176j5685Q2462j83189l3453
16538B336224n6890J00990m74443O58518l26188j10588J70158M9534k76745k0164
16528B050406q7361O0328j22288L60687l54126L00920j87426k1578J44823J2880
16518B157265k63306k47757N02487m14455L02668l56145L33040k39013o2385J76772
16508A889171j28490J10557n9019j08251K79801l16435l4788k014r5632J79722
16498A714622m1904K1195p4290J34280m8884K2837k76800l5778K23782l0442M4179
16487A652797J72999K8488l13658R067L9954n19443M27948j15272R5215k57224
16477A220871J25203Q9538J73739m04559K46451N2649M8979k14935J31458N1828
$$ y = [2435846, 2664311, 2473673, 2551233, 2190615, 2412913, 2486089, 2470404, 2552866, 2369677, 2336224, 2279334, 2380324, 1905881, 2564399, 2238211, 2127623, 2297781, 2347315, 2070570, 2050406, 1963045, 2023373, 1901085, 2261772, 1907646, 2208566, 2021140, 1999562, 2144385, 2157265, 1893959, 1646202, 2148689, 1734234, 2036902, 1680757, 2013797, 1774784, 1712399, 1889171, 1760681, 1871238, 1812219, 1703968, 1983769, 1667334, 1632546, 1630532, 1534900, 1714622, 1672718, 1693913, 1619623, 1753903, 1705019, 1727856, 1451056, 1415278, 1639060, 1608618, 1652797, 1825796, 1854284, 1540626, 1549693, 1589647, 1070204, 1498152, 1382880, 1478095, 1220871, 1346074, 1435612, 1609351, 1204792, 1451243, 1503892, 1552871, 1337936, 1469394, 1521222]
16467A521222r7508l39956J44913J22703J0191N5308j81723O2697o9174L1557
16457A260230r6383K76719k91679M985J21394L9021j37649J07438j18662k73260
16447H92154J65344M5049p020j0846O4569o4626J19996o7177J02996q8318j62551
16436I89570q4634M86295l17805J61256k03343j14478p3768m0062K51773m524
16426A050280J36021q2163P2142m68112N63929m12283K81164N97r272k68281j17586
16415G46436L81356k730l27867j02043M03927k93521l6291J08395n4986L5332
16405H58008J8316K29572q7592L81515m22106l0138J99227j34042k61753M22928
16395A173935j92363Q9363l37362M47666m82380L78345l84900M76621n07023K3941
$$ y = [1521222, 1423714, 1083758, 1228671, 1351374, 1361565, 1416873, 1235150, 1297847, 1228673, 1260230, 1163847, 1440566, 1148887, 1153872, 1275266, 1314287, 1176638, 1284076, 1165414, 892154, 1057498, 1102547, 1095527, 1084681, 1149250, 1084624, 1204620, 1137443, 1240439, 1152121, 989570, 904936, 1391231, 1073426, 1234682, 1031339, 916861, 843093, 803031, 1054804, 1050280, 1186301, 1104138, 1176280, 708168, 1272097, 859814, 1140978, 1141575, 1132303, 864022, 746436, 1127792, 1125062, 797195, 695152, 1099079, 805558, 769267, 877662, 822676, 858008, 876324, 1105896, 1018304, 1399819, 977713, 947575, 1146802, 1012760, 751007, 1173935, 981572, 1070935, 733573, 1181239, 698859, 1077204, 692304, 1168925, 661902, 685843]
16385F85843j37940M09124l44553N4751L12967r3419Q941J89104j58905j08912
16375H17001j68494J27849K83634j82853l8527R5629l9616j77573q3970M89084
16365A122164k37401m19309M16149j38766l26968J49755J21454J52713j84684
16356F55107j322l3316J99404P573l08635j58007K40667M28026o2417j49876M042
16345H21246n6390J43290k87407J62534K3344l2301J25433k45540N4266j34389
16335E74086J48929j01068J52488k42404N05311l96562R8546B31648N38707j22699
16325F47656k7190p9587o6750j03518J72625K33135l48053L64718j20065j32757
16315E40214K70232j54058j90606L11317j1695K11054k97828j29889q8500J32885
$$ y = [685843, 547903, 957027, 612474, 667225, 980192, 886773, 895714, 1084818, 925913, 817001, 648507, 776356, 1059990, 877137, 838610, 934239, 894623, 717050, 633080, 1122164, 884763, 465454, 881603, 742837, 415869, 565624, 687078, 839791, 655107, 653785, 620469, 819873, 827446, 518811, 360804, 601471, 1029497, 967080, 817204, 821246, 764856, 908146, 620739, 783273, 806617, 774316, 899749, 654209, 708475, 574086, 723015, 621947, 774435, 532031, 1037342, 640780, 739326, 231648, 770355, 647656, 620466, 540879, 474129, 370611, 543236, 776371, 428318, 793036, 672971, 540214, 810446, 656388, 465782, 777099, 765404, 976458, 678630, 548741, 460241, 593126]
16305E93126B90705K63500j24814N32703l90877j95714L25542j981C43258L72910
16295G16168j70409k6392m55j04001M04601D09727j99099O04569D02113J35591
16285E37704o2638J57239k46807J20883J73289j91614J76599j07346n450j3146
16275E38713J14166l06163K02147K20294j46478j11744j25905K96728N3823k69241
16265D66340J23931j28725j79590J31760k514J43224j01239J39888B51600J54245
16255D05845R213J60237k4534p8669j11649J79522o1562q2504L25938k16113J01077
16244F06801j11836p4493o7363J6404P837K40916O0988k47622m2389p8779N1095
16233C61559J3783A64385J24925J67944l4093J01755K98222C68213J44382o3970
$$ y = [593126, 290705, 554205, 429391, 962094, 571217, 375503, 701045, 699064, 343258, 716168, 545759, 519367, 518912, 414911, 819512, 409727, 210628, 815197, 402113, 537704, 475066, 632305, 385498, 506381, 679670, 488056, 664655, 557309, 551859, 538713, 652879, 346716, 548863, 769157, 622679, 510935, 385030, 681758, 735581, 466340, 590271, 461546, 281956, 413716, 411202, 554426, 453187, 593075, 251600, 405845, 415058, 575295, 550761, 472092, 360443, 539965, 478403, 395899, 721837, 505724, 606801, 494965, 420472, 353109, 369513, 377350, 618266, 679254, 431632, 389243, 310464, 361559, 375342, 164385, 289310, 457254, 423161, 524916, 823138, 368213, 512595, 448625]
16223D48625n5156C4148K30495K02265j57117Q4404J55951J03155D6345M83959
16213E30304r0351K69799C32596Q4905j36614j36003O0773N9700J24537j18395
16203B71499A15709K87743A34396J26613M04118k66365J50992j31879D5909R0777
16193A36686Q1463K14606E0284L63358l5473M0768o2638N5950P6945O8097A73007
16181E88045k90517M1547J89534J19295k59468A67812O2635C1193a05441B63291
16170D44470M37149A47635O7090A8002K41032n3079K03646A05796j3590J75998
16160B68204L18872A34181J18931N2480I3698N7225N2956K5255A07849J15790
16150B23639Q8185q2198J92501j89370J8517L51043e673B75669M70588B43567
$$ y = [448625, 393469, 34148, 264643, 466908, 309791, 394195, 550146, 653301, 46345, 530304, 439953, 709752, 332596, 417501, 280887, 144884, 205657, 265357, 389894, 271499, 115709, 403452, 134396, 261009, 665127, 398762, 549754, 417875, 45909, 136686, 218149, 432755, 50284, 413642, 378169, 418937, 356299, 412249, 489194, 557291, 173007, 588045, 297528, 339075, 528609, 647904, 388436, 167812, 230447, 31193, -105441, 263291, 444470, 881619, 147635, 214725, 18002, 259034, 205955, 409601, 105796, 92206, 268204, 587076, 134181, 253112, 305592, 93698, 150923, 203879, 229134, 107849, 223639, 311824, 229626, 422127, 232757, 251274, 602317, -5673, 275669, 746257, 243567]
16139B90495A04189R6371A3926L29506j16989K68977j97578K02455C6524K89639
16129C26163g9921A79999G8264d3416C0009Q57R8193M58421A10312J55538A00702
16117B12226G4917P8049L29079m5210j93878J6321A8707K85919A30844J52633
16107B83477m5424J11664j26351r0821J47613A0799J4529L88247A92469j9108
16097A73361b73603B71141r8642C3714M74720c05973D6617B3061c3412A56498
16086F3209o338J59642p6875b86549C15364I6206J26474K7105e5678E5637N19351
16075E74988B29911B4596j1627M44460a31825N9910A61342J398o4522d2370F308
16063B06717K51640D4785K38743A26992a36042A9801J97476q8606b26188B67547
$$ y = [290495, 104189, 200560, 13926, 343432, 226443, 495420, 297842, 500297, 36524, 326163, -79921, 179999, 78264, -43416, 30009, 30866, 129059, 587480, 110312, 265850, 100702, 212226, 74917, 152966, 482045, 436835, 242957, 259278, 18707, 304626, 130844, 283477, 238053, 349717, 223366, 132545, 280158, 10799, 25328, 413575, 192469, 173361, -273603, 271141, 172499, 33714, 508434, -305973, 46617, 23061, -33412, 156498, 63209, 56871, 216513, 139638, -286549, 315364, 96206, 222680, 249785, -55678, 55637, 574988, 229911, 24596, 12969, 457429, -131825, -71915, 161342, 162740, 98218, -42370, 6308, 206717, 458357, 44785, 283528, 126992, -136042, 19801, 217277, 128671, -226188, 267547]
16052F8453d97H1777N1239K02655I8375M750O4795c5215B7351M6471a72996e3007
16039D53983j7315c7735k82694B09648D5065a72292A56580b37275C28197A19005
16028A26893d1954C99807b98360f745C8602p267b859k33648J12371k016J74A8056
16015G4171L1677N30622A10968A4817L6100R0523M2363a77685A01443k1908a89027
16003A3053f3120a8268A0492c06239b097D3378K07823c4172A29657k616a52531
15991A51049l4222A8240J53985a3958B43009J51599J27899k12443L33922B20138
15980B88014B5705h2492j49457B45876q9276P4745f985j07190N4177K2148C60676
15968D67621i7544B46879p878b8181j6294j27799C53204n5021b16975J04183A33082
$$ y = [68453, -497, 81777, 133016, 335671, 98375, 103125, 167920, -35215, 27351, 73822, -172996, -53007, 453983, 436668, -37735, -320429, 209648, 45065, -172292, 156580, -237275, 328197, 119005, 126893, -41954, 399807, -298360, -6745, 38602, 31335, -2859, -236507, -124136, -126152, -125978, 18056, 74171, 105848, 636470, 110968, 14817, 50917, 141440, 183803, -177685, 101443, 79535, -189027, 13053, -63120, -18268, 10492, -306239, -2097, 43378, 251201, -34172, 129657, 127041, -152531, 151049, 116827, 18240, 172225, -13958, 243009, 394608, 522507, 310064, 643986, 220138, 288014, 25705, -82492, -231949, 245876, 156600, 231345, -6985, -114175, -59998, -37850, 360676, 467621, -97544, 246879, 239001, -28181, -44475, -172274, 353204, 298183, -216975, -112792, 133082]
15956a69705p4721F2202K0045M6733J34914f0576B09507B6795a53979A57459E658
15944c4922B10766p4419n2741Q6983b61245G5974d0263I9899c594j19900A47597
15932a86509i0139A47229B8033h1092k16678o678f7708A27510a13705J3197A81429
15920b5399m4138o5552A75703a12899j831I4369J28319D6849a6506I9222a35813
15908h6388l3795M2603C2748P1104d3199k72360P6133A01762J47009a28383c4832
15896A23328d7215A03997e1339J4024a1904A50117a5004D4309L38704F8747b42489
15884a45008B0341c14255h1896A28414a13613B36914g1178G2443C0531b46777
15873H1018a55955l252g569j25810C8660d280B50381d6769D5120J17415e9335
$$ y = [-169705, -244426, 62202, 82247, 128980, 263894, -60576, 209507, 26795, -153979, 157459, 5658, -34922, 210766, 136347, 83606, 170589, -261245, 75974, -40263, 99899, -3594, -123494, 147597, -186509, -90139, 147229, 28033, -81092, -297770, -304448, -67708, 127510, -113705, -100508, 181429, -25399, -69537, -135089, 175703, -112899, -114730, 94369, 222688, 46849, -16506, 99222, -135813, -86388, -120183, -77580, 32748, 103852, -43199, -315559, -239426, 101762, 248771, -128383, -34832, 123328, -47215, 103997, -51339, -37315, -11904, 150117, -15004, 44309, 383013, 68747, -242489, -145008, 20341, -314255, -81896, 128414, -113613, 236914, -71178, 72443, 30531, -246777, 81018, -155955, -159207, -7569, -133379, 38660, -4280, 250381, -46769, 45120, 162535, -59335]
15861a11214A28495a96648B37568G2789l1257e9251A34438a30969D3897a00457
15850I6156M51346i2456m3966B30463b28753A6043J72778b8763A88938k8953K0547
15839A80532i0627B5155a20740K6928A26012a32843l7685F8903j1849J27676m5603
15828A39127f9800Q660k26329g4336c0199B65350g3184j81925g3065C9286J92929
15817B32215a12403B69752g6132q2191L1127l8901b1866k06809D0541a29580B5257
15805d29973C7289b00815d895H1917R755R951c3647A40679o0889c0842B9706a53717
15792d62240a60289d6989K1118B8884P1662g0831k09656i4055A15799J22855G5883
15780b02949A0664a08218L4707k53811a45844L6391j12168j77566A47445m6105
$$ y = [-111214, 128495, -196648, 237568, 72789, 41532, -59251, 134438, -130969, 43897, -100457, 96156, 547502, -92456, -136422, 230463, -228753, 16043, 188821, -28763, 188938, 159985, 180532, -90627, 25155, -120740, -93812, 126012, -132843, -170528, 68903, 57054, 184730, 139127, -69800, -61140, -287469, -74336, -30199, 265350, -73184, -255109, -73065, 39286, 232215, -112403, 269752, -76132, -158323, -127196, -166097, -21866, -228675, 40541, -129580, 25257, -429973, 37289, -200815, -4895, 81917, 91672, 101623, -33647, 140679, 79790, -30842, 29706, -153717, -462240, -160289, -46989, -25871, 28884, 100546, -70831, -280487, -94055, 115799, 238654, 75883, -202949, 10664, -108218, -73511, -327322, -145844, -109453, -221621, -399187, 147445, 101340]
15770A01340c52344f0008h5C7916J31530k2569A1940g7304F1932K53082b81739
15758B67903A31484Q0968r1146c281j74136A413a46964l777e1305G9935O5313
15747A45248r50J61497m7700c24787C083K26380F9139a92542k4615h2023p260
15736h9283j35989e6435C3678K5961Q571A6442M7314a01602F6725K9514e4363
15724b04057b6996A22988b54758l0819O2608n1525a33894f3540j88969F5889F316
15712b5796A31470m688a06981C1856A0247a58747C3888J03284b41994b6185B44574
15700a08255L6469A6580b3832k5747H1751a940G1526B9713c0542E5461P1268K33965
15688C60694a22255l086J0216F8523e7152l15586G5421A9526J65738n3265j5687
$$ y = [101340, -352344, -60008, -85, 37916, 169446, 146877, 11940, -77304, 61932, 315014, -281739, 267903, 131484, 212452, 121306, -3281, -177417, 1413, -146964, -150741, -51305, 79935, 145248, 144298, 305795, 258095, -324787, 3083, 229463, 69139, -192542, -217157, -82023, -89283, -225272, -56435, 33678, 59639, 68210, 16442, 63756, -101602, 66725, 96239, -54363, -204057, -26996, 122988, -254758, -285577, -222969, -274494, -133894, -63540, -252509, 65889, 6316, -25796, 131470, 126782, -106981, 31856, 10247, -158747, 33888, 137172, -241994, -26185, 244574, -108255, -71786, 16580, -23832, -49579, 81751, -1940, 71526, 29713, -30542, 55461, 126729, 360694, -122255, -125341, -115125, 68523, -57152, -372738, 75421, 19526, 185264, 131999, 116312]
15677A16312A638J98921a94188B07753i1381c3626I8507P2905b38617q9128b8613
15665b86190J16419p3725A53064c30390B28367c37075n5358A79902o2327B0536
15654G056J79254a5994m34086a59249i983L155j01366c510p7488B11989c13984
15642b62928i3614r2865k10571B8850b4361k06276a04594D6587a4301q5434B14714
15630A13783m0689o850g8955A07355m5317b61224F7567J9517H424J65861E7366
15618H7042b02921b6035o1432l59115a68393B01257a89825C8637b84530A64093
15607b85034q0372E5331a12483e3705j939a7907l9307A32171o5461j4018e5319
15595G1512J64324G4154N1097c86511H8225a39363C37112i2692H9784a65731e0500
$$ y = [116312, 1638, 200559, -194188, 207753, -91381, -33626, 98507, 171412, -238617, -327745, -28613, -286190, -169771, -243496, 153064, -330390, 228367, -337075, -392433, 179902, 117575, 20536, 7056, 186310, -15994, -450080, -159249, -9983, -6828, -108194, -3510, -80998, 211989, -313984, -262928, -93614, -186479, -397050, 28850, -24361, -230637, -104594, 46587, -14301, -99735, 214714, 113783, 73094, 66244, -78955, 107355, 62038, -261224, 67567, 87084, 8424, 174285, 57366, 87042, -202921, -26035, -87467, -446582, -168393, 201257, -189825, 38637, -284530, 164093, -285034, -365406, 55331, -112483, -53705, -55644, -17907, -57214, 132171, 66710, 52692, -55319, 71512, 235836, 74154, 125251, -386511, 88225, -139363, 337112, -92692, 89784, -165731, -50500]
15583C742N9244a91224h8782a6754j9020a2811D3542g4587D7303K9776d8683l53771
15571d02454A76169b5980E2863h9524j51169B30926h3276A92002D8023K93818
15561C41841e5514H6255a8080j60522A82779b63076b9070n7366I6210J8226j57
15550A14279m1149i8723A38428k7755a87777Q6648A52214i1968k9150a1152j43502
15539a54654b3270k28920o8194E7288M9778j3402b2468l63499a33463A86392e8612
15527C04213b31968A62384J29258a04377A97751r8526l3455e525j14349F7821
15516c98746A41299n0111O1851i6442J3308m8743A14654f6532K5271o5078a0113
15504e5256B5729K0909b50240d4754B222J22786B1709N1616R8722a09231A92693
$$ y = [3742, 62986, -191224, -88782, -16754, -35774, -12811, 43542, -74587, 47303, 77079, -48683, -402454, 176169, -25980, 52863, -89524, -240693, 230926, -83276, 192002, 48023, 341841, -55514, 86255, -18080, -178602, 182779, -263076, -29070, -86436, 96210, 114436, 114279, 73130, -98723, 138428, 110673, -187777, -101129, 152214, -91968, -121118, -11152, -154654, -23270, -252190, -320384, 57288, 107066, 93664, -22468, -385967, -133463, 186392, -58612, 304213, -231968, 162384, 291642, -104377, 197751, 99225, 65770, -5525, -119874, 67821, -398746, 141299, 91188, 153039, -96442, -83134, -131877, 114654, -66532, -41261, -106339, -10113, -55256, 25729, 46638, -250240, -44754, 2222, 125008, 21709, 73325, 172047, -109231, 192693]
15492C6295L2175B3026i2600K7356A08705a04800j50562J6318f8265K7283C6288
15480C4471a31534F7531a1560k64558B15495k8507g1944D6768a53880c1221B20098
15468A42954A145c148q3087k31666d382A00973L43868d1307B00703d12011F8431
15456C35703A5885J23897a015H0220A2536L15556b54256A34031l3802e69508C97376
15444c95A30135n1680M671L6621m9517b32645H9256C4347L59601c036A41791c57538
15431b78555A06778h0351p2843j02917i887B6851b21022B32079a40672B2433i1076
15419b5074B56388i3517A98928G9867b28085E0005J9599h9554B22240k1495a40474
15407G6894Q9908a91487g0097B5502I382Q3389j1396R5475a29772J6831A63117
$$ y = [36295, 68470, 23026, -92600, -65244, 108705, -104800, -255362, -239044, -68265, -40982, 36288, 34471, -131534, 67531, -11560, -276118, 215495, 186988, -71944, 46768, -153880, -31221, 220098, 142954, 1145, -3148, -86235, -317901, -4382, 100973, 444841, -41307, 200703, -412011, 68431, 335703, 15885, 139782, -1015, 80220, 12536, 328092, -254256, 134031, 100229, -569508, 397376, -395, 130135, 78455, 83126, 119747, 70230, -232645, 89256, 34347, 393948, -3036, 141791, -357538, -278555, 106778, -80351, -153194, -256111, -9887, 26851, -221022, 232079, -140672, 22433, -91076, -25074, 256388, -93517, 198928, 79867, -228085, 50005, 69604, -89554, 222240, 200745, -140474, 76894, 166802, -191487, -70097, 25502, 9382, 92771, 81375, 176850, -129772, -112941, 163117]
15395a39902m8765d6094I4378J26173F2949g4087j62257Q1143e4517I7906B6405
15383a53685A20571K11220a29315A44221D4150a46803J7393D534N5825D753L08360
15372C13113J08016A7774b9691n6471A63323G4292M7632J03975g7826L5080j45831
15361a88577A83539m5697M2080f1488A52067J00832A15382m2429J20292d945C39879
15349a11432G7293j8798b91470A69778p9434c41176I1699H472g7385A42263b40621
15337A81193O4392g8072B16984b01827g1118F3305k936J55974C2414J1586j164
15326D2836b5179A310L26211b3789h019j56192J3499D1837b9243G8182g8707F3080
15313A28495a47316A64544O0964L6712h0648B01463b03474A61954o9866i7940
$$ y = [-139902, -188667, -46094, 94378, 220551, 62949, -74087, -236344, -155201, -54517, 97906, 26405, -153685, 120571, 331791, -129315, 144221, 44150, -146803, -129410, 4534, 60359, 4753, 313113, 421129, 17774, -29691, -86162, 163323, 74292, 121924, 225899, -77826, -42746, -188577, 183539, 137842, 179922, -61488, 152067, 252899, 115382, 72953, 193245, -4945, 339879, -111432, 77293, 58495, -291470, 169778, 90344, -341176, 91699, 8472, -77385, 142263, -240621, 181193, 245585, -78072, 216984, -201827, -71118, 63305, 60369, 216343, 32414, 44000, 42836, -25179, 1310, 327521, -23789, -8019, -164211, -150712, 41837, -29243, 78182, -78707, 63080, 128495, -147316, 164544, 225508, 262220, -80648, 201463, -203474, 161954, 92088, -97940]
15302d468D7287b7429A72760K3003E9009K41511G644K56786b33500D54835D1086
15290d3D23471a98166B99437E3083J50860o9938F4873a25911A15736e577A85723
15278h6969m1869c8223k70674C8228K9811K36782A47838f3924A9463a71388A17715
15266b06224c7419A65661F0093j5650J14580B9094a06130L4706A03344d4703C241
15254A60617O5291l6571L16869O78262n82154r8583M36180m25594j39637h8590
15243B87802e0227k00590M0773A98705b48546A70148k0038a66404B55115a11042
15232b1821B39109m6132Q758g5181q6966l7199D5952J7992f489n4654I9819i7931
15219a83891C41063j34269d69253B39524b01339A36087R4473i5854B8572K20648
$$ y = [-4468, 47287, -27429, 172760, 195763, 59009, 300520, 7644, 264430, -233500, 454835, 41086, -43, 423471, -198166, 299437, 53083, 203943, 134005, 64873, -125911, 115736, -5577, 185723, -86969, -128838, -38223, -308897, 38228, 68039, 304821, 147838, -63924, 19463, -171388, 117715, -206224, -37419, 165661, 60093, 44443, 159023, 29094, -106130, -71424, 103344, -44703, 3241, 160617, 225908, 189337, 506206, 1184468, 602314, 503731, 939911, 514317, 374680, -88590, 287802, -50227, -250817, -210044, 198705, -248546, 170148, 150110, -166404, 255115, -111042, -21821, 239109, 192977, 201735, -75181, -162147, -199346, 45952, 63944, -6489, -61143, 99819, -97931, -183891, 341063, 206794, -469253, 239524, -201339, 136087, 230560, -95854, 28572, 249220]
15209B49220N389C1089J9099O458L3649a36325A82076a0652A65656a53329A37687
15197A66381C4904J00482J21643j02262c7409A72657K8943j1790m6035G0794a36175
15185C1957K87582a17194j43432J28495A36384M8698b30062H0827g3207A97374
15174A93467C457N6036a05783C24016m198g34p436A50162a66954H9397Q4828L6480
15162B10705L01375A20265c15795A27152N7097a59646p5047i1482A98647o3375
15152A35272l3264K89401p7702n7765l6013C7313a92489C38870A52465m1094i9345
15140D7291K52170A5298K00974K63636B22898L6112j9339r9763a136B45854b1532
15128A88966d288A78790k1210J1563D8382g177A86859E538a23628A78848q4118
$$ y = [249220, 254609, 31089, 50188, 56646, 90295, -136325, 182076, -10652, 165656, -153329, 137687, 166381, 34904, 135386, 257029, 154767, -37409, 172657, 201600, 189810, 143775, 70794, -136175, 31957, 319539, -117194, -260626, -132131, 136384, 185082, -230062, 80827, -73207, 197374, 193467, 3457, 59493, -105783, 324016, 319818, -734, -8170, 150162, -166954, 89397, 174225, 210705, 512080, 120265, -315795, 127152, 184249, -159646, -234693, -91482, 198647, 135272, 102008, 391409, 313707, 255942, 219929, 37313, -192489, 338870, 152465, 111371, -99345, 47291, 299461, 15298, 216272, 479908, 222898, 259010, 239671, 139908, -1136, 245854, -21532, 188966, -4288, 178790, 157580, 169143, 48382, -7177, 186859, 5538, -123628, 178848, 94730]
15117I4730a3564B86664j22308M6908e296E461a58038D8944K966L20423a05432
15105A12790j3111a16179D3957a37569B71722M202Q0310e8961A31420a24596B47843
15093D8862a0039A41613C6192J23686a28882A92937J75803J92412B32078O708
15083B38786h2395A81905A100K67770k1625p1283K4401e9773B48360a11577d6072
15071B10731J44659p5975k2996p1741E2121N0355K81702a84397c3754B26691J1804
15060B38495R2435A53112m4678K95187A25340J56185j08066l2305K05712A38968
15049B60483l1539J3839N46K81741B46332A9590O0087K80030n4088J70510I1005
15037C99128L4530H0332J62736B007K85215p9284J55528A75587K05770A52544
$$ y = [94730, -13564, 286664, 164356, 211264, -5296, 5461, -158038, 48944, 51910, 372333, -105432, 112790, 99679, -116179, 43957, -137569, 271722, 275924, 356234, -58961, 131420, -124596, 247843, 48862, -10039, 141613, 36192, 159878, -128882, 192937, 368740, 561152, 232078, 238786, -82395, 181905, 1100, 268870, 247245, 175962, 200363, -59773, 248360, -111577, -46072, 210731, 355390, 279415, 256419, 184678, 52121, 102476, 384178, -184397, -33754, 226691, 238495, 330930, 153112, 108434, 403621, 125340, 281525, 173459, 141154, 346866, 138968, 260483, 228944, 242783, 243329, 525070, 246332, 19590, 79677, 359707, 305619, 476129, 91005, 399128, 433658, 80332, 243068, 2007, 287222, 207938, 363466, 175587, 381357, 152544]
15026b5189C93562m9738N7317a01035B41561k368l4787J53530O0070k08682C1286
15014A97115C3682d0452H7172K47306j63144G2357J45685a43890B81875o6681
15004B15194H2181O268Q4347J87058j62079F2097f6150B0392J45606n0683J00797
14993B16112j8098L70477B77584J17500j00836K2726I2050N26764B33153O1510
14983B94663D5030M45209o9075J9164q8220d5552A67633h3020B8467e0776B67738
14971B35338q6365j4006D4184M0761K97645r9178L27705j78553K7201B7033K9929
14960E6962L42114o5901j3370L0950j12605L29653n3502A54020L4872K83258q5154
14949C86996J32678p8590A50726J7512J24453O1382j29907D3223K69001a23758
$$ y = [-25189, 393562, 343824, 401141, -101035, 241561, 239193, 204406, 357936, 418006, 209324, 31286, 197115, 33682, -40452, 87172, 334478, 171334, 72357, 218042, -143890, 281875, 215194, 82181, 88449, 172796, 359854, 197775, 62097, -66150, 20392, 165998, 115315, 216112, 198014, 568491, 277584, 395084, 294248, 316974, 92050, 618814, 233153, 294663, 45030, 490239, 421164, 440328, 352108, -45552, 167633, -83020, 28467, -50776, 267738, 235338, 148973, 134967, 44184, 84945, 382590, 283412, 611117, 432564, 459765, 27033, 56962, 399076, 333175, 319805, 350755, 238150, 567803, 514301, 154020, 188892, 472150, 386996, 519674, 441084, 150726, 168238, 292691, 354073, 224166, 43223, 312224, -123758]
14938E33235P1243k5718k56343q9908L36024B18039Q3079c320l6113E79636B11145
14926E10891j25117j73997o8590J43749l7260K11340j81887L6843o2797J51544
14916D04719j79152J22104J39559n2932O8471L52806C76793J34764L8739A99799
14905B07899j0016J28464j61834L21731L1573j84869J6720J07373K26998B63152
14894C9057J36267J45268Q91K5547A18896K79905N8226A72N42120j32015R2847
14883E03124j13569J830o0230J23454k9696r7920M9248m6933m8947j877A25996
14871E15005A13307M32365j65896l4749M2131j80152K21584O1299B27472L02712
14861E30184j03095k07399R6581K08018M8635m9895K3616r7079K9505j41088j29311
$$ y = [533235, 604478, 578760, 322417, 232509, 568533, 218039, 301118, -3320, -39433, 579636, 211145, 510891, 385774, 211777, 143187, 286936, 249676, 461016, 279129, 315972, 253175, 404719, 225567, 347671, 487230, 434298, 502769, 855575, 376793, 511557, 550296, 199799, 207899, 197883, 326347, 164513, 486244, 517817, 332948, 349668, 457041, 684039, 263152, 39057, 175324, 320592, 321483, 347030, 118896, 398801, 457027, 172, 542292, 410277, 503124, 389555, 391385, 331155, 454609, 424913, 326993, 376241, 329308, 280361, 278484, 125996, 515005, 113307, 545672, 379776, 345027, 387158, 207006, 428590, 489889, 227472, 530184, 427089, 219690, 316271, 524289, 572924, 523029, 546645, 449566, 479071, 337983, 208672]
14850B08672n8210N09170k60327M6435J37742B23070L21896L7872k7275j29473
14840D26090A53504L12563P661A28010Q09351m57109J77410k99913A28650N33068
14830F61718p8800j44223J28585A76860J85685k025K7270O3034j08813K90155
14820F32166B96538K36530j53209k4800L03446B85780J92291N7998k02872L26331
14810F59528p1488M7982k03258j37870Q3626P5808J21193k54714J19547M44214
14800H84568l69849J19038j88248K90074j47257k41526J28217j20593K74096B25346
14789E62800o5j77597K01946L77078C93757J17887N2957A46623L89464K05347
14779G41434l08813K41682j86794n5125K00674j66284L290A73734L08365L12573
$$ y = [208672, 150462, 659632, 399305, 445740, 583482, 223070, 544966, 582838, 555563, 426090, 153504, 466067, 473728, 128010, 937361, 480252, 657662, 357749, 128650, 661718, 582918, 438695, 567280, 176860, 362545, 360520, 387790, 450824, 342011, 632166, 296538, 533068, 379859, 355059, 658505, 285780, 478071, 536069, 333197, 659528, 588040, 636022, 432764, 294894, 378520, 454328, 575521, 320807, 440354, 884568, 514719, 633757, 445509, 735583, 588326, 346800, 475017, 354424, 628520, 225346, 562800, 562735, 385138, 587084, 964162, 393757, 511644, 564601, 146623, 536087, 741434, 432621, 674303, 487509, 432384, 633058, 466774, 470064, 173734, 482099, 794672]
14769G94672B65437R5452M55359k77344J60491L0574j29060L32960j48134k3687
14759G62048m7761B28758L83495k9083L61032l52421q7329K24700o9482j54095
14749E05575K43181l5367k97426J74872j23848K50165O7283j98118P5436J57879
14739H19632P7928D35988O37646m24106p6489R3197K8244q8354K21886l0920L2796
14728H29888j53535J15247j30030j36301J65049K8822k06577L14513L23917k16503
14718I34490k54177r7715O71302l36194l7240o7691k0683j99164K38810j66174
14708F65564M6608C50725N43476j12669O5637J13829j5458L9946k9128l60203
14698E96155J44497K82762j43488j12752J42849Q761j00583K13912k43579J87471
$$ y = [794672, 265437, 360889, 816248, 538904, 699395, 729969, 600909, 933869, 785735, 762048, 714287, 228758, 612253, 583170, 944202, 591781, 504452, 729152, 659670, 505575, 748756, 713389, 415963, 590835, 466987, 717152, 784435, 586317, 661753, 819632, 897560, 435988, 1073634, 649528, 573039, 666236, 694480, 606126, 828012, 797092, 829888, 676353, 791600, 661570, 525269, 690318, 719140, 512563, 827076, 1150993, 934490, 680313, 582598, 1253900, 917706, 880466, 812775, 792092, 592928, 831738, 665564, 712172, 350725, 894201, 781532, 847169, 960998, 945540, 985486, 956358, 596155, 740652, 1023414, 879926, 767174, 910023, 918784, 818201, 1032113, 788534, 976005]
14688I76005J3337J89859m32022j9781J67316k4945L20217l79193K07543K71068
14678A289404m64757J88348j11999R7660l07510J06732K41764k04166N189M57746
14668A298411m18495R4328K95478m19656K03287K63450n26972M24002L3690l37471
14658I10052J61048J30495j31058m9155K2540J3668l9365l7547K9038j30184J21588
14647A001120J77001J89001k62347j25217J94877m6865L7414J56609p6773j28707
14637A116113j32948J72282L2914O115J52552J30297k07736m1790R2494k38674
14627A081619O2573N05225l00565J97689k9039m00286J89859l6586P9755l1036
14617A319208m3432J02823j1679l6643K36810k76618J27717K61338k90365J54708
$$ y = [976005, 989342, 1179201, 747179, 727398, 894714, 869769, 1189986, 810793, 1018336, 1289404, 824647, 1012995, 900996, 998656, 691146, 797878, 1039642, 835476, 840665, 1298411, 879916, 974244, 1269722, 850066, 1053353, 1316803, 789831, 1213833, 1247523, 910052, 1071100, 1201595, 1070537, 1021382, 1043922, 1057590, 1018225, 980678, 1009716, 879532, 1001120, 1178121, 1367122, 1104775, 979558, 1174435, 1127570, 1164984, 1321593, 1244820, 1116113, 983165, 1155447, 1188361, 1194476, 1347028, 1477325, 1269589, 1227799, 1320293, 1081619, 1144192, 1649417, 1348852, 1546541, 1517502, 1117216, 1307075, 1270489, 1350244, 1319208, 1275776, 1378599, 1366920, 1330277, 1567087, 1290469, 1418186, 1679524, 1389159, 1543867]
14607A543867j36474r0111J12992j23547K14334j19603J13294R9963j7123N6245
14597A653837J67063l06699L85392m81205L47365j93797J90032J26364q4538M2298
14587A846112J9731l14848K18293L8714R572p9951o8326K07391l1074P0254q1304
14576A834564K96166l11587J29337L70950j35561q8108J64391n75326L33932L90925
14566B409683N9377J03091j79328L30134k45263j56549L74809K15499p7592K18410
14556C052271N9047M84923O8448L07283L62340Q65362J976295K646538O164891
14547A5987398O600744J1766244l314190j5194080p590534l134831j214171j101160
14539B805420k81122k06279j67160J24962q542N8384k51062K58228j89176J82469
$$ y = [1543867, 1407393, 1317282, 1430274, 1306727, 1521061, 1401458, 1514752, 1614715, 1597592, 1653837, 1820900, 1514201, 1899593, 1418388, 1765753, 1571956, 1761988, 1888352, 1803814, 1846112, 1865843, 1550995, 1769288, 1808002, 1817574, 1737623, 1669297, 1876688, 1845614, 1915868, 1834564, 2130730, 1819143, 1948480, 2319430, 2183869, 2095761, 2260152, 1684826, 2018758, 2409683, 2469060, 2572151, 2392823, 2722957, 2477694, 2321145, 2695954, 2911453, 2833861, 3052271, 3111318, 3596241, 3664689, 3971972, 4334312, 5199674, 7175969, 9822507, 15987398, 22588142, 34354386, 31040196, 15846116, 8255582, 5120751, 3906580, 2805420, 2524298, 2318019, 2150859, 2275821, 2267279, 2325663, 2074601, 2332829, 2143653, 2326122]
14529B326122L15503m19309R2519o1635j07969R1761J58137m7604K67918O2798
14519B678241j08251l95159O75506l11335n8613K42694N5400l41803K73395N6962
14509B767037J93855l96378M25058o60491L72909K74536R806j82513Q9815Q2802
14499B976436J57523l35954O21478l83109K0541J95620J62502j46017K88347j42126
14489C415241n913K22805j6882M5755l23143J35397L19417k93545K45789K38512
14479C983433k53083L13032j13458J22528r3321Q3042L186J43320Q1190q4455
14469D185414q1010J22185J43367K01629j07140j28866M632K28553k2412J9662
14459D566014L60704j58812J28247J43162k967j98157J2588K21678M25926N1021
$$ y = [2326122, 2641625, 2222316, 2314835, 2253200, 2145231, 2236992, 2395129, 2347525, 2615443, 2678241, 2569990, 2174831, 2850337, 2539002, 2480389, 2723083, 2778483, 2436680, 2710075, 2767037, 2960892, 2564514, 2989572, 2329081, 2701990, 2976526, 2986332, 2803819, 2893634, 2976436, 3133959, 2798005, 3419483, 3036374, 3056915, 3252535, 3415037, 3269020, 3557367, 3415241, 3409328, 3632133, 3615251, 3661006, 3337863, 3473260, 3792677, 3499132, 3744921, 3983433, 3730350, 4043382, 3929924, 4052452, 3959131, 4042173, 4045359, 4188679, 4269869, 4185414, 4104404, 4226589, 4369956, 4571585, 4464445, 4335579, 4340211, 4568764, 4546352, 4566014, 4926718, 4767906, 4896153, 5039315, 5036348, 4838191, 4850779, 5072457, 5498383, 5549404]
14449E549404k05055P5843l9880K3239Q0221K8272M08783k52392K39565P1296
14439E979296J92060k9785j68380L14849J21960m8011k32079J54522N09437m8847
14429F745022K22968j30408M6660K45800R1023J48471N5595P1027J09915k5442
14419G580631L13191m8766L12125L4551L02959l18445P67927l99392N44435P3840
14409I163056j40358J20473J54949J17565J75586L2935L56824K90234j01333L79708
14399A0549639k53736L56976J83481L61677J47600K85782P2022j54983L85584
14390A1934042N40908J2692K53051J54120K94222J69753J58402J25623K70996
14381A3913809K56284l7492O47051L26565K76701K12116L53252L37833N25377
$$ y = [5549404, 5344349, 5420192, 5380312, 5403551, 5483772, 5512044, 5920827, 5668435, 5908000, 5979296, 6171356, 6141571, 5973191, 6288040, 6410000, 6361989, 6129910, 6284432, 6793869, 6745022, 6967990, 6837582, 6884242, 7130042, 7221065, 7369536, 7425131, 7496158, 7606073, 7580631, 7893822, 7845056, 8157181, 8191732, 8494691, 8176246, 8944173, 8544781, 9089216, 9163056, 9022698, 9143171, 9298120, 9415685, 9591271, 9624206, 9981030, 10271264, 10169931, 10549639, 10295903, 10652879, 10836360, 11198037, 11345637, 11631419, 11703441, 11548458, 11934042, 12474950, 12487642, 12740693, 12894813, 13189035, 13358788, 13517190, 13642813, 13913809, 14170093, 14132601, 14779652, 15106217, 15382918, 15595034, 15948286, 16286119, 16811496]
14372A6811496j19466N57289L44119K59725M06234N33359J71480M97400L92666
14363A9854302N93946O8028P15074L56857N81176M42844P30271K51085R19418
14354B4513001L47090M71742O79070N32879R54523O18115O56561N56649Q27640
14345C0157270P06944Q35697P71089O44585J368278O92182R49854R10820J264682
14336C8301401R04282J541850J038405J457086R26906J668107J296209J404510
14328D8538756J321181J910187J634307J880170J850805J700366K066640K419678
14320F3322090J799140K779809K265713K871854K580218L008788K879061L282409
14312H4789082L239983M081078L233099M118469M047685M503938M831474N120107
$$ y = [16811496, 16692030, 17249319, 17593438, 17853163, 18259397, 18792756, 18964236, 19461636, 19854302, 20448248, 20516276, 21231350, 21588207, 22169383, 22612227, 23342498, 23593583, 24513001, 24860091, 25331833, 26010903, 26543782, 27498305, 28116420, 28772981, 29329630, 30157270, 30864214, 31699911, 32471000, 33115585, 34483863, 35176045, 36125899, 37036719, 38301401, 39205683, 40747533, 41785938, 43243024, 44169930, 45838037, 47134246, 48538756, 49859937, 51770124, 53404431, 55284601, 57135406, 58835772, 60902412, 63322090, 65121230, 67901039, 70166752, 73038606, 75618824, 78627612, 81506673, 84789082, 88029065, 92110143, 95343242, 99461711, 103509396, 108013334, 112844808, 117964915]
14304A17964915N362437N568089N635685O681789O209560P128095P506719P857780
14296A69915069Q303897Q368319R408029R753179J0596328J0416566J1482400
14289B38243787J1795990J2358569J2571144J3180021J3159955J3697605J4190738
14282C29197809J3678847J3903568J3564161J3155867J2337553J1362187J0123768
14275D17323760Q648145N975673K457285M10568J33132l14554k204448m633248
14267D27796313o054657o793915q797699j0336262j1401580j3241703j4009023
14260C57161474j4359490j4517387j3978569j4205415j4123939j3397264j3329756
14253B59249654j2403670j1723854j1831707j0944003j0463398r430815r302895
$$ y = [117964915, 123327352, 128895441, 134531126, 141212915, 147422475, 154550570, 162057289, 169915069, 178218966, 186587285, 195995314, 205748493, 216344821, 226761387, 238243787, 250039777, 262398346, 274969490, 288149511, 301309466, 315007071, 329197809, 342876656, 356780224, 370344385, 383500252, 395837805, 407199992, 417323760, 425971905, 431947578, 434404863, 434815431, 434948563, 434634009, 432429561, 427796313, 421741656, 414947741, 406150042, 395813780, 384412200, 371170497, 357161474, 342801984, 328284597, 314306028, 300100613, 285976674, 272579410, 259249654, 246845984, 235122130, 223290423, 212346420, 201883022, 192452207, 183149312]
14246A83149312q997951q206950p424991p454750p263407o362694o732597n342706
14238A25363266n262430m959665n284603m574171m293672m198010l736915l404661
14230H9649139l330776l565858l376368k946683l052457k542968k904566k262205
14222F5667258k357938k102590j872024j974737k180610j622884j633758j797024
14214E0125693j341923j240922j512461j417883j451021j190305j205635q54487
14206C9911056j035636j480367j063621o36742j304899n20540j059295p83416
14198C2026540q42859p91419j191626n27635m47345q47657p89055p05995l11404
14189B5571545n29401p96573l77950q16760k53772m94684n46608n16994k88703
$$ y = [183149312, 174151361, 165944411, 158519420, 151064670, 143801263, 137438569, 130705972, 125363266, 120100836, 115141171, 109856568, 105282397, 100988725, 96790715, 93053800, 89649139, 86318363, 82752505, 79376137, 76429454, 73376997, 70834029, 67929463, 65667258, 63309320, 61206730, 59334706, 57359969, 55179359, 53556475, 51922717, 50125693, 48783770, 47542848, 46030387, 44612504, 43161483, 41971178, 40765543, 39911056, 38875420, 37395053, 36331432, 35694690, 34389791, 33869251, 32809956, 32026540, 31183681, 30392262, 29200636, 28673001, 28225656, 27377999, 26588944, 25882949, 25571545, 25042144, 24245571, 23867621, 23050861, 22797089, 22302405, 21755797, 21238803, 20950100]
14180B0950100o45472n41628k40105n03057j72929n59464n49794l56768l31144
14171A7049739l01088j03819m68546l86808l3820o08528k62167j38834k08639
14162A4537490m26897j17726k53921n19738J79601j5763k96941l18069j82231
14153A2585805j51110j003787L60672k68340k16881o6139m75591o7477k57058
14144A0440094Q600k7916m34291J77926o64435L30430k42328p0435k84698l05239
14134H927708O03129l66612k81230l19611k56120j2213N047k71951j16123R0490
14124H002514j65803j18741l85809M80405k57583J14458m62159J13470m08340
14115F912412j28449N9872J71928m53470p1948O8127j69030j99386q9720l4430
$$ y = [20950100, 20304628, 19763000, 19522895, 19019838, 18846909, 18287445, 17737651, 17380883, 17049739, 16748651, 16644832, 16176286, 15789478, 15755658, 15147130, 14884963, 14746129, 14537490, 14110593, 13992867, 13738946, 13219208, 13398809, 13383046, 13086105, 12768036, 12585805, 12434695, 11430908, 11791580, 11523240, 11306359, 11240220, 10764629, 10697152, 10440094, 10448694, 10420778, 9986487, 10164413, 9499978, 9830408, 9588080, 9517645, 9232947, 8927708, 9530837, 9164225, 8882995, 8563384, 8307264, 8295051, 8300098, 8028147, 7912024, 8002514, 7836711, 7717970, 7332161, 7812566, 7554983, 7669441, 7207282, 7320752, 6912412, 6783963, 6843835, 7015763, 6562293, 6490345, 6558472, 6389442, 6190056, 6100336, 6065906]
14105F065906K862l15455N01589n16232p8101k38238o3910K81738m6226R7747
14095E691680q6302o4008m75717O3170M4587J33933k42143j51020M8218k27413
14085D734985J6632K46479l40604M6907l08348L27800j69500j3329Q3685q00564
14075C824143O15565j73727J35261j66763J1619J32675l16048k54265M75592l97609
14065C886443r282K1015r2888j90505J75462m8629l38634K79517k53232M30018
14055C859285j64295j71026N3467q9194J41337j22226J1413k17881M0396l8013
14045C303263L4142j28894p0268K58903l69575J67510K44879q8976n97677L09152
14035C062459q7992j10390L99274m67215P3606o0065K0805J22401l64384j50691
$$ y = [6065906, 6068768, 5753313, 6254902, 5738670, 5660569, 5422331, 5358421, 5640159, 5593933, 5691680, 5605378, 5541370, 5065653, 5128823, 5173410, 5307343, 5065200, 4914180, 4962398, 4734985, 4751617, 4998096, 4657492, 4704399, 4396051, 4723851, 4554351, 4541022, 4624707, 3824143, 4439708, 4265981, 4401242, 4234479, 4246098, 4378773, 4062725, 3808460, 4284052, 3886443, 3877161, 3898176, 3805288, 3614783, 3790245, 3741616, 3402982, 3682499, 3429267, 3859285, 3694990, 3523964, 3577431, 3488237, 3629574, 3507348, 3518761, 3300880, 3341276, 3303263, 3337405, 3208511, 3138243, 3397146, 3027571, 3195081, 3439960, 3350984, 2753307, 3062459, 2974467, 2864077, 3263351, 2796136, 2869742, 2809677, 2830482, 2952883, 2588499, 2437808]
14025B437808L43043K3403l9603j14858k85059J15020J40120j58493j19127K53969
14015B596223j73636j10776j88165N5278P4349k3305l65644M15185L9482J10432
14005B429423l91199K98191m84867L38483J07547j94544j1993N3525o9808k55973
13995A818785n9231N81121j10059J60644M00953Q21594J853584L333305O994140
13986A5794836J3497367M215988j2035479r012535l851166k228606j325233r27404
13978D127768m98355j54440l76386j27747k65211m5616K5174k29184K1315j37054
13968B340264P7184o2201j58991K99434j38435k17249j53683K83275l1750j18719
13958B119129j34578J5178k45614L531m1062q559R4514J93040q8773q3408J12000
$$ y = [2437808, 2780851, 2804254, 2764651, 2649793, 2364734, 2479754, 2619874, 2461381, 2342254, 2596223, 2422587, 2311811, 2123646, 2178924, 2253273, 2229968, 1864324, 2279509, 2318991, 2429423, 2038224, 2336415, 1851548, 2190031, 2297578, 2103034, 2091041, 2144566, 2074758, 1818785, 1759554, 2340675, 2230616, 2391260, 2792213, 3613807, 5467391, 8800696, 15794836, 29292203, 33508191, 21472712, 12460177, 8609011, 6380405, 5055172, 4127768, 3629413, 3474973, 3098587, 2970840, 2705629, 2660013, 2685187, 2456003, 2477318, 2340264, 2417448, 2355247, 2196256, 2495690, 2357255, 2140006, 1986323, 2269598, 2237848, 2119129, 1984551, 1999729, 1754115, 1757646, 1716584, 1708025, 1802539, 1995579, 1906806, 1823398, 1935398]
13947A935398j50659o7968K61825m61561L83266J1737m56161L05611j05406J58386
13937A814468j82363r804q9274M02058k84855P6026r2536l46334M31578k07125
13927A511839j71909J43578m7920K03325j6494R0781M2999m98644L91456l34172
13917A314839K1986j36828J91551K56071j84724r0083J54165q1867M6410k58816
13907A232704M6076O2309J78859k4207K63678m53192n9529p7948j02973J33200
13897A198977k02813R2976K40473j84805K34321l03731J23005j7827k74171L53129
13887A259534r584O5377l27293L78677m43513L87182J0405k50431K90472k70209
13877A090617K12493j04133j15207J47093r7634Q0712k5087Q2210k98274J26982
$$ y = [1935398, 1784739, 1716771, 1978596, 1517035, 1900301, 1912038, 1455877, 1761488, 1656082, 1814468, 1632105, 1622301, 1533027, 1935085, 1650230, 1726256, 1633720, 1287386, 1718964, 1511839, 1339930, 1483508, 1435588, 1638913, 1622419, 1713200, 1756199, 1257555, 1649011, 1314839, 1336825, 1199997, 1391548, 1647619, 1462895, 1372812, 1526977, 1445110, 1491520, 1232704, 1278780, 1341089, 1519948, 1495741, 1759419, 1306227, 1246698, 1168750, 1065777, 1198977, 996164, 1089140, 1329613, 1144808, 1379129, 1075398, 1198403, 1180576, 906405, 1259534, 1249950, 1315327, 988034, 1366711, 923198, 1310380, 1320785, 1070354, 1360826, 1090617, 1303110, 1198977, 1083770, 1230863, 1133229, 1213941, 1188854, 1271064, 972790, 1099772]
13867A099772Q1640k6254j40871P350j00820L12683k23402K9204j2853k28928
13857G97521L16505P8733k57747m4688p8423R5650j92140K39690o2539J69369
13847A061931l3501j58775L00168O668l04356J98275k94684K52048l23825R2408
13837G96357M1795L85896k06809k47638L51709j38073M8100k93922J01304k09307
13827F29412r19J28541K01544J13763l32710J60757j00666k33071M53159j33496
13817H86314L748K9145k8988K42110O448m73526p4478J39509J66606m2955j13224
13806G40709J35852L6240O569m26247n6200L41655p4775l23131O37299D40064
13795I81520l1572j66451J18491n0759k70654J46730L2155l1293j40879J77788
$$ y = [1099772, 1181412, 1155158, 1014287, 1021637, 920817, 1233500, 1010098, 1039302, 1026449, 797521, 1114026, 1192759, 935012, 890324, 811901, 907551, 715411, 955101, 892562, 1061931, 1028430, 869655, 1169823, 1176491, 872135, 1070410, 775726, 1027774, 703949, 796357, 838152, 1224048, 1017239, 769601, 1121310, 983237, 1031337, 737415, 838719, 629412, 628493, 757034, 958578, 1072341, 739631, 900388, 799722, 566651, 1019810, 886314, 890062, 919207, 890219, 1132329, 1138777, 665251, 590773, 730282, 896888, 853933, 740709, 876561, 912801, 919370, 493123, 436923, 778578, 703803, 380672, 1017971, 440064, 981520, 949948, 783497, 901988, 851229, 580575, 727305, 759460, 728167, 587288, 765076]
13785G65076o1408L0875J21750Q5699j02695j2905k25204P0990K68919j95730
13775G45367P2295l76192M92230l51785L27421j59392k70370J41185k74000L70277
13765G17036J77132k6582D15085K27613J7930J81986R7037j55211j60528r2642
13755E31270m5523N420N18069m75681n4161O8135J70800l3772C17936M27434k50284
13744D95086K03219J62637l16676J18996l9535K23878j25774j38348K785j20371
13734D65897N32271m66748r7607O8370H0376O27671k78458J84223J40865j00930
13724F53747l4534J19347k4675j42555q3051k25696r0108K69022L5165m7511m1439
13713C87712K5229L9864N2062j91406K0170P1544K46169k15511j65617P4528k5055
$$ y = [765076, 703668, 734543, 856293, 941992, 839297, 826392, 601188, 672178, 941097, 745367, 817662, 441470, 933700, 581915, 909336, 749944, 479574, 620759, 346759, 717036, 894168, 867586, 415085, 642698, 660628, 842614, 939651, 784440, 623912, 531270, 485747, 491167, 1009236, 533555, 479394, 547529, 718329, 684557, 317936, 745370, 495086, 698305, 860942, 544266, 663262, 623727, 847605, 721831, 583483, 586268, 465897, 998168, 531420, 433813, 502183, 80376, 708047, 429589, 613812, 754677, 653747, 619213, 738560, 713885, 571330, 488279, 262583, 172475, 441497, 476662, 429151, 387712, 412941, 452805, 504867, 313461, 333631, 405175, 651344, 435833, 270216, 344744, 319689]
13702C19689K89464j25874J60906C15224L13904A38057M48134j75418K82906j15974
13692E77705j52545j53061K52433J56204j64875j53369R8947B21256m5874L92218
13682E67600j8261j41628N2942o5837O9348o3975L73602l33997M6271Q4402j51261
13671D19206K74308k99165O1143j67602J53420j02687P0570P0738L01745A53788
13660C85978l3998O2328A64941K69876j82836K16M2838K80940k28627j54395L76134
13649E69087B72485M4628P92j02354F7850J89810m0464K94290j24318J55976m8376
13638D94768n590H0900K15431J43699j05644K23361j84412p5914R3532J88247
13628E79200k26902J1799L01369k24801K16401A88028L70929A44712L94654n6859
$$ y = [319689, 609153, 483279, 644185, 315224, 629128, 138057, 586191, 410773, 693679, 577705, 425160, 272099, 524532, 680736, 515861, 362492, 461439, 221256, 175382, 567600, 549339, 407711, 460653, 394816, 464164, 400189, 773791, 439794, 486065, 570467, 419206, 693514, 394349, 455492, 287890, 441310, 338623, 409193, 479931, 781676, 153788, 385978, 351980, 414308, 164941, 434817, 251981, 252197, 295035, 575975, 347348, 192953, 569087, 272485, 317113, 317905, 215551, 67850, 257660, 217196, 511486, 387168, 543144, 494768, 489178, 80900, 296331, 440030, 334386, 557747, 373335, 297421, 390953, 579200, 352298, 364097, 665466, 440665, 657066, 188028, 558957, 144712, 539366, 482507]
13618D82507m6855j60687P8087F9270N51340j99073P3006q9509j39939J30750
13608C95845J0775K618P4295o9799J33883K47752B44387j01315K15334G2104N19861
13597E91965j67074m7034E5313K92083j24488J61596M1174j87229P0850K3639
13587C32938A23222J98263A13571J25324L57812B92419b9914B79985L6500N1248
13577C67733j16491p6929K68153j77265J60973J31005B78082H6628K96687j57445
13567B25870K07770J21755a54366B93916J41102l4449j16870J5051J58420k03851
13557B53319K55672a9120B15231M0007R9672k8806A11956M58661C562L11488L5191
13546C50241A35185E7972M48028a11112B19532K87882B51509K20874J49490A63820
$$ y = [482507, 435652, 274965, 353052, 69270, 620610, 421537, 494543, 405034, 265095, 395845, 406620, 409238, 483533, 413734, 547617, 795369, 244387, 143072, 358406, 72104, 591965, 424891, 377857, 55313, 347396, 222908, 384504, 425678, 238449, 309299, 332938, 123222, 321485, 113571, 238895, 596707, 292419, -29914, 279985, 316485, 367733, 251242, 174313, 442466, 265201, 426174, 557179, 278082, 86628, 383315, 225870, 433640, 555395, -154366, 293916, 435018, 400569, 283699, 298750, 457170, 253319, 508991, -19120, 215231, 255238, 354910, 326104, 111956, 570617, 3562, 315050, 350241, 135185, 57972, 506000, -111112, 219532, 507414, 251509, 472383, 621873, 163820]
13535D96038G9801J50221j14563C1246J78963n721J0710G8735K31947N0245m4176
13524C16751k038p9199m9178O2035F2629a33066D59455A49344k0555M30777B04942
13512A56702J12803K85448A04508M11531j83886Q7647j8415j79144K69821k22649
13502B69413K9749p1176k2305k4985P8978R9776L9835j60837o8143l9189A7625
13490B48222r169M5146k0073G0179j7681L7687a8594A84333J97421A34438K98776
13479D33214a20018B69137k2295J01757H9690L22026A81112B3245J92705R5430
13469C11380J4778o3677A7793c9183B08851m3112J50575n8325j28271E6217J64156
13458B20373J42929J02907A86608k8573Q6081F7269J05171L59241j89313l113
$$ y = [496038, 79801, 230022, 115459, 31246, 210209, 204488, 215198, 78735, 310682, 360927, 316751, 314713, 235514, 186336, 248371, 62629, -133066, 459455, 149344, 128789, 559566, 204942, 156702, 269505, 554953, 104508, 516039, 332153, 419800, 401385, 222241, 492062, 269413, 299162, 227986, 205681, 180696, 259674, 359450, 399285, 238448, 170305, 131116, 17625, 248222, 239053, 284199, 264126, 70179, 52498, 90185, -18594, 184333, 381754, 134438, 433214, -120018, 269137, 246842, 348599, 89690, 411716, 181112, 23245, 215950, 311380, 326158, 262481, 17793, -39183, 208851, 165739, 316314, 257989, 129718, 56217, 220373, 363302, 466209, 186608, 158035, 244116, 67269, 172440, 531681, 342368, 339255]
13448C39255j53737k4679G2663K12223j17545J45068d9021A06171L49783A90424
13437A26631O6519a9192A28730K96197H4592K76386A9281K66724A18042e6139
13426I4297C7608a56384B18586K6990Q3331P6094q0453H5630j959K02127K4393
13415C10191A09649N0707K40020j82894b252C55116D9865j0358J3881J64778c83635
13403C45397g4841k10790i468j0490C16226K25171A6439M09335A48959c0058i169
13391D03526a97127H162K50143r7229p7718j5270L48125A64057K31210E69J40403
13380A40972N2755j8646K54966L2909H0089J30504J24665G7503K35646B8846M24584
13369D53430j5514j72373P585i08B29549j08532L84739j48710J12934j71388k7119
$$ y = [339255, 185518, 160839, 72663, 284886, 167341, 312409, -49021, 106171, 455954, 190424, 126631, 193150, -19192, 128730, 424927, 84592, 360978, 19281, 286005, 118042, -56139, 94297, 37608, -156384, 218586, 245576, 328907, 405001, 324548, 85630, 83671, 285798, 310191, 109649, 160356, 400376, 217482, -2252, 355116, 49865, 39507, 53388, 218166, -383635, 345397, -74841, -285631, -9468, -19958, 316226, 541397, 16439, 425774, 148959, -30058, -9169, 403526, -197127, 8162, 258305, 161076, 83358, 68088, 416213, 164057, 395267, 569, 140972, 193727, 175081, 430047, 462956, 80089, 210593, 335258, 77503, 313149, 28846, 453430, 437916, 265543, 273128, -908, 229549, 121017, 505756, 357046, 469980, 298592, 271473]
13358B71473D7058K12984j2005i863D44014A24261J49618h3021C08753L5152q8251
13347B55654J61489a891D41536B07962e6365A40073f7750D13859A76441O3099
13337B39540m5979H6127K9447K7450J51456i0438A14937K6585E2451L15575K25983
13326E94009k09533A05678L2124G444b06213d7966A99081b2906A68741j2516J00740
13315B56965A12482F351K17586P0311d0341F6264l0567K27145I424J54594J06649
13304B70667f5213D79121A5101K03093a17564F3681c13361f7267C12551k5704
13294B86847q9694J87194J4201M9691G2429a83033k05874E3848J98581l8637G3369
13282E20329b05042B63789E853K40825K1705n637j07558R748j1932F2007b7961
$$ y = [271473, 47058, 260042, 248037, -9863, 444014, 124261, 273879, -83021, 308753, 343905, 255654, 417143, -1891, 441536, 207962, -56365, 140073, -67750, 413859, 176441, 239540, 193561, 86127, 115574, 143024, 294480, -90438, 114937, 141522, 52451, 368026, 594009, 384476, 105678, 137802, 7444, -206213, -47966, 199081, -22906, 168741, 156225, 256965, 112482, 6351, 223937, 294248, -40341, 66264, 35697, 262842, 9424, 164018, 270667, -65213, 479121, 15101, 218194, -117564, 63681, -313361, -67267, 312551, 286847, 197153, 384347, 398548, 448239, 72429, -183033, -388907, 53848, 252429, 213792, 73369, 520329, -205042, 263789, 5853, 246678, 268383, 262746, 155188, 164936, 153004, 62007, -27961]
13270D8416K04689b50992B13190J08742E8928c6228A11598a7209k3400A46193
13259D30282I702K79039F8285K03590i2316D08991j92137B5506K62188A7197F193
13247B36715p4794A02K6882L51256A22440m896K06399a0461I8454A4474L44191
13236C58665d4834A42092c1562C0121a19855G3616h5219A55549E7421c56213A83272
13224C2720O2646O4304g3044L2532B15411b33766C98208A62197J10193P5516i0763
13212A39804I461b3079B60336b25043E377J58b08093j8858A40395g5322H4491
13200D85134a07926A50642J68269A2622P214J14086J41211A30797C771J08048
13190A11819K95622G2929j039L74283A10379j623R0127f3177b1060m8371A81187
$$ y = [48416, 253105, -250992, 213190, 321932, 58928, -36228, 111598, -17209, -40609, 146193, 430282, 9702, 288741, 68285, 271875, -92316, 408991, 216854, 25506, 287694, 17197, 6193, 236715, 161921, 102, 26984, 378240, 122440, 117544, 323943, -10461, 98454, 14474, 358665, -44834, 142092, -31562, 30121, -119855, 73616, -85219, 155549, 57421, -356213, 183272, 32720, 95366, 159670, -73044, -40512, 215411, -233766, 398208, 162197, 272390, 347906, -90763, 139804, 9461, -23079, 260336, -225043, 5377, 5535, -208093, -226951, 140395, -75322, 84491, 485134, -107926, 150642, 318911, 12622, 19836, 133922, 275133, 130797, 3771, 111819, 407441, 72929, 71890, 446173, 110379, 108756, 198883, -63177, -21060, -69431, 181187]
13178b2577a437C1665K6584M6422a45350A40487L59122f4177G9357J24833b2314
13166D3791i4648C32786A27547P4352h8746B12345J2123K981A0835h7096j40775
13155b27871A17597L07974f8098B49319c41r5279C61784j22868f4559j5073a7019
13143g5303k8826A19061j4346J79304B2083a35951a7697j1066j56568l6730i4116
13131B04983c1935q3765j90042A06930J34647b41055e6140F5991K39336j24003
13121A81324J71334A4381a84122B15628c08992h2267A8262Q123J01667a10677
13110a35466C90886n7384f6333b3075A50911C37b86928C3371K53323A9489r657
13099I832J06325h2193C00700N2766A8761K41387d8171C9009h2894j50056A98099
$$ y = [-22577, -1437, 31665, 58249, 104671, -145350, 140487, 499609, -64177, 79357, 204190, -22314, 43791, -94648, 332786, 127547, 201899, -88746, 212345, 224468, 227449, 10835, -87096, -227871, 117597, 425571, -68098, 249319, -341, -95620, 361784, 238916, -64559, -79632, -17019, -75303, -104129, 119061, 104715, 284019, 22083, -135951, -17697, -28763, -185331, -222061, -94116, 204983, -31935, -115700, -305742, 106930, 241577, -241055, -56140, 65991, 305327, 181324, 352658, 14381, -184122, 215628, -308992, -82267, 18262, 26385, 128052, -110677, -135466, 390886, 333502, -66333, -23075, 150911, 337, -286928, 33371, 286694, 19489, 9832, 116157, -82193, 300700, 353466, 18761, 260148, -48171, 39009, -82894, -232950, 198099]
13087E2651g6699A5075J04651c16661B48750e7314H3366a30566q206D35692A14863
13075B30154C4598J80310l1436e5727A05899a5633B1552a12528B69497a77557
13064e3515A89479J8752D2578k90J31259E5934c1538B6275K33805e446F7452J85721
13052B53173L0063j20929Q5594A18671l086J32822B2093n277Q5024k4310K4383
13041A01913l3867Q5198b63784A48973a03325B18649q5955a07161A37167b41061
13030F9842K10740D7554J21495K61218k04877f0333I8387R4775E7367M8424m2325
13019F3466b48163e6660B23311l4012h5619I0624K3765Q0568e942A93986p5479
13008A18507a33029o3973B9634O6673K07236B3264J39062o9149b02183q2946f2814
$$ y = [52651, -76699, 15075, 119726, -316661, 248750, -57314, 83366, -130566, -138772, 435692, 114863, 230154, 34598, 214908, 183472, -55727, 105899, -15633, 21552, -112528, 269497, -177557, -53515, 189479, 208231, 42578, 42288, 173547, 55934, -31538, 26275, 260080, -5446, 67452, 253173, 283236, 162307, 247901, 118671, 115585, 248407, 22093, 16816, 101840, 77530, 101913, 68046, 153244, -263784, 148973, -103325, 218649, 132694, -107161, 137167, -241061, 69842, 280582, 47554, 169049, 430267, 225390, -60333, 98387, 193162, 57367, 105791, 63466, -248163, -56660, 223311, 189299, -85619, 90624, 114389, 194957, -5942, 193986, 118507, -133029, -197002, 29634, 96307, 303543, 23264, 162326, 93177, -202183, -285129, -62814]
12996B28709o8271c23189I0385R4667D1092j0187n552J92829J19380m7118j34893
12985A55551a11935A27269b06078C74767A22053Q6556F6274a17523q7722A42862
12974h9938K2745r7151a587q1847J0293k11387B1493o131c26k15231c4106J2446
12962b1660C05349A10368a39427E1144J90340e747B7751L7843a45659A28038M330
12951A32368K9517D3060b08897B40684h5962B11716d8040B60413F0632A0506a26343
12939g1730o210j12954J8018E3548Q8892l2335b8799G9709J33106b5651l0945
12928e6596A35221m3517e7549B35870A0054i4934C7964J28813g5800B94950A43287
12916a1139A10518b2413q4603q2054l6880B23732K3803p4102J4846J87043j73157
$$ y = [228709, 160438, -323189, 90385, 185052, 41092, 30905, 25353, 218182, 337562, 290444, 155551, -111935, 127269, -206078, 374767, 122053, 208609, 66274, -117523, -205245, 142862, -89938, -67193, -164344, -1587, -83434, -73141, -284528, 21493, 15362, -326, -215557, -34106, -21660, 305349, 110368, -139427, 51144, 241484, -5747, 27751, 65594, -145659, 128038, 132368, 161885, 43060, -208897, 240684, -85962, 211716, -48040, 260413, 60632, 10506, -126343, -71730, -77940, -190894, -172876, 53548, 142440, 110105, -28799, 79709, 212815, -25651, -56596, 135221, 91704, -57549, 235870, 10054, -94934, 37964, 166777, -75800, 294950, 143287, -11139, 110518, -22413, -107016, -189070, -225950, 223732, 247535, 173433, 188279, 375322, 202165]
12905B02165G7495J78676r2013e6065A39313h7109C03853O0046a02890B04420
12894F389a15116A48993Q2171r935c03745N8794D6499J16799m0478k3495a5034
12882I2729M17598h4157A13906h6326a532E3718a01164B4925J03782P6383b31109
12870a01825b7193j05502G4766l4010M7961b07333B7113b38067C6980K3330J73747
12859B34057a12387C68b05279N8677f4335B79503b0003F3912a50250b5471A71585
12847A54057O9331c1295e898B00372a74201A0663J29800a81583B5395a36646A31317
12835A57522j4530L9511c3609j64576A81214a00835f580m45495A79820E1617a02117
12823E3353J67903p3583B1655Q739L4564a28278l09242i5593a2327A8838L6381
$$ y = [202165, 77495, 256171, 164158, -56065, 139313, -87109, 303853, 363899, -102890, 204420, 6389, -115116, 148993, 231164, 221229, -303745, -244951, 46499, 163298, 122820, 99325, -15034, 92729, 510327, -84157, 113906, -86326, -1532, 53718, -101164, 24925, 128707, 205090, -231109, -101825, -27193, -132695, 74766, 40756, 88717, -207333, 27113, -238067, 36980, 60310, 234057, -112387, 368, -205279, -146602, -64335, 279503, -20003, 63912, -150250, -25471, 171585, 154057, 223388, -31295, -5898, 200372, -174201, 10663, 140463, -181583, 25395, -136646, 131317, 157522, 142992, 182503, -33609, -198185, 181214, -100835, -6580, -452075, 179820, 51617, -102117, 53353, 221256, 147673, 21655, 30394, 64958, -128278, -437520, -95593, -12327, 18838, 55219]
12812E5219N8431k9689a95369d224j09674j5804j17345B3281a82296B46154a51028
12800A6358a24640L124E0042d7240A96991C2261J12522f1060C06412a64470j22672
12789b87142M7044a14728q6324I2933c6411G0981N0638a52489I5043P81j0458
12778H5366N6822J80942j386j60722b76699a35604A89114H8224a89495c5839j28266
12767a64105K3405A35238M1592e8049j20716A44044a82411E853a67075h511j37092
12756a45603e914A96161r7198e6119J1909A63231F1280L23329A57747a39315D1865
12744A49580A5847i5972B0502c3692p4272A08964j3234j2105J97390c8899B93083
12732I3452A7160a03659L320a1146q3334B20044A03012c07221d1139A44217D7230
$$ y = [55219, 113650, 83961, -195369, -4224, -113898, -129702, -247047, 23281, -182296, 246154, -151028, 16358, -124640, -121516, 50042, -47240, 196991, 32261, 144783, -61060, 306412, -164470, -287142, -240098, -114728, -201052, 92933, -36411, 70981, 121619, -152489, 95043, 95824, 85366, 142188, 323130, 321744, 161022, -276699, -135604, 189114, 88224, -189495, -35839, -164105, -140700, 135238, 176830, -58049, -178765, 144044, -182411, 5853, -167075, -8511, -145603, -5914, 196161, 98963, -56119, -44210, 163231, 61280, 384609, 157747, -139315, 41865, 149580, 15847, -95972, 20502, -33692, -107964, 108964, 95730, 83625, 281015, -38899, 293083, 93452, 17160, -103659, -100339, -11146, -94480, 220044, 103012, -307221, -41139, 144217, 47230]
12720b07767B11038a53654b0628A08313J06369b07303A59614J07886k3336C0994
12709E48702o2160B18547J70444A50699K4127E6682k4844R935M6298a51573B21572
12697B6655K55667a01594B3048M19801a58260B10961J29967g6577k37236J50954
12687a62859A244P1364a4081H4461f4344D43490d5187L77r744C5378J19491F4381
12674A85671f287A75232e2439B54350b28598B72595h4401C26451A50702g2237
12663a58979G0365c13102B13400n3346p9182K09532I3154R6408J7971d2212k6365
12652f8577A72887a25471l5462B9218e6097a9909j26070A97331b77250i5322K946
12641i2376D6231a26048B20656q8672n6670a19390J6509l1122C1880J71874M673
$$ y = [-207767, 211038, -153654, -20628, 108313, 214682, -207303, 159614, 267500, 244164, 30994, 548702, 486542, 218547, 388991, 150699, 174826, 56682, 31838, 41773, 88071, -151573, 221572, 26655, 282322, -101594, 23048, 442849, -158260, 210961, 340928, -76577, -313813, -162859, 1244, 72608, -14081, 84461, -64344, 443490, -45187, -44810, -54554, 35378, 154869, 64381, 185671, -6287, 175232, -52439, 254350, -228598, 272595, -84401, 326451, 150702, -72237, -158979, 70365, -313102, 213400, 160054, 80872, 290404, 93154, 189562, 207533, -42212, -68577, 172887, -125471, -160933, 29218, -56097, -19909, -145979, 197331, -277250, -95322, -92376, 46231, -126048, 220656, 131984, 75314, -119390, -102881, -134003, 31880, 203754, 208427]
12630B08427n1857f7716C33081j01245K6660c1261J0976A19596M0664C6874a17969
12618A62512b03093C2663a4812B1163a04275a8879E6437J11698b22999j85643
12608d08642A02562a15022C0436M023A2665J86829c8260a8524C10939h25j10434
12597a11259A88166F5018n140a32880A29409n8164b88897A74509K6007r3443R0208
12586A97281b59963D6998g8504k28088F6630L3295a9923I8012a35160b1863C05807
12574h5372A4006L2969a8555F3885c0757B64696e4704m1334J8840j11431B30315
12562c3106j16282C5938K7266c13564B96028E9289B005M11386F4520E581d1025
12550e7630A86561g6318q3659c8300A31526D8557J67333G6105b95264F8767o93
$$ y = [208427, 156570, -67716, 333081, 231836, 258496, -31261, -20285, 119596, 160260, 36874, -117969, 162512, -203093, 32663, -14812, 21163, -104275, -18879, 56437, 168135, -222999, -408642, 102562, -115022, 30436, 34459, 12665, 199494, -38260, -18524, 310939, -825, -111259, 188166, 65018, 59878, -132880, 129409, 71245, -288897, 174509, 200516, 107073, 197281, -259963, 46998, -78504, -306592, 66630, 99925, -19923, 98012, -135160, -21863, 305807, -85372, 14006, 46975, -18555, 63885, -30757, 264696, -54704, -96038, -77198, -188629, 230315, -33106, -149388, 35938, 63204, -313564, 296028, 59289, 2005, 413391, 64520, 5581, -41025, -57630, 186561, -76318, -159977, -38300, 131526, 48557, 215890, 76105, -295264, 68767, 68074]
12539F8074a736j95110f2515b1829p6203r202k6719A24527k1356a7951A56651
12527a0723C62608A40559K5468n8731n201N8090C3368a13876a8667D2950a88759
12515b068H1823j5453a14125A70699m2425A516J43311F687h4125C23417I9234
12503D3654d3551A2649a99376G8541l8241L21666a092j65927k2185B08976F7471
12491A22722J13188C392c48343A19023a8856j0850A74121g415m29524I6899c303
12479i1003B10525a22880E605b42473J02412A96163o6332h7867I8606b21675A6912
12467d57238b06534j59118d3975A9283d1959A70007A774a74533B28755j1242i2525
12455a04790A4606L0672a81011A71714F435c51208a21400B97685N416h2336F0472
$$ y = [68074, -1736, -196846, -62515, -21829, -98032, -107234, -133953, 124527, 103171, -17951, 156651, -10723, 362608, 140559, 166027, 107296, 102095, 160185, 33368, -113876, -18667, 42950, -188759, -2068, 81823, 66370, -114125, 170699, 128274, 1516, 144827, 6687, -84125, 323417, 99234, 43654, -43551, 12649, -199376, 78541, 40300, 361966, -1092, -167019, -189204, 208976, 67471, 122722, 235910, 3392, -348343, 119023, -18856, -29706, 174121, -7415, -436939, 96899, -3303, -91003, 210525, -122880, 5605, -242473, -140061, 196163, 129831, -87867, 98606, -221675, 16912, -457238, -206534, -365652, -43975, 19283, -41959, 170007, 1774, -174533, 228755, 217513, -92525, -104790, 14606, 45278, -181011, 171714, 6435, -351208, -121400, 297685, 303101, -82336, 60472]
12443c6572J6177A2089c5034G5121e73967B1613a67265A42006E765a41879G1709
12431a1931I0096D0943q012J86875F5416a19596k19506a55763A4064h8757A23293
12419d0930F9436c6817k77286i1793q5324G4044K2140c46985J51216A72702K5832
12408A98534B7722d5325j5306j04183A80043E9785L5428c02178A2668d23467A72204
12396G1151e6718P527j9738m3854G484e6512C06976d4119A4833g4006q3209H6683
12383A45500b32242A55318d6948B55491N8311c14178A75316a10848A30460K49019
12373C79479j24119j17324L3061a63703A74278j3206a9384A86846C686K84513
12363B88199I476c4749k6750l06662a76499A98134J56172b72745G0853F440a20054
$$ y = [-36572, -20395, 12089, -35034, 75121, -573967, 21613, -167265, 142006, 5765, -141879, 71709, -11931, 90096, 40943, 32931, 219806, 65416, -119596, -339102, -155763, 14064, -88757, 123293, -40930, 69436, -36817, -314103, -91793, -177117, 74044, 96184, -346985, -195769, 172702, 198534, 27722, -45325, -60631, -164814, 180043, 59785, 95213, -302178, 12668, -423467, 172204, 71151, -56718, -49191, -68929, -112783, 7484, -56512, 306976, -44119, 14833, -74006, -157215, 86683, 145500, -232242, 155318, -46948, 255491, 313802, -314178, 175316, -110848, 130460, 379479, 255360, 138036, 171097, -163703, 174278, 161072, -19384, 186846, 3686, 288199, 9476, -34749, -61499, -368161, -176499, 198134, 354306, -272745, 70853, 6440, -120054]
12351b73331D29806b7278f021A75723a07774N436q3166D1120j1538K02768c4593
12339b62833J31252c4829E3878R012i3610j98473N040a29894j6914J4973H3285
12327A53280G2691R500j15K67622b27650A75178f082m0415B20616B0003f1417
12315d2210J4893q0008a4604j56262K2338C3225R1363c00464B2957c1546A0838
12303c75865J83572F5037A3703N5208b796C47373j4967a44973l79576c4788G450
12291c94372H7843e6868f414r0707D34O2848c5226A78996K2765a83963A3543P2343
12279H5886J46B010J11634d2264r214A98612G1526J3382e6789n7271A77980D4457
12266B21556j01148O2923c6017C5922e6371N574J7230A25455a3128k3103A329
$$ y = [-273331, 429806, -27278, -6021, 175723, -107774, -102338, -185504, 41120, 29582, 232350, -34593, -262833, -131581, -34829, 53878, 62890, -93610, -292083, -287043, -129894, -146808, -131835, 83285, 153280, 72691, 82191, 82076, 349698, -227650, 175178, -6082, -46497, 220616, 20003, -61417, -42210, -27317, -107325, -14604, -170866, -148528, 33225, 124588, -300464, 22957, -31546, 10838, -375865, -192293, 65037, 13703, 68911, -2796, 347373, 332406, -144973, -524549, -34788, 7450, -394372, 87843, -56868, -6414, -97121, 434, 63282, -35226, 178996, 201761, -183963, 13543, 85886, 86032, 2010, 113644, -42264, -51478, 198612, 71526, 84908, -56789, -114060, 177980, 44457, 221556, 120408, 183331, -36017, 35922, -56371, -50797, -33567, 125455, -13128, -36231, 1329]
12254a81611g0441C80136j01073a34264C10938k5703i7288C6787a79242Q6948
12244i2294H2431H112O6615a22022o9443A73012a28069A90070a8350G3536L57525
12233D31061A59439a114j38470B53575a04353B78061k662N4429A43694L26167
12223D69861j12098A58097K22003C9820K18918O7330p3708A21478N9022K21305
12213D01805I2737J67812e8631E1587A9986D053L07885B04N0583b309C3391j5607
12201A7784K71509A33547P6276a48028D1356M57278A51812k357G1777A6626J11117
12190A27743A2438J03154a122A85658p2085b54583c8523m0479B12367J41576j76129
12179A77814O8331h6960A44691B3778g4254C44813A47747J51939m2215H8846a88457
$$ y = [-181611, -70441, 380136, 279063, -134264, 310938, 285235, -97288, 36787, -179242, -92294, 82431, 8112, 74727, -122022, -191465, 173012, -128069, 190070, -18350, 73536, 431061, 159439, -1114, -139584, 253575, -104353, 278061, 275399, 329828, 143694, 469861, 357763, 158097, 380100, 39820, 258738, 326068, 252360, 121478, 180500, 401805, 92737, 260549, -58631, 51587, 19986, 4053, 311938, 204, 50787, -2309, 33391, 17784, 289293, 133547, 209823, -148028, 41356, 498634, 151812, 149455, 71777, 16626, 127743, 12438, 115592, -1122, 185658, 113573, -254583, -38523, -79002, 212367, 353943, 177814, 246145, -86960, 144691, 23778, -74254, 344813, 147747, 299686, 257471, 88846, -188457]
12167A92291J99203A94527p9927a36779C17471b30063A5716J40847c5429C96439
12156A37050N488D2735e7453j36219b6285p2022D41152a33j09495C99440d0121
12144A60529K49918k3983E1603J21327a54813A99350a76543B80426A9149O5682
12134H4831b06885d230B0680a73437d9192j79201A54004b4450j24861A3450i138
12122H7995e1411B7681c40625D3284a19632F5285a4886B79955g0205B79740A06310
12110a41668I6174c82813C3145N1563b04832B30013r855i1399M1985C6686J4603
12099E1289B523a98972o3110a29104C51330j61293D0629J01608b65124g5798p7169
12088a52967A31443o5240a78773d2023a3961B8785b2122j80909I0384b6702j74225
$$ y = [192291, 391494, 194527, 114600, -136779, 317471, -230063, 15716, 156563, -35429, 396439, 137050, 142538, 42735, -57453, -193672, -26285, -98307, 441152, -133, -109628, 399440, -40121, 160529, 410447, 386464, 51603, 172930, -154813, 199350, -176543, 280426, 19149, 84831, -206885, -4230, 20680, -173437, -49192, -228393, 154004, -24450, -149311, 13450, -9138, 87995, -51411, 27681, -340625, 43284, -119632, 65285, -14886, 279955, -70205, 279740, 106310, -141668, 96174, -382813, 33145, 84708, -204832, 230013, 220158, -91399, -49414, 36686, 51289, 2523, -198972, -262082, -129104, 351330, 190037, 40629, 142237, -265124, -75798, -152967, 131443, 66203, -178773, -42023, -13961, 28785, -22122, -203031, 90384, -26702, -200927]
12077b00927g0877p8041q7218D07058A21845a24709L7457B70777o7760a08805
12066B35742r9588B533K68748A03243L1231h2113J0895l169k2430L139j62438
12055b56116f4412k75107n3121A55295J33496a97324b0879E0119g6934K2391A24742
12043E8731c33681G3906a73258C3745J583K36310c10256o5679C27761a18411A22995
12031a2832j50263e4040A18688j9403b00198C5259K68164A09206F223h0858m4480
12020a25338k3848H2343b21355E7050a60247B50942A24409f6207l58921H6741
12009a18166j3051a4919j31987q4955A01592c03697H9575g5229k2168C2324a403
11997B85621o0847a69940e2133C2343a63659j928k72098A84884b45976I0369J21910
$$ y = [-200927, -70877, -148918, -236136, 407058, 121845, -124709, -87252, 270777, 203017, -108805, 235742, 136154, 2533, 271281, 103243, 134474, -82113, -71218, -74387, -96817, -93678, -256116, -64412, -339519, -392640, 155295, 288791, -197324, -20879, 50119, -76934, -54543, 124742, 58731, -333681, 73906, -173258, 33745, 35328, 271638, -310256, -375935, 327761, -118411, 122995, -12832, -163095, -54040, 118688, 99285, -200198, 35259, 303423, 109206, 6223, -80858, -125338, -149186, 82343, -221355, 57050, -160247, 250942, 124409, -66207, -425128, 86741, -118166, -131217, -14919, -146906, -231861, 101592, -303697, 89575, -75229, -97397, 32324, -1403, 285621, 224774, -169940, -52133, 32343, -163659, -165587, -437685, 184884, -245976, 90369, 212279]
11986B12279c35711g3457F8124c2486A57680b55911A67931f0846k14279O376B67792
11974b20943A23431Q1098f0540m7927m5508E0311a49042I2987m0849i4787c1799
11962D8543j2832a01138R734F0945a04714A29102m0291J07686A4525f1406A18348
11950b9325j61247i020q3358E2195a77957A42602e3977k6723b5895Q019j07108
11939a24984o2996B33713L3007A4017h8219d2817j81736B11500k9564c54167h8757
11927b8710B90261A6505a9313B18583C5642a79226G7141c34100B70263e2206C9232
11915B97751H2340b1789D7882c85496H4579O004d80k5317M565k82583J44466f7428
11902F2545L2458b37963D25363a24923a7150H4811d05133d6742C77754H1475J37023
$$ y = [212279, -335711, -73457, 68124, -32486, 157680, -255911, 167931, -60846, -275125, -268749, 267792, -220943, 123431, 204529, -60540, -108467, -153975, 50311, -149042, 92987, 52138, -94787, -31799, 48543, 35711, -101138, -91404, 60945, -104714, 129102, 88811, 196497, 14525, -61406, 118348, -29325, -190572, -9020, -92378, 52195, -177957, 142602, -53977, -80700, -25895, -17876, -124984, -187980, 233713, 266720, 14017, -88219, -42817, -224553, 211500, 181936, -354167, -88757, -28710, 290261, 16505, -19313, 218583, 35642, -179226, 77141, -334100, 270263, -52206, 39232, 297751, 82340, -21789, 47882, -385496, 84579, 90583, -480, -25797, -21232, -303815, -159349, -67428, 62545, 95003, -237963, 425363, -124923, -17150, 84811, -405133, -46742, 377754, 81475, 218498]
11891B18498E2032K4311a04051M9693I250J40985o8039A7239c14610q794G0132
11879c68600a05475k64783F0721J01376g0721A0750a43258A98070b1909C33578
11868i9691c3156l0429C7431M2912a20422K8217l9398C4567c50451J38597j41831
11857c53685B75884M5832I7429L3395J2600a85201l5587a07992H110b07828h1983
11845a49412O389I3591M0318J14111b7404k55252R1310k12067a07033e717q778
11834a4495H4309a19654k1314C7779J63210D2496L6147i8509l6418j67911R5804
11823b07034h6518I6609f9302c3381A72964a34985p0554A96551c40259i6412A61684
11811a24056H4954a13153B57074A13301a35326N905p6004B32892O0825b73841
$$ y = [218498, 52032, 76343, -104051, -54358, 9250, 150235, 82196, 17239, -314610, -323404, 70132, -368600, -105475, -370258, 60721, 162097, -70721, 10750, -143258, 198070, -21909, 333578, -99691, -33156, -63585, 37431, 80343, -120422, -92205, -131603, 34567, -350451, -211854, -353685, 275884, 321716, 97429, 130824, 143424, -185201, -220788, -107992, 8110, -207828, -81983, -149412, -143023, 93591, 133909, 248020, -27404, -282656, -191346, -403413, -107033, -5717, -14495, 84309, -119654, -140968, 37779, 200989, 42496, 78643, -98509, -134927, -302838, -207034, -86518, 96609, -69302, -33381, 172964, -134985, -205539, 196551, -340259, -96412, 161684, -124056, 84954, -113153, 257074, 113301, -135326, -129421, -205425, 232892, 293717, -273841]
11800c2017N378j23775c6096j4770j78869B32975a74327C8467K39284a48693f1574
11788a39119H3443e968p5695q9862m0757m8541g94F6369a2506A73846a58118j3727
11776a71845A03444a91029J7220e0305A10611J94730a53224o015A1681K7482J2772
11765E1935d61766K16969c8104j81926d3266G3474R6282G7866H499L5350b55924
11753g5610A31787a28717m1496m5256c6633j1918j50639i2510L5961B89357B2640
11741a55351E4646J96560f3437a5383k738A8480Q7557O9631g2766m8629j62237
11730b83632p6946f4055H4932O7578e1386a5496j78356I6175c38529C86892a25723
11718a29768b0454j6245j91097H4220g9658r1691n2949A52401L6580a17138e1402
$$ y = [-32017, -26639, -150414, -36096, -50866, -229735, 232975, -174327, 38467, 277751, -148693, -61574, -139119, 83443, -5968, -81663, -171525, -212282, -260823, -794, 66369, -12506, 173846, -158118, -171845, 103444, -191029, -173809, -50305, 110611, 305341, -153224, -159239, 11681, 39163, 51935, -461766, -244797, -38104, -220030, -43266, 73474, 169756, 77866, 8499, 43849, -255924, -75610, 131787, -128717, -170213, -215469, -36633, -48551, -199190, -92510, -56549, 289357, 22640, -155351, 54646, 251206, -63437, -15383, -18121, 18480, 106037, 175668, -72766, -121395, -283632, -360578, -64055, 84932, 152510, -51386, -15496, -193852, 96175, -338529, 386892, -125723, -129768, -20454, -36699, -227796, 84220, -79658, -171349, -224298, 152401, 188981, -117138, -51402]
11706B6691J22484C1494h701B4388K65716r3615a87141J546A53009A567a37553
11694G8440a01192A23669a24957N0760B05587J94337B4557b4853D4854J39037
11684A83891M4386F7884N6105e1924A1096e7170o9846o3728F4146L64975b30437
11672d9108k09730B3911a53557a7535B7172K500R5751a17653C3473K80260c4814
11660D1489Q0622d5930j4310j46166M8869C43088h4680k03041N0897M6585o9477
11649b59716A9675Q1253m5574a48617G7637c63674B51798e0142B36018c0569n6356
11638h6925H1964c32115i7549A67177f9512E1193d20893A06456c2816j95836h5959
11626e7639A74373G9945h7799G1329J03399d5226A76662b28735M351G1194a16506
$$ y = [26691, 149175, 31494, -8701, 24388, 290104, 196489, -187141, -185595, 153009, 1567, -137553, 78440, -101192, 123669, -124957, -74197, 205587, 399924, 24557, -24853, 44854, 183891, 228277, 67884, 123989, -51924, 11096, -57170, -127016, -190744, 64146, 429121, -230437, -49108, -258838, 23911, -153557, -17535, 27172, 29672, 125423, -117653, 33473, 313733, -34814, 41489, 122111, -45930, -60240, -206406, -157537, 343088, -84680, -287721, -236824, -190239, -259716, 19675, 100928, 55354, -148617, 77637, -363674, 251798, -50142, 236018, -30569, -86925, 81964, -332115, -97549, 167177, -69512, 51193, -420893, 106456, -32816, -228652, -85959, -57639, 174373, 79945, -87799, 71329, 174728, -45226, 176662, -228735, -224384, 71194, -116506]
11614e3532j08108e5272j67989L6172D4450J12192a55338A47284b64266I3426
11603a89144M5111o5020j95723a87464P2754C852a4626B28758b65155F8829A482
11591C6211a23429h826F2734a50909K5408B25922A05238K6125h3257A46549J65764
11580C12313B6445K16973a6708j84672P9355A63663R5437j10956b09717d9738
11569B16736f7906A58877D9215J35120d6647C37091a2396n6077j64753l5924C9389
11557i3124A25207D5036J22095J94175M5431I5004d3716j01567G3881a53670O1542
11546i2128H8264A0086J1001K09797c7863B05220b82674D75801a23380N6175C08758
11534D6877K608P170b21854C52409d6863A42543J09333A02534b8438o9558A91353
$$ y = [-53532, -161640, -55272, -223261, -187089, 44450, 156642, -155338, 147284, -264266, 93426, -189144, -144033, -209053, -404776, -187464, -114710, 3852, -14626, 228758, -265155, 68829, 1482, 36211, -123429, -8826, 62734, -150909, -125501, 225922, 105238, 131363, -83257, 146549, 312313, 26445, 243418, -16708, -201380, -122025, 163663, 259100, 148144, -209717, -49738, 216736, -67906, 158877, 49215, 184335, -46647, 337091, -12396, -68473, -233226, -269150, 39389, -93124, 125207, 45036, 167131, 361306, 406737, 95004, -43716, -145283, 73881, -153670, -92128, 88264, 10086, 21087, 230884, -37863, 205220, -282674, 475801, -123380, -67205, 308758, 46877, 49485, 56655, -221854, 352409, -46863, 142543, 251876, 102534, -28438, -97996, 191353]
11522C1985N7769J38770b9071M270B28399a68175c8639A19070P9587I7750l4048
11511F3702Q2595o3272J61021a84527E3136J41189K09992A56972b56544A42260
11500a17273H3203O1507a76673B25729a35743H3137a46815e3894B18095a9004
11489a42586C64720j51802K4498d0190A92948E2758K20668e7183B11137J46265
11479C57402A19879b5631Q103D13981L4851A69513F488L60315C2283e0892b4981
11467F6546j3316L92918G0590P5346i1459A21778K55437a13406b6348A04830N3649
11456A58479F0880a9422A54137b29912A36615N0022L7964C9325J33731J35160
11446C08216j25787a22971F9611J55314e4340b5754j65898a1135k23317H8598
$$ y = [31985, 89754, 228524, -29071, -24801, 228399, -168175, -38639, 119070, 198657, 97750, 63702, 146297, 83025, 244046, -184527, 53136, 194325, 404317, 156972, -256544, 142260, -117273, 83203, 144710, -176673, 225729, -135743, 83137, -146815, -53894, 218095, -19004, -142586, 364720, 212918, 237416, -40190, 192948, 52758, 273426, -57183, 211137, 357402, 119879, -25631, -17528, 413981, 448832, 169513, 6488, 366803, 32283, -50892, -24981, 66546, 53230, 446148, 70590, 145936, -91459, 121778, 377215, -113406, -26348, 104830, 158479, 60880, -19422, 154137, -229912, 136615, 186637, 224601, 39325, 173056, 308216, 182429, -122971, 69611, 224925, -54340, -25754, -191652, -11135, -234452, 88598]
11435i0663F3387B0908a02283b3823m86012f5078A65645m3887c08399l9312e5404
11423a72303a9363q4651G1423b11397b7117A26649Q3047J4382a21916A6269f5403
11411a14870d6525B22251J79685i2887L0454A69278G883i8849A17027b165l9732
11400d1897H7642M413a04066I6310d7747C1017f5744H84c292A44775d85976C00587
11387C05872I6466b2775j74591A23077M1864q1086A1928a1505E51005B69984b75534
11375B07300I64a90275p1912D3732h9560m580j84556J02908j9977M2214C1189
11363d78260C9854c49236c8801A42705a58474E971d5188j99235a1476k37503i3218
11351B0308K6735b29273F1518K23526A04479K6199o3388a66580F5144P489L0368
$$ y = [-90663, 63387, 20908, -102283, -23823, -509835, -65078, 165645, 121758, -308399, -347711, -55404, -172303, -19363, -104014, 71423, -211397, -27117, 126649, 209696, 224078, -121916, 16269, -65403, -114870, -46525, 222251, 401936, -92887, -62433, 169278, 7883, -98849, 117027, -2165, -41897, 87642, 92055, -104066, 96310, -47747, 31017, -65744, 884, -3292, 144775, -485976, 300587, 305872, 96466, -22775, -197366, 123077, 164941, 83855, 11928, -11505, 551005, 269984, -275534, 207300, 964, -190275, -262187, 43732, -89560, -94140, -278696, -175788, -195765, -153551, 31189, -478260, 39854, -349236, -38801, 142705, -158474, 5971, -45188, -244423, -11476, -248979, -93218, 20308, 47043, -229273, 61518, 285044, 104479, 130678, 67290, -166580, 65144, 72633, 103001]
11340A03001c94141a86006g9307j88898h8713l4682A95612h3207K1464j59878
11330b21621B556L187K71348b76576J0184J07498o5451M8589A01162c7400H1037
11318B6971J69291m0056a97360h074B32907A13357m1197K0147b06725N6004j03574
11307b54295J14662F8641P6580e8799p1324A44928a05796k3941B78110a63711
11296b69980J26503N6905H2002b00392m0685e2725B54678m8397a44199N1362C79806
11284A10109b18986Q9395l1254k25829d5996j9825M511A6516c0088j1561m3496
11273h5145B2189a54836r6449j26675a03958K3029o6859A33470a07107N0953j2736
11262f8890n9381J0549e6944j33511F8463a29437a9464j68282j06439c6648A97976
$$ y = [103001, -394141, -186006, -79307, -268205, -88713, -123395, 195612, -83207, -61743, -221621, 2556, 5743, 277091, -276576, -266392, -158894, -224345, -175756, 101162, -37400, 81037, 26971, 196262, 156206, -197360, -8074, 232907, 113357, 72160, 92307, -206725, -150721, -254295, -139633, 68641, 145221, -58799, -130123, 144928, -105796, -129737, 278110, -163711, -269980, -143477, -86572, 82002, -200392, -241077, -52725, 254678, 206281, -144199, -92837, 379806, 110109, -218986, -129591, -160845, -386674, -45996, -65821, -61310, 16516, -30088, -41649, -85145, 22189, -154836, -251285, -377960, -103958, -80929, -147788, 133470, -107107, -56154, -68890, -128271, -117722, -56944, -190455, 68463, -129437, -19464, -187746, -294185, -36648, 197976]
11250a48276A34557a67170b6936l6157j04022H6952e0289k203B36582A2176b1413
11238B04894m6972b20082E7738J75095K2440p1934a09105k75524i1325B02841
11227d3549B31989F3427a8234n6122C75705E9465J12409e2360H1127J09058a91888
11215b09764i0860r6413k05232J51605A88941f9184B75325a29257K6633k4073
11205a26697b5125B2982P0195a8792B68819c135A61767a3212A9703K5941e3597
11193A04253D9219l076g1869B94863B9537b4511l71007R7725h0940c8953A00757
11181i7277A00915b9405k52490B58236a49816j1885f338F0000d4721j4918k19032
11170b78671k35736A95582a64822P7716A18141h3267e450o1767K1973j16033c6463
$$ y = [-148276, 134557, -167170, -26936, -63093, -167115, 86952, -50289, -52492, 236582, 12176, -21413, 204894, 157922, -220082, 57738, 232833, 255273, 183339, -109105, -384629, -91325, 202841, -43549, 231989, 63427, -18234, -74356, 375705, 59465, 171874, -52360, 81127, 190185, -191888, -209764, -90860, -187273, -392505, -240900, 188941, -69184, 275325, -129257, -102624, -126697, -25125, 22982, 93177, -18792, 268819, -3135, 161767, -13212, 19703, 45644, -53597, 104253, 49219, 46143, -71869, 294863, 29537, -24511, -395518, -297793, -80940, -38953, 100757, -97277, 100915, -29405, -281895, 258236, -149816, -161701, -6338, 60000, -44721, -59639, -278671, -514407, 195582, -164822, -87106, 118141, -83267, -5450, -67217, -45244, -161277, -36463]
11158a70380c4595H3895K20249a51701j54576R4334M9067K1906A27676a35999
11147d5206G9931e9177l0164A5675J46948a619B81553a80008A15892b88077b2685
11135D3922b52539a07663B37536L10880H1681a47163j468K1474A46798a421k35341
11124b36762A17182D4163c54607B06182a4404I5163g7690A8298a07078B1196O4546
11113H5742J00464J32342g9879I4605r603b977A30292a73076A33247C3654J61970
11102A95624K18224C881N8275J14778J53484A7674J36050E8077N2744d3842C53659
11090A78383q8877J23227m6519R11j1477a0471C80821E4945J75883k007H8916
11078F5334C0896J84256a0817l8423A15746k4506a93161F5835M26502k33817J09945
$$ y = [-170380, -34595, 83895, 304144, -151701, -306277, -211943, -162876, -140970, 127676, -135999, -45206, 79931, -59177, -89341, 15675, 162623, -1619, 281553, -180008, 115892, -288077, -22685, 43922, -252539, -107663, 237536, 548416, 81681, -147163, -148631, -127157, 146798, -1421, -236762, 117182, 44163, -354607, 206182, -14404, 95163, -77690, 18298, -107078, 21196, 85742, 186206, 318548, -79879, 94605, 85002, -2977, 130292, -173076, 133247, 33654, 195624, 413848, 3881, 62156, 176934, 330418, 17674, 153724, 58077, 110821, -43842, 353659, 178383, 89506, 212733, 166214, 167125, 155648, -10471, 380821, 54945, 230828, 228821, 88916, 65334, 30896, 215152, -10817, -49240, 115746, 91240, -193161, 65835, 492337, 258520, 368465]
11067C68465a63273A81421K08630k436r9456J37161j71161J02503o6107R6098
11057C86653J45806o0100f4983H01442A95113B5994O23241k29314L3027J30844
11047E83792k24120L18906k75915J4067L60410o6410j04167r3314M1381j64991
11037C89639J76103k49133K51174J53322C51272q6481R0267j8124o1619P3430
11027C48745j12307L12721R430Q9536B23775J66361M5968N2447j89916j9333K76313
11016E55615B41772M23320j08600j88751J76458B19001L32250j62445D3643L35956
11006C79599O06720D53772r4514r9954L31456k82966L50566j60635K68527j58555
10996F07697K52374C09105K53211n6744J50297j29767j52849p0982O4243p0436
$$ y = [368465, -163273, 181421, 390051, 387615, 288159, 425320, 254159, 356662, 290555, 386653, 532459, 472359, -64983, 801442, 195113, 25994, 649235, 419921, 452948, 583792, 359672, 678578, 402663, 416730, 777140, 710730, 606563, 513249, 554630, 389639, 565742, 316609, 567783, 721105, 351272, 264791, 355058, 336934, 275315, 348745, 236438, 549159, 558589, 648125, 223775, 390136, 436104, 488551, 298635, 279302, 555615, 241772, 665092, 556492, 367741, 544199, 219001, 551251, 388806, 43643, 379599, 986319, 453772, 359258, 259304, 590760, 307794, 658360, 497725, 766252, 607697, 860071, 309105, 562316, 505572, 655869, 526102, 373253, 302271, 366514, 296078]
10986B96078M31041n5744P7981l16151M25696m4870K1767L01832m09067K12641
10976I41204L15182K09358K65244K7198l6981K95885q1590J15040j39065k10115
10966A701360k51049l27090R098K90485j57350n47974O44405K7367J95151j09917
10956A474486j98700K10757l81298j45429N8512m3903R229l64132o4269A75585
10945C07157A15703k2431K82627I3751J33796I4294J844J68358Q8079m9573B8891
10933f7860K928H8961J22753G3508J37998r2471b31851j82201B02800c95627i4279
10921A18733c52056F8572e043A71102b48904A08219a06956K6697j77490A8001
10910A52951D4917b26615h6395B1486K1360a01728k35885B42046I7672a76394
$$ y = [296078, 727119, 671375, 749356, 433205, 858901, 814031, 835798, 1137630, 728563, 941204, 1256386, 1465744, 1730988, 1758186, 1721205, 2017090, 1935500, 2050540, 1911475, 1701360, 1450311, 1123221, 1132319, 1422804, 1265454, 717480, 1361885, 1389252, 1584403, 1474486, 1275786, 1486543, 1105245, 959816, 1018328, 974425, 983654, 619522, 555253, 175585, 307157, 115703, 93272, 375899, 93751, 227547, 94294, 96138, 264496, 352575, 303002, 28891, -67860, -64932, 88961, 211714, 73508, 211506, 119035, -231851, -414052, 202800, -395627, -94279, 118733, -352056, 68572, -5043, 171102, -248904, 108219, -106956, -80259, -257749, 18001, 152951, 44917, -226615, -86395, 21486, 42846, -101728, -337613, 242046, 97672, -176394]
10899b3336c565E7186b23404g3680b2028r8783e0622j26463M1053D2905A2116
10887A93952c4023n9360E3281o439q369K7406b52306f3130j2932a8202C91128
10875A04895M9194k8273b7049B0555b04584m8072c9413H504a47796H4694Q6964
10864A71658E9827h2746B9635A3569a17534A0135a16045N306c2795H5753c3044
10852f667B1903d3798l65856A7078K168N5455a64944O2020Q635J864k01029A31195
10839h7389k45989e9325B26843a64173e5160E567b19645h610A18520l6834J28772
10828B10458a59625B46110B5183J09774D8839a73888B70251A686d1321j26812
10818a68133g643j20314B15084b20681k07737c2701j15339e846k0165A90136q5445
$$ y = [-23336, -3565, 57186, -223404, -73680, -22028, -120811, -50622, -177085, -136032, 42905, 12116, 193952, -34023, -93383, 53281, 46842, 38473, 65879, -252306, -63130, -76062, -18202, 391128, 104895, 154089, 125816, -27049, 20555, -204584, -252656, -39413, 8504, -147796, 84694, 171658, 59827, -82746, 29635, 13569, -117534, 10135, -116045, -110739, -32795, 85753, -33044, -6667, 21903, -43798, -409654, 17078, 19246, 74701, -164944, -102924, -94289, -92425, -293454, 131195, -87389, -333378, -59325, 226843, -164173, -55160, 5567, -219645, -8610, 118520, 81686, 210458, -159625, 246110, 25183, 134957, 48839, -173888, 270251, 1686, -41321, -168133, -7643, -127957, 215084, -220681, -428418, -32701, -148040, -5846, -26011, 190136, 104691]
10807A04691i3875B3178J58716O030a80327E1399b47415J6742A93271b2084G7480
10795d9651j84434i6658k29601J61410B57716e8021B6101b16556h0270c6537o6383
10784a02920L0713A45364A0426D809a38795m818B4832I773d62594B8749L3995
10773F2744K04066a56454G0968c41061f9967j62685A43194b66173R5757k7049
10763a97465I0461b9382J1185j37616C1213D498K42048a63513A8227a08259m7395
10752a55654k02147a08149j27373A95899F5803i185F5126O8788a6006j71398J9338
10741a68066b1732A80260J08180E6687N0478D0493a8587Q263B6799c01845I3409
10729C02661A12652h6420B02883m6198D89i3109A14602m9461e6580C5712b17165
$$ y = [104691, -93875, 23178, 181894, 187924, -180327, 51399, -247415, -230673, 193271, -22084, 77480, -49651, -234085, -96658, -326259, -164849, 257716, -58021, 26101, -216556, -80270, -36537, -102920, -72207, 145364, 10426, 4809, -138795, -143613, 24832, 9773, -462594, 28749, 62744, 266810, -156454, 70968, -341061, -69967, -232652, 143194, -266173, -170416, -197465, 90461, -29382, -18197, -155813, 31213, 4498, 246546, -163513, 18227, -108259, -155654, -357801, -108149, -235522, 195899, 65803, -9185, 65126, 133914, -16006, -187404, -168066, -21732, 180260, 288440, 56687, 107165, 40493, -18587, -10324, 26799, -301845, 93409, 302661, 112652, -86420, 202883, 156685, 489, -93109, 114602, 65141, -56580, 35712, -217165]
10717a279E8118J59194a32802A38064c92169c2300H4252j4989L8571b03904f1918
10705C7030R0787g6723A16464h9574o9254A60279m3701h6756L8486q755n5780
10694a12805r9470J04820D6347a70399f632D7781b98116J45294M8029d1321J7279
10683b4042H6413e8103A01246c1696i43j94125C5862g01k54479h8559L0626n2466
10671a10399B20974G3602d1155r2921o9515A05499A7034R3978i7907A53520D8196
10659H7555b15992R5975A21581n7558a63165J1496B49791i615D1337i149M421
10648d728k34607r890M2060Q4984j78742A28088g8457B01900h3473C4690B334
10636d4621k61379P2086c2930J207k26587A22689g6343l24638a34082A70892B8526
$$ y = [-1279, 58118, 217312, -132802, 138064, -392169, -32300, 84252, 69263, 107834, -203904, -61918, 37030, 127817, -76723, 116464, -89574, -158828, 160279, 116578, -86756, -48270, -57025, -112805, -212275, -107455, 46347, -170399, -6632, 47781, -298116, -152822, -104793, -41321, -24042, 86413, -58103, 101246, -31696, -943, -195068, 35862, -701, -255180, -88559, -57933, -110399, 220974, 73602, -41155, -134076, -203591, 105499, 17034, 111012, -97907, 153520, 48196, 87555, -215992, -120017, 121581, 64023, -163165, -151669, 249791, -9615, 41337, -9149, -4728, -239335, -249225, -207165, -122181, -300923, 128088, -78457, 201900, -83473, 34690, 2334, -44621, -306000, -233914, -32930, -31723, -258310, 122689, -76343, -400981, -134082, 170892, 28526]
10624A7169g6081K9014q050j14410q5577R4783M1353k32392G7305a05401L632
10613a01769B20802A06168b64340f3583b1511k3452l45032a56162C1722L08472
10603C40194j07590b74702H8296c55330e8274k2082A20891a18596j07625a00768
10592d5119E0343c70131J79239Q7539f322q9231l38597a41692a9140j70884d3650
10580b96166R3762p0393A26323b49367a03065j33345A56189c56019b2925q8410
10570a11335d5310B57375F474J93256c9572o8764q1901B14283h1579D8299a89828
10558D5386j3879f6341k82694n1059A7616a28054C22298F816c6864j12101M2679
10547a06286j11427A18388n1658a27743e743k58492c5036H999d9432A9906J47176
$$ y = [17169, -76081, -47067, -55117, -169527, -255104, -160321, -118968, -351360, 77305, -105401, -101769, 220802, 106168, -264340, -63583, -21511, -44963, -389995, -156162, 31722, 340194, 232604, -274702, 88296, -355330, -58274, -80356, 120891, -118596, -226221, -100768, -45119, 50343, -370131, -190892, -103353, -6322, -95553, -434150, -141692, -19140, -190024, -43650, -296166, -202404, -272797, 126323, -249367, -103065, -236410, 156189, -356019, -22925, -111335, -45310, 257375, 6474, 199730, -39572, -108336, -190237, 214283, -81579, 48299, -189828, 45386, 31507, -66341, -349035, -400094, 17616, -128054, 322298, 6816, -36864, -148965, -106286, -217713, 118388, 66730, -127743, -5743, -264235, -35036, 8999, -49432, 19906, 167082]
10536A67082b8171l50699h2528K0747j36042A32073Q6661j1570f1988M792G9295
10524A04158K1271c5382k31356a10098c391j26077B25076b67811c5811q9311o368
10513a31490j00542j82065g4580A77748g5502B15652a06589j48365C3542a17930
10502F5086a75144C4318P7086b33422K4722A52826a39782L9629k12255A10373
10491A37799D3059d6085B38406M9386A6582Q3707a3753A02621J2385m0775K04320
10480B78551K12384k36331J51625H3046a06999r0143I1720J70438c12625a32196
10469B91930a1213C09138A04030b7812C91623c36484f5665j26838b0063G3112
10458a55531n1532f114l2840A8917K0355i0332p6256d3546m17720F1777b25525
$$ y = [167082, -28171, -378870, -82528, -61781, -197823, 132073, 218734, 207164, -61988, -57196, 79295, 104158, 125429, -35382, -266738, -110098, -3391, -129468, 225076, -267811, -35811, -125122, -131490, -232032, -414097, -74580, 177748, -75502, 215652, -106589, -254954, 33542, -117930, 65086, -175144, 34318, 111404, -233422, -208700, 152826, -139782, -100153, -312408, 110373, 137799, 43059, -46085, 238406, 287792, 16582, 100289, -13753, 102621, 115006, 74231, 278551, 490935, 254604, 406229, 83046, -106999, -197142, 91720, 262158, -312625, -132196, 291930, -11213, 309138, 104030, -27812, 391623, -336484, -65665, -192503, -20063, 73112, -155531, -207063, -6114, -38954, 18917, 39272, -90332, -166588, -43546, -461266, 61777, -225525]
10446i4695A28061K02560a61001A15703b06278A9005b54800J23812L945k37431
10436c64474D6095a67285P0927j17300b6168k7383j08635Q0633o5961k12697A01633
10424e75838K40882A47054a30452j20737q1623A23512I014J10954b734A12557
10413b35050O20A95116a72394A51771c15283e4956K2294k7909p7802l76564b06000
10401B24795a31228A1322K06161b85446F8722J6419a69473B18460E2137a32254
10390B03513h7636A87760a19081K0280K5872o796B05501i7205A82573F2873a98854
10378B10776p2171Q0848G3343J65940D8333i5342B27420m7919q9426J65736A27690
10366I2087N78257k77391a48114C29520L99279C00976J29920H3078L6983j9541
$$ y = [-94695, 128061, 330621, -161001, 115703, -206278, 19005, -254800, -130988, -127043, -364474, 46095, -167285, -96358, -213658, -26168, -53551, -162186, -81553, -147514, -360211, 101633, -575838, -334956, 147054, -130452, -251189, -332812, 123512, 9014, 119968, -2734, 112557, -235050, -234430, 195116, -172394, 151771, -315283, -54956, -32662, -60571, -138373, -514937, -206000, 224795, -131228, 11322, 217483, -285446, 68722, 85141, -169473, 218460, 52137, -132254, 203513, -87636, 187760, -119081, -98801, -72929, -79725, 205501, -97205, 182573, 62873, -198854, 210776, 138605, 219453, 73343, 239283, 48333, -95342, 227420, 179501, 90075, 255811, 127690, 92087, 670344, 392953, -148114, 329520, 728799, 300976, 430896, 83078, 120061, 100520]
10356A00520Q6657b5904A83243J77713O6030k8172K49301B43723J00179j69168
10346A74734a0805C56161j70328R7185N3974j29794J94313A04319c4887H1007
10335a55524A17829K53532j75463q7517h3388D0582a76620A07986e3114N055B14528
10323A65234j1538J61729K0516A38988j0238K3201Q367C3048J59719k0141b22694
10311a90258N0205F8114b08788c2707E8318a99718i6045K1075A5929J9720i8226
10299a86827F2977a49875J1819A18335K18949b4610B94540r8913b87874B01433
10288a4626j58747r5533c3561F2969b24545J047a2630A23888a65463l1568G0669
10276F9540C2186a15058D26911a40676L736C41975j24787a86959B00802a91436
$$ y = [100520, 187177, -25904, 183243, 360956, 426986, 398814, 648115, 243723, 343902, 174734, -10805, 356161, 185833, 283018, 336992, 207198, 401511, 104319, -34887, 81007, -155524, 117829, 371361, 195898, 108381, -83388, 40582, -176620, 107986, -53114, -48059, 214528, 165234, 153696, 315425, 335941, 138988, 128750, 151951, 160318, 33048, 192767, 172626, -222694, -190258, -140053, 68114, -208788, -32707, 58318, -199718, -96045, -74970, 15929, 35649, -98226, -186827, 62977, -149875, -138056, 118335, 337284, -24610, 294540, 195627, -287874, 201433, -14626, -173373, -268906, -33561, 62969, -224545, -223498, -12630, 123888, -165463, -197031, 70669, 69540, 32186, -115058, 426911, -140676, -136940, 341975, 217188, -186959, 200802, -191436]
10265a37622A15911j7634A8910L17845R9966j88127m0628J25180h0516c2965C3956
10253D1152K63153e40024A42974i8347G5218K7056E0275f5791E7371J1073B3831
10241E2089b86532h2941H8037a43082D0799K20194a57676A48356i6767A06349
10230b58143i3057F0120N5771b53987n1608F4579f3645b6797A6380b23208A396
10218h9498j16718O5287j11443a9111D7044g210B57198C7600J12753a83053D4752
10206a21800E7764L7987l4391c14505b5752k28655a00066A45139J1719a35185
10195b7608j910C30562c1817H764J13839A6750f2539K6066H0878j6482l392a27332
10182A30038R5506a55917a4534B0987a87772G9766O9929a65412k678j6414K6808
$$ y = [-137622, 115911, 98277, 18910, 336755, 436721, 248594, 207966, 333146, -80516, -32965, 33956, 41152, 304305, -540024, 142974, -98347, 75218, 102274, 50275, -65791, 57371, 68444, 23831, 52089, -286532, -82941, 88037, -143082, 40799, 260993, -157676, 148356, -96767, 106349, -258143, -93057, 60120, 115891, -253987, -305595, 64579, -63645, -26797, 16380, -223208, 1396, -89498, -206216, -140929, -252372, -19111, 47044, -7210, 257198, 37600, 150353, -183053, 44752, -121800, 57764, 95751, 61360, -314505, -25752, -254407, -100066, 145139, 156858, -135185, -27608, -29518, 330562, -31817, 8764, 122603, 16750, -62539, -36473, 80878, 64396, 61004, -127332, 130038, 225544, -155917, -14534, 20987, -187772, 79766, 149695, -165412, -168090, -184504, -157696]
10171a57696b6384H1033d8782E9765a80372P0997B19005a72787Q1461J3917C6373
10159A4332d9634r1820A72438d3927j30183f5800A60676a24687j55502j498a4992
10147B183J44029E2909F698M0758f0206j10458e8991A25417d55919d4339l70078
10136d14417a87216D0032L20733d1742A13294m8536g0053C1348f0349M756j64813
10125b20406O6811k26842A35864a25665d3846j75598C42223e2634K1260A54891
10114b3757F1549b0672q4129j10274P4406N1411j04728e0800A14137h9992j11458
10103b01450Q240p9247A4395a70070j67762i4211o9058C78743b53494k1g2937
10091c12058B04571c1812j04621A5328R907J59720b704A67568F0027a43045O9315
$$ y = [-157696, -26384, 81033, -48782, 59765, -180372, -109375, 219005, -172787, -91326, -77409, 36373, 14332, -49634, -141454, 172438, -43927, -174110, -65800, 160676, -124687, -280189, -281687, -14992, 2183, 146212, 52909, 6698, 47456, -60206, -170664, -58991, 125417, -455919, -44339, -414417, -187216, 40032, 360765, -41742, 113294, 64758, -70053, 31348, -60349, -55593, -220406, -153595, -380437, 135864, -125665, -43846, -219444, 342223, -52634, -31374, 154891, -23757, 61549, -20672, -104801, -215075, -140669, -89258, -193986, -50800, 114137, -89992, -201450, -193210, -272457, 14395, -170070, -337832, -94211, -163269, 378743, -253494, -253515, -72937, -312058, 204571, -31812, -136433, 15328, 25235, 184955, -2704, 167568, 60027, -143045, -73730]
10080g3730c5270A37129e5425J1134C14210j10064d5812B9321a32635j53326f1272
10068b46542d8236A45058d0907A30394a33627A40917j5832C9772d9474C4791a41244
10056a28235j69327C9210a69524f821H9965b29774R1810a2960B23003q2550a28275
10044i4160j4005A01635h3205B43926a63855K5598j00744N9188M1707j52553h4346
10032e9022o9545r9073J12082n9042B16188d0154D2694M491a19699B23570b171
10020B70954b45830c4859F0062c9063j85114j63456j16950D878J03063i1828A85225
10008C8188f2640k29068B04423b20433F3097R1663d11894J63721f8867E948J52678
9997A58626g4674b808l9441r5375c3571q5238M4036A21063J06247a21261A46528
$$ y = [-73730, -35270, 137129, -55425, -44291, 314210, 204146, -45812, 29321, -132635, -285961, -61272, -246542, -48236, 145058, -40907, 130394, -133627, 140917, 125085, 39772, -49474, 34791, -141244, -128235, -297562, 39210, -169524, -6821, 89965, -229774, -137964, -12960, 223003, 140453, -128275, -94160, -108165, 101635, -83205, 243926, -163855, -138257, -239001, -179813, -138106, -290659, -84346, -59022, -128567, -227640, -115558, -174600, 216188, -40154, 42694, 47185, -119699, 223570, -2171, 270954, -245830, -34859, 60062, -39063, -224177, -387633, -504583, 4878, 107941, -91828, 185225, 38188, -62640, -291708, 204423, -220433, 63097, 154760, -411894, -248173, -68867, 5948, 158626, -74674, -2808, -42249, -137624, -33571, -118809, -74773, 121063, 227310, -121261, 146528]
9985a70055j38001a42136K2377c6461k00654j4670d8515m13070E8758a50034M8397
9974a01637C53022c7594k63545B22612j03740f0468A50605f8259m02390e8798
9963a06815q7269h1797B30191d2566H6333g0438m23344D04937p0632a78746c1234
9951A13822b3599n083k3556j65489n5231L6322f6987F0488J35308a58730B76456
9939b691j60401I4411c63145A67384d1370B06700b26346A26817b36320E7169m41
9928E6728B7645c8656B04299a96621d5495m1048H76L27169a24594k0006D286a32792
9915B02356J26985C895a5163m6825q018j43710G6939J10273H9888J03764h6282
9903e1272m6330A77858J35436A31197E2600a95928K4091Q1764L9460k05964b3402
$$ y = [-170055, -308056, -142136, -119759, -36461, -237115, -251785, -48515, -461585, 58758, -150034, -101637, 353022, -37594, -301139, 222612, 118872, -60468, 150605, -68259, -470649, -58798, -106815, -194084, -81797, 230191, -42566, 86333, -70438, -493782, 404937, 334305, -178746, -31234, 113822, -23599, -28682, -52238, -217727, -272958, -236636, -66987, 60488, 195796, -158730, 276456, -2691, -163092, 94411, -363145, 167384, -41370, 206700, -226346, 126817, -236320, 57169, 56728, 27645, -38656, 204299, -196621, -45495, -86543, 876, 328045, -124594, -144600, 4286, -132792, 202356, 329341, 3895, -15163, -61988, -70006, -213716, 76939, 187212, 89888, 193652, -86282, -51272, -97602, 177858, 313294, 131197, 52600, -195928, -171837, -90073, -50613, -256577, -23402]
9891H5605k5390b52545d2456j4843l0745k16852a10479j10866r0923b0822k06556
9880b27378G3602b07638c8586j28804d0911k00709J3908E4764i4472j61167L4905
9869b20734D04J89041f5422F0184b39569k83923a99192A145J12415j3068d33805
9857A09152a23207A75121b38445E5117b2831o8020D5272J08378F5807f1749j00006
9846a61755q3359J04623j39916J07525P6759j81149h9590A5046J8147a59253D9228
9834a46105p0722k08693G9250a20321B9118a66584M5033j16221J06953B69923
9823d1486k17926i9259A97437D715a5716k01577j28095I1706a8607o5485A04332
9811C02366r0676a02309k7747m7050d8059q1791M7833j71293N1402C4100a0827
$$ y = [85605, 60215, -252545, -42456, -57299, -88044, -304896, -110479, -221345, -312268, -20822, -227378, 73602, -207638, -38586, -167390, -40911, -241620, -227712, 54764, -94472, -255639, -220734, 404, 189445, -65422, 60184, -239569, -523492, -199192, 1145, 113560, 100492, -433805, 109152, -123207, 175121, -238445, 55117, -22831, -90851, 45272, 153650, 65807, -61749, -161755, -245114, -140491, -280407, -172882, -96123, -277272, -89590, 15046, 33193, -159253, 49228, -146105, -216827, -425520, 79250, -120321, 29118, -166584, -121551, -237772, -130819, 269923, -41486, -259412, -99259, 197437, 4715, -15716, -217293, -345388, 91706, -18607, -84092, 104332, 302366, 211690, -102309, -130056, -177106, -48059, -129850, -82017, -253310, -201908, 34100, -10827]
9799i1318k5723d6602G5409b6782n0692B28007a14636g007H9929b44440Q790a8748
9786c13015C28123b37869e9047C25081b0213k97833a24028B5476r557g7807B51558
9774A91006b34278J0603h0265H320a61712F8689c2833C78031G9455b08789h6405
9762i7517C7183M0362g6238n43936C5458a22324c7609A1657b00635q5850G4376
9750f4955I5002a1789o7243b536I9396d323a523k50313B7926c0735j64372G0873
9737e1037A9731a22674r3347D5624K8758d213k5563H4777A5028h8100h743k3179
9725c1922j56633L9878j70746J52785j44521I4707a84201r8948g0246p7306C98032
9713a10766B81417a37279I2826a54026J1555A1453i5854B79276C690a73064B12315
$$ y = [-91318, -117041, -46602, 75409, -26782, -77474, 228007, -114636, -7007, 89929, -244440, -235650, -18748, -313015, 328123, -237869, -59047, 325081, -20213, -318046, -124028, 25476, 15919, -77807, 251558, 191006, -234278, -223675, -80265, 8320, -161712, 68689, -32833, 378031, 79455, -208789, -86405, -97517, 37183, 77545, -76238, -620174, 35458, -122324, -37609, 11657, -200635, -286485, 74376, -64955, 95002, -11789, -79032, -2536, 99396, -4323, -1523, -251836, 27926, -30735, -195107, 70873, -51037, 19731, -122674, -216021, 45624, 74382, -4213, -29776, 84777, 15028, -88100, -8743, -31922, -188555, -148677, -319423, -166638, -311159, 94707, -184201, -283149, -70246, -147552, 398032, -110766, 281417, -137279, 92826, -154026, -142471, 11453, -95854, 279276, 3690, -173064, 212315]
9701i6168p090j4534k91537A7640K12427a94920A12725K0259a49644L4614M4331
9690g0699E2521a07999b5434n2763O228A51353J40556b82145a38758O4641J5490
9679e8627k61837D7028c17898c857B62021a6303j55865c730k44273A57866d8251
9667i0566C06299c10088D1371a5242p9776d4892k29814J35516H6055f8725n2356
9656a21081r0392i0534F7825b17971j18633J23179g7510k78610j64583f6057J5492
9645e0565q3749K263j94535a35929O101j36218C34732j30681c28484e7927k13856
9634b71783d6553E2152a62748c7594j05943k07579D5920a37256O2115A08375f5780
9622a67709f1923k58540J33212c7152B08922f0824A34351e9033I9974M6395e7139
$$ y = [-96168, -103258, -117792, -409329, 17640, 230067, -194920, 112725, 132984, -149644, -115030, -70699, 52521, -107999, -25434, -78197, -71969, 151353, 291909, -282145, -138758, -74117, -58627, -320464, 47028, -317898, -3857, 262021, -16303, -172168, -3730, -248003, 157866, -48251, -90566, 306299, -310088, 41371, -15242, -95018, -44892, -274706, -139190, 86055, -68725, -121081, -211473, -90534, 67825, -217971, -336604, -213425, -77510, -356120, -520703, -66057, -50565, -134314, -132051, -326586, -135929, -129828, -266046, 334732, 204051, -328484, -57927, -271783, -46553, 52152, -162748, -37594, -143537, -351116, 45920, -137256, -75141, 108375, -65780, -167709, -61923, -320463, -187251, -37152, 208922, -60824, 134351, -59033, 99974, 146369, -57139]
9610f7301J3882b1761j71561o3189I9270m2639c6090a2085D9592j1659c2175A13048
9597H314a51054C3976b3213r3409M6233C96617h8387k1244k9028o3479L7615K0001
9585a44522A09860h9646R201k4440A83113O4524a28853k07254J18900d0795Q913
9574c1882j51274j85290G7631b8489q4164p0163h6836F5855b6189j05636e3545
9562H4201a95509a4639j20292j55107J10052M6855c4424Q115j17889N8769j8516
9551a03945F1970P724a83442c5195j41481L2643j06651l2108R1620B7734L9347
9540F7081L0362J41591D4744J20776b2184A5507c4581j45955a6661j18548C778
9528d8838j10681a5486k13090J00415K6760A4899J22260b32286A90133c9455j96442
$$ y = [-67301, -53419, -21761, -193322, -256511, 99270, 56631, -36090, -12085, 49592, 37933, -32175, 113048, 8314, -151054, 33976, -23213, -116622, -70389, 396617, -88387, -109631, -138659, -202138, -164523, -144522, 109860, -89646, -80445, -104885, 183113, 247637, -128853, -336107, -217207, -40795, -31882, -183156, -368446, 77631, -28489, -112653, -182816, -86836, 65855, -26189, -131825, -53545, 84201, -195509, -14639, -134931, -290038, -179986, -133131, -34424, -26309, -144198, -85429, -103945, 61970, 69694, -183442, -35195, -176676, -144033, -250684, -282792, -191172, 27734, 67081, 97443, 239034, 44744, 165520, -22184, 15507, -34581, -180536, -16661, -135209, 3778, -48838, -159519, -15486, -228576, -128161, -101401, 14899, 137159, -232286, 190133, -39455, -235897]
9517b35897A22141g8355q088B49146M8907A8240J70279a19942A47537C465a95481
9505b24278L5611E8463J20953o6021C7620a9691k39625c2197j38457A66125A2359
9493b78250Q211c1114j23928a7022B44506a39367f2539A92459D1447i5073K9616
9482f5457E3898M9555L26518p6049j783j12084b18287A5183P0698a92461e2586
9470b57407g4641c0858B0858e0658h202A8569J59084E2002N9699a5251j8763j26421
9458a60435e5939j70933P7563k54089a51017k09537J466J31083L2920B89374o3280
9447B26094a70028I1219b98381i1334d0297A3046L8886J01127d63501J30097F7468
9435E301b93008b2569A1451a24211D3472L42558c4533p2141k11258I4282b58807
$$ y = [-235897, 122141, -78355, -86443, 249146, 298053, 18240, 188519, -119942, 147537, 3465, -195481, -224278, -188667, 58463, 179416, 113395, 37620, -19691, -259316, -32197, -170654, 166125, 12359, -278250, -270039, -31114, -155042, -17022, 244506, -139367, -62539, 192459, 41447, -95073, -65457, 53898, 103453, 429971, 353922, 352139, 240055, -218287, 15183, 85881, -192461, -52586, -257407, -74641, -30858, 20858, -50658, -8202, 18569, 177653, 52002, 111701, -15251, -34014, -160435, -55939, -226872, -149309, -403398, -151017, -360554, -359088, -228005, -195085, 289374, 226094, -170028, 91219, -298381, -91334, -40297, 13046, 51932, 153059, -463501, -333404, 67468, 5301, -293008, -22569, 11451, -124211, 43472, 386030, -34533, -106674, -317932, 94282, -258807]
9423d7751b0480A6425L9015a79968A13096P9891A1255a01478J082c9353B02748
9411b4645A76693h7353j20266Q8551d0773r4705D600a68199A33939i4011B28495
9399b77306J15749j47914q1776K5576N4740i594j81474j23503g349k25601J03001
9388a29949F1126C250a89355A4434L3934h4750A09060J1262b37024P008H3909
9376b01847A3510a67468M7630l5642A96044a8109A25428f5418j44917G2327b84710
9364a33070K2869B02578O8224h1504D6740b1298j32691G3738Q6022d9268E85514
9352a10849n0289F2918N1292f4786I1319a61074B49834G7904A9846J98964g065
9340D5986a5068r9572j29440e5125A36324c3836j55338k64121a3448p9037A8816
$$ y = [-47751, -20480, 16425, 55440, -179968, 113096, 192987, 11255, -101478, -100396, -39353, 202748, -24645, 176693, -87353, -207619, -119068, -40773, -135478, 4600, -168199, 133939, -94011, 228495, -277306, -161557, -309471, -391247, -365671, -310931, -9594, -191068, -314571, -7349, -232950, -129949, 61126, 3250, -189355, 14434, 48368, -84750, 109060, 120322, -237024, -230016, 83909, -201847, 13510, -167468, -119838, -155480, 196044, -18109, 125428, -65418, -210335, 72327, -284710, -133070, -110201, 202578, 270802, -81504, 46740, -21298, -153989, 73738, 159760, -49268, 585514, -110849, -161138, 62918, 114210, -64786, 91319, -161074, 249834, 77904, 19846, 218810, -7065, 45986, -15068, -114640, -244080, -55125, 136324, -33836, -189174, -453295, -13448, -92485, 18816]
9328b4137k50482B1300K19306A15512a29198D464b29403J5188d2179l4674D06854
9316a68019f4015k7641J8256A32752f4069G5661a19312l0337A1409K11187d46401
9304c578j16049L1621b5475F1535J9359a54108l07144O3051f1304E66J02177f12427
9291A53688N9712b58487b7888r3837j93505a02630M7851J0520D04494b67611a2400
9279a41930p483B50630b17336e2455A11736a87265j41943a31311A27423g0867
9268f3906k13705j4100d97j51406r2J4092J3503e0250C29196a59392D826a51940
9255a98153C1766O9967A741J47671c0194K417q6885J730k0700j28193c7777C8495
9242A19566a48281j07178J21827q8744A81627E5891a35182I3593i4512k33467
$$ y = [-24137, -274619, 21300, 240606, 115512, -129198, 4464, -229403, -214215, -42179, -76853, 406854, -168019, -64015, -91656, -73400, 132752, -64069, 75661, -119312, -149649, 11409, 222596, -446401, -3578, -119627, -88006, -25475, 61535, 80894, -154108, -461252, -398201, -61304, 566, 102743, -612427, 153688, 213400, -258487, -27888, -121725, -315230, -102630, -54779, -44259, 404494, -267611, -12400, -141930, -149413, 250630, -217336, -52455, 111736, -187265, -329208, -131311, 127423, -70867, -63906, -277611, -291711, -497, -151903, -151995, -137903, -124400, -50250, 329196, -159392, 4826, -151940, -198153, 31766, 101733, 1741, 149412, -30194, -27777, -114662, -112932, -133632, -261825, -37777, 38495, 119566, -148281, -255459, -133632, -222376, 181627, 55891, -135182, 93593, -94512, -327979]
9232c27979B8408c9243B39290b475E07124b33776G7312a15572M6110n6807E7398
9220i2892a7693j07171o9874E0475C12b0939q4177f978m50013g3758c1109j9503
9208e0612A6798J52138d5893j23167f2034D8679a02476k41369g6045A68703A0017
9196D9874f7994j4538D26426h9786j83224L5391d0216F1419B8795m51b24095A2652
9183b23703A90157b5697k05136L1801H5603c495j55734d8557B44717c04358a12786
9171c37590J21304A5778d3365k42692B1628b4527k70344A9748R6808f1377B67997
9159b0813F5936O3355A12c50411d8721j83791b8159A13907a6802m12217J4868
9148d14151J87213A51685b39739J04507J7449a2351D24088g3462j27524e8160
$$ y = [-327979, 28408, -39243, 239290, -2475, 507124, -233776, 77312, -115572, -69462, -126269, 57398, -92892, -17693, -124864, -194738, 50475, 312, -20939, -105116, -6978, -456991, -73758, -31109, -50612, 16798, 168936, -45893, -169060, -62034, 48679, -102476, -343845, -76045, 168703, 10017, 49874, -67994, -82532, 426426, -89786, -273010, -237619, -40216, 61419, 28795, 28344, -224095, 12652, -223703, 190157, -25697, -230833, -199032, 85603, -3495, -159229, -48557, 244717, -304358, -112786, -337590, -216286, 15778, -43365, -286057, 21628, -24527, -294871, 19748, 116556, -61377, 267997, -20813, 65936, 129291, 112, -350411, -48721, -232512, -28159, 113907, -16802, -429019, -414151, -226938, 151685, -239739, -135232, -117783, -12351, 424088, -73462, -200986, -58160]
9137f2485B2816K19093H1359N8021i9979k94335D1619J57609q9529B4041R8891
9126A22932a947A78176G807d29161A12279K94951a5626A50553J33672A07854b45717
9114A9263a09777B6107i0861H0267b25709R9617k37852J54879p1025A606R3469
9103I5075d8969G9914b6727A03300N0736a9548A46469c5962a1394l2000K440k81737
9091c22691B86936a12287p1065l8968G4957d9166k43530J07008Q0057F5287P4885
9080A40172f1487A08618a85694p6964A50715c7667k1700J7674C03644a1996A07645
9068f9195F3721K39762b7184j05957F08b64246h5769C864K30384A00296h5486
9056C3227i1458j87806a15308q0696D03158D0136o269c15759a14267c8388G0718
$$ y = [-62485, 22816, 241909, 81359, 139380, -99979, -394314, 41619, 199228, 109699, 24041, 122932, -1947, 178176, 7807, -429161, 112279, 407230, -15626, 150553, 284225, 107854, -245717, 19263, -109777, 26107, -90861, 80267, -225709, -126092, -363944, -209065, -280090, 1606, 95075, -48969, 79914, -26727, 103300, 154036, -19548, 146469, -35962, -11394, -43394, -40954, -322691, 286936, -112287, -183352, -222320, 74957, -49166, -292696, -185688, -105631, 65287, 140172, -61487, 108618, -185694, -262658, 150715, -37667, -59367, -41693, 303644, -11996, 107645, -69195, 63721, 303483, -27184, -133141, 608, -264246, -85769, 3864, 234248, 100296, -85486, 33227, -91458, -279264, -115308, -196004, 403158, 40136, 33867, -315759, -114267, -38388, 70718]
9044a38853D5900J29773J50059b09478D9088f2213j30650P3375p6940Q2215k09035
9033c23248h2361c5901B49433E0811b49476G2008i1299A80010g002k00031d8729
9021F359a75831n8543g7706B85533c61254a28433B02936a57590B9621b49667e4966
9009b59973B67860A19639P1920a56961M8012B0549i4998d3548o37p0033c7865
8997A23007F1452d2658B2105a08631l653j5875e1201k05914L9994c4130j32773
8986a66903D7099a01942p4619M0086I7033a97271g1597D5606e3358m9863p3938
8975a77159A26472a64085P9141A34397a66276q6922Q633A3851a50980A7130b03136
8963a86876j14989e4104m7601j30592B4892J77516a82456I8120a1233k56501F8747
$$ y = [-138853, 45900, 175673, 325732, -209478, 49088, -62213, -192863, -119488, -196428, -114213, -323248, -82361, -35901, 249433, 50811, -249476, 72008, -91299, 180010, -7002, -207033, -48729, 6359, -175831, -234374, -77706, 285533, -361254, -128433, 202936, -157590, 29621, -249667, -54966, -259973, 267860, 119639, 191559, -156961, -108949, 20549, -94998, -43548, -44185, -114218, -37865, 123007, 61452, -42658, 22105, -108631, -112284, -128159, -51201, -257115, -217121, -34130, -166903, 47099, -101942, -176561, -136475, 97033, -197271, -71597, 45606, -53358, -103221, -177159, 126472, -164085, -84944, 134397, -166276, -253198, -244565, 13851, -150980, 17130, -203136, -186876, -301865, -54104, -101705, -232297, 24892, 202408, -182456, 98120, -11233, -267734, 68747]
8951b9067q5960I4677a80282b6032a2394A5651b0078j52171l7868H8543a67370
8939a5234A00117b3454I1858A3968a6818D48752k09523G0819A9807K38307a86729
8927f6180B81459R0669J87601L00891R24790K756747J0735754p484839B190968
8917F50298K58820A79360J08376a89760M2361F4341i8911M6128Q856A18659J00152
8906B18811A1534h5380A01393a50245f979q9998q5804B3301a08779j0715k00594
8895c20088a46025K2340B19481a76005B77503h0733B49601H1246K65982h5586
8884a46334D8261a2646o3597G7628b70851A25643a80331I9522a49922M6035A5006
8872a94886B8315J11738h5987A11941D0640a5072n7914A20748i5825B28905a99458
$$ y = [-29067, -115027, 94677, -180282, -26032, -12394, 15651, -20078, -172249, -210117, 88543, -167370, -15234, 100117, -23454, 91858, 13968, -16818, 448752, 239229, 70819, 19807, 258114, -186729, -66180, 281459, 372128, 559729, 860620, 1785410, 4542157, 15277911, 7793072, 2190968, 650298, 909118, 179360, 287736, -189760, -147399, 64341, -98911, -52783, -43927, 118659, 218811, 11534, -85380, 101393, -150245, -6979, -96977, -182781, 23301, -108779, -119494, -320088, -146025, -123685, 219481, -176005, 277503, -80733, 249601, 81246, 347228, -85586, -146334, 48261, -12646, -76243, 77628, -270851, 125643, -180331, 99522, -149922, -103887, 15006, -194886, 28315, 140053, -85987, 111941, 40640, -15072, -72986, 120748, -95825, 228905, -199458]
8860a6246n028j8304p2292e800A71439a62687A51901c2447A34848b79901C21775
8848b45645h2370B70683b15784D4136M2654b09748A4357L5109J63978a63750l0093
8837a93843f1955A7502i7163k35025E5669a3625k26786A19663a48023d853j85878
8826a90731A2007a83515A80439c49200A36529Q441n9004k3361B8140K8721d9588
$$ y = [-16246, -21274, -39578, -111870, -5800, 171439, -162687, 151901, -32447, 134848, -279901, 321775, -245645, -82370, 270683, -215784, 44136, 86790, -209748, 14357, 49466, 213444, -163750, -193843, -61955, 17502, -97163, -332188, 55669, -13625, -240411, 119663, -148023, -4853, -190731, 12007, -183515, 180439, -349200, 136529, 144970, 85966, 62605, 28140, 56861, -49588]
$$ [...]
##END NTUPLES=NMR SPECTRUM
##END=
