##TITLE=NES1067_159122.0008_002_9705217_n3veQimBWz
##JCAMPDX= 6.0         $$ Bruker NMR JCAMP-DX V2.0
##DATA TYPE= NMR SPECTRUM
##DATA CLASS= NTUPLES
##ORIGIN= BRUKER
##OWNER= Administrator
$$ 1.72 TOPSPIN		Version 2.1
$$ 2016-04-30 17:58:29.099 -0700  Administrator@X
$$ Compression mode = diff/dup
##.OBSERVE FREQUENCY= 400.02188249412
##.OBSERVE NUCLEUS= ^1H
##.ACQUISITION MODE= SIMULTANEOUS (DQD)
##.ACQUISITION SCHEME= undefined
##.AVERAGES= 8
##.DIGITISER RES= 22
##SPECTROMETER/DATA SYSTEM= spect
##.PULSE SEQUENCE= zg30
##.SOLVENT NAME= COFFEE_meoh
##.SHIFT REFERENCE= INTERNAL, COFFEE_meoh, 1, 14.98509
##AUDIT TRAIL= $$ (NUMBER, WHEN, WHO, WHERE, PROCESS, VERSION, WHAT)
$$ ##TITLE= Audit trail, TOPSPIN		Version 2.1
$$ ##JCAMPDX= 5.01
$$ ##ORIGIN= Bruker BioSpin GmbH
$$ ##OWNER= Administrator
$$ $$ E:\/data/COFFEE/nmr/NES1067_159122.0008_002_9705217_n3veQimBWz/10/pdata/1/auditp.txt
$$ ##AUDIT TRAIL=  $$ (NUMBER, WHEN, WHO, WHERE, PROCESS, VERSION, WHAT)
(   1,<2016-04-30 17:58:21.739 -0700>,<Administrator>,<X>,<go>,<TOPSPIN 2.1>,
      <created by zg
	started at 2016-04-30 17:57:15.849 -0700,
	POWCHK enabled, PULCHK disabled,
       configuration hash MD5:
       21 0F 79 D6 B3 7B B4 F6 88 20 88 DB 03 48 BD 9F
       data hash MD5: 64K
       3C 51 32 81 53 F2 39 79 40 AE 71 50 FE 52 8D 34>)
(   2,<2016-04-30 17:58:25.067 -0700>,<Administrator>,<X>,<proc1d>,<TOPSPIN 2.1>,
      <Start of raw data processing
       efp LB = 0 FT_mod = 6 PKNL = 1 PHC0 = 0 PHC1 = 0 SI = 32K 
       data hash MD5: 32K
       62 65 93 9E 00 99 C8 6B A6 60 97 1C 13 16 4D 25>)
(   3,<2016-04-30 17:58:25.349 -0700>,<Administrator>,<X>,<proc1d>,<TOPSPIN 2.1>,
      <pk PHC0 = 98.18481 PHC1 = 0 
       data hash MD5: 32K
       A4 7D E3 91 E0 82 B4 71 35 7D 47 D6 F3 29 4B B4>)
(   4,<2016-04-30 17:58:25.474 -0700>,<Administrator>,<X>,<proc1d>,<TOPSPIN 2.1>,
      <abs ABSG = 1 
       data hash MD5: 32K
       F7 DF 8A CF 09 26 9D 9D 5D 42 59 48 BD 71 9B C5>)
(   5,<2016-04-30 17:58:25.536 -0700>,<Administrator>,<X>,<proc1d>,<TOPSPIN 2.1>,
      <abs ABSG = 2 
       data hash MD5: 32K
       E9 45 70 67 40 D5 00 B6 2D 06 52 B4 FB BC E1 A7>)
(   6,<2016-04-30 17:58:25.614 -0700>,<Administrator>,<X>,<proc1d>,<TOPSPIN 2.1>,
      <abs ABSG = 3 
       data hash MD5: 32K
       43 07 F8 73 DD 88 E9 57 F4 44 57 87 5D F3 DE 9F>)
(   7,<2016-04-30 17:58:25.677 -0700>,<Administrator>,<X>,<proc1d>,<TOPSPIN 2.1>,
      <abs ABSG = 4 
       data hash MD5: 32K
       93 1B 03 6A B8 4D 7F 04 6C DE 3A F0 D6 FC F3 38>)
(   8,<2016-04-30 17:58:25.724 -0700>,<Administrator>,<X>,<proc1d>,<TOPSPIN 2.1>,
      <abs ABSG = 5 
       data hash MD5: 32K
       70 4C 1A 6A 94 44 37 01 21 A7 D0 23 01 9E 24 96>)
$$ ##END=
$$ 
$$ $$ hash MD5
$$ $$ 87 2C EB FC 7C 6B 32 05 FE 88 D4 F9 6B 18 D4 6E
##$RELAX= 
##$RELAX= 
##$RELAX= 
##$RELAX= 
##$RELAX= 
##$RELAX= 
##$RELAX= 
$$ Bruker specific parameters
$$ --------------------------
##$DU= <E:\>
##$EXPNO= 10
$$ [...]
150 150 150 150 150 150 150 150
##$TP07= 0
##$TPNAME0= <>
##$TPNAME1= <>
##$TPNAME2= <>
##$TPNAME3= <>
##$TPNAME4= <>
##$TPNAME5= <>
##$TPNAME6= <>
##$TPNAME7= <>
##$TPOAL= (0..7)
0.5 0.5 0.5 0.5 0.5 0.5 0.5 0.5
##$TPOFFS= (0..7)
0 0 0 0 0 0 0 0
##$TUNHIN= 0
##$TUNHOUT= 0
##$TUNXOUT= 0
##$USERA1= <user>
##$USERA2= <user>
##$USERA3= <user>
##$USERA4= <user>
##$USERA5= <user>
##$V9= 5
##$VALIST= <valist>
##$VCLIST= <CCCCCCCCCCCCCCC>
##$VD= 0
##$VDLIST= <DDDDDDDDDDDDDDD>
##$VPLIST= <PPPPPPPPPPPPPPP>
##$VTLIST= <TTTTTTTTTTTTTTT>
##$WBST= 2048
##$WBSW= 25
##$XGAIN= (0..3)
0 0 0 0
##$XL= 0
##$YL= 0
##$YMAX_a= 533528
##$YMIN_a= -456529
##$ZGOPTNS= <>
##$ZL1= 120
##$ZL2= 120
##$ZL3= 120
##$ZL4= 120
##$ABSF1= 14.98509
##$ABSF2= -5.573092
##$ABSG= 5
##$ABSL= 3
##$ALPHA= 0
##$AQORDER= 0
##$ASSFAC= 0
##$ASSFACI= 0
##$ASSFACX= 0
##$ASSWID= 0
##$AUNMP= <proc_prof1d_extract_pilot.lims>
##$AXLEFT= 0
##$AXNAME= <>
##$AXNUC= <1H>
##$AXRIGHT= 0
##$AXTYPE= 0
##$AXUNIT= <>
##$AZFE= 0.1
##$AZFW= 0.1
##$BCFW= 0
##$BC_mod= 0
##$BYTORDP= 0
##$COROFFS= 0
##$CY= 15
##$DATMOD= 1
##$DC= 0
##$DFILT= <>
##$DTYPP= 0
##$F1P= 0
##$F2P= 0
##$FCOR= 0.5
##$FTSIZE= 32768
##$FT_mod= 6
##$GAMMA= 0
##$GB= 0
##$INTBC= 1
##$INTSCL= 1
##$ISEN= 128
##$LB= 0
##$LEV0= 0
##$LPBIN= 0
##$MAXI= 10000
##$MC2= 0
##$MEAN= 0
##$ME_mod= 0
##$MI= 0
##$NCOEF= 0
##$NC_proc= -8
##$NLEV= 6
##$NOISF1= 0
##$NOISF2= 0
##$NSP= 0
##$NTH_PI= 0
##$NZP= 0
##$OFFSET= 14.98509
##$PC= 1
##$PHC0= 98.18481
##$PHC1= 0
##$PH_mod= 1
##$PKNL= yes
##$PPARMOD= 0
##$PPDIAG= 0
##$PPIPTYP= 0
##$PPMPNUM= 2147483647
##$PPRESOL= 1
##$PSCAL= 4
##$PSIGN= 0
##$PYNMP= <proc.py>
##$REVERSE= no
##$SF= 400.02
##$SI= 32768
##$SIGF1= 0
##$SIGF2= 0
##$SINO= 400
##$SIOLD= 32768
##$SPECTYP= <>
##$SREGLST= <1H.CDCl3>
##$SSB= 0
##$STSI= 32768
##$STSR= 0
##$SW_p= 8223.68421052631
##$SYMM= 0
##$S_DEV= 0
##$TDeff= 65536
##$TDoff= 0
##$TI= <>
##$TILT= no
##$TM1= 0
##$TM2= 0
##$TOPLEV= 0
##$USERP1= <user>
##$USERP2= <user>
##$USERP3= <user>
##$USERP4= <user>
##$USERP5= <user>
##$WDW= 1
##$XDIM= 32768
##$YMAX_p= 377804998
##$YMIN_p= -631882
##$CURPLOT= <Network HP LaserJet P1505>
##$CURPRIN= <$Network HP LaserJet P1505>
##$DFORMAT= <normdp>
##$LAYOUT= <+/1D_H.xwp>
##$LFORMAT= <normlp>
##$PFORMAT= <normpl>
##$SURQMSG= 1
$$ End of Bruker specific parameters
$$ ---------------------------------
##NTUPLES= NMR SPECTRUM
##VAR_NAME=  FREQUENCY,     SPECTRUM/REAL,   SPECTRUM/IMAG
##SYMBOL=    X,             R,               I
##VAR_TYPE=  INDEPENDENT,   DEPENDENT,       DEPENDENT
##VAR_FORM=  AFFN,          ASDF,            ASDF
##VAR_DIM=   32768,         32768,           32768
##UNITS=     HZ,            ARBITRARY UNITS, ARBITRARY UNITS
##FACTOR=    0.250966925370066, 1,           1
##FIRST=     8223.43324360094, 28328,        -234987
##LAST=      0,             -63487,          -23282
##MIN=       0,             -631882,         0
##MAX=       8223.43324360094, 377804998,    0
$$ Real data points
##PAGE= N=1
##DATA TABLE= (X++(R..R)), XYDATA
$$ [...]
19559a82432f5207l9506A64435a87940a2525k27569L7643j9850c157A0872N2751
19548F3623b29185B1072P364K9487J00758d18469a53011j94432D4490L12176a46960
19536A50538J7634i2252B06613b01198B89146a34096A09654b67151J29052l7210
19526a75309E0582f4336b791A49310a37069H9779J5920b6788A409R4212p372l7119
19514E1130b7697m7865J9058A51102m9779a71882f7224A77702f2886r1514o372
19503a60772e5858B2225e9518r1492m2423G9831a51421I2595f9878j16073I9538
19491A5598b82890I724b05768g9540K9950q9122e5084C45162a93974H2550M6332
19480A28882q865a28456b9270m5561K1096j455A64208B8861c02504J30678e4260
$$ plain form
19559 -182432 -65207 -104713 164435 -187940 -12525 -240094 -202451 -222301 -3157 10872 63623
19548 63623 -229185 21072 28436 57923 158681 -418469 -153011 -347443 44490 356666 -146960
19536 150538 168172 -92252 206613 -201198 289146 -134096 109654 -267151 -138099 -175309
19526 -175309 50582 -64336 -2791 149310 -137069 89779 105699 -26788 1409 95621 88249 51130
19514 51130 -27697 -75562 -56504 151102 101323 -171882 -67224 177702 -62886 -154400 -160772
19503 -160772 -55858 22225 -59518 -151010 -193433 79831 -151421 92595 -69878 -185951 99538
19491 15598 -282890 9724 -205768 -79540 -49590 -138712 -55084 345162 -193974 82550 128882
19480 128882 120017 -128456 -29270 -74831 -53735 -55190 164208 28861 -302504 -171826 -54260
19468h8883c7447j14319k01052a3822F940J7257a75850j1293a4306D8073a80416
19456a39018B1082M22J53330B263Q5166F385a22907K6825a1423A784a52576A04898
19443B3429c31312f2474A116M7201K31385b39835c9638G3673a37342b4119o1380
19432h5499K2307A8239c9764m9204A04699J93717c75557A52500f4502j14657n5910
19421b35069J09741c2526o5370c8551E0102a82359d312G451J04028j0858J86050
19410B86671f7497D1355M7171f6130j41051j51336A48003a55897K0020R835I108
19398b19163E549a43433c0407J0314J991H1160b27196q252N6370b3019k47500
19387b70519g1241I3729b78633D6510J24132C3233a15047j9590c4779A0110J23341
$$ plain form
19468 -88883 -37447 -151766 -352818 -13822 6940 24197 -175850 -187143 -14306 48073 -180416
19456 -139018 21082 21504 174834 2263 87429 6385 -122907 -96082 -11423 1784 -152576 104898
19443 23429 -331312 -62474 1116 48317 279702 -239835 -39638 73673 -137342 -24119 -85499
19432 -85499 -63192 18239 -39764 -88968 104699 298416 -375557 152500 -64502 -179159 -235069
19421 -235069 -125328 -32526 -97896 -38551 50102 -182359 -4312 7451 111479 100621 286671
19410 286671 -67497 41355 88526 -66130 -207181 -358517 148003 -155897 -135877 -126042 9108
19398 -219163 5549 -143433 -30407 -20093 -18102 81160 -227196 -235448 -179078 -23019 -270519
19387 -270519 -71241 93729 -278633 46510 170642 33233 -115047 -134637 -34779 10110 133451
19376A33451a9417B96353d33194K06915J2135i8322j004d7140j48818c1156C2510
19364A11193l5910p740k746b5527j25906j38711B89968j43152a38325q2425A86862
19352A02403m5549f9835j97013c8992E738b66939A89565a42460C7781N5500l2055
19341F1226J64b77139A36039a12866j42786j7695A88403b65782k74757J82216
19331c58323J77716L9518k42112A26056a95773F8404d4195A51752n8839b80872
19320b1105C137d1534A32403D4193J21090A0496i5993j13272B1892h7285B08822
19308b31414c545I9358a01848j32854d5732k9454E6667b12375I6594g8149f106
19296A86653a09813j37398A524a50096B9170a17522B86039b5708A53345G1200
$$ plain form
19376 133451 -19417 296353 -433194 -226279 -214144 -98322 -99326 -47140 -195958 -31156 32510
19364 111193 75283 67543 64797 -25527 -151433 -290144 289968 146816 -138325 -220750 186862
19352 102403 56854 -69835 -266848 -38992 5738 -266939 189565 -142460 37781 93281 61226
19341 61226 61390 -277139 136039 -112866 -255652 -273347 188403 -265782 -540539 -358323
19331 -358323 -180607 -141089 -383201 126056 -195773 68404 -44195 151752 92913 -280872
19320 -21105 3137 -41534 132403 44193 165283 10496 -95993 -209265 21892 -87285 208822
19308 -231414 -3545 99358 -101848 -234702 -45732 -75186 56667 -212375 96594 -78149 -6106
19296 186653 -109813 -247211 1524 -150096 29170 -117522 286039 -25708 153345 71200
19285h6830K4608m992B20776I8014K8419b61173E6070a5163j18588K9364B31582
19273a06395k1165N6177C09016q6720b07663Q39A62107g6913G0735g1854m8879
19262a20733b9694p0355a8008F4491J5239b44272Q5236B0445a48378B68759C4507
19250a01792d3925l02086l8306i2102A74047a35531M5278L3812H3e8382K6744
19239c1638A10168g5223H1537J57999a80922N795I8539b2740A72303k3960f2020
19227a78994E3711g7837l5854P89j12592H0275A7822O1889d2874j61246L5428
19216a68692B02521r3125M6895e8371G0946L57507A224b06433l80A32209K919
19205A35128L1904b55905B7511b91370J21743F5404c16353N7343J06464G5244
$$ plain form
19285 -86830 -62222 -67214 220776 98014 126433 -261173 56070 -15163 -133751 -104387 231582
19273 -106395 -127560 -71383 309016 222296 -207663 -206824 162107 -76913 70735 -71854 -120733
19262 -120733 -29694 -100049 -18008 64491 79730 -244272 -159036 20445 -148378 268759 34507
19250 -101792 -43925 -346011 -384317 -92102 174047 -135531 -90253 -56441 83 -58382 -31638
19239 -31638 110168 -75223 81537 239536 -180922 -175127 98539 -22740 172303 148343 -62020
19227 -178994 53711 -77837 -113691 -112902 -225494 80275 17822 79711 -42874 -204120 -168692
19216 -168692 202521 109396 156291 -58371 70946 428453 1224 -206433 -206813 132209 135128
19205 135128 167032 -255905 27511 -291370 -169627 65404 -316353 -259010 -152546 75244
19194A8453a76182A99598j8011b12519R7199j18744b1281k20804o7293A9060R8828
19183A17888J20747B9319b48448A39093b18928e4124F6221J64845D7653a23711
19172a17792B8223K4896a58983F2744b81519b1243j34199n16C5663a97492C45481
19160a88995c2979A24980a08793b5472A03419c46493j20060A30772E2677M62511
19150E15188H1207D989J5367g2076E5162K21623b694j95166B209b72550A2074
19138b0905D51482a07312n9688A2095N8341a02389o6618A3193Q7225K02330H0891
19126B49002G5919J73548f877l5551r9932c8531j67625H6567K2208A7407L28430
19115C45837b78177F1790R6113f7517B2411g3673A28804E7364i4672K6629k68357
$$ plain form
19194 18453 -176182 199598 181587 -212519 -115320 -234064 -21281 -242085 -309378 19060 117888
19183 117888 238635 29319 -248448 139093 -218928 -54124 66221 231066 47653 -123711
19172 -117792 28223 53119 -158983 62744 -281519 -21243 -155442 -155958 35663 -197492 345481
19160 -188995 -32979 124980 -108793 -25472 103419 -346493 -466553 130772 52677 515188
19150 515188 81207 4989 20356 -72076 55162 276785 -2694 -197860 2209 -272550 12074
19138 -20905 451482 -107312 -167000 12095 70436 -102389 -169007 13193 100418 302748 80891
19126 249002 75919 249467 -6877 -42428 -142360 -38531 -206156 86567 108775 17407 345837
19115 345837 -278177 61790 157903 -67517 22411 -73673 128804 57364 -94672 -68043 -336400
19104c36400J09389A96603B3056a27162c5373P240p2987D1528e5498k22392i1566
19092a75832F8587O7615h5760j51349G7862a72187c6240k22847A68158n461c37073
19080b19215i3349p7118N3425G8906B7632c78762B81921a56890d5785k42321h3358
19068A34809b45046e3815j12646j57240O7173b6937j54680j24418a03020n3672
19058a56692A05144A9197K02488d6143j6840A12696a4051o5036J2374A63214b76997
19046e4811k1413j94006A55674h8902r8199B57589A15459m2577f2795q7821j77138
19035c27754B66399i0924G949a79776D9703a75258K1513L2887C03133j48438a54157
19023A44386l3422b7425o3867J9066c2621d367A61849d2519B18249a24667L2875
$$ plain form
19104 -336400 -227011 196603 23056 -127162 -35373 -28133 -101120 41528 -55498 -277890 -91566
19092 -175832 68587 136202 -85760 -237109 77862 -172187 -36240 -259087 168158 162697 -337073
19080 -219215 -93349 -170467 -117042 78906 27632 -378762 281921 -156890 -45785 -288106 -83358
19068 134809 -245046 -53815 -166461 -323701 -256528 -26937 -181617 -306035 -103020 -156692
19058 -156692 105144 19197 221685 -46143 -62983 112696 -14051 -79087 -66713 163214 -276997
19046 -54811 -76224 -270230 155674 -88902 -187101 257589 115459 72882 -62795 -150616 -327754
19035 -327754 266399 -90924 7949 -179776 49703 -175258 -153745 -120858 303133 154695 -154157
19023 144386 110964 -27425 -91292 -72226 -32621 -4367 161849 -42519 218249 -124667 -91792
19012i1792j14016b9864m15752A83232i9983k50082N6400D2216b39641O831A397
19000e2726A8820g3359E0551K28509d1864G8000k0820c8626A40751h5026B20127
18988b6479m10166E5441a98041d665j80310C3316O8220c09190D7310K75045e88672
18976C9467O567c9750G6191M222q663e9716B22983a51811j32267f5774j13431
18965a79205I1870e855r6140j3207B05943b00131N0336q241b4095k12552i8869
18953a16527A20856N0564i6591A6584h1185c9176b862B678J1536c10303B00196
18941C7831O8428b23710P7107A54307c52483d3367j66035E3432q649a22640c1543
18929a15102p6280O4149j02266e1546b4886D6542a39719K4155a4986A5978a87624
$$ plain form
19012 -91792 -205808 -29864 -445616 183232 -99983 -350065 -293665 42216 -239641 -232810 1397
19000 -52726 18820 -73359 50551 279060 -41864 78000 57180 -38626 140751 -85026 220127
18988 -26479 -436645 55441 -198041 -4665 -184975 33316 101536 -309190 47310 322355 -588672
18976 39467 46034 -39750 76191 80413 71750 -59716 222983 -151811 -284078 -65774 -179205
18965 -179205 91870 -5855 -101995 -115202 205943 -200131 -149795 -158036 -24095 -236647 -98869
18953 -116527 120856 171420 -96591 16584 -81185 -39176 -2862 2678 14214 -310303 200196
18941 37831 106259 -223710 -146603 154307 -352483 -43367 -209402 53432 44783 -122640 -31543
18929 -115102 -191382 -127233 -229499 -51546 -24886 46542 -139719 -115564 -14986 15978 -187624
18917b53259A15939h1031B28923i1435d2814a1160C9111a22694F4855i4450A54138
18905a38702B18587e9207e164j76429d0117j34936r8887h7545B8679i4418A2875
18893F7164k4741f1269j9798A35605L9503l2527j0458A8552b9365B06097o6756
18882A39341c0626A44907a33012a2737j10840A2405a0203l1914B77049i3468J4527
18871g8941B17351a27088b951j58440N2063F9899b97870A53615G6661a68734e5214
18859b34943O7232M0623q8649b183D3338g9069H4721a36359q2064C29195F4276
18847a65441r5469g4312b4497l01526h9696F0996P9907c28049a56125O8454E1324
18835c24293J58731A41874b83500E6724J36189a62417L8104k47822k6403A36031
$$ plain form
18917 -253259 115939 -81031 228923 -91435 -42814 -11160 39111 -122694 64855 -94450 154138
18905 -138702 218587 -59207 -5164 -181593 -40117 -175053 -273940 -87545 28679 -94418 12875
18893 67164 42423 -61269 -81067 135605 175108 142581 132123 18552 -29365 206097 139341
18882 139341 -30626 144907 -133012 -12737 -123577 12405 -10203 -42117 277049 -93468 -78941
18871 -78941 217351 -127088 -2951 -161391 -109328 69899 -297870 153615 76661 -168734 -55214
18859 -234943 -167711 -127088 -215737 -2183 43338 -79069 84721 -136359 -218423 329195 64276
18847 -165441 -260910 -74312 -24497 -326023 -89696 60996 140903 -328049 -156125 -87671 51324
18835 -324293 -165562 141874 -283500 56724 192913 -162417 -124313 -372135 -398538 136031
18824B0635c23283c9869l61816a13079B63344A0885a86832j2819N2549A66971
18813a20933C00816a89000C373Q256i1858C92289F3451k2496d7573a2287p832
18802b0119A44768b07686P6392e6344G7060A8766b1248A40756E9449d3889j49914
18791a93803g979j01450C7982J72403A4550a79865C7726a01367j80427A51973
18780b37456g0316B90184E1149h0024j24877Q9456J7011O70C1244H920d5379k26467
18768b71846q0709C5480J03345A2248b03769A85330b88661A16563i2428A19232
18757B4451f714A44824C0892c23659a30658e6804j77087C5001i0391K5829p7451
18746a42013I573J43310a3198n9864o5571e6480j44433o2174M5712A52765l0576
$$ plain form
18824 20635 -323283 -39869 -401685 -113079 263344 10885 -186832 -199651 -147102 166971
18813 -120933 300816 -189000 3373 11629 -91858 392289 63451 40955 -47573 -12287 -20119
18802 -20119 144768 -207686 -131294 -56344 77060 18766 -21248 140756 59449 -43889 -193803
18791 -193803 -7979 -109429 37982 210385 14550 -179865 37726 -101367 -281794 151973
18780 -237456 -70316 290184 51149 -80024 -204901 -115445 -98434 -97764 31244 8920 -45379 -271846
18768 -271846 -352555 35480 138825 12248 -203769 185330 -288661 116563 -92428 119232
18757 24451 -6714 144824 30892 -323659 -130658 -56804 -233891 35001 -90391 -64562 -142013
18746 -142013 9573 152883 -13198 -73062 -138633 -56480 -200913 -263087 -217375 152765 122189
18735A22189a93455i4753j47566b5738B81636A35302b00744d4596J4582A51927
18724B8562N1806b14647K152i0158m31750J91504B6514J419Q495b0941C8209P7982
18712A16191J29189I9322b32671A81262N9041B2265c26172C1592J58387e9802
18701d60197A811Q4521a43625A5560d17943f3435B25974b88270i4806B42421d86183
18689e2733D5966d1224j26484L4649K6007a0975j87877C29606A60088a38108A26066
18677A60863f202B6751f5004j75912N8267B32657j09577f0316p2768O5497a0412
18665e8878E1171a0639j79056A4928b02068B3946h6963j69763J02368e105j50866
18654a55971A56617F2207b11906A13212b85969q9232J37949A44877L8324p5447
$$ plain form
18735 122189 -193455 -94753 -242319 -25738 281636 135302 -200744 -44596 -30014 151927
18724 28562 80368 -214647 -212495 -90158 -521908 -330404 26514 27933 36428 -20941 38209 116191
18712 116191 245380 99322 -232671 181262 240303 22265 -326172 31592 189979 -59802
18701 -460197 1811 86332 -143625 15560 -417943 -63435 225974 -288270 -94806 242421 -486183
18689 -52733 45966 -41224 -167708 -133059 -107052 -10975 -198852 329606 160088 -138108 126066
18677 160863 -6202 26751 -65004 -240916 -182649 232657 123080 -60316 -133084 -67587 -10412
18665 -58878 51171 -10639 -189695 14928 -202068 23946 -86963 -256726 -154358 -5105 -155971
18654 -155971 156617 62207 -211906 113212 -285969 -375201 -237252 144877 183201 107754
18644A07754g780A38656a72042D0367K4772b7652j33776g2212l15079J40657B48794
18632f1583A21642E5514a47594A40086J10662o4157C9554Q6570J67275a38598
18621f5706D1310P1970K01992A16306E7022g2188j02973k0017n8364B3905b24369
18609H0557h2856H9517C287i2879a1212B93987a19790n2288A1985J3530R266b51154
18596G8210O3971c32833B2657a22946B3778N3269k9097R8554d8109q7089L1437
18585a03761G173Q041J19147g019m03567b191j03016j6406b0323O83K11A1097
18572a39229j32813h0795k8570L5087j99035a02992B61564k75D6443a70239j10530
18561b80769e8430j34007e5137n6199q1364c1814K240B8183O5357L3362A9982
$$ plain form
18644 107754 -7780 138656 -172042 40367 65139 -27652 -161428 -72212 -387291 -246634 248794
18632 -61583 121642 55514 -147594 140086 250748 186591 39554 126124 293399 -138598
18621 -65706 41310 113280 315272 116306 57022 -72188 -175161 -195178 -253542 23905 -224369
18609 80557 -82856 89517 3287 -92879 -11212 293987 -119790 -172078 11985 25515 34781 -251154
18596 78210 142181 -332833 22657 -122946 23778 77047 47950 146504 -48109 -135198 -103761
18585 -103761 7173 15214 134361 -7019 -410586 -2191 -105207 -121613 -20323 -19640 -19429 11097
18572 -139229 -272042 -80795 -109365 -74278 -273313 -102992 261564 261289 46443 -170239 -280769
18561 -280769 -58430 -192437 -55137 -111336 -192700 -31814 -29574 28183 93540 126902 19982
18549g3762k16L5234m0769L6152A3384a75562A87785a92747B4304i6399J5218
18538h1181k1455c5349k94379J45053d9308B2782a15188E6644M9849c6951k6552
18527f3503p687B5570g3201a8908k34469I6335e9020j95343j34312A49756C5206
18515A32831k320n0845b73704c2334q2054B7427J4967c2798q8093k89661J32598
18504b77954a23703O479F098a59292M8814A60323A9501e0482l2944A43828j4822
18493A29006c2307B68820a76567h6837o6692P6591H9849C4594b53474c7611A12883
18481b80485e843A60488a98517C8215R7760a60121L2950E8856Q2051a38253d0692
18469B1670b8452j64178c3713r4914D0046J8933K37326b62540c6748m8676b8666
$$ plain form
18549 -73762 -73978 -38744 -79513 -43361 13384 -175562 187785 -192747 24304 -96399 -81181
18538 -81181 -102636 -35349 -329728 -184675 -49308 22782 -115188 56644 106493 -36951 -63503
18527 -63503 -71190 25570 -73201 -18908 -253377 96335 -59020 -254363 -388675 149756 35206
18515 132831 130511 79666 -273704 -32334 -114388 27427 42394 -32798 -120891 -410552 -277954
18504 -277954 -123703 -117224 6098 -159292 -110478 160323 19501 -50482 -83426 143828 129006
18493 129006 -32307 268820 -176567 -86837 -153529 -76938 89849 34594 -253474 -37611 112883
18481 -280485 -5843 160488 -198517 38215 135975 -160121 -127171 58856 140907 -138253 -40692
18469 21670 -28452 -192630 -33713 -128627 40046 58979 296305 -262540 -36748 -85424 -28666
18457C76610a90007A77262D5072a46571j06853e7003a5311k10329i7827E2395
18446b93685B8536a84968k2375b0059g802H4478L1951M0830h1290L9821C7856
18434a84160A03922R672n0670L0487b9934A31511j986D8830d8212G7460B9196
18422d8137k01196a7888k2192B768L6713e4464J225B57307c13128j03293a60555
18410A21448J69393a90628D6736K132B3228a42099e526A6723J06712a74609a8353
18398F5281a34687d5197A57579b1911j41676b0199j07267A32910B3890d16357
18387f2091l653A84206e3633E3882L2631a03272c0596l10309d3038C0279a30977
18375F2975c3521m3970B1862e1696j05787l017C4540O3724c7895n7497D5702b01321
$$ plain form
18457 376610 -190007 177262 45072 -146571 -253424 -57003 -15311 -225640 -97827 52395
18446 -293685 28536 -184968 -207343 -20059 -7802 84478 116429 157259 -81290 -41469 37856
18434 -184160 103922 113594 62924 93411 -29934 131511 129525 48830 -48212 77460 29196
18422 -48137 -249333 -17888 -40080 2768 39481 -54464 -53239 257307 -313128 -416421 -160555
18410 121448 290841 -190628 46736 48868 23228 -142099 -5526 16723 123435 -174609 -18353
18398 65281 -134687 -45197 157579 -21911 -163587 -20199 -127466 132910 23890 -416357
18387 -62091 -65744 184206 -53633 53882 86513 -103272 -30596 -340905 -43038 30279 -130977
18375 62975 -33521 -77491 21862 -51696 -157483 -160500 34540 98264 -37895 -95392 45702 -201321
18362b38382R86a12819C17149b3001j7153a698A80360c12429H0085J27903a11378
18350a85403A92842F1547a53018M9686E2468K7145g222B36091e1891J2746q8033
18339a27178L5529I6671a66287H4273p899c3404j53264b7883C4888K25847C7171
18327G7250k0292a34548j03282R031c9937j68884E8736a41688F4022N3253a26520
18315I7419Q8583b9943K558j64862h0109j09302b7087B63554i1801c6020a1157
18303h3818B26095b58485J27772c3749A74178P7198n6198B4516a05598C13511
18292G0433c5814j98579j15759E346a75706p8880a9845l09170B1411a3739A48132
18280A47244b9381C4114a22064b4498C13291c3285j33923O8615r3614k7437j17161
$$ plain form
18362 -238382 -237396 -112819 317149 -23001 -40154 -1698 180360 -312429 80085 207988 -111378
18350 -185403 192842 61547 -153018 -103332 52468 79613 -7222 236091 -51891 -39145 -127178
18339 -127178 -91649 96671 -166287 84273 76374 -33404 -186668 -27883 34888 260735 37171
18327 77250 56958 -134548 -237830 -228799 -39937 -208821 58736 -141688 64022 117275 -126520
18315 97419 186002 -29943 -27385 -192247 -80109 -189411 -27087 263554 -91801 -36020 -11157
18303 -83818 226095 -258485 -130713 -33749 174178 251376 195178 24516 -105598 313511
18292 70433 -35814 -234393 -350152 5346 -175706 -254586 -19845 -329015 21411 -13739 148132
18280 147244 -29381 34114 -122064 -24498 313291 -33285 -167208 -98593 -192207 -219644 -336805
18269c36805a6755l73265C37816A42955a73069J1877E4141b54000a11151e0729
18258b38628A18964m6169e7345A03163a55401A39468b32720A33823D6825a19299
18247e06772g0589j15667C19070B4433b8232E6251b72406A453i9281j2676k53996
18236c65953d4284k12998J27149D1099K4477j735g2754A93661i9456l44275D19342
18224a70732C3029d1022C23227C8855Q0983b13196A85570q6982l9416b33086q3570
18213c16656A44743e7682a4782j21840A49735a09807A06139b60134C5359d16486
18202F8916L52700e4161k87393Q1012A35799a400I1660b1561o8678E0522i7472
18190C9391P7522C380J52871d85585F8787k2791J07992e9324o6985j25629C54930
$$ plain form
18269 -336805 -16755 -390020 337816 142955 -173069 -161192 54141 -254000 -111151 -50729
18258 -238628 118964 72795 -57345 103163 -155401 139468 -232720 133823 46825 -119299
18247 -506772 -70589 -186256 319070 24433 -28232 56251 -272406 1453 -99281 -111957 -365953
18236 -365953 -44284 -257282 -130133 41099 65576 63841 -72754 193661 -99456 -443731 419342
18224 -170732 33029 -41022 323227 38855 119838 -213196 185570 98588 59172 -233086 -316656
18213 -316656 144743 -57682 -14782 -136622 149735 -109807 106139 -260134 35359 -416486
18202 68916 421616 -54161 -341554 -260542 135799 -1400 91660 -21561 -90239 50522 -97472
18190 39391 116913 3380 156251 -485585 68787 45996 153988 -59324 -126309 -251938 354930
18178a15921c0843A1357b3705k15721J17561B4707a99701O1325F1072L05395c8255
18166c9685m9937F7406Q8308g0666A5222b8567B3297o292a7607E4544I115Q8582
18154I7697A4206J10821k0748J00514c83428a60653I5454O2060p8282C7286a5411
18142A17122O6559b69003a18484l3904m526F8054a74212A56988b7550B73128i4614
18130A7771g4061A98068o8550j0156m8657J01510J66527c88323E3718b28406A28316
18118d1906j59659m4823b0611q0742A45629C6819P0687m2102M3794A1787d39549
18106g9207k27474a22849j75455B8687P9912e31224g6867p8624k0698A9167K22262
18095B41429i7537E0007f0210J7982l01183a20048b7073A18636i6074o846j13159
$$ plain form
18178 -115921 -30843 11357 -23705 -239426 -121865 24707 -199701 -138376 61072 366467 -38255
18166 -39685 -89622 67406 155714 -70666 15222 -28567 23297 17005 -17607 54544 9115 97697
18154 97697 14206 125027 104279 204793 -383428 -160653 95454 157514 79232 37286 -15411
18142 117122 183681 -269003 -118484 -152388 -156914 68054 -174212 156988 -27550 273128 -94614
18130 17771 -74061 198068 129518 119362 70705 172215 338742 -388323 53718 -228406 128316
18118 -41906 -201565 -246388 -20611 -101353 145629 36819 107506 65404 109198 11787 -439549
18106 -79207 -306681 -122849 -298304 28687 108599 -531224 -76867 -155491 -176189 19167 241429
18095 241429 -97537 50007 -60210 -42228 -343411 -120048 -27073 118636 -96074 -102920 -216079
18084b16079A63362e8113q9468B12798J8620k7866B7424J54458m9701b41809a11619
18072B2748J68971a34192C7820b2983j26258B57723g4021B43918G5681i6275H5185
18060e8398q5096N1710C0382P9526g44B68296r7415G0646a23157K3835H3397c76524
18047a07593A64845p2413K29910a49029B67745a40965B33142a20159J1551J0529
18037i8079B2749D036M3370c54464d6148n0927M568k56458f004j20136p6784D23004
18024d7840B43391a9854k50941F8094M59027A64644d64852A55405j2898K03945
18014C46452b34610b5818k53627e8832J4307H7917N8499b38831a6690o2280A46173
18002A79643a23651C8911g9718A65984A7771l189O0686b6069A27193D0246a19378
$$ plain form
18084 -216079 163362 -58113 -147581 212798 231418 203552 27424 181882 132181 -241809 -111619
18072 22748 191719 -134192 37820 -22983 -149241 257723 -74021 243918 75681 -96275 85185
18060 -58398 -143494 -91784 30382 109908 -744 268296 170881 70646 -123157 -99322 83397 -376524
18047 -107593 164845 92432 322342 -149029 267745 -140965 233142 -120159 -108608 -98079
18037 -98079 22749 4036 47406 -354464 -46148 -97075 -92507 -348965 -6004 -126140 -202924 423004
18024 -47840 243391 -19854 -270795 68094 527121 164644 -464852 155405 142507 346452
18014 346452 -234610 -25818 -279445 -58832 -44525 87917 146416 -238831 -16690 -78970 146173
18002 179643 -123651 38911 -79718 165984 17771 14582 75268 -26069 127193 40246 -119378
17990B69406c27355i8310G6081N0605P2958a08390A04502a32212H3560a21740
17979e7421m3147A08486c5037G6650e7318B69866a25811j8534k2067q6534Q0308
17968a72638P8905I8064a88540B843M4274A6730K2666i928j05550R2H5730o425
17956G9305g5598A15033c06502A55478d07274B57346o7455j1175o3617a9807A56471
17944A78497R2810C8475c2492A90013a24042k44608E0512a13441j5958c6451l53105
17933c89556B00259a18086k39175H5060a01130B1791J48228e002B89987b46462
17922a47331b5045B17473q8587e5369k7962j59972D1058d4582J35A07655C23a3165
17909a33807e0324B42594p1741c7430D3508J22125a78273i775j87160A82829Q3260
$$ plain form
17990 269406 -327355 -98310 76081 126686 199644 -108390 104502 -132212 83560 -121740
17979 -57421 -100568 108486 -35037 76650 -57318 269866 -125811 -144345 -166412 -252946 -172638
17968 -172638 -93733 98064 -188540 2843 47117 16730 39396 -9928 -115478 -115386 85730 79305
17956 79305 -75598 115033 -306502 155478 -407274 257346 189891 178716 115099 -19807 156471
17944 178497 271307 38475 -32492 190013 -124042 -368650 50512 -113441 -129399 -36451 -389556
17933 -389556 200259 -118086 -357261 85060 -101130 21791 170019 -5002 289987 -246462
17922 -147331 -25045 217473 128886 -55369 -83331 -243303 41058 -44582 -44447 107655 323 -13165
17909 -133807 -50324 242594 170853 -37430 43508 165633 -178273 -9775 -196935 182829 266089
17898B66089e1628m4278j68097E0530b0462p3054L7007A53462a14276M7088A08482
17886A34179b49055G6045K3927J64519E9049Q3776a09240M0554b8640m9610o8022
17875a46272G3567C3226K21703a56641C07901i1226A26955c54150H8758K5618
17865A14376B1697b53095A3044a24576a3252j55247b8978C34938b3202j067A03278
17853H4904J49860j09846D2097A3305a53657M9656B29148b20681A44918a32615
17842A46215a2612H8305l511m1625h665k93527D6803J13090Q6720a73609A97093
17830c3157H2086a09242m0114L2815C57612I0599b07507i6309A25153A9053Q393
17819B7446N9714j9019a06812A17300P7495F7442a3304A12791a69621A17539D143
$$ plain form
17898 266089 -51628 -95906 -264003 50530 -20462 -93516 -56509 153462 -114276 -67188 108482
17886 134179 -249055 76045 99972 264491 59049 142825 -109240 -68686 -28640 -78250 -146272
17875 -146272 73567 33226 254929 -156641 307901 -91226 126955 -354150 88758 114376
17865 114376 21697 -253095 13044 -124576 -13252 -168499 -28978 334938 -23202 -24269 103278
17853 84904 234764 124918 42097 13305 -153657 -104001 229148 -220681 144918 -132615
17842 146215 -12612 88305 84794 43169 -8665 -302192 46803 159893 246613 -173609 197093
17830 -33157 82086 -109242 -149356 -116541 357612 90599 -207507 -96309 125153 19053 27446
17819 27446 87160 68141 -106812 117300 194795 67442 -13304 112791 -169621 117539 4143
17807d1337i883c088k6366k11G8816N5446N493h361k25976J14768c6520p1716
17795a08236G5603C82a0258A44377b351k29757O4795D1886K94280j53953A3156
17783D50772k06199E7916a10283o9694a0992A69973e1092A27559a55666k37261
17773c92927A57539c2435A69709e4293F3316M5379a01252B813O65L2600L5726
17762G1804b56041A00107p065G753c43079c2708F033b96357d4554j77300c04B62646
17749B6596b28935A78997o6165c24584h865F8858f1868j32001k43414F6595d85609
17737b00175A99067a09229A56753d2894A58454a89970P7884B29041A00448J84685
17727B85133l0043a186q5210E6773I964P9035M3215K33268a95620a2981B08393
$$ plain form
17807 -41337 -9883 -3088 -29454 -29665 78816 134262 139755 -8361 -234337 -119569 -36520 -108236
17795 -108236 75603 382 -10258 144377 -2351 -232108 -167313 41886 336166 182213 13156
17783 450772 244573 57916 -110283 -179977 -10992 169973 -51092 127559 -155666 -392927
17773 -392927 157539 -32435 169709 -54293 63316 108695 -101252 2813 3478 36078 71804
17762 71804 -256041 100107 93042 7753 -343079 -32708 6033 -296357 -44554 -221854 -304 262646
17749 26596 -228935 178997 112832 -324584 -8865 68858 -61868 -193869 -437283 66595 -485609
17737 -200175 199067 -109229 156753 -42894 158454 -189970 -112086 229041 100448 285133
17727 285133 255090 -1186 -86396 56773 9964 88999 132214 365482 -195620 -12981 208393
17715A68529F5513b6154D1164D106J24321f6884n3209A34334J97644j36883a57960
17703b27561j44131C12072a25B2089K92313B0767a98722d9576B77172A17406b62740
17691A62256r484L3323B406J98986r0612b71280C45520b18381r5502B42758b93404
17679B7304a41166C6287N0295b33771O5449B17130f7026A47923J08210a01705
17668D7139J6695F949K64327d966r6914E2892G815K26709n9507m3654q055N570
17656A28878g5141k65998C73102I9657b6995A92583a28956M4893B44264b15793
17645h1547j60053B26730g1018D5672C503e9703j7466A25258g2759K5007k07648
17634b55400E4236M2988c83216F037a20785M3439B29070F6938a8743n9320F3012
$$ plain form
17715 168529 65513 -26154 41164 4106 128427 -66884 -120093 134334 331978 195095 -157960
17703 -227561 -371692 312072 -125 22089 314402 20767 -198722 -49576 277172 117406 -262740
17691 162256 152772 186095 2406 201392 110780 -271280 345520 -218381 -313883 242758 -293404
17679 27304 -141166 36287 86582 -233771 -168322 217130 -67026 147923 256133 -101705
17668 47139 63834 6949 271276 -4966 -101880 52892 7815 234524 175017 131363 123308 128878
17656 128878 -75141 -341139 373102 99657 -26995 192583 -128956 -84063 244264 -215793
17645 -81547 -241600 226730 -71018 45672 3503 -59703 -77169 125258 -72759 -47752 -255400
17634 -255400 54236 97224 -383216 6037 -120785 -77346 229070 66938 -18743 -78063 63012
17622a09834k04928i5563A22773J53512j37818K6034g61A97958b890F3903c68919
17610G6435b1828A04565i6579j63481R9835P3431n1725D62676B19108A00556j7738
17599H2818O6024c5937H5007i020A15942a60542b5907d717A49286c13108B84835
17587A01202a72225n5676F1186g4450k06645b7669A03602A7219J4659d1569D51900
17575h5827a9622A87895l4196D8486K37048A15777M0286B5008L36256A49432H437
17563A44482d4916A84146p9264L7817K8569m1283k3010n2660B2473K7515L631
17552E3619a49531A52453K15323A35716K27007A10202a45133e3002G2013Q7304
17542A59317O28f1332E7257a40596A38446P2284F7844a67095G0480b3331B54561
$$ plain form
17622 -109834 -314762 -95563 122773 276285 138467 164501 -761 197958 -2890 63903 -368919
17610 76435 -21828 104565 -96579 -260060 -160225 -86794 -138519 462676 219108 100556 82818
17599 82818 148842 -35937 85007 -9020 115942 -160542 -25907 -4717 149286 -313108 284835
17587 101202 -172225 -227901 61186 -74450 -281095 -27669 103602 17219 31878 -41569 451900
17575 -85827 -19622 187895 153699 48486 285534 115777 156063 25008 361264 149432 8437
17563 144482 -44916 184146 104882 142699 171268 129985 106975 54315 22473 49988 53619
17552 53619 -149531 152453 367776 135716 362723 110202 -145133 -53002 72013 159317
17542 159317 159945 -61332 57257 -140596 138446 210730 67844 -167095 70480 -23331 254561
17530A12365f9661C28020E102J16225m6917A8152c62480a40794B67003E4137J05281
17519A59418l4413R2601a33785d2937B94780j34555D239a73005D9540J58278R4846
17508C02664g8963D03401j76854l827P2255e1251A45133m0646J8417J0310h5665
17496a76008C35933M8055A11957b745B34704A08504R8867r2056J33760E0000a097
17484a79978e2113p581B86317J22234i2947B92398r0656a03177B30108k3491b63980
17472A84558p9730O4766J28797j22369F88J29497a59057A90950d3358B3992J07559
17461A31551d6139B38284k881b42340A37179O3872J26097D461M43352B01562M4030
17450B45592h6090B15966p1221L0797l9411J86513E5821a3995j15709B12416J09603
$$ plain form
17530 112365 -69661 328020 5102 121327 74410 18152 -362480 -140794 267003 54137 159418
17519 159418 125005 217606 -133785 -42937 294780 160225 4239 -173005 49540 207818 302664
17508 302664 -78963 403401 226547 222720 294975 -51251 145133 104487 122904 133214 -85665
17496 -176008 335933 383988 111957 -2745 234704 108504 207371 115315 249075 50000 -1097
17484 -179978 -52113 -59694 286317 408551 -92947 292398 201742 -103177 230108 206617 -263980
17472 184558 104828 169594 298391 176022 688 130185 -159057 190950 -43358 23992 131551
17461 131551 -46139 238284 235403 -242340 137179 201051 327148 4461 447813 201562 245592
17450 245592 -86090 215966 144745 175542 136131 322644 55821 -13995 -129704 212416 322019
17439C22019E6592K30042K5525j06317m526I2032J49971b7744A75358J67195A28940
17427B68986l346j16385K5643g0496B83563i8472A03568m6208K6009A8810K95684
17416C14494L5080A54778I986J60424j5256f061j74763h175j19572B20127E6759
17404I2895J88929b07656F7387J01774J12371a43749f8824A58480G6407B1187
17393a5927E9739B3613J0055R3403a28871l08510e9192A0243O3258M883J49952
17382B28336i0289C77839A45919N3210J9427b34178F2342k5139N4951Q5526P8843
17371B56523G1197a11883A21159D8779L0532c9373B33091e2552j22923A42795
17360A09378b29671B38056j00919Q6775n7136k02a99307g5348d01B98263G5165
$$ plain form
17439 322019 56592 286634 312159 205842 201316 92032 242003 -27744 175358 342553 128940
17427 268986 265640 149255 174898 -70496 283563 -98472 103568 57360 83369 18810 314494
17416 314494 349574 154778 9986 170410 155154 -6061 -180824 -8175 -127747 220127 56759
17404 92895 281824 -207656 67387 169161 281532 -143749 -68824 158480 76407 21187
17393 -15927 59739 23613 33668 127071 -128871 -437381 -59192 10243 73501 78384 228336
17382 228336 -90289 377839 145919 199129 218556 -234178 62342 37203 92154 177680 256523
17371 256523 71197 -111883 121159 48779 79311 -39373 233091 -52552 -175475 142795
17360 109378 -229671 238056 137137 223912 166776 166574 -199307 -75348 -401 298263 75165
17348I7335K66264L1218c54509B93307j22396A6386Q6336b5881A35842f2333H9607
17336B30421a9236A49233J05222D458K27944G4054L4920l1147K4877H894a6367
17324C9100M7520J13284a13979R620C76907A87061A6853b00997k7144D0031J4239
17313E4270J94258G0391d5233B22652n9182e7230r4012B81833j17470J01910j00153
17302A66120E9604B314c23388b3450C87699j58619k8814a4954q4218H8400C9983
17290a81086r9393a8639A477b87018A79377J08101K6648p734R065A45063a18461
17278a54600H833B920K38774A11481K19882J35038G9943K17120h1712A06161J65702
17267B71863p7303r5562L8642a27585D39632F1152M2814a70729E2364K11364H6942
$$ plain form
17348 97335 363599 394817 -354509 293307 170911 16386 102722 -25881 135842 -62333 89607
17336 230421 -19236 149233 254455 4458 232402 74054 108974 77827 102704 8894 -16367
17324 39100 86620 199904 -113979 -104359 376907 187061 16853 -200997 -228141 40031 54270
17313 54270 248528 70391 -45233 222652 163470 -57230 -151242 281833 164363 266273 166120
17302 166120 59604 2314 -323388 -23450 387699 229080 200266 -14954 -99172 88400 39983
17290 -181086 -280479 -18639 1477 -287018 179377 287478 314126 306392 315457 145063 -118461
17278 -154600 8833 2920 241694 111481 331363 466401 79943 297063 -81712 106161 271863
17267 271863 194560 98998 137640 -127585 439632 61152 103966 -170729 52364 263728 86942
17255A46319E8648k957Q1440a09234j67218A79715k1460k8811L8902K77329H662
17243A20175J81526B3670R4894J15740l3272a31710H6152e2268A44024J79093
17233C23117j36936i2085B97131G5341i577A21437R8998B9766L33706A21768d0136
17221B57856J5808k3708j03117K37163J02323H1979M2725a32953H3677J33226
17211B16903k0773J07452I8437k5795f9059H8808A5196K62640H6359k6483K17751
17200B77627A18719K48637M7991j70401A21148J37293e6168B65174N096m3954
17190B26316p525d6861D84648B41849F876K04866a89411A86763J4707a25306b4890
17178A85299J05192K6587A28000J40709A08081K55341G222J00183K82271a4714
$$ plain form
17255 146319 58648 55691 137131 -109234 -276452 179715 158255 129444 168346 445675 8662
17243 120175 301701 23670 118564 234304 201032 -131710 86152 -52268 144024 323117
17233 323117 186181 -92085 297131 75341 -9577 121437 220435 29766 363472 121768 -40136
17221 257856 273664 249956 146839 384002 486325 81979 124704 -132953 83677 216903
17211 216903 196130 303582 98437 72642 -69059 88808 15196 277836 86359 59876 277627
17200 277627 118719 367356 415347 244946 121148 258441 -56168 265174 270270 226316
17190 226316 218791 -46861 484648 241849 6876 211742 -189411 186763 201470 -125306 -24890
17178 185299 290491 317078 128000 268709 108081 363422 7222 107405 389676 -14714
17167C16748i7710C03618j13599J93681j03744J07501B4898M01125j34182M2523
17157C34364o7206D4445M23724j53406c4420A06026M8069J77451O5403A77749
17146C83858A41886M18786B45532G2410J76353H7289O5253K07394j12065K20542
17136D68413j93512b5810A90729O4742j18473e7100A44139e9871B17542I9105
17125G23454B18651Q9592j24460j4031L03427j82329G379J50108J43613J06969
17115D08069J03648k25589M03010B97268E4407J93170K02493k05966J84227m1700
17105C86631a19389C90141k1718E3487N83483f5405B23839F228L9904K83111l4743
17094B94500J41451j5801A47512M23032j05458J92596A74960b6800C33494A07147
$$ plain form
17167 316748 -97710 303618 190019 383700 279956 387457 24898 426023 291841 334364
17157 334364 267158 44445 468169 314763 -34420 106026 154095 331546 396949 177749
17146 383858 141886 560672 245532 72410 248763 87289 152542 359936 247871 468413
17136 468413 274901 -25810 190729 255471 136998 -57100 144139 -59871 217542 99105
17125 723454 218651 308243 183783 169752 473179 290850 7379 157487 301100 408069
17115 408069 511717 286128 689138 297268 54407 247577 450070 244104 428331 386631
17105 386631 -119389 390141 368423 53487 636970 -65405 223839 6228 46132 329243 294500
17094 294500 435951 420150 147512 570544 465086 657682 174960 -26800 333494 107147
17083D59680j09428k3106m5302o6390A01232M24488j75872J68328G6140M4331
17073A20471M87724k09801m504G2328L30214j06519D6466L81936E2228K41052
17063B93280A1033L65778j06649K94432L3366k91107K60342k05932M607L4710
17053D00580n7587J7209M3994o2174H3000N69984C05014L4593m8141B9026K60570
17042B89596j1477K06996j26994A25770L74557j29364a3347A78840R0307K91138
17032E60285B44550A18219J49962J94291P6877j90761o6908j16534L24343j00387
17022C89102Q3691j16294r1867J21983j62613k3017M76863A35845L01755r1439
17012C46161o4623p9846K25330o6740K00813k46637K43407j486K1493j19751j04168
$$ plain form
17083 459680 350252 327146 281844 215454 101232 525720 349848 518176 76140 120471
17073 120471 608195 398394 393890 72328 402542 296023 46466 428402 52228 293280
17063 293280 11033 376811 270162 564594 597960 306853 567195 361263 365870 400580
17053 400580 342993 360202 404196 342022 83000 652984 305014 339607 291466 29026 289596
17042 289596 278119 485115 358121 125770 500327 370963 -13347 178840 269147 560285
17032 560285 244550 118219 268181 462472 539349 348588 281680 165146 489489 389102
17022 389102 472793 356499 264632 386615 224002 200985 677848 135845 437600 346161
17012 346161 281538 201692 427022 360282 561095 314458 557865 556379 577872 458121 353953
17001C53953K45458P727j36254l8058J8210n6292L81821k92235J31426k78761
16991C36995j47028L71812j96011J26322J96131k28275J38474J87103k71650j42643
16981C71230J14971J39767J10146k96251K29705r5196P4250D2396J13071M41998
16971E97465k0899R5110K8955k03691R229K15753m1136B94309m022K30300J92102
16960G12689k24742n9374j95059P05080k50683o7907M6787j58468N6339N3560
16950F18222L12373k71817A31086O59842q9369k4328k8158q6696L42265Q1827
16940I86469j64293k05632j80392L26582j20483L33546j67751J77352j81034j25711
16930F78653J84359N1360R1592j34564m786n3477m9875K6969K02378k30470L48277
$$ plain form
17001 353953 599411 607138 470884 432826 451036 394744 776565 484330 615756 336995
16991 336995 189967 561779 365768 492090 688221 459946 598420 785523 513873 371230
16981 371230 486201 625968 736114 439863 669568 574372 648622 42396 155467 597465
16971 597465 576566 671676 700631 496940 506169 721922 680786 294309 290287 520587 712689
16960 712689 487947 428573 233514 938594 687911 620004 666791 508323 564662 618222
16950 618222 930595 658778 131086 790928 701559 677231 649073 562377 904642 986469
16940 986469 822176 616544 436152 762734 642251 975797 808046 985398 804364 678653
16930 678653 863012 914372 1005964 871400 866614 813137 763262 790231 992609 762139 1110416
16919A110416k37660k17068L86756l9113K542J11473k30296K91255k47681O8701
16909I99325o4641K42532L3551j55287o0951J31630l54639K90540K79087k48253
16899A092894K3630Q5308J3785Q3547k14400K60008l86947N11036l12572j3359
16889A142930M0558K81369k89176j39433L00342L01820p9913j66359J37272k53030
16879A276380p9039L76876k494m01403N59412m60476K48406L60609r5323r4597
16869A688351k4395N4622O2225N4724j31065K76392K1968k2109k46691M9952K64382
16858B048356l015p8560Q0357k14992J28355J76367J51737k4603J73594k76858
16848B160738L11591K59844j99382m21676L86252l71986N10236r5050M18886k51422
$$ plain form
16919 1110416 872756 655688 1042444 1003331 1005873 1117346 887050 1178305 930624 999325
16909 999325 934684 1177216 1210767 1055480 994529 1126159 771520 1062060 1341147 1092894
16899 1092894 1116524 1201832 1215617 1299164 1084764 1344772 957825 1468861 1156289 1142930
16889 1142930 1183488 1464857 1175681 1036248 1336590 1638410 1558497 1392138 1529410 1276380
16879 1276380 1197341 1574217 1571723 1170320 1729732 1269256 1517662 1878271 1782948 1688351
16869 1688351 1663956 1718578 1780803 1835527 1704462 1980854 2002822 1980713 1734022 1783974 2048356
16858 2048356 2045341 1966781 2047138 1832146 1960501 2136868 2288605 2264002 2437596 2160738
16848 2160738 2472329 2732173 2532791 2111115 2497367 2125381 2635617 2540567 2959453 2708031
16838B708031k25386K52683m0883L44611o4903p860J69524L57185k52902J66117
16828C406217N42510n27580M47722l47624L01438J12931J23585J7700N35031m36821
16818D175109J50441M40716J34940Q0648N8808k5716K49103j31293J94098M30489
16808E757343O9858K08582P3380R0442M26729K37054O7877Q113O4876M41309J97371
16797G642934L15565j89056M31073N7094O61520K94693N46805K60007L54983K19861
16787A0595479K69728M92145L50293K39520N76316O14347L96695K56478R05777
16778A4696778M72938N16145Q88387N41884P31579O57458J011255P90028N82040
16769B0888492J236939N24577J190406J106724J353439R75113J594436J162197
$$ plain form
16838 2708031 2482645 2735328 2694445 3039056 2974153 2966293 3135817 3493002 3240100 3406217
16828 3406217 3948727 3421147 3868869 3521245 3822683 3935614 4059199 4076899 4611930 4175109
16818 4175109 4325550 4766266 4901206 4981854 5040662 5014946 5264049 5132756 5326854 5757343
16808 5757343 5827201 6035783 6109163 6199605 6626334 6863388 6931265 6939378 7004254 7445563 7642934
16797 7642934 7958499 7769443 8200516 8257610 8919130 9213823 9760628 10020635 10375618 10595479
16787 10595479 10865207 11357352 11707645 11947165 12523481 13137828 13534523 13791001 14696778
16778 14696778 15169716 15685861 16574248 17116132 17847711 18505169 19516424 20306452 20888492
16769 20888492 22125431 22650008 23840414 24947138 26300577 27275690 28870126 30032323
16761C0032323J187313J724976J504631J683401K355296J540660J809712K446299
16753D4284611K383471K340555K436032K733779K798516K996134L233182L408896
16745F6615176L447115L725814L551185L566354M422860L878123M527618L894161
16737I7628406M327525M041756M000952L760855L593090L451526K970792K539845
16729A26314747K192881J656744J170129K91808N9491j41964j474467j494038
16721A28575331j900398k550346k670910l419477l090187l796539l343372l476389
16713A04327713m053920l697630l982604l364053l740391l425686l085811l671711
16705G5305907k848034l039574l117050k762814k582795k582431k435269k015213
$$ plain form
16761 30032323 31219636 32944612 34449243 36132644 38487940 40028600 41838312 44284611
16753 44284611 46668082 49008637 51444669 54178448 56976964 59973098 63206280 66615176
16745 66615176 70062291 73788105 77339290 80905644 85328504 89206627 93734245 97628406
16737 97628406 101955931 105997687 109998639 113759494 117352584 120804110 123774902 126314747
16729 126314747 128507628 130164372 131334501 131626309 131685800 131543836 130069369 128575331
16721 128575331 126674933 124124587 121453677 118034200 114944013 111147474 107804102 104327713
16713 104327713 100273793 96576163 92593559 89229506 85489115 82063429 78977618 75305907
16705 75305907 72457873 69418299 66301249 63538435 60955640 58373209 55937940 53922727
16697E3922727k226610k107210k079596j681825j753888j861259j709085j388584
16689C9114670j373354j461487j408011j380850q60341j251349j151903j017287
16681B9210088j134696o82543q97479j055282q43791r24988n08878j052525k99703
16672B1810203r26290j030468n36445l44831o47210p06906l94874k96059n39628
16663A6387492m36118q94141k02710n88566p89629j11568l40940l46491k97135
16654A2380194k16110n60070k64328l41265n06729l58987j08548k68232k78061
16645I477864l26755j62271j88669l69908n17421M5007l93462k08655k88102J49918
16635G217546l58118J5241m94282k47551j39703j22234k38784j78830k66691K49868
$$ plain form
16697 53922727 51696117 49588907 47509311 45827486 44073598 42212339 40503254 39114670
16689 39114670 37741316 36279829 34871818 33490968 32630627 31379278 30227375 29210088
16681 29210088 28075392 27392849 26495370 25440088 24596297 23671309 23162431 22109906 21810203
16672 21810203 20883913 19853445 19317000 18972169 18324959 17618053 17223179 16927120 16387492
16663 16387492 15951374 15057233 14854523 14265957 13476328 13364760 13023820 12677329 12380194
16654 12380194 12164084 11604014 11339686 10998421 10491692 10132705 10024157 9755925 9477864
16645 9477864 9151109 8988838 8800169 8430261 7912840 7957847 7564385 7355730 7067628 7217546
16635 7217546 6859428 6874669 6380387 6132836 5993133 5870899 5632115 5453285 5186594 5436462
16625E436462k87620n94345M10357j62129l37103l07255J94675J48509k04560
16616D296991k73922l24018j86827K66849l54179K65832P0702n07266o3380N890
16606C196672j39522p9419L0576L1611m61150L95996l52753J05062n5131m8186
16596B623756j05759K9260k489j23331m20892o8828K40204l9580J58129o63288
16586A627182M04607M9520l02976j13423J96290k79583M79005o53853L73050m8132
16576A731687R1720j45392k88060J65441O4022r6335j40417r0779J10738J07996
16566A510621K34633o58959K15398j36048K11500j32741q8363o5243N4488K04163
16556A349449q7399l30923K44565l23269J48181j6535J2010p2199R8265m8765
$$ plain form
16625 5436462 5148842 4554497 4964854 4802725 4465622 4158367 4353042 4501551 4296991
16616 4296991 4023069 3699051 3512224 3779073 3424894 3690726 3761428 3254162 3190782 3196672
16606 3196672 3057150 2977731 3008307 3039918 2578768 2974764 2622011 2727073 2671942 2623756
16596 2623756 2517997 2547257 2544768 2421437 2000545 1931717 2171921 2132341 2290470 1627182
16586 1627182 2031789 2081309 1778333 1664910 1861200 1581617 2060622 1406769 1779819 1731687
16576 1731687 1823407 1678015 1389955 1555396 1619418 1523083 1382666 1291887 1402625 1510621
16566 1510621 1745254 1086295 1301693 1165645 1377145 1244404 1156041 1090798 1145286 1349449
16556 1349449 1262050 931127 1175692 852423 1000604 984069 996079 923880 1022145 973380
16546I73380k502J27542k35005K4275j5915P0411R1043j41110m4178J39836n5007
16535I32770l32130K4842K54796J57983k57785J64516k36408O04K36460l41485
16525F04163K36465k7910J93790l00464j65302L43961k31242J66873M6153n8690
16515H07797K5353l29545n0593L35974o2682q8195j59566J88733L5327r7939J00477
16504G05141K34948l09127B87404N86696j67673k05608J4432n1300J11225J53381
16494G28557j08372j52651L20444k92397l8137A04637M92658B92280R6304J85461
16484E74045k19573L5041L0114J24466J28850j3011k11853j91624O6449K95252
16474F18156j14480B25837K96980m2622O0418o6059J01393J46998C04079N05933
$$ plain form
16546 973380 970878 1098420 863415 887690 871775 942186 1033229 892119 847941 987777 932770
16535 932770 600640 625482 880278 1038261 780476 944992 708584 709188 945648 604163
16525 604163 840628 812718 1006508 706044 540742 884703 653461 820334 866487 807797
16515 807797 833150 503605 453012 788986 726304 638109 478543 667276 702603 604664 705141
16504 705141 940089 630962 287404 874100 706427 500819 515251 463951 575176 728557
16494 728557 620185 467534 787978 495581 457444 104637 597295 292280 388584 574045
16484 574045 354472 389513 419627 544093 672943 659932 448079 256455 322904 618156
16474 618156 503676 225837 522817 480195 540613 474554 575947 722945 304079 810012
16464H10012l62150P7896j42379J87164L1585L5479j55214j89464J23551J97052
16454F13532k64741j68297K63739p3190K43890J08213l44946N3968N8415j31844
16444C58739o2123L51707j86701k03070J76868j515J20414J98913l67563J9532
16434D05201A50404M59295l834k3891m8647J72468k30726M8281k46072M8495J65102
16423D90875J01025k52659L4154j03163M19168P7030C18258K75226B90887L49431
16413F40318B99241a53015B90856R0164J91240A92605O06099l86458J5802P4903
16403E02951k165p7775J68336B78320F2970L85852j54597J050j32870L27332j82626
16392C07111J03114j54401J98133K32044k10204A77230J88793J5614j12492j3798
$$ plain form
16464 810012 447862 525758 383379 570543 602128 637607 482393 292929 416480 613532
16454 613532 348791 180494 444233 371043 614933 723146 378200 432168 490583 358739
16444 358739 296616 648323 461622 258552 435420 433905 554319 753232 385669 405201
16434 405201 150404 609699 605865 581974 533327 705795 475069 523350 277278 325773 490875
16423 490875 591900 339241 373395 270232 689400 766430 318258 593484 290887 640318
16413 640318 299241 -153015 290856 381020 572260 192605 798704 412246 428048 502951
16403 502951 500786 423011 591347 278320 62970 448822 294225 295275 162405 489737 307111
16392 307111 410225 255824 453957 686001 475797 177230 366023 381637 269145 255347
16382B55347K633J98043K76405C03241L04220B82453K63910j31329J25441q665
16372E31810j58650J97017j33779j03398J08038j06269K51266J05923k21571k3300
16362D47087J59890j79227Q12j79093N38908k15645k57563N0705Q7521L64529
16352H17924k5619j08113B24779O81957k09719k62151J47169k69795K21912J36371
16342F70523j36655K6398J26740B80647K99757J1145J98323j34398k19196K44913
16332F81191k05912J80741L3639j10294R469j4049k44813M76820l94567M65840
16322H78065l37185l2827J98919p5644B11307L93634J1995j25753Q1476k12145
16312C60514L47524O9561q9365O3285J24625J21551l40394J47536k47984Q8119
$$ plain form
16382 255347 257980 456023 732428 303241 607461 282453 546363 415034 540475 531810
16372 531810 373160 570177 436398 333000 441038 334769 586035 691958 470387 447087
16362 447087 606977 427750 428562 249469 788377 572732 315169 365874 453395 817924
16352 817924 792305 684192 224779 906736 697017 434866 582035 312240 534152 670523
16342 670523 533868 560266 687006 280647 580404 591549 789872 655474 436278 681191
16332 681191 475279 656020 689659 579365 588834 574785 329972 806792 412225 878065
16322 878065 540880 508053 706972 631328 211307 604941 616936 491183 572659 360514
16312 360514 708038 777599 688234 751519 876144 997695 657301 804837 556853 644972
16302F44972J46668K09642j12504K5695j50955K37114p7047m17897O7853R4274
16292F67815L93654j36661q6068l24981J44565m0464R735K265R5654J3664L3539
16281G72717m3844r3393P3792J5712J49535j9663o8441K36696k06176J68262j91876
16270G93321l26460M86817l59399K76082J65214J6197j12465O1527L0667k72302
16260G59199J73551L9785m25580J90094L68276n37094K95032j63778L23726k14722
16250H08489J06741j90943k52588K17525P9429p6246N3237L6113L4801m1790L1439
16239H06207J71776m6339k13502K88548D31034M69505r4653K22553n5717l66973
16229F05749J14410K41396k33850O9596K63476l61411m9073L39437D32105J32562
$$ plain form
16302 644972 791640 1001282 888778 914473 763518 1000632 923585 505688 573541 667815
16292 667815 1061469 924808 838740 513759 658324 617860 627595 629860 725514 739178 772717
16281 772717 728873 635480 709272 724984 874519 854856 786415 1023111 816935 985197 793321
16270 793321 466861 953678 594279 870361 1035575 1051772 939307 1000834 1031501 759199
16260 759199 932750 972535 546955 737049 1105325 568231 863263 699485 1023211 808489
16250 808489 915230 724287 471699 689224 768653 692407 745644 781757 816558 774768 806207
16239 806207 977983 931644 718142 1006690 431034 900539 805886 1028439 972722 605749
16229 605749 720159 961555 727705 797301 1060777 699366 650293 989730 432105 564667
16219E64667O7081M35985j64223k13001K38541j87130J75918D05033L11548j54148
16209E62433R0672k4737m8196J56690l27479R1452Q1854J3k9517L57598l04305
16198F06478k86903L46463r2442p0427B46970L71943J29156l66112J24835r8371
16188D08421L48850k33990J37494q2656j25353j26320j8948K255J27080j09293
16178C27540K94144B62028K38468l8693j28882A19576K28077l8091K84798A88390
16167A54703K37251J23913q8647j07166l0578L80108C33037j18993K59230j91793
16157B81481J13315J12179k26972K956K84628A61341K85103j3952o8339j20429
16147B43724K04566E4469K59221j49937J55402e7810h771j5343A07066D1445L45885
$$ plain form
16219 564667 631748 1067733 903510 690509 929050 741920 917838 405033 716581 562433
16209 562433 653105 628368 580172 736862 409383 500835 582689 582702 553185 910783 606478
16198 606478 319575 666038 573596 503169 246970 618913 748069 381957 506792 408421
16188 408421 757271 523281 660775 578119 452766 326446 307498 309753 436833 327540
16178 327540 621684 262028 500496 461803 332921 119576 347653 309562 594360 188390
16167 154703 391954 515867 427220 320054 289476 669584 333037 214044 473274 281481
16157 281481 394796 506975 280003 282959 567587 161341 446444 432492 364153 243724
16147 243724 448290 54469 313690 163753 319155 -57810 -8771 -24114 107066 41445 387330
16136C87330A84107J22999j38919J31918l7838D1183J91125O9525B9726c151F1814
16124C00544k2210G2803J83704R90n8054k5491J59029q4430l6321m8309a16146
16112C96820a56872B01968G520l215L581R8758A7162N5887A7611R5607P1887d3171
16099A24596M1562c2668A34062b35644d2634q1128N9987I150a77762I4797L3669
16088A28466E4167a93405C38768f7763j48243B16446g8131o2277C02971A29786
16077a4112E3J80898n4607f4630A91919J80638b1653B79874a22566A13265J41127
16066B54392G2677N6513b01459N7634I7727a54351A56312e1949O173D39223E900
16054d5199C37578A11221Q246j1351a57387B82940B035b00300d9705p0257C18997
$$ plain form
16136 387330 184107 307106 168187 300105 262267 41183 232308 301833 29726 -3151 61814
16124 300544 278334 72803 256507 257497 199443 173952 332981 248551 212230 163921 -116146
16112 396820 -156872 201968 7520 4305 7886 106644 17162 73049 17611 113218 185105 -43171
16099 124596 166158 -32668 134062 -235644 -42634 -123762 -63775 9150 -177762 94797 128466
16088 128466 54167 -193405 338768 -67763 -216006 216446 -78131 -140408 302971 129786
16077 -14112 53 180951 126344 -64630 191919 372557 -21653 279874 -122566 113265 254392
16066 254392 72677 129190 -201459 -143825 97727 -154351 156312 -51949 -45776 439223 5900
16054 -45199 337578 111221 119467 108116 -157387 282940 2035 -200300 -49705 -119962 318997
16042b9076p9568j97928i3628B09425a19316d5956j02726b0713j60556c8830P786
16031c1044A10516J23053c952j15711C42335D9912F089O8643C4266e8903F7719
16019D7722p714j0442b4072A27244i041o4096p5373A91649J03125a33735j086
16008a34821B11003h0491j07864J3424L9828A18722a27053I2584a20724A33550
15997B225K85591A18604Q6373a08443p2496C9158J77345o4473J8759J42911a86907
15985a68074L4132B51238L35926p9199b16441A07271O9750c2211A37564b37474
15974b23664c4474E4713e6055k6829b5625j58021E0165f2226b4780j97778A37873
15962A24197d9396k28284H3650L2042g161j02834c354j32650A02249D699K4118
$$ plain form
16042 -29076 -108644 -306572 -93628 209425 -119316 -45956 -148682 -20713 -181269 -38830 -31044
16031 -31044 110516 233569 -3952 -119663 342335 49912 6089 74732 34266 -58903 67719
16019 47722 40008 29566 -24072 127244 -9041 -73137 -148510 191649 294774 -133735 -134821
16008 -134821 211003 -80491 -188355 -174931 -135103 118722 -127053 92584 -120724 133550
15997 2225 287816 118604 204977 -108443 -180939 39158 216503 152030 170789 313700 -186907
15985 -168074 -133942 251238 587164 507965 -216441 107271 177021 -32211 137564 -237474
15974 -223664 -34474 54713 -56055 -82884 -25625 -183646 50165 -62226 -24780 -222558 137873
15962 124197 -49396 -277680 83650 115692 -7161 -109995 -3354 -136004 102249 4699 28817
15951B8817O258J6189b39437B1428K39844f7497C17248H8159a05508j68726B8267
15939a30824l3987J432C3428b01747G3399a1517n9853j62710B34265a48650K1672
15928a26978A1518b15663h4611B7651a96765g7361A9132a63962f6755H2315e5702
15916i9709I7969j4789a24037N2825k2935j28646O5123g0595A8174b03336E8228
15904d01614a76904P7794A26580n4509b6098A32728a15199A16928b77963h4771
15893f1911r9582M0887o1787Q5262A66274K2476b45458C9479Q321O2365b15355
15881F3780i6628D3520b7178j55966f9781o57j28111A6489b4090j75702H8543
15869b60292L9982A14459a51612N9409m5649H6604c77163A14548a55383n4297
$$ plain form
15951 28817 35075 51264 -239437 21428 261272 -67497 317248 88159 -105508 -274234 28267
15939 -130824 -164811 -163379 33428 -201747 73399 -11517 -71370 -234080 234265 -148650 -126978
15928 -126978 11518 -215663 -84611 27651 -196765 -77361 19132 -163962 -66755 82315 -55702
15916 -99709 97969 83180 -124037 -71212 -94147 -222793 -157670 -70595 18174 -203336 58228
15904 -401614 -176904 -99110 126580 72071 -26098 132728 -115199 116928 -277963 -84771
15893 -61911 -161493 -120606 -182393 -97131 166274 188750 -245458 39479 47800 110165 -215355
15881 63780 -96628 43520 -27178 -183144 -69781 -70438 -198549 16489 -24090 -199792 88543
15869 -260292 -220310 114459 -151612 -92203 -137852 86604 -377163 114548 -155383 -209680
15859b09680c3675k60784B04322b51704A7942l236N1190k6548f5371j07610P2123
15848a00858C5333L3196b09669B0587c96757A72363f4692j70132A42174B4870
15837a48465O8966j96624d1367k99942G7498c89861a09573B92438a28767d2256
15826a61531a2278A54765a72434j67150M781H3137d1574K119p1106A44641G0045
15814a53425c9100E8729i4934B6896b92415k5315J57938j12928A81633P5889e3780
15802h0695l04556G4966K01740A1127L24136b89392L4204B34022e7631j06502
15792a64133G0625b6385l00898C43108a71362E6861h5232D7624a17935K7142q6445
15781a77238b3963j89106a7246p304B7768a55207I3460d9886Q250B41566a64018
$$ plain form
15859 -209680 -33675 -294459 204322 -251704 17942 14706 65896 39348 -65371 -172981 -100858
15848 -100858 35333 68529 -209669 20587 -396757 172363 -64692 -234824 142174 24870
15837 -148465 -79499 -276123 -41367 -341309 77498 -389861 -109573 292438 -128767 -42256
15826 -161531 -12278 154765 -172434 -339584 -334803 83137 -41574 -39455 -110561 144641 70045
15814 -153425 -39100 58729 -94934 26896 -292415 -317730 -159792 -272720 181633 257522 -53780
15802 -80695 -385251 74966 276706 11127 335263 -289392 -255188 234022 -57631 -164133
15792 -164133 70625 -26385 -327283 343108 -171362 56861 -85232 47624 -117935 -90793 -177238
15781 -177238 -23963 -213069 -17246 -24550 27768 -155207 93460 -49886 -41636 241566 -164018
15769A86492a20342K4237L7327j34446d3732A61941a123n4942J9756m7211k00254
15758b83774A40829b02810b3430B8971g7562B66917A8133b3364A90450B6305K12351
15747B38656m3391a68968B72238a42725B99607f6996r4550f2092j4976K521D72792
15735A19424B8949J28313a33650A74252c6711j61349j14405e0533C737e0561B60355
15723C71681B7797J10635n5082d2675E8633a6913j05230k03205J55247g071B53105
15711a02176A66963b06583l8118J08139H2349i1454C8426a34256A7699a13034
15700d960C2609b59188L3069G3537H854J88778C4397K2285e1932j01727A51243
15688g5049j49434A13312P2965a00255j93783D3695K7841b87531f4323B788c79594
$$ plain form
15769 186492 -120342 -96105 -58778 -193224 -43732 161941 -1123 -56065 -36309 -83520 -283774
15758 -283774 140829 -202810 -23430 28971 -77562 266917 18133 -23364 190450 26305 238656
15747 238656 195265 -168968 272238 -142725 299607 -66996 -161546 -62092 -77068 -74547 472792
15735 119424 28949 157262 -133650 174252 -36711 -198060 -312465 -50533 3737 -50561 260355
15723 371681 27797 138432 83350 -42675 58633 -16913 -122143 -325348 -170101 -7071 253105
15711 -102176 166963 -206583 -244701 -136562 82349 -91454 38426 -134256 17699 -113034
15700 -4960 32609 -259188 -226119 73537 8854 197632 34397 56682 -51932 -153659 151243
15688 -75049 -224483 113312 186277 -100255 -294038 43695 71536 -287531 -64323 2788 -379594
15676c01715B37887r8043A3676f1633j73036m4946N9587A72276j6b45816a09062
15664a73980I990a65833e0513C99585b71026Q8108C4810a66024N409j89789A12417
15652a2246o8902k21800M6138L876G0696K17785A0580a95835e7736l4267j49612
15641b41615I2315b5843C89657a48314j8347A83597a82004J1259N3514j1503M5839
15630h2895K2611K7221l6753C15524i2877K3275C8462D62K6206b76909c030j35769
15618a38799a7004l1155D7075c98488C6069O5942a1936C6772N9369J41518E0989
15606b9098k80403j45672J90056A86709A5707K93644D5775a61156A69496c4011
15595h1848l81474c8371C2462a55253M7621j07391d7838A27145b31784D14276
$$ plain form
15676 -301715 237887 139844 13676 -61633 -234669 -279615 -220028 172276 172260 -245816 -109062
15664 -173980 9990 -165833 -50513 399585 -271026 -182918 34810 -166024 -160615 -350404 112417
15652 -12246 -81148 -302948 -256810 -252934 70696 288481 10580 -195835 -57736 -92003 -241615
15641 -241615 92315 -25843 389657 -148314 -166661 183597 -182004 -170745 -117231 -128734 -82895
15630 -82895 -60284 -33063 -69816 315524 -92877 -69602 38462 462 26668 -276909 -3030 -138799
15618 -138799 -17004 -48159 47075 -398488 36069 102011 -11936 36772 96141 237659 50989
15606 -29098 -309501 -455173 -265117 186709 15707 309351 45775 -161156 169496 -34011
15595 -81848 -463322 -38371 32462 -155253 -107632 -215023 -47838 127145 -231784 414276
15584A50853a43728N5486j80401d564C4736N102f31882a23353N1977j36288G4163
15572g705j12917l1630D7722b01509C3627i1526b6384j02883E9591J77510B4767
15560B81695o8888a96328Q7191N0133B15477E0961K29505l7902f8837j20678A93798
15548a90603e9573a35k48392q4290b1168j44797d4839j37205O9596K5882l41201
15537d27767J73488G226i896B40198i1692B36470p9684o029J92606j41481a91954
15525a90087A10643b49077a14041m9207G4204A9086b01619b9602Q73a0629k67975
15514b78604a22725A68285e6786m4577j68142J21308K6364l95A08041J49036J6417
15503B73494p6626f9494f664j1859j21887e3415B2115a71219c1146A84475B9423
$$ plain form
15584 150853 -143728 -88242 -268643 -4564 34736 39838 -631882 -123353 -71376 -207664 74163
15572 -7705 -120622 -152252 47722 -201509 33627 -91526 -26384 -129267 59591 237101 24767
15560 281695 212807 -196328 -109137 -59004 215477 50961 280466 242564 -68837 -189515 193798
15548 -190603 -59573 -135 -248527 -332817 -21168 -165965 -44839 -182044 -112448 -86566 -427767
15537 -427767 -254279 7226 -9896 240198 -91692 236470 156786 150757 343363 201882 -191954
15525 -190087 110643 -249077 -114041 -163248 74204 19086 -201619 -29602 -28729 -10629 -278604
15514 -278604 -122725 168285 -56786 -101363 -269505 -148197 -121833 -122228 108041 257077 273494
15503 273494 196868 -69494 -6664 -18523 -140410 -53415 22115 -171219 -31146 184475 29423
15491a07095k27055Q3170d1219j37788P0463e3465l26977a22472E1602A1939l698
15480H241J46265J99936b08764B49630G6783f1043A25279J55386j03312f6927
15469a84430B08007H843e1021N166j74764c0577l5874k7400m5697j55773c6921
15457B8883K6231K51332j41637f1367B82067f3140A99454A6731h5898b7467B59758
15445a20287J7181M6673F8720B8248a39770O504j513I3700a32511B68626E6989
15433B21167b4361D0765R0963a2399A54880d8149j00016I6777j7598P4587b4960
15421I6936b08823O7867K8969a2124k69417C10384a17665G4359J52759c67711
15410A28949d2856A01273h0408j61477R9614r4721b7149D9426b17971i0141A31184
$$ plain form
15491 -107095 -334150 -250980 -41219 -179007 -108544 -53465 -380442 -122472 51602 11939 8241
15480 8241 154506 354442 -208764 249630 76783 -61043 125279 280665 177353 -66927
15469 -184430 208007 8843 -51021 -45855 -220619 -30577 -66451 -93851 -139548 -295321 -36921
15457 28883 55114 306446 164809 -61367 282067 -63140 199454 16731 -85898 -27467 259758
15445 -120287 -103106 -56433 68720 28248 -139770 -133266 -134779 93700 -132511 268626 56989
15433 221167 -24361 40765 131728 -12399 154880 -48149 -148165 96777 79179 153766 -24960
15421 96936 -208823 -140956 -111987 -12124 -281541 310384 -117665 74359 227118 -367711
15410 128949 -42856 101273 -80408 -241885 -142271 -236992 -27149 49426 -217971 -90141 131184
15398H1815a87594a8165m5887q047J5266A306J23829N4489d8565j11508g6A87139
15385a15845A15498c70375a78402c8798k6829k088q9311D1402O5628d42594c4275
15373A73478p880f9717j89852J15024c4613A08323l1432J13368E2237R2787f0778
15361D412c67934A82380c18063a51351D8884I334J66870n9944a59332j28572h318
15349D1452M8147e159l61122H3835b17459D16471D6554b3662G7856P0024g1173
15337A19638b486F6154l500a60024H3000J38412b08751P9360A57212o2575c00904
15325D57589A45388J20406A03531j3817O6504A0879J03298b09554a7625B37154
15314b48846i7172j49697G7795b04120D1794M6177g0712B84392b52514A40961
$$ plain form
15398 81815 -187594 -18165 -64052 -72099 -56833 1306 125135 179624 -48565 -160073 -76 187139
15385 -115845 115498 -370375 -178402 -38798 -65627 -67715 -157026 41402 107030 -442594 -34275
15373 173478 165598 -69717 -259569 -144545 -34613 108323 76891 190259 52237 145024 -60778
15361 4412 -367934 182380 -318063 -151351 48884 9334 176204 116260 -159332 -287904 -8318
15349 41452 89599 -5159 -366281 83835 -217459 416471 46554 -23662 77856 147880 -71173
15337 119638 -2486 66154 62654 -160024 83000 221412 -208751 -129391 157212 94637 -300904
15325 457589 145388 265794 103531 89714 156218 10879 114177 -209554 -17625 237154
15314 -248846 -97172 -246869 77795 -204120 41794 87971 -70712 284392 -252514 140961
15303B50385a71432N9480B0398P7156J00919C9609J03926J91589p0400B1095G797
15291a73647C30348q2315a63465f2884j10069A7328K3031L2832a00217B3886b37450
15279e224B52374a02310A38161a96372Q8324B7126e0676E6873L153J43243a63620
15267c5089H4056j4819a30447O4612G1471a40548G937h7989A45976g4931D70566
15255A5349c1147A65734M3157K41919O401L14259B68387M8407A29202F1436K7581
15244H9017f8636F8367a45840O3569B15314g671A70339a16387q1158B07683a81333
15232c2640A05840f6969G4564J7515a91017e2429N604A34973P0142q0366M1448
15221A66197a13245H37a37085j67487H8237g0452A18159P7852L8270D1610J03020
$$ plain form
15303 250385 -171432 -111952 20398 97554 198473 39609 143535 335124 264724 21095 7797
15291 -173647 330348 248033 -163465 -62884 -172953 17328 40359 73191 -100217 23886 -237450
15279 -5224 252374 -102310 138161 -196372 -108048 27126 -50676 56873 60026 203269 -163620
15267 -35089 84056 69237 -130447 -65835 71471 -140548 7937 -87989 145976 -74931 470566
15255 15349 -31147 165734 208891 450810 457211 771470 268387 316794 129202 61436 89017
15244 89017 -68636 68367 -145840 -82271 215314 -7671 170339 -116387 -197545 207683 -181333
15232 -32640 105840 -66969 74564 92079 -191017 -52429 -46825 134973 205115 124749 166197
15221 166197 -113245 837 -137085 -304572 88237 -70452 118159 196011 234281 41610 144630
15210A44630p1218a70540B58256a02559Q560A37629b27576B80505E4036R2689
15200A46725j9408c4143C15614A32188d8467I3195A3018K92709c10552I1309l7888
15189E3421K99749I6312C9256b5257C67677d99A58507N5131C3768c17001A91349
15177C9117J36100b49940B25755j4918j03523j7830J35288j10984j540m1391K93812
15166C64669E1404K72350j57501d503A19462a98734A09702F701J47828a07689
15155G2570a34778k8096A00750a30370B15447A5780L983d5617p79B59165q8841
15144A70324J16365q5011O6293p7688a291A46073B0933K41464a6069H8165b5855
15132a53133a7225D6718J76747a85963f0907b9317A29841l6826K88766j77360
$$ plain form
15210 144630 73412 -170540 258256 -102559 -93999 137629 -227576 280505 54036 146725
15200 146725 127317 -34143 315614 132188 -48467 93195 13018 305727 -310552 91309 53421
15189 53421 353170 96312 39256 -25257 367677 -499 158507 213638 33768 -317001 191349
15177 39117 175217 -249940 225755 210837 107314 89484 224772 113788 112248 70857 364669
15166 364669 51404 323754 166253 -4503 119462 -198734 109702 6701 154529 -107689
15155 72570 -134778 -162874 100750 -130370 215447 15780 19763 -45617 -46396 259165 170324
15144 170324 286689 201678 267971 190283 -1291 146073 20933 262397 -16069 88165 -25855
15132 -153133 -17225 46718 223465 -185963 -60907 -29317 129841 93015 381781 204421
15122B04421D0321J76136q6267d0618a7849p3751A78217c5859I6277a03470C46895
15110A23781M8124j7856R3452q10e6653A96716P2314F5111J99521a7032B16986
15098c3552a6268j4855Q72A22831m1715I785M4684a56621A03557N5316e9007l6235
15086i5242A84581F2472b4736F139a26584A92042G8833j9117J3922J06878K04410
15075C84926A08409P9063p2193J45363a71609B00213o3972b12129E96121B34809
15064A69741a26453A88425q945g93A4377J51272M4875k6816r1705M35167A70936
15052C90677O7219A2723R6208a63565B82996J17195j18353J15347A74072N9579
15042B33651P5537d7020B23615K19200j26827a92483D9406g1988K3745k46352
$$ plain form
15122 204421 40321 216457 130190 -40618 -17849 -91600 178217 -35859 96277 -103470 346895
15110 123781 171905 154049 247501 246691 -56653 196716 269030 65111 264632 -17032 216986
15098 -33552 -16268 -31123 -30251 122831 81116 9785 54469 -156621 103557 158873 -59007 -95242
15086 -95242 184581 62472 -24736 6139 -126584 192042 78833 59716 73638 180516 384926
15075 384926 108409 187472 115279 260642 -171609 200213 136241 -212129 596121 234809
15064 169741 -126453 188425 179480 -793 14377 165649 210524 183708 92003 527170 170936
15052 390677 457896 12723 108931 -163565 282996 400191 281838 397185 174072 233651
15042 233651 309188 -47020 223615 442815 315988 -192483 49406 -71988 -48243 -294595
15032b94595A50269K9036J82271i7850D43405f9556A21404L27604H2629J41041
15022B23670A5775J24889g4571B15953i5555A34703n9466J4322J15823Q1942l4266
15011B53058J24296j72304r4806m0678a2436C56047e7885C23712J40566A95995
15000I1890O0644D7667O4985K13593r9922O7424n7320K39576P1635B14002j273
14989B12729K1078j9508L5086J0939J82866A74993J16113j20027K43435H6722
14978b5991A57611J33228j33244m9648J52581a4142E5660K15902j27811M6448
14968A90199M85298A10161J33266A916c8649B60532P6610j67866p6942J25091
14958B17425n9592m3274J91651j41114R2195j00107a20504k3331A89992G7167
$$ plain form
15032 -294595 150269 179305 361576 -97850 443405 -69556 121404 449008 82629 223670
15022 223670 15775 140664 -74571 215953 -95555 134703 75237 89559 205382 287324 253058
15011 253058 377354 205050 110244 69566 -12436 356047 -57885 323712 464278 195995
15000 91890 152534 47667 112652 326245 226323 293747 236427 476003 547638 214002 212729
14989 212729 233807 214299 249385 260324 443190 174993 291106 171079 414514 86722
14978 -25991 157611 290839 157595 107947 260528 -14142 55660 271562 143751 190199
14968 190199 675497 110161 243427 1916 -38649 260532 337142 169276 92334 217425
14958 217425 157833 114559 306210 165096 257291 157184 -120504 -143835 189992 77167
14947E16983k33481N9374r7355o116K1284j5363b04138B25307L09523K20287A55065
14935C70682J64773A75525j1482A2190M73729A61031J86699H3358O8430L90135
14925E41923k49354J15321j59230J80470R3266k42559L4867D3531L86488I0746
14914a7554C33880o0954J6605K71090o7713k20700M9381k1893E4600J99839r431
14903B45008K9122Q585Q2428E8954M86021B61013P7411N5450J3740n9687j63002
14892A84925H0288L01852j83984n6500a69818E73305j26986m1970A42162M21368
14882E63530m3252A07140M33031j70419R6273j46606L02883q4962G3035J57325
14872B30360K93524I4073M03584R3649k93250R7045K7622J17621I5456K01495
$$ plain form
14947 516983 283502 342876 245521 239405 260689 245326 -204138 225307 534830 755117 155065
14935 370682 535455 175525 164043 12190 485919 161031 347730 83358 151788 541923
14925 541923 292569 407890 248660 429130 522396 279837 314704 43531 430019 90746
14914 -17554 333880 272926 289531 560621 492908 272208 321589 299696 54600 254439 245008
14903 245008 274130 282715 365143 58954 544975 261013 338424 393874 407614 347927 184925
14892 184925 80288 382140 198156 141656 -169818 573305 446319 404349 142162 563530
14882 563530 520278 107140 540171 369752 466025 319419 622302 537340 73035 230360
14872 230360 523884 94073 497657 591306 298056 395101 422723 540344 95456 296951
14862B96951n1728H2348J54092K57052O2032B43123n8581J93522f4063B70889
14851B78616l4159K55684A84685K41604P9735A03210L28068n995J65317k18474
14841C72126N677d202B73441P4693j43396Q389P8698K39680q0743o5689J02978
14830D88051J6077E679J584M47270M61677C49293L33375C33823J40470j93820
14820B80473A24831K30753Q867j12826m2982J04951C8028J85510K84290j24987
14810C82841A82035o6903L76238j43091J21787k08220C7887K92273N0934L08976
14800F90070K18815C94699j86268g590E73062A61391K54553N363j1303j38153
14790B71851K25625k37487K19838J50543E5780M65849p6101M9641j8584p5459
$$ plain form
14862 296951 245223 82348 236440 493492 555524 243123 184542 378064 -64063 270889
14851 278616 244457 500141 184685 426289 506024 103210 431278 425283 590600 372126
14841 372126 377803 -4202 273441 348134 204738 213127 291825 531505 450762 385073 488051
14830 488051 504128 5679 7263 454533 916210 349293 682668 333823 474293 280473
14820 280473 124831 355584 364451 251625 208643 313594 38028 223538 507828 382841
14810 382841 182035 115132 491370 348279 470066 261846 37887 330160 381094 690070
14800 690070 908885 394699 208431 -7590 573062 161391 415944 421307 410004 271851
14790 271851 497476 259989 479827 630370 55780 521629 445528 495169 476585 401126
14780D01126k7549j36542J15048M5733J98707j52455R2200j19796A97672O13284
14770H10956r7876j99789K08840P6807l24512K6159j7854L21270C13951L4211
14760C48162L7839J20642N0026A80743J52400K99443k83415L60822l03686L45745
14750G52052j92964j14901K51677k48752j66930M17510m1993j28706j08960L2057
14740D50090r8288L0743M16341l31280J74839j14964K8536P6710k81961K04077
14730E54843K76705l90556K85800n9978k66710L54684j32167j74941M1083J66912
14720F55675K6658j48952O5330J22383r3884m2967K85797l27826R0612J56581
14710G89407j99681N6042n937J32615L5508l92351L77145l92651J80724J21882
$$ plain form
14780 401126 373577 237035 352083 397816 596523 444068 536268 416472 197672 810956
14770 810956 713080 513291 722131 798938 474426 500585 482731 804001 313951 348162
14760 348162 386001 506643 556669 180743 333143 632586 349171 709993 406307 752052
14750 752052 559088 444187 695864 447112 280182 697692 655699 526993 418033 450090
14740 450090 351802 382545 798886 467606 642445 527481 556017 632727 350766 554843
14730 554843 831548 440992 726792 666814 400104 754788 622621 447680 488763 655675
14720 655675 682333 533381 598711 721094 627210 584243 870040 542214 632826 789407
14710 789407 589726 645768 639831 772446 807954 415603 792748 400097 580821 702703
14700G02703j42316m8211L48399j23113K138J39194j68286K76658j99884k11712
14690E75570L65916m15673M4746L52980j25769J68535k14906j09296L19629r4759
14680H66973l80897M42570J07074C92354M06000K3593J02662j17839J12053j11539
14670H07284K04859j75678j11830j35283L65788L1807j92303J27058k52042P4653
14660G44313K72950P2315j1493l42070k1941K86150k7000l00244J1989J54200
14650H39169k09175M36764j98064K47215q8899k04496K1032J79040j16552J7015
14640I23049p7495N7477j73076K14776n5526L0052M2115J37268k3732j94277j6345
14629H64286M1983J38874l6675N6781L1203n1951r7909J91910k7726K46556j4761
$$ plain form
14700 702703 560387 512176 860575 737462 739600 878794 710508 987166 787282 575570
14690 575570 941486 525813 570559 923539 797770 966305 751399 642103 961732 866973
14680 866973 486076 928646 1035720 392354 798354 821947 924609 806770 918823 807284
14670 807284 1012143 836465 724635 589352 955140 986947 794644 921702 669660 744313
14660 744313 1017263 1089578 1078085 736015 714074 1000224 973224 672980 684969 839169
14650 839169 629994 1066758 868694 1115909 1027010 822514 843546 1022586 906034 923049
14640 923049 845554 903031 729955 944731 889205 919257 961372 1098640 1074908 880631 864286
14629 864286 906269 1045143 1008468 1065249 1096452 1044501 946592 1138502 1110776 1357332 1342571
14618A342571k62516j4554Q1170l98482L78498p8097k1089K64468k5104j03409
14608A163456L77947m29553K56887j36747j35380j78315L42434j54698N5761l3626
14598A128166n9186L3051o2383O5667L90659q2676k8293M04303m31687L34789
14588A692410l37400M74407k24957l19820J74692r9125J77243K21680m89879K86882
14578A556133j10548J17971J98391k61801J34137K46147p7910k24350N86176P7677
14568B242023m6536k83855o9654K49158L0439j20810o0174M01210J36715n6346
14558B422170P9435M26681J29710K6122O36095L92017J041889R70430J500702
14549G625251J750704L047724L261392K171871r68116m209886l854710k344997
$$ plain form
14618 1342571 1080055 1065501 1146671 748189 1126687 1048590 1027501 1291969 1266865 1163456
14608 1163456 1541403 1111850 1368737 1231990 1096610 918295 1260729 1106031 1161792 1128166
14598 1128166 1068980 1102031 1039648 1105315 1495974 1413298 1385005 1789308 1357621 1692410
14588 1692410 1355010 1829417 1604460 1284640 1459332 1360207 1537450 1759130 1269251 1556133
14578 1556133 1445585 1563556 1761947 1500146 1634283 1880430 1802520 1578170 2164346 2242023
14568 2242023 2195487 1911632 1841978 2091136 2121575 2000765 1940591 2341801 2478516 2422170
14558 2422170 2501605 2928286 3057996 3084118 3720213 4112230 5154119 6124549 7625251
14549 7625251 9375955 12423679 15685071 17856942 16888826 12678940 8824230 6479233
14541F479233j990014p53129p91606k58531j97785J31867n01638L7754m7023K58755
14531B367883o22093K56788K8687l9584r5945R0481l34059L79326n3127J5515
14521A993872K24383k67837J24026k67426J16665p5908K91268K18846j87789m9428
14511B120672Q1154R2034Q7894J70810n24185K54425k09476K50529j9211K5693
14501B330339l7786K31809j78962K27351q0815J43833Q790J9043j11988l9495
14491B512119L38091r7973P0358M64458o24849M56680k54455J98332k41785M30029
14481C251005k73042J64192k24549j3344M9359J76904P0841K94803J8440o5464
14471C449145k52080k2316L42115q0542K07861J15235J13614l0863k56963n3070
$$ plain form
14541 6479233 4489219 3736090 2944484 2685953 2488168 2620035 2118397 2156151 2109128 2367883
14531 2367883 1745790 2002578 2031265 1991681 1895736 1986217 1652158 2031484 1978357 1993872
14521 1993872 2218255 1950418 2074444 1807018 1923683 1847775 2139043 2357889 2170100 2120672
14511 2120672 2201826 2293860 2381754 2552564 2028379 2282804 2073328 2323857 2304646 2330339
14501 2330339 2292553 2524362 2345400 2572751 2491936 2635769 2644559 2663602 2551614 2512119
14491 2512119 2850210 2752237 2822595 3287053 2662204 3118884 2864429 3062761 2820976 3251005
14481 3251005 2977963 3142155 2917606 2904262 2953621 3130525 3201366 3496169 3514609 3449145
14471 3449145 3197065 3174749 3516864 3436322 3644183 3759418 3873032 3842169 3585206 3532136
14461C532136L71772l20842L83902l3298p7113j78589K44704L75565k88986K42556
14451D251807R3371J4895J56279j49059J5083J48410j58552K54926j7647j76507
14441D433006L89401j4899M8582O5104l51375J36032L68931p0740K63941k36782
14431E031201M25954k09064J74389p7259L37839j39139L98004k42173K36473j26164
14421E810061k73483N11817L0410M71452j02696J04474K38464l2842J34302M7843
14411F939802j73397O8316N56270j89102j1703K76900K87471k317K60866j07478
14401G905628J53296L86499r3209M98717k52972M96163k79642J63924j41624N17755
14391I354535J22069K81998J6539L11670M44839l5278J18642J1825M9779N31738
$$ plain form
14461 3532136 3903908 3583066 3966968 3933670 3856557 3677968 3922672 4298237 4009251 4251807
14451 4251807 4345178 4360073 4516352 4367293 4382376 4530786 4372234 4627160 4609513 4433006
14441 4433006 4822407 4807508 4856090 4921194 4569819 4705851 5074782 5004042 5267983 5031201
14431 5031201 5457155 5248091 5422480 5345221 5683060 5543921 5941925 5699752 5936225 5810061
14421 5810061 5536578 6048395 6078805 6550257 6447561 6552035 6790499 6757657 6891959 6939802
14411 6939802 6766405 6834721 7390991 7201889 7190186 7467086 7754557 7752240 8013106 7905628
14401 7905628 8058924 8445423 8352214 8850931 8597959 9094122 8814480 8978404 8836780 9354535
14391 9354535 9476604 9758602 9775141 10086811 10531650 10496372 10615014 10626839 10676618 11208356
14381A1208356K22385K59256L52876K22388J16941J18919L49784L37226p2182
14372A3115949N05893N02376k15659M34541N19218K42624K14340M99092j46237
14363A5672137O21651M04935K82729O66432R0668L96229M52585O48628K09056
14354A9445050Q14130L31377N63287K54880R78549J70944J047695M50725O40790
14345B4697427M10886O64524R30553O55841O75965J039893P32724Q47186R14311
14336C1569310J147697Q42904Q58259R27417J337211J083258J565495J151515
14328D0483066J181238J122475J535638J791910J369368J716903J731936J509332
14320E2441866K406060J860224K134886K620877J982178K616541K738115K496875
$$ plain form
14381 11208356 11430741 11689997 12042873 12265261 12382202 12501121 12850905 13188131 13115949
14372 13115949 13621842 14124218 13908559 14343100 14862318 15104942 15319282 15818374 15672137
14363 15672137 16293788 16698723 16981452 17647884 17738552 18134781 18587366 19235994 19445050
14354 19445050 20259180 20590557 21153844 21408724 22387273 22558217 23605912 24056637 24697427
14345 24697427 25108313 25772837 26703390 27359231 28035196 29075089 29807813 30654999 31569310
14336 31569310 32717007 33559911 34418170 35345587 36682798 37766056 39331551 40483066
14328 40483066 41664304 42786779 44322417 46114327 47483695 49200598 50932534 52441866
14320 52441866 54847926 56708150 58843036 61463913 63446091 66062632 68800747 71297622
14312G1297622K764429L279370K899738L545654L885058L634035L989645M285441
14304I9580992M815545M525087M979383N026041N836784N921566O364790O673015
14296A43723203P378882P448593P605907Q624356Q748735Q956380R819233J0014963
14288B12320252J0483756J0937830J1237426J1564552J1483439J1834460J1780353
14281B91642068J1857310J1440705J0761611J0634500R474945Q943671P725267
14274C62480077O268579M357613K754383J524142M20204o33598k030455l332133
14266C71808812n311670o951894q042869r365461j0258379j1223733j1537987
14259C09116819j1799155j1968265j2268418j1764646j1833454j1179130j1038367
$$ plain form
14312 71297622 74062051 77341421 80241159 83786813 87671871 91305906 95295551 99580992
14304 99580992 104396537 108921624 113901007 118927048 124763832 130685398 137050188 143723203
14296 143723203 151102085 158550678 166156585 174780941 183529676 192486056 202305289 212320252
14288 212320252 222804008 233741838 244979264 256543816 268027255 279861715 291642068
14281 291642068 303499378 314940083 325701694 336336194 345811139 354754810 362480077
14274 362480077 368748656 373106269 375860652 377384794 377804998 377171400 375140945 371808812
14266 371808812 366497142 359545248 351502379 342136918 331878539 320654806 309116819
14259 309116819 297317664 285349399 273080981 261316335 249482881 238303751 227265384
14252B27265384j0850794j0234224r890386r616869r194426q323812q249152p379715
14244A53526006p313628p303778o331540n848062o224237n429476m868095n251016
14236A04956174m490159m249618m214791m235388l453030l571681l198016l213457
14228G4330034l229273k739618k706650k254574k654290k158815k145632k037348
14220E4403834j751611j916057j773110j776171j740237j372089j256366j510851
14212D1307342j602989j046748j082593j046407j375660o98379r43706j019828
14204C2491032j099456p25282n39689j335135p39385p74499n93384r52530p06573
14195B5025099n18667p66633l54932p06760l85299p10703m15241q74024m57841
$$ plain form
14252 227265384 216414590 206180366 196289980 186673111 177478685 169154873 160905721 153526006
14244 153526006 146212378 138908600 132577060 126728998 120504761 115075285 110207190 104956174
14236 104956174 100466015 96216397 92001606 87766218 84313188 80741507 77543491 74330034
14228 74330034 71100761 68361143 65654493 63399919 60745629 58586814 56441182 54403834
14220 54403834 52652223 50736166 48963056 47186885 45446648 44074559 42818193 41307342
14212 41307342 39704353 38657605 37575012 36528605 35152945 34454566 33510860 32491032
14204 32491032 31391576 30666294 30126605 28791470 28052085 27277586 26684202 25731672 25025099
14195 25025099 24506432 23739799 23384867 22678107 22292808 21582105 21166864 20292840 19834999
14186A9834999P779o51193m11131n09407m79981k94705m12169j90676m46166n07629
14176A5939721l46339j95653l72573l84691k42762k78602l30575j34516k49389
14167A3404621n43076r3796k58940l35331j0628j25623l49465j84785k98212k08415
14157A0996350m05976J09121j34591l64998N8606l80924l02865j6034j87331l01151
14147I070207q6262j24952k60031K06565l06932l56861J42946n14346N9759J53998
14137G984091o5282j79985K5294o20540K8585J62616M770k80874j49745J9403
14127F928333k97513K74129m61321n07824N47096j54924r5499j21988k11120l0469
14117E868900K48316k68831M4507k66316J58331r3843k63941R590K19418l19824
$$ plain form
14186 19834999 19842778 19191585 18780454 18271047 17791066 17496361 17084192 16893516 16447350 15939721
14176 15939721 15593382 15397729 15025156 14640465 14397703 14119101 13788526 13654010 13404621
14167 13404621 12861545 12767749 12508809 12173478 12162850 12037227 11687762 11502977 11204765 10996350
14157 10996350 10590374 10699495 10564904 10199906 10258512 9877588 9574723 9558689 9371358 9070207
14147 9070207 8983945 8858993 8598962 8805527 8498595 8141734 8284680 7770334 7830093 7984091
14137 7984091 7918809 7738824 7764118 7143578 7172163 7334779 7339549 7058675 6908930 6928333
14127 6928333 6630820 6904949 6443628 5935804 6482900 6327976 6232477 6110489 5899369 5868900
14117 5868900 6117216 5848385 5892892 5626576 5784907 5691064 5427123 5436713 5656131 5336307
14107E336307j84847L9693p7447J91535n74743J85401j43043P903j73760J68235
14097D775234j43101k17929j98495J99750M4803n3971n4308j13929k06211j01963
14087C929880J04657p8345k56312K31939j98867j91452K85339k36671n0259R8265
14077C638174j57446J93668l24490K04878O5490m11866J47865j7440m3772K99948
14067C595009l86021j89570J44947m73569N07132r4633p0267Q3941n82157O40139
14057C174951m13988O5168J61715J2149j06233J12956l68285j62069M09688l51569
14047B534483k65899K71187N0818j64256L87304m37299r918j71029r382M23611
14037B609620j90522K22620n25451K5142p2911J96548L8051l68755K72495K8279
$$ plain form
14107 5336307 5151460 5191153 5113706 5305241 4730498 4915899 4772856 4780759 4606999 4775234
14097 4775234 4632133 4414204 4215709 4415459 4460262 4406291 4351983 4238054 4031843 3929880
14087 3929880 4034537 3956192 3699880 3931819 3732952 3541500 3826839 3590168 3539909 3638174
14077 3638174 3480728 3674396 3349906 3554784 3620274 3208408 3356273 3338833 3295061 3595009
14067 3595009 3208988 3019418 3164365 2690796 3197928 3103295 3033028 3116969 2534812 3174951
14057 3174951 2760963 2826131 2987846 2999995 2893762 3006718 2638433 2476364 2886052 2534483
14047 2534483 2268584 2539771 2590589 2426333 2813637 2376338 2366420 2195391 2186009 2609620
14037 2609620 2419098 2641718 2116267 2141409 2068498 2265046 2303097 1934342 2206837 2235116
14027B235116K77657l1016l76386P043r2305J77323j84675J50533j28919n5575
14017A978796P0200j16082k8389n1627K21235j92797K7181L88234m52285O0902
14007A905368l09862M43369J98117m94028k43387J63986M2829J7349L738J82713
13997A910192J46865P0256J60111M31445P1909N40690O66419J061885J748701
13988F808473L171235L553447L355322L52860k663903l691868k714708j834094
13980F336764j231112p29152n52237l65940k23323k51801o79907K55518N8651
13971B617461l92791k7536M4241r1710j28117p0289M8606p4223j50927J52755
13961A927470K55188l44363k73789K22827K1287j69048J84529p2673j66385J58505
$$ plain form
14027 2235116 2512773 2481757 2105371 2112414 2020109 2197432 2012757 2163290 2034371 1978796
14017 1978796 2048996 1932914 1904525 1852898 2074133 1881336 1908517 2296751 1844466 1905368
14007 1905368 1595506 2038875 2236992 1742964 1499577 1663563 1706392 1723741 1727479 1910192
13997 1910192 2057057 2127313 2287424 2718869 2790778 3331468 3997887 5059772 6808473
13988 6808473 9979708 13533155 16888477 17241337 14577434 10885566 8170858 6336764
13980 6336764 5105652 4376500 3824263 3458323 3235000 2983199 2303292 2558810 2617461
13971 2617461 2224670 2197134 2241375 2149665 2021548 1951259 1999865 1925642 1774715 1927470
13961 1927470 2182658 1838295 1564506 1787333 1808620 1639572 1824101 1751428 1585043 1743548
13951A743548j80471J82831k60593K36618j18094l7049j44995j73734j29252J99277
13941A318086j17051L46137m62210J01120J62625k19036L1401J48437k73515M81985
13931A517979l17360L23457O5692m81188J60708p7834K89792j50138o1730j52604
13921A116774J5153p4774L58786j25325j6736r6245m48723O94839n85488M68250
13911A306511k2920j89587N2665m05695J19791M9303K24411j40113l3105K98015
13901A259276k9042l86765L1187j92085K33320m7405L33083m25243J19891O4337
13891I60554n6964j30523L60994r3317r0188J55216j81880k36797K45922J39751
13881A072768n402r0298M8457k69023J11640j3494L8936j21704K64222k2010j34672
$$ plain form
13951 1743548 1563077 1745908 1485315 1721933 1603839 1566790 1421795 1248061 1118809 1318086
13941 1318086 1201035 1547172 1084962 1186082 1348707 1129671 1161072 1309509 1035994 1517979
13931 1517979 1200619 1524076 1589768 1108580 1269288 1191454 1481246 1331108 1269378 1116774
13921 1116774 1131927 1057153 1415939 1290614 1273878 1177633 728910 1423749 838261 1306511
13911 1306511 1283591 1094004 1146669 740974 860765 910068 1134479 994366 961261 1259276
13901 1259276 1230234 843469 874656 682571 915891 868486 1201569 776326 896217 960554
13891 960554 903590 773067 1134061 1040744 950556 1105772 923892 687095 933017 1072768
13881 1072768 1067366 977068 1025525 756502 868142 854648 893584 771880 1036102 1014092 879420
13870H79420l75652K58962J47774j26454l2562j08701o8856L11621k12222J58703
13860H32033q229l64483J24550j0512J00731K41933l53245J42671J27668K4479
13850H57596j52837L2237J64718k75578j13512M29212k35495l5023P4880k88216
13840D57982K782M50461D26638K12821K97417q0756r7400P412K1379O3495k93182
13829E57824J51476r6361K37050l03097J32302j00153P2378j32978K29376l05980
13819D41837L43405k99028L61248A58847M70390j5314L2680J52912j35332k23484
13809D40699J0182K18984B34697L05391J08147J07500J85394B13004J07984K96337
13799F17325R7121j55973j93832L89557C07464p841M28789k32645M5045j76255
$$ plain form
13870 879420 503768 762730 910504 784050 751488 642787 573931 885552 673330 832033
13860 832033 823804 459321 583871 573359 674090 916023 562778 705449 833117 857596
13850 857596 704759 736996 901714 626136 512624 941836 706341 671318 746198 457982
13840 457982 460764 911225 426638 639459 936876 856120 758720 766132 787511 851006 557824
13829 557824 709300 612939 849989 546892 679194 579041 651419 518441 747817 441837
13819 441837 785242 486214 847462 158847 629237 613923 646603 799515 664183 440699
13809 440699 450881 669865 234697 540088 648235 755735 941129 213004 320988 617325
13799 617325 714446 558473 364641 754198 307464 299623 728412 495767 540812 364557
13789C64557J65108J59748J27418j99716L27795B79860K12151K44680k61011O6837
13779E42517L32280k72813j00240k45355L50741J3058R2493l44715J25394B26436
13768E39900j04486o6729r9755K57251j3677N8746j58307q3821J93476j54378
13758C68220P1328N559L9548K61527k74298p4924L96906j99691k41142K42147
13748E95180q9688R6745M5853J5174k26309q4125N34261C99785K43976k66041
13738C77720p8871J62339R6291J38640k76097K95338A77701K38343k07718K31723
13728D40049J30584n3562K29784j84457m9891k17539J17285K51409j69182k03092
13718B91388M20134k91909K68430j27789j25729K15283A54525K6165K80552J50816
$$ plain form
13789 364557 529665 689413 816831 617115 944910 279860 492011 736691 475680 542517
13779 542517 874797 601984 501744 256389 607130 620188 712681 367966 493360 226436
13768 539900 435414 368685 268930 526181 512504 571250 412943 329122 522598 368220
13758 368220 439548 445107 484655 746182 471884 396960 793866 594175 353033 595180
13748 595180 505492 602237 648090 663264 436955 352830 887091 399785 643761 377720
13738 377720 298849 461188 557479 696119 420022 715360 177701 416044 208326 440049
13728 440049 570633 517071 746855 562398 512507 294968 412253 663662 494480 291388
13718 291388 711522 419613 688043 560254 434525 649808 154525 180690 461242 612058
13708F12058j22369l0769j7328j64380J89886j38477J44644j505J63340k44096
13698C91004L3351B11988R5301J82065k27324j24788J61706j00992K06779k6955
13688C77780B4081P1720K39261q0282J46788J25036k50305A32962J69848P8757
13678C81567j36608J53721P7933o9858K90552G8804M20233k08519L40604C13186
13667C39286A44643M78277j01949P3426B66212m089o2373J91461A72289K06704
13657C78993k599M8808A17262K61951A63303L7179K13036j18354J87033r7699
13647C84498K61158B77651L89682j50960j08173j64488J80137I6423J51017J7394
13637B64834L35865A81894J95555A975L46096A55058J28501k2386O6523J53528
$$ plain form
13708 612058 489689 458920 441592 277212 467098 328621 473265 471760 635100 391004
13698 391004 424355 211988 307289 489354 262030 137242 298948 197956 404735 377780
13688 377780 24081 95801 335062 254780 401568 526604 276299 132962 302810 381567
13678 381567 244959 398680 476613 406755 697307 78804 499037 290518 631122 313186
13667 339286 144643 622920 520971 594397 266212 262123 199750 391211 172289 378993
13657 378993 376394 425202 117262 379213 163303 200482 413518 295164 482197 384498
13647 384498 645656 277651 667333 516373 408200 243712 423849 96423 247440 264834
13637 264834 600699 181894 377449 1975 348071 155058 283559 261173 327696 481224
13627D81224E9179L05797A03755K60758E6849M163J30333F4126J11958Q7520l6376
13616B27228J44677q6754J65978A43098N0811M7711n9984J11951g4756B56746
13605C16424J09401Q246D8725L89961k00962J30536A12361M62374B02920J82075
13595C84995a7046B95192j24083K45050G4554P4167J40230E8760M5992M07324
13585E12076B25705p9867J44520C0079P4722h202C11620j06113n5172K09655j05374
13574B54616K55609B33572B8172J41101J42637a3888B551M34278j78627b06242
13563B18435a51282F31339F6439M1162J56977J91592H8922K38174l7194G0222
13552C97842O511j49856n0162J54092a7570B67977a23590B30205Q8027m8150n323
$$ plain form
13627 481224 59179 364976 103755 364513 56849 61012 191345 64126 176084 263604 227228
13616 227228 371905 285151 451129 143098 193909 241620 181636 293587 -74756 256746
13605 316424 425825 434071 48725 438686 237724 368260 112361 574735 202920 384995
13595 384995 -17046 295192 171109 416159 74554 148721 288951 58760 104752 512076
13585 512076 225705 145838 290358 30079 104801 -8202 311620 205507 150335 359990 254616
13574 254616 510225 233572 28172 169273 311910 -13888 2551 436829 258202 -206242
13563 218435 -151282 631339 66439 107601 264578 456170 88922 327096 289902 70222
13552 397842 404353 254497 204335 358427 -17570 267977 -123590 230205 318232 270082 264759
13541B64759J51324A69225J66702r415A05338R4264O3026l9873a04684K145A68593
13529A18503L06254P178H9655K19245J33194g337j67885C94622H0715N8053J3175
13518A51943M7783J15826l2074L4805J433K8876r2183K6168l6503G5040J90981
13507B66021P0863I6997J43083j5109G9209c5355I9590K804L29N98301I0686L34380
13495D25066e2555J8512I9527k8468L1405j3190l5557a4433A48299D3747L75203
13484D18950j72680A11518K30201g7175q91A14943d7157B98592k8760k5461K0690
13473B65061N3559j48692p9842a7595B25052J69589B457L60719A62260K19201
13463C81461Q1569A59289O8592D6986Q6359K34239e2257B96686m2813J97492A28690
$$ plain form
13541 264759 416083 169225 335927 326512 105338 199602 262628 222755 -104684 -102539 168593
13529 118503 424757 431935 89655 308900 442094 -7337 -175222 394622 80715 138768 151943
13518 151943 199726 315552 283478 318283 319716 348592 256409 282577 246074 75040 266021
13507 266021 336884 96997 240080 224971 79209 -35355 99590 102394 102723 701024 90686 425066
13495 425066 -52555 -34043 99527 71059 102464 89274 53717 -14433 148299 43747 418950
13484 418950 246270 111518 341719 -77175 -78066 114943 -47157 298592 269832 244371 265061
13473 265061 318620 169928 90086 -17595 225052 394641 2457 363176 162260 381461
13463 381461 463030 159289 227881 46986 133345 367584 -52257 296686 253873 451365 128690
13451a00871D77645G8935d1192B22663F8502i6558r2647B45276a37071B32345
13440i4617E3461c42336C58725b8398B6376N6319L67321q6538k5252j32175I1655
13428D3627J03130B0389e3770B5474e3338a032C1821K44526M4953C1106J11384
13417A42490J77199a42765C92016C0760c89327a05987M3477E86625r7135A4187
13406B8764a36534H7031P9181B7221L79580F1553g0713C4070M75857B32400J43703
13395C76103A50678J75119j02662l5715a56418C0417I799a8018C14057i4243A69722
13383B49932A20586A4825h1716G224J42502k8225Q5759c7380A49686h0867D5132
13371C40604N8498A86178N4895J5652A24169M3562o2356j3451J65640G37i5954
$$ plain form
13451 -100871 477645 78935 -41192 222663 68502 -96558 -189205 245276 -137071 232345
13440 -94617 53461 -342336 358725 -28398 26376 82695 450016 363478 338226 206051 91655
13428 43627 146757 20389 -53770 25474 -53338 -1032 31821 276347 321300 31106 142490
13417 142490 319689 -142765 392016 30760 -389327 -105987 -62510 586625 489490 14187
13406 28764 -136534 87031 166212 27221 406801 61553 -70713 34070 509927 232400 376103
13395 376103 150678 325797 223135 187420 -156418 30417 9799 -18018 314057 -94243 169722
13383 249932 120586 14825 -81716 7224 149726 121501 207260 -37380 149686 -80867 45132
13371 340604 399102 186178 241073 256725 124169 167731 105375 91924 257564 737 -95954
13359B55169a77536F1915k5198N6053j7192L04088j45132k8095A3074N9987R4802
13348A67863Q4802R286L711l3864b49050A73140D6154M9192R456a08889A47915
13336C61197p9379A26097R7972l1576l6619L5719E5285L38329A82073K86521j47026
13325C21568A55500e5507B20536l5319j4972K1119K3670k6214J34723A12588J13079
13314B25667e3362A28597c69049B44906K22063j55724j30792m7242L54443c4022
13303B99299o7411C7600a18525m1768H3594b03608C90940j57646B5074J62923
13293A87997Q3320A11146i48q2124C6816L50919A14256M59348C7770M2155a11110
13281B13303J37561I2560M39823g3455B76229j33355c0350C3144O7846E227d4973
$$ plain form
13359 255169 -177536 61915 36717 92770 75578 379666 234534 206439 13074 73061 167863
13348 167863 252665 261951 265662 231798 -249050 173140 46154 95346 104802 -108889 147915
13336 361197 281818 126097 224069 192493 155874 191593 55285 393614 182073 468594 321568
13325 321568 155500 -55507 220536 185217 170245 191364 215034 188820 323543 112588 225667
13314 225667 -53362 128597 -369049 244906 466969 311245 180453 133211 487654 -34022
13303 299299 231888 37600 -118525 -160293 83594 -203608 390940 233294 25074 187997
13293 187997 271317 111146 -948 -83072 36816 387735 114256 573604 37770 79925 -111110
13281 213303 350864 92560 532383 -73455 276229 142874 -30350 33144 100990 5227 -44973
13269A38468b1620C15792K12677A45732a31741A94557a78390k6191B55086r7164
13259A57922l9336a16960B84838J77575k22638F6440J85751c15708I2592K8960
13249A21552a11167D77723B05795P9718j14899K01147a1928r3108C0857b29692
13238a77434C9581A8071K56020a7561G6412K3553a96240D8761a81149A17582J95467
13227C13049a07938M9982C34666A42894a58169D7665K98494D368b50928B24467
13216a03560H1362b08225A54732o4531a34151L4163A7804D836a61317P6552A82187
13204a7362A13934E4223e7315D4687i7795k08759A60575m486L8961h9584j09843
13193a99427n2703P3273A67987h2422j52797R6663A57389n8290h064o2674E693
$$ plain form
13269 138468 -21620 315792 528469 145732 -131741 194557 -178390 -204581 255086 157922
13259 157922 118586 -116960 284838 462413 239775 66440 252191 -315708 92592 121552
13249 121552 -111167 477723 205795 285513 170614 371761 -11928 -105036 30857 -229692
13238 -177434 39581 18071 274091 -17561 76412 99965 -196240 48761 -181149 117582 313049
13227 313049 -107938 -57956 334666 142894 -158169 47665 346159 4368 -250928 224467
13216 -103560 81362 -208225 154732 90201 -134151 -99988 17804 4836 -161317 -84765 182187
13204 -17362 113934 54223 -57315 44687 -97795 -306554 160575 156089 195050 -89584 -199427
13193 -199427 -252130 -178857 167987 -82422 -235219 -138556 157389 99099 -8064 -70738 5693
13181a52920B9774J56362F1775M47890b8754E528Q009h0924I9058J12620b76812
13169B4521b23390Q4517C34681G0737J05185D9493A2739L30782A14482R7332a478
13157g5564J9875A01131k1668f5141F8473a61753L1967B29904C0247N4509e8813
13145a84965A71385p8028N3912D7079J62385K16910D5458c09280A06185J99733
13135C05918f5017B69119B1961c4757l5552b1585A06897e0500o1242d4674m1859
13124h6533j2187I7936K34817G767a0036m1077r5083n589A7861i8493B453b11300
13111E198J40666b25984C10020A21293K0624J24616q6668a6446I3214h1079j22045
13100b03124j44979E6410a33556M9871A07491C418L5224a42941F2983e7320a2132
$$ plain form
13181 -152920 29774 186136 61775 509665 -28754 5528 13537 -80924 99058 211678 -276812
13169 24521 -223390 -138873 334681 70737 175922 49493 12739 343521 114482 211814 -1478
13157 -75564 -55689 101131 79463 -65141 68473 -161753 -129786 229904 30247 84756 -58813
13145 -184965 171385 93357 147269 47079 209464 426374 45458 -309280 106185 305918
13135 305918 -65017 269119 21961 -34757 -70309 -21585 106897 -50500 -111742 -44674 -86533
13124 -86533 -98720 97936 332753 7767 -10036 -51113 -146196 -151785 17861 -98493 2453 -211300
13111 5198 145864 -225984 310020 121293 141917 266533 179865 -16446 93214 -81079 -203124
13100 -203124 -348103 56410 -133556 -83685 107491 3418 38642 -142941 62983 -57320 -12132
13088g6404A22434k9526a38388L1551K9273G0948a66016A2690K97033p4466r5902
13077A39355b17779A12186R6477J35840j54310G6195J15374a51266A55422a489
13066a96545A43744c6427D52129i691j9309j40802A22706J15897i6204A03884
13055G5830J73642M7586A01905A0354L75244a67821g2679A85997a8478D3032a61063
13043F2253g6330G9969R9867j6622K26167A13140p998b4633A81915a10888G07
13031b00709G5669a37033C8392Q3006B5638c20976a7584G0261c7488E0888L23160
13020C74048A24472m5060M9866M23403A1138d1687j00681A57735L4804J02863
13010B95402a93267f5972G0846J2352J1758Q4002G1796a54244F0593J35872a1344
$$ plain form
13088 -76404 122434 92908 -138388 -106837 -77564 70948 -166016 12690 309723 235257 139355
13077 139355 -217779 112186 208663 344503 190193 76195 191569 -151266 155422 -1489
13066 -196545 143744 -36427 452129 -9691 -29000 -169802 122706 238603 -96204 103884
13055 75830 249472 297058 101905 10354 385598 -167821 -72679 185997 -18478 43032 -161063
13043 62253 -76330 79969 179836 163214 389381 113140 105142 -24633 181915 -110888 707
13031 -200709 75669 -137033 38392 121398 25638 -320976 -17584 70261 -37488 50888 374048
13020 374048 124472 79412 129278 552681 11138 -41687 -142368 157735 192539 295402
13010 295402 -193267 -65972 70846 83198 94956 178958 71796 -154244 60593 196465 -11344
12998A43308g1166A9328J71225e8821J9325J7482A40534a31459A94836F3304a46075
12986d8195A45882F2354p698M5567a49192A48505J3571a33808F2031J60078a13175
12974a0714k3860F0982j3591f0474A563a49727B12818p2218K11776A67689J27980
12963B95669I7255M3030J32512d6659j85186j08656A0078L41063B7547g9237B837
12951c4513B12619i9092I0117A9151a63022b6539n0118m6988F8713J58755B6909
12939b736A3303h6304B22999F7559a93463k6302R0333A61712h7712H7556M5333
12928A32889J15977a31363p0903A54653a5811A28522D2038K90077F7970e1576
12917a57046J0244b6543G9992R9474J21122i7164B41294j10549b12504g9611c5095
$$ plain form
12998 143308 -71166 19328 190553 -58821 -39496 -22014 140534 -131459 194836 63304 -146075
12986 -48195 145882 62354 54656 100223 -149192 148505 162076 -133808 62031 222109 -113175
12974 -10714 -34574 60982 47391 -60474 1563 -149727 212818 140600 352376 167689 295669
12963 295669 97255 140285 272797 -46659 -231845 -340501 10078 351141 27547 -79237 2837
12951 -34513 212619 -99092 90117 19151 -163022 -26539 -76657 -123645 68713 227468 26909
12939 -2736 13303 -86304 222999 67559 -193463 -219765 -129432 161712 -87712 87556 132889
12928 132889 248866 -131363 -202266 154653 -15811 128522 42038 332115 67970 -51576
12917 -157046 -146802 -26543 79992 179466 300588 -97164 241294 130745 -212504 -79611 -35095
12905b3232j2477o1007j15261k2931g8896A4199a13314A62396m0915h0733A42268
12893a3454C34064d56480a80388B8724N731g0183j1192A40937a48027l2133C3819
12881a04794c3928A51128G878f0797K4749A47358c44254B90729M4972b794A27457
12869a13492j01408D2062d4322B29195f0721K2359k53860a34428B29224A00353
12858c01881B17728a81821o4331C90993a03689M4819H5568N3151a11311A36827
12847A09497B1295K694a05953c2847j74146j0685c8132D34315G931c00725A93596
12835e2538A13975J3064n8542J00039e7674D6793A9616m560N5864L64062b66592
12823A14704e1229A35158O4425O4252e913k08953D6033K79852H7640h6679q6768
$$ plain form
12905 -23232 -35709 -96716 -211977 -234908 -78896 14199 -113314 162396 121481 -80733 142268
12893 -13454 334064 -456480 -180388 28724 34455 -70183 -81375 140937 -148027 -180160 33819
12881 -104794 -33928 151128 7878 -60797 -36048 147358 -344254 290729 335701 -2794 127457
12869 -113492 -214900 42062 -44322 229195 -60721 -38362 -292222 -134428 229224 100353
12858 -301881 217728 -181821 -246152 390993 -103689 -58870 85568 138719 -111311 136827
12847 109497 21295 23989 -105953 -32847 -206993 -217678 -38132 434315 7931 -300725 193596
12835 -52538 113975 127039 68497 168536 -57674 46793 19616 15056 70920 434982 -266592
12823 114704 -51229 135158 199583 263835 -5913 -214866 46033 325885 87640 -86679 -173447
12812a73447a0582H6608b21892P5366I5216k0532a14772B0714L0803F073Q8597
12801I4670m1124a79001l29193a0985C9353a12994K2913A66404c7168k3562A21614
12789a77877A33090c2246B12762e0818r5869d2952A27045l902e644q4856j28728
12778b19228R6361b6080k17138d9562j59262f6766A95832a79856j4895A58230
12767A51584a61591k1767d6505l17975g5864A44099J1282i6191E0045J18069J5684
12756A83798c22718A6489a76778L0581G9187b57596b380q7006A9839d2223H9802
12744e7772E9511f4464A43934m7319J49641g7843A04404l2439K32010D3894c61351
12732I7052m6174K4978f0366B62693A09631C0840b54181A02916k9031D658J09599
$$ plain form
12812 -173447 -10582 86608 -221892 -146526 95216 74684 -114772 20714 51517 6073 94670
12801 94670 53546 -179001 -508194 -10985 39353 -112994 -90081 166404 -37168 -60730 121614
12789 -177877 133090 -32246 212762 -50818 -146687 -42952 127045 123143 -5644 -90500 -219228
12778 -219228 -122867 -26080 -243218 -49562 -208824 -66766 195832 -179856 -194751 158230
12767 151584 -161591 -183358 -46505 -364480 -75864 144099 155381 -96191 50045 168114 183798
12756 183798 -322718 16489 -176778 -146197 79187 -257596 -2380 -89386 19839 -42223 89802
12744 -57772 59511 -64464 143934 96615 246256 -77843 104404 71965 303975 43894 -361351
12732 97052 50878 75856 -60366 262693 109631 30840 -254181 102916 73885 4658 114257
12721A14257e6412A63129f1577q0696e0233A28762m2728J6210c2044H8702J09186
12710A97888P5900G4219K9531e3824C53880A66722K24801o0086F9104K32013j18217
12699A82900a89051B17971b9924j53248A75162e3332B88581j21802N9287A6410
12688c80069J10251k2691a07909c0519q1456M9694j24270h7374J5583J4533E6497
12676E4974g0536A63572b28121b3204A51674Q5252k0305R5972j3010b5985o7108
12665i3093E0173b04302f9709k6040D646a58085D4357J90947h6391C87512a86855
12653G2685K616J18578C4937a83101j00839Q2751i7986A42791F4841g4745J3996
12642f0749D5963p322R7555Q5549g9936A33949h6145F4828b98063g8643j12485
$$ plain form
12721 114257 -56412 163129 -61577 -142273 -50233 128762 86034 102244 -32044 88702 197888
12710 197888 273788 74219 103750 -53824 353880 166722 391523 331437 69104 301117 182900
12699 182900 -189051 217971 -29924 -183172 175162 -53332 288581 166779 226066 16410
12688 -380069 -269818 -292509 -107909 -30519 -111975 -62281 -186551 -87374 -71791 -57258 56497
12676 54974 -70536 163572 -228121 -23204 151674 236926 216621 312593 299583 -25985 -93093
12665 -93093 50173 -204302 -69709 -95749 4646 -158085 44357 235304 -86391 387512 -186855
12653 72685 75301 193879 34937 -183101 -283940 -201189 -97986 142791 64841 -74745 -60749
12642 -60749 45963 38641 136196 221745 -79936 133949 -86145 64828 -298063 -78643 -191128
12631a91128E3488L8333C7145P2361M7901N6752A8025P589F179K35634a32640
12619f4612D63815A6805a71759K8415A71851a2033C2022a42297D57726a32604
12608d10287C63535A14466a85105D7090c69594a04737j07024K2966B66348a3890
12597B9988P6797L3093f8633A19776B9296R4504l6444k0808b24055e3590A19369
12585E7592i6932h887I0865J03982O3076E2174B0699f8609a9842G6570J02298
12574A78868b51934I4486b27998B18826H4539K1496a469F265K58297a86180e9399
12562A99232i8413l4557A29688h6702G2878b66402p0086A38813D3902e16688K41776
12551b74912F8927M3450D6624a12606J942A72044b33911A63357d55B82351i1191
$$ plain form
12631 -191128 53488 91821 37145 109506 157407 214159 18025 25614 6179 241813 -132640
12619 -64612 463815 16805 -171759 -143344 171851 -12033 32022 -142297 457726 -132604
12608 -410287 363535 114466 -185105 47090 -369594 -104737 -211761 -188795 266348 -13890
12597 29988 106785 139878 -68633 119776 29296 123800 87356 66548 -224055 -53590 119369
12585 57592 -96932 -8887 90865 194847 257923 52174 20699 -68609 -19842 76570 178868
12574 178868 -251934 94486 -227998 218826 84539 106035 -1469 6265 264562 -186180 -59399
12562 199232 -98413 -132970 129688 -86702 72878 -266402 -336488 138813 43902 -516688 -274912
12551 -274912 68927 112377 46624 -112606 -110664 172044 -233911 163357 -455 282351 -91191
12539b650G046c6465d021E9027J33263b1500n8132a8885k1993B4868K5322R9287
12527A49477o4784b9771r2096J5154M2909A28919J69548b0134j23625j6041A58974
12515a24458D7929J64729B8181f8544L0680G7667I758K02851m4591k6507n9692
12504H1819b28728j2465O8654G2669J7450k0697b97532J26583l4845B46413i5259
12492d126A87247a76914K8720H5494N6232B5381J6960o846L780J6721j8451a96478
12479a46688B9450J29100a48390b4206B60966h9110A32122d97509e3945D3886
12468b89669c1612k00774j9480a5603E3622K83536a18774N6951F7561A4482K2782
12457C7264b88308A12678C4456J4235A0598f5839k55541g9154k9510j38852A18659
$$ plain form
12539 -2650 7046 -36465 -4021 59027 192290 -21500 -79632 -18885 -40878 24868 50190 149477
12527 149477 84693 -29771 -121867 -106713 -63804 128919 298467 -20134 -143759 -159800 158974
12515 -124458 47929 212658 28181 -68544 -37864 77667 9758 212609 168018 141511 81819
12504 81819 -228728 -241193 -172539 72669 90119 69422 -297532 -170949 -205794 246413 -95259
12492 -4126 187247 -176914 -148194 85494 141726 25381 42341 35495 39275 55996 37545 -196478
12479 -146688 29450 158550 -148390 -24206 260966 -89110 132122 -497509 -53945 43886
12468 -289669 -31612 -232386 -251866 -15603 53622 337158 -118774 -61823 67561 14482 37264
12457 37264 -288308 112678 34456 48691 10598 -65839 -321380 -79154 -108664 -247516 118659
12445B4598d6223n06644i4001k89096a0759o2440B94111q7562o5728F5397K13388
12434B78785j28543D3237a20792F6357f5441E0039a2328G8449a20649B7264R6631
12423A23895L9342A3064b85031A01670f8129C7417h4441j36584e078k02351q0505
12412b87934C04546I6500b19417e6439k9390j45845A60423c72524a44196D4968
12401F6813a51090B38819B2706a06454A05097a06711j92046J19747A45379b95126
12390h8934A58816b5136B99659J55995i1218B5499a32345N9038c3131m394q7340
12379a24865N0713j58278a6050q2119J2277K8734r2381j25311e705l01972a12739
12367b35935A0787b44696J6454G9035b46480M708k8680A75464n0003H985k127
$$ plain form
12445 24598 -46223 -552867 -94001 -383097 -10759 -73199 294111 206549 140821 65397 278785
12434 278785 150242 43237 -120792 66357 -65441 50039 -12328 78449 -120649 27264 123895
12423 123895 163237 13064 -285031 101670 -68129 37417 -84441 -221025 -5078 -207429 -287934
12412 -287934 304546 96500 -219417 -56439 -85829 -231674 160423 -372524 -144196 44968
12401 66813 -151090 238819 22706 -106454 105097 -106711 -298757 -179010 145379 -295126
12390 -88934 158816 -25136 299659 455654 -91218 25499 -132345 -73307 -33131 -37525 -124865
12379 -124865 -74152 -232430 -16050 -98169 -85892 -57158 -149539 -274850 -5705 -307677 -112739
12367 -235935 10787 -244696 -228242 79035 -246480 -241772 -270452 175464 125461 8985 6858
12356F858b30904c1608A44558d26816a00545A58206k3190k8591b24557g465C48025
12344C8470b92964J38637m8791h1732G1661b278j87193A38514K774o7897L0619
12333A04010K6854b16059M4279A26346L1510d4039A12105d9251A17868l9544r303
12322F9021K8544b10654A05630d884q1371H9431C1092H258B781J37683A8760d3474
12309H5842a32645a0842j12014B22751A0030c693l714A56746D798a32761A41879
12297F0757J5353b66622A43244C5368e8958H3396J25716B4967c28796a993l0542
12286c2535A83954a20706o587b4936j42431d5696A04053D4849J40696g8942A62535
12274e5703a4214B93368A02226P0862J341i8861B32876o0955b176A13680J16080
$$ plain form
12356 6858 -230904 -31608 144558 -426816 -100545 158206 135016 106425 -224557 -7465 348025
12344 38470 -292964 -154327 -203118 -81732 71661 -2278 -189471 138514 141288 73391 104010
12333 104010 130864 -216059 -171780 126346 157856 -44039 112105 -49251 117868 78324 69021
12322 69021 97565 -210654 105630 -4884 -86255 89431 31092 8258 2781 140464 18760 -43474
12309 85842 -132645 -10842 -122856 222751 10030 -3693 -7407 156746 4798 -132761 141879
12297 60757 76110 -266622 143244 35368 -58958 83396 209112 24967 -328796 -1993 -32535
12286 -32535 183954 -120706 -127293 -24936 -167367 -45696 104053 44849 185545 -78942 162535
12274 -55703 -14214 293368 102226 173088 174429 -98861 232876 171921 -2176 113680 229760
12263B29760b77210I2348e8408k11763c2257H1220L81037A80649p3118K25997
12253C33528G3447J75719q1205h5751B01377K00240c4631k51649D7180a29051
12242g9687B68814e6609a0796A45604h3903I1908a45769A84398e3511C0507f354
12230I3711b04078e3363C89839B8555K10160K81709k31124H3181J0375K25162
12220C18718B8554K05316I9356b2242A88004i0575q613j97238O0080B42648h6072
12208h6568K4721m2484A6834a17541m7706P8520L8893D0106P8164a3106I3782
12196H3816J02127m2467J06158J6295j19652j2149C7345L31917G3026h6463A2848
12184F0428K2661g1894B3189a54277I4563A2009d8190o1776b895A02525R8328
$$ plain form
12263 229760 -277210 92348 -58408 -270171 -32257 81220 462257 180649 107531 333528
12253 333528 73447 249166 167961 -85751 201377 401617 -34631 -286280 47180 -129051
12242 -79687 268814 -56609 -10796 145604 -83903 91908 -145769 184398 -53511 30507 -6354
12230 93711 -204078 -53363 389839 28555 238715 520424 289300 83181 93556 318718
12220 318718 28554 233870 99356 -22242 188004 -90575 -99188 -296426 -236346 242648 -86072
12208 -86568 -61847 -104331 16834 -117541 -165247 -86727 -47834 40106 118270 -13106 93782
12196 83816 185943 143476 249634 265929 146277 134128 37345 369262 73026 -86463 12848
12184 60428 83089 -71894 23189 -154277 94563 12009 -48190 -109966 -2895 102525 200853
12173B00853c3277i838E4266A3099M2878h2881C00025B3089a03284C6521L02399
12162C38920b8310k5333E5485M2162a81033B0197J84700A6727a57081b6518C849
12150c9215A13354N4187b8066A09960a43953j90050H8859d4596j55791B9289J33289
12139A62578a44934j0995j14033B5794b08456F8406a96834D0462J98654i2300
12128c8659A37443A7969K00171b17215L371j92572A57958g9320G8096C7446e5160
12116a39794H0149a16109a5875I3346b102C9306a13624k6817m9661j24956M7573
12105b67485G1950b29047A56993a73939j1197H8826b89152A3244a24069N1857
12095g2212d386k207k20861G6560J68512A09431a66695A34132d6939A2107g0797
$$ plain form
12173 200853 -33277 -9838 54266 13099 55977 -82881 300025 23089 -103284 36521 338920
12162 338920 -28310 -53643 55485 97647 -181033 20197 204897 16727 -157081 -26518 3849
12150 -39215 113354 167541 -28066 109960 -143953 -334003 88859 -44596 -200387 29289 162578
12139 162578 -144934 -155929 -269962 25794 -208456 68406 -196834 40462 239116 -92300
12128 -38659 137443 17969 218140 -217215 -213844 -406416 157958 -79320 78096 37446 -55160
12116 -139794 80149 -116109 -15875 93346 -2102 39306 -113624 -140441 -190102 -315058 -267485
12105 -267485 71950 -229047 156993 -173939 -185136 88826 -289152 13244 -124069 -72212
12095 -72212 -4386 -6593 -227454 76560 245072 109431 -166695 134132 -46939 12107 -70797
12083b00628H5105b32647l8747A23426A7909J10557c0404A79148O0937A1169K65669
12072B76838c5235O924j58487B44778e4388B42777A17419K30784a7202k09996
12062b27198R5387k00985h3956E8195g5376I362L3781b5818k5728I2918Q2510
12051A75428b59835f0725j76824M4267C5449a59071A62863b8456j53563R0749
12041i1270C42989I7235g7487A20936b1331A37157F2503p852e041o3245A19209
12029F705N3555k5863G066J92480b12459B69681c9785B8444K45981N6449j09508
12018B21366F6555a44655q446g1941F8384L07818b64199A27105J37513b2147o3717
12007h5864A65941F5325M6864l2484j6004Q635Q0034C9210i616H759N0350L50612
$$ plain form
12083 -200628 85105 -232647 -271394 123426 17909 128466 -30404 179148 240085 11169 276838
12072 276838 -35235 -28311 -186798 244778 -54388 242777 117419 348203 -17202 -227198
12062 -227198 -131811 -332796 -83956 58195 -75376 9362 43143 -25818 -51546 92918 175428
12051 175428 -259835 -60725 -237549 -193282 35449 -159071 162863 -28456 -182019 -91270
12041 -91270 342989 97235 -77487 120936 -21331 137157 62503 54651 -5041 -68286 119209
12029 6705 60260 34397 7066 199546 -212459 269681 -39785 28444 274425 330874 221366
12018 221366 66555 -144655 -153101 -71941 68384 376202 -264199 127105 264618 -22147 -85864
12007 -85864 165941 65325 112189 79705 63701 72336 152370 39210 -9616 8759 59109 409721
11995D09721F0998C339a38396C00148B2646d03842A55312a99965P3399A28963
11984a70317I1031a24696A36017d32j18399A35575J6062a96172g9344A384e8854
11972A000J3933c73552e8583j97434G9609a37612L5630B2595J71743r1680L6446
11961A39104J84902a40316c1850j68083b2761h438l40297a57506j13189b3258
11950f4287b131B01642a515A05576m6812a15174A390N8059B9233i9063k4081o2889
11938a86033A80248a45807A72516G7187M3487A0322g3914a5230k30624h151j71465
11927a79616g2306A46363N6896I4002e4128a7340C3292Q2233a21124A8941b48634
11915F2697b76254a07326J0113b9926j93979A68111e7831j18j04246k0086q7123
$$ plain form
11995 409721 60998 3339 -138396 300148 22646 -403842 155312 -199965 -126566 128963
11984 -170317 91031 -124696 136017 -432 -118831 135575 151637 -196172 -79344 1384 -58854
11972 1000 14933 -373552 -58583 -256017 79609 -137612 -101982 22595 194338 102658 139104
11961 139104 324006 -140316 -31850 -199933 -22761 -8438 -348735 -157506 -270695 -23258
11950 -64287 -2131 201642 -1515 105576 58764 -115174 1390 59449 29233 -99063 -123144 -186033
11938 -186033 180248 -145807 172516 77187 120674 10322 -73914 -15230 -245854 -8151 -179616
11927 -179616 -72306 146363 203259 94002 -54128 -17340 33292 115525 -121124 18941 -248634
11915 62697 -276254 -107326 -97213 -29926 -223905 168111 -57831 -57949 -162195 -182281 -269404
11904b69404b1909D3102f5071j84149N8835F9957a49376m169P1605A8696K65549
11893B84245b30066h1875B128J6281J5012b56643A1167a99020p3114P1999c7737
11881a58787f973F638a58631D2151J86763C9835a19881E0871d1911j27264B44429
11869B1116g1418B51648a74418f5415k0738a2519B56396b93402a01684r3143c0031
11857a98650B08076b14883j08703A23669h7190G5930P7175B4689N3273b58898
11846C33410A32720A5776N0799a07728D7663d9403l0473J9654A7719L03005a19948
11834A13588A2810K14634c9208O259j88144H9190I011K08654o2600R1329a1058
11822a50604d2867j32679j72246a04144L8207B71288i3317A31095n1584Q5815
$$ plain form
11904 -269404 -21909 43102 -65071 -249220 -190385 69957 -149376 -153545 -81940 18696 284245
11893 284245 -230066 -81875 2128 18409 33421 -256643 11167 -199020 -272134 -200135 -37737
11881 -158787 -6973 6638 -158631 42151 228914 39835 -119881 50871 -41911 -169175 244429
11869 21116 -71418 251648 -174418 -65415 -86153 -12519 256396 -293402 -101684 -194827 -30031
11857 -198650 208076 -214883 -323586 123669 -87190 75930 153105 24689 77962 -258898
11846 333410 132720 15776 66575 -107728 47663 -49403 -79876 -60222 17719 320724 -119948
11834 113588 12810 227444 -39208 -32949 -221093 89190 9011 217665 155065 246394 -11058
11822 -150604 -42867 -175546 -347792 -104144 -65937 271288 -93317 131095 79511 165326
11812A65326e4639A15683D9081b41636L1255H3429P131a17361j28022A89174a81834
11800b28219a13487j35342e6330j05963f2552j27005r1873A04152b44536m7450
11790b91986C2033f6410n3152M3264p9246e8095I2081k0095a00082j53322M7371
11779b06033Q7113C16572G8303c08645D1895K43508p1869a78981A37334c54021
11768c74285M1587g2599G8018J1192b19562A44383B4397a80593D2901K01605h614
11756a6765I8564b25504c3392o5026R511A8532J69576B2111J47777c7701r6191
11745a33892K0191A49037J5433e7530A74780c33118A06723L6176a95807A59232
11734a57803q2577M0243c385k33719e6745D4491L73494a98675j9202b5106A26882
$$ plain form
11812 165326 -54639 115683 49081 -241636 -210381 83429 90560 -117361 -245383 189174 -181834
11800 -228219 -113487 -248829 -56330 -162293 -62552 -189557 -281430 104152 -244536 -291986
11790 -291986 32033 -66410 -119562 -76298 -155544 -58095 92081 71986 -100082 -253404 -206033
11779 -206033 -118920 316572 78303 -308645 41895 285403 213534 -178981 137334 -354021
11768 -374285 -332698 -72599 78018 89210 -219562 144383 24397 -180593 42901 244506 -8614
11756 -16765 98564 -225504 -33392 -98418 -88907 18532 188108 22111 169888 -37701 -133892
11745 -133892 -113701 149037 164470 -57530 174780 -333118 106723 142899 -195807 159232
11734 -157803 -240380 -200137 -3385 -237104 -56745 44491 417985 -198675 -217877 -25106 126882
11722C6430f1324C6093d20979f2958I4322j9428a45485M2038B78706b30151B55741
11710a08865H5807P4373b59961A4091a17185F3730i8703k21970a24584H5129a64543
11698C062a21238M8597c0894N485A4947b86956A17139E3319a7892j4595p9943
11687a12430A27888B7673J5304a4709l91589A70324a90563Q3172D67089a79672
11676A44119l9704j2620Q5686G0626F841K03886J23051B8332b87004B1640a20297
11664A10282c2042L629E6468E330a80861a5320C14838c7415j68698N538g4307
11652A68184b5825j59512A70123a686n915D3468O0054h467l24444I8501a3649
11640G0965R7064b63298B23577d11468L6001C009a4335A96435p2998C9526N3944
$$ plain form
11722 36430 -61324 36093 -420979 -62958 94322 74894 -145485 -103447 278706 -230151 255741
11710 -108865 85807 160180 -259961 14091 -117185 63730 -98703 -320673 -124584 85129 -164543
11698 3062 -121238 -72641 -30894 -25409 14947 -286956 117139 53319 -17892 -32487 -112430
11687 -112430 127888 27673 42977 -14709 -406298 170324 -190563 -107391 467089 -179672
11676 144119 104415 91795 177481 70626 6841 210727 333778 28332 -287004 21640 -120297
11664 110282 -32042 -28413 56468 5330 -180861 -15320 314838 -37415 -206113 -200575 -74307
11652 168184 -25825 -185337 170123 -1686 -7601 43468 103522 -8467 -332911 98501 -13649
11640 70965 168029 -263298 223577 -411468 -375467 3009 -14335 196435 123437 39526 93470
11629I3470j7492d41574A6626a30653a9457A69308p6118f7004j8882l132j31578
11618b20596D5686h0962A50783n26C6872N6269b01408B69096G5615c63794a62591
11606c7982E6182j9486e6484C8438J18903a06641D1499b8631j71297g297G1286
11594G8083C2614c41416C4665a4398A28818D0757Q6071L540N6414b48075A10025
11582A9473G372Q6908b2588m4160B03025d1820l01910O2100d4204A47620e8984
11570h4440C0646a29711A67642g1009k51860A98340b50559A40362E8325d440k77065
11559b81505B11663A2292h4423C2588g0340L1502a2457B22748P6489b12038i7661
11547B51803c0984C019J21043B9106J44291i6231l1457j09069l2783A56724F1013
$$ plain form
11629 93470 75978 -441574 16626 -130653 -19457 169308 93190 -67004 -85886 -89018 -220596
11618 -220596 45686 -80962 150783 150257 36872 93141 -201408 269096 75615 -363794 -162591
11606 -37982 56182 36696 -56484 38438 157341 -106641 41499 -28631 -199928 -7297 71286
11594 78083 32614 -341416 34665 -14398 128818 40757 126828 130368 186782 -248075 110025
11582 19473 7372 94280 -22588 -66748 203025 -41820 -343730 -281630 -44204 147620 -58984
11570 -84440 30646 -129711 167642 -71009 -322869 198340 -250559 140362 58325 -4440 -281505
11559 -281505 211663 12292 -84423 32588 -70340 -38838 -12457 222748 299237 -212038 -97661
11547 251803 -30984 3019 124062 29106 173397 -96231 -127688 -236757 -269540 156724 61013
11535A29432l538l1030a20822I7651Q3491E5323a18981q1133f9460p4827k936
11524a47223k814p319P8604c6150o4803b3410j62122Q7422G7920A7004a60606
11512b62722f870j2781j70609A18696N956R3549a65685B10148F3561e1477A47731
11500d547j17322A72072h4708A74050d1471E5678b35646b6822I4624m2737j7836
11489C4051K12759r7816a50206E225M8124f2325H4779d6872q841j24024B94233
11477C52502j43413F8051J33886g4242A4554K28507B3549a6086C55962b98902
11466G8970b10456G2930J2944b51449G5326G732c6029o278q0434o5651A12886
11454a1045j55403d1319J9026n7729B71796a14080m353B38058F3228b03899G7275
$$ plain form
11535 129432 125894 94864 -120822 97651 181142 55323 -118981 -200114 -69460 -144287 -147223
11524 -147223 -150037 -157356 -78752 -36150 -100953 -23410 -185532 -98110 77920 17004 -160606
11512 -262722 -6870 -19651 -190260 118696 124652 218201 -165685 210148 63561 -51477 147731
11500 -4547 -121869 172072 -84708 174050 -41471 55678 -235646 -26822 94624 51887 34051
11489 34051 246810 148994 -150206 5225 53349 -62325 84779 -46872 -55713 -179737 294233
11477 352502 209089 68051 201937 -74242 14554 243061 23549 -16086 355962 -298902
11466 78970 -210456 72930 85874 -251449 75326 7732 -36029 -42307 -122741 -188392 112886
11454 -11045 -166448 -41319 -22293 -80022 271796 -114080 -118433 238058 63228 -203899 77275
11442a02108b1429B77359d8809C3893J8952a00654p8068r240f7389r128E6384
11430A13904d6551B380b45561A15768a51454C84776E027O1035b03706j79995A1926
11418e2682b2302B593a82359A55917d7370n962n0112k9411a7501r6810A28168
11406c9205A71015J29549B6840a20084C9794A0429e5430E32035a68579C22300
11395C46939f8112L2339C05533a19799j73878C74017a97084b6379J2928k12413
11385b25864B2836a49878E267c75974J26099A07317b869q8748B16372K5536b0035
11373f3801n213j16973m2273G334h8885j69131g3507j16217B20890e3604p3612
11362a27216M5678L1402j88354a9257k47679i6853p8370b9522B0526M1530a8737
$$ plain form
11442 -102108 -21429 277359 -48809 33893 52845 -100654 -178722 -187962 -67389 -76517 56384
11430 113904 -46551 2380 -245561 115768 -151454 384776 5027 66062 -203706 -383701 11926
11418 -52682 -22302 2593 -182359 155917 -47370 -53332 -103444 -132855 -17501 -114311 128168
11406 -39205 171015 300564 26840 -120084 39794 10429 -55430 532035 -168579 322300
11395 346939 -68112 -35773 305533 -119799 -293677 374017 -197084 -26379 -13451 -225864
11385 -225864 22836 -149878 5267 -375974 -249875 107317 -2869 -91617 216372 241908 -20035
11373 -63801 -69014 -185987 -228260 7334 -88885 -258016 -73507 -189724 220890 -53604 -127216
11362 -127216 -81538 -50136 -238490 -19257 -266936 -96853 -175223 -29522 20526 62056 -18737
11350a47120e7705e482j58256f6776j25972Q4108C916J83108a12851J732g155
11338b31345A48322I463a8843k09352f0888F808a74418e4580E2262a23397c2047
11326a72886j20876i2383d2461j20917A97437a18200L9473B77016c44519E1676
11315A02898a2988k10735B34038a22966B49473G5165O3813J6138m1749a84239
11304c9508m2199k9419n0229j47690A68209h8841F3136J1603J45061a85521B8071
11292b45457R6672L8960B08434q6063c01021J32420r8601D3040i6338m7368g0975
11280g4963K7635a8667O595j11764j42040b850p8073A02424C6749J8173K46552
11269C01474F9175a76274C7105b84026g2044F6522d9838k3198l43866A43867j8000
$$ plain form
11350 -147120 -57705 -5482 -163738 -66776 -192748 -108640 3916 187024 -112851 -111119 -7155
11338 -231345 148322 9463 -18843 -228195 -60888 6808 -174418 -54580 52262 -123397 -32047
11326 -172886 -293762 -92383 -42461 -163378 197437 -118200 -78727 277016 -344519 51676
11315 102898 -12988 -223723 234038 -122966 249473 75165 138978 155116 113367 -184239
11304 -39508 -81707 -111126 -161355 -309045 168209 -88841 63136 74739 219800 -185521 28071
11292 -245457 -148785 -109825 208434 122371 -301021 -168601 -267202 43040 -96338 -143706 -70975
11280 -74963 -47328 -18667 -12072 -123836 -265876 -2850 -80923 102424 36749 54922 301474
11269 301474 69175 -176274 37105 -284026 -72044 66522 -49838 -73036 -416902 143867 125867
11258A25867b53448K153J00809K2391j12656n1878J45281d4787l6842b8541C5331
11246c31016r5342I7000p206C4883I172J61138a15388c8886l43673e5166j13194
11235a68360e2167j56238G4807c73984J33707O3768j9363A27602a18293K7710
11225i0583j7383A36577b8276B4462R9850A7175a49180J818M266C31596g3038
11213a99883d1389B5233a45382d1552D0889a3183A36064b05566h0983j81700A06735
11201b57320A03456b04651g0232E0820d9497H9545b74706J06684P7868A65763
11190c2543A95422n7446k6023a14074I4981a75857B10656R1729a39784j86281
11180c26065G9831q043b55784M9086l590B5163b2305j45133r7776J12849j3366
$$ plain form
11258 125867 -253448 -251295 -150486 -128095 -240751 -292629 -147348 -44787 -81629 -28541 35331
11246 -331016 -426358 97000 89794 34883 9172 170310 -115388 -38886 -382559 -55166 -168360
11235 -168360 -52167 -208405 74807 -373984 -240277 -176509 -195872 127602 -118293 -90583
11225 -90583 -107966 136577 -28276 24462 124312 17175 -149180 -147362 -143096 331596 -73038
11213 -199883 -41389 25233 -145382 -41552 40889 -13183 136064 -205566 -80983 -262683 106735
11201 -257320 103456 -204651 -70232 50820 -49497 89545 -274706 -168022 -90154 165763
11190 -32543 195422 137976 111953 -114074 94981 -175857 210656 302385 -139784 -326065
11180 -326065 79831 71788 -255784 -206698 -210288 25163 -22305 -167438 -265214 -152365 -165731
11169a65731A16417e8689A59496b29111b9837E2997J4724i7321j5562m7985a0506
11157A97946a50103A7679b25223m1872M0020A75143n6421A3047P8454N098b28659
11145B19568B1820J53433P3875h4327m401m0965n6314o8621A03483b96519B39355
11133b19638r5670H5836B5138a35066O0072C57050A33247a35063B97954P6547
11123C74501A19421J61290F8990i2212E4511b61805A04007g1013m4824B46424
11112E4277E750J36606b43339A42892P2535i3822k6434A63877a07080C2573i2060
11100C09430e0231H6010g727A40871B6607O1215c52430G0601Q8804F574a3937
11088C26623h5116I6847K0179h198C14618j27463n4068A0083M2465E64O6170P3960
$$ plain form
11169 -165731 116417 -58689 159496 -229111 -29837 52997 67721 -97321 -112883 -160868 -10506
11157 197946 -150103 17679 -225223 -267095 -227075 175143 118722 13047 91501 96599 -228659
11145 219568 21820 175253 249128 -84327 -88728 -129693 -186007 -254628 103483 -296519 239355
11133 -219638 -315308 85836 25138 -135066 -74994 357050 133247 -135063 297954 374501
11123 374501 119421 280711 68990 -92212 54511 -261805 104007 -71013 -115837 246424
11112 54277 5750 142356 -243339 142892 215427 -93822 -120256 163877 -107080 32573 -92060
11100 309430 -50231 86010 -7727 140871 26607 87822 -352430 70601 159405 6574 -13937
11088 326623 -85116 96847 117026 -8198 314618 187155 133087 10083 52548 564 66734 140694
11076A40694a07261A99899J22656A03862j9154j4090a95425B08905J34926j38542
11066B05289l484K82235j98829K4504K28003B12172d5218A18454K26066j19362
11056B25158F3532N62755a0645D11661n6654L3996n898J63994A12366Q1983J86387
11045C80736R2915j10417O623J1480N9990L22851b4674D42611J100K8038j83187
11034B88562K90811j56102J60666B33478L7086R472B1383M23816q1416J5353A64201
11022A08687K18337F7623L32364J12608l7180A45707q427J59861k7430J86021
11012D55732m9124j59553p2212j9819O2660J44912j117J2391K04066k81683r2413
11001B03840J93819J88648J19803k56234J05412j46853A59316P6005P9761L45306
$$ plain form
11076 140694 -107261 199899 322555 103862 84708 70618 -195425 208905 343831 205289
11066 205289 201805 484040 285211 309715 537718 212172 -45218 118454 344520 225158
11056 225158 63532 626287 -10645 411661 355007 389003 383105 547099 112366 194349 380736
11045 380736 473651 363234 369857 381337 441327 764178 -24674 442611 443711 471749 288562
11034 288562 579373 423271 583937 233478 270564 280036 21383 445199 363783 379136 164201
11022 108687 327024 67623 399987 512595 475415 145707 137280 297141 269711 455732
11012 455732 406608 247055 174843 155024 217684 362596 361479 373870 577936 296253 203840
11001 203840 397659 586307 706110 449876 555288 408435 159316 235321 315082 660388
10991F60388j68316E2976M45909j22815L12111k76304J10222J54719j35794J48247
10981F89271k22167K73003J0735K62045N5120Q3538O1177R4344k9085o487J64975
10970A436469j81789j54103N2502j11851k05653j9294J46874O1646o9735O6622
10960A021688m1977k86414L57117k4082l79705P7419j88018j83834J85344O1287
10950E98825m7498j53798J6823j98396L6905A18877J14658J29931F6472N0454
10940A16926C689N14J36962A8661O9775N2280g9505k7926j47232D7931A5343h7532
10927B18812h9045c1516F0631J02033k103f1475A3248a1205l25943B10150I567
10915A41068l7078C5424c4258l36667a4833p7811j03817e550p4191H8334A7590
$$ plain form
10991 660388 492072 52976 498885 376070 688181 411877 522099 676818 541024 689271
10981 689271 467104 740107 750842 1012887 1068007 1151545 1212722 1307066 1277981 1271494 1436469
10970 1436469 1254680 1100577 1153079 1041228 835575 816281 963155 1024801 955066 1021688
10960 1021688 979711 693297 1050414 1026332 646627 724046 536028 352194 537538 598825
10950 598825 551327 397529 414352 215956 252861 118877 233535 363466 66472 116926
10940 116926 3689 4203 141165 18661 88436 140716 -79505 -107431 -254663 47931 15343 -87532
10927 218812 -89045 -31516 60631 162664 160561 -61475 13248 -11205 -337148 210150 9567
10915 141068 103990 35424 -34258 -370925 -14833 -92644 -196461 -5550 -79741 88334 17590
10903A74976d4340A74490f4850K3078A36145d5457A09266m8002q460J51254a41234
10891a53266j9474F373b30871E8366L7718b65452c4640B5409m85K76756H8002
10879a88865r570j35751n6134a15446c3298B04796k266p3288K4764F9671b44405
10867g6497A02816f4700k74049b3688A4542J60237A8609a71936P0337j27564B4344
10855d2912A25984n6427K0454a5161l0158l6499j67831N8239B98528b33960C7290
10843g761j96659G2027a79382m066h0347C28871b2131k46544i2362l6702A12706
10831A49659a38348A31648a83981A37114a75140e2525l7776k7866K8991j44078
10821b33254B9211d7261r0411K4674d5889l0386I3818c05512R2867l342N4918
$$ plain form
10903 174976 -44340 174490 -64850 -41772 136145 -45457 109266 61264 52804 204058 -141234
10891 -153266 -172740 6373 -230871 58366 96084 -265452 -34640 25409 24924 301680 88002
10879 -188865 -198435 -334186 -390320 -115446 -33298 204796 202530 129242 154006 69671 -244405
10867 -76497 102816 -64700 -338749 -23688 14542 174779 18609 -171936 -101599 -229163 24344
10855 -42912 125984 69557 90011 -15161 -45319 -81818 -249649 -191410 298528 -233960 37290
10843 -7761 -204420 72027 -179382 -183448 -80347 328871 -22131 -268675 -92362 -129064 112706
10831 149659 -138348 131648 -183981 137114 -175140 -52525 -90301 -118167 -89176 -233254
10821 -233254 29211 -47261 -137672 -112998 -45889 -76275 93818 -305512 -212645 -215987 -161069
10810a61069J6077c568l0548E9558a32058j6536A07877a0194r1144B30550c80037
10798b3606l12741F4405k5106b50690i0778L6073A57757l5157a76047a2878l39781
10787c52659J75375B19076a94526g5821m5624j71755a31519F0605F486b4981B9870
10775b6221A9202b88338A04333o858k173K4270R7830B3978a5053j5060j4560a7890
10762a48008E9236M7356C4322N4328b1459A56779d6803A68607b58028j5240i318
10750d13209A22638b21462c5422A48850D1146b43082A2520a01607D18423c62933
10739B21114b0392j92403J00896K8353A91633a19038B09080P8024j22888G0217
10728E4508d7674G9861a56938M1533A83446a09358B11552c5585j58028b9746A98608
$$ plain form
10810 -161069 -144992 -3568 -34116 59558 -132058 -148594 107877 -10194 -101338 230550 -380037
10798 -23606 -336347 64405 39299 -250690 -90778 -54705 157757 122600 -176047 -12878 -352659
10787 -352659 -177284 219076 -194526 -75821 -121445 -293200 -131519 60605 6486 -24981 29870
10775 -26221 19202 -288338 104333 97475 95302 119572 217402 23978 -15053 -30113 -44673 -17890
10762 -148008 59236 106592 34322 88650 -21459 156779 -46803 168607 -258028 -273268 -9318
10750 -413209 122638 -221462 -35422 148850 41146 -243082 12520 -101607 418423 -362933
10739 221114 -20392 -212795 -111899 -83546 191633 -119038 209080 287104 164216 70217
10728 54508 -47674 79861 -156938 -115405 183446 -109358 211552 -35585 -193613 -29746 198608
10716A5043a0915m0345r7055q5414A45995B4770i2679c5240m5943j04300A03749
10704b36375e528j17347A36215Q2222J8053i8229b0787A7669L1472i6947F5021
10692a90832b7503D1782M1993k2134i9804j13410P84A80892e3196B7181k767J03287
10680A27701p087c12024B27412c91065B03052a18411I8792R4950a20717j14544
10670b35261n6264O3530J00654G9311a52956c1097B16561D8082b56500F2405c15205
10658E6925h8931H4896b32111B30003J09720c06013J22227A3016a02370K0752
10648h1618o2071C2294a77472a1185j06096n2K4555a4235n0350J859k67166a3097
10635c97292g1791o3008A42668l6378b18780A41498k1111B4486k559a02456m727
$$ plain form
10716 15043 -10915 -51260 -148315 -233729 145995 24770 -92679 -35240 -81183 -185483 103749
10704 -236375 -5528 -122875 136215 218437 236490 -98229 -20787 17669 49141 -96947 65021
10692 -190832 -27503 41782 83775 61641 -99804 -213214 -212430 180892 -53196 27181 24414 127701
10680 127701 120614 -312024 227412 -391065 203052 -118411 98792 193742 -120717 -235261
10670 -235261 -291525 -227995 -127341 79311 -152956 -31097 216561 48082 -256500 62405 -315205
10658 56925 -88931 84896 -232111 230003 339723 -306013 -183786 13016 -102370 -81618
10648 -81618 -143689 32294 -177472 -11185 -117281 -117333 -92778 -14235 -64585 -62726 -329892 -13097
10635 -397292 -71791 -134799 142668 106290 -218780 141498 120387 24486 21927 -102456 -107183
10624a07183d3155D7921c26427o5140a29541A57183n3771B1215c88618B1326e8142
10612a41208c617C9911a96361B5758b97081J28465G7204a44213F7673J6995d5255
10600g7318j71922N5502M4848A07663A6583b37446Q9781A14230g7227A23041b33632
10588A01744j9180c13605m1255a1634D9707b64903B0745c9634j03601N6415L2329
10577e4491C4230K68646E4917M8357J52573C8283b8091h107B8312a52070l6377
10566a88447j49178e4735A36048L8135p1013d949A58094a69780h4392K1442A64555
10554C478a30931I8234N9582i5553B85330A18286k3987a31802c0052E3934e0892
10542B530N9968a17930A80642n9519g6069B87320d9492A74284e49956h9139A9921
$$ plain form
10624 -107183 -43155 47921 -326427 -391567 -129541 157183 103412 21215 -388618 21326 -58142
10612 -141208 -3617 39911 -196361 25758 -297081 -168616 77204 -144213 67673 84668 -45255
10600 -77318 -249240 -193738 -148890 107663 16583 -237446 -147665 114230 -77227 123041 -233632
10588 101744 82564 -313605 -354860 -11634 49707 -264903 20745 -39634 -143235 -86820 -54491
10577 -54491 34230 302876 54917 103274 255847 38283 -28091 -8107 28312 -152070 -188447
10566 -188447 -337625 -54735 136048 174183 103170 -4949 158094 -169780 -84392 -62950 164555
10554 3478 -130931 98234 157816 -95553 285330 118286 94299 -131802 -30052 53934 -50892
10542 2530 62498 -117930 180642 121123 -76069 287320 -49492 174284 -549956 -89139 19921
10530A41673a036C04408b69812E6244d2415j0579B56100F6823c16562a19624A70228
10518b62511J29289j21456N5352C6105L2126K1096a77238G552J24547l4344K05429
10507C03184b08591i0284A0060J7300J4371f5018r8277j95373e6262o0710D1003
10495g5574J5675e866k4404m6797A44701a11077d2651j60008E0262G74N8536A5028
10482F1137J24J55629a86407m4563B01361I5102A6502a70305A42560c9948m1991
10471h1939j03175g1558C46234h9973D7530a6587l58223j56666b3401j34470e6461
10459b95267e9003q8199H2857b88094d5973k11126F5588a17077A81141d7494K2260
10448b5234B40892D3992a48807B7641a44709k05124i2790j05063d84E4228K176
$$ plain form
10530 141673 -1036 304408 -269812 56244 -42415 -52994 256100 66823 -316562 -119624 170228
10518 -262511 -133222 -254678 -199326 36105 68231 89327 -177238 7552 132099 97755 303184
10507 303184 -208591 -90284 10060 27360 41731 -65018 -163295 -358668 -56262 -116972 41003
10495 -75574 -59899 -5866 -30270 -77067 144701 -111077 -42651 -202659 50262 774 59310 15028
10482 61137 61261 216890 -186407 -230970 201361 95102 16502 -170305 142560 -39948 -81939
10471 -81939 -185114 -71558 346234 -89973 47530 -16587 -374810 -531476 -23401 -157871 -56461
10459 -295267 -59003 -147202 82857 -288094 -45973 -257099 65588 -117077 181141 -47494 -25234
10448 -25234 240892 43992 -148807 27641 -144709 -349833 -92790 -197853 -484 54228 56404
10437E6404a43109o9867A03278l5926a90749l5051E7673N3891i4624A77906F4513
10425f0965G9352d1443D3963c28462h823l53651g951k64927d7720n5945C00076
10413a08629L6654B87573n0037l8331a90755a8572f375k70394f4578k38540H7431
10401a2427j44473A1a29065D2728B104J79708a11610m9967N1727A03889P4314
10390A78203l6689g0949A47003a02843A35562a82418d938B35573b38330h2170
10379A33706C2741J10944m1538P7884G2959a08354A09423E813J84778J96568A54713
10367C90993j26669d9062B29271O387a3636B40527D2900K27786m0038k8496I0974
10355b29624C71653c92683C0181M23980J30146r5092a0771B71850q3098n1136
$$ plain form
10437 56404 -143109 -212976 103278 67352 -190749 -225800 57673 111564 -94624 177906 64513
10425 -60965 79352 -41443 43963 -328462 -8823 -362474 -7951 -272878 -47720 -103665 300076
10413 -108629 -71975 287573 237536 199205 -190755 -18572 -6375 -276769 -64578 -303118 87431
10401 -12427 -156900 11 -129065 42728 2104 181812 -111610 -161577 -109850 103889 178203
10390 178203 141514 -70949 147003 -102843 135562 -182418 -4938 235573 -238330 -82170
10379 133706 32741 143685 102147 180031 72959 -108354 109423 5813 190591 387159 154713
10367 390993 264324 -49062 229271 235658 -13636 240527 42900 270686 230648 202152 90974
10355 -229624 371653 -392683 30181 454161 584307 489215 -10771 271850 188752 137616
10345A37616a6098C63091E3002J02228D6447a46096q2914e0665j37282B90397
10334a6064D642J07934l2462K6093a6407B51416b11378A72113l0907g9907c0803
10322A3677a01353B83799a35876C25130C0977a2106p9400A52767b64295J21521
10312a42774j31690d190E0169J26517b41147j21839b7296D9599O7245a16770B0949
10300f5859D854b4593A08832g7819A43478B0387e797D21917a65862j49780a41896
10288a71935I6200g1175E7296K03248c8262a7480E0519a03158B87286a67105E404
10276g2401A41150h4914G1207c20364D46422b13747B10890M05351I5325m5474
10266D9851C219d1897n7264B32936B5712L24669A01177k5570J05014k0803a01068
$$ plain form
10345 137616 -16098 363091 53002 155230 46447 -146096 -229010 -50665 -187947 290397
10334 -16064 4642 112576 80114 106207 -16407 251416 -211378 172113 141206 -79907 -30803
10322 13677 -101353 283799 -135876 325130 30977 -12106 -91506 152767 -264295 -142774
10312 -142774 -274464 -4190 50169 176686 -241147 -362986 -27296 49599 116844 -116770 20949
10300 -65859 4854 -24593 108832 -77819 143478 20387 -5797 421917 -165862 -315642 -141896
10288 -171935 96200 -71175 57296 260544 -38262 -17480 50519 -103158 287286 -167105 5404
10276 -72401 141150 -84914 71207 -320364 446422 -213747 210890 616241 95325 49851
10266 49851 3219 -41897 -99161 232936 25712 350381 101177 75607 180621 159818 -101068
10254a30136j1378F5587a56139n7278A32584e001E5887a88671P195j52731h3771
10242a55474C33898b9203l53058P9598a43191m945B05093d9584C12395b47315
10231a3987k86849a6362k41650D9879g9080B29J21740c03435f1986r7344A06148
10219b30465G5601b98681J36061F7020a62631q5941A21571b77164P0996e0336
10208c71649M2823d3618I2910J88790j33935A6093a85492q255h5493A47797a68867
10196A80698b14128g5326L2102I8566m3683f1224j22395e4925I7349l6351c0487
10184B89021H9497J39203a08090n1084n9954C60279k7570f9242C5187i1523o9145
10173a60668j61606a49823K7019D560a2675j14814C5973c169p5064I7840d32552
$$ plain form
10254 -130136 -141514 65587 -156139 -213417 132584 -5001 55887 -188671 -181476 -334207 -83771
10242 -155474 333898 -29203 -382261 -302663 -143191 -148136 205093 -49584 312395 -247315
10231 -13987 -300836 -16362 -258012 49879 -79080 229 121969 -303435 -61986 -159330 106148
10219 -230465 75601 -298681 -162620 67020 -162631 -248572 121571 -277164 -206168 -50336
10208 -371649 -328826 -43618 92910 281700 147765 16093 -185492 -193747 -85493 147797 -168867
10196 180698 -214128 -75326 -43224 98566 54883 -61224 -183619 -54925 97349 60998 -30487
10184 289021 89497 228700 -108090 -159174 -219128 360279 332709 -69242 35187 -91523 -160668
10173 -160668 -322274 -149823 -122804 4560 -12675 -127489 35973 -3169 -78233 97840 -432552
10161C459i0708k7456J2846L0111J2801A00769M3354a70497G8344a56192H847
10149a33665b7542j4277l47011J61962B1811a59442j19193i5884I99K77146a94897
10137c63253J67401D07706a85583k02848a62991j37293B09342p1830N2845b16135
10126A39557P4820a56323k10664C78828b46237A24584a17158E1680b17806Q2067
10116a35739E61201F6693b21985M0825C9872c31886a16871l4203c6135D7261J61234
10105B08495E6362M0956b00531B08844a49834D40633a97152B0084a80637r7444
10095b78081H6919b77512c9139E6625A5676L5539c22782R2848j79681A09927b70636
10083a58028L5029n9118E8566i0438j33659f1921a5102A55130l7824g3994C53117
$$ plain form
10161 3459 -90708 -118164 -105318 -75207 -62406 100769 144123 -170497 78344 -156192 8847
10149 -133665 -27542 -41819 -388830 -226868 21811 -159442 -278635 -95884 999 278145 -194897
10137 -363253 -195852 407706 -185583 -388431 -162991 -300284 209342 137512 190357 -216135
10126 139557 214377 -156323 -366987 378828 -246237 124584 -117158 51680 -217806 -135739
10116 -135739 561201 66693 -221985 -181160 39872 -331886 -116871 -151074 -36135 47261 208495
10105 208495 56362 97318 -200531 208844 -149834 440633 -197152 20084 -180637 -278081
10095 -278081 86919 -277512 -39139 56625 15676 51215 -322782 -229934 -409615 109927 -270636
10083 -158028 -122999 -182117 58566 -90438 -224097 -61921 -15102 155130 117306 -73994 353117
10071E0138Q3162h5136D8178c4945E1273b0857j14574E30054a92814c4083F9601
10059A51236b25640J04472a3131B02019g3407p0902R472F6153n514c8120D8065
10047g0016D3193N4592N065a482A2748M4648k3753h3217C02240a16823A17515
10035h5595L8645j2752r0134A07483b56596d2585k82597a9519r6823N2316K1474
10024d2552I3070c36877A10518n697b13713K7569M2346E6104J7537c38384G2324
10012b60774J06198j98886J03924f4676I3773a56271j0540B95874b76228A78877
10001A2776K3092b83697L2196A33027c85170h6912k59676B5191a13452e4402A66314
9989g757A54595C8793K8500i8364b8034l053j9709A21304d73834d2215n1990D12370
$$ plain form
10071 50138 133300 -85136 48178 -34945 51273 -20857 -135431 530054 -192814 -34083 69601
10059 151236 -225640 -121168 -13131 202019 -73407 -144309 -134837 66153 60639 -38120 48065
10047 -70016 43193 97785 102850 -1482 12748 57396 33643 -83217 302240 -116823 117515
10035 -85595 -46950 -59702 -149836 107483 -256596 -42585 -325182 -19519 -116342 -64026 -42552
10024 -42552 93070 -336877 110518 104821 -213713 -186144 -143798 56104 73641 -338384 72324
10012 -260774 -154576 -353462 -249538 -64676 93773 -156271 -166811 295874 -276228 178877
10001 12776 35868 -283697 -251501 133027 -385170 -86912 -346588 25191 -113452 -54402 166314
9989 -7757 154595 38793 67293 -98364 -28034 -31087 -50796 121304 -473834 -42215 -94205 412370
9976d624H9958k3024a61539P1370G9654c58286M705A57727A2479d27356R4397
9965c32959J46415b9406r9086k12036J08411J15072d6641l33025B04948A3156
9954h5118j63279a15816A45152K9278D784f5630o877I9127e2998j9081j07057
9943a79136j6760j4766p7995A42208d09616a34661e7564q0507A03840b52852A8206
9931B27558B7196b6884l06657A25438c34791h1112J013H1675C8872d2210L590
9920c8620F9638a45527M5693j89655K1726m5927M1317Q8584A89249a43730b2640
9908F7437J73985b63829l2237i0512p604j55538Q3349B88064A04510g9708A7708
9896b19072k28746a5784A83778c0207j28250f8074A72750a52567k5462k6868Q8857
$$ plain form
9976 -4624 89958 66934 -161539 -90169 79654 -358286 -353581 157727 12479 -427356 -332959
9965 -332959 -186544 -29406 -128492 -340528 -232117 -117045 -46641 -379666 204948 13156
9954 -85118 -248397 -115816 145152 174430 4784 -65630 -72507 99127 -52998 -72079 -179136
9943 -179136 -195896 -210662 -288657 142208 -409616 -134661 -57564 -138071 103840 -252852 18206
9931 227558 27196 -26884 -333541 125438 -334791 -81112 -80099 81675 38872 -42210 -38620
9920 -38620 69638 -145527 -99834 -289489 -267763 -313690 -272373 -183789 189249 -143730 -22640
9908 67437 241422 -263829 -296066 -90512 -98116 -253654 -170305 288064 104510 -79708 17708
9896 -219072 -447818 -15784 183778 -30207 -158457 -68074 172750 -152567 -178029 -204897 -116040
9885a16040A99771J5118b36432a05146F9982K67010a3430k84509e2164j62562
9875b14726A65176m2212b16684C8971b72123H6538R4788J07040F8907M8107b5515
9863G4972b39056C96228D1251a63147P1559j17919c2708j00331c6691j15160K1594
9852a30257d0905I0940a69087E2117c32792D8831a6836C32728j2535b5067A32224
9840A25231f9079m1846c6911B31424a4796j96206M3411p5507n1570e5887j74829
9829b30716A05571i3329m6890j37865g8588B61990f0447D1627f2764A50800b79544
9817D1652N6791B1250J4627g5740A19904a40490n0e1441j10926A96812b5103I0118
9804F0864a51245A62125n0435a54895O1644K1529j99927J03945B33960F7990a89374
$$ plain form
9885 -116040 199771 214889 -236432 -105146 69982 336992 -13430 -297939 -52164 -214726
9875 -214726 165176 122964 -216684 38971 -272123 86538 181326 288366 68907 117014 -25515
9863 74972 -239056 396228 41251 -163147 -91588 -209507 -32708 -133039 -36691 -151851 -130257
9852 -130257 -40905 90940 -169087 52117 -332792 48831 -16836 332728 320193 -25067 132224
9840 125231 -69079 -110925 -36911 231424 -14796 -211002 -167591 -243098 -294668 -55887 -230716
9829 -230716 105571 -93329 -140219 -278084 -78588 261990 -60447 41627 -62764 150800 -279544
9817 41652 98443 21250 35877 -75740 119904 -140490 -140540 -51441 -162367 196812 -25103 90118
9804 60864 -151245 162125 111690 -154895 -93251 -71722 -271649 -167704 233960 67990 -189374
9792b63495M5544g2438l9455h692A38559K1501a02337B61540q2228A459a03633
9780b51125a06221E3802L56226C7996K4788a06509B49979b112r7314l41627A35092
9768b23256E3806M256K002a21259N4697j31562m9881A83069d91k08994J7255Q2785
9756a09445a184A24776b08218A84428J03838j28342A1766R4606c09881a13277
9745a71307C8278a78346a1437k2554j67184g4203b069F3843a76640K9985J0654
9734a36001M8959A88445G6299h4034G7524a22048m9178A330e5080F4137N0936
9723A15073b02496b0953j94077Q6959I8172d26477F364e27441c9317D3229N455
9712D8684r35J41832c501l42233a03255F0553b07111A62875g3160A89674a64018
$$ plain form
9792 -263495 -217951 -72438 -111893 -8692 138559 160060 -102337 261540 179312 1459 -103633
9780 -251125 -106221 53802 410028 37996 62784 -106509 249979 -2112 -99426 -441053 135092
9768 -223256 53806 58062 60064 -121259 -66562 -198124 -248005 183069 -491 -209485 -192230 -109445
9756 -109445 -1184 124776 -208218 184428 288266 159924 11766 106372 -309881 -113277
9745 -171307 38278 -178346 -11437 -33991 -201175 -74203 -2069 63843 -176640 -146655 -136001
9734 -136001 -87042 188445 76299 -84034 77524 -122048 -171226 1330 -55080 64137 115073
9723 115073 -202496 -20953 -215030 -128071 98172 -426477 6364 -527441 -39317 43229 48684
9712 48684 47749 189581 -3501 -345734 -103255 60553 -207111 162875 -73160 189674 -164018
9700a06946m0328f8821a9364j08851F3546d2509n8033j16084J9414b0456D6908
9688i5016B7911a23942H6278a24864J6880d5728B46992J6689I343a10041K1652
9677h8389m7420B6879c61436c116j92456j2215F9330a35309b9809k82757J38064
9666a74502A58779D7007c6658q8778B27727F4430K7255c6808l98014a73866q3056
9655b56922a5312A7621E490c4481n0941k6734c6111a7320A78157g9024A15992
9643a24962N0621c2029A64933f0652j22656J0029j14725A92262b11271A2667J02813
9632A15480l3591b37760m7531N6058n9944i0098c8638j40137O8073R478j57740
9621b58964f8371K5575E8481e0814j19086A68162h6139c7844H5821i4305G2099
$$ plain form
9700 -106946 -147274 -68821 -19364 -128215 63546 -42509 -100542 -216626 -197212 -20456 46908
9688 -95016 27911 -123942 86278 -124864 -107984 -45728 246992 263681 9343 -110041 -88389
9677 -88389 -135809 26879 -361436 -3116 -195572 -207787 69330 -135309 -29809 -312566 -174502
9666 -174502 158779 47007 -36658 -125436 227727 64430 91685 -36808 -434822 -173866 -256922
9655 -256922 -15312 17621 5490 -34481 -85422 -112156 -36111 -17320 178157 -79024 115992
9643 -124962 -74341 -32029 164933 -60652 -183308 -173279 -288004 192262 -211271 12667 115480
9632 115480 81889 -237760 -285291 -229233 -289177 -90098 -38638 -178775 -110702 -101224 -258964
9621 -258964 -68371 -42796 58481 -50814 -169900 168162 -86139 -37844 85821 -94305 72099
9609A51946P7703c57688a10982J7887I4739k1301a39452L9286o4234L8500c9859
9597A02141b863A25874D1260a48644B59017F4671J18939b51861A0882L5011a21920
9585a40643k12576a36894M8584J3899A29778b05233C2024J22879b537j13854a2757
9573A7503b2350m0874H9766M8119a58001b2545A41203b14828f5377r0957e1490
9561A52006d31243I4846D2133g6762C14684F5151b75752C8626O4037c43841G774
9549B079M2401b34201M0330a2615D6476R487Q8720L6762f032l48145a55940B57535
9536f3623b5725j50831K9804n4742b171B99466a82494Q0759j92803D12704k01699
9525B11005e5618k80112I7959d1802C31414A45454a06627E1623d9589l88236a83052
$$ plain form
9609 151946 229649 -357688 -110982 -93095 94739 73438 -139452 -100166 -164400 -125900 -39859
9597 102141 -2863 125874 41260 -148644 259017 64671 183610 -251861 10882 45893 -121920
9585 -140643 -353219 -136894 -88310 -74411 129778 -205233 32024 154903 -2537 -116391 -12757
9573 17503 -22350 -63224 89766 137885 -158001 -22545 141203 -214828 -65377 -156334 -51490
9561 152006 -431243 94846 42133 -76762 314684 65151 -275752 38626 102663 -343841 7774
9549 2079 44480 -234201 -193871 -12615 46476 55963 144683 181445 -6032 -354177 -155940 257535
9536 -63623 -25725 -176556 -146752 -201494 -2171 299466 -182494 -101735 -294538 412704 211005
9525 211005 -55618 -335730 97959 -41802 331414 145454 -106627 51623 -49589 -437825 -183052
9513d6907H3863c9965I0128a333q7251q6489H3058J38370a79403A10985a4439
9501A14512a52565g1772K5452j23053D3031J02448i2261c663q3934j937n2524
9490a42058N9087B37862a64390f9166K4777n3356A21074b766k85848M1923n7317
9479c04008a14332e4539A431K0785c56010a40119p0176F2339b50899G1949C604
9467C23609a4939H3192a34679c7331e962k27135f9128q5465A08676l7272g276
9455b76773B18189b13533C1001a47605j79723a23478A80298b09772F5967b1831
9444C4740b4707D6918J61593I2987b87621D6136J0159P0971k959i9798F9702d5427
9431d3481j63961C7802M7664C9321a97588h5969j55204J04758A05845N5249a47846
$$ plain form
9513 -46907 83863 -39965 90128 -1333 -88584 -175073 83058 221428 -179403 110985 -14439
9501 114512 -152565 -71772 -46320 -169373 43031 145479 -92261 -3663 -87597 -89534 -142058
9490 -142058 -82971 237862 -164390 -69166 -44389 -97745 121074 -2766 -288614 -246691 -304008
9479 -304008 -114332 -54539 1431 22216 -356010 -140119 -210295 62339 -250899 71949 3604
9467 323609 -14939 83192 -134679 -37331 -5962 -233097 -69128 -154593 108676 71404 -7276
9455 -276773 218189 -213533 31001 -147605 -327328 -123478 180298 -209772 65967 -21831
9444 34740 -24707 46918 208511 92987 -287621 46136 56295 127266 124307 -99798 69702 -45427
9431 -43481 -207442 37802 85466 39321 -197588 -85969 -241173 -136415 105845 161094 -147846
9419A20425P429a00658k92719A00063b50136O9268B27694B4453a49549B42849
9408d20188C2462K01705I974a36256G540a39271A75161b71107a23383m25552e748
9396a47547L3410A16502m89J0214n6832b54756Q7593b0806l6048B9899e1342B8905
9383a35262D8740R5014a03998B08604h5440a6382H8334j3665N2070J60287G5523
9371D0881d5083k58757a28222n8735c3717l51289a5858j99612J07054j57566E9731
9359C6623b59855a02353o7596k73945A38331A4462K70781F6696a65619E7935a02327
9347g8871a2923Q64n6177b4993o8617D5217M16348a75243C16343o5781b33516
9335b23757C08538b85566D3062J2019K58599b65491A19785b6125j30488j18307
$$ plain form
9419 120425 127854 -100658 -393377 100063 -250136 -180868 227694 24453 -149549 242849
9408 -420188 32462 234167 9974 -136256 7540 -139271 175161 -271107 -123383 -548935 -5748
9396 -147547 -114137 116502 116013 126227 69395 -254756 -167163 -20806 -56854 29899 -51342 28905
9383 -135262 48740 143754 -103998 208604 -85440 -16382 88334 74669 126739 287026 75523
9371 40881 -45083 -303840 -128222 -186957 -33717 -385006 -15858 -215470 -108416 -265982 59731
9359 36623 -259855 -102353 -169949 -443894 138331 14462 285243 66696 -165619 57935 -102327
9347 -78871 -12923 -12059 -68236 -24993 -93610 45217 461565 -175243 316343 250562 -233516
9335 -223757 308538 -285566 43062 55081 313680 -265491 119785 -26125 -156613 -274920
9325b74920a13089A08160a11527A64381c1676r9497k27394I3241a28365l9949
9315a68314D4673a10151C84031A15709a45628F5776R0406O6954A2869P1318B1776
9303a89009g6097A52161k3729b81521a38570C21546g2341j7711A88807c33742
9292i6164a8627N40n940I0950h5135j74993r9438a72666f6771B0243b87528A4544
9279C58868b0565B43398J92728d4365C4574b04718G2318g5323J3352l1437K0888
9268g2520q836A44394L9358c5802o5713p8739E1395N2284b84823A53665a32424
9256a19666c8120B13783c3093A10070j9588K1609m4675B7093J00259a30798l7127
9245a67925h429r6200D39430A61841d2630k7651j17081A42516J24365a17143a0751
$$ plain form
9325 -274920 -113089 108160 -111527 164381 -31676 -131173 -358567 93241 -128365 -168314
9315 -168314 44673 -110151 384031 115709 -145628 65776 156182 223136 12869 84187 21776
9303 -189009 -76097 152161 128432 -281521 -138570 321546 -72341 -90052 188807 -333742
9292 -96164 -18627 -18087 -24027 90950 -85135 -260128 -359566 -172666 -66771 20243 -287528 14544
9279 358868 -20565 243398 436126 -44365 34574 -204718 72318 -75323 -61971 -93408 -72520
9268 -72520 -81356 144394 183752 -35802 -101515 -180254 51395 103679 -284823 153665 -132424
9256 -119666 -38120 213783 -33093 110070 90482 112091 67416 27093 127352 -130798 -167925
9245 -167925 -8429 -104629 439430 161841 -42630 -70281 -187362 142516 266881 -117143 -10751
9233A62053a6785C5453a91437R3528C4794R2543M6999A309e3754A59526n974a94475
9220a31017J7437B8197o478d9983j10882j16894D3304J3866a32382A91045c31239
9208a26176d3451k69207b686A01114f6267j3189H139d69844E6476a46983a1978
9196g7170A365M3499a91021h2246k65725A51308a70566B10540a11794A02771I318
9184a83754A03148a35458k20168h8185j16826J01810A60038c8186I1213a27860
9173B6653d5216q8428C05028c66497A17445b6556j35560F2469a18200A46269a82871
9161a07224E0507A2863e83835J90418B15193B9159c8656D6751J00896A1118q39
9150A0279c18142B21052B3836J52363i2376j83324j3657A19928b19549G649N0234
$$ plain form
9233 162053 -16785 35453 -191437 -97909 34794 127337 174336 1309 -53754 159526 153552 -194475
9220 -131017 -113580 28197 21719 -49983 -160865 -277759 43304 57170 -132382 191045 -331239
9208 -126176 -43451 -312658 -2686 101114 -66267 -79456 8139 -469844 56476 -146983 -11978
9196 -77170 1365 44864 -191021 -82246 -347971 151308 -170566 210540 -111794 102771 9318
9184 -183754 103148 -135458 -355626 -88185 -205011 -103201 160038 -38186 91213 -127860
9173 26653 -45216 -133644 305028 -366497 117445 -26556 -162116 62469 -118200 146269 -182871
9161 -107224 50507 12863 -583835 -393417 215193 29159 -38656 46751 147647 11118 10279
9150 10279 -318142 221052 23836 176199 -92376 -275700 -289357 119928 -219549 7649 57883
9139E7883c87204A05006e9386q2775o9459j21530A86762L7265R1763a46255J2805
9128a33450A3425b86488F9308a48509r53A14095d43411K14870A82949b32589d9328
9116A82058q2421P3548b9776j89132A29016J37232a4048M368A99600b7650G3986
9104a99482b2061A18473a02234B91512i1438l9949l2j17187m8358A78045b12123
9092b24417j0498h4934K3160K5009G3068a31357M7354c1747B3381a26702C22692
9080A71841O5291b25870g6770K096H2764P7887h461B321a22948B56139l4157a04349
9067b17520B8497A673K16800j03558J20900A8342a06321a5970E4620B5253J25889
9056A51142a90259a9662r7452a1686F8020h1645L9573F5011J97427c60512a46233
$$ plain form
9139 57883 -387204 105006 -59386 -142161 -211620 -333150 186762 224027 315790 -146255 -133450
9128 -133450 13425 -286488 69308 -148509 -149462 114095 -443411 -228541 182949 -232589 -49328
9116 182058 99637 173185 -29776 -218908 129016 266248 -14048 -9680 199600 -27650 73986
9104 -199482 -22061 118473 -102234 291512 -91438 -131387 -131419 -248606 -296964 178045 -212123
9092 -224417 -234915 -84934 -61774 -36765 73068 -131357 -84003 -31747 23381 -126702 322692
9080 171841 237132 -225870 -76770 -74674 82764 160651 -8461 2321 -122948 256139 221982 -104349
9067 -217520 28497 1673 218473 114915 235815 18342 -106321 -15970 54620 25253 151142
9056 151142 -190259 -19662 -117114 -11686 68020 -81645 -42072 65011 262438 -360512 -146233
9044A2125L41461B9278h0322k992k81139d2536j23391C0760a14642m2960l139
9033a60741H6480b89276B25609e1428K2949j15173j86427e1181k0205a7553B71920
9021d9664b3631k48940I8010m2019a14582D7744J68343C4516K48636a80081b3088
9009F7801i327A32854a02442A6602b16574A86228f0847g371m8975K7591A23089
8997a04744H6389e7412j42823p9204a11650e1458A36903k2460h6774K2102n0708
8986a15380p8256b7546k4916C7997M0348i6011C5997R4441a2303j68715A21586
8974H0401D445f2855P063a9376l59474C39159c31715a9053k21267J05463j1105
8963a45962j6865e3703r0636b9232j4867j31769a194o7631j39739B6058J32373
$$ plain form
9044 12125 353586 29278 -80322 -83314 -364453 -42536 -165927 30760 -114642 -157602 -160741
9033 -160741 86480 -289276 225609 -51428 -28479 -143652 -330079 -51181 -71386 -17553 271920
9021 -49664 -23631 -272571 98010 55991 -114582 47744 216087 34516 283152 -180081 -23088
9009 67801 -9327 132854 -102442 16602 -216574 186228 -60847 -7371 -56346 -28755 123089
8997 -104744 86389 -57412 -200235 -279439 -111650 -51458 136903 114443 -86774 -64672 -115380
8986 -115380 -193636 -27546 -52462 37997 78345 -96011 35997 130438 -12303 -181018 121586
8974 80401 4445 -62855 -55792 -19376 -378850 339159 -331715 -19053 -240320 -134857 -145962
8963 -145962 -162827 -53703 -144339 -29232 -44099 -175868 -1194 -68825 -208564 26058 158431
8952A58431N3127L1024J4012g129j79940A14851J00033d2813B19144r9949b66848
8940a52634C0434J198b71808C79299o5371K72990B3618J49280c8435B7255A0063
8928a02444A18530N2127Q3751L24953P73927K987831R363097o125398A566450
8918B15939J10266A8620a2652B07072b69142e4982A97619m5755c5209G1817L8974
8907A10791J02786a4959l3994B5859a06590q1731g6027g159j09739C16461a17341
8895a66622B63507D9755c9603k6359p208j82390E8676J50098c44745J08872A71107
8883A89115o0729b67408A11711L0796a46259N8634B66898C3446a19981C18647
8872B27379b70096C583b41903P0081D6931i5665B3562a21725j15461B10932J18733
$$ plain form
8952 158431 211558 242582 256594 -7129 -187069 114851 214884 -42813 219144 119195 -266848
8940 -152634 30434 31632 -271808 379299 313928 586918 23618 172898 -38435 27255 10063
8928 -102444 118530 170657 254408 579361 1353288 4341119 13704216 7578818 1566450
8918 215939 326205 18620 -12652 207072 -269142 -54982 197619 151864 -35209 71817 110791
8907 110791 213577 -14959 -48953 25859 -106590 -188321 -76027 -7159 -116898 316461 -117341
8895 -166622 263507 49755 -39603 -65962 -73170 -255560 58676 208774 -344745 -235873 171107
8883 189115 128386 -267408 111711 142507 -146259 -87625 266898 33446 -119981 318647
8872 227379 -270096 3583 -241903 -171822 46931 -95665 23562 -121725 -237186 210932 329665
8861C29665A37745K61768A18726M0157o576a31468j7352c672B850a19587D5210
8849d5794F6148L2807a00104A60436B6177K1339a72k15796G0196a92983G2334
8837a01097F5188e4653A36083h0733I7656d4508p7552F8748d5799A44768J08749
8826B53517j16673N508b5287j01590N184C23704a67412I796f1150k44578b9330
8814d7601B38640a01725A55192b1681D6502K08701J12968h486F5000c4707H2378
8802d0794H065a43772B17005D9093J35178P2062a88975q2020G4592A2880d21179
$$ plain form
8861 329665 137745 399513 118726 158883 152307 -131468 -148820 -3672 2850 -119587 45210
8849 -45794 66148 98955 -100104 160436 26177 47516 -172 -215968 70196 -192983 72334
8837 -101097 65188 -54653 136083 -80733 97656 -44508 -122060 68748 -45799 144768 253517
8826 253517 136844 142352 -25287 -126877 -121693 323704 -167412 9796 -61150 -305728 -29330
8814 -47601 238640 -101725 155192 -21681 46502 255203 368171 -8486 65000 -34707 82378
8802 -40794 8065 -143772 217005 49093 184271 256333 -188975 -270995 74592 12880 -421179
$$ [...]
##END NTUPLES=NMR SPECTRUM
##END=
