##TITLE=NES1067_159122.0008_002_9705217_n3veQimBWz
##JCAMPDX= 6.0         $$ Bruker NMR JCAMP-DX V2.0
##DATA TYPE= NMR SPECTRUM
##DATA CLASS= NTUPLES
##ORIGIN= BRUKER
##OWNER= Administrator
$$ 1.72 TOPSPIN		Version 2.1
$$ 2016-04-30 18:11:32.989 -0700  Administrator@X
$$ Compression mode = diff/dup
##.OBSERVE FREQUENCY= 400.02188249412
##.OBSERVE NUCLEUS= ^1H
##.ACQUISITION MODE= SIMULTANEOUS (DQD)
##.ACQUISITION SCHEME= undefined
##.AVERAGES= 64
##.DIGITISER RES= 22
##SPECTROMETER/DATA SYSTEM= spect
##.PULSE SEQUENCE= noesygpps1d.comp
##.SOLVENT NAME= COFFEE_meoh
##.SHIFT REFERENCE= INTERNAL, COFFEE_meoh, 1, 14.96073
##AUDIT TRAIL= $$ (NUMBER, WHEN, WHO, WHERE, PROCESS, VERSION, WHAT)
$$ ##TITLE= Audit trail, TOPSPIN		Version 2.1
$$ ##JCAMPDX= 5.01
$$ ##ORIGIN= Bruker BioSpin GmbH
$$ ##OWNER= Administrator
$$ $$ E:\/data/COFFEE/nmr/NES1067_159122.0008_002_9705217_n3veQimBWz/12/pdata/1/auditp.txt
$$ ##AUDIT TRAIL=  $$ (NUMBER, WHEN, WHO, WHERE, PROCESS, VERSION, WHAT)
(   1,<2016-04-30 18:11:27.646 -0700>,<Administrator>,<X>,<go>,<TOPSPIN 2.1>,
      <created by zg
	started at 2016-04-30 17:59:58.005 -0700,
	POWCHK enabled, PULCHK disabled,
       configuration hash MD5:
       21 0F 79 D6 B3 7B B4 F6 88 20 88 DB 03 48 BD 9F
       data hash MD5: 64K
       A0 0B 35 D5 60 FD 13 CA 25 EF 18 93 A4 04 7C 0B>)
(   2,<2016-04-30 18:11:30.958 -0700>,<Administrator>,<X>,<proc1d>,<TOPSPIN 2.1>,
      <Start of raw data processing
       efp LB = 0.3 FT_mod = 6 PKNL = 1 PHC0 = 0 PHC1 = 0 SI = 128K 
       data hash MD5: 128K
       6E B9 DD 11 3D ED C1 4C 39 1B 60 51 AD B2 4D E2>)
(   3,<2016-04-30 18:11:31.833 -0700>,<Administrator>,<X>,<proc1d>,<TOPSPIN 2.1>,
      <pk PHC0 = -81.21094 PHC1 = 0 
       data hash MD5: 128K
       A9 03 64 38 F6 8E A8 39 6B 91 01 37 69 CE ED 22>)
(   4,<2016-04-30 18:11:32.239 -0700>,<Administrator>,<X>,<proc1d>,<TOPSPIN 2.1>,
      <abs ABSG = 1 
       data hash MD5: 128K
       84 8A 31 31 3B C3 53 46 01 5E 5A 85 D2 A1 8D 8C>)
(   5,<2016-04-30 18:11:32.317 -0700>,<Administrator>,<X>,<proc1d>,<TOPSPIN 2.1>,
      <abs ABSG = 2 
       data hash MD5: 128K
       E4 49 0D 0D 22 34 04 38 71 38 D8 98 38 4C D7 77>)
(   6,<2016-04-30 18:11:32.396 -0700>,<Administrator>,<X>,<proc1d>,<TOPSPIN 2.1>,
      <abs ABSG = 3 
       data hash MD5: 128K
       58 B1 62 D0 B2 50 26 F5 10 6E 19 26 AE AF 4B 0E>)
(   7,<2016-04-30 18:11:32.489 -0700>,<Administrator>,<X>,<proc1d>,<TOPSPIN 2.1>,
      <abs ABSG = 4 
       data hash MD5: 128K
       17 1E 2B A0 9E 1E 15 59 42 52 F2 98 4E 37 BE FC>)
(   8,<2016-04-30 18:11:32.583 -0700>,<Administrator>,<X>,<proc1d>,<TOPSPIN 2.1>,
      <abs ABSG = 5 
       data hash MD5: 128K
       F6 D8 CC 06 29 C3 91 42 60 00 12 C6 24 AB 58 73>)
$$ ##END=
$$ 
$$ $$ hash MD5
$$ $$ F3 FA 53 3D 7E E1 5B 22 8D 27 78 6A 31 46 86 E7
##$RELAX= 
##$RELAX= 
##$RELAX= 
##$RELAX= 
##$RELAX= 
##$RELAX= 
##$RELAX= 
##$RELAX= 
$$ Bruker specific parameters
$$ --------------------------
##$DU= <E:\>
##$EXPNO= 12
$$ [...]
##$TP07= 0
##$TPNAME0= <>
##$TPNAME1= <>
##$TPNAME2= <>
##$TPNAME3= <>
##$TPNAME4= <>
##$TPNAME5= <>
##$TPNAME6= <>
##$TPNAME7= <>
##$TPOAL= (0..7)
0.5 0.5 0.5 0.5 0.5 0.5 0.5 0.5
##$TPOFFS= (0..7)
0 0 0 0 0 0 0 0
##$TUNHIN= 0
##$TUNHOUT= 0
##$TUNXOUT= 0
##$USERA1= <user>
##$USERA2= <user>
##$USERA3= <user>
##$USERA4= <user>
##$USERA5= <user>
##$V9= 5
##$VALIST= <valist>
##$VCLIST= <CCCCCCCCCCCCCCC>
##$VD= 0
##$VDLIST= <DDDDDDDDDDDDDDD>
##$VPLIST= <PPPPPPPPPPPPPPP>
##$VTLIST= <TTTTTTTTTTTTTTT>
##$WBST= 2048
##$WBSW= 25
##$XGAIN= (0..3)
0 0 0 0
##$XL= 0
##$YL= 0
##$YMAX_a= 5038534
##$YMIN_a= -8805205
##$ZGOPTNS= <>
##$ZL1= 120
##$ZL2= 120
##$ZL3= 120
##$ZL4= 120
##$ABSF1= 14.96073
##$ABSF2= -5.597452
##$ABSG= 5
##$ABSL= 3
##$ALPHA= 0
##$AQORDER= 0
##$ASSFAC= 0
##$ASSFACI= 0
##$ASSFACX= 0
##$ASSWID= 0
##$AUNMP= <proc_prof1d_extract.lims>
##$AXLEFT= 0
##$AXNAME= <>
##$AXNUC= <1H>
##$AXRIGHT= 0
##$AXTYPE= 0
##$AXUNIT= <>
##$AZFE= 0.1
##$AZFW= 0.1
##$BCFW= 0
##$BC_mod= 0
##$BYTORDP= 0
##$COROFFS= 0
##$CY= 15
##$DATMOD= 1
##$DC= 0
##$DFILT= <>
##$DTYPP= 0
##$F1P= 0
##$F2P= 0
##$FCOR= 0.5
##$FTSIZE= 131072
##$FT_mod= 6
##$GAMMA= 0
##$GB= 0
##$INTBC= 1
##$INTSCL= 1
##$ISEN= 128
##$LB= 0.3
##$LEV0= 0
##$LPBIN= 0
##$MAXI= 10000
##$MC2= 0
##$MEAN= 0
##$ME_mod= 0
##$MI= 0
##$NCOEF= 0
##$NC_proc= -3
##$NLEV= 6
##$NOISF1= 0
##$NOISF2= 0
##$NSP= 0
##$NTH_PI= 0
##$NZP= 0
##$OFFSET= 14.96073
##$PC= 1
##$PHC0= -81.21094
##$PHC1= 0
##$PH_mod= 1
##$PKNL= yes
##$PPARMOD= 0
##$PPDIAG= 0
##$PPIPTYP= 0
##$PPMPNUM= 2147483647
##$PPRESOL= 1
##$PSCAL= 4
##$PSIGN= 0
##$PYNMP= <proc.py>
##$REVERSE= no
##$SF= 400.020009744081
##$SI= 131072
##$SIGF1= 0
##$SIGF2= 0
##$SINO= 400
##$SIOLD= 131072
##$SPECTYP= <>
##$SREGLST= <1H.CDCl3>
##$SSB= 0
##$STSI= 131072
##$STSR= 0
##$SW_p= 8223.68421052631
##$SYMM= 0
##$S_DEV= 0
##$TDeff= 65536
##$TDoff= 0
##$TI= <>
##$TILT= no
##$TM1= 0
##$TM2= 0
##$TOPLEV= 0
##$USERP1= <user>
##$USERP2= <user>
##$USERP3= <user>
##$USERP4= <user>
##$USERP5= <user>
##$WDW= 1
##$XDIM= 131072
##$YMAX_p= 424532923
##$YMIN_p= -38951
##$CURPLOT= <Network HP LaserJet P1505>
##$CURPRIN= <$Network HP LaserJet P1505>
##$DFORMAT= <normdp>
##$LAYOUT= <+/1D_H.xwp>
##$LFORMAT= <normlp>
##$PFORMAT= <normpl>
##$SURQMSG= 1
$$ End of Bruker specific parameters
$$ ---------------------------------
##NTUPLES= NMR SPECTRUM
##VAR_NAME=  FREQUENCY,     SPECTRUM/REAL,   SPECTRUM/IMAG
##SYMBOL=    X,             R,               I
##VAR_TYPE=  INDEPENDENT,   DEPENDENT,       DEPENDENT
##VAR_FORM=  AFFN,          ASDF,            ASDF
##VAR_DIM=   131072,        131072,          131072
##UNITS=     HZ,            ARBITRARY UNITS, ARBITRARY UNITS
##FACTOR=    0.0627417313425164, 1,          1
##FIRST=     8223.62146879497, 885,          -83802
##LAST=      0,             3350,            -83906
##MIN=       0,             -38951,          0
##MAX=       8223.62146879497, 424532923,    0
$$ Real data points
##PAGE= N=1
##DATA TABLE= (X++(R..R)), XYDATA
$$ [...]
$$ plain form
63611 720836 773579 828325 884368 939997 993064 1040717 1078987 1104333 1116176 1117042 1110153 1097890
63599 1097890 1082425 1066028 1049907 1033960 1018380 1004218 991285 976522 955782 926954 890656
63588 890656 848795 803563 757252 711618 667397 625159 586272 552064 522345 495782 471540
63577 471540 449802 431091 416109 405838 400442 398231 397037 396632 398566 403716 411483 421452 434028
63564 434028 448871 464503 480479 498461 519899 543911 568949 595647 626346 662168 701932
63553 701932 743825 787029 831868 879313 930083 983091 1034678 1080217 1116590 1142713 1158356
63542 1158356 1163671 1159751 1148504 1131845 1111829 1091379 1073621 1060040 1049923 1041493 1032616 1020447
63530 1020447 1001857 975145 940856 900651 856117 808876 760793 713282 666896 622130 580018
$$ packed form
63611G20836N2743N4746N6043N5629N3067M7653L8270K5346J1843Q66o889j2263
63599A097890j5465j6397j6121j5947j5580j4162j2933j4763k0740k8828l6298
63588H90656m1861m5232m6311m5634m4221m2238l8887l4208k9719k6563k4242
63577D71540k1738j8711j4982j0271n396k211j194m05J934N150P767R969J2576
63564D34028J4843J5632J5976J7982K1438K4012K5038K6698L0699L5822L9764
63553G01932M1893M3204M4839M7445N0770N3008N1587M5539L6373K6123J5643
63542A158356N315l920j1247j6659k0016k0450j7758j3581j0117q430q877j2169
63530A020447j8590k6712l4289m0205m4534m7241m8083m7511m6386m4766m2112
$$ plain form
63519 580018 541458 506390 474178 444471 417370 393235 372679 356098 342727 330730 318931
63508 318931 307982 299131 292170 285458 277920 270220 263769 258990 254929 250449 245614 241586 238905 236162
63494 236162 231214 223935 216982 213228 212965 214258 215427 216177 216619 216500 215860 215548 216367 218131 220134 222227
63478 222227 224756 227545 229768 231155 232667 235200 237927 238895 237377 234587 231574 227535 221430 214495
63464 214495 209437 207141 205807 203852 202087 202079 203659 205390 206785 208624 211426 214875 218669 222821 227094
63449 227094 231175 235602 241658 250040 260302 271768 284306 297957 312486 327654 343458 359864
63437 359864 376810 394736 414575 436841 461154 486981 514509 544454 577342 613396 652917
63426 652917 696324 743815 795354 851071 911578 977649 1049409 1125663 1203953 1281136 1353605
$$ packed form
63519E80018l8560l5068l2212k9707k7101k4135k0556j6581j3371j1997j1799
63508C18931j0949q851o961o712p538p700o451m779m061m480m835m028k681k743
63494B36162m948p279o953l754k63J293J169P50M42j19o40l12Q19J764K003K093
63478B22227K529K789K223J387J512K533K727R68j518k790l013m039o105o935
63464B14495n058k296j334j955j765qJ580J731J395J839K802L449L794M152M273
63449B27094M081M427O056Q382J0262J1466J2538J3651J4529J5168J5804J6406
63437C59864J6946J7926J9839K2266K4313K5827K7528K9945L2888L6054L9521
63426F52917M3407M7491N1539N5717O0507O6071P1760P6254P8290P7183P2469
$$ plain form
63415 1353605 1417037 1466878 1500186 1517210 1520756 1514062 1499803 1480814 1460433 1441234 1423758 1406921
63403 1406921 1389239 1369083 1344159 1311833 1270526 1220735 1164605 1104674 1043037 981391 921403
63392 921403 864677 812376 765133 723361 687219 656043 628349 603083 580624 561941 547043
63381 547043 535293 527118 523970 525967 530867 536602 544060 555909 572890 592665 612681 632986 655671
63368 655671 682375 713145 747322 784763 826154 872492 924267 980885 1040850 1102611 1165132
63357 1165132 1227603 1288685 1345996 1396099 1435212 1460680 1472370 1472452 1463527 1447184 1424697 1398580
63345 1398580 1372517 1349421 1329856 1312206 1293685 1270968 1240865 1201685 1154301 1101513 1046081
63334 1046081 989427 931978 874189 816979 761550 709153 660889 617484 579167 545843 517195
$$ packed form
63415A353605O3432M9841L3308J7024L546o694j4259j8989k0381j9199j7476j6837
63403A406921j7682k0156k4924l2326m1307m9791n6130n9931o1637o1646n9988
63392I21403n6726n2301m7243m1772l6142l1176k7694k5266k2459j8683j4898
63381E47043j1750q175l148J997M900N735P458J1849J6981J9775K0016K0305K2685
63368F55671K6704L0770L4177L7441M1391M6338N1775N6618N9965O1761O2521
63357A165132O2471O1082N7311N0103L9113K5468J1690Q2q925j6343k2487k6117
63345A398580k6063k3096j9565j7650j8521k2717l0103l9180m7384n2788n5432
63334A046081n6654n7449n7789n7210n5429n2397m8264m3405l8317l3324k8648
$$ plain form
63323 517195 492497 470539 450101 430580 412097 395176 380504 368660 359486 351629 343284 333811
63311 333811 324385 316704 311218 307005 303153 299626 296636 293841 290824 288077 286750 287159 288126 288183 287078
63296 287078 285574 284038 282015 279274 276494 274341 272389 269667 266136 262898 260865 259857 259240 258906 259027
63281 259027 259194 258406 256101 252833 249788 247873 247376 248163 249785 251410 252233 252303 252760 254778 258276 262082
63265 262082 265362 268274 271032 273181 274507 276080 279280 283912 288398 292013 295846 301086 307354 313508
63251 313508 319314 325413 332233 340021 349536 361442 374946 388231 400701 413972 430146 449671
63239 449671 471332 493793 516546 539580 562718 585520 607797 630073 653071 676383 698213
63228 698213 717311 735027 754413 777093 801917 826851 850999 874255 896298 917092 937494
$$ packed form
63323E17195k4698k1958k0438j9521j8483j6921j4672j1844r174p857q345r473
63311C33811r426p681n486m213l852l527k990k795l017k747j327M09R67N7j105
63296B87078j504j536k023k741k780k153j952k722l531l238k033j008o17l34J21
63281B59027J67p88k305l268l045j915m97P87J622J625Q23P0M57K018L498L806
63265B62082L280K912K758K149J326J573L200M632M486L615L833N240O268O154
63251C13508N806O099O820P788R515J1906J3504J3285J2470J3271J6174J9525
63239D49671K1661K2461K2753K3034K3138K2802K2277K2276K2998K3312K1830
63228F98213J9098J7716J9386K2680K4824K4934K4148K3256K2043K0794K0402
$$ plain form
63217 937494 957989 977080 991932 1000382 1001566 995227 981737 962581 939472 912885 882569 849551
63205 849551 816382 785146 756378 730283 707795 689832 676531 667775 663521 663011 664858 668880 676914
63192 676914 690643 709206 730074 751746 774404 798287 822800 847403 872258 897692 923768
63181 923768 950662 978768 1008069 1037712 1066487 1093561 1118848 1142940 1166487 1189206 1209471
63170 1209471 1225144 1234761 1237862 1234573 1225120 1209269 1185920 1154015 1114421 1070191 1024104 976592
63158 976592 927112 876818 828406 783655 742655 705306 671825 641490 612769 585564 561825
63147 561825 542874 527254 512416 497623 484021 472630 463565 456727 451765 447470 442512 437051 432696
63134 432696 430524 429867 429313 428268 427110 426253 425617 424988 424529 424748 425918 427685 429377 430594 431236 431107
$$ packed form
63217I37494K0495J9091J4852Q450J184o339j3490j9156k3109k6587l0316l3018
63205H49551l3169l1236k8768k6095k2488j7963j3301q756m254n10J847M022Q034
63192F76914J3729J8563K0868K1672K2658K3883K4513K4603K4855K5434K6076
63181I23768K6894K8106K9301K9643K8775K7074K5287K4092K3547K2719K0265
63170A209471J5673R617L101l289r453j5851k3349l1905l9594m4230m6087m7512
63158I76592m9480n0294m8412m4751m1000l7349l3481l0335k8721k7205k3739
63147E61825j8951j5620j4838j4793j3602j1391r065o838m962m295m958n461m355
63134D32696k172o57n54j045j158q57o36o29m59K19J170J767J692J217O42j29
$$ plain form
63118 431107 430031 428407 427119 426624 426561 426366 425774 424568 422553 420186 418509 417935 417695 417141 416897 417865 419637
63101 419637 421042 422064 424038 427751 432371 436664 440510 444621 449270 453936 458077 461798 465689 470203
63087 470203 475230 480149 484243 487215 489530 492363 496920 503491 511320 519708 528905 539299 550058 559700
63073 559700 568186 577324 588589 601574 615306 630036 646695 665363 685486 707039 730192 754273
63061 754273 778481 803559 831492 863539 899646 939597 983276 1029627 1076940 1124793 1174470
63050 1174470 1226761 1280444 1333641 1385689 1436809 1486895 1535605 1583076 1629732 1676011 1723011
63039 1723011 1772507 1825074 1878621 1929912 1977201 2020158 2057455 2085950 2102739 2106961 2099077 2079329
63027 2079329 2047673 2004756 1952190 1892000 1826272 1757252 1687387 1619152 1554839 1496249 1444372
$$ packed form
63118D31107j076j624j288m95o3j95n92j206k015k367j677n74k40n54k44R68J772
63101D19637J405J022J974L713M620M293L846M111M649M666M141L721L891M514
63087D70203N027M919M094K972K315K833M557O571P829Q388R197J0394J0759R642
63073E59700Q486R138J1265J2985J3732J4730J6659J8668K0123K1553K3153K4081
63061G54273K4208K5078K7933L2047L6107L9951M3679M6351M7313M7853M9677
63050A174470N2291N3683N3197N2048N1120N0086M8710M7471M6656M6279M7000
63039A723011M9496N2567N3547N1291M7289M2957L7297K8495J6789M222p884j9748
63027B079329l1656m2917n2566o0190o5728o9020o9865o8235o4313n8590n1877
$$ plain form
63016 1444372 1399547 1362193 1333179 1313189 1301932 1298502 1302583 1314819 1335736 1364689 1400331 1441834
63004 1441834 1488919 1540617 1594834 1649786 1705446 1762808 1821869 1881057 1938780 1994722 2049232
62993 2049232 2102055 2152402 2199914 2244651 2285776 2320757 2346342 2360344 2362265 2352216 2329581
62982 2329581 2292949 2241397 2175659 2098000 2011082 1917048 1817562 1714510 1610556 1508873 1412027
62971 1412027 1320930 1235073 1153950 1078068 1008467 945687 889696 840462 797781 760455 726469
62960 726469 694480 664737 638203 615191 595331 578382 564252 552139 540372 527603 513884
62949 513884 500182 486965 473727 460043 446605 434692 424728 415873 407183 398714 391173 384843 379327
62936 379327 374160 369152 364123 358749 352853 346693 340948 336464 333735 332283 330699 327754 323489 318994
$$ packed form
63016A444372m4825l7354k9014j9990j1257l430M081J2236K0917K8953L5642M1503
63004A441834M7085N1698N4217N4952N5660N7362N9061N9188N7723N5942N4510
62993B049232N2823N0347M7512M4737M1125L4981K5585J4002J921j0049k2635
62982B329581l6632n1552o5738p7659q6918r4034r9486j03052j03954j01683r6846
62971A412027r1097q5857q1123p5882o9601o2780n5991m9234m2681l7326l3986
62960G26469l1989k9743k6534k3012j9860j6949j4130j2113j1767j2769j3719
62949E13884j3702j3217j3238j3684j3438j1913r964q855q690q469p541o330n516
62936C79327n167n008n029n374n896o160n745m484k729j452j584k945m265m495
$$ plain form
62922 318994 315254 312532 310599 309049 307616 306793 307904 311606 316361 319526 320287 320458 321760 323380 323220
62907 323220 320728 317166 313510 309575 305331 301715 299481 298214 297225 296814 297819 300207 302825 304495 304886
62892 304886 304439 303893 303831 304149 303986 302660 300686 299269 298659 297674 295273 291994 289246 287646 286707 285888 285118
62875 285118 284381 283600 283004 282891 282931 282427 281343 280257 279150 277289 274718 272802 272523 273127 273311 272974 272820
62858 272820 273038 273610 275310 278852 283244 286361 287324 287116 286838 286572 286171 285980 286407 287692 290272 294247
62842 294247 298332 300715 301366 302065 303549 304123 302205 298808 296122 294664 293500 292555 292822 294337 295680
62827 295680 295893 295710 296414 298428 301473 305288 309581 313775 317445 320881 324874 329996 336156 342617 348390
62812 348390 352758 355644 357599 359593 362718 367613 373959 380874 388143 396710 407623 420800 435251
$$ packed form
62922C18994l740k722j933j550j433q23J111L702M755L165P61J71J302J620j60
62907C23220k492l562l656l935m244l616k234j267r89m11J005K388K618J670L91
62892C04886m47n46o2L18j63j326j974j417o10r85k401l279k748j600r39q19p70
62875B85118p37p81n96j13M0n04j084j086j107j861k571j916k79O04J84l37j54
62858B72820K18N72J700L542M392L117R63k08k78k66m01j91M27J285K580L975
62842B94247M085K383O51O99J484N74j918l397k686j458j164r45K67J515J343
62827B95680K13j83P04K014L045L815M293M194L670L436L993N122O160O461N773
62812C48390M368K886J955J994L125M895O346O915P269Q567J0913J3177J4451
$$ plain form
62799 435251 450193 465478 481294 498148 517050 539064 564587 593527 626181 663347 705469
62788 705469 752230 803375 859619 922358 992384 1069045 1150731 1236166 1325078 1417442 1512216
62777 1512216 1607143 1699655 1787334 1867357 1936277 1991033 2029971 2052572 2058622 2048125 2021577
62766 2021577 1979679 1923182 1853778 1774968 1691086 1605316 1519098 1433312 1349043 1266922 1186779
62755 1186779 1108803 1034611 966283 904310 847235 793612 743753 699014 659765 625004 594033
62744 594033 567490 545901 527890 510985 494086 478167 464480 453145 443724 436018 429693 424120
62732 424120 419328 416292 415464 415791 416112 416887 419447 424058 429867 436468 444342 453837 464759 477009 490807
62717 490807 506380 524286 545768 571699 601219 632679 666025 703072 745160 791942 843089
$$ packed form
62799D35251J4942J5285J5816J6854J8902K2014K5523K8940L2654L7166M2122
62788G05469M6761N1145N6244O2739P0026P6661Q1686Q5435Q8912R2364R4774
62777A512216R4927R2512Q7679Q0023O8920N4756L8938K2601O050j0497k6548
62766B021577m1898n6497o9404p8810q3882q5770q6218q5786q4269q2121q0143
62755A186779p7976p4192o8328o1973n7075n3623m9859m4739l9249l4761l0971
62744E94033k6543k1589j8011j6905j6899j5919j3687j1335r421p706o325n573
62732D24120m792l036q28L27L21P75K560M611N809O601P874R495J0922J2250J3798
62717D90807J5573J7906K1482K5931K9520L1460L3346L7047M2088M6782N1147
$$ plain form
62706 843089 900025 964885 1038436 1119867 1208176 1302935 1403982 1511079 1623747 1740801 1859873
62695 1859873 1977506 2089538 2191481 2279279 2350309 2403402 2437547 2450934 2441754 2409674 2356168
62684 2356168 2283791 2195817 2096291 1989397 1878213 1764384 1649349 1535549 1425992 1322746
62674 1322746 1226304 1136532 1053784 978705 911317 850967 797133 749654 707970 670745 636711
62663 636711 605437 576911 550847 527003 505735 487434 471512 456597 441746 426919 412338
62652 412338 398092 384461 372034 361187 351778 343533 336442 330667 326234 322859 319930 316830 313493
62639 313493 310444 308101 306282 304709 303582 303213 303466 304114 305394 307519 309843 311194 310997 309606 307711
62624 307711 305889 304434 303223 302219 302492 305843 312532 320295 326853 332628 339510 347792 356377 365530
$$ packed form
62706H43089N6936O4860P3551Q1431Q8309R4759J01047J07097J12668J17054J19072
62695A859873J17633J12032J01943Q7798P1030N3093L4145J3387r180l2080n3506
62684B356168p2377q7974r9526j06894j11184j13829j15035j13800j09557j03246
62674A322746r6442q9772q2748p5079o7388o0350n3834m7479m1684l7225l4034
62663F36711l1274k8526k6064k3844k1268j8301j5922j4915j4851j4827j4581
62652D12338j4246j3631j2427j0847r409q245p091n775m433l375k929l100l337
62639C13493l049k343j819j573j127l69K53O48J280K125K324J351j97j391j895
62624C07711j822j455j211j004K73L351O689P763O558N775O882Q282Q585R153
$$ plain form
62610 365530 376891 390450 403975 416412 429761 446455 466706 489729 515826 545535 578082
62599 578082 612594 649921 691538 737224 785325 834526 883693 930555 972557 1009016 1040764
62588 1040764 1067470 1086803 1096549 1096309 1086723 1068280 1041558 1007832 968798 926046 881056 835360
62576 835360 790425 747466 707106 669009 632374 597409 565669 538121 513453 489561 466330
62565 466330 445522 427996 412708 398859 387323 378876 372115 364540 355253 345549 337079 330431 325513
62552 325513 322372 321084 321215 321913 322576 323196 323989 324848 325451 325930 327076 329653 333587 337969 341706 344173
62536 344173 345685 347549 351230 357102 364308 372111 380914 391560 404190 418501 434734 453697 476118
62523 476118 502611 533847 569815 609207 650697 694809 743521 797840 856622 917746 979270
$$ packed form
62610C65530J1361J3559J3525J2437J3349J6694K0251K3023K6097K9709L2547
62599E78082L4512L7327M1617M5686M8101M9201M9167M6862M2002L6459L1748
62588A040764K6706J9333R746k40r586j8443k6722l3726l9034m2752m4990m5696
62576H35360m4935m2959m0360l8097l6635l4965l1740k7548k4668k3892k3231
62565D66330k0808j7526j5288j3849j1536q447o761p575r287r704q470o648m918
62552C25513l141j288J31O98O63O20P93Q59O03M79J146K577L934M382L737K467
62536C44173J512J864L681N872P206P803Q803J0646J2630J4311J6233J8963K2421
62523D76118K6493L1236L5968L9392M1490M4112M8712N4319N8782O1124O1524
$$ plain form
62512 979270 1039201 1095378 1146402 1191889 1231106 1262035 1282455 1291435 1289148 1275781 1251450 1216895
62500 1216895 1173635 1123630 1069227 1012914 956339 899638 842440 785585 731441 682396 639233
62489 639233 600933 565916 533706 505612 483429 467148 454340 442231 430081 419037 410062 402877
62477 402877 396844 391938 388382 385916 383909 381897 379655 376971 373763 370288 366879 363439 359528 355123
62463 355123 351003 348006 345867 343153 338727 333127 328091 324684 322338 319967 317559 316148 316437 318044
62449 318044 320148 322393 324967 328278 332842 339195 347388 356470 364700 370547 373786 375876 379071 384527
62435 384527 391038 396030 398144 398368 398235 397507 394648 389345 383273 377988 373155 367555 360973 354147 347596
62420 347596 341653 337181 334768 333184 330150 325165 320415 318108 317825 317284 314997 311163 306568 301804 297554
$$ packed form
62512I79270N9931N6177N1024M5487L9217L0929K0420Q980k287j3367k4331l4555
62500A216895m3260n0005n4403n6313n6575n6701n7198n6855n4144m9045m3163
62489F39233l8300l5017l2210k8094k2183j6281j2808j2109j2150j1044q975p185
62477D02877o033m906l556k466k007k012k242k684l208l475l409l440l911m405
62463C55123m120k997k139k714m426n600n036l407k346k371k408j411K89J607
62449C18044K104K245K574L311M564O353Q193R082Q230N847L239K090L195N456
62435C84527O511M992K114K24j33p28k859n303o072n285m833n600o582o826o551
62420C47596n943m472k413j584l034m985m750k307k83n41k287l834m595m764m250
$$ plain form
62405 297554 294612 293270 293148 293761 294940 296739 299176 301959 304297 305478 306063 307926 312362 318546 324716
62390 324716 330476 336761 343702 349993 354773 358959 363963 370026 376576 383444 390731 398024 404812 411533
62376 411533 419331 428813 439796 452291 466980 484440 504477 526531 550406 576456 605498 638845
62364 638845 678065 724329 777984 838865 906824 981837 1063855 1152820 1248525 1349882 1454040
62353 1454040 1556366 1651570 1735219 1804747 1859505 1899867 1925993 1937333 1933384 1914693 1882710
62342 1882710 1838754 1783768 1719228 1647431 1570184 1487869 1400875 1311765 1224885 1143515 1068305
62331 1068305 998868 935901 880824 833871 793541 757917 725931 697390 672389 650821 632078
62320 632078 615050 598538 581712 564255 546434 529159 513472 499593 486795 474492 462981
$$ packed form
62405B97554k942j342j22O13J179J799K437K783K338J181N85J863M436O184O170
62390C24716N760O285O941O291M780M186N004O063O550O868P287P293O788O721
62376D11533P798R482J0983J2495J4689J7460K0037K2054K3875K6050K9042L3347
62364F38845L9220M6264N3655O0881O7959P5013Q2018Q8965R5705J01357J04158
62353A454040J02326R5204Q3649O9528N4758M0362K6126J1340l949j8691l1983
62342A882710m3956n4986o4540p1797p7247q2315q6994q9110q6880q1370p5210
62331A068305o9437o2967n5077m6953m0330l5624l1986k8541k5001k1568j8743
62320F32078j7028j6512j6826j7457j7821j7275j5687j3879j2798j2303j1511
$$ plain form
62309 462981 452813 444039 436587 430685 426122 421720 416542 411238 407120 404279 401822 399696 398753 398943
62295 398943 399075 398837 399597 402383 406333 410067 413486 417130 420707 423507 425672 427837 429975 431854 434378
62280 434378 439189 446862 456411 466638 477120 488005 499779 513291 529084 546571 564761 583896
62268 583896 605477 630514 658859 690700 727586 771059 820954 876021 935933 1001964 1075860
62257 1075860 1158595 1249861 1347929 1449878 1552383 1652283 1746129 1829638 1898434 1949607 1982344
62246 1982344 1997358 1996391 1982075 1957083 1922540 1877508 1820442 1751069 1670845 1582275 1488461 1393009
62234 1393009 1299461 1210315 1126669 1048795 976932 911615 853554 803165 759992 722634 689568
62223 689568 660095 634345 612558 594716 580555 569267 559198 548704 537728 527860 520267 514052
$$ packed form
62309D62981j0168q774p452n902m563m402n178n304m118k841k457k126r43J90
62295C98943J32k38P60K786L950L734L419L644L577K800K165K165K138J879K524
62280D34378M811P673R549J0227J0482J0885J1774J3512J5793J7487J8190J9135
62268E83896K1581K5037K8345L1841L6886M3473M9895N5067N9912O6031P3896
62257A075860Q2735R1266R8068J01949J02505R9900R3846Q3509O8796N1173L2737
62246A982344J5014r67j4316k4992l4543m5032n7066o9373q0224q8570r3814r5452
62234A393009r3548q9146q3646p7874p1863o5317n8061n0389m3173l7358l3066
62223F89568k9473k5750k1787j7842j4161j1288j0069j0494j0976r868p593o215
$$ plain form
62211 514052 507332 499603 492373 487581 486007 487020 489105 490599 490708 490176 490506 492357 495100 498035 501470
62196 501470 506319 513127 521799 531833 542442 552883 563187 574298 587043 601118 615500 629630
62184 629630 643743 658222 673249 689160 706468 725148 744205 762439 779748 797562 817951
62173 817951 842354 871139 904250 942073 985522 1035413 1091962 1154888 1223685 1297535 1374963
62162 1374963 1453634 1530397 1601477 1662914 1711300 1744628 1762868 1767850 1762281 1748261 1726371 1696020
62150 1696020 1656466 1607506 1549675 1484510 1414616 1342929 1271796 1203050 1138715 1080722 1029711
62139 1029711 985081 946700 915678 892653 876075 863288 852777 844157 836302 827127 815709 803347
62127 803347 791808 781408 771535 762190 753892 746495 739087 731003 722169 712579 702291 692002 682836
$$ packed form
62211E14052o720p729p230m792j574J013K085J494J09n32L30J851K743K935L435
62196E01470M849O808Q672J0034J0609J0441J0304J1111J2745J4075J4382J4130
62184F29630J4113J4479J5027J5911J7308J8680J9057J8234J7309J7814K0389
62173H17951K4403K8785L3111L7823M3449M9891N6549O2926O8797P3850P7428
62162A374963P8671P6763P1080O1437M8386L3328J8240M982n569j4020k1890l0351
62150A696020l9554m8960n7831o5165o9894p1687p1133o8746o4335n7993n1011
62139A029711m4630l8381l1022k3025j6578j2787j0511q620p855r175j1418j2362
62127H03347j1539j0400r873r345q298p397p408q084q834r590j0288j0289r166
$$ plain form
62114 682836 675337 669341 665017 663230 664358 667421 671106 675191 680113 685385 689471 691487 692301 693552
62100 693552 696188 700362 706080 713082 720356 726778 732492 738994 747402 757088 766537 775238 784171 794426
62086 794426 805946 817915 830065 843136 857986 874534 891880 909558 928448 950188 975657
62075 975657 1004321 1035174 1068035 1103501 1141860 1182750 1226167 1273272 1325607 1383669 1446772
62064 1446772 1514199 1585629 1659905 1733824 1802687 1862054 1908903 1941774 1960752 1967308 1963276 1949576
62052 1949576 1926312 1894092 1854405 1808232 1755071 1694172 1626443 1554383 1480540 1406958 1335906
62041 1335906 1269795 1209742 1154933 1104116 1057383 1016050 981146 952460 928737 908265 889501
62030 889501 871846 856007 843217 833838 826746 820022 812147 802730 792572 783157 775766 770637 766792
$$ packed form
62114F82836p499n996m324j787J128L063L685M085M922N272M086K016Q14J251
62100F93552K636M174N718P002P274O422N714O502Q408R686R449Q701Q933J0255
62086G94426J1520J1969J2150J3071J4850J6548J7346J7678J8890K1740K5469
62075I75657K8664L0853L2861L5466L8359M0890M3417M7105N2335N8062O3103
62064A446772O7427P1430P4276P3919O8863N9367M6849L2871J8978O556m032j3700
62052A949576k3264l2220l9687m6173n3161o0899o7729p2060p3843p3582p1052
62041A335906o6111o0053n4809n0817m6733m1333l4904k8686k3723k0472j8764
62030H89501j7655j5839j2790r379p092o724p875r417j0158r415p391n129l845
$$ plain form
62017 766792 762857 758296 753825 750377 747621 744044 738878 733450 729845 728425 727660 726509 725793 726556 728107
62002 728107 728844 728525 728523 729877 732192 734659 737182 740008 742901 745268 746791 747595 747970 748025 747310 744865 740250
61985 740250 734595 729814 726302 722105 715046 705300 695245 687218 682094 679629 678950 678515 676490 671967
61971 671967 665701 659450 654670 651721 649919 648289 646511 645093 644426 643957 642918 641629 641174 641685 641906
61956 641906 640907 639452 639030 640132 642074 643908 644783 644091 642272 641206 642748 646955 652648 659553 668688
61941 668688 680374 692959 704177 713266 721348 730281 741396 754674 768690 781831 793912 806073
61929 806073 818920 831576 843038 853558 863878 873777 882461 890113 898031 907208 917487 928107
61917 928107 938491 948589 959039 971021 985420 1002148 1020718 1041274 1064515 1090850 1120251
$$ packed form
62017G66792l935m561m471l448k756l577n166n428l605j420p65j151p16P63J551
62002G28107P37l19kJ354K315K467K523K826K893K367J523Q04L75N5p15k445m615
61985G40250n655m781l512m197p059r746j0055q027n124k465o79m35k025m523
61971F71967o266o251m780k949j802j630j778j418o67m69j039j289m55N11K21
61956F41906r99j455m22J102J942J834Q75o92j819j066J542M207N693O905R135
61941F68688J1686J2585J1218R089Q082Q933J1115J3278J4016J3141J2081J2161
61929H06073J2847J2656J1462J0520J0320R899Q684P652P918R177J0279J0620
61917I28107J0384J0098J0450J1982J4399J6728J8570K0556K3241K6335K9401
$$ plain form
61906 1120251 1152633 1187500 1223294 1258159 1291626 1324782 1358525 1392471 1425860 1458663 1491214
61895 1491214 1523403 1554986 1586273 1617780 1649357 1680087 1708927 1735209 1758835 1780449 1801123
61884 1801123 1821348 1840246 1856027 1867110 1872702 1872666 1867310 1857144 1842397 1822820 1798298 1769593
61872 1769593 1738015 1704346 1668518 1630490 1591021 1551301 1512075 1473527 1435873 1399571 1364817
61861 1364817 1331264 1298587 1267081 1237361 1209647 1183841 1160177 1139104 1120428 1103292 1087407
61850 1087407 1073710 1063296 1056251 1052001 1050154 1050173 1050699 1050275 1048492 1045440 1040318 1031950 1020841 1009249
61836 1009249 998546 987644 974913 960764 947278 935889 926599 919162 913790 910505 908794 908416 909998
61823 909998 914321 921276 929900 939178 948364 956594 962791 966352 967674 967489 965808 962119 956691 950940
$$ packed form
61906A120251L2382L4867L5794L4865L3467L3156L3743L3946L3389L2803L2551
61895A491214L2189L1583L1287L1507L1577L0730K8840K6282K3626K1614K0674
61884A801123K0225J8898J5781J1083N592l6n356j0166j4747j9577k4522k8705
61872A769593l1578l3669l5828l8028l9469l9720l9226l8548l7654l6302l4754
61861A364817l3553l2677l1506k9720k7714k5806k3664k1073j8676j7136j5885
61850A087407j3697j0414p045m250j847J9N26m24j783l052n122q368j1109j1592
61836A009249j0703j0902j2731j4149j3486j1389r290p437n372l285j711l78J582
61823I09998M323O955Q624R278R186Q230O197L561J322j85j681l689n428n751
$$ plain form
61809 950940 946015 941706 937430 933675 931404 930464 929848 929596 931089 935100 940706 946833 953858 962879 974090
61794 974090 986871 1001047 1017038 1034849 1053762 1073241 1093731 1116347 1141818 1169656 1198387
61783 1198387 1226816 1255067 1284102 1314510 1346447 1380629 1418226 1459425 1503135 1548726 1597036
61772 1597036 1648778 1702905 1757769 1813417 1871391 1932397 1995362 2058991 2123304 2189323 2257895
61761 2257895 2328914 2400994 2471627 2538351 2600234 2657955 2712201 2762356 2806861 2844411 2874371
61750 2874371 2896293 2909598 2913971 2909763 2897645 2877840 2850021 2814157 2771079 2721868 2667079 2607202
61738 2607202 2543489 2477380 2409219 2338701 2266778 2195804 2127071 2059337 1990872 1922177 1855593
61727 1855593 1792722 1733427 1677022 1623173 1571556 1521711 1473658 1428029 1385305 1345258 1307160
$$ packed form
61809I50940m925m309m276l755k271r40o16k52J493M011N606O127P025R021J1211
61794I74090J2781J4176J5991J7811J8913J9479K0490K2616K5471K7838K8731
61783A198387K8429K8251K9035L0408L1937L4182L7597M1199M3710M5591M8310
61772A597036N1742N4127N4864N5648N7974O1006O2965O3629O4313O6019O8572
61761B257895P1019P2080P0633O6724O1883N7721N4246N0155M4505L7550K9960
61750B874371K1922J3305M373m208j2118j9805k7819l5864m3078m9211n4789n9877
61738B607202o3713o6109o8161p0518p1923p0974o8733o7734o8465o8695o6584
61727A855593o2871n9295n6405n3849n1617m9845m8053m5629m2724m0047l8098
$$ plain form
61716 1307160 1270183 1233765 1198075 1164099 1132827 1104345 1077923 1052773 1028401 1004611 981625
61705 981625 959926 939510 919613 899534 879365 859464 839862 820825 803325 787927 773604
61694 773604 758803 743456 728859 715536 702350 688017 672663 657538 643789 631802 621233
61683 621233 611420 602027 593376 585925 579594 573892 568411 562821 556839 550741 545434 541323 537532 533038
61669 533038 528104 523660 519720 515602 511377 507802 504779 501228 496754 492307 488850 486311 484289 482910
61655 482910 482546 483239 484639 486029 486354 484804 481385 476484 470374 463971 459391 458219 459359 460187 459942
61640 459942 460408 462945 466668 470160 473305 476262 478132 478048 476686 475278 473724 470824 465996 459812 453227
61625 453227 447085 442030 438104 434751 431752 429674 428825 428405 427433 425957 424528 422918 420280 416328 411638
$$ packed form
61716A307160l6977l6418l5690l3976l1272k8482k6422k5150k4372k3790k2986
61705I81625k1699k0416j9897k0079k0169j9901j9602j9037j7500j5398j4323
61694G73604j4801j5347j4597j3323j3186j4333j5354j5125j3749j1987j0569
61683F21233r813r393q651p451o331n702n481n590n982o098n307m111l791m494
61669E33038m934m444l940m118m225l575l023l551m474m447l457k539k022j379
61655D82910l64O93J400J390L25j550l419m901o110o403m580j172J140Q28k45
61640D59942M66K537L723L492L145K957J870q4j362j408j554k900m828o184o585
61625D53227o142n055l926l353k999k078q49m20r72j476j429j610k638l952m690
$$ plain form
61610 411638 407036 403370 401486 401579 402630 403163 402513 400901 398551 395387 391530 387512 383938 381192 379255
61595 379255 377520 375088 371712 368258 365849 364776 364508 364455 364339 364103 363942 364326 365656 367902 370570 372884
61579 372884 374182 374700 375845 378950 383754 388913 393988 399743 406267 412230 416806 421088 426560 433161
61565 433161 440035 447253 455450 464384 473327 482416 492219 502271 511485 519970 529043 539313 550013
61552 550013 560343 570223 579348 586730 591756 594899 596925 598198 599098 600214 601567 602405 602369 602124 602173 601769
61536 601769 599985 597455 596017 596552 597986 598676 598130 597139 596775 597845 600919 605969 611788 616497 619288
61521 619288 621490 625378 631991 640529 649710 658993 668386 677853 687435 697589 708977 722089 737230
61508 737230 754505 773589 793841 814889 836806 859676 883498 908633 935608 964197 993400
$$ packed form
61610D11638m602l666j884R3J051N33o50j612k350l164l857m018l574k746j937
61595C79255j735k432l376l454k409j073k68n3j16k36j61L84J330K246K668K314
61579C72884J298N18J145L105M804N159N075N755O524N963M576M282N472O601
61565D33161O874P218Q197Q934Q943R089R803J0052R214Q485R073J0270J0700
61552E50013J0330R880R125P382N026L143K026J273R00J116J353Q38l6k45M9m04
61536F01769j784k530j438N35J434O90n46r91l64J070L074N050N819M709K791
61521F19288K202L888O613Q538R181R283R393R467R582J0154J1388J3112J5141
61508G37230J7275J9084K0252K1048K1917K2870K3822K5135K6975K8589K9203
$$ plain form
61497 993400 1022760 1052920 1084317 1116073 1146969 1176882 1206372 1235280 1262665 1287816 1310528
61486 1310528 1330712 1348465 1364073 1376963 1385071 1386512 1381909 1373994 1364877 1354843 1343855 1332755
61474 1332755 1322187 1311392 1299214 1285998 1273681 1263983 1256920 1251012 1244656 1237355 1229845 1223213 1217998
61461 1217998 1214092 1211024 1207969 1203854 1198208 1191870 1186320 1182309 1179653 1178240 1178433 1180304 1183303 1187124
61447 1187124 1192383 1199918 1209783 1221281 1233669 1246467 1259471 1273040 1288072 1304842 1321605 1334984
61435 1334984 1342285 1343384 1340107 1334073 1325805 1315918 1306193 1298646 1293844 1290827 1288656 1287410 1287758 1290386
61421 1290386 1295955 1304794 1316198 1328573 1340573 1351432 1359899 1363765 1361238 1352345 1338515 1321361
61409 1321361 1302437 1283299 1264767 1246526 1228379 1211516 1197512 1186367 1176638 1167369 1158776 1151013
$$ packed form
61497I93400K9360L0160L1397L1756L0896K9913K9490K8908K7385K5151K2712
61486A310528K0184J7753J5608J2890Q108J441m603p915r117j0034j0988j1100
61474A332755j0568j0795j2178j3216j2317r698p063n908o356p301p510o632n215
61461A217998l906l068l055m115n646o338n550m011k656j413J93J871K999L821
61447A187124N259P535R865J1498J2388J2798J3004J3569J5032J6770J6763J3379
61435A334984P301J099l277o034q268r887r725p547m802l017k171j246L48K628
61421A290386N569Q839J1404J2375J2000J0859Q467L866k527q893j3830j7154
61409A321361j8924j9138j8532j8241j8147j6863j4004j1145r729r269q593p763
$$ plain form
61397 1151013 1143540 1136182 1129939 1126096 1125009 1126131 1128724 1132234 1136396 1141328 1147307 1154386 1162657 1172906
61383 1172906 1186347 1203261 1222292 1241606 1260597 1280082 1300917 1322931 1345430 1368326 1392195
61372 1392195 1417134 1442186 1466317 1489460 1511786 1532345 1549562 1563151 1574281 1583422 1589255 1590540
61360 1590540 1587984 1583125 1576116 1565997 1552764 1537918 1522845 1507427 1490233 1469510 1444378 1415762
61348 1415762 1385883 1356169 1326098 1294708 1262501 1230906 1200663 1171980 1145561 1121936 1100236
61337 1100236 1079400 1060314 1044843 1032682 1021231 1009130 997993 989724 983753 978120 972087 966453
61325 966453 962176 959754 959252 959930 960500 960633 961668 965007 970381 976539 983023 990270 998291 1006331 1013811
61310 1013811 1020914 1028163 1035834 1043686 1051010 1057212 1062652 1068452 1075048 1081323 1085697 1087805 1088594 1089023
$$ packed form
61397A151013p473p358o243l843j087J122K593L510M162M932N979P079Q271J0249
61383A172906J3441J6914J9031J9314J8991J9485K0835K2014K2499K2896K3869
61372A392195K4939K5052K4131K3143K2326K0559J7217J3589J1130R141N833J285
61360A590540k556m859p009j0119j3233j4846j5073j5418j7194k0723k5132k8616
61348A415762k9879k9714l0071l1390l2207l1595l0243k8683k6419k3625k1700
61337A100236k0836j9086j5471j2161j1451j2101j1137q269n971n633o033n634
61325I66453m277k422n02O78N70J33J035L339N374O158O484P247Q021Q040P480
61310A013811P103P249P671P852P324O202N440N800O596O275M374K108P89M29
$$ plain form
61296 1089023 1089220 1088712 1086988 1083918 1080046 1076352 1073302 1070112 1065255 1057800 1048151 1037537 1026964 1016638
61282 1016638 1006260 995752 985492 975842 966815 958507 951501 946305 942529 939211 935904 932870 930197
61269 930197 927357 923821 919696 915716 913016 912768 915334 919585 923556 925992 926943 927051 926934 927378 929363
61254 929363 933542 939995 948577 959259 972224 988057 1007597 1031022 1057344 1085404 1114979 1146017
61242 1146017 1177051 1205421 1228930 1246318 1256479 1258804 1254510 1246241 1235948 1224286 1212196 1201428
61230 1201428 1192749 1185064 1177252 1169778 1163640 1158857 1155070 1152706 1152409 1153876 1156080 1157991 1158224 1154771
61216 1154771 1146081 1131970 1112883 1089088 1061581 1033011 1006428 983326 963647 947171 933942
61205 933942 923735 916152 911011 907784 905010 901256 896662 892674 890250 888896 887384 884824 880984 875973
$$ packed form
61296A089023J97n08j724l070l872l694l050l190m857p455r649j0614j0573j0326
61282A016638j0378j0508j0260r650r027q308p006n196l776l318l307l034k673
61269I30197k840l536m125l980k700k48K566M251L971K436R51J08j17M44J985
61254I29363M179O453Q582J0682J2965J5833J9540K3425K6322K8060K9575L1038
61242A146017L1034K8370K3509J7388J0161K325m294q269j0293j1662j2090j0768
61230A201428q679p685p812p474o138m783l787k364k97J467K204J911K33l453
61216A154771q690j4111j9087k3795k7507k8570k6583k3102j9679j6476j3229
61205I33942j0207p583n141l227k774l754m594l988k424j354j512k560l840n011
$$ plain form
61191 875973 869640 861374 850928 839511 829140 820432 811757 801148 788312 774190 759575 745219
61179 745219 732430 722054 713007 703023 690996 677865 665330 654511 645706 638549 632178 625795 619199
61166 619199 612606 606298 600805 596902 594754 593350 591407 588635 585716 583493 582643 583522 585570 587297 587594
61151 587594 586712 585326 583130 579230 573505 566818 560162 554269 549589 545873 542232 538398 535412 534187
61137 534187 533995 533514 532815 532947 533808 533961 532695 530941 529780 529166 528554 527930 527697 528083 528987 530076 530953
61120 530953 531684 532997 535438 538561 541619 544855 549235 554937 560952 566278 570832 575173 579912 585316
61106 585316 590799 594851 596207 594979 592094 588033 583113 578529 575617 573852 570958 565510 558421 551437
61092 551437 545215 539506 534092 528621 522297 514930 507984 503516 501980 501737 500855 498861 496638 495193 494918
$$ packed form
61191H75973o333q266j0446j1417j0371q708q675j0609j2836j4122j4615j4356
61179G45219j2789j0376r047r984j2027j3131j2535j0819q805p157o371o383o596
61166F19199o593o308n493l903k148j404j943k772k919k223q50Q79K048J727K97
61151E87594q82j386k196l900n725o687o656n893m680l716l641l834k986j225
61137E34187j92m81o99J32Q61J53j266j754j161o14o12o24k33L86R04J089Q77
61120E30953P31J313K441L123L058L236M380N702O015N326M554M341M739N404
61106E85316N483M052J356j228k885m061m920m584k912j765k894n448p089o984
61092E51437o222n709n414n471o324p367o946m468j536k43q82j994k223j445k75
$$ plain form
61077 494918 495785 497619 499946 501898 502705 502313 501361 500588 500564 501828 504765 509197 514413 519755 524908 529736
61061 529736 534417 539790 546992 556502 567859 580146 592226 602943 612287 622356 635870 653425
61049 653425 673359 694499 717544 743336 771492 801501 833497 866887 899934 932089 965369
61038 965369 1002110 1042925 1088288 1140244 1200317 1267097 1338250 1414074 1497344 1591320 1700699
61027 1700699 1833367 1998424 2203389 2456050 2767492 3149933 3613775 4172301 4848418
61018 4848418 5670656 6663169 7846768 9243351 10848865 12570290 14190670 15434347
61010 15434347 16111708 16226973 15957338 15538456 15169676 14993432 15094951 15459281 15919518
61001 15919518 16189689 16002012 15248134 14010886 12482066 10857444 9283478 7853065
$$ packed form
61077D94918Q67J834K327J952Q07l92r52p73k4J264K937M432N216N342N153M828
61061E29736M681N373P202R510J1357J2287J2080J0717R344J0069J3514J7555
61049F53425J9934K1140K3045K5792K8156L0009L1996L3390L3047L2155L3280
61038I65369L6741M0815M5363N1956O0073O6780P1153P5824Q3270R3976J09379
61027A700699J32668J65057K04965K52661L11442L82441M63842N58526O76117
61018D848418Q22238R92513J183599J396583J605514J721425J620380J243677
61010A5434347O77361J15265k69635m18882l68780j76244J01519L64330M60237
61001A5919518K70171j87677p53878j237248j528820j624622j573966j430413
$$ plain form
60993 7853065 6613587 5573956 4717689 4019573 3454668 2999063 2630879 2333066 2092833
60984 2092833 1898290 1737990 1603510 1489968 1393579 1310221 1236140 1168436 1104983 1045189
60974 1045189 990425 942384 901254 866332 837417 814035 794001 774344 753421 731100 707661
60963 707661 683945 661817 642738 626101 610232 594707 580472 568209 557840 549233 542147 535919
60951 535919 530337 526203 523875 521962 518790 514457 510117 506085 502175 498986 496864 494249 489219 482425
60937 482425 476488 472543 469244 465001 459133 450928 439950 427837 417632 410447 404436 397787 391051
60924 391051 385686 381919 379108 376929 375129 373090 370577 368132 366043 363803 361175 358791 357058 355514
60910 355514 353953 353122 353430 353913 353503 352562 352133 352260 352061 351100 349839 348946 348817 349552 350913 352575 354736
$$ packed form
60993G853065j239478j039631q56267o98116n64905m55605l68184k97813k40233
60984B092833j94543j60300j34480j13542r6389q3358p4081o7704o3453n9794
60974A045189n4764m8041m1130l4922k8915k3382k0034j9657k0923k2321k3439
60963G07661k3716k2128j9079j6637j5869j5525j4235j2263j0369q607p086o228
60951E35919n582m134k328j913l172m333m340m032l910l189k122k615n030o794
60937D82425n937l945l299m243n868q205j0978j2113j0205p185o011o649o736
60924C91051n365l767k811k179j800k039k513k445k089k240k628k384j733j544
60910C55514j561q31L08M83m10r41m29J27j99r61j261q93j29P35J361J662K161
$$ plain form
60893 354736 357952 361932 365151 366304 365687 364570 363695 362999 362265 361231 359536 357425 356243 357238 359834
60878 359834 361956 362273 361521 361433 362922 365555 368261 370042 370216 368552 365449 361886 358803 356285 353442
60863 353442 349520 345216 342476 342602 344790 346922 347638 347199 346376 345172 343098 340309 337826 336591 336789
60848 336789 338178 340570 343576 346405 348592 350800 354203 358950 363831 367579 369921 371160 371452 370911 369955
60833 369955 369114 368878 369895 372515 375656 377102 375887 373686 372635 372250 370100 365484 360735 358218 357427
60818 357427 356212 353934 351998 351552 352013 352148 351602 350799 349927 348727 347047 345024 342710 339976 336859 333619
60802 333619 330395 327220 324437 322455 320833 318367 314684 311056 308668 306623 302986 297666 292922 290804
60788 290804 291304 293288 295851 298093 298934 298320 297803 298849 301162 303505 305405 307075 308387 309139 309865 311188
$$ packed form
60893C54736L216L980L219J153o17j117q75o96p34j034j695k111j182R95K596
60878C59834K122L17p52q8J489K633K706J781J74j664l103l563l083k518k843
60863C53442l922m304k740J26K188K132P16m39q23j204k074k789k483j235J98
60848C36789J389K392L006K829K187K208L403M747M881L748K342J239K92n41r56
60833C69955q41k36J017K620L141J446j215k201j051l85k150m616m749k517p91
60818C57427j215k278j936m46M61J35n46q03q72j200j680k023k314k734l117l240
60802C33619l224l175k783j982j622k466l683l628k388k045l637n320m744k118
60788B90804N00J984K563K242Q41o14n17J046K313K343J900J670J312P52P26J323
$$ plain form
60772 311188 312706 313566 313769 313825 313570 312704 312314 314280 318904 324317 328706 332117 335591 339443 343031 345663
60756 345663 347227 348268 349832 352990 358239 365233 372885 379609 384023 386106 387484 389949 393739 397548
60742 397548 399873 399913 397748 394382 391227 388670 385406 380022 373014 366398 361528 358001 354526 350038 344260
60727 344260 337991 332674 329019 326381 324067 322467 321926 321405 319718 317488 316199 315753 314767 313038 311779
60712 311779 311377 310865 309901 309365 309568 309699 309591 310155 311445 312199 312159 312848 314881 316414 315873 314552 314703 316283
60694 316283 317474 317563 317409 317639 318185 319326 321501 324046 325378 324514 321520 316812 311156 306146 303333 302664
60678 302664 302663 302296 301845 301869 302083 301616 299900 297222 294735 293910 295596 299399 303899 307302 308251 306807 304748
60661 304748 303978 304330 303868 301720 299464 298920 299713 300206 300041 300463 302493 305944 310043 314134 317985 322119
$$ packed form
60772C11188J518Q60K03N6k55q66l90J966M624N413M389L411L474L852L588K632
60756C45663J564J041J564L158N249O994P652O724M414K083J378K465L790L809
60742C97548K325M0k165l366l155k557l264n384p008o616m870l527l475m488n778
60727C44260o269n317l655k638k314j600n41n21j687k230j289m46r86j729j259
60712C11779m02n12r64n36K03J31j08N64J290P54m0O89K033J533n41j321J51J580
60694C16283J191Q9j54K30N46J141K175K545J332q64k994m708n656n010k813o69
60678C02664jl67m51K4K14m67j716k678k487q25J686L803M500L403R49j444k059
60661C04748p70L52m62k148k256n44P93M93j65M22K030L451M099M091L851M134
$$ plain form
60645 322119 327442 333835 339659 343456 345528 346903 347525 346745 345012 343539 342551 341367 340125 339885 340892
60630 340892 342183 343270 344825 347232 349816 352174 355051 358999 363164 366379 368761 371217 373842 375930
60616 375930 377309 378554 379711 379826 378372 376466 375834 376678 377420 376709 374852 372687 369862 365387 359554
60601 359554 353944 349444 345589 342279 340625 341104 342003 341028 337791 333631 329742 326698 325124 325190 325616 324670
60585 324670 322239 319799 318353 317622 317240 317309 317506 316902 315294 313813 313730 315253 317641 319799 320706 320261 319968
60568 319968 321857 326432 332398 338489 344562 350793 356909 362603 367729 371845 374662 377296 381862 389313
60554 389313 398831 409818 423047 439070 457049 476543 499246 527269 560292 595899 632143 668230
60542 668230 702920 733775 758142 773773 778672 771799 754286 728958 698477 664823 630434 598288
$$ packed form
60645C22119N323O393N824L797K072J375O22p80j733j473r88j184j242k40J007
60630C40892J291J087J555K407K584K358K877L948M165L215K382K456K625K088
60616C75930J379J245J157J15j454j906o32Q44P42p11j857k165k825m475n833
60601C59554n610m500l855l310j654M79Q99r75l237m160l889l044j574O6M26r46
60585C24670k431k440j446p31l82O9J97o04j608j481q3J523K388K158R07m45k93
60568C19968J889M575N966O091O073O231O116N694N126M116K817K634M566P451
60554C89313R518J0987J3229J6023J7979J9494K2703K8023L3023L5607L6244L6087
60542F68230L4690L0855K4367J5631M899o873j7513k5328l0481l3654l4389l2146
$$ plain form
60530 598288 570182 545925 524825 507046 492959 482210 474322 469402 467231 466264 464752 462612 461125
60517 461125 460998 462013 464633 470480 480487 493665 508808 526675 549288 577366 609622 644467
60505 644467 680886 717196 750457 778318 800719 818609 831550 838081 838460 835733 833791 835464 843027
60492 843027 859201 886327 924821 973332 1030159 1093568 1160567 1226080 1283711 1327310 1352201
60481 1352201 1355767 1337509 1298716 1242187 1172156 1093919 1012821 933322 858854 791838 733053
60470 733053 681237 634370 591738 554277 522672 495887 472183 451073 433449 419808 409087
60459 409087 399539 390286 381715 374605 369228 365194 361861 358799 355991 353715 352230 351512 351121 350216 347876
60444 347876 343800 338872 334711 332340 331250 329987 327631 324566 321967 320760 320980 321842 322486 322891 323943
$$ packed form
60530E98288k8106k4257k1100j7779j4087j0749p888m920k171r67j512k140j487
60517D61125j27J015K620N847J0007J3178J5143J7867K2613K8078L2256L4845
60505F44467L6419L6310L3261K7861K2401J7890J2941O531L79k727j942J673P563
60492H43027J6174K7126L8494M8511N6827O3409O6999O5513N7631M3599K4891
60481A352201L566j8258l8793n6529p0031p8237q1098p9499p4468o7016n8785
60470G33053n1816m6867m2632l7461l1605k6785k3704k1110j7624j3641j0721
60459D09087r548r253q571p110n377m034l333l062k808k276j485p18l91r05k340
60444C47876m076m928m161k371j090j263k356l065k599j207K20Q62O44M05J052
$$ plain form
60429 323943 326255 329077 330897 331071 330241 329080 327482 325413 323682 322978 322664 321533 319587 318099 317903
60414 317903 318572 319525 321076 323837 327679 331781 335406 338290 340720 343605 348035 354202 360947 366867 371737
60399 371737 376430 381559 386689 391023 394554 398381 403769 410717 417426 421600 422594 422068 422242 423851 426164
60384 426164 428533 431103 434069 437025 439348 440773 441366 441426 441610 442771 445328 449050 453559 458575 463405
60369 463405 466797 467907 467149 465647 464097 462753 462152 462943 464876 466765 467778 468184 468454 468327 467456 466637
60353 466637 467535 470940 475700 479660 481556 481905 482145 483044 484040 484115 483007 481179 478799 475390 470761 465742
60337 465742 461543 458589 456198 453083 448062 440916 433139 427309 424916 424867 424636 422681 419298 415624 412730
60322 412730 411370 411530 412026 411382 409287 406565 403795 400881 398032 396086 395500 395962 397394 400441 405508
$$ packed form
60429C23943K312K822J820J74q30j161j598k069j731p04l14j131j946j488j96
60414C17903O69R53J551K761L842M102L625K884K430K885M430O167O745N920M870
60399C71737M693N129N130M334L531L827N388O948O709M174R94n26J74J609K313
60384D26164K369K570K966K956K323J425N93O0J84J161K557L722M509N016M830
60369D63405L392J110p58j502j550j344o01P91J933J889J013M06K70j27q71q19
60353D66637Q98L405M760L960J896L49K40Q99R96P5j108j828k380l409m629n019
60337D65742m199k954k391l115n021p146p777n830k393m9k31j955l383l674k894
60322D12730j360J60M96o44k095k722k770k914k849j946n86M62J432L047N067
$$ plain form
60307 405508 412028 419032 425553 430198 431566 429859 426991 424211 420575 414706 406979 398782 390591 382398
60293 382398 375279 370629 368003 365451 362203 359616 359203 360969 363874 366662 367989 367185 365410 364781 365630
60278 365630 365723 362965 357936 352872 349020 346079 343765 342726 343792 346826 350453 352857 353236 352658 353049
60263 353049 355160 358110 361040 364327 368609 373423 377714 381328 385131 389715 394562 398529 400836 401687
60249 401687 402225 403708 406484 409850 412954 415553 417936 420620 424171 428705 433389 437139 440114 443803
60235 443803 449353 456592 465036 474772 485607 496376 506251 516139 527646 541106 555662 570840 586872
60222 586872 603946 622564 644516 671850 704477 740015 776526 814199 853779 894502 934614
60211 934614 973210 1010491 1046575 1080921 1112792 1141486 1166118 1185787 1200129 1209402 1214010 1214288
$$ packed form
60307D05508O520P004O521M645J368j707k868k780l636n869p727q197q191q193
60293C82398p119m650k626k552l248k587m13J766K905K788J327q04j775o29Q49
60278C65630R3k758n029n064l852k941k314j039J066L034L627K404L79n78L91
60263C53049K111K950K930L287M282M814M291L614L803M584M847L967K307Q51
60249D01687N38J483K776L366L104K599K383K684L551M534M684L750K975L689
60235D43803N550P239Q444R736J0835J0769R875R888J1507J3460J4556J5178J6032
60222E86872J7074J8618K1952K7334L2627L5538L6511L7673L9580M0723M0112
60211I34614L8596L7281L6084L4346L1871K8694K4632J9669J4342R273M608K78
$$ plain form
60199 1214288 1210803 1204566 1196688 1187852 1178207 1167761 1156872 1146273 1136635 1128277 1121405 1116510 1114355
60186 1114355 1115790 1121767 1133215 1150412 1172598 1198615 1227920 1260588 1296552 1335466 1377231 1421818
60174 1421818 1468395 1515280 1561016 1604805 1645456 1680662 1708049 1726656 1736846 1739226 1734365 1723254
60162 1723254 1707067 1686231 1660296 1628976 1593110 1554531 1515280 1476892 1440155 1405543 1374017
60151 1374017 1347166 1326151 1310779 1300253 1294732 1295267 1301891 1312582 1324821 1337892 1353093 1371808
60139 1371808 1393852 1417500 1440435 1460529 1476340 1487487 1494538 1498257 1498900 1496387 1491173 1484653 1478446
60126 1478446 1473298 1468906 1464921 1461867 1460821 1462493 1467160 1475481 1488633 1507181 1530338 1557038 1587609
60113 1587609 1623733 1666748 1716624 1772639 1834204 1900584 1970630 2043695 2120534 2202209 2287862
$$ packed form
60199A214288l485o237p878q836r645j0446j0889j0599r638q358o872m895k155
60186A114355J435N977J1448J7197K2186K6017K9305L2668L5964L8914M1765M4587
60174A421818M6577M6885M5736M3789M0651L5206K7387J8607J0190K380m861j1111
60162A723254j6187k0836k5935l1320l5866l8579l9251l8388l6737l4612l1526
60151A374017k6851k1015j5372j0526n521N35O624J0691J2239J3071J5201J8715
60139A371808K2044K3648K2935K0094J5811J1147P051L719O43k513n214o520o207
60126A478446n148m392l985l054j046J672M667Q321J3152J8548K3157K6700L0571
60113A587609L6124M3015M9876N6015O1565O6380P0046P3065P6839Q1675Q5653
$$ plain form
60102 2287862 2374227 2457598 2535688 2607227 2670546 2723600 2765346 2796234 2816881 2826674 2824005 2807638
60090 2807638 2777487 2734429 2680092 2616948 2548005 2475838 2401974 2327464 2253805 2182839 2115744
60079 2115744 2052634 1993314 1938058 1887387 1841463 1800097 1763278 1731345 1704705 1683529 1667521
60068 1667521 1655625 1646184 1637853 1630387 1624230 1619575 1616520 1616028 1619625 1627409 1636953 1645112 1650800 1655354
60054 1655354 1660176 1664805 1667530 1667329 1664573 1660005 1653496 1644004 1630620 1613366 1592928 1569859 1544409
60041 1544409 1517157 1489296 1461986 1435732 1410724 1387406 1366213 1347078 1329926 1315570 1305340
60030 1305340 1299778 1298514 1301642 1310413 1326085 1348706 1377537 1411990 1451570 1495471 1542979 1593731
60018 1593731 1646710 1699390 1748904 1793833 1833902 1868128 1894547 1911910 1920450 1920639 1912351 1895859
$$ packed form
60102B287862Q6365Q3371P8090P1539O3319N3054M1746L0888K0647R793k669j6367
60090B807638l0151m3058n4337o3144o8943p2167p3864p4510p3659p0966o7095
60079B115744o3110n9320n5256n0671m5924m1366l6819l1933k6640k1176j6008
60068A667521j1896r441q331p466o157m655l055m92L597P784R544Q159N688M554
60054A655354M822M629K725k01k756m568o509r492j3384j7254k0438k3069k5450
60041A544409k7252k7861k7310k6254k5008k3318k1193j9135j7152j4356j0230
60030A305340n562j264L128Q771J5672K2621K8831L4453L9580M3901M7508N0752
60018A593731N2979N2680M9514M4929M0069L4226K6419J7363Q540J89q288j6492
$$ plain form
60006 1895859 1872483 1843345 1808276 1766966 1720575 1671283 1620793 1570313 1521614 1476757 1436684
59995 1436684 1401063 1369739 1343586 1323660 1310168 1302465 1299516 1300303 1304497 1313124 1328197 1351399
59983 1351399 1383181 1422877 1469186 1520722 1576825 1637794 1703532 1771755 1838341 1899783 1954760
59972 1954760 2003156 2044433 2077586 2102035 2117711 2124391 2121502 2108615 2085923 2054353 2015317 1970226
59960 1970226 1920365 1867514 1814431 1763999 1717841 1676500 1640933 1612761 1592592 1579181 1571072
59949 1571072 1568438 1572500 1583668 1601069 1623491 1650023 1680174 1714172 1752877 1796517 1843584 1891663
59937 1891663 1939234 1985954 2031291 2073732 2111617 2144281 2172170 2196057 2216042 2231136 2240122
59926 2240122 2243325 2243310 2243318 2245043 2248218 2251983 2256130 2261296 2268687 2279630 2294945 2314704 2338722 2366811
$$ packed form
60006A895859k3376k9138l5069m1310m6391m9292n0490n0480m8699m4857m0073
59995A436684l5621l1324k6153j9926j3492p703k949P87M194Q627J5073K3202
59983A351399L1782L9696M6309N1536N6103O0969O5738O8223O6586O1442N4977
59972A954760M8396M1277L3153K4449J5676O680k889j2887k2692l1570l9036m5091
59960A970226m9861n2851n3083n0432m6158m1341l5567k8172k0169j3411q109
59949A571072k634M062J1168J7401K2422K6532L0151L3998L8705M3640M7067M8079
59937A891663M7571M6720M5337M2441L7885L2664K7889K3887J9985J5094Q986
59926B240122L203j5QJ725L175L765M147N166P391J0943J5315J9759K4018K8089
$$ plain form
59912 2366811 2398155 2431001 2463653 2495400 2525801 2553559 2577026 2595488 2608967 2617035 2619031 2615472
59900 2615472 2608008 2597642 2583876 2565919 2543883 2518455 2490261 2460181 2429610 2399752 2370775
59889 2370775 2341971 2312681 2283195 2255078 2230444 2210318 2193738 2179035 2165901 2155589 2149204
59878 2149204 2146542 2146574 2148266 2150919 2154514 2159757 2166866 2174316 2179868 2183106 2185893 2189910 2194714 2198668
59864 2198668 2200638 2199995 2195811 2187108 2173503 2154978 2131563 2104002 2074379 2045224 2017864 1991837
59852 1991837 1965651 1937858 1907687 1875082 1840262 1803561 1766063 1729972 1697357 1668421 1641739
59841 1641739 1616294 1592426 1570902 1552197 1536850 1525076 1515348 1504583 1490776 1474827 1459265
59830 1459265 1445924 1435235 1426463 1417776 1407217 1394741 1382515 1372313 1363627 1355262 1347598 1341895
$$ packed form
59912B366811L1344L2846L2652L1747L0401K7758K3467J8462J3479Q068J996l559
59900B615472p464j0366j3766j7957k2036k5428k8194l0080l0571k9858k8977
59889B370775k8804k9290k9486k8117k4634k0126j6580j4703j3134j0312o385
59878B149204k662L2J692K653L595N243P109P450N552L238K787M017M804L954
59864B198668J970o43m184q703j3605j8525k3415k7561k9623k9155k7360k6027
59852A991837k6186k7793l0171l2605l4820l6701l7498l6091l2615k8936k6682
59841A641739k5445k3868k1524j8705j5347j1774r728j0765j3807j5949j5562
59830A459265j3341j0689q772q687j0559j2476j2226j0202q686q365p664n703
$$ plain form
59818 1341895 1338386 1336633 1336935 1339571 1343283 1346451 1349601 1354849 1362772 1371593 1379639 1386812 1393238 1398211
59804 1398211 1401355 1403397 1404899 1405401 1404750 1404243 1405312 1407823 1410625 1413199 1415834 1418717 1421917 1425997 1431658
59789 1431658 1438669 1445824 1451927 1456379 1459033 1460278 1461256 1463225 1466329 1469454 1471564 1472734 1473558 1474068 1473987
59774 1473987 1473883 1475283 1479326 1485797 1493798 1502881 1513183 1524998 1538894 1555847 1576417 1599971 1625671
59761 1625671 1654192 1687510 1726855 1771885 1822243 1878922 1943594 2017480 2101475 2196341 2301662
59750 2301662 2414948 2532230 2648596 2757226 2848850 2913993 2946408 2944367 2909859 2848036 2766997
59739 2766997 2676040 2582895 2492662 2408939 2334679 2271484 2218970 2175621 2140289 2112895 2094062
59728 2094062 2084249 2082993 2088919 2100487 2116603 2136695 2160901 2190260 2225728 2266545 2310663 2357601
$$ packed form
59818A341895l509j753L02K636L712L168L150N248P923Q821Q046P173O426M973
59804A398211L144K042J502N02o51n07J069K511K802K574K635K883L200M080N661
59789A431658P011P155O103M452K654J245R78J969L104L125K110J170Q24N10q1
59774A473987j04J400M043O471Q001R083J0302J1815J3896J6953K0570K3554K5700
59761A625671K8521L3318L9345M5030N0358N6679O4672P3886Q3995R4866J05321
59750B301662J13286J17282J16366J08630R1624O5143L2415k041l4508o1823q1039
59739B766997r0957r3145r0233q3723p4260o3195n2514m3349l5332k7394j8833
59728B094062r813j256N926J1568J6116K0092K4206K9359L5468M0817M4118M6938
$$ plain form
59716 2357601 2409757 2469643 2536844 2609348 2687097 2772185 2865734 2966857 3075170 3192266 3319653
59705 3319653 3456614 3601215 3752350 3909641 4072048 4237619 4404200 4569405 4730010
59696 4730010 4882119 5022082 5147273 5256339 5349045 5425740 5486967 5533740 5567869 5591452
59686 5591452 5606138 5613498 5615799 5615427 5613593 5610512 5606930 5604384 5603742 5604495 5605980 5608458 5612621 5618786
59672 5618786 5626969 5637060 5648727 5661967 5677926 5698133 5722475 5749051 5776692 5806775 5841823
59661 5841823 5883113 5930297 5982460 6038544 6097280 6157714 6219747 6283611 6348998 6414935 6480057
59650 6480057 6542663 6601028 6653834 6699545 6735105 6756209 6759555 6744161 6710102 6657090 6585209
59639 6585209 6496082 6392120 6275160 6146968 6010655 5870527 5730614 5594160 5464176 5343420
$$ packed form
59716B357601N2156N9886O7201P2504P7749Q5088R3549J01123J08313J17096J27387
59705C319653J36961J44601J51135J57291J62407J65571J66581J65205J60605
59696D730010J52109J39963J25191J09066R2706P6695O1227M6773L4129K3583
59686E591452J4686P360K301l72j834l081l582k546o42P53J485K478M163O165
59672E618786Q183J0091J1667J3240J5959K0207K4342K6576K7641L0083L5048
59661E841823M1290M7184N2163N6084N8736O0434O2033O3864O5387O5937O5122
59650F480057O2606N8365N2806M5711L5560K1104L346j5394l4059n3012p1881
59639F585209q9127j03962j16960j28192j36313j40128j39913j36454j29984j20756
$$ plain form
59629 5343420 5233728 5135929 5050156 4975430 4908735 4844739 4776057 4693861 4589775 4459190 4303279
59618 4303279 4127449 3938273 3742451 3547514 3361090 3188308 3030513 2886931 2757064
59609 2757064 2641192 2539178 2449457 2369423 2296946 2231578 2173858 2123155 2076760 2031745 1987367
59598 1987367 1944993 1906058 1870914 1839256 1810549 1783962 1758898 1735740 1715291 1697380 1680897
59587 1680897 1665353 1651370 1639227 1627860 1615953 1603383 1590981 1579413 1568907 1559430 1550293 1539910
59575 1539910 1526987 1512065 1497169 1483777 1471708 1460168 1449178 1439386 1430938 1423307 1416283 1410489
59563 1410489 1406653 1404767 1404223 1404462 1405254 1406724 1409452 1414246 1421325 1429992 1439622 1450670 1464146 1480461
59549 1480461 1499552 1521735 1547215 1574857 1602938 1631604 1663363 1700587 1743727 1792460 1846517
$$ packed form
59629E343420j09692r7799q5773p4726o6695o3996o8682q2196j04086j30585j55911
59618D303279j75830j89176j95822j94937j86424j72782j57795j43582j29867
59609B757064j15872j02014q9721q0034p2477o5368n7720n0703m6395m5015m4378
59598A987367m2374l8935l5144l1658k8707k6587k5064k3158k0449j7911j6483
59587A680897j5544j3983j2143j1367j1907j2570j2402j1568j0506r477r137j0383
59575A539910j2923j4922j4896j3392j2069j1540j0990r792q448p631p024n794
59563A410489l836j886n44K39P92J470K728M794P079Q667R630J1048J3476J6315
59549A480461J9091K2183K5480K7642K8081K8666L1759L7224M3140M8733N4057
$$ plain form
59538 1846517 1903314 1955780 1995190 2016961 2022860 2018011 2007470 1995651 1986589 1982744 1984007 1988900
59526 1988900 1996381 2005825 2015886 2024587 2030660 2034111 2035439 2034939 2032935 2030045 2026602 2021957 2014914 2004986
59512 2004986 1992836 1979292 1964374 1947822 1930223 1912782 1895962 1879322 1863057 1848663 1837282
59501 1837282 1828148 1819717 1811914 1806111 1803145 1802715 1805013 1811653 1824188 1842428 1864929 1890695 1919720
59488 1919720 1952243 1988236 2027631 2070399 2116179 2164121 2213282 2263111 2313449 2364080 2414278
59477 2414278 2462728 2507845 2548109 2582108 2608511 2626328 2635210 2635350 2627127 2611013 2587750 2558381
59465 2558381 2524054 2485935 2445186 2402682 2358734 2313526 2268100 2224566 2184918 2149588 2117442
59454 2117442 2087173 2058418 2031432 2006086 1981777 1958207 1935578 1913694 1891449 1867833 1843166
$$ packed form
59538A846517N6797N2466L9410K1771N899m849j0541j1819r062l845J263M893
59526A988900P481R444J0061Q701O073L451J328n00k004k890l443m645p043r928
59512B004986j2150j3544j4918j6552j7599j7441j6820j6640j6265j4394j1381
59501A837282r134q431p803n803k966m30K298O640J2535J8240K2501K5766K9025
59488A919720L2523L5993L9395M2768M5780M7942M9161M9829N0338N0631N0198
59477B414278M8450M5117M0264L3999K6403J7817Q882J40q223j6114k3263k9369
59465B558381l4327l8119m0749m2504m3948m5208m5426m3534l9648l5330l2146
59454B117442l0269k8755k6986k5346k4309k3570k2629k1884k2245k3616k4667
$$ plain form
59443 1843166 1818640 1794672 1770426 1744975 1718206 1690355 1661564 1632371 1603872 1576552 1549329
59432 1549329 1520563 1489921 1458652 1428221 1399268 1371810 1345771 1321138 1298075 1277029 1258405
59421 1258405 1242173 1228330 1217728 1211842 1211415 1216022 1225544 1241437 1265026 1293709 1319553 1333150
59409 1333150 1329874 1312676 1289207 1266876 1250289 1241552 1241286 1249576 1266924 1293779 1327522 1359987
59397 1359987 1380086 1380459 1361463 1328715 1288141 1244014 1199925 1159264 1124375 1096110 1074310 1058230
59385 1058230 1046838 1039412 1035824 1035875 1038720 1043273 1048682 1054195 1059459 1065607 1075037 1089026 1106246 1124631
59371 1124631 1143925 1165160 1188435 1212832 1238101 1264682 1292116 1319160 1345841 1373873 1404576
59360 1404576 1437579 1472006 1507740 1545025 1583959 1625040 1669245 1716928 1767383 1820037 1875318
$$ packed form
59443A843166k4526k3968k4246k5451k6769k7851k8791k9193k8499k7320k7223
59432A549329k8766l0642l1269l0431k8953k7458k6039k4633k3063k1046j8624
59421A258405j6232j3843j0602n886m27M607R522J5893K3589K8683K5844J3597
59409A333150l276j7198k3469k2331j6587q737k66Q290J7348K6855L3743L2465
59397A359987K0099L73j8996l2748m0574m4127m4089m0661l4889k8265k1800j6080
59385A058230j1392p426l588N1K845M553N409N513N264O148R430J3989J7220J8385
59371A124631J9294K1235K3275K4397K5269K6581K7434K7044K6681K8032L0703
59360A404576L3003L4427L5734L7285L8934M1081M4205M7683N0455N2654N5281
$$ plain form
59349 1875318 1933980 1996475 2063483 2136160 2215144 2299940 2389722 2483962 2581864 2682217 2784652
59338 2784652 2890038 2998587 3108261 3216203 3321262 3423783 3523074 3616388 3700763 3775065
59328 3775065 3839887 3896099 3943924 3982982 4012723 4032928 4044035 4046871 4041745 4027633 4002346 3963669
59316 3963669 3910508 3843104 3762504 3670330 3569040 3461652 3350566 3236979 3121950 3007592
59306 3007592 2896376 2789410 2686351 2587018 2492151 2402393 2317528 2237251 2162028 2092585 2029003
59295 2029003 1970889 1918114 1870953 1829550 1793360 1760917 1730312 1700491 1672120 1646579 1624078
59284 1624078 1603561 1584474 1567556 1553418 1541364 1530400 1520663 1512988 1507631 1504146 1502054 1500792
59272 1500792 1499422 1497390 1495482 1495306 1497852 1502971 1509886 1517466 1524352 1529748 1534195 1538760 1543437 1547116
$$ packed form
59349A875318N8662O2495O7008P2677P8984Q4796Q9782R4240R7902J00353J02435
59338B784652J05386J08549J09674J07942J05059J02521R9291R3314Q4375P4302
59328C775065O4822N6212M7825L9058K9741K0205J1107K836n126j4112k5287l8677
59316C963669n3161o7404q0600r2174j01290j07388j11086j13587j15029j14358
59306C007592j11216j06966j03059r9333r4867q9758q4865q0277p5223o9443o3582
59295B029003n8114n2775m7161m1403l6190l2443l0605k9821k8371k5541k2501
59284A624078k0517j9087j6918j4138j2054j0964r737p675n357l485k092j262
59272A500792j370k032j908j76K546N119O915P580O886N396M447M565M677L679
$$ plain form
59258 1547116 1549263 1550680 1552050 1552445 1550101 1544524 1537072 1529298 1521339 1512298 1501763 1490183 1477698
59245 1477698 1463370 1446091 1425844 1403592 1380380 1357245 1335495 1315925 1297731 1279338 1260556
59234 1260556 1242836 1226989 1211819 1195849 1179309 1163417 1148585 1134712 1122656 1113761 1107871 1103158
59222 1103158 1098212 1093104 1088121 1082743 1076758 1071438 1068448 1067852 1068040 1067606 1066647 1066218 1067128 1069541 1073409
59207 1073409 1078996 1086901 1097536 1110550 1124947 1139990 1155908 1173499 1193312 1215618 1241063 1270587
59195 1270587 1304384 1341554 1381334 1424281 1471529 1523183 1578339 1636585 1698316 1763268 1829856
59184 1829856 1896747 1964214 2032839 2101399 2167114 2227755 2282475 2330756 2371616 2403945 2426649
59173 2426649 2438323 2437734 2424952 2401282 2368026 2326214 2277538 2224215 2167401 2106951 2043505 1979703
$$ packed form
59258A547116K147J417J370L95k344n577p452p774p959r041j0535j1580j2485
59245A477698j4328j7279k0247k2252k3212k3135k1750j9570j8194j8393j8782
59234A260556j7720j5847j5170j5970j6540j5892j4832j3873j2056q895n890m713
59222A103158m946n108m983n378n985n320k990n96J88m34r59m29R10K413L868
59207A073409N587P905J0635J3014J4397J5043J5918J7591J9813K2306K5445K9524
59195A270587L3797L7170L9780M2947M7248N1654N5156N8246O1731O4952O6588
59184A829856O6891O7467O8625O8560O5715O0641N4720M8281M0860L2329K2704
59173B426649J1674n89j2782k3670l3256m1812m8676n3323n6814o0450o3446o3802
$$ plain form
59161 1979703 1918277 1859701 1802869 1747440 1694319 1644230 1597197 1553456 1513749 1478441 1447225
59150 1447225 1419901 1396600 1376856 1359200 1342247 1325812 1310550 1296767 1284018 1271745 1259988
59139 1259988 1249387 1240638 1233929 1228923 1225282 1223084 1222445 1222677 1222156 1219438 1214602 1209354 1205659 1204409
59125 1204409 1205412 1208227 1212432 1217228 1221576 1225057 1228075 1230953 1233607 1236549 1241128 1247657 1254047 1257840
59111 1257840 1259361 1261215 1264540 1267509 1268074 1266580 1264628 1262720 1260340 1257437 1254445 1251371 1248080 1245045
59097 1245045 1242661 1240175 1236493 1231861 1227563 1224061 1220613 1216868 1213626 1211647 1210604 1209672 1208410 1206630
59083 1206630 1204064 1200809 1197790 1196224 1196652 1198560 1200767 1202125 1202211 1201627 1201436 1202080 1202840 1202414 1200050 1196240
59067 1196240 1192489 1190254 1189775 1189880 1189085 1186927 1184124 1181497 1178882 1175204 1169602 1162468 1155183 1148805 1143212
$$ packed form
59161A979703o1426n8576n6832n5429n3121n0089m7033m3741l9707l5308l1216
59150A447225k7324k3301j9744j7656j6953j6435j5262j3783j2749j2273j1757
59139A259988j0601q749o709n006l641k198o39K32n21k718m836n248l695j250
59125A204409J003K815M205M796M348L481L018K878K654K942M579O529O390L793
59111A257840J521J854L325K969N65j494j952j908k380k903k992l074l291l035
59097A245045k384k486l682m632m298l502l448l745l242j979j043r32j262j780
59083A206630k566l255l019j566M28J908K207J358Q6n84j91O44P60m26k364l810
59067A196240l751k235m79J05p95k158k803k627k615l678n602p134p285o378n593
$$ plain form
59052 1143212 1137711 1131971 1125793 1118455 1109439 1099714 1091052 1083653 1075676 1065859 1055465 1046562 1039299 1032235
59038 1032235 1024758 1017552 1010749 1003115 993597 982643 971549 961216 951840 943031 933856 923480 912360
59025 912360 902304 894779 889491 885034 880572 876291 872485 868990 865715 863093 861484 860320 858400 855166
59011 855166 851302 847909 845416 843537 841773 839469 835855 830767 825117 819786 814290 807593 800077 793309
58997 793309 787643 781691 775056 770024 769010 771122 772901 772116 769599 767540 767312 768955 771533 773746 775109
58982 775109 776733 780283 786090 793127 800783 809727 820810 834046 849032 865574 883442 901986 920360
58969 920360 937805 953595 967192 978755 989165 999413 1010058 1021088 1031816 1041039 1047913 1052835
58957 1052835 1057083 1061635 1066699 1072160 1077740 1082704 1086057 1087196 1086022 1082570 1077215 1071192 1066091 1062469
$$ packed form
59052A143212n501n740o178p338r016r725q662p399p977r817j0394q903p263p064
59038A032235p477p206o803p634r518j0954j1094j0333r376q809r175j0376j1120
59025I12360j0056p525n288m457m462m281l806l495l275k622j609j164j920l234
59011H55166l864l393k493j879j764k304l614n088n650n331n496o697p516o768
58997G93309n666n952o635n032j014K112J779p85k517k059k28J643K578K213J363
58982G75109J624L550N807P037P656Q944J1083J3236J4986J6542J7868J8544J8374
58969I20360J7445J5790J3597J1563J0410J0248J0645J1030J0728R223O874M922
58957A052835M248M552N064N461N580M964L353J139j174l452n355o023n101l622
$$ plain form
58943 1062469 1059529 1056361 1052946 1049725 1046790 1044082 1042066 1041699 1043602 1047451 1052338 1057869 1064840 1074452
58929 1074452 1086684 1099874 1112252 1123504 1134439 1145634 1157134 1169134 1182101 1196238 1211467
58918 1211467 1227952 1246095 1266055 1287713 1310985 1335659 1361267 1387768 1416179 1447780 1482769
58907 1482769 1520335 1559858 1601317 1644684 1689743 1736480 1784823 1833812 1881443 1925275 1962966
58896 1962966 1993144 2016900 2037945 2059821 2082888 2105180 2126011 2147212 2170651 2196243 2223204
58885 2223204 2251949 2283793 2319565 2359232 2402056 2446455 2490549 2533685 2576876 2621087 2665765
58874 2665765 2709733 2752809 2795603 2838117 2879366 2918123 2953283 2983630 3007851 3024901 3034168
58863 3034168 3035634 3030253 3019934 3006684 2991803 2975913 2959238 2941433 2921589 2899010 2873963 2847317
$$ packed form
58943A062469k940l168l415l221k935k708k016l67J903L849M887N531O971R612
58929A074452J2232J3190J2378J1252J0935J1195J1500J2000J2967J4137J5229
58918A211467J6485J8143J9960K1658K3272K4674K5608K6501K8411L1601L4989
58907A482769L7566L9523M1459M3367M5059M6737M8343M8989M7631M3832L7691
58896A962966L0178K3756K1045K1876K3067K2292K0831K1201K3439K5592K6961
58885B223204K8745L1844L5772L9667M2824M4399M4094M3136M3191M4211M4678
58874B665765M3968M3076M2794M2514M1249L8757L5160L0347K4221J7050R267
58863C034168J466n381j0319j3250j4881j5890j6675j7805j9844k2579k5047k6646
$$ plain form
58851 2847317 2819537 2790441 2759920 2728472 2696680 2664218 2629811 2592586 2553311 2513721 2474648
58840 2474648 2435489 2395591 2355037 2313665 2270747 2226850 2184814 2147108 2112763 2078805 2044421
58829 2044421 2011728 1982441 1956011 1931715 1910498 1893391 1879419 1866484 1853525 1840934 1829559
58818 1829559 1820140 1812978 1807497 1802799 1799141 1797988 1800093 1804532 1810244 1817285 1825659 1834105 1841372 1847962
58804 1847962 1855436 1864511 1874772 1885680 1896822 1907778 1918742 1930875 1945115 1961094 1978084 1996378
58792 1996378 2016626 2038358 2060487 2083200 2108217 2136891 2168772 2202151 2235614 2269101 2303689
58781 2303689 2340173 2377795 2414936 2451065 2487033 2523187 2558526 2592330 2625138 2656911 2685744
58770 2685744 2710233 2732111 2754340 2776884 2796392 2810161 2818600 2823452 2825344 2823790 2818318 2808712
$$ packed form
58851B847317k7780k9096l0521l1448l1792l2462l4407l7225l9275l9590l9073
58840B474648l9159l9898m0554m1372m2918m3897m2036l7706l4345l3958l4384
58829B044421l2693k9287k6430k4296k1217j7107j3972j2935j2959j2591j1375
58818A829559r419p162n481m698l658j153K105M439N712P041Q374Q446P267O590
58804A847962P474R075J0261J0908J1142J0956J0964J2133J4240J5979J6990J8294
58792A996378K0248K1732K2129K2713K5017K8674L1881L3379L3463L3487L4588
58781B303689L6484L7622L7141L6129L5968L6154L5339L3804L2808L1773K8833
58770B685744K4489K1878K2229K2544J9508J3769Q439M852J892j554n472r606
$$ plain form
58758 2808712 2794940 2777444 2756888 2733306 2706212 2675783 2643070 2608631 2571721 2531386 2487820
58747 2487820 2442220 2395662 2348532 2300818 2252741 2205129 2159023 2114618 2070908 2026978 1983397
58736 1983397 1941664 1902363 1864628 1827378 1790281 1753418 1716864 1680956 1646336 1613371 1581849
58725 1581849 1551381 1521797 1493177 1465950 1440784 1417818 1396141 1374799 1354152 1335413 1318914
58714 1318914 1303906 1290232 1278895 1270333 1263226 1255990 1248724 1242632 1237995 1233866 1229570 1225186 1220033
58701 1220033 1211638 1197222 1176099 1150066 1121529 1091883 1061820 1032333 1004491 978354 953005
58690 953005 928073 904730 884766 868911 856371 845737 836079 827402 820413 815687 812877 811036 809902
58677 809902 810461 813811 819801 827214 834961 842430 848837 852957 853774 851094 845377 837107 826395 813187
$$ packed form
58758B808712j3772j7496k0556k3582k7094l0429l2713l4439l6910m0335m3566
58747B487820m5600m6558m7130m7714m8077m7612m6106m4405m3710m3930m3581
58736A983397m1733l9301l7735l7250l7097l6863l6554l5908l4620l2965l1522
58725A581849l0468k9584k8620k7227k5166k2966k1677k1342k0647j8739j6499
58714A318914j5008j3674j1337q562p107p236p266o092m637m129m296m384n153
58701A220033q395j4416k1123k6033k8537k9646l0063k9487k7842k6137k5349
58690I53005k4932k3343j9964j5855j2540j0634r658q677o989m726k810j841j134
58677H09902N59L350N990P413P747P469O407M120Q17k680n717q270j0712j3208
$$ plain form
58663 813187 797940 781941 766524 752002 737906 724453 712984 704415 697896 691696 684954 677794
58651 677794 670115 661303 651264 641039 632106 625330 620627 617241 614319 611428 608587 605926 603638 602340
58637 602340 602852 605266 608679 612163 615556 618943 622051 624705 627312 630237 633187 635821 638492 641623
58623 641623 644920 647929 650924 654358 657991 661562 665899 672110 679801 687235 693367 698778 704598 711483
58609 711483 719683 729089 738905 748188 757095 766860 778171 790147 801228 810547 818188 824713 830854
58596 830854 837279 844165 851045 857213 862332 866834 871854 878535 887171 897258 908498 921181 935310
58583 935310 950073 964831 979966 995881 1011626 1025629 1037619 1048929 1060875 1073514 1085810
58572 1085810 1096280 1103677 1107909 1110363 1112759 1115810 1119482 1123918 1129158 1134239 1137698 1138902 1138134 1135706
$$ packed form
58663H13187j5247j5999j5417j4522j4096j3453j1469q569o519o200o742p160
58651F77794p679q812j0039j0225q933o776m703l386k922k891k841k661k288j298
58637F02340N12K414L413L484L393L387L108K654K607K925K950K634K671L131
58623F41623L297L009K995L434L633L571M337O211P691P434O132N411N820O885
58609G11483Q200R406R816R283Q907R765J1311J1976J1081R319P641O525O141
58596H30854O425O886O880O168N119M502N020O681Q636J0087J1240J2683J4129
58583I35310J4763J4758J5135J5915J5745J4003J1990J1310J1946J2639J2296
58572A085810J0470P397M232K454K396L051L672M436N240N081L459J204p68k428
$$ plain form
58558 1135706 1132045 1128326 1125644 1123438 1119896 1114103 1106835 1099152 1091262 1082957 1074160 1064779 1054790 1044550
58544 1044550 1034196 1022829 1009375 994299 979322 965385 952130 939563 928773 920350 913193 905652
58532 905652 897049 887649 878025 869012 861400 854968 848507 841325 834150 828068 823179 818745 814137 809279
58518 809279 804686 801304 799776 799697 800177 801070 802803 804958 806187 805878 804883 804143 803593 802986 802790 803563 805258
58501 805258 807830 811747 817018 822323 826091 828308 830666 834927 841363 848596 854855 859687 864356 870098
58487 870098 876218 880775 883032 884150 885302 886275 886416 885907 885455 885533 886568 889020 892543 895672 897065 896711
58471 896711 895488 894118 892928 892091 891618 891515 892193 894096 896719 898766 899665 900135 900889 901715 902439 903944
58455 903944 907312 912502 918630 925215 932425 940281 948287 955910 963121 970387 978053 985617 991878 996160
$$ packed form
58558A135706l661l719k682k206l542n793p268p683p890q305q797r381r989j0240
58544A044550j0354j1367j3454j5076j4977j3937j3255j2567j0790q423p157p541
58532I05652q603r400r624r013p612o432o461p182p175o082m889m434m608m858
58518H09279m593l382j528p9M80Q93J733K155J229l09r95p40n50o07j96P73J695
58501H05258K572L917N271N305L768K217K358M261O436P233O259M832M669N742
58487H70098O120M557K257J118J152R73J41n09m52P8J035K452L523L129J393l54
58471H96711j223j370j190q37m73j03O78J903K623K047Q99M70P54Q26P24J505
58455I03944L368N190O128O585P210P856Q006P623P211P266P666P564O261M282
$$ plain form
58441 996160 999098 1001743 1004311 1006607 1009147 1012769 1017331 1021931 1026232 1030428 1034166 1037053 1040182 1045492
58427 1045492 1053335 1062237 1071294 1080998 1091229 1100481 1108106 1115621 1124477 1133864 1142057 1148819 1155198 1161947
58413 1161947 1169336 1177709 1187025 1196427 1205249 1213818 1222546 1231102 1239390 1248470 1259473 1272235 1285789
58400 1285789 1299468 1312756 1324976 1336170 1347663 1360773 1375427 1390647 1405737 1420361 1434234
58389 1434234 1447474 1460630 1473908 1487153 1500910 1516265 1533145 1550082 1566403 1583187 1601133
58378 1601133 1618942 1635140 1650330 1666302 1683939 1703211 1724171 1746423 1768279 1787834 1804594
58367 1804594 1819385 1833382 1847905 1864077 1881840 1900107 1918494 1937697 1957772 1977782 1997950
58356 1997950 2020103 2044749 2069787 2093732 2118177 2144954 2172777 2199163 2224186 2249733 2276142
$$ packed form
58441I96160K938K645K568K296K540L622M562M600M301M196L738K887L129N310
58427A045492P843Q902R057R704J0231R252P625P515Q856R387Q193O762O379O749
58413A161947P389Q373R316R402Q822Q569Q728Q556Q288R080J1003J2762J3554
58400A285789J3679J3288J2220J1194J1493J3110J4654J5220J5090J4624J3873
58389A434234J3240J3156J3278J3245J3757J5355J6880J6937J6321J6784J7946
58378A601133J7809J6198J5190J5972J7637J9272K0960K2252K1856J9555J6760
58367A804594J4791J3997J4523J6172J7763J8267J8387J9203K0075K0010K0168
58356A997950K2153K4646K5038K3945K4445K6777K7823K6386K5023K5547K6409
$$ plain form
58345 2276142 2302242 2327883 2353836 2379832 2405214 2431156 2459830 2491595 2525099 2559714 2595651
58334 2595651 2632122 2667921 2703774 2741736 2782133 2823270 2864292 2906099 2949167 2992533 3035483
58323 3035483 3078433 3121729 3165244 3209538 3255839 3304418 3354428 3405662 3459058 3515035 3572496
58312 3572496 3629960 3686839 3743586 3801426 3861791 3925130 3990480 4056861 4124567 4194342 4266265
58301 4266265 4340406 4417333 4496615 4576120 4654595 4733866 4816625 4903085 4991791 5082638 5176781
58290 5176781 5274371 5374740 5478156 5585031 5694051 5803550 5914334 6028874 6148169 6271599
58280 6271599 6399206 6531641 6668379 6808440 6952445 7101608 7255496 7413359 7576856
58271 7576856 7748560 7928394 8114489 8306826 8506868 8714240 8927374 9147152 9376333
$$ packed form
58345B276142K6100K5641K5953K5996K5382K5942K8674L1765L3504L4615L5937
58334B595651L6471L5799L5853L7962M0397M1137M1022M1807M3068M3366M2950
58323C035483M2950M3296M3515M4294M6301M8579N0010N1234N3396N5977N7461
58312C572496N7464N6879N6747N7840O0365O3339O5350O6381O7706O9775P1923
58301D266265P4141P6927P9282P9505P8475P9271Q2759Q6460Q8706R0847R4143
58290E176781R7590J00369J03416J06875J09020J09499J10784J14540J19295J23430
58280F271599J27607J32435J36738J40061J44005J49163J53888J57863J63497
58271G576856J71704J79834J86095J92337K00042K07372K13134K19778K29181
$$ plain form
58262 9376333 9615411 9862537 10117558 10382558 10658288 10943798 11239936 11549589 11873905
58253 11873905 12211746 12563270 12930634 13314717 13714779 14131809 14568648 15026391 15504414
58244 15504414 16004424 16530611 17085223 17667818 18279463 18923851 19603796 20320593 21077199
58235 21077199 21877890 22724713 23618906 24566010 25574624 26649920 27793751 29011391 30312196
58226 30312196 31702920 33186470 34767939 36455620 38255972 40175553 42229760 44442770
58218 44442770 46838196 49438089 52272026 55377988 58793418 62555912 66713718 71323966
58210 71323966 76441307 82125176 88460403 95551759 103497124 112390591 122341285 133409077
58202 133409077 145447694 158037283 170674737 183108653 195510082 208337895 222070995
$$ packed form
58262I376333K39078K47126K55021K65000K75730K85510K96138L09653L24316
58253A1873905L37841L51524L67364L84083M00062M17030M36839M57743M78023
58244A5504414N00010N26187N54612N82595O11645O44388O79945P16797P56606
58235B1077199Q00691Q46823Q94193R47104J008614J075296J143831J217640J300805
58226C0312196J390724J483550J581469J687681J800352J919581K054207K213010
58218D4442770K395426K599893K833937L105962L415430L762494M157806M610248
58210G1323966N117341N683869O335227P091356P945365Q893467R950694J1067792
58202A33409077J2038617J2589589J2637454J2433916J2401429J2827813J3733100
$$ plain form
58195 222070995 237043861 253422569 271213188 290249676 310195313 330569535 350765913
58188 350765913 370055677 387613969 402583984 414154286 421633963 424532923 422636439
58181 422636439 416038051 405114997 390467418 372844722 353064318 331930057 310169555
58174 310169555 288400133 267114468 246677761 227337815 209245378 192474193 177036824
58167 177036824 162901300 150008229 138281749 127634899 117976536 109218805 101278284
58160 101278284 94073167 87525500 81566863 76137899 71182843 66649742 62496137 58688712
58152 58688712 55195502 51982863 49021248 46288851 43766961 41435551 39275649 37272171
58144 37272171 35411478 33678931 32061421 30549885 29136949 27814170 26573631 25410032
$$ packed form
58195B22070995J4972866J6378708J7790619J9036488J9945637K0374222K0196378
58188C50765913J9289764J7558292J4970015J1570302P479677K898960j896484
58181D22636439o598388j0923054j4647579j7622696j9780404k1134261k1760502
58174C10169555k1769422k1285665k0436707j9339946j8092437j6771185j5437369
58167A77036824j4135524j2893071j1726480j0646850r658363q757731p940521
58160A01278284p205117o547667n958637n428964m955056m533101m153605l807425
58152E8688712l493210l212639k961615k732397k521890k331410k159902k003478
58144C7272171j860693j732547j617510j511536j412936j322779j240539j163599
$$ plain form
58136 25410032 24318774 23293578 22328017 21417820 20559607 19748665 18980081 18251204 17561240
58127 17561240 16908928 16291830 15707136 15151877 14622978 14118110 13636073 13175721 12735353
58118 12735353 12313804 11911226 11527936 11163128 10815230 10482626 10163536 9856191 9559926
58109 9559926 9275425 9003166 8742225 8491029 8248697 8015234 7791016 7576407 7371282
58100 7371282 7174667 6985329 6802739 6626922 6457689 6294841 6138686 5989114 5844492
58091 5844492 5702926 5564530 5430874 5302233 5177222 5055383 4938155 4826407 4718742
58082 4718742 4613266 4509709 4408771 4310629 4215137 4122454 4032359 3943905 3856847 3772613 3692675
58071 3692675 3616561 3542487 3469447 3397674 3327455 3258667 3191524 3126945 3065800 3007999 2952369
$$ packed form
58136B5410032j091258j025196r65561r10197q58213q10942p68584p28877o89964
58127A7561240o52312o17098n84694n55259n28899n04868m82037m60352m40368
58118A2735353m21549m02578l83290l64808l47898l32604l19090l07345k96265
58109I559926k84501k72259k60941k51196k42332k33463k24218k14609k05125
58100G371282j96615j89338j82590j75817j69233j62848j56155j49572j44622
58091E844492j41566j38396j33656j28641j25011j21839j17228j11748j07665
58082D718742j05476j03557j00938r8142r5492r2683r0095q8454q7058q4234p9938
58071C692675p6114p4074p3040p1773p0219o8788o7143o4579o1145n7801n5630
$$ plain form
58060 2952369 2897567 2843358 2790813 2740739 2692135 2643021 2592808 2542939 2495047 2449376 2405193
58049 2405193 2361715 2318329 2274910 2232480 2192606 2155565 2119809 2083765 2047428 2011734 1977111
58038 1977111 1943284 1909877 1876699 1843913 1812240 1782461 1754453 1727312 1700415 1673489 1645739
58027 1645739 1616334 1586177 1557718 1532196 1508224 1483934 1459332 1435627 1413430 1392733 1373575
58016 1373575 1355325 1336311 1315714 1295278 1277531 1262676 1248673 1234168 1219739 1206194 1193112
58005 1193112 1179593 1165472 1151358 1138108 1126407 1116174 1106209 1095115 1082787 1070528 1059652
57994 1059652 1050496 1042720 1035852 1029396 1023032 1016952 1011650 1007290 1003530 999897 996084 992180 988972 987588
57980 987588 988136 988993 988287 985922 983389 981747 980797 980218 980335 981235 982071 981972 981091 980047 978671 976040 971745
$$ packed form
58060B952369n4802n4209n2545n0074m8604m9114n0213m9869m7892m5671m4183
58049B405193m3478m3386m3419m2430l9874l7041l5756l6044l6337l5694l4623
58038A977111l3827l3407l3178l2786l1673k9779k8008k7141k6897k6926k7750
58027A645739k9405l0157k8459k5522k3972k4290k4602k3705k2197k0697j9158
58016A373575j8250j9014k0597k0436j7747j4855j4003j4505j4429j3545j3082
58005A193112j3519j4121j4114j3250j1701j0233r965j1094j2328j2259j0876
57994A059652r156p776o868o456o364o080n302m360l760l633l813l904l208j384
57980I87588N48Q57p06k365k533j642r50n79J17R00Q36r9q81j044j376k631m295
$$ plain form
57963 971745 966506 961177 955296 947115 935450 921433 907824 896270 885642 873489 858680 842101
57951 842101 825310 809485 795419 783302 772217 760773 748786 737673 728786 721920 715831 709671
57939 709671 703450 697586 692511 688343 684515 680123 674978 669825 665082 659915 653238 645122 636331 626870
57925 626870 616134 604491 593599 584576 576619 568074 558415 548606 539813 532400 526212 521313 518140
57912 518140 517000 517472 518443 518899 518727 518519 518587 518533 518068 517868 519118 522211 526259 529931 532445 533662 533555
57895 533555 531922 528595 523731 517869 511689 505767 500521 496235 492859 489744 485843 480306 472731 462975
57881 462975 451450 439941 431160 426249 422933 417418 408388 398060 389034 381399 373807 366091 359255
57868 359255 353459 347823 342456 339183 339407 342098 344754 345956 346392 347614 350417 354400 358652 362584 366106
$$ packed form
57963I71745n239n329n881q181j1665j4017j3609j1554j0628j2153j4809j6579
57951H42101j6791j5825j4066j2117j1085j1444j1987j1113q887o866o089o160
57939G09671o221n864n075m168l828m392n145n153m743n167o677q116q791r461
57925F26870j0736j1643j0892r023p957q545r659r809q793p413o188m899l173
57912E18140j140M72R71M56j72k08O8n4m65k00J250L093M048L672K514J217j07
57895E33555j633l327m864n862o180n922n246m286l376l115l901n537p575r756
57881D62975j1525j1509q781m911l316n515r030j0328r026p635p592p716o836
57868C59255n796n636n367l273K24K691K656J202M36J222K803L983M252L932L522
$$ plain form
57853 366106 369077 370878 370860 369132 366544 363815 361034 358139 355558 354132 354456 356316 358710 360525 361402
57838 361402 361777 361976 361707 360926 360685 362198 365193 368221 370767 374026 378939 384226 387178 386103 381452
57823 381452 374835 367570 360185 352877 346153 340826 337086 333823 329527 324046 318762 314755 311492 307817
57809 307817 303612 299758 296860 294709 292832 291018 289431 288579 288987 290552 292518 294415 296644 299743 303560
57794 303560 307655 311965 316493 320827 324679 328407 332154 334980 335915 335654 336060 338041 340955 344025 347077
57779 347077 349594 350257 348078 343366 337261 331065 326176 323509 322292 320317 316136 310438 304738 299496
57765 299496 294301 289101 284134 279015 272985 266092 259400 254145 251245 251260 253791 256967 258530 257764 255775
57750 255775 253856 252372 251441 251667 253518 256488 259572 262238 264453 266166 267442 268906 271241 274232 276904
$$ packed form
57853C66106K971J801j8j728k588k729k781k895k581j426L24J860K394J815Q77
57838C61402L75J99k69p81k41J513K995L028K546L259M913N287K952j075m651
57823C81452o617p265p385p308o724n327l740l263m296n481n284m007l263l675
57809C07817m205l854k898k151j877j814j587q52M08J565J966J897K229L099L817
57794C03560M095M310M528M334L852L728L747K826R35k61M06J981K914L070L052
57779C47077K517O63k179m712o105o196m889k667j217j975m181n698n700n242
57765B99496n195n200m967n119o030o893o692n255k900J5K531L176J563p66j989
57750B55775j919j484r31K26J851K970L084K666K215J713J276J464K335K991K672
$$ plain form
57735 276904 278753 280226 281714 282750 282755 282187 282243 283535 285781 288839 293273 299363 306101 311859 315993 319187
57719 319187 322174 324688 325977 325975 325460 325094 324719 323806 322372 321019 319970 318491 315725 312046 309053 308016
57703 308016 308721 310086 311549 313412 316111 319642 323536 326887 328534 327824 325296 322063 318470 313907 308193
57688 308193 302577 298949 298326 300327 303791 307599 311336 315647 321840 330791 342352 356090 372354 392260
57674 392260 416872 446858 482860 525676 576028 634441 701227 775628 854016 928691 989043
57663 989043 1025090 1031507 1009733 966939 912752 855973 802913 757274 720482 692072 670472 654214
57651 654214 642751 636190 634356 636289 640732 646952 654843 664140 673862 682921 691293 700149 710566 722337
57637 722337 734247 745290 755174 763794 770883 776546 781677 787124 792354 795501 795137 791675 786593 780557
$$ packed form
57735B76904J849J473J488J036Nn68N6J292K246L058M434O090O738N758M134L194
57719C19187K987K514J289kn15l66l75r13j434j353j049j479k766l679k993j037
57703C08016P05J365J463J863K699L531L894L351J647p10k528l233l593m563n714
57688C08193n616l628o23K001L464L808L737M311O193Q951J1561J3738J6264J9906
57674C92260K4612K9986L6002M2816N0352N8413O6786P4401P8388P4675O0352
57663I89043L6047O417k1774m2794n4187n6779n3060m5639l6792k8410k1600j6258
57651F54214j1463o561j834J933M443O220P891R297R722R059Q372Q856J0417J1771
57637G22337J1910J1043R884Q620P089N663N131N447N230L147l64l462n082o036
$$ plain form
57623 780557 773020 763606 752998 741977 730335 717508 703893 690695 678681 667916 658664 651522
57611 651522 646318 641702 636420 630622 625449 621665 618987 616427 613017 608600 604244 601509 600946 601583 602085
57596 602085 601932 601163 599702 597812 596818 598290 602248 606828 610121 612064 614272 618222 623905 630165 636049
57581 636049 641503 646811 651869 656450 660837 665441 669847 672998 674404 674364 672754 668664 661846 653628 645614
57566 645614 638093 630440 622262 613222 602505 589824 576571 564633 554148 543637 532278 520773
57554 520773 509912 499617 489734 480502 471598 461823 450604 439184 429685 423292 419581 416983 413634
57541 413634 408448 401937 395618 390483 386493 383379 380897 378182 374157 369168 365091 363103 362305 361343 360326
57526 360326 360135 360744 361469 362159 362811 362618 360903 358788 358514 360972 365133 369902 375147 380586 385047 387769
$$ packed form
57623G80557p537r414j0608j1021j1642j2827j3615j3198j2014j0765r252p142
57611F51522n204m616n282n798n173l784k678k560l410m417m356k735n63O37N02
57596F02085j53p69j461j890r94J472L958M580L293J943K208L950N683O260N884
57581F36049N454N308N058M581M387M604M406L151J406m0j610m090o818q218q014
57566F45614p521p653q178r040j0717j2681j3253j1938j0485j0511j1359j1505
57554E20773j0861j0295r883r232q904r775j1219j1420r499o393l711k598l349
57541D13634n186o511o319n135l990l114k482k715m025m989m077j988p98r62j017
57526C60326j91O09P25O90O52j93j715k115k74K458M161M769N245N439M461K722
$$ plain form
57510 387769 389612 392148 395943 400242 404041 406993 409555 412622 416788 421740 426514 430528 434039 437556
57496 437556 441274 445438 450727 457625 465374 472211 477062 480967 486384 494801 505125 514729 521993 527413
57482 527413 532315 537276 542109 546542 550084 551741 550829 547945 544419 540876 537010 532517 527352 521139
57468 521139 513415 504650 496037 487919 479374 469892 460585 453066 447720 443719 440082 435920 430359 423375
57454 423375 416533 411677 408663 405297 399941 393546 388655 386855 387720 389775 391739 392882 393050 392932 394000
57439 394000 397465 402971 408611 412627 415151 418078 423147 430180 437325 443107 448071 454131 462185 470760
57425 470760 477497 481759 485042 488838 493062 497086 501280 506335 511461 514606 514719 512853 510631 508317
57411 508317 504890 499436 491992 483372 474503 465703 456344 445582 433668 422139 412362 404125 395998
$$ packed form
57510C87769J843K536L795M299L799K952K562L067M166M952M774M014L511L517
57496D37556L718M164N289O898P749O837M851L905N417Q417J0324R604P264N420
57482E27413M902M961M833M433L542J657r12k884l526l543l866m493n165o213
57468E21139p724q765q613q118q545r482r307p519n346m001l637m162n561o984
57454D23375o842m856l014l366n356o395m891j800Q65K055J964J143J68j18J068
57439C94000L465N506N640M016K524K927N069P033P145N782M964O060Q054Q575
57425D70760O737M262L283L796M224M024M194N055N126L145J13j866k222k314
57411E08317l427n454p444q620q869q800r359j0762j1914j1529r777q237q127
$$ plain form
57398 395998 386889 376933 367089 358128 349946 341700 332734 323460 315067 308309 302837 297863 293076 288667
57384 288667 284667 280625 275812 269775 262971 256880 253076 251891 252219 252688 252705 252292 251519 250362 248731 246397
57368 246397 243334 240318 238507 237974 237264 235023 231664 228736 227097 226411 226166 226203 226248 225785 224715 223548
57352 223548 222556 221190 218836 215988 214176 214468 216125 217103 216006 213303 210346 207660 204915 202316 200873
57337 200873 200942 201510 201535 201159 200882 200348 198944 196975 195209 193734 192330 191522 191950 192933 193091 192468 192626 194277
57319 194277 196148 196778 196369 196100 196512 197373 198460 199664 200749 201657 202696 203966 205085 205875 206757 207947
57303 207947 208874 209113 209367 210723 213202 215818 217856 219360 220499 221253 221857 222939 224976 227937 231456
57288 231456 235094 238456 241380 244056 246745 249498 252361 255647 259754 264812 270707 277130 283337 288300
$$ packed form
57398C95998r109r956r844q961q182q246q966r274q393o758n472m974m787m409
57384B88667m000m042m813o037o804o091l804j185L28M69J7m13p73j157j631k334
57368B46397l063l016j811n33p10k241l359k928j639o86k45L7M5m63j070j167
57352B23548r92j366k354k848j812K92J657R78j097k703k957k686k745k599j443
57337B00873O9N68K5l76k77n34j404j969j766j475j404q08M28R83J58o23J58J651
57319A94277J871O30m09k69M12Q61J087J204J085R08J039J270J119P90Q82J190
57303B07947R27K39K54J356K479K616K038J504J139P54O04J082K037K961L519
57288B31456L638L362K924K676K689K753K863L286M107N058N895O423O207M963
$$ plain form
57274 288300 291601 293997 296628 299835 303158 306217 309109 312134 315639 319781 323888 326461 326676 325667
57260 325667 325294 325657 324967 322195 318774 317059 317925 320636 324303 328380 331935 333574 332596 329901 327412
57245 327412 326521 327112 328049 328656 329505 331498 334458 337238 339231 341122 343902 347824 352583 357792 362750
57230 362750 366504 368937 371356 375167 380244 385407 390186 395200 400913 407008 413109 419212 425163 430589
57216 430589 435729 441546 448501 455827 462561 468813 475430 482832 490763 498880 507041 515250 523863 533548
57202 533548 544417 555300 564651 572335 580005 589571 601692 615766 630737 645557 659416 672240
57190 672240 684970 698824 714053 729643 744387 758040 771215 784384 797461 810475 824107
57179 824107 839061 855119 871418 887649 904415 922265 940921 959821 978980 998947 1020221
$$ packed form
57274B88300L301K396K631L207L323L059K892L025L505M142M107K573K15j009
57260C25667l73L63o90k772l421j715Q66K711L667M077L555J639r78k695k489
57245C27412q91N91R37O07Q49J993K960K780J993J891K780L922M759N209M958
57230C62750L754K433K419L811N077N163M779N014N713O095O101O103N951N426
57216D30589N140N817O955P326O734O252O617P402P931Q117Q161Q209Q613R685
57202E33548J0869J0883R351P684P670R566J2121J4074J4971J4820J3859J2824
57190F72240J2730J3854J5229J5590J4744J3653J3175J3169J3077J3014J3632
57179H24107J4954J6058J6299J6231J6766J7850J8656J8900J9159J9967K1274
$$ plain form
57168 1020221 1043096 1067666 1093454 1119309 1144297 1168756 1194063 1221435 1251228 1283099 1316197
57157 1316197 1349407 1382159 1415126 1449587 1485984 1523710 1562381 1602502 1644553 1688147 1732738
57146 1732738 1778812 1827706 1880282 1936064 1993593 2051514 2109638 2169219 2231884 2298078 2366830
57135 2366830 2437258 2509900 2586242 2667305 2753167 2843473 2937853 3036031 3138237 3245575 3359611
57124 3359611 3481460 3611493 3749698 3895924 4049931 4211855 4382755 4564367 4758226
57115 4758226 4965430 5187263 5425589 5682404 5959355 6258014 6580411 6929188 7307545
57106 7307545 7719378 8169330 8662354 9203116 9795803 10444446 11153361 11927343 12771479
57097 12771479 13690527 14688112 15766152 16924728 18162142 19474649 20855677 22294962
$$ packed form
57168A020221K2875K4570K5788K5855K4988K4459K5307K7372K9793L1871L3098
57157A316197L3210L2752L2967L4461L6397L7726L8671M0121M2051M3594M4591
57146A732738M6074M8894N2576N5782N7529N7921N8124N9581O2665O6194O8752
57135B366830P0428P2642P6342Q1063Q5862R0306R4380R8178J02206J07338J14036
57124C359611J21849J30033J38205J46226J54007J61924J70900J81612J93859
57115D758226K07204K21833K38326K56815K76951K98659L22397L48777L78357
57106G307545M11833M49952M93024N40762N92687O48643P08915P73982Q44136
57097A2771479R19048R97585J078040J158576J237414J312507J381028J439285
$$ plain form
57089 22294962 23778355 25288507 26805664 28307717 29769857 31164968 32464918 33641638
57081 33641638 34667555 35516436 36165361 36596657 36798496 36764786 36495658 35998158 35285663
57072 35285663 34376292 33291966 32058412 30704506 29260235 27754781 26215869 24669540
57064 24669540 23139248 21644703 20201578 18821879 17514186 16283829 15133617 14064806
57056 14064806 13077372 12169600 11338003 10578087 9885290 9255266 8683721 8166591 7700578
57047 7700578 7282934 6909547 6572475 6259730 5958826 5661893 5368144 5081769 4807626
57038 4807626 4548505 4305349 4078734 3869431 3677736 3502705 3342332 3194414 3057171
57029 3057171 2929297 2809842 2698231 2594120 2496985 2405958 2320214 2239340 2163132 2091329
$$ packed form
57089B2294962J483393J510152J517157J502053J462140J395111J299950J176720
57081C3641638J025917Q48881O48925M31296K01839l3710k69128m97500p12495
57072C5285663r09371j084326j233554j353906j444271j505454j538912j546329
57064B4669540j530292j494545j443125j379699j307693j230357j150212j068811
57056A4064806r87434r07772q31597p59916o92797o30024n71545n17130m66013
57047G700578m17644l73387l37072l12745l00904k96933k93749k86375k74143
57038D807626k59121k43156k26615k09303j91695j75031j60373j47918j37243
57029C057171j27874j19455j11611j04111r7135r1027q5744q0874p6208p1803
$$ plain form
57019 2091329 2023815 1960724 1901752 1845579 1790746 1737267 1686758 1640641 1598660 1559372 1521527
57008 1521527 1484499 1447876 1411403 1375321 1340269 1306698 1274612 1243868 1214445 1186441 1160003
56997 1160003 1135201 1111752 1088995 1066436 1044413 1023965 1005991 990521 976634 962908 948202
56986 948202 932516 917151 903599 892056 881219 869640 857001 843908 830780 817329 803045
56975 803045 787895 772571 758286 746179 736458 728005 719208 709509 699938 691850 685397 679629 673930
56962 673930 668704 664521 661301 658808 657481 657958 659766 661211 660880 658813 655871 652359 647800 641906 635069
56947 635069 627733 619829 611285 602801 595496 589789 585216 581515 579351 579469 581564 584620 588236 592833
56933 592833 598447 603961 607864 609410 608863 607081 605037 603115 600464 595507 587475 577019 565029 551662
$$ packed form
57019B091329o7514o3091n8972n6173n4833n3479n0509m6117m1981l9288l7845
57008A521527l7028l6623l6473l6082l5052l3571l2086l0744k9423k8004k6438
56997A160003k4802k3449k2757k2559k2023k0448j7974j5470j3887j3726j4706
56986I48202j5686j5365j3552j1543j0837j1579j2639j3093j3128j3451j4284
56975H03045j5150j5324j4285j2107r721q453q797r699r571q088o453n768n699
56962F73930n226m183l220k493j327M77J808J445l31k067k942l512m559n894o837
56947F35069p336p904q544q484p305n707m573l701k164J18K095L056L616M597
56933E92833N614N514L903J546n47j782k044j922k651m957q032j0456j1990j3367
$$ plain form
56919 551662 537118 522546 509097 496576 484175 472144 461450 451955 442548 433411 426558 423244
56907 423244 421954 420062 416758 413272 410692 408676 406204 402821 399168 396738 396881 399448 402605 404585
56893 404585 405520 407005 410126 414611 419802 425577 431963 438322 443443 446491 447857 449013 451195 453996
56879 453996 455646 455017 453019 451603 451789 453285 455593 458575 461996 465562 469620 475032 482045 490056 498829
56864 498829 509122 521414 534671 547211 558505 569238 579663 588802 595537 599749 601892 601952 599637
56851 599637 595613 591841 590091 590176 590067 588012 584537 582362 584443 592070 604482 619851 636501 653510
56837 653510 670554 687341 703202 717246 729009 738862 747481 754666 758849 758195 752279 742364 729901
56824 729901 715287 698478 680277 662221 645342 629889 616402 606127 599863 596971 596097 596463 598019
$$ packed form
56919E51662j4544j4572j3449j2521j2401j2031j0694r495r407r137o853l314
56907D23244j290j892l304l486k580k016k472l383l653k430J43K567L157J980
56893D04585R35J485L121M485N191N775O386O359N121L048J366J156K182K801
56879D53996J650o29j998j416J86J496K308K982L421L566M058N412P013Q011Q773
56864D98829J0293J2292J3257J2540J1294J0733J0425R139O735M212K143O0k315
56851E99637m024l772j750Q5j09k055l475k175K081P627J2412J5369J6650J7009
56837F53510J7044J6787J5861J4044J1763R853Q619P185M183o54n916r915j2463
56824G29901j4614j6809j8201j8056j6879j5453j3487j0275o264k892q74L66J556
$$ plain form
56811 598019 600771 604689 609995 616845 624551 631516 635996 636839 633772 627351 618485 607697 595046 580878
56797 580878 566208 551904 537983 524313 511601 500853 492118 484626 478058 472865 469387 467563 467492
56784 467492 469295 472219 474939 477084 479415 481965 482992 480570 474495 465877 455612 444253 432716
56771 432716 421809 411136 399461 386268 372261 358393 345156 332800 321518 311329 302362 295119
56759 295119 289707 284988 279463 273095 267292 262900 259349 256116 253754 252697 252110 250981 249441 247853
56745 247853 245471 241543 237271 234798 234189 233169 230384 227272 225741 225310 223889 220622 216657 213510 211764
56730 211764 211099 210593 209219 206952 205238 205463 207114 208372 208373 207808 207390 206990 206527 206495 207083 207748 208235 209113
56712 209113 210696 212210 212679 211953 210398 208398 206750 206508 207590 208431 208054 207562 208315 209503 209218 207416
$$ packed form
56811E98019K752L918N306O850P706O965M480Q43l067o421q866j0788j2651j4168
56797E80878j4670j4304j3921j3670j2712j0748q735p492o568n193l478j824p1
56784D67492J803K924K720K145K331K550J027k422o075q618j0265j1359j1537
56771D32716j0907j0673j1675j3193j4007j3868j3237j2356j1282j0189q967p243
56759B95119n412m719n525o368n803m392l551l233k362j057n87j129j540j588
56745B47853k382l928m272k473o09j020k785l112j531m31j421l267l965l147j746
56730B11764o65n06j374k267j714K25J651J258Jn65m18m00m63l2N88O65M87Q78
56712B09113J583J514M69p26j555k000j648k42J082Q41l77m92P53J188k85j802
$$ plain form
56696 207416 205972 205865 206246 206540 207564 209704 211666 212222 212019 212398 213379 214130 214728 215939 217603 218713
56680 218713 219146 220019 222011 224346 225924 226633 227058 227592 228395 229685 231374 232807 233598 234481 236592 239833
56664 239833 242832 244788 246587 249442 253000 255749 257095 258004 259412 260957 261818 262044 262341 263050 264076
56649 264076 265396 266789 267368 266357 264388 263141 263536 264932 266235 267071 267701 268584 270365 273529 277619
56634 277619 281272 283510 284602 285381 286130 286498 286101 284901 283352 282228 281793 281129 279108 276232 274469 274742
56618 274742 275637 275348 273903 272367 270782 268374 265399 263274 262823 263569 264784 266153 267393 268350 269520
56603 269520 271261 272369 270889 266876 262993 261566 262102 262632 262341 261663 260641 258844 256708 255580 256212
56588 256212 258171 260781 263629 265987 266788 265784 263961 262294 260614 258299 255656 253902 253854 255133 256703
$$ packed form
56696B07416j444j07L81K94J024K140J962N56k03L79R81P51N98J211J664J110
56680B18713M33Q73J992K335J578P09M25N34Q03J290J689J433P91Q83K111L241
56664B39833K999J956J799K855L558K749J346R09J408J545Q61K26K97P09J026
56649B64076J320J393N79j011j969j247L95J396J303Q36O30Q83J781L164M090
56634B77619L653K238J092P79P49L68l97j200j549j124m35o64k021k876j763K73
56618B74742Q95k89j445j536j585k408k975k125m51P46J215J369J240R57J170
56603B69520J741J108j480m013l883j427N36N30k91o78j022j797k136j128O32
56588B56212J959K610K848K358Q01j004j823j667j680k315k643j754m8J279J570
$$ plain form
56573 256703 257930 259073 260946 263981 267517 270216 271541 272641 275281 279889 285196 289966 294431 299391
56559 299391 304194 306690 305618 302438 300144 300460 302750 305494 308044 310761 314159 318436 323318 327776
56545 327776 330221 329788 327390 324942 323468 322413 320733 318030 314557 310925 308144 307199 307985 309159 309636
56530 309636 309791 310448 311150 310463 307966 304940 302849 301903 301502 301322 301343 301321 300898 299972 298520 296310 293350
56513 293350 290411 288511 287855 287632 286776 284606 280965 276431 272463 270648 271348 273261 274551 274290 272857
56498 272857 271330 270626 270831 271016 270027 267783 265654 265149 266367 268063 269194 269916 271002 272767 274953 277319
56482 277319 279768 281887 282919 282487 281118 279824 279401 280274 282649 286214 289845 292193 292785 292298 291638 291116
56466 291116 290555 289847 289253 289429 291196 294812 299320 303152 305619 307399 309367 311583 313788 316111 318593
$$ packed form
56573B56703J227J143J873L035L536K699J325J100K640M608N307M770M465M960
56559B99391M803K496j072l180k294L16K290K744K550K717L398M277M882M458
56545C27776K445m33k398k448j474j055j680k703l473l632k781r45P86J174M77
56530C09636J55O57P02o87k497l026k091r46m01j80K1k2m23r26j452k210k960
56513B93350k939j900o56k23q56k170l641m534l968j815P00J913J290k61j433
56498B72857j527p04K05J85r89k244k129n05J218J696J131P22J086J765K186K366
56482B77319K449K119J032m32j369j294m23Q73K375L565L631K348N92m87o60n22
56466B91116n61p08n94J76J767L616M508L832K467J780J968K216K205K323K482
$$ plain form
56451 318593 320526 321150 320642 319588 317881 315202 312392 311073 311638 312649 312704 312069 311950 312895 314578 316595
56435 316595 318685 320387 321147 320862 319969 318970 318016 316931 315649 314591 314434 315291 316439 317229 317906 318886 319646
56418 319646 319386 318668 319131 321325 324003 326069 327927 330035 331334 330481 328019 326058 326035 327786 330343 332463
56402 332463 332705 330493 327298 325566 326062 327284 327850 328334 330010 332576 334251 333904 332317 331271 331890 334034
56386 334034 336942 340044 343035 345502 347108 348281 350133 353118 356196 357983 358439 358621 359017 359237 359469
56371 359469 360981 364448 368648 371752 373481 375157 377836 381214 384359 386806 388676 390244 391738 393298
56357 393298 394849 396095 396887 397577 398849 401018 403591 405738 407277 408907 411194 413649 415338 416213 417206
56342 417206 418884 420796 422472 424346 427012 430065 432488 433996 435188 436419 437354 437849 438518 439999 442184
$$ packed form
56451C18593J933O24n08j054j707k679k810j319N65J011N5o35j19R45J683K017
56435C16595K090J702P60k85q93r99r54j085j282j058j57Q57J148P90O77R80P60
56418C19646k60p18M63K194K678K066J858K108J299q53k462j961k3J751K557K120
56402C32463K42k212l195j732M96J222N66M84J676K566J675l47j587j046O19K144
56386C34034K908L102K991K467J606J173J852K985L078J787M56J82L96K20K32
56371C59469J512L467M200L104J729J676K679L378L145K447J870J568J494J560
56357C93298J551J246P92O90J272K169K573K147J539J630K287K455J689Q75R93
56342D17206J678J912J676J874K666L053K423J508J192J231R35M95O69J481K185
$$ plain form
56327 442184 444611 447148 449847 452490 454845 457059 459242 460988 462110 463668 467226 472844 478653 482910
56313 482910 485693 487950 489718 490385 490382 491368 494540 499625 505716 512213 518550 523916 528066 531959 536910
56298 536910 543212 550010 556272 561489 565778 569820 574460 579857 585172 589724 594253 600380 608725 618158
56284 618158 627072 634943 642475 650667 659968 670000 679858 688931 697621 706996 717509 728380 738585
56271 738585 748245 758681 771089 785383 800446 815404 830611 847396 866829 888785 912301 936814
56259 936814 962888 991687 1024035 1060171 1100328 1145275 1196197 1254111 1319393 1391699 1470236
56248 1470236 1554278 1643748 1739214 1840839 1947074 2054788 2161248 2265685 2368177 2466894
56238 2466894 2557318 2634767 2697166 2744739 2777474 2793986 2793092 2775659 2744332 2701764 2649532 2588624
$$ packed form
56327D42184K427K537K699K643K355K214K183J746J122J558L558N618N809M257
56313D82910K783K257J768O67lR86L172N085O091O497O337N366M150L893M951
56298E36910O302O798O262N217M289M042M640N397N315M552M529O127Q345R433
56284F18158Q914P871P532Q192R301J0032R858R073Q690R375J0513J0871J0205
56271G38585R660J0436J2408J4294J5063J4958J5207J6785J9433K1956K3516K4513
56259I36814K6074K8799L2348L6136M0157M4947N0922N7914O5282P2306P8537
56248A470236Q4042Q9470R5466J01625J06235J07714J06460J04437J02492R8717
56238B466894R0424P7449O2399M7573L2735J6512q94j7433l1327m2568n2232o0908
$$ plain form
56226 2588624 2520417 2446978 2370587 2293076 2215413 2137624 2059234 1980280 1902191 1827379 1757556
56215 1757556 1692538 1631078 1572667 1517978 1467628 1421312 1378445 1339049 1303471 1271646 1243136
56204 1243136 1217682 1195340 1176198 1160186 1146839 1135048 1123554 1112172 1102226 1095224 1091274 1089164
56192 1089164 1087768 1086934 1087188 1088959 1091964 1095117 1097407 1099162 1101978 1106986 1113653 1120790 1128128 1136157
56178 1136157 1144893 1153731 1162264 1170456 1178312 1186298 1195821 1208130 1222603 1236964 1249383 1259843 1269740
56165 1269740 1281037 1295537 1313631 1333495 1352493 1369707 1386402 1404197 1423907 1446109 1471271
56154 1471271 1498880 1527992 1559502 1596593 1641837 1694865 1754006 1819324 1892617 1974905 2065179
56143 2065179 2161369 2261101 2361195 2457289 2544704 2620023 2682538 2734850 2781811 2828056 2875938
$$ packed form
56226B588624o8207p3439p6391p7511p7663p7789p8390p8954p8089p4812o9823
56215A757556o5018o1460n8411n4689n0350m6316m2867l9396l5578l1825k8510
56204A243136k5454k2342j9142j6012j3347j1791j1494j1382r946p002l950k110
56192A089164j396q34K54J771L005L153K290J755K816N008O667P137P338Q029
56178A136157Q736Q838Q533Q192P856P986R523J2309J4473J4361J2419J0460R897
56165A269740J1297J4500J8094J9864J8998J7214J6695J7795J9710K2202K5162
56154A471271K7609K9112L1510L7091M5244N3028N9141O5318P3293Q2288R0274
56143B065179R6190R9732J00094R6094Q7415P5319O2515N2312M6961M6245M7882
$$ plain form
56132 2875938 2925071 2972747 3014690 3046956 3068592 3082294 3091748 3098730 3103034 3103753 3098859 3084216
56120 3084216 3055272 3010589 2952810 2886104 2814066 2740502 2670552 2609232 2558899 2518961 2487885
56109 2487885 2464794 2449256 2440515 2437618 2440056 2447731 2460019 2475263 2491716 2508973 2527925 2549144
56097 2549144 2571914 2595300 2619720 2646706 2677188 2710475 2744810 2778562 2811127 2843258 2876526
56086 2876526 2911995 2949434 2988080 3027938 3069784 3114030 3160102 3206920 3253603 3299950 3346741
56075 3346741 3395382 3446626 3499761 3553642 3608313 3664824 3723615 3784093 3845868 3909342 3974670
56064 3974670 4041187 4108538 4177610 4249498 4324083 4400458 4478331 4558122 4639825 4722784 4806791
56053 4806791 4892729 4981753 5074171 5169421 5266703 5365265 5464404 5563980 5665182 5770310 5881166
$$ packed form
56132B875938M9133M7676M1943L2266K1636J3702R454O982M304P19m894j4643
56120C084216k8944m4683n7779o6706p2038p3564o9950o1320n0333l9938l1076
56109B487885k3091j5538q741k897K438P675J2288J5244J6453J7257J8952K1219
56097B549144K2770K3386K4420K6986L0482L3287L4335L3752L2565L2131L3268
56086B876526L5469L7439L8646L9858M1846M4246M6072M6818M6683M6347M6791
56075C346741M8641N1244N3135N3881N4671N6511N8791O0478O1775O3474O5328
56064C974670O6517O7351O9072P1888P4585P6375P7873P9791Q1703Q2959Q4007
56053D806791Q5938Q9024R2418R5250R7282R8562R9139R9576J01202J05128J10856
$$ plain form
56042 5881166 5997607 6118107 6241816 6369611 6502827 6641468 6784276 6930389 7080280
56033 7080280 7235077 7395657 7562611 7736400 7916981 8103709 8296248 8495478 8702853
56024 8702853 8918778 9142158 9372028 9609234 9856059 10114189 10383648 10663853 10955013
56015 10955013 11257920 11572867 11899824 12239763 12594802 12966578 13355241 13760694 14184188
56006 14184188 14627849 15093029 15580039 16089356 16622332 17180846 17767199 18384372 19035382
55997 19035382 19722039 20445130 21206258 22008951 22857719 23756717 24709699 25720523 26793071
55988 26793071 27931369 29140718 30428466 31802847 33271058 34839238 36514593 38307221
55980 38307221 40229861 42296398 44520986 46918513 49505792 52302437 55330873 58615974
$$ packed form
56042E881166J16441J20500J23709J27795J33216J38641J42808J46113J49891
56033G080280J54797J60580J66954J73789J80581J86728J92539J99230K07375
56024H702853K15925K23380K29870K37206K46825K58130K69459K80205K91160
56015A0955013L02907L14947L26957L39939L55039L71776L88663M05453M23494
56006A4184188M43661M65180M87010N09317N32976N58514N86353O17173O51010
55997A9035382O86657P23091P61128Q02693Q48768Q98998R52982J010824J072548
55988B6793071J138298J209349J287748J374381J468211J568180J675355J792628
55980C8307221J922640K066537K224588K397527K587279K796645L028436L285101
$$ plain form
55972 58615974 62185332 66070402 70307470 74937646 80006620 85565356 91671442 98389661
55964 98389661 105791392 113953853 122959903 132897450 143857049 155927454 169189830 183710868
55956 183710868 199533970 216667804 235072520 254644258 275198164 296450162 317999688
55949 317999688 339318536 359752544 378542208 394866433 407910052 416949543 421443186
55942 421443186 421106006 415950888 406285570 392667262 375827293 356583763 335759328
55935 335759328 314115738 292310225 270873612 250206586 230588719 212194864 195114796
55928 195114796 179373119 164947192 151782062 139802676 128923684 119056177 110111171
55921 110111171 102001588 94644716 87964861 81894182 76371333 71340001 66748922 62552500
$$ packed form
55972E8615974L569358L885070M237068M630176N068974N558736O106086O718219
55964I8389661P401731Q162461R006050R937547J0959599J2070405J3262376J4521038
55956A83710868J5823102J7133834J8404716J9571738K0553906K1251998K1549526
55949C17999688K1318848K0434008J8789664J6324225J3043619R039491M493643
55942D21443186l37180n155118r665318j3618308j6839969j9243530k0824435
55935C35759328k1643590k1805513k1436613k0667026j9617867j8393855j7080068
55928A95114796j5741677j4425927j3165130j1979386j0878992r867507q945006
55921A10111171q109583p356872o679855o070679n522849n031332m591079m196422
$$ plain form
55913 62552500 58710433 55186556 51948311 48967317 46219718 43685079 41344232 39178119
55905 39178119 37168992 35302459 33567421 31953294 30447710 29037567 27712049 26463936
55897 26463936 25288305 24181035 23138558 22157724 21234973 20365958 19546319 18772364 18040840
55888 18040840 17348701 16693480 16073216 15485567 14927710 14397673 13894940 13418838 12967029
55879 12967029 12536732 12126906 11737561 11366770 11009935 10663031 10325698 10000257 9688284
55870 9688284 9389241 9102124 8827058 8564652 8314483 8074982 7844584 7622388 7407806
55861 7407806 7200294 6999769 6806837 6622019 6444883 6274284 6109410 5950152 5796433
55852 5796433 5647660 5503094 5362535 5226413 5095255 4969162 4847743 4730519 4617340
$$ packed form
55913F2552500l842067l523877l238245k980994k747599k534639k340847k166113
55905C9178119k009127j866533j735038j614127j505584j410143j325518j248113
55897B6463936j175631j107270j042477r80834r22751q69015q19639p73955p31524
55888A8040840o92139o55221o20264n87649n57857n30037n02733m76102m51809
55879A2967029m30297m09826l89345l70791l56835l46904l37333l25441l11973
55870I688284k99043k87117k75066k62406k50169k39501k30398k22196k14582
55861G407806k07512k00525j92932j84818j77136j70599j64874j59258j53719
55852E796433j48773j44566j40559j36122j31158j26093j21419j17224j13179
$$ plain form
55843 4617340 4508144 4402294 4298676 4196922 4098033 4003085 3911652 3822497 3735596 3652186
55833 3652186 3572582 3495313 3419176 3344903 3273767 3205480 3138769 3073395 3010217 2949498 2890462
55822 2890462 2832484 2775511 2719317 2663580 2608892 2556453 2506316 2457080 2407838 2359354 2312582
55811 2312582 2267110 2222175 2178478 2137711 2100411 2065390 2031327 1998036 1965976 1935312 1905887
55800 1905887 1877615 1850477 1824345 1799174 1775273 1753069 1732578 1713244 1694525 1676663 1660871
55789 1660871 1648505 1639791 1633073 1625082 1611990 1590934 1561426 1525696 1487297 1449049 1412216 1377372
55777 1377372 1345352 1317177 1293629 1275279 1262203 1252916 1243906 1231238 1212931 1189426 1162082 1132079
55765 1132079 1100945 1071004 1044269 1021052 1000346 981542 965227 952096 941633 932239 922543 912180
$$ packed form
55843D617340j09196j05850j03618j01754r8889r4948r1433q9155q6901q3410
55833C652186p9604p7269p6137p4273p1136o8287o6711o5374o3178o0719n9036
55822B890462n7978n6973n6194n5737n4688n2439n0137m9236m9242m8484m6772
55811B312582m5472m4935m3697m0767l7300l5021l4063l3291l2060l0664k9425
55800A905887k8272k7138k6132k5171k3901k2204k0491j9334j8719j7862j5792
55789A660871j2366q714o718p991j3092k1056k9508l5730l8399l8248l6833l4844
55777A377372l2020k8175k3548j8350j3076r287r010j2668j8307k3505k7344l0003
55765A132079l1134k9941k6735k3217k0706j8804j6315j3131j0463r394r696j0363
$$ plain form
55753 912180 901267 889497 876104 860700 843861 826817 810726 796287 783673 772484 761866
55742 761866 751166 740625 731168 723266 716184 708632 700161 691540 683583 675869 667093 656700 645640
55729 645640 635185 625370 615153 603854 591780 579507 567420 556121 546306 537674 528878 519328
55717 519328 510288 503028 496515 488448 478423 468481 460269 453189 446051 439031 432785 426749 419804 412151
55703 412151 405195 399713 395136 390456 384887 377888 369630 361335 354115 347520 340326 332679 326172 321588
55689 321588 317881 313830 309369 304675 299310 293394 288591 286524 286689 287033 286216 284270 281545 278346 275581
55674 275581 274436 275017 276165 276902 277307 277730 277907 277336 276000 274291 272557 270921 269235 267144 264701 263005
55658 263005 263519 266321 269577 271196 270617 268603 265858 262637 259386 256780 254822 252529 248952 244200 239140
$$ packed form
55753I12180j0913j1770j3393j5404j6839j7044j6091j4439j2614j1189j0618
55742G61866j0700j0541r457p902p082p552q471q621p957p714q776j0393j1060
55729F45640j0455r815j0217j1299j2074j2273j2087j1299r815q632q796r550
55717E19328r040p260o513q067j0025r942q212p080p138p020o246o036o945p653
55703D12151o956n482m577m680n569o999q258q295p220o595p194p647o507m584
55689C21588l707m051m461m694n365n916m803k067J65L44q17j946k725l199k765
55674B75581j145N81J148P37M05M23J77n71j336j709j734j636j686k091k443j696
55658B63005N14K802L256J619n79k014k745l221l251k606j958k293l577m752n060
$$ plain form
55643 239140 234434 230316 227089 225073 223881 222432 220327 218761 219192 221164 222387 221291 218664 216129
55629 216129 213829 210576 205960 201185 197719 195957 195467 195829 196835 198237 199682 200765 201202 201232 201722 203378
55613 203378 205872 208305 210414 212548 214408 214789 213021 209912 206604 203180 199154 194944 191883 190724
55599 190724 190757 190578 189440 187747 186453 186010 185793 184631 181878 177720 172557 166670 160684 155635 151957
55584 151957 148872 145376 141550 138280 136081 135013 135493 138197 142935 148483 153824 158863 163534 166921
55570 166921 167896 166229 162447 156847 149420 140689 131923 124190 117517 111220 104765 98086 91353 84838
55556 84838 78879 73565 68436 62934 57310 52780 50394 49881 49846 49090 47566 46160 45736 46366 47376 48149
55540 48149 48781 49624 50249 49558 47318 44871 43502 42590 40480 37051 34140 33172 33478 33513 32789 31905 31483
$$ packed form
55643B39140m706m118l227k016j192j449k105j566M31J972J223j096k627k535
55629B16129k300l253m616m775l466j762m90L62J006J402J445J083M37L0M90J656
55613B03378K494K433K109K134J860L81j768l109l308l424m026m210l061j159
55599A90724L3j79j138j693j294m43k17j162k753m158n163n887n986n049l678
55584A51957l085l496l826l270k199j068M80K704M738N548N341N039M671L387
55570A66921R75j667l782n600p427q731q766p733o673o297o455o679o733o515
55556H4838n959n314n129n502n624m530k386n13l5p56j524j406m24O30J010P73
55540D8149O32Q43O25o91k240k447j369r12k110l429k911r68L06L5p24q84m22
$$ plain form
55523 31483 31863 33252 35278 36835 37175 36789 36448 35809 33974 31197 28929 28185 28812 30462 33168 36478
55507 36478 38911 38944 36303 32005 27626 24722 24168 25331 26222 25197 22608 20488 20610 23019 26275 28767
55491 28767 29815 29750 29197 28448 27604 27082 27552 29238 31581 33845 35812 37736 39812 41990 44156 46136
55475 46136 47553 48105 48252 49351 52496 57056 60757 61726 60303 58344 56800 54710 50783 45260 39606
55460 39606 34861 31033 27878 25512 24124 23522 23026 21644 18716 14846 11818 10756 10503 8669 4375
55445 4375 -810 -4728 -6552 -6642 -5579 -3994 -2729 -2278 -2263 -1992 -1359 -879 -1002 -1686 -2452 -2730 -2474 -2482 -3589
55426 -3589 -5377 -6386 -5911 -4847 -4296 -4142 -3702 -3008 -2523 -2238 -2093 -2799 -4961 -7627 -9042 -8845 -8249
55409 -8249 -7978 -7420 -6201 -5188 -5113 -5326 -4886 -4005 -3460 -3245 -2914 -2701 -3217 -4385 -5755 -7599 -10480 -13769
$$ packed form
55523C1483L80J389K026J557L40l86l41o39j835k777k268p44O27J650K706L310
55507C6478K433L3k641m298m379k904n54J163Q91j025k589k120J22K409L256K492
55491B8767J048o5n53p49q44n22M70J686K343K264J967J924K076K178K166J980
55475D6136J417N52J47J099L145M560L701R69j423j959j544k090l927n523n654
55460C9606m745l828l155k366j388o02m96j382k928l870l028j062k53j834m294
55445D375h10l918j824r0J063J585J265M51J5K71O33M80j23o84p66k78K56qj107
55426c589j788j009M75J064N51J54M40O94M85K85J45p06k162k666j415J97N96
55409h249K71N58J219J013P5k13M40Q81N45K15L31K13n16j168j370j844k881l289
$$ plain form
55391 -13769 -15763 -15572 -13991 -12319 -11198 -10885 -11632 -13231 -14881 -16159 -17530 -19373 -21141 -22158 -22741
55376 -22741 -23715 -25112 -26099 -26050 -25070 -23586 -22083 -21210 -21424 -22336 -22876 -22354 -21141 -20277 -20619 -22140 -23745
55359 -23745 -23986 -22485 -20528 -19773 -20562 -22048 -23734 -25816 -27960 -28922 -28094 -26624 -26139 -26801 -27399 -27127 -26427
55342 -26427 -26044 -26042 -26086 -26192 -26700 -27522 -27891 -27211 -26131 -26229 -28176 -30541 -31171 -29841 -28693 -29689 -32369 -34739
55324 -34739 -35690 -35621 -35035 -33751 -31779 -30049 -29608 -30453 -31707 -32799 -34063 -35986 -38104 -38951 -37385 -33930
55308 -33930 -30478 -28522 -27915 -27529 -26647 -25272 -23443 -21154 -19027 -18274 -19515 -22043 -24740 -27346 -30227
55293 -30227 -33016 -34333 -33266 -30647 -28221 -26656 -25025 -22376 -19170 -16729 -15721 -15881 -16952 -19043 -21944
55278 -21944 -24773 -26652 -27257 -26565 -24700 -22405 -21060 -21531 -23208 -24652 -25093 -24991 -25313 -26621 -28666 -30478
$$ packed form
55391a3769j994J91J581J672J121L13p47j599j650j278j371j843j768j017n83
55376b2741r74j397r87M9R80J484J503Q73k14r12n40N22J213Q64l42j521j605
55359b3745k41J501J957P55p89j486j686k082k144r62Q28J470M85o62n98K72P00
55342b6427L83Km4j06n08q22l69O80J080r8j947k365o30J330J148r96k680k370
55324c4739r51O9N86J284J972J730M41q45j254j092j264j923k118q47J566L455
55308c3930L452J956O07L86Q82J375J829K289K127P53j241k528k697k606k881
55293c0227k789j317J067K619K426J565J631K649L206K441J008j60j071k091k901
55278b1944k829j879o05O92J865K295J345m71j677j444m41J02l22j308k045j812
$$ plain form
55262 -30478 -31031 -30205 -28992 -28500 -28870 -29361 -29277 -28515 -27440 -26586 -26385 -26912 -27928 -29178 -30423 -31215 -31130 -30310
55244 -30310 -29228 -27802 -25445 -22230 -19218 -17194 -15936 -15285 -15875 -17912 -20204 -21588 -22599 -24336 -26313
55229 -26313 -26992 -26124 -24845 -23567 -21558 -18874 -16912 -16362 -16112 -15092 -13885 -13474 -13472 -12822 -11576 -10794 -11031
55212 -11031 -11841 -12583 -12961 -13026 -13286 -14603 -17347 -20742 -23456 -24747 -24789 -24203 -23650 -23660 -24406 -25622 -26773 -27189
55194 -27189 -26270 -24200 -22468 -22891 -25776 -29550 -32282 -33044 -31813 -29129 -26191 -24240 -23199 -21717 -19089
55179 -19089 -16320 -14620 -13859 -13302 -12920 -12898 -12642 -11566 -10364 -10237 -11133 -11890 -11940 -11774 -11916 -12498 -13650 -15104
55161 -15104 -15515 -13503 -9568 -5884 -3938 -3498 -4096 -6166 -9903 -14053 -16888 -17923 -17918 -17634 -17341 -17286 -17832
55144 -17832 -19030 -20550 -22010 -23164 -23827 -23963 -23835 -23780 -23776 -23438 -22556 -21614 -21614 -23200 -25890 -28260 -28974 -27581
$$ packed form
55262c0478n53Q26J213M92l70m91Q4P62J075Q54K01n27j016j250j245p92Q5Q20
55244c0310J082J426K357L215L012K024J258O51n90k037k292j384j011j737j977
55229b6313o79Q68J279J278K009K684J962N50K50J020J207M11KO50J246P82k37
55212a1031q10p42l78o5k60j317k744l395k714j291m2N86N53j0p46j216j151m16
55194b7189R19K070J732m23k885l774k732p62J231K684K938J951J041J482K628
55179a9089K769J700P61N57L82K2K56J076J202J27q96p57n0J66j42n82j152j454
55161a5104m11K012L935L684J946M40n98k070l737m150k835j035NK84K93N5n46
55144a7832j198j520j460j154o63j36J28N5ML38Q82R42%j586k690k370p14J393
$$ plain form
55126 -27581 -24427 -20192 -15726 -11942 -9394 -7980 -7323 -7261 -7715 -8310 -8574 -8497 -8601 -9483 -11339 -13664 -15398
55109 -15398 -15823 -15610 -16278 -18109 -19327 -18164 -15228 -12721 -11694 -11288 -10579 -9790 -9327 -8868 -8079 -7343 -7049
55092 -7049 -6854 -6293 -5603 -5361 -5761 -6740 -8365 -10509 -12576 -14027 -14804 -14850 -13746 -11429 -8765 -6676 -5057
55075 -5057 -3247 -1189 709 2460 4155 4904 3385 -144 -3515 -5000 -5184 -5735 -6930 -7474 -6526 -4816
55059 -4816 -3534 -3007 -2971 -3511 -4907 -6720 -7792 -7450 -6344 -5719 -6007 -6421 -5988 -4792 -4077 -5068 -7751
55042 -7751 -10798 -12657 -12629 -11077 -8964 -7436 -7436 -9098 -11360 -12623 -12171 -10777 -9818 -9929 -10695 -11388 -11763
55025 -11763 -12185 -13095 -14283 -14721 -13458 -10755 -7962 -6116 -5115 -4502 -4416 -5205 -6564 -7941 -9511 -11801
55009 -11801 -14347 -15746 -15479 -14811 -15209 -16425 -16968 -16234 -15326 -15549 -16726 -17402 -16461 -14108 -11295 -8551 -5611
$$ packed form
55126b7581L154M235M466L784K548J414O57O2m54n95k64P7j04q82j856k325j734
55109a5398m25K13o68j831j218J163K936K507J027M06P09P89M63M59P89P36K94
55092g049J95N61O90K42m00r79j625k144k067j451p77m6J104K317K664K089J619
55075e057J810a189G09J751J695P49j519a44l371j485j84n51j195n44R48J710
55059d816J282N27L6n40j396j813j072L42J106O25k88m14M33J196P15r91k683
55042g751l047j859K8J552K113J528%j662k262j263M52J394R59j11p66o93l75
55025a1763m22r10j188m38J263K703K793J846J001O13Q6p89j359j377j570k290
55009a1801k546j399K67O68l98j216n43P34R08k23j177o76R41K353K813K744K940
$$ plain form
54992 -5611 -2159 1395 4063 5266 5559 6206 7925 10124 11557 11711 11287 11235 11762 12656 14088 16278 18474
54975 18474 19229 18034 16005 14538 13902 13682 13903 14858 16162 16876 16607 15896 15467 15580 16054 16478 16441 15886
54957 15886 15164 14432 13348 11816 10595 10444 10957 11136 10877 10913 11228 10677 8593 5926 4275 4416 6106
54940 6106 8619 10878 11630 10274 7387 4116 1257 -750 -1387 -177 2736 6472 9915 12417 14225 16222
54924 16222 18921 21761 23876 25543 28228 32988 39455 46667 54223 62099 69939 77235 83900 89946
54910 89946 94795 97519 97755 95956 92709 88197 82394 75568 68487 62031 56468 51134 45262 39226 34490
54895 34490 32090 31567 31717 31834 31760 31243 30029 28518 27594 27612 27854 27156 25010 22241 20728 22034 25925
54878 25925 30467 34031 36930 40645 45756 51446 56977 62686 69035 75351 80246 83041 84161 84083 82542
$$ packed form
54992e611b159A395K668J203K93O47J719K199J433J54m24n2N27Q94J432K190K196
54975A8474P55j195k029j467o36k20K21R55J304P14k69p11m29J13M74M24l7n55
54957A5886p22p32j084j532j221j51N13J79k59L6L15n51k084k667j651J41J690
54940F106K513K259P52j356k887l271A257g50o37a77B736L736L443K502J808J997
54924A6222K699K840K115J667K685M760O467P212P556P876P840P296O665O046
54910H9946M849K724K36j799l247m512n803o826p081o456n563n334n872o036m736
54895C4490k400n23J50J17p4n17j214j511r24J8K42o98k146k769j513J306L891
54878B5925M542L564K899L715N111N690N531N709O349O316M895K795J120p8j541
$$ plain form
54863 82542 79058 73868 67887 61873 56011 50262 44675 39296 34296 30309 28003 26960 25644 23147
54849 23147 20369 18644 17704 16241 14281 13506 14773 16555 16539 14058 10455 7816 7790 10594 14390 16406
54833 16406 15516 13225 11579 11049 11159 11990 13647 15117 15314 14870 15228 16240 16474 15940 16521 19014 21440
54816 21440 21348 18553 14617 10762 7544 5652 5469 6143 6419 6358 7121 9004 10720 10964 9917 8859 8848
54799 8848 10040 11764 12929 12784 11683 10848 11139 12393 14144 16507 19712 23051 25048 24823 22862 20278
54783 20278 17807 15742 14326 13666 13508 13588 14143 15614 17890 20260 22106 23323 24183 25251 27398 31162
54767 31162 35941 40402 43937 47274 51520 57197 64414 73038 82020 89289 93311 94643 95225 96188 96802
54752 96802 95414 90983 84001 76366 69985 64958 59551 52542 45025 38992 34745 31054 27599 25689
$$ packed form
54863H2542l484n190n981o014n862n749n587n379n000l987k306j043j316k497
54849B3147k778j725r40j463j960p75J267J782j6k481l603k639k6K804L796K016
54833A6406q90k291j646n30J10Q31J657J470J97m44L58J012K34n34N81K493K426
54816B1440r2k795l936l855l218j892j83O74K76o1P63J883J716K44j047j058j1
54799H848J192J724J165j45j101q35K91J254J751K363L205L339J997k25j961k584
54783B0278k471k065j416o60j58Q0N55J471K276K370J846J217Q60J068K147L764
54767C1162M779M461L535L337M246N677P217Q624Q982P269M022J332N82R63O14
54752I6802j388m431o982p635o381n027n407p009p517o033m247l691l455j910
$$ plain form
54738 25689 26268 28579 31435 34567 37925 40670 41982 42332 42978 44485 46524 48891 51907 55819 60437
54723 60437 65464 70759 76190 81473 86265 90407 94214 98452 103642 109261 113976 116741 117168 114864 109276
54708 109276 100790 91346 83155 76908 71647 66131 59955 53670 48304 44554 42169 40371 39014 38632
54694 38632 39120 39431 39316 40284 43448 47128 48245 45976 42414 39517 37073 34227 31386 29499 28522 27802
54678 27802 27314 27375 27619 27303 26423 25563 24874 24054 23258 23068 23492 23895 24110 24793 26261 27643 27762 26517
54660 26517 24864 23677 23103 22900 22896 22937 22681 21831 20576 19541 19057 18591 17223 14836 12510 11443 11667
54643 11667 12188 12214 11888 11890 12814 14942 18154 21845 25228 27962 30223 32097 33312 33796 34157 35199 37145
54626 37145 39716 42776 46450 50652 54943 59012 62976 66955 70631 73611 76226 79610 84651 90875
$$ packed form
54738B5689N79K311K856L132L358K745J312L50O46J507K039K367L016L912M618
54723F0437N027N295N431N283M792M142L807M238N190N619M715K765M27k304n588
54708A09276q486r444q191o247n261n516o176o285n366l750k385j798j357l82
54694C8632M88L11j15R68L164L680J117k269l562k897k444k846k841j887r77p20
54678B7802m88O1K44l16q80q60o89q20p96j90M24M03K15O83J468J382J19j245
54660B6517j653j187n74k03mM1k56q50j255j035m84m66j368k387k326j067K24
54643A1667N21K6l26KR24K128L212L691L383K734K261J874J215M84L61J042J946
54626C7145K571L060L674M202M291M069L964L979L676K980K615L384N041O224
$$ plain form
54612 90875 96624 100367 101661 100785 98014 93790 89255 85740 83429 81169 77893 73663 68952 63669 57755
54597 57755 52301 48957 48076 48236 47855 46565 44653 41951 38116 33753 30397 29007 28861 28319 26671 24867
54581 24867 24216 24564 24334 22535 20204 19326 20577 22832 24713 25860 26546 26910 27063 27358 27961 28506 28707
54564 28707 29007 30043 31597 32715 32854 32451 32235 32350 32310 31571 30078 28425 27443 27453 27900 27952 27467 27167
54546 27167 27742 28983 29937 29915 29314 29324 30725 33037 35090 36335 37207 38128 38709 38348 37146 35701 34255
54529 34255 32735 31494 31289 32295 33696 34569 34845 35141 35817 36460 36321 35342 34759 36333 40543 45726 49569
54512 49569 51364 52303 53708 55799 58250 60902 63365 64809 64998 65042 66239 68428 70148 70135 67985 63772
54496 63772 58132 52650 49025 47478 46804 46209 46179 47158 48456 49260 49876 50900 51662 50747 48015 45097 43727
$$ packed form
54612I0875N749L743J294q76k771m224m535l515k311k260l276m230m711n283n914
54597E7755n454l344q81J60l81j290j912k702l835m363l356j390j46n42j648j804
54581B4867o51L48k30j799k331q78J251K255J881J147O86L64J53K95O03N45K01
54564B8707L00J036J554J118J39m03k16J15m0p39j493j653r82J0M47N2m85l00
54546B7167N75J241R54k2o01J0J401K312K053J245Q72R21N81l61j202j445j446
54529C4255j520j241k05J006J401Q73K76K96O76O43j39r79n83J574M210N183L843
54512D9569J795R39J405K091K451K652K463J444J89M4J197K189J720j3k150m213
54496F3772n640n482l625j547o74n95l0R79J298Q04O16J024P62r15k732k918j370
$$ plain form
54479 43727 44303 46204 48666 50993 52613 53394 53629 53489 52868 51882 50987 50467 50325 50923 52959 56306 59455
54462 59455 60833 60445 59712 59898 61087 62381 62654 61373 59123 57074 55579 53793 51156 48528 46904
54447 46904 45602 43112 39655 37495 38252 41065 44011 46287 48098 49226 48972 47483 46173 46472 48422
54432 48422 50673 51761 51459 50907 51273 52405 53247 53501 54126 55770 57330 56822 53559 49029 45711 45267
54416 45267 47573 50905 53128 53190 51691 49975 48856 48441 48803 50210 52559 55033 56742 57663 58742 60917
54400 60917 64183 67742 70915 73553 75498 76249 75544 73923 72171 70496 68755 67108 65789 64520 63052
54385 63052 61996 62040 62508 62052 60847 60670 62316 64412 65563 66320 67924 70337 72794 75267 77837 79452
54369 79452 79088 77765 77603 78777 79121 77112 73861 71477 70610 70326 69617 68287 66789 65736 65352 65228
$$ packed form
54479D3727N76J901K462K327J620P81K35j40o21r86q95n20j42N98K036L347L149
54462E9455J378l88p33J86J189J294K73j281k250k049j495j786k637k628j624
54447D6904j302k490l457k160P57K813K946K276J811J128k54j489j310K99J950
54432D8422K251J088l02n52L66J132Q42K54O25J644J560n08l263m530l318m44
54416D5267K306L332K223O2j499j716j119m15L62J407K349K474J709R21J079K175
54400F0917L266L559L173K638J945P51p05j621j752j675j741j647j319j269j468
54385F3052j056M4M68m56j205j77J646K096J151P57J604K413K457K473K570J615
54369G9452l64j323j62J174L44k009l251k384q67k84p09j330j498j053l84j24
$$ plain form
54353 65228 64928 64798 65636 67493 69466 70859 71885 72917 73636 73423 72253 70799 69715 69010 68132 66682
54337 66682 65088 64232 64198 63839 62143 59644 57727 56714 55561 53510 51191 49747 49471 49701 49642 48997 48032
54320 48032 47239 46905 47007 47518 48386 49041 48605 47132 45977 46101 46685 46551 46331 47651 50269 51829 50894
54303 50894 48677 47055 46293 45760 45654 46551 47876 48270 47451 46644 46962 48101 48911 48779 48104 47560 47245 46709
54285 46709 45706 44485 43190 41542 39641 38601 39498 41919 44349 45926 46885 47428 47353 47000 47439 49158
54269 49158 51360 53035 54021 54631 55000 55182 55225 54781 53302 50887 48237 45657 43035 40924 40426 41605
54253 41605 43249 44683 46490 48722 49996 49534 48711 48980 49311 47541 43735 40367 39252 39867 40755 41138
54237 41138 40817 39799 38624 38301 39350 41287 43172 44317 44530 44188 43987 44081 43602 41557 38128 34616
$$ packed form
54353F5228l00j30Q38J857J973J393J026J032P19k13j170j454j084p05q78j450
54337F6682j594q56l4l59j696k499j917j013j153k051k319j444k76K30n9o45r65
54320D8032p93l34J02N11Q68O55m36j473j155J24N84j34k20J320K618J560r35
54303E0894k217j622p62n33j06Q97J325L94q19q07L18J139Q10j32o75n44l15n36
54285D6709j003j221j295j648j901j040Q97K421K430J577R59N43p5l53M39J719
54269D9158K202J675R86O10L69J82M3m44j479k415k650k580k622k111m98J179
54253D1605J644J434J807K232J274m62q23K69L31j770l806l368j115O15Q88L83
54237D1138l21j018j175l23J049J937J885J145K13l42k01R4m79k045l429l512
$$ plain form
54221 34616 32314 31938 33710 37122 40662 42585 42184 40061 37406 35443 35080 36270 37856 38846 39651 41380
54205 41380 44065 46444 47457 47138 46090 44967 44565 45477 47300 48816 49371 49544 50148 51043 51340 50518 48910
54188 48910 47054 44841 41671 37703 34585 34202 36585 39875 42588 44994 47797 50579 52501 53529 53718
54173 53718 52170 48393 44160 42140 42613 43281 42585 41520 41597 42691 43874 45056 46511 47646 47623 46805
54157 46805 46471 47198 48307 48861 48529 47509 46229 45222 44849 44967 44999 44322 42537 39625 36183 33475 32814
54140 32814 34545 37522 39886 40670 40743 41879 44791 48408 51050 51795 50629 48083 45318 43775 43843 44315
54124 44315 44003 43448 44060 46024 48255 50238 52475 55016 56895 57487 57268 56733 55641 54018 52926 53297
54108 53297 54564 55302 54832 53563 52092 50697 49539 48755 48297 47997 47768 47561 47283 46948 46718 46702 46960 47740
$$ packed form
54221C4616k302l76J772L412L540J923m01k123k655j963l63J190J586R90Q05J729
54205D1380K685K379J013l19j048j123m02R12J823J516N55J73O04Q95K97q22j608
54188D8910j856k213l170l968l118l83K383L290K713K406K803K782J922J028J89
54173E3718j548l777m233k020M73O68o96j065P7J094J183J182J455J135k3q18
54157D6805l34P27J109N54l32j020j280j007l73J18L2o77j785k912l442k708o61
54140C2814J731K977K364P84P3J136K912L617K642P45j166k546k765j543O8M72
54124D4315l12n55O12J964K231J983K237K541J879N92k19n35j092j623j092L71
54108E3297J267P38m70j269j471j395j158p84m58l00k29k07k78l35k30j6K58P80
$$ plain form
54090 47740 49358 51666 53909 55310 55623 55094 54170 53368 53218 54138 56325 59516 62845 65395 67260 69574
54074 69574 72950 76336 78107 77941 76850 75815 75342 76028 78263 81254 83474 84352 84636 84991 85252 85273 85492
54057 85492 86199 87154 88306 90262 93704 98921 105819 113607 120661 125940 130583 136760 144850 153265 161212
54042 161212 169729 179326 188624 196666 204861 214875 225771 235012 241589 246510 250797 254585 257797 260220
54028 260220 261122 260138 258363 257275 256750 255289 252146 247991 243509 238510 232602 225826 218487 211030 204030
54013 204030 197631 191172 184065 176695 169697 162898 156070 150190 146494 144412 141886 137865 133224 129067
53999 129067 125523 122535 120502 119534 119129 119073 119665 120538 120361 118461 115796 113503 111322 108377 104829 101705
53983 101705 99410 97430 95426 93839 93299 93957 95513 97523 99571 101316 102475 102801 102273 101312 100489 99955
$$ packed form
54090D7740J618K308K243J401L13n29r24q02j50R20K187L191L329K550J865K314
54074F9574L376L386J771j66j091j035m73O86K235K991K220Q78K84L55K61K1K19
54057H5492P07R55J152J956L442N217O898P788P054N279M643O177Q090Q415P947
54042A61212Q517R597R298Q042Q195J0014J0896R241O577M921M287L788L212K423
54028B60220R02r84j775j088n25j461l143m155m482m999n908o776p339p457p000
54013B04030o399o459p107p370o998o799o828n880l696k082k526m021m641m157
53999A29067l544k988k033r68m05n6N92Q73j77j900k665k293k181k945l548l124
53983A01705k295j980k004j587n40O58J556K010K048J745J159L26n28r61q23n34
$$ plain form
53967 99955 99482 99126 99497 101128 103917 107281 110502 112842 113903 114244 115191 117549 120731 123559 125655 127561
53951 127561 129757 132150 134613 137412 140758 144202 146950 148919 151273 155594 162373 170440 178085 184700
53937 184700 191191 198906 208435 219401 231083 243059 255386 268343 281925 295587 308529 320227
53925 320227 330678 340285 349727 359788 370834 382297 392973 402234 410843 420183 430447 439761 445484
53912 445484 446506 444090 440375 436407 431907 426488 420330 413717 406684 399389 392142 384799 376653 367354
53898 367354 357381 347192 336475 324823 312657 300829 289693 279273 269936 262027 254976 247597
53886 247597 239466 231464 224856 220162 216864 213875 210496 207052 204150 201049 195707 187355 178258 171592
53872 171592 167957 165381 162426 159530 157081 154179 150282 146609 144518 143413 141562 138492 135304 132924
$$ packed form
53967I9955m73l56L71J631K789L364L221K340J061L41R47K358L182K828K096J906
53951A27561K196K393K463K799L346L444K748J969K354M321O779Q067P645O615
53937A84700O491P715R529J0966J1682J1976J2327J2957J3582J3662J2942J1698
53925C20227J0451R607R442J0061J1046J1463J0676R261Q609R340J0264R314N723
53912D45484J022k416l715l968m500n419o158o613p033p295p247p343q146r299
53898C67354r973j0189j0717j1652j2166j1828j1136j0420r337p909p051p379
53886B47597q131q002o608m694l298k989l379l444k902l101n342q352r097o666
53872A71592l635k576k955k896k449k902l897l673k091j105j851l070l188k380
$$ plain form
53858 132924 131228 129925 129174 128917 128289 126223 122484 117877 113497 109872 106799 104014 101880 101206 102365
53843 102365 104864 107733 110023 110953 110219 108468 107032 106830 107721 109109 110763 112705 114711 116399 117664
53828 117664 118661 119423 119775 119616 119226 119337 120809 123861 127683 131224 134396 138017 142546 147539 152570 157987
53812 157987 164376 171825 180088 188946 197975 206561 214563 222449 230281 237255 242864 247859 253238 258770
53798 258770 263318 266183 267304 266800 265440 265000 266581 268710 268736 266195 263041 260072 255145 246319 235279
53783 235279 225751 219228 214072 208512 202546 196611 190192 182883 175646 169857 165598 161919 158429 155599
53769 155599 153575 151663 149226 146437 143791 141390 139014 136489 133663 130319 126548 122927 119911 117194
53755 117194 114140 110853 108318 107321 107562 108028 108017 107521 106861 106277 105891 105665 105152 103530 100369 96518 93839
$$ packed form
53858A32924j696j303p51k57o28k066l739m607m380l625l073k785k134o74J159
53843A02365K499K869K290R30p34j751j436k02Q91J388J654J942K006J688J265
53828A17664R97P62L52j59l90J11J472L052L822L541L172L621M529M993N031N417
53812A57987O389P449Q263Q858R029Q586Q002P886P832O974N609M995N379N532
53798B58770M548K865J121n04j360m40J581K129K6k541l154k969m927q826j1040
53783B35279r528o523n156n560n966n935o419p309p237n789m259l679l490k830
53769A55599k024j912k437k789k646k401k376k525k826l344l771l621l016k717
53755A17194l054l287k535r97K41M66j1m96o60n84l86k26n13j622l161l851k679
$$ plain form
53738 93839 93639 95422 97589 99342 101404 104731 109087 113352 116791 119376 121079 121618 121169 120717 121282 122919
53722 122919 124792 126217 127487 129590 133068 137249 140841 143379 145704 148738 152166 154826 156226 157031
53708 157031 158091 159617 161522 164012 167504 172153 177633 183151 187620 190244 191139 191237 191563 192769 195130
53693 195130 198427 201724 203876 204470 203964 202788 200840 198034 194814 191810 189410 187957 187869 189166 191172
53678 191172 193010 194226 194809 194943 194824 194235 192364 188747 184520 181715 180873 180383 178870 177288 177560 179914
53662 179914 182858 185361 187641 189835 191214 191036 189426 187234 185612 185575 187133 188955 189770 189940 190662 191907
53646 191907 192608 192866 194192 196955 199229 199255 197747 196606 196431 196670 197335 199054 201870 205309 209254 213402
53630 213402 216326 216778 216016 217186 221900 228612 234750 239219 242332 244614 246725 249656 253989 259329 265115
$$ packed form
53738I3839k00J783K167J753K062L327M356M265L439K585J703N39m49m52N65J637
53722A22919J873J425J270K103L478M181L592K538K325L034L428K660J400Q05
53708A57031J060J526J905K490L492M649N480N518M469K624Q95R8L26J206K361
53693A95130L297L297K152N94n06j176j948k806l220l004k400j453q8J297K006
53678A91172J838J216N83J34j19n89j871l617m227k805q42m90j513j582K72K354
53662A79914K944K503K280K194J379j78j610k192j622l7J558J822Q15J70P22J245
53646A91907P01K58J326K763K274K6j508j141j75K39O65J719K816L439L945M148
53630B13402K924M52p62J170M714O712O138M469L113K282K111K931M333N340N786
$$ plain form
53615 265115 271338 277827 283616 288000 291701 295916 300545 304465 307354 310127 313401 316544 318567 319223
53601 319223 318921 318281 318147 319432 322409 326404 330339 333314 334586 333698 330967 327389 323712 320066 316766
53586 316766 314762 314514 314839 313733 310387 305861 301786 298998 297433 296696 296321 295771 294564 292427 289354
53571 289354 285790 282724 281139 280997 281024 279906 277690 275553 274162 272822 270669 268262 267162 267926 269379
53556 269379 270311 271033 272456 274278 275348 275715 276955 280013 283835 286893 289251 292229 296656 302475 309619
53541 309619 318045 326861 334594 340874 347258 355844 367335 380745 394711 408644 422657 436768 450677
53528 450677 464488 479317 496481 515940 536121 555634 574623 594000 614075 634820 657050
53517 657050 682127 710316 740330 770869 802007 834697 869339 905128 940532 974245 1006019
$$ packed form
53615B65115O223O489N789M384L701M215M629L920K889K773L274L143K023O56
53601C19223l02o40j34J285K977L995L935K975J272q88k731l578l677l646l300
53586C16766k004k48L25j106l346m526m075k788j565p37l75n50j207k137l073
53571B89354l564l066j585j42K7j118k216k137j391j340k153k407j100P64J453
53556B69379R32P22J423J822J070L67J240L058L822L058K358K978M427N819P144
53541C09619Q426Q816P733O280O384Q586J1491J3410J3966J3933J4013J4111J3909
53528D50677J3811J4829J7164J9459K0181J9513J8989J9377K0075K0745K2230
53517F57050K5077K8189L0014L0539L1138L2690L4642L5789L5404L3713L1774
$$ plain form
53506 1006019 1036754 1067615 1098979 1130362 1161138 1190967 1219624 1246904 1272711 1297048 1320150
53495 1320150 1342884 1366566 1391758 1417742 1443891 1470908 1499491 1528193 1554397 1577598 1600093
53484 1600093 1623622 1646794 1666947 1683473 1698025 1712053 1725376 1736813 1745088 1749235 1749062 1745379
53472 1745379 1739280 1731195 1720854 1707718 1691069 1670339 1646163 1620618 1595573 1571103 1546270 1520961
53460 1520961 1495872 1470908 1444934 1417295 1388578 1359579 1330466 1301477 1273583 1247707 1223624
53449 1223624 1200254 1176872 1153733 1131727 1111815 1094724 1080838 1070211 1062593 1057381 1053609 1050279
53437 1050279 1046985 1044224 1043040 1044142 1047219 1051308 1056177 1063146 1073891 1088249 1103986 1119209 1134431
53424 1134431 1151741 1172524 1196671 1223385 1251766 1280981 1310952 1342789 1377483 1414261 1451433
$$ packed form
53506A006019L0735L0861L1364L1383L0776K9829K8657K7280K5807K4337K3102
53495A320150K2734K3682K5192K5984K6149K7017K8583K8702K6204K3201K2495
53484A600093K3529K3172K0153J6526J4552J4028J3323J1437Q275M147j73l683
53472A745379o099q085j0341j3136j6649k0730k4176k5545k5045k4470k4833k5309
53460A520961k5089k4964k5974k7639k8717k8999k9113k8989k7894k5876k4083
53449A223624k3370k3382k3139k2006j9912j7091j3886j0627p618n212l772l330
53437A050279l294k761j184J102L077M089M869O969J0745J4358J5737J5223J5222
53424A134431J7310K0783K4147K6714K8381K9215K9971L1837L4694L6778L7172
$$ plain form
53413 1451433 1489012 1529183 1573708 1622056 1672829 1725841 1781582 1839465 1898218 1958049 2021127
53402 2021127 2089426 2162722 2239033 2316422 2394067 2472149 2551241 2631578 2712444 2792320 2869929
53391 2869929 2945054 3018077 3088859 3156517 3220378 3280663 3337830 3391442 3440046 3482112 3516850
53380 3516850 3544261 3564900 3579550 3588570 3591304 3586482 3573503 3553014 3525993 3492609 3452271 3404474
53368 3404474 3349275 3287333 3219928 3148676 3074593 2997559 2917232 2834431 2751143 2669227 2589620
53357 2589620 2512822 2439492 2370205 2304843 2242555 2182376 2124048 2068245 2015605 1965291 1914994
53346 1914994 1863025 1810125 1758527 1709486 1662724 1618247 1577477 1541848 1510964 1482890 1455970
53335 1455970 1429976 1405806 1384531 1366441 1350597 1335456 1320142 1304756 1289264 1272718 1254373
$$ packed form
53413A451433L7579M0171M4525M8348N0773N3012N5741N7883N8753N9831O3078
53402B021127O8299P3296P6311P7389P7645P8082P9092Q0337Q0866P9876P7609
53391B869929P5125P3023P0782O7658O3861O0285N7167N3612M8604M2066L4738
53380C516850K7411K0639J4650R020K734m822j2979k0489k7021l3384m0338m7797
53368C404474n5199o1942o7405p1252p4083p7034q0327q2801q3288q1916p9607
53357B589620p6798p3330o9287o5362o2288o0179n8328n5803n2640n0314n0297
53346A914994n1969n2900n1598m9041m6762m4477m0770l5629l0884k8074k6920
53335A455970k5994k4170k1275j8090j5844j5141j5314j5386j5492j6546j8345
$$ plain form
53324 1254373 1235298 1218028 1204458 1194434 1186423 1179053 1171933 1165520 1160629 1157958 1157852 1160445 1165826
53311 1165826 1173806 1183685 1194760 1207229 1222144 1240126 1260358 1281340 1302649 1325654 1352357 1383570
53299 1383570 1418181 1454033 1489635 1525376 1563070 1603969 1647093 1689917 1730662 1769283 1805870
53288 1805870 1839076 1867240 1890601 1910961 1928980 1943099 1951718 1955212 1954871 1950759 1941920 1928196
53276 1928196 1910537 1889626 1865443 1838427 1810005 1781452 1752858 1723603 1693303 1661939 1629457
53265 1629457 1595655 1560293 1523230 1484671 1445175 1405025 1363724 1320762 1276820 1233476 1191604
53254 1191604 1150820 1110848 1072513 1036860 1003884 972816 943241 915198 888464 862388 836438
53243 836438 810448 784504 759025 734829 712591 692213 673183 655558 640086 627108 615726
$$ packed form
53324A254373j9075j7270j3570j0024q011p370p120o413m891k671j06K593N381
53311A165826P980R879J1075J2469J4915J7982K0232K0982K1309K3005K6703L1213
53299A383570L4611L5852L5602L5741L7694M0899M3124M2824M0745L8621L6587
53288A805870L3206K8164K3361K0360J8019J4119Q619L494l41m112q839j3724
53276A928196j7659k0911k4183k7016k8422k8553k8594k9255l0300l1364l2482
53265A629457l3802l5362l7063l8559l9496m0150m1301m2962m3942m3344m1872
53254A191604m0784l9972l8335l5653l2976l1068k9575k8043k6734k6076k5950
53243H36438k5990k5944k5479k4196k2238k0378j9030j7625j5472j2978j1382
$$ plain form
53232 615726 604572 593341 583137 574932 567922 559905 549481 537379 525307 513876 502202 489195
53220 489195 474479 458163 440607 422698 405600 389821 375012 361004 348520 338416 330513 323521
53208 323521 315903 306840 296864 287634 280411 274505 267954 260063 252356 246412 241688 236444 230165 223865
53194 223865 218351 213451 208976 205351 202892 201166 199352 196819 193359 189468 186459 185527 186404 187487 187520
53179 187520 186666 185717 184840 183553 181572 179251 177309 176327 176361 176917 177419 177786 178438 179820 182071 184947 187766
53162 187766 189733 190868 192331 195072 198274 200088 200036 199671 200455 201992 203160 204118 206091 209446 213051
53147 213051 215605 216857 217400 217866 218470 218893 218449 216788 214495 212727 212215 212875 214293 216155 218261 220512
53131 220512 222867 224809 225016 222352 217421 212429 209067 207075 205274 203411 202175 201749 201260 199741 197090
$$ packed form
53232F15726j1154j1231j0204q205p010q017j0424j2102j2072j1431j1674j3007
53220D89195j4716j6316j7556j7909j7098j5779j4809j4008j2484j0104p903o992
53208C23521p618r063r976r230p223n906o551p891p707n944m724n244o279o300
53194B23865n514m900m475l625k459j726j814k533l460l891l009r32Q77J083L3
53179A87520q54r49q77j287j981k321j942r82L4N56N02L67O52J382K251K876K819
53162A87766J967J135J463K741L202J814n2l65P84J537J168R58J973L355L605
53147B13051K554J252N43M66O04M23m44j661k293j768n12O60J418J862K106K251
53131B20512K355J942K07k664m931m992l362j992j801j863j236m26m89j519k651
$$ plain form
53116 197090 194027 191587 190655 191317 192403 192245 190315 187886 186707 187233 188383 188798 188008 186448 184707 182862
53100 182862 180539 177638 174814 172819 171328 168965 164831 159589 154612 150527 147306 145336 145217 146331
53086 146331 146798 145586 143999 144135 146238 148449 149051 148030 146274 144236 142055 140365 140065 141351 143527
53071 143527 145699 147074 146697 143839 139131 134728 132714 133447 135752 138254 139979 140125 138282 135128 132320
53056 132320 131386 132830 135976 139118 140152 138155 134572 131912 131001 130464 129217 128109 128199 128599 127502 124733
53040 124733 121847 120034 119353 119818 121667 124319 126469 127652 128550 129380 129250 127711 125764 124525 123852 123059
53024 123059 122007 120629 118423 115583 113817 114670 117496 120374 122559 124631 126530 127179 126458 126065 127629
53009 127629 130775 133689 134893 133977 131336 127950 125016 123160 122158 121672 121887 123026 124635 125851 126216
$$ packed form
53116A97090l063k440r32O62J086j58j930k429j179N26J150M15p90j560j741j845
53100A82862k323k901k824j995j491k363m134n242m977m085l221j970j19J114
53086A46331M67j212j587J36K103K211O02j021j756k038k181j690l00J286K176
53071A43527K172J375l77k858m708m403k014P33K305K502J725J46j843l154k808
53056A32320r34J444L146L142J034j997l583k660r11n37j247j108R0M00j097k769
53040A24733k886j813o81M65J849K652K150J183Q98Q30j30j539j947j239o73p93
53024A23059j052j378k206k840j766Q53K826K878K185K072J899O49p21l93J564
53009A27629L146K914J204r16k641l386k934j856j002m86K15J139J609J216L65
$$ plain form
52994 126216 125878 125283 125021 125641 127065 128311 128404 127601 127239 128262 130240 131984 132747 132577 131859 130997 130462
52977 130462 130633 131349 131954 132091 132262 133181 134724 136010 136554 136767 137096 137319 137179 137141 137687 138183 137451 135562
52959 135562 134077 134115 135033 135684 136222 137645 139882 141519 141677 141250 141757 143602 146132 148937 152108 155126
52943 155126 156485 155205 152369 150372 150504 151784 152464 152115 151650 151580 151101 149173 145888 142312 139306 137055
52927 137055 135546 134797 134400 133441 131374 128807 127001 126633 127325 128292 129021 129302 129065 128463 127814 127177 126191
52910 126191 124657 123062 122118 121805 121295 119972 118203 116913 116656 117305 118428 119606 120397 120443 119848 119279 119307
52893 119307 119659 119467 118462 117535 117668 118562 118996 118536 118133 118724 120005 121197 122329 123825 125123 124899 122871
52876 122871 120546 119682 120527 121952 122968 123756 125309 128085 130896 131402 128258 122659 117119 112895 109468
$$ packed form
52994A26216l38n95k62O20J424J246R3q03l62J023J978J744P63j70p18q62n35
52977A30462J71P16O05J37J71R19J543J286N44K13L29K23j40l8N46M96p32j889
52959A35562j485L8R18O51N38J423K237J637J58m27N07J845K530K805L171L018
52943A55126J359j280k836j997J32J280O80l49m65p0m79j928l285l576l006k251
52927A37055j509p49l97r59k067k567j806l68O92R67P29K81k37o02o49o37r86
52910A26191j534j595r44l13n10j323j769j290k57O49J123J178P91M6n95n69K8
52893A19307L52j92j005r27J33Q94M34m60m03N91J281J192J132J496J298k24k028
52876A22871k325q64Q45J425J016P88J553K776K811N06l144n599n540m224l427
$$ plain form
52861 109468 106473 104681 104426 104327 102799 100141 97887 96462 94812 92353 90021 88913 88800 88615 87831 86678
52845 86678 85272 83332 80945 79093 78880 80212 81744 82449 82830 83990 85753 86565 85416 83065 81108
52830 81108 80616 82074 85616 90471 94834 97293 98039 97947 97111 95255 93069 91819 91750 91978 91865 91364 90227
52813 90227 88250 86432 86383 88149 89996 90925 92041 94564 97821 100391 102216 104184 106289 107747 108625
52798 108625 109922 111951 113801 114657 114691 114395 113827 112897 111793 110781 109970 109360 108713 107425 105202 102971
52782 102971 102321 103651 105469 105963 104804 103019 101601 100878 100866 101469 102335 103061 103615 104135 104249 103154 100667
52765 100667 97881 96364 96694 98014 99008 99135 98934 99336 100807 103002 104967 105794 105341 104515 104621 106190
52749 106190 108476 110267 111072 111295 111356 111051 109900 107771 104971 101996 99471 98058 98010 98795 99450 99292 98142
$$ packed form
52861A09468k995j792k55r9j528k658k254j425j650k459k332j108j13j85p84j153
52845H6678j406j940k387j852k13J332J532P05L81J160J763Q12j149k351j957
52830H1108m92J458L542M855M363K459P46r2q36j856k186j250o9K28j13n01j137
52813I0227j977j818m9J766J847R29J116K523L257K570J825J968K105J458Q78
52798A08625J297K029J850Q56L4k96n68r30j104j012q11o10o47j288k223k231
52782A02971o50J330J818M94j159j785j418p23j2O03Q66P26N54N20J14j095k487
52765A00667k786j517L30J320R94J27k01M02J471K195J965Q27m53q26J06J569
52749A06190K286J791Q05K23O1l05j151k129k800k975k525j413m8P85O55j58j150
$$ plain form
52732 98142 96126 93706 91861 91620 93079 95161 96565 96762 96035 94952 94130 94231 95751 98723 102712 106916
52716 106916 110317 112163 112603 112529 112511 112272 111587 111218 112291 114941 118199 121098 123345 125009 126198 127059
52700 127059 127542 127222 125969 124659 124446 125278 125971 125822 125335 125179 125430 126152 127626 129355 129920 128766 127396
52683 127396 127736 129844 132185 133754 134773 135609 136184 136560 137155 138127 139224 140331 141508 142464 142680 142168
52667 142168 141457 140704 139507 137774 136095 134968 134185 133397 132842 133063 134055 134938 134462 131903 127714 123319
52651 123319 120087 118522 118358 118938 119109 117502 113885 109986 107965 107958 108038 106707 104537 103034 102815 103439 104362
52634 104362 105318 106143 106789 107412 108184 109183 110595 112627 115045 117188 118608 119271 119012 117429 114628 111557
52618 111557 109226 108029 108065 109498 112077 114826 116838 118053 118811 119119 119071 119539 121517 124685 127415 128388
$$ packed form
52732I8142k016k420j845k41J459K082J404J97p27j083q22J01J520K972L989M204
52716A06916L401J846M40p4j8k39o85l69J073K650L258K899K247J664J189Q61
52700A27059M83l20j253j310k13Q32O93j49m87j56K51P22J474J729N65j154j370
52683A27396L40K108K341J569J019Q36N75L76N95R72J097J107J177R56K16n12
52667A42168p11p53j197j733j679j127p83p88n55K21R92Q83m76k559m189m395
52651A23319l232j565j64N80J71j607l617l899k021pQ0j331k170j503k19O24R23
52634A04362R56Q25O46O23P72R99J412K032K418K143J420O63k59j583k801l071
52618A11557k331j197L6J433K579K749K012J215P58L08m8M68J978L168K730R73
$$ plain form
52602 128388 127756 126611 125889 126115 127649 130547 134110 137002 138147 137636 136632 136296 136814 137587 138193 138833
52586 138833 139807 140957 141915 142655 143415 144087 143978 142418 139578 136524 134292 132872 131249 128528 124814 120942
52570 120942 117737 115864 115923 117940 120751 122596 122610 121373 119972 119009 118644 118926 119598 119855 118839 116402
52554 116402 113243 110468 109042 109360 111052 113220 114938 115611 115116 113921 112919 112818 113760 115793 119146
52539 119146 123332 126368 126154 123010 119905 119585 122067 125316 127636 128657 128614 127699 126280 125188 125357 126915
52523 126915 128503 127924 124231 119148 115616 114758 115156 115256 115211 115658 115953 114907 112638 110400 108869 107798
52507 107798 107158 107382 108354 109247 109677 110097 110641 110427 108611 105638 102852 101202 100836 101653 103502 105676 106886
52490 106886 106429 105302 105446 107536 109994 110841 110146 109690 110252 110454 108829 106088 104419 105024 107153 109146
$$ packed form
52602A28388o32j145p22K26J534K898L563K892J145n11j004l36N18P73O06O40
52586A38833R74J150R58P40P60O72j09j560k840l054k232j420j623k721l714l872
52570A20942l205j873N9K017K811J845J4j237j401r63l65K82O72K57j016k437
52554A16402l159k775j426L18J692K168J718O73m95j195j002j01R42K033L353
52539A19146M186L036k14l144l105l20K482L249K320J021m3r15j419j092J69J558
52523A26915J588n79l693n083l532q58L98J00m5M47K95j046k269k238j531j071
52507A07798o40K24R72Q93M30M20N44k14j816k973k786j650l66Q17J849K174J210
52490A06886m57j127J44K090K458Q47o95m56N62K02j625k741j669O05K129J993
$$ plain form
52474 109146 109686 108392 106128 104676 105293 107467 109613 110908 111806 112819 113611 113610 112960 112473 112861 114169 115765
52457 115765 116803 116930 116642 116767 117586 118594 119109 118964 118588 118452 118423 117846 116460 114998 114364 114336 113839 112559
52439 112559 111393 111037 111042 110801 110636 111254 112861 115410 118756 121858 122949 121735 120423 121071 122683 122697 120735
52422 120735 118738 117592 116033 113512 111828 112642 114966 116620 117094 117545 118745 120420 122222 124166 126256
52407 126256 128545 131315 134451 136971 137966 137736 137252 136739 135616 133696 131653 130401 130635 132802 136567
52392 136567 140366 142444 142776 143219 145368 148818 152040 154449 156811 159765 162807 165083 166753 168937 172321
52377 172321 176300 179774 182424 184748 187037 189012 190737 193200 197285 202299 206288 208066 208443 209144 210905
52362 210905 213236 215737 218739 222323 225581 227695 229429 232602 238081 245124 252829 261234 270490 279841
$$ packed form
52474A09146N40j294k264j452O17K174K146J295Q98J013P92jo50m87L88J308J596
52457A15765J038J27k88J25Q19J008N15j45l76j36k9n77j386j462o34k8m97j280
52439A12559j166l56Nk41j65O18J607K549L346L102J091j214j312O48J612J4j962
52422A20735j997j146j559k521j684Q14K324J654M74M51J200J675J802J944K090
52407A26256K289K770L136K520R95k30m84n13j123j920k043j252K34K167L765
52392A36567L799K078L32M43K149L450L222K409K362K954L042K276J670K184L384
52377A72321L979L474K650K324K289J975J725K463M085N014L989J778L77P01J761
52362B10905K331K501L002L584L258K114J734L173N479P043P705Q405R256R351
$$ plain form
52348 279841 288405 296507 305386 315723 327211 339363 352022 365109 378667 393221 409466 427504
52336 427504 446887 467414 489224 512130 535507 558987 582697 606703 630724 654414 677243
52325 677243 698154 716254 732130 747566 763433 778587 791446 802016 811607 820944 829367 835723
52313 835723 839416 840585 839803 837653 834288 829377 822734 814989 807366 800640 794387 787333 778583 768721
52299 768721 759586 752747 748228 744902 741935 739483 738307 739368 743660 751479 761690 772526 783522
52286 783522 795916 810811 827760 845714 864520 884482 905016 924779 942978 959582 974342
52275 974342 986529 995953 1003518 1010425 1017215 1023831 1030102 1035692 1039797 1041367 1039893 1035862 1030304 1023807
52261 1023807 1016180 1007181 997262 987079 976423 964450 951232 938289 927000 917018 906948 896194
$$ packed form
52348B79841Q564Q102Q879J0337J1488J2152J2659J3087J3558J4554J6245J8038
52336D27504J9383K0527K1810K2906K3377K3480K3710K4006K4021K3690K2829
52325F77243K0911J8100J5876J5436J5867J5154J2859J0570R591R337Q423O356
52313H35723L693J169p82k150l365m911o643p745p623o726o253p054q750r862
52299G68721r135o839m519l326k967k452j176J061M292P819J0211J0836J0996
52286G83522J2394J4895J6949J7954J8806J9962K0534J9763J8199J6604J4760
52275I74342J2187R424P565O907O790O616O271N590M105J570j474m031n558o497
52261A023807p627q999r919j0183j0656j1973j3218j2943j1289r982j0070j0754
$$ plain form
52249 896194 885347 875063 865553 857226 850921 847058 845047 843912 843151 842753 842794 843381 844734 846975 849943
52234 849943 853484 857872 863695 871217 879902 888593 896356 903303 910552 919146 929036 939225 948631 956483
52220 956483 962240 966077 969635 975327 984056 994025 1002548 1008774 1013875 1018956 1023991 1028968 1034645 1041293
52206 1041293 1047687 1052528 1056283 1060304 1064420 1066966 1067442 1067542 1068655 1069527 1067756 1062978 1057258 1052439 1048352
52191 1048352 1043902 1038855 1033888 1029318 1024469 1018370 1010930 1003290 996895 992130 988101 983843 979354 975140
$$ packed form
52249H96194j0847j0284r510q327o305l863k011j135p61l98M1N87J353K241K968
52234H49943L541M388N823P522Q685Q691P763O947P249Q594R890J0189R406P852
52220I56483N757L837L558N692Q729R969Q523O226N101N081N035M977N677O648
52206A041293O394M841L755M021M116K546M76J00J113Q72j771m778n720m819m087
52191A048352m450n047m967m570m849o099p440p640o395m765m029m258m489m214
$$ [...]
##END NTUPLES=NMR SPECTRUM
##END=
