##TITLE=NES1067_159122.0008_002_9705217_n3veQimBWz
##JCAMPDX= 6.0         $$ Bruker NMR JCAMP-DX V2.0
##DATA TYPE= NMR SPECTRUM
##DATA CLASS= NTUPLES
##ORIGIN= BRUKER
##OWNER= Administrator
$$ 1.72 TOPSPIN		Version 2.1
$$ 2016-05-01 20:33:14.005 -0700  Administrator@X
$$ Compression mode = diff/dup
##.OBSERVE FREQUENCY= 400.02188249412
##.OBSERVE NUCLEUS= ^1H
##.ACQUISITION MODE= SIMULTANEOUS (DQD)
##.ACQUISITION SCHEME= undefined
##.AVERAGES= 8
##.DIGITISER RES= 22
##SPECTROMETER/DATA SYSTEM= spect
##.PULSE SEQUENCE= zg30
##.SOLVENT NAME= COFFEE_meoh
##.SHIFT REFERENCE= INTERNAL, COFFEE_meoh, 1, 14.98509
##AUDIT TRAIL= $$ (NUMBER, WHEN, WHO, WHERE, PROCESS, VERSION, WHAT)
$$ ##TITLE= Audit trail, TOPSPIN		Version 2.1
$$ ##JCAMPDX= 5.01
$$ ##ORIGIN= Bruker BioSpin GmbH
$$ ##OWNER= Administrator
$$ $$ E:\/data/COFFEE/nmr/NES1067_159122.0008_002_9705217_n3veQimBWz/10/pdata/1/auditp.txt
$$ ##AUDIT TRAIL=  $$ (NUMBER, WHEN, WHO, WHERE, PROCESS, VERSION, WHAT)
(   1,<2016-05-01 20:33:06.942 -0700>,<Administrator>,<X>,<go>,<TOPSPIN 2.1>,
      <created by zg
	started at 2016-05-01 20:32:01.224 -0700,
	POWCHK enabled, PULCHK disabled,
       configuration hash MD5:
       21 0F 79 D6 B3 7B B4 F6 88 20 88 DB 03 48 BD 9F
       data hash MD5: 64K
       8A 88 E8 6A B2 D0 4D 80 2C 60 4C 19 7D 05 CB F5>)
(   2,<2016-05-01 20:33:10.083 -0700>,<Administrator>,<X>,<proc1d>,<TOPSPIN 2.1>,
      <Start of raw data processing
       efp LB = 0 FT_mod = 6 PKNL = 1 PHC0 = 0 PHC1 = 0 SI = 32K 
       data hash MD5: 32K
       D0 F4 86 38 25 50 3E 33 D1 F5 6D 70 BC 4A 54 52>)
(   3,<2016-05-01 20:33:10.349 -0700>,<Administrator>,<X>,<proc1d>,<TOPSPIN 2.1>,
      <pk PHC0 = 94.39453 PHC1 = 0 
       data hash MD5: 32K
       5B 0C 06 64 F1 54 66 60 51 66 AB 61 7E 46 B7 C8>)
(   4,<2016-05-01 20:33:10.458 -0700>,<Administrator>,<X>,<proc1d>,<TOPSPIN 2.1>,
      <abs ABSG = 1 
       data hash MD5: 32K
       A1 98 5A F3 21 42 F6 37 E0 CF 20 53 2F 34 BF B3>)
(   5,<2016-05-01 20:33:10.505 -0700>,<Administrator>,<X>,<proc1d>,<TOPSPIN 2.1>,
      <abs ABSG = 2 
       data hash MD5: 32K
       9C 19 2C 35 1F 4E 6E 77 28 87 ED D6 21 93 2C 61>)
(   6,<2016-05-01 20:33:10.567 -0700>,<Administrator>,<X>,<proc1d>,<TOPSPIN 2.1>,
      <abs ABSG = 3 
       data hash MD5: 32K
       3F 25 09 BD DB E2 0F 5B 58 7B F9 37 94 EE 11 FD>)
(   7,<2016-05-01 20:33:10.630 -0700>,<Administrator>,<X>,<proc1d>,<TOPSPIN 2.1>,
      <abs ABSG = 4 
       data hash MD5: 32K
       DB 09 DD A9 EA B0 53 A6 69 70 62 54 14 28 89 EC>)
(   8,<2016-05-01 20:33:10.692 -0700>,<Administrator>,<X>,<proc1d>,<TOPSPIN 2.1>,
      <abs ABSG = 5 
       data hash MD5: 32K
       C5 6E 32 DC 45 D4 B4 59 82 1C C7 5E 43 A2 5A CF>)
$$ ##END=
$$ 
$$ $$ hash MD5
$$ $$ F7 BF C1 CC 43 9B 88 0A 58 F9 D0 D5 84 71 E7 02
##$RELAX= 
##$RELAX= 
##$RELAX= 
##$RELAX= 
##$RELAX= 
##$RELAX= 
##$RELAX= 
$$ Bruker specific parameters
$$ --------------------------
##$DU= <E:\>
##$EXPNO= 10
$$ [...]
150 150 150 150 150 150 150 150
##$TP07= 0
##$TPNAME0= <>
##$TPNAME1= <>
##$TPNAME2= <>
##$TPNAME3= <>
##$TPNAME4= <>
##$TPNAME5= <>
##$TPNAME6= <>
##$TPNAME7= <>
##$TPOAL= (0..7)
0.5 0.5 0.5 0.5 0.5 0.5 0.5 0.5
##$TPOFFS= (0..7)
0 0 0 0 0 0 0 0
##$TUNHIN= 0
##$TUNHOUT= 0
##$TUNXOUT= 0
##$USERA1= <user>
##$USERA2= <user>
##$USERA3= <user>
##$USERA4= <user>
##$USERA5= <user>
##$V9= 5
##$VALIST= <valist>
##$VCLIST= <CCCCCCCCCCCCCCC>
##$VD= 0
##$VDLIST= <DDDDDDDDDDDDDDD>
##$VPLIST= <PPPPPPPPPPPPPPP>
##$VTLIST= <TTTTTTTTTTTTTTT>
##$WBST= 2048
##$WBSW= 25
##$XGAIN= (0..3)
0 0 0 0
##$XL= 0
##$YL= 0
##$YMAX_a= 642971
##$YMIN_a= -546247
##$ZGOPTNS= <>
##$ZL1= 120
##$ZL2= 120
##$ZL3= 120
##$ZL4= 120
##$ABSF1= 14.98509
##$ABSF2= -5.573092
##$ABSG= 5
##$ABSL= 3
##$ALPHA= 0
##$AQORDER= 0
##$ASSFAC= 0
##$ASSFACI= 0
##$ASSFACX= 0
##$ASSWID= 0
##$AUNMP= <proc_prof1d_extract_pilot.lims>
##$AXLEFT= 0
##$AXNAME= <>
##$AXNUC= <1H>
##$AXRIGHT= 0
##$AXTYPE= 0
##$AXUNIT= <>
##$AZFE= 0.1
##$AZFW= 0.1
##$BCFW= 0
##$BC_mod= 0
##$BYTORDP= 0
##$COROFFS= 0
##$CY= 15
##$DATMOD= 1
##$DC= 0
##$DFILT= <>
##$DTYPP= 0
##$F1P= 0
##$F2P= 0
##$FCOR= 0.5
##$FTSIZE= 32768
##$FT_mod= 6
##$GAMMA= 0
##$GB= 0
##$INTBC= 1
##$INTSCL= 1
##$ISEN= 128
##$LB= 0
##$LEV0= 0
##$LPBIN= 0
##$MAXI= 10000
##$MC2= 0
##$MEAN= 0
##$ME_mod= 0
##$MI= 0
##$NCOEF= 0
##$NC_proc= -8
##$NLEV= 6
##$NOISF1= 0
##$NOISF2= 0
##$NSP= 0
##$NTH_PI= 0
##$NZP= 0
##$OFFSET= 14.98509
##$PC= 1
##$PHC0= 94.39453
##$PHC1= 0
##$PH_mod= 1
##$PKNL= yes
##$PPARMOD= 0
##$PPDIAG= 0
##$PPIPTYP= 0
##$PPMPNUM= 2147483647
##$PPRESOL= 1
##$PSCAL= 4
##$PSIGN= 0
##$PYNMP= <proc.py>
##$REVERSE= no
##$SF= 400.02
##$SI= 32768
##$SIGF1= 0
##$SIGF2= 0
##$SINO= 400
##$SIOLD= 32768
##$SPECTYP= <>
##$SREGLST= <1H.CDCl3>
##$SSB= 0
##$STSI= 32768
##$STSR= 0
##$SW_p= 8223.68421052631
##$SYMM= 0
##$S_DEV= 0
##$TDeff= 65536
##$TDoff= 0
##$TI= <>
##$TILT= no
##$TM1= 0
##$TM2= 0
##$TOPLEV= 0
##$USERP1= <user>
##$USERP2= <user>
##$USERP3= <user>
##$USERP4= <user>
##$USERP5= <user>
##$WDW= 1
##$XDIM= 32768
##$YMAX_p= 415309492
##$YMIN_p= -690696
##$CURPLOT= <Network HP LaserJet P1505>
##$CURPRIN= <$Network HP LaserJet P1505>
##$DFORMAT= <normdp>
##$LAYOUT= <+/1D_H.xwp>
##$LFORMAT= <normlp>
##$PFORMAT= <normpl>
##$SURQMSG= 1
$$ End of Bruker specific parameters
$$ ---------------------------------
##NTUPLES= NMR SPECTRUM
##VAR_NAME=  FREQUENCY,     SPECTRUM/REAL,   SPECTRUM/IMAG
##SYMBOL=    X,             R,               I
##VAR_TYPE=  INDEPENDENT,   DEPENDENT,       DEPENDENT
##VAR_FORM=  AFFN,          ASDF,            ASDF
##VAR_DIM=   32768,         32768,           32768
##UNITS=     HZ,            ARBITRARY UNITS, ARBITRARY UNITS
##FACTOR=    0.250966925370066, 1,           1
##FIRST=     8223.43324360094, -314568,      -283539
##LAST=      0,             -142974,         -206561
##MIN=       0,             -690696,         0
##MAX=       8223.43324360094, 415309492,    0
$$ Real data points
##PAGE= N=1
##DATA TABLE= (X++(R..R)), XYDATA
$$ [...]
23850 356530 39503 321320 -103888 -115887 15996 -81070 -161581 58306 -158292 68828 47224
23839 47224 7612 -309615 -366301 104254 33121 134849 -81148 -105541 18602 -128461 -282578
23828 -282578 225283 408168 -115612 -63192 160709 -26324 -67616 -22058 -382545 130471
23817 -18889 -55984 129247 -234043 76102 306293 63464 -44884 61191 -74339 35389 29177
23806 29177 -113884 -139339 -18290 -63338 254575 -47821 -71500 19220 -192627 -31561 50323
23794 265908 -16866 183415 291418 -285614 3181 35030 -163267 60453 -247262 135521
23783 -20428 -1512 -11491 -12480 -51639 -194666 100333 296084 269448 21118 128175 -149250
23771 142672 305516 -93315 271843 -159413 56557 8776 -441813 -84575 -214612 -91651 32242
23759 160769 22428 -8976 -153315 -285825 -189638 -37098 -518794 324712 -32247 -9108 -200417
23748 -200417 -33650 -279142 -85320 12656 -255740 79980 245423 -126119 181520 -291586
23737 30457 283283 153785 -71281 -169630 -80295 -102288 304397 -126499 -68185 -85064 45432
23725 -214145 -143303 -120353 -265750 7820 -105567 -189186 -233907 -18715 -76491 18001 71030
23714 71030 12926 69140 -354605 -123020 254346 -41282 161676 -154626 125778 275222
23704 275222 172234 228176 106342 -88231 -67111 -468413 -2024 -213638 -199174 -77491 -152868
23693 -152868 -39457 -3825 55636 368856 58197 -75286 -173029 -28642 -64945 39499 75868
23682 75868 125489 -300981 -104937 -173728 -27262 76857 2541 63195 317995 119140 -99457
23670 123401 4901 329946 -177446 -85599 -13831 -86033 157334 333225 -14933 184643 -138139
23658 -52754 95973 45346 205623 -81053 -199787 52545 -161825 -114208 469886 49061 -114820
23646 6621 -180845 73268 -159609 16404 19223 190439 58945 47941 65735 29825 192696
23635 192696 127437 49682 107028 238729 -57029 139541 -82184 -73524 -225307 -114931 -665
23623 -91864 -441687 -52987 -21916 162688 29166 284258 -338382 -77327 -101572 48956 -60830
23611 -64483 29315 -115647 -29847 23267 -97514 318678 -140520 104212 -143135 211923
23600 -104945 -11282 -328481 56989 33987 149361 -96379 -158715 141220 186981 -77953 228442
23588 -121575 -78257 508195 45586 146226 75241 16068 -203046 -161017 158197 -18621 -57848
23577 -57848 -4900 -259642 386906 135441 50417 187471 275179 152287 -199461 -12064 161294
23565 132006 -268118 -19942 98942 201401 254974 -15925 47601 -3770 -202030 -40607 -48235
23554 -48235 106326 252217 39498 -34444 -55876 59608 -14964 -124749 -281847 81915 -33231
23542 76809 -476786 78957 -50724 -56714 132924 -18662 -92614 140561 42045 49185 111359
23531 111359 -189 -61503 -196477 -24417 -157372 55470 -150098 -200209 -16685 -19550 -114279
23520 -114279 95730 33851 -199700 -193127 8800 163330 -43073 -102327 -286007 114286 -46040
23508 -41766 -149753 -23223 73924 -79092 -31824 180222 301402 -404695 -174606 195361
23497 66703 -182727 -305180 23943 -179216 102344 17753 174125 128591 -80067 -348062
23487 -348062 -121125 256019 225503 -96065 173707 -107152 -61266 65606 -54958 142589
23476 265265 -211323 -8615 216160 189098 -76597 220802 42860 244102 90181 182916 -60722
23464 -17243 -85964 83861 -140740 55483 -146372 -209062 -78148 358152 127335 -60852 -17302
23452 35691 -40121 -40653 357074 -44266 33800 -115702 6520 -120613 47845 99757 -499179
23440 -416250 216271 -120784 7587 23598 92575 -375589 -135950 -10087 85585 -239814 -105128
23428 -112812 -323179 -9809 142806 -8186 75563 -121332 -136550 -9102 -334227 -109997 -94711
23417 -94711 106692 -86491 -305694 -50401 -25944 -226297 -320251 253152 296546 55450 -103652
23405 123036 187869 -130929 116417 160158 -265705 -117664 -8626 -28283 124125 153340 53309
23393 133400 209653 -164980 -168932 -24283 83414 -174325 -211222 181069 -59182 106264 109811
23382 109811 -201813 54667 93589 -38881 -130618 -30697 100658 414583 -172967 -483288
23372 -483288 -304286 -278306 -383604 117957 -5220 148789 -369248 168114 49095 20416
23361 -94945 3293 131491 215540 -125781 -87556 -273 -93126 -29905 -54212 -83742 217621 -4594
23348 205913 -198668 -35188 -44186 535476 223210 52264 -103655 72391 -175821 10585 204702
23337 204702 -34060 29374 -35680 136591 -2268 222684 135959 -31691 -69630 -87129 61793
23325 -110418 169056 223839 -2999 -394609 -141804 3815 71969 148430 103920 -18282 166618
23313 47272 236256 720 -56836 42492 65791 112297 -104490 -460361 -249306 163473 -149536
23301 -86043 -31637 -16855 239074 -113356 245303 -28248 81276 191766 -136590 142215
23290 -11411 183578 -165631 -226181 26944 -108120 -60058 -109233 -311466 50064 62063 -80752
23278 -135652 73689 -219300 -206941 179077 16601 67516 206345 -333109 -24633 16576 153116
23267 153116 144942 -9190 185054 142039 121082 393 -168251 -98653 -372134 -90839 -2187 -122298
23255 -122298 -116108 22038 -79580 -5217 109858 -66434 -18942 105717 134013 -34522 -242751
23244 -242751 -410779 -167088 -142680 -27325 137995 -305995 -275826 64043 -35536 444952
23233 -119503 -103906 -122489 10878 -22964 -460176 -188192 -149135 95879 -192576 11655 75916
23222 75916 26697 -8858 -171198 194147 -116896 -25991 -189921 -236879 296646 90756 155530
23211 155530 -121321 -111085 239507 -190377 39050 -2058 325557 -198204 -83908 275647
23200 45013 149327 -96554 200595 -17676 175448 -103634 -18956 168651 299390 -105895
23189 -387725 193993 -22071 -383986 41774 28516 -233284 -56047 -215546 -12114 -44349 -113937
23178 -113937 -78151 191340 -233445 -118629 98615 28654 22674 123994 -100644 18052 -129271
23166 -156972 -205043 -189570 -51138 -198392 -2853 -19488 226128 -8324 21014 39383 101907
23155 101907 -52588 295943 44727 66614 -303664 114302 366183 69593 -294450 -124708
23144 65423 -52302 160615 -199563 -151981 179474 -104353 215226 142915 -112747 -245823
23134 -245823 207809 -18475 20839 -76806 -238924 -210732 82394 -132159 -48009 -185653 117729
23122 -79607 -230124 79724 -83952 -247305 171728 -143388 -150839 -114642 14619 18478 273819
23111 273819 -110247 8387 13001 -44616 -115506 -178590 156503 44595 172927 -30522 -214669
23100 -214669 -262535 137638 48106 173405 -143582 61496 405056 -253987 -43259 -48924 -103386
23089 -103386 -219503 -133624 -159458 -121784 -247308 -165427 -228067 -37276 277966 -180647 39111
23077 237483 -76919 -127470 -51884 -258189 -77744 93531 11150 -501219 211100 15386 24091
23066 24091 -8118 255647 25378 -104495 155562 -65234 -159847 -68327 -61504 -414239 -5240
23054 37363 -4574 -318994 -213535 37172 262388 -77606 -135530 -170531 -9935 48537 206190
23043 206190 34792 327752 -31298 254193 -219253 211153 68588 226014 -155576 359828
23032 167609 54477 -90471 -44939 8476 -138415 21057 -140626 -199294 -11717 196887 -11324
23020 -72153 -201310 -2752 -49619 -253755 112110 53989 31293 104529 -176121 -110160 -197383
23009 -197383 14685 269793 -248192 181299 -5244 -162451 -5833 -107618 -259271 -104228
22998 -126351 161258 -68789 -151663 -63569 -356740 100660 -33719 -45220 177606 -203959
22987 78754 -6571 19343 -28186 174348 253370 -116593 30397 -192288 125376 -87328 -151730
22976 -151730 -360072 89244 -79358 -102317 143304 -44051 -144898 185529 102939 -217954
22965 -87879 -324227 107750 167475 82942 -7369 125570 -352632 -177777 -38630 42559 11430
22953 -30969 -196050 -325405 -104957 161309 -177396 -547 83904 -126032 -15665 -49487 -53512
22942 -53512 -124491 -253429 71358 290124 -75755 125772 -161241 -160185 -37323 -3090 133656
22930 -161302 -105588 -162172 -171008 -158602 -34608 -83695 -46320 -109344 51846 -39417 -78854 -110184
22918 -110184 -147421 -105738 -119456 -109611 195507 -252237 -199272 -30764 -5424 -84550 182728
22906 -194552 -292617 -256345 -161500 -98206 55578 148096 190890 -324904 -119535 428687 -307088
22894 -201401 39900 81045 -325032 38881 -43738 -310059 -192668 128498 -151712 -187038
22884 -187038 50260 -15018 305563 -12347 -21733 301476 -328127 165514 -34605 22424 -70558
22872 -101216 -126629 -82646 -131220 -1702 26440 -49618 62878 -13833 -138544 4394 195668
22861 195668 -68103 -146881 248389 -111650 41412 273627 52186 -335823 -69033 142455
22850 51582 -290139 123386 -136642 -38346 153000 -14197 505046 -5138 237063 115530
22839 -124346 -76612 187302 -248837 -112226 187152 -33495 1271 288301 146928 47110
22828 -30989 -263700 209598 -41981 -232121 -404877 56392 100527 -23409 243095 28946 4257
22816 -48242 -97867 -143509 -10864 147154 -410109 16482 -17534 -107342 36060 -223317 -177978
22805 -177978 404709 -222762 -143469 -195029 120117 52923 172281 -13318 -14026 322725 7799
22793 -83253 -247224 228882 211768 -489493 -211726 -315535 -84277 141670 247361 294931
22783 294931 132693 -116068 187807 -82332 69468 -201480 315656 88528 -208700 -184736
22773 -184736 268759 -378244 -228689 144880 225242 176282 209004 -223071 111934 -150114
22762 29592 -22449 28374 35811 -239177 255180 79634 270899 -145614 -169416 -56330 26798
22750 -33738 168172 -154215 -269587 25856 -24840 186568 -29496 -101086 105144 -55622 -19722
22738 61032 -82074 205918 9282 -204508 109157 11681 -344907 54203 -90035 120719 -58584
22726 324048 -2042 -18924 241942 11150 -86304 -80674 -163583 185187 143910 -215977 -23171
22714 -45888 -481819 -302746 5904 -21559 47746 -413003 81352 -143053 20969 56367 -309550
22702 -504603 19024 -9561 -131264 39665 -86887 -294460 129922 -101021 -29780 -60846 -334018
22691 -334018 20349 65055 110968 -53168 -53652 -143252 -59856 428836 -149847 -169335 143315
22679 -73412 -48999 -265467 -122424 -7824 -81409 15613 -82079 -486824 -303819 -29038 -203632
22668 -203632 137704 138486 -66224 -40837 255924 -187979 31434 -38077 -64470 -110562 84659
22656 -208673 218642 -102172 -9006 -253462 -87729 58603 83777 117857 19152 320789 -49444
22644 -60656 15348 -33858 -22273 -70650 166117 -234798 -359235 -44490 -38714 205064 89757
22632 -260646 101420 8618 -81941 49218 -18692 231942 14620 -72321 337744 148693 40062
22620 -63681 -110225 192058 -292453 -68599 -102602 -68832 234495 -296978 -346288 -70619 -141770
22609 -141770 -79957 28674 -17693 -230046 -94540 259933 155143 -18901 -48358 -127046 -84768
22598 -84768 -267399 116043 60033 -83224 122323 -209166 52849 -274668 34945 9774 -77667
22586 -165721 -88862 29458 -20938 66211 -39722 -10368 -190133 -231998 94371 -177504 -50374
22574 103148 -254870 -190620 106854 27149 -63135 318676 -76846 249377 83336 -94902 -58844
22563 -58844 -221076 6562 99435 -290441 154214 53065 -94334 79515 -72566 133157 10416
22551 -121765 -31579 198454 -245007 190223 64308 -365985 43748 -353665 38960 110710
22541 110710 -48888 -109326 30972 -76029 -169833 29305 143717 -414292 272176 104011 -404210
22529 -83034 -180042 76560 -108699 -318103 388821 16803 -64884 24749 -171811 -168994 77513
22517 -64286 69925 63085 -167908 117683 158761 -43691 260101 165184 -60225 -219995 215495
22505 -54646 15057 -34747 170718 -196958 -277501 -17930 230192 -33763 -173642 271245 -234398
22493 208150 490578 -123216 161119 -85757 309162 164197 -15840 -293786 -175976 -153571
22483 -153571 -39482 -165766 -81905 151543 107105 -108475 45369 -352752 -101302 246107
22472 69378 -206331 -155098 105201 37042 -330172 97947 100151 -369094 -73331 211823 129715
22461 129715 518338 -90678 25778 -90135 -186595 -224478 35343 -161046 -251661 -105238 143579
22449 -321572 -82846 -136846 -396182 76195 -109909 -87712 -166269 -206251 215 36756 -239677
22437 234980 29423 88496 -267428 77006 -152083 55379 -18258 -196588 133610 -115664
22426 -3528 -184716 -151565 -118899 -20514 -5443 -236121 -214646 258152 -357047 -110429 -156347
22415 -156347 261888 90877 87034 15503 -249463 -83930 139954 -64100 66509 -70542 -73731
22404 -73731 -34403 -268957 7783 -232136 -88833 309986 -120914 -89402 -189440 304265 -197237
22392 -35055 -189902 120097 93475 -216416 -176080 85979 155126 185762 -96960 137914 -84004
22380 13588 259340 219953 -82785 87564 -101864 27301 116499 284330 -346675 73738 -151397
22368 -392603 106135 308274 261081 -42936 81608 244401 -94638 -105560 -107410 134065 79471
22357 79471 -104900 121611 -177717 193826 -54343 -37504 106155 -38271 -228574 100572
22346 -68554 -60767 -185779 -7093 -237889 122918 -34717 -408105 -43831 5158 29427 -116462
22334 -109704 -77733 -20741 176950 -103577 95127 42021 -88400 -158051 49049 -43815 -286018
22323 -286018 157334 -239798 79862 50688 -66184 13092 168149 153944 -119291 -56638 182839
22311 -59032 227143 -135539 -124866 -117984 330376 -229604 84438 -107571 -153725 -225331 -105964
22299 66190 44477 -145646 -144352 47726 60696 131533 171065 -187745 57444 -239839 -185502
22288 -185502 -13057 -141196 -78114 -144856 -280162 -220127 -302272 -73731 216388 -65917 -89794
22277 -89794 26055 -32843 -53277 -595 -155780 140863 -137328 -262647 -188575 -136232 -210447
22266 -210447 90101 162973 -236864 -163168 -223456 220518 -167050 153774 -85151 122851
22255 313380 -71632 -297850 140829 -103331 -77753 -11965 18140 151019 -109190 37302
22244 -101420 222505 -105609 201595 -56697 46788 -13742 141939 93395 -37408 -9121 32860
22232 -97978 90242 159624 -104071 175707 -157439 -28142 -37202 138374 -197315 276940 32734
22220 -258408 -240114 -104119 172656 -85824 -162020 55625 152728 -266597 46940 5661 295704
22209 295704 250067 12381 55141 -128541 -144021 75423 112917 35116 -63835 15854 19188
22198 19188 197929 -147334 -63670 -70608 -269793 260435 -314066 86320 -80649 343051 -76130
22186 11764 166133 -58987 -4504 62850 -40157 -167540 -445660 40457 -432432 308412 -113950
22174 108015 133527 -196433 99126 -10858 -67105 134767 32032 -54669 -137736 -37298 -163971
22163 -163971 162586 266487 -408379 -209131 189697 -19601 -166822 168703 -183084 -409663
22153 -409663 -3874 142513 53458 -92179 19632 37485 80761 -72919 -59962 -176618 73004
22141 -137261 -21573 -134210 484557 23272 285335 149275 341289 -254401 136388 -302838
22130 215762 -12755 159101 202448 -14130 61936 47265 -229167 137248 -84269 -38411 -12408
22118 -6068 -97715 146361 293449 -255787 -250516 94063 -197651 185947 -259105 21986 68163
22107 68163 345648 -169281 -98260 105149 329114 -221104 224868 11811 39990 -149664
22096 -169438 85751 75336 -169904 -86866 -110821 -35762 -197479 237265 -80010 4353 -107981
22084 9009 -250553 -227013 205986 359256 -59381 -21679 181252 -165571 -391441 67293 84525
22073 84525 174138 -137501 -199576 199125 -330106 106718 124524 -202332 -113468 -136563 132245
22061 36003 -221722 38944 -30411 -108679 -287885 -14627 -64591 -245553 -331691 -68326 -69211
22050 -69211 -936 31214 -144017 -297501 145974 -197248 -71169 -140421 156230 -281991 82425
22038 -61599 -85158 -29237 3045 -219845 -21851 -26584 -151450 13126 108675 871 -18673 19781
22025 -2577 212049 143592 -64950 -149983 -130883 74889 -66250 -352438 33548 -187461 124429
22013 -36746 -126636 -114071 -115978 256958 -62998 186635 113413 29513 -22972 18624 425025
22002 425025 -384630 -157114 -39342 139707 316264 183075 -3792 106720 147104 -2247 -235313
21991 -235313 -38089 117728 -169282 -28194 -85681 -74465 -4598 -60861 -109139 -136781 282327
21979 225841 103319 69715 -331827 -104305 -145285 -19976 -69253 -110465 249913 197483 -200945
21967 -18801 -112052 -437783 200828 65328 61522 173779 76735 31851 137506 66377 -68722
21955 8243 245174 -14897 -189041 -182246 -204521 34736 35634 28270 197155 122244 208589 -89398
21942 -131171 29123 28631 53645 -264474 49282 -6671 -29634 136875 9824 -475645 -147041
21930 -250862 248875 212653 178437 -117894 -195772 64827 158878 -285288 -116832 34996 -76955
21918 -270107 -39753 -103892 -168755 358866 178478 -332952 304690 -54410 -87082 -268445
21908 -268445 142788 4405 -228456 -51948 -368912 -221390 -379021 177525 92929 19304
21897 -260531 23384 225145 123052 111299 222575 -7465 -177106 12783 -33856 114272 -28185
21885 113802 66244 -136046 280459 -83689 -241174 143306 84894 -12248 71901 -165249
21874 -142264 185595 135306 26935 -53450 -99582 -176158 -375892 -328475 -57338 325083 -226580
21862 75611 103483 -130644 182281 -299890 132765 95230 -115425 75217 -24483 31665 55786
21851 55786 -189139 -131901 -34380 74334 -107861 293667 -52009 -194655 18129 63643 99336
21840 99336 124542 128041 -232799 -205308 -340791 -15134 -100632 -412847 109477 294939 -302753
21828 145684 141991 -18327 39322 -16402 38987 -230264 132328 -97794 7178 -5962 -16431 277550
21815 -5420 149457 38633 2228 -41878 96860 44074 -326964 227010 125345 57307 -15576
21803 79661 143354 -127955 -97769 233502 -28330 -190869 -259896 -16341 -255186 -96848 -212600
21792 -212600 -11216 90464 -75116 15031 6396 -124871 -175870 -151143 -90367 182633 -132232
21780 -196155 -121017 -55236 62276 -76018 -165435 213034 -269316 -168916 -20482 -428587 40409
21768 184511 -208261 -282675 108290 -83845 201999 171629 -64854 -348869 48154 -43297 55146
21756 -43562 -3769 -169689 -118479 -11356 -418539 240489 81925 128712 -116977 -20735 -151043
21745 -151043 -213164 -40717 -60591 -169285 37599 46928 40654 40158 -53252 134301 -49691 396
21732 -189843 80678 -45934 42750 351230 28540 104838 -237952 -206328 -22970 77032 -133389
21720 29072 149557 -77704 -223733 -129462 366272 -220835 -73856 -34625 -46177 -311633 133822
21708 -349868 255465 -238500 207664 -80627 -252865 -213270 44145 -152783 135534 -139388
21697 -87191 -417159 -106370 -174608 -15496 -159577 19884 105591 -93871 -13771 121111 87918
21686 87918 12401 -110897 -215549 23638 185414 -216885 74701 -11952 -177886 -86178 95300
21674 176631 -112687 266767 -187462 -102348 -210663 -313557 -226697 12926 -146442 178740
21663 56628 -192480 -119778 32605 1430 233548 55993 -131213 -172076 -78803 -191663 -206136
21652 -206136 -275135 110393 40903 -45373 -311129 -189493 224160 -180575 -201968 -81001
21641 -111607 126454 -149315 -306362 -105192 -9465 -71399 -128321 -31522 -146850 -208324 -258838
21630 -258838 -5842 -264042 49118 64357 -75846 -193226 -105189 -173713 -161024 -318925 -565
21618 -172143 88154 -61744 647 14550 -307613 -241913 -21107 -72516 -12492 69212 37874 -111990
21605 -58358 93183 -186137 -8740 -496876 62084 216083 -58410 214662 -123010 327420 -76066
21593 66861 -74348 -233110 125725 -174102 7991 -333769 -163769 52211 114775 47288 211014
21582 211014 82926 90771 -194007 64124 -182848 -162231 -119083 292506 121738 18736 172109
21571 172109 75044 93189 1449 61659 84111 256599 -109044 -261207 -71064 202149 -250469
21559 3375 186877 -111497 83795 43712 315298 -294450 -95604 -119015 128885 -1583 -280068
21548 -280068 -208668 -221732 -101057 -203762 -10271 227282 137689 104091 -61309 -41836 -368889
21537 -368889 -143828 -92612 -14997 69885 -289894 -4353 -153724 6011 5738 -59437 36785 -186781
21524 -258303 -206031 322248 110108 -162784 -152190 -83472 -172191 -284192 30783 -253262
21513 141971 154936 -139415 -143958 -333827 -308422 -353706 -73552 -254152 42744 -194885 107975
21501 -113768 1050 -338208 529439 -214984 176500 63661 40056 -167800 -103326 92583 61282
21490 61282 -43260 -94432 -67333 -135405 -277578 -32546 116866 158271 161187 -16827 107259
21478 -144736 126348 17729 102189 -109726 -62739 17599 2398 88316 -171318 60020 -595
21466 17803 -55582 -74810 -109708 -239490 -73151 64962 -37499 156382 59643 -78770 184879
21454 -27780 -107122 -64585 -327844 35454 -56095 -209793 -237664 -82884 -14614 -119589 -170086
21443 -170086 -212786 173482 82237 -203417 48381 74988 39071 -163580 324810 -75689 2217
21431 -205769 -171074 -10900 19199 83230 -50797 159110 31786 118235 157971 214217 154423
21420 154423 -337239 -34811 -309420 -75283 -15072 -169536 -177885 160924 49061 -117797 -857
21408 127915 -6117 -170199 -9517 -88301 -43249 -141235 -111832 -132078 91509 64852 7676 -140882
21395 -226279 -256524 -415892 -512 -131084 -340694 -18511 -243002 -8634 37272 -69339 -52068
21384 -52068 282396 -247191 -174003 167786 55 -130880 -98511 57487 172618 -11004 77498
21372 -124966 89145 -7678 -284959 -206871 213756 76400 -302462 -16593 93104 382552 15953
21360 29399 -135993 176705 14747 208603 72724 228115 -105946 -179579 -28485 -54318 -91660
21349 -91660 -57625 -106160 2378 -79495 -91554 -175305 -319339 -11352 -264110 18484 -209752
21337 43433 -222091 -71008 -959 -411730 -25182 22312 -212844 72473 -62587 -193659 -133652
21326 -133652 42223 -69549 -307131 -384148 172877 327943 265771 30706 12585 -230692 -218116
21315 -218116 167865 60916 -211136 68459 73184 -210210 -300471 -62926 -90502 -116408 -27248
21303 -2919 301416 1286 -202887 -101910 -77178 48590 76364 32246 -23310 116871 -20020
21291 -59994 49169 151684 -73449 -76198 -21119 -35799 -29763 -55825 -107959 -1655 -154308 42065
21278 -177478 -193635 -171890 -54151 411571 23206 -222209 22296 141171 -67404 145037 -80960
21266 -18494 -19443 -21278 -350580 151415 -132073 -39015 29758 -62911 173038 20111 65418
21255 65418 219693 46460 -304331 -93518 -236535 -128050 -72533 -14148 275077 -33107 -26616
21244 -26616 -138442 -306861 -198786 194390 -44177 -75023 -26836 -96110 -275875 -221632 -112047
21233 -112047 29910 -38772 122077 150963 -218897 -245197 -129591 28362 122137 -380390 -13780
21221 129824 171 57176 98055 225543 102740 52854 -381716 -41246 -103444 14964 107580
21210 107580 -269778 -73795 -116919 -51249 41583 69042 222904 -149901 -197221 -212038 -157467
21199 -157467 -246936 -21014 -38929 175328 25241 102023 -66470 164908 -66724 -204937 -191947
21188 -191947 288371 -170757 73555 -122339 -17098 -242431 218207 108621 -6484 -347083
21178 -347083 -250886 261891 162637 -157109 -99135 -69704 132365 68496 4134 -97085 -16591
21166 -346723 -104501 -198334 -129344 -37644 -42592 -68772 -273600 202485 43850 -80730 -195345
21155 -195345 257156 -54296 -166991 -358 -128166 -36823 40980 268556 -50904 149125 18898
21143 -104190 -59042 25739 -74058 39760 22478 -208143 91085 119220 -115333 -333152 -33822
21131 164217 -112750 58998 38236 -192153 31380 155899 -118054 -113525 -174222 -5745 -199672
21120 -199672 147363 -216559 229638 -4440 -292475 420068 -502508 -134332 194985 -216133
21109 -380514 119938 -68886 -151848 59538 -220139 -189314 -154555 227442 -119636 -98326 189564
21097 13289 -253987 -405388 -220255 17783 -169217 167546 -108032 -44800 -13870 -207678
21087 -207678 24821 281619 -244589 -315296 -223216 -93884 192326 -204954 -314516 -49167
21076 -29566 6405 -252827 197426 -163492 300385 -122380 -23091 -52812 -7273 251829 45034
21064 -276015 164385 58605 -28106 -25607 -346504 -107952 -160119 112007 -33835 -116277 13922
21052 -279149 -189219 141865 72176 -219391 194527 -33434 168242 148183 87744 128236 -56103
21040 -75475 106092 67702 -88620 -338009 214532 -104456 64098 275825 -61864 3393 -35276
21028 194529 -30403 -80153 19736 -110992 -57635 -238832 15782 -295713 -183774 103318
21017 23680 -254477 -203926 -90219 66400 -120724 -165566 -57862 -38503 62259 220404 -155100
21005 -203797 306335 84351 -82689 19159 -208425 -160888 167703 -88490 126687 -102905
20994 -76118 -226100 -149161 -10836 -23243 256998 77838 -57720 251875 242111 -353734 215904
20982 182121 -37700 -60085 -73999 -345487 -186497 -41295 -158831 57742 -79705 -98040 -176183
20971 -176183 -25433 75104 25401 -162539 -143144 -17283 -166587 55364 72595 -95970 345813
20959 -215681 94057 -2495 -69767 77456 -55392 71738 152486 -147104 159178 66847 -277795
20947 290667 113270 98276 -46063 -200180 64959 -112645 -45085 351685 -263810 -59472
20936 46981 -184109 -248311 -2159 111911 -20774 -364747 198286 -48731 -42895 111440 -102561
20924 -211306 88798 136557 47769 66404 -242806 31293 -27081 -58509 -143790 -132906 -56737
20912 -98057 -320348 -39266 -259486 219 108081 -277426 2921 111214 110446 -57927 75896 -118268
20899 17561 -528533 101193 154931 -91419 225646 -341712 -120980 163405 98683 77508
20889 77508 226077 -229426 228859 -92647 -21519 -309901 -78728 -156657 -44623 -232977 18596
20877 -191798 -298293 -142728 -143093 -71933 -365127 -66870 166792 26174 337535 14663 -61439
20865 -42025 -123606 13571 -133709 -209771 -108903 314381 -109566 -259234 -104391 -14278
20854 -161770 309724 132183 -81419 -151273 -713 5797 -129347 -67943 257442 -165001 -93632
20843 -93632 -49697 -165975 -35883 -41223 -244067 -119059 -47802 143345 -64431 -62134 184409
20831 -81968 -151447 17989 -197660 -319818 78356 103019 33024 -153909 194099 -77144 95466
20819 -132023 160868 19639 -4281 34538 16747 -290023 -358061 -312218 -238193 -79289 -210028
20808 -210028 59665 52069 -113141 62520 -17686 209936 -35481 -114103 -88627 94932 -79364
20796 131130 44095 -228207 -9382 -95827 100636 14841 38032 -105288 -58095 -172889 -163942
20785 -163942 -171569 103214 -3574 -3926 -76520 -210619 46788 84575 -132770 -331020 -28229
20773 -201546 45327 104028 -154321 -30384 139156 -119962 53302 31152 198652 3179 116496
20762 116496 187908 -122775 83187 -115097 -12434 -78985 -237948 105172 -129050 -90119
20752 -90119 -331015 -2664 4952 -217913 -214288 164069 -107168 121795 79967 -21059 -2867
20740 -132477 -144167 61127 -75200 -121007 -303881 -120537 124871 -73685 -198821 -258945 -130443
20729 -130443 -28098 -184892 287206 -164646 -143330 -367226 236823 -140944 -445996 -219839
20718 -215629 157156 113317 -213189 139971 -161516 480883 133047 -75030 -188120 46572
20707 -76330 449867 -41075 -143927 -74311 -55924 -200044 -314742 225334 -152079 -212041
20697 -212041 -59360 -88269 -7659 -146659 222573 112510 14268 -74095 -293998 -99418 -213696
20686 -213696 3916 -38416 17712 -57864 13481 -268898 -29269 -118648 -22949 258433 51742
20674 -71246 -59245 -255170 -149550 122405 42960 -79231 -154093 87337 34752 6358 76433
20663 76433 -137620 24660 232090 -94446 -135653 -14712 -321487 -186142 -281974 -60015 -68728
20652 -68728 -106171 -277275 -160681 -3775 -55883 63454 -181966 -259966 -216589 87649 -60847
20640 134947 -153121 37352 -242401 -95122 241022 -7979 77237 -82603 142886 140425 139043
20629 139043 -35242 222197 159453 -5213 -220799 242034 90168 -210220 -273047 -125334 71133
20617 32140 215532 -73161 -161082 81621 71367 208606 -45810 187017 -18057 141798 -116818
20605 -218981 -493599 28975 -79410 257354 -111924 -127559 -175624 -2376 -121404 100660 -77033
20593 -75226 -68810 70280 -230472 -47084 15474 33205 -199536 -93685 -20117 -31646 162846
20581 97497 36564 -436058 -88244 91331 435631 31970 -214972 315061 206001 90896 171902
20570 171902 128799 28232 58957 212642 -145223 136890 16845 -278240 -4495 -157071 31503
20558 -24763 105877 -267592 -43221 231737 -192793 -41084 -10700 53619 -93448 -66647 117074
20546 19764 -52954 -203437 174782 451457 -53286 72163 27058 -8938 -322307 94654 97993
20535 97993 -106530 1332 -59753 90660 -174695 -145969 -247708 -141049 50708 -13921 -119928
20524 -119928 35259 78887 113195 -170091 88265 -131123 -61652 215971 141069 -132985 -40497
20512 -80574 184281 63043 -321630 44317 -8804 219878 113119 -130283 -118101 69362 135035
20501 135035 -34919 181952 -82860 41954 139452 8288 107588 194626 -87418 -152814 -214989
20490 -214989 -4758 76168 -241669 -48654 -82828 -284584 77306 -236249 -56043 265973 -367664
20478 373876 -38758 -315101 -41506 -299440 61788 -534112 -161695 -312988 -7108 -303063
20468 -303063 -13005 67393 19630 -134157 -174999 -37358 -98764 -65045 209851 -210071 -149863
20457 -149863 185803 -77022 -61274 -216191 221904 -164677 -190340 134606 -300391 263012
20446 85340 -76065 -225454 -57743 51075 6342 -104889 -165377 11823 -91654 -400957 108643
20434 -71585 118398 20771 -369846 14157 6555 -103261 260582 -201120 -203708 -114281 -323838
20423 -323838 -81692 -57328 215893 -127580 -171581 130775 -252571 -34495 234379 52044
20412 142292 -164985 83633 -197664 26328 184814 -21201 -146392 -61290 310783 65485
20401 -215093 -226057 -169325 -194587 -184199 -28955 65515 -201554 -240024 -533273 -130208 27863
20389 7295 -246576 105934 242895 -143844 -23177 -72392 362928 -90187 177105 -85483 53001
20377 -514332 -11355 113841 448122 -49293 -34019 93147 -234628 201787 30391 -95973 277692
20365 -193518 125333 66823 -256103 83705 87651 8496 -39371 25265 12101 -107985 126828
20353 2059 -261210 11853 -69378 103314 -248987 -43062 -156631 -90712 265722 -163606 -119890
20342 -119890 -194611 -266929 -17319 31156 -95620 -364737 -154641 -42695 -224357 -106714 87724
20330 145003 195620 27291 -207094 76478 248429 166953 10400 175157 191284 -73815 -24579
20318 -159925 -312378 -82898 -42776 194876 -26155 52955 14788 115169 -27435 221832 -91471
20306 -102557 431376 -252493 -494051 -175683 -134001 295739 -155928 -66152 -26011 38563
20295 -413722 -18232 -19820 204330 68368 -298921 -70887 93789 104787 -155449 -92715 87250
20283 -28541 -388840 -168441 1425 47756 -138955 61376 101759 86679 -182529 68051 190346
20272 190346 -252270 -342043 -147838 -183549 -261846 -121942 -298557 -126729 -71031 87584
20261 -467497 -51098 -232122 54385 164995 -141897 133154 95584 42524 -2349 -166755 170082
20249 -12679 32280 -367367 276418 175049 49175 116089 -323423 -15695 -62030 -129312 104332
20237 -211894 158747 73011 206886 -139045 -74960 305662 -390082 -34952 -190947 194525
20226 -226478 -131279 -102959 190763 123379 -59427 -27576 -59021 104210 -241993 -5689 267059
20214 56508 294755 -97785 -98109 -148316 274098 -69938 49138 47202 164574 -44459 -107080 -231565
20202 -231565 230510 13118 86833 101986 90531 45003 52075 -210174 51900 268633 -308990
20190 -1052 31173 -75268 118421 -173202 9477 -204146 205370 -117133 228858 145092 227307
20179 227307 -128206 151793 194156 46678 -18008 -128325 -85699 4329 -101465 -395526 47194
20167 -118688 -224567 -473468 -342719 -39607 -31958 100721 -113065 -199465 51466 93140 163873
20156 163873 18945 -62215 -407893 -306198 34197 150720 -9535 -75084 -118815 201843 -228736
20144 255585 -35879 -467931 89455 229095 138683 31689 -245523 -146615 -72687 -225240 -67220
20132 -70266 107938 135294 18565 -58657 -243138 25798 -313485 -133157 211310 -23190 -198521
20121 -198521 -2914 31574 -209964 90022 -350780 -307430 -10791 66981 -240947 -101756 -58273
20110 -58273 -249377 -203253 139215 216488 -207587 -150464 -348302 99869 142 8277 50709
20099 50709 42376 117107 -271425 -85858 -129327 309494 -245869 -33727 -59671 -274425 224296
20087 -169713 -36429 -59642 169882 -128115 37136 -149843 37314 -219484 -263306 -63913 121785
20075 -198988 5064 -60211 -254040 28007 -24182 30618 176712 -329869 105734 -94070 90917
20063 -33378 -109673 -150409 168789 186073 200996 -38722 244974 -135710 -238653 -40811 197064
20051 -7341 20624 -232858 -154309 -161930 -129906 -86769 318212 -60981 -106519 -32448 -252937
20040 -252937 -128244 171598 159609 -83644 -102732 -52477 -306076 218171 -45646 217160
20029 71682 -70695 -137996 -379267 47492 -13248 2031 -159016 -199175 -1945 115008 133503
20018 133503 -123873 -73641 -56266 -177200 -63754 136624 -48636 -244675 -209629 -58814 330017
20006 -176964 -256675 -91703 24613 -269213 -109144 249580 -135180 -135122 99092 2631 144055
19995 144055 -65182 -78888 -2590 -306730 207805 -165455 -40298 85889 70641 79731 -104329
19983 111261 -387282 -41064 -88496 228303 -78891 -293806 -87042 131590 242132 78380
19972 87351 -45837 -260857 141922 -253667 126613 -193743 1062 -36935 77546 -209290 4848
19960 -136875 -77166 56978 -108509 -360902 -216362 -108710 102603 -261968 -150115 -124982
19950 -124982 33600 -156949 -18564 234129 69014 -206091 312258 -191928 -74115 -37308
19940 -37308 -57044 -47924 11057 -13328 169445 -357395 34278 359984 100903 116671 311463
19929 311463 -139732 -94286 -255745 220345 218845 10777 -110385 -210969 -142892 -64351 -87172
19918 -87172 -29745 -4603 -91792 143618 -24303 -110630 -59708 -279695 -163031 73159 -925 -101794
19906 -101794 -197422 -115810 -72150 -211285 164277 -64927 143135 7706 79252 186399 -25256
19894 144293 182774 68670 -270245 47558 -55434 -110263 -113531 -68708 -35774 191944 -311602
19882 -220103 232262 81207 105784 256011 17547 128039 42910 -210595 -360678 -177161
19871 -261301 113537 -88399 -304338 -245983 -203872 61968 -38411 -55188 71206 100695 -244420
19859 -41896 -51989 -209737 -30709 -102389 -360413 298093 80864 183352 -24575 -181454 -57683
19847 -266410 70043 -193794 10561 -284536 182291 108221 -140448 -152202 -192314 -129144 -243112
19836 -243112 275865 -231042 -212264 -78365 -24435 -131404 119184 64114 9948 40199 17909
19824 21017 6960 -77109 -260634 -81885 -19620 -242008 50601 -29390 -88802 77349 -361113
19812 49362 -567113 -230315 111681 -53120 -18591 -212768 -374450 30227 20340 89082 -228264
19800 43521 151912 4391 140711 172076 -8876 236049 -90865 -170573 62644 -92539 78895
19788 45475 -156916 12389 20941 -58998 -273803 21848 -29111 -208648 -489529 -82352 -7651
19776 283048 202254 143575 120982 62865 -74648 -19205 167205 -303696 196881 -47755 -322527
19765 -322527 -48591 -259223 129584 5348 -196339 -192742 -403846 -100233 -277058 152102
19754 -261961 146886 -98225 154671 114480 173380 -239401 21456 -127233 -893 21527 -180796
19742 -193859 156795 284020 40265 -132399 -135043 -208719 26630 25050 -162037 -241893 12170
19730 -176608 -389554 -104005 -238552 -699 -216306 340639 395933 49618 -205412 -10426 102039
19718 -94251 -120238 -92756 -20638 33895 -186316 -252589 -22226 21611 122190 48327 54885
19707 54885 91368 15297 -3340 -19487 157427 -8868 -3968 -34717 130238 105456 108960 -162526
19694 319988 -116644 -315947 96017 52426 -23868 -242127 62722 37437 -219583 103068
19683 120836 -21206 -61201 20174 -295091 -328554 143637 57086 -24084 48635 116011 -235775
19671 -115263 -278036 -330144 -44681 45322 97145 -80884 -35074 96191 299395 -242018 -88299
19659 -174077 -43279 -7184 -53686 -198169 -376088 -40141 79408 86165 71614 184346 -33202
19647 92339 -91929 167726 114143 48785 227385 -42493 60864 -1406 390715 155319 -18191
19635 6973 233325 107651 -59194 -301668 21328 -23348 -291627 7248 -65683 -98384 -225661
19624 -225661 104232 -18615 -13690 144619 143206 -89870 184831 22332 -65064 -131354 175948
19612 29980 -176239 -2127 38378 -18417 121778 -69303 -35081 -25795 289607 133969 13575
19600 199454 -119744 82178 77181 -184709 -41202 -119971 -194375 105553 -34263 -184720 -174328
19589 -174328 137052 -199523 -83765 -149976 51814 -51082 -64399 38855 -188806 -433925 1464
19577 -222124 149219 -238439 -105411 80633 -204723 69433 -190514 -139574 119430 55896
19566 -473332 -52475 -309087 -55993 -278792 -134984 -257442 -418023 -198521 -46888 -141562
19556 -141562 85748 -683 -374807 21441 -6463 70987 2028 36557 -306885 276305 90418 232496
19544 232496 -29105 -66712 140789 -144151 91314 -226201 -359369 212513 -77682 98848
19533 -254863 356469 -391843 -179269 93156 -56753 -156635 -316152 -119523 -332459 -278251
19523 -278251 -381090 -345305 -65058 101555 -119455 -134383 111831 -111890 8755 24204 -11438
19511 -149694 -195346 5431 -23283 198652 51604 -210648 -3483 -250341 -58617 197923 -5284
19499 -34776 -7344 -342514 -219452 -167493 -71656 198579 -7587 -117813 -222873 -40305 94926
19487 -312019 24683 -300380 157765 -31985 42532 -47485 40851 306273 -332351 -153398
19476 -233243 132416 -205734 -143175 -7613 -53601 200922 29967 -92675 71019 -77774 -90350
19465 -90350 190243 -77861 -17560 -382227 76599 119479 204533 -30018 -288505 39648 -49857
19453 200689 -27179 -295564 163113 -62075 -83033 164165 -34945 -16812 -177748 -90174 -370854
19442 -370854 -4065 -81640 45180 -119717 -243932 -309619 -237585 252637 20255 74681 -224596
19430 -189606 -25222 47797 -270831 -298039 134367 -311737 -177443 -7062 98809 34227 199871
19419 199871 228368 5453 53075 220798 -220049 -183928 -169540 -98355 -223903 -234793 -238033
19408 -238033 -133589 -25538 182810 -61231 261792 -69357 -332724 -50355 -232985 27038
19397 22010 151483 -66178 -307059 78429 -293166 -205502 -217280 -130939 250438 -222077 -130724
19386 -130724 -37787 -318922 18856 101738 10498 172114 -54417 165330 108183 -139858 -64552
19374 -40038 -304825 203826 67861 -93886 -83320 130298 -220806 -132748 170594 45171 -178608
19362 12247 -26640 70407 -270616 -150801 -14628 -135847 -125685 137929 175351 126308 -233040
19350 -203954 -199522 -227795 59022 -102965 -271072 153609 95635 2366 -150513 -10779 -81799
19339 -81799 64341 -235811 -107063 328441 52540 -336099 -138312 -323361 -1994 14091 -351850
19327 -213119 139156 191813 14532 -99832 -81042 -227040 -104230 -80049 -206067 -89688 82158
19315 -303169 317343 190960 27502 -16469 -216908 114773 83694 -409022 29780 54901
19305 54901 256726 -143466 -281199 -232978 -64113 264758 157353 -21833 271347 -510900
19294 -248565 -141837 -91916 -431157 132834 -672 -74050 -163073 174623 -99422 400327 -63388
19282 -52317 -61886 244977 -27611 2521 -7472 87709 -347727 183245 -237174 -29464 76462
19270 115313 -220868 142556 -170463 62283 -65427 -131541 217387 408981 -117808 -137985
19260 -137985 -301574 -340887 -59591 -315137 -51051 159088 -36169 -120017 -90456 238430 -198012
19248 -198486 91049 129710 -87361 -172175 -197861 -2768 -398105 15920 -68302 -86253 -62035
19237 -62035 -49792 -514813 -54115 -167557 -162542 -171677 61806 -178750 -63420 -153491 -45440
19225 -66123 -178055 276553 275710 159505 -328658 26203 -77109 235287 -29510 -255231 -33822
19213 -53239 -47775 218267 -23866 -324539 -183527 200862 -6094 93446 -128101 -53085 -50534
19202 -50534 517103 -20726 -20823 -169026 54524 -223144 -122131 -86992 -105246 -47369 -77862
19191 -77862 -130700 57475 -322547 254006 -234016 9193 95518 -95903 308338 -242726 71861
19179 -96563 -406589 -308265 130436 -284457 58311 300154 50460 -249807 58350 113306 142717
19168 142717 -595595 -117184 -438560 304409 59722 -106556 45271 -291991 53005 191185
19158 191185 -291877 -245451 -128974 78527 -160004 67394 -131973 -3070 215854 -241569
19147 7564 -261829 -130700 -85924 -309674 38292 -132354 -194721 -203723 -237727 -14112 263503
19135 -262302 -256909 -145991 86777 198004 26788 -187048 -127268 9311 -238653 94954 -74647
19123 -101600 -124117 73565 -106568 -169984 -408794 -165134 113317 137574 -70062 -230393
19113 -230393 -273791 -85281 203927 -135034 -165535 52678 46878 -90652 19144 272430 -86529
19101 146810 -263504 14039 -180535 209552 30101 297314 -59999 -140804 -550452 -383477
19091 -383477 -180265 -27772 -243866 28012 -51716 -268487 196702 -46767 -306487 241 -441833
19079 -55383 -331593 -335443 205281 -55871 -172493 -215220 323748 55167 80162 -130364 -23648
19067 1832 -150641 41726 214862 32533 -108589 -12029 -108948 -359381 111273 -135150 -15151
19055 -21557 308509 -64980 -125913 -105013 38533 -307447 137638 117418 -37774 171754 -182984
19043 169829 -263789 137086 -266245 -83882 -86898 -162853 55954 56488 -32698 -78410 181572
19031 49845 122701 -276914 -270567 -112523 -196837 -92602 -21889 -172954 -179014 48977 83132
19020 83132 -46806 -57333 -9518 35005 18058 139609 -5986 -182703 -104645 287052 96433
19008 198464 -140393 381886 291654 129774 -92893 -52776 -150533 35745 -158615 51245 -327774
18996 -223545 201922 -225814 44011 331932 -79806 -83092 -8271 217725 111386 -140963 -271981
18985 -271981 -113937 -58490 -44067 -230907 45254 -73381 54560 81924 51441 -84079 -211716
18974 -211716 -16397 -87561 -370362 -203639 160878 87381 -15762 -124370 -86120 -315097
18964 -315097 -220351 -90519 5627 -149630 -112596 -142443 -235175 -72201 6737 237949 -306572
18952 36291 6710 89627 69779 -247689 -110370 -64715 -106159 -244127 -199509 -220430 147795
18940 -312582 15755 296514 -390331 -18491 106936 70407 217948 28162 130211 -196549
18929 73144 -261409 -136077 349923 211326 272126 -80688 -142672 -63204 -254190 20896 3767
18917 -19327 -180368 322310 266860 -33837 -42846 -200336 -78401 157521 -382616 -101575 -133001
18906 -133001 -251456 -152772 -152538 13320 -45037 -211996 -118765 -44110 -111608 92155 -168315
18894 -166054 285456 205591 -385112 -406392 213893 -134030 214903 -64733 87616 -109672
18883 -207282 -36450 116727 -104729 -10270 77982 22318 -124053 -144095 -95618 21193 -240363
18871 216713 -273174 -71348 -56578 -117515 147981 -187909 92341 -207256 139719 -86914
18860 1531 -19794 -25734 7809 99634 -163145 -122223 146634 -42968 -105301 -94089 165389 -85063
18847 -372745 104360 -137413 -260811 -269128 -10353 -4463 139397 1783 198299 -188779 186729
18835 -87134 -83253 -316874 80183 201769 -191866 -87198 186748 357835 14804 163219 70932
18823 -80225 -132831 -27190 39829 -64125 -135551 -71517 -67127 -102533 -192795 251841 182821 35588
18810 -146948 140580 139302 -266171 -108533 -67108 12564 165267 3841 -355787 43697 53968
18799 53968 27242 -104010 -309659 -36195 -282346 -73384 107809 -177464 222252 -102045
18788 -71433 -3358 -139351 -15979 -109813 123746 -92428 -3271 61680 -136027 -23573 179489
18776 -281710 -590102 -6754 3420 -423597 123517 -53123 68078 -130107 29885 27689 -78370
18764 -2403 138182 -127264 15630 -99892 218361 81225 -95675 73764 23428 40720 -8964
18752 -18216 -205894 -151148 -121256 -23797 -7725 79477 -184890 -29413 -152282 212387 -353706
18740 218098 -300659 -88255 67913 -58290 -125422 -195239 109121 127788 23031 -334619 -328604
18729 -328604 -243583 -93146 126178 3008 98976 37560 -118751 -315635 -416149 -93387 -5294
18717 178660 64001 -13843 25975 -141443 -37973 -50675 -47356 84794 -145003 -54330 -190362
18706 -190362 46797 -167649 -303735 197181 20835 248492 -242475 -461526 268200 -2293
18695 -477531 -56451 -49822 14795 -110951 -179747 -38848 -62785 -43806 -227100 -187216 -216352
18684 -216352 -118010 127769 -338178 52481 -25442 23914 -239028 -75275 -164630 -17649 -210634
18673 -210634 -59305 15422 -170437 -76801 1593 -36837 28723 28502 51070 148842 9706 -128509
18660 -249436 -293654 85163 -36698 -17872 40081 62114 161682 -72626 24587 83788 72182
18649 72182 134749 -75307 -36356 -142573 -7898 -90858 -52319 192975 -3217 -22240 -12719 -168603
18637 -168603 265716 -18471 42781 -195831 137273 -210117 113238 -60923 -224425 65868
18626 -224772 185287 56174 260106 116504 82748 -139224 -100752 -207238 -4328 129491
18615 266285 71037 -10478 -199656 -174947 204650 -155409 341913 -86248 -65449 -323672
18605 -323672 -102999 -45483 -35422 19835 9072 177668 -131749 -120667 31136 -72197 193183
18593 9513 58283 -61596 -258579 87787 452768 -71214 -28976 -157053 303996 125756 -157343
18581 -218845 25699 -158271 -86408 73564 168228 -73963 6203 -236206 9988 -11727 -16065 -80556
18569 -80556 7102 25518 -253930 -292706 -306371 -314814 245262 -2180 72122 -21590 76309 -25241
18556 77116 -353133 -78957 -122689 194867 95655 -386822 112823 -125514 -192418 132966
18545 -161610 -54935 -117238 51266 -81156 125170 103535 -40614 -207020 130827 -59770 -208041
18534 -208041 79806 -44575 200808 -296685 1487 -70696 148792 44380 -257543 -91361 -54973
18523 -54973 142479 89094 40186 123279 -187063 -1690 45530 179863 112601 -6402 247190
18511 -417046 42562 -321168 -72751 -262393 -95911 99235 110158 -219846 165973 5178 -235748
18499 43344 -176460 -6707 -28943 350765 393182 139105 79927 266621 -180868 54308 -75955
18487 13200 -356422 -16266 147655 1131 16329 77012 -100590 110262 -78560 -236505 73149
18475 -282476 238169 24473 -133214 -90845 -134586 159618 -198990 108717 -119629 -437465
18465 -437465 -32589 -63683 -274457 -352895 -234265 -219059 -58486 -35416 -139972 -188033 148521
18453 -41218 118695 26677 60879 -83797 -218832 84044 -99021 25250 -235018 85362 159721
18442 159721 133216 -257258 -122405 -178455 -6033 11027 -37881 -98968 249712 -176732 -373746
18431 -373746 -192035 149630 -37242 37664 111253 -272824 13045 -207187 88355 132764 -169645
18419 -112182 -256392 147408 -41098 -86714 -177748 158456 43811 462906 -165336 69918
18408 -297329 189552 21379 290562 -104844 217109 148544 -79429 116954 52425 -211299
18397 -273745 179331 -16473 -44582 219431 -65655 -368542 -163522 -7158 368866 -206258
18386 81486 -79438 171759 -377974 75560 -69697 45538 30069 -53597 64763 80369 139012
18375 139012 -103297 -85956 78262 -115810 193143 55711 96483 -211194 -125567 129625
18364 -57621 -36216 -37524 42672 -287173 68699 -45025 92567 -126073 228632 -4651 -121773
18353 -121773 -248324 -3219 168914 -385629 90888 -120791 43355 111171 -42946 17892 -25272
18341 123343 -248213 -9027 79512 -219750 -61162 -72024 -447794 11090 -110152 -43101 -1748
18329 190714 6946 97374 119555 118149 -188005 193908 -151819 43340 48965 80373 -57580
18317 36371 -191573 -301134 -155834 -38671 -301678 -290275 -160246 129266 231387 -37826
18306 -176968 104508 -254292 86546 222029 130728 34748 59472 18691 -180936 -307411
18296 -307411 -96925 -235773 44622 111718 -29422 -369315 -60966 41477 87265 3014 169224
18285 169224 -70678 18191 132000 -163074 -15477 -72620 -204976 -40239 -365934 -69295 45325
18273 -34489 -165795 -36092 -279680 -67097 -11278 191381 -263561 -347371 -179654 232460
18262 -192184 -193842 -40203 10292 122159 -160669 -177380 14855 97677 -357211 -181895 -71036
18250 280191 135351 -191614 -196919 -41582 -218147 -76008 28214 202059 132258 93276 97745
18239 97745 -146909 -53896 -204060 -25445 100381 -6996 -37595 83231 -316738 -115668 -57171
18227 -93786 120865 70816 -15356 164968 21729 -61098 -113274 -206490 223886 46088 -3562
18215 -237765 -104458 -158778 -6141 52130 68790 16009 -269373 98821 -391755 189542 30748
18203 152837 -86167 -192363 -75473 -128348 228648 167874 245814 765 -41213 5486 -78372 3179
18190 297423 -136923 -143227 2205 -27860 -78016 -368650 129786 70260 -19044 -163376 -72552
18178 91559 161055 -209498 -182644 -134363 96916 17763 -146934 -162750 -62119 36886 387244
18167 387244 -96431 -102127 372813 -204597 -3612 65941 364936 -107442 49497 -217668 -47755
18155 99073 -71460 -37197 -187096 -219634 107420 -52125 282785 -105230 -94171 8527 -353024
18143 26621 96704 -298998 -65220 1408 118053 -145118 10407 -256774 -160789 -133421 14142
18131 -152051 -26146 -51356 174181 -207665 61329 -261174 114884 304149 71920 132810
18121 132810 -189587 -48936 250303 21257 217117 157296 66910 73956 152288 205045 -41869
18109 -21748 44237 325842 18767 170356 -357677 -150257 -208336 -202984 263536 -20984 134045
18097 -305706 203182 -141733 -444800 -85329 -46671 142284 -12548 375720 301600 -359852
18086 91122 159222 -61692 -66205 21265 206250 -20914 34105 44313 38107 4876 -23779 202628
18073 -94612 54576 -297083 261956 23396 37242 -24169 -255915 -113642 -152985 180260 -161003
18061 113870 -63402 128370 239577 21374 -127025 182754 6186 -171444 -230285 -178488 139269
18049 94381 -18079 38648 84725 -217268 -91339 8828 257950 -135834 11498 -436320 -234851
18038 -234851 3797 -303015 -131361 -306677 -97075 76589 -45867 -32720 -216092 63469 -76584
18026 79884 -9170 -235267 78781 25340 -104961 69005 -61207 -94977 -278462 -47893 23658
18014 -151001 65673 152046 371311 116539 -145194 -147900 -85366 -140411 257713 -216596 199894
18002 -304081 -16069 152321 -228636 128557 108181 -132976 117296 262092 150633 60857
17991 -351056 42544 48446 305030 -176166 272418 -173919 17579 207384 -114521 6152 -87299
17979 4295 -295980 86600 287849 25227 -91946 -252672 143553 -173090 142094 10277 110046
17968 110046 330059 172925 -33060 239484 -85223 159998 -7801 23170 396685 -167892
17957 40324 160495 -283992 152726 100899 249277 -157168 217349 -1374 -233119 124564
17946 105245 153591 -148761 -155681 -16396 210933 11985 -116899 -173788 -35319 -55516 226764
17934 251334 178209 313802 95580 -127848 -241621 -239290 -351726 154750 34289 -183905
17923 -97257 -153623 19356 -83857 -4591 -183698 174425 155783 -104893 -47591 -54042 -6751 51146
17910 44856 6890 411466 -244050 -31822 62471 -4747 -118926 31204 -189711 51091 -160204
17898 37140 -9431 89320 18650 -302216 -75818 177438 134982 -138869 104133 -109230 -8718
17886 5236 -293103 -257076 27037 155946 -238027 -11880 -42226 270918 -282222 239846 24235
17874 -233534 -90223 7138 135108 123888 111290 122362 50347 -187812 -240407 50480 2134
17862 169446 58260 145065 -168719 -92839 155904 10512 59431 -79256 -97353 -114648 -341323
17851 -341323 -165180 154708 155354 68351 -80144 -145826 -35632 179863 -7514 -42449 85956
17839 116508 166363 63058 -449871 -218489 -234544 -4996 195863 189177 242698 -14447 4912
17827 -197820 -45511 -163027 62404 -49454 -27923 -98651 -278283 -143536 -22866 -499771 221210
17815 62633 -265208 280822 -295595 -118158 261386 212972 -146488 -55533 -50514 53174 -138002
17803 -132322 -50919 -152175 -178884 -210306 79347 117432 -143005 227312 -81381 8536 140840
17792 140840 -21016 102620 47998 -45086 41577 -8782 -87129 153969 -158818 31262 -107657
17780 -26825 357237 217528 -88293 -81680 180759 -57512 104596 -1392 -21897 -36031 169450
17768 -9917 87862 45715 174779 -261102 56492 -22421 73381 46600 -196050 -154534 286057
17756 213632 7041 -79036 -222411 94638 -4996 142937 -181283 39382 12945 -15608 10777
17744 123018 -50778 331931 321315 142798 245017 148668 -58766 4350 5544 -141322 170946
17732 -194550 -29707 91665 126536 267484 220377 322522 -238412 29008 -65014 -197739 215761
17720 191646 -82217 235528 -12119 198332 -102817 -1261 -12115 -127651 -64027 -102076 -355068
17709 -355068 -49646 -94816 -203618 94472 37765 94944 -98858 169140 -168752 -122791 -171140
17698 -171140 85768 -247085 41016 100407 276910 121068 -77456 -97700 107916 244531
17688 244531 63620 -9504 179979 -125379 -35380 -890 11506 -57961 24464 -82978 40228 -8690
17675 182746 30217 259378 185367 245486 98018 187624 254240 119817 -254526 122865 -56433
17663 357746 22657 -89677 -155389 -135208 63808 156943 171329 -30218 67001 -3614 -285334
17652 -285334 88749 224547 -71857 211487 46411 13286 139743 239440 146475 82574 224797
17641 224797 -35626 -32344 -79449 226452 174644 42845 61478 148021 -70488 -91770 -124908
17630 -124908 255622 -246964 33131 128467 344773 209210 103490 153229 89188 -189846
17619 -69752 17165 206908 -13781 61345 -116560 55676 139121 -33439 410906 131873 302899
17608 302899 224690 164789 -171745 299908 129745 176591 130969 69799 118938 18528 250467
17597 250467 22038 -231789 -51684 -125562 167135 -12800 217202 308713 159217 120852 290199
17586 290199 111950 204609 -180733 141380 -76815 -50126 -218937 -150661 170481 -29867
17575 145426 267180 -22035 -243319 -89297 -36554 140001 34751 -144877 -73986 45979 95278
17564 95278 2046 255563 136488 20377 322260 129881 220070 82642 294735 -75913 64719
17552 20738 278755 -68180 101405 88847 209418 171366 -67261 149020 37943 -163423 -15282
17540 -76146 -207232 19027 -83200 118086 270261 201886 79351 -1572 -140683 45312 30437
17529 30437 206251 87228 20705 469817 -179894 123196 407695 312375 284035 200856 -250105
17517 98197 197586 118826 468664 172701 76972 -141991 211 85978 290874 156171 377763
17506 377763 33144 -34824 -61314 328910 252210 58662 -10993 368613 92015 -17998 -47055
17495 -47055 -35920 89267 24442 74572 214670 88852 70769 94385 255814 64065 332767
17484 332767 -282644 8460 -10909 42495 185160 137225 269954 115539 517967 41777 24453
17473 24453 216 437161 154702 116950 -15076 80722 -46436 -12437 243780 37311 431582
17462 431582 -175084 66753 -164402 148313 -68533 -53840 210168 60401 378368 293234
17452 293234 181622 270743 -135426 104873 82896 421191 -12298 217979 -145804 225002
17441 77996 41737 -67536 168268 -45186 122657 -152410 361478 261353 91664 143891 392004
17430 392004 287245 126238 193742 399085 424643 310913 317192 295902 271575 169120 145837
17419 145837 224998 240450 226535 147571 162365 482909 -20365 354859 79150 222357 76108
17407 151151 68796 -133726 212646 402267 286249 248015 234806 -43222 -70217 252907
17396 280459 71534 73106 248800 -96203 92997 365392 81634 3836 260113 242313 8010
17384 73509 45655 -192999 350409 155982 137589 251465 -65915 -143516 355125 343465 -44207
17372 222071 176708 80431 232032 300789 50122 16807 27935 485550 285484 216390 126877
17361 126877 -106167 133248 339710 22925 207351 -13089 199549 277392 270763 84766 194160
17350 194160 244314 129177 89229 -105256 122431 577418 337962 -105089 -88755 240324
17339 265797 74859 -29203 160450 246028 34270 114817 410877 -199384 172645 39932 234412
17328 234412 35102 422392 220683 235120 -25730 -65686 171837 -55374 -8689 132613 40031
17316 1771 -127328 268799 100853 318393 107449 -112904 374989 50077 177850 -74525
17305 17484 134393 122525 208598 67106 236604 15901 81578 236684 360123 186084 304689
17294 304689 148464 382533 320491 -84 263860 98225 99707 -14583 79352 359155 57670
17282 70037 86831 141606 383212 279339 186865 130829 -35862 222933 270823 198843 522020
17271 522020 163769 147059 -102975 29387 183011 367884 405409 80762 274676 158606
17261 158606 154312 339116 72181 -85513 248295 -3753 286900 -30463 196430 -52854 34676
17249 -151028 125691 368275 -9895 397527 392334 140732 79798 150728 278221 85229 233641
17238 233641 441046 -60548 141357 354632 -21522 204125 280939 -130795 98154 72629
17228 72629 89593 381339 -134738 -23437 24531 382747 318633 263329 51707 128455 87850
17217 87850 241697 326999 38099 321512 -51490 148141 368645 -125922 -33709 58080 -42453
17205 156091 415335 -49515 130884 144070 250170 106736 564859 -237748 251498 12229
17194 448277 232569 321581 -171275 233227 211698 99350 -14473 240033 341244 -137601
17183 528223 442127 222252 422413 164609 -117739 324471 199649 252874 397187 216992
17173 216992 -256328 -90631 271716 433126 49211 166253 281209 289450 248809 399678
17163 399678 17949 295457 46426 281114 209558 160772 64082 457206 303175 325097 226454
17152 226454 222099 239876 414745 362781 286865 229566 116489 220717 274266 255734 271637
17141 271637 286346 328742 450460 310618 256872 218474 217057 634561 227698 152519 -63061
17129 139159 293090 360494 226876 363289 392321 281238 366443 476888 350950 164910
17118 292883 308900 169263 -13010 270847 421913 673824 381348 364127 461133 683095
17108 683095 172092 166286 140806 54052 287881 163226 399502 439627 398239 374652 342630
17097 342630 114021 660167 250698 448904 631833 425289 324011 466457 382040 319244
17087 319244 299087 282422 486588 305852 386727 530016 303874 522238 676078 348319
17077 348319 198372 366985 40656 576388 314566 372441 665935 367555 478338 632979
17067 632979 658360 633896 340846 621471 315810 6906 637232 494536 428620 573452
17057 573452 566927 121380 369854 507625 758024 475811 316688 549397 317011 674427
17047 674427 470998 460835 319629 453207 360315 491099 326147 490557 393253 753623
17037 753623 707047 335259 395074 640896 778426 453496 498080 681452 697244 618145
17027 618145 525318 446078 424120 120313 355841 417658 365252 496522 460276 396290 485932
17016 485932 465956 222858 558276 637301 575879 666676 565930 833487 625585 446562
17006 446562 589743 586216 529947 423399 852300 300920 626047 404897 583579 860241
16996 860241 704226 718984 531599 843316 801160 475892 770705 778820 317993 640999
16986 640999 778881 356113 452912 894788 836704 820878 901903 539709 856452 629010
16976 629010 604891 870058 1006986 766261 610029 618207 613939 432596 903739 673856
16966 673856 1049592 744918 524078 629399 539029 742164 884636 855336 472033 618504
16956 618504 1074606 995923 699549 798898 878874 829634 1141399 1169174 633892 895105
16946 895105 1120743 983909 862476 924813 1115735 727684 1281215 893611 1045334 1022452
16936 1022452 922029 1265118 1071949 1016983 936905 1401831 920815 973146 707918 889640
16926 889640 1189643 1063501 1051295 984754 1180177 1063846 1087825 1126386 936281 1192924
16916 1192924 1314958 1093845 1529594 1048407 1428930 1090694 1189012 1378712 1468399 1327794
16906 1327794 1375868 1303586 1564641 1476881 1168170 1590107 1377371 1540657 1391005 1621272
16896 1621272 1490780 1767763 1555249 1651480 1489996 1777876 1412652 1855177 1565852 1656302
16886 1656302 1810434 1828957 1768273 1550883 1732579 1904928 1806906 1670573 1946176 1883757
16876 1883757 1772457 1972971 2059861 2074663 2059351 2139675 2181450 2095941 2146053 2124322 2620719
16865 2620719 2332973 2371791 2055265 2222495 2502932 2413454 2629771 2489501 2610973 2718250
16855 2718250 2642272 2733641 2988039 2923953 3024666 2971016 2827812 3153727 2815785 2872296
16845 2872296 3137832 3468427 3273008 3535682 3533475 3436641 3687396 3449737 4046451 3956957
16835 3956957 3920484 3928732 4223083 4274997 4274713 4157750 4425487 4621530 4654492 4876318 4727551
16824 4727551 5014626 5134542 5215727 5552238 5495254 5868043 5958484 6018584 6121840 6027350
16814 6027350 6206072 6475696 6782721 6793350 6911152 7323267 7491893 7479300 7656579 7885159
16804 7885159 8295080 8207988 8850087 8967377 9181628 9451492 9917114 10168163 10757514 10739622
16794 10739622 11182600 11731445 11699203 12138562 12941733 13306446 13700235 14019022 14813632
16785 14813632 15132361 15914842 16526187 17043339 17917317 18604260 19242591 20338212 20808448
16776 20808448 21758853 22514510 23719245 24676843 25664651 26965353 27758912 29364903 30624957
16767 30624957 32255301 33693976 35157481 36834447 38732898 40620750 42330405 44520813
16759 44520813 46887767 49408944 51875625 54749024 57201944 60529223 63909541 67243382
16751 67243382 70829320 74602551 78812965 82996026 87140352 92079830 96534102 101661414
16743 101661414 106810163 112116705 117330348 122482097 127671933 133173453 138412338 143135128
16735 143135128 147657479 151540080 155466980 158423435 160860176 162834361 163952437 164417546
16727 164417546 163876845 162864429 160837127 158878832 155677617 152121874 148733810 144069012
16719 144069012 139707415 135329319 130159574 125330891 120610479 115593479 110589934 106194065
16711 106194065 101426363 97169448 92873658 88741652 84874220 81010219 77683459 74194534
16703 74194534 70928393 67922722 65125392 62384147 60067489 57175409 55219192 52772099
16695 52772099 50965852 48665155 46977640 44825006 43399189 41422216 40224189 38447174
16687 38447174 37460855 35843437 34877022 33648460 32440562 31464845 30089907 29106943 28163364
16678 28163364 27319757 26261006 25545788 24779791 24003810 23194690 22349414 21906855 21269466
16669 21269466 20270229 19721092 19409419 18687155 18203439 17387357 17415830 16331091 15693310
16660 15693310 15749371 15117608 14601582 14243712 14005198 13253013 13116246 12676460 12179161
16651 12179161 12032778 11555886 11165067 11062912 10455888 10341685 10177922 9722257 9333652
16642 9333652 9431615 8823482 8926948 8542646 8428255 7666787 7831959 7603416 7019212 7101903
16632 7101903 7006941 6782287 6554014 6331982 6316075 5902558 5821979 5880058 5507384 5415447
16622 5415447 5477695 5261914 4898670 4807062 4790040 4627665 4684498 4537639 4450897 4066044
16612 4066044 3867250 4099280 3943130 3834941 3565464 3587229 3554055 3244885 3438888 3616923
16602 3616923 3209642 3309936 3338453 3009551 2854975 2772894 2653496 2792849 2642967 2572507
16592 2572507 2540672 2483282 2028818 2628259 2126726 2237366 2240198 2029848 2222259 2130201
16582 2130201 2206755 1947345 2126099 1905095 2060269 1928484 1947968 1769990 1890777 1362849
16572 1362849 1556384 1510630 1841625 1927292 1699560 1554735 1456199 1819388 1368978 1463170
16562 1463170 1841612 1354473 1399112 1605784 1370468 1359433 1592054 1334405 1608401 1078455
16552 1078455 1127689 1244287 1354184 1179356 1276193 1286389 1168689 1356542 1232682 991519
16542 991519 1154395 1042977 906885 1347231 1084849 1216706 904919 1011221 1162484 962492
16532 962492 952377 1005775 594939 683564 1150457 758185 857038 688658 1245530 1003111
16522 1003111 979324 983311 649357 340773 918804 785918 599085 1121231 777422 712562
16512 712562 593236 732738 669551 587027 788483 466861 986259 732727 884171 758847
16502 758847 942914 578609 691425 466267 720873 647456 371602 846325 798806 198580
16491 788526 391662 587764 690374 646082 724363 549093 529754 378331 629856 568419
16481 568419 530893 461393 605045 799338 394373 415314 452314 746583 463754 490835
16471 490835 517349 838178 460633 795460 379282 389720 459276 425145 460384 314477
16461 314477 624489 374801 607006 361649 663532 573125 660813 672725 413664 487892
16451 487892 426558 608461 386002 505119 97859 533483 574568 210617 523199 472826
16441 472826 367421 561225 553099 370164 212406 463651 169033 382012 631620 15353
16430 588179 467137 651913 753145 572062 579349 726017 642349 538664 297594 608217
16420 608217 590418 628377 499626 545537 287159 536461 425919 526563 484895 193143
16409 426145 546059 376416 629490 543432 708539 721327 687619 638877 386487 838269
16399 838269 408309 567200 586697 509053 469386 533764 402785 674797 503930 801893
16389 801893 516396 493935 565161 558306 336407 300873 709975 606790 83076 491988 580137
16378 580137 694191 571996 180979 661363 812923 785698 414258 649559 518831 645611
16368 645611 588043 549938 750291 506989 652873 533385 603659 683000 574642 303474
16358 303474 610680 593238 630505 463062 831882 685877 565171 521367 935404 571038
16348 571038 743408 672268 724514 343958 696735 733393 855203 711190 586392 707373
16338 707373 619326 571129 543689 1057678 982070 703337 636511 591301 848360 774282 401163
16327 401163 854358 988071 672084 819926 604496 789317 708525 740618 696174 438522
16317 438522 769618 684384 738905 1106834 714153 572965 887651 960575 973940 656622
16307 656622 374852 914187 1002433 763718 1164054 794942 791174 1278897 891926 854505
16297 854505 884425 899662 969862 1023688 1033057 570746 679025 705066 732740 1280351 1056621
16286 1056621 801499 1004938 818658 1135640 1105107 800805 575866 771436 1183716 985019
16276 985019 899642 1070397 1213693 1134901 955559 1074352 580732 1288715 1287624 1077318
16266 1077318 879096 1085118 1251361 1065780 1149842 1220076 940630 933023 885861 1059439
16256 1059439 941623 1146493 1385322 942240 833020 1133678 1163470 1130434 1008536 1218331
16246 1218331 1065789 1029029 981248 1106158 1138706 940298 1121422 1059422 1112343 985764
16236 985764 1058761 1148524 886731 1080196 989005 1257457 1024499 1184032 1093531 894893
16226 894893 1211199 820897 1005112 726032 947452 653884 698292 947119 848962 1122177
16216 1122177 938269 1061449 771963 947646 744789 751154 855047 767453 535007 716379
16206 716379 752133 820599 722505 1075392 666884 708789 723843 627646 621409 921066 622607
16195 622607 376894 881378 719790 663351 466977 371547 567989 742759 536386 557800
16185 557800 744140 661620 763073 720468 517385 624840 569596 526260 609094 672268 261594
16173 628701 493579 613963 655420 604973 237865 653082 574494 538462 562628 363229
16163 363229 490328 173676 456067 49119 229851 437234 141471 613129 181043 73747
16152 384569 284187 6114 240278 686968 581094 296907 168694 533118 136861 357635
16142 357635 509317 -68659 242740 119449 108626 499225 379960 -82801 -59006 17856
16131 155678 264434 193404 102043 -172559 -85356 -68642 357465 -25718 164667 186713 100619
16120 100619 162340 -57482 -198224 70654 16441 37002 166495 237448 -46998 211170 92919
16108 -66454 72340 41100 292183 39825 134629 168331 540248 298807 255445 19266 323894
16097 323894 -8713 -183863 361019 236383 -258579 10271 455077 358415 53795 174471
16087 174471 248410 -141389 -54086 74095 283791 23017 -51921 167754 116129 256745 124896
16075 196375 389043 -21506 77214 138222 198144 291157 36618 19170 75755 -164670 -57255
16063 129260 -130940 222743 161960 285309 42085 -158757 -19470 370501 -114154 -239647
16053 -239647 -44911 159897 147021 74130 110183 -13401 -441720 -124165 63678 118742 51214
16041 71138 163322 -82990 57886 -176425 139402 -129338 -77218 307628 -300209 406037
16030 -230387 53281 -78612 47680 54262 -37875 -83515 -466690 99232 -79883 134860 65404
16018 -193551 24829 -19278 -163851 219793 -125507 131661 81488 -7632 22036 -116867 -49169
16006 -74356 -191834 42281 162836 -78402 -167544 -45448 179904 -354284 83887 -190640 -399154
15995 -399154 -139167 -70204 -139390 -34643 558111 236213 -13878 -103084 43710 -90415 6529
15983 17993 245758 233196 152784 251587 12821 -204444 102292 -207856 280832 -201528
15972 -78937 -205505 72709 -146692 -90625 -256483 -67059 255976 -291319 -46020 -63891 -75325
15961 -75325 328131 188477 65980 127235 47893 83726 -191368 -193131 158746 75909 145218
15950 145218 -273184 263698 -308514 -101145 143877 -219385 -139957 322213 -196573 -147703
15940 -147703 30849 -37806 -261258 -97520 -116828 -221708 98292 47749 -106726 32659 -304640
15928 4409 54321 -53137 -103977 -232554 -54471 -293281 166986 -602922 66544 -157835 158195
15916 314932 77054 133110 -80411 -149514 188246 -78748 291836 39430 132997 -20601 -360707
15905 -360707 97980 -45976 48294 -260638 -40283 -370250 71471 -102689 58839 -161671 -227142
15894 -227142 210502 71990 -94722 -59544 88822 74438 -96657 -162827 -74755 -95776 -94869 -283389
15882 -283389 -229651 19785 168398 -68294 -8324 -83371 -62847 -152671 -180022 -245185 -179543
15871 -179543 -84467 -199791 -272705 -148878 189155 -112460 -192838 -65573 -149349 -254548
15861 -254548 91915 -7168 173179 115768 112543 -280085 18357 125873 -325561 -91434 273929
15849 125542 -251824 -167192 -298947 -141839 26131 -67148 -93443 81453 195386 -194073
15838 10251 -111256 -10725 -177183 -120475 -64847 20426 4167 56265 -49725 -184931 -155490
15827 -155490 54708 -299410 -17691 -124740 -285139 246913 -72523 -2959 -235153 -240154 -180800
15816 -180800 -159642 -562809 -209455 204266 -355263 -213791 72526 31434 -127518 -224553
15806 -224553 118321 -65848 123842 -322327 65927 20998 -51278 -44347 79935 -58399 196204
15794 296043 -240363 -86830 94202 -11230 -230222 147342 15455 46015 337293 -39350 -29398
15783 -29398 63939 -124960 -1405 -22862 124237 120584 150311 -156848 114427 -320121 162270
15771 51705 46003 86875 -68434 -161720 34297 93197 -21476 -196913 28331 -25639 -339802
15760 -339802 -28752 211130 -171739 -30585 -124719 52238 -79121 138936 -19120 81868 236431
15749 236431 241767 130857 20 130828 56531 -103055 290787 281483 -100011 -159136 29278
15737 -103460 -129884 -33576 -78191 -18113 -185614 -156169 -177626 -40673 182879 -1019 -218280
15726 -218280 15664 -258065 55805 -104459 119289 117371 117609 202449 50188 -20036 -235257
15715 -235257 -198427 -393069 257185 12636 35848 109029 -77981 -188821 -251392 -132805 -121325
15704 -121325 -141403 42715 -32402 -260774 176911 -117870 115309 192117 -138769 42132
15693 -155581 -143188 -21029 125298 300699 -124456 68702 -125422 -195981 5416 -20406 -328812
15682 -328812 -272651 -89012 -409783 -395275 -276409 96614 -27286 -251723 -211568 -24820 93910
15670 -152953 -5100 -208271 -123935 47791 69490 -5146 66931 53495 -6278 12326 -250428 17024
15657 170129 -56570 96054 -78512 64297 -197457 -358912 125006 -79604 219044 62267 3235
15645 -71627 -159047 -102903 6030 305545 37143 123856 29536 19193 111874 5847 -182093 -35015
15632 29655 -236810 98191 -117210 -262785 71947 -39354 -42447 9423 -102713 92422 -202451
15620 5112 14677 -247984 -10201 14254 -33379 -132339 -80186 -21261 250689 -171969 -155245
15609 -155245 -292044 -132525 -247912 126509 -473248 174930 51141 -271682 -206959 -14407
15598 -364398 22037 -91273 1974 83083 208255 -54809 171118 155894 -51239 98099 -75738
15586 -31043 205125 -257332 128632 -284636 217184 -274824 -154748 -345932 58006 -116875
15575 8581 -204344 -101777 327533 -288529 169724 -216458 300178 -305500 191778 41715
15564 7817 9065 -293998 129551 -93117 85058 -9617 -27805 -156758 181771 262660 -308278
15552 141450 -179667 311040 -131955 -42460 44739 -75921 -33234 -52324 46531 -378012 6307
15540 -338595 -80732 211452 76903 -121136 -118347 -147152 206985 90939 -352927 -4732 39047
15528 364527 185749 -161769 83251 -325364 -259903 82484 -9863 -136758 -301442 109806
15517 8806 -295527 198459 -138166 256956 -97655 413242 62974 -114046 9593 -19721 -32347
15506 -32347 15780 -146987 333105 -90413 -38091 -265060 260815 81748 -129895 -324197
15496 -324197 112925 -208281 161462 134450 41727 -51750 -380355 -232001 -161847 -93281
15486 -93281 -276476 158942 -158067 226406 266870 63436 -329376 -83804 285396 22222
15475 12612 98478 123249 129190 -67620 46213 123555 -67572 -149098 18675 -250916 -108738
15463 3618 101808 113329 -31099 -16989 -153939 -83338 173710 346804 -13125 -72130 -37966
15452 -37966 -30735 78624 -71498 -174426 203544 14299 -164638 117285 -223616 -100083 148778
15440 179985 183593 49282 304377 -137019 17526 95049 -115160 46962 -108005 134790 148854
15429 148854 126615 -49400 96230 168848 96466 -349572 -332417 30493 -219639 48071 -16594
15417 -51601 112362 58180 84472 -16304 70044 -89472 -8544 -2509 -98973 -219988 121381
15405 207605 -227019 -49749 -273676 43755 62866 86694 -29642 121260 -93014 -138401 87369
15393 -68064 -322126 184891 -132836 -201395 5401 200779 -144072 193775 160856 -130563
15382 69453 3840 271729 80516 75525 115650 -159772 187046 68961 -167627 -45613 118152
15370 225383 -139927 189446 -104279 225977 3738 -2706 -108878 72758 -97295 -79060 42389
15358 -72736 52716 143368 -135140 -52635 -138701 -33928 235870 -16021 -97108 124362 -8674
15346 90911 70482 25777 207836 158607 31235 70200 -153871 64991 359927 -100534 254027
15334 219717 102906 -227719 67785 347432 -76988 231770 -88239 -182186 -2954 -221537 89597
15322 1466 52823 -93484 -9755 151609 103170 -104150 105648 32681 182598 131975 -76498
15310 -242549 110523 -163537 94480 -94691 -191935 246307 205131 123130 -116779 -348257
15300 -348257 225171 -264254 -82569 127971 10023 286317 123849 -92824 -173047 21107
15289 85983 13286 173782 -12728 376250 305059 -121225 -95711 127832 152941 -69954 -1158
15277 -137510 227636 179108 -194844 -110840 3987 -114856 -73167 68649 264234 465648 -297419
15265 600 210333 -94693 390 -139597 -38838 207732 -39939 -36144 -101690 -63022 127454 75299
15253 75299 485369 385543 323041 291955 557745 94596 -37956 -114518 198795 -65555 100490
15241 366596 392369 76071 50330 226885 8859 238649 -577979 -43951 -63277 265551 -80486
15229 111888 318224 163176 122883 197125 -199396 103949 222521 82806 2264 98366 161576
15218 161576 461810 -70179 64381 223674 140635 81168 237444 -8906 230501 294528 -151930
15206 249633 276971 458198 63953 -303276 82431 62181 372650 27391 -112233 206147
15195 155637 27568 34812 -2693 40337 -131228 120980 -24647 82661 39447 176155 -84139
15183 105347 412406 173495 163975 -129182 -192812 263048 86243 338653 -108345 219531
15172 362638 -110066 240113 94671 265362 1784 318451 194604 32001 111159 93691 -87991
15160 724775 -177120 -70044 206252 40673 224308 355363 61826 231565 -99739 -285973
15150 -285973 -128658 -133338 123743 25868 52106 297527 183280 99600 45633 466669 146903
15138 119365 114156 -161109 159396 537429 62619 85192 107963 198218 264142 -175046 56874
15126 304018 -32477 346249 -55128 65111 177156 25631 -6708 -56059 -40751 -47626 -25943
15115 -25943 295086 281198 -13032 -91401 -36709 362235 166907 28773 -153808 155772 38367
15103 202310 -122707 102710 175963 -40991 172523 -31244 129860 339814 302205 179459
15093 179459 97683 81589 189272 379104 217726 154492 132538 126608 64824 311513 9289
15081 250759 202818 86527 133116 217610 277149 219169 -220518 126379 95657 151038 -123731
15069 75772 257490 408960 213959 53216 176503 72040 229134 -118458 31807 -83469
15058 129863 294873 183335 291485 -50340 102169 243129 328441 169606 38222 20021
15048 20021 311391 113366 345024 144044 177538 56376 275415 311370 272136 93577 146066
15037 146066 217688 198353 209776 -91097 327671 166521 258074 243661 113563 332692 280220
15026 280220 103243 208896 -75372 347223 -96221 388907 58589 525855 259173 265393
15016 265393 56287 -89996 150710 68392 322058 86930 216453 245919 198711 203527 372472
15005 372472 -60803 208048 225214 332090 304836 44354 402732 393122 294537 108100 476386
14994 476386 69447 148365 307007 349815 220452 74240 410498 243707 -244699 274955
14983 419341 387526 18156 227662 431189 515987 231075 248298 402494 239695 130406
14973 130406 82193 320906 458068 463000 221616 262484 175314 681062 376735 382768 256890
14962 256890 69656 190738 309216 286427 395866 369043 104370 326202 282141 205541
14952 205541 189445 211870 355629 -95381 157261 188175 65341 202635 469576 689958
14942 689958 298574 337416 200550 331190 477812 186294 258247 574170 123717 287613
14932 287613 520457 143834 252531 48948 512750 183162 224095 241927 315916 677913
14922 677913 631399 68355 512856 491935 164424 537827 524160 363556 447468 422575 525891
14911 525891 169235 286476 741919 325751 539909 380297 247631 244695 456610 396328
14901 396328 508732 108365 593913 202570 141297 377154 286474 157004 465105 472781
14891 472781 506445 510252 165264 332478 572353 272180 63520 312379 412390 584018
14881 584018 719863 829487 347676 650232 134487 563296 731322 229846 215872 348817
14871 348817 438773 590339 141664 656867 317764 520225 569144 333498 594112 540017
14861 540017 541902 577902 319499 316961 256802 461170 464913 191762 427216 671132 396668
14850 396668 202490 296282 360911 351071 308519 304523 476413 353429 205678 471790 313806
14839 313806 515895 417657 486227 448707 549635 355530 209327 586456 295619 488750
14829 488750 601669 481962 441630 563037 345435 246991 482810 648851 584598 441586
14819 441586 511714 559802 359617 626253 526373 474118 560652 498635 259695 308680 491884
14808 491884 656984 688480 245088 756351 625261 523055 289238 572827 479946 411285
14798 411285 532189 882725 474156 435502 627483 854515 765177 877667 444487 630851
14788 630851 489550 691144 425091 414351 731408 656578 902845 637096 547474 673746
14778 673746 386852 743095 390349 749423 618124 441872 793790 497217 328863 576711
14768 576711 806956 799781 392719 630081 637617 574360 366156 618313 791691 928688
14758 928688 487973 433528 533907 602717 875757 1004312 605616 613731 835231 693244
14748 693244 843848 609178 819376 832634 724669 617452 535014 925982 1023249 854367
14738 854367 607271 923247 841817 677656 513699 754312 627827 703785 709820 999302
14728 999302 883736 637648 835321 825954 660187 551124 815329 549960 948987 1059591
14718 1059591 998080 602547 782896 965661 930114 825253 640197 1059404 755443 862835
14708 862835 849106 925654 937609 952260 828248 957553 1009826 816768 833185 797962 852595
14697 852595 850110 853251 1289743 802952 817074 919673 1134972 1115178 1126932 1150135 1229986
14686 1229986 1004215 1105050 1212470 1075927 913007 1124494 1199212 1205569 946791 774733
14676 774733 1198197 1109528 1022287 1123943 1249184 763823 936714 963807 932224 1341774
14666 1341774 1055271 1146215 891744 1219216 1000644 1143317 1114530 1082785 998219 1452417
14656 1452417 1155124 1128081 1001205 1072895 1341439 1397591 1156615 1212739 953515 1311201
14646 1311201 1575101 935838 1208240 1517070 1347429 1271370 1536576 1304322 1175635 1351446
14636 1351446 1030284 1165049 1452579 1210470 1454181 1032804 1208290 1310033 1073232
14627 1073232 1468531 1521704 1593946 1414674 1568500 1534079 1449654 1468668 1671157 1509426
14617 1509426 1448596 1265025 1483550 1377861 1345665 1775450 1300051 1409423 1329011 1742158
14607 1742158 1578024 1724559 1794959 1704860 1605614 1906259 1791669 1849760 1782513 1378192
14597 1378192 1796364 1991010 1856521 1701491 1875968 2057432 2101689 2080225 1857714 2067031
14587 2067031 1942063 1955052 1981302 1784935 2120703 2263129 1929015 2118706 2228825 2144372
14577 2144372 2002542 1863851 2417742 2123501 2542988 2308904 2384528 1925414 2605100 2345399
14567 2345399 2457540 2390759 2675473 2613753 2809313 2755144 2951821 3120747 3478920 3416630
14557 3416630 3765846 3647818 4484086 4717343 5085676 6062423 7599048 9728849 12045101
14548 12045101 15352246 19247356 21945832 20461801 15632727 11201139 7891435 5936246
14540 5936246 4476943 4070509 3607944 3374538 3136054 2963985 2896095 2808824 2630845 2836228
14530 2836228 2370718 2682445 2187383 2665515 2973952 2683655 2770767 2449195 2745551 2587497
14520 2587497 2999891 2600672 2494188 2790419 3008214 2843163 2636052 2938364 2941825 3077645
14510 3077645 2851271 2881245 3117679 3048410 3179732 3003676 3291351 3258147 3039213 3347974
14500 3347974 3092885 3231421 3427651 3260053 3503417 3414526 3425014 3672110 3721343 3773301
14490 3773301 3465282 3802855 3706514 3833253 3873004 4132301 3897032 3842396 3770416 4220738
14480 4220738 4211691 4001217 4172202 4097776 4244672 4279815 3852979 4241242 4324425 4279042
14470 4279042 4147559 3975814 4615801 4565558 4638236 4717831 4699289 5008432 4644641 5024940
14460 5024940 4707449 5126542 5227424 5260571 4992628 5416703 5315861 5554144 5502720 5819112
14450 5819112 5911637 5852429 5677926 5747247 5971326 6035252 5852037 6451752 6368254 6390220
14440 6390220 6482758 6531449 6513178 6729654 6719993 6542137 6873539 7288668 6880264 7430013
14430 7430013 6976921 7634922 7387339 7562267 7627058 7913254 7777383 7866510 8237477 8245787
14420 8245787 8273355 8447789 8684428 8476391 8752509 8996324 9039084 9458192 9478970 9600251
14410 9600251 9709160 10079183 9750284 10090089 10230318 10170205 10258636 10677048 10803985 11508284
14400 11508284 11119350 11140386 11601935 11699287 12132688 12142490 12430637 12677998 12807405 12968667
14390 12968667 13444411 13438641 13528147 13975725 14349752 14372524 14476303 14962566 15342718 15268386
14380 15268386 15749445 16203745 16473467 16905218 16905117 17347192 17632760 17873805 18669864 18677652
14370 18677652 19273613 19536423 19953360 20452192 20512237 21229537 21515654 21946266 22421266
14361 22421266 22779427 23645624 24194516 24701027 25198674 25725895 26572454 26918191 27582663
14352 27582663 28391674 28981245 29851493 30509731 31509320 32215115 32960488 34041535 34380167
14343 34380167 35702314 36691712 37621954 38611370 39867863 40842369 42195639 43410510 44631165
14334 44631165 46015998 47438369 48723747 50178473 51871571 53494393 55216415 56865186
14326 56865186 59087128 60794232 62557366 65050133 67852841 69711760 72039119 75032656
14318 75032656 77625544 80613051 83687803 87026222 90241282 93874337 97325230 101231372
14310 101231372 105386638 109775663 114207337 118705074 123975668 129604947 135003198 141051136
14302 141051136 147115883 153573177 160488297 167747550 175431961 183195157 191544046 200212449
14294 200212449 209390303 218800570 228789447 239074040 249584437 260603540 271917800
14287 271917800 283228337 295188695 306842320 318653307 330241530 341743163 353241649
14280 353241649 364107430 374043744 383480719 392168317 399650045 405637140 410356555 413810639
14272 413810639 414865952 415309492 414398685 412491147 409638497 405778993 400516831 393616795
14264 393616795 385582389 376667407 366727577 356033202 345026266 333537930 321968143
14257 321968143 310209911 298230195 286628026 275119750 263795315 252589941 242262159
14250 242262159 231934285 221609296 212039761 203184549 194265557 186049158 177813687 170268548
14242 170268548 162895012 155857084 149543155 143252068 137164939 131797428 126121069 121067387
14234 121067387 116258976 111590014 107225355 103179759 99352133 95223189 92071078 88404254
14226 88404254 85231872 82132053 79235380 76233231 73757232 71166951 68750385 66192555
14218 66192555 64363388 61856480 60092572 58435091 56466479 54435019 52957716 51659550
14210 51659550 49759222 48407025 46979319 45839204 44158211 43009371 42106741 40696886
14202 40696886 39801987 38412136 37823188 36484450 35555158 34848740 33980781 32904537 32324321
14193 32324321 31369907 30470201 29718747 29103021 28471684 27434214 26840983 26308451 26279117
14184 26279117 25450053 24730196 24280489 23500472 23021722 22635389 22001262 21635260 21340882
14175 21340882 20572908 20600837 20007073 19383715 19058629 18887040 18483379 17951624 17508958
14166 17508958 16907010 17111102 16647473 16516194 16066923 15847964 15866978 15555217 14995961
14157 14995961 14851008 14669777 14252689 13976153 13958376 13438730 13565594 13269495 13039947
14148 13039947 12665598 12351522 12021517 12085774 11553761 11733828 11419288 11397826 11246459 11250646
14138 11250646 10766751 10759538 10403258 10403112 10161451 10142958 9955171 9640658 9780379 9514865
14128 9514865 9274705 9377882 8947118 8757987 8795816 8914656 8651734 8336712 8385065 8408081
14118 8408081 8144315 7975140 7836070 7888957 7608668 7618277 7461249 7509721 7267974 7410682
14108 7410682 6844698 7126567 7114145 6717165 6717172 6720348 6980283 6758413 6066419 6511879 6080560
14097 6080560 6169381 6177932 6163810 6144248 5916693 5959171 6039876 5691715 5627181 5570132 5612240
14086 5612240 5535261 5270774 5504351 5394611 5539911 5311063 5350685 5130850 5029551 5063712
14076 5063712 5017784 4946401 5054504 4763731 4628981 4744181 4765253 4798527 4752473 4738752
14066 4738752 4347385 4540883 4218530 4182417 4392920 4081904 4387091 4011785 4161304 4082196
14056 4082196 4128389 4024014 4252780 3978549 3858927 3920246 4116413 3471363 3891325 3504008
14046 3504008 3723137 3643709 3624876 3640295 3452112 3413907 3246915 3185318 3422566 3310384
14036 3310384 3206893 3006053 3520003 3399750 2717129 3180441 3255828 3230923 3053173 2781097
14026 2781097 3071106 3257005 3002773 2876603 2803979 2559737 2762926 2847643 3108522 2657567
14016 2657567 2791683 2473099 2612446 2803255 2703782 2852356 2428987 2738166 2691449 2833663
14006 2833663 2903713 2549962 2538659 2591642 2322693 2522372 2678013 2723102 2673699 2740034
13996 2740034 3040989 3047867 3331193 3436517 3981590 5038588 6007733 8567908 11668931
13987 11668931 16437052 20789961 21340686 18199149 13918540 10529513 8407524 6719219
13979 6719219 6005167 4955001 4319159 4301757 3830849 3829269 3519060 3367080 3056754 3014041
13969 3014041 2973821 2649459 2863572 2735694 2752413 2211693 2570178 2263808 2489120 2108013
13959 2108013 2233899 2556107 2371535 2360377 1906118 2243107 2169690 2080502 2092803 2400659
13949 2400659 2013827 2340797 1939388 1979508 2114713 2031869 1988909 1611923 1887506 1844801
13939 1844801 2057195 1613738 1801893 1961641 1743012 1922382 2023328 1826471 1885547 1749547
13929 1749547 1696998 1835156 1541795 1889299 1698145 1983358 1414157 1695474 1680620 1716912
13919 1716912 1490662 1591003 1718949 1729175 1717216 1676695 1663709 1609574 1955693 1817097
13909 1817097 1513340 1385641 1536254 1512277 1209049 1496498 1467526 1416174 1538366 1201448
13899 1201448 1424022 1305970 1069173 1449127 1548567 1650218 1673540 1353913 1469033 1158922
13889 1158922 1378944 1582722 1345888 1623969 1285774 1340715 1168086 1342880 1450841 1435241
13879 1435241 1276878 974817 1349210 1228661 1121720 1202936 1311467 1175886 985959 1244046
13869 1244046 1388107 1018002 1034883 1327979 999133 1411802 1331567 1034511 1097665 1095116
13859 1095116 1454310 1197392 1035163 1156094 1157391 1029764 914617 1140442 1109257 946153
13849 946153 960932 990813 1013780 1049823 1101785 766957 1140485 893742 1334072 1198186
13839 1198186 1232099 1008662 1245993 1052461 1151761 892077 1160360 1334238 893382 931516
13829 931516 940297 874951 806656 910661 557961 1016307 842764 938516 860198 1091808 960009
13818 960009 758802 990679 758528 887185 989988 1035312 791284 511113 816236 1077601
13808 1077601 1055243 863422 807325 843196 865358 767434 803787 447408 779687 748528 812857
13797 812857 809894 871830 1014585 639398 892004 957715 1201318 1054369 770408 900121
13787 900121 761872 1038745 828246 884046 736307 616156 960696 854409 567478 634270
13777 634270 637030 600037 744629 612412 1121578 912138 865001 764093 629015 576015
13767 576015 765007 1058579 529638 651636 846902 892491 797917 640522 556667 771626
13757 771626 506301 881071 803674 896827 739319 782291 735117 666596 771613 844241 789703
13746 789703 459502 1083467 733292 545531 560048 494187 665107 718754 683580 848305
13736 848305 578930 361438 669193 499700 623244 410669 477649 812719 555172 595613
13726 595613 688049 430732 694745 362725 1031981 489834 854507 514140 796107 832359
13716 832359 476124 571966 950755 571063 658750 604690 991405 576150 413664 719004
13706 719004 551346 532175 635679 795907 101526 587113 547343 430181 424297 443157
13696 443157 381590 722317 323096 436563 582591 443402 373336 478282 654373 469779
13686 469779 417382 718449 743043 720106 671193 562119 688691 199264 473753 213943
13675 529455 698953 622917 711620 603981 665914 774752 427806 529984 792472 205770
13664 416728 196703 229502 570949 601777 739927 699507 698027 523412 317154 731563
13654 731563 662996 70374 430905 414071 270808 552619 620970 399880 474645 522815 542475
13643 542475 562015 381517 328234 375255 484973 249543 535098 348897 639759 451618
13633 451618 264244 537827 574172 310086 192014 407085 219503 706755 513460 356452
13623 356452 300663 103458 637142 391700 399812 303790 442821 610101 214044 309855
13613 309855 545264 346233 470669 330288 475752 362823 592300 407750 466951 666677
13603 666677 636874 354075 261991 545319 494996 349669 417240 580351 586851 166987 571886
13592 571886 717527 432763 276171 431656 431313 394848 116314 163539 354975 200502
13582 200502 628280 461168 518681 557401 182832 458408 357143 608173 201073 107169
13572 107169 500140 451114 216880 591447 834500 389137 312145 123307 412871 445606
13562 445606 358178 397749 564760 472689 510653 168883 241454 167270 578036 306894 496188
13551 496188 176644 225091 424291 511525 514684 -38027 312151 267067 178575 154907 140956
13540 140956 34847 40317 109269 526059 229632 329842 -46956 358516 228817 129399 305612
13529 305612 323904 217446 147932 212782 113961 60483 482913 122913 352740 275802 425776
13518 425776 155951 70121 326779 235625 545856 361413 239387 249972 589600 373907
13508 373907 144624 346443 62700 243341 581960 290769 381818 105976 296544 181204
13498 181204 237325 150737 722346 328396 436639 301437 279698 317216 473221 -47066
13487 442254 239888 143298 394933 232274 19213 193291 203166 341207 359546 525428
13477 525428 482037 289279 80115 162760 242748 253638 -937 182980 415278 535405 86770
13465 170985 351603 97147 232166 167631 114575 416679 253604 -1432 336750 27046 191734
13454 191734 284547 381200 521662 248697 168618 296951 454198 353340 290595 117746
13443 194293 521556 176409 191997 630012 117561 -34955 222906 -70994 94559 400732
13433 400732 124755 25609 42793 335923 366645 392070 283435 201849 39672 245715 439791
13422 439791 445805 239850 -95204 425337 418859 306230 128809 335242 243887 216954 -178312
13410 143799 296600 259834 84175 376722 456014 489031 208733 145652 150686 149259 19859
13398 204546 203327 343948 233749 266369 487076 99675 69734 282477 519374 160394
13387 337098 301827 458982 548189 267686 255442 127683 383866 594881 230828 148584
13377 148584 19780 281756 494031 229443 282532 200305 185557 68062 411813 227839
13367 227839 265943 193743 126813 208437 -7953 258078 423743 214443 229136 154037 207441
13356 207441 -32315 361814 128222 331691 164787 282036 354028 537000 13542 -88777
13345 222127 388907 231520 215467 272497 556065 20781 183746 106747 291773 75863
13334 53884 96556 294378 421402 314323 -52973 188999 206065 117648 114043 421195 259368
13323 259368 432502 30300 463043 -16585 -3589 531857 228408 117242 223585 520408
13313 520408 392209 309831 382404 136524 -128429 179845 -105809 67357 333164 -86158
13302 100157 -184390 -121069 147698 347726 46074 14983 71767 153110 7486 280403 262750
13291 262750 171600 75241 167692 269393 65585 213208 663956 438993 179229 136347
13281 136347 111196 78506 -126229 132285 66383 297507 275374 51104 301752 -1804 324917
13269 70586 36598 108579 241372 143778 -26790 107361 -95475 401688 15355 4110 -23008
13257 19802 244574 152374 58490 12265 76006 176496 227579 23347 106700 17923 180954
13246 180954 -52219 269798 338129 80595 490256 57669 36702 -47547 212218 284256 168174
13235 168174 148192 265216 358268 -22705 279371 537787 102687 91995 14763 -143906
13224 77538 135407 313648 111201 246279 266902 60760 228153 52827 -235288 -45117 55250
13212 10738 -262210 96575 202544 127328 78182 188530 72947 255522 364741 967 64178
13201 64178 324892 -33537 -23291 138610 337984 -87912 82650 35789 411782 91490 202859
13190 202859 182381 302000 108137 95220 68849 330037 137175 105806 114905 134087 213504
13179 213504 -351857 295963 215858 43107 -87332 180782 -126884 316061 158766 -83864
13168 52847 359852 285727 -13351 118958 149664 42535 73345 -784 199398 -39407 238599
13156 90554 141648 254707 23542 313103 129397 339657 260412 -12862 338174 59642 145567
13145 145567 387484 116364 24184 6483 -12980 247296 41928 -154109 -20246 256067 37547
13133 155415 80980 -28156 238316 414807 -83604 101941 233880 94641 -161692 13075
13122 -97381 63265 -173048 -80141 148523 199908 11538 233933 72205 229101 -76985 -64428
13111 -64428 194573 194923 98642 63571 312449 -75312 228067 87204 -138281 -42694 161127
13099 -1345 311400 -99270 211178 8870 99589 96291 -171012 267703 -72846 140735 -56519
13087 335720 85329 165095 187519 -156842 311673 132824 51535 171310 22841 295548
13077 295548 15487 172948 82192 90530 23569 19073 -28652 -13883 215140 -56502 -83149
13066 -83149 146583 200572 132801 199475 -8229 18914 238742 54314 -55779 231501 237296
13055 237296 111212 -192485 468335 39538 301103 152471 279756 176586 154259 -54814
13044 153225 -79911 156269 21968 -80924 333117 193824 101784 53043 115928 318496 -29353
13032 171617 206730 44319 155092 -84490 108200 48783 -188008 77831 -41805 66996 279444
13021 279444 135931 188114 71989 -323766 -7277 348323 -60543 -20047 347041 -120700 229680
13009 -11419 63614 109039 151290 -253869 262256 -22410 -127699 30520 185989 -37950 -8640
12997 172577 -45321 61135 43592 166196 254530 265449 139349 118246 6100 97798 -13758
12985 31005 -30786 142685 18924 228625 -59924 -58863 -98774 12498 44309 -29868 113450
12973 129890 65156 82408 89926 111992 132249 -163696 282905 -170024 67314 -10753 115176
12961 211449 -66080 -216043 -12320 175905 -19413 182935 35707 8970 63468 129793 20448
12949 -7069 255768 -118330 97984 55016 261520 287923 144051 -282805 -123095 -29716 45158
12937 185311 154832 -33952 -56560 4841 -165204 109903 120754 -121065 171748 -155362 75850
12925 256228 279251 -17282 -138654 91449 279150 209582 178040 -112693 -190964 186768 -216788
12913 106451 122558 -66021 297884 10855 -191693 26826 -64150 -485822 -116579 -134138 67398
12901 341749 326179 57387 -209048 -19143 115766 39611 125564 293129 -10367 287153 -8061
12889 -253443 88253 251491 -157759 211806 -5829 -28861 -292548 -78186 107540 -116684
12878 -191896 441270 -29617 -52526 50348 52901 -50236 -46730 47917 44413 46918 -202515 124494
12865 298767 -78588 232939 88745 -4853 10784 73553 34021 -824 171911 112616 23217 -229556
12852 50484 -137204 160412 -25412 -106013 -216732 -151205 -35065 -432009 41610 -108792 127503
12840 44164 118621 162594 -14808 -35525 33064 -118217 150156 29955 108885 255152 144199
12829 144199 -44679 59903 -40990 -331112 104535 -91275 -62632 115031 -1673 -84541 42772
12817 -22551 -35534 -125859 146889 113080 -283 -33005 124504 -108780 -305100 75403 71234
12806 71234 -155753 66807 107595 250971 -10276 -172531 -159364 -345976 96752 -193767 90621
12794 107356 12157 -41526 156908 4146 -123956 -197237 -84463 44594 32537 21660 -126484
12782 29695 194890 37867 43864 -61647 -15517 229188 -42759 331698 62905 -17737 -70988
12771 -70988 5388 -285128 179187 12798 150212 107402 106961 268117 -272556 227292 -96006
12759 351107 -24262 -167448 26030 295210 88330 -230052 99832 123775 9877 -3305 253397
12747 -84350 138905 125252 3212 55359 251874 -35943 250346 -58801 125347 -17021 -249474
12736 -249474 -100464 -28874 32570 81624 86331 -171060 163931 375548 -171594 188849
12725 -84237 -20332 -366091 181490 60378 204700 132087 2302 124282 222519 109007 213245
12714 213245 -151343 38443 -25231 229074 108983 -83409 -47165 -46961 308711 11773 41937
12703 41937 277984 113901 -250517 -88101 187170 52169 -75011 -129670 275502 -19828 74348
12691 163049 -24067 49782 -135360 -63249 83368 -112684 -73832 11296 -191625 -98154 147205
12679 341185 70187 287522 65032 37220 256504 380651 37188 -53291 201846 35930 143916
12668 143916 15889 -41558 161415 164133 -2132 -198388 329383 157708 165325 42284 174419
12657 174419 21532 -34179 -209798 -250971 -124675 138111 -256346 -82135 111328 327728
12647 327728 -185014 -146810 -11102 -105805 52617 -123726 181602 23537 -54326 -57922 68997
12635 108442 -106261 50189 -24637 128257 195364 46666 284815 32787 -172703 294003
12624 87357 245235 68517 -72734 81562 350949 35528 293983 -14805 61662 -237492 134746
12612 -26035 56033 6112 84807 22858 104428 67904 -111918 -129651 250699 80146 168803
12601 168803 5957 158064 -33300 355834 239601 123161 -78381 -74873 143707 124461 -121886
12589 193554 -106302 138745 -135874 -127631 280742 -81475 219963 -235215 147362 134469
12579 134469 188477 -291720 -177979 188621 -76564 188511 -3727 -43430 64696 -161604 302361
12567 252609 -59113 272779 51951 19091 -89580 91947 -151049 54462 -130257 140311 468760
12556 468760 -114360 45439 81181 254844 18885 -34236 -28233 187493 124258 68741 -63015
12544 46084 36368 47497 -176938 216465 26712 78016 54650 72896 227152 34541 22560
12533 22560 45652 46466 297587 29890 96246 320803 96737 259929 51513 -170519 132577
12521 -72787 127097 181640 -2478 127508 430790 272815 -243395 -165787 -298124 321593
12510 133940 -313558 87825 151989 -99737 19161 -213811 388197 239683 -49969 38865 -138728
12498 12370 -197761 20801 -102530 2200 -52747 327371 64059 -99023 65746 -89203 -211918
12487 -211918 188664 -221884 -317524 -104145 183008 -168198 -202663 -321167 -95514 168198
12476 93082 -23315 -188511 94770 -104691 -110689 -147064 -272250 -280344 -14446 130174 -131636
12464 -547793 -111789 -43207 -10578 -208513 257172 93192 -25230 -1647 220722 102884 -20820
12452 37361 -87962 22791 -37383 -209719 -101357 -71810 300867 135226 -20305 128356 108168
12441 108168 205541 210097 347253 -295833 -67596 -255774 98826 -190661 48289 -59599 -163064
12430 -163064 -53000 179550 -146836 -112110 -66144 186582 -72401 68303 -82226 -37344 91388
12418 116680 -9693 -256358 79005 381322 67208 -229998 7183 225507 213474 122435 111167
12407 111167 166403 63819 53402 137947 -171571 -93953 203789 -328923 -205766 214767
12396 -223915 51140 -171220 -82821 223268 -123098 -119596 23643 -101814 -39667 -58292 -199915
12385 -199915 -57486 -138162 31964 154860 -37030 102760 156207 22774 -256445 636007 -196198
12373 110241 307983 46824 224367 -104352 24823 -15061 131112 -93939 12653 -152035
12362 -297279 -9337 200468 12912 49782 -212700 -42817 -35047 -110598 29090 180829 -180654
12350 -64966 -149762 -448527 -132105 -101306 104061 -175050 -101670 -261423 20628 -178081
12339 -80339 23788 131981 197010 174562 -53646 122730 146626 92194 289691 -29647 -111752
12328 -111752 -76816 -281610 203238 133795 159730 -259558 -112194 27547 22896 -46212 -131139
12317 -131139 228984 132339 -55777 -91911 277655 234283 -47676 -226529 -149734 -240230 17275
12305 95735 -16682 335016 -48440 -37997 108479 -63271 72306 2819 -186890 -251624 67322
12293 214058 163327 -5492 128686 37140 -42347 -107855 8907 -150515 -228317 23275 4231 237656
12281 237656 -81825 -25789 1528 7498 -37793 255998 -82792 114551 -45607 406775 61113
12269 90951 -109880 -105395 -116670 -253242 31786 -124728 -195645 217009 -272335 92745 306624
12258 306624 92075 288520 43782 208202 -190477 -26776 -179916 104415 173314 -53384
12247 -231034 -113115 111787 215029 -77411 276337 -185204 -156066 -188123 69390 223083
12237 223083 93249 105297 23284 6490 145854 -237654 -186862 74095 66607 104318 11948
12225 269895 171095 122438 313158 -77043 156485 404865 64715 184060 357081 42745
12214 59161 120331 81020 -103403 12734 40499 -294836 -142971 63886 216623 129418 -75642
12202 157677 -52737 172213 64937 270612 -123272 -129009 95579 18819 -79182 267972 162508
12191 162508 270491 8094 -116092 2504 306322 -75341 30540 -73752 8526 297650 117840
12179 154507 -280982 -2976 -11728 41664 109041 13408 235639 -12979 -47898 289817 114051
12167 -64737 90093 334427 -107056 -131708 -55849 23184 -6509 7185 269606 192209 -308456
12155 109501 216625 -235950 -208907 285570 1979 37970 143544 144125 65863 -25549 -50732
12144 -50732 -207556 6815 66219 81830 -81648 -96858 294590 8491 157424 73666 37118
12133 37118 -19761 -125289 -193729 205419 73904 213071 -44359 -144194 -97835 84939 -81751
12121 158581 214920 -112627 -64066 140570 -13231 -82950 92915 -98866 -28326 -32706 -57249
12110 -57249 105854 58905 -66761 -1509 -401800 163623 265567 69896 163991 -66940 297513
12098 296917 -31580 -173841 135864 -86950 -165344 -128809 -198260 266378 -222642 447639
12087 -321736 245947 85417 -189648 -171122 -427 -76644 50644 -141405 268675 -9457 -331226
12076 -331226 -59525 192751 244714 -18380 339784 -109201 15048 -284120 -70190 84010 -83420
12064 -194136 -152493 -19892 146451 199930 62391 -332666 -20656 204211 73003 49067 15424
12052 -144485 -415856 -46997 -127735 -36432 -30023 142854 28889 -131907 23323 -21800 -245478
12041 -245478 -35791 -55325 165165 -405954 -210896 221657 -1183 -123691 156847 98183
12031 98183 -225690 164606 150891 86942 -321692 -60970 -4391 129409 231081 -59644 -114059
12020 -114059 127126 -80226 42033 -192511 -44104 -107536 316597 224421 11516 -281801 -99943
12008 69744 107906 -86026 -215917 245981 435613 -197867 -275963 14408 107461 199484 -99926
11996 44591 -212062 -47149 83951 -338168 -30982 71409 -202566 -57425 33602 149828 -60242
11984 280191 166481 192166 -164077 37615 100356 -125060 271425 123923 -177755 -364994
11974 -364994 40922 -320258 -157963 23282 -149104 -74222 -180777 -308750 111213 -179594
11963 -94388 -175507 -214061 -147622 -27650 -199480 25617 407930 -99851 284486 -289071 22270
11951 -319148 -73953 -256308 -180246 -58396 -299129 240990 -150512 -367403 -56388 113655
11940 -245929 158015 73693 -139470 -40706 -3684 23557 -117444 85036 150442 -165169 -21580
11928 255280 75419 -113176 11131 -76033 223892 -72741 -10273 -474932 -249591 127034
11917 14510 -80599 -23305 -98091 -156505 -165070 149059 -331590 25686 -104163 -59780 175788
11905 111742 148081 -17082 -85976 -186725 105614 -91890 -62639 157424 -112404 -235500
11895 -235500 107583 -31271 42327 174190 179893 -116795 -38597 203944 -331649 -109284
11884 -86676 -13735 11905 -333944 -50051 233990 22005 -315212 95603 -152097 141379 -108905
11872 -260492 3937 -110459 -154441 74947 13510 -226022 70165 -5200 42453 -53845 -5958 -61712
11860 -61712 51747 -242974 54132 5502 172303 76825 33342 -98494 128447 274515 -257790
11848 -275526 -222999 200744 -57490 -129935 -241347 119540 -200010 -186447 -71297 -269411
11838 -269411 3883 -52478 83407 -141533 -64191 -98543 -225911 -63393 -120806 -76097 -158923
11827 -158923 100603 -93730 284756 -116627 -267766 -219689 26719 158464 -308669 140972
11816 -141185 96519 -101152 24752 11284 -207768 59703 -72233 142006 -64702 -81680 -83882
11805 -83882 -37669 -151702 76686 -68024 -54460 -125627 -31371 12287 -324968 -18081 67597
11793 -126030 268348 -168469 -259806 -66272 -78646 -974 34723 -120410 50115 -190985 78634
11781 -177619 -69463 131568 256269 -44309 -213077 65798 86280 -49347 274547 -55036 -379629
11770 -379629 394939 -149274 -265123 -144679 6731 -14767 -43399 15331 -17740 55892 -61837
11758 -360074 -165543 154215 97459 197589 -42393 -32192 89117 127849 232144 49410 -309760
11746 -8961 -120228 -54361 144453 -92866 229634 68274 -63741 252683 -40164 228196 180613
11735 180613 -147504 242572 -42844 -191199 -33339 -47499 -25108 -101197 180387 189247 -129508
11723 -166203 -176160 80965 -194655 140330 160357 -88555 129586 121787 28192 -337594 -15420
11711 315143 -37261 461624 -49493 86421 -50259 -8056 269909 -291495 10402 -74597 12106
11699 174114 -114010 -67012 -58137 20617 -162450 38991 -99341 27282 -194099 -190768 31894
11687 -29909 -83123 -3218 232955 -23775 335618 121602 -15624 141940 144218 239983 181805
11676 181805 -22765 152295 -45943 44339 -4047 -301112 76292 -138078 46947 -71719 -32323
11664 -76744 88364 -3424 337264 -34296 276106 -121599 172755 -157343 138784 31685 -255221
11652 42709 -192514 85476 -152079 37431 74400 210952 322584 -35103 199019 -344750
11641 83572 167510 115976 -38279 -53661 -351346 212989 -11731 53130 -117035 -177724 -63444
11629 9851 -188087 -280426 126971 218762 -109268 4553 154206 182457 49194 -197852 -114858
11618 -114858 -306512 -65685 -73780 14361 82599 -16922 37810 -159491 -264873 -84920 -24557
11606 37895 17483 287372 -76406 42514 88313 -57519 138191 121758 194135 -73782 -42357
11595 -42357 -133658 152214 170946 88291 -95504 -54302 -130818 -102262 280906 -117304 155844
11583 93942 130460 479948 58649 -325666 251030 -20657 -128051 325142 -72461 13694 123212
11572 123212 289734 -162272 -174208 -250966 79176 165094 -218876 118038 196667 132023 82560
11561 82560 137330 82137 200286 193224 106057 161398 -168904 -136505 -135139 133705 207466
11550 207466 188181 311339 -49936 -80473 300376 -33727 165459 -90017 13653 -77839 -206061
11539 -206061 5459 -205933 -41154 103461 -159857 -15887 -97766 129336 -62959 150988 -219152
11527 125201 132364 31628 16207 -82021 8015 134006 38897 66566 22263 -64698 217306
11515 142293 -25066 -137640 -95263 -101551 107731 -169700 71401 81627 -9147 -91466 221304
11503 -108332 292942 205033 122552 7823 149342 87894 99128 54557 75900 50294 218826
11492 218826 86217 131667 115802 4858 -174999 60221 174571 157632 -47046 50571 172164
11481 172164 96614 177208 -253640 155322 278923 91139 -49567 87380 148073 158570 -122031
11469 139189 160580 -16151 -21500 174761 112537 196210 -206703 -274277 -28 85177 146873 66296
11456 -7570 173476 145337 167417 223490 -92154 117917 -84556 -14350 19712 90932 -113800
11444 -1862 -142488 -90671 -310349 -129529 -144032 269553 -131007 -161054 61172 -92367 116646
11432 -39045 105227 74024 -104782 132123 207971 -52890 61550 -74234 103659 490935 145411
11420 -19758 -43503 -186385 -208639 -223862 -101386 201491 -172504 -113252 35828 -124559 10890
11408 -119934 -25803 -47443 -124927 86088 192173 81449 -76955 268633 91764 85851 78178
11397 78178 -104161 -135850 16240 204336 -78997 -296685 -98390 -274728 -230193 -62587 -94060
11386 -94060 -29184 -19685 -49119 -328597 -95275 142678 155376 -278586 -66091 -133349 73214
11374 -57883 35354 108590 -170895 -40634 -283578 -79974 -96455 43145 380354 -12954 -18921
11363 -18921 -208513 -120372 -14178 82669 139805 241354 49099 -79108 -156715 78202 -96441
11351 58523 104975 -217387 -282441 127145 -52418 32664 -160049 -38480 189867 29840 -80867
11339 82461 17969 238639 -74292 -60447 -12783 -272227 -158603 -203062 -7968 -25168 111590
11327 273305 -144567 -26365 -1942 -29542 -113720 298982 36873 -137871 119593 -175332 -24973
11315 -185707 183075 29395 93697 135630 -3282 267777 -415501 72937 -238575 42053 52825
11304 52825 28447 -351014 -46138 41950 -270190 48690 -165074 74197 -347413 181295 -292335
11292 -252849 95538 -133515 67276 -104749 132552 -29991 -211137 8793 312601 56046 299098
11281 299098 -132938 -16356 87368 75624 99312 -5470 58870 58260 34629 255484 -97202 -163378
11269 -163378 -105656 154614 -267155 173884 -357153 227418 -17690 -471981 -89930 -210104
11259 -210104 -73557 -44303 -182766 67007 -7091 88317 288273 127867 -238825 118489 -120520
11247 77696 -244394 71316 -258034 -156255 92198 265626 -205604 301117 -79752 10042
11236 150762 -130037 -142758 -45115 126496 -229232 -305237 -166781 -11797 -80936 -47857 -149289
11225 -149289 -98246 169921 -155836 -117045 -19378 -55751 106107 -95656 252760 -26396 203432
11213 196541 79208 187336 336008 103449 -34944 -159158 -180670 -177269 -64548 -54308 -1863
11201 -171 -169729 65103 120592 -9580 1072 -30209 59957 144133 215677 -385530 207085 5008
11188 -55993 -18069 309719 -284546 -125585 10069 -1082 263691 160101 -449682 -130978
11177 25273 -198751 114524 -404996 -139401 -196517 -287103 -217158 201746 8093 381778 -98562
11165 31995 -176993 63758 -15756 66290 -79314 -240288 -76159 67144 218669 52794 208754
11154 208754 228378 135016 121973 -117900 140747 -224755 159371 -265936 58713 97660
11144 97660 163639 -182994 42897 150149 -202834 -93271 -205225 183727 61523 244940
11134 244940 -136048 287247 -301148 -312930 -35789 136119 -39995 -29594 -203726 -45544
11123 305332 -12776 -69870 63887 15124 227534 240749 -92025 33076 -45268 -27935 181946
11111 -252411 34899 -12898 20597 297697 268597 -110981 53144 -77367 112321 -64255 -219741
11100 -219741 88361 248177 30560 275895 -98302 167669 81823 -36055 -132432 400322 4542
11088 -11808 -141875 -147603 141683 64135 173057 115837 327509 -20720 2202 147186 125371
11077 125371 21466 295877 161681 -125172 283063 25362 224236 220458 159612 -75130 137857
11065 237385 493078 211653 333896 214772 357856 73673 210186 275808 91016 396166
11055 396166 540610 93032 166702 808470 45467 204219 219923 447873 398174 514051
11045 514051 422640 582853 98147 316586 267535 562260 475695 404959 170709 228343 503422
11034 503422 337336 706167 700745 522676 553470 628222 522363 445271 275833 299081 366279
11023 366279 306727 364494 293406 471982 290720 520333 528702 489733 512718 435758 659919
11012 659919 312171 374871 361999 157237 480877 517229 366736 478039 236001 540352
11002 540352 221707 432053 644084 379104 149749 209337 376230 233542 355967 432785
10992 432785 610363 675601 402381 195372 272148 449289 664118 727722 290041 300124
10982 300124 480043 880866 744482 964750 1051584 1111066 1287624 1618285 1431689 1621327
10972 1621327 1891878 1839447 1336828 1399915 1210752 945845 1360456 989755 797573 1180057
10962 1180057 957419 1025925 1256546 1070995 1314142 1097301 1068558 671148 778909 959878
10952 959878 645845 730469 466164 371989 705981 446201 40548 293637 267325 148191
10942 148191 -115197 68402 241605 -211057 216421 -48083 -105047 -89779 60439 -160054
10931 305465 -143069 -228040 342203 -5752 -58213 253524 -1778 233534 378910 -308055 -65936
10919 -133517 -211465 -93349 -127698 -30992 103846 73340 208922 -95953 -108094 -171356 -119742
10908 -119742 -3985 -193767 -61186 -177238 -135773 -180711 -118017 208847 -237110 22857 9232
10896 -75293 265591 -220701 -73425 102687 77356 116392 67643 -514303 168844 -167198
10885 181512 -54120 -226944 -68245 128601 156212 14367 -16860 33 -41200 25932 215817
10874 215817 -97744 -262400 -30241 -127311 -77245 -83948 144942 -222757 115901 62160 123387
10863 123387 178954 -497893 21237 -98226 95393 -261848 335609 42076 105371 -341155 -19724
10851 -104672 -159073 -157077 -49935 20639 124199 79903 -332485 187867 -419262 33600 -8617
10839 -292172 210045 -11944 -270595 217316 -75453 90323 102539 -23896 220339 147860 10218
10827 -101121 50887 -205251 -104527 -118756 -106312 -48269 170938 259589 -124271 157427
10816 -83756 158268 169894 415 -336970 -192559 -93873 9315 -176561 179061 -266683 116039
10804 -121726 -89791 -136397 97253 23028 -212929 88768 -23463 333815 202254 -162195 -164563
10793 -164563 18360 -175713 81638 -285788 -273152 -67112 36057 -139639 -77073 -134789 -125566
10782 -125566 51815 -133440 138720 -26938 -222364 203839 -58133 44589 -74503 -3852 -335950
10771 -335950 -365029 -66061 -119992 40227 -219968 -172966 59100 -100084 -177869 -191636 -1685
10759 -9412 -248940 -54992 -83163 138705 -398110 -318674 -88869 -182275 -54491 -77841 -115420
10748 -115420 -75840 244934 6775 110664 60095 -51282 -243502 74522 -66137 65856 -148793
10736 103191 152836 -90681 38516 -75564 120843 -161632 146351 -126130 232826 28174
10725 3986 -156532 -305164 223525 70130 71129 -41205 116351 -126851 204883 -127192 -31521
10713 22790 357899 7007 -45320 41391 -143043 150946 -112143 -130033 -182968 122698 -434877
10701 28247 -166131 61372 -130344 -52321 -361632 -43935 -64945 122419 -180715 64067 129707
10690 129707 48217 -307554 159523 175249 -96531 127157 -22800 -253359 -352823 14975 -162074
10678 103391 -43315 -102403 140632 -54391 -63033 -72691 -83897 -226612 -151591 -80100 94793
10666 176159 32378 47947 107400 -187944 133961 -143483 -135874 -49939 -435113 113941 -278869
10654 -172545 -69150 -67783 123697 -192258 -21276 -192070 -210736 -209990 -209589 -115992 65435 33728
10642 33728 -108268 -227881 -315620 109380 -315257 -203138 -222857 -192928 -54564 216132
10631 66873 -101617 -205769 199073 -330648 -104943 -351466 194986 -205771 -78077 107248
10620 42088 69556 137933 -94010 2022 41058 -242416 -135720 160608 216337 385696 -52825
10608 -47442 -281735 -261371 -68812 228804 -371301 12720 -88336 -208395 -282109 -133128 -48571
10596 -264406 26395 -88430 -122541 206746 113855 87381 -194540 -5237 -222386 151608 32788
10584 -237977 62234 -108853 -69166 -11857 145503 -121624 -448010 -158144 -226860 -5023 65376
10572 92429 -209326 -253257 -100036 -192310 -66616 -183013 179075 -71635 -185089 -363388
10562 -363388 122408 -299870 134667 -367109 -156309 -32938 -38788 50096 243201 -26857
10551 158388 40806 -129271 -157492 -161568 104740 81058 -15134 67798 -29030 -442940 318001
10539 -81285 481125 -53228 180381 29235 84432 -21052 12262 386893 10975 295365 -328200
10527 154899 87989 60843 -65175 77432 22842 68460 253049 -80356 -244153 -62285 -293645
10516 -293645 88685 34917 70652 108500 -187350 -7374 -178864 82489 -224454 -86694 214819
10504 -168883 99935 116748 135991 240980 -104805 -170678 370484 14809 21931 -212197 -29333
10492 -186405 50595 221057 -325763 -63021 24880 -133320 109973 72729 380545 318126
10482 318126 130679 70233 114216 -70463 -64156 163191 3984 -12961 60121 262425 -53994
10470 -78524 -93160 -13421 -119057 -104752 86223 -197276 -21143 251120 -20689 7148 -45896
10458 74100 -65090 -111204 -332936 19120 -54348 -243225 305149 28391 11437 162630 57214
10446 -247092 -155479 84229 -107956 -170037 -165427 -52655 -79037 21369 -133893 -213471 -23563
10434 -334943 5356 -138080 -193461 -170533 -111725 197881 -17371 -70011 160410 -143970 -83231
10423 -83231 54708 76453 162731 40410 -457251 -280933 18129 -233511 -106054 437911 -247251
10411 -526576 13724 107304 -275966 85925 -245401 -341085 -23509 -5410 113205 35793 -19056
10399 -87522 132818 45474 -77022 153963 -80300 -56677 -58077 -21269 78297 362077 -79163
10387 -50322 23313 -54062 -378639 389660 124487 -104067 123815 68310 184242 248368
10377 248368 157778 173790 119563 184933 -97136 104088 315486 -79688 302221 496985 265605
10366 265605 195617 298016 299663 326401 207850 29642 217543 -210248 423750 -39939 -262315
10355 -262315 132498 189189 240770 -192913 485334 238407 332461 261909 379796 301162
10345 301162 236927 72672 -39024 83312 180430 93815 -4608 244227 -103309 270617 -2728
10333 -41018 54610 -147287 13290 -56027 139909 58194 288147 -248202 22749 -3052 312618
10321 357444 -189039 180301 -51389 35487 340649 293396 435160 20319 36446 103640 -20603
10309 -209928 -229875 -103744 -387104 -212395 -36970 -73989 180937 136058 109054 -235380
10298 99601 327199 81461 93742 -57639 -231391 90858 -6346 -212435 -93192 38536 188468
10287 188468 -131422 114051 197015 46184 -113478 -213995 -255310 -249573 -219129 31647 -222294
10275 41573 -395480 -252353 210549 340722 -113305 -191957 56104 158236 186122 -54938
10264 372326 -33441 449152 35887 95694 475043 -267255 394854 105816 -65333 -265696
10254 -265696 279120 306409 265100 91193 -26153 -94828 172791 -82486 -6538 76388 -307173
10242 -238752 218277 301897 -274999 22160 148054 -248483 -386081 -262977 17406 277646
10232 277646 17755 -74351 -106193 -142440 48520 36699 -297159 -457598 -97844 -142921 111539
10220 -74767 27973 -62559 35236 79387 -67615 -67644 -236028 26447 -72786 -287075 33233 -54615
10207 114337 -54546 -188662 196096 -190458 -148824 -91366 139657 -205791 -8422 113671
10196 23038 -48628 16636 -82118 -28360 50050 33078 -250695 -185587 -23678 112549 109184
10185 109184 -699 -26800 -196419 -163015 -387431 138323 25527 -9784 67957 122182 -161031
10173 -40423 -46301 115373 131502 46869 -59234 70224 210055 -89233 142529 -343543 -151677
10161 -71804 87366 -37415 -107321 -23563 100404 -217721 -170511 -238994 -118141 -105156 -243038
10150 -243038 -56011 -83231 254217 37197 202136 133172 215686 261685 96260 277321 -42783
10138 -247776 -99294 68851 -143091 -34754 -100240 55940 -105981 193258 85222 -191098 -117472
10127 -117472 280055 -188415 87521 -173485 177334 54177 -117626 12083 10458 115672
10117 115672 -238189 39297 -199623 -278492 -173823 -29508 106957 -289137 -250398 134308
10106 -276125 -98780 -86655 -333804 -144154 92873 105487 -337612 -138341 -43127 372601
10095 74812 79429 105164 -251276 -120632 78413 124734 90867 -5697 -26207 -282355 127732
10083 -248170 350773 -28071 -231434 -140294 -500088 -119302 -7157 39954 -193525 138154
10072 -389084 42877 -269950 6323 -253373 -186084 -105118 -150598 -146678 156734 188651 48140
10060 72154 -177448 -14443 -114618 -332063 83325 14922 -123689 -192058 92839 8877 -254137
10048 -11736 75205 32326 -139304 115683 -67630 -153532 -22909 -90643 84879 87858 129104
10037 129104 -59981 -225206 170855 -40123 130429 -248344 299051 -7808 86089 -64484 -42399
10026 -42399 -164137 -73919 -73390 211924 -44762 46177 80836 162455 95869 -175429 101653
10014 -166791 -351704 -503 128811 -212063 -199904 -55441 20165 -6910 126857 -69750 -56034
10003 -56034 -134677 -208869 -122208 133632 -139107 329553 99709 69639 76324 17975 -55315
9991 -257160 -155398 -141856 -136358 -291846 -201600 134804 -164848 81764 287328 43068 217540
9980 217540 -11936 170650 -163473 241775 17531 -260643 -74437 108225 -212094 -163686
9970 -163686 -322625 -40005 -415182 -234203 -253332 17577 -382145 -104931 193677 -96641
9959 -61890 323172 -153363 154457 -180565 141391 -120068 -48005 -124539 -26096 34429 -100104
9947 -378444 -365971 -121258 -16160 -183935 119448 82566 129227 58279 215628 179066 120012
9936 120012 -107992 67668 641800 -9236 -54062 182425 15467 52800 -70348 -204806 120628
9924 58486 -174815 -133338 -52008 -5173 -130625 -195367 99514 121625 -174339 35301 -382554
9912 238329 -57938 -80319 363872 52380 -6837 103960 70555 97096 -148099 144230 252835
9901 252835 -134 -233080 166801 68948 176250 -159523 -61332 -135877 118767 -151173 53718
9889 257320 -139916 212945 31683 -13459 -304054 -35933 -88841 119984 46348 -362039 -97108
9877 8946 63854 -228445 -74616 78679 245016 -85691 -291028 -52727 -100880 -86606 -44920
9866 -44920 135613 24569 142923 -238497 192738 -35345 67820 -253916 163415 9242 -74060
9854 -159335 189796 -83869 -147540 -51342 46861 -401436 -157976 -174145 227012 -212106 104549
9842 -347029 136554 -260691 67772 -81189 15926 -7507 10778 53114 67554 114823 -113813
9830 184690 -175537 -205327 -109032 -314129 -9474 -179646 -126764 -82306 15743 -2504 27663
9818 -66442 75008 76606 -129789 -271286 -555095 -153682 -132061 -302478 -37859 -306937 -88505
9806 -226632 -84678 -188553 -64619 -80564 11088 -293426 32693 142808 -134852 64658 -71078
9794 40341 95366 -433287 -121062 -103373 158608 -28986 -84024 -114926 39584 -190750 300464
9782 -35792 -6272 143038 -110648 -79715 -2617 141339 -258946 98055 -99538 187607 -8832
9770 -45190 -52074 141599 -21155 -118411 -33586 -152066 -172847 139092 -242984 -201456 -196194
9759 -196194 -49203 -111898 177136 -55986 -290556 10691 175569 98130 -138572 -58610 245197
9747 104763 3021 -328807 145723 -52268 21486 -100039 -69987 -209179 141313 -169087 -12280
9735 166241 -72244 -140831 -113363 -168889 -196125 -363679 13203 -319640 316128 -223808 113097
9723 -47148 -170776 -220792 -13332 -100025 -106379 82340 67000 -62337 -345586 -79614 128970
9711 105858 63346 180619 -182049 -18855 -103308 132817 -210556 161763 26954 -9256 -142855
9700 -142855 -12452 -109551 158754 -25147 153412 -469743 -121753 -244293 47209 -74731 91510
9688 -309503 101213 -210884 -166838 133474 259248 28510 -292102 -239704 15519 -452718
9677 -201622 126921 -347020 93439 -259037 -84436 206635 44823 -113676 -389375 89409
9666 -41308 19066 -31886 9356 -108301 -144986 41041 -65332 148169 -45513 14116 -243326
9654 65340 -45776 -34432 -334927 -119632 -99333 -179419 -62137 -213073 -326961 -172495 -184380
9643 -184380 -10741 -246381 -25760 115957 -105923 -74545 94862 -81649 -134688 83249 113001
9632 113001 -80773 39275 219957 -306413 72380 -42977 -121532 -97383 -238588 94742 -294628
9620 -230747 85335 144925 145335 5265 187854 176471 -84475 -34094 -152856 56576 77507 237920
9608 237920 138559 108726 89753 -25524 83653 -78230 -211917 -167198 -169051 -251474 -316067 144664
9595 56467 -799 -315368 -222726 -385871 121217 -158778 -25343 42659 45852 26668 -197754
9583 -131844 186670 -304226 319111 102013 -57970 -135377 -239470 143169 -315244 400863
9572 -237707 -70360 -28121 -44402 28498 24729 144323 24849 99531 103538 -54521 -119389 32069
9559 170025 -116345 -89333 -8138 52497 49692 -186610 -121229 -43549 -267565 -124531 -131435
9548 -131435 19430 -196096 -159462 -5641 -86733 -515467 248379 -163402 -83291 -122106 13738
9536 -71636 -110635 -68831 118204 -176725 250125 -116307 151232 -222606 -75102 -316057
9526 -316057 -504602 -94525 -8096 -187337 -90850 52466 -194242 164589 -227925 -142709 165239
9514 111354 112108 71714 27098 21249 -172366 -123789 -159484 -272371 -80325 -42579 74013 -126618
9501 -253719 -113249 -18064 48481 40550 60991 81335 60022 -148941 -167529 -168903 -164643 198856
9488 -172235 283673 -449536 -35912 -167541 129236 -101474 174644 -145507 66597 -358738
9477 -217821 -144504 -162591 -209720 -77646 102855 152202 -268057 -75070 160571 131985 22580
9465 213191 -51916 -111958 -14100 -16026 -133843 -72811 41600 27335 -54828 182620 213964
9454 213964 -176263 -416285 43873 232104 -178466 41758 -223864 -224336 292194 -269118 274437
9442 -163829 -124515 187030 -69358 -140540 -84903 -15055 15925 135271 -443893 -255325 -60662
9430 -101908 -140089 73176 132672 -119443 -144803 203424 -305518 244226 -242902 2020 182613
9419 182613 129392 1166 80727 -101755 -201376 -19192 -24940 -197007 -86972 224852 -105074
9407 -71363 18311 -75900 69110 -4841 -88874 -116318 -249905 979 165864 34135 -56771 -38188
9395 -38188 91886 317218 222456 -224962 56715 47052 -203862 -250937 -167353 37710 -265248
9383 -170342 96266 41604 -307438 -228210 140576 35706 -164856 55585 -34925 -76717 -25393
9371 78300 1566 263730 -27569 -65874 23302 -91332 265867 -43567 50364 132620 -40019 -207636
9359 -207636 -181076 28512 -383787 247739 64740 18671 -193501 -41971 28649 64897 -79966
9347 86957 349586 -34532 -25608 27075 -75814 22418 -32627 -43242 -133008 -55649 -234799 13889
9334 50314 -82284 14037 -72138 204466 -198427 220363 -56705 -159050 114121 76359 72425
9323 72425 -159689 181687 -249252 -113797 -487927 -1855 -30526 195861 -66730 70082 -296651
9311 13441 -15888 -206039 -93388 -54053 -24437 16318 -386386 176385 248722 113261 31950
9299 39747 64772 -235904 142235 -186780 139068 -219988 -287471 -16660 107121 -176896
9288 -115846 69906 -277727 -307644 -133929 121377 -87235 50910 -351322 240173 -4910 27626
9276 -116194 -10691 104561 -160130 14450 -247940 -163425 265377 -86792 25255 227908 -273498
9264 135607 72650 203148 286649 -36279 121825 -316405 -62443 209262 46311 -394644 -70806
9252 25805 -33186 -13442 259643 -224245 15811 -268212 -72558 -91312 -6914 -95920 55400
9240 265371 230623 -55976 -190642 -204157 80117 -184809 259636 -224863 189343 159675 150732
9229 150732 38299 145968 -202561 -225201 -19908 -317429 157345 -26507 197546 -265799
9218 177804 63127 -49644 -79279 78214 -89309 -54514 13866 40910 -234309 12625 -212861
9206 -69745 -214674 -41121 -144222 -251684 -65837 143455 -302640 -290817 -58648 99425 -72533
9194 -188363 -8193 28875 -306498 13413 104228 146193 -106468 -406586 -50805 -144786 155211
9182 -132944 -127322 24405 -133479 212418 16767 142142 156397 161787 28521 132242 222893
9171 222893 -152530 26556 -173783 -121960 -154474 -83817 179913 -3805 -156724 -296610 -65860
9159 -121729 -185542 39510 -68742 48938 -168953 -79814 95991 -138844 -189084 114029 -98915
9147 -84107 -61133 15083 -226071 -238001 114222 -130413 -10754 -163784 -55959 -29028 3841
9135 -2859 -208276 79704 -106724 5816 359911 138993 -569167 -133565 -228554 118375 153414
9124 153414 -50861 -194116 -369410 228661 -238210 219856 -38897 133694 -17848 -104080
9114 -104080 60546 -83819 -31482 178374 83416 154190 -341155 -62782 -25992 19382 -18568
9102 -385188 -512975 -107308 98912 -137708 -315752 -513431 138468 -39320 -231924 -255637
9092 -255637 146085 -131902 66745 -261701 17698 -65193 -53946 -297929 -105029 236068
9081 -11200 -229043 -42748 99646 -11055 -109653 27921 -242292 65645 -274505 239495 67777
9069 221960 -124174 -147539 -136677 124872 -173484 78962 163457 -90997 48528 -216849 -155548
9058 -155548 -44045 99022 115701 -22162 176219 193013 -82458 167758 11429 55773 -207850
9046 -465282 32474 114068 -319866 95284 -134334 -245740 54505 -47781 124208 -13214 197470
9034 98029 224556 3699 -44496 -48733 -203460 91295 -110545 -429218 -103691 -167171 -350822
9023 -350822 -112116 21697 25878 74001 54316 -89134 -126225 17666 -153628 -44185 -124922
9012 -124922 -224342 -270223 153981 130034 -262012 -149554 107231 -122813 -77754 82721 165530
9001 165530 439499 282790 -12378 -128252 -285555 -108927 -504523 -13040 -120626 -353336
8991 -353336 223449 100299 70530 -39991 -57420 56224 -45703 -134645 51773 -345424 -158455
8979 -218977 12190 -208866 46114 286348 87056 104726 39912 164547 -240363 465 -234904
8967 319763 -81558 -110831 167965 -89683 -229912 -132090 -119009 -415650 74887 66381 -230910
8955 -367744 -147584 -38668 -135619 -260644 67943 -279329 -124217 -116922 147878 -107220 -14361
8943 -77418 117523 -215971 -88144 -146985 102614 21278 -50915 143338 209 391679 24943
8931 -220463 -60317 -225015 -54879 -258263 18225 130895 167194 269756 1815833 6520997
8921 6520997 10951491 3763781 822805 191936 188874 445304 357313 135523 -29403 93800
8910 -544952 433665 -119469 247976 493388 -314051 -26829 -181484 31588 18689 235573
8900 235573 -123065 -184888 -45680 38712 -90890 -187919 82025 -91480 -410137 -244414 144929
8888 -168281 84220 59422 -70282 -163256 -119655 -268957 23878 -62089 57570 125567 -220368
8876 -40896 -199603 -233390 -52378 -329777 -196812 -41537 -256795 81550 -24784 -247725 126932
8864 153020 68185 95671 -403379 -215317 204686 275646 95108 -17453 13760 -10786 -239443
8853 -239443 17367 -250386 -138864 -11954 -98263 123946 -171875 206727 -28037 -190392
8843 -190392 -46986 -25314 -205 34022 -148454 -40734 -98591 168464 -150877 221526 -101506
8831 -207127 54966 55415 -220199 -84385 -358208 -283513 46741 59371 43333 -41010 -191887
8820 -191887 -241264 -22771 98807 8777 -235920 -121614 105811 133425 -10762 39333 -66127
8808 -260695 -152755 111794 113526 26926 202781 -366066 9330 319131 -99455 -122199 -44222
8796 -102784 -372132 -35606 175343 -203956 -120081 -240357 260343 104079 -49438 262736
8785 -20912 -316308 -147793 51424 313376 425739 -457749 48648 207707 86228 -13041 -250561
8774 -250561 -144562 -68864 -119945 -135673 -149154 -281856 299600 -224537 155487 121650 427455
8763 427455 -152974 144980 131840 -105524 100119 106151 -152862 -17582 -151043 100658
8752 -236397 -2680 -93875 -40088 -195094 -42707 -473920 163652 -109557 252616 -82895 34346
8740 -25867 -104854 -93497 -80631 -49842 -126365 -51094 223611 213659 -61814 -226708 -85986 -53604
8728 -53604 120133 -131955 -294478 206991 80944 -124912 146081 -336776 193500 -267093
8717 -289245 -328864 -71366 -249210 -349089 -69708 -226309 -140921 -264877 123463 -8302 -95632
8706 -95632 -173148 -287340 -287286 -126843 76724 -377465 51272 -26142 -13448 -180950 182060
8694 -113038 -188422 -135089 -295153 -186489 10344 -160165 183912 130055 39822 -15591 131999
8682 -46447 -134105 -32948 67289 -232032 -192312 199933 46982 -266472 -157864 301584 138553
8670 -81399 -70580 43302 107934 -183833 10292 -221015 -164445 198973 -143580 196505 -129394
8658 72992 -24629 187717 -214233 281497 -51893 -78334 98127 42319 201255 32079 -245576
8646 -81625 -275069 39531 75183 -268905 86425 84625 106927 -301862 -127858 65939 -17801
8634 -75155 172219 -335574 -59269 4164 280966 -168003 -115152 70461 130328 298747 4137
8622 193751 -82957 54078 71243 126686 3555 -205951 6476 81279 7759 -84896 148686 138480
8610 138480 135146 -55939 88276 -50566 67739 -162419 44383 -42432 -120808 -127211 -261261 57482
8597 -53618 305974 -71209 -23097 -106466 386413 57347 169474 -163714 125438 7906 -84278
8585 -165363 153101 123232 293103 -222659 -63897 -194979 -76250 280878 -102904 -251196
8575 -251196 26228 276304 74184 56703 113952 36622 88189 -230159 -61460 -154636 88129
8563 -263336 -158887 61981 -85594 -255206 -88822 176578 -83935 -91140 -295886 142538 46359
8551 -74822 -252800 -64379 -70721 -211806 120367 81862 69522 -250442 -157686 -150481 -57823
8539 -17061 126479 -36057 169466 -77721 90050 -110749 -176103 -6975 -174374 -149003 -272850
8528 -272850 23069 -64803 22394 64591 -114234 119207 388585 189623 -74750 -345148 -208698
8517 -208698 -238632 148515 18564 -402611 118990 95310 -67090 120744 118055 -77700 -228793
8506 -228793 -125443 167302 149489 -39685 65255 60897 60007 47679 196574 -255913 367701
8494 -229921 65554 76571 -142901 82964 -124542 61173 -142732 -99549 357723 -240969 -28670
8482 310034 -25985 -12603 157577 72185 -257162 94247 15966 271336 -261231 65220 193837
8471 193837 -151461 -217273 -98149 -204309 273038 -76038 -44315 197653 -11715 -199868 -86014
8459 28904 218138 -208874 -95589 100661 -297615 122716 -56967 126676 -270194 -165567
8449 -165567 -69456 -14445 -178484 138900 113755 18448 -4600 -124612 -177543 -69488 122684
8437 181964 104657 -238536 -36860 -101306 124569 157517 -209388 26021 -152922 206519 -141793
8425 165573 -405296 31286 -42429 -210203 29 150585 -171006 -169181 -271905 -60152 18298
8413 -229373 -84047 33611 -118580 -174374 -129853 136977 95091 154710 60637 -191063 6389
8401 -249068 -6543 -53759 -163882 -201372 -6361 14979 -309343 -229701 -46296 -87972 215911
8389 156955 -19468 -16263 -236713 -151452 76552 -13607 -49861 -15496 -18294 -177369 -217469 204853
8376 -117730 -186392 -207589 20987 -225332 -105216 -319405 143278 -23944 435331 59258 -230600
8364 216446 8286 -33932 132906 149852 -333744 174552 75888 -130445 204645 181491 20822
8352 104362 63643 -37590 -79228 -248139 -109543 -429995 -108222 -256454 -193485 -149364 -163826
8341 -163826 56032 54338 119097 -19003 50841 -81003 -234403 42903 -220657 16289 327733
8330 327733 246424 -1561 -225764 -68084 182985 56037 -68915 19509 -222818 -325787 31391
8318 -318640 -346580 -143501 -236119 165975 374874 -243121 88165 -79826 342161 -474572
8307 -168352 124409 -31874 -30888 -18471 86730 79318 -16648 277922 -112118 -294162 -9212 -78254
8295 -78254 74860 -300 -31308 -198780 -132872 -94511 -56819 123368 82206 303060 63320 -133693
8282 -96489 330697 -386219 -256284 -66780 125751 -158233 113454 -42691 153463 275825
8272 275825 -39141 121743 181485 92268 20781 107306 -110298 -67077 134458 -81507 -65303
8261 -65303 -49897 133664 -207469 58398 2210 43479 76904 9985 1837 35154 -18357 -8073
8248 -134674 -18863 -381522 -117659 146225 -125957 132103 -55537 125649 201311 -60124
8237 39702 -133914 -74674 -23234 -87707 -310740 126566 75195 -189329 201433 -242309 -103947
8225 -18342 84167 82869 -326712 92031 108620 -12056 312735 -97527 -184292 -361847 43197
8213 -190564 223287 44406 -200229 -9434 7482 109947 494 -221369 -278714 54514 -284549
8201 -324849 -148632 170571 -230902 33790 -14834 -143019 23355 386531 77649 71515 -3549
8189 -88313 608 13883 48000 -25447 77660 44919 54979 3463 -85396 16357 -123877 -302852
8177 -302852 -103129 162180 -173729 -42785 -455016 -223336 -282692 -38608 73117 199873
8167 199873 9970 -155447 39884 -315822 -15393 -53041 26099 -6069 -55946 184029 261722
8156 261722 61025 -174442 -174103 -60200 -472602 -108350 192207 -301002 75777 -166081 207808
8144 -439783 -93171 25055 -30128 -86036 -48874 204670 -140092 -263700 35999 -86661 -187253
8133 -187253 -15229 29144 -62113 144694 -238556 -43062 64155 -53176 -105498 335996 -74417
8121 -118043 155153 -149536 -116965 42785 248835 5806 117475 113222 -10247 -368910 -105035
8109 325396 -54635 -349984 -167510 74135 132991 21356 -197928 -133127 -62941 200616 148498
8098 148498 78750 111428 -169953 -180652 -134695 -177871 -95184 33788 -173790 -127783 -459027
8087 -459027 -38846 -175091 42339 -27955 229584 108166 -87098 -402859 -322403 -91398 -47783
8076 -47783 186205 -124153 -31567 34926 -59640 -214550 23634 -339421 -109070 38557 37943
8065 37943 -28098 -124739 -309298 164100 11100 12418 -131692 173265 135480 -232799 -62924
8053 -78514 -279593 313954 -233535 -287826 233376 53593 60398 30653 16788 -52300 -239732
8042 -239732 297120 98056 -15547 152772 -97987 21240 -106157 225004 -101602 -222146
8032 -222146 -149069 226446 -45943 112174 -107337 -284991 -90019 -181543 130056 -234175
8021 122324 -199302 -1469 195609 -136917 -87700 84094 81758 -129204 -214822 -176928 -181615
8010 -181615 -223255 -148579 -113260 -89784 69877 473512 218302 -376758 132285 -219088 218441
7998 23979 240088 169068 -74868 -21777 181069 -42226 5471 159873 70784 -11015 65988
7986 -7893 -158343 -189223 212009 -130056 211102 64442 -301973 -243646 111053 173709 -93468
7974 -51301 5314 -106823 92031 228822 7146 182123 -66731 -200669 -46635 -139136 43700
7962 -20261 17253 -114337 -17587 -259684 60865 166570 -20504 -466683 358414 65425 -234247
7950 327099 149688 -122453 -130874 -274647 3607 -177406 -58150 -53260 -69867 -5747 4602 87916
7938 87916 -249146 97231 103319 -377463 -131634 -219263 135196 -383891 -289003 155424 -64028
7926 -6811 -58802 -284081 -347210 -25821 11769 1251 9245 153385 -161679 181860 -388083
7914 -232939 -215379 66434 96819 88601 -215373 38199 -297809 321878 40940 151536 -37999
7902 -205390 5278 46604 149983 823 78853 -74073 -6388 -9102 -17401 -246078 -27237 268521
7889 155281 220608 -14699 -94880 31330 -64785 -231818 -23627 -149782 206914 137085 87611
7878 87611 -317873 -195955 101621 -251407 -175944 -307074 -111666 -122732 13763 89487 -7756
7866 -223127 -129868 -225675 -75057 33868 215471 -23896 -60552 -62448 -13285 100969 -187912
7854 -155982 -216864 -170457 -53323 -289576 -204735 102152 8605 118405 135579 -255835 33746
7842 -75275 15198 -10488 2675 101711 83390 70225 33360 -95545 -122851 -120443 -401710 -87694
7829 216824 63834 339876 -62650 -409320 113867 -24828 299806 293962 248585 -11997 216046
7817 -376639 -5384 -32899 -9211 -43945 -8796 -22 -181094 -14708 -67590 439614 51571 260805
7805 260805 48400 29076 37590 -33534 236703 -135836 10650 236403 18212 46894 -274252
7793 -139527 -107302 2803 -66080 61502 44805 -151049 -455034 106540 -345496 200151 56418
7781 341901 268664 -170094 -51680 -94462 -32842 -241471 40250 14817 -349191 -32463 -94302
7770 -94302 168007 21006 -21609 112118 54607 -46164 -11598 -161648 -116652 -295404 -15439
7758 -152988 88415 169989 -191945 64375 -80439 -275440 -178639 -188258 -358072 280854 -93365
7746 -82623 -97686 -156165 33538 97057 -164017 -196840 33031 -211697 -26219 -172042 67752
7734 -440182 -136041 69772 45411 -456022 50161 51300 -180648 102545 146228 -109146 161111
7722 -84006 232710 -201804 228103 -158024 150187 80002 -59295 -176986 64582 460560
7712 460560 -65939 82071 -260593 -396294 115654 1908 70844 49280 -26565 -36384 -50807
7701 -50807 12555 -204728 -169089 -55783 -200019 -260891 -7771 128564 128423 -346811 786 -206726
7688 -51068 -10376 -238102 -112323 -47616 -188106 -196850 -89325 -123235 -268871 142626 -117999
7676 -81708 41757 -382656 83207 209818 165116 -205059 -69751 47294 138674 -327724 -79890
7664 -168805 -104824 72242 -271401 210930 -387637 -103256 245452 -66699 165335 -226476
7653 -9461 -104287 -83890 -198653 266926 -207583 -289115 -25507 197211 102866 -294968 -338507
7642 -338507 206707 275449 -147735 -68596 -181474 16504 107402 38907 -114382 232197 -221245
7630 51717 4450 46164 121872 346401 2540 -131622 70547 65970 36286 -94429 -140092 -366977
7618 -366977 -75140 -281930 -54357 -127348 -240928 108170 -27257 -111921 172903 -39472 -222053
7607 -222053 90297 -33515 -109213 47539 -26180 130988 -22586 7996 -247739 -281402 158299
7595 -10812 -15305 -58074 -37986 85151 -164924 -47797 -306138 137845 -275957 -71244 92397
7583 -253187 101886 -55980 -146805 -75919 -87416 -93714 224339 210420 -27120 -16903 -74251
7572 -74251 84692 129948 117708 328995 -25909 206814 -154652 -69209 85038 -149961 180978
7560 -153063 -279740 188610 -236865 -150254 77399 -268731 -136250 -262336 143246 -155026
7549 89291 54103 -235583 24444 29854 16115 73908 283464 -4765 97600 53745 -30712 167880
7536 -29674 37908 -250719 -126920 -44567 116935 -201999 -115229 -41117 137741 86470 -43997
7524 145240 -238573 -4447 88446 12053 132861 -32386 -266822 -183969 -116965 -10689 -136498
7513 -136498 14506 -76857 -142509 -120909 -172945 -73581 -83197 -231406 -134356 146002 -169162
7501 241444 161653 -201537 -47950 51724 -172604 36201 -94571 178687 99144 -96961 75477
7489 71397 166977 48764 -131617 -43945 -66287 88099 7899 -113419 -96773 183694 -87503
7477 -28772 122378 -75619 -259 95387 189503 220238 62410 -110547 250209 48359 184229
7466 184229 -9775 210981 153376 413690 -39802 -122234 266451 44835 2005 -249499 -91760
7454 11007 -368575 12358 -47419 75748 -69088 -72875 -66785 308994 -344912 123907 -128849
7442 -253660 -236001 287639 101840 -202630 77703 -125531 -54906 87588 -53443 -10096 66809
7430 321811 -78994 -25801 -202275 8012 -119914 -137694 -30145 -519120 -254861 15909 -217144
7418 59599 -180716 127431 -66550 5385 -370794 -29800 -99779 186433 -108140 -105695 -22557
7406 -20949 -94069 24811 -6830 -61072 -94868 43024 139480 123762 134396 -337367 -120403 -205256
7394 -205256 -88054 74478 -226258 92515 -168386 47207 229896 -159362 -177714 19115 -215661
7382 -174894 103208 -118805 291596 -137607 -285866 -167354 105147 -187770 91749 278277
7372 278277 -241044 140556 -106537 116790 -27564 -41580 -103478 -106689 -299015 267787 -10093
7360 -155373 2725 52999 165596 -104210 115486 -154771 228435 -51611 -87768 -8989 -166249
7349 -166249 -63376 39332 -160093 12004 -73582 -149035 -9287 46980 50523 -42527 12395 -13987
7336 168146 127344 175014 32415 -62210 -118584 5785 -32621 -182834 -301298 -113031 -8314
7324 190739 262459 251921 -53890 7708 -302224 159733 -282385 -142133 265572 29704 62679
7313 62679 322116 51643 26882 318139 146798 57978 98809 -102246 -100375 15088 28454
7302 28454 -62481 -232816 -204803 -62533 91521 -72026 -46202 -39484 274954 205481 255685 -10275
7289 147922 -204231 -264442 61417 102347 -262872 -67544 -171369 -69722 -208093 31070 10249
7277 -159830 -31557 -263896 -361982 -29349 109872 -138153 23004 -164705 -12165 276319 -32302
7265 192077 -65788 -133615 -322391 223900 -107637 -41921 27739 -26034 153370 -349616 300049
7253 -259229 56854 157005 -23712 -113742 -156151 -171748 -91170 -60391 215488 -209880 -55735
7241 411870 5343 -79689 98580 -344765 150721 -136053 -31582 338321 -17627 65471 -179027
7229 113880 127315 -185350 -55075 -135941 20923 -101451 -47531 292866 -48995 97509 26862
7217 30172 -319450 -29367 -11176 176928 -353221 -132287 32400 167531 64623 36672 16046
7205 -288527 44287 -28588 80686 158210 3592 105293 -269734 38598 -226721 141690 142257
7194 142257 55121 104855 -6622 -353502 -262700 -264474 59869 510 106258 -216144 -43025 -149462
7182 -149462 -76726 -176565 178646 1918 7223 -217974 -118010 -62955 -64861 -64281 -245557 283105
7169 64862 82612 -215226 83557 167346 63413 85123 207917 -157428 -49733 45780 -232560
7157 -68096 234845 54004 9979 -110008 54640 187683 58355 -362715 -38850 -327882 138796
7145 -185430 -35121 165629 -129535 112099 77771 149225 359481 -53131 -69378 -51645 -71551
7134 -71551 -96957 -151136 58000 290344 155821 -148462 117351 -276985 161000 -237175
7123 200971 424271 -70948 30076 73222 -183406 -45945 185757 53519 -65225 -217779 -129275
7112 -129275 -32155 -64674 35980 126655 -11809 -367524 -176320 251558 -5158 284970 -74876
7100 74618 -186008 62966 -12988 67633 -48137 42083 109069 140517 -17525 -80741 -26736 100706
7087 429142 -232523 -76792 115798 167183 158157 42475 -803 -95105 -90220 6348 -202179 -163162
7075 -163162 -116258 -41388 11555 -177926 -430259 -69382 -70614 274856 125784 -178483 -127775
7064 -127775 -30394 345030 -64499 3572 39850 265971 -117875 -21593 279568 -101772 22368
7052 413919 -249119 -144753 64577 -49480 -331583 -143008 -120657 -234695 22689 -332943
7041 -191640 133616 -122120 197678 129723 50355 -54431 -2942 281913 -60674 -251605 -145971
7030 -145971 126863 128319 -191103 -208651 74461 -213991 -273302 106276 276254 -78038 60398
7018 -90160 446331 -131727 167707 276962 -58812 -65788 -34180 -256664 -43659 50666 114595
7007 114595 132833 42672 -79631 -83662 67013 -79734 293632 228274 -219954 34745 164964
6996 164964 145242 290281 162548 1705 116133 -350114 -39388 64645 -89942 63911 -9574
6984 25605 -146783 185785 -145541 -89094 170899 -27049 40446 96566 -52106 -11940 -36715
6973 -36715 -165430 79553 124347 345704 -74217 -438451 119351 207037 -188739 157595 -37656
6961 187179 49989 -158690 -51594 456375 81661 139016 -52776 -258328 -263245 28849 -289376
6949 -2480 -67471 -86929 175668 163293 -321026 -403836 -75622 22425 100464 -94477 -167280 -36951
6936 -38250 61008 -201774 -203335 142898 -36711 36475 27774 -103123 115466 -222095 80657
6924 158523 67843 56970 -324742 -123746 -353206 -120003 -121679 -22538 -142514 -42319 142179
6912 -16657 -296910 -6909 -312893 7989 -181912 20611 -40421 -98009 -158811 21185 -33557 94711
6899 -319055 -3583 107805 132933 -59368 136347 -82034 -104458 -124164 61086 18524 52812
6888 52812 92784 123471 81909 41223 97623 128868 -40079 202609 -59 119600 132728 -5833
6875 -204711 43253 -262884 -232182 82042 -17235 7789 -220859 -100890 -163533 -28585 -141540
6864 -141540 -193917 -63511 -40165 -242914 -121386 156523 -168981 -139994 121052 -174617
6853 -148516 -32370 308413 -216084 -32091 106603 -51349 -186246 258037 79862 206180
6843 206180 56599 -144571 25083 -114518 273287 94511 -173880 193698 86507 -271766
6832 -224445 7685 59842 -5064 70167 -317612 9953 -19616 -119898 123985 91946 50398 -353748
6819 -255105 -315204 -56938 -180560 -152929 122858 -149270 28408 -272619 126364 -13444 -187715
6808 -187715 -38110 333150 -170801 -338929 -118205 -136242 -236958 105127 383245 -6947
6797 43852 165908 44706 -309820 277579 201096 27034 -65975 43947 243237 123923 -59106
6785 242121 190478 4033 170537 -328382 69022 243713 103857 117055 151175 -184760 -33619
6773 109895 374107 37241 93453 -104918 18728 -29205 -33613 -7846 49473 -208556 -204737 65061
6760 -203569 -45136 -74818 163791 -35257 27209 -76217 208409 139826 -254983 146931 -367304
6748 50310 44895 30394 -155278 -149129 -168784 469 -84862 -265209 -36875 -196165 65637 -103346
6735 -173555 215266 140299 -142460 270505 122732 22134 -28218 -181466 -200912 231111
6724 119416 -176034 -129505 -48935 43215 96873 -54978 211608 75852 -398128 109358 355367
6713 355367 58060 -328159 -124119 -158052 98420 60816 26228 -34589 -122969 -71932 -1021
6701 -51906 -39031 115673 134098 77662 193430 118052 -132551 -68518 228592 -70373 -38654
6690 -38654 221247 -91766 -127005 -3182 -406326 13488 -103752 77739 111239 -15394 -102579
6679 -102579 279930 -216306 -38055 116696 -83603 38811 42988 -143777 35274 -177414 174545
6667 -199837 -40637 -36143 -98059 114108 125588 -188814 -90530 -9674 -144870 -119332 -121378 102255
6654 81930 -156700 77276 -121720 95594 -40786 -210872 -67231 -321603 -71565 104559 -215051
6642 -207524 61773 -108654 -214138 -79823 -239672 -11402 -37911 -40813 -1674 8078 183483
6631 183483 71552 -123135 -125435 74968 33773 50448 -24001 63295 -198119 -37016 -146581
6620 -146581 80613 70468 -31193 377084 -9079 -326969 56880 548 138667 -38410 -135666 221243
6607 -80549 -107217 -140479 50498 -27240 -222174 139306 128919 32847 161202 -6889 -27149
6596 -27149 -128669 61749 122114 151355 216748 -165057 -23765 -81063 42497 -80743 -99397
6585 -99397 -179930 14025 -301395 -64846 -32232 -46618 -97688 -218870 -369840 227125 120873
6574 120873 240912 64081 -21547 -102249 57598 -42477 38598 198412 -97158 -41976 161109
6562 255993 -323792 15505 186806 9354 127645 -285770 -180 -43700 137895 -95379 3735
6550 105856 -235279 -21079 147098 -57383 197249 243237 306084 -83851 -328023 -504 113063
6538 93269 -47606 59827 -320402 21491 102327 105139 -399512 -96069 -356713 145844 -165990
6526 299769 -110591 16004 -87226 43938 194865 -152659 -275716 -459170 -51785 216623
6515 -96331 303167 87097 -193385 -323829 -147816 -37265 -159606 255335 -68849 79645 217273
6504 217273 43998 334927 160994 -157679 -170187 -221939 253579 209809 35793 -86681 -20680
6492 -89817 -9872 -144891 496462 142559 79943 -109298 111469 168020 64523 -65629 105928
6480 -154982 -125282 -7855 7378 17055 81649 8522 -115742 -156672 90106 189280 188737 6804 85337
6467 85337 317182 -32641 -323858 -284794 161730 192070 -123084 266811 15358 -17076 2939
6455 -70103 -358661 2410 139864 -217819 383126 124916 -28496 -143816 -154702 -60539 156990
6443 86290 83863 -1489 -48602 -110916 8597 122118 8111 30248 213386 -82812 -350889 -199507
6431 -199507 -24316 -8104 -249948 -11978 279698 116960 -301908 -448501 129244 147836 108420
6420 108420 238437 -271624 -6138 -42546 174392 -90469 9501 -93992 -98627 38947 -45932 -221212
6408 -221212 309764 111432 -132609 24423 174844 17731 -311185 -159829 44521 -254313
6397 155126 38829 -125386 -394353 48240 59619 94739 -93921 -176511 -103523 -79480 -260918
6386 -260918 85826 -28744 233676 148416 173640 289236 71505 -68620 95637 -1865 3532 -91397
6373 -159877 228221 227744 -277862 -27495 -72889 -164946 -110249 32909 58445 119066 27176 552
6360 -104961 84378 -150581 -37671 -40360 -10979 -240620 53266 -12875 15748 -59262 6039 82174
6348 82174 73822 161466 -437209 -103580 343773 57946 34778 47614 77974 -99199 -95553 -251924
6336 -251924 162436 -89731 -198573 108940 -154006 -52995 -69790 146314 -62162 1288 -236867
6324 -108944 321950 5263 85454 -185693 99735 -295035 -65563 18636 -90354 221158 -173584
6312 6304 -379405 179531 164323 226554 -178437 -142167 -10306 187744 4858 32508 -14514
6300 83901 11849 -174559 144665 112443 4722 -11052 -58457 -269119 -299531 61607 52522 224971
6288 224971 -102779 -234025 137953 41178 210943 6305 80521 -136791 9362 -107316 -102241
6277 -102241 -26952 171887 -21070 -58574 -205578 2896 -67675 -146859 76428 251595 -15059
6265 68799 -106074 -173887 -47405 17079 5081 -72334 -69667 -36799 -171318 188334 -63984 4030
6252 232155 -27716 57426 -286225 394043 -63298 81818 -150654 190770 -27420 54206 -4521
6240 -97844 12860 -229767 238514 -221308 -222400 -24072 254526 -193866 237765 -186376 121926
6228 80061 -262004 79351 38692 -165924 187746 -126771 -94276 -225538 134865 28294 -396896
6216 -261943 -219774 20849 -48109 -64804 165212 86988 3207 -39668 -433962 -10405 183958
6204 -31565 231359 54977 -158929 127199 -209920 -84983 38411 -209914 -320495 -1351 93916
6192 -49151 -36060 -40656 124454 -114401 45952 -129889 -189260 -76599 -126097 -122227 -76638 -96638
6180 -96638 -96502 3489 -276660 -158638 -138635 -92931 12378 -150969 29101 144759 -71938 -463033
6168 -463033 -7299 -328882 -309624 27636 -142493 -17145 118863 -131271 125330 -50353 103595
6156 -163309 -196734 -181766 147932 104127 -156990 130958 -49608 29208 264080 55610 14309
6144 92448 130920 67397 158153 209439 -233438 274170 129081 -78489 99377 263361 78955
6132 -152845 -158332 -298798 104479 -46879 194498 232482 98331 124082 45739 -303566 -110903
6120 -117655 -116626 196514 239370 -24700 90282 332231 -46461 -48383 -213812 168942 -137582
6108 50112 -136859 -161250 -243561 -68579 5546 -72698 74878 128163 44987 18549 167999 14321
6095 -17050 -91324 181378 -141245 -260918 31389 14213 -170003 67368 -25951 -80410 -177815
6084 -177815 -35167 45936 -295662 51418 -264041 42035 308909 -26284 230513 -16371 -77264
6073 -77264 235160 -338348 -336742 -30278 202981 70476 -29859 62529 72805 -87147 -69518
6062 -69518 -283852 -32311 62015 -113106 -253013 225742 35745 226710 116763 32876 -67750
6050 -178875 209103 -121659 -153903 31092 -60220 145145 -90000 -37969 219484 -189534 37770
6038 -23647 21977 -248086 -695 145203 -5848 -86471 241478 -186861 111420 -23756 210072
6026 -88769 -220013 -138231 107004 348532 102869 131448 138831 -158895 550976 9840 356406
6015 356406 -318380 -51687 264904 -18127 -46086 36240 13879 125455 196685 -89639 236673
6003 259901 17518 -106499 -199905 -64729 370387 4341 -104148 215249 -306332 -145265 58192
5991 -181686 -256981 -5689 77254 -263192 37985 171459 154917 15240 -45374 57318 -47335
5979 189522 228959 -16509 -111078 -37360 -115630 75813 -108388 -316906 22213 64176 -73547
5967 -147263 37731 50554 17687 -41335 -181899 199835 302767 -227020 -263028 -26904 300862
5955 -178733 -14954 75674 143148 159107 31345 -31042 152968 -301604 -17927 -71212 223647
5943 -51790 -174685 144661 41401 216079 -38232 209704 122774 -154964 -205970 51501 -288426
5931 -213824 244425 -124940 43072 -173348 40365 -1620 -191093 -270439 -184296 568 -72424
5919 50237 236474 143673 87779 14606 -119507 28361 -103671 -11724 -37069 39524 260273
5908 260273 185801 -76570 -126097 322522 -15877 -187735 -93506 -141166 140672 119813 31576
5896 230532 -132243 33653 246279 90462 -185894 -173143 29966 195251 -71935 218346 89204
5884 -131348 -159581 -115176 75726 177887 -225538 221098 -276 -258783 -2312 44425 149379
5873 149379 -180049 -157149 74733 -58528 -37561 46323 -363050 -156266 62022 78035 195757
5862 195757 75337 -77418 121831 89927 -326714 46845 -78779 319304 293932 -87233 -219202
5851 -219202 -265489 -38828 -94666 -84690 -104291 70126 52312 -71135 45286 -145965 163515
5839 79629 -130998 -19893 -286953 -374554 -277820 -129377 -51989 167140 -255517 -209308 35025
5827 -53527 185276 300014 235588 -137944 -25664 118902 -45669 96912 -213146 109109 101183
5816 101183 31354 47538 89699 -192205 -42801 -256004 -1491 -93615 22548 -269020 -15076
5804 -62877 15831 -41691 103144 -333392 10328 -364135 294551 -127128 163989 107225 139193
5793 139193 23287 75626 -312675 234518 34441 -142889 -65863 254345 202419 75895 -133890
5781 -188038 57463 16771 92552 32319 145773 427747 106032 473053 -175935 148251
5770 60080 230243 15846 120773 -60652 -116993 59315 -218597 65102 -99099 496701 192776
5758 -9599 179265 75240 -148021 28922 5168 7656 -304016 384854 -18120 -83988 -184539
5747 -184539 -8819 -107130 -117094 73942 -196207 -84966 -78387 -170847 285661 -61742 27699 152924
5735 152924 110805 15837 -102462 -154790 367586 -319494 29962 -165994 159805 202230 117483
5724 117483 85282 -25763 49071 -58141 177801 247219 -36029 37387 93826 -49703 -99445
5713 -99445 -66278 -226796 -215365 84900 31739 264159 116965 8512 -143753 137985 29530
5701 -62342 129434 130276 -41007 228563 226610 127456 70713 256053 -104051 -43447 -86639 -65805
5689 -65805 146888 11032 21269 -89521 -54123 -166707 -200031 -21888 35235 49483 -27002
5677 35521 -295316 247564 24695 -120987 -34278 -240863 -46976 274389 103148 -220841
5666 212792 -90178 -98640 171915 6097 32592 -141047 6032 -119662 -19576 254008 133399
5655 133399 156135 -286418 -215978 148182 389236 10012 -128363 -221323 -45329 -161346 -26530
5643 -79636 -242204 -41404 291605 -15393 143858 12036 -195897 -68036 131748 -55429 -336107
5632 -336107 292945 190498 -115226 -56588 -3999 -303133 -2397 177920 -39431 190107 63552
5620 -140774 -20784 -98842 111884 -28663 -96011 137391 7208 -108194 106223 -82218 43180
5608 -63 32134 14137 -180586 -76055 -335854 -276971 -306330 -206981 -89118 -13037 -101734 -128236
5596 -128236 218720 -120332 195787 107472 -113341 -202790 141982 257469 -330681 209614
5585 -141258 -71502 241432 305979 -74126 109966 209495 77699 -125010 298857 -145466 -128546
5574 -128546 -199396 32071 -319302 -381833 -78883 -83194 181706 -137142 24119 -121817 59185
5562 173769 -88910 -114526 -232972 148524 -205489 37653 154583 290716 22265 173160
5552 173160 285711 77158 -33731 41305 -163017 117062 9664 274628 101431 19601 -9562
5540 55060 252663 215990 -186642 -441810 58137 238233 -67565 -238240 -232043 -112542 181541
5528 -264692 -52953 -182282 -304187 -71396 -47137 -61261 -67902 105696 179110 -160164 141705
5516 129940 -66548 -51205 -161114 -53134 -6017 11156 170872 363395 60524 262091 90378
5504 155672 -103246 -49031 167406 170983 55343 -141286 28465 -116903 106570 -226045 -90245
5492 -249923 29504 -4160 -135098 -274180 -182731 287951 -34393 -103960 52157 65955 -77784
5480 -97195 88829 -139388 338891 48317 67913 63149 166910 139098 -74828 -36946 209203
5468 13609 24465 -178803 -142124 18764 -104435 -286983 246340 9640 45041 -67345 -37486
5457 -37486 -835 -209214 282866 -372705 122359 34035 -145595 77103 3960 64477 -35729
5445 226273 -70962 -126806 -120620 -161898 -157963 -29181 -79808 -147138 -62732 -31500 46674 -1795
5432 -107512 -116372 -197125 262016 -107818 149441 122412 42809 -123265 102428 32440 -201973
5420 372308 36005 71798 164968 -29672 -98134 132477 -82216 216665 -65585 -57160 -154080
5409 -154080 -24704 -91103 -181035 30306 196730 -63610 85125 30992 110200 75946 -276718
5397 -142271 -9396 224812 -12240 115738 -172879 91492 7181 -158708 376678 65548 -99270
5385 81971 -151653 -87019 98165 313397 457533 66149 -80630 161978 -112978 -243750 100467
5373 18120 -207269 -60726 -16648 -138162 -12951 -250892 -43095 -48828 389458 -147723 295936
5361 -90857 262300 222021 -125194 -22395 19075 -386772 -63965 444246 -167883 90517 298124
5350 298124 -45960 173987 -61552 -18363 -150930 -313233 225786 -41061 -86054 12353 1903
5338 -137295 90565 188303 105631 -307280 28128 -96373 243390 -161199 -96521 137474 -158899
5326 -30270 163831 -44211 26137 -75471 22737 126638 110574 -420489 39737 -79111 434885
5314 87476 -248662 111780 94266 -26031 178650 4022 -268014 -6557 -86322 -148742 -147800 80608
5301 -551 -279507 13844 -164779 26579 -86203 -303554 168705 -208320 -336817 35218 -139348
5289 88296 -109969 256676 14545 55757 -276659 -24980 267155 37098 -79173 99523 -19153
5277 -151522 471879 121645 38095 99653 30383 -70228 -235165 -201483 221543 -171139 200787
5265 -117805 44843 149312 -84091 -141590 -178533 -7843 205148 251450 76540 45820 35459
5254 35459 -130336 255120 4562 -690696 -55946 235391 -72559 296947 58729 -95585 -352775
5243 -352775 -275891 -226168 -212842 174949 21122 -48058 161560 32256 104614 300864 246462
5232 246462 11511 -379492 -162066 76077 210133 -169743 -161996 -82707 7953 -106702 145676
5220 -57744 -187939 70668 -231253 11931 8815 -75030 -24738 156160 -52934 419723 -134198
5208 271164 63599 -18197 -21714 -158916 15455 -70089 -341569 -81763 -22940 -44293 267764
5196 11647 87007 103628 -124558 -18039 -2234 183027 -92591 110945 203062 -47098 -55910 266322
5183 66645 -51518 43130 -45517 30161 -77824 211393 114549 -164824 -185833 52485 -25566
5171 -76454 235159 74970 -245642 128998 -85082 99275 46375 124310 -352649 -105984 78023
5159 318102 111661 -295460 329265 158428 -67301 -19644 332425 165671 -161947 -5967
5148 556101 -199585 -273028 -105814 -67582 144201 -79397 -186385 133783 -88184 -151913 -151349
5137 -151349 -319388 35651 -27812 220188 400 -267550 -180240 35173 6997 -241074 224773
5125 83817 13771 -92789 112285 -8090 -97056 -97405 117512 187653 -4017 121404 -9381 -108105
5113 -108105 -118082 34348 -34603 68276 -127882 -126022 45950 -253275 194734 -239411 123380
5101 -20325 124495 188451 179418 -124343 97442 -112653 -159992 -8149 -28714 122238 285302
5090 285302 354063 121808 354654 23613 182607 -259820 -125974 150343 -102968 -20174
5079 24685 182485 -74619 88279 44528 332462 34820 284875 16105 20594 -44928 225308
5067 -38699 48396 121420 85192 -34209 -212768 -167716 -185910 -267833 -91950 -63367 180057
5055 71602 104860 94543 -14748 135603 71729 -100803 -75582 168236 119111 -9321 154258
5043 118700 319715 -13289 -58527 135787 67050 101164 -264883 147163 -224249 -57432 -61946
5032 -61946 198933 -332872 78965 -95856 274637 -317641 -68070 10178 -178674 -89571 75216
5020 226254 113681 76857 -236156 82834 48200 52443 -114386 -201760 123390 311929 -204634
5008 169889 -51649 27213 -122156 44066 -159305 109241 142627 -141335 167288 21746 -181614
4996 87299 -252969 -155463 -174213 -402905 16215 -28701 -371517 388027 389276 -33426 166932
4984 -214430 -247379 -45138 -65796 -294316 97593 -216177 200606 -332644 167989 20703 -68010
4972 17842 -274074 -262725 91464 -11238 72202 90856 274712 -324907 -393547 100061 -206551
4960 -236049 125149 161583 -8736 361147 95942 114762 81308 -138398 143400 34100 197830
4949 197830 256672 18952 -365719 192498 63790 173035 47771 -175678 -129790 -216851 114600
4937 22240 62652 -88537 -280650 -119165 80188 166993 244263 20053 352209 -59629 148880
4925 116442 172720 55434 -155182 -916 234422 -13844 6616 -41740 26966 260116 -209319
4913 133181 49276 -179923 -143576 -7982 -166131 280729 95435 -202159 102489 -53535 -177255
4902 -177255 -153518 46050 175914 298160 -100831 -116780 82844 101857 206237 41471 16185
4890 -170720 -28838 -86571 221029 251840 389488 39538 28149 91399 64305 -230509 116258
4878 -124609 117170 277292 175195 -20906 224878 -198307 -36832 89927 430649 203042
4867 202748 132525 -37132 -17731 32890 108361 99476 -256880 -140015 -175332 7337 13341 -63584
4854 396607 -84354 -209768 -117173 -211525 135946 -69691 -372010 12974 321061 -243879 -96722
4842 71394 -102996 126544 -311400 170384 -65449 -239219 -31209 -243454 126943 6138 -147185
4830 -74766 52914 235191 -107754 -132263 120109 244795 -349596 -163548 149878 -121207
4819 141569 -73129 31882 -96830 -136408 14703 -241270 -47423 12819 -213624 -6912 193061
4807 426649 109716 -304594 101011 115592 195782 285331 -20593 -100707 -182658 -121091 -91279
4796 -91279 48456 -193406 488800 121493 81563 -113176 -149418 -107715 219156 -88883 87009
4784 -44233 -54461 -87867 179641 173869 -117702 213393 -18466 -248343 3172 -146844 133704
4772 -20220 43784 63575 106384 -67827 116398 72551 111005 -263867 130410 24847 125326
4761 125326 -244876 -61025 145079 194857 -76287 -53747 -84621 73647 98585 26430 -180976
4749 -110060 37617 111687 107478 -43131 306514 -116915 -92359 -307545 62493 -106473 89660
4737 159101 67920 42982 -179334 -107260 -376643 -425292 -9980 46223 -7219 124675 -211671
4725 54174 -200902 259540 -181718 -1709 -227266 171836 100278 -294091 -184658 -154815 -124532
4714 -124532 195746 -40151 -226108 29662 185225 145330 26628 56161 -152817 8800 -417679
4702 -63465 -161952 192604 247814 229078 -161853 206707 -263665 102249 -58470 45494 -63248
4690 111417 46637 25894 107133 -119225 28113 -166684 -83151 -21822 3646 -38063 -231057
4679 -231057 -276169 -143100 188273 6765 389248 -4949 -16168 230229 78350 210233 71643
4667 144303 69075 241973 -22508 -256541 184996 347157 74500 -186696 -81683 -351294
4657 -351294 -91439 -170282 -125233 -150914 -40712 -84782 -103643 -169400 -214173 5697 68970 2773
4644 86811 -113207 -176511 238895 -210326 183313 226533 138077 97916 46973 -239617 -40074
4632 187161 20380 -194803 328327 92815 239890 -147151 27876 164953 -53614 -107070 -114835
4621 -114835 244941 151461 -17927 358278 250432 103391 -24199 222328 85051 -69987 59537
4609 -146378 394541 44001 -2763 102989 -97659 236875 110337 -361661 -29432 56946 -182803
4597 56881 73476 138106 315306 -12244 -372196 -218357 -21726 -166177 205074 -159531 61211
4585 202428 48463 -164728 226545 25727 498 -74718 113033 -208890 311515 -16913 198199
4573 444092 -180688 207899 119025 -431 116712 16491 130942 323864 -240676 192724 33474
4561 182862 187900 219536 57161 201512 197998 182893 -82936 -87300 -109088 -94105 331684 160960
4548 -76469 -65849 -60206 -44254 219230 -347568 -7199 -177082 40601 -78023 -28057 -284789
4537 -284789 -39387 -217367 -97919 -18723 -91917 16126 -14852 223013 -180487 102944 88808
4526 88808 -79758 -28136 -13753 94273 57169 -30406 129218 -25436 106000 -370768 129695
4514 61519 167096 86829 154059 80214 -390882 -212769 -90685 123332 -240238 -3456 -139944
4503 -139944 296522 196090 56303 211421 -7634 -167563 -150453 -44335 79164 -120519 262532
4491 -86804 -115510 6732 -69703 -187892 165374 -26327 251540 10687 -39486 -40161 296876 -105034
4478 -171254 305488 -15437 75521 -2162 -101637 84011 -12572 -304564 -288275 399261 -224045
4466 89074 -7793 -12078 52470 -113724 -113583 123503 12516 -256897 -412478 359386 -79891 -119588
4454 -119588 -26617 -196087 -40171 154269 -217964 74771 -144734 -45998 30550 86742 42811
4442 119032 -295197 25377 370502 75857 -18548 -83515 -372527 103780 3321 -51620 21649
4430 278968 100914 183825 -13710 -177208 30943 57342 -170525 28442 -169293 -50439 -132358
$$ [...]
##END NTUPLES=NMR SPECTRUM
##END=
