##TITLE=NES1067_159122.0008_002_9705217_n3veQimBWz
##JCAMPDX= 6.0         $$ Bruker NMR JCAMP-DX V2.0
##DATA TYPE= NMR SPECTRUM
##DATA CLASS= NTUPLES
##ORIGIN= BRUKER
##OWNER= Administrator
$$ 1.72 TOPSPIN		Version 2.1
$$ 2016-05-01 20:46:17.271 -0700  Administrator@X
$$ Compression mode = diff/dup
##.OBSERVE FREQUENCY= 400.02188249412
##.OBSERVE NUCLEUS= ^1H
##.ACQUISITION MODE= SIMULTANEOUS (DQD)
##.ACQUISITION SCHEME= undefined
##.AVERAGES= 64
##.DIGITISER RES= 22
##SPECTROMETER/DATA SYSTEM= spect
##.PULSE SEQUENCE= noesygpps1d.comp
##.SOLVENT NAME= COFFEE_meoh
##.SHIFT REFERENCE= INTERNAL, COFFEE_meoh, 1, 14.96103
##AUDIT TRAIL= $$ (NUMBER, WHEN, WHO, WHERE, PROCESS, VERSION, WHAT)
$$ ##TITLE= Audit trail, TOPSPIN		Version 2.1
$$ ##JCAMPDX= 5.01
$$ ##ORIGIN= Bruker BioSpin GmbH
$$ ##OWNER= Administrator
$$ $$ E:\/data/COFFEE/nmr/NES1067_159122.0008_002_9705217_n3veQimBWz/12/pdata/1/auditp.txt
$$ ##AUDIT TRAIL=  $$ (NUMBER, WHEN, WHO, WHERE, PROCESS, VERSION, WHAT)
(   1,<2016-05-01 20:46:12.380 -0700>,<Administrator>,<X>,<go>,<TOPSPIN 2.1>,
      <created by zg
	started at 2016-05-01 20:34:42.802 -0700,
	POWCHK enabled, PULCHK disabled,
       configuration hash MD5:
       21 0F 79 D6 B3 7B B4 F6 88 20 88 DB 03 48 BD 9F
       data hash MD5: 64K
       1F 83 E8 9C 9F A8 85 B8 39 D1 6E DA 2A DB 0C 36>)
(   2,<2016-05-01 20:46:15.489 -0700>,<Administrator>,<X>,<proc1d>,<TOPSPIN 2.1>,
      <Start of raw data processing
       efp LB = 0.3 FT_mod = 6 PKNL = 1 PHC0 = 0 PHC1 = 0 SI = 128K 
       data hash MD5: 128K
       27 3E 97 76 28 BF 77 9E 2B AB EA 76 7C 02 EA FF>)
(   3,<2016-05-01 20:46:16.364 -0700>,<Administrator>,<X>,<proc1d>,<TOPSPIN 2.1>,
      <pk PHC0 = -83.85864 PHC1 = 0 
       data hash MD5: 128K
       F0 00 80 17 38 D5 26 FC 59 B0 89 06 1C F2 6E B8>)
(   4,<2016-05-01 20:46:16.755 -0700>,<Administrator>,<X>,<proc1d>,<TOPSPIN 2.1>,
      <abs ABSG = 1 
       data hash MD5: 128K
       28 32 71 C8 F0 8B 8A 40 C3 FE F2 7D F3 86 F6 D6>)
(   5,<2016-05-01 20:46:16.833 -0700>,<Administrator>,<X>,<proc1d>,<TOPSPIN 2.1>,
      <abs ABSG = 2 
       data hash MD5: 128K
       C8 67 27 1C D8 20 B0 DD C3 10 9B EB 76 EA 67 13>)
(   6,<2016-05-01 20:46:16.927 -0700>,<Administrator>,<X>,<proc1d>,<TOPSPIN 2.1>,
      <abs ABSG = 3 
       data hash MD5: 128K
       BB CB 12 C4 F6 2E 48 72 DD 64 8C 6F 89 CC 9C B3>)
(   7,<2016-05-01 20:46:17.021 -0700>,<Administrator>,<X>,<proc1d>,<TOPSPIN 2.1>,
      <abs ABSG = 4 
       data hash MD5: 128K
       E9 54 6A CB 3B A3 45 A3 E6 A0 24 2A 58 FC FF 0F>)
(   8,<2016-05-01 20:46:17.114 -0700>,<Administrator>,<X>,<proc1d>,<TOPSPIN 2.1>,
      <abs ABSG = 5 
       data hash MD5: 128K
       B9 E3 24 68 61 34 90 A6 BA 34 34 A1 38 07 15 82>)
$$ ##END=
$$ 
$$ $$ hash MD5
$$ $$ EA 14 52 59 7E 94 20 96 93 91 E2 2F F9 2E 16 AF
##$RELAX= 
##$RELAX= 
##$RELAX= 
##$RELAX= 
##$RELAX= 
##$RELAX= 
##$RELAX= 
##$RELAX= 
$$ Bruker specific parameters
$$ --------------------------
##$DU= <E:\>
##$EXPNO= 12
$$ [...]
150 150 150 150 150 150 150 150
##$TP07= 0
##$TPNAME0= <>
##$TPNAME1= <>
##$TPNAME2= <>
##$TPNAME3= <>
##$TPNAME4= <>
##$TPNAME5= <>
##$TPNAME6= <>
##$TPNAME7= <>
##$TPOAL= (0..7)
0.5 0.5 0.5 0.5 0.5 0.5 0.5 0.5
##$TPOFFS= (0..7)
0 0 0 0 0 0 0 0
##$TUNHIN= 0
##$TUNHOUT= 0
##$TUNXOUT= 0
##$USERA1= <user>
##$USERA2= <user>
##$USERA3= <user>
##$USERA4= <user>
##$USERA5= <user>
##$V9= 5
##$VALIST= <valist>
##$VCLIST= <CCCCCCCCCCCCCCC>
##$VD= 0
##$VDLIST= <DDDDDDDDDDDDDDD>
##$VPLIST= <PPPPPPPPPPPPPPP>
##$VTLIST= <TTTTTTTTTTTTTTT>
##$WBST= 2048
##$WBSW= 25
##$XGAIN= (0..3)
0 0 0 0
##$XL= 0
##$YL= 0
##$YMAX_a= 5542841
##$YMIN_a= -9322742
##$ZGOPTNS= <>
##$ZL1= 120
##$ZL2= 120
##$ZL3= 120
##$ZL4= 120
##$ABSF1= 14.96103
##$ABSF2= -5.597152
##$ABSG= 5
##$ABSL= 3
##$ALPHA= 0
##$AQORDER= 0
##$ASSFAC= 0
##$ASSFACI= 0
##$ASSFACX= 0
##$ASSWID= 0
##$AUNMP= <proc_prof1d_extract.lims>
##$AXLEFT= 0
##$AXNAME= <>
##$AXNUC= <1H>
##$AXRIGHT= 0
##$AXTYPE= 0
##$AXUNIT= <>
##$AZFE= 0.1
##$AZFW= 0.1
##$BCFW= 0
##$BC_mod= 0
##$BYTORDP= 0
##$COROFFS= 0
##$CY= 15
##$DATMOD= 1
##$DC= 0
##$DFILT= <>
##$DTYPP= 0
##$F1P= 0
##$F2P= 0
##$FCOR= 0.5
##$FTSIZE= 131072
##$FT_mod= 6
##$GAMMA= 0
##$GB= 0
##$INTBC= 1
##$INTSCL= 1
##$ISEN= 128
##$LB= 0.3
##$LEV0= 0
##$LPBIN= 0
##$MAXI= 10000
##$MC2= 0
##$MEAN= 0
##$ME_mod= 0
##$MI= 0
##$NCOEF= 0
##$NC_proc= -3
##$NLEV= 6
##$NOISF1= 0
##$NOISF2= 0
##$NSP= 0
##$NTH_PI= 0
##$NZP= 0
##$OFFSET= 14.96103
##$PC= 1
##$PHC0= -83.85864
##$PHC1= 0
##$PH_mod= 1
##$PKNL= yes
##$PPARMOD= 0
##$PPDIAG= 0
##$PPIPTYP= 0
##$PPMPNUM= 2147483647
##$PPRESOL= 1
##$PSCAL= 4
##$PSIGN= 0
##$PYNMP= <proc.py>
##$REVERSE= no
##$SF= 400.02000962546
##$SI= 131072
##$SIGF1= 0
##$SIGF2= 0
##$SINO= 400
##$SIOLD= 131072
##$SPECTYP= <>
##$SREGLST= <1H.CDCl3>
##$SSB= 0
##$STSI= 131072
##$STSR= 0
##$SW_p= 8223.68421052631
##$SYMM= 0
##$S_DEV= 0
##$TDeff= 65536
##$TDoff= 0
##$TI= <>
##$TILT= no
##$TM1= 0
##$TM2= 0
##$TOPLEV= 0
##$USERP1= <user>
##$USERP2= <user>
##$USERP3= <user>
##$USERP4= <user>
##$USERP5= <user>
##$WDW= 1
##$XDIM= 131072
##$YMAX_p= 498264366
##$YMIN_p= -37804
##$CURPLOT= <Network HP LaserJet P1505>
##$CURPRIN= <$Network HP LaserJet P1505>
##$DFORMAT= <normdp>
##$LAYOUT= <+/1D_H.xwp>
##$LFORMAT= <normlp>
##$PFORMAT= <normpl>
##$SURQMSG= 1
$$ End of Bruker specific parameters
$$ ---------------------------------
##NTUPLES= NMR SPECTRUM
##VAR_NAME=  FREQUENCY,     SPECTRUM/REAL,   SPECTRUM/IMAG
##SYMBOL=    X,             R,               I
##VAR_TYPE=  INDEPENDENT,   DEPENDENT,       DEPENDENT
##VAR_FORM=  AFFN,          ASDF,            ASDF
##VAR_DIM=   131072,        131072,          131072
##UNITS=     HZ,            ARBITRARY UNITS, ARBITRARY UNITS
##FACTOR=    0.0627417313425164, 1,          1
##FIRST=     8223.62146879497, 6435,         -91521
##LAST=      0,             10772,           -90637
##MIN=       0,             -37804,          0
##MAX=       8223.62146879497, 498264366,    0
$$ Real data points
##PAGE= N=1
##DATA TABLE= (X++(R..R)), XYDATA
$$ [...]
63603A103465M6784L5170K3039J1763J878o049j1478j4435j5258j4117j1651r754
63591A139357j0695j5214k2135k9838l7192m3112m6565m7675m7878m8194m8001
63580G42858m6198m2795l8586l3964k9031k4305k0391j7215j4461j2326j0894
63569D52692r246o313k409J203M169P283J0847J4080J6464J8600K1212K4153K6866
63556E79601K9138L1012L2660L4683L7800M1861M5857M9351N2955N6799N9301
63545A051018N8499N4071M7122L8311K7418J4867K640p018j3332j6953j8557j8156
63533A219930j5949j3183j1660j2305j4786j8597k3966l1148l9178m6147n0812
63522I42199n3347n4341n3751n1349m7712m4075m1183l8717l5930l2572k9021
$$ plain form
63603 1103465 1150249 1185419 1208458 1220221 1222099 1216050 1204572 1190137 1174879 1160762 1149111 1139357
63591 1139357 1128662 1113448 1091313 1061475 1024283 981171 934606 886931 839053 790859 742858
63580 742858 696660 653865 615279 581315 552284 527979 507588 490373 475912 463586 452692
63569 452692 443446 437133 434724 435927 440096 447379 458226 472306 488770 507370 528582 552735 579601
63556 579601 608739 639751 672411 707094 744894 786755 832612 881963 934918 991717 1051018
63545 1051018 1109517 1163588 1210710 1249021 1276439 1291306 1293946 1286928 1273596 1256643 1238086 1219930
63533 1219930 1203981 1190798 1179138 1166833 1152047 1133450 1109484 1078336 1039158 993011 942199
63522 942199 888852 834511 780760 729411 681699 637624 596441 557724 521794 489222 460201
63511D60201k5772k2963k0452j8136j6009j3986j1906r909q542q216q619q967
63499B86724q804q285p613o567m902l118k307k898l749l191j215J14q48k920l380
63484B27041j563L26M35r3J040L811N866N756M633M428N426O236N509L213M60
63469B72524j593k751l676m725n391n153m420l905l591k975j987q95L48J727K509
63454B36046K102J272J324K175K583K241K238L167M298N157O499Q873J1414J3001
63440C02390J3695J4117J4344J4405J5094J7109J9814K1912K3095K4176K5787
63429E05938K7817L0055L2771L6468M1338M6868N1972N6054N9933O5024P1394
63418A025632P7509Q2091Q5070Q6115Q3629P6408O5263N1670L5818J7890O37j1597
$$ plain form
63511 460201 434429 411466 391014 372878 356869 342883 330977 321068 312526 304310 295691 286724
63499 286724 277920 269635 262022 255455 250553 247435 245128 242230 238481 235290 234075 234189 233341 230421 227041
63484 227041 225478 225804 226239 226146 227186 230997 236863 242619 247252 251680 257106 263342 268851 272064 272524
63469 272524 270931 268180 264504 259779 254388 249235 244815 240910 237319 234344 232357 231462 231810 233537 236046
63454 236046 238148 239420 240744 242919 245502 247743 249981 253148 257446 262603 269102 277975 289389 302390
63440 302390 316085 330202 344546 358951 374045 391154 410968 432880 455975 480151 505938
63429 505938 533755 563810 596581 633049 674387 721255 773227 829281 889214 954238 1025632
63418 1025632 1103141 1185232 1270302 1356417 1440046 1516454 1581717 1633387 1669205 1687095 1687732 1676135
63406A676135j6971j7775j7407j7127j6545j6007j7188k1515k8944l8299m8225
63395A420132n7664o5680p1187p3254p1828o7899o2678n6799n0642m4963m0552
63384G56986l7318l4221l0220k4997j8994j3191q631n591l219l97L146O864J0265
63371F00482J3207J5687J7990K0816K4553K8599L2142L5410L9359M4200M9155
63360I21600N3582N7522O1083O4318O7602P0931P2590O9959O2272N1458L9483
63349A592400K6225J1229l572j4750k0729k2763k2619k0971j8465j6924j8344
63338A470717k3225l0591l9196m8029n6134o2758o7616p0462p0634o7669o2452
63327H71951n6917n2458m8970m5617m1897l7704l3049k8318k4328k1477j9144
$$ plain form
63406 1676135 1659164 1641389 1623982 1606855 1590310 1574303 1557115 1535600 1506656 1468357 1420132
63395 1420132 1362468 1296788 1225601 1152347 1080519 1012620 949942 893143 842501 797538 756986
63384 756986 719668 685447 655227 630230 611236 598045 589414 583823 580604 580207 583353 590217 600482
63371 600482 613689 629376 647366 668182 692735 721334 753476 788886 828245 872445 921600
63360 921600 975182 1032704 1093787 1158105 1225707 1296638 1369228 1439187 1501459 1552917 1592400
63349 1592400 1618625 1629854 1626282 1611532 1590803 1568040 1545421 1524450 1505985 1489061 1470717
63338 1470717 1447492 1416901 1377705 1329676 1273542 1210784 1143168 1072706 1002072 934403 871951
63327 871951 815034 762576 713606 667989 626092 588388 555339 527021 502693 481216 462072
63316D62072j6681j4669j4133j4618j4199j1857q851p014o574o469o128n760n354
63303C29765m617l918m019m542l923j565Q59J200m92k157k407k023k487l815m581
63288B91278l827k178j000r82j853k985l744l447j748O95K453K647J748Q01K14
63273B78072k27n14k61M89R65M60q29k000k362j909j026j5R61J673J925J960K436
63256B79798L596M709M874M378M481N727P157P753P811Q188Q748Q753Q496R386
63242C73855J2048J5347J7768J9018J9712K0184K0467K1061K2684K5199K7401
63231E94744K8230K7694K6418K4842K3376K2908K4210K6654K8271K7715K5862
63220H80924K4819K5496K6794K7130K6021K3858K0746J6246J0133K986m095j0315
$$ plain form
63316 462072 445391 430722 416589 401971 387772 375915 367064 360050 353476 347007 340879 335119 329765
63303 329765 325148 321230 317211 312669 308746 307181 308040 309240 308748 306591 304184 302161 299674 295859 291278
63288 291278 287451 285273 284273 283291 281438 278453 274709 271262 269514 270209 272662 275309 277057 277858 278072
63273 278072 277845 277331 277070 277559 278524 278984 278155 276155 273793 271884 270858 270843 271804 273477 275402 277362 279798
63256 279798 283394 288103 292977 297355 301836 307563 314720 322473 330284 338472 347220 355973 364469 373855
63242 373855 385903 401250 419018 438036 457748 477932 498399 519460 542144 567343 594744
63231 594744 622974 650668 677086 701928 725304 748212 772422 799076 827347 855062 880924
63220 880924 905743 931239 958033 985163 1011184 1035042 1055788 1072034 1082167 1085153 1081058 1070743
63208A070743j5804k1288k6942l1785l4678l5699l5686l4640l1745k7273k3017
63197G52186j9998j6905j2084o091q28L292P504J2256J6378J9093K1183K3459
63185G99445K5382K6184K6470K7582K9859L2263L3507L2995L1096K8954K7745
63174A121482K7581K7467K6688K5668K4910K3610K0220J4295O993l65p656j5603
63162A295290k4419l3133m0246m4963m7661m9195m9909m9589m8162m5957m3266
63151H18790m0272l7452l5400l3926l1938k8797k5233k2331k0019j7421j4406
63140E11595j1891j0484r611q353o635n237m910n577o227n503k949J17J467K25
63126D36027k007k747j195J210K660K735K188J647J093L75l69p89n90K23J048
$$ plain form
63208 1070743 1054939 1033651 1006709 974924 940246 904547 868861 834221 802476 775203 752186
63197 752186 732188 715283 703199 697108 696280 699572 707076 719332 735710 754803 775986 799445
63185 799445 824827 851011 877481 905063 934922 967185 1000692 1033687 1064783 1093737 1121482
63174 1121482 1149063 1176530 1203218 1228886 1253796 1277406 1297626 1311921 1318914 1318549 1310893 1295290
63162 1295290 1270871 1237738 1197492 1152529 1104868 1055673 1005764 956175 908013 862056 818790
63151 818790 778518 741066 705666 671740 639802 611005 585772 563441 543422 526001 511595
63140 511595 499704 489220 479609 471256 464621 459384 454474 448897 442670 437167 434218 434335 435802 436027
63126 436027 434020 431273 430078 431288 433948 436683 438871 440518 441611 441986 441617 440828 440238 440461 441509
63111D41509Q61p54k745l378k137l03N95M18L1j87o66j531j937q20J917N155P344
63094D43372P610O256M348K769J803J455J803K792M023N031N529N391M784M508
63080E01474N422P202Q383Q275Q015Q816R956R873Q820Q808J0781J3300J4566
63067F23691J4501J4213J4533J5825J8304K1506K4058K5030K5261K6613L0001
63056H53536L4613L8860M1737M3505M5400M8374N1902N4403N5105N4839N4683
63045A376957N4558N3844N2666N1779N1572N2080N3574N6107N8660N9763N9090
63034A980650N7467N5132N0953M3822L4108K3025J1093k021j6191l0165m2446
63023B165427n2488o0597o6868p0774p2034p1328o9627o6983o2507n5657m6953
$$ plain form
63111 441509 442370 441616 438871 435493 433356 433053 433648 434066 434097 433910 433244 431713 429776 428956 430873 436028 443372
63094 443372 450982 457238 461586 464355 466158 467613 469416 472208 476231 481262 486791 492182 496966 501474
63080 501474 506896 514098 522481 530756 538771 547587 557543 567416 576236 585044 595825 609125 623691
63067 623691 638192 652405 666938 682763 701067 722573 746631 771661 796922 823535 853536
63056 853536 888149 927009 968746 1012251 1057651 1106025 1157927 1212330 1267435 1322274 1376957
63045 1376957 1431515 1485359 1538025 1589804 1641376 1693456 1747030 1803137 1861797 1921560 1980650
63034 1980650 2038117 2093249 2144202 2188024 2222132 2245157 2256250 2254229 2238038 2207873 2165427
63023 2165427 2112939 2052342 1985474 1914700 1842666 1771338 1701711 1634728 1572221 1516564 1469611
63012A469611l7361k7486j7547p619K391J2520K2201L0426L6781M1794M5963M9145
63000A620819N1397N3623N6437N8994O0056N9866N9837O0429O0598N9508N7552
62989B259116N5063N1167M4959L7164K9460K2090J3182P90j4914l1883m8147o2991
62977B355056p6313q7694r6573j02943j07144j09092j08376j05245j00767r5679
62967A365230q9758q2792p5487o8671o2136n5201m8181m2308l8180l5204l2618
62956G34694l0245k8013k5682k3427k1871k0979j9660j7048j3722j1020r627r434
62944E03966j0214j1529j2313j1674j0087q942q771q781q310p714p371o834n731
62931C85695m801m995o037o807o779o096m630k328m36o63k721m167l546k158j615
$$ plain form
63012 1469611 1432250 1404764 1387217 1379598 1381989 1394509 1416710 1447136 1483917 1525711 1571674 1620819
63000 1620819 1672216 1725839 1782276 1841270 1901326 1961192 2021029 2081458 2142056 2201564 2259116
62989 2259116 2314179 2365346 2410305 2447469 2476929 2499019 2512201 2512991 2498077 2466194 2418047 2355056
62977 2355056 2278743 2191049 2094476 1991533 1884389 1775297 1666921 1561676 1460909 1365230
62967 1365230 1275472 1192680 1117193 1048522 986386 931185 883004 840696 802516 767312 734694
62956 734694 704449 676436 650754 627327 605456 584477 564817 547769 534047 523027 513400 503966
62944 503966 493752 482223 469910 458236 448149 439207 430436 421655 413345 405631 398260 391426 385695
62931 385695 380894 375899 369862 363055 356276 350180 345550 343222 342786 342123 339402 335235 331689 329531 327916
62916C27916j200N35K693K988J446O18J634K404Q36k052l820l840l204k470j484
62901C23000q92j720l320l547j612O44J137J93j49J030K390K059j72k611l423
62886C13007k392r12l86r03j531j571j222j175j804k734l098k421j240o03q54
62871B90161j395j683j791j774j294l76K42J88R9M17L52p96k041j929r01p48j730
62854B75001k109r59L34L02l97k93M91O58J7k14O92K002K644K391J616O37k73
62837B82540p92q00n69l69j37K41N72N57L37N34J569L061M070L940K752J097l46
62820B98257r63l80J116K611L399L619L822M181M602N218O157P002P219P115P514
62805C60489Q485R242R562J0294J1961J3676J4327J4243J4790J6544J8839K0960
$$ plain form
62916 327916 326716 327251 329944 332932 334378 334996 336630 339034 339870 337818 333998 330158 326954 324484 323000
62901 323000 322108 320388 317068 313521 311909 312553 313690 313883 313734 314764 317154 319213 319041 316430 313007
62886 313007 310615 309703 309317 308414 306883 305312 304090 302915 301111 298377 295279 292858 291618 291015 290161
62871 290161 288766 287083 285292 283518 282224 281848 282090 282278 282377 282794 283146 282350 280309 278380 277479 276731 275001
62854 275001 272892 271933 272267 272569 272172 271879 272370 273028 273045 272831 273523 275525 278169 280560 282176 282813 282540
62837 282540 281748 280948 280379 280010 279873 280114 280686 281243 281580 282114 283683 286744 290814 294754 297506 298603 298257
62820 298257 297294 296914 298030 300641 304040 307659 311481 315662 320264 325482 331639 338641 345860 352975 360489
62805 360489 368974 378216 387778 398072 410033 423709 438036 452279 467069 483613 502452 523412
62793E23412K3008K5250K7424K9236L1283L4875M0720M8030N5197O1405O7235
62782I67075P3572Q0294Q6476R1616R5897R9367J01560J02142J01096R7838R0904
62771A987837P9345O4078M7151K9835J2085o223k4276m0833n5249o7632p8152
62760A947966q6451r1917r4424r4622r3297r0679q6779q2177p7822p3880o9484
62749A006434o4005n7959n2232m7099m2465l8510l5263l2050k8306k4646k2091
62738E61808k0336j7978j4592j1512j0018r586q670o662m358k786k240k310k324
62725D48436j708l04J566L486N435P692J0301J2809J4643J5695J6466J7563J9207
62712E71287K1394K4432K8802L4250L9546M3732M7376N1996N8374O6073P4423
$$ plain form
62793 523412 546420 571670 599094 628330 659613 694488 735208 783238 838435 899840 967075
62782 967075 1040647 1120941 1207417 1299033 1394930 1494297 1595857 1697999 1799095 1896933 1987837
62771 1987837 2067182 2131260 2178411 2208246 2220331 2214108 2189832 2148999 2093750 2026118 1947966
62760 1947966 1861515 1769598 1675174 1580552 1487255 1396576 1309797 1227620 1149798 1075918 1006434
62749 1006434 942429 884470 832238 785139 742674 704164 668901 636851 608545 583899 561808
62738 561808 541472 523494 508902 497390 487372 477786 469116 462454 458096 455310 453070 450760 448436
62725 448436 446728 446424 447990 451476 456911 464603 474904 487713 502356 518051 534517 552080 571287
62712 571287 592681 617113 645915 680165 719711 763443 810819 862815 921189 987262 1061685
62701A061685Q3108R1712R9574J06551J13124J19264J23789J25381J23685J18955
62691B166828J11076R9626Q4512O6065M4869K1982j274k4206m6755o7963q5446
62680B369314r7677j06107j13398j19835j23206j22221j18168j12736j06074r8046
62670A251846q9738q2255p5106o7323n9461n2985m8131m3828l9530l5752l2758
62659F24979l0006k7051k4100k1509j9486j8261j7715j6913j5025j2650j1241
62648D11022j1113j1153j0569r739q968p707n707l930l414l994m784n250n097
62635C19597l962k165j145j894l226k761J65L395M153K013p30j551k92J037R20
62620C13554O7J1Q05J370J675K811M823O231O424O702P982R165R258R419J1094
$$ plain form
62701 1061685 1144793 1236505 1336079 1442630 1555754 1675018 1798807 1924188 2047873 2166828
62691 2166828 2277904 2377530 2462042 2528107 2572976 2594958 2593684 2569478 2522723 2454760 2369314
62680 2369314 2271637 2165530 2052132 1932297 1809091 1686870 1568702 1455966 1349892 1251846
62670 1251846 1162108 1079853 1004747 937424 877963 824978 776847 733019 693489 657737 624979
62659 624979 594973 567922 543822 522313 502827 484566 466851 449938 434913 422263 411022
62648 411022 399909 388756 378187 368448 359480 351773 346066 342136 338722 334728 329944 324694 319597
62635 319597 315635 313470 312325 310431 307205 304444 304609 308004 312157 314170 313440 311889 311597 312634 313554
62620 313554 313621 313632 314437 315807 317482 320293 325116 331347 337771 344473 352455 361620 370878 380297 391391
62605C91391J3395J4734J6015J9515K4914K9316L1632L4122L8660M3838M7443
62594G04975M9706N2043N3932N3337M9850M5267M0916L5950K8879J9673R696J33
62582A144357q904j7824k6511l3992l9177m1873m2893m3252m3526m3884m4193
62571G58328m3896m2291l9282l5603l2111k9168k6767k4777k2904k0778j8315
62560D22436j5689j2904r934p358o062n981n887m881l527k812k578j778n1J762
62546C44756K590K089O79p62j287n58P08J403J246R92J308J877K025J923K632
62531C61621M786P622R696J0413J0546J1319J3413J6811K0985K4996K8136L0858
62519E51202L4493L9433M4286M7621M9962N2997N7262O1705O5134O6753O5480
$$ plain form
62605 391391 404786 419520 435535 455050 479964 509280 540912 575034 613694 657532 704975
62594 704975 754681 806724 860656 913993 963843 1009110 1050026 1085976 1114855 1134528 1144224 1144357
62582 1144357 1135453 1117629 1091118 1057126 1017949 976076 933183 889931 846405 802521 758328
62571 758328 714432 672141 632859 597256 565145 535977 509210 484433 461529 440751 422436
62560 422436 406747 393843 383909 376551 370489 364508 358621 353740 350213 347401 344823 343045 342994 344756
62546 344756 347346 349435 350114 349352 348065 347507 348215 349618 350864 351856 353164 355041 357066 358989 361621
62531 361621 366407 374029 383725 394138 404684 416003 429416 446227 467212 492208 520344 551202
62519 551202 585695 625128 669414 717035 766997 819994 877256 938961 1004095 1070848 1136328
62508A136328O0479N2652M4151L5777K6176J4154N66j2830k5072l5613m3592m8784
62496A204392n2430n5863n8772o0010n9444n7897n5699n2539m8424m3753l8655
62485F20906l3283k8456k4930k2276j9539j6758j4754j3514j2031r774p273n179
62473D13139l800l529m564n989o317n363m479m541m784m271l402l033k921k200
62459C53946j018n53j420k916l935m015l335k316j461j203j508j746j298j03J476
62444C28595L187M914O256O637O083N490N665O370O731O366N583M732L999L620
62430D04228L417K317n25m078o120o004n415n768o351o054n585o281p583p499
62416C42699n376k713j247j499k972m595n015l786k224j838k137j447K50J110
$$ plain form
62508 1136328 1196807 1249459 1293610 1329387 1355563 1369717 1370283 1357453 1332381 1296768 1253176 1204392
62496 1204392 1151962 1096099 1037327 977317 917873 859976 804277 751738 703314 659561 620906
62485 620906 587623 559167 534237 511961 492422 475664 460910 447396 435365 425591 418318 413139
62473 413139 409339 405810 401246 395257 388940 383577 379098 374557 369773 365502 362100 359067 356146 353946
62459 353946 352928 352375 350955 348039 344104 340089 336754 334438 332977 331774 330266 328520 327222 327119 328595
62444 328595 331782 336696 342952 349589 355672 361162 366827 373197 379928 386294 391877 396609 400608 404228
62430 404228 407645 409962 409437 405359 399239 393235 387820 382052 375701 369647 364062 357781 350198 342699
62416 342699 337323 334610 333363 331864 328892 324297 319282 315496 313272 311434 309297 307850 308100 309210
62402C09210L18o64m56L68O56N22O87J168J754K726M011M588L927L166L579M641
62386C40201M955M476M371N092O008O723P322P440O580N520O004Q549J1608J3385
62372D38234J3629J3249J3135J3861J5729J8482K1524K4901K9424L5423M2094
62361F79685M8545N4834O1389O8224P5526Q4174R4490J04727J12054J15050J14299
62350A612997J10524J03343R2219P7619O0645M2281K3665O286r008k2837l6386
62339B061348m9849o2333p3008q1678q8379r3100r5785r6210r4030q9460q3467
62328A154049p6639o8409n8533m8788m1714l7631l4515l1111k8357k7056k5899
62317F75397k3356k0204j8413j8263j8281j7651j6948j6588j6167j5528j5085
$$ plain form
62402 309210 309528 308864 308408 308776 309432 309954 310641 311809 313563 316289 320300 324888 328815 331981 335560 340201
62386 340201 345156 349632 354003 359095 365103 371826 379148 386588 393168 398688 404692 413241 424849 438234
62372 438234 451863 465112 478247 492108 507837 526319 547843 572744 602168 637591 679685
62361 679685 728230 783064 844453 912677 988203 1072377 1166867 1271594 1383648 1498698 1612997
62350 1612997 1723521 1826864 1919083 1996702 2057347 2099628 2123293 2129579 2120571 2097734 2061348
62339 2061348 2011499 1949166 1876158 1794480 1706101 1613001 1517216 1421006 1326976 1237516 1154049
62328 1154049 1077410 1009001 950468 901680 859966 822335 787820 756709 728352 701296 675397
62317 675397 652041 631837 613424 595161 576880 559229 542281 525693 509526 493998 478913
62306D78913j4689j3386j0896q276o524n349l968k428j506j619k273k401j128
62293D04470J340L524L929K673J336J155J987L094M090M806M982M671M484M963
62279D51504O029P281Q392R160R662J0475J2024J3616J3967J3121J2918J4934
62267E83083J8588K2053K4487K6644K9707L4235M0055M6526N3051N9749O7406
62256A005584P6412Q6010R4986J02719J09045J13339J14242J10215J00333Q5044
62246A997929O6521M7712L0500J4969N66j2853k5570l8528n2219o5606p7228q6870
62234A799323r5062j01186j03588j01718r6982r1163q4956p8383p1570o4593n7348
62223H52774n0182m3906l8634l3402k7654k2405j8965j7077j5331j3148j1190
$$ plain form
62306 478913 464224 450838 439942 431666 425142 419793 415825 413397 411891 410272 407999 405598 404470
62293 404470 405810 409334 413263 415936 417272 418427 420414 423508 427598 432404 437386 442057 446541 451504
62279 451504 457533 464814 473206 482366 492028 502503 514527 528143 542110 555231 568149 583083
62267 583083 601671 623724 648211 674855 704562 738797 778852 825378 878429 938178 1005584
62256 1005584 1081996 1168006 1262992 1365711 1474756 1588095 1702337 1812552 1912885 1997929
62246 1997929 2064450 2112162 2142662 2157631 2158197 2145344 2119774 2081246 2029027 1963421 1886193 1799323
62234 1799323 1704261 1603075 1499487 1397769 1300787 1209624 1124668 1046285 974715 910122 852774
62223 852774 802592 758686 720052 686650 658996 636591 617626 600549 585218 572070 560880
62212E60880r942r032q183p715p542o775n100l667l513l762k739o22N60j26j011
62197D91711n2K570N088O549P333P845Q039Q200Q940J0191J1162J1588J2150J3331
62183F04645J4681J5636J6280J6902J7259J6970J6228J5738J6197J7992K0910
62172G89438K4079K6766K9353L2866L7503M2686M8757N7083O7586P7495Q4023
62161A317635Q7308Q9003Q8691Q3881P3589N9949M5655L1591J7821N197n586j5470
62149A879264k5911l6761m6682n5388o3834p2008p7999q0023p8403p4722o9861
62138A197672o3657n6086m7752l9340l1430k4872k0559j8580j8157j8503j9210
62127H39526j9577j8450j5392j1579q883q024q172q271q385r485j1984j4601j4979
$$ plain form
62212 560880 550938 541906 533723 526008 518466 511691 506591 502924 499411 495649 492910 492288 492848 492722 491711
62197 491711 491659 494229 499317 505866 513199 521044 529083 537283 546223 556414 567576 579164 591314 604645
62183 604645 619326 634962 651242 668144 685403 702373 718601 734339 750536 768528 789438
62172 789438 813517 840283 869636 902502 940005 982691 1031448 1088531 1156117 1233612 1317635
62161 1317635 1404943 1493946 1582637 1666518 1740107 1800056 1845711 1877302 1895123 1900320 1894734 1879264
62149 1879264 1853353 1816592 1769910 1714522 1650688 1578680 1500681 1420658 1342255 1267533 1197672
62138 1197672 1134015 1077929 1030177 990837 959407 934535 913976 895396 877239 858736 839526
62127 839526 819949 801499 786107 774528 765645 757621 749449 741178 732793 723308 711324 696723 681744
62114F81744j1985p314m094l694m561m542l329j956q56L62J738K859L767M748
62100F52887N357M867L704L233L906M796N252N802O989Q403R496J0340J1011J1159
62086G47202J0850J0944J1909J3042J3667J4275J5629J7355J8455J8828J9460
62075I11616K1285K4426K8184L1472L3690L5580L8595M3033M7648N1586N5737
62064A322852O1352O8191P4932Q0483Q3794Q3384P8548P0461O0661M9015L4776
62053B068449J9207N208n877j5345k4698l3787m2000m9777n7811o5576p1774p5706
62041A650513p7483p7202p4736p0243o4448n8321n2527m7022m1336l5533l0700
62030A020962k7845k6375k4403k0812j6428j2903j1046j0499j0497j0382r742
$$ plain form
62114 681744 669759 662445 658351 654657 650096 645554 642225 640269 639413 639775 641513 644372 648139 652887
62100 652887 658244 663111 666815 670048 673954 678750 684002 689804 696793 705196 714692 725032 736043 747202
62086 747202 758052 768996 780905 793947 807614 821889 837518 854873 873328 892156 911616
62075 911616 932901 957327 985511 1016983 1050673 1086253 1124848 1167881 1215529 1267115 1322852
62064 1322852 1384204 1452395 1527327 1607810 1691604 1774988 1853536 1923997 1984658 2033673 2068449
62053 2068449 2087656 2092864 2086987 2071642 2046944 2013157 1971157 1921380 1863569 1797993 1726219 1650513
62041 1650513 1573030 1495828 1421092 1350849 1286401 1228080 1175553 1128531 1087195 1051662 1020962
62030 1020962 993117 966742 942339 921527 905099 892196 881150 870651 860154 849772 840030
62019H40030q540p197o299o102o248n898m444k286p22o66j714k765l339l749m144
62004G75917m057l122j729o31m2N87J742K907K921J606N00J097K622K918J530
61989G84766M27J036K222K262J300L84o81k718n166o571o573n832m561k898k038
61974G55359k942m314m113k851k925m598n355l809j585m42qL59r7j678k828k460
61958G15713j784j941j617O49L260L348R62j087j111K1J050J695J820J447J786
61943G24211M230P855R771Q736O816O680Q578J0866J2320J2863J2780J2266J1510
61930H49482J0737J0285J0703J2141J3630J3759J2342J0645R705R220Q457P440
61918I78546O734O695P381Q709J0269J1562J2770J4625J7170J9415K0877K2552
$$ plain form
62019 840030 831490 824293 817994 811892 805644 799746 795302 793016 792294 791628 789914 787149 783810 780061 775917
62004 775917 771860 768738 767009 766378 766336 766923 768665 771572 774493 776099 776599 777696 780318 783236 784766
61989 784766 785193 786229 788451 790713 792013 792397 791716 788998 783832 777261 770688 764856 760295 757397 755359
61974 755359 752417 748103 743990 741139 738214 733616 728261 724452 722867 722425 722417 722776 722679 721001 718173 715713
61958 715713 713929 711988 710371 711020 714280 717628 718590 717503 716392 716413 717463 719158 720978 722425 724211
61943 724211 728441 736296 746067 754803 761619 768299 776877 787743 800063 812926 825706 837972 849482
61930 849482 860219 870504 881207 893348 906978 920737 933079 943724 953429 962649 971106 978546
61918 978546 985280 991975 999356 1008065 1018334 1029896 1042666 1057291 1074461 1093876 1114753 1137305
61906A137305K5444K8791L0945L1647L2154L3142L3913L3987L4122L4800L4855
61895A491105L2971L0064K8477K8797K8966K7279K4846K3872K4386K4325K2660
61884A787748K0650J9501J8183J4725Q897K541k484n799q204j0757j4235j8753
61872A812013k3646k7986l1314l3708l5235l5814l5656l5476l5985l7235l8504
61861A441454l8802l7610l5231l2449k9896k7823k6250k4903k3054k0151j6731
61850A128554j4074j2540j0971q362n429l585k817j727K43J843J730K85j094k068
61836A069988l792p172j1335j4295j4919j3798j2191j0726r369q113o869m946
61824I52463j610K635O155P905Q323Q224P676O573N373M334K743J0k837m032l324
$$ plain form
61906 1137305 1162749 1191540 1222485 1254132 1286286 1319428 1353341 1387328 1421450 1456250 1491105
61895 1491105 1524076 1554140 1582617 1611414 1640380 1667659 1692505 1716377 1740763 1765088 1787748
61884 1787748 1808398 1827899 1846082 1860807 1869704 1872245 1869761 1863962 1855758 1845001 1830766 1812013
61872 1812013 1788367 1760381 1729067 1695359 1660124 1624310 1588654 1553178 1517193 1479958 1441454
61861 1441454 1402652 1365042 1329811 1297362 1267466 1239643 1213393 1188490 1165436 1145285 1128554
61850 1128554 1114480 1101940 1090969 1082607 1077178 1073593 1070776 1069049 1069292 1071135 1072865 1073150 1072056 1069988
61836 1069988 1066196 1059024 1047689 1033394 1018475 1004677 992486 981760 972391 964278 957409 952463
61824 952463 950853 953488 959643 967548 975871 984095 991771 998344 1003717 1008051 1010794 1010804 1007967 1003935 1000611
61809A000611k261k144k714l126l160l058k909k726k639k528j911n37J260L188
61795I75346N601R012J3144J6850J9038J9636J9662K0256K1607K2940K3679K4242
61783A191013K5359K7012K8585K9791L0810L1745L2612L3817L5816L8366M0930
61772A545856M3773M7610N1946N5008N5924N6037N7092N8913N9935N9619N9165
61761B150878N9744O1055O1925O1786O1059O0246N8941N5854N0103M2476L4972
61750B759039K8766K3007J6129P969j98p573j4774k2520l0217l6532m1111m5056
61738B636929m9676n5128o0322o3897o5330o5314o5126o5471o5830o5168o3244
61727A952423o1053n9806n9603n9255n7425n3889m9711m6276m4119m2657m1015
$$ plain form
61809 1000611 998350 996206 993492 990366 987206 984148 981239 978513 975874 973346 971435 970898 972158 975346
61795 975346 980947 989959 1003103 1019953 1038991 1058627 1078289 1098545 1120152 1143092 1166771 1191013
61783 1191013 1216372 1243384 1271969 1301760 1332570 1364315 1396927 1430744 1466560 1504926 1545856
61772 1545856 1589629 1637239 1689185 1744193 1800117 1856154 1913246 1972159 2032094 2091713 2150878
61761 2150878 2210622 2271677 2333602 2395388 2456447 2516693 2575634 2631488 2681591 2724067 2759039
61750 2759039 2787805 2810812 2826941 2834910 2834712 2827139 2812365 2789845 2759628 2723096 2681985 2636929
61738 2636929 2587253 2532125 2471803 2407906 2342576 2277262 2212136 2146665 2080835 2015667 1952423
61727 1952423 1891370 1831564 1771961 1712706 1655281 1601392 1551681 1505405 1461286 1418629 1377614
61716A377614l8906l6627l4421l2265l0373k9334k9401k9917k9856k8775k6947
61705A030792k4868k3037k1937k1504k0812j9059j6857j5661j5840j6266j6133
61694H18818j6032j6620j7204j6807j5848j5476j5562j4747j2603j0439r586r860
61682F48034j0287j0499j0705j0862j0657j0055r197p925o067m283l886n319p095
61669E41197p036m802k563k489l918m155k148m1k04j818k063k27J232J63k411
61654E08717l921l630k995l133l393k686j204k20n69j827k913l116k435j165M53
61639D75963J972K631K005P58J47N47J021O07l95r53p30m31q23j921l158l956
61623D73284m030l539l049l031l208k747j338J72N81k81j432j994k121k424k856
$$ plain form
61716 1377614 1338708 1302081 1267660 1235395 1205022 1175688 1146287 1116370 1086514 1057739 1030792
61705 1030792 1005924 982887 960950 939446 918634 899575 882718 867057 851217 834951 818818
61694 818818 802786 786166 768962 752155 736307 720831 705269 690522 677919 667480 657894 648034
61682 648034 637747 627248 616543 605681 595024 584969 575772 567847 561780 557497 553611 548292 541197
61669 541197 534161 529359 526796 524307 520389 516234 514086 514045 513841 512023 509960 509733 510965 511128 508717
61654 508717 504796 501166 498171 495038 491645 488959 487755 487535 486966 485139 482226 479110 476675 475510 475963
61639 475963 477935 480566 482571 483329 483476 484023 485044 485651 485256 484303 483573 483142 482319 480398 477240 473284
61623 473284 469254 465715 462666 459635 456427 453680 452342 452514 453095 452814 451382 449388 447267 444843 441987
61608D41987k787k088j575k105l494m613m477l145j694j360k382l621l673k416
61594D02557j132r15j423j665j462j486k079k813l188l168k832k074q33P43K493
61579C80723M217N368N234L777J984J099J525K700L810M493M869N154N376N526
61565D35855N866O808Q322R679J0104R555Q676Q054P753P478P007O633P150R006
61551E47946J1194J1608R259N784L918M512N799N672L924K014J303J883K663K334
61537F19813N47j597k503j660K5J407K108K297K110J655J217J065J209J471J631
61522F30795J511J205J208K069L801N933P943R453J0186J0257J0264J0612J1057
61509G16294J1486J2650J5145J8055J9910K0885K2488K4895K6231K5258K3274
$$ plain form
61608 441987 439200 437112 435537 433432 429938 425325 420848 417703 416009 414649 412267 408646 404973 402557
61594 402557 401425 400510 399087 397422 395960 394474 392395 389582 386394 383226 380394 378320 377487 378230 380723
61579 380723 384940 390308 395542 399319 401303 402402 403927 406627 410437 414930 419799 424953 430329 435855
61565 435855 441721 448529 456851 466530 476634 486189 494865 502919 510672 518150 525157 531790 538940 547946
61551 547946 559140 570748 580007 585791 589709 594221 600020 605692 609616 611630 612933 614816 617479 619813
61537 619813 620360 618763 616260 614600 614625 616032 618140 620437 622547 624202 625419 626484 627693 629164 630795
61522 630795 632306 633511 634719 636788 640589 646522 654465 663918 674104 684361 694625 705237 716294
61509 716294 727780 740430 755575 773630 793540 814425 836913 861808 888039 913297 936571
61498I36571K2375K2960K4128K5409K6762K7689K7817K7932K8998L0374L0286
61487A231301K8018K4528K0916J7409J3967J0858Q269N971L642J111j645m206
61475A360139n767o154o409p524q932r400r135r479j0460j0382q482o493o367
61462A255155p592q198p732p559q340q753p347m562k139j028p07m15j58k44l44
61447A190037L20J990M154O374Q801J1511J3860J5064J5213J5096J4999J4224
61435A311643J1999Q473M642J460q44k683m353n465n423m529l929l959l299o32
61421A303101L255O231P566Q592J0330J1798J1427R026N376O88n180j1363j6170
61408A344677j8805j9966k0598k0761k0019j8217j5642j2801j0339q663p532o330
$$ plain form
61498 936571 958946 981906 1006034 1031443 1058205 1085894 1113711 1141643 1170641 1201015 1231301
61487 1231301 1259319 1283847 1304763 1322172 1336139 1346997 1355266 1361237 1364879 1365990 1364345 1360139
61475 1360139 1354372 1348218 1341809 1334285 1325353 1315953 1306818 1297339 1286879 1276497 1268015 1261522 1255155
61462 1255155 1247563 1239365 1231633 1224074 1215734 1206981 1199634 1195072 1192933 1191905 1191198 1190783 1190625 1190381 1190037
61447 1190037 1190357 1192347 1196501 1202875 1211676 1223187 1237047 1252111 1267324 1282420 1297419 1311643
61435 1311643 1323642 1332115 1336757 1338217 1337373 1334690 1330337 1324872 1319449 1314920 1310991 1307032 1303733 1303101
61421 1303101 1306356 1312587 1320153 1328745 1339075 1350873 1362300 1371326 1376702 1377390 1372210 1360847 1344677
61408 1344677 1325872 1305906 1285308 1264547 1244528 1226311 1210669 1197868 1187529 1178866 1171334 1165004
61396A165004m980m014l581k982j688k97J96j44j33J119L395O049Q892J1927J4617
61381A193380J6043J5988J5573J6454J9195K2484K4198K3519K1827K1253K2390
61370A412304K3862K4113K3045K1559K0040J7948J4902J1396Q354O202M652K989
61358A591366M98l063p051j0290j2105j3088j4531j7179k0625k3917k6439k8205
61346A415371k9483l0403l0933l1020l0593k9511k7701k5430k3186k1239j9541
61335A116331j8119j7249j6938j6563j5421j3544j1501r623p854o267n111m258
61323I73883l212j875p36j44J96P82J811L362N418P453Q548Q521Q351Q973J0023
61308A031354J0415R809Q719P476N917M146K749K079J867J776J841K095K231J909
$$ plain form
61396 1165004 1160024 1156010 1152429 1149447 1147759 1147462 1147658 1147514 1147381 1148500 1151895 1157944 1166836 1178763 1193380
61381 1193380 1209423 1225411 1240984 1257438 1276633 1299117 1323315 1346834 1368661 1389914 1412304
61370 1412304 1436166 1460279 1483324 1504883 1524923 1542871 1557773 1569169 1577523 1583725 1588377 1591366
61358 1591366 1591864 1588801 1581750 1571460 1559355 1546267 1531736 1514557 1493932 1470015 1443576 1415371
61346 1415371 1385888 1355485 1324552 1293532 1262939 1233428 1205727 1180297 1157111 1135872 1116331
61335 1116331 1098212 1080963 1064025 1047462 1032041 1018497 1006996 997373 989519 983252 978141 973883
61323 973883 970671 968796 968060 967916 968112 968894 970705 974067 979485 986938 995486 1004007 1012358 1021331 1031354
61308 1031354 1041769 1051578 1060297 1067773 1073690 1077836 1080585 1082664 1084531 1086307 1088148 1090243 1092474 1094383
61294A094383J146J97o93j260j251p82n67j433l622o605r583j1976j3431j3563
61280A030960j2147r712p627p022p654q285q170p562o747n549m228l812m615n152
61266I32678l778r77J228J947K072K220J702J35j328j479p36k30Q8J200L308N678
61250I43728P949J0495J3422J6376J9492K3391K7737L0852L1451L0130K8283K6107
61238A209413K2511J6809R720K675l147p107r196j0217j1327j2872j3896j3175
61226A180191j0673p651n347l864k342j06K455M112L848J704j458m994q968j3513
61212A133394j8058k1545k3326k3486k2359k0171j7264j4310j1950j0340r111
61201I41474p698n700l247j142l33r93k293l295l963m940o436p761q177p891p864
$$ plain form
61294 1094383 1095529 1095726 1095033 1093773 1092522 1091740 1091173 1089740 1086118 1079513 1069930 1057954 1044523 1030960
61280 1030960 1018813 1009101 1001474 994452 986798 978513 970343 962781 956034 950485 946257 942445 937830 932678
61266 932678 928900 927923 929151 931098 933170 935390 937092 937227 935899 934420 933684 933454 933542 934742 938050 943728
61250 943728 951677 962172 975594 991970 1011462 1034853 1062590 1093442 1124893 1155023 1183306 1209413
61238 1209413 1231924 1248733 1258453 1261128 1257981 1250874 1241678 1231461 1220134 1207262 1193366 1180191
61226 1180191 1169518 1161867 1156520 1152656 1150314 1150208 1152663 1156775 1160623 1162327 1160869 1155875 1146907 1133394
61212 1133394 1115336 1093791 1070465 1046979 1024620 1004449 987185 972875 960925 950585 941474
61201 941474 933776 928076 924829 923687 923354 922361 920068 916773 912810 907870 901434 893673 885496 877605 869741
61186H69741q640r742j0353j0342j0217j0264j0248j0114j0387j1451j2708j3049
61174G42226j2098j0541r284q695q650q796q699q109p258o591o176n783n454n524
61160F30568n905n936n132l712k163p37M32J152J451J559J372L83j542l743n431
61145F02616o380o663o263n393m686m437m119l263k382k277k655k421j281j75
61131E50221J14JK13N44J60r38j564p51Q70J656R01l75q20l84K3J21N69J764L201
61112E55526M269M944N426N746O024O432O621N892M250K552J301J23j171k096
61098F05839k572l354m596n169m468l766m419n807o559o857p568p819n865k354
61084E34666k82j128l019l621k971k349j874q01P96K116K846L197L099K459J892
$$ plain form
61186 869741 861101 851359 841006 830664 820447 810183 799935 789821 779434 767983 755275 742226
61174 742226 730128 719587 710303 701608 692958 684162 675463 667354 660096 653505 647329 641546 636092 630568
61160 630568 624663 618727 613595 609883 607720 606983 607415 608567 610018 611577 612949 613332 611790 608047 602616
61145 602616 596236 589573 583310 577917 573231 568794 564675 561412 559030 556753 554098 551677 550396 550221
61131 550221 550335 550336 550549 551093 551253 550315 548751 548000 548870 550526 551427 551052 550232 549848 549871 549992 550561 552325 555526
61112 555526 559795 564739 570165 575911 581935 588367 594988 600880 605130 607682 608983 609106 607935 605839
61098 605839 603267 599913 595317 590148 585680 581914 577495 571688 565129 558272 550704 542885 537020 534666
61084 534666 534384 533256 530237 526616 523645 521296 519422 518621 519417 521533 524379 527576 530675 533134 535026
61069E35026K142K917L177K663K319L011M364N315N459N438N978O950P740Q271
61055F00770R045J0107J0812J1044J1885J4256J7435J9985K1747K3701K6075K7870
61043H04732K8494K8708K9478L0761L2027L3425L5896M0235M6176N2406N7836
61032A220174O3057O9646P7651Q5166R1807J01360J18950J46165J81099K22730
61022B377805K73062L35642M14911N16980O48005Q11714J010379J242571J485942
61013I117011J675842J715138J530382J133883O31113J63488j60103k90500k28700
61004A5287554j8597K46573M34455M24123J71459k64048p55133j175214j448738
60995A2902434j559869j533690j413950j246833j069105r01572p51240o19240
$$ plain form
61069 535026 537168 540085 543262 545925 548244 551255 555619 560934 566393 571831 577809 584759 592499 600770
61055 600770 609815 619922 630734 641778 653663 667919 685354 705339 727086 750787 776862 804732
61043 804732 833226 861934 891412 922173 954200 987625 1023521 1063756 1109932 1162338 1220174
61032 1220174 1283231 1352877 1430528 1515694 1607501 1708861 1827811 1973976 2155075 2377805
61022 2377805 2650867 2986509 3401420 3918400 4566405 5378119 6388498 7631069 9117011
61013 9117011 10792853 12507991 14038373 15172256 15803369 15966857 15806754 15516254 15287554
61004 15287554 15268957 15515530 15949985 16374108 16545567 16281519 15526386 14351172 12902434
60995 12902434 11342565 9808875 8394925 7148092 6078987 5177415 4426175 3806935
60987C806935n06349m12927l37326k76454k27319j87565j55472j30068j10718
60978A462737r6245q5003p5808o8208o1787n5941n0381m5084l9673l3739k7852
60967H23016k3352k0830j9600j8964j9108k0215k1498k1749k0573j8595j6644
60956F01888j5034j3437j1356q890o897o124o244o261n701m838l937k976k137
60943E08056j812j988k290k674l440m401m880m677m331m274m496n248p014r337
60929D47194j0604r876q222p441p861q273p657o152m312k356m13J005J316N55
60915C76903m55p95l37Q5m07j725k899l114k438j435m93K04M09l5p25q17J93J798
60897C63917K781K358R18m34r64p63k74J42J63l46r36q51r4L14k97j185j149j57
$$ plain form
60987 3806935 3300586 2887659 2550333 2273879 2046560 1858995 1703523 1573455 1462737
60978 1462737 1366492 1281489 1205681 1137473 1075686 1019745 969364 924280 884607 850868 823016
60967 823016 799664 778834 759234 740270 721162 700947 679449 657700 637127 618532 601888
60956 601888 586854 573417 562061 553171 546274 540150 533906 527645 521944 517106 513169 510193 508056
60943 508056 506244 504256 501966 499292 495852 491451 486571 481894 477563 473289 468793 463545 456531 447194
60929 447194 436590 426714 418492 411051 403190 394917 387260 381108 376796 374440 374027 375032 376348 376903
60915 376903 376448 375653 375316 375401 374994 373269 370370 367256 364818 363383 362890 363094 363503 363468 362743 361926 362119 363917
60897 363917 366698 369056 369974 369540 368576 367813 367539 367681 367844 367498 366562 365711 365617 365931 365634 364449 363300 363143
60879C63143Q22J319J780K473K899K648K158K164K664K774J558r44l472m488l656
60864C73842k131j234j153j213r17k59M83P38m6j554k597k635k614l393m196l697
60848C47424k009k23J376K947L584K163k62j118K52J798K009J875K637L500L135
60833C69088J987J448J673J750J294N10o31k003k711k146j182j062j599j632q60
60818C63924%N56R63J060N20k95p11q36j193j530j290j141k460n033o650n781
60802C40103l546k223k561l336l197k102j050r52j850l063l869l862k827q76J010
60787C05799J323l51k477l148k228j085o02m64j89K91J101K229K846K057O31M56
60771C06189J783K519J299j86N61L136M646L571J522R23K330M599O529P544P469
$$ plain form
60879 363143 363965 365284 367064 369537 372436 375084 377242 379406 382070 384844 386402 385458 381986 377498 373842
60864 373842 371711 370477 369324 368111 367194 366935 367418 368156 368110 366556 363959 361324 358710 355317 351121 347424
60848 347424 345415 345192 346568 349515 353099 355262 355000 353882 354134 355932 357941 359816 362453 365953 369088
60833 369088 371075 372523 374196 375946 377240 377750 377119 375116 372405 370259 369077 368015 366416 364784 363924
60818 363924 363924 364480 365443 366503 367023 366728 366017 365181 363988 362458 361168 360027 357567 352534 345884 340103
60802 340103 336557 334334 331773 328437 325240 323138 322088 321136 319286 316223 312354 308492 305665 304789 305799
60787 305799 307122 306771 304294 301146 298918 297833 297231 296767 296578 296869 297970 300199 303045 305102 305733 306189
60771 306189 307972 310491 311790 311604 312165 315301 319947 323518 325040 325963 328293 332892 339421 346965 354434
60756C54434O577N579N011M640L922K929K466L304N392P678Q592P094L666J86
60742D21470j615j629j198j528k566l458l773l961m631n494n490m172k774l054
60728C76127m921o117m993k868k382l937n314m959l936l825m204l676k310j399
60714C21286j308j198p98q45j557k073j830j331j101q66k93M00R58J383J365N25
60698C12717l54L56K747M505L607R43r42r78j05O70J171J227N27m56p18j67J51
60681C24901l85j114j267j086j249j817k301k345j842p75N50J406J253M41r0J94
60665C14474Q60J064M63n33j379j930k155j652j34J616K203J419P96J660L351
60650C20123M269M160M170M800N133M316K747J319L37k50k46L80R37N29q57k281
$$ plain form
60756 354434 361011 366590 371601 376241 380163 383092 385558 388862 394254 401932 410524 417618 421284 421470
60742 421470 419855 418226 417028 415500 412934 409476 405703 401742 397111 391617 386127 381955 379181 376127
60728 376127 371206 365089 360096 357228 354846 350909 345595 340636 336700 332875 328671 324995 322685 321286
60714 321286 319978 318780 317982 317137 315580 313507 311677 310346 309245 308379 308086 308486 309444 310827 312192 312717
60698 312717 312363 312719 315466 319971 323578 324521 323579 322601 322496 323166 324337 325564 326091 325635 324917 324750 324901
60681 324901 324516 323402 322135 321049 319800 317983 315682 313337 311495 310720 311270 312676 313929 314370 314280 314474
60665 314474 315334 316398 316861 316328 314949 313019 310864 309212 309078 310694 312897 314316 315112 316772 320123
60650 320123 324392 328552 332722 337522 342655 346971 349718 351037 351374 351124 350878 351258 352195 352724 351867 349586
60634C49586k860k521j781j073m60Q0L70K69J88Q91K555M400N582O064O162N720
60618C73172M481L101K740L608M671N010M611L601J630j311m091n337m877l656
60604C87353k400j090L47J491J856J372J51j731l858n195m949l773l410m603n881
60589C55680n139k302L89Q70o75k470l159k666j668q29l51J92J226K205J847j82
60573C42968k422l124k087l71J181K265K632K409K588L942N579N775M256K550
60559C68141J935K260L035M459O729R230J1128J2203J2831J3673J5646J9369K4292
60546E04931K8930L2303L4513L5793L5720L3685K9461K3123J5043O129k781j1767
60534G65083k0991k9026l3386l3295l0677k7653k4335j9992j5229j1730j0484
$$ plain form
60634 349586 346726 344205 342424 341351 340891 340971 341341 341610 341798 342689 345244 349644 355226 361290 367452 373172
60618 373172 377653 380754 383494 387102 391773 396783 401394 404995 406625 405314 401223 395886 391009 387353
60604 387353 384953 383863 384210 385701 387557 388929 389080 387349 383491 378296 373347 369574 366164 361561 355680
60589 355680 350541 348239 348628 349498 348823 346353 343194 340528 338860 338031 337680 337872 339098 341303 343150 342968
60573 342968 340546 337422 335335 334964 336145 338410 341042 343451 346039 349981 355560 361335 365591 368141
60559 368141 370076 372336 375371 379830 386559 395789 406917 419120 431951 445624 461270 480639 504931
60546 504931 533861 566164 600677 636470 672190 705875 735336 758459 773502 779631 776850 765083
60534 765083 744092 715066 681680 648385 617708 590055 565720 545728 530499 518769 508285
60523E08285j1138j2437j2594j0198n834k055o61o46K06K655N960R568J3259J6378
60509E00748J8580K0914K4656K9304L3281L6209L8728M0233L8815L3840K6960
60498H42268J9993J3389P474L585K998N735J1357J9924L1235M3748N5099O3225
60486A120030O6583O4139N5909M2907K5960N322j7847m0383n8592p0698p7282
60475A116048p9706p8835p5111o9010o1315n3184m5853l9900l5032l0744k6969
60464E20389k3797k0901j7687j3967j0325p846p307q266r105q546p048o031n803
60451C73760n297l945k587k005j772j320j114j656k213j764p10l64j076j980k450
60436C43507k656k740k476j845j120l36N26R41K61j165k169k186j675j103l56
$$ plain form
60523 508285 497147 484710 472116 461918 456084 454029 453368 452722 452928 455583 461543 471111 484370 500748
60509 500748 519328 540242 564898 594202 627483 663692 702420 742653 781468 815308 842268
60498 842268 862261 875650 883124 886709 889707 895442 906799 926723 957958 1001706 1056805 1120030
60486 1120030 1186613 1250752 1306661 1349568 1375528 1380850 1363003 1322620 1264028 1193330 1116048
60475 1116048 1036342 957507 882396 813386 752071 698887 653034 613134 578102 547358 520389
60464 520389 496592 475691 458004 444037 433712 425866 418559 410293 401188 392642 385594 379563 373760
60451 373760 368463 364518 361931 359926 358154 356834 355720 354064 351851 350087 349377 349013 347937 345957 343507
60436 343507 340851 338111 335635 333790 332670 332334 332860 333801 334062 332897 330728 328542 326867 325764 325408
60421C25408O49J580K098K094J453K87n83k68J037K349L320M238M688L651J455
60406C53456P2O58K083K886L387M552N873O113N464N220N550N442M732M448M758
60391D14694M334K506O35L01J177J817J785J773K061K143J840J741K208K719K605
60376D44339J936J272Q78O86Q10J554K738L494L176K200J462J142P92N65J234
60361D68278K593L031J732K85O15J963J848j10j484o88P54P79j50k56N71R91P41
60344D81493Q17J310J014n22k171l044l708m946o323o818o102m610k977j889j848
60329D39676k542l015k884k779l222l722l587k957k474k390k585l014l488l415
60315C97602k432r85J30O57R08J315K240L723N036N136M064L218L597M422M276
$$ plain form
60421 325408 326057 327637 329735 331829 333282 333569 332986 332718 333755 336104 339424 343662 348350 352001 353456
60406 353456 353528 354186 356269 359155 362542 367094 372967 379080 384544 389764 395314 400756 405488 409936 414694
60391 414694 419028 421534 422169 422470 423647 425464 427249 429022 431083 433226 435066 436807 439015 441734 444339
60376 444339 446275 447547 448425 449111 449921 451475 454213 457707 460883 463083 464545 465687 466479 467044 468278
60361 468278 470871 473902 475634 475919 476534 478497 480345 480235 478751 478063 478817 479596 479446 479190 479761 480752 481493
60344 481493 482310 483620 484634 484112 481941 478897 475189 470243 463920 457102 451000 446390 443413 441524 439676
60329 439676 437134 434119 431235 428456 425234 421512 417925 414968 412494 410104 407519 404505 401017 397602
60315 397602 395170 394185 394315 394972 395880 397195 399435 403158 408194 413330 417394 420612 424209 428631 432907
60300D32907K950J128j120m098p033q329p601o315n922o203n968m696k952j539
60286C75209p22j55N39J160J116M58J41P05J180K79j734l347l757l366k475r16
60270C64315P82J325L88p09p59j43J04r4M7J114L043N174O370N893M468L551L289
60253C98158K487J060P80K556M545M545L002J881J611J186N84Q17J777K194J860
60238D29043J966K941L802M084M699O154P650Q586R486J0572J0957J0219R483
60225E19642R834J0828J1675J2781J4821J7228J8954K0149K1829K4305K7087K9841
60213G38974L2484L4760L6673L8748M0824M1312L9021L5291L2706L1795L0462
60202A133050K6892K1664J6539J2331Q654N003J295k291n529q304j0644j2599
$$ plain form
60300 432907 435857 436985 435865 431767 424734 416405 408804 402489 396567 390364 384396 379700 376748 375209
60286 375209 374487 374332 374871 376031 377147 377605 377746 378451 379631 379910 378176 374829 371072 367706 365231 364315
60270 364315 365097 366422 366810 366101 365342 365199 365303 365209 365256 366370 369413 374587 380957 386850 391318 394869 398158
60253 398158 400645 401705 402485 405041 409586 414131 417133 419014 420625 421811 422395 423212 424989 427183 429043
60238 429043 431009 433950 437752 441836 446535 452689 460339 468925 478411 488983 499940 510159 519642
60225 519642 529476 540304 551979 564760 579581 596809 615763 635912 657741 682046 709133 738974
60213 738974 771458 806218 842891 881639 922463 963775 1002796 1038087 1070793 1102588 1133050
60202 1133050 1159942 1181606 1198145 1210476 1219130 1224133 1225428 1223137 1217608 1209304 1198660 1186061
60190A186061j4076j4859j4474j2098p363j696K225L272L427N551J0312J6379
60178A162661K2692K8831L3823L6869L9165M2731M7003M8860M6903M3419M0762
60167A593719L7828L2258K4650J8008J3518R127K695n340j3030j9377k4861l0172
60155A639023l5161l8880m0487m0070l8420l5918l2081k6658k0608j5368j1343
60144A304029p770l817P02N489R963J3450J5763J7447J9009K0132K0074J8624
60132A433095J6092J2816R270O216M008K036l32k552l573l429l066k657j308J363
60118A467979M483P238J0058J3960J9258K5431L1753L7718M3226M8607N4118N9320
60106A823149O3550O7042P0879P5516P9980Q2859Q3505Q2012P8653P3760O7577
$$ plain form
60190 1186061 1171985 1157126 1142652 1130554 1123191 1121495 1123720 1126992 1130419 1135970 1146282 1162661
60178 1162661 1185353 1214184 1248007 1284876 1324041 1366772 1413775 1462635 1509538 1552957 1593719
60167 1593719 1631547 1663805 1688455 1706463 1719981 1729108 1731803 1726463 1713433 1694056 1669195 1639023
60155 1639023 1603862 1564982 1524495 1484425 1446005 1410087 1378006 1351348 1330740 1315372 1304029
60144 1304029 1296259 1292442 1293144 1298633 1308596 1322046 1337809 1355256 1374265 1394397 1414471 1433095
60132 1433095 1449187 1462003 1471273 1477489 1481497 1483533 1483201 1480649 1477076 1473647 1470581 1467924 1466616 1467979
60118 1467979 1472462 1479700 1489758 1503718 1522976 1548407 1580160 1617878 1661104 1709711 1763829 1823149
60106 1823149 1886699 1953741 2024620 2100136 2180116 2262975 2346480 2428492 2507145 2580905 2648482
60095B648482N9817M9907L8076K5625J3657K074r751k1870l3907m5613n6375o4729
60083B605393o9403p0850p0891p0905p0946p0557o9403o6862o2075n5134m7765
60072A880602m1961l7983l4316k9762k5001k1728k0438j9687j7601j3792r481
60061A608852n988l578j730j6J549K771L551L893L775L011J468m20j583j357o08
60046A613590j228m210q665j3051j6745j9907k2324k3416k3419k3573k4590k5523
60034A406939k4868k2540j9959j7983j5634j1478n810m53L556P087J1300J5986
60022A326143K0372K4866L0604L7464M3709M7916N0271N1601N1946N0722M7583
60011A783197M2660L6399K9542K2592J4930N291o159j7051k5147l0847l6231m1965
$$ plain form
60095 2648482 2708299 2758206 2796282 2821907 2835564 2837638 2827887 2806017 2772110 2726497 2670122 2605393
60083 2605393 2535990 2465140 2394249 2323344 2252398 2181841 2112438 2045576 1983501 1928367 1880602
60072 1880602 1838641 1800658 1766342 1736580 1711579 1689851 1669413 1649726 1632125 1618333 1608852
60061 1608852 1602864 1599286 1597556 1597540 1599089 1601860 1605411 1609304 1613079 1616090 1617558 1617138 1615555 1614198 1613590
60046 1613590 1612362 1608152 1599487 1586436 1569691 1549784 1527460 1504044 1480625 1457052 1432462 1406939
60034 1406939 1382071 1359531 1339572 1321589 1305955 1294477 1288667 1288214 1291770 1298857 1310157 1326143
60022 1326143 1346515 1371381 1401985 1439449 1483158 1531074 1581345 1632946 1684892 1735614 1783197
60011 1783197 1825857 1862256 1891798 1914390 1929320 1934611 1928452 1911401 1886254 1855407 1819176 1777211
59999A777211m6525m8547m8555m7794m6424m3790l9810l5148l0274k5151j9891
59988A345302j4942j0430n794n26N026J0087J4656J9775K6331L3902M1272M7915
59976A512574N4333O0623O5386O6789O4678O0879N7181N3415M8051M0295L0892
59965B115096K0855J0273j044j2227k1721k8961l4867m0339m4991m7830m8547
59954A865697m7438m4682m0491l5616l0769k5642j9340j1722l708L631R627J4104
59942A633651J7910K2908L0077L7750M3199M5975M8001N0205N1161M9834M7491
59931B078162M5483M2882L8335L2851K8588K5571K1844J6635J1408P759N964N631
59919B361113O202O722O693P152R359J2408J4098J4336J5531J8821K2082K2985
$$ plain form
59999 1777211 1730686 1682139 1633584 1585790 1539366 1495576 1455766 1420618 1390344 1365193 1345302
59988 1345302 1330360 1319930 1314136 1313610 1318636 1328723 1343379 1363154 1389485 1423387 1464659 1512574
59976 1512574 1566907 1627530 1692916 1759705 1824383 1885262 1942443 1995858 2043909 2084204 2115096
59965 2115096 2135951 2146224 2145180 2132953 2111232 2082271 2047404 2007065 1962074 1914244 1865697
59954 1865697 1818259 1773577 1733086 1697470 1666701 1641059 1621719 1609997 1606289 1609920 1619547 1633651
59942 1633651 1651561 1674469 1704546 1742296 1785495 1831470 1879471 1929676 1980837 2030671 2078162
59931 2078162 2123645 2166527 2204862 2237713 2266301 2291872 2313716 2330351 2341759 2349518 2355482 2361113
59919 2361113 2367315 2374037 2380730 2387882 2397241 2409649 2423747 2438083 2453614 2472435 2494517 2517502
59907B517502K2157K1522K0971J8782J4564R750N269O40m500r550j4125j8721
59895B584261k3511k7432k9361k9618k9493k9637k9696k9318k8638k7537k5317
59884B274703k1842j8499j6944j6838j5916j2756q543n241k905j18L373N986O531
59871B170991N759N193N381N821N833M881K827L72j451k745n053r428j4851j9319
59857B154211k2038k3750k5214k6254k6413k5924k5887k7449l0645l3990l5730
59846A850917l5652l5067l4860l4402l2784l0252k7629k5089k2342j9500j6834
59835A536506j4189j1476r466r033r895j0891j1400j1625j1758j1653j1251j0578
59823A403291r566q492q076q320p841n596k777j425j467q51J275L438M389M837
$$ plain form
59907 2517502 2539659 2561181 2582152 2600934 2615498 2625248 2630517 2631157 2626657 2617107 2602982 2584261
59895 2584261 2560750 2533318 2503957 2474339 2444846 2415209 2385513 2356195 2327557 2300020 2274703
59884 2274703 2252861 2234362 2217418 2200580 2184664 2171908 2163365 2158124 2155219 2155101 2158474 2164460 2170991
59871 2170991 2176750 2181943 2187324 2193145 2198978 2203859 2206686 2207058 2205607 2202862 2197809 2188381 2173530 2154211
59857 2154211 2132173 2108423 2083209 2056955 2030542 2004618 1978731 1951282 1920637 1886647 1850917
59846 1850917 1815265 1780198 1745338 1710936 1678152 1647900 1620271 1595182 1572840 1553340 1536506
59835 1536506 1522317 1510841 1501375 1492342 1482447 1471556 1460156 1448531 1436773 1425120 1413869 1403291
59823 1403291 1393725 1385233 1377157 1368837 1360996 1355400 1352623 1351198 1349731 1348880 1350155 1353593 1357982 1362819
59809A362819N641O019M998L466L027L587L679K815J999J913K023J714J252J173
59795A406125J524K080K818L831N064O190O669O097M889M196M533M886M003K256
59781A465161J265J732K758L474M084M879N280M773L955L704L898L909L966M874
59767A517712O624Q347R729J1385J3657J6087J8532K1824K6491L1512L5432L8408
59755A755740M2208M8254N6512O6294P7162Q8661R9964J10231J18690J23605J21815
59744B709136J10307Q8492N8615K4349j0325m1261o4823p9412q6004q6717q3180
59733B539177p6527o8198n9711n1604m3244l3834k3414j3052m326J790N986J0327
59721B183370J6205K2800K8385L2836L7751M3921N0138N5121N9418O4428P0408
$$ plain form
59809 1362819 1368460 1374479 1379477 1382943 1385970 1389557 1393236 1396051 1398050 1399963 1401986 1403700 1404952 1406125
59795 1406125 1407649 1409729 1412547 1416378 1421442 1427632 1434301 1440398 1445287 1449483 1454016 1458902 1462905 1465161
59781 1465161 1466426 1468158 1470916 1474390 1478474 1483353 1488633 1493406 1497361 1501065 1504963 1508872 1512838 1517712
59767 1517712 1524336 1532683 1542412 1553797 1567454 1583541 1602073 1623897 1650388 1681900 1717332 1755740
59755 1755740 1797948 1846202 1902714 1969008 2046170 2134831 2234795 2345026 2463716 2587321 2709136
59744 2709136 2819443 2907935 2966550 2990899 2980574 2939313 2874490 2795078 2709074 2622357 2539177
59733 2539177 2462650 2394452 2334741 2283137 2239893 2206059 2182645 2169593 2165267 2167057 2173043 2183370
59721 2183370 2199575 2222375 2250760 2283596 2321347 2365268 2415406 2470527 2529945 2594373 2664781
59710B664781P6765Q3680R1934J01217J10096J17872J25378J33454J41682J49155
59700C796014J55603J61061J65064J66811J65702J61297J53279J42061J28817
59691E195709J14314R8296Q0773O3349M8185L5770K4830J4460N482p24l958n340
59679E671146o054o419o067m749k896j343m38L42J694L653N743P784J0127J3151
59665E685674J6769K0337K2936K4240K5368K8316L3845M0370M5693M9453N2860
59654F045861N6379N8941N9616N8838N7496N5723N3080M9200M3690L5977K5821
59643F600622J3527o47j6732l4362n2490p0176q7102j02882j16485j26873j33703
59632E872697j37105j37310j34942j30725j24278j14063r9623q3365o9140n9408
$$ plain form
59710 2664781 2741546 2825226 2917160 3018377 3128473 3246345 3371723 3505177 3646859 3796014
59700 3796014 3951617 4112678 4277742 4444553 4610255 4771552 4924831 5066892 5195709
59691 5195709 5310023 5408319 5489092 5552441 5600626 5636396 5661226 5675686 5681168 5680444 5676486 5671146
59679 5671146 5665092 5658673 5652606 5647857 5644961 5643618 5643180 5643522 5645216 5648869 5654612 5662396 5672523 5685674
59665 5685674 5702443 5722780 5745716 5769956 5795324 5823640 5857485 5897855 5943548 5993001 6045861
59654 6045861 6102240 6161181 6220797 6279635 6337131 6392854 6445934 6495134 6538824 6574801 6600622
59643 6600622 6614149 6613502 6596770 6562408 6509918 6439742 6352640 6249758 6133273 6006400 5872697
59632 5872697 5735592 5598282 5463340 5332615 5208337 5094274 4994651 4911286 4842146 4782738
59622D782738n4832n6191o5006q1738j04157j28206j50127j67650j79577j84890
59612C610364j82702j73457j59882j45742j32920j20431j06959r3576q2695p4861
59602B337139o8237o1352n4865n0026m6714m3925m1293l9040l6896l4093l0424
59591A830274k6632k3590k1500j9947j8447j6849j5355j4212j3414j2762j2160
59580A635406j1687j1395j1214j1044j0880j0889j1385j2436j3309j2869j1010
59569A507288r197q842r461r352p940o314n356m564l293k052j615j493m68J679
59555A439020L943N615P190R479J2385J4989J6593J7400J8254J9818K2072K4560
59543A611318K6983K9521L2765L7619M4866N3974O2029O4598N8613M4669K6577
$$ plain form
59622 4782738 4727906 4671715 4606709 4524971 4420814 4292608 4142481 3974831 3795254 3610364
59612 3610364 3427662 3254205 3094323 2948581 2815661 2695230 2588271 2494695 2412000 2337139
59602 2337139 2268902 2207550 2152685 2102659 2055945 2012020 1970727 1931687 1894791 1860698 1830274
59591 1830274 1803642 1780052 1758552 1738605 1720158 1703309 1687954 1673742 1660328 1647566 1635406
59580 1635406 1623719 1612324 1601110 1590066 1579186 1568297 1556912 1544476 1531167 1518298 1507288
59569 1507288 1498091 1489249 1479788 1470436 1462496 1456182 1450826 1446262 1442969 1440917 1439302 1437809 1437341 1439020
59555 1439020 1442963 1448578 1455768 1465247 1477632 1492621 1509214 1526614 1544868 1564686 1586758 1611318
59543 1611318 1638301 1667822 1700587 1738206 1783072 1837046 1899075 1963673 2022286 2066955 2093532
59532B093532Q908n003j3580j6742j5512j1511o438j790J391K901L329L231K389
59519B045105L15k642n255o788p907r767j2383j4578j5601j6088j6912j7756j7675
59506A902068j6862j6595j7139j6935j4735j1580r362q117o261l290n09J170K567
59493A784420M743P556J0590J4196J8602K3018K6767L0458L4781L9078M2495M5732
59481B082436M9788N3480N4386N2436N0443N0326N0490M8012M2143L4437K6405
59470B594782J8413J0454K765m421j1108j7474k3754k9828l4825l7789l8929l9471
59458B388815l9912l9473l7850l6268l5777l5534l4143l1913l0232k9313k8333
59447B010067k7441k7691k8830k9187k8300k7752k8491k9084k7992k6087k5369
$$ plain form
59532 2093532 2102440 2097437 2083857 2067115 2051603 2040092 2033654 2031864 2033255 2036156 2039485 2042716 2045105
59519 2045105 2045420 2042778 2037523 2030735 2022828 2013061 2000678 1986100 1970499 1954411 1937499 1919743 1902068
59506 1902068 1885206 1868611 1851472 1834537 1819802 1808222 1798860 1790743 1784482 1781192 1780683 1781853 1784420
59493 1784420 1789163 1796719 1807309 1821505 1840107 1863125 1889892 1920350 1955131 1994209 2036704 2082436
59481 2082436 2132224 2185704 2240090 2292526 2342969 2393295 2443785 2491797 2533940 2568377 2594782
59470 2594782 2613195 2623649 2626414 2621993 2610885 2593411 2569657 2539829 2505004 2467215 2428286 2388815
59458 2388815 2348903 2309430 2271580 2235312 2199535 2164001 2129858 2097945 2067713 2038400 2010067
59447 2010067 1982626 1954935 1926105 1896918 1868618 1840866 1812375 1783291 1755299 1729212 1703843
59436A703843k6209k7537k8993l1067l3408l4647l4063l2183k9730k7242k5539
59425A373225k5183k5193k3822k0986j8641j7984j7576j5156j0371m646J107P536
59413A202310J5646K4976L2726L4644K7777J3354l281j6212k2490k2453j7776
59402A269221r978M9J2132K5898L8758M5486M1492K6816O178j4744l2242m4391
59390A364675n0127m9703m5112l8950l2808k7059k1711j6870j2565q570m525k59
59378A056416L835O911Q512R304J0444J2265J4063J5287J6328J7877J9938K1818
59366A212998K2879K3196K3731K5678K9195L2813L4641L4291L3117L2534L2776
59355A537849L3492L4741L6924M0083M3735M7258N0370N3440N7254O2073O7072
$$ plain form
59436 1703843 1677634 1650097 1621104 1590037 1556629 1521982 1487919 1455736 1426006 1398764 1373225
59425 1373225 1348042 1322849 1299027 1278041 1259400 1241416 1223840 1208684 1198313 1193667 1194774 1202310
59413 1202310 1217956 1242932 1275658 1310302 1338079 1351433 1348152 1331940 1309450 1286997 1269221
59402 1269221 1259243 1259292 1271424 1297322 1336080 1381566 1423058 1449874 1456052 1441308 1409066 1364675
59390 1364675 1314548 1264845 1219733 1180783 1147975 1120916 1099205 1082335 1069770 1061200 1056675 1056416
59378 1056416 1060251 1067162 1075674 1084978 1095422 1107687 1121750 1137037 1153365 1171242 1191180 1212998
59366 1212998 1235877 1259073 1282804 1308482 1337677 1370490 1405131 1439422 1472539 1505073 1537849
59355 1537849 1571341 1606082 1643006 1683089 1726824 1774082 1824452 1877892 1935146 1997219 2064291
59344B064291P1329P5147P9531Q4440Q8726R2008R5256R9017J02258J03830J03902
59333C059735J03071J01094R7733R3807Q9977Q5077P7350O7074N6378M6657L7727
59322C915680K9540K2843J7469J1411K615r223k3216l8537n4194o8523q0154q9249
59310C636462r6818j03080j07286j09030j08911j07834j06230j04098j01304r7729
59300B594142r3363q8379q2968p7205p1339o5875o1012n6163n0662m4923m0142
59289A862111l6629l3169k8717k4261k1858k1806k1860j9953j6838j4973j5156
59278A606891j5616j4574j2368j0325q678o674m165j767K67K153L623M030L663
59265A546460L776M840N741N402M323L782M019M183L647K424M68k371n470p472
$$ plain form
59344 2064291 2135620 2210767 2290298 2374738 2463464 2555472 2650728 2749745 2852003 2955833 3059735
59333 3059735 3162806 3263900 3361633 3455440 3545417 3630494 3707844 3774918 3831296 3877953 3915680
59322 3915680 3945220 3968063 3985532 3996943 3999558 3990335 3967119 3928582 3874388 3805865 3725711 3636462
59310 3636462 3539644 3436564 3329278 3220248 3111337 3003503 2897273 2793175 2691871 2594142
59300 2594142 2500779 2412400 2329432 2252227 2180888 2115013 2054001 1997838 1947176 1902253 1862111
59289 1862111 1825482 1792313 1763596 1739335 1717477 1695671 1673811 1653858 1637020 1622047 1606891
59278 1606891 1591275 1576701 1564333 1554008 1545330 1538656 1534491 1532724 1532991 1535144 1538767 1542797 1546460
59265 1546460 1550236 1555076 1560817 1566219 1570542 1574324 1578343 1582526 1586173 1588597 1589065 1586694 1581224 1573752
59251A573752p824p784r102j1788j4013j4456j4108j4945j7092j8486j7703j6039
59239A410412j5798j7172j8239j7919j7312j7616j8087j7205j4969j2881j2079
59228A231135j2553j3822j5220j5592j3899j0615p614o263o139o075n716n433
59216A112194n198m414k911j416p31p73p78k57O51J851L758O611R542J1156J1218
59201A140503J1179J2533J5176J7983K0469K3080K6104K9268L2459L5900L9405
59190A404059M2335M4706M7515N1385N5550N8882O1367O3759O6129O7624O7596
59179B030907O6196O3764O0162N4961M7907L9243K9788K0486J1484J872r041k0442
59167B397287l0704l9155m6268n2193n6378n8994o1317o3711o4345o1378n5902
$$ plain form
59251 1573752 1565928 1558144 1549042 1537254 1523241 1508785 1494677 1479732 1462640 1444154 1426451 1410412
59239 1410412 1394614 1377442 1359203 1341284 1323972 1306356 1288269 1271064 1256095 1243214 1231135
59228 1231135 1218582 1204760 1189540 1173948 1160049 1149434 1141820 1135557 1129418 1123343 1117627 1112194
59216 1112194 1106996 1102582 1099671 1098255 1097524 1096751 1095973 1095716 1096367 1098218 1101976 1108587 1118129 1129285 1140503
59201 1140503 1151682 1164215 1179391 1197374 1217843 1240923 1267027 1296295 1328754 1364654 1404059
59190 1404059 1446394 1491100 1538615 1590000 1645550 1704432 1765799 1829558 1895687 1963311 2030907
59179 2030907 2097103 2160867 2221029 2275990 2323897 2363140 2392928 2413414 2424898 2426770 2417729 2397287
59167 2397287 2366583 2327428 2281160 2228967 2172589 2113595 2052278 1988567 1924222 1862844 1806942
59156A806942n1159m8790m7246m4265l9697l5107l1591k8879k6250k3458k0890
59145A409610j9235j8805j8797j7680j4885j1733r873r191q262o716n892o687
59133A261854p939p824o146m195k767j470L3J198J471J162R68J101J387J813K468
59118A243114L179L728M346N485P067Q312Q375P057M971L180K525K991L711L757
59104A311798K875J359m21k034k905k844k561k957l917m413l995l404l450l893
59090A279238m028l854l928m270m154l030j248L28J094J053N63k0n72j023j164
59075A254985p98j29L24K64r6m20n61n00l00k57p04j505k190k701l430m384n010
59058A232588n166n453o107o552o631p212q584r366q485p234p538q791q656o894
$$ plain form
59156 1806942 1755783 1706993 1659747 1615482 1575785 1540678 1509087 1480208 1453958 1430500 1409610
59145 1409610 1390375 1371570 1352773 1335093 1320208 1308475 1298602 1289411 1281149 1274433 1268541 1261854
59133 1261854 1253915 1246091 1239945 1235750 1232983 1231513 1231546 1232744 1234215 1235377 1236345 1237446 1238833 1240646 1243114
59118 1243114 1246293 1250021 1254367 1259852 1266919 1275231 1283606 1290663 1295634 1298814 1301339 1304330 1308041 1311798
59104 1311798 1314673 1316032 1315611 1313577 1310672 1307828 1305267 1302310 1298393 1293980 1289985 1286581 1283131 1279238
59090 1279238 1275210 1271356 1267428 1263158 1259004 1255974 1254726 1255054 1256148 1257201 1257764 1257744 1257172 1256149 1254985
59075 1254985 1254187 1254058 1254382 1254646 1254550 1254130 1253569 1253069 1252769 1252512 1251808 1250303 1248113 1245412 1241982 1237598 1232588
59058 1232588 1227422 1221969 1215862 1209310 1202679 1195467 1186883 1177517 1169032 1161798 1154260 1145469 1136813 1129919
59044A129919n905o883p906p148n943o767r503j1747j2133j1479j0942j0651j0247
59031A012665r530q396p139o748p847r370r370p394n237m882o337p803p607n735
59017I09270l703l013l625m241m038l577l658m122m441m745n241n316m425l410
59003H51715l572m606m894l853k648k385k949l870m965n698n164l477j999j514
58989H00121j220l13O31P65N45R66J967K832L591M786O145O902P268Q342J0325
58974H53653J2024J2545J2526J3111J4357J5374J5652J5545J5473J5151J3982
58963A009393J2049J0385J0027J0817J1396J0541Q367O117M868M557M201L044
58951A105762J471O26R32J311L55j886l934m604m048l032k038j402j532k403l286
$$ plain form
59044 1129919 1124014 1117131 1109225 1102077 1096134 1089367 1079864 1068117 1055984 1044505 1033563 1022912 1012665
59031 1012665 1003135 994739 987600 980852 973005 963635 954265 946871 941634 936752 930415 922612 915005 909270
59017 909270 905567 902554 898929 894688 890650 887073 883415 879293 874852 870107 864866 859550 855125 851715
59003 851715 848143 843537 838643 834790 832142 829757 826808 822938 817973 812275 807111 803634 801635 800121
58989 800121 798901 798588 799219 799984 800529 801495 803462 806294 809885 814671 820816 827718 834986 843328 853653
58974 853653 865677 878222 890748 903859 918216 933590 949242 964787 980260 995411 1009393
58963 1009393 1021442 1031827 1041854 1052671 1064067 1074608 1082975 1089092 1093960 1098517 1102718 1105762
58951 1105762 1107233 1107859 1108791 1110102 1110457 1108571 1104637 1100033 1095985 1092953 1090915 1089513 1087981 1085578 1082292
58936A082292l373k368l09K478N027O269O390O783Q065R123R029Q812J0040J2354
58922A160612J3965J4195J4061J4453J5228J6266J7988K0318K2240K2997K2982
58911A355305K3105K3923K5543K7709K9854L1833L4550L8795M3555M6750M7900
58900A728822M8590M9802N0275M8381M4356L9514L4429K9279K5042K2781K2072
58889B143343K1595K1151K1843K4244K7473L0228L1853L2363L2322L2749L4311
58878B453475L6395L7762L8159L8495L9286L9862L9545L8852L8836L9547L9682
58867B879896L7748L3427K7721K1767J5609Q664J375m472p837r991j2958j6858
58855B974091k0152k2226k4012k5906k6855k6406k6175k7950l1205l3783l4568
$$ plain form
58936 1082292 1078919 1076551 1076242 1078720 1083747 1090016 1096406 1103189 1111254 1120377 1129406 1138218 1148258 1160612
58922 1160612 1174577 1188772 1202833 1217286 1232514 1248780 1266768 1287086 1309326 1332323 1355305
58911 1355305 1378410 1402333 1427876 1455585 1485439 1517272 1551822 1590617 1634172 1680922 1728822
58900 1728822 1777412 1827214 1877489 1925870 1970226 2009740 2044169 2073448 2098490 2121271 2143343
58889 2143343 2164938 2186089 2207932 2232176 2259649 2289877 2321730 2354093 2386415 2419164 2453475
58878 2453475 2489870 2527632 2565791 2604286 2643572 2683434 2722979 2761831 2800667 2840214 2879896
58867 2879896 2917644 2951071 2978792 3000559 3016168 3024832 3026207 3021735 3013898 3003907 2990949 2974091
58855 2974091 2953939 2931713 2907701 2881795 2854940 2828534 2802359 2774409 2743204 2709421 2674853
58844B674853l4337l4268l4720l5452l6124l6438l6415l6554l7243l8051l8125
58833B277126l7258l5938l4453l2585l0351k8403k7326k6784k5736k3534k0648
58822A954110j8234j6991j6515j5857j4408j2086q994n544k640r06K39J838L739
58809A847751M867N343O688R210J0753R549P055O199P671R837J1693J3653J5539
58796A965808J6168J5588J5633J7300J9282K0145K0457K1499K3151K4517K5746
58785B185294K7633K9910L1374L1687L1862L2943L4951L7021L8018L7234L5174
58774B553101L3348L2608L1998L0045K6879K4071K2445K0981J8145J3619Q432
58763B815672L809J76k903n941q859j1304j3572j6539k0419k4285k7223k9411
$$ plain form
58844 2674853 2640516 2606248 2571528 2536076 2499952 2463514 2427099 2390545 2353302 2315251 2277126
58833 2277126 2239868 2203930 2169477 2136892 2106541 2078138 2050812 2024028 1998292 1974758 1954110
58822 1954110 1935876 1918885 1902370 1886513 1872105 1860019 1851025 1845481 1842841 1841935 1842174 1844012 1847751
58809 1847751 1852618 1857961 1864649 1873859 1884612 1894161 1901216 1907415 1915086 1924923 1936616 1950269 1965808
58796 1965808 1981976 1997564 2013197 2030497 2049779 2069924 2090381 2111880 2135031 2159548 2185294
58785 2185294 2212927 2242837 2274211 2305898 2337760 2370703 2405654 2442675 2480693 2517927 2553101
58774 2553101 2586449 2619057 2651055 2681100 2707979 2732050 2754495 2775476 2793621 2807240 2815672
58763 2815672 2819481 2819657 2816754 2810813 2801954 2790650 2777078 2760539 2740120 2715835 2688612 2659201
58751B659201l1444l3344l5016l6974l9612m2193m3694m4326m5068m5869m5566
58740B216095m3743m1490l9939l9098l8462l7885l7358l6720l6081l5941l6363
58729A793015l6536l5657l3852l1898l0369k9465k9222k9350k8982k7142k3723
58718A456819j9895j7333j6721j7061j6782j5518j4202j3286j1948r744p969p977
58706A288383q821q195n627l133k522l568n257p437j0436j4269j8849k4048k8856
58693A147365l1547l1461k9763k7824k5883k3900k2411k1382j9489j5979j2337
58682H85389j0507j0068q879o210l459j800o55J027L386O013Q575J0532J1069
58669H84413R933P654M694J004l257p333j0702j3577j6149j7899j8200j7172j5514
$$ plain form
58751 2659201 2627757 2594413 2559397 2522423 2482811 2440618 2396924 2352598 2307530 2261661 2216095
58740 2216095 2172352 2130862 2090923 2051825 2013363 1975478 1938120 1901400 1865319 1829378 1793015
58729 1793015 1756479 1720822 1686970 1655072 1624703 1595238 1566016 1536666 1507684 1480542 1456819
58718 1456819 1436924 1419591 1402870 1385809 1369027 1353509 1339307 1326021 1314073 1304329 1296360 1288383
58706 1288383 1279562 1271367 1265740 1262607 1260085 1256517 1251260 1243823 1233387 1219118 1200269 1176221 1147365
58693 1147365 1115818 1084357 1054594 1026770 1000887 976987 954576 933194 913705 897726 885389
58682 885389 874882 864814 855935 849725 846266 844466 843811 844838 848224 854237 862812 873344 884413
58669 884413 894346 902000 906694 907698 904441 897108 886406 872829 856680 838781 820581 803409 787895
58656G87895j3893j2805j2459j2402j1743j0209q532p311o105m473l239l635n256
58643F75833o146n249l690l063l288l142k262j495j325j156l82O93J558K290L076
58628F52252L519L217K628K609L277M178N233O688Q111Q426P267N449L928L014
58614G19796K849L809N842Q023R368R653R210Q455Q020Q586R950J0903J0663R924
58600H35051R753R987R688Q730P956P843P907P551O719N708M959N092O446Q413
58586I41803R758R872R424R636J1089J3143J4364J3767J1902J0496J0600J1530
58574A077384J1894J1247J0169R268Q818Q873Q979Q223O483N074N114N765N364
58561A182655L841K471J514L6j842k596j905j601k921m605n141n342o889r412
$$ plain form
58656 787895 774002 761197 748738 736336 724593 714384 705852 698541 692436 687963 684724 681089 675833
58643 675833 669687 664438 660748 657685 654397 651255 648993 647498 646173 645017 644635 645328 646886 649176 652252
58628 652252 655771 658988 661616 664225 667502 671680 676913 683601 691712 700138 707405 712854 716782 719796
58614 719796 722645 726454 732296 740319 749687 759340 768550 777005 785025 793611 803561 814464 825127 835051
58600 835051 844804 854791 864479 873209 881165 889008 896915 904466 911185 916893 921852 926944 933390 941803
58586 941803 951561 961433 970857 980493 991582 1004725 1019089 1032856 1044758 1055254 1065854 1077384
58574 1077384 1089278 1100525 1110694 1119962 1128780 1137653 1146632 1154855 1161338 1166412 1171526 1177291 1182655
58561 1182655 1186496 1188967 1190481 1190517 1188675 1186079 1184174 1182573 1179652 1175047 1169906 1164564 1157675 1148263
58547A148263j1110j1497j1597j1811j1629j1391j2218j3904j4677j3691j2146
58536A012592j1217j0447r171q091q096q639q641q245q143p910o583m644l685
58523I09080m031m268l546k801k948l266k704j818k021l371m483m497l863l061
58509H62402j771J61J868K441K266K594L854N121N339M608L908L836M079M166
58495I04872M313N077O303P015O622N765N490O020O894P952R211R872Q681N764
58481I99851L092K292K601K005M3j691j801p98o0J6N7M10P28P75Q55J167J346
58464A010888J141J099J925L241L820L155K128J736J797J622J433K142L791N214
58450A045132N507N095M920N207N551N773N994O115N836N313N286O280P800Q616
$$ plain form
58547 1148263 1137153 1125656 1114059 1102248 1090619 1079228 1067010 1053106 1038429 1024738 1012592
58536 1012592 1001375 990928 981757 973666 965570 956931 948290 940045 931902 923992 917409 912765 909080
58523 909080 905049 900781 897235 894434 891486 888220 885516 883698 881677 878306 873823 869326 865463 862402
58509 862402 860631 860792 862660 865101 867367 869961 873815 878936 884275 888883 892791 896627 900706 904872
58495 904872 909185 914262 920565 927580 934202 939967 945457 951477 958371 966323 975534 985406 994087 999851
58481 999851 1002943 1005235 1007836 1009841 1009884 1008193 1006392 1005594 1005534 1005550 1005607 1006017 1006745 1007520 1008375 1009542 1010888
58464 1010888 1012029 1013128 1015053 1018294 1022114 1025269 1027397 1029133 1030930 1032552 1033985 1036127 1039918 1045132
58450 1045132 1050639 1055734 1060654 1065861 1071412 1077185 1083179 1089294 1095130 1100443 1105729 1112009 1119809 1128425
58436A128425P973O447N313N056M992M547M357N350P129Q207P882O997O711P297
58422A216683Q378R562J0441J0688J0530J0576J0800J0422R149P862P540Q228
58410A330859R478J1131J2897J3909J3569J2507J1994J2552J3656J4441J4275
58399A471268J3076J1650J1235J2233J3791J5025J5953J6760J7010J6547J6326
58388A630874J7186J8341J8323J7109J6153J6400J7410J8415J9223J9966K0758
58377A830158K1659K2350K2105K0748J9360J9062J9471J9457J9136J9748K1481
58366B054735K2867K2832K2079K1845K2233K2541K2500K2442K2627K3145K4122
58355B303968K5554K6949K7624K7469K7250K7913K9464L0743L0787L0324L1025
$$ plain form
58436 1128425 1136398 1142845 1148158 1153214 1158206 1162753 1167110 1172460 1179589 1187796 1195678 1202675 1209386 1216683
58422 1216683 1225061 1234623 1245064 1255752 1266282 1276858 1287658 1298080 1307229 1315091 1322631 1330859
58410 1330859 1340337 1351468 1364365 1378274 1391843 1404350 1416344 1428896 1442552 1456993 1471268
58399 1471268 1484344 1495994 1507229 1519462 1533253 1548278 1564231 1580991 1598001 1614548 1630874
58388 1630874 1648060 1666401 1684724 1701833 1717986 1734386 1751796 1770211 1789434 1809400 1830158
58377 1830158 1851817 1874167 1896272 1917020 1936380 1955442 1974913 1994370 2013506 2033254 2054735
58366 2054735 2077602 2100434 2122513 2144358 2166591 2189132 2211632 2234074 2256701 2279846 2303968
58355 2303968 2329522 2356471 2384095 2411564 2438814 2466727 2496191 2526934 2557721 2588045 2619070
58344B619070L3091L4636L4275L3287L4032L6793L9542M0552M0005L9045L8525
58333C022853L8909M0341M2384M4297M5772M6891M7606M7901M8280M9271N0618
58322C525123N1650N2375N3416N5051N7076N9264O1204O2090O1676O1098O1789
58311D161812O3835O6286O8581P0634P2146P3178P4827P7920Q1468Q3967Q5750
58300D980404Q8302R1608R4224R5897R7952J00728J02774J03278J03641J05736
58290E964544J09885J15076J20081J24043J27048J30327J34735J39236J42318
58281G107293J44574J47998J52892J57660J61823J66803J73203J79656J85243
58272H577145J91058J98288K06510K14844K23173K31463K39347K47034K55220
$$ plain form
58344 2619070 2652161 2686797 2721072 2754359 2788391 2825184 2864726 2905278 2945283 2984328 3022853
58333 3022853 3061762 3102103 3144487 3188784 3234556 3281447 3329053 3376954 3425234 3474505 3525123
58322 3525123 3576773 3629148 3682564 3737615 3794691 3853955 3915159 3977249 4038925 4100023 4161812
58311 4161812 4225647 4291933 4360514 4431148 4503294 4576472 4651299 4729219 4810687 4894654 4980404
58300 4980404 5068706 5160314 5254538 5350435 5448387 5549115 5651889 5755167 5858808 5964544
58290 5964544 6074429 6189505 6309586 6433629 6560677 6691004 6825739 6964975 7107293
58281 7107293 7251867 7399865 7552757 7710417 7872240 8039043 8212246 8391902 8577145
58272 8577145 8768203 8966491 9173001 9387845 9611018 9842481 10081828 10328862 10584082
58263A0584082K63845K72607K82592K95189L09297L22296L34041L46986L61882
58254A3372817L76645L90594M06236M25137M45259M64509M84115N06185N30468
58245A7401965N55839N82647O11384O41260O72210P06057P43700P83584Q24916
58236B3523562Q69720R19484R72761J028637J089551J157725J231624J309297
58228C2102361J392555J484448J584975J692687J808102J932257K064560K205806
58220D6267751K361063K536156K733907K956957L210795L500053L825594M189786
58212G1582062M601312N070997N608250O226361O944571P778962Q739691R841181
58204A26393387J1089186J2422430J3671293J4623793J5179085J5446948J5690914
$$ plain form
58263 10584082 10847927 11120534 11403126 11698315 12007612 12329908 12663949 13010935 13372817
58254 13372817 13749462 14140056 14546292 14971429 15416688 15881197 16365312 16871497 17401965
58245 17401965 17957804 18540451 19151835 19793095 20465305 21171362 21915062 22698646 23523562
58236 23523562 24393282 25312766 26285527 27314164 28403715 29561440 30793064 32102361
58228 32102361 33494916 34979364 36564339 38257026 40065128 41997385 44061945 46267751
58220 46267751 48628814 51164970 53898877 56855834 60066629 63566682 67392276 71582062
58212 71582062 76183374 81254371 86862621 93088982 100033553 107812515 116552206 126393387
58204 126393387 137482573 149905003 163576296 178200089 193379174 208826122 224517036
58197B24517036J6172142J7030160J8260702J9749691K1313080K2733336K3792530
58190C63568677K4289565K4041921K2893748K0741945J7565776J3443317Q553621
58183D95098570L165796k390882p774676j2680525j6874593k0211249k2635751
58176D15696690k4173879k4911312k4970052k4487266k3597921k2423269k1066953
58169B50066038j9615220j8135768j6676721j5270275j3938901j2697592j1552588
58162A42178973j0502949r545457q677019p893207p187653o553732n985029n474236
58154H0359691n013913m598506m223818l884842l576575l296677l044556k817684
58146D9903120k611372k422444k250444k094761j953060j823308j704864j596735
$$ plain form
58197 224517036 240689178 257719338 275980040 295729731 317042811 339776147 363568677
58190 363568677 387858242 411900163 434793911 455535856 473101632 486544949 495098570
58183 495098570 498264366 495873484 488098808 475418283 458543690 438332441 415696690
58176 415696690 391522811 366611499 341641447 317154181 293556260 271132991 250066038
58169 250066038 230450818 212315050 195638329 180368054 166429153 153731561 142178973
58162 142178973 131676024 122130567 113453548 105560341 98372688 91818956 85833927 80359691
58154 80359691 75345778 70747272 66523454 62638612 59062037 55765360 52720804 49903120
58146 49903120 47291748 44869304 42618860 40524099 38571039 36747731 35042867 33446132
58138C3446132j496905j404234j319044j241092j168818j101192j038386r80058
58130B3696403r25019q73181q25716p82606p42086p03348o67569o35304o05077
58121A6936497n75818n48571n24249n01571m78932m56800m36543m18122m00596
58112A2595295l83874l68335l53463l38528l24039l11081k99504k87986k75799
58103I652686k63567k52289k42275k33073k24168k15756k08650k02970j97389
58094G612549j90611j83284j77116j72278j67279j61590j56497j52751j49103
58085F102040j44328j39131j34920j31678j28360j24489j20321j16200j12565
58076D950048j09876j07701j04753j00630r6592r3777r1637q9139q6470q4303
$$ plain form
58138 33446132 31949227 30544993 29225949 27984857 26816039 25714847 24676461 23696403
58130 23696403 22771384 21898203 21072487 20289881 19547795 18844447 18176878 17541574 16936497
58121 16936497 16360679 15812108 15287859 14786288 14307356 13850556 13414013 12995891 12595295
58112 12595295 12211421 11843086 11489623 11151095 10827056 10515975 10216471 9928485 9652686
58103 9652686 9389119 9136830 8894555 8661482 8437314 8221558 8012908 7809938 7612549
58094 7612549 7421938 7238654 7061538 6889260 6721981 6560391 6403894 6251143 6102040
58085 6102040 5957712 5818581 5683661 5551983 5423623 5299134 5178813 5062613 4950048
58076 4950048 4840172 4732471 4627718 4527088 4430496 4336719 4245082 4155943 4069473 3985170
58066C985170q2279p9559p6372p3626p1435o9271o7201o5705o4506o2893o1123
58055C211200o0170o0009n9355n7471n5211n3743n3142n2751n2210n1351m9581
58044B606206m6415m2631m0026l9590m0444m1042m0900m0481l9781l8189l5800
58033B160907l3660l2291l1175l0259l0527l2044l2860l1531k9666k9824l1554
58022A815516l1914k9843k7568k7111k7668k7440k6187k4688k3115k1281j9601
58011A529100j8698j8634j9126j9781j9855j8799j7440j7276j8178j8293j6701
58000A326319j4571j3097j2088j1510j2304j4249j5060j3433j1234j0644j0846
57989A187283r958q730r237j0817j0541p686m748l633l585l559l941m789m689
$$ plain form
58066 3985170 3902891 3823332 3746960 3673334 3601899 3532628 3465427 3399722 3335216 3272323 3211200
58055 3211200 3151030 3091021 3031666 2974195 2918984 2865241 2812099 2759348 2707138 2655787 2606206
58044 2606206 2559791 2517160 2477134 2437544 2397100 2356058 2315158 2274677 2234896 2196707 2160907
58033 2160907 2127247 2094956 2063781 2033522 2002995 1970951 1938091 1906560 1876894 1847070 1815516
58022 1815516 1783602 1753759 1726191 1699080 1671412 1643972 1617785 1593097 1569982 1548701 1529100
58011 1529100 1510402 1491768 1472642 1452861 1433006 1414207 1396767 1379491 1361313 1343020 1326319
58000 1326319 1311748 1298651 1286563 1275053 1262749 1248500 1233440 1220007 1208773 1198129 1187283
57989 1187283 1177325 1168595 1159358 1148541 1138000 1130314 1125566 1121933 1118348 1114789 1110848 1106059 1101370
57976A101370k913r60m06o58l10N02P08K95J5l35j649l738n275n682n860o719
57960A068385p967q852r384j0247j1692j3155j3963j4157j4386j4986j5425j4847
57948I19324j3217j1588j1188j2299j4119j5439j5401j3846j1312q703o836o035
57936G79341n982n917n197l946l020l098l869m484m801n688p727j0022j0950j0155
57922F94485r102r307j0493j1153j0588r605r114q970q548p686o533n101l641
57909E84644k918l240l677l089j578j45P34J231J284P29N1k20o46k056l747m110
57893E63247l172k785l816m847m431l102k213k224l031m631o393o988o170n472
57879E03972n969o781p018p677r763j1893j1922j0174q789q400p638n823m054
$$ plain form
57976 1101370 1098457 1097497 1097091 1096433 1096123 1096625 1097333 1097628 1097643 1097308 1095659 1091921 1086646 1080964 1075104 1068385
57960 1068385 1060418 1051566 1042182 1031935 1020243 1007088 993125 978968 964582 949596 934171 919324
57948 919324 906107 894519 883331 871032 856913 841474 826073 812227 800915 792212 785376 779341
57936 779341 773359 767442 762245 758299 755279 752181 748312 743828 739027 733339 725612 715590 704640 694485
57922 694485 685383 676076 665583 654430 643842 634237 625123 616153 607605 599919 593386 588285 584644
57909 584644 581726 578486 574809 571720 570142 569997 570731 571962 573246 573975 574026 573806 573160 571104 567357 563247
57893 563247 560075 557290 553474 548627 544196 541094 538881 536657 533626 528995 522602 515614 509444 503972
57879 503972 498003 491222 484204 476527 466764 454871 442949 432775 423986 415586 407948 402125 398071
57866C98071l418l834m800n693n306k769P78L061L426L364M034M812M627L301
57852C99654J246q08j556j54K126K758J015j191j964j394m36M41O78o51l211m810
57836C91743l637l67K838M463M183K543J034J236K794L339J448j538l679m996
57822D01404o378p379p046o012n541n206l799k168k586n091o943o555n625o045
57808C25030o636n028j666L53n90k521k503j79K255K992K464K203K741L340L447
57793C25702L526M161N024N242M473L087J607M39j30j77j77l27j73N35R81J51
57777C53944j618k952l175k811k329j619r81j401l036m508m623m046m100m648
57763C12097m508l700l711n291p250p977p052m937k152L44J071l41j991j515J042
$$ plain form
57866 398071 394653 390819 386019 380326 375020 372251 373029 376090 379516 382880 386914 391726 396353 399654
57852 399654 400900 400092 398536 398382 400508 403266 404281 403090 401126 399732 399296 399737 400415 399764 396553 391743
57836 391743 388106 387739 390577 395040 399223 401766 402800 404036 406830 410169 411617 410079 406400 401404
57822 401404 395026 387647 380601 374589 369048 363842 360043 357875 355289 350198 343255 336700 331075 325030
57808 325030 318394 313366 311700 312053 311463 308942 306439 306260 308515 311507 313971 316174 318915 322255 325702
57793 325702 329228 333389 338413 343655 348128 351215 352822 353261 353131 352954 352777 352450 352277 352812 353793 353944
57777 353944 352326 349374 346199 343388 341059 339440 338459 337058 334022 329514 324891 320845 316745 312097
57763 312097 307589 303889 300178 294887 287637 279660 272608 267671 265519 265863 266934 266593 264602 263087 264129
57748B64129L362L808L034K452K413K493K502K393J850Q77K99Q97K368L688M112
57733C00677L447J939N25M87J991L563L888L495L613M054L703K715K361K728K341
57718C41527N59j255j711j176p23n65m70p97j913l263l945l744k933j740p07p57
57702C16387k003l187l260k737k471j946k68J747K168N55j413k141j618n25Q43
57687C00131K245L099L129K847K917L485M367N382O326P165Q391J0570J3537J6680
57673C90271K0089K4515L0033L5795M1697M9238N9709P1725Q1403Q4696P9065
57662I68236O3704L9659J0545j7779l9504n1756n5415n3373m8180m1274l3605
57651G41258k6002j8765j1829n676j340J050K941N580Q274R590R695J0016J0711
$$ plain form
57748 264129 267491 271299 274333 276785 279198 281691 284193 286586 288436 289313 289612 290509 292877 296565 300677
57733 300677 304124 306063 306588 307075 309066 312629 316517 320012 323625 327679 331382 334097 336458 339186 341527
57718 341527 342086 340831 339120 337944 337221 336656 336186 335389 333476 330213 326268 322524 319591 317851 317144 316387
57702 316387 314384 311197 307937 305200 302729 300783 300515 302262 304430 304985 303572 301431 299813 299288 300131
57687 300131 302376 305475 308604 311451 314368 317853 322220 327602 333928 341093 349484 360054 373591 390271
57673 390271 410360 434875 464908 500703 542400 591638 651347 723072 804475 889171 968236
57662 968236 1031940 1071599 1082144 1064365 1024861 973105 917690 864317 816137 774863 741258
57651 741258 715256 696491 684662 678986 677646 678696 681637 687217 695491 705081 714776 724792 735503
57638G35503J0333Q433O768O966Q368R283R257Q799P805N826L526K255K094J543
57624H26759n83l867p074r399j0690j1147j1112j0770r964q739p862q100r045
57611G18407r459q836p813o922n951m873m408m921n495m978l538k321j873j646
57597F45373j024o8P76J189J050N64L57R82K093K653K258J816K535M351N846N684
57581F76435L971K212K037L827O229P186N784L150J210M80l26k313m692n834n692
57566F93664o004p847j0040j0731r866r055r375j0358j1200j1913j2797j3529
57554E70949j3395j2185j0503r348r477j0814j2332j2918j2478j1738j0860r092
57542D35809o128l096j516j769l072m400m925m222k987k806m211n504m794k753
$$ plain form
57638 735503 745836 754269 761037 768003 776371 785654 794911 803710 811515 817341 820867 823122 825216 826759
57624 826759 826176 822309 815235 805836 795146 783999 772887 762117 752153 743414 735552 727452 718407
57611 718407 708948 700112 692299 685377 679426 674553 670145 665224 659729 654751 651213 648892 647019 645373
57597 645373 644349 644281 645057 646246 647296 647860 648217 649199 651292 653945 656203 658019 660554 664905 670751 676435
57581 676435 680406 682618 684655 688482 694711 701897 707681 710831 712041 712521 712195 709882 705190 699356 693664
57566 693664 687660 679813 669773 659042 649176 640121 630746 620388 609188 597275 584478 570949
57554 570949 557554 545369 534866 525518 516041 505227 492895 479977 467499 455761 444901 435809
57542 435809 429681 426585 425069 423300 420228 415828 410903 406681 403694 400888 396677 391173 386379 383626
57528C83626j739k377k806j656L7Q13J033J849L048L397K569J477J019J472K717
57513C94479M096M429L285J825J437J904K116K034K459L036K288J41j239k2L035
57498D25303N828P421Q324Q943R020Q372P262N966M618L570L428M436O006O950
57484E15447O442M878L635L596M128M048L353L081L563L847L191K037J011j49
57470E62108j883l843n399o516p365p713p496p362p738p996p501o917p196p781
57456D69402p243n626m546m799n282m788l668k896k546k076j410q49l01N25J417
57441D25314J822J747J861K696M001M978M933L854K452J630J783K648L897N499
57427D69115P374Q921R236P906N573L619L043L451L386J973rj021o07K10K78n82
$$ plain form
57528 383626 381887 379510 376704 375048 375085 375898 376931 378780 381828 385225 387794 389271 390290 391762 394479
57513 394479 398575 403004 406289 408114 409551 411455 413571 415605 418064 421100 423388 423529 422290 422268 425303
57498 425303 431131 438552 446876 455819 464839 473211 480473 486439 491057 494627 498055 502491 508497 515447
57484 515447 521889 526767 530402 533998 538126 542174 545527 548608 552171 556018 559209 561246 562257 562108
57470 562108 560225 556382 550983 544467 537102 529389 521893 514531 506793 498797 491296 484379 477183 469402
57456 469402 462159 456533 451987 447188 441906 437118 433450 430554 428008 425932 424522 423673 423372 423897 425314
57441 425314 427136 428883 430744 433440 437441 442419 447352 451206 453658 455288 457071 459719 463616 469115
57427 469115 476489 485410 494646 502552 508125 511744 514787 518238 521624 523597 523588 522567 521960 522170 522448 521866
57411E21866j961l670n655p448q262p790o715o214o867q119r038r478r991j0634
57397D20024j0682r880r175r473j0358j0892j0981j0912j0288q711p054o430o269
57384B98919n092l166k328l016l595l254l379m876o287o101n209n089n057l512
57370B38958r35O44O08M7n40j649k884k793j040Q67J587J372J159J343J786K028
57354B40558J398j65j528j664j260j678k741l090k556k158j949r81L38K67j220
57339B21571j803l79J069N58r72j511r06o3J061K533K972J290j023j703r95q66
57323B20833j578j520k02R41R24K23p29j943k530j077J926L985L761K685K568
57308B28267L170L145K231J279R45J252J815J968J274K52j87j8J63O15K145M117
$$ plain form
57411 521866 519905 516235 510580 503132 494870 487080 480365 474151 467284 459165 450127 440649 430658 420024
57397 420024 409342 399462 390287 380814 370456 359564 348583 337671 327383 318672 311618 305188 298919
57384 298919 293827 290661 288333 285317 281722 278468 275089 270213 263926 257825 252616 247527 242470 238958
57370 238958 238023 238667 239275 239322 238782 237133 234249 231456 230416 231283 232870 234242 235401 236744 238530 240558
57354 240558 241956 241791 240263 238599 237339 235661 232920 229830 227274 225116 223167 222186 222524 222791 221571
57339 221571 219768 219389 220458 221016 220044 218533 217627 217564 218625 221158 224130 225420 224397 222694 221699 220833
57323 220833 219255 217735 217533 218474 219398 219621 218892 216949 214419 213342 215268 219253 223014 225699 228267
57308 228267 231437 234582 236813 238092 239037 240289 242104 244072 245346 245598 245411 245393 245556 246171 248316 252433
57292B52433M699L654L020L964M871M003K318J816K460K854K958L785M921M720
57278C02476L053J755J993K957L653M343N381O097N756M734L831L113K201J203
57264C52546O27O62J137J879K648K942K371J202K18k3L36P64J003J263J645J575
57248C72795L49j775l554m044l344j904k2J576J616j67k077k199o73Q13J450J920
57232C60760K810L817M613N279N655N397M941N219O157O506N663M580M371M973
57218D30741N793O673P639Q380Q662Q579Q073O954N809N802P051Q181Q190P690
57204E34217P570P604P438P782R220J0693J0775R888R627J0253J0512R961R753
57191F55293J0810J2512J3742J4146J3919J3287J2660J2481J2540J2165J1414
$$ plain form
57292 252433 257132 260786 263806 267770 272641 276644 278962 280778 283238 286092 289050 292835 297756 302476
57278 302476 305529 307284 309277 312234 315887 320230 325611 331708 337464 342198 346029 349142 351343 352546
57264 352546 353173 353835 354972 356851 359499 362441 364812 366014 366232 366209 366545 367309 368312 369575 371220 372795
57248 372795 373144 371369 367815 363771 360427 358523 358501 360077 361693 361526 359449 357250 356577 357390 358840 360760
57232 360760 363570 367387 372000 377279 382934 388331 393272 398491 404648 411154 416817 421397 425768 430741
57218 430741 436534 443207 450846 459226 467888 476467 484540 491494 497303 503105 510156 518337 526527 534217
57204 534217 541787 549391 556829 564611 573831 584524 595299 605187 614814 625067 635579 645540 655293
57191 655293 666103 678615 692357 706503 720422 733709 746369 758850 771390 783555 794969
57180G94969J1256J2235J3786J5199J6453J7555J7938J7258J6158J5599J5865
57169I64271J6832J8566K0889K2879K3685K3739K4183K5259K6039K5933K5645
57158A217920K6206K7596K8833K9236K9130K9302L0090L1262L2545L3981L5671
57147A551772L7475L9231M1027M2911M4420M4984M4829M5080M6668M9524N2988
57136B040909N6590O0001O2654O4123O4915O6325O9247P3425P8003Q2576Q7410
57125B806178R2732R8307J03870J09723J16389J23722J30949J38047J46517J58029
57115D024463J72361J87535K02214K17132K33753K52323K72169K93428L17327
57106F172705L44696L75165M08166M44010M83302N25916N71261O19312O70418
$$ plain form
57180 794969 806225 818460 832246 847445 863898 881453 899391 916649 932807 948406 964271
57169 964271 981103 999669 1020558 1043437 1067122 1090861 1115044 1140303 1166342 1192275 1217920
57158 1217920 1244126 1271722 1300555 1329791 1358921 1388223 1418313 1449575 1482120 1516101 1551772
57147 1551772 1589247 1628478 1669505 1712416 1756836 1801820 1846649 1891729 1938397 1987921 2040909
57136 2040909 2097499 2157500 2220154 2284277 2349192 2415517 2484764 2558189 2636192 2718768 2806178
57125 2806178 2898910 2997217 3101087 3210810 3327199 3450921 3581870 3719917 3866434 4024463
57115 4024463 4196824 4384359 4586573 4803705 5037458 5289781 5561950 5855378 6172705
57106 6172705 6517401 6892566 7300732 7744742 8228044 8753960 9325221 9944533 10614951
57097A0614951P23939P77856Q30212Q80394R28258R72163J008815J035197J049887
57088A8821672J051932J039193J008938R60096Q93971Q12374P15805O04080M78294
57079B6386355L41405J97032M8213j02568k52596l98401n35849o60892p70525
57070B4252174q63228r38447r95874j035463j057870j064487j057029j037457
57062A6202319j008157r71531r29144q81761q30401p76996p23639o71576o21239
57053H787875n72855n26587m82468m40719m01924l66209l32639l00302k70155
57044E094017k44869k26472k14719k07901k04213k01561j97018j88162j75238
57035C233864j61104j48499j37906j28239j18825j10039j02351r5564q9197q3166
$$ plain form
57097 10614951 11338890 12116746 12946958 13827352 14755610 15727773 16736588 17771785 18821672
57088 18821672 19873604 20912797 21921735 22881831 23775802 24588176 25303981 25908061 26386355
57079 26386355 26727760 26924792 26973005 26870437 26617841 26219440 25683591 25022699 24252174
57070 24252174 23388946 22450499 21454625 20419162 19361292 18296805 17239776 16202319
57062 16202319 15194162 14222631 13293487 12411726 11581325 10804329 10080690 9409114 8787875
57053 8787875 8215020 7688433 7205965 6765246 6363322 5997113 5664474 5364172 5094017
57044 5094017 4849148 4622676 4407957 4200056 3995843 3794282 3597264 3409102 3233864
57035 3233864 3072760 2924261 2786355 2658116 2539291 2429252 2326901 2231337 2142140 2058974
57025B058974p7768p3162o9124o5364o1836n8464n4809n0549m6339m3548m2595
57014A415416m2080m0299l7316l4706l3363l2547l1228k9339k7272k5042k2761
57003A059463k1158k0741k0784j9959j7925j5646j4279j4152j4651j4660j3397
56992H72111j1249r454q594q007p269p370r242j1782j2877j2252j1694j2287j3116
56979G36918j3274j3455j4573j6017j6632j6432j6094j5402j3614j0956q469o625
56967E75375n240m514m805n424n074l715k635k369j940q12k03j295l185m052l776
56952E26336l892n101o263o270n641n515n958o062n351m189k992j790o31J80N55
56937D67416R07J645K578L131K979K267J326M07l67j039j793k816m177n989q361
$$ plain form
57025 2058974 1981206 1908044 1838920 1773556 1711720 1653256 1598447 1547898 1501559 1458011 1415416
57014 1415416 1373336 1333037 1295721 1261015 1227652 1195105 1163877 1134538 1107266 1082224 1059463
57003 1059463 1038305 1017564 996780 976821 958896 943250 928971 914819 900168 885508 872111
56992 872111 860862 851408 842814 834807 827538 820168 810926 799144 786267 774015 762321 750034 736918
56979 736918 723644 710189 695616 679599 662967 646535 630441 615039 601425 590469 582000 575375
56967 575375 570135 565621 560816 555392 550318 546603 543968 541599 539659 538847 538644 537349 534164 530112 526336
56952 526336 522444 517343 511080 504810 499169 493654 487696 481634 476283 472094 469102 467312 466681 466861 467416
56937 467416 468323 469968 472546 475677 478656 480923 482249 482656 482289 481250 479457 476641 472464 466475 458114
56922D58114j0926j2669j2793j1745j0775j0404r976r010q198q386r158r323q505
56909C26246p355o270m946l391k391k380k656k395j807j505j235k50J203J883
56895B92751J311O15J041K250K860K382J877K416L513L578J935j27p15M37J667
56880C17791J473L20j89M63J130O16r20k293k321l03L582P740R899R312P846P915
56864C62061R688J1285J1392J0448R254P824O221N274N407N539M198J400j388
56851D48603k866k821j792o60k02k21O26L173O170P585P507Q297J1379J5205J7301
56836E17284J7223J6271J5106J3229J0558P966N815L237m30m305o865p765q054
56823E79270q776r876j0526j0053q580o993o184o021n268k899N86L609N212N754
$$ plain form
56922 458114 447188 434519 421726 409981 399206 388802 378826 369816 361618 353232 344074 334751 326246
56909 326246 318891 312621 307675 304284 301893 299513 296857 294462 292655 291150 289915 289665 290868 292751
56895 292751 294062 294677 295718 297968 300828 303210 305087 307503 311016 314594 316529 316402 315687 316124 317791
56880 317791 319264 319584 319395 319858 320988 321604 320684 318391 316070 315767 319349 327089 336988 346300 354146 362061
56864 362061 371749 383034 394426 404874 414128 421952 428173 433447 438854 444393 448591 449991 448603
56851 448603 445737 442916 441124 440464 440262 440041 440667 443840 450010 457595 465102 473399 484778 499983 517284
56836 517284 534507 550778 565884 579113 589671 597637 603452 606689 606259 601954 595089 587324 579270
56823 579270 570494 560618 550092 540039 531459 524466 518282 512261 506993 504094 504680 508289 513501 519255
56809E19255N838N379M239L063K528K022J43l190o228p508p827r172j1996j4657
56795D81889j5547j4844j3688j2389j0326p408m670l156k668k170j176k46K8%
56781C93629N15J618K210J196j303m115o151p138p377p268p161p392q153r228
56767C33882j0002r986r395q926q755q095o362m577m618o687q537q010n708m105
56753B30119m390n412n582m629l132j548k70K57J89L73J116J484O11q04j261l96
56737B06725O93R82M97l11j302k419l286l498l101k467j829j096q7J020J492O05
56721A92618j310k665k027K63K318K666J541J90n50n94l2J009J907J658k5j968
56705A94999k531j423k4L90K43Q12K115K674J509m75j639j499q19l53j98j64n6
$$ plain form
56809 519255 525093 530472 534711 537774 540302 542324 542467 539277 533049 525541 517714 508542 496546 481889
56795 481889 466342 451498 437810 425421 415095 407687 403017 399861 397193 395023 393847 393601 393629 393629
56781 393629 394144 395762 397972 399168 397865 393750 387599 380461 373084 365816 358655 351263 343110 333882
56767 333882 323880 313894 304499 295573 286818 278723 272361 267784 263166 256479 247942 239932 234224 230119
56753 230119 225729 220317 214735 210106 206974 205426 205156 205413 205602 205975 207091 208575 209186 208382 207121 206725
56737 206725 207418 208400 208897 208586 207284 204865 201579 198081 194980 192513 190684 189588 189501 190521 192013 192618
56721 192618 191308 188643 186616 186879 189197 191863 193404 193594 193044 192450 192418 193427 195334 196992 196967 194999
56705 194999 192468 191045 191021 191411 191654 192466 194581 197255 198764 198289 196650 195151 194332 193979 193781 193617 193561
56688A93561L15Q33R45L36m17n27j39Nq9M87K045L485L448J831k15j442j388n26
56670B02548K14M14P30K053L957M778L656J857J384K649M230M643L713K286J258
56655B40370R96J300J733K070K366K492J980P08o18j085n41M90J407J682Q54p64
56639B55440j701p32J299K135Q63r85j551p32N10J882L503M619M084K154M80M6
56623B71314J18l54j296j964k109j951j600j173j028j207j039n0R67O20j359l710
56607B54179m975m605k849l86J685K329J528L75j81k41l20l80j17K32Q7n27q70
56590B44964m29M83J141J152O84J95R6N33J312K033K257J677L98r17j499j323
56574B52757j141j402j448l57J675L381L914L594L063K248P93q63j491m26J473
$$ plain form
56688 193561 193876 194709 195654 195990 195573 195046 194907 194912 194823 195310 197355 200840 204288 206119 205904 204462 203074 202548
56670 202548 202762 203176 203906 205959 209916 214694 218350 220207 221591 224240 228470 233113 236826 239112 240370
56655 240370 241366 242666 244399 246469 248835 251327 253307 254015 253397 252312 251771 252261 253668 255350 256204 255440
56639 255440 253739 253007 254306 256441 257304 256319 254768 254036 254546 256428 259931 264550 268634 270788 271268 271314
56623 271314 271432 271078 269782 267818 265709 263758 262158 260985 259957 258750 257711 257661 258628 259248 257889 254179
56607 254179 249204 244599 241750 241364 243049 245378 246906 247281 247100 246859 246539 246159 246042 246274 246361 245834 244964
56590 244964 244535 245018 246159 247311 247995 248190 248286 248819 250131 252164 254421 256098 256496 255579 254080 252757
56574 252757 251616 250214 248766 248409 250084 253465 257379 260973 264036 266284 267077 266214 264723 264297 265770
56559B65770K616K399J814K092L069L448K624J531J272J570J338M97K20J208K557
56544B94025K861J921Q37O10J220J915J972J066o24k422l447l271k355j704j843
56529B90761k305k210j324k01O30J150J374R51k11j348j525q56l80p30j503j991
56513B80282j923j272r5J088J308K80q99q36M46J507J229K1r57j286j566k279
56497B75048k899k433p66R27J365N20n15q48n11Q3P48J260J124K52m86j47Q51
56480B73573J033j70j446j128O90K286K379J396O34P56J502K323K802K575J498
56465B90703L5p91j83J625L337L517J944J35P2J991L933M057K834K027J912J016
56449C18164j192k964k508l81J462K080J786Q53o21j924k269j971j818j542l40
$$ plain form
56559 265770 268386 270785 272599 274691 277760 281208 283832 285363 286635 288205 289543 290040 290260 291468 294025
56544 294025 296886 298807 299644 300254 301474 303389 305361 306427 305803 303381 299934 296663 294308 292604 290761
56529 290761 288456 286246 284922 284721 285351 286501 287875 288826 288615 287267 285742 284886 284506 283776 282273 280282
56513 280282 278359 277087 276992 278080 279388 279668 278769 277933 278379 279886 281115 281136 280179 278893 277327 275048
56497 275048 272149 269716 268950 269877 271242 271762 271247 270399 269888 269971 270719 271979 273103 273355 272869 272722 273573
56480 273573 274606 274436 272990 271862 272552 274838 277217 278613 279247 280003 281505 283828 286630 289205 290703
56465 290703 290738 289947 289764 291389 294726 298243 300187 300322 300394 302385 306318 310375 313209 315236 317148 318164
56449 318164 316972 314008 311500 311119 312581 314661 316447 317300 316679 314755 312486 310515 308697 307155 306815
56434C06815J262J696P16k02j22K35K47M61J100J198L99K6R65J873J283K18N99
56417C18769J901J702n70k694k701r61J117K676L146K144N14rR22J616Q38l30
56401C28080k51Q40J566J574J475J242L40p74q60K53J273J176L60k16j00O40J638
56384C38256K243K074J716K025K651K366J215R08K238L359K124o36j811J16L371
56369C62215N392N595N096M697M200L321K341J827K038K649L036K987L048L646
56355D12088M129L417J729N97P37J029M14k60M22K033K808K287J797K089K192
56340D37508J208r6l65N63J872L004L786L921L276K395J939J870J808J741J762
56325D66192J485O31j48P3J133K015K315K553K933K837K009J357J858L219M248
$$ plain form
56434 306815 308077 309773 310489 310287 310165 310400 310647 311108 312208 313406 313805 313831 314796 316669 317952 318170 318769
56417 318769 320670 322372 321802 319108 316407 315446 316563 319239 322385 324529 325043 325034 325956 327572 328410 328080
56401 328080 327829 328669 330235 331809 333284 334526 334866 334092 333232 333485 334758 335934 336294 336078 335978 336618 338256
56384 338256 340499 342573 344289 346314 348965 351331 352546 353454 355692 359051 361175 360539 358728 358844 362215
56369 362215 367607 373202 378298 382995 387195 390516 392857 394684 396722 399371 402407 405394 408442 412088
56355 412088 416217 419634 421363 421960 422697 423726 424140 423880 424302 426335 429143 431430 433227 435316 437508
56340 437508 438716 438620 438255 438818 440690 443694 447480 451401 454677 457072 459011 460881 462689 464430 466192
56325 466192 467677 468308 468160 468233 469366 471381 473696 476249 479182 482019 484028 485385 487243 490462 494710
56310D94710M335L885L462L165K952L074L721M472M636M201M022M774O009O702
56296E54120O488N892N445N203N116N181N116M559L876M032N315O907Q052Q853
56282F34155R447R379Q642Q313R051R684Q741O875O250P603R485J0544J1101J2007
56268G61277J3232J4322J5241J6041J6455J6459J6659J7575J8956K0325K1773
56257I48315K3770K6610L0221L4208L7933M1157M4715M9798N6442O3542P0477
56246A427188P7749Q5589R3082R9311J04379J08415J10521J09783J06735J02598
56236B425350R7456R0141P9754O6312N0223L2212J3754l467j8749l2407m4583
56225B755996n4803o2723o8626p2982p6081p8173p9338p9212p7493p4811p2359
$$ plain form
56310 494710 499045 502930 506392 509557 512509 515583 519304 523776 528412 532613 536635 541409 547418 554120
56296 554120 560608 566500 571945 577148 582264 587445 592561 597120 600996 605028 610343 617250 625302 634155
56282 634155 643602 652981 661623 669936 678987 688671 697412 704287 710537 718140 727625 738169 749270 761277
56268 761277 774509 788831 804072 820113 836568 853027 869686 887261 906217 926542 948315
56257 948315 972085 998695 1028916 1063124 1101057 1142214 1186929 1236727 1293169 1356711 1427188
56246 1427188 1504937 1590526 1683608 1782919 1887298 1995713 2106234 2216017 2322752 2425350
56236 2425350 2522806 2612947 2692701 2759013 2809236 2841448 2855202 2851735 2832986 2800579 2755996
56225 2755996 2701193 2638470 2569844 2496862 2420781 2342608 2263270 2184058 2106565 2031754 1959395
56214A959395p0456o8130o4540o0155n6067n2649m9479m6205m2876l9460l5746
56203A373632l1847k8437k6114k4688k3222k0815j7234j3054r274o723n411m440
56191A162373k877q57N86R69J095J809K552K171R18N96K366N336P849R286R985
56176A204157J0113R551Q725Q614R810J1895J3774J4478J3931J3018J2728J3103
56164A343897J3444J3433J3406J3439J3266J3400J5087J8376K1376K2578K2936
56153A524638K4314K6728K8868L0852L4363M0044M6620N3235O0909P0621Q1199
56142B022391R0330R6841J00752J01593R8055Q9727P8448O7426N9077N3824N0736
56131B909200M8690M6532M2703L6019K7306J9295J4083J1303R443P829O062K380
$$ plain form
56214 1959395 1888939 1820809 1756269 1696114 1640047 1587398 1537919 1491714 1448838 1409378 1373632
56203 1373632 1341785 1313348 1287234 1262546 1239324 1218509 1201275 1188221 1178947 1172224 1166813 1162373
56191 1162373 1159496 1158639 1159225 1160194 1161289 1163098 1165650 1167821 1168739 1169335 1171701 1177037 1184886 1194172 1204157
56176 1204157 1214270 1223821 1232546 1241160 1250970 1262865 1276639 1291117 1305048 1318066 1330794 1343897
56164 1343897 1357341 1370774 1384180 1397619 1410885 1424285 1439372 1457748 1479124 1501702 1524638
56153 1524638 1548952 1575680 1604548 1635400 1669763 1709807 1756427 1809662 1870571 1941192 2022391
56142 2022391 2112721 2209562 2310314 2411907 2509962 2599689 2678137 2745563 2804640 2858464 2909200
56131 2909200 2957890 3004422 3047125 3083144 3110450 3129745 3143828 3155131 3164574 3172403 3178465 3180845
56119C180845n304j6742k9339m0851n0545n7631o0508n8495n2877m5387l6836
56108B726330k7781j9286j1918n095J702P855J2552J5868J8246J9930K1575K4225
56096B784203K7758L0502L1376L1327L1648L2201L2563L3490L5540L7480L7973
56085C146061L7911L9012M1032M2646M4325M7532N1268N2533N0864M9584N1239
56074C654007N4332N6228N7153N9111O2295O4968O6397O7717O9743P1716P2744
56063D356411P3406P5064P8073Q1191Q2935Q3381Q4231Q6880R0766R4379R7471
56052E284188J00976J04768J07162J07424J07331J09017J12279J15366J17722
56043F266233J20400J24139J28534J33178J38180J43304J47754J51413J55476
$$ plain form
56119 3180845 3175541 3158799 3129460 3088609 3038064 2980433 2919925 2861430 2808553 2763166 2726330
56108 2726330 2698549 2679263 2667345 2662250 2663952 2671807 2684359 2700227 2718473 2738403 2759978 2784203
56096 2784203 2811961 2842463 2873839 2905166 2936814 2969015 3001578 3035068 3070608 3108088 3146061
56085 3146061 3183972 3222984 3264016 3306662 3350987 3398519 3449787 3502320 3553184 3602768 3654007
56074 3654007 3708339 3764567 3821720 3880831 3943126 4008094 4074491 4142208 4211951 4283667 4356411
56063 4356411 4429817 4504881 4582954 4664145 4747080 4830461 4914692 5001572 5092338 5186717 5284188
56052 5284188 5385164 5489932 5597094 5704518 5811849 5920866 6033145 6148511 6266233
56043 6266233 6386633 6510772 6639306 6772484 6910664 7053968 7201722 7353135 7508611
56034G508611J61227J68590J76280J83241J89657J96622K04832K13629K21766
56025I224455K29213K37454K47402K57771K66593K73908K81674K91244L02325
56016A1612039L14504L28204L43498L59344L75005L91092M08310M26132M43991
56007A5002119M62846M84115N07526N31612N56131N82391O11129O41690O73770
55998B0053329P08456P46616P87616Q30656Q76311R25637R78663J035155J096088
55989B8038527J162784J235129J312419J395904J488546J591697J703809J823359
55981C9752174J951742K092126K246664K416377K603090K809795L039030L292298
55973F0203296L571463L880073M223050M605712N033209N510484O042765O636500
$$ plain form
56034 7508611 7669838 7838428 8014708 8197949 8387606 8584228 8789060 9002689 9224455
56025 9224455 9453668 9691122 9938524 10196295 10462888 10736796 11018470 11309714 11612039
56016 11612039 11926543 12254747 12598245 12957589 13332594 13723686 14131996 14558128 15002119
56007 15002119 15464965 15949080 16456606 16988218 17544349 18126740 18737869 19379559 20053329
55998 20053329 20761785 21508401 22296017 23126673 24002984 24928621 25907284 26942439 28038527
55989 28038527 29201311 30436440 31748859 33144763 34633309 36225006 37928815 39752174
55981 39752174 41703916 43796042 46042706 48459083 51062173 53871968 56910998 60203296
55973 60203296 63774759 67654832 71877882 76483594 81516803 87027287 93070052 99706552
55965I9706552P299749Q041142Q868289R787447J0804108J1922760J3145189J4468156
55957A84043392J5880750J7360971J8871984K0358911K1745953K2933287K3795775
55950C24991023K4187116K3951560K2942761K1048355J8217582J4485771R987011
55943D59811179M948335l35885n544757j0376834j4588600j8016932k0585143
55936C95311363k2296757k3219608k3462716k3152786k2417979k1379308k0144117
55929B39238092j8799903j7412835j6032139j4694595j3425103j2236917j1135531
55922A35501069j0123275r200131q362540p604603o920622o305189n751519n251966
55914G5981224m800396m392743m025547l695309l398988l133291k893482k674550
$$ plain form
55965 99706552 107006301 115047443 123915732 133703179 144507287 156430047 169575236 184043392
55957 184043392 199924142 217285113 236157097 256516008 278261961 301195248 324991023
55950 324991023 349178139 373129699 396072460 417120815 435338397 449824168 459811179
55943 459811179 464759514 464423629 458878872 448502038 433913438 415896506 395311363
55936 395311363 373014606 349794998 326332282 303179496 280761517 259382209 239238092
55929 239238092 220438189 203025354 186993215 172298620 158873517 146636600 135501069
55922 135501069 125377794 116177663 107815123 100210520 93289898 86984709 81233190 75981224
55914 75981224 71180828 66788085 62762538 59067229 55668241 52534950 49641468 46966918
55906D6966918k473887k291220k125807j975480j838748j715851j606620j508778
55898C1430527j419389j336692j259484j186123j115721j049433r88923r33964
55890B2140798q82850q34792p90262p49012p09421o70452o33149n99259n68953
55881A5702648n40792n13610m87559m63181m40313m18644l98875l82442l69719
55872A1687513l59184l48806l37688l25846l13055k99009k84415k70683k58313
55863H890514k46612k35390k25856k18995k13785k08107k01073j93571j86536
55854F960589j79669j72315j65000j59295j56022j54063j51419j47306j42592
55845E532908j38182j33721j28547j23152j18717j15456j12531j09428j06303
$$ plain form
55906 46966918 44493031 42201811 40076004 38100524 36261776 34545925 32939305 31430527
55898 31430527 30011138 28674446 27414962 26228839 25113118 24063685 23074762 22140798
55890 22140798 21257948 20423156 19632894 18883882 18174461 17504009 16870860 16271601 15702648
55881 15702648 15161856 14648246 14160687 13697506 13257193 12838549 12439674 12057232 11687513
55872 11687513 11328329 10979523 10641835 10315989 10002934 9703925 9419510 9148827 8890514
55863 8890514 8643902 8408512 8182656 7963661 7749876 7541769 7340696 7147125 6960589
55854 6960589 6780920 6608605 6443605 6284310 6128288 5974225 5822806 5675500 5532908
55845 5532908 5394726 5261005 5132458 5009306 4890589 4775133 4662602 4553174 4446871
55836D446871j02842r8241r2846q8521q6385q5151q2930p9890p7742p6831p5500
55825C499992p2627o9445o7878o7899o7686o6088o3810o1875o0032n7529n4871
55814B790252n3551n3911n4425n3614n1788n0132m8861m7325m5404m3550m1709
55803B245982l9358l6693l4634l3485l2549l1227k9551k7682k5862k4842k4958
55792A905141k4812k2509j8559j5624j4602j3061r253n866p461j4924k4583l2470
55780A701417l7459m0103m0594l8733l4866k9816k4346j9012j4268j0764r757
55769A401699j2655j9254k6835l2139l4199l4432l4152l3172l0906k7594k3972
55758A092389k0528j7528j5163j3315j1739j0664j0791j2451j5045j7409j8522
$$ plain form
55836 4446871 4344029 4245788 4152942 4064421 3978036 3892885 3809955 3730065 3652323 3575492 3499992
55825 3499992 3427365 3357920 3290042 3222143 3154457 3088369 3024559 2962684 2902652 2845123 2790252
55814 2790252 2736701 2682790 2628365 2574751 2522963 2472831 2423970 2376645 2331241 2287691 2245982
55803 2245982 2206624 2169931 2135297 2101812 2069263 2038036 2008485 1980803 1954941 1930099 1905141
55792 1905141 1880329 1857820 1839261 1823637 1809035 1795974 1786721 1780855 1773394 1758470 1733887 1701417
55780 1701417 1663958 1623855 1583261 1544528 1509662 1479846 1455500 1436488 1422220 1411456 1401699
55769 1401699 1389044 1369790 1342955 1310816 1276617 1242185 1208033 1174861 1143955 1116361 1092389
55758 1092389 1071861 1054333 1039170 1025855 1014116 1003452 992661 980210 965165 947756 929234
55747I29234j8082j6698j5290j4009j2283j0261r285r973j0786r955q260q089
55735G86263r874j1420j1087r778r056r021r181r981j1892j3823j3985j2189j0116
55722F44860r405j0197j1509j2269j2015j1121j0396j0153r727q286n995m065
55710E29722l673m942o933q463r110r375r867j0511j0782j0383r310p588n613
55697D23172m436m788n952o522o328o572p817q943q647p097n486m562m230m172
55683C37620m255m430m585m373l379j797p07r94k187l205l938m947n815n346l648
55668B84014k350k225k158j285n83j154k344k925k983l137k848j259Q35J550L41
55653B61489j462k507k625k306k025k089k247j691j51J279J364L85m52p98j269
$$ plain form
55747 929234 911152 894454 879164 865155 852872 842611 833326 823353 812567 802612 794352 786263
55735 786263 776389 764969 753882 744104 735048 726027 716846 706865 694973 681150 667165 654976 644860
55722 644860 635455 625258 613749 601480 589465 578344 567948 557795 548068 539782 533787 529722
55710 529722 526049 521107 514174 505711 496601 487226 477359 466848 456066 445683 436373 428785 423172
55697 423172 418736 413948 407996 401474 395146 388574 380757 371814 363167 356070 350584 346022 341792 337620
55683 337620 333365 328935 324350 319977 316598 314801 314094 313100 310913 307708 303770 298823 293008 287662 284014
55668 284014 281664 279439 277281 275996 275413 274259 271915 268990 266007 262870 260022 258763 259598 261148 261489
55653 261489 260027 257520 254895 252589 250564 248475 246228 244537 244386 245665 247029 247414 246962 246164 244895
55638B44895j988k407k510l019m223n562o460o663n862m048k218j624k076k026
55624A94209n87J372K421K012O10q64j417n90J097K655L553L688K844J093n98
55609B11498j263j230j463j853j557q63j114k519l683l782l680m218m807m639
55595A74827l975l335k574j692j472k184k728k289j904k993n060o366o336n825
55581A26094n284m275k864j975k001k217k034j863k217k713k624k020j671j982
55567I0354k508k616k412k681l767m796m499k887j453j405k289k777k294j315
55553E2655n35m66j369k810l591k917j544q80j124j186m31M88Q00O28M37K01k56
55536C8100o34n07k6K57Q0l78r01j283j127m6J697L074L030J494n02j690j633
$$ plain form
55638 244895 242907 240500 237990 234971 230748 225186 218726 212063 206201 202153 199935 198311 196235 194209
55624 194209 193622 194994 197415 199427 200037 199173 197756 197166 198263 200918 204471 208159 211003 212096 211498
55609 211498 210235 209005 207542 205689 204132 203269 202155 199636 195953 192171 188491 184273 179466 174827
55595 174827 170852 167517 164943 163251 161779 159595 156867 154578 152674 149681 144621 138255 131919 126094
55581 126094 120810 116535 113671 111696 109695 107478 105444 103581 101364 98651 96027 94007 92336 90354
55567 90354 87846 85230 82818 80137 76370 71574 67075 64188 62735 61330 59041 56264 53970 52655
55553 52655 52120 51654 50285 47475 43884 40967 39423 38543 37419 36233 35802 36290 37090 37718 38155 38356 38100
55536 38100 37466 36959 36933 37190 37270 36892 35991 34708 33581 33535 35232 38306 41336 42830 42328 40638 39005
55519C9005q04J80J139J938K075J127m55j538j432n04L95P13L05p64k127l084
55503C6169l075k267j426j167j460j782j684j204p67p30r64r59l42P32J691J899
55487B2664R48r65k710k642m8L623N607M418J533k6J180L713N062M252K247M16
55471D9272o85j128j068p11l29R9Q37J734J896O42j518l322m194m605n036n263
55455B6621n037m731m647m156k435j50O91r51A650b846k782K00K372c23A250j45
55439A105c41j935j962j911j420k6J562J943J024M09J132F20K023J041K38o86
55423C236E18d579n678l847j357M13K132M475b362B789K236k83j014o00j98l43
55407B587j242a519m322m308k691r96n96j001o48R19K349K163N43r50j304j077
$$ plain form
55519 39005 38201 38381 39520 41458 43533 44660 44205 42667 41235 40731 41126 41839 42144 41380 39253 36169
55503 36169 33094 30827 29401 28234 26774 24992 23308 22104 21337 20607 19643 18684 18342 19074 20765 22664
55487 22664 23612 22647 19937 17295 17247 20870 26477 30895 32428 32402 33582 37295 42357 46609 48856 49272
55471 49272 48587 47459 46391 45680 45351 45450 46287 48021 49917 50559 49041 45719 41525 36920 31884 26621
55455 26621 21584 16853 12206 8050 5615 5465 6156 5205 1650 -2846 -5628 -5428 -3056 -323 1250 1105
55439 1105 -341 -2276 -4238 -6149 -7569 -7595 -6033 -4090 -3066 -2657 -1525 620 2643 3684 3922 3236
55423 3236 518 -4579 -10257 -14104 -15461 -15048 -12916 -8441 -2362 2789 5025 4742 3728 3128 2930 2587
55407 2587 1345 -1519 -5841 -10149 -12840 -13836 -14432 -15433 -16081 -15162 -12813 -10650 -10107 -11057 -12361 -13438
55391a3438j367k163k358j226O91K299K935K575J507K27p88j431j807j687n99
55376a6630J242K651K548J019r29k183k097q67L01J91q48j112K05J853K272J512
55360a0872M34q63k468l300k182L2J170O28n7K38P79O25J93K43N14L34k88j035
55342a5875j900k602k297q00N96O32j64l10M98J207J152P34M08R5j69P7R28J692
55324a6098J700J006M0r51j717j797j030j89l70j634k648k090l10R71O74m51j080
55307b5974j133j380j634o31J737L363K212r82l400l264j370L70R19N07m3l8N74
55290c0167J159J119M94m07j589k898l354k127l4J123R53R03J905K896K531J207
55274b6286K78M5j82n54n55k26k54q17j310j296q67j05Q91J452R29l3J14J791
$$ plain form
55391 -13438 -14805 -16968 -19326 -20552 -19861 -17562 -14627 -12052 -10545 -10318 -11106 -12537 -14344 -16031 -16630
55376 -16630 -15388 -12737 -10189 -9170 -10099 -12282 -14379 -15246 -14945 -14754 -15602 -16714 -16509 -14656 -12384 -10872
55360 -10872 -10438 -11301 -13769 -17069 -19251 -19219 -18049 -17421 -17478 -17240 -16461 -15836 -15643 -15400 -14886 -14552 -14840 -15875
55342 -15875 -17775 -20377 -22674 -23474 -22878 -22246 -22410 -22720 -22222 -21015 -19863 -19129 -18721 -18626 -18795 -18718 -17790 -16098
55324 -16098 -14398 -13392 -13352 -14303 -16020 -17817 -18847 -19036 -19406 -21040 -23688 -25778 -26088 -25117 -24443 -24894 -25974
55307 -25974 -27107 -28487 -30121 -30752 -29015 -25652 -23440 -24422 -27822 -31086 -32456 -32086 -31167 -30660 -30703 -30741 -30167
55290 -30167 -29008 -27889 -27395 -27802 -29391 -32289 -35643 -37770 -37804 -36681 -35728 -34825 -32920 -30024 -27493 -26286
55274 -26286 -26008 -25963 -26145 -26699 -27254 -27480 -27734 -28551 -29861 -31157 -32024 -32129 -31238 -29786 -28857 -28890 -28776 -26985
55256b6985L583M014L068J553r7j667k683k948k914k855k265q19P55J577J841
55241b6842K229K608K358J542P22m9j018j678j198Q2Q21M79p1K6O38J336J976
55224a6039K229J458k41j753k195j889j596j451j156n71L07J372K014J496J04
55209a7911q38o54k06m55j031j085p31o71q81p69k94P2J95K34J50N0O11K016K962
55190a9236J995k42j489p90L70K34j023j894j515l17P44J018N31K7L57J560K703
55173a6967K860K086J237J013J231J020p8j270j276j04O58k0j080r77m8Q4q18
55156a2449j264n04L49J71n59p83l44L95J338K223K267J231J23q7J34l03j487
55139i549k545k875k441j318R8Q41L24o87r05n3J226K467L389L222J512n17q41
$$ plain form
55256 -26985 -23402 -19388 -16320 -14767 -14864 -16531 -19214 -22162 -25076 -27931 -30196 -31015 -30260 -28683 -26842
55241 -26842 -24613 -22005 -19647 -18105 -17383 -17432 -18450 -20128 -21326 -21244 -20423 -19944 -20015 -19989 -19351 -18015 -16039
55224 -16039 -13810 -12352 -12593 -14346 -16541 -18430 -20026 -21477 -22633 -23204 -22897 -21525 -19511 -18015 -17911
55209 -17911 -18749 -19403 -19609 -20064 -21095 -22180 -22911 -23582 -24463 -25232 -25526 -25454 -25259 -25025 -24875 -24825 -24214 -22198 -19236
55190 -19236 -17241 -17483 -18972 -19762 -19392 -19158 -20181 -22075 -23590 -23907 -23163 -22145 -21614 -21587 -21230 -19670 -16967
55173 -16967 -14107 -12021 -10784 -9771 -8540 -7520 -7598 -8868 -10144 -10248 -9590 -9610 -10690 -11667 -11715 -11631 -12449
55156 -12449 -13713 -14217 -13868 -13697 -14256 -15039 -15383 -14988 -13650 -11427 -9160 -7929 -7806 -7893 -7759 -8062 -9549
55139 -9549 -12094 -14969 -17410 -18728 -18630 -17789 -17465 -18152 -19057 -19110 -17884 -15417 -12028 -8806 -7294 -7811 -8652
55122h652O96J890Q87j636l655m216l807l040k008p01P66K330L806M571M019K363
55106f387N01q47j564j662j011K97J653K381K307J652N57r61k574l633l630k639
55090a5560j122L91J480J996K221K622L152a709C72O58k08C95b44r47n80Q68A596
55072D554J890K69n26J96J885K992K201k03k401k791j493Q4O94O4j210k079j648
55055B478K4J757K169P77j777A324c369k981k44J207M45j033j277k63N73N40K49
55038f153K91M98O17O72N78K79K60R95d7A904J116M57K84k46j464c72k416j974
55020d762j673j125j32N04M41R09K779A449L834J032j395k168D36b203k223l80
55004d806J569a327d44O3M4P0m03r96j266j270j184j013q26o89m36NK44K8QR45
$$ plain form
55122 -8652 -7956 -6066 -5179 -6815 -10470 -14686 -18493 -21533 -23541 -24242 -23476 -21146 -17340 -12769 -8750 -6387
55106 -6387 -5886 -6733 -8297 -9959 -10970 -10673 -9020 -6639 -4332 -2680 -2123 -3084 -5658 -9291 -12921 -15560
55090 -15560 -16682 -16291 -14811 -12815 -10594 -7972 -4820 -1709 372 1030 822 395 -244 -1191 -1771 -903 1596
55072 4554 6444 6713 6187 6383 8268 11260 13461 13258 10857 8066 6573 6657 7351 7415 6205 4126 2478
55055 2478 2502 4259 6428 7205 5428 1324 -3369 -6350 -6594 -5387 -4942 -5975 -7252 -7515 -6942 -6402 -6153
55038 -6153 -5862 -5364 -4747 -4075 -3497 -3218 -2958 -1963 -47 1904 3020 3477 3761 3515 2051 -372 -2788 -4762
55020 -4762 -6435 -7560 -7692 -7188 -6747 -5838 -3059 1449 5283 6315 4920 2752 436 -2203 -4426 -4806
55004 -4806 -3237 -1327 -444 -381 -337 -267 -670 -1666 -2932 -4202 -5386 -6399 -7225 -7914 -8350 -8345 -8101 -8073 -8065 -7120
54984g120K175K065M15q56j59J521A04J235P78J573K329J613j6q43j60J338K696
54967A0647L290K656R01p82j091k06M90L73K25N61N73n46k152l023k979k548j609
54950D780K95K450L139J660p62k398k602j814q71n69j129D73g28J97E98R48M67
54933B013L55J20m39j26J825L837L631J419k75J24J750L115L754L741L133K535
54917C0512K954M327N361N452N566O411P022O294M799L752L050J783Q7j218k489
54902H3663m987q453j0531r349n819k690j801k619l144k007m3M21j791m939o018
54887A9893m043q98J024J056P2q17q09M08K247L385L080K127K033L317M963N504
54871D2542M517L101K865M239N854O002M490K582J190q8j915l906m917m523l672
$$ plain form
54984 -7120 -4945 -2880 -2465 -3321 -3480 -1959 104 1339 2117 3690 6019 7632 7616 6773 6613 7951 10647
54967 10647 13937 16593 17494 16712 15621 15415 15905 16278 16503 17064 17637 17091 14939 11916 8937 6389 4780
54950 4780 5075 7525 10664 12324 11562 9164 6562 4748 3877 3308 2179 473 -728 -531 598 1546 2013
54933 2013 2368 2488 2049 1923 3748 7585 11216 12635 12360 12484 14234 17349 21103 24844 27977 30512
54917 30512 33466 37793 43154 48606 54172 60583 67605 73899 78698 82450 85500 87283 87370 86152 83663
54902 83663 78676 70223 59692 50343 44524 41834 40033 37414 34270 32263 32220 32641 30850 25911 19893
54887 19893 15850 14952 15976 17032 17104 16287 15478 15886 18133 21518 24598 26725 28758 32075 37038 42542
54871 42542 47059 50160 53025 57264 63118 69120 73610 76192 77382 77294 75379 71473 66556 62033 58361
54856E8361l756n008o018n303l394k553l881n651n597m084l404m179A093a531
54841a342G01K526K390J849N96r70j872j681q45l4L14J73O1N17J154R32j73p05
54823D933M01K359L669L883L418K504J429R79J424J709Q94l17p87r78k006l231
54807B0283k844q35O08J33j154j727j697j791j693o85Q71J871J823J079J66l39
54791A4069J42J407K102J083r73k119j345L55J275P72m58j432j727j294j14J558
54775A3301K779K566J236M40J288K872L299J986O1j208j438o30J242L614N298
54760C6706N781O011P126Q693R020P277M616K841K276J572l77k925m661n368o011
54745G2577o843o822n493m175m169m669l923j888k38J64K13Q07J503J513R87O54
$$ plain form
54856 58361 54605 49597 43579 38276 34882 32329 28448 22797 17200 13116 9712 5533 1093 -1531
54841 -1342 701 3227 5617 7466 8062 7092 5220 3539 2694 2660 2974 3147 3208 3725 4879 5811 5638 4933
54823 4933 5334 7693 11362 15245 18663 21167 22596 23575 24999 26708 27602 27285 26498 25520 23514 20283
54807 20283 17439 16604 17212 17345 16191 14464 12767 10976 9283 8598 9469 11340 13163 14242 14408 14069
54791 14069 14211 15618 17720 18803 17830 15711 14366 14721 15996 16768 16310 14878 13151 11857 11743 13301
54775 13301 16080 18646 19882 20322 21610 24482 27781 29767 29828 28620 27182 26552 27794 31408 36706
54760 36706 42487 48498 55624 64317 73337 80614 85230 88071 90347 91919 91542 88617 83956 78588 72577
54745 72577 65734 58912 53419 49244 45075 40406 36483 34595 34357 34521 34734 35541 37044 38557 39544 40198
54729D0198R61J950L361M484M568L726K956L096M258O054P624P744O031L981L463
54714A04455M126L773J563q05j674j581j871k705l719n223p300q748q540p557
54700F4194p238p183n877l457j903k259l264l186j858l82K20l53j611k366j591
54685B1886L97K031K148J122K18J86Q24J547J962J938J408L88p07j178p84k55
54669C3131l69o79p2J225J334q04l652m738l560j807j011j035q03K66J769K713
54653B1908K394J172R1l72o59j062j156q39q15j213p45J452L932M448K804P88
54637C2128m10j072j518j456r71o51m21M48J968L294M124M841N160M258K640K178
54621E4540L577N255N564M741L825L087K640L233N023O562O426N040L676K440
$$ plain form
54729 40198 41159 43109 46470 50954 55522 59248 62204 65300 69558 75612 83236 90980 97011 100992 104455
54714 104455 108581 112354 113917 113112 111438 109857 107986 105281 101562 96339 89039 80291 71751 64194
54700 64194 56956 49773 43896 40439 38536 36277 33013 29827 27969 27587 27807 27454 25843 23477 21886
54685 21886 22283 24314 26462 27584 27802 27988 28812 30359 32321 34259 35667 36055 35348 34170 33386 33131
54669 33131 32762 32083 32011 33236 34570 33766 30114 25376 21816 20009 18998 17963 17160 17426 19195 21908
54653 21908 24302 25474 25565 25193 24534 23472 22316 21477 20662 19449 18704 20156 24088 28536 31340 32128
54637 32128 31718 30646 29128 27672 26701 26050 25629 26077 28045 31339 35463 40304 45464 49722 52362 54540
54621 54540 58117 63372 68936 73677 77502 80589 83229 86462 91485 98047 104473 109513 113189 115629
54607A15629O79j393l022m325n854p157p278o498n969n749m795l070j984k303
54593E6911l067l166k682k021j033J05L53o80j638j126J10J16j407k608k024m46
54577C5697K33q61k998m767n039l566j185P77J614J567R98j22j469j819l32J927
54561B0655K854J932R39J493K801K772Q46j442k555k483j990j390p10l12n09q94
54545B2007p73q2O80J275J797K037J565P05N28J383K065J258m78j122K93K383
54529C5521L026J701k29j194p60M43J364J152l04k146l169k892j801n63N96J650
54513C2395K480L041L516L996M248M063L520K739J764Q90O35R91J151N30l60o53
54497F4946m63p09j696k651k743j932o25Q42K084K486J709J62j291k063k114j707
$$ plain form
54607 115629 116308 114915 111893 107568 101714 94557 87279 80781 74812 69063 64268 61198 59214 56911
54593 56911 53844 50678 47996 45975 44942 45047 45400 44720 43082 41956 42066 42182 40775 38167 36143 35697
54577 35697 35930 35069 32071 27304 22265 18699 17514 18291 19905 21472 22470 22348 20879 19060 18728 20655
54561 20655 23509 25441 26380 27873 30674 33446 34292 32850 30295 27812 25822 24432 23722 23410 22901 22007
54545 22007 21234 21152 21832 23107 24904 26941 28506 29211 29739 31122 33187 34445 33967 32845 33138 35521
54529 35521 38547 40248 40019 38825 38065 38508 39872 41024 40720 38574 35405 32513 30712 30149 30745 32395
54513 32395 34875 37916 41432 45428 49676 53739 57259 59998 61762 62652 63287 64278 65429 65959 65599 64946
54497 64946 64483 63774 62078 59427 56684 54752 54127 54969 57053 59539 61248 61410 60119 58056 55942 54235
54481E4235j128o15l12k06j05J47L56O9q05j612j572p56P5N73J065J683J986J848
54463E4926J812K056J812N94q20j522j800k296k529j700l88J29j1M57J528J691
54447E3939L94r67j258j120j373j350j19J726K757K505J533L78n47o85K7P45P78
54430E7363M81L35j26j382k622k663j710r61p70m24M68J445K009J958J093l90
54414E4104j502j594j551k506l553k498R12M159N052M135L156K486J458K81NP88
54398F3332J497J289O51M64O70M69l36q43k75O96N60q67j868j030P05J306M95
54381F6915j17L57Q61K55j013j848j963j562o31N63J167J028J270K423K887J051
54365G1643j700k187K29K547K100j31j427j172j044j889k309q15J794L175K164
$$ plain form
54481 54235 53107 52492 52180 51974 51869 52016 52372 52441 51636 50024 48452 47696 47771 48344 49409 51092 53078 54926
54463 54926 56738 58794 60606 61200 60380 58858 57058 54762 52233 50533 50145 50274 50263 50720 52248 53939
54447 53939 54333 53366 52108 50988 49615 48265 48146 49872 52629 55134 56667 57045 56498 55813 55840 56585 57363
54430 57363 57844 58179 58053 56671 54049 51386 49676 48715 47945 47521 47989 49434 51443 53401 54494 54104
54414 54104 52602 51008 49457 46951 43398 40900 41812 45971 51023 55158 58314 60800 62258 62539 62544 63332
54398 63332 64829 66118 66769 67233 67903 68372 68036 67193 66918 67614 68174 67307 65439 64409 65114 66420 66915
54381 66915 66798 67155 68016 68271 67258 65410 63447 61885 61254 61817 62984 64012 65282 67705 70592 71643
54365 71643 69943 67756 67985 70532 72632 72501 71074 69902 68858 66969 64660 63845 65639 68814 70978
54350G0978m2j465j491r68p00o47o86j141j901j871l44J436J522j09j479j449
54334E9643j109j644k272j564J59J317J281O87j35j394k557k457j121r6l93j206
54318D7139j359q82l92J60J065J820J568K88j121j760j258J75J641K071J385O16
54302E1156L91M7r90j907j694q18l71j81O08J497J035p10j921j588o18J19J030
54285D5085K211K361O13j762k904k663k018j139L65J846K091J246P71J262J707
54270D9072J244M88N05J292J967J921J273M60j98o08q70j137j477j948k523k835
54254D6626k326j030N0j56j504k602k143r9K217L210K399R64N07J116J233k48
54238D8214k508l929l990l186j799QJ339J138k51j182o13Q71K058K262J393j48
$$ plain form
54350 70978 70936 69471 67980 67012 66312 65665 64979 63838 61937 60066 59722 61158 62680 62571 61092 59643
54334 59643 58534 56890 54618 53054 53213 54530 55811 56498 56363 54969 52412 49955 48834 48738 48345 47139
54318 47139 45780 44898 44506 44666 45731 47551 49119 49407 48286 46526 45268 45443 47084 49155 50540 51156
54302 51156 51547 51594 50604 48697 47003 46185 45814 45633 46241 47738 48773 48063 46142 44554 43936 44055 45085
54285 45085 47296 49657 50270 48508 45604 42941 40923 39784 40149 41995 44086 45332 46103 47365 49072
54270 49072 50316 50804 51309 52601 54568 56489 57762 58222 58024 57416 56546 55409 53932 51984 49461 46626
54254 46626 44300 43270 43320 43164 41660 39058 36915 36816 39033 42243 44642 45606 46113 47229 48462 48214
54238 48214 45706 41777 37787 34601 32802 32810 34149 35287 35036 33854 33241 34112 36170 38432 39825 39677
54222C9677j313j008O42K238K598J782M52j004k287k822k270j013K69J207J685
54207C8833J603J004J38p86j565j542M9K906N372N897M508K418N64q89j942k362
54191E4206k079j516j261j547k124k537k466j811o17Q55K067K482K057J173J02
54176D6984r93j430l39J864L121J916p31k522k632k034j452o14M91J188J311J387
54160D5515J266J78j357j457L19J778J127l88o52j51r24k784l256j409O92J152
54144C9649Q22J382K410K181N65o86n56n7m00j040n90Q93J825J295K57n8O1l22
54126D7631q30j65J556K479J558N6m43k50n61j240j161k96K06M7K36J182J714
54109E1719P72q53j413l18J350K187J699L31j173k245k614k252j373m00L11P77
$$ plain form
54222 39677 38364 37356 37998 40236 42834 44616 45068 44064 41777 38955 36685 35672 35941 37148 38833
54207 38833 40436 41440 41578 40792 39227 37685 37734 40640 46012 51909 56417 58835 59399 58510 56568 54206
54191 54206 52127 50611 49350 47803 45679 43142 40676 38865 38248 39103 41170 43652 45709 46882 46984
54176 46984 45991 44561 44222 46086 49207 51123 50392 47870 45238 43204 41752 41138 41629 42817 44128 45515
54160 45515 46781 46959 45602 44145 44464 46242 47369 46981 46329 46178 45254 42470 39214 37805 38497 39649
54144 39649 40471 41853 44263 46444 47009 46323 45767 45710 45310 44270 43680 44573 46398 47693 47950 47892 47953 47631
54126 47631 46801 46636 48192 50671 52229 52285 51842 51592 51031 49791 48630 48334 48540 48587 48823 50005 51719
54109 51719 52491 51638 50225 49907 51257 53444 55143 55474 54301 52056 49442 47190 45817 45417 45728 46505
54093D6505J198J405R20k10j126j073k73N44J052J338J488J677K292L236L592
54078F2565K762J598J413K116K417J769R93P98Q31N93K64M2m16j187j424k62J879
54061G6751L589L885K964J743J014R12J043J163J652K992M876O380O991O961O635
54046A29551O088N513N320N606O192P291R282J1566J2590J1636R894Q992R044
54033B38565Q898P825O178M615L449K708K341K251K320K253J351r19l900n957
54019B71978o287n886o125p043p895q677r783j0566r745p469n598n350n708n033
54005A70813l484k783l818n412n726m323k475j654k129l130l954m427m411l604
53991A19483k289j596k255l304k982r36J217J782P55o28j341j137k49O59O27o61
$$ plain form
54093 46505 47703 49108 50028 49818 48692 47619 47346 47890 48942 50280 51768 53445 55737 58973 62565
54078 62565 65327 66925 68338 70454 72871 74640 75633 76431 77262 77855 78119 78161 77745 76558 75134 74872 76751
54061 76751 80340 84225 87189 88932 89946 90858 91901 93064 94716 97708 102584 108964 115955 122916 129551
54046 129551 135639 141152 146472 152078 158270 165561 174843 186409 198999 210635 220529 229521 238565
54033 238565 247463 255288 261466 266081 269530 272238 274579 276830 279150 281403 282754 281835 277935 271978
54019 271978 265691 259805 253680 246637 238742 230065 220282 209716 199971 192502 186904 181554 175846 170813
54005 170813 167329 164546 160728 155316 149590 145267 142792 141138 139009 135879 131925 127498 123087 119483
53991 119483 117194 115598 113343 110039 107057 106121 107338 109120 109875 109247 107906 106769 106520 107179 107806 107145
53975A07145k150k325r71O08J238J074Q59P09L08j41m2N54Q45M64O7M02J316K171
53957A12131K792L401L903L990L758L569L325K564J449Q83J380K355K867K667
53943A51034K203K059K687M177N898O775O489O007O482P969R734J1421J3051J4220
53929B50206J4303J3538J3036J3372J3824J3490J2526J1839J1938J2628J3536
53918C94236J4313J4405J3247J0963Q429O408M755K722j2k928n207o428o704o407
53904D41792o063o187o856p473p362o705o571p822j0178j2534j3924j4041j3119
53891C22957j1671j0259r235q574p984p246o434n900o017o814p825q457q426p757
53877B10358o615n476n201o220p666q000o703m791l469k967k907k937k642j640
$$ plain form
53975 107145 104995 102670 101699 102307 103545 104619 105478 106187 106495 106354 106312 106866 107711 108175 108242 108644 109960 112131
53957 112131 114923 118324 122227 126217 129975 133544 136869 139433 140882 141765 143145 145500 148367 151034
53943 151034 153237 155296 157983 162160 168058 174833 181322 187329 193811 201780 211514 222935 235986 250206
53929 250206 264509 278047 291083 304455 318279 331769 344295 356134 368072 380700 394236
53918 394236 408549 422954 436201 447164 455593 462001 466756 469478 469466 466538 461331 454903 448199 441792
53904 441792 435729 429542 422686 415213 407851 401146 394575 386753 376575 364041 350117 336076 322957
53891 322957 311286 301027 291792 283218 275234 267988 261554 255654 249637 242823 234998 226541 218115 210358
53877 210358 203743 198267 193066 186846 179180 171180 164477 159686 156217 153250 150343 147406 144764 143124
53863A43124m67m95k033l317k533l49R49N16k88k83p3p15j997k865k848k253j520
53846A22553r86q18o89RJ160J636O97p92j340p34j38l78r75j064n26J80Q12J382
53828A19989J683J324L95m00m43J86J038J925K886L701L984L800L752M251N072
53813A53143N729O033O157O525P560R026R645Q258N667M286N369P486Q530Q205
53799B51619P403O170M005J635N70Q45R54L32J33J046J906J381k17j799l113m515
53783B68355n992p330q633r804j0216r659r005r111r610r566q729p429n795l876
53769A53600k017m89P16J214J67k328m673n474n083m498l705k339j100r96j656
53754A21339j889j549j370j352q55j18o9o83j016r01j030j226m41J118J669L69
$$ plain form
53863 143124 142657 142162 140129 136812 134279 133930 134879 135395 135107 134824 134751 134036 132039 129174 126326 124073 122553
53846 122553 121567 120749 120060 120069 121229 122865 123562 122770 121430 120696 120558 120180 119205 118141 117615 117795 118607 119989
53828 119989 121672 122996 123391 122991 122548 122734 123772 125697 128583 132284 136268 140068 143820 148071 153143
53813 153143 158872 164905 171062 177587 185147 194173 203818 212076 217743 222029 227398 234884 243414 251619
53799 251619 259022 265192 269197 270832 271402 272247 273201 273533 273666 274712 276618 277999 277782 275983 272870 268355
53783 268355 262363 255033 246400 236596 226380 216721 207716 198605 188995 179429 170700 163271 157476 153600
53769 153600 151583 151094 151810 153024 153191 150863 146190 140716 135633 131135 127430 125091 123991 122995 121339
53754 121339 119450 117901 116531 115179 114324 114206 114137 113454 112438 111537 110507 109281 108840 109958 111627 111996
53738A11996j307j622p50M0K73L54O08J144K029K901L026K329J665J586J627J247
53722A27146P02M38N09J033K219L421L379K104J321K111L368L668L345L294L041
53707A61099J896J011K049M261N217M378L737M428M966L794J794Q67J288J838
53693B02623J806J516J286J064R69J315J987K370K035J179M00J56L04R9j062k820
53677B15227m040m047l265k532k226k269k552k898k970k552j744o32Q72K553L590
53662A90515L229J679j3q57n84K91P32j28j936l007j938N69K182J567p2n51O21
53645A92299J971K247J957K214K917L053K522K461L399M155L403J721R27J625
53631B26871K526K427J820J846K519K923K740K512K397J768N43k7J259L779N688
$$ plain form
53738 111996 110689 109067 108317 108357 108630 108984 109592 110736 112765 115666 118692 121021 122686 124272 125899 127146
53722 127146 127848 128286 128795 129828 132047 135468 138847 140951 142272 144383 147751 151419 154764 158058 161099
53707 161099 162995 164006 166055 170316 175533 179911 183648 188076 193042 196836 198630 199497 200785 202623
53693 202623 204429 205945 207231 208295 209264 210579 212566 214936 216971 218150 218550 218706 219010 219109 218047 215227
53677 215227 211187 207140 203875 201343 199117 196848 194296 191398 188428 185876 184132 183500 184372 186925 190515
53662 190515 193744 195423 195410 194553 193969 194260 194992 194864 192928 189921 187983 188552 190734 192301 192229 191678 192299
53645 192299 194270 196517 198474 200688 203605 206658 209180 211641 215040 219195 222598 224319 225246 226871
53631 226871 229397 231824 233644 235490 238009 240932 243672 246184 248581 250349 250892 250865 252124 255903 261591
53616B61591O209O333O964P441O738N319M693N317O171O493O653O836O022L388
53602C46168O3j688r18J130K577K518J220m56j545j467m99M48N78l80k222m278
53586C41249n516n242l844k490k005k341k910l096k570j679j387k226l389l520
53572B99034k384r96j48L12O22N14r0n75m59j00p7m10q30j254j520j217k73P92
53554B90941J633K505L389L475K335J026R66K109L217L766M432N728P118P758
53540C40398P397O427N662O106Q093J0524J1704J1247J0455J0597J1593J2766
53528D52969J4021J5654J7471J8861J9504J9521J9204J9055J9746K1493K3622
53517F61121K5235K6161K6868K7711K8812L0432L2716L5055L6496L6989L7542
$$ plain form
53616 261591 267800 274133 281097 288538 295276 300595 305288 310605 316776 323269 329922 336758 342780 346168
53602 346168 346231 344543 343625 344755 347332 349850 351070 350614 349069 347602 347103 347551 348129 347749 345527 341249
53586 341249 335733 330491 326647 324157 322152 319811 316901 313805 311235 309556 308169 305943 302554 299034
53572 299034 296650 295654 295506 295818 296440 296954 296864 296289 295830 295730 295653 295243 294413 293159 291639 290422 290149 290941
53554 290941 292574 295079 298468 301943 304278 305304 306270 308379 311596 315362 319794 325522 332640 340398
53540 340398 347795 354222 359884 365990 374083 384607 396311 407558 418013 428610 440203 452969
53528 452969 466990 482644 500115 518976 538480 558001 577205 596260 616006 637499 661121
53517 661121 686356 712517 739385 767096 795908 826340 859056 894111 930607 967596 1005138
53506A005138L8758L9769L9169L6743L3670L1206K9654K8591K7574K6474K5539
53495A362285K5226K5665K6255K6216K5679K5705K6872K8392K9119K8995K8743
53484A659152K8498K7654K6101K4594K3580K2391K0158J6974J3600J0459P435
53473A880596M334J039k465n839q602j1088j4605j9729k4811k7396k7095k5957
53461A718382k5810k6284k6124k5447k5726k7793l0811l3174l3950l3316l1989
53450A397958l0498k8974k7485k6230k5105k3434k0831j8165j6748j6391j5337
53439A148760j2624r409p060m970j766J968M085M156M449O814J0080J1811J1687
53426A167981J1627J2975J5080J6804J8166J9962K2529K5520K8443L0985L3049
$$ plain form
53506 1005138 1043896 1083665 1122834 1159577 1193247 1224453 1254107 1282698 1310272 1336746 1362285
53495 1362285 1387511 1413176 1439431 1465647 1491326 1517031 1543903 1572295 1601414 1630409 1659152
53484 1659152 1687650 1715304 1741405 1765999 1789579 1811970 1832128 1849102 1862702 1873161 1880596
53473 1880596 1884930 1885969 1883504 1877665 1869063 1857975 1843370 1823641 1798830 1771434 1744339 1718382
53461 1718382 1692572 1666288 1640164 1614717 1588991 1561198 1530387 1497213 1463263 1429947 1397958
53450 1397958 1367460 1338486 1311001 1284771 1259666 1236232 1215401 1197236 1180488 1164097 1148760
53439 1148760 1136136 1126727 1119667 1114697 1112931 1114899 1118984 1123140 1127589 1134403 1144483 1156294 1167981
53426 1167981 1179608 1192583 1207663 1224467 1242633 1262595 1285124 1310644 1339087 1370072 1403121
53415A403121L4748L6353L8034L9940M2391M5601M9085N1906N3708N5098N6747
53404A906732N8656O0679O3230O6820P1265P5820P9804Q2607Q3653Q3249Q3101
53393B715616Q4707Q7198Q7938Q5620Q1742P8544P6528P4785P2654O9925O6065
53382C581322O0581N3983M7246M0371L2615K4175J6471J0250M411k632j1054j9673
53370C838066k7447l4356m1100m8507n6884o5555p3131p8733q2762q6221q9367
53359C154003r1373r1283q9048q5726q2655q0213p7428p3182o7861o3212o0465
53348B291557n9190n8436n8017n8016n7701n6141n3604n1235m9413m7372m4612
53337A697820m1611l8877l6107l2754k8781k4528k0455j7346j6003j6307j7169
$$ plain form
53415 1403121 1437869 1474222 1512256 1552196 1594587 1640188 1689273 1741179 1794887 1849985 1906732
53404 1906732 1965388 2026067 2089297 2156117 2227382 2303202 2383006 2465613 2549266 2632515 2715616
53393 2715616 2800323 2887521 2975459 3061079 3142821 3221365 3297893 3372678 3445332 3515257 3581322
53382 3581322 3641903 3695886 3743132 3783503 3816118 3840293 3856764 3867014 3871425 3868793 3857739 3838066
53370 3838066 3810619 3776263 3735163 3686656 3629772 3564217 3491086 3412353 3329591 3243370 3154003
53359 3154003 3062630 2971347 2882299 2796573 2713918 2633705 2556277 2483095 2415234 2352022 2291557
53348 2291557 2232367 2173931 2115914 2057898 2000197 1944056 1890452 1839217 1789804 1742432 1697820
53337 1697820 1656209 1617332 1581225 1548471 1519690 1495162 1474707 1457361 1441358 1425051 1407882
53326A407882j7781j8228j8519j7943j6156j4115j2929j2333j1242r348p106m612
53314A247570j729Q45K060K231L007N240Q008J0181J1957J4115J6693J9184K1410
53301A360772K3508K5571K7929L1198L5297L9090M1682M3582M5611M7248M7268
53290A768756M5780M4254M3316M1685L7972L2697K7702K3899K0372J5733R792
53279B111958L558k108p277j2187j6367j9260k1465k4306k7959l1074l2708l3555
53267A887250l4520l5278l5405l5875l7751m0051m0818m0093l9940m1365m3130
53256A463024m4093m4706m5380m5121m3215m0900l9805l9625l8760l6638l4047
53245A010734l1678k9687k8350k7885k7751k7190k6308k5596k4680k2748k0181
$$ plain form
53326 1407882 1390101 1371873 1353354 1335411 1319255 1305140 1292211 1279878 1268636 1259288 1252182 1247570
53314 1247570 1245841 1246686 1248746 1250977 1253984 1259224 1267232 1277413 1289370 1303485 1320178 1339362 1360772
53301 1360772 1384280 1409851 1437780 1468978 1504275 1543365 1585047 1628629 1674240 1721488 1768756
53290 1768756 1814536 1858790 1902106 1943791 1981763 2014460 2042162 2066061 2086433 2102166 2111958
53279 2111958 2115516 2113408 2106131 2093944 2077577 2058317 2036852 2012546 1984587 1953513 1920805 1887250
53267 1887250 1852730 1817452 1782047 1746172 1708421 1668370 1627552 1587459 1547519 1506154 1463024
53256 1463024 1418931 1374225 1328845 1283724 1240509 1199609 1159804 1120179 1081419 1044781 1010734
53245 1010734 979056 949369 921019 893134 865383 838193 811885 786289 761609 738861 718680
53234G18680j8411j7886j7213j4871j1085p569n987o860r459j2304j4068j4350
53222E68617j3736j3195j3451j4543j5676j5848j4999j4147j4043j4240j3941
53211D10798j3190j2533j2048j1443j0738j0040r174q229p833p950p379n681m685
53198B89875o225r018r911q076n751m720m440m129m321n147n232l735j923j248
53184B15999j359j400j679k498k811j900j076j640k407j568J5M1j329j722o55
53169A94011k78j405j897l68J237P78m51K28K460L305J709RM68K366L507L200
53153B08879K426J886J252K43o26p94m42k0O24K026M051N658N857M511K219l3
53137B37717j056k44J417J935O83o00j60J189J214m41j870j830j277j407j870
$$ plain form
53234 718680 700269 682383 665170 650299 639214 631645 625658 618798 609339 597035 582967 568617
53222 568617 554881 541686 528235 513692 498016 482168 467169 453022 438979 424739 410798
53211 410798 397608 385075 373027 361584 350846 340806 331632 323403 315570 307620 300241 294560 289875
53198 289875 283650 274632 264721 256645 250894 246174 241734 237605 233284 228137 222905 219170 217247 215999
53184 215999 214640 213240 211561 209063 206252 204352 203276 201636 199229 197661 197676 197717 196388 194666 194011
53169 194011 193733 192328 190431 190063 191300 192078 191627 191855 194315 197620 199329 199338 199806 202172 205679 208879
53153 208879 211305 213191 214443 214686 214060 213266 212824 212804 213428 215454 219505 225163 231020 235531 237750 237717
53137 237717 236661 236417 237834 239769 240452 239852 239692 240881 242095 241654 239784 237954 236677 235270 233400
53122B33400j904j938k681l533l383k497k196k825l317k872j942j299r90o75k89
53107B01059k7m0m66j330k239k567k171j573j256j140r99j037j608k468k756j909
53091A77473m89R7j014l055m197l425j616n04p47j496j676j106k67L78M79k65
53075A58570j643k654k296q32K72j30j584k676k641k001j537j225n56M23J039
53060A40529Q90K30o09j542k225k017j039o12j721l391l638k053l37q9j046j895
53044A19435j871r59N38J799J628j53j915j859j65J474K105K143J954J278L21
53029A25753M7P04J070K6j851k959k380m10J919L320L051J907J626K549K826J037
53013A38235j433k163j142n76j418k190j662p96j044k095k456j450L15J815K220
$$ plain form
53122 233400 231496 229558 226877 223344 219961 217464 215268 212443 209126 206254 204312 203013 202023 201348 201059
53107 201059 201032 200992 200526 199196 196957 194390 192219 190646 189390 188250 187251 186214 184606 182138 179382 177473
53091 177473 176984 177081 176067 173012 168815 165390 163774 163270 162523 161027 159351 158245 157978 158356 158835 158570
53075 158570 156927 154273 151977 151145 151417 151287 149703 147027 144386 142385 140848 139623 139067 139490 140529
53060 140529 141419 141649 141040 139498 137273 135256 134217 133605 131884 128493 124855 122802 122465 122376 121330 119435
53044 119435 117564 116605 117143 118942 120570 120417 118502 116643 116478 117952 120057 122200 124154 125432 125753
53029 125753 125800 126504 127574 127600 125749 122790 120410 120000 121919 125239 128290 130197 131823 134372 137198 138235
53013 138235 136802 134639 133497 132921 131503 129313 127651 126855 125811 123716 121260 119810 120125 121940 124160
52998A24160J295j36p44k52K85K17K92J131J863J409K06o85j293k046k153n87
52982A22962J601K092O68k54Q81K526K404O39q58j162r64r23p65m5J161K403L031
52965A35397K374L78j902l092k816j817r39m31j95n5L14J228K508L508L733L179
52949A41372K046N99n31m60J005K790L448K590J040m34j844l262m063l676k695
52934A37925k336k766k876k006r77q24j246j155k59Q33J655K065J646K7k040l042
52918A24624k461j325o61k80L98J164J450J329J256J069R9j633k964k729j182
52903A18154O8k21j356j332O53K951L328J653k36j009r50o72k38L4o26k016k549
52886A15636j366J73K73p92j274m90O13J108R64L84n18j217r65K87J831L027L616
$$ plain form
52998 124160 125455 125319 124575 124323 124608 124825 125117 126248 128111 129520 129726 129041 127748 125702 123549 122962
52982 122962 124563 126655 127323 127069 127950 130476 132880 133519 132661 131499 130535 129612 128847 128802 129963 132366 135397
52965 135397 137771 138149 136247 133155 130339 128522 127583 127152 126957 126902 127216 128444 130952 134460 138193 141372
52949 141372 143418 144017 143486 143026 144031 146821 150269 152859 153899 153465 151621 148359 144296 140620 137925
52934 137925 135589 132823 129947 127941 126964 126140 124894 123739 123480 124313 125968 128033 129679 129706 127666 124624
52918 124624 122163 120838 120177 119897 120295 121459 122909 124238 125494 126563 126662 125029 122065 119336 118154
52903 118154 118222 118001 116645 115313 115966 118917 122245 123898 123662 122653 121703 121031 120793 120827 120201 118185 115636
52886 115636 114270 114443 114716 113924 112650 112160 112773 113881 114845 115229 114711 113494 112529 112816 114647 117674 121290
52869A21290L340K097M11r92j957k629k858k718l091m476n580m602j920k4m31
52854I5860k061l048k806j821p23k09p54j592j083J178L592M468L717K029j94
52839I6553k291l160k731k416k858k574m43J885K106Q07M64J425J581Q7j180p51
52823H6504K35J93l61L5J323K229K289K120K093J869J208L95j51k15P3J93k91
52806I9741r93j026k45M93P27R99J603J753R15%J30Q75J009M47R9J03k81j060
52788A05289j250n15K37L46K88N28N88R1k39L34J131P92q23k507l394l746l857
52771I3293l200j342Q41J666N36j189j540M1K235L267K543Q88m04n72K83J463
52755I8809K304K664K753K545J734M45n67q68j033j738k550k502j596p71l22M70
$$ plain form
52869 121290 124630 126727 127138 126146 124189 121560 118702 115984 112893 108417 102837 98235 96315 96291 95860
52854 95860 93799 90751 87945 86124 85401 85192 84438 82846 81763 82941 86533 91001 94718 96747 96553
52839 96553 94262 91102 88371 85955 83097 80523 80080 81965 84071 84878 85342 86767 88348 88435 87255 86504
52823 86504 86739 86932 86571 86606 87929 90158 92447 94567 96660 98529 99737 100132 99981 99766 99839 100032 99741
52806 99741 98748 97722 97477 97970 98697 99696 101299 103052 103967 103967 104097 104972 105981 106428 106527 106630 106349 105289
52788 105289 104039 103524 103761 104107 104395 104923 105511 105602 105363 105697 106828 107620 106797 104290 100896 97150 93293
52771 93293 90093 88751 89592 91258 91794 90605 89065 89106 91341 94608 97151 98039 97635 97063 97346 98809
52755 98809 101113 103777 106530 109075 110809 111254 110687 109819 108786 107048 104498 101996 100400 99629 99307 99777
52739I9777J843K747K300J141M03k0j077k628l211j982j0R45M25m75o40r2M21
52722I9867N02M11M10L86K75M76J272K160K326J740J109P62L38k55m03K38J057
52705A12671J397J498J868K169J647L64p91j254j245j100q36m12R6O42J117J200
52689A19031P54K49L10R62J748K352K580K088Q06n17r63m98M16J820L756M954
52673A39848L684K90k474k564r30J25j08n93n80l04L1O64J496J888J481N33o72
52656A41815k004k863k300l75J182M89k293m873n281l943k917l195l556k379j6
52641A07491J564J249L5m73L2O29N18k85j155j280k35J359K095J303j0l37L88
52624A12888Q14Q2j062j297l24R54J634J725J804K049J984J306M38j80r38k360
$$ plain form
52739 99777 101620 104367 106667 107808 108211 108191 107114 104486 101275 99293 99283 100228 100653 100178 99538 99446 99867
52722 99867 100369 100780 101190 101576 101851 102327 103599 105759 108085 109825 110934 111696 112034 111779 111376 111614 112671
52705 112671 114068 115566 117434 119603 121250 121614 120823 119569 118324 117224 116388 115976 116072 116714 117831 119031
52689 119031 119785 120034 120344 121306 123054 125406 127986 130074 130880 130363 129400 128902 129318 131138 134894 139848
52673 139848 143532 143822 141348 138784 137854 137979 137871 137278 136698 136394 136425 137089 138585 140473 141954 142487 141815
52656 141815 139811 136948 134648 134273 135455 135944 133651 128778 123497 119554 116637 113442 109886 107507 107491
52641 107491 109055 110304 110339 109866 109898 110527 111045 110760 109605 108325 108090 109449 111544 112847 112837 112500 112888
52624 112888 113702 113784 112722 111425 111101 112055 113689 115414 117218 119267 121251 122557 122995 122815 121877 119517
52608A19517l668l265r60J455K445K487K687K762J899P17O67J656K079J339O45
52593A32462Q28J009K73o09l89O90J249O65m86j491k069k050j325k08P48J306
52577A30603J529J356P43P3j3O54J573K083J846R40j58q62j060j383k457l905
52561A31562m496l499j631l65k97n01K49J727K286Q73j485k816k447j373n61J
52545A17227M65N55L35N02J078Q07j067l079l021p56J599K285J465J88r12j481
52529A16190j222m42Or1P5Q90J372N83o57n99J008K485K360J026j19m59n11q59
52511A21036j448j905k066j948j503p25J25O68R01J231J787J968J100n54j883
52496A16784k210k035k230k815l007k302j078j25O7m84j347j791j131O20K548
$$ plain form
52608 119517 115849 112584 111624 113079 115524 118011 120698 123460 125359 126076 126743 128399 130478 131817 132462
52593 132462 133290 134299 134572 133963 133574 134264 135513 136178 135692 134201 132132 130082 128757 128549 129297 130603
52577 130603 132132 133488 134231 134304 134291 134945 136518 138601 140447 141387 141229 140367 139307 137924 135467 131562
52561 131562 127066 123567 121936 121571 121274 120773 121022 122749 125035 125908 124423 121607 119160 117787 117226 117227
52545 117227 117692 118247 118582 119084 120162 120969 119902 116823 113802 113046 114645 116930 118395 118583 117671 116190
52529 116190 114968 114526 114532 114441 114516 115406 116778 117361 116704 116105 117113 119598 121958 122984 122865 122406 121895 121036
52511 121036 119588 117683 115617 113669 112166 111441 111566 112234 113135 114366 116153 118121 119221 118667 116784
52496 116784 114574 112539 110309 107494 104487 102185 101107 100982 101049 100565 99218 97427 96296 96916 99464
52481I9464L523L171J941L76j238k396k146j03K442L309J767n24j347l46J034
52466A08927J590J376Q31M6o54m24R45K115J453r17l082l445k223p76j2K47O68
52449A06665J508K204J857L55j138j230J62J750K463K523K606K558J599l12k087
52434A21483k607j796l63J067K265L006K981K222J252N37K2m84o84q2J144K101
52418A32064K260J985J588O02j281k935k589q9K506L004J266j054k412k543k049
52403A30323j467q90k81J19N0p0P18K436L413K129l46j140P89L194L498J979P81
52386A45235Q55J401J728K077K662L342M235N340N682M274K114J534L091M671
52372A88241M446L219K712K931K729K057J952K729L624M135M368M144L075J647
$$ plain form
52481 99464 102987 106158 108099 108475 107237 104841 102695 102592 105034 108343 110110 109586 108239 107893 108927
52466 108927 110517 111893 112724 112770 112116 111692 112637 114752 116205 115288 112206 108761 106538 105762 105750 105997 106665
52449 106665 108173 110377 112234 112589 111451 110221 110383 112133 114596 117119 119725 122283 123882 123570 121483
52434 121483 118876 117080 116717 117784 120049 123055 126036 128258 129510 130047 130069 129585 128901 128819 129963 132064
52418 132064 134324 136309 137897 138499 137218 134283 131694 131605 134111 137115 138381 137327 134915 132372 130323
52403 130323 128856 127966 127685 127804 127854 127784 128502 130938 134351 136480 136134 134994 135783 138977 142475 144454 145235
52386 145235 146090 147491 149219 151296 153958 157300 161535 166875 172557 176831 178945 180479 183570 188241
52372 188241 192687 195906 198618 201549 204278 206335 208287 211016 214640 218775 223143 227287 230362 232009
52358B32009J065J751K970M078N123N893N724M768M404N527P323Q609R531J0822
52344C09597J2096J2387J2104J2816J4858J6635J6924J6613J7199J8684K0183
52333D80096K1763K4047K6314K6763K5102K3350K3203K3873K3531K2035K0806
52322G40883K0391J9647J7605J5110J3900J4395J4958J3476R610N213K193L30
52310H87711j980m827o114m575k090j546l253n188o194o937p756p704o376m972
52296H18199m637m967m888l893j771J542N200P750Q932J0004J1605J2833J3231
52283H69140J4007J5933J7684J7912J7554J8130J9061J8773J7526J6683J5950
52272A058353J3848J0634Q119O548M270Q85j781k687l140m323n397n575o091q284
$$ plain form
52358 232009 233074 234825 237795 241873 246996 252889 258613 263381 267785 273312 280635 289244 298775 309597
52344 309597 321693 334080 346184 359000 373858 390493 407417 424030 441229 459913 480096
52333 480096 501859 525906 552220 578983 604085 627435 650638 674511 698042 720077 740883
52322 740883 761274 780921 798526 813636 827536 841931 856889 870365 879975 885188 887381 887711
52310 887711 885731 880904 874790 870215 868125 866579 863326 858138 851944 845007 837251 829547 823171 818199
52296 818199 813562 808595 803707 799814 798043 799585 804785 812535 821467 831471 843076 855909 869140
52283 869140 883147 899080 916764 934676 952230 970360 989421 1008194 1025720 1042403 1058353
52272 1058353 1072201 1082835 1090954 1097502 1101772 1102657 1100876 1098189 1095049 1090726 1085329 1079754 1073663 1065379
52258A065379j1039j2013j0764r107q780r964j1691j2683j2089j0275q717q478
52246I39779r099r393q769p269n068k622p76m6j20l58k33Q88L336O086P201O220
52230I19757M992N255O325O484N693N465O456P646P950P410O689O323O643P742
52216A010830R272J0627J1308J0942R420P425O128N868N748N132M663M951N162
52203A107476M136K272Q48m0j292k708k785r64J299K226J465k26k059l428l902
$$ plain form
52258 1065379 1054340 1042327 1031563 1022456 1013676 1003712 992021 979338 967249 956974 948257 939779
52246 939779 930680 921287 912518 905249 900181 897559 896783 896737 896617 896259 896026 896914 900250 906336 913537 919757
52230 919757 924749 930004 936329 942813 948506 953971 960427 968073 976023 983433 990122 996445 1003088 1010830
52216 1010830 1020102 1030729 1042037 1052979 1062399 1069824 1075952 1081820 1087568 1092700 1097363 1102314 1107476
52203 1107476 1111612 1113884 1114732 1114692 1113400 1110692 1107907 1106943 1108242 1110468 1111933 1111707 1109648 1106220 1102318
$$ [...]
##END NTUPLES=NMR SPECTRUM
##END=
