##TITLE=NES1068_159122.0013_001_9705792_3LNsZ8qjEM
##JCAMPDX= 6.0         $$ Bruker NMR JCAMP-DX V2.0
##DATA TYPE= NMR SPECTRUM
##DATA CLASS= NTUPLES
##ORIGIN= BRUKER
##OWNER= Administrator
$$ 1.72 TOPSPIN		Version 2.1
$$ 2016-04-30 21:25:54.271 -0700  Administrator@X
$$ Compression mode = diff/dup
##.OBSERVE FREQUENCY= 400.02188249412
##.OBSERVE NUCLEUS= ^1H
##.ACQUISITION MODE= SIMULTANEOUS (DQD)
##.ACQUISITION SCHEME= undefined
##.AVERAGES= 64
##.DIGITISER RES= 22
##SPECTROMETER/DATA SYSTEM= spect
##.PULSE SEQUENCE= noesygpps1d.comp
##.SOLVENT NAME= COFFEE_meoh
##.SHIFT REFERENCE= INTERNAL, COFFEE_meoh, 1, 14.96176
##AUDIT TRAIL= $$ (NUMBER, WHEN, WHO, WHERE, PROCESS, VERSION, WHAT)
$$ ##TITLE= Audit trail, TOPSPIN		Version 2.1
$$ ##JCAMPDX= 5.01
$$ ##ORIGIN= Bruker BioSpin GmbH
$$ ##OWNER= Administrator
$$ $$ E:\/data/COFFEE/nmr/NES1068_159122.0013_001_9705792_3LNsZ8qjEM/22/pdata/1/auditp.txt
$$ ##AUDIT TRAIL=  $$ (NUMBER, WHEN, WHO, WHERE, PROCESS, VERSION, WHAT)
(   1,<2016-04-30 21:25:49.005 -0700>,<Administrator>,<X>,<go>,<TOPSPIN 2.1>,
      <created by zg
	started at 2016-04-30 21:14:19.286 -0700,
	POWCHK enabled, PULCHK disabled,
       configuration hash MD5:
       21 0F 79 D6 B3 7B B4 F6 88 20 88 DB 03 48 BD 9F
       data hash MD5: 64K
       60 42 C1 FD 4A B6 66 AC 3C 6A 46 64 60 9C EE E2>)
(   2,<2016-04-30 21:25:52.239 -0700>,<Administrator>,<X>,<proc1d>,<TOPSPIN 2.1>,
      <Start of raw data processing
       efp LB = 0.3 FT_mod = 6 PKNL = 1 PHC0 = 0 PHC1 = 0 SI = 128K 
       data hash MD5: 128K
       6D 93 66 7A 15 AB A4 1B B3 A0 1D 41 4D DD 4A 3E>)
(   3,<2016-04-30 21:25:53.130 -0700>,<Administrator>,<X>,<proc1d>,<TOPSPIN 2.1>,
      <pk PHC0 = -85.73181 PHC1 = 0 
       data hash MD5: 128K
       BD 19 2A 54 3D 61 32 F1 0D 7D EF FB 8C A9 25 EA>)
(   4,<2016-04-30 21:25:53.505 -0700>,<Administrator>,<X>,<proc1d>,<TOPSPIN 2.1>,
      <abs ABSG = 1 
       data hash MD5: 128K
       7F DD 20 A4 F3 98 9F 53 37 E4 EC F1 75 50 87 B6>)
(   5,<2016-04-30 21:25:53.599 -0700>,<Administrator>,<X>,<proc1d>,<TOPSPIN 2.1>,
      <abs ABSG = 2 
       data hash MD5: 128K
       B2 86 BE 1B C0 52 8B 28 A7 9A 49 4F B6 27 8D C1>)
(   6,<2016-04-30 21:25:53.692 -0700>,<Administrator>,<X>,<proc1d>,<TOPSPIN 2.1>,
      <abs ABSG = 3 
       data hash MD5: 128K
       EF EE 57 F6 DE 4B 5F 94 94 D8 22 C2 0C B9 8A D9>)
(   7,<2016-04-30 21:25:53.786 -0700>,<Administrator>,<X>,<proc1d>,<TOPSPIN 2.1>,
      <abs ABSG = 4 
       data hash MD5: 128K
       00 E1 28 9B 57 9C 67 7E C5 B1 D5 05 75 8B F9 AA>)
(   8,<2016-04-30 21:25:53.896 -0700>,<Administrator>,<X>,<proc1d>,<TOPSPIN 2.1>,
      <abs ABSG = 5 
       data hash MD5: 128K
       00 C7 CA BB 21 62 C5 C2 D2 EE 91 4F AA AE 09 D8>)
$$ ##END=
$$ 
$$ $$ hash MD5
$$ $$ 5B 84 DC 64 2E 80 DF 31 2C 0B 08 43 0B 32 EE 62
##$RELAX= 
##$RELAX= 
##$RELAX= 
##$RELAX= 
##$RELAX= 
##$RELAX= 
##$RELAX= 
##$RELAX= 
$$ Bruker specific parameters
$$ --------------------------
##$DU= <E:\>
##$EXPNO= 22
$$ [...]
##$TP07= 0
##$TPNAME0= <>
##$TPNAME1= <>
##$TPNAME2= <>
##$TPNAME3= <>
##$TPNAME4= <>
##$TPNAME5= <>
##$TPNAME6= <>
##$TPNAME7= <>
##$TPOAL= (0..7)
0.5 0.5 0.5 0.5 0.5 0.5 0.5 0.5
##$TPOFFS= (0..7)
0 0 0 0 0 0 0 0
##$TUNHIN= 0
##$TUNHOUT= 0
##$TUNXOUT= 0
##$USERA1= <user>
##$USERA2= <user>
##$USERA3= <user>
##$USERA4= <user>
##$USERA5= <user>
##$V9= 5
##$VALIST= <valist>
##$VCLIST= <CCCCCCCCCCCCCCC>
##$VD= 0
##$VDLIST= <DDDDDDDDDDDDDDD>
##$VPLIST= <PPPPPPPPPPPPPPP>
##$VTLIST= <TTTTTTTTTTTTTTT>
##$WBST= 2048
##$WBSW= 25
##$XGAIN= (0..3)
0 0 0 0
##$XL= 0
##$YL= 0
##$YMAX_a= 5466530
##$YMIN_a= -11803321
##$ZGOPTNS= <>
##$ZL1= 120
##$ZL2= 120
##$ZL3= 120
##$ZL4= 120
##$ABSF1= 14.96176
##$ABSF2= -5.596422
##$ABSG= 5
##$ABSL= 3
##$ALPHA= 0
##$AQORDER= 0
##$ASSFAC= 0
##$ASSFACI= 0
##$ASSFACX= 0
##$ASSWID= 0
##$AUNMP= <proc_prof1d_extract.lims>
##$AXLEFT= 0
##$AXNAME= <>
##$AXNUC= <1H>
##$AXRIGHT= 0
##$AXTYPE= 0
##$AXUNIT= <>
##$AZFE= 0.1
##$AZFW= 0.1
##$BCFW= 0
##$BC_mod= 0
##$BYTORDP= 0
##$COROFFS= 0
##$CY= 15
##$DATMOD= 1
##$DC= 0
##$DFILT= <>
##$DTYPP= 0
##$F1P= 0
##$F2P= 0
##$FCOR= 0.5
##$FTSIZE= 131072
##$FT_mod= 6
##$GAMMA= 0
##$GB= 0
##$INTBC= 1
##$INTSCL= 1
##$ISEN= 128
##$LB= 0.3
##$LEV0= 0
##$LPBIN= 0
##$MAXI= 10000
##$MC2= 0
##$MEAN= 0
##$ME_mod= 0
##$MI= 0
##$NCOEF= 0
##$NC_proc= -2
##$NLEV= 6
##$NOISF1= 0
##$NOISF2= 0
##$NSP= 0
##$NTH_PI= 0
##$NZP= 0
##$OFFSET= 14.96176
##$PC= 1
##$PHC0= -85.73181
##$PHC1= 0
##$PH_mod= 1
##$PKNL= yes
##$PPARMOD= 0
##$PPDIAG= 0
##$PPIPTYP= 0
##$PPMPNUM= 2147483647
##$PPRESOL= 1
##$PSCAL= 4
##$PSIGN= 0
##$PYNMP= <proc.py>
##$REVERSE= no
##$SF= 400.020009333809
##$SI= 131072
##$SIGF1= 0
##$SIGF2= 0
##$SINO= 400
##$SIOLD= 131072
##$SPECTYP= <>
##$SREGLST= <1H.CDCl3>
##$SSB= 0
##$STSI= 131072
##$STSR= 0
##$SW_p= 8223.68421052631
##$SYMM= 0
##$S_DEV= 0
##$TDeff= 65536
##$TDoff= 0
##$TI= <>
##$TILT= no
##$TM1= 0
##$TM2= 0
##$TOPLEV= 0
##$USERP1= <user>
##$USERP2= <user>
##$USERP3= <user>
##$USERP4= <user>
##$USERP5= <user>
##$WDW= 1
##$XDIM= 131072
##$YMAX_p= 454996902
##$YMIN_p= -87328
##$CURPLOT= <Network HP LaserJet P1505>
##$CURPRIN= <$Network HP LaserJet P1505>
##$DFORMAT= <normdp>
##$LAYOUT= <+/1D_H.xwp>
##$LFORMAT= <normlp>
##$PFORMAT= <normpl>
##$SURQMSG= 1
$$ End of Bruker specific parameters
$$ ---------------------------------
##NTUPLES= NMR SPECTRUM
##VAR_NAME=  FREQUENCY,     SPECTRUM/REAL,   SPECTRUM/IMAG
##SYMBOL=    X,             R,               I
##VAR_TYPE=  INDEPENDENT,   DEPENDENT,       DEPENDENT
##VAR_FORM=  AFFN,          ASDF,            ASDF
##VAR_DIM=   131072,        131072,          131072
##UNITS=     HZ,            ARBITRARY UNITS, ARBITRARY UNITS
##FACTOR=    0.0627417313425164, 1,          1
##FIRST=     8223.62146879497, 3174,         -53520
##LAST=      0,             5711,            -54259
##MIN=       0,             -87328,          0
##MAX=       8223.62146879497, 454996902,    0
$$ Real data points
##PAGE= N=1
##DATA TABLE= (X++(R..R)), XYDATA
$$ [...]
63721C56657N089L876L309L484L949L948L256K714L298M685N556N345M753M384
63707D14303L957L293L047L723M798N443N488N094M235L087K280K124K193K180
63693D65245K393K806K459O32j970m110n566o941q444r683j0411j0676j0470r858
63679C95406r163q491p421n760m178l457l453l448l180k901k720k630k876l642
63665C32086m589n200n376n241m782m120l700l625l288k319j362j129j197o45
63651B85513M80J292J476J518J670J625J382J502K307L434M396M994N119M706
63637C21414M095L899M365N177O013O919Q049R363J0625J1526J1942J2274J3325
63624D28986J5414J7822J9543K0326K0525K0205J9054J7071J4600J1691Q065L903
$$ y = [356657, 361746, 365622, 368931, 372415, 376364, 380312, 383568, 386282, 389580, 394265, 399821, 405166, 409919, 414303, 418260, 421553, 424600, 428323, 433121, 438564, 444052, 449146, 453381, 456468, 458748, 460872, 463065, 465245, 467638, 470444, 472903, 473535, 471565, 467455, 461889, 454948, 446504, 436821, 426410, 415734, 405264, 395406, 386243, 377752, 370331, 364571, 360393, 356936, 353483, 350035, 346855, 343954, 341234, 338604, 335728, 332086, 327497, 322297, 316921, 311680, 306898, 302778, 299078, 295453, 292165, 289846, 288484, 287355, 286158, 285513, 285993, 287285, 288761, 290279, 291949, 293574, 294956, 296458, 298765, 302199, 306595, 311589, 316708, 321414, 325509, 329408, 333773, 338950, 344963, 351882, 359931, 369294, 379919, 391445, 403387, 415661, 428986, 444400, 462222, 481765, 502091, 522616, 542821, 561875, 578946, 593546, 605237, 613302, 617205]
63612F17205J07k522l943m604m853m820m542l976l081k089j548k012l701o378
63598E69243r323j1554j2477j2455j2436j2853j3059j2152j0210q350p406o929
63586D40039n872m082k502j838j620r79K33J619L035M442N420N744O119P342Q879
63571D65979R419Q862Q427Q668Q751Q266Q233R470J1173J2263J3134J4758J6803
63558F04206J7991J7844J6721J4473J0534N392O69k576m620n908o124m946k985
63545F60671j313l34M10J424K501K813J713n26k940m924o770q994j1448j3493
63531F18790j4790j5590j6318j7115j7657j7326j5901j4150j3219j3185j2808
63520D50731j1156q892p408p065p024o442n232l871l005l029l636l994l756l519
$$ y = [617205, 617312, 614790, 610847, 606243, 601390, 596570, 592028, 588052, 584971, 582882, 581334, 579322, 575621, 569243, 559920, 548366, 535889, 523434, 510998, 498145, 485086, 472934, 462724, 454374, 446968, 440039, 434167, 430085, 427583, 425745, 424125, 423146, 423379, 424998, 428033, 432475, 437895, 443639, 449758, 457100, 465979, 475398, 484260, 492687, 501355, 510106, 518372, 526605, 536075, 547248, 559511, 572645, 587403, 604206, 622197, 640041, 656762, 671235, 681769, 687161, 687830, 685254, 680634, 674726, 668602, 663656, 660671, 659358, 659024, 659434, 660858, 663359, 666172, 667885, 667359, 664419, 659495, 652725, 643731, 632283, 618790, 604000, 588410, 572092, 554977, 537320, 519994, 504093, 489943, 476724, 463539, 450731, 439575, 430683, 423275, 416210, 409186, 402744, 397512, 393641, 390636, 387607, 383971, 379977, 376221, 372702]
63506C72702l849m367m380l931l549l259k644j681p87j94J24R4k88n76k57O01
63490C43759J570K547L649M704N409N821O168O361O144N508M535L200J730O70
63476D01775L8r24k510l684l464k517k343l206m052m197l915l429k601j673j101
63461C62197n81P36K749M278M674M531M470M298L904L955N014O637Q074R283J0615
63446D34834J1925J2673J2684J2293J1904J1731J1817J2041J2214J2354J2712
63435E69182J3501J4763J6495J8605K0718K2406K3644K4600K4969K3933K0980
63424G93796J6508J1468O691K620o50l266n391o976p786p679o781n561m742m931
63410G77320o182q200j0907j4324j7791k0037k0504j9987j9487j9028j8149j6942
$$ y = [372702, 368853, 364486, 360106, 356175, 352626, 349367, 346723, 345042, 344255, 344061, 344185, 344279, 343991, 343415, 343158, 343759, 345329, 347876, 351525, 356229, 361638, 367459, 373627, 379988, 386132, 391640, 396175, 399375, 401105, 401775, 401813, 400889, 398379, 394695, 391231, 388714, 386371, 383165, 379113, 374916, 371001, 367572, 364971, 363298, 362197, 361616, 362352, 365101, 369379, 374053, 378584, 383054, 387352, 391256, 395211, 400225, 406862, 414936, 424219, 434834, 446759, 459432, 472116, 484409, 496313, 508044, 519861, 531902, 544116, 556470, 569182, 582683, 597446, 613941, 632546, 653264, 675670, 699314, 723914, 748883, 772816, 793796, 810304, 821772, 828463, 831083, 830433, 827167, 821776, 814800, 807014, 799335, 792554, 786993, 782251, 777320, 771138, 762938, 752031, 737707, 719916, 699879, 679375, 659388, 639901, 620873, 602724, 585782]
63398E85782j5773j4562j3128j1769j0641r118o753m348k887j828K41L461O600
63385E05277R018J1331J3937J6251J7754J8593J8728J7665J5537J3425J2042J0987
63373F80545R819Q968Q949R514J0239J1234J2591J3670J3591J2050R275N621J618
63360H07684k050n035p354q810q967p922o469n183m058l373l978o104q702j0720
63346G18959j2474j4937j8097k0784k1963k1474j9756j7530j5632j4504j3672
63335E28136j2209r813p181n296m576m715n106n309n263n130n020m824m354l564
63321D45776k715k236k220k113j243K32J474K201L172M977P008Q306Q887R414
63307D80920R956R973R193P611M881Q07l741p400r802j1534j2742j2982j2406
$$ y = [585782, 570009, 555447, 542319, 530550, 519909, 510791, 504038, 499690, 496803, 494975, 495216, 498677, 505277, 514295, 525626, 539563, 555814, 573568, 592161, 610889, 628554, 644091, 657516, 669558, 680545, 690364, 699332, 708281, 717795, 728034, 739268, 751859, 765529, 779120, 791170, 800445, 806066, 807684, 805634, 800599, 793245, 784435, 775468, 767546, 761077, 755894, 751836, 748463, 744485, 738381, 729679, 718959, 706485, 691548, 673451, 652667, 630704, 609230, 589474, 571944, 556312, 541808, 528136, 515927, 506114, 498933, 493637, 489061, 484346, 479240, 473931, 468668, 463538, 458518, 453694, 449340, 445776, 443061, 440825, 438605, 436492, 435249, 435481, 436955, 439156, 442328, 447305, 454313, 462619, 471506, 480920, 490876, 500849, 510042, 517653, 522534, 523341, 519600, 512200, 502398, 490864, 478122, 465140, 452734]
63294D52734j1884j1615j0819r160p364o042m938l801l031k865k827k485j999
63281C73904j470o68K23M77l8m76l23j37l71m54K36J316K108K613K988K831J911
63264C84670R89R57J634K240K567K898L227L381L510L732L714L297L071L580M415
63249D27882M911N292O149P247P852Q092Q846J0314J1659J2303J2704J3527J4684
63236E51462J5617J6138J6554J7180J7956J8592J8962J9254J9635J9961K0104
63225G51415K0352K1070K2040K2785K3512K4929K6973K8588K9152K9213K9290
63214A029319K8780K6745K3091J8244J2341N730l05m467o925q984j1453j4112
63202A098004j6691j9351k2170k4799k6894k8344k8970k8454k6699k3895k0225
$$ y = [452734, 440850, 429235, 418416, 409256, 401892, 395850, 390912, 387111, 384080, 381215, 378388, 375903, 373904, 372434, 371766, 371989, 372466, 372428, 371952, 371629, 371492, 371121, 370667, 370903, 372219, 374327, 376940, 379928, 382759, 384670, 385659, 386616, 388250, 390490, 393057, 395955, 399182, 402563, 406073, 409805, 413519, 416816, 419887, 423467, 427882, 432793, 438085, 444234, 451481, 459333, 467425, 476271, 486585, 498244, 510547, 523251, 536778, 551462, 567079, 583217, 599771, 616951, 634907, 653499, 672461, 691715, 711350, 731311, 751415, 771767, 792837, 814877, 837662, 861174, 886103, 913076, 941664, 970816, 1000029, 1029319, 1058099, 1084844, 1107935, 1126179, 1138520, 1144250, 1143945, 1139478, 1132553, 1123569, 1112116, 1098004, 1081313, 1061962, 1039792, 1014993, 988099, 959755, 930785, 902331, 875632, 851737, 831512]
63191H31512j5843j1127o600k572R30L957O608R061J1411J3545J5396J7061J8568
63178H91907J9696K0302K0546K0651K0674K0661K0687K0519J9713J8231J6597
63167A110184J5144J3500J1054P575L112k145p655j2655j6842k0498k3696k5983
63155A051095k7213k7964k8639k8820k8082k6821k5604k4157k1878j8908j6017
63144G76992j3610j1499r446p351n105k724l82J978M748P974J1078J3579J5506
63131G81738J6643J6168J3671R892N726J174l867q548j1831j3905j5586j6761
63119G74514j6586j5091j3361j2090j1035r993r228q668p649n923m209l292l062
63106F54327k814k128j192m83k67l14j78J24M4n86j065p42jL42K86M57R60J258
$$ y = [831512, 815669, 804542, 797942, 795370, 796300, 800257, 806865, 815926, 827337, 840882, 856278, 873339, 891907, 911603, 931905, 952451, 973102, 993776, 1014437, 1035124, 1055643, 1075356, 1093587, 1110184, 1125328, 1138828, 1149882, 1157457, 1160569, 1158424, 1150769, 1138114, 1121272, 1100774, 1077078, 1051095, 1023882, 995918, 967279, 938459, 910377, 883556, 857952, 833795, 811917, 793009, 776992, 763382, 751883, 742437, 735086, 729981, 727257, 726875, 728853, 733601, 741575, 752653, 766232, 781738, 798381, 814549, 828220, 838112, 843838, 845012, 841145, 832597, 820766, 806861, 791275, 774514, 757928, 742837, 729476, 717386, 706351, 696358, 687130, 678462, 670813, 664890, 660681, 657389, 654327, 651513, 649385, 648193, 647710, 647443, 647129, 646951, 647075, 647119, 646533, 645468, 644726, 644725, 645067, 645353, 645810, 646770, 648028]
63088F48028J174J171J505J826J782J492J291J440K079K964L378K870K037J927
63074F74964K678L410L512L371L668M513N620O782P942R041J0117J1297J2628
63061G59543J3965J5095J5913J6647J7923K0280K3412K6300K8409L0248L2384
63050A000119L4454L5790L6483L7027L7316L6923L6140L5744L5782L5530L4771
63039A396079L4186L4304L4888L5666L6851L8387L9302L8448L5592L1285K5819
63028A780807J8835J0060J46r578j8207k5998l3669m1097m7132n0782n2162n2027
63016A479196n0819m8563m5343m1398l6923l2101k7093k1878j6377j0899n966
63005A141836j486L361R018J4894K0143K4446K7689K9649L0626L1609L3046L4142
$$ y = [648028, 649202, 650373, 651878, 653704, 655486, 656978, 658269, 659709, 661788, 664752, 668130, 671000, 673037, 674964, 677642, 681052, 684564, 687935, 691603, 696116, 701736, 708518, 716460, 725501, 735618, 746915, 759543, 773508, 788603, 804516, 821163, 839086, 859366, 882778, 909078, 937487, 967735, 1000119, 1034573, 1070363, 1106846, 1143873, 1181189, 1218112, 1254252, 1289996, 1325778, 1361308, 1396079, 1430265, 1464569, 1499457, 1535123, 1571974, 1610361, 1649663, 1688111, 1723703, 1754988, 1780807, 1799642, 1809702, 1809848, 1800270, 1782063, 1756065, 1722396, 1681299, 1634167, 1583385, 1531223, 1479196, 1428377, 1379814, 1334471, 1293073, 1256150, 1224049, 1196956, 1175078, 1158701, 1147802, 1141836, 1140350, 1143711, 1152729, 1167623, 1187766, 1212212, 1239901, 1269550, 1300176, 1331785, 1364831, 1398973]
62993A398973L4168L3768L3999L4672L4739L3903L2705L1279K9044K5575K0863
62982A743688J4870P674j54q081j6317k5209l4242m2412m9253n4710n8478o0502
62970A416874o1643o2641o2800o0935n7341n3487m9944m6098m1931l8467l6125
62959H45462l3998l1325k8540k6265k4298k2189k0038j8126j6402j4717j3208
62948E96356j2079j1416j1198j1072j0405r123q143q117q207p191n414m282m012
62935D85697l529k591k326l125l736l182k248k112k634l040l289l694l937l491
62921D42763k604k023j958j996j841j642j739k317l058l188k269r95m94r25j448
62906D14266j572j636j841j840j517j191p93J46J397J973J603J223J444J621J055
$$ y = [1398973, 1433141, 1466909, 1500908, 1535580, 1570319, 1604222, 1636927, 1668206, 1697250, 1722825, 1743688, 1758558, 1766232, 1766078, 1757997, 1741680, 1716471, 1682229, 1639817, 1590564, 1535854, 1477376, 1416874, 1355231, 1292590, 1229790, 1168855, 1111514, 1058027, 1008083, 961985, 920054, 881587, 845462, 811464, 780139, 751599, 725334, 701036, 678847, 658809, 640683, 624281, 609564, 596356, 584277, 572861, 561663, 550591, 540186, 531063, 522920, 514803, 506596, 499405, 493991, 489709, 485697, 482168, 479577, 477251, 474126, 470390, 467208, 464960, 462848, 460214, 457174, 453885, 450191, 446254, 442763, 440159, 438136, 436178, 434182, 432341, 430699, 428960, 426643, 423585, 420397, 418128, 417133, 416639, 415714, 414266, 412694, 411058, 409217, 407377, 405860, 404669, 403876, 404022, 405419, 407392, 408995, 410218, 411662, 413283, 414338]
62891D14338J35m74q70j335j561j308j138j554k055j943j599j884k662k883k078
62876C91129r75m67n61o00k36J17j02o46n31O13J743J635N76l6M25J280J837K096
62858C97297K074J547P75M81P67R57Q37R70J523J776J261L86m11j131j504j046
62842D06559k26l03j422k152j588n79n6M19J409K233K145J734J827J968J403P47
62826D14118J115K263K999L008K912K906K715K588L033L760L994L673L306K914
62812D55304K262J795K172L007L320L085L229M067M932N413N875O561P229P896
62798E16147R018J0637J2123J3128J4143J5800J8162K0916K3773K6527K9184L2160
62786G41718L5981M0567M5191M9193N2606N6027N9969O4177O7543O9036O8761
$$ y = [414338, 414473, 413999, 413129, 411794, 410233, 408925, 407787, 406233, 404178, 402235, 400636, 398752, 396090, 393207, 391129, 390154, 389687, 389126, 388526, 388290, 388407, 388305, 387659, 387128, 387741, 389484, 391119, 391695, 391659, 392084, 393364, 395201, 397297, 399371, 400918, 401693, 402174, 402941, 403898, 404735, 405705, 407228, 409004, 410265, 410651, 410240, 409109, 407605, 406559, 406333, 406030, 404608, 402456, 400868, 400289, 400233, 400652, 402061, 404294, 406439, 408173, 410000, 411968, 413371, 414118, 415233, 417496, 420495, 423503, 426415, 429321, 432036, 434624, 437657, 441417, 445411, 449084, 452390, 455304, 457566, 459361, 461533, 464540, 467860, 470945, 474174, 478241, 483173, 488586, 494461, 501022, 508251, 516147, 525165, 535802, 547925, 561053, 575196, 590996, 609158, 630074, 653847, 680374, 709558, 741718, 777699, 818266, 863457, 912650, 965256, 1021283, 1081252, 1145429, 1212972, 1282008, 1350769]
62775A350769O7547O5444O1433N5014M7096L8556K8859J7190M304q014j9000k9197
62763A680001l8820m7083n3349n7897o1261o3459o4285o3762o2133n9784n7239
62752A050929n4788n2125m8777m4810m0697l6677l2775k9286k6577k4528k2644
62741F37245k0701j8744j6604j4039j1331r128p616o306m741l022j587p35l63
62728E22328RQ71K163L307L876L949L735L416L563M982P593J0081J1328J1691
62714E92892J2254J3398J4820J6469J8541K0908K3393K6358L0159L4336L8176
62703H41704M1879M6294N1581N7024O2076O6720P0764P3576P4683P3931P1047
62692A531279O5661N7958M8708L8527K7435J5204J882j1980k5240l6660m5817
$$ y = [1350769, 1418316, 1483760, 1545193, 1600207, 1647303, 1685859, 1714718, 1731908, 1736212, 1728198, 1709198, 1680001, 1641181, 1594098, 1540749, 1482852, 1421591, 1358132, 1293847, 1230085, 1167952, 1108168, 1050929, 996141, 944016, 895239, 850429, 809732, 773055, 740280, 710994, 684417, 659889, 637245, 616544, 597800, 581196, 567157, 555826, 546698, 539082, 532776, 528035, 525013, 523426, 522691, 522328, 522337, 523208, 525371, 528678, 532554, 536503, 540238, 543654, 547217, 552199, 559792, 569873, 581201, 592892, 605146, 618544, 633364, 649833, 668374, 689282, 712675, 739033, 769192, 803528, 841704, 883583, 929877, 981458, 1038482, 1100558, 1167278, 1238042, 1311618, 1386301, 1460232, 1531279, 1596940, 1654898, 1703606, 1742133, 1769568, 1784772, 1786654, 1774674, 1749434, 1712774, 1666957]
62681A666957n3254n9405o3776o5763o5794o4935o3622o1524n8463n4751n0814
62670A004856m6974m3517m0414l7250l3844l0649k8086k5938k3937k2360k1277
62659F50610j9817j7188j3980j1516j0194r381q650q107p706p199o713o518o381
62646E17260n913n322m999m671l880k931k433k167j510o25j16K01Q82J461R24
62631D86161m56j224r07n97j062j587j375q12o33o89l03O77J813K627K915K874
62615D87422L003L546M119M396M786N726O727P092P284Q326J0140J1803J3303
62602E77673J5531J8421K0808K2474K4749K8388L2302L5157L6906L7948L8018
62591H88375L6869L5059L2971K9955K5356J9666J3780P841J638m508j0178j5554
$$ y = [1666957, 1613703, 1554298, 1490522, 1424759, 1358965, 1294030, 1230408, 1168884, 1110421, 1055670, 1004856, 957882, 914365, 873951, 836701, 802857, 772208, 744122, 718184, 694247, 671887, 650610, 630793, 613605, 599625, 588109, 577915, 568534, 559884, 551777, 544071, 536872, 530159, 523641, 517260, 511347, 506025, 501026, 496355, 492475, 489544, 487111, 484944, 483434, 482809, 482693, 482894, 483776, 485237, 486161, 485705, 484481, 483574, 482977, 481915, 480328, 478953, 478141, 477508, 476819, 476516, 477193, 479006, 481633, 484548, 487422, 490425, 493971, 498090, 502486, 507272, 512998, 519725, 526817, 534101, 542427, 552567, 564370, 577673, 593204, 611625, 632433, 654907, 679656, 708044, 740346, 775503, 812409, 850357, 888375, 925244, 960303, 993274, 1023229, 1048585, 1068251, 1082031, 1089872, 1091510, 1087002, 1076824, 1061270]
62579A061270k0822k5443k8763l0851l2086l2392l1681l0457k9237k7745k5504
62568G46289k2806k0360j8282j6180j3997j2149j0894j0123r615r114q369p385
62556E87015o434n552m435l066j964j509j529j775k249k730k708k151j754j898
62542E47261k015j462l99P12J792K744L097K777K599L243M314N168O072P612R480
62527E92995J0913J2001J3499J5565J7704J9852K2494K5653K8752L1670L5032
62516H26130L9122M3193M6315M8392M9997N1545N2875N3511N3150N2085N1041
62505A367356N0373M9553M7853M5314M2596M0069L7778L6269L6449L8003L8478
62494A830091L4767K5788J3627K098o014j0984j5997k4613l7621n2094o3799p0614
$$ y = [1061270, 1040448, 1015005, 986242, 955391, 923305, 890913, 859232, 828775, 799538, 771793, 746289, 723483, 703123, 684841, 668661, 654664, 642515, 631621, 621498, 611883, 602769, 594400, 587015, 580581, 575029, 570594, 567528, 565564, 564055, 562526, 560751, 558502, 555772, 553064, 550913, 549159, 547261, 545246, 543784, 543385, 544097, 545889, 548633, 551730, 554507, 557106, 560349, 564663, 569831, 575903, 583515, 592995, 603908, 615909, 629408, 644973, 662677, 682529, 705023, 730676, 759428, 791098, 826130, 865252, 908445, 954760, 1003152, 1053149, 1104694, 1157569, 1211080, 1264230, 1316315, 1367356, 1417729, 1467282, 1515135, 1560449, 1603045, 1643114, 1680892, 1717161, 1753610, 1791613, 1830091, 1864858, 1890646, 1904273, 1906371, 1900357, 1889373, 1873376, 1848763, 1811142, 1759048, 1695249, 1624635]
62482A624635p3596p4980p5918p6123p4884p1724o6547n9993n3447m7991m3345
62471I06087l8493l3283k8529k4524k0619j6551j3093j0710q600o052l782k789
62459F99062k539j649N0J387J683J426J151R15Q98J407K043K030J524J544K361
62444G13293L093L267L627M785O076O442N671M149K100l18k746n057p507r995
62430G26880j1757j2378j2524j3082j4020j4545j4077j2659j0798r214q355p854
62418E85617o961n666m783m678m567l545j672L50K041L231L835L976L982L975
62404E75135L861L866M350N012N076M581M560N489O463O493N862N442N407N377
62390F46974N199M859M125L026K207K124K363K359K308K629L101L301L509M335
$$ y = [1624635, 1551039, 1476059, 1400141, 1324018, 1249134, 1177410, 1110863, 1050870, 997423, 949432, 906087, 867594, 834311, 805782, 781258, 760639, 744088, 730995, 720285, 711685, 705633, 701851, 699062, 696523, 694874, 694924, 696311, 697994, 699420, 700571, 701486, 702384, 703791, 705834, 707864, 709388, 710932, 713293, 716386, 719653, 723280, 728065, 734141, 740583, 746254, 750403, 752503, 752185, 749439, 744382, 736875, 726880, 715123, 702745, 690221, 677139, 663119, 648574, 634497, 621838, 611040, 601826, 593471, 585617, 578656, 572990, 568207, 563529, 558962, 555417, 553745, 554095, 556136, 559367, 563202, 567178, 571160, 575135, 578996, 582862, 587212, 592224, 597300, 601881, 606441, 611930, 618393, 624886, 630748, 636190, 641597, 646974, 652173, 657032, 661157, 664183, 666390, 668514, 670877, 673236, 675544, 678173, 681274, 684575, 688084, 692419]
62376F92419N741P214Q668J0506J2896J5673J8753K2109K5458K8475L1212L3848
62364I12972L6290L8331L9914M0814M0322L7857L3642K8441K2800J6973J1397
62353A259753O700L244P81j450m283p893j1575j4636j7409k0738k4592k8008l0445
62340A109449l2164l3111l2595l0578k8264k6668k5467k3852k1730j9398j6960
62329H18662j4729j3375j2841j2030j0329q551p592p015n995m731l855l210k399
62316G12010j776j750j801j379j025j298j334l6J821K409J515P36J076J884K378
62301G13430K641K839K732K442K555L130L531L630M214N813P946R867J1343J2473
62287G88586J3317J3970J4385J4083J2613J0293P839N387K690J24j465j975k133
$$ y = [692419, 698160, 705374, 714042, 724548, 737444, 753117, 771870, 793979, 819437, 847912, 879124, 912972, 949262, 987593, 1027507, 1068321, 1108643, 1146500, 1180142, 1208583, 1231383, 1248356, 1259753, 1266453, 1269697, 1270478, 1269028, 1264745, 1256852, 1245277, 1230641, 1213232, 1192494, 1167902, 1139894, 1109449, 1077285, 1044174, 1011579, 981001, 952737, 926069, 900602, 876750, 855020, 835622, 818662, 803933, 790558, 777717, 765687, 755358, 746807, 739215, 732200, 726205, 721474, 717619, 714409, 712010, 710234, 708484, 706683, 705304, 704279, 702981, 701647, 701611, 703432, 705841, 707356, 708092, 709168, 711052, 713430, 716071, 718910, 721642, 724084, 726639, 729769, 733300, 736930, 741144, 746957, 754903, 764770, 776113, 788586, 801903, 815873, 830258, 844341, 856954, 867247, 875086, 880473, 883163, 883287, 881822, 879847, 877714]
62274H77714k217j609J39K645N429Q549J2164J6070K0045K4100K8206L2134L5695
62261A059064L8644M0436M0542L9041L6368L2599K7620K1855J6136J0948O313
62250A369566K258j428n600j0956j6880k2052k6066k9466l2249l3615l3320l2069
62238A128123l0286k7680k4461k1770k0270j9248j7804j6004j4247j2370j0273
62227I13710q626q020p850o976n252l653k983l020k835j619P52L581N917P362
62213H80488Q168Q528Q293P480O454N246L250N0l812p318r847j1228j1405j0641
62199H73706r702r179q667p235m717k054j54J157K762M992P123Q188P969O960
62185H71149N581L870K015O43K88Q42J786K820M018N664Q082J1308J4713J7382
$$ y = [877714, 875497, 873888, 874027, 876672, 882101, 890650, 902814, 918884, 938929, 963029, 991235, 1023369, 1059064, 1097708, 1138144, 1178686, 1217727, 1254095, 1286694, 1314314, 1336169, 1352305, 1363253, 1369566, 1371824, 1370396, 1364796, 1353840, 1336960, 1314908, 1288842, 1259376, 1227127, 1193512, 1160192, 1128123, 1097837, 1070157, 1045696, 1023926, 1003656, 984408, 966604, 950600, 936353, 923983, 913710, 905084, 897064, 889214, 882238, 876986, 873333, 870350, 867330, 864495, 862876, 863628, 867209, 873126, 880488, 888656, 897184, 905477, 912957, 919411, 924657, 927907, 927957, 924145, 916827, 906980, 895752, 884347, 873706, 864004, 854825, 846158, 838923, 834206, 832152, 831998, 833155, 835917, 840909, 848032, 856220, 864189, 871149, 876730, 880600, 882615, 883258, 883546, 884388, 886174, 888994, 893012, 898676, 906758, 918066, 932779, 950161]
62171I50161J9130K0586K1966K2392K0992J8075J4515J0544O072J716j619m036
62159A100494o497r445j2423j5108j7858k1049k4529k7789l0115l0806k9920k8589
62147H46366k7743k6810k4635k1489j8896j7496j6372j4769j3202j2370j2095
62136F40489j1893j1726j1566j1060j0252r806r904r619q029n433k879r77L41
62123E37686J421K708M495O326P100O167M012J597m30j696j996j603j108o36J05
62108E64148O86j36k738n611o948o658o010n719n331m308k760j127K48J148J636
62093E20520K191L288M781O085O883P445Q230R446J0902J2077J2513J2310J2158
62080F28829J2596J3456J4163J4457J4556J4734J5018J5276J5539J6056J6987
$$ y = [950161, 969291, 989877, 1011843, 1034235, 1055227, 1073302, 1087817, 1098361, 1104433, 1106149, 1104530, 1100494, 1093997, 1084552, 1072129, 1057021, 1039163, 1018114, 993585, 965796, 935681, 904875, 874955, 846366, 818623, 791813, 767178, 745689, 726793, 709297, 692925, 678156, 664954, 652584, 640489, 628596, 616870, 605304, 594244, 583992, 574186, 564282, 554663, 546634, 541201, 538322, 537345, 537686, 539107, 541815, 546310, 552636, 559736, 565903, 569915, 571512, 571082, 569386, 567390, 565787, 564679, 564043, 564148, 564834, 564698, 561960, 556349, 549401, 542743, 536733, 531014, 525683, 521375, 518615, 517488, 517736, 518884, 520520, 522711, 525999, 530780, 536865, 543748, 551193, 559423, 568869, 579771, 591848, 604361, 616671, 628829, 641425, 654881, 669044, 683501, 698057, 712791, 727809, 743085, 758624, 774680, 791667]
62069G91667J7930J8036J6816J4648J2127R220N607J613j923m730p306r911j2126
62056H51668j3738j5385j7834k1010k4124k6401k7445k7259k6264k5050k3815
62045F03343k2326k0430j8323j6184j4066j2192j0891j0055r143p904o620n517
62033D49692m498l647l338l562l683l236k502j944j619j446j512j756j811j591
62019D13547j562j981k334j997j120l03K75R10J750K597L196L448L416L440L957
62004D27239N006O026O355N779M523K956J442K02q47j893k935l901m949o205p276
61989D31522p641p520p626p995p796o568m936l761l276l372m055n021n423m764
61975C51768l637l056l231l527l255k147l97J271J895J191M0l69K31J110J606
$$ y = [791667, 809597, 827633, 844449, 859097, 871224, 880444, 886051, 887664, 885741, 881011, 873705, 863794, 851668, 837930, 822545, 804711, 783701, 759577, 733176, 705731, 678472, 652208, 627158, 603343, 581017, 560587, 542264, 526080, 512014, 499822, 488931, 478876, 469733, 461829, 455209, 449692, 445194, 441547, 438209, 434647, 430964, 427728, 425226, 423282, 421663, 420217, 418705, 416949, 415138, 413547, 411985, 410004, 407670, 405673, 404553, 404250, 404525, 405435, 407185, 409782, 412978, 416426, 419842, 423282, 427239, 432245, 438271, 444626, 450405, 454928, 457884, 459326, 459528, 458681, 456788, 453853, 449952, 445003, 438798, 431522, 423881, 416361, 408735, 400740, 392944, 386376, 381440, 377679, 374403, 371031, 366976, 361955, 356532, 351768, 348131, 345075, 341844, 338317, 335062, 332915, 332518, 333789, 335684, 336875, 336915, 336546, 336777, 337887, 339493]
61960C39493J795K175K922L679M049M146M471N202O038O899Q275J0241J1741J1728
61946D22854J0804J0665J1957J3671J4703J4986J4820J4232J3445J3028J3004
61935E68169J2644J1624J0558R852Q883O960M377J871l41k251l471l671l232k759
61921F19213k345j739q36M54K336M668O893Q788J0715J2715J3994J3858J2532
61908G01246J0594Q280N866L975K719J292r11l315n034n998o524o471n775n165
61894F94779n284n559m996l825l272l857m845n336n083m345l622l511m107m684
61880F32453m555m030l885m126m028l251k180j163j32R94K084L040L862M502N039
61865F24624N820P081Q614J0214J2139J4668J7445J9779K1399K2470K3136K3496
$$ y = [339493, 341288, 343463, 346385, 350064, 354113, 358259, 362730, 367932, 373970, 380869, 389144, 399385, 411126, 422854, 433658, 444323, 456280, 469951, 484654, 499640, 514460, 528692, 542137, 555165, 568169, 580813, 592437, 602995, 612847, 621730, 628690, 633067, 634938, 634597, 632346, 628875, 625204, 621972, 619213, 616868, 615129, 614293, 614747, 617083, 621751, 628644, 637432, 648147, 660862, 674856, 688714, 701246, 711840, 720120, 725986, 729961, 732680, 733972, 733061, 729746, 724712, 718714, 712190, 705719, 699944, 694779, 689495, 683936, 678940, 675115, 671843, 667986, 663141, 657805, 652722, 648377, 644755, 641244, 637137, 632453, 627898, 623868, 619983, 615857, 611829, 608578, 606398, 605235, 605103, 606097, 608181, 611221, 615083, 619585, 624624, 630444, 637525, 646139, 656353, 668492, 683160, 700605, 720384, 741783, 764253, 787389, 810885]
61853H10885K3830K4325K4733K4579K3538K1414J8124J4047R971O357L100K22
61841A005125j801k810l328l590k905o39K768O430J0085J3778J7129J9759K1952
61828A081953K4098K5798K6229K4988K1858J6356Q409r12j0171j8680k6169l2005
61816A141752l5691l7621l8338l7569l5006l1577k8718k6696k4746k2558k0412
61805H02820j8121j5210j2116r990r144q774q289p840p479o827n813m845m157
61792F84215l736l833m604n276m763l187j870j635k015k267k198j778r18R9O93
61777F46927P35N90L36k70r91j131m65O04J772K943L673L486K856K765L223L209
61761F70262K270J162N96L11j88r54j989l438m946n695n489n137n325n840o189
$$ y = [810885, 834715, 859040, 883773, 908352, 931890, 953304, 971428, 985475, 995446, 1001803, 1004903, 1005125, 1003324, 1000514, 997186, 993596, 990691, 990052, 992820, 999250, 1009335, 1023113, 1040242, 1060001, 1081953, 1106051, 1131849, 1158078, 1183066, 1204924, 1221280, 1229689, 1228777, 1218606, 1199926, 1173757, 1141752, 1106061, 1068440, 1030102, 992533, 957527, 925950, 897232, 870536, 845790, 823232, 802820, 784699, 769489, 757373, 747383, 738239, 729465, 721176, 713336, 705857, 699030, 693217, 688372, 684215, 680479, 676646, 672042, 666766, 662003, 658816, 656946, 655311, 653296, 651029, 648831, 647053, 646135, 646234, 646927, 647662, 648252, 648588, 648318, 647327, 646196, 645731, 646335, 648107, 651050, 654723, 658209, 661065, 663830, 667053, 670262, 672532, 673694, 674290, 674601, 674413, 673459, 671470, 668032, 663086, 657391, 651902, 646765, 641440, 635600, 629411]
61746F29411o286o164n805n535n843o478o509n628m547l764k911j822j262j794
61732E65063k758l118k803k456k366k293k008j398m19N82R52O13M20J029J917
61717E50957K095J450O85J73m29j455k630l310l082k194j542j968l389m764n100
61702E25497m345l216k441k282k533k768k775k766k943l053k706k057j561j108
61688D88943j12J490L032M106N014N945O473O314N909N725N556N046M568M803
61674E52812N766O744P094O660N525L756J370j640n134q502j0851j1816j1970
61661E39814j2043j1888j0605p708l836j59K774N409Q454J1916J5080J7290J8382
61648E72880J8281J6664J3341Q686L262k636q604j3677j6868j8141j8247j7703
$$ y = [629411, 623125, 616961, 611156, 605621, 599778, 593300, 586791, 581163, 576616, 572852, 569941, 568119, 566857, 565063, 562305, 559187, 556384, 553928, 551562, 549269, 547261, 545863, 545444, 546026, 546978, 547591, 548011, 549040, 550957, 553052, 554502, 555187, 555360, 554931, 553476, 550846, 547536, 544454, 542260, 540718, 538750, 535361, 530597, 525497, 521152, 517936, 515495, 513213, 510680, 507912, 505137, 502371, 499428, 496375, 493669, 491612, 490051, 488943, 488831, 490321, 493353, 497459, 502473, 508418, 514891, 521205, 527114, 532839, 538395, 543441, 548009, 552812, 558578, 565322, 572416, 579076, 584601, 588357, 589727, 588087, 582953, 574451, 563600, 551784, 539814, 527771, 515883, 505278, 497570, 493734, 493575, 496349, 501758, 510212, 522128, 537208, 554498, 572880, 591161, 607825, 621166, 629852, 633114, 630478, 621874, 608197, 591329, 573188, 554941, 537238]
61636E37238j6438j4424j2070r910q240p113o320n467m336l089j876n79O93J398
61622D49467J422J616K687L981M305L653L017K678J859K49j326k067k167k198
61608D67176k319k429k512k524k312j830j034K06J594K167J436M62O94J911K539
61593D63225K017J424J570J893J814J850K547L346L378K664J860J406J436J839
61579D92269K013J355L78M53J997L830M932N778P265R235J1066J2900J5229J7820
61565E86520J9961K1382K2177K2152K0963J8556J4867R646L199l177q211j1754
61553G16281j4296j5864j6100j5000j2901j0099p060m565k983j766l07J196K287
61540F18823L149M184N144N598N844O487P300P346O211M333K188r3k265l861m738
$$ y = [537238, 520800, 506376, 494306, 484396, 476156, 469043, 462723, 457256, 452920, 449831, 447955, 447376, 448069, 449467, 450889, 452505, 455192, 459173, 463478, 467131, 470148, 472826, 474685, 474934, 473608, 471541, 469374, 467176, 464857, 462428, 459916, 457392, 455080, 453250, 452216, 452422, 454016, 456183, 457619, 458081, 458775, 460686, 463225, 465242, 466666, 468236, 470129, 471943, 473793, 476340, 479686, 483064, 485728, 487588, 488994, 490430, 492269, 494282, 495637, 496015, 496468, 498465, 502295, 507227, 513005, 520270, 529505, 540571, 553471, 568700, 586520, 606481, 627863, 650040, 672192, 693155, 711711, 726578, 736224, 739423, 736246, 728035, 716281, 701985, 686121, 670021, 655021, 642120, 632021, 624961, 620396, 617413, 615647, 615340, 616536, 618823, 621972, 626156, 631300, 636898, 642742, 649229, 656529, 663875, 670086, 674419, 676607, 676514, 674249, 670388, 665650]
61525F65650n239n613n649n031l817k461j472r81o01J83J423K756M056N546P226
61510F55976Q727J0008J1668J4159J7166K0180K3216K6521K9997L3509L7393M2113
61498I30633M7455N2419N5690N5998N2455M5037L4562K2016Q233n461j6924k4225
61486A257888k6915k5932k2469j7245j0612k833N797J4840K3794L2302M0137M6910
61474A315662N1958N4483N3496M7881L7152K2215M893j3228l0904m6469n8040
61463A439099o4803o7276o6210o2130n6113m9752m3781l7667l1124k4947j9737
61452I15559j4864r695m911j473J064M063Q016J2330J6541K0778K5009K8584L0511
61439A031512K9696K5293J7486P855j575r570j5789k0160k2643k3295k2120j9160
$$ y = [665650, 660411, 654798, 649149, 644118, 640301, 637840, 636368, 635387, 634786, 634969, 636392, 639148, 643204, 648750, 655976, 664703, 674711, 686379, 700538, 717704, 737884, 761100, 787621, 817618, 851127, 888520, 930633, 978088, 1030507, 1086197, 1142195, 1194650, 1239687, 1274249, 1296265, 1304498, 1299037, 1282113, 1257888, 1230973, 1205041, 1182572, 1165327, 1154715, 1151882, 1157679, 1172519, 1196313, 1228615, 1268752, 1315662, 1367620, 1422103, 1475599, 1523480, 1560632, 1582847, 1587740, 1574512, 1543608, 1497139, 1439099, 1374296, 1307020, 1240810, 1178680, 1122567, 1072815, 1029034, 991367, 960243, 935296, 915559, 900695, 891000, 886089, 884616, 885680, 889743, 897759, 910089, 926630, 947408, 972417, 1001001, 1031512, 1061208, 1086501, 1103987, 1111842, 1110267, 1100697, 1084908, 1064748, 1042105, 1018810, 996690, 977530]
61427I77530j4966j0389n715n70M992J0227J5005K0331K6597L2015L3797L0596
61415A119450K3132J3044K016q364j6978k3410k7555k9365k9436k9045k8891k8378
61403I36220k6856k4924k3622k2900k1822j9931j7527j5064j3024j1983j1898
61392G26669j1657j0202p760n331l356j680l38M97J022J570K182K944M092N212
61378G03864N194L837K583K588K920J947k46k211l384m413n586o415o674o518
61364F87486n719l967j800k4J527L444N146N277L616J220j251l903o285p232o486
61349F71049n239m704n058n962p049p779p797p600p871q182p514o017m945m705
61335E80627m333l165j717o03J79N41K70N9J158L418N031M972M400M847O216P635
$$ y = [977530, 962564, 952175, 946460, 945890, 950882, 961109, 976114, 996445, 1023042, 1055057, 1088854, 1119450, 1142582, 1155626, 1157642, 1149278, 1132300, 1108890, 1081335, 1051970, 1022534, 993489, 964598, 936220, 909364, 884440, 860818, 837918, 816096, 796165, 778638, 763574, 750550, 738567, 726669, 715012, 704810, 697050, 691719, 688363, 686683, 686345, 686842, 687864, 689434, 691616, 694560, 698652, 703864, 709058, 712895, 715478, 718066, 720986, 722933, 722687, 720476, 717092, 712679, 707093, 700678, 694004, 687486, 681767, 677800, 676000, 675976, 677503, 680947, 686093, 691370, 694986, 696206, 694955, 691052, 684767, 677535, 671049, 665810, 661106, 656048, 650086, 643037, 635258, 627461, 619861, 611990, 603808, 596294, 590277, 585332, 580627, 576294, 573129, 571412, 570809, 570988, 571529, 571799, 571858, 573016, 576434, 581465, 586437, 590837, 595684, 601900, 609535]
61319F09535R141J1298J3829J5881J7284J8575J9952K0921K0810J9253J6544J3813
61307H06836J2299J1949J1250Q941N357J741j121l065m020m259m717o197q327
61294H26667r922j0348j0035r682r403q785p528n840m113k339j06K625N137O802
61280G63130P984R480J1268J2596J3203J3616J4168J4527J4461J4209J3899J3239
61268I15780J2108J0767R242P211M785K716J470P49L43O93K130M116N909P545
61254I85564R608J2324J5434J8807K2699K7421L2955L8854M4446M9201N2747N4417
61242A364477N3052M7823L9124K8266J6572N308l921r851j2742j3928j3996j2299
61230A487885q547l774Q42N369J0586J6589K2618K7848L1760L3839L3358K9469
$$ y = [609535, 618676, 629974, 643803, 659684, 676968, 695543, 715495, 736416, 757226, 776479, 793023, 806836, 819135, 831084, 842334, 851275, 856632, 858373, 857252, 854187, 850167, 845908, 841191, 834994, 826667, 816745, 806397, 796362, 786680, 777277, 768492, 760964, 755124, 751011, 748672, 748566, 751191, 756328, 763130, 771114, 780594, 791862, 804458, 817661, 831277, 845445, 859972, 874433, 888642, 902541, 915780, 927888, 938655, 947897, 955108, 959893, 962609, 964079, 964828, 965171, 965864, 967994, 972110, 978019, 985564, 995172, 1007496, 1022930, 1041737, 1064436, 1091857, 1124812, 1163666, 1208112, 1257313, 1310060, 1364477, 1417529, 1465352, 1504476, 1532742, 1549314, 1554622, 1550701, 1540850, 1528108, 1514180, 1500184, 1487885, 1479338, 1475564, 1476406, 1481775, 1492361, 1508950, 1531568, 1559416, 1591176, 1625015, 1658373, 1687842]
61218A687842K1525R760m147j7505k8024l4783l8148l9156l8912l7880l5641l1856
61206A413075k7325k3426k0551j7948j5282j3405j3111j3945j4874j5514j6091
61195A221603j6617j6661j5888j4467j3073j2446j2706j3158j3221j3391j4609
61184A065366j6746j8543j9236j9347j9566j9714j9283j8313j7113j5605j3587
61173H68313j1283r241p826p067o688o194n217l934k817j987j242o43m48m97l86
61158H02843k66p88k169m020o090q363j0416j1555j1764j1567j0848q910n879
61145G10208k924o44J618M269O482P435P542P581P491O948O312O087O006N537
61131G79948M782M076L251K124J221J133J512J580J284J343K254L824N435O428
$$ y = [1687842, 1709367, 1719127, 1714980, 1697475, 1669451, 1634668, 1596520, 1557364, 1518452, 1480572, 1444931, 1413075, 1385750, 1362324, 1341773, 1323825, 1308543, 1295138, 1282027, 1268082, 1253208, 1237694, 1221603, 1204986, 1188325, 1172437, 1157970, 1144897, 1132451, 1119745, 1106587, 1093366, 1079975, 1065366, 1048620, 1030077, 1010841, 991494, 971928, 952214, 932931, 914618, 897505, 881900, 868313, 857030, 847789, 839963, 832896, 826208, 820014, 814797, 810863, 808046, 806059, 804817, 804174, 803726, 803229, 802843, 802577, 801789, 799620, 795600, 789510, 781147, 770731, 759176, 747412, 735845, 724997, 716087, 710208, 707284, 706640, 708258, 712527, 719009, 726444, 733986, 741567, 749058, 756006, 762318, 768405, 774411, 779948, 784730, 788806, 792057, 794181, 795402, 796535, 798047, 799627, 800911, 802254, 804508, 808332, 813767, 820195]
61117H20195O633O829P989R725J0274Q679O007L651J308k171o564j0272j2280
61104H50003j2952j2983j2675j2234j1871j1391j0417r087p931p105o358n627
61092G29372n119m868m808n059n611n915n543n007n129n738n833n006l893l082
61078F58761k429j617o69L81J680L066L993M321M689N716P152Q277Q889R439J0305
61063G21954J1255J1786J1854J1981J2649J3637J4275J4264J3929J3542J2842
61052H63968J1535R955Q766Q208Q069Q249Q884R893J0845J1385J1577J1717J2084
61039I95135J2870J4124J5764J7705J9911K2227K4385K6433K8885L1963L4884
61028A244286L6576L7183L8220M0948M5223N0347N6431O4048P2857Q1632Q9710
$$ y = [820195, 826828, 833657, 841646, 851371, 861645, 870324, 876331, 879982, 881290, 879119, 872555, 862283, 850003, 837051, 824068, 811393, 799159, 787288, 775897, 765480, 756393, 748462, 741357, 734999, 729372, 724253, 719385, 714577, 709518, 703907, 697992, 692449, 687442, 682313, 676575, 670742, 665736, 661843, 658761, 656332, 654715, 654046, 654427, 656107, 659173, 663166, 667487, 672176, 677892, 685044, 693321, 702210, 711649, 721954, 733209, 744995, 756849, 768830, 781479, 795116, 809391, 823655, 837584, 851126, 863968, 875503, 885458, 894224, 902432, 910501, 918750, 927634, 937527, 948372, 959757, 971334, 983051, 995135, 1008005, 1022129, 1037893, 1055598, 1075509, 1097736, 1122121, 1148554, 1177439, 1209402, 1244286, 1280862, 1318045, 1356265, 1397213, 1442436, 1492783, 1549214, 1613262, 1686119, 1767751, 1857461]
61017A857461R7658J06444J17027J31147J51267J79018K14750K59386L15528L85815
61007C815501M72124N78141P10587Q75175J073563J306588J571171J836229K017351
60998A4256430J998383J710940J206454O41006J78723r3070j67091p1173J46155
60989A9806757L88444N10269L86435K84n38567j067472j465367j692115j765084
60980A4563584j720276j594215j422319j235840j055712q91997p48971o28166
60972E266088n27714m43335l71959l12962k65657k27635j96383j70753j50024
60963B599666j32975j18714j07014r7124q7594p8036o9739o3638n8908n4419n0342
60952A681163m7306m5151m3523m2740m2863m2817m1575l9513l7605l5977l4265
$$ y = [1857461, 1955119, 2061563, 2178590, 2309737, 2461004, 2640022, 2854772, 3114158, 3429686, 3815501, 4287625, 4865766, 5576353, 6451528, 7525091, 8831679, 10402850, 12239079, 14256430, 16254813, 17965753, 19172207, 19813213, 19991936, 19898866, 19731775, 19660602, 19806757, 20195201, 20705470, 21091905, 21092189, 20553622, 19486150, 18020783, 16328668, 14563584, 12843308, 11249093, 9826774, 8590934, 7535222, 6643225, 5894254, 5266088, 4738374, 4295039, 3923080, 3610118, 3344461, 3116826, 2920443, 2749690, 2599666, 2466691, 2347977, 2240963, 2143839, 2056245, 1978209, 1908470, 1844832, 1785924, 1731505, 1681163, 1633857, 1588706, 1545183, 1502443, 1459580, 1416763, 1375188, 1335675, 1298070, 1262093, 1227828]
60941A227828l2655l1492l0398k8825k6949k5162k3245k0897j8560j6779j5251
60930I57615j3400j1408r804q537p246n968m722l000n42J804K951K993K928L288
60916I06952L781L920L351J935R7j309j997k582l397l788l263k584k811l997n686
60901H88622p925j0758j3398j5033j5914j6555j6492j5004j2657j0822r864r054
60889G35146q064p381p241p251p145p090p118p014o751o516o346o237o361o644
60875F37987o479n487m235l555l531l733l958m123l918l273k671k344j706m09
60861E88565P54Q44J52l69n31o94o76M9J316K491L394M171M584M338L731L105
60845F15224K143N96q48j458j790k911m682n956o176n679m740l470k381j954j792
$$ y = [1227828, 1195173, 1163681, 1133283, 1104458, 1077509, 1052347, 1029102, 1008205, 989645, 972866, 957615, 944215, 932807, 923003, 914466, 907220, 901252, 896530, 893530, 892988, 894792, 897743, 900736, 903664, 906952, 910733, 914653, 918004, 919939, 920036, 918727, 916730, 914148, 910751, 906963, 903700, 901116, 898305, 894308, 888622, 880697, 869939, 856541, 841508, 825594, 809039, 792547, 777543, 764886, 754064, 744200, 735146, 727082, 719701, 712460, 705209, 698064, 690974, 683856, 676842, 670091, 663575, 657229, 650992, 644631, 637987, 631508, 626021, 621786, 618231, 614700, 610967, 607009, 602886, 598968, 595695, 593024, 590680, 588974, 588565, 589319, 590163, 590315, 589946, 589415, 588721, 588045, 588094, 589410, 591901, 595295, 599466, 604050, 608388, 612119, 615224, 617367, 617963, 617115, 615657, 613867, 610956, 606274, 600318, 594142, 588463, 583723, 580253, 577872, 575918, 574126]
60830E74126j304p78p12n02P68K494L014J852R2j503l320n549p442q348q515q451
60814E35922q336q307q529q690q259p346o560n989n167m127l544l650l874l782
60800D49762l595l473l013j853l06R07J321J004M55J39jl04n94k07Q75J679J547
60783D44343J072J049J285J257J210J693K510L080L308L333L122L006L759N228
60769D79255N977N386M907N813O860N994L479J365M85j5o36j030j350k099k759
60754E11632k374j359r57j048m50P65J247O46j24r85k837n311o633o309n891o365
60738D73647o776o241n452n124m709l735k907k738k502j602p77q53j331j337r85
60723D26578q42q25o02l78m46n68m42k82l61n93q80j356j992k542k996l385l314
$$ y = [574126, 572822, 572044, 571332, 570830, 571598, 574092, 577106, 578958, 579050, 577547, 574227, 568678, 561236, 552888, 544373, 535922, 527586, 519279, 510750, 502060, 493801, 486455, 479895, 473906, 468739, 464612, 461068, 457418, 453544, 449762, 446167, 442694, 439681, 437828, 437522, 438429, 439750, 440754, 441209, 441348, 441347, 441043, 440449, 440242, 441117, 442796, 444343, 445415, 446464, 447749, 449006, 450216, 451909, 454419, 457499, 460807, 464140, 467262, 470268, 474027, 479255, 485232, 490618, 495525, 501338, 508198, 514192, 517671, 519036, 519521, 519506, 518870, 517840, 516490, 514391, 511632, 509258, 507899, 506942, 505894, 505444, 506209, 507456, 508102, 507978, 506993, 504156, 498845, 492212, 485903, 480012, 473647, 466871, 460630, 455178, 450054, 445345, 441610, 438703, 435965, 433463, 431861, 431084, 430231, 428900, 427563, 426578, 425736, 424911, 424309, 423931, 423485, 422917, 422475, 422193, 421832, 421239, 420359, 419003, 417011, 414469, 411473, 408088, 404774]
60706D04774k535j809k077k925l047k220j366p74K14J580K339K269K404L337M496
60691D04660N499O640P614P384N991M963N122N456M955M089L600L227K622K335
60677D74157K752L112K507J001q40k639l836l807k978k654l201l574l233l076
60663D53691l675m089l401k177j299n33O31J763K270K530L223M196M872N004M398
60648D67404K694J78k084l505m536n476n879n666n598n902n684m481l165k464
60634D15836j801n02J039K268L379M402M629L976L687M650O101O993P456P819
60620D69932P448N870L917K462J064q55k498k793k175j830j913j834j643j774
60606D73378j980j759j411j621k349l018l267k798j185J315L471M420M640M908
$$ y = [404774, 402239, 400430, 398353, 395428, 392381, 390161, 388795, 388021, 388235, 389815, 392154, 394423, 396827, 400164, 404660, 410159, 416799, 424413, 431797, 437788, 442751, 447873, 453329, 458284, 462373, 465973, 469200, 471822, 474157, 476909, 480021, 482528, 483529, 482689, 480050, 476214, 472407, 469429, 466775, 463574, 460000, 456767, 453691, 450016, 445927, 442526, 440349, 439050, 438517, 439148, 440911, 443181, 445711, 448934, 453130, 458002, 463006, 467404, 470098, 470276, 468192, 464687, 460151, 454675, 448796, 443130, 437532, 431630, 425946, 421465, 418300, 415836, 414035, 413533, 414572, 416840, 420219, 424621, 429250, 433226, 436913, 441563, 447664, 454657, 462113, 469932, 477380, 483250, 487167, 489629, 490693, 489838, 487340, 484547, 482372, 480542, 478629, 476795, 475152, 473378, 471398, 469639, 468228, 466607, 464258, 461240, 457973, 455175, 453990, 455305, 458776, 463196, 467836, 472744]
60592D72744N225N497O203P426Q248Q062P538P284O580M607J917m52k457m448
60578E33974o046o743o883o888o343m844k969j439j77R20J339J089J296K555L873
60563E02714M357M689N604O313N971N414N717O189N588M298L466K887J716M53
60549E65376K74J037J797K671M347O319P549Q481J0467J3608J6935K0406K4799
60536F84066K9795L4042L7064L9400M0806L9951L5992K9205K0102R290j921j2002
60524I85790k0191k6156k9316k9750k8983k8360k7310k4710k1178j8158j5491
60513G16187j2010q086n211l197j01M817J0053J4198J7510K0815K4475K8831L4196
60500H42477M0027M5290M9616N2870N3874N1315M5802L9328L2812K6011J9785
$$ y = [472744, 477969, 483466, 489669, 497095, 505343, 513405, 520943, 528227, 534807, 539414, 541331, 540879, 538422, 533974, 527928, 521185, 514302, 507414, 501071, 496227, 493258, 491819, 491642, 492562, 493901, 494990, 496286, 498841, 502714, 507071, 511760, 517364, 523677, 529648, 535062, 540779, 546968, 552556, 556854, 560320, 563207, 564923, 565376, 565650, 566687, 568484, 571155, 575502, 581821, 589370, 597851, 608318, 621926, 638861, 659267, 684066, 713861, 747903, 784967, 824367, 865173, 905124, 941116, 970321, 990423, 999713, 997792, 985790, 965599, 939443, 910127, 880377, 851394, 823034, 795724, 771014, 749836, 731678, 716187, 704177, 696091, 690880, 687683, 687582, 692399, 702452, 716650, 734160, 754975, 779450, 808281, 842477, 882504, 927794, 977410, 1030280, 1084154, 1135469, 1181271, 1220599, 1253411, 1279422, 1299207]
60489A299207J6081J5217J5186J4249J2381R536M498l525j3633k4472l5341m5267
60477A264117n2573n6387n7531n7022n4864n1092m6829m3201m0079l6843l3632
60466G34064l0953k8629k6039k2999j9842j7007j4930j3787j3042j1750r673p559
60454E17854o083n121m335l827l775l849l457k417j212n80o99p84O8J511K170
60439D85464J600J056J647K711L080L036L532M307M347L810L790M388M625M261
60425E31654M111M466M674M526M688N442O161O392O440O647O969P339P644P531
60411F14684P072P296Q975J1248J2747J3687J5363J7802J9538J9708J8927J7940
60399G84987J6828J5682J4777J3953J2953J2217J2146J1946J0599Q673P476O735
$$ y = [1299207, 1315288, 1330505, 1345691, 1359940, 1372321, 1381857, 1386355, 1382830, 1369197, 1344725, 1309384, 1264117, 1211544, 1155157, 1097626, 1040604, 985740, 934648, 887819, 844618, 804539, 767696, 734064, 703111, 674482, 648443, 625444, 605602, 588595, 573665, 559878, 546836, 535086, 525413, 517854, 511771, 506650, 502315, 498488, 494713, 490864, 487407, 484990, 483778, 483198, 482499, 481715, 481783, 483294, 485464, 487064, 488120, 489767, 492478, 495558, 498594, 502126, 506433, 510780, 514590, 518380, 522768, 527393, 531654, 535765, 540231, 544905, 549431, 554119, 559561, 565722, 572114, 578554, 585201, 592170, 599509, 607153, 614684, 621756, 629052, 638027, 649275, 662022, 675709, 691072, 708874, 728412, 748120, 767047, 784987, 801815, 817497, 832274, 846227, 859180, 871397, 883543, 895489, 906088, 914761, 922237, 928972]
60387I28972N090K638R45L89k57j238j155M38J900J992J621J987K649K617K026
60372I50614J494R56J91l62k23N21J821L995O914R868J2689J5957J9666K2673
60358A046774K3941K3276K0617J5951J0276N263J259l082q696j4818k0256k4578
60346A075927k7464k8350k7472k6090k4943k3598k1857k0441j9652j8694j7094
60335H20272j5489j4275j2862j1004r470q454o735l519J79L150N813R114J2597
60322G69317J4947J5743J5463J4340J2341R851P378M893K081j118m654q399j1579
60309H40604j2967j2314j0834r673q553o575l712q26J300K415K679K505K086R63
60295G87098j325m287o842q594r825j0408r918q757p855p215o162n055n073o015
$$ y = [928972, 934062, 936700, 937645, 938034, 937777, 936539, 935384, 935822, 937722, 939714, 941335, 943322, 945971, 948588, 950614, 952108, 953064, 953255, 952893, 952670, 953191, 955012, 959007, 965921, 975789, 988478, 1004435, 1024101, 1046774, 1070715, 1093991, 1114608, 1130559, 1140835, 1146098, 1147357, 1144275, 1135579, 1120761, 1100505, 1075927, 1048463, 1020113, 992641, 966551, 941608, 918010, 896153, 875712, 856060, 837366, 820272, 804783, 790508, 777646, 766642, 757172, 748718, 741983, 738464, 738643, 741793, 747606, 756720, 769317, 784264, 800007, 815470, 829810, 842151, 852002, 859380, 864273, 866354, 865236, 860582, 852183, 840604, 827637, 815323, 804489, 794816, 786263, 779688, 775976, 775150, 776450, 778865, 781544, 784049, 786135, 787098, 785773, 781486, 774644, 766050, 756225, 745817, 735899, 727142, 719287, 712072, 705910, 700855, 695782, 689767]
60281F89767o131m751l338l113l282k626j380l30O55K060L668N056O350P652Q545
60266F98802Q838Q912Q841Q250P473P619Q800R593Q907P218N312L109M51k167
60252G89958m446o694q802r987j0128r969r561q069n649l720k611q44K219N048
60238G16745O425P360R024J0641J1155J1289J2117J2961J2728J2119J2524J3633
60226H48721J4068J3649J3366J3634J4173J4983J6135J7111J7622J8378J9996
60215A021836K1984K3824K5993K8704L0891L1883L2885L5197L7956L9303L8849
60204A369305L7339L4797L0750K5549J9783J3109N300k278p895j1588j4440j6468
60192A483263j6908j5968j4513j2583r836p033n266m191k765j307j004j692j860
$$ y = [689767, 683636, 678885, 675547, 672434, 669152, 666526, 665146, 664816, 665471, 667531, 671199, 676255, 682605, 690257, 698802, 707640, 716552, 725393, 733643, 741116, 748735, 757535, 767128, 776035, 783253, 788565, 791674, 792125, 789958, 785512, 778818, 770016, 760029, 749901, 739932, 730371, 722302, 716653, 712933, 710322, 709478, 711697, 716745, 723170, 730530, 739554, 750195, 761350, 772639, 784756, 797717, 810445, 822564, 835088, 848721, 862789, 876438, 889804, 903438, 917611, 932594, 948729, 965840, 983462, 1001840, 1021836, 1043820, 1067644, 1093637, 1122341, 1153232, 1185115, 1218000, 1253197, 1291153, 1330456, 1369305, 1406644, 1441441, 1472191, 1497740, 1517523, 1530632, 1535932, 1533654, 1525759, 1514171, 1499731, 1483263, 1466355, 1450387, 1435874, 1423291, 1413455, 1406422, 1401156, 1396965, 1394200, 1392893, 1391889, 1390197, 1388337]
60179A388337q18Q67K835N233P556Q874R249R500R555Q536O462M444L018J627
60165A465275j00j764l043m089m939n449n790o263o778p380q868j1878j5716j9155
60151A364063k2075k5142k8194l0155l0529k9780k8385k6387k3872k1025j7849
60140A080670j4568j1919j0343r303q183p263o995p057p026p340q469r854j0713
60127I61637j1136j1379j0963r725q829r271j0183j0191r641r802j0501j0441
60115H39575r431q448p795o873n680m868m404l664k771k402k395j960j083l64
60101G77437K24J068J751J677J485K226L497M082M163N077O959Q534R257R839
60087H37276J0420J0087Q634P127O221N256L527J206j373m141o769q827j0570
$$ y = [1388337, 1387519, 1388386, 1391221, 1396454, 1404010, 1412884, 1422133, 1431633, 1441188, 1449724, 1456186, 1460630, 1463648, 1465275, 1465175, 1463411, 1460368, 1456279, 1451340, 1445891, 1440101, 1433838, 1427060, 1419680, 1410812, 1398934, 1383218, 1364063, 1341988, 1316846, 1288652, 1258497, 1227968, 1198188, 1169803, 1143416, 1119544, 1098519, 1080670, 1066102, 1054183, 1043840, 1034537, 1026354, 1019091, 1012096, 1005039, 998013, 990673, 982204, 972350, 961637, 950501, 939122, 928159, 918434, 909605, 900334, 890151, 879960, 870319, 860517, 850016, 839575, 830144, 821696, 813901, 807028, 801348, 796480, 792076, 788412, 785641, 783239, 780844, 778884, 777801, 777437, 777661, 778729, 780480, 782157, 783642, 785868, 789365, 793447, 797610, 802687, 809646, 818180, 827437, 837276, 847696, 857783, 866417, 873544, 879765, 885021, 888548, 889754, 888381, 884240, 877471, 868644, 858074]
60074H58074j2501j4058j4020j2307j0198q613p349o077m846l490j691K40J693
60061G64857K967M892P380R422J0598J1387J1994J2082J1593J0705R033O038K169
60048H75117j484m446o633p372o115l822k106j165j17J016J275O04j77j068k764
60033H40743m760n527m755l648k793j597OJ240K301M478P871J0786J2021J2009
60019H68375J1093Q546M214n61m629q220j1604j4063j5130j5541j5893j5589j4014
60006G76984j1702r463p368n362l852k893j825m06O10P57O53R12J224J219J239
59991G40727J544J661J260P77N10J7q99j402o36J127K987M451N512O318P227Q672
59975G79853J0564J2358J3819J5116J6085J6199J5422J4226J2593R901N997J611
$$ y = [858074, 845573, 831515, 817495, 805188, 794990, 786377, 779028, 772951, 768105, 764615, 762924, 763164, 764857, 767824, 772716, 780096, 789518, 800116, 811503, 823497, 835579, 847172, 857877, 866910, 872948, 875117, 873633, 869187, 862554, 855182, 849067, 845245, 843139, 841974, 841857, 842873, 844148, 844752, 844575, 843507, 840743, 835983, 830456, 825701, 822053, 819260, 817663, 817669, 818909, 821210, 825688, 833559, 844345, 856366, 868375, 879468, 888014, 892228, 891667, 887038, 878818, 867214, 853151, 838021, 822480, 806587, 790998, 776984, 765282, 755819, 748451, 743089, 739237, 736344, 734519, 734113, 734723, 735480, 736133, 737045, 738269, 739488, 740727, 742271, 743932, 745192, 745969, 746479, 746496, 745597, 744195, 743559, 744686, 747673, 752124, 757636, 763954, 771181, 779853, 790417, 802775, 816594, 831710, 847795, 863994, 879416, 893642, 906235, 916136, 922133, 923744]
59963I23744k494n999q635j0092j0449r935q471o181l946k359o07K348N893Q668
59949H71485J0935J4179J8524K2549K5847K9640L4365L8634M1255M2446M2272
59938A192131L9800L4800K8646K2469J5844Q332Q86n423j0862j6044k0594k3834
59926A266151k5892k7118k7348k6576k5446k4307k2603j9921j6810j3882j1020
59915A025228q067n367l110j109K54K5j776l759m975n956p233q109p781o560n079
59900I56626l259r95J070K402L355M403N375O126P057Q290R228R650J0242J1345
59886A030915J2227J2278J1945J1717J1165R915Q579P878P720P959R240J2123
59874A153661J6251K1106K6842L3533M0387M6534N1785N5672N6439N2092M2189
$$ y = [923744, 921250, 915251, 906616, 896524, 886075, 876140, 867669, 861488, 857542, 855183, 854576, 856924, 862817, 871485, 882420, 896599, 915123, 937672, 963519, 993159, 1027524, 1066158, 1107413, 1149859, 1192131, 1231931, 1266731, 1295377, 1317846, 1333690, 1342022, 1342908, 1337485, 1326623, 1310579, 1289985, 1266151, 1240259, 1213141, 1185793, 1159217, 1133771, 1109464, 1086861, 1066940, 1050130, 1036248, 1025228, 1017161, 1011794, 1008684, 1007575, 1007829, 1007854, 1006078, 1002319, 997344, 991388, 984155, 976046, 968265, 961705, 956626, 953367, 952372, 953442, 955844, 959199, 963602, 968977, 975103, 982160, 990450, 999678, 1009328, 1019570, 1030915, 1043142, 1055420, 1067365, 1079082, 1090247, 1100162, 1108741, 1116619, 1124339, 1132298, 1141538, 1153661, 1169912, 1191018, 1217860, 1251393, 1291780, 1338314, 1390099, 1445771, 1502210, 1554302, 1596491]
59863A596491K8040J1621n131k0484l3082m1947m6369m6401m3426l9211l4220
59852A325881k7748j9886j2123n723o57L456O587R059J1878J5543J9507K3292
59840A349066K7200L1316L4843L7047L8069L8403L8590L9789M3568N0602O0349
59829A788842P2097Q5001R6987J05112J07502J03766R3451P6109N3560L0231J0041
59818B622699n891j7928k6139l0863l3520l5585l7777m0925m6141n3048n9285
59807B235597o2905o4216o4396o3642o1825n9761n8508n8292n8913o0196o1262
59796A561681o0585n7641n3483m9052m4207l8971l4068k9515k4384j8863j4758
59785A136154j2784j1135p960l655N95M705Q742J1822J3616J5365J7758J9368
$$ y = [1596491, 1624531, 1636152, 1631021, 1610537, 1577455, 1535508, 1489139, 1442738, 1399312, 1360101, 1325881, 1298133, 1278247, 1266124, 1260401, 1259744, 1263200, 1269787, 1278846, 1290724, 1306267, 1325774, 1349066, 1376266, 1407582, 1442425, 1479472, 1517541, 1555944, 1594534, 1634323, 1677891, 1728493, 1788842, 1860939, 1945940, 2042927, 2148039, 2255541, 2359307, 2452758, 2528867, 2582427, 2612658, 2622699, 2616808, 2598880, 2572741, 2541878, 2508358, 2472773, 2434996, 2394071, 2347930, 2294882, 2235597, 2172692, 2108476, 2044080, 1980438, 1918613, 1858852, 1800344, 1742052, 1683139, 1622943, 1561681, 1501096, 1443455, 1389972, 1340920, 1296713, 1257742, 1223674, 1194159, 1169775, 1150912, 1136154, 1123370, 1112235, 1104275, 1100620, 1101215, 1105920, 1114662, 1126484, 1140100, 1155465, 1173223, 1192591]
59773A192591J8926J7559J6930J6637J5464J3754J2385J0627P329L350N52r68
59761A325136k466m055m593l756k239k70K370N111O975P941Q555Q601P468N382
59747A360160L008L74k658n477p513r198j0909j1875j1489j0721j0728j0989j0388
59734A261597r274q712q552q016p573q305r885j0970j1228j1358j1472j1126j0579
59721A134547j0493j0650j0310r519q716p611n804l998l164k977k491j764j409
59708A055641j109q4J402K415K775K867K625J971J528J583J182l27j830k031j500
59693A067108j381j082O75L339N175N933O742P823Q386Q467Q826R266R065Q801
59679A147143R754J1560J2549J2322J2097J2412J2448J1815J1218J0951J0339
$$ y = [1192591, 1211517, 1229076, 1246006, 1262643, 1278107, 1291861, 1304246, 1314873, 1322202, 1325552, 1326104, 1325136, 1322670, 1318615, 1314022, 1310266, 1308027, 1307757, 1310127, 1315238, 1322213, 1330154, 1338709, 1347310, 1354778, 1360160, 1363168, 1363542, 1360884, 1355407, 1347894, 1338696, 1327787, 1315912, 1304423, 1293702, 1282974, 1271985, 1261597, 1252323, 1243611, 1235059, 1227043, 1219470, 1211165, 1201280, 1190310, 1179082, 1167724, 1156252, 1145126, 1134547, 1124054, 1113404, 1103094, 1093575, 1084859, 1077248, 1071444, 1067446, 1064282, 1061305, 1058814, 1057050, 1055641, 1054532, 1054448, 1055850, 1058265, 1061040, 1063907, 1066532, 1068503, 1070031, 1071614, 1072796, 1072469, 1070639, 1068608, 1067108, 1065727, 1064645, 1065320, 1068659, 1073834, 1079767, 1086509, 1094332, 1102718, 1111185, 1120011, 1129277, 1138342, 1147143, 1156897, 1168457, 1181006, 1193328, 1205425, 1217837, 1230285, 1242100, 1253318, 1264269, 1274608]
59668A274608Q934O934M317Q71k888o065q503j0428j1366j0846r691q999q327
59655A218551o602m472l820n030o624p576q264r009r456r540r601r369q337p077
59641A113774o767p516q569r877j1844j3801j4653j4847j5784j7203j7137j4782
59629I60994j1520q670n926k619J019M599Q244J1997J5442J8352K0882K2930K4119
59616A059843K4315K3407K0913J6801J2300Q804O374M348K823K184J857R84j67
59603A184786r18j651l092m744n664o082o653o835n885m656m435m721m378m162
59589A120910n691q451j0418j1231j2180j3325j3417j2602j2336j2450j1101q051
59577I89657n301l917k819j296k02J38O58J412J056o23j978k118k080k430j999
$$ y = [1274608, 1283542, 1290476, 1294793, 1295664, 1292776, 1286711, 1278208, 1267780, 1256414, 1245568, 1235877, 1226878, 1218551, 1211949, 1207477, 1203657, 1198627, 1192003, 1184427, 1176163, 1167154, 1157698, 1148158, 1138557, 1129188, 1120851, 1113774, 1107007, 1099491, 1090922, 1081045, 1069201, 1055400, 1040747, 1025900, 1010116, 992913, 975776, 960994, 949474, 940804, 934878, 932259, 933278, 937877, 946121, 958118, 973560, 991912, 1012794, 1035724, 1059843, 1084158, 1107565, 1128478, 1145279, 1157579, 1166383, 1172757, 1177105, 1179928, 1182112, 1183969, 1184953, 1184786, 1183868, 1182217, 1179125, 1174381, 1168717, 1162635, 1155982, 1149147, 1143262, 1138606, 1134171, 1129450, 1125072, 1120910, 1115219, 1106768, 1096350, 1085119, 1072939, 1059614, 1046197, 1033595, 1021259, 1008809, 997708, 989657, 984356, 980439, 977620, 976324, 976122, 976260, 976918, 978330, 979386, 978763, 976785, 974667, 972587, 970157, 968158]
59562I68158j17K023L505N256Q290J1914J4804J6467J6854J6097J5273J5799J7451
59549A111774J8603J8795J9165K0010K0329K0338K1723K4165K4253J9619J2093
59538A330867N062l65m858q414j0724j2743j5743j9417k2420k4266k5431k6225
59526A165323k6643k6775k6540k5597k4059k2499k0868j8439j5227j2332j0428
59515I35916r183q509q895r994j0445r797r113q974q532p280o124n723n306m192
59501H23849l016k347j475K85K298L732M875O238P424P893P939Q068Q283Q694
59487H82740R822J1683J3661J5667J8138K0414K0718J8510J5372J2688R940O278
59475A055631K349o57k640m161n336o085o635p013o949o702o973p603p609o836
$$ y = [968158, 968041, 970064, 973569, 978825, 987115, 999029, 1013833, 1030300, 1047154, 1063251, 1078524, 1094323, 1111774, 1130377, 1149172, 1168337, 1188347, 1208676, 1229014, 1250737, 1274902, 1299155, 1318774, 1330867, 1335929, 1335564, 1330706, 1322292, 1311568, 1298825, 1283082, 1263665, 1241245, 1216979, 1191548, 1165323, 1138680, 1111905, 1085365, 1059768, 1035709, 1013210, 992342, 973903, 958676, 946344, 935916, 926733, 918224, 909329, 899335, 888890, 879093, 869980, 861006, 852474, 845194, 839070, 833347, 828041, 823849, 820833, 818486, 817011, 817296, 819594, 823326, 828201, 834439, 841863, 849756, 857695, 865763, 874046, 882740, 892562, 904245, 917906, 933573, 951711, 972125, 992843, 1011353, 1026725, 1039413, 1049353, 1055631, 1057980, 1057323, 1054683, 1050522, 1045186, 1039101, 1032466, 1025453, 1018504, 1011802, 1004829, 997226, 989617, 982781]
59461I82781o237o114n729n030m961n444m939k886p45M15J516L540N717O973P614
59446I66471Q275Q626Q323P965P906P377N884M161K714Q45j785m155n570o837
59432A010200q543r749r695r253r200q533o156k911k60J867M256O660Q645J1192
59418I78520J5288J9442K0492J6971J0423L640j299l569l370j456J652N977J1563
59405A074274J7992K4216K8193K7306K0703J1234L349j093l337m237k827J038
59393A196811N241Q062J0239J2921J5475J6851J7422J7802J7359J5512J3266J1909
59381A358870J1304J0742J0263R960R301Q339Q079Q363O967K326m247j0500j5834
59368A413933k0471k3613k4479k4000k3656k3466k2695k1543k0581j9440j7549
$$ y = [982781, 976544, 970430, 964701, 959671, 954710, 949266, 944327, 941441, 940696, 941111, 942627, 946167, 951884, 958857, 966471, 974746, 983372, 991695, 999660, 1007566, 1014943, 1020827, 1024988, 1027702, 1028547, 1026762, 1022607, 1017037, 1010200, 1001657, 991908, 982213, 972960, 963760, 955227, 949071, 946160, 945900, 947767, 952023, 958683, 967328, 978520, 993808, 1013250, 1033742, 1050713, 1061136, 1064776, 1063477, 1059908, 1056538, 1055082, 1056734, 1062711, 1074274, 1092266, 1116482, 1144675, 1171981, 1192684, 1203918, 1207267, 1206174, 1202837, 1198600, 1195773, 1196811, 1202052, 1210114, 1220353, 1233274, 1248749, 1265600, 1283022, 1300824, 1318183, 1333695, 1346961, 1358870, 1370174, 1380916, 1391179, 1401139, 1410440, 1418779, 1426858, 1435221, 1442188, 1444514, 1440267, 1429767, 1413933, 1393462, 1369849, 1345370, 1321370, 1297714, 1274248, 1251553, 1230010, 1209429, 1189989, 1172440]
59357A172440j5340j3394j1341q838o629n464n018m973n815p398q140p127n568
59344A067395m818m318k983j150M46K195M481O378P157P756R024R977R606R041
59330A120187R938J1911J3544J4730J5907J6113J3993J0008N578Q17m972j1294
59318A216460j6758k0753k3197k3512k1563j8750j6401j3895j0077n493j418K369
59306A047012O908J2019J6783K1136K4936K6367K3553J7483J1279O940M379L096
59294A221891K877L110L080K793K291P47k402o117q940j0815j2450j3664j3773
59281A168628j2745j0719p356k977P97K977M585O640Q228Q230P447P006O091L414
59267A190246l04l507o338r675j2787j4388j5076j6343j7825j7993j6912j5931
$$ y = [1172440, 1157100, 1143706, 1132365, 1123527, 1116898, 1111434, 1106416, 1101443, 1095628, 1088230, 1080090, 1072963, 1067395, 1062577, 1058259, 1055276, 1054126, 1054572, 1056767, 1061248, 1067626, 1074783, 1082539, 1091563, 1101540, 1111146, 1120187, 1130125, 1142036, 1155580, 1170310, 1186217, 1202330, 1216323, 1226331, 1231909, 1232726, 1227754, 1216460, 1199702, 1178949, 1155752, 1132240, 1110677, 1091927, 1075526, 1061631, 1051554, 1046061, 1044643, 1047012, 1053920, 1065939, 1082722, 1103858, 1128794, 1155161, 1178714, 1196197, 1207476, 1214416, 1218795, 1221891, 1224768, 1227878, 1230958, 1233751, 1236042, 1236789, 1234387, 1228270, 1219330, 1208515, 1196065, 1182401, 1168628, 1155883, 1145164, 1137808, 1134831, 1135628, 1138605, 1143190, 1149830, 1158058, 1166288, 1173735, 1180741, 1186832, 1190246, 1189942, 1186435, 1180097, 1170422, 1157635, 1143247, 1128171, 1111828, 1094003, 1076010, 1059098, 1043167]
59255A043167j5212j3831j1940j0612r846q807p608p004o859o701p046q353r532
59242I19816r561r521j0873j2697j3093j2414j2489j3330j3338j2305j1574j1397
59230G77224j0737r502q618q050p031o022o085o582n883m189l277l549l720l348
59216F90631l294l559l047j746j025j432k087k355k389j961n44J461L184M767
59202F76604O711Q347Q754Q712R741J1654J3074J3846J4832J5773J5636J4689
59190H18373J4026J3334J1409Q474N807L330j5l787o339p453q349r225r057p744
59176H22784o201m321j118L154P114J0437J3912J7586K0884K4342K9063L4730
59164I72366M0078M4858M9201N1741N0671M6157L9357K9885J6982K498j0183j9917
$$ y = [1043167, 1027955, 1014124, 1002184, 991572, 981726, 972919, 965311, 958307, 951448, 944747, 937701, 929348, 919816, 910255, 900734, 889861, 877164, 864071, 851657, 839168, 825838, 812500, 800195, 788621, 777224, 766487, 756985, 748367, 740317, 733286, 727264, 721179, 714597, 708714, 704525, 701248, 697699, 693979, 690631, 687337, 683778, 680731, 678985, 677960, 676528, 674441, 672086, 669697, 667736, 667192, 668653, 671837, 676604, 683315, 691662, 700416, 709128, 718869, 730523, 743597, 757443, 772275, 788048, 803684, 818373, 832399, 845733, 857142, 865616, 871423, 874753, 874738, 870951, 864612, 857159, 848810, 839585, 830528, 822784, 816583, 812262, 811144, 814298, 821412, 831849, 845761, 863347, 884231, 908573, 937636, 972366, 1012444, 1057302, 1106503, 1158244, 1208915, 1255072, 1294429, 1324314, 1341296, 1343794, 1333611, 1313694]
59152A313694k7751l3672l6441l6339l4996l2587k8159k2562j7967j4509j0465
59141A018246n776k204Q8K882O583R708J2014J4956J8584K1097K2010K2774K3860
59128A164822K4170K3728K3839K4115K2579J9284J6506J4805J2228Q212M822L045
59116A362155J274j360l418m280n658q348j0480j0651j0220j0792j1844j2460
59104A273918j3005j3697j3637j2672j2181j2823j3552j3756j4215j5148j5529
59093A123703j5206j5329j5980j5800j4681j4176j4532j4137j2694j2053j2772
59082I66343j2883j1314r617q944q119o253m566m040l775l115k896l285k965j830
59068H82741j786l401m514l791k928l557m533m184k861j401O54L448N621O393
$$ y = [1313694, 1285943, 1252271, 1215830, 1179491, 1144495, 1111908, 1083749, 1061187, 1043220, 1028711, 1018246, 1012470, 1010266, 1010354, 1013236, 1019819, 1029527, 1041541, 1056497, 1075081, 1096178, 1118188, 1140962, 1164822, 1188992, 1212720, 1236559, 1260674, 1283253, 1302537, 1319043, 1333848, 1346076, 1354288, 1359110, 1362155, 1363429, 1362069, 1358651, 1354371, 1348713, 1340365, 1329885, 1319234, 1309014, 1298222, 1286378, 1273918, 1260913, 1247216, 1233579, 1220907, 1208726, 1195903, 1182351, 1168595, 1154380, 1139232, 1123703, 1108497, 1093168, 1077188, 1061388, 1046707, 1032531, 1017999, 1003862, 991168, 979115, 966343, 953460, 942146, 932529, 923585, 915466, 909213, 904647, 900607, 896832, 893717, 890821, 887536, 884571, 882741, 880955, 877554, 873040, 869249, 866321, 862764, 858231, 854047, 851186, 849785, 850439, 853887, 859508, 865901]
59054H65901O818P462P070N044K881J565j14l051n918p459q331r094q652o487
59040H47635m120k684j267P67K215K560L463N896Q162Q701Q493Q646Q030N627
59026I02124L005K031K003J292J01n74r85j607j658n46P53J452K415M278O016
59011I20100O967Q288J0696J2734J3105J2784J3043J3306J2736J2000J1754J1318
58999A058831J0567J1061J3476J6032J7319J8650K1679K5854L0078L4908M1054
58988A299509M7679N4049O0796O7702P2347P2881O9947O4051N3635L8042K0074
58977A920712L118j2166k6083l7209m4234m8431n1688n3716n3686n2623n1707
58966A492287m9932m5996m0909l6348l2159k7752k4157k2219k0517j7528j4196
$$ y = [865901, 872719, 880181, 887251, 892295, 895176, 896741, 896627, 893576, 887658, 880199, 871868, 862774, 854122, 847635, 843515, 840831, 839564, 840331, 842546, 845106, 848569, 854465, 862627, 871328, 879821, 888467, 896497, 902124, 905129, 907160, 909163, 910455, 910556, 909982, 908997, 907390, 905732, 905186, 905939, 907391, 909806, 914084, 920100, 927067, 935355, 946051, 958785, 971890, 984674, 997717, 1011023, 1023759, 1035759, 1047513, 1058831, 1069398, 1080459, 1093935, 1109967, 1127286, 1145936, 1167615, 1193469, 1223547, 1258455, 1299509, 1347188, 1401237, 1462033, 1529735, 1602082, 1674963, 1744910, 1808961, 1862596, 1900638, 1920712, 1923830, 1911664, 1885581, 1848372, 1804138, 1755707, 1704019, 1650303, 1596617, 1543994, 1492287, 1442355, 1396359, 1355450, 1319102, 1286943, 1259191, 1235034, 1212815, 1192298, 1174770, 1160574]
58955A160574j2025j0472q635p599q489r956j0226r914j0246j0210q378n923m864
58942A043637m613l055m2K721M324M929M599L924M515O809Q878R290R411J0859
58928A106186J2692J3479J4182J6369J9442K2218K5490L0223L4887L7339L7813
58917A370320L7370L4991K8970J9830R307j974j3355k2407k7152k8527k8240k5936
58905A353197k1042j5337j0776o596j470L398O382Q651J2035J5464J7010J7713
58893A378629J9891K3149K5601K7523L0102L1816K9889K4442J7695R991K07j0792
58881A608143k0570k8364l4667l8569l8754l6349l3499l0048k4878j9434j6266
58870A286745j4850j2535r095o715n867m863l389l061m341n956p503r808j2755
$$ y = [1160574, 1148549, 1138077, 1129442, 1121843, 1113354, 1103398, 1093172, 1083258, 1073012, 1062802, 1054424, 1048501, 1043637, 1039024, 1035969, 1035927, 1038648, 1042972, 1047901, 1052500, 1056424, 1060939, 1067748, 1076626, 1085916, 1095327, 1106186, 1118878, 1132357, 1146539, 1162908, 1182350, 1204568, 1230058, 1260281, 1295168, 1332507, 1370320, 1407690, 1442681, 1471651, 1491481, 1500788, 1498814, 1485459, 1463052, 1435900, 1407373, 1379133, 1353197, 1332155, 1316818, 1306042, 1299446, 1297976, 1301374, 1307756, 1316407, 1328442, 1343906, 1360916, 1378629, 1398520, 1421669, 1447270, 1474793, 1504895, 1536711, 1566600, 1591042, 1608737, 1618728, 1618935, 1608143, 1587573, 1559209, 1524542, 1485973, 1447219, 1410870, 1377371, 1347323, 1322445, 1303011, 1286745, 1271895, 1259360, 1250265, 1243550, 1237683, 1232820, 1229431, 1226370, 1222029, 1216073, 1208570, 1198762, 1186007]
58857A186007j5267j7266j9299k0690k0388j9029j7856j6510j4275j2298j1907
58846A001222j2002j0960r801j0418j1966j2288j1758j2244j3335j3110j1817
58835H71523j1233j1142r948q055p124o636m712j779J20J175L447P086J0348J2943
58821H46013J5979J8961K0295K0414K1043K1640J9876J5363R804L840l028r817
58809A000383j4709j7926k0892k3054k2777k0714j9035j7878j5854j3279j1540
58798H02725j0039p381m725m330n471n629m956n629p390p904p038o738o912n664
58784G12919l242j672n89K334O955J0727J2973J4919J5679J2780O943J941p09
58771G91958k759m743m958l469k732l377l307j782m88J24J595L872M866M312M273
$$ y = [1186007, 1170740, 1153474, 1134175, 1113485, 1093097, 1074068, 1056212, 1039702, 1025427, 1013129, 1001222, 989220, 978260, 968459, 958041, 946075, 933787, 922029, 909785, 896450, 883340, 871523, 860290, 849148, 839200, 831145, 824021, 817385, 812673, 810894, 811014, 812189, 815636, 822722, 833070, 846013, 861992, 880953, 901248, 921662, 942705, 964345, 984221, 999584, 1009388, 1013228, 1010200, 1000383, 985674, 967748, 946856, 923802, 901025, 880311, 861276, 843398, 827544, 814265, 802725, 792686, 785305, 780580, 776250, 770779, 765150, 760194, 754565, 747175, 739271, 732233, 725495, 718583, 712919, 709677, 708005, 707416, 709750, 716705, 727432, 740405, 755324, 771003, 783783, 790726, 792667, 791958, 789199, 784456, 779498, 776029, 773297, 769920, 766613, 764831, 764343, 764467, 766062, 769934, 774800, 779112, 783385]
58756G83385N172N135M021M156O191P983Q542R418J1339J2983J3912J5300J7066
58743I04603J7607J6991J6990J7573J6863J4839J3470J2894J1275Q714P405P595
58731A066819P425P065Q824J2719J6305J9401K4569L2080L8846M3266M6712M9090
58719A373121M7424M0334K9947J8015M067j1350k5451l6653m5757n2775n6218
58708A284704n6359n5414n3697m9459m3133l7591l3420k8261k1668j6199j2743
58697H76760r165m651r51J786N816J1197J4871J5654J5596J5151J1697M495l460
58684I54796j0155j6626k2837k6215k6098k5124k4414k1869j6949j2474r791o767
58672G35477k517O39J952M105Q082J0915J0934J0494J0869R209L587l295q356
$$ y = [783385, 788557, 793692, 797713, 801869, 808060, 816043, 824585, 834003, 845342, 858325, 872237, 887537, 904603, 922210, 939201, 956191, 973764, 990627, 1005466, 1018936, 1031830, 1043105, 1051819, 1059224, 1066819, 1074244, 1081309, 1090133, 1102852, 1119157, 1138558, 1163127, 1195207, 1234053, 1277319, 1324031, 1373121, 1420545, 1460879, 1490826, 1508841, 1512908, 1501558, 1476107, 1439454, 1393697, 1340922, 1284704, 1228345, 1172931, 1119234, 1069775, 1026642, 989051, 955631, 927370, 905702, 889503, 876760, 867595, 862944, 861993, 863779, 869595, 880792, 895663, 911317, 926913, 942064, 953761, 958256, 954796, 944641, 928015, 905178, 878963, 852865, 827741, 803327, 781458, 764509, 752035, 742244, 735477, 732960, 733599, 735551, 739656, 747738, 758653, 769587, 780081, 790950, 800159, 803746, 800451, 792095]
58659G92095j2118j5599j7338j6496j5155j4808j3992j1793r994r508q506o322
58647F40466n270o273o710m993l233l048k795j387o92j653k140j046m58j376j561
58632E97831j5Q09l18j015j31k18k407l656k196j026k546m297l555j937j775j935
58616E71613p76M70O43J240L002L785K616J855K554K119n04k071p87Q9j904l785
58600E80159k370L50J284J517L178N070N616O451Q963J0939J0516R851J0997J1942
58586F64463J0513Q467P901P552O284O213Q574J0682J0917J2292J6949K1611K3020
58573H15438K3517K6396K9940L0944L0180K9399K6794K0576J3578R185O004J342
58561A063293l456n864o876q184q149n390k909l756o001o770p770j1838j7407
$$ y = [792095, 779977, 764378, 747040, 730544, 715389, 700581, 686589, 674796, 664802, 655294, 646788, 640466, 635196, 628923, 622213, 617220, 613987, 610939, 608144, 606757, 606065, 604412, 602272, 601226, 600768, 599392, 597831, 597816, 598625, 598307, 597292, 597161, 596943, 594536, 590880, 588684, 587658, 585112, 580815, 577260, 575323, 573548, 571613, 570837, 571307, 571950, 573190, 576192, 579977, 582593, 584448, 587002, 589121, 588617, 586546, 585759, 585848, 583944, 580159, 577789, 578139, 579423, 580940, 584118, 589188, 594804, 601255, 610218, 621157, 631673, 641524, 652521, 664463, 674976, 683443, 691344, 698896, 705180, 711393, 719967, 730649, 741566, 753858, 770807, 792418, 815438, 838955, 865351, 895291, 926235, 956415, 985814, 1012608, 1033184, 1046762, 1055947, 1061951, 1063293, 1059837, 1053973, 1047097, 1038913, 1030764, 1025374, 1022465, 1018709, 1012708, 1005938, 998168, 986330, 968923]
58548I68923k1356k4068k6816k7670k5069k2039k1691k1868j9310j5727j4452
58537G28857j4401j2777j0682j0595j1209j0043q354q319q303n978l179k607k745
58524F19665r93J232J598J816M351P432Q432Q957J1496J4410J5339J5980J8220
58511G27935J9281J6307J1988R982Q545M699P52L88J849J580J168M096Q849J1878
58497H29297J4168J8257K1811K1121J8062J6917J7049J5429J3445J4307J6329
58486A016192J5690J3196J1611R063K130p033j3588j7551k1668k4592k3346k0066
58474I40038j9045j9231j6607j1715p938m666P75O916J0718J3893J9620K5726
58462I38484K8123K8033K8428K6522J7902N286n047j2994k2419l1843l6135l5636
$$ y = [968923, 947567, 923499, 896683, 869013, 843944, 821905, 800214, 778346, 759036, 743309, 728857, 714456, 701679, 690997, 680402, 669193, 659150, 650796, 642477, 634174, 628196, 625017, 622410, 619665, 618672, 619904, 621502, 623318, 627669, 635101, 643533, 652490, 663986, 678396, 693735, 709715, 727935, 747216, 763523, 775511, 785493, 794038, 798737, 799489, 799877, 801726, 803306, 804474, 808570, 817419, 829297, 843465, 861722, 883533, 904654, 922716, 939633, 956682, 972111, 985556, 999863, 1016192, 1031882, 1045078, 1056689, 1065752, 1067882, 1060849, 1047261, 1029710, 1008042, 983450, 960104, 940038, 920993, 901762, 885155, 873440, 865502, 860836, 861611, 868527, 879245, 893138, 912758, 938484, 966607, 994640, 1023068, 1049590, 1067492, 1072778, 1067731, 1054737, 1032318, 1000475, 964340, 928704]
58450I28704l4916l4116l0040k4236k1399k0945j8395j3919j1392j0381p339l300
58438F98326k218k944j110K448L399K464L819O481N895K770J680K181Q0l692m386
58423G15193k527k827n099n115l451m384o925o151k722j886l591k781R33L006
58409F71673K910M378P102P168N310N933Q517Q748P283Q319J0596R200N299M410
58395G66846O039M948J675J551L959L130q10k117m19q44l373k775P64J617n37
58380G79654m54K089K098j73O53M354N342L678M879Q636Q980N836M991O426M374
58365H41363o34j842J002J105k371k946M98J929K97J209N160O302M267N027Q778
58350H69144R286O493P029J0982J1298P681P611J1884J2877R234Q261J1456J1581
$$ y = [928704, 893788, 859672, 829632, 805396, 783997, 763052, 744657, 730738, 719346, 708965, 701626, 698326, 696108, 693164, 692054, 694502, 697901, 700365, 704184, 710665, 716560, 719330, 721010, 723191, 723271, 719579, 715193, 712666, 709839, 704740, 699625, 696174, 691790, 684865, 678714, 675992, 674106, 670515, 667734, 668667, 671673, 674583, 678961, 686063, 693231, 698541, 704474, 712991, 721739, 729022, 737341, 747937, 757137, 762436, 766846, 772885, 777833, 779508, 781059, 785018, 788148, 787338, 785221, 784802, 783958, 780585, 777810, 778574, 780191, 779654, 779200, 781289, 783387, 783214, 783867, 788221, 793563, 797241, 802120, 810756, 819736, 825572, 830563, 836989, 841363, 840729, 838887, 839889, 840994, 838623, 835677, 836175, 838104, 838401, 839610, 844770, 851072, 855339, 860366, 869144, 878430, 884923, 891952, 902934, 914232, 921913, 929524, 941408, 954285, 963519, 971780, 983236, 994817]
58337I94817O871M236N489M355L6l43M142N766K897L018P908J0322Q665J0294
58323A068473J6705K0260J9312K1501K8219L0996K7433K5417K7390K6052K0035
58312A331793J7873K1601K2196J6228J1242R943N309l608p636m457l023o031n001
58299A406429K029N584L050L859J0708J3934J0865J1861K0373K5937K4201K4718
58287A563548L1339L4223K9297K6192K8758K7463J9379J5619K0308K2637J8391
58276A837154J8446K6939L2597L1105L3862M4691N0632M6461M5016N2054N4630
58265B273587M6355M0005M2514M1947L2433K7112L2435L4818K7166K3108L0128
58254B651608L4768K9949L0073M2718N2697N1119N2468O5265P4512P1598P2305
$$ y = [994817, 1001688, 1005924, 1011413, 1015768, 1015804, 1015461, 1019603, 1025369, 1028266, 1031284, 1039192, 1049514, 1058179, 1068473, 1085178, 1105438, 1124750, 1146251, 1174470, 1205466, 1232899, 1258316, 1285706, 1311758, 1331793, 1349666, 1371267, 1393463, 1409691, 1420933, 1430876, 1436185, 1432577, 1424941, 1420484, 1417461, 1411430, 1406429, 1408458, 1414042, 1417092, 1420951, 1431659, 1445593, 1456458, 1468319, 1488692, 1514629, 1538830, 1563548, 1594887, 1629110, 1658407, 1684599, 1713357, 1740820, 1760199, 1775818, 1796126, 1818763, 1837154, 1855600, 1882539, 1915136, 1946241, 1980103, 2024794, 2075426, 2121887, 2166903, 2218957, 2273587, 2319942, 2359947, 2402461, 2444408, 2476841, 2503953, 2536388, 2571206, 2598372, 2621480, 2651608, 2686376, 2716325, 2746398, 2789116, 2841813, 2892932, 2945400, 3010665, 3085177, 3156775, 3229080]
58243C229080Q5869R6175R3642R4914J10018J21789J19784J21808J38872J52633
58233D364584J51697J55224J75201J91681J92251J98395K24308K48542K56505
58224F158388K70472L05631L38562L53134L73724M17234M58247M79862N10611
58215I665865N70430O31169O74180P32583Q29512R32377J019087J127610J284915
58206A7467728J454501J615690J822768K118915K471841K870124L395409M115932
58198C7332908N010439O098148P533585R460127J1899885J4918950J8737433K3513184
58190A34504659K9224842L5920533M3535863N0685373N3813770M8780463L4274295
58183D30739798J3585048p431034k4135318l4971797m0530780m1933531m0265428
$$ y = [3229080, 3314949, 3411124, 3504766, 3599680, 3709698, 3831487, 3951271, 4073079, 4211951, 4364584, 4516281, 4671505, 4846706, 5038387, 5230638, 5429033, 5653341, 5901883, 6158388, 6428860, 6734491, 7073053, 7426187, 7799911, 8217145, 8675392, 9155254, 9665865, 10236295, 10867464, 11541644, 12274227, 13103739, 14036116, 15055203, 16182813, 17467728, 18922229, 20537919, 22360687, 24479602, 26951443, 29821567, 33216976, 37332908, 42343347, 48441495, 55975080, 65435207, 77335092, 92254042, 110991475, 134504659, 163729501, 199650034, 243185897, 293871270, 347685040, 396465503, 430739798, 444324846, 436893812, 412758494, 377786697, 337255917, 295322386, 255056958]
58176B55056958l6672496l2220933k7623086k3276480j9448713j6267981j3661772
58169H5885497j1486065r678281q210025o991264n930867n024631m293450l694007
58161C0576907l167364k716926k363928k077189j814403j585637j413070j271290
58153A4167100j125755r89920q89225q06159p12929o23157n61364n13522m55020
58144G490049l97453l62923l40096l08083k77205k65449k59727k39464k14971
58135D824678k05304k00743j83178j61971j54743j52813j39309j22363j18052
58126C386202j18733j09316r7370r7066j00273r2655q2002q2213q5279p7010o5070
58115B379215o4021o7286o0859n0629m9755n2341m5589l5361l4331l6865l0464
$$ y = [255056958, 218384462, 186163529, 158540443, 135263963, 115815250, 99547269, 85885497, 74399432, 64721151, 56511126, 49519862, 43588995, 38564364, 34270914, 30576907, 27409543, 24692617, 22328689, 20251500, 18437097, 16851460, 15438390, 14167100, 13041345, 12051425, 11162200, 10356041, 9643112, 9019955, 8458591, 7945069, 7490049, 7092596, 6729673, 6389577, 6081494, 5804289, 5538840, 5279113, 5039649, 4824678, 4619374, 4418631, 4235453, 4073482, 3918739, 3765926, 3626617, 3504254, 3386202, 3267469, 3158153, 3060783, 2963717, 2863444, 2770789, 2688787, 2606574, 2521295, 2444285, 2379215, 2315194, 2247908, 2187049, 2136420, 2086665, 2034324, 1988735, 1953374, 1919043, 1882178, 1851714]
58104A851714k0591j9795k3138j8218r240p946j0665p066k023o282j4561j4816
58092A697373j0709j3396j9436j8101j2736j4043j9446j9253j6282j9537k5362
58081A509072k4297k0044k2407k7849k6120k0124k0397k5335k5272k1157k1299
58070A254771k4364k3043j9868k2496k7829k7398k3812k5503k9787k7696k1260
58059I81715j9644k2089k0766j6770j7383k0803j9241j4116j3082j5028j2829
58048G89964p952p689j0659r445n015m440o936o006k753l469o632n713k240k783
58034G08232n697m252j76o74m584m883k487m057q319q162m424m257p393p179l787
58019F37901l377n430l882L34O89k032r05L918N726M219N549R882J1275R796J1612
$$ y = [1851714, 1831123, 1811328, 1788190, 1769972, 1760732, 1752786, 1742121, 1735055, 1733032, 1726750, 1712189, 1697373, 1686664, 1673268, 1653832, 1635731, 1622995, 1608952, 1589506, 1570253, 1553971, 1534434, 1509072, 1484775, 1464731, 1442324, 1414475, 1388355, 1368231, 1347834, 1322499, 1297227, 1276070, 1254771, 1230407, 1207364, 1187496, 1165000, 1137171, 1109773, 1085961, 1060458, 1030671, 1002975, 981715, 962071, 939982, 919216, 902446, 885063, 864260, 845019, 830903, 817821, 802793, 789964, 782012, 774323, 763664, 754219, 749204, 744764, 737828, 731822, 729069, 725600, 718968, 713255, 711015, 708232, 702535, 698283, 698107, 697433, 692849, 687966, 685479, 681422, 673103, 664941, 660517, 656260, 648867, 641688, 637901, 634524, 629094, 625212, 625546, 626235, 624203, 623298, 627216, 632942, 637161, 642710, 652592, 663867, 673663, 685275]
58004F85275J7024K0119K0454K3440K8961L0946K8499K6464K4940J9361J1063
57993I36546O620O438M967K283M202J0719J5649J8357K4615L4867M2814M6885
57981A154962N2121N9133O2002N9023N5325N2815M7470L8545L0757K5153J6958
57970A654264M470q691k1549l6967n3534o5259p0905p4854p7679p5011o7064n9824
57958A047397n5077m8451l9181l2480l0016k7076k1564j7157j5195j2019o841
57947G42340l913m280l464J95K800K829L876P103Q712P387O704P756O980L573
57933G88598J589K259J680j450l284k314k004l383k440K448P566J1006J5728K2880
57919H38879K8897L1887L4136L5710L2340K2462R981k325j5601k8982l7769m0380
$$ y = [685275, 702299, 722418, 742872, 766312, 795273, 826219, 854718, 881182, 906122, 925483, 936546, 943166, 949604, 954571, 956854, 961056, 971775, 987424, 1005781, 1030396, 1065263, 1108077, 1154962, 1207083, 1266216, 1328218, 1387241, 1442566, 1495381, 1542851, 1581396, 1612153, 1637306, 1654264, 1658734, 1650043, 1628494, 1591527, 1537993, 1472734, 1401829, 1326975, 1249296, 1174285, 1107221, 1047397, 992320, 943869, 904688, 872208, 842192, 815116, 793552, 776395, 761200, 749181, 742340, 738427, 734147, 730683, 730878, 733678, 736507, 740383, 747486, 756198, 763585, 770289, 778045, 785025, 788598, 790187, 792446, 794126, 792676, 789392, 787078, 785074, 781691, 779251, 781699, 789265, 800271, 815999, 838879, 867776, 899663, 933799, 969509, 1001849, 1024311, 1034292, 1031967, 1016366, 987384, 949615, 909235]
57907I09235m0700m1046l9150l4427l0495k8849k6464k2266j9519j9291j8067
57896E88961j4503j2085j2337j1913r176p282p817p730n557m364n593o115m456
57883D80033l776n676p050o077n315n945n105j970k64j539k092K35K334K133K483
57868D42409N217P424P245P442R570J0509Q626P451R253J0722R116P090P182O996
57854E56252M275J534J136O76k243n356o155o390p968q807o995m749m191l398
57840E07621o22J887K198K507M731O618O235N910P726R297Q263O743P160P720
57826E83994O331M936N656O461N099L584M405N794N109L521L076K421k80l284
57812F36823m241m242m966m955k555M28J869L150O222R957J2969J6876K3050K9295
$$ y = [909235, 868535, 827489, 788339, 753912, 723417, 694568, 668104, 645838, 626319, 607028, 588961, 574458, 562373, 550036, 538123, 528947, 521665, 513848, 506118, 500561, 496197, 490604, 484489, 480033, 476257, 470581, 463531, 457454, 452139, 446194, 441089, 439119, 438855, 437316, 435224, 435459, 437793, 439926, 442409, 447626, 455050, 462295, 469737, 479307, 489816, 498442, 505893, 515146, 525868, 534984, 542074, 549256, 556252, 560527, 562061, 563197, 563873, 561630, 556274, 550119, 543729, 535761, 526954, 519959, 515210, 511019, 507621, 506999, 508886, 511084, 513591, 518322, 524940, 531175, 537085, 544811, 554108, 562371, 569114, 576274, 583994, 590325, 595261, 600917, 607378, 612477, 616061, 620466, 626260, 631369, 634890, 637966, 640387, 640107, 636823, 632582, 628340, 623374, 618419, 615864, 616292, 618161, 621311, 627533, 637490, 650459, 667335, 690385, 719680]
57798G19680L3515L7378M2587M6639M6150M1410L4038K3461R626l921j3794k0811
57786I95958k6698l0001k9201k6744k5741k5337k3365k0816j9725j9246j7769
57775G31315j6364j6385j6281j4434j2510j2374j2521j1235j0196j1148j2066
57764E85801j0750r139r775j0940r757p363o421o145m412k417k476l431k834j707
57750D98234k513m311m447l367l306l841l043j535j228j496o07N74K34o79j80
57735D68489R60J016J043K920N364N954N302N281M899K115j850m158m846n780
57721D86709o680o151n093n072m926k896m47M0m06N13J823J303K66J601M485N777
57705D70846N439N929P254P401O696P054P672O117L093J609J875J442p8p95n94
$$ y = [719680, 753195, 790573, 833160, 879799, 925949, 967359, 1001397, 1024858, 1034484, 1030563, 1016769, 995958, 969260, 939259, 910058, 883314, 857573, 832236, 808871, 788055, 768330, 749084, 731315, 714951, 698566, 682285, 667851, 655341, 642967, 630446, 619211, 609015, 597867, 585801, 575051, 565912, 556137, 545197, 535440, 528077, 521656, 515511, 511099, 508682, 506206, 502775, 499941, 498234, 495721, 491410, 486963, 483596, 480290, 476449, 473406, 471871, 470643, 469147, 468540, 469114, 469348, 468669, 468489, 469449, 470465, 471508, 474428, 479792, 485746, 491048, 496329, 501228, 503343, 501493, 497335, 492489, 486709, 480029, 473878, 468785, 463713, 458787, 455891, 455444, 455484, 455078, 455591, 457414, 458717, 458983, 460584, 465069, 470846, 476285, 482214, 489468, 496869, 503565, 510619, 518291, 524408, 527501, 529110, 530985, 532427, 532349, 531554, 530960]
57690E30960j125k143j983j223j766k797j917K49R68M54J505M346O457P590J0412
57675E49987J5810K1897K8147L6364M6936N8126O9513Q1900R2793R5764Q5846
57664A183083O3253L1818k975l4399n6955o9797p5607p6126p1531o3535n5263
57653G71966m7794m0022l2145k5968k1746j7996j4605j2780j1924j0036p394o335
57641E23221p142p562o783o375o824o570n215m466n117n948o228o554o861o300
57627D35276n388n517o285o026m894m555m978m684l900m200n140m705l156k817
57613C69031l955m388l452k822l008k647j653j537k083j322O43J356J38r67j033
57598C42301j397k304k112p54m00j609k336j767j657k643k822j414m49j256k299
$$ y = [530960, 529835, 527692, 525709, 524486, 522720, 519923, 518006, 518255, 519223, 519677, 521182, 525528, 531985, 539575, 549987, 565797, 587694, 615841, 652205, 699141, 757267, 826780, 908680, 1001473, 1097237, 1183083, 1246336, 1278154, 1275179, 1240780, 1183825, 1114028, 1038421, 962295, 890764, 827229, 771966, 724172, 684150, 652005, 626037, 604291, 586295, 571690, 558910, 546986, 536950, 529556, 523221, 516079, 508517, 501734, 495359, 488535, 481965, 476750, 472284, 467167, 461219, 454991, 448437, 441576, 435276, 429888, 424371, 418086, 412060, 407166, 402611, 397633, 392949, 389049, 384849, 379709, 375004, 371848, 369031, 365076, 360688, 357236, 354414, 351406, 348759, 347106, 345569, 343486, 342164, 342807, 344163, 344301, 343334, 342301, 340904, 338600, 336488, 335734, 335334, 333725, 331389, 329622, 327965, 325322, 322500, 321086, 320637, 319381, 317082]
57583C17082k135j580j515j311p65q50j373o45J359K319J285J65L22N45k67j144
57567C11492j206j161j395j127n63j176k768l055j368P7n7j69J128K607K860K556
57551C06675K657K731K527K980M217M815M255L864M241M143K960J807J074l72
57537C48574k496l402k621k274l559m800m454l361k552j558m11n10j876k219n23
57522C11958J108R00P4K25O87M23J52O31J077J022J434K374K085J04j292n88N93
57505C22967N38J51N23M76j058k645k778k454k955l306k423j610k272l130k415
57490B97609j050r18j592j461p06n91r24o53MK10K61P62J109O26L7J69M17J15
57472B93424k1N87R47L59N5J171K576K665J830J378J384J371J663K327K294J225
$$ y = [317082, 314947, 313367, 311852, 310541, 309776, 308926, 307553, 306908, 308267, 310586, 311871, 312036, 312358, 312903, 312636, 311492, 310286, 309125, 307730, 306603, 306040, 304864, 302096, 299041, 297673, 297750, 297693, 297524, 298652, 301259, 304119, 306675, 309332, 312063, 314590, 317570, 321787, 326602, 330857, 334721, 338962, 343105, 346065, 347872, 348946, 348574, 346078, 342676, 340055, 337781, 334222, 329422, 324968, 321607, 319055, 317497, 317086, 316576, 314700, 312481, 311958, 313066, 313966, 314040, 314265, 314952, 315375, 315527, 316158, 317235, 318257, 319691, 322065, 324150, 324254, 322962, 322374, 322967, 323505, 323656, 324179, 324655, 323597, 320952, 318174, 315720, 312765, 309459, 307036, 305426, 303154, 300024, 297609, 296559, 295641, 294049, 292588, 291882, 291291, 290367, 289714, 289718, 289928, 290189, 290951, 292060, 292686, 292723, 292892, 293309, 293424, 293403, 293990, 294937, 295296, 295351, 296522, 299098, 301763, 303593, 304971, 306355, 307726, 309389, 311716, 314010, 315235]
57456C15235O20J367J971R92m87q40m59l42L4J241K026J302L58Q41J933J969J301
57439C29062J145J017j20j338j039K29O70J39j26J31K71M00R66J424J177R44J472
57422C36424J968J500Q04R17J267J057J093K339L885M407M239M085L210J084p24
57407C67555p16l7m92j438j263m82n69r78k35J077J358J104J985L540L826K833
57391C77068K352K769K809K249K137K515K408K035K487L376L227K126J578J843
57377D10979J736J042P92J085R07K82M46J653K700K842K552K347K428L228M691
57362D39710N452M415K676K042K279J878R27Q35J578J631O89J63Q26J868K485
57347D69454K584J975N99n48m18L26K58n45r16q74j404k218j939m94O54Q07P34
$$ y = [315235, 315855, 317222, 319193, 320185, 319698, 318858, 318399, 318057, 318091, 319332, 321358, 322660, 323018, 323859, 325792, 327761, 329062, 330207, 331224, 331104, 329766, 328727, 328956, 329626, 329765, 329639, 329770, 330041, 330441, 331407, 332831, 334008, 334952, 336424, 338392, 339892, 340696, 341613, 342880, 343937, 345030, 347369, 351254, 355661, 359900, 363985, 367195, 368279, 367555, 366839, 366802, 366310, 364872, 363609, 363127, 362558, 361580, 361345, 362422, 363780, 364884, 366869, 370409, 374235, 377068, 379420, 382189, 384998, 387247, 389384, 391899, 394307, 396342, 398829, 402205, 405432, 407558, 409136, 410979, 412715, 413757, 414549, 415634, 416541, 416823, 417269, 418922, 421622, 424464, 427016, 429363, 431791, 435019, 439710, 445162, 449577, 452253, 454295, 456574, 458452, 459379, 460214, 461792, 463423, 464112, 464275, 465101, 466969, 469454, 472038, 474013, 474612, 474064, 473646, 473972, 474230, 473685, 472769, 471895, 470491, 468273, 466334, 465840, 466494, 467301, 468035]
57330D68035R94J209J169J158J168J090J295J894K014J224P78J751K952K714J788
57315D91233K115L425L664K409J379J548K168K652L269L796L507K681K322K484
57301E28652K463K421L039L916M158M115M671N368N158M512M641N244N170M730
57287E88258M994N438M763L536L438M297M485L914L941M601M700M471N286O766
57273F52888P039N994N460O042O457O262O373O732O204N124N170O379P022O765
57259G39911P062Q086Q222P217O867P780Q327P694P240P796Q348Q318Q686R714
57245H51268J0117R490R223R972J0589J0500J0844J2167J3260J3295J3034J3040
57233I86799J2783J2375J2949J4501J5498J5423J5528J6379J7008J7134J7757
$$ y = [468035, 469029, 470238, 471407, 472565, 473733, 474823, 476118, 478012, 480026, 481250, 482028, 483779, 486731, 489445, 491233, 493348, 496773, 500437, 502846, 504225, 505773, 507941, 510593, 513862, 517658, 521165, 523846, 526168, 528652, 531115, 533536, 536575, 540491, 544649, 548764, 553435, 558803, 563961, 568473, 573114, 578358, 583528, 588258, 593252, 598690, 603453, 606989, 610427, 614724, 619209, 623123, 627064, 631665, 636365, 640836, 646122, 652888, 659927, 665921, 671381, 677423, 683880, 690142, 696515, 703247, 709451, 714575, 719745, 726124, 733146, 739911, 746973, 755059, 763281, 770498, 777365, 785145, 793472, 801166, 808406, 816202, 824550, 832868, 841554, 851268, 861385, 870875, 880098, 890070, 900659, 911159, 922003, 934170, 947430, 960725, 973759, 986799, 999582, 1011957, 1024906, 1039407, 1054905, 1070328, 1085856, 1102235, 1119243, 1136377, 1154134]
57222A154134J8789J8701J7407J6928J8101J9230J9098J8798J9332J9892J9849
57211A360259K0062K0879K1115K0371K0102K1209K2620K3486K4500K5976K6951
57200A607530K7386K8807L1559L3773L4429L4890L6110L6805L6054L5225L5610
57189A978178L6340L6255L5758L5256L4037L2192L1508L2763L4276L4654L4826
57178B356043L5854L7064L7956L9616M2448M4790M5596M6315M8267N0353N1276
57167B835578N1831N3027N3923N3460N2599N2620N3015N2930N2921N3550N3993
57156C419447N3639N3398N3857N4018N3260N2557N2355N1394M9107M6910M5629
57145C985571M3996M1289L8968L8040L7398L6527L7065L9783M2767M4741M7430
$$ y = [1154134, 1172923, 1191624, 1209031, 1225959, 1244060, 1263290, 1282388, 1301186, 1320518, 1340410, 1360259, 1380321, 1401200, 1422315, 1442686, 1462788, 1483997, 1506617, 1530103, 1554603, 1580579, 1607530, 1634916, 1663723, 1695282, 1729055, 1763484, 1798374, 1834484, 1871289, 1907343, 1942568, 1978178, 2014518, 2050773, 2086531, 2121787, 2155824, 2188016, 2219524, 2252287, 2286563, 2321217, 2356043, 2391897, 2428961, 2466917, 2506533, 2548981, 2593771, 2639367, 2685682, 2733949, 2784302, 2835578, 2887409, 2940436, 2994359, 3047819, 3100418, 3153038, 3206053, 3258983, 3311904, 3365454, 3419447, 3473086, 3526484, 3580341, 3634359, 3687619, 3740176, 3792531, 3843925, 3893032, 3939942, 3985571, 4029567, 4070856, 4109824, 4147864, 4185262, 4221789, 4258854, 4298637, 4341404, 4386145, 4433575]
57134D433575N2330N7949O2672O7614P3902P9744Q3012Q4336Q4816Q3039P7636
57123E240625P0943O7321O9141P6334Q7828J01239J13447J23758J34634J47739
57113F233009J61886J76351J92780K11808K31486K51563K75888L08011L48231
57104H391013L97463M59842N38879O35854P55474R08491J105389J352624J658403
57095A6203432K035297K491588L025013L628596M294094N002817N721110O413280
57087D8815227P051968P609218Q048878Q336334Q434329Q262976P682319O570465
57079A10811714M952597L038824J110572o36243k148584l459324m607604n602683
57071A03459269o424139p034847p402394p521535p419579p142260o738214o252822
$$ y = [4433575, 4485905, 4543854, 4606526, 4674140, 4748042, 4827786, 4910798, 4995134, 5079950, 5162989, 5240625, 5311568, 5378889, 5448030, 5524364, 5612192, 5713431, 5826878, 5950636, 6085270, 6233009, 6394895, 6571246, 6764026, 6975834, 7207320, 7458883, 7734771, 8042782, 8391013, 8788476, 9248318, 9787197, 10423051, 11178525, 12087016, 13192405, 14545029, 16203432, 18238729, 20730317, 23755330, 27383926, 31678020, 36680837, 42401947, 48815227, 55867195, 63476413, 71525291, 79861625, 88295954, 96558930, 104241249, 110811714, 115764311, 118803135, 119913707, 119277464, 117128880, 113669556, 109061952, 103459269, 97035130, 90000283, 82597889, 75076354, 67656775, 60514515, 53776301, 47523479]
57063D7523479n724959n182491m642488m117308l618640l156287k736650k363164
57055A5981492k035843j750790j502848j288929j107117r53784q24330p15717
57047E802134o25620n49964m84161m26146l75753l31800k92312k56841k25943
57038B233594j98870j74088j51345j30972j11838r2291p2103n1091k7383r13K1590
57027A244290K9151J5981j3150m7175p6420r6186j06009j07771j03941r6370q6491
57016E55909p6082o6776n8836n1478m4450l8458l3996l0551k7200k3519j9895
57005H4668j7191j5866j5264j4270I305b334j1118j0249q471o596n442m533k994
56992e1737q47J494M194P508J1068a3669E322K4912L1655L6806L7520L1956K0501
$$ y = [47523479, 41798520, 36616029, 31973541, 27856233, 24237593, 21081306, 18344656, 15981492, 13945649, 12194859, 10692011, 9403082, 8295965, 7342181, 6517851, 5802134, 5176514, 4626550, 4142389, 3716243, 3340490, 3008690, 2716378, 2459537, 2233594, 2034724, 1860636, 1709291, 1578319, 1466481, 1374190, 1302087, 1250996, 1223613, 1222700, 1244290, 1273441, 1289422, 1276272, 1229097, 1152677, 1056491, 950482, 842711, 738770, 642400, 555909, 479827, 413051, 354215, 302737, 258287, 219829, 185833, 155282, 128082, 104563, 84668, 67477, 51611, 36347, 22077, 9305, -2334, -13452, -23701, -32172, -38768, -44210, -48743, -51737, -52584, -51090, -46896, -39388, -28320, -13669, 5322, 30234, 61889, 98695, 136215, 168171, 188672]
56979A88672O067p481j7748k4423k7889k8426k6791k4151A6809d75j3370j0118
56967b3963p320l974JL816P805a0296A0174K7782L5075M3667N2530N6546N0795
56954B76569L5515J5460m229k0236l0892l6126l7276l5713l2045k7178k2744j9352
56942F1753j5706j0647m975NM609J0064J6613K3725L1552M0813N1383O1357O6966
56929C37512O3563M8613K4887m96k1252l5500m4255m8508m9009m6974m3263l7874
56917A47444l1434k5930k2672k0732j8699A1189d635j5385j4439j2980j1522r832
56905f8793p505n060l264j977p29L99J311K497M200N950P650J0016J3108J5740
56891b6457i189I600K1529K5215K8965L2210L3725L1283K3883J3330K522o831
$$ y = [188672, 194739, 187258, 169510, 145087, 117198, 88772, 61981, 37830, 16809, -475, -13845, -23963, -31283, -35257, -35256, -31440, -23635, -10296, 10174, 37956, 73031, 116698, 169228, 225774, 276569, 312084, 327544, 323315, 303079, 272187, 236061, 198785, 163072, 131027, 103849, 81105, 61753, 46047, 35400, 30425, 30430, 35039, 45103, 61716, 85441, 116993, 157806, 209189, 270546, 337512, 401075, 449688, 474575, 474079, 452827, 417327, 373072, 324564, 275555, 228581, 185318, 147444, 116010, 90080, 67408, 46676, 27977, 11189, -4635, -20020, -34459, -47439, -58961, -68793, -76298, -81358, -84622, -86599, -87328, -86929, -85618, -83121, -78921, -72971, -65321, -55305, -42197, -26457, -9189, 9600, 31129, 56344, 85309, 117519, 151244, 182527, 206410, 219740, 222262, 215431]
56879B15431j4004j8401k0211k0581j9966j7591j3458r223n891k427K014O379
56867H2071R897J4117K0772K9202L7978M7631N9219P0921P8082P6322O3619M0975
56855F30806J3000j3319l2748m4604n0693n1966m8784m2761l5916k8720k0758
56844B73537j2504m635L386J2420K2239L2594M4525N9024P5621R3615J12355J27700
56832H39877J30386J12201P4250K6874j8329n4578p9583r3378r7666r5071q7781
56821F57202p7482o6132n5196m4530l3541k2987j3912n289N197J8205L2428M7217
56809D41180O3501Q1219R6683J03023R3700O7206K9612q463l8784n9365p1784
56798G97728p7151p6205p1064o4103n6028m7003l8464l1674k5630j8654j1058
$$ y = [215431, 201427, 183026, 162815, 142234, 122268, 104677, 91219, 81996, 76105, 73678, 75692, 82071, 91968, 106085, 126857, 156059, 194037, 241668, 300887, 371808, 449890, 526212, 589831, 630806, 643806, 630487, 597739, 553135, 502442, 450476, 401692, 358931, 323015, 294295, 273537, 261033, 256398, 259784, 272204, 294443, 327037, 371562, 430586, 506207, 599822, 712177, 839877, 970263, 1082464, 1156714, 1183588, 1165259, 1110681, 1031098, 937720, 840054, 744983, 657202, 579720, 513588, 458392, 413862, 380321, 357334, 343422, 338133, 343330, 361535, 393963, 441180, 504681, 585900, 682583, 785606, 879306, 946512, 976124, 967661, 928877, 869512, 797728, 720577, 644372, 573308, 509205, 453177, 406174, 367710, 336036, 310406, 291752, 280694]
56787B80694m066K779J0801J9755K8661L7828M7170N3179N0776L8467J9583j109
56775E84518j9869l3852m1755m4979m5965m5257m1981l6728l1581k7438k3601
56764A91512j9935j7215j5359j3461j1546j0389r759q859q146q583r433r026p449
56751D2352o256n759m912l722l260l380k810j604j162j652j736j029o29r60j147
56736B334q18n29l04L66J085R88N39Q79J624J460O50P04J658K087J777K005L006
56719A9511L553L246L010L100K781K172K247K847K823K223K230K887L009K420
56705E8059K069K001J384M18L8r4q85j439p6K492L817L489L383M060M101L319
56689H6136L500N180O672P107P657Q912R687R323Q689Q077O568M282K715K139
$$ y = [280694, 276628, 279407, 290208, 309963, 338624, 376452, 423622, 476801, 527577, 566044, 585627, 584518, 564649, 530797, 489042, 444063, 398098, 352841, 310860, 274132, 242551, 215113, 191512, 171577, 154362, 139003, 125542, 113996, 103607, 93848, 84989, 76843, 68260, 58827, 49801, 42352, 36096, 30337, 25425, 21703, 18443, 15063, 12253, 10649, 9487, 7835, 6099, 5070, 4441, 3481, 2334, 1516, 987, 683, 1049, 2134, 3122, 3661, 4540, 6164, 7624, 8274, 8978, 10636, 12723, 14500, 16505, 19511, 23064, 26310, 29320, 32420, 35201, 37373, 39620, 42467, 45290, 47513, 49743, 52630, 55639, 58059, 60128, 62129, 63513, 63931, 63969, 63875, 62990, 61551, 61475, 63967, 67784, 71273, 74656, 78716, 82817, 86136, 89636, 94816, 101488, 108595, 116252, 125164, 134851, 144174, 152863, 160940, 167508, 171790, 174505, 176644]
56675A76644J236j4J74K133L678L483K908L282L801L475K915K870K889K617K604
56660B14695K946K855K262J947J739O38q35r30K50M65j249l396m899o400p972
56645B02116q325p374o836p218o841n018l487l376l434k653k165k936l932m026
56631A34495l606k986j521M89J344P48P47K537M615N494N879O591O648N029K461
56616A68964j6k283l894l683j911o49q10j002m24l80j590k565k270j969k741l434
56600A39343k876j924j590j180k7Q82P32M60J006J764K148K783L837M153L325
56585A52836K695L004L174K547K127K421K362J597J402K142K316J436J193K380
56571A83632L430L456L896N462O401N714N230O394P751P745P320P532P218N367
$$ y = [176644, 177880, 177866, 178040, 180173, 183851, 187334, 190242, 193524, 197325, 200800, 203715, 206585, 209474, 212091, 214695, 217641, 220496, 222758, 224705, 226444, 227082, 226247, 225317, 225567, 226032, 224783, 221387, 216488, 210088, 202116, 193791, 186417, 179581, 172363, 165522, 160504, 157017, 153641, 150207, 147554, 145389, 142453, 138521, 134495, 130889, 127903, 126382, 126871, 128215, 128963, 129710, 132247, 136862, 142356, 148235, 154826, 161474, 166503, 168964, 168948, 166665, 162771, 159088, 157177, 156528, 155718, 154716, 154292, 153912, 152322, 149757, 147487, 145518, 142777, 139343, 136467, 134543, 132953, 131773, 131746, 132628, 133360, 133820, 134826, 136590, 138738, 141521, 145358, 149511, 152836, 155531, 158535, 161709, 164256, 166383, 168804, 171166, 172763, 174165, 176307, 178623, 180059, 181252, 183632, 187062, 190518, 194414, 199876, 206277, 211991, 217221, 223615, 231366, 239111, 246431, 253963, 261181, 266548]
56557B66548L308K216R20j474l276l029k178k559l430l491l538m634n818o063
56543B33502o437p877r080q947q840r878j0461r113p449p459q049p215n643n108
56529A21946n142m287k973k395k036j011k35p20j303o14L67J55n88o53o40j288
56513I8583j431j81P86j32j551j514q51j283k070j572m45l31r20j062j248k248
56497H2530k894j951n78l09l73M26J056K25q81o95j68p89j529p63O79J264J593
56480G6843K563K794J052p85m91P59P14J27Q79J993J306l97o72M04R48Q39J179
56463I0055J411M56n44J04J416J340K95n5j12j146k270j942j010j037j132K15
56447H6044J825J799J130J771K782K116N84L22P89J96o98j01R82M76o48k8J640
$$ y = [266548, 269856, 272072, 272992, 271518, 268242, 265213, 263035, 260476, 257046, 253555, 250017, 245383, 239565, 233502, 227065, 219188, 210108, 201161, 192321, 182443, 171982, 162869, 155420, 147961, 139912, 132697, 127054, 121946, 116804, 112517, 109544, 107149, 105113, 104102, 103867, 103147, 101844, 101230, 101597, 101752, 101164, 100511, 99871, 98583, 97152, 96971, 97757, 97625, 96074, 94560, 93709, 92426, 90356, 88784, 88339, 88008, 87088, 86026, 84778, 82530, 79636, 77685, 77107, 76798, 76425, 76851, 77907, 78132, 77251, 76556, 76388, 75599, 74070, 73307, 73986, 75250, 76843, 79406, 82200, 83252, 82467, 81976, 82735, 83449, 83576, 84455, 86448, 87754, 87357, 86685, 87089, 88037, 88876, 90055, 91466, 91922, 91378, 91482, 92898, 94238, 94533, 94478, 94366, 93220, 90950, 89008, 87998, 86961, 85829, 86044, 87869, 89668, 90798, 92569, 95351, 97467, 98051, 98373, 99162, 99358, 98660, 98559, 99541, 100017, 99369, 99341, 100981]
56430A00981J860Q44O49J081N07m18j4P28j64j499p50J096R49j092k204j719j242
56413I9593q13P02K206J674J20J28J312J426Q99J723K998K242K89R8J402J363
56397A17362o6l10P96J014L41Q11K024J665J73R9J117O53q10k03K377L501K264
56380A32808J307J656J435K34j6Q90R52O1J91J177P63r05j288k46k30j463j487
56363A35839P5Q76L79O23J957K410J688J548K037J555O81J491L173K917J037M50
56347A58736J278R72l04K33K424L057J688J255K443K777J832J906K934K159l35
56332A83055j230J06O45m85o72P91J408O51R91K645K746Q81J20J299J709O15O97
56315A95972K596L571K865L012M436M334K407K090M421O201N914O030P586Q097
$$ y = [100981, 102841, 103685, 104334, 105415, 105922, 105504, 105490, 106218, 106054, 104555, 103805, 104901, 105850, 104758, 102554, 100835, 99593, 98780, 99482, 101688, 103362, 103482, 103610, 104922, 106348, 107247, 108970, 111968, 114210, 114499, 114597, 115999, 117362, 117296, 116986, 117782, 118796, 119137, 119948, 121972, 123637, 123810, 123909, 125026, 125679, 124869, 124666, 127043, 130544, 132808, 134115, 135771, 137206, 137440, 137424, 138314, 139266, 139327, 139518, 140695, 141458, 140553, 139265, 139019, 138789, 137326, 135839, 135914, 136790, 137169, 137792, 139749, 142159, 143847, 145395, 147432, 148987, 149668, 151159, 154332, 157249, 158286, 158736, 160014, 160986, 160682, 160915, 163339, 166396, 168084, 169339, 171782, 174559, 176391, 178297, 181231, 183390, 183055, 181825, 181931, 182576, 182091, 181419, 182210, 183618, 184269, 185260, 187905, 190651, 191532, 191652, 192951, 194660, 195275, 195972, 198568, 202139, 205004, 208016, 212452, 216786, 219193, 221283, 225704, 231905, 237819, 243849, 251435, 259532]
56301B59532O652N770O268N611L245K161L351M002K979K719L840L509J112L2J670
56286C12453L143K865L033M531M932L654L557N364O064M895N193Q102J0291J0138
56272C88215J0426J2505J3738J3153J3836J7091J9961K1059K3109K7217L0595
56261E90905L2498L6413M3500M9976N3880N8346O5214P1473P5204P9026Q4443
56250A240878Q8599Q9830R0607R1893R0527Q5264P9321P3928O5596N2994M0071
56239B089508K9059J6896K170j1073k0296k8797l9001m7929n3347n8118o4126
56228A814946o8241o8581o8573p0455p0998o8054o5130o4938o4543o1438n8340
56217A085655n7379n5666n1155m6883m4913m2226l7100l3063l2090l0364k5512
$$ y = [259532, 266184, 271954, 278222, 283833, 287078, 289239, 292590, 296592, 299571, 302290, 306130, 309639, 310751, 310783, 312453, 315596, 318461, 321494, 326025, 330957, 334611, 338168, 343532, 349596, 354491, 359684, 367786, 378077, 388215, 398641, 411146, 424884, 438037, 451873, 468964, 488925, 509984, 533093, 560310, 590905, 623403, 659816, 703316, 753292, 807172, 865518, 930732, 1002205, 1077409, 1156435, 1240878, 1329477, 1419307, 1509914, 1601807, 1692334, 1777598, 1856919, 1930847, 1996443, 2049437, 2089508, 2118567, 2135463, 2137633, 2126560, 2106264, 2077467, 2038466, 1990537, 1937190, 1879072, 1814946, 1746705, 1678124, 1609551, 1539096, 1468098, 1400044, 1334914, 1269976, 1205433, 1143995, 1085655, 1028276, 972610, 921455, 874572, 829659, 787433, 750333, 717270, 685180, 654816, 629304]
56206F29304k1326k0429j9107j4646j0915j1090j1553q772n757n785o148l964
56194D89812k063l092l924j713M90j36p10J122J942o82k759j116N54j144k856
56179D73725j370p0k018l426q12K048J207n1K087M476L367J783L413N496M925
56164D94780M881Q279J1241J0434J0070J4041J8006J7196J5302J7463K1106K2084
56152F64883K3350K8980L5973M0499M6063N6979P0000Q0809R2360J07980J22650
56141A370526J29891J31108J29560J22049J05830Q7244P3938O4729N5874N0191
56131B320940N0110M8815L8956K4115J1763J366j0470k0005k2705k3584l0479
56120B388822m2558n5394p0833r1178j10086j20311j24390j27361j25799j15199
$$ y = [629304, 607978, 587549, 568442, 553796, 542881, 531791, 520238, 511466, 505709, 499924, 493776, 489812, 487749, 484657, 480733, 479020, 479510, 479374, 478664, 479786, 481728, 481046, 478287, 477171, 477725, 476581, 473725, 472355, 472285, 470267, 466841, 466029, 468077, 469284, 469233, 471320, 475796, 479163, 480946, 484359, 489855, 494780, 499661, 507940, 519181, 529615, 539685, 553726, 571732, 588928, 604230, 621693, 642799, 664883, 688233, 717213, 753186, 793685, 839748, 896727, 966727, 1047536, 1139896, 1247876, 1370526, 1500417, 1631525, 1761085, 1883134, 1988964, 2076208, 2150146, 2214875, 2270749, 2320940, 2371050, 2419865, 2458821, 2482936, 2494699, 2496065, 2485595, 2465590, 2442885, 2419301, 2388822, 2346264, 2290870, 2220037, 2128859, 2018773, 1898462, 1774072, 1646711, 1520912, 1405713]
56110A405713j01058r0833q1681o8049n4329m7475m3766l5857k6482k2338k0675
56099H13170j5237r233q930j0468o620p67l73k483L66N544N791L573N796R800
56085G89929Q853O075Q531J3002J2034Q490R523J2016Q903L889M664P573M653
56072H98135l29J077N303L636m72J973P701P438M048O688J2491J2158Q337J0144
56058I78328J4886J3652R558J1709J6631J4838J0072J2370J7889J6007J0531J2825
56046A139296J9563J8954J3676J5377K1546K0578J5029J6679K3108K2533J7495
56035A343834J9933K7239K7318K2892K6059L3389L1930K5329K7702L6084L5998
56024A657707L0079L3239M3385M5527M1224M4826N4047N4164M8012N1202O0986
$$ y = [1405713, 1304655, 1213822, 1132141, 1064092, 1009763, 962288, 918522, 882665, 856183, 833845, 813170, 797933, 788700, 779770, 769302, 762682, 761915, 761542, 759059, 759425, 764969, 770760, 774333, 780129, 789929, 798782, 804857, 813388, 826390, 838424, 846914, 856437, 868453, 877356, 881245, 885909, 893482, 898135, 897806, 898883, 904186, 907822, 907350, 909323, 917024, 924462, 928510, 935198, 947689, 959847, 968184, 978328, 993214, 1006866, 1016424, 1028133, 1044764, 1059602, 1069674, 1082044, 1099933, 1115940, 1126471, 1139296, 1158859, 1177813, 1191489, 1206866, 1228412, 1248990, 1264019, 1280698, 1303806, 1326339, 1343834, 1363767, 1391006, 1418324, 1441216, 1467275, 1500664, 1532594, 1557923, 1585625, 1621709, 1657707, 1687786, 1721025, 1764410, 1809937, 1851161, 1895987, 1950034, 2004198, 2052210, 2103412, 2164398]
56013B164398O1229N4867N8994P1069P3441O8211P3095Q5734Q7848Q1948Q7047
56002B967881J00688J03364R7968J05143J21964J26531J21388J29447J48749J55927
55992D179050J53003J64062J86768J95884J94113K08642K37542K52860K56899
55983F028823K79441L18496L42657L53479L83658M31519M63008M81242N24645
55974I606968N92474O45942O87572P60832Q65805R59591J046850J179297J357911
55965A7703242J534356J718593J978059K320610K698324L140541L751253M561555
55957C9406533N538245O759689Q411275J0584409J3282416J6647595K0929322
55950A21559484K6201710L2430086L9734195M7755405N4194441N4707751M5651526
$$ y = [2164398, 2225627, 2280494, 2339488, 2410557, 2483998, 2552209, 2625304, 2711038, 2798886, 2880834, 2967881, 3068569, 3171933, 3269901, 3375044, 3497008, 3623539, 3744927, 3874374, 4023123, 4179050, 4332053, 4496115, 4682883, 4878767, 5072880, 5281522, 5519064, 5771924, 6028823, 6308264, 6626760, 6969417, 7322896, 7706554, 8138073, 8601081, 9082323, 9606968, 10199442, 10845384, 11532956, 12293788, 13159593, 14119184, 15166034, 16345331, 17703242, 19237598, 20956191, 22934250, 25254860, 27953184, 31093725, 34844978, 39406533, 44944778, 51704467, 60115742, 70700151, 83982567, 100630162, 121559484, 147761194, 180191280, 219925475, 267680880, 321875321, 376583072, 422234598]
55943D22234598K7515996N246308j5121684l0010023l8923018m2829914m2855749
55936B85256514m0143357l5914592l1167041k6480478k2189249j8520963j5516179
55929I5324655j3036298j0957971r254019p874806o705323n682440m831341m150799
55921C2831658l571131l053548k627182k297714k012595j744640j523989j360494
55913A4640365j213387j062979r38649q51605p68500o74584n98344n51459n04888
55904G475970m45551l99299l77101l52908l14547k85006k74143k58642k28402
55895D540371k05780k00678j91451j67981j50449j48284j41870j21889j07011
55886C104978j06196j01924q6798p9346q7424r1940q2876p6750q2722q5046p4916
$$ y = [422234598, 449750594, 454996902, 439875218, 409865195, 370942177, 328112263, 285256514, 245113157, 209198565, 178031524, 151551046, 129361797, 110840834, 95324655, 82288357, 71330386, 62076367, 54201561, 47496238, 41813798, 36982457, 32831658, 29260527, 26206979, 23579797, 21282083, 19269488, 17524848, 16000859, 14640365, 13426978, 12363999, 11425350, 10573745, 9805245, 9130661, 8532317, 7980858, 7475970, 7030419, 6631120, 6254019, 5901111, 5586564, 5301558, 5027415, 4768773, 4540371, 4334591, 4133913, 3942462, 3774481, 3624032, 3475748, 3333878, 3211989, 3104978, 2998782, 2896858, 2810060, 2730714, 2643290, 2551350, 2468474, 2391724, 2309002, 2223956, 2149040]
55875B149040o7236p0138o9014n6117m5859m5826m2100k8321k0586k8343l7783
55864A637717l8763m1481n2048n7771n1607m6290m9682n0138m0343l2079l3316
55853A144199l3553k5681k0159k3855k6435k1194j8339k4309k8479k3566j9252
55842H79377k2679k4942j9600j5465j8518j9829j3742r578j3167j5041q960m118
55830F93738o769p750n66N697M002K670Q464J3150R684N762Q430J0699O146J710
55816G55067L446M127k443q920q456p469j2387j7096j5594j3901j7606k0359j6510
55803F21899j2574j4547j6177j1404o340p412r398o525l832o191p496k115L922
55790E21810M176L370O900R637O255K278L951P182P082Q442J6252K5687L1644
$$ y = [2149040, 2081804, 2011666, 1942652, 1886535, 1840676, 1794850, 1752750, 1724429, 1703843, 1675500, 1637717, 1598954, 1557473, 1505425, 1447654, 1396047, 1349757, 1300075, 1249937, 1209594, 1177515, 1144199, 1110646, 1084965, 1064806, 1040951, 1014516, 993322, 974983, 950674, 922195, 898629, 879377, 856698, 831756, 812156, 796691, 778173, 758344, 744602, 735024, 721857, 706816, 697856, 693738, 686969, 679219, 678653, 684350, 688352, 691022, 699486, 712636, 722320, 728082, 736512, 747211, 753357, 755067, 758513, 762640, 760197, 751277, 742821, 735352, 722965, 705869, 690275, 676374, 658768, 638409, 621899, 609325, 594778, 578601, 567197, 560857, 553445, 544047, 537522, 533690, 527499, 520003, 517888, 521810, 525986, 529356, 536256, 545893, 552148, 554426, 558377, 565559, 572641, 581083, 597335, 623022, 654666]
55777F54666L8141M7781N1984M2700K4723O530j1533k9918m1232m0220l3563k9122
55765F80937k4120j4043l944l3J312N237P564K906m366p981j0794j7570k4422
55752E90683k5943k5533k8231l0471k7219k2299k1438k1792j8350j4060j3714
55741C41633j4278j1209p892r081j1214q916m986m492n060k485J88j397l903k527
55727B54381l12k004m574l150n62j615l586j690J537J502O91L303O262M773J540
55712B56496J400K023r12m574m143k002k706l943j609J288N3k355q11K092J084
55697B41381j543l32L016L261J525K269M197L375J626K831M582K521p11J52L350
55682B71500L694K261L475O030N683L844M593O244M703J972K588M684L390J24
$$ y = [654666, 692807, 740588, 792572, 835272, 859995, 866525, 854992, 825074, 783842, 743622, 710059, 680937, 656817, 642774, 638830, 638797, 640109, 645346, 652910, 655816, 651450, 643469, 632675, 615105, 590683, 564740, 539207, 510976, 480505, 453286, 430987, 409549, 387757, 369407, 355347, 341633, 327355, 316146, 308254, 299173, 287959, 279043, 274057, 269565, 264505, 262020, 262208, 260811, 256908, 254381, 254069, 252065, 247491, 244341, 243779, 242164, 238578, 236888, 238425, 239927, 240618, 243921, 250183, 254956, 256496, 257896, 259919, 259007, 254433, 250290, 248288, 245582, 241639, 240030, 241318, 241371, 239016, 238205, 240297, 241381, 239838, 239506, 242522, 245783, 247308, 249577, 253774, 257149, 258775, 261606, 266188, 268709, 267998, 268150, 271500, 275194, 277455, 280930, 286960, 292643, 296487, 301080, 307324, 312027, 313999, 316587, 321271, 324661, 324785]
55668C24785l94O02j493n463o586n607o704q953q413o402p097r109p944m665l743
55653B42814m377k423J101J932J093L122P422R628J0008J2388J6264J8018J8521
55640C35511K1522K5851K6954K4805K2735K0080J3806N812P81j906o347j1741
55628D77863j3690j2508j2227j2527r564l933lJ916N118R027R794P677O413N735
55614D59091J855n059j0991j5120j9804k4236k5142k3313k2590k2939k1161j7708
55602B52883j5959j5610j3539j0406r565j0285q949o074n248o042n058l011l498
55589A39639n548m841j740p07k072j876L40R88k63O8K288L010J895K149M061M668
55573A42059L948M808O817O560M231L336L914K626m44j746r65j156k321j550N80
$$ y = [324785, 324391, 324993, 323500, 318037, 311451, 305844, 299140, 290187, 281774, 275372, 268275, 259166, 251222, 246557, 242814, 238437, 236014, 237115, 239047, 240140, 243262, 250684, 260312, 270320, 282708, 298972, 316990, 335511, 357033, 382884, 409838, 434643, 457378, 477458, 491264, 497076, 497857, 495951, 489604, 477863, 464173, 451665, 439438, 426911, 417347, 413414, 413411, 415327, 420445, 429472, 439266, 446943, 453356, 459091, 460946, 455887, 444896, 429776, 409972, 385736, 360594, 337281, 314691, 291752, 270591, 252883, 236924, 221314, 207775, 197369, 187804, 177519, 168570, 162496, 157248, 151206, 146148, 143137, 139639, 134091, 129250, 127510, 126803, 124731, 122855, 123195, 124183, 123920, 123988, 126276, 129286, 131181, 133330, 137391, 142059, 146007, 150815, 157632, 164192, 168423, 171759, 175673, 178299, 177855, 176109, 175144, 173988, 171667, 170117, 170697]
55558A70697N41j251j019J005Q59j483j875K88J265L14O09K287J793r84k045o75
55542A70326n70k611l514k672l372n935o537m339l023l854l798k027j631l267
55528A23176l596j718q40j964k142o10k90j660j457Q66J719J13n11J091J831O81
55512A14689Q12L250M621L484K913M546N890N790O768R667J1621J1613J2523J5432
55498B13619J7525J7739J8742K1105K1233J7629J3589J1075P439Q51o206j1582
55486C42758j6460k1203k3305k2022k0270j9547j7780j4315j1949j1747j0987
55475A53173q524p025p563p230m628k634l019l418k256j650k741l072j439m63
55461I7511j631k446j273k80r11j152Q2N98m68n05J431K255M28j032p3Q40k71
$$ y = [170697, 171238, 169987, 168968, 169973, 170832, 169349, 167474, 167762, 169027, 169341, 169950, 172237, 174030, 173046, 171001, 170326, 169756, 167145, 163631, 160959, 157587, 151652, 145115, 140776, 137753, 133899, 130101, 128074, 126443, 123176, 119580, 117862, 117022, 115058, 112916, 112306, 112016, 110356, 108899, 109765, 111484, 111597, 111086, 112177, 114008, 114689, 115501, 118751, 123372, 126856, 129769, 134315, 140205, 145995, 152763, 162430, 174051, 185664, 198187, 213619, 231144, 248883, 267625, 288730, 309963, 327592, 341181, 352256, 359695, 360546, 354340, 342758, 326298, 305095, 281790, 259768, 239498, 219951, 202171, 187856, 175907, 164160, 153173, 144649, 137624, 130061, 122831, 118203, 115569, 112550, 109132, 106876, 105226, 102485, 99413, 97974, 97511, 95880, 93434, 92161, 91881, 90970, 89818, 89900, 90498, 90030, 89525, 90956, 93211, 93639, 92607, 92534, 93374, 93103]
55444I3103j174p1Q12k86j078K81J515N64m54O85K243K018J269J689K035J007
55428A04158R9N08N91p19j466m15M26l22o85O94J680O44m15K84J062K54o46k85
55410A05447k39j652k625j851j260k253k964j976j130j774k056p75k8j139j872
55395H1853p21J2j356k387r59P49K91p15l1R49J74j071q77l80j107j638l88J089
55377G3487R75M89J151J619M91o71k42M14j84p10Q2O07l58r53K44J202P2j381
55359G6334j168o25j293j585j4J496R74o6K26N66l69q00O32J605J42j411m12J354
55341G5586J027k78p2P74K92l49P04J772L56k077k407j003m15p10j68R56J167
55324G5155P63P71M94q33j777j133m01r36j155L03J421K26j368q87K77l55j780
$$ y = [93103, 91929, 91858, 92670, 92384, 91306, 91587, 93102, 93666, 93212, 93897, 96140, 98158, 99427, 101116, 103151, 104158, 104257, 104765, 105356, 104637, 103171, 102756, 103182, 102860, 102175, 102869, 104549, 105193, 104778, 105062, 106124, 106378, 105732, 105447, 105208, 103556, 100931, 99080, 97820, 95567, 92603, 90627, 89497, 87723, 85667, 84892, 84864, 83725, 81853, 81132, 81144, 79788, 77401, 76442, 77191, 77482, 76767, 76736, 77685, 77859, 76788, 75911, 75531, 74424, 72786, 72398, 73487, 74462, 74951, 76102, 77721, 78212, 77541, 77299, 77713, 77529, 76819, 76901, 77508, 77150, 76197, 76441, 77643, 77715, 76334, 75166, 74541, 73248, 71663, 71649, 73145, 74119, 74053, 74279, 74845, 74476, 73676, 74308, 75913, 76055, 74644, 74232, 75586, 76613, 76335, 76263, 77037, 77329, 76980, 77684, 79456, 79812, 77735, 75328, 74325, 73910, 73200, 73032, 73988, 75155, 75918, 76689, 77183, 76350, 74573, 73440, 73039, 72103, 70948, 71251, 72672, 72898, 71530, 70643, 70920, 70565, 68785]
55307F8785j719r73j386j824l90J489J421M72J041K225J606j31n54J19L1m38K26
55290G0000J211Q80J86Q38J704P83q74j016k11l10o59K37J160K67j037l91J075
55273G3843P87m96k34J096J113J04Q7N77l79k042k048p03m6J75J489K817J894
55256G8034l42j037k32k24r95n86P15P52m19q38m89q87j507o47P58K48j713k354
55238F8237j224l23j12O49J488O70j129j503l86J02l57j76O22N24j13M64J825
55221F9258J903Q99R40J982J813Q1j173j119q70p29O4R38O07k51J2Q12L56p98
55203G4725o56L61J77r27q43K83L61n34k94J104J516O42L07P28K36j094j311k45
55185G4536K17k31qR16Q31k66n68K2k31j314j319q5M71m2p2N64M46k19K68J543
$$ y = [68785, 67066, 66093, 64707, 62883, 62493, 63982, 65403, 65875, 66916, 69141, 70747, 70616, 70062, 70181, 70212, 69774, 70000, 71211, 72091, 72277, 73115, 74819, 75602, 74728, 73712, 73501, 73191, 72532, 72769, 73929, 74196, 73159, 72768, 73843, 74630, 74134, 73900, 74996, 76109, 76213, 76300, 76877, 76498, 74456, 72408, 71705, 71659, 71834, 73323, 76140, 78034, 77692, 76655, 76423, 76199, 75204, 74618, 75333, 76085, 75666, 74828, 74339, 73452, 71945, 71298, 72056, 72304, 70591, 68237, 67013, 66690, 66578, 67227, 68715, 69385, 68256, 66753, 66367, 66469, 66112, 65936, 66558, 67082, 66969, 67433, 69258, 71161, 72060, 73000, 74982, 76795, 76876, 75703, 74584, 73714, 72985, 73049, 73987, 74594, 74343, 74355, 75167, 75523, 74725, 74069, 74430, 74607, 73680, 72837, 73120, 73481, 72947, 72653, 73757, 75273, 75915, 76222, 76950, 77186, 76092, 74781, 74536, 74753, 74522, 74514, 75430, 76261, 75995, 75427, 75449, 75218, 73904, 72585, 72500, 72971, 72929, 72857, 73421, 73867, 73648, 73916, 75459]
55165G5459J414l2l31R72J567O10q7K64K03o89q56p7k09j606k128q16N18N35K02
55146G4913M17N57L64O16J120O17p05j147m24pk76r8N36L62m02k14P57P34k59
55127G7461l52N88P47L2L59J753J841Q8j058l63L38k43p21PP36L84j69r8L6M6
55107H1412P98K099K333J126L2j46k78o84m77K59K91k79K1J095J196J33k71N25
55089H9185R76N27M19Q46M36p37p68N78J148P1r40r02j080k040k283j049K56O92
55071H5335J122J919K021J283J063J517J022p62j958j522n82LP03J254N45q12
55055I2151p64N66Q05m46p44Q92K222J689O39K56m14j851k606k027j531j747j353
55038H5737j02J82j017j613n90K71j93n56L8J02j003j294L17J805J441N69P66
$$ y = [75459, 76873, 76841, 76510, 77482, 79049, 79659, 79572, 79836, 80039, 79350, 78494, 78417, 78208, 76602, 74474, 73658, 74176, 74711, 74913, 75330, 75887, 76251, 76867, 77987, 78604, 77899, 76752, 76328, 76321, 76045, 75947, 76483, 76845, 76443, 76229, 76986, 77720, 77461, 77109, 77697, 78444, 78476, 78835, 80588, 82429, 82517, 81459, 81096, 81434, 81191, 80470, 80477, 81213, 81597, 81428, 81330, 81366, 81412, 82210, 84309, 86642, 87768, 87800, 87654, 87376, 86692, 86215, 86474, 86765, 86486, 86507, 87602, 88798, 88931, 88660, 89185, 90161, 90688, 91107, 91953, 92389, 91652, 90884, 91462, 92610, 92681, 91741, 90839, 89759, 87719, 85436, 84387, 84643, 85335, 86457, 88376, 90397, 91680, 92743, 94260, 95282, 94520, 92562, 91040, 90458, 90461, 91164, 92418, 92963, 92151, 91387, 91953, 92758, 92312, 91568, 92460, 94682, 96371, 97010, 97266, 96852, 95001, 92395, 90368, 88837, 87090, 85737, 85635, 85817, 84800, 83187, 82597, 82868, 82675, 82119, 82157, 82259, 81256, 79962, 80279, 82084, 83525, 84094, 84860]
55021H4860J109M70r5M84J173R56P21J106R15l93j147l33N20J89j6J031J932J329
55003I4811M10O15J013K26j064j610j691j852j534o53m30j108j017M69J538J072
54987H9195N90J309J944J363P35J012Q91m63j300k90R26N92j80K38R80O21j9L81
54969I8525J097R85P26J057Q08q42k185j531j09J43k13L56J374J443Q64O82O02
54952A03782K5k01P58K006K514K824L425L399K594K976N560Q185Q677Q181Q749
54937A63454R709R202P553O220M852K212j125l662n384p025q126p972p267o859
54923A55782o185m867m173m828n257m173k978l225l652k424n33o8o39m56M03O21
54907A13348L63P22J455J757K191L468M574M463M270N462P198P988Q448R657J0302
$$ y = [84860, 85969, 86439, 86344, 86828, 88001, 88957, 89678, 90784, 91699, 91306, 90159, 89826, 90346, 90535, 90519, 91550, 93482, 94811, 95221, 95836, 96849, 97075, 96011, 94401, 92710, 90858, 89324, 88671, 88241, 87133, 86116, 86585, 88123, 89195, 89785, 91094, 93038, 94401, 95136, 96148, 97039, 96576, 95276, 94986, 95912, 96504, 96324, 96562, 97542, 98163, 98144, 98525, 99622, 100607, 101333, 102390, 103198, 102356, 100171, 98640, 98531, 98674, 98461, 98817, 100191, 101634, 102498, 103180, 103782, 103807, 103606, 104364, 106370, 108884, 111708, 115133, 118532, 121126, 124102, 129662, 137847, 146524, 154705, 163454, 173163, 182365, 189918, 196138, 200990, 203202, 202077, 198415, 193031, 186006, 177880, 169908, 162641, 155782, 149597, 144730, 140557, 135729, 130472, 126299, 123321, 120096, 116444, 114020, 113487, 113419, 112780, 112324, 112727, 113348, 113711, 114433, 115888, 117645, 119836, 123304, 127878, 132341, 136611, 142073, 149271, 157259, 165707, 175364, 185666]
54892A85666Q492N237L094K281J016j179l274n107p165q665q487p421p071p210
54878A50207o583n453m986m887m116l182l213l583k920j746j667k547k893k425
54864A00006j905j186K95J707J862J315J312J411M89q19j071o15p89j306q88J08
54848I9926K45m51q17q84j513k297k139j413j288j517j067k86j95l55L04J191
54832H7444R62mk83R5Q7j19L91J146J027M32N00R07O72L15Q85J680J392O32Q03
54813I8964J356Q51r5K01J283J195r5p90l92%J45P71J479J248O87J177K123J777
54795A11885N09M11J779K811K834L127M331N584O426P301Q039P969P489P394P048
54780A84937N386L262K264J719l70l718n967o426o728p601p807o730n407m512
$$ y = [185666, 194158, 199395, 202489, 204770, 205786, 204607, 201333, 196226, 189061, 180396, 171909, 164488, 157417, 150207, 143624, 138171, 133185, 128298, 124182, 121000, 117787, 114204, 111284, 109538, 107871, 105324, 102431, 100006, 98101, 96915, 97210, 98917, 100779, 102094, 103406, 104817, 105306, 104487, 103416, 102801, 102012, 100706, 99818, 99926, 100171, 99720, 98903, 98019, 96506, 94209, 92070, 90657, 89369, 87852, 86785, 86499, 86304, 85949, 86253, 87444, 88406, 88402, 88119, 88214, 88301, 88182, 88573, 89719, 90746, 91178, 91678, 92585, 93257, 93572, 94457, 96137, 97529, 98161, 98964, 100320, 101171, 101076, 101277, 102560, 103755, 103660, 102870, 102478, 102478, 102623, 103394, 104873, 106121, 106808, 107985, 110108, 111885, 112394, 112805, 114584, 117395, 120229, 123356, 127687, 133271, 139697, 146998, 155037, 163006, 170495, 177889, 184937, 190323, 193585, 195849, 197568, 197198, 193480, 187513, 181087, 174359, 166758, 158951, 152221, 146814, 142302]
54766A42302l565k537k104k076j625j095j497k314k026o85K43L83N36N74k20j036
54750A23258m43Q49R02J09Q95L701O248P190P600Q336Q684Q331Q055P703N957
54735A97375K814Nj726l523n875p569p857p578p376o737n566m807m857m989m773
54720A26961m515m100l048j796j200r85m17q7r39k039j696m02m1n85l84M45Q3
54703A05255j445j912n93O77P27N04O50M08k86k27P15J122N73K37M57K22m76m38
54685A06170Q5n74k239k612j088J52j32m24L86R61J92p15n08R9J81K15N31L06
54667A00986o06r29l02j93j239j880j049j0n0m02k2N25N13N89J260J547O78m03
54649I9013n82l03m46q59j053j106r68k20P68R05J52l09j12r5k97K96J492J645
$$ y = [142302, 138737, 136200, 134096, 132020, 130395, 129300, 127803, 125489, 123463, 122778, 123021, 123404, 123940, 124514, 124294, 123258, 122815, 123664, 124566, 124675, 125570, 129271, 135519, 142709, 150309, 158645, 167329, 175660, 183715, 191418, 197375, 200189, 200194, 198468, 194945, 189070, 181501, 173644, 166066, 158690, 151953, 146387, 141580, 136723, 131734, 126961, 122446, 118346, 115298, 113502, 112302, 111317, 110900, 110813, 109874, 107835, 106139, 105737, 105696, 105111, 104727, 105172, 105255, 103810, 101898, 101305, 101982, 102709, 103213, 103863, 104271, 103985, 103758, 104473, 105595, 106168, 106405, 106862, 107084, 106608, 106170, 106255, 105681, 103442, 100830, 99742, 99894, 99762, 99338, 99724, 100685, 100877, 100162, 99654, 99753, 99934, 100149, 100680, 100986, 100380, 99451, 99149, 98956, 97717, 95837, 94788, 94778, 94728, 94326, 94304, 94829, 95342, 95931, 97191, 98738, 99416, 99013, 98431, 98128, 97682, 96823, 95770, 94664, 93696, 93476, 94244, 95149, 95301, 94992, 94880, 94785, 94488, 94784, 96276, 97921]
54631I7921M42l31K85J059J030R84J371J116j99j197j005n64m82J26J402J710
54615A03668L74q47n74J01m8j42P71J562R96Q2L70J396J793J583J531J428Q37
54598A14881L56O02Q83L93l04l28N7K11K34L65L22J52M90J221J294N58J65M37
54580A21989K14q87j552j121p55j115j100k11P5j089k032j139N20J057N58K03
54564A13615Q9j86j46N84J220J180J249J906K042Q56m87o50j72j52k87O8K73m70
54546A20532j535j926j800j613r98J88J010Q63N05M97J71p82j350j025q36j319
54530A10582j362m40O5o82j250m83L52j13q51m13M76M87J61N66J145J055J028
54513A10323J664J642N6j240l18J374J201l72p77L20Q98K14l82k01J9N7N38J224
$$ y = [97921, 98363, 98032, 98317, 99376, 100406, 101390, 102761, 103877, 103678, 102481, 101476, 100912, 100430, 100556, 101958, 103668, 104042, 103195, 102621, 102722, 102674, 102532, 103303, 104865, 105861, 105943, 106313, 107709, 109502, 111085, 112616, 114044, 114881, 115237, 115839, 116722, 117115, 116811, 116483, 116540, 116751, 116985, 117350, 117672, 117824, 118314, 119535, 120829, 121387, 121552, 121989, 122203, 121316, 119764, 118643, 117888, 116773, 115673, 115462, 115537, 114448, 112416, 111277, 111797, 112854, 113412, 113615, 113704, 113518, 113372, 113956, 115176, 116356, 117605, 119511, 121553, 122409, 121922, 121272, 121100, 120948, 120661, 120729, 121002, 120532, 118997, 117071, 115271, 113658, 112660, 112848, 113858, 114721, 115226, 115723, 115894, 115112, 113762, 112737, 111901, 110582, 109220, 108780, 108845, 108163, 106913, 106430, 106782, 106669, 105818, 105405, 105881, 106368, 106529, 107095, 108240, 109295, 110323, 111987, 113629, 113685, 112445, 112127, 113501, 114702, 114330, 113553, 113873, 114771, 114985, 114603, 114402, 114421, 114478, 115016, 116240]
54495A16240J182O57Q43J728K026J349P37R42J630K262K607K494K134K330L394
54480A42555M443M652M401M214L715K716K073K104J498o55l059m098m188m554
54466A55817m942m536l837l627l147j561p5l40j666k099j477j063r20j10R49Q55
54450A28221l18j073r55q82j203j319j174j298j478j024k00J19p8j91k59n45n09
54433A15834K87R88P20K16M99R30M67j33M53J500J203k72j058n38K02O79J454
54416A23431K371K496J890J579J727J546R40N30K43m32j052q32k68m02q44m45
54400A32478M68N36k34n68k69l44q66q10j46k3o90j098p55k76J06Q10J530J386
54382A31235N93L84J019J490J364J344J794K259K625L297M002L879K939K143J913
$$ y = [116240, 117422, 118079, 118922, 120650, 122676, 124025, 124762, 125704, 127334, 129596, 132203, 134697, 136831, 139161, 142555, 146998, 151650, 156051, 160265, 163980, 166696, 168769, 170873, 172371, 171716, 168657, 164559, 160371, 155817, 150875, 146339, 142502, 138875, 135728, 134167, 134092, 133752, 132086, 129987, 128510, 127447, 126527, 126417, 127366, 128221, 127903, 126830, 125875, 124993, 123790, 122471, 121297, 119999, 118521, 117497, 117297, 117416, 117338, 117147, 116888, 116343, 115834, 116121, 117109, 117829, 118045, 118544, 119474, 119941, 119808, 120261, 121761, 122964, 122692, 121634, 121096, 121298, 121977, 123431, 125802, 128298, 130188, 131767, 133494, 135040, 135980, 136510, 136753, 136321, 135269, 134437, 134169, 133767, 132923, 132478, 132946, 133482, 133248, 132680, 132411, 132067, 131201, 130391, 130245, 130222, 129532, 128434, 127679, 127403, 127509, 128319, 129849, 131235, 131828, 132212, 133231, 134721, 136085, 137429, 139223, 141482, 144107, 147404, 151406, 155285, 158224, 160367, 162280]
54367A62280J776J507J361J178M60o81j771k828l894m203l133j551q13q73q11
54352A48004o06q38j126o53J48K01l20l88l8m3j30N96J684J803R99O07J018J379
54334A52297J370J409J205Nj656k310j760j198j182j181j117j544k247k265j455
54319A38371n57J92R86J330O25m88r35r67j400j761j162l80p50j584j130K40N33
54302A31163m25p69j7K04p29j318p33j48l56l92L89R72N30j85l36k56l66l05J05
54283A27028M06N52J050J750J915J701J926K267J577K15o0J094J936J387M66K72
54267A45482M58N07P63J351J590J181N99p0j119j802q43J192K021P50r85j649
54251A49426j600j550j226n09j72m49m60N0j4j225k500k738k222j627r68k81l6
$$ y = [162280, 164056, 165563, 166924, 168102, 168562, 167881, 166110, 163282, 159388, 155185, 152052, 150501, 149688, 148815, 148004, 147398, 146560, 145434, 144781, 144929, 145130, 144810, 144422, 144384, 144341, 144211, 144807, 146491, 148294, 149293, 149900, 150918, 152297, 153667, 155076, 156281, 156286, 154630, 152320, 150560, 149362, 148180, 146999, 145882, 144338, 142091, 139826, 138371, 137814, 138006, 138992, 140322, 140947, 140459, 139524, 138557, 137157, 135396, 134234, 133854, 133104, 131520, 130390, 130630, 131163, 130738, 129969, 129952, 130156, 129427, 128109, 127376, 127228, 126872, 126480, 126869, 127841, 128371, 128186, 127850, 127594, 127228, 126923, 127028, 127434, 127986, 129036, 130786, 132701, 134402, 136328, 138595, 140172, 140387, 140327, 141421, 143357, 144744, 145210, 145482, 145940, 146447, 147210, 148561, 150151, 151332, 151931, 151861, 150742, 148940, 148097, 149289, 151310, 152060, 151075, 149426, 147826, 146276, 145050, 144541, 144369, 143920, 143460, 143510, 143496, 142271, 139771, 137033, 134811, 133184, 132216, 131935, 131899]
54234A31899k92n12o31r74j075j94R31P41n02q51J52P66J15l75L97J342J250O86
54216A32873N67N12J0l81j91%j49O3R00J391J033P65J234J625J229O96P01P98
54198A43676O96J171K604L977M433M492M699M494L524K629K409K123J100k8n96
54183A81403j118k137l113l472l665m130m404m141l836l758l371k618k320k582
54169A36738k268r83%k09o91m03J80K98K55M03K25m15n18K98P45j37j321j506
54151A30691j092j024r43j05R33J096M60j84o75j148j163l56O96J253J322J072
54135A30833K88p91j126l42N55P28O74J007J272R57O15Q38J159R05K68l05p79
54118A36756r76m31N16P39O5l50L2L47J47L07J248J926J673J331J503J399N35
$$ y = [131899, 131607, 131095, 130464, 129490, 128415, 128221, 129152, 129893, 129391, 128540, 128692, 129458, 129573, 129198, 129595, 130937, 132187, 132873, 133440, 133952, 133962, 133581, 133390, 133390, 133241, 133304, 134204, 135595, 136628, 137393, 138627, 140252, 141481, 142177, 142878, 143676, 144372, 145543, 148147, 152124, 156557, 161049, 165748, 170242, 173766, 176395, 178804, 180927, 182027, 181999, 181403, 180285, 178148, 175035, 171563, 167898, 163768, 159364, 155223, 151387, 147629, 144258, 141640, 139320, 136738, 134470, 133487, 133487, 133278, 132587, 132184, 132364, 132662, 132917, 133320, 133545, 133130, 132612, 132910, 133655, 133518, 132197, 130691, 129599, 128575, 127632, 127527, 128460, 129556, 130016, 129832, 129157, 128009, 126846, 126490, 127186, 128439, 129761, 130833, 131121, 130330, 129204, 128862, 129417, 130145, 130819, 131826, 133098, 134055, 134670, 135508, 136667, 137572, 137840, 137535, 136756, 135780, 135349, 135865, 136604, 136669, 136319, 136351, 136698, 136845, 137152, 138400, 140326, 141999, 143330, 144833, 146232, 146767]
54101A46767r7J19J73n97j030j67Q84Q16K95N70J255J352J241J860K935L624M032
54084A64032M526M572L715K704K299J974J131L50J19m06j854l153l157k585k739
54069A71528l374l450k957k435j748q09m45j000j234r7J488K078J780J440J030
54054A61795L82J47N64N63l29p05M66J953K378K488L277L734K839K079L211M983
54038A89825M997L669L304M113M319L614L359L614L021J666J192J830K037J319
54024B31879R05J139P44p47j984j998j474j172q76n01p02j644k521k823k926l080
54008B12219l004k750k805l176l279k885k256j505p31m29p93j031m74J76r5r97
53992A86185j618k028k695l033k303j307j367k099k059j230r08j329j388p10j22
$$ y = [146767, 146670, 146789, 146962, 146365, 145335, 145168, 146052, 146868, 147163, 147733, 148988, 150340, 151581, 153441, 156376, 160000, 164032, 168558, 173130, 176845, 179549, 181848, 183822, 184953, 185303, 185422, 185016, 183162, 180009, 176852, 174267, 171528, 168154, 164704, 161747, 159312, 157564, 156755, 156310, 155310, 154076, 153979, 155467, 157545, 159325, 160765, 161795, 162177, 162324, 162888, 163451, 163122, 162417, 162883, 164836, 167214, 169702, 172979, 176713, 179552, 181631, 184842, 189825, 194822, 198491, 201795, 205908, 210227, 213841, 217200, 220814, 223835, 225501, 226693, 228523, 230560, 231879, 232784, 233923, 234667, 233920, 231936, 229938, 228464, 227292, 226416, 225915, 225213, 223569, 221048, 218225, 215299, 212219, 209215, 206465, 203660, 200484, 197205, 194320, 192064, 190559, 189828, 189399, 188606, 187575, 187101, 187277, 187182, 186185, 184567, 182539, 179844, 176811, 174508, 173201, 171834, 169735, 167676, 166446, 165538, 164209, 162821, 162111, 161989]
53977A61989O9M96J260J661J567J612J948K087J918J646R58l88j465j232l22j93
53961A73611p69p35J52Q68J108J489J821J149j83m70R06K586L220K865K152J489
53945A91259J399K225L268L450L004L195M261N086N005M523M069L465K816K543
53931B39568K304J275k67r69k74R71J973K808L591M069M274M524M622M101L297
53916B75867L040L343L477L366L653M400M851M530L602K268P76k48n34q18j641
53901C09932k156j459m52p37k125l092l322l884n058n887n978n967o069n819n306
53886B52621n124n045m304l180k715k915k891k622k864l409l321k831l081l942
53872B04377m007k931j861j301n76L43M44m12j093j202j608k498k749j876r27
$$ y = [161989, 162058, 162554, 163814, 165475, 167042, 168654, 170602, 172689, 174607, 176253, 177211, 176823, 175358, 174126, 173804, 173611, 172842, 172107, 172259, 173127, 174235, 175724, 177545, 178694, 178511, 178041, 178947, 181533, 184753, 187618, 189770, 191259, 192658, 194883, 198151, 201601, 204605, 207800, 212061, 217147, 222152, 226675, 230744, 234209, 237025, 239568, 241872, 243147, 242880, 241911, 241637, 242608, 244581, 247389, 250980, 255049, 259323, 263847, 268469, 272570, 275867, 278907, 282250, 285727, 289093, 292746, 297146, 301997, 306527, 310129, 312397, 313173, 312925, 312391, 311573, 309932, 307776, 306317, 305865, 305128, 303003, 299911, 296589, 292705, 287647, 281760, 275782, 269815, 263746, 257927, 252621, 247497, 242452, 238148, 234968, 232253, 229338, 226447, 223825, 220961, 217552, 214231, 211400, 208319, 204377, 200370, 197439, 195578, 194277, 193701, 194044, 194488, 194076, 192983, 191781, 190173, 187675, 184926, 183050, 182123]
53857A82123o91o14j51K36Q2l59q15j219j121j67P88O10j29J23J208J330kj171
53839A80061j088n08j73L34J134J385R40Q77J612K101J688J152J158J291J307
53824A93271J662K173J822O43Q4P37J480J561J762K608L289L369L741M831N512
53809B28545M978M135L977M050L721L498L904M309M021L418K967K302J190K24
53795B75239k89q65j501j215J60J185Q05j94o99q76j213j324r04o50j144j813
53779B64702k075k349l034l540l355k977k861k519j628r68j271k043k416k258
53765B31408j813j196p81j071j669j601r52q11j244j028L0M44m82j355r30J12
53749B17061O47P22N70k48j545j918q10M06N48K35K19o3r36j278n08mq13j609
$$ y = [182123, 181432, 180818, 180667, 180903, 180985, 180626, 179811, 178592, 177471, 177304, 178092, 178702, 178573, 178696, 179904, 181234, 181232, 180061, 178973, 178465, 178292, 178626, 179760, 181145, 182085, 182962, 184574, 186675, 188363, 189515, 190673, 191964, 193271, 194933, 197106, 198928, 199571, 199655, 200392, 201872, 203433, 205195, 207803, 211092, 214461, 218202, 223033, 228545, 233523, 237658, 241635, 245685, 249406, 252904, 256808, 261117, 265138, 268556, 271523, 273825, 275015, 275239, 274950, 274085, 272584, 271369, 271529, 272714, 273519, 273325, 272626, 271750, 270537, 269213, 268309, 267659, 266515, 264702, 262627, 260278, 257244, 253704, 250349, 247372, 244511, 241992, 240364, 239396, 238125, 236082, 233666, 231408, 229595, 228399, 227618, 226547, 224878, 223277, 222325, 221514, 220270, 219242, 219272, 219716, 219234, 217879, 216949, 217061, 217708, 218430, 219000, 218752, 217207, 215289, 214479, 214885, 215433, 215668, 215887, 215824, 214888, 213610, 213102, 213098, 212285, 210676]
53731B10676q72M71O34j08k84J21N8k96J40J337K319K920L593M025L591K766K482
53714B33573K551K164J534J515K039K281K076J795J347M58m68r45j297j872k038
53699B44713j202o5M01N53J326K556L393L698L696K979J290l46p09j30K62L67
53683B62782P69J141P10p2M1J084J821J667J281J270J500J779K122K271J804P95
53667B82765l20j300j945j812q22K45N99L93K16J76R2N0O0j49m38j54P56J410
53649B79822J384J349J616J341J54p86m95K97N73P21J304J484L98r49j015j14
53633B87084K98R4L19J117J594J535J586J825J707J222Q95Q22P95J089J950K755
53617C06687K753K169J617J104O71J057K491L687L467K507K053J908J323Q64J462
$$ y = [210676, 209804, 210275, 210909, 210801, 210517, 210638, 210696, 210400, 210540, 211877, 214196, 217116, 220709, 224734, 228325, 231091, 233573, 236124, 238288, 239822, 241337, 243376, 245657, 247733, 249528, 250875, 251333, 250865, 249920, 248623, 246751, 244713, 243511, 243446, 243847, 244400, 245726, 248282, 251675, 255373, 259069, 262048, 263338, 262992, 262283, 262153, 262415, 262782, 263551, 264692, 265402, 265330, 265371, 266455, 268276, 269943, 271224, 272494, 273994, 275773, 277895, 280166, 281970, 282765, 282445, 281145, 279200, 277388, 276566, 276811, 277410, 277803, 278019, 278195, 278287, 278337, 278397, 278248, 277810, 277656, 278412, 279822, 281206, 282555, 284171, 285512, 285666, 284880, 284385, 284682, 285255, 285976, 287280, 288764, 289162, 288213, 287198, 287084, 287382, 287476, 287795, 288912, 290506, 292041, 293627, 295452, 297159, 298381, 299276, 300098, 300893, 301982, 303932, 306687, 309440, 311609, 313226, 314330, 315001, 316058, 318549, 322236, 325703, 328210, 330263, 332171, 333494, 334358, 335820]
53602C35820K410K343J580J438J800J485O58O12J349J594J176J237J921K003J203
53587C58629Q09J439J964J364J06q95j491j821j796j498j251j064p61n95p73o90
53571C51676K10J104O74q92k162k490k343j847o56P19J145N68O2K9j65o52p38
53554C44242k31L15Q70J868K788K413Q89j43J34P69Q56P85J025J158Q68P22J167
53537C60495J782K059K073J887J388J100K012M015N647N951N659N832O368O586
53523D12854O472O507O774O994P117P328P687Q043Q211Q056P694P436P411P445
53509E16029P586Q272R520J0614J1171J1918J3507J5270J6166J6324J6523J6771
53497F69671J6643J6517J7022J7687J7588J7020J7025J7579J7745J7382J7119
$$ y = [335820, 338230, 340573, 342153, 343591, 345391, 346876, 347534, 348146, 349495, 351089, 352265, 353502, 355423, 357426, 358629, 359438, 360877, 362841, 364205, 364311, 363416, 361925, 360104, 358308, 356810, 355559, 354495, 353734, 353139, 352366, 351676, 351886, 352990, 353664, 352772, 350610, 348120, 345777, 343930, 343274, 343993, 345138, 345706, 345768, 345797, 345632, 344980, 344242, 344011, 344326, 345196, 347064, 349852, 352265, 353154, 353011, 353145, 353914, 354770, 355555, 356580, 357738, 358606, 359328, 360495, 362277, 364336, 366409, 368296, 369684, 370784, 372796, 376811, 382458, 388409, 394068, 399900, 406268, 412854, 419326, 425833, 432607, 439601, 446718, 454046, 461733, 469776, 477987, 486043, 493737, 501173, 508584, 516029, 523615, 531887, 541407, 552021, 563192, 575110, 588617, 603887, 620053, 636377, 652900, 669671, 686314, 702831, 719853, 737540, 755128, 772148, 789173, 806752, 824497, 841879, 858998]
53486H58998J6857J6027J5129J5209J5821J5370J3768J2769J3255J4000J3796
53475A020999J3068J2688J2643J2734J3198J3810J3603J2252J0681R592Q535P023
53463A160826N470M227K773O25j789l878n706p472q905r740j0149j0274j0006
53450A106002r559r526j0115j1001j2021j3177j3995j3936j3459j3529j3947j3556
53438I58181j2298j1610j2154j2654j1757r902q326p233n960m362l002k316k181
53425H54426k057j324J52J606K094J680J344J687K448L285M168M933N337N696
53411H85475O650Q234R927J1542J3207J4615J5384J5988J7205J8709J9547J9859
53399A056342K0757K2369K3680K4436K5633K7633K9450L0503L1622L3496L5509
$$ y = [858998, 875855, 891882, 907011, 922220, 938041, 953411, 967179, 979948, 993203, 1007203, 1020999, 1034067, 1046755, 1059398, 1072132, 1085330, 1099140, 1112743, 1124995, 1135676, 1145268, 1153803, 1160826, 1166296, 1170523, 1173296, 1173921, 1172132, 1168254, 1162548, 1155076, 1146171, 1136431, 1126282, 1116008, 1106002, 1096443, 1086917, 1076802, 1065801, 1053780, 1040603, 1026608, 1012672, 999213, 985684, 971737, 958181, 945883, 934273, 922119, 909465, 897708, 887806, 879480, 872247, 866287, 861925, 858923, 856607, 854426, 852369, 851045, 851197, 852803, 854897, 856577, 857921, 859608, 862056, 865341, 869509, 874442, 879779, 885475, 892125, 900359, 910286, 921828, 935035, 949650, 965034, 981022, 998227, 1016936, 1036483, 1056342, 1077099, 1099468, 1123148, 1147584, 1173217, 1200850, 1230300, 1260803, 1292425, 1325921, 1361430]
53388A361430L6937L8080L9358M0344M0606M0617M0958M1401M1462M1109M0379
53377A802681L9065L7333L5876L4944L3991L2629L1118K9523K7367K4536K1641
53366B150704J9035J6374J3508J0779Q001M173j226p508j3763j9673k4957k9002
53354B126445l1638l3457l4922l5952l6692l7701l8999l9822l9657l8716l7203
53343A721686l5146l3066l1750l1094l0334k9528k9558l0464l1179l1200l1066
53332A377301l0888k9960k8298k6938k6055k4464k1678j8880j6989j5366j3438
53321A124347j2059j1983j2355j2002j1139j0687j0853j1437j2500j3723j4099
53310I91510j3252j2146j1580j1008r695p995o523n097l461k019r82K05J690K606
$$ y = [1361430, 1398367, 1436447, 1475805, 1516149, 1556755, 1597372, 1638330, 1679731, 1721193, 1762302, 1802681, 1841746, 1879079, 1914955, 1949899, 1983890, 2016519, 2047637, 2077160, 2104527, 2129063, 2150704, 2169739, 2186113, 2199621, 2210400, 2218401, 2222574, 2221348, 2213840, 2200077, 2180404, 2155447, 2126445, 2094807, 2061350, 2026428, 1990476, 1953784, 1916083, 1877084, 1837262, 1797605, 1758889, 1721686, 1686540, 1653474, 1621724, 1590630, 1560296, 1530768, 1501210, 1470746, 1439567, 1408367, 1377301, 1346413, 1316453, 1288155, 1261217, 1235162, 1210698, 1189020, 1170140, 1153151, 1137785, 1124347, 1112288, 1100305, 1087950, 1075948, 1064809, 1054122, 1043269, 1031832, 1019332, 1005609, 991510, 978258, 966112, 954532, 943524, 933829, 925834, 919311, 914214, 910753, 908734, 907752, 907957, 909647, 912253]
53296I12253K556K565L563N104O507Q045R864J1095J1324J1688J3207J5159J6441
53283A029371J7310J8269J8538J7349J5818J5595J6382J6573J5712J4594J3461
53272A208972J1854J0030Q726P748O240M226K489J055q41l345n768p713r354j0739
53258A223580j1911j3405j5632j7972j9608k0817k2290k3575k3577k2464k1682
53247A010647k1945k2462k2309k1443k0179j8672j7282j6614j6852j7562j8267
53236G97060j8710j8696j8217j7733j7664j7716j7209j6030j4722j3763j3212
53225F13388j2895j2506j1659j0281q720p296o051n219n239o027o778p041p403
53212E06273q527j0050j1045j1149j0737j0421j0708j1658j2507j2275j0988r624
$$ y = [912253, 914809, 917374, 920937, 926041, 932548, 940593, 950457, 961552, 972876, 984564, 997771, 1012930, 1029371, 1046681, 1064950, 1083488, 1100837, 1116655, 1132250, 1148632, 1165205, 1180917, 1195511, 1208972, 1220826, 1230856, 1239582, 1247330, 1253570, 1257796, 1260285, 1261340, 1260499, 1257154, 1251386, 1243673, 1234319, 1223580, 1211669, 1198264, 1182632, 1164660, 1145052, 1124235, 1101945, 1078370, 1054793, 1032329, 1010647, 988702, 966240, 943931, 922488, 902309, 883637, 866355, 849741, 832889, 815327, 797060, 778350, 759654, 741437, 723704, 706040, 688324, 671115, 655085, 640363, 626600, 613388, 600493, 587987, 576328, 566047, 557327, 550031, 543980, 538761, 533522, 527495, 520717, 513676, 506273, 497746, 487696, 476651, 465502, 454765, 444344, 433636, 421978, 409471, 397196, 386208, 376584]
53200C76584q655p671o604o108o233o055n329n093n801o290n732n195n815o678
53186B89325o247m902m218m395m241l419k901l167l506l277k724k315k177k273
53172B39563k442k310j749j155q48o10l25l41o34m96K16M81k81j040p18L1k9o93
53154B26620r04o10n44o88n03k44n00q47l88O02J036P52N61P16P61O57P69Q74
53136B28120M93J0J60O55O17K24M15J178J496J079P01P66Q82R77J484K222K304
53119B43783J490N86K35K44K10n3p43j811k494k136j346j358k244k897k709k171
53103B26586j729j198n51j98k41l08l68q42j740k409k343j614n57L99P11K42l40
53086B13500m22l58p22j068n13O94J279O34n69j423j604j203o19m86r42j158l93
$$ y = [376584, 367929, 360258, 353654, 347546, 341313, 335258, 329929, 324836, 319035, 312745, 307013, 301818, 296003, 289325, 283078, 278176, 273958, 269563, 265322, 261903, 259002, 255835, 252329, 249052, 246328, 244013, 241836, 239563, 237121, 234811, 233062, 231907, 231059, 230449, 230124, 229783, 229149, 228653, 228869, 229350, 229069, 228029, 227311, 227342, 227313, 226620, 225716, 225106, 224562, 223874, 223371, 223127, 222627, 221780, 221392, 221994, 223030, 223782, 224343, 225059, 225820, 226477, 227246, 228120, 228613, 228623, 228783, 229438, 230055, 230279, 230694, 231872, 233368, 234447, 235148, 235914, 236796, 237773, 239257, 241479, 243783, 245273, 245859, 246094, 246338, 246548, 246495, 245752, 243941, 241447, 239311, 237965, 236607, 234363, 231466, 228757, 226586, 224857, 223659, 223108, 222910, 222669, 222361, 221993, 221151, 219411, 217002, 214659, 213045, 212488, 212887, 213598, 213840, 213500, 213078, 212720, 211998, 210930, 210417, 211111, 212390, 213024, 212455, 211032, 209428, 208225, 207606, 207120, 206178, 205020, 204627]
53069B04627P63J125N54j20n07q38j024o47J16N41L73%k69l79k30J5j56p21p28
53050B02495K88J319J363J039J369J821J222Ql28L35P24L89J28K11ln74p98o91
53032B10317j060j812j829p70L97R87J301J495J199N51L04N67O74N12P19J348
53016B14900J618J235P60N47M57O95J587K577K747K322K281K632K609K415K927
53001B42309L704L295J721O09M92N0j383k613k660k145j724r98O2L77m31j069
52985B39596n80K28M18N42J347K187K063J181L24l38p33k84J044K068J901J211
52969B52175J017J100P72K94K96M63j5j059j841j933j590j217j124j466j918j906
52953B42048j392r41p90o67o07r72j464j275n00j85o02p76k32J40l48j046j194
$$ y = [204627, 205390, 206515, 207069, 206949, 206442, 205604, 204580, 203933, 204049, 204590, 204963, 204963, 204694, 204315, 204085, 204100, 203944, 203223, 202495, 202783, 204102, 205465, 206504, 207873, 209694, 210916, 210924, 210596, 210931, 211655, 212044, 212172, 212383, 212380, 211806, 211008, 210317, 209257, 207445, 205616, 204846, 205243, 206230, 207531, 209026, 210225, 210776, 211080, 211647, 212321, 212833, 213552, 214900, 216518, 217753, 218513, 219060, 219517, 220212, 221799, 224376, 227123, 229445, 231726, 234358, 236967, 239382, 242309, 246013, 249308, 251029, 251638, 252130, 252180, 250797, 248184, 245524, 243379, 241655, 240657, 240719, 241096, 240665, 239596, 239016, 239244, 239662, 240204, 241551, 243738, 245801, 246982, 247306, 246968, 246235, 245951, 246995, 249063, 250964, 252175, 253192, 254292, 255064, 255358, 255654, 256117, 256102, 255043, 253202, 251269, 249679, 248462, 247338, 245872, 243954, 242048, 240656, 239715, 238925, 238258, 237651, 236679, 235215, 233940, 233440, 233255, 232653, 231877, 231645, 231785, 231437, 230391, 229197]
52936B29197j055j001o61J40O46L40j67j74P1J68L19N70L72l80r18q69q03q75
52918B24920l41Q07J221K79o47k65O93R00N17L95L84J1k82nK07j56j79R25J964
52899B31348J399o3m39N40J404J504J584J913J855J406J419K050K462K362K386
52884B53130K739K719K030J266P59N8j057k037k477k716l057l176k673j677n80
52869B43251L78J040J324J316J071L67r05k281l143l486l686l729l268k320j347
52854B24582p16n58r38j679k194k052j501j013o24k55j93o36j053q84m99o46j167
52837B07974j194n50pn3k86k08Q6K77L85N94R28J300J620J736J538J139P87N61
52819B16627L64J15k84r65j878k647k907k649k097j420p76l98l79n41o63o54m75
$$ y = [229197, 228142, 227141, 226480, 226620, 227266, 227606, 227439, 227265, 227336, 227504, 227823, 228393, 228765, 228385, 227467, 226598, 225795, 224920, 224579, 225386, 226607, 226886, 226239, 225974, 226667, 227567, 228084, 228479, 228863, 228874, 228592, 228587, 228794, 228638, 228459, 229384, 231348, 232747, 232684, 232245, 232785, 234189, 235693, 237277, 239190, 241045, 242451, 243870, 245920, 248382, 250744, 253130, 255869, 258588, 260618, 261884, 262643, 262701, 261644, 259607, 257130, 254414, 251357, 248181, 245508, 243831, 243251, 243629, 244669, 245993, 247309, 248380, 248747, 247842, 245561, 242418, 238932, 235246, 231517, 228249, 225929, 224582, 223866, 223308, 222370, 220691, 218497, 216445, 214944, 213931, 213307, 213052, 212859, 212223, 211170, 210286, 209787, 209141, 207974, 206780, 206230, 206223, 206170, 205884, 205676, 205762, 206039, 206424, 207018, 207946, 209246, 210866, 212602, 214140, 215279, 216066, 216627, 216991, 217106, 216822, 215857, 213979, 211332, 208425, 205776, 203679, 202259, 201483, 201085, 200706, 200165, 199502, 198848, 198373]
52802A98373r8K77L62K13J93M58P80R66J010Q26L33r2J39R65J617J552R11N5p13
52783B08127q95j24J021J360N39n79j177j291j085l93N74J024P41N84J157J793
52767B11376J567O53j19l82k63J91Q13J098Q05M51O31J220J729J941J849J437
52751B24997R36P56Q74Q15N34N37Q86J013Q44J098J984K617K334J615J058M28
52735B43326n05j146r95n26l69l75k36j74k54M0P21Q15j02q61k92J003J613J251
52717B42934O10J9n88r28p53m58m07k49K23L15m80j352j286n75k18m07p77j285
52699B34338j777j471j69P80J04j416k045j539r88p84l84J64R2p10j442j590j264
52682B19899n84K40N05j74r23n99N21J150P75m9p71j097n84P47J748J385K70k25
$$ y = [198373, 198275, 198552, 198914, 199127, 199320, 199778, 200558, 201524, 202534, 203360, 203693, 203601, 203740, 204705, 206322, 207874, 208785, 208840, 208127, 207232, 207108, 208129, 209489, 210028, 209449, 208272, 206981, 205896, 205503, 206077, 207101, 207842, 208426, 209583, 211376, 212943, 213596, 213477, 213095, 212832, 213023, 213836, 214934, 215739, 216190, 216821, 218041, 219770, 221711, 223560, 224997, 225933, 226689, 227563, 228378, 228912, 229449, 230335, 231348, 232192, 233290, 235274, 237891, 240225, 241840, 242898, 243326, 242821, 241675, 240680, 240154, 239785, 239410, 239174, 239000, 238746, 238786, 239507, 240322, 240220, 239359, 239067, 240070, 241683, 242934, 243544, 243563, 242975, 242047, 241294, 240836, 240429, 240180, 240403, 240718, 240238, 238886, 237600, 237025, 236807, 236400, 235623, 234338, 232561, 231090, 230921, 231701, 231805, 230389, 228344, 226805, 225817, 225033, 224649, 224813, 224905, 224195, 222753, 221163, 219899, 219315, 219555, 220060, 219886, 218963, 218364, 218885, 220035, 220810, 220761, 219990, 218893, 218309, 219056, 220804, 222189, 222459, 222234]
52664B22234M8K27J98N80J238J396J099J084J282R22J05k41J1M5l13l27K02N93
52646B30383N90O98J047J123Q58P29P06L34r2K82J288J767J320P09K73n49j710
52629B39756k090j185l1L34K22M26Q87J016O77J42l61o06l88J26M67M54L03J11
52611B40260j42k33R4O45J133J770K672L109K342R48J39%l91j171j436q57k12
52594B48670m7m0nl54j163j830k008j962j805j333p77o98q88n16M32R06L66m52
52576B36496p17m22J37Q30J266Q79j38p88n38J49P21J094J149O74K0l9N42R27
52558B42242N76j85r36j571j839j434o38p9K17N83P72L50j32K73J184J315O82
52541B41380P13J859K777K509J814J651J770J735J891K377K389J475N83P23J576
$$ y = [222234, 222282, 222509, 222707, 223287, 224525, 225921, 227020, 228104, 229386, 230308, 230413, 230172, 230183, 230228, 229915, 229588, 229790, 230383, 230973, 231671, 232718, 233841, 234699, 235428, 236134, 236468, 236376, 236658, 237946, 239713, 241033, 241742, 242015, 241466, 239756, 237666, 236481, 236450, 236784, 237006, 237432, 238319, 239335, 240012, 240154, 239793, 239187, 238799, 238925, 239392, 239846, 240149, 240260, 240118, 239885, 239979, 240624, 241757, 243527, 246199, 249308, 251650, 252598, 252737, 252737, 252346, 251175, 249739, 248882, 248670, 248623, 248583, 248578, 248224, 247061, 245231, 243223, 241261, 239456, 238123, 237346, 236648, 235760, 235244, 235676, 236582, 236948, 236496, 235779, 235357, 235494, 236324, 237590, 238469, 238331, 237543, 237005, 237154, 237875, 238969, 240118, 240792, 240812, 240773, 241315, 242242, 242818, 242633, 241697, 240126, 238287, 236853, 236215, 236136, 236353, 236936, 237708, 238058, 237926, 238199, 239383, 240698, 241380, 242093, 243952, 246729, 249238, 251052, 252703, 254473, 256208, 258099, 260476, 262865, 264340, 264923, 265646, 267222]
52526B67222K249K563K616K076Q93M4M70J715K536K472K102K084K549L165L397
52511B98153L014K502K509K829K638J837J179R28M04p79k101l144m177n215n584
52496B94993m987m130l679l484l282l205l125k517j523j093j435j480n75M74Q24
52481B61776Q73J225J430R62M06N24R20Q15M56N92J093J276J143J178J232P32
52465B76633k15r12j192j515k033k284j936j297r25j032j295j189o03n2L1K6N11
52448B60721J161J135N05J83L67L27k0L21J651K831L046L083L782M440L981K750
52432B90264J895J640J394J041Q87P74L34k08m82p88j535k252k197j666j617k136
52416B85348k283j466r4J181K172K972L603L984M005L607K929K152J128l45j835
$$ y = [267222, 269471, 272034, 274650, 276726, 277619, 277663, 278133, 279848, 282384, 284856, 286958, 289042, 291591, 294756, 298153, 301167, 303669, 306178, 309007, 311645, 313482, 314661, 315589, 315993, 315214, 313113, 309969, 305792, 300577, 294993, 290006, 285876, 282197, 278713, 275431, 272226, 269101, 266584, 265061, 263968, 262533, 261053, 260478, 260952, 261776, 262649, 263874, 265304, 266266, 266672, 267196, 268116, 268931, 269387, 269979, 271072, 272348, 273491, 274669, 275901, 276633, 276418, 275506, 274314, 272799, 270766, 268482, 266546, 265249, 264324, 263292, 261997, 260808, 260205, 260153, 260184, 260210, 260721, 261882, 263017, 263522, 263705, 264072, 264399, 264379, 264700, 266351, 269182, 272228, 275311, 279093, 283533, 287514, 290264, 292159, 293799, 295193, 296234, 297121, 297895, 298229, 298021, 297539, 296751, 295216, 292964, 290767, 289101, 287484, 285348, 283065, 281599, 281505, 282686, 284858, 287830, 291433, 295417, 299422, 303029, 305958, 308110, 309238, 308893, 307058]
52401C07058k483k226k045k613l367l457k893k166j461q37o21q89j078q21o13
52386B79488r98j529j334l19Q39J582J772J492J109J170J676J855J185L17K88
52371B88593J126J745J197l03j533j396j40P06J19j016j099j15N39L98N35J447
52355B90803K009J377M20K63O44Q50J099J752K149J696J209J796K953L211K269
52340C14500J203Q85J300K142L065L587L675M083N250O373O475N892N634N752
52326C69816N523M839M317M206M340M921O211P569P972P489P300Q091R410J0680
52312D62684J1971J3464J4871J5776J6211J6630J7387J8232J8358J7232J5423
52301F38239J4086J3626J3433J3110J2969J3048J2641J1434J0109R182Q198O810
$$ y = [307058, 304575, 302349, 300304, 297691, 294324, 290867, 287974, 285808, 284347, 283510, 282889, 282000, 280922, 280101, 279488, 278490, 276961, 275627, 275308, 276147, 277729, 279501, 280993, 282102, 283272, 284948, 286803, 287988, 288305, 288593, 289719, 291464, 292661, 292358, 290825, 289429, 289289, 289995, 290114, 289098, 287999, 287884, 288423, 288821, 289356, 290803, 292812, 294189, 294609, 294872, 295516, 296366, 297465, 299217, 301366, 303062, 304271, 306067, 309020, 312231, 314500, 315703, 316588, 317888, 320030, 323095, 326682, 330357, 334440, 339690, 346063, 352538, 358430, 364064, 369816, 375339, 380178, 384495, 388701, 393041, 397962, 404173, 411742, 419714, 427203, 434503, 442594, 452004, 462684, 474655, 488119, 502990, 518766, 534977, 551607, 568994, 587226, 605584, 622816, 638239, 652325, 665951, 679384, 692494, 705463, 718511, 731152, 742586, 752695, 761877, 770075, 776885]
52289G76885N721N572N786N491M761L963K810J219K00N63J384J184Pj033j747
52274H12766k839m278n178n233m881m160k720r43K63Q94J894L624N357O506P364
52259H08436Q436R753J1045J2006J2360J2187J2039J2201J2167J1431J0367R579
52247I42007Q880P761O439N513M931M213L401K846K424J844J312J002L62j030
52233I91905k405k780k543k857l842m663n129n811o701p139p042o988o981o392
52219I20632n223m226l697l214k675k477k493j967o97O79J740K702L585L837L178
52204I09684K046R59K0q22j502j914j883j219k19L03j7n74p90j038j726k303k071
52187H96934j392r63n83J52N87q4j157j247n26m36j393k265k238j716j296j140
$$ y = [776885, 782606, 788178, 793964, 799455, 804216, 808179, 810989, 812208, 812408, 812971, 814355, 815539, 815546, 814513, 812766, 809927, 805649, 800471, 795238, 790357, 786197, 783477, 782534, 782797, 783691, 785585, 789209, 794566, 801072, 808436, 816872, 826625, 837670, 849676, 862036, 874223, 886262, 898463, 910630, 922061, 932428, 942007, 950887, 958648, 965087, 970600, 975531, 979744, 983145, 985991, 988415, 990259, 991571, 992573, 992935, 991905, 989500, 986720, 984177, 981320, 977478, 972815, 967686, 961875, 955174, 948035, 940993, 934005, 927024, 920632, 915409, 911183, 907486, 904272, 901597, 899120, 896627, 894660, 893963, 894642, 896382, 899084, 902669, 906506, 909684, 911730, 912689, 912709, 911887, 910385, 908471, 906588, 905369, 905150, 905453, 905436, 904862, 904072, 903034, 901308, 899005, 896934, 895542, 894579, 893996, 894148, 894735, 894651, 893494, 892247, 891721, 891285, 889892, 887627, 885389, 883673, 882377, 881237]
52171H81237j416k132k559j981r28l82j27O42J404Q52p92j896j978k154k760k608
52155H62422j300l75j103k681l645l772l613l283k730k348k387k528k519k520
52141H27618k396j663n12J14j39n68p06q93j172q64J67R91J005Q62J351K299L236
52124H28730M208N331O429P576R077J0499J0860J0180R718J0025J0118R264Q334
52111I40349Q368Q991R347R648J0585J1953J3029J3717J4382J4948J5131J5127
52099A085575J5220J5141J4480J3405J2303J1126R727Q298O925N166K740K43j551
52086A198798k714l930n479o965p911q216q155q112q085p527o114m511l712l604
$$ y = [881237, 879821, 877689, 875130, 873149, 872221, 871839, 871712, 872354, 873758, 874610, 873818, 871922, 869944, 867790, 865030, 862422, 861122, 860747, 859644, 856963, 853318, 849546, 845933, 842650, 839920, 837572, 835185, 832657, 830138, 827618, 825222, 823559, 823047, 823161, 823022, 822454, 821748, 820855, 819683, 818819, 818986, 819977, 820982, 821844, 823195, 825494, 828730, 832938, 838269, 844698, 852274, 861351, 871850, 882710, 892890, 902608, 912633, 922751, 932015, 940349, 948717, 957708, 967055, 976703, 987288, 999241, 1012270, 1025987, 1040369, 1055317, 1070448, 1085575, 1100795, 1115936, 1130416, 1143821, 1156124, 1167250, 1176977, 1185275, 1192200, 1197366, 1200106, 1200349, 1198798, 1196084, 1192154, 1186675, 1179710, 1171799, 1163583, 1155428, 1147316, 1139231, 1131704, 1125590, 1121079, 1117367, 1113763]
$$ [...]
##END NTUPLES=NMR SPECTRUM
##END=
