##TITLE=NES1068_159122.0013_001_9705792_3LNsZ8qjEM
##JCAMPDX= 6.0         $$ Bruker NMR JCAMP-DX V2.0
##DATA TYPE= NMR SPECTRUM
##DATA CLASS= NTUPLES
##ORIGIN= BRUKER
##OWNER= Administrator
$$ 1.72 TOPSPIN		Version 2.1
$$ 2016-05-01 15:39:42.599 -0700  Administrator@X
$$ Compression mode = diff/dup
##.OBSERVE FREQUENCY= 400.02188249412
##.OBSERVE NUCLEUS= ^1H
##.ACQUISITION MODE= SIMULTANEOUS (DQD)
##.ACQUISITION SCHEME= undefined
##.AVERAGES= 8
##.DIGITISER RES= 22
##SPECTROMETER/DATA SYSTEM= spect
##.PULSE SEQUENCE= zg30
##.SOLVENT NAME= COFFEE_meoh
##.SHIFT REFERENCE= INTERNAL, COFFEE_meoh, 1, 14.98509
##AUDIT TRAIL= $$ (NUMBER, WHEN, WHO, WHERE, PROCESS, VERSION, WHAT)
$$ ##TITLE= Audit trail, TOPSPIN		Version 2.1
$$ ##JCAMPDX= 5.01
$$ ##ORIGIN= Bruker BioSpin GmbH
$$ ##OWNER= Administrator
$$ $$ E:\/data/COFFEE/nmr/NES1068_159122.0013_001_9705792_3LNsZ8qjEM/20/pdata/1/auditp.txt
$$ ##AUDIT TRAIL=  $$ (NUMBER, WHEN, WHO, WHERE, PROCESS, VERSION, WHAT)
(   1,<2016-05-01 15:39:35.552 -0700>,<Administrator>,<X>,<go>,<TOPSPIN 2.1>,
      <created by zg
	started at 2016-05-01 15:38:29.708 -0700,
	POWCHK enabled, PULCHK disabled,
       configuration hash MD5:
       21 0F 79 D6 B3 7B B4 F6 88 20 88 DB 03 48 BD 9F
       data hash MD5: 64K
       33 0B 77 21 B4 3F 1B 0E 27 8B 8E E8 B4 C6 3D C7>)
(   2,<2016-05-01 15:39:38.614 -0700>,<Administrator>,<X>,<proc1d>,<TOPSPIN 2.1>,
      <Start of raw data processing
       efp LB = 0 FT_mod = 6 PKNL = 1 PHC0 = 0 PHC1 = 0 SI = 32K 
       data hash MD5: 32K
       AD BA E2 55 7E 3F 95 3C 47 F3 53 00 1A C3 27 69>)
(   3,<2016-05-01 15:39:38.896 -0700>,<Administrator>,<X>,<proc1d>,<TOPSPIN 2.1>,
      <pk PHC0 = 92.39502 PHC1 = 0 
       data hash MD5: 32K
       42 E9 56 94 23 33 07 03 6B 3A D2 80 1C 1D EE 85>)
(   4,<2016-05-01 15:39:39.005 -0700>,<Administrator>,<X>,<proc1d>,<TOPSPIN 2.1>,
      <abs ABSG = 1 
       data hash MD5: 32K
       85 0E A4 DC 21 7E 87 99 A3 FE C8 7E A1 DC 9A 26>)
(   5,<2016-05-01 15:39:39.067 -0700>,<Administrator>,<X>,<proc1d>,<TOPSPIN 2.1>,
      <abs ABSG = 2 
       data hash MD5: 32K
       B7 9D BB CC 9E F6 12 CB 80 9C 91 92 AA 56 D4 E6>)
(   6,<2016-05-01 15:39:39.130 -0700>,<Administrator>,<X>,<proc1d>,<TOPSPIN 2.1>,
      <abs ABSG = 3 
       data hash MD5: 32K
       D6 73 31 88 2C E8 D0 85 5B C9 9E 32 64 36 EB F6>)
(   7,<2016-05-01 15:39:39.177 -0700>,<Administrator>,<X>,<proc1d>,<TOPSPIN 2.1>,
      <abs ABSG = 4 
       data hash MD5: 32K
       28 19 AF 5E 56 15 F0 F1 83 1B DA 3D 60 F0 A6 C1>)
(   8,<2016-05-01 15:39:39.239 -0700>,<Administrator>,<X>,<proc1d>,<TOPSPIN 2.1>,
      <abs ABSG = 5 
       data hash MD5: 32K
       5E E7 F6 1F B3 F5 F9 6E F9 88 97 39 F6 B3 31 F4>)
$$ ##END=
$$ 
$$ $$ hash MD5
$$ $$ 86 2F 5C B6 A5 28 48 0B 69 70 AD 89 D0 81 70 2A
##$RELAX= 
##$RELAX= 
##$RELAX= 
##$RELAX= 
##$RELAX= 
##$RELAX= 
##$RELAX= 
$$ Bruker specific parameters
$$ --------------------------
##$DU= <E:\>
##$EXPNO= 20
$$ [...]
150 150 150 150 150 150 150 150
##$TP07= 0
##$TPNAME0= <>
##$TPNAME1= <>
##$TPNAME2= <>
##$TPNAME3= <>
##$TPNAME4= <>
##$TPNAME5= <>
##$TPNAME6= <>
##$TPNAME7= <>
##$TPOAL= (0..7)
0.5 0.5 0.5 0.5 0.5 0.5 0.5 0.5
##$TPOFFS= (0..7)
0 0 0 0 0 0 0 0
##$TUNHIN= 0
##$TUNHOUT= 0
##$TUNXOUT= 0
##$USERA1= <user>
##$USERA2= <user>
##$USERA3= <user>
##$USERA4= <user>
##$USERA5= <user>
##$V9= 5
##$VALIST= <valist>
##$VCLIST= <CCCCCCCCCCCCCCC>
##$VD= 0
##$VDLIST= <DDDDDDDDDDDDDDD>
##$VPLIST= <PPPPPPPPPPPPPPP>
##$VTLIST= <TTTTTTTTTTTTTTT>
##$WBST= 2048
##$WBSW= 25
##$XGAIN= (0..3)
0 0 0 0
##$XL= 0
##$YL= 0
##$YMAX_a= 609186
##$YMIN_a= -517788
##$ZGOPTNS= <>
##$ZL1= 120
##$ZL2= 120
##$ZL3= 120
##$ZL4= 120
##$ABSF1= 14.98509
##$ABSF2= -5.573092
##$ABSG= 5
##$ABSL= 3
##$ALPHA= 0
##$AQORDER= 0
##$ASSFAC= 0
##$ASSFACI= 0
##$ASSFACX= 0
##$ASSWID= 0
##$AUNMP= <proc_prof1d_extract_pilot.lims>
##$AXLEFT= 0
##$AXNAME= <>
##$AXNUC= <1H>
##$AXRIGHT= 0
##$AXTYPE= 0
##$AXUNIT= <>
##$AZFE= 0.1
##$AZFW= 0.1
##$BCFW= 0
##$BC_mod= 0
##$BYTORDP= 0
##$COROFFS= 0
##$CY= 15
##$DATMOD= 1
##$DC= 0
##$DFILT= <>
##$DTYPP= 0
##$F1P= 0
##$F2P= 0
##$FCOR= 0.5
##$FTSIZE= 32768
##$FT_mod= 6
##$GAMMA= 0
##$GB= 0
##$INTBC= 1
##$INTSCL= 1
##$ISEN= 128
##$LB= 0
##$LEV0= 0
##$LPBIN= 0
##$MAXI= 10000
##$MC2= 0
##$MEAN= 0
##$ME_mod= 0
##$MI= 0
##$NCOEF= 0
##$NC_proc= -8
##$NLEV= 6
##$NOISF1= 0
##$NOISF2= 0
##$NSP= 0
##$NTH_PI= 0
##$NZP= 0
##$OFFSET= 14.98509
##$PC= 1
##$PHC0= 92.39502
##$PHC1= 0
##$PH_mod= 1
##$PKNL= yes
##$PPARMOD= 0
##$PPDIAG= 0
##$PPIPTYP= 0
##$PPMPNUM= 2147483647
##$PPRESOL= 1
##$PSCAL= 4
##$PSIGN= 0
##$PYNMP= <proc.py>
##$REVERSE= no
##$SF= 400.02
##$SI= 32768
##$SIGF1= 0
##$SIGF2= 0
##$SINO= 400
##$SIOLD= 32768
##$SPECTYP= <>
##$SREGLST= <1H.CDCl3>
##$SSB= 0
##$STSI= 32768
##$STSR= 0
##$SW_p= 8223.68421052631
##$SYMM= 0
##$S_DEV= 0
##$TDeff= 65536
##$TDoff= 0
##$TI= <>
##$TILT= no
##$TM1= 0
##$TM2= 0
##$TOPLEV= 0
##$USERP1= <user>
##$USERP2= <user>
##$USERP3= <user>
##$USERP4= <user>
##$USERP5= <user>
##$WDW= 1
##$XDIM= 32768
##$YMAX_p= 445692637
##$YMIN_p= -627204
##$CURPLOT= <Network HP LaserJet P1505>
##$CURPRIN= <$Network HP LaserJet P1505>
##$DFORMAT= <normdp>
##$LAYOUT= <+/1D_H.xwp>
##$LFORMAT= <normlp>
##$PFORMAT= <normpl>
##$SURQMSG= 1
$$ End of Bruker specific parameters
$$ ---------------------------------
##NTUPLES= NMR SPECTRUM
##VAR_NAME=  FREQUENCY,     SPECTRUM/REAL,   SPECTRUM/IMAG
##SYMBOL=    X,             R,               I
##VAR_TYPE=  INDEPENDENT,   DEPENDENT,       DEPENDENT
##VAR_FORM=  AFFN,          ASDF,            ASDF
##VAR_DIM=   32768,         32768,           32768
##UNITS=     HZ,            ARBITRARY UNITS, ARBITRARY UNITS
##FACTOR=    0.250966925370066, 1,           1
##FIRST=     8223.43324360094, -253324,      222772
##LAST=      0,             -250133,         -355030
##MIN=       0,             -627204,         0
##MAX=       8223.43324360094, 445692637,    0
$$ Real data points
##PAGE= N=1
##DATA TABLE= (X++(R..R)), XYDATA
$$ [...]
19541c0900j47268B45076F0777a36375k18902G8306b32921a2900j42356A98488
$$ -30900 -178168 245076 60777 -136375 -355277 78306 -232921 -12900 -155256 198488
19530b63671A37795b72435J10582A42065i5642B73817j01537a90750a2786A66513
$$ -263671 137795 -272435 -161853 142065 -95642 273817 172280 -190750 -12786 166513
19519B1341a57299c8972o57J0554A46445F6971J44934A537c17671a38843D7858
$$ 21341 -157299 -38972 -39629 -29075 146445 66971 211905 1537 -317671 -138843 47858
19507c4453C1160a30846d7066A63874a77987h4946C516a83783L437g4947o5436
$$ -34453 31160 -130846 -47066 163874 -177987 -84946 3516 -183783 -180346 -74947 -140383
19496a40383j18519f1627p4847b5700r9064B18431b39495j47168a23917c5766
$$ -140383 -258902 -61627 -136474 -25700 -124764 218431 -239495 -386663 -123917 -35766
19485c2041k14504b6402A48349a24531K3656j28463a03369p659d6490J3893H4232
$$ -32041 -246545 -26402 148349 -124531 -100875 -229338 -103369 -111028 -46490 -32597 84232
19473a75068F1742J8739L9322c14146K3177B44602q8210b08976g0181a8464j68630
$$ -175068 61742 80481 119803 -314146 -290969 244602 156392 -208976 -70181 -18464 -187094
19462a87094m5180i948A79172b43698A50492a07271c191G7644d8294j4785m5932
$$ -187094 -232274 -9948 179172 -243698 150492 -107271 -3191 77644 -48294 -63079 -109011
19451a09011j30606e926k351A38920b34133a03507H4122J2377b46317R0893A2345
$$ -109011 -239617 -5926 -8277 138920 -234133 -103507 84122 96499 -246317 -155424 12345
19439a0102j4779j28922o0906A42195E4188J02788G0295a7117j33861c6397l25310
$$ -10102 -24881 -153803 -214709 142195 54188 156976 70295 -17117 -150978 -36397 -361707
19428c61707M2128e4577l7105A91813C1327J33696a8443j07109c6480n2294J4953
$$ -361707 -319579 -54577 -91682 191813 31327 165023 -18443 -125552 -36480 -88774 -73821
19417g3821l1559B8714O6279A0063g6436B72856H0008g7549G6712o611a18409
$$ -73821 -105380 28714 94993 10063 -76436 272856 80008 -77549 76712 70101 -118409
19405g7068a2558r9543B38704g4585j55958G2643k3603b00449a5830F6093b05141
$$ -77068 -12558 -112101 238704 -74585 -230543 72643 49040 -200449 -15830 66093 -205141
19393a0828I4908j4011b37084a9623C2481a0985j92874b1744k28205E1404d76847
$$ -10828 94908 80897 -237084 -19623 32481 -10985 -203859 -21744 -249949 51404 -476847
19381a23628j97122R661h0262L2588A74407a88749B59534a25310C02J59111b39599
$$ -123628 -320750 -311089 -80262 -47674 174407 -188749 259534 -125310 302 159413 -239599
19369B4790a65582J9681l54c4468H5425e0606A50216o9890N3595b52105E5606
$$ 24790 -165582 -145901 -146255 -34468 85425 -50606 150216 80326 133921 -252105 55606
19357a13011m7769k56085A63324K4465a7677k08528F1660a31178K7386k9805c7879
$$ -113011 -160780 -416865 163324 187789 -17677 -226205 61660 -131178 -103792 -133597 -37879
19345B69369E7455L4677b74853j37191C04092i7687r7075A43718b40176N3921
$$ 269369 57455 92132 -274853 -412044 304092 -97687 -194762 143718 -240176 -186255
19335a86255A90118i4051l8918J4845N0799J9282p6048k2141H4119L8502O7585
$$ -186255 190118 -94051 -132969 -118124 -67325 -48043 -124091 -146232 84119 122621 190206
19324A90206b35570C559O9579F054a41264E660K26338b85286j07866c0515r7985
$$ 190206 -235570 3559 73138 6054 -141264 5660 231998 -285286 -393152 -30515 -128500
19313a28500j775k33284J40367L9165e2462k18816D51190a58794P5947n44357
$$ -128500 -130275 -363559 -223192 -184027 -52462 -271278 451190 -158794 -82847 -627204
19303f27204K66042h2128j43750I7717i6547L5119A33340c15170a57103C32350
$$ -627204 -361162 -82128 -225878 97717 -96547 -61428 133340 -315170 -157103 332350
19292b07196j25650F2973N4051c0238E253a34530D6224c3218l1680l5780k61067
$$ -207196 -332846 62973 117024 -30238 5253 -134530 46224 -33218 -64898 -100678 -361745
19281c61745B31847r6498a91037E7087k8461g9639A08526a8073j77847q6477I1422
$$ -361745 231847 135349 -191037 57087 28626 -79639 108526 -18073 -195920 -282397 91422
19269I8326f5926I8885N9858J32317m8910i6989l13648a77917G0386b5294H6326
$$ 98326 -65926 98885 158743 291060 242150 -96989 -410637 -177917 70386 -25294 86326
19257e8592k44299A2121a80224j84457A03697A3701J74400r1990a33796r7714
$$ -58592 -302891 12121 -180224 -364681 103697 13701 188101 96111 -133796 -231510
19247b31510A47677a65919B4779e2920j53887A27472a60582E2627d4875i413k28846
$$ -231510 147677 -165919 24779 -52920 -206807 127472 -160582 52627 -44875 -9413 -238259
19236b38259B27939c75508A0776J29672E4338a65146j61909a18162C38786G2151
$$ -238259 227939 -375508 10776 140448 54338 -165146 -327055 -118162 338786 72151
19225B5211a33987r961j44870m4816A99990a71505B8047a98033R8751E5166P3129
$$ 25211 -133987 -143948 -288818 -333634 199990 -171505 28047 -198033 -99282 55166 128295
19214A28295i8949c5457j96355A57428J50976A21866a40511K816j23944f8246
$$ 128295 -98949 -35457 -231812 157428 308404 121866 -140511 -137695 -261639 -68246
19203c6231q1926j7429M7605H989J0183J74821a96957A64211D3888J16g3154r977
$$ -36231 -118157 -135586 -87981 8989 19172 193993 -196957 164211 43888 44004 -73154 -83131
19191h3131j97205R6071A10057J5822c064q0040o8610B0052a78430q5919N3559
$$ -83131 -280336 -184265 110057 125879 -3064 -83104 -151714 20052 -178430 -264349 -210790
19180b10790H7362a26659j6153E0895a47251B65888d8186k6162b836o4046A20735
$$ -210790 87362 -126659 -142812 50895 -147251 265888 -48186 -74348 -2836 -66882 120735
19168D9642P548a94473L3553F5988K26402i1251J2266n0263A79362H5327a21954
$$ 49642 57190 -194473 -160920 65988 292390 -91251 -78985 -129248 179362 85327 -121954
19156D8124J31636d0987l76236c1708o2021K1464c2976F1523Q9710a26844e4313
$$ 48124 179760 -40987 -417223 -31708 -93729 -72265 -32976 61523 151233 -126844 -54313
19144A50544b13198A48i8612n7108k94623a79829b4675F0529b64161r783A06405
$$ 150544 -213198 148 -98612 -155720 -450343 -179829 -24675 60529 -264161 -273944 106405
19132B5267a45528p5388P4776m21e3424j6890E0005b6552B60278h3451G979a06269
$$ 25267 -145528 -220916 -146140 -146561 -53424 -70314 50005 -26552 260278 -83451 7979 -106269
19119c6322n9869a6327A58377g9972A62673a28134e6505a2595C2259d4788j93541
$$ -36322 -96191 -16327 158377 -79972 162673 -128134 -56505 -12595 32259 -44788 -238329
19108b38329c5016E8871L7512h4493L2386m5014K6006q3148r473A46424b9443
$$ -238329 -35016 58871 96383 -84493 -52107 -97121 -71115 -154263 -163736 146424 -29443
19096i5681j30143A01908b57284j6571P8185N1952G5295M9107k9085j5060N1540
$$ -95681 -225824 101908 -257284 -273855 -195670 -143718 75295 124402 95317 80257 131797
19085A31797F3114c6256D5114b29614H8613b8174A77959g0842l818A17968b04223
$$ 131797 63114 -36256 45114 -229614 88613 -28174 177959 -70842 -74660 117968 -204223
19073f772j90842j35676a27349l8234H4045D1184M4588a70853E645J24196c88902
$$ -6772 -197614 -333290 -127349 -165583 84045 41184 85772 -170853 5645 129841 -388902
19061a42150j43397A01058M5446c93016B77972b1457j09429A74838b20918E9675
$$ -142150 -285547 101058 146504 -393016 277972 -21457 -130886 174838 -220918 59675
19050d79821A5936b08499j29881a8632c755A41987c8894k3204k65805E5987L87365
$$ -479821 15936 -208499 -338380 -18632 -3755 141987 -38894 -62098 -327903 55987 443352
19039D43352b31769j3567g879E6919K63750r3180d7123r4812C4055L78020a44050
$$ 443352 -231769 -245336 -7879 56919 320669 227489 -47123 -141935 34055 412075 -144050
19027B80727j3773c52143F5798b6439A8800J1604c07828A06876I688k662J89228
$$ 280727 266954 -352143 65798 -26439 18800 30404 -307828 106876 9688 7026 196254
19016A96254c81826E8882N854R2863c5933m7110j5640A29382c650I345e8454A47585
$$ 196254 -381826 58882 64736 157599 -35933 -83043 -98683 129382 -3650 9345 -58454 147585
19003g4113N923j23118H987a01256l5604I4389A016N3730j5040a70246A09544
$$ -74113 -68190 -191308 8987 -101256 -136860 94389 1016 54746 39706 -170246 109544
18991d03004D8669b3321G7385b35519B18872f8189r3669f306j05598k6114A40669
$$ -403004 48669 -23321 77385 -235519 218872 -68189 -161858 -6306 -111904 -138018 140669
18979H1346D620i4764C1321a43116G7807a10754k705j5179M1287M2863I2287a63269
$$ 81346 4620 -94764 31321 -143116 77807 -110754 -113459 -128638 -87351 -44488 92287 -163269
18966b03355e8375H6178a87812l5479m9652F8459f4090L0355l18663j5024G1097
$$ -203355 -58375 86178 -187812 -223291 -272943 68459 -64090 -33735 -352398 -367422 71097
18954A14234a04112C32985e9178F556Q7349A05J12173b0656j62096r4441C9941
$$ 114234 -104112 332985 -59178 6556 93905 105 112278 -20656 -182752 -277193 39941
18942f3646j10266q2284A25365J13822A03880A843R7863b92064J17633L3022d4876
$$ -63646 -173912 -256196 125365 239187 103880 1843 99706 -292064 -174431 -141409 -44876
18930g5063j60707k69909a04060A00232b22673M1114q6273F1427J55617C4661
$$ -75063 -235770 -505679 -104060 100232 -222673 -181559 -267832 61427 217044 34661
18919E819J64771c2150j25776A65238a90308P1480M6435F5265a83486B46531c29442
$$ 5819 170590 -32150 -157926 165238 -190308 -118828 -72393 65265 -183486 246531 -329442
18907A69853a57586J7489O851k0733B23781a51078M9677a7608f720G1211J37034
$$ 169853 -157586 -140097 -133246 -153979 223781 -151078 -101401 -17608 -6720 71211 208245
18896B08245K9484h5642B09195d04477C46303a56249j40078d6850j44399e3179
$$ 208245 237729 -85642 209195 -404477 346303 -156249 -296327 -46850 -191249 -53179
18885A40634A7427P586Q8454b28324A75535B2968J36510b19703J07990c818j01762
$$ 140634 17427 25013 113467 -228324 175535 22968 159478 -219703 -111713 -3818 -105580
18874a05580E7396a11135G3317a29303A1392a82093e8689I1366L9182C3405b53380
$$ -105580 57396 -111135 73317 -129303 11392 -182093 -58689 91366 130548 33405 -253380
18862B8584J4170b52884A25442a29515L1823j59773B05999c03581M8504o9073
$$ 28584 42754 -252884 125442 -129515 -97692 -257465 205999 -303581 -255077 -324150
18852c24150A09126J66663b50062i7078H2800a75013P6848p2483o823k1549G6835
$$ -324150 109126 275789 -250062 -97078 82800 -175013 -98165 -170648 -177471 -199020 76835
18840a03959k28848g2552A12145d05576e7985a1401j48084I2576a89065E4522
$$ -103959 -332807 -72552 112145 -405576 -57985 -11401 -159485 92576 -189065 54522
18829H8520a6487j62699B97925B2987J49085g7589A36165l4162h1292j46123a06864
$$ 88520 -16487 -179186 297925 22987 172072 -77589 136165 102003 -81292 -227415 -106864
18817b85343A71424n3857b23406C6077h2833A8152a37348A93857O3685j7143k4565
$$ -285343 171424 117567 -223406 36077 -82833 18152 -137348 193857 257542 240399 215834
18806B15834e6141b6432F2893J01636b6715I0775b2630j041l12191A90439j2353
$$ 215834 -56141 -26432 62893 164529 -26715 90775 -22630 -23671 -335862 190439 178086
18795A78086p3286B6035b41469e4297A48956N347b92168B61919b73747f3842E7201
$$ 178086 104800 26035 -241469 -54297 148956 154303 -292168 261919 -273747 -63842 57201
18783C6255K12437c40194A27502B320h6710d2903l10785J66114C7639b9127p0733
$$ 36255 248692 -340194 127502 2320 -86710 -42903 -353688 -187574 37639 -29127 -99860
18772i9860M1362E9758h646C27156j52682a84213O1035I3067b03009B5965J54312
$$ -99860 -58498 59758 -8646 327156 174474 -184213 -123178 93067 -203009 25965 180277
18761A80277g2085m3980h530C57549b73063E6908B4256L02244e3115j70960j32619
$$ 180277 -72085 -116065 -8530 357549 -273063 56908 24256 326500 -53115 -224075 -356694
18750c56694A45497C9260f5240j29311r4191R1112B11845a82569G683a25673k23766
$$ -356694 145497 39260 -65240 -194551 -288742 -197630 211845 -182569 7683 -125673 -349439
18739c49439a05356k3606r9247B5916c06964A9992N8206j971f0904k14298B7979
$$ -349439 -105356 -128962 -228209 25916 -306964 19992 78198 76227 -60904 -275202 27979
18727c61707g2524A9124h3485F6613c5234A08498J78179a57712m06c4442E8231
$$ -361707 -72524 19124 -83485 66613 -35234 108498 286677 -157712 -158118 -34442 58231
18715a15578j49481J30598A87989f6404j80160A16153L6541e2585i130A53845
$$ -115578 -265059 -134461 187989 -66404 -246564 116153 152694 -52585 -9130 153845
18704a91611e5056L715r4522M3298D2949A2882b26847i487k5616p6673o5852N1671
$$ -191611 -55056 -51341 -145863 -102565 42949 12882 -226847 -9487 -35103 -111776 -177628 -125957
18692a25957m2062A96906r4833c2174j93599A93991J0749a10370k3358F9982K6911
$$ -125957 -168019 196906 102073 -32174 -225773 193991 204740 -110370 -133728 69982 96893
18681I6893c8096D8699a00572p9998A18484n0799i5341A09591j932R1034m1348
$$ 96893 -38096 48699 -100572 -180570 118484 67685 -95341 109591 107659 198693 157345
18670A57345b05178H0751e1775F3235b32418B02302a66058D0075a7722l59646
$$ 157345 -205178 80751 -51775 63235 -232418 202302 -166058 40075 -17722 -377368
18660c77368Q6758J21907k9284C7226A7121e12617D3936c39022c7519a7875k17453
$$ -377368 -290610 -168703 -197987 37226 17121 -512617 43936 -339022 -37519 -17875 -235328
18649b35328a4331l31050a1909A21499M7432l8452a1857j54241N8051A14095a18844
$$ -235328 -14331 -345381 -11909 121499 168931 130479 -11857 -166098 -108047 114095 -118844
18637a23095j27194c3740A3140f30D6214a04777N753p6536j19143H721O3135i568
$$ -123095 -250289 -33740 13140 -630 46214 -104777 -99024 -175560 -294703 8721 71856 -9568
18624C19061g7463B8600J45642c10809Q6511j44856A13537D0625O7372a44339
$$ 319061 -77463 28600 174242 -310809 -224298 -369154 113537 40625 107997 -144339
18613b53525N5599F1279f0116B31162a04547G1986k2569A4711R5786i1116j29654
$$ -253525 -197926 61279 -60116 231162 -104547 71986 49417 14711 110497 -91116 -220770
18602b20770e7111j27676k5524J2002D5700K54724A162c06161Q7625a4697A8411
$$ -220770 -57111 -184787 -210311 -198309 45700 300424 1162 -306161 -218536 -14697 18411
18590a7737C2280c4958B676N4891J30204p0229h6272j08958M3691i862j38072
$$ -17737 32280 -34958 2676 57567 187771 117542 -86272 -195230 -151539 -9862 -147934
18579a47934C16369e4610q3754j57044I2176N3971J28887I0751b2640p3830j5710
$$ -147934 316369 -54610 -138364 -295408 92176 146147 275034 90751 -22640 -96470 -112180
18568a12180O397A60945p3483b42566A48877p0914L3394a26343D098b20447b7296
$$ -112180 -105783 160945 87462 -242566 148877 77963 111357 -126343 4098 -220447 -27296
18556D0551R1660c2367l6856J0582B36210d9158A0981K64325B9466J95678I5636
$$ 40551 132211 -32367 -69223 -58641 236210 -49158 10981 275306 29466 225144 95636
18544h6871j23460A09098a49896A33435a64238G85b20695I6252d0978k03880B3657
$$ -86871 -210331 109098 -149896 133435 -164238 785 -220695 96252 -40978 -244858 23657
18532e9281C17757a13219j64115l06139I1102A3140c15506C50611A37888C4470
$$ -59281 317757 -113219 -277334 -583473 91102 13140 -315506 350611 137888 34470
18521a03673A13915L7424l001c4735I9982d08226J06479J26363q1112E6696d94173
$$ -103673 113915 151339 148338 -34735 99982 -408226 -301747 -175384 -256496 56696 -494173
18509C606J81584G3533f9514l86893g7090B089J97943b5316H2032J51526a43817
$$ 3606 185190 73533 -69514 -456407 -77090 2089 200032 -25316 82032 233558 -143817
18497B8381Q2361e9350k6322r3579r136j42560Q8030r9404B91305g1581k25263
$$ 28381 110742 -59350 -85672 -179251 -188387 -330947 -242917 -342321 291305 -71581 -296844
18486b96844B374K35250c130j46367k3760j22062b5647k09742Q4742j50906b0272
$$ -296844 2374 237624 -3130 -149497 -173257 -295319 -25647 -235389 -150647 -301553 -20272
18474H7403e1573j77157O6817j210r1821N7477C4131a40605O4360A9583a98694
$$ 87403 -51573 -228730 -161913 -163123 -254944 -197467 34131 -140605 -76245 19583 -198694
18462c42183a55268D729b41717e8364G9344b06104i5513n6336F0251a57369C87537
$$ -342183 -155268 4729 -241717 -58364 79344 -206104 -95513 -151849 60251 -157369 387537
18450B8314a37933F4677a08051C63650D7874a63517k2152q7074c9435n736A32480
$$ 28314 -137933 64677 -108051 363650 47874 -163517 -185669 -272743 -39435 -45171 132480
18438G6784a44732A09599c1697A9475g628k06736g3498l0390A17510c5679A42428
$$ 76784 -144732 109599 -31697 19475 -7628 -214364 -73498 -103888 117510 -35679 142428
18426a12267j3428j94945a16883j0907n3517j02853A68804b12940C39080f8876
$$ -112267 -125695 -320640 -116883 -127790 -181307 -284160 168804 -212940 339080 -68876
18415f1878A52980a83834A04912b67062C5374J37095o5016i5156C4206K8942m668
$$ -61878 152980 -183834 104912 -267062 35374 172469 107453 -95156 34206 63148 58480
18404E8480k22O6721J32391e388A16127c4495A77529H605M3J90927b16178D880
$$ 58480 58258 124979 257370 -5388 116127 -34495 177529 8605 8648 199575 -216178 4880
18391g1681k77589A00909f8352j89054G233a44408A51251a94838d7532A06858
$$ -71681 -349270 100909 -68352 -257406 7233 -144408 151251 -194838 -47532 106858
18380c1392n2840p9163A29062l0484J21433b72101b1111k6549l2038j71629a10075
$$ -31392 -84232 -163395 129062 98578 220011 -272101 -21111 -47660 -79698 -251327 -110075
18368B2682i6503L2839j40705B9824a67104B77369a04481j29261B10861c2707
$$ 22682 -96503 -63664 -204369 29824 -167104 277369 -104481 -233742 210861 -32707
18357d8295m4245B10165J10724c37106a64841K3517j43923A45045c5750B59187
$$ -48295 -92540 210165 320889 -337106 -164841 -141324 -285247 145045 -35750 259187
18346a03000l55822F6300i3375C2271P5083K1057P9653f7101A33718i9811j08351
$$ -103000 -458822 66300 -93375 32271 107354 128411 208064 -67101 133718 -99811 -208162
18335b08162L3959F4872P5581a20780F6008a25512r7839H9390f6455D1603J27119
$$ -208162 -174203 64872 140453 -120780 66008 -125512 -223351 89390 -66455 41603 168722
18324A68722c09717A69615B2056K51283d34931A96619D7082N553A4080a25405
$$ 168722 -309717 169615 22056 273339 -434931 196619 47082 52635 14080 -125405
18313A5763i4289a4029j8266F0265A3901J11303F1673h1942A41723K93294h8974
$$ 15763 -94289 -14029 -32295 60265 13901 125204 61673 -81942 141723 435017 -88974
18301a77567I8633f1566n9071l35601A23440a33009M8190c3769B55708a9239j19579
$$ -177567 98633 -61566 -120637 -456238 123440 -133009 -84819 -33769 255708 -19239 -138818
18290a38818B9451c34399B4394c17593E9423b7842A91878b60230A13338h9898
$$ -138818 29451 -334399 24394 -317593 59423 -27842 191878 -260230 113338 -89898
18279b48766H9937b18599F9810M2282i1158m1869K1027A8742a19392A36693b62433
$$ -248766 89937 -218599 69810 112092 -91158 -133027 -112000 18742 -119392 136693 -262433
18267A22582h5353A75338j2157b33641g7896B16834H243J97370e1032A1072K54699
$$ 122582 -85353 175338 163181 -233641 -77896 216834 8243 205613 -51032 11072 265771
18256B65771b79690B3269J40325b77997a30347C5979a36295C91715i9829K9593
$$ 265771 -279690 23269 163594 -277997 -130347 35979 -136295 391715 -99829 -70236
18246g0236j05014C24862C5167J83121a35625K9147j308A06969h9586L248C3382
$$ -70236 -175250 324862 35167 218288 -135625 -106478 -107786 106969 -89586 -86338 33382
18234c01039r9848J33186A46607A3225a98921G5233a38876f8355C88006a19717
$$ -301039 -400887 -267701 146607 13225 -198921 75233 -138876 -68355 388006 -119717
18223A86602J57134a05579e2206n8501G1632a10903E65605a03599l01580B4109
$$ 186602 343736 -105579 -52206 -110707 71632 -110903 565605 -103599 -405179 24109
18212B34179b51123c8837j7606A58233F4037B8662b26077A79787a12658c0708
$$ 234179 -251123 -38837 -56443 158233 64037 28662 -226077 179787 -112658 -30708
18201b23818o1508h6645E0302c8851q0323A06569a31018B5087a21154B11899E6518
$$ -223818 -285326 -86645 50302 -38851 -119174 106569 -131018 25087 -121154 211899 56518
18189A82552G8905a53828N24e2889m7K4627p8517B1901b0806j23539m2054n8856
$$ 182552 78905 -153828 -153304 -52889 -52936 -28309 -106826 21901 -20806 -144345 -186399 -245255
18177b45255Q1851B5316K2996L11025j74885a31839d2765A78180M5667b24724
$$ -245255 -163404 25316 48312 359337 184452 -131839 -42765 178180 223847 -224724
18166a5257m22069H2729d5273j48497h7805A96893b14310d1701C0578b20514l3613
$$ -15257 -437326 82729 -45273 -193770 -87805 196893 -214310 -41701 30578 -220514 -254127
18155b54127e6563j3580a3852C57063A09211I461L1224b81496a30261H9773J89973
$$ -254127 -56563 -70143 -13852 357063 109211 9461 40685 -281496 -130261 89773 279746
18144B79746b57640o1518a33771B47277g5131m5733C23517r8626n720H3944a01531
$$ 279746 -257640 -319158 -133771 247277 -75131 -120864 323517 224891 219171 83944 -101531
18132B09939G3947Q2884C647a62098A36498g9708k0831j88295f3410A04910a15626
$$ 209939 73947 156831 3647 -162098 136498 -79708 -100539 -288834 -63410 104910 -115626
18120c30589A81247n3808J63239a029A89923C5160J21968d4028o2575H0811L7041
$$ -330589 181247 127439 290678 -1029 189923 35160 157128 -44028 -106603 80811 117852
18109A17852M9117a59048f6185p9434N9489p9307G3150N4593J27461j18246e6999
$$ 117852 166969 -159048 -66185 -145619 -86130 -165437 73150 127743 255204 136958 -56999
18097A64437a14344j18499K3938p745A84625M583a8055k19767A29855l8576J9638
$$ 164437 -114344 -232843 -208905 -216650 184625 189208 -18055 -237822 129855 91279 110917
18086A10917b32524J12121L5466m05649b35447h9249j65359N9861h5710A1293
$$ 110917 -232524 -120403 -84937 -490586 -235447 -89249 -254608 -194747 -85710 11293
18075b04917q5652a33964A73262Q3295b0529j7045B53468d0733j46921f8235K7756
$$ -204917 -290569 -133964 173262 256557 -20529 -37574 253468 -40733 -187654 -68235 -40479
18064d0479j98297F7857k1478J06591a53716d6532H1665l9840P8823O6867a25105
$$ -40479 -238776 67857 46379 152970 -153716 -46532 81665 41825 120648 187515 -125105
18052F7412J22828a36302B39314b3681g361C27808B0471a24988C20587b17970
$$ 67412 190240 -136302 239314 -23681 -7361 327808 20471 -124988 320587 -217970
18041b94602O1657A72617f2570A26575a3898r7856K1501j18006j84432A78188
$$ -294602 -232945 172617 -62570 126575 -13898 -111754 -90253 -208259 -392691 178188
18030b48857J11689C001P9534o610c210k03632C2048N6957N6577J76197f4166
$$ -248857 -137168 3001 82535 75925 -3210 -206842 32048 89005 145582 321779 -64166
18018a4841j66119Q4458l36972A20243a54298a0957j52592A51248J41329b18227
$$ -14841 -180960 -96502 -433474 120243 -154298 -10957 -163549 151248 292577 -218227
18007A4832M619K16840f6682D74753b0147j10380A13726E395a75088A91318a21481
$$ 14832 19451 236291 -66682 474753 -20147 -130527 113726 5395 -175088 191318 -121481
17995d9602r63A53133A2712b108H0236A6368J55294A4502a51143b5212j7188O166
$$ -49602 -50565 153133 12712 -2108 80236 16368 171662 14502 -151143 -25212 -42400 -36234
17983c6234j47471G1537A3966i0934j29378a06980F9075c1026H0121c02591B11057
$$ -36234 -183705 71537 13966 -90934 -220312 -106980 69075 -31026 80121 -302591 211057
17971H9925A2076Q5605b07444C8434J62059a8320j96469G7526K1510L0274c8723
$$ 89925 12076 97681 -207444 38434 200493 -18320 -214789 77526 99036 129310 -38723
17959a17003F7019a02529o1274o569P5839m9265L1863c7226A50999m2628b455
$$ -117003 67019 -102529 -163803 -170372 -94533 -143798 -111935 -37226 150999 108371 -2455
17947e9730H2467J86212D9688a43603e386D10355d798n2320r4351H0639i3624
$$ -59730 82467 268679 49688 -143603 -5386 410355 -4798 -57118 -151469 80639 -93624
17935a49993g3830n3091A89696j2758a07822n2512B51474L903H9481R8503i4019
$$ -149993 -73830 -126921 189696 176938 -107822 -160334 251474 255377 89481 187984 -94019
17923b56825e8008a6437l05676g5997D0579N0362j270g7471D3044a80429I7536
$$ -256825 -58008 -16437 -322113 -75997 40579 90941 89671 -77471 43044 -180429 97536
17911d5499q8309J6388B2170b32107I0069f0383G5523d1341j20230C68446c37508
$$ -45499 -133808 -117420 22170 -232107 90069 -60383 75523 -41341 -161571 368446 -337508
17899E2952J23976a19181E8838L706Q579L4925a9495D7463j2318b20277N9717
$$ 52952 176928 -119181 58838 62544 71123 106048 -19495 47463 35145 -220277 -160560
17888a60560A27434a68041j84290g2882B48327i9291j19856F1030a0320A03897
$$ -160560 127434 -168041 -352331 -72882 248327 -99291 -219147 61030 -10320 103897
17877B2578J23606D9332c02946a9492B35788d4003o5398m378k7955N0593B51604
$$ 22578 146184 49332 -302946 -19492 235788 -44003 -109401 -113779 -141734 -91141 251604
17865B6573B225L6292b15956a2813j26123n5358H3184B0614K37332c1688B35841
$$ 26573 2225 38517 -215956 -12813 -138936 -194294 83184 20614 257946 -31688 235841
17853A34965C4697b7339j52688j3131O7788A77188c9977A17799K43289h9167j4289
$$ 134965 34697 -27339 -180027 -193158 -125370 177188 -39977 117799 361088 -89167 -103456
17842a03456b1447j20663M9486C2287d3282A30394J19396l6819E531c75385b4934
$$ -103456 -21447 -142110 -92624 32287 -43282 130394 249790 212971 5531 -375385 -24934
17830A58419C8379a30923A07441B8209c8118p3779H2310Q250c9046k32498A7740
$$ 158419 38379 -130923 107441 28209 -38118 -111897 82310 90560 -39046 -271544 17740
17818a66121M8944H6607b92460a43085d7106J6359k14604B06323D1999N3869Q6575
$$ -166121 -117177 86607 -292460 -143085 -47106 -30747 -245351 206323 41999 95868 182443
17807A82443p8030a52448C42780j9467C6563b223A04054N7226B5074e5371A54541
$$ 182443 104413 -152448 342780 323313 36563 -2223 104054 161280 25074 -55371 154541
17795B82839A33465J41663b75098A18384a07970A58054b9675A32551b75866h9108
$$ 282839 133465 275128 -275098 118384 -107970 158054 -29675 132551 -275866 -89108
17784B52913b80891A03762K96386b603j81988c7101A7784a51818b3217A97700
$$ 252913 -280891 103762 400148 -2603 -184591 -37101 17784 -151818 -23217 197700
17773A85420b9586A81651E612P0390L9686c148j2518A07180J23807m7346i1808
$$ 185420 -29586 181651 5612 76002 115688 -3148 -15666 107180 230987 183641 -91808
17761C002b601j83921B25177F4064b69739L1986B57869g304A9877a20433A36034
$$ 3002 -2601 -186522 225177 64064 -269739 -237753 257869 -7304 19877 -120433 136034
17749B07602b50739a0934r2919C87804j60440p0089d9979E6005J57194b02400
$$ 207602 -250739 -10934 -103853 387804 227364 157275 -49979 56005 213199 -202400
17738H1452e0431l6596r0092q0717d8282a0206C03067a27168H2544L2628g5612
$$ 81452 -50431 -87027 -177119 -257836 -48282 -10206 303067 -127168 82544 115172 -75612
17726A23189C3699e3510A34660R0339g194B72051A04801l2913e5191E2530h7990
$$ 123189 33699 -53510 134660 224999 -7194 272051 104801 71888 -55191 52530 -87990
17714b50334J23669K2160B89382c6703I8244j6460e05174i0755n8794K3220H7662
$$ -250334 -126665 -104505 289382 -36703 98244 81784 -505174 -90755 -149549 -126329 87662
17702H3284b38150A49696R7348D5569a19623L2231C13060E9298j0021b3890B20488
$$ 83284 -238150 149696 247044 45569 -119623 -87392 313060 59298 49277 -23890 220488
17690H0379R724J03785a2170p2147B4209K45707F5688d6189n6701l9058B98541
$$ 80379 90103 193888 -12170 -84317 24209 269916 65688 -46189 -102890 -141948 298541
17678B04019c6296A47045a72711A17061a42007m4643B62934a29882j10340J13873
$$ 204019 -36296 147045 -172711 117061 -142007 -186650 262934 -129882 -240222 -126349
17668a26349j62081a22741I7906L8105j6969d9366A49589K61172A35812a6153
$$ -126349 -288430 -122741 97906 136011 119042 -49366 149589 410761 135812 -16153
17657b38721f7768r2061M520B35474a0614A16779K03583j03293c5262o9080C29577
$$ -238721 -67768 -159829 -155309 235474 -10614 116779 320362 217069 -35262 -104342 329577
17645H7521M3476J83913a01409H5331B288J78661J18109A32332K325J46703a75200
$$ 87521 130997 314910 -101409 85331 2288 180949 299058 132332 134657 281360 -175200
17633B39290C8353J79745b84121G0559J25904D2877a03874I2500J852k4249e9870
$$ 239290 38353 218098 -284121 70559 196463 42877 -103874 92500 94352 70103 -59870
17621g5217c3424C27786e5557j8296q6529C74390l2014l7251D2988R3238b36354
$$ -75217 -33424 327786 -55557 -73853 -160382 374390 342376 305125 42988 136226 -236354
17609C0574i694A12330J26632d9059A83442K0061D3071N6040a07643d6057A76486
$$ 30574 -9694 112330 238962 -49059 183442 203503 43071 99111 -107643 -46057 176486
17597B01668L919A00287a42354j81681B83720e8554A43256J1314d1859p6234B41974
$$ 201668 205587 100287 -142354 -324035 283720 -58554 143256 154570 -41859 -118093 241974
17585E0492b62119g3883A55120c0741A8661J21828R9997a77273M2115A66802a33497
$$ 50492 -262119 -73883 155120 -30741 18661 140489 240486 -177273 -135158 166802 -133497
17573F0901j5169J12412C6815E541J49879Q7575e9481B88908A36640K25502D3662
$$ 60901 45732 158144 36815 5541 155420 242995 -59481 288908 136640 362142 43662
17561A02915J23257b63169A31810L39352b030A36465d1869B03927O3328i769G6893
$$ 102915 226172 -263169 131810 471162 -2030 136465 -41869 203927 267255 -9769 76893
17549I9440i0099a0012m402C91368i45j35642B90574f4171D5091i5156j04615
$$ 99440 -90099 -10012 -14414 391368 -945 -136587 290574 -64171 45091 -95156 -199771
17538a99771A61790K98617B07104A01425M9186K03775j37160N3750o5911k8161
$$ -199771 161790 460407 207104 101425 150611 354386 217226 270976 205065 176904
17528A76904D9586K25487A10821n4194a10045A13023l2135L9731a22107k0743
$$ 176904 49586 275073 110821 56627 -110045 113023 80888 120619 -122107 -142850
17518a42850c6513A71354l327L7861e9748A05457I845a47980f6799A35217k9168
$$ -142850 -36513 171354 168027 205888 -59748 105457 9845 -147980 -66799 135217 106049
17507A06049K68090F9129J73009B4920R7127k8159m1710J82786l2059D3810a62496
$$ 106049 374139 69129 242138 24920 122047 93888 52178 234964 202905 43810 -162496
17495E8108r905J79932L37366A6727J19607k3170M108J17799b05323C00798o3423
$$ 58108 48203 228135 565501 16727 136334 113164 117272 235071 -205323 300798 237375
17484B37375N1540A12375B8617R7117K64827a07637A19129M0485J43908o8034
$$ 237375 288915 112375 28617 125734 390561 -107637 119129 159614 303522 235488
17474B35488j0624M03212a05632C45321H4155N4573c4328C54609h1101F3358i1629
$$ 235488 224864 628076 -105632 345321 84155 138728 -34328 354609 -81101 63358 -91629
17462H0253L3575K03141A720P6874M0522l6037M7755K98735K16427B63575Q7929
$$ 80253 113828 316969 1720 78594 119116 83079 130834 429569 645996 263575 351504
17451C51504c8565H7063K7239L33723j46144H6104L84572A35037K4357J7297M9675
$$ 351504 -38565 87063 114302 448025 301881 86104 470676 135037 159394 176691 226366
17440B26366N4036J98674A70427L40962B07823o8146m2018N869L2931M2714L0847
$$ 226366 280402 479076 170427 511389 207823 139677 97659 103528 136459 179173 210020
17429B10020m6015L29249H7702j7730K55187M0014A6694L72496A37841J1589L32080
$$ 210020 164005 493254 87702 69972 325159 365173 16694 389190 137841 149430 481510
17418D81510E5768K59595K59636B16318J70189h0014A29555h3024A10611b30874
$$ 481510 55768 315363 574999 216318 386507 -80014 129555 -83024 110611 -230874
17407A90452j5289J3503K49592A21320b10279C42458j05278H023K50930A1226
$$ 190452 175163 188666 438258 121320 -210279 342458 237180 8023 258953 11226
17396B16510k4719a44291C84904J50807d6184C25745H1599a04222F0416J46285
$$ 216510 191791 -144291 384904 535711 -46184 325745 81599 -104222 60416 206701
17386B06701J25429J56454m4994A09043E2004L38720O598j42711a5179G150R5621
$$ 206701 332130 488584 443590 109043 52004 390724 397322 254611 -15179 7150 102771
17375A02771M6773M269o4063Q7121H3091O9367L08320G0087O2845K05673j50052
$$ 102771 149544 153813 89750 176871 83091 152458 460778 70087 132932 338605 188553
17364A88553j6560a7615F2815J87512D9948L23493j79666R513p8588J51429j9670
$$ 188553 171993 -17615 62815 250327 49948 373441 193775 203288 124700 276129 256459
17353B56459h3742A45722o4497J48990C3641J52750L23424k41034j4150R1774
$$ 256459 -83742 145722 81225 230215 33641 186391 509815 268781 254631 346405
17343C46405F5923J09627K49637j13027l3380J37455F6107M9965J41456B8288
$$ 346405 65923 175550 425187 312160 278780 416235 66107 116072 257528 28288
17332G1878K02156A25224L55234b653p2239A04548i1092A35765J42530J20790
$$ 71878 274034 125224 480458 -2653 -74892 104548 -91092 135765 278295 399085
17322C99085A03383M78112a36369E6927K01476l6843R6139r6925J71605j54805
$$ 399085 103383 581495 -136369 56927 258403 221560 317699 220774 392379 237574
17312B37574A09089e5787B01638c3934A99864Q187R872j2626J7887F3889K89207
$$ 237574 109089 -55787 201638 -33934 199864 208051 217923 205297 223184 63889 353096
17301C53096C9539K4755O9907l317J25267J12639A20874N7112J89009E9919K65785
$$ 353096 39539 64294 134201 130884 256151 368790 120874 177986 366995 59919 325704
17290C25704l2898q5883M41588B34431k6403L0728C5413K51804O8835K9210n2230
$$ 325704 292806 206923 648511 234431 208028 238756 35413 287217 356052 385262 333032
17279C33032q8901q2458J35025R8737A09787m1489J01597J52580A41653i936A29443
$$ 333032 244131 161673 296698 395435 109787 68298 169895 322475 141653 -9936 129443
17267B84344j11425D4251Q4444J10819k3385P2089d2638E13963k51140K18420
$$ 284344 172919 44251 128695 239514 216129 288218 -42638 513963 262823 481243
17257D81243j53465K6294j60154q6329K30783j45426J90157j76037F2301K47743
$$ 481243 327778 354072 193918 107589 338372 192946 383103 207066 62301 310044
17247C10044M1055A26348m3360O1495d3665A12594K13101j49707J06041K66940
$$ 310044 351099 126348 82988 144483 -43665 112594 325695 175988 282029 548969
17237E48969A06501J75119Q4743j79534G3584K38765E2722J46320j3176n712J07366
$$ 548969 106501 281620 366363 186829 73584 312349 52722 199042 185866 180154 287520
17226B87520j13154K43368B4963K90843G9331c6061C15053J14598A98801L6758
$$ 287520 174366 417734 24963 315806 79331 -36061 315053 429651 198801 235559
17216B35559J50359A77652b619B94747j36249R044J91383L6772J36569A69295
$$ 235559 385918 177652 -2619 294747 158498 167542 358925 395697 532266 169295
17205D11126j05892J28943A91297A5146Q1905K78312O6908p2813j17625K30641
$$ 411126 305234 434177 191297 15146 97051 375363 442271 369458 251833 482474
17195D82474j31222m5441k0410A32935M1427M37507j01308A43007K7507Q4189
$$ 482474 351252 305811 285401 132935 174362 611869 510561 143007 170514 254703
17185B54703q353K52045j11552K55523B96478H6659K28177K94841A26313L82719
$$ 254703 246350 498395 386843 642366 296478 86659 314836 609677 126313 509032
17175E09032J60551A39685L24021m5029l9343A43681J15411K15968q6665A69542
$$ 509032 669583 139685 463706 418677 379334 143681 259092 475060 388395 169542
17164C71509J9393A22372L48204o7131n8241K89247k39299L5692o6478J19473
$$ 371509 390902 122372 470576 403445 345204 634451 395152 430844 364366 483839
17154D83839A26825L06754j14527c9950A46248J48339K30474j52710J72792k31869
$$ 483839 126825 433579 319052 -39950 146248 294587 525061 372351 545143 313274
17144C13274R8857q9677J39279Q4981j30385K7572J29348k32424A21847K85339
$$ 313274 412131 322454 461733 546714 416329 443901 573249 340825 121847 407186
17134D07186Q0498N1964k9367J38883C13251L9299J40188A38857J76831j2803
$$ 407186 487684 539648 510281 649164 313251 352550 492738 138857 315688 302885
17124C02885J67306j76751M22356B03827G9433L37712L21729l50110A81980K74580
$$ 302885 470191 293440 715796 203827 79433 417145 738874 388764 181980 456560
17114D56560r5663K04925P4716p5505j43963j42440A6607M42836R1228J32619
$$ 456560 360897 565822 640538 565033 421070 278630 16607 459443 550671 683290
17104F83290j61328O2947l8327j71868R6250A01962N84949Q4337m2344C13593
$$ 683290 521962 584909 546582 374714 470964 101962 686911 771248 728904 313593
17093D71216N22517m81998l3699l4481l6194J31928J61576C38216K24726K86753
$$ 471216 993733 511735 478036 443555 407361 539289 700865 338216 562942 849695
17083H49695l81567J7388J14458O0566j19085J8077k3434J85767G9839M94705
$$ 849695 468128 485516 599974 660540 541455 559532 536098 721865 79839 574544
17073E74544p1904J83726m2157j42905N0939r5871J73696j62491L14537C07250
$$ 574544 502640 686366 644209 501304 552243 456372 630068 467577 782114 307250
17062F48292O5238J16995j41180k62766L09139k01259p1831J09154K09145k60906
$$ 648292 713530 830525 689345 426579 735718 534459 462628 571782 780927 520021
17052E20021L16401m01647J96755K61136m23034L21683r5493m3795M3619j9135
$$ 520021 836422 434775 631530 892666 469632 791315 695822 652027 695646 676511
17042F76511l15657J58867K92747J71071r4416m07919j42530N49505O2952l72728
$$ 676511 360854 519721 812468 983539 889123 481204 338674 888179 951131 578403
17032E78403L31847l62671K37141M1898o2658l2446j42595L27938j10908q0713
$$ 578403 910250 547579 784720 826618 763960 731514 588919 916857 805949 725236
17022G25236j36002L01068k03987J42376J20523j52406J33413j68768j1730M15236
$$ 725236 589234 890302 686315 828691 949214 796808 930221 761453 749723 1164959
17012A164959n33487l7368J87364J88200o7099M3175L2408P6209J4036m40123
$$ 1164959 631472 594104 781468 969668 902569 945744 978152 1054361 1068397 628274
17002F28274K55436j65856J37638p658k4255L51563j78403l55944K41672J52776
$$ 628274 883710 717854 855492 847834 823579 1175142 996739 640795 882467 1035243
16992A035243n04280N91094o9079j05949O0883j13972j19438L0444l5117L86572
$$ 1035243 530963 1122057 1052978 947029 1007912 893940 774502 804946 769829 1156401
16982A156401p5620j07334j32402J68537j35082K63657j94833L1604J94991j3221
$$ 1156401 1080781 973447 841045 1009582 874500 1138157 943324 974928 1169919 1156698
16972A156698j06814J32655l67097K02954K79666l0906l3650k95984O7143J45917
$$ 1156698 1049884 1182539 815442 1018396 1298062 1267156 1233506 937522 1004665 1150582
16962A150582N7843j47737K74406O3700n8865n8887R7698l30673K90041j47613
$$ 1150582 1208425 1060688 1335094 1398794 1339929 1281042 1378740 1048067 1338108 1190495
16952A190495L10261m63277M47685j30066n05343P19150k07002k17962L76464
$$ 1190495 1500756 1037479 1485164 1355098 849755 1568905 1361903 1143941 1520405
16943A520405L9174Q0652k94879J41219J57975k81707K95782l76490K55288k48786
$$ 1520405 1559579 1640231 1345352 1486571 1644546 1362839 1658621 1282131 1537419 1288633
16933A288633J93180k07258K70457r9039R9561j18212R7285J50606M3165l98436
$$ 1288633 1481813 1274555 1545012 1445973 1545534 1427322 1524607 1675213 1718378 1319942
16923A319942K75197m4620K53160J42223P9640l76650K43426o9406j19658j98070
$$ 1319942 1595139 1550519 1803679 1945902 2025542 1648892 1892318 1822912 1703254 1505184
16913A505184M35650j92509P6305J51101j08556K42480j20811J78033j82253J1957
$$ 1505184 1940834 1748325 1824630 1975731 1867175 2109655 1988844 2166877 1984624 1996581
16903A996581p588K35257J25427l85468R2389J34066k18144J03471J03533j31807
$$ 1996581 1988993 2224250 2349677 1964209 2056598 2190664 1972520 2075991 2179524 2047717
16893B047717j1938K98108j28520O1060n0730k8022K26109j38719L5656J35359
$$ 2047717 2035779 2333887 2205367 2266427 2215697 2187675 2413784 2275065 2310721 2446080
16883B446080L29901k29434K04206p327k63912O0612J06540N7471p2601L00476
$$ 2446080 2775981 2546547 2750753 2743426 2479514 2540126 2646666 2704137 2631536 2932012
16873B932012J20006j12992j34309K09127m97235P15083j67926k63719J79215
$$ 2932012 3052018 2939026 2804717 3013844 2516609 3231692 3063766 2800047 2979262
16864B979262o6576M0187M71717n50670K67885p913O9422M08590m17337J98947
$$ 2979262 2912686 2952873 3424590 2873920 3141805 3133892 3203314 3611904 3194567 3393514
16854C393514J11421k09978K98601L21849j90443L1477N0031m7549N3457L57307
$$ 3393514 3504935 3294957 3593558 3915407 3724964 3756441 3806472 3758923 3812380 4169687
16844D169687J2560K56368p0277k04625j05418J22716L74618K33270k49815J79151
$$ 4169687 4182247 4438615 4368338 4163713 4058295 4181011 4555629 4788899 4539084 4718235
16834D718235M596P6502J37608j3649R4593k9748j12281L28288J03545j05367
$$ 4718235 4722831 4799333 4936941 4923292 5017885 4988137 4875856 5204144 5307689 5202322
16824E202322L32892J24363J46629M6465J72070K09568k67402M06665k1192k2764
$$ 5202322 5535214 5659577 5806206 5852671 6024741 6234309 5966907 6373572 6352380 6329616
16814F329616M65596J69809m3865K84400k2295p7834K92383K87162Q1759M20383
$$ 6329616 6795212 6965021 6921156 7205556 7183261 7105427 7397810 7684972 7766731 8187114
16804H187114p0452J98010K1686M28110l9383Q6064M82532N2555J69605L93625
$$ 8187114 8116662 8314672 8336358 8764468 8725085 8811149 9293681 9346236 9515841 9909466
16794I909466o9233O72276K44453L477K95376M26494r590K15793P42048K71942
$$ 9909466 9840233 10512509 10756962 10760439 11055815 11482309 11472719 11688512 12430560 12702502
16784A2702502m660L57929M32587M32084O11333M19382J82074M80310K74827P10289
$$ 12702502 12697842 13055771 13488358 13920442 14531775 14951157 15133231 15613541 15888368 16598657
16774A6598657L00653M11349P00790P41858K70288R84513N88303N91726P16706
$$ 16598657 16899310 17310659 18011449 18753307 19023595 20008108 20596411 21188137 21904843
16765B1904843O33707Q33977Q67847R91520N51455J243741R57944J125531J165949
$$ 21904843 22538550 23372527 24240374 25231894 25783349 27027090 27985034 29110565 30276514
16756C0276514R81214J473939J595384J014649J835958J160299J785163J413260
$$ 30276514 31257728 32731667 34327051 35341700 37177658 38337957 40123120 41536380
16748D1536380K168351J740673K361297K246684K064035K577489K789685K752064
$$ 41536380 43704731 45445404 47806701 50053385 52117420 54694909 57484594 60236658
16740F0236658L022115L193842K891500L923515L523133M258450L999908M319150
$$ 60236658 63258773 66452615 69344115 73267630 76790763 81049213 85049121 89368271
16732H9368271M730063M608381M953255N306069N399719M994432N743480N248726
$$ 89368271 94098334 98706715 103659970 108966039 114365758 119360190 125103670 130352396
16724A30352396N421265N063952M944571M272663M268851L773587K796183K445940
$$ 130352396 135773661 140837613 145782184 150054847 154323698 158097285 160893468 163339408
16716A63339408J460340L01763j42533q02592k056833k452275l526060l990572
$$ 163339408 164799748 165101511 164958978 164156386 162099553 159647278 156121218 152130646
16708A52130646m235003m665878n407467n267926n319981n649003n672840n221603
$$ 152130646 147895643 143229765 137822298 132554372 127234391 121585388 115912548 110690945
16700A10690945n850479m488642n235002m817539m816267m365500m156063l914917
$$ 110690945 104840466 100351824 95116822 90299283 85483016 81117516 76961453 73046536
16692G3046536l585868l803313l137086l139038k941546k920025k428349k592415
$$ 73046536 69460668 65657355 62520269 59381231 56439685 53519660 51091311 48498896
16684D8498896k127136k132264k434192j812310j749418j543923j622432j518854
$$ 48498896 46371760 44239496 41805304 39992994 38243576 36699653 35077221 33558367
16676C3558367j307861j553140j109343j358001j153026r14416j018938q04522
$$ 33558367 32250506 30697366 29588023 28230022 27076996 26162580 25143642 24339120
16668B4339120q94968j062966p70949n35444r36672q05975n76836n53287q19545
$$ 24339120 23444152 22381186 21610237 21074793 20138121 19332146 18755310 18202023 17382478
16659A7382478o60092l42001p95683m15281k50667o22271k07957m52910p37304
$$ 17382478 16722386 16380385 15584702 15169421 14918754 14296483 14088526 13635616 12898312
16650A2898312l21102k16533j46851k39159n52611n67013l27789O870o4411n67900
$$ 12898312 12577210 12360677 12213826 11974667 11422056 10855043 10527254 10534124 10469713 9901813
16640I901813j68126l74261l13237j52448k61336l87204J3234l37760l4403j35182
$$ 9901813 9733687 9359426 9046189 8893741 8632405 8245201 8258435 7920675 7886272 7751090
16630G751090k78608p2932k00286m41867o8097p4015j63923j59435L1745j38859
$$ 7751090 7472482 7399550 7199264 6757397 6689300 6615285 6451362 6291927 6323672 6184813
16620F184813m94325N9938M244q8839m48462k62296k2985j46472M06217m54706
$$ 6184813 5690488 5750426 5754670 5665831 5217369 4955073 4932088 4785616 5191833 4737127
16610D737127K86263m08779l51930J69363r9285J68882j26184k43366M3528j66196
$$ 4737127 5023390 4614611 4262681 4432044 4332759 4501641 4375457 4132091 4175619 4009423
16600D009423k45467O3094j64391K53975j73874l08524K3824j55997L06018O8008
$$ 4009423 3763956 3827050 3662659 3916634 3742760 3434236 3458060 3302063 3608081 3676089
16590C676089l91424j70065Q1192K46122m40286N2189M8629l05744M9351P9644
$$ 3676089 3284665 3114600 3195792 3441914 3001628 3053817 3102446 2796702 2846053 2925697
16580B925697j79916K32351n87257N5352n3143L38888l25973K58183l69882L50606
$$ 2925697 2745781 2978132 2390875 2446227 2393084 2731972 2405999 2664182 2294300 2644906
16570B644906n83647M16499j33062l38672K66254K09681k73743j24411K96269
$$ 2644906 2061259 2477758 2344696 2006024 2272278 2481959 2208216 2083805 2380074
16561B380074j92832k64064L7727p0644r0560K50738R629k17978k70244J61876
$$ 2380074 2187242 1923178 1960905 1890261 1799701 2050439 2060068 1842090 1571846 1733722
16551A733722K17168k89380R4810j7856j73050J26472N3498J07141k13820j89365
$$ 1733722 1950890 1661510 1756320 1738464 1565414 1691886 1745384 1852525 1638705 1449340
16541A449340J23371K41542k38558j41006k19527L63459j29861k3936J72520j59650
$$ 1449340 1572711 1814253 1575695 1434689 1215162 1578621 1448760 1424824 1597344 1437694
16531A437694Q7498j26905j7985l55026J75876N8426k14819J68142L73521k81101
$$ 1437694 1525192 1398287 1380302 1025276 1201152 1259578 1044759 1212901 1586422 1305321
16521A305321M5472M8302K30673G33271M13000k68790P3495J27452J57058k38634
$$ 1305321 1350793 1399095 1629768 733271 1146271 877481 950976 1078428 1235486 996852
16511I96852K64100j73339j15365P3232j33451J37365j95427K19348J27909L8191
$$ 996852 1260952 1087613 972248 1045480 912029 1049394 853967 1073315 1201224 1239415
16501A239415l17357L102m5844J75117k70902M40739k98725j65709J98381n7302
$$ 1239415 922058 925160 879316 1054433 783531 1224270 925545 759836 958217 900915
16491I00915P3113O3122j38113k34860K18920n0880j12035J15671k93803K64524
$$ 900915 974028 1037150 899037 664177 883097 832217 720182 835853 542050 806574
16481H06574N7184n8012j199l30968K36978K68374j41437k86083n1465P9202n2041
$$ 806574 863758 805746 804547 473579 710557 978931 837494 551411 499946 579148 527107
16470E27107Q2226q1849J32490J70101J02925l54774K87967j40566J7604l3765
$$ 527107 609333 527484 659974 830075 933000 578226 866193 725627 743231 709466
16460G09466P3963J41236k96981A41411K39640m83J40721K76012j62353j64022
$$ 709466 783429 924665 627684 141411 381051 380568 521289 797301 634948 470926
16450D70926L1440K45963j65158J6652k97617K00465L8166p4444j53365J37539
$$ 470926 502366 748329 583171 599823 302206 502671 540837 466393 313028 450567
16440D50567j9186A83997L78767k00792J12095J93711j36641j56933m8663K56766
$$ 450567 431381 183997 562764 361972 474067 667778 531137 374204 325541 582307
16430E82307J28420j53050j69683J04975r8824q0728L79767B82963K86117A59920
$$ 582307 710727 557677 387994 492969 394145 313417 693184 282963 569080 159920
16419D92718j74999J7054K73175k60132n3419M9015L2532J48495k26561m0540
$$ 492718 317719 334773 607948 347816 294397 343412 375944 524439 297878 257338
16409B57338L24331k65477j3596L66903B75779P1664N204o7731J71875j65316
$$ 257338 581669 316192 302596 669499 275779 347443 352647 284916 456791 291475
16399B91475K24913E3452N18392B42147L70348A08385L50740j26450n3745I9306
$$ 291475 516388 53452 571844 242147 612495 108385 459125 332675 278930 99306
16388H4883L67368j96749R07O4817J65374D4122J3407K93366H2354K02914j15091
$$ 84883 452251 255502 256409 321226 486600 44122 57529 350895 82354 285268 170177
16377A70177L30066A26957J07037k1266M36225k72211o3450D0049L60659f8893
$$ 170177 500243 126957 233994 212728 648953 376742 313292 40049 400708 -68893
16366B94057P1011A79541J05613m7532K02480B0906J86496M35814A65016l552
$$ 294057 365068 179541 285154 237622 440102 20906 207402 643216 165016 161464
16356A61464k999B7356J923G338O3508J85173j04597K1424R057c9145C53747a5468
$$ 161464 158465 27356 29279 7338 70846 256019 151422 172846 181903 -39145 353747 -15468
16343B00971J88094j77700G4117h1238a1047C62736q5350j13564n8620B0252k870
$$ 200971 389065 211365 74117 -81238 -11047 362736 277386 163822 105202 20252 17382
16332A7382J31287j8783O9006l9649m4905K6984B5343K77590L5661a52620E55346
$$ 17382 148669 129886 198892 159243 114338 141322 25343 302933 338594 -152620 555346
16320I165M06291B03984n4837K270J9938M8985K9241j09191m8544J55714r9755
$$ 9165 415456 203984 149147 151417 171355 220340 249581 140390 91846 247560 147805
16309A47805k1331L3064K16028j00933j33769R5050K52517a79512I0979d3434
$$ 147805 126474 159538 375566 274633 140864 235914 488431 -179512 90979 -43434
16298B54257b3434D62695B14360r0044m4702l979a5866B83229o6832h3131A14176
$$ 254257 -23434 462695 214360 124316 79614 75635 -15866 283229 216397 -83131 114176
16286D45078A85985o2805K22541n6431b4005F4991L43221E7605f7644B96097f0836
$$ 445078 185985 123180 345721 289290 -24005 64991 408212 57605 -67644 296097 -60836
16274A94280K28677A92017f9832j6739M2151B25770A6791g511A00655L1775K1700
$$ 194280 422957 192017 -69832 -86571 -44420 225770 16791 -7511 100655 132430 154130
16263A54130M7732J92263f9724C8034a41547A61052J21761a74177B41902o4968
$$ 154130 201862 394125 -69724 38034 -141547 161052 282813 -174177 241902 176934
16253A76934J1094I2366K75166j12813I2059J9858C6396L00932b46749d1162I1669
$$ 176934 188028 92366 367532 254719 92059 111917 36396 337328 -246749 -41162 91669
16241H2836L26000j65356e2005C12516g0795B85406H3769P9914D8819O2178n4475
$$ 82836 408836 243480 -52005 312516 -70795 285406 83769 163683 48819 110997 56522
16230E6522a8233B92386H2867b9760A97464p1102L9874l6985K5068j5759J15656
$$ 56522 -18233 292386 82867 -29760 197464 126362 166236 129251 154319 138560 254216
16219B54216c170B13155d573A89192a79172j88452A39901a25406A83406K972b17575
$$ 254216 -3170 213155 -4573 189192 -179172 -367624 139901 -125406 183406 186378 -217575
16207a06460n7981b9851l34609a42262a8028A16558L8961d3231B0013M3639J96855
$$ -106460 -164441 -29851 -364460 -142262 -18028 116558 155519 -43231 20013 63652 260507
16196B60507B9188J20329b7518j29329K7547I2823a10810D4527a95454A22476
$$ 260507 29188 149517 -27518 -156847 -129300 92823 -110810 44527 -195454 122476
16185C4778g927q942J667A09543a5158C2325i3066B15169d7977B4640b9807k5481
$$ 34778 -7927 -16869 -15202 109543 -15158 32325 -93066 215169 -47977 24640 -29807 -55288
16173e5288j60238D09702a35632A55471b06942B5656a91725D95072A11162D3420
$$ -55288 -215526 409702 -135632 155471 -206942 25656 -191725 495072 111162 43420
16162b96805D26309a63486A07848L38432c45764B39957a28451A04050e4193k2932
$$ -296805 426309 -163486 107848 446280 -345764 239957 -128451 104050 -54193 -77125
16152g7125L5407k65744a17229p1141c1510k5620l2730j59734J04960C8225J38289
$$ -77125 -41718 -307462 -117229 -188370 -31510 -57130 -89860 -249594 -144634 38225 176514
16141A76514J29481f0271r0338O8133a2031o484G2232b8164l7541C39725m0442
$$ 176514 305995 -60271 -150609 -82476 -12031 -18515 72232 -28164 -65705 339725 299283
16130B99283A4662N2145b8471A03189c6777j35142B85087A19807g705D2444a16656
$$ 299283 14662 66807 -28471 103189 -36777 -171919 285087 119807 -7705 42444 -116656
16118b7196C9910e3663A04505L8924n5572b1668j13442A43889o3141J56644c7567
$$ -27196 39910 -53663 104505 143429 87857 -21668 -135110 143889 80748 237392 -37567
16106C6669J81755i5472p2017c4414h48A17779b0655a0023F8894a31571A24772
$$ 36669 218424 -95472 -167489 -34414 -848 117779 -20655 -10023 68894 -131571 124772
16094B71275a71701B26060F1191k6784a66181K6840A75245f6155G4145b69099
$$ 271275 -171701 226060 61191 34407 -166181 -139341 175245 -66155 74145 -269099
16083F2702a58764d5310m1647m0491A0257c81941B30784c29306a61642F0853J3096
$$ 62702 -158764 -45310 -86957 -127448 10257 -381941 230784 -329306 -161642 60853 73949
16072G3949K08999b68891A44393a4946q9597A05745A4542J37146b30798b8888
$$ 73949 282948 -268891 144393 -14946 -104543 105745 14542 151688 -230798 -28888
16061H2868b39153e751l9093B76191B0692J25892c3748j41993H476Q69L43821
$$ 82868 -239153 -5751 -44844 276191 20692 146584 -33748 -175741 8476 9345 353166
16050C53166d8472A07180d7811a7230p1838I3894l9788b43966A84777E2875J20980
$$ 353166 -48472 107180 -47811 -17230 -89068 93894 54106 -243966 184777 52875 173855
16039A73855d1430A27469h521n7137B11635M7344K166A17738C8373a23835j6505
$$ 173855 -41430 127469 -8521 -65658 211635 258979 261145 117738 38373 -123835 -140340
16028a40340A95314a44931j46520d6509K2836k20811C1726h1348r2754d9388C8669
$$ -140340 195314 -144931 -291451 -46509 -23673 -244484 31726 -81348 -174102 -49388 38669
16016F6762a3204j54217C7074J32181M612a20534B3868f3179B57032A10181d41899
$$ 66762 -13204 -167421 37074 169255 173867 -120534 23868 -63179 257032 110181 -441899
16004G8833k7898b92733D3322d22337a92752m6790n1185E23027D0821f076j29145
$$ 78833 50935 -292733 43322 -422337 -192752 -239542 -290727 523027 40821 -6076 -135221
15993a35221C3161c08464A07074E2540Q9220g4815G3916L43188j663J7121J9305
$$ -135221 33161 -308464 107074 52540 141760 -74815 73916 417104 415441 432562 451867
15982D51867L6503A88743K0123f479r0973B5219L834a93182i0109C95093q9325
$$ 451867 488370 188743 208866 -6479 -97452 25219 29053 -193182 -90109 395093 305768
15971C05768D8148b33299I8799J0661J6361a65683k46112D4934Q552a03922M4964
$$ 305768 48148 -233299 98799 109460 125821 -165683 -411795 44934 53486 -103922 -58958
15960e8958I023b14896B66955a62100j74719J20430N2472O0688G771a38501B87036
$$ -58958 9023 -214896 266955 -162100 -336819 -216389 -163917 -103229 7771 -138501 287036
15948A30967A9077i7451C16224k8809a95471g4628b8694o1544j8740a057k9122
$$ 130967 19077 -97451 316224 287415 -195471 -74628 -28694 -90238 -108978 -1057 -30179
15937c0179A05893f0423I0545b33483d9343j13448A177a35388k03093d5537j85345
$$ -30179 105893 -60423 90545 -233483 -49343 -162791 1177 -135388 -338481 -45537 -230882
15926b30882h5473B55310e6443B25997B3433c12920a47128O0150A25644a20079
$$ -230882 -85473 255310 -56443 225997 23433 -312920 -147128 -86978 125644 -120079
15915a79193A12636m7487K85040A9844K21837G4724B5069M5729K11564a2480I880
$$ -179193 112636 65149 350189 19844 241681 74724 25069 70798 282362 -12480 9880
15903A47866c81466a10739d0371A50053a68502K0488D554d13579F2168J18320
$$ 147866 -381466 -110739 -40371 150053 -168502 -148014 4554 -413579 62168 180488
15893A80488a40091I6264f09C48045b22223B25816b71453B51925a78407H6910
$$ 180488 -140091 96264 -609 348045 -222223 225816 -271453 251925 -178407 86910
15882C1983N9784b09915j15242A74587D8439P9022a43515A85609d2746j99030
$$ 31983 91767 -209915 -325157 174587 48439 127461 -143515 185609 -42746 -241776
15872b41776C9026J28322A4231b46621A61065F3716a15065n4566k9572A72421
$$ -241776 39026 167348 14231 -246621 161065 63716 -115065 -169631 -199203 172421
15861C32469b2198j46851A51832a26371B05077b08339o7258A05880i9365k87963
$$ 332469 -22198 -169049 151832 -126371 205077 -208339 -275597 105880 -99365 -387328
15851c87328J20656o1524F2384d7923B8390c00148g9415A91134a13588B31295
$$ -387328 -266672 -328196 62384 -47923 28390 -300148 -79415 191134 -113588 231295
15840A30644c33093a32844A90621J32751C3156L1912e0627o842C288f2885B69814
$$ 130644 -333093 -132844 190621 323372 33156 65068 -50627 -57469 3288 -62885 269814
15828a75017A73611J93521b98543C80838B912c998A01645d1996F656a63017j01465
$$ -175017 173611 367132 -298543 380838 2912 -3998 101645 -41996 6656 -163017 -264482
15817b64482B5248J47425J5146A8920J0028a09797N4220k18209J28139B48541
$$ -264482 25248 172673 187819 18920 28948 -109797 -55577 -273786 -145647 248541
15806A13457J29942a44268A13060L83916b04156A92607a22807n1583M5228n3881
$$ 113457 243399 -144268 113060 496976 -204156 192607 -122807 -174390 -129162 -183043
15796a83043A37486P7298E3992b83145A46253Q7131O3479i1508k0789k33458i6646
$$ -183043 137486 214784 53992 -283145 146253 233384 296863 -91508 -112297 -345755 -96646
15784b10046g0292E1234J38416a45778c5114I8634m8645a89232h0370n5579G6401
$$ -210046 -70292 51234 189650 -145778 -35114 98634 49989 -189232 -80370 -135949 76401
15772F6021P0309f9454j59866f4256B18127A2236j703i0372o7442B9322D652d8873
$$ 66021 136330 -69454 -229320 -64256 218127 12236 10533 -90372 -157814 29322 4652 -48873
15759a41377M877I6159a22762j07793A19186p498K7612b6939l8774k50097d0761
$$ -141377 -136500 96159 -122762 -230555 119186 111688 139300 -26939 -65713 -315810 -40761
15747H6502L2319K54590a85622F169c70454d7953a0389p0169m2970I2504d57486
$$ 86502 118821 373411 -185622 6169 -370454 -47953 -10389 -80558 -123528 92504 -457486
15735i7740d7189B9446a68355O565C51021A15746k4677Q8738c01161A33695g4465
$$ -97740 -47189 29446 -168355 -161790 351021 115746 91069 179807 -301161 133695 -74465
15723a10944B10279A0700b99012P6034q6419J3360F6886K2041h05A46086o7002
$$ -110944 210279 10700 -299012 -222978 -309397 -296037 66886 88927 -805 146086 79084
15712G9084h0658I1048i4104D6395a59701B3252J30873A9872c21768J15558e8996
$$ 79084 -80658 91048 -94104 46395 -159701 23252 154125 19872 -321768 -206210 -58996
15700b76446L3890A98607a09744p9772C51563A54966c14086a5793j55124A70679
$$ -276446 -242556 198607 -109744 -189516 351563 154966 -314086 -15793 -170917 170679
15689A33011k1320D6742c01480A42115J24710h5278B8522h856j21067A63873b17793
$$ 133011 111691 46742 -301480 142115 266825 -85278 28522 -8856 -129923 163873 -217793
15677B23808r7914a46875j02629C04941A29849n4848a22402G3670a18399n0759
$$ 223808 125894 -146875 -249504 304941 129849 75001 -122402 73670 -118399 -169158
15667a69158j61d9907j4441G7890l5678q197a51730A30549e1995A31493a96418
$$ -169158 -169319 -49907 -64348 77890 42212 34015 -151730 130549 -51995 131493 -196418
15655c8388q3286I6513O98c23275G6438f6732B6275a86399E5686a89742A16108
$$ -38388 -121674 96513 97211 -323275 76438 -66732 26275 -186399 55686 -189742 116108
15643B36967i5525c3044E9586c89270D8979a42718A57333E5249b08085l35430
$$ 236967 -95525 -33044 59586 -389270 48979 -142718 157333 55249 -208085 -543515
15633e43515e5590H41d5739B97039a0708n5098C63209A37409A6041L1378K07291
$$ -543515 -55590 841 -45739 297039 -10708 -65806 363209 137409 16041 47419 254710
15622B54710d913j21551c9975A53693b7138J3082D5545a44988H3059C9377c92886
$$ 254710 -4913 -126464 -39975 153693 -27138 -14056 45545 -144988 83059 39377 -392886
15610g9867K6482B31573a92773j31902A0319M5870K14072A7466a08534k7986B04741
$$ -79867 -53385 231573 -192773 -324675 10319 56189 270261 17466 -108534 -136520 204741
15598C13282D8838b35212G0155a11344I693a13501A65831h6304n9426A66870e9808
$$ 313282 48838 -235212 70155 -111344 9693 -113501 165831 -86304 -145730 166870 -59808
15586B40940l9345c7178n9871H7933N1728c74776g8261A23619a70467A1248a03036
$$ 240940 201595 -37178 -97049 87933 139661 -374776 -78261 123619 -170467 11248 -103036
15574h5841D9289J16633a64563A64730B1722g1122j60170n1807a21332L5911A7445
$$ -85841 49289 165922 -164563 164730 21722 -71122 -231292 -283099 -121332 -85421 17445
15562A18378C8364J54148D5791a04175D6644J45306E3231a60827r2789B9934J31800
$$ 118378 38364 192512 45791 -104175 46644 191950 53231 -160827 -253616 29934 161734
15551A61734c0323m9790G7457R7804m1640A7460K8628Q6575g5017D3254b20778
$$ 161734 -30323 -80113 77457 175261 133621 17460 46088 132663 -75017 43254 -220778
15539A68897J29536I661K0708J50602G453h3841j58757e0135K2950o7098B50786
$$ 168897 298433 9661 30369 180971 7453 -83841 -242598 -50135 -27185 -94283 250786
15527C032J29108D3502j258b42133C2718c26789C69311a4913m63461e8508E979
$$ 3032 132140 43502 42244 -242133 32718 -326789 369311 -14913 -478374 -58508 5979
15515a34533B30576A1466L37387H0981K66930b86482E7409q502h6689A39597b082
$$ -134533 230576 11466 348853 80981 347911 -286482 57409 48907 -86689 139597 -2082
15503D34068c62449C44615c104o9499k91056A66711J18892p4597a94075R5064
$$ 434068 -362449 344615 -3104 -72603 -363659 166711 285603 211006 -194075 -99011
15493i9011K8805k26084B74106r9952K3054G402e9170j53278A99118a36885I1973
$$ -99011 -70206 -296290 274106 174154 197208 7402 -59170 -212448 199118 -136885 91973
15481a00305A6053J49215K89775k09766f1581A08577e8637A11661a107k0062B63054
$$ -100305 16053 165268 455043 245277 -61581 108577 -58637 111661 -1107 -21169 263054
15469d0830k4500A36398n6096c64944A60757b16114D36381G2520R2399b52013
$$ -40830 -65330 136398 80302 -364944 160757 -216114 436381 72520 164919 -252013
15458a77867D1513J09462K3044p7711m995a44736e1460q0497F6735A841J5973
$$ -177867 41513 150975 174019 96308 91313 -144736 -51460 -131957 66735 1841 17814
15447A7814K79228i77B71191b23560A60898G4525a09930B9987J74315j1405a05242
$$ 17814 297042 -977 271191 -223560 160898 74525 -109930 29987 204302 192897 -105242
15435i1630j17119B36141d12931a89655h274D5949r216g7078m3745c3010A09030
$$ -91630 -208749 236141 -412931 -189655 -8274 45949 36733 -77078 -120823 -33010 109030
15423a17226C4643b47214B67396b76486B443a36101A65102c3070A66180h0342
$$ -117226 34643 -247214 267396 -276486 2443 -136101 165102 -33070 166180 -80342
15412C0940J30910O532b22950c9498j2524b2417A43521o3443j5046g2298m1106
$$ 30940 161850 168382 -222950 -39498 -52022 -22417 143521 80078 65032 -72298 -113404
15401a13404n1068A41759a64771A7511K52377E682b9904A1775L5392a87361h0746
$$ -113404 -164472 141759 -164771 17511 269888 5682 -29904 11775 47167 -187361 -80746
15389e8523k7624a9740H8516A2284a64090b7910B20712A6766K8869K57537a36960
$$ -58523 -86147 -19740 88516 12284 -164090 -27910 220712 16766 45635 303172 -136960
15377b76926e8705B5956J2038a436A19216a96874A24519C0573P9582l3347C5715
$$ -276926 -58705 25956 37994 -1436 119216 -196874 124519 30573 110155 76808 35715
15365C1562a23021H2292Q0487j5509g2329B64879q5621F8172a89897B63757r6905
$$ 31562 -123021 82292 162779 147270 -72329 264879 179258 68172 -189897 263757 166852
15354A66852L5325a54825q6165A187f8966A11065e0333B33926A04325b65054H3696
$$ 166852 202177 -154825 -240990 1187 -68966 111065 -50333 233926 104325 -265054 83696
15342b40444a8307B43079n3682o4718A1840J46411j6995m4106f2028A61246b8660
$$ -240444 -18307 243079 189397 124679 11840 158251 141256 97150 -62028 161246 -28660
15330a5734A93214f7455A11667c5180C23098I779a61002j17058A73239q3111J6838
$$ -15734 193214 -67455 111667 -35180 323098 9779 -161002 -278060 173239 90128 106966
15319A06966b31378e0960B05223a54351C3849B333Q7082N5445B0451K17514D5215
$$ 106966 -231378 -50960 205223 -154351 33849 2333 89415 144860 20451 237965 45215
15307B48257b9075A55534j621K67278a34570B1577Q4686m7607J84713A10441g0907
$$ 248257 -29075 155534 153913 421191 -134570 21577 106263 58656 243369 110441 -70907
15295B44100j17206J69381d5002a5067B50573c32934A14633c4001A7843K1094
$$ 244100 126894 296275 -45002 -15067 250573 -332934 114633 -34001 17843 38937
15285C8937a774A27012J16405d7119j71827g5322G808a97823M0410B90451a33326
$$ 38937 -1774 127012 243417 -47119 -218946 -75322 7808 -197823 -157413 290451 -133326
15273a5178k21483A60981K97796F3074O5090F0414b96399a9190r0637j3367B45673
$$ -15178 -236661 160981 458777 63074 128164 60414 -296399 -19190 -109827 -123194 245673
15261c22091B97940a44801B80332r6376N6238j08411i5290j99987A57756i1587
$$ -322091 297940 -144801 280332 183956 240194 131783 -95290 -295277 157756 -91587
15250E32862M52940K04867j83975J00610Q9988C36132A65530n3804A7732a2938
$$ 532862 985802 1190669 1006694 1107304 1197292 336132 165530 111726 17732 -12938
15239C09545o7080q4761l7788K0872K2733A4567K01066D836J15737l6892K55732
$$ 309545 242465 157704 119916 140788 163521 14567 215633 4836 120573 83681 339413
15228C39413j12569q3246b03097B3238L04836I4757a04806D3861P2970J32082
$$ 339413 226844 143598 -203097 23238 328074 94757 -104806 43861 116831 248913
15218B48913J656j07390C2114j4618e2775C75022F9451K1933l5385b26348A54154
$$ 248913 250569 143179 32114 17496 -52775 375022 69451 91384 55999 -226348 154154
15206B0992a7317I6240J9400J86911c8607A4984J57769G2652L20606B1040N5777
$$ 20992 -17317 96240 115640 302551 -38607 14984 172753 72652 393258 21040 76817
15195G6817j940c1685A10858M7109K7829m8572C8948J06730k1653J79704a4227
$$ 76817 74877 -31685 110858 157967 185796 137224 38948 145678 124025 303729 -14227
15183h4997B0860L84514B8399n0J79080k3924J05718M7874E9244N5889J47479
$$ -84997 20860 405374 28399 28349 207429 183505 289223 337097 59244 115133 262612
15172B62612b01347d6196A61804O5422G986l969a96734A21393c49321J66218h9281
$$ 262612 -201347 -46196 161804 227226 7986 4017 -196734 121393 -349321 -183103 -89281
15160h883k27816D2532Q0827M1121Q280k882b34795D03272h6468H5888J4156c50283
$$ -8883 -236699 42532 123359 164480 172760 169878 -234795 403272 -86468 85888 100044 -350283
15147A7728M29197e9439A9283a70601I8854N9096n7111J63366Q6272o3492R9626
$$ 17728 446925 -59439 19283 -170601 98854 157950 100839 264205 350477 286985 386611
15136C86611j75702O9599G4869b6702j51282A24575a5972A87425e0439C40107
$$ 386611 210909 280508 74869 -26702 -177984 124575 -15972 187425 -50439 340107
15125D02722L6545A12109m8124L15808A51006p3040A9071J20056C596K94563e2205
$$ 402722 439267 112109 63985 379793 151006 77966 19071 139127 3596 298159 -52205
15113C09527j7082j18329a98063b0531A78417K7353l8169K6010K35603I4382J81676
$$ 309527 292445 174116 -198063 -20531 178417 205770 167601 193611 429214 94382 276058
15102B76058D1592J23350l2116J06847a88443b5255i408A04841J4297d3538A9585
$$ 276058 41592 164942 132826 239673 -188443 -25255 -9408 104841 119138 -43538 19585
15090c4238A73029N2440K580C3565L07599q0475a14646A85723J2307J12697J84698
$$ -34238 173029 225469 228049 33565 341164 260689 -114646 185723 198030 310727 495425
15079D95425i4820B04964n371g6556p0657B84176p0626K96415b07134i6681A90028
$$ 495425 -94820 204964 199593 -76556 -147213 284176 213550 509965 -207134 -96681 190028
15067A74723a19721A68598g643A51910a39185C56603c0207j20502b305G6742B3404
$$ 174723 -119721 168598 -7643 151910 -139185 356603 -30207 -150709 -2305 76742 23404
15055F0910K30026G1424O2459P8588a2830A03724J54847L1495E2924J85246J78116
$$ 60910 290936 71424 133883 212471 -12830 103724 258571 290066 52924 238170 416286
15044D16286j11742A40212J13253a01660A72843J80176A51711R6655k7664J12440
$$ 416286 304544 140212 253465 -101660 172843 353019 151711 248366 220702 333142
15034C33142A24842D0490A9743F688J32259q11L22668k15637Q5476i3643C12424
$$ 333142 124842 40490 19743 6688 138947 138136 460804 245167 330643 -93643 312424
15022B07471r8845K3518K63809r7456g575o9669B35379j095b1603A54214o811
$$ 207471 108626 132144 395953 298497 -7575 -77244 235379 234284 -21603 154214 147403
15011A47403f786l1233B82066a39946A91204H3412R2920l1685J58919j45213J3749
$$ 147403 -6786 -38019 282066 -139946 191204 83412 176332 144647 303566 158353 172102
15000A72102O0749f3715C1215Q6840J41525D3153L0940B7940N79832A47560J82149
$$ 172102 232851 -63715 31215 118055 259580 43153 74093 27940 607772 147560 329709
14989C29709E0129J33877J30624J6316K20775j65008L2095A300N17126k47464
$$ 329709 50129 184006 314630 330946 551721 386713 418808 1300 518426 270962
14979B70962B237K73245K7124j45986K04743k0113a15294B05445K18332A56933
$$ 270962 2237 275482 302606 156620 361363 341250 -115294 205445 423777 156933
14968B31895K77075A24562L9635L30162B44559j09585J70845q768r3340q9708
$$ 231895 508970 124562 164197 494359 244559 134974 305819 297051 203711 114003
14958A14003L46076B10297L22141j64910A75794J92432j49176G6877Q2698J50383
$$ 114003 460079 210297 532438 367528 175794 368226 219050 76877 159575 309958
14948C09958M6076m58A22295L9078J76743o6393K22381A81450L81466D7716M23622
$$ 309958 356034 355576 122295 161373 338116 271723 494104 181450 562916 47716 471338
14937D71338r562r2602e1733E54347k43063A38725O0308J2149K19832p6457A34194
$$ 471338 461776 369174 -51733 554347 311284 138725 199033 211182 431014 354557 134194
14925A63251C3872N04422l4747k47754l0438J39909G0529J76720J48855j05625
$$ 163251 33872 538294 503547 255793 225355 365264 70529 247249 396104 290479
14915B90479j32091M9107L08835p8384J55658k20249j25178q2789J68724J88717
$$ 290479 158388 207495 516330 437946 593604 373355 248177 165388 334112 522829
14905E22829j89181j42737l9940e4615A45333N99576C53175j0882j19971K30674
$$ 522829 333648 190911 150971 -54615 145333 744909 353175 342293 222322 452996
14895D52996M9751k41530Q0287p2110L38501C00665A13568K99619A71436L61293
$$ 452996 502747 261217 341504 269394 607895 300665 113568 413187 171436 532729
14885E32729r7117A9184i5083B7526L74789j13207L62489k98911m6726N0059j29668
$$ 532729 435612 19184 -95083 27526 402315 289108 651597 352686 305960 356019 226351
14874B26351J57184k5544L89023C73019P2386p3565K42767H2362K17881p1286
$$ 226351 383535 357991 747014 373019 445405 371840 614607 82362 300243 228957
14864B28957L61965j50226J12485k65752N3412A67457J86458L3558K23985k14863
$$ 228957 590922 440696 553181 287429 340841 167457 353915 387473 611458 396595
14854C96595j06784L60120R927j55774j00378k7196j22280J42646K63728B41230
$$ 396595 289811 649931 659858 504084 403706 376510 254230 396876 660604 241230
14843B89511M8832J88106K5337B72380A20569L13110L54J72613B71290K73879
$$ 289511 338343 526449 551786 272380 120569 433679 434033 606646 271290 545169
14833E45169n046l9997j03361K84439j57473r8866L02933j87320k4096J90713
$$ 545169 540123 500126 396765 681204 523731 424865 727798 540478 516382 707095
14823G07095C29464M58181j03960j43317r0187J09774B10881J76177K00533r693
$$ 707095 329464 787645 683685 540368 450181 559955 210881 387058 587591 577898
14813E77898k7647j59496L26416A92092l6964N55792r7088j72383j0545L03478
$$ 577898 550251 390755 717171 192092 155128 710920 613832 441449 430904 734382
14803G34382k54500m1439J16344j57951k0689J62069J05733j46788j74263J53683
$$ 734382 479882 438443 554787 396836 376147 538216 643949 497161 322898 476581
14793D76581J39271A9508J32978L18572P0395P9192p9094j29222J98458B76206
$$ 476581 615852 19508 152486 471058 541453 620645 541551 412329 610787 276206
14782G67773C22079J29076m6561J10621J35730k76592K18353M8753J30067k68403
$$ 767773 322079 451155 404594 515215 650945 374353 592706 641459 771526 503123
14772E03123J54621k20180o5376J88451M3147q9185J7611K59293j84786j05659
$$ 503123 657744 437564 372188 560639 603786 514601 532212 791505 606719 501060
14762E01060j52201K70335B47804J63352J40782B29806L75680m9159B26838K65869
$$ 501060 348859 619194 247804 411156 551938 229806 605486 556327 226838 492707
14752D92707K32943R3682l83529J73595A90419M69160m529q1121k06081K52449
$$ 492707 725650 819332 435803 609398 190419 659579 655050 573929 367848 620297
14742F20297O6441K0657k17137K18457l4913K6917J49247j07981M6063j17728
$$ 620297 686738 707395 490258 708715 673802 700719 849966 741985 788048 670320
14732F70320K40205k11665J41912j42927p4527q4154K15783J47360q0395j6320
$$ 670320 910525 698860 840772 697845 623318 539164 754947 902307 821912 805592
14722H05592L3368j32911j65784J89409R8929k44456J62585J74681l63235J21643
$$ 805592 838960 706049 540265 729674 828603 584147 746732 921413 558178 679821
14712F79821r4430M06748l59269q9493N64731E21196J97219J04219O7156K11052
$$ 679821 585391 992139 632870 543377 1108108 521196 718415 822634 889790 1100842
14702A100842l09376L1950O1585Q5341j9357j93763L29133l06756j66168O64681
$$ 1100842 791466 823416 885001 970342 950985 757222 1086355 779599 613431 1278112
14692A278112k93063l24464J99378L40143k24265j81513J12354M06878m82773
$$ 1278112 985049 660585 859963 1200106 975841 794328 906682 1313560 830787
14683H30787j5217p8695L71433o8788j50308O9015q7468K27030k59793M18856
$$ 830787 815570 736875 1108308 1039520 889212 958227 870759 1097789 837996 1256852
14673A256852k41962k4142r2987K55910k49927J58969m84665L37648K30416J68468
$$ 1256852 1014890 990748 897761 1153671 903744 1062713 578048 915696 1146112 1314580
14663A314580l16178j78364k5529K48787l84420K41414J73142j31009k3461n687
$$ 1314580 998402 820038 794509 1043296 658876 900290 1073432 942423 918962 913275
14653I13275J17712J51087k99926L69291p1922q3634K82139l74133J62845m17703
$$ 913275 1030987 1182074 882148 1251439 1179517 1095883 1378022 1003889 1166734 749031
14643G49031L60148m1667q0905N7104L14739Q6820l1352j07702l40886P882K79977
$$ 749031 1109179 1067512 986607 1043711 1358450 1445270 1413918 1306216 965330 973212 1253189
14632A253189J57240K2944R845j94915J53993j55032j01682K38950O2558k24605
$$ 1253189 1410429 1433373 1443218 1248303 1402296 1247264 1145582 1384532 1447090 1222485
14622A222485K64019k07206J23632j85891L51125P2910l18684M09739m68218J73817
$$ 1222485 1486504 1279298 1402930 1217039 1568164 1641074 1322390 1732129 1263911 1437728
14612A437728L9038j07891K21202j70160j89108M09194l01848o9845N1377K03234
$$ 1437728 1476766 1368875 1590077 1419917 1230809 1640003 1338155 1268310 1319687 1522921
14602A522921N7568m7229k80165J25919L10225J30899p3861j82852j01888L9168
$$ 1522921 1580489 1533260 1253095 1379014 1689239 1820138 1746277 1563425 1461537 1500705
14592A500705J53211j32805J51113j80019L1731J26969K990J54979j29144J70908
$$ 1500705 1653916 1521111 1672224 1492205 1523936 1650905 1653895 1808874 1679730 1850638
14582A850638J38239j01997k961k45414L02589N7960m0586L42579j47809j53239
$$ 1850638 1988877 1886880 1883919 1638505 1941094 1999054 1958468 2301047 2153238 1999999
14572A999999J2872j32999J44057j18028O81296j97190r2392k00690L09909j88355
$$ 1999999 2012871 1879872 2023929 1905901 2587197 2390007 2297615 2096925 2406834 2218479
14562B218479j12304K57318L44623R7799l54666K68775L86826o9696J3550o8679
$$ 2218479 2106175 2363493 2708116 2805915 2451249 2720024 3106850 3037154 3050704 2982025
14552B982025P34820L34584J207490K423387M407086J0356181K7955902j2094572
$$ 2982025 3716845 4051429 5258919 7682306 12089392 22445573 50401475 38306903
14544C8306903A4642459F065761k701681p56859m30528k80001K52520l29374K66880
$$ 38306903 14642459 6065761 3364080 2607221 2176693 1896692 2149212 1819838 2086718
14535B086718n4446k50003p5446L50334P2601j23667j28613j69495M01113l43819
$$ 2086718 2032272 1782269 1706823 2057157 2129758 2006091 1877478 1707983 2109096 1765277
14525A765277P59005n39871N76765l32114r7855J28134R7354k85491M44800j295
$$ 1765277 2524282 1984411 2561176 2229062 2131207 2259341 2356695 2071204 2516004 2514709
14515B514709J86042j73102R9271o8883N734j59902j61433O51335P990j22405
$$ 2514709 2700751 2527649 2626920 2558037 2563771 2403869 2242436 2893771 2901761 2779356
14505B779356M25468j54542o5401j85148O9642k5164M66161k7715k85777J28249
$$ 2779356 3204824 3050282 2984881 2799733 2869375 2844211 3310372 3282657 2996880 3125129
14495C125129m5538K48979k5357J9007J46893O8406p6078k89096J97114K11486
$$ 3125129 3079591 3328570 3303213 3322220 3469113 3537519 3461441 3172345 3369459 3580945
14485C580945k58940J3171L97627k97912P0825j1457K15096j50504R0122N4091
$$ 3580945 3322005 3335176 3732803 3434891 3505716 3494259 3709355 3558851 3648973 3703064
14475C703064R1309J94122m25423R2070O30933l38431L38119j60455P8483m39600
$$ 3703064 3794373 3988495 3563072 3655142 4286075 3947644 4285763 4125308 4203791 3764191
14465C764191O89182k97253R6754L44666k30269J76865o3183K95368k30979J92377
$$ 3764191 4453373 4156120 4252874 4597540 4367271 4544136 4480953 4776321 4545342 4737719
14455D737719j05593K34266k78522L24748q873L48891M6604J10383n39970P34587
$$ 4737719 4632126 4866392 4587870 4912618 4903745 5252636 5299240 5409623 4869653 5604240
14445E604240k73752J76968k524J41374J02476n8982m1289K62768J99276j54517
$$ 5604240 5330488 5507456 5504932 5646306 5748782 5689800 5648511 5911279 6110555 5956038
14435E956038q1645L27738L25020l53065R6396R6432K50087K43943J4220m7248
$$ 5956038 5874393 6202131 6527151 6174086 6270482 6366914 6617001 6860944 6875164 6827916
14425F827916N4637j06374M39482J06011j59167m7373L13974K94134p346J58375
$$ 6827916 6882553 6776179 7215661 7321672 7162505 7115132 7429106 7723240 7715894 7874269
14415G874269M9302K24686k35335P55813j03305m32063O69508k17911K13289J8264
$$ 7874269 7923571 8148257 7912922 8668735 8565430 8133367 8802875 8584964 8798253 8816517
14405H816517J77108N24019J40809l50427L00540K06799N46729k07968K00803
$$ 8816517 8993625 9517644 9658453 9308026 9608566 9815365 10362094 10154126 10354929
14396A0354929Q7775K86367J92041q2039M02731k7875K68535J15598L21337K99574
$$ 10354929 10442704 10729071 10921112 10839073 11241804 11213929 11482464 11598062 11919399 12218973
14386A2218973R3810L65385o7335L14943L77083J27943L38465R7626L58538L76809
$$ 12218973 12312783 12678168 12610833 12925776 13302859 13430802 13769267 13866893 14225431 14602240
14376A4602240K32367M61263m90M52180j9282P85499J88001J40495K89890M72397
$$ 14602240 14834607 15295870 15295380 15747560 15728278 16513777 16701778 16842273 17132163 17604560
14366A7604560J36910Q08088P3407L57396K66808P07136M38630R33420K94480
$$ 17604560 17741470 18549558 18622965 18980361 19247169 19954305 20392935 21326355 21620835
14357B1620835K30785M87071L43209O66302N42693P64357M79202K87899O14462
$$ 21620835 21851620 22338691 22681900 23348202 23890895 24655252 25134454 25422353 26036815
14348B6036815Q30472Q78519N17442O67274O76024Q38287J050728P48188J132927
$$ 26036815 26867287 27745806 28263248 28930522 29606546 30444833 31495561 32243749 33376676
14339C3376676O16075P58800J409635Q81907J245389R75122J301161Q60399J432029
$$ 33376676 33992751 34751551 36161186 37043093 38288482 39263604 40564765 41425164 42857193
14330D2857193J271427J606654J503106J413474J725884J375111J905744J719332
$$ 42857193 44128620 45735274 47238380 48651854 50377738 51752849 53658593 55377925
14322E5377925K044565J928329K432591K233274K263696K850259K183680K871156
$$ 55377925 57422490 59350819 61783410 64016684 66280380 69130639 71314319 74185475
14314G4185475K925655L162354L259584L385923L614758L911417L778036M772176
$$ 74185475 77111130 80273484 83533068 86918991 90533749 94445166 98223202 102995378
14306A02995378M432843M552879N415436N431014N867034O286684O275488P068155
$$ 102995378 107428221 111981100 117396536 122827550 128694584 134981268 141256756 148324911
14298A48324911P519257P538526Q623978Q616496R486818R992810J0603785J0682258
$$ 148324911 155844168 163382694 172006672 180623168 190109986 200102796 210706581 221388839
14290B21388839J1877725J2341609J2882261J3404608J3892822J4321710J4909725
$$ 221388839 233266564 245608173 258490434 271895042 285787864 300109574 315019299
14283C15019299J4939366J5402232J4966167J4802375J4195140J3559509J2551301
$$ 315019299 329958665 345360897 360327064 375129439 389324579 402884088 415435389
14276D15435389J1094419R472895O886310K171938l92195K9209R94672k505671
$$ 415435389 426529808 436002703 442889013 445060951 444668756 444697965 445692637 443186966
14268D43186966p935451m688487p382381q976460j1225458j2571937j3477438
$$ 443186966 435251515 430563028 423180647 414204187 402978729 390406792 376929354
14261C76929354j4433220j4510368j5176294j5481103j5235899j4238447j4094590
$$ 376929354 362496134 347985766 332809472 317328369 302092470 287854023 273759433
14254B73759433j3791328j3137783j2623576j1997956j1427627j0624483j0109246
$$ 273759433 259968105 246830322 234206746 222208790 210781163 200156680 190047434
14247A90047434r519120r047524q176938p782261p356444p253834o683226o119572
$$ 190047434 180528314 171480790 163303852 155521591 148165147 140911313 134228087 128108515
14239A28108515n978651m755417n396955n161115m463608m278646m262443l635285
$$ 128108515 122129864 117374447 111977492 106816377 102352769 98074123 93811680 90176395
14231I0176395k996731l733729l242964l272990k853517l015320k555568k445804
$$ 90176395 87179664 83445935 80202971 76929981 74076464 71061144 68505576 66059772
14223F6059772k328999k401298k021487j578998k149247j873142j982369j603202
$$ 66059772 63730773 61329475 59307988 57728990 55579743 53706601 51724232 50121030
14215E0121030j740310j067971j091199k180102r05777j415256j525274o83191
$$ 50121030 48380720 47312749 46221550 44041448 43135671 41720415 40195141 39511950
14207C9511950p08667j101067j512594j085199j170201p72740k96935p76456j010806
$$ 39511950 38803283 37702216 36189622 35104423 33934222 33161482 32864547 32088091 31077285
14198C1077285o73454j228961o67024o35204n73833o75283n89951q56172p43087
$$ 31077285 30403831 29174870 28507846 27872642 27298809 26623526 26033575 25177403 24434316
14189B4434316l57057o22724m23459n95127k79699o84149n22754k65692n81890
$$ 24434316 24077259 23454535 23031076 22435949 22156250 21472101 20949347 20683655 20101765
14180B0101765l03568m55999p01589o18509K47292n48705m10752n27021o45636
$$ 20101765 19798197 19342198 18640609 18022100 18269392 17720687 17309935 16782914 16137278
14171A6137278L18609l82793o38099K62922l67849p65902K95130q41197j90732
$$ 16137278 16455887 16073094 15434995 15697917 15330068 14564166 14859296 14018099 13827367
14162A3827367k3174j91295m92816p1827l58663K50397o33100o5711l52905M7199
$$ 13827367 13804193 13612898 13120082 13048255 12689592 12939989 12306889 12241178 11888273 11935472
14152A1935472j18492m00069j93029p682m39980l05415J23196n2232l76720m19262
$$ 11935472 11816980 11416911 11223882 11216200 10776220 10470805 10594001 10541769 10165049 9745787
14142I745787K96698n31560j5059J22524m2998k71434r1664m15296n7712m14374
$$ 9745787 10042485 9510925 9495866 9618390 9575392 9303958 9212294 8796998 8739286 8324912
14132H324912K83364j83354k54045K3733m64286J90939j9685l21567j96481l01056
$$ 8324912 8608276 8424922 8170877 8194610 7730324 7921263 7901578 7580011 7383530 7082474
14122G082474L07442j61520K31432m34967J26961j96350j83924j20375K2601m1350
$$ 7082474 7389916 7228396 7459828 7024861 7151822 6955472 6771548 6651173 6673774 6632424
14112F632424k57718J20743l97804J38313j08520r7274J28439l25623M4834k3368
$$ 6632424 6374706 6495449 6097645 6235958 6127438 6030164 6158603 5832980 5877814 5854446
14102E854446j64717J63723l22814j49545M7610J63029l97979j30275M22740N4088
$$ 5854446 5689729 5853452 5530638 5381093 5428703 5591732 5193753 5063478 5486218 5540306
14092E540306m30930J54238l16590j09489o9623Q9850j08952j16600K08574k94678
$$ 5540306 5109376 5263614 4947024 4837535 4767912 4857762 4748810 4632210 4840784 4546106
14082D546106K80681l97265k66347K72458j39283L7108j10618J1752j56916K7784
$$ 4546106 4826787 4429522 4163175 4435633 4296350 4333458 4222840 4234592 4077676 4105460
14072D105460M00636k91632o702j31041n2374j33785l37386K23917L64202o55109
$$ 4105460 4506096 4214464 4207762 4076721 4024347 3890562 3553176 3777093 4141295 3486186
14062C486186L70154o0009K70369o90789j70618M22776l59177k25311J19327K84445
$$ 3486186 3856340 3796331 4066700 3375911 3205293 3628069 3268892 3043581 3162908 3447353
14052C447353k34766J12977l25052M11850o3911l88163L94186n6484k52747l54490
$$ 3447353 3212587 3325564 3000512 3412362 3348451 2960288 3354474 3297990 3045243 2690753
14042B690753M04742j84255K92890k58661o9996J55524N6734n5809r5358j25208
$$ 2690753 3095495 2911240 3204130 2945469 2875473 3030997 3087731 3031922 2936564 2811356
14032B811356M2049j30698K8756j45978N3395L06928l38022j95340M64586n70281
$$ 2811356 2853405 2722707 2751463 2605485 2658880 2965808 2627786 2432446 2897032 2326751
14022B326751L23337k13049o1277K54954k54807k54389K93525r9034J22628k43716
$$ 2326751 2650088 2437039 2375762 2630716 2375909 2121520 2415045 2316011 2438639 2194923
14012B194923j10822L14225l26969L4200J61675J06060k26750j08104j58537O4722
$$ 2194923 2084101 2398326 2071357 2105557 2267232 2373292 2146542 2038438 1879901 1944623
14002A944623J2334j86495R1256L60662l27509K79000k72799p0841j5350Q9886
$$ 1944623 1956957 1770462 1861718 2222380 1894871 2173871 1901072 1830231 1814881 1904767
13992A904767k11690M8292O41503O08015L081967O801304K3552497J0631829B1931863
$$ 1904767 1693077 1741369 2382872 2990887 6072854 12874158 36426655 47058484 21931863
13982A1340756m127444k297836o49901o01154k21875l02473n99050L54463k64717
$$ 11340756 7213312 4915476 4265575 3664421 3442546 3140073 2541023 2895486 2630769
13973B630769k04531R8137n02096M09788o2024l31580n8220K24680k47m4212j3416
$$ 2630769 2426238 2524375 2022279 2432067 2370043 2038463 1980243 2204923 2204676 2160464 2147048
13962B147048J28169o06553M13058j2701r278J10934l06206l4778O1252k62445
$$ 2147048 2275217 1668664 2081722 2069021 2059743 2170677 1864471 1829693 1890945 1628500
13952A628500J99668j15114K93498j6547l29266K21540n94728J80119N13717m80829
$$ 1628500 1828168 1713054 2006552 1990005 1660739 1882279 1287551 1467670 1981387 1500558
13942A500558p3650J72792j53428L43401L15147m42442j38789r2378p5789k5796
$$ 1500558 1426908 1599700 1446272 1789673 2104820 1662378 1523589 1431211 1355422 1329626
13932A329626k05584O69401l34339K82285j49404o00939N12520l4294L14895n98376
$$ 1329626 1124042 1793443 1459104 1741389 1591985 991046 1503566 1469272 1784167 1185791
13922A185791L40525q4683L4600M2583j16949L39108k16395J26555j85578r8761
$$ 1185791 1526316 1441633 1476233 1518816 1401867 1740975 1524580 1651135 1465557 1366796
13912A366796P2586l88711L48722m67926L58403k14499K39368J12168j64676O2929
$$ 1366796 1439382 1050671 1399393 931467 1289870 1075371 1314739 1426907 1262231 1325160
13902A325160j85984M52205n8855m13991r7404L66594j39682k8446J59291l49325
$$ 1325160 1139176 1591381 1532526 1118535 1021131 1387725 1248043 1219597 1378888 1029563
13892A029563L24700m10773K34362j78668j27999K05605m5892L14456j15237M859
$$ 1029563 1354263 943490 1177852 999184 871185 1076790 1030898 1345354 1230117 1234976
13882A234976j05277Q7205j72657K81121Q55l76255J84753j2461k67258M38679
$$ 1234976 1129699 1216904 1044247 1325368 1326223 949968 1134721 1122260 855002 1293681
13872A293681R2760r5376k09969k74177L17183k59743q6553K11080p6590K56546
$$ 1293681 1386441 1291065 1081096 806919 1124102 864359 777806 988886 912296 1168842
13862A168842l0411k2100k98632K01422j30844J61116j06648J10780J0425l60440
$$ 1168842 1138431 1116331 817699 1019121 888277 1049393 942745 1053525 1063950 703510
13852G03510N5004K60914j62855o4055K86729l03576K29112J71696q3842R7208
$$ 703510 758514 1019428 856573 792518 1079247 775671 1004783 1176479 1092637 1189845
13842A189845E15410K67830J06019J33259j75653p7453J26992K0500j4754l05616
$$ 1189845 515410 783240 889259 1022518 846865 769412 896404 916904 902150 596534
13832E96534J94784j32360J84307O4716k25202J08959j24496K12454p8237K29180
$$ 596534 791318 658958 843265 907981 682779 791738 667242 879696 801459 1030639
13822A030639k67950J88677l61767K40478m0196L76294l98526J94916k9386m13839
$$ 1030639 762689 951366 589599 830077 789881 1166175 767649 962565 933179 519340
13812E19340L01273R7074k96014L34886j55925j62911q0675L12824j24285k95155
$$ 519340 820613 917687 621673 956559 800634 637723 557048 869872 745587 450432
13802D50432L40692J28763l80137K89254j56730J91728J05501j20974j75349P7991
$$ 450432 791124 919887 539750 829004 672274 864002 969503 848529 673180 751171
13792G51171J03864l23315K24733l31135K578N18305r2726J25241m1793k42994
$$ 751171 855035 531720 756453 425318 427896 946201 853475 978716 936923 693929
13782F93929K9672k42453L73183o7394q6118k22420K02970J0473p5806j7457p6926
$$ 693929 723601 481148 854331 786937 700819 478399 681369 691842 616036 598579 521653
13771E21653L47176k52093R0144K0530j09664j85839R5985L14102C79134K26086
$$ 521653 868829 616736 706880 727410 617746 431907 527892 841994 379134 605220
13761F05220k73323L32729B93752K71551J45456k45063O350J18934N026k23882
$$ 605220 331897 664626 293752 565303 710759 465696 472046 590980 596006 372124
13751C72124p4039J14889J2687M0325K08792J41289C49381K61795j52029K60549
$$ 372124 298085 412974 425661 465986 674778 816067 349381 611176 459147 719696
13741G19696n506j18056j05119j86589J1241L02345n8653K2112J04146J2967j16868
$$ 719696 714190 596134 491015 304426 315667 618012 559359 581471 685617 698584 581716
13730E81716P5262j64809B20306N98989j70988j00778A64687L35393m4877M20725
$$ 581716 656978 492169 220306 819295 648307 547529 164687 500080 455203 875928
13720H75928D10455L55221k10594j34539Q1112j0919p0799m6066K66381j25275
$$ 875928 410455 765676 555082 420543 501655 490736 419937 373871 640252 514977
13710E14977m4230j96208O6666O7977N6875o126j8246K62593Q3896k63706A96508
$$ 514977 470747 274539 341205 409182 466057 459931 441685 704278 788174 524468 196508
13698G17325J28148B35471K92069J18014j12047j67565P6114j92783N23097C81487
$$ 717325 845473 235471 527540 645554 533507 365942 442056 249273 772370 381487
13687A31731J65264K77695j15936j00085K22192j99094J8790J94887k32851J05189
$$ 131731 296995 574690 458754 358669 580861 381767 400557 595444 362593 467782
13677D67782j16749N1954R8165J27680A94297K84399N8299j7283n500j90895k1121
$$ 467782 351033 402987 501152 628832 194297 478696 536995 519712 514212 323317 302196
13666C02196L63794B61084N8384O4029p4388G0779M33713P4965B83386J37249
$$ 302196 665990 261084 319468 383497 309109 70779 504492 579457 283386 420635
13656D20635j65761K38749k35449L75570B77291L1571L6071K15045j62156A70082
$$ 420635 254874 493623 258174 633744 277291 308862 344933 559978 397822 170082
13645E57524A74895J30146K54616A27759J34986K0016J23315A64918L81803o5019
$$ 557524 174895 305041 559657 127759 262745 282761 406076 164918 546721 481702
13635D81702J89982B99082K84434k00359d0528A89559p5866J48683q5065K38834
$$ 481702 671684 299082 583516 383157 -40528 189559 113693 262376 177311 416145
13625D16145j61074J25533J60430l3191j41247q0816j09045K63235o5003o9974
$$ 416145 255071 380604 541034 507843 366596 285780 176735 439970 374967 304993
13615C04993o1679j9471q1444K58719A97356J70003j46333I9042R8529K89930
$$ 304993 243314 223843 142399 401118 197356 367359 221026 99042 197571 487501
13605D87501j26957A7993M01598N884A62172j0273j1388K15220j24380O5419R5799
$$ 487501 360544 17993 419591 425475 162172 151899 140511 355731 231351 296770 392569
13594C92569j50658L19853B06927J03739J72957j10535A46855L7525J78047j69393
$$ 392569 241911 561764 206927 310666 483623 373088 146855 184380 362427 193034
13584A93034M68376B70431E1163K25007K10370k4475r0477l4621q9572K42395
$$ 193034 661410 270431 51163 276170 486540 462065 371588 336967 247395 489790
13574D89790A86341K58433o3707G4695O8243O0440K27070a7556A50314J06065
$$ 489790 186341 444774 381067 74695 142938 203378 430448 -17556 150314 256379
13564B56379J32225J1772m1555D4488L07246N1938M1829J87549k73442o7103K29467
$$ 256379 388604 400376 358821 44488 351734 403672 445501 633050 359608 292505 521972
13553E21972j60135M3324J5611j73665o742N7291K26377p7543A69174M41019B37116
$$ 521972 361837 405161 420772 247107 240365 297656 524033 446490 169174 610193 237116
13541A19347K31065A64869n0768J50757H1968P09736C93052n9731b76216A84554
$$ 119347 350412 164869 114101 264858 81968 791704 393052 333321 -276216 184554
13530C05936l1416M9241o7324F6161K65828b7447B20084J69953p3089N80N1486
$$ 305936 274520 323761 256437 66161 331989 -27447 220084 390037 316948 317528 369014
13519C69014F3054L28471b496C14878K5916j54095l1547K20674a0373E59815A97684
$$ 369014 63054 391525 -2496 314878 340794 186699 155152 375826 -10373 559815 197684
13507A3595P7208d1160C08903g7881C17244J6401A14005J99950K207A43339I414
$$ 13595 90803 -41160 308903 -77881 317244 333645 114005 313955 316162 143339 9414
13495e2831C28726j09030J72382A03659A8059K83748j03156M8219Q943A01704
$$ -52831 328726 219696 392078 103659 18059 301807 198651 246870 255813 101704
13484c0529C98968r7074I6271a10589A94726J31093j52718l6895J86554A53988
$$ -30529 398968 301894 96271 -110589 194726 325819 173101 136206 322760 153988
13473F61744B38046I1377J2848J28457p5914E6704K6917Q7443P959H3457J34698
$$ 661744 238046 91377 104225 232682 156768 56704 83621 171064 179023 83457 218155
13462B18155l7915a8496A85879J86526j71081K6696I7295K01566N5994j25873
$$ 218155 180240 -18496 185879 372405 201324 228020 97295 298861 354855 228982
13452B28982J42247J68605j93392F292N22636I6309K5957b2710j14996A70623
$$ 228982 371229 539834 346442 6292 528928 96309 122266 -22710 -137706 170623
13441E17499G6088c0774C77607j05271E3885P4111l6486a2415B67456d7190B22934
$$ 517499 76088 -30774 377607 272336 53885 127996 91510 -12415 267456 -47190 222934
13429h7248B72470j32127a882B34135h3660B23129r6038d5408B63659A07881g86
$$ -87248 272470 140343 -1882 234135 -83660 223129 127091 -45408 263659 107881 -786
13417C59696A45183c0950C51987A22856c25947B80059L39913A89978k0199J58068
$$ 359696 145183 -30950 351987 122856 -325947 280059 619972 189978 169779 327847
13407C27847j51722D1502M39515B37849r0592J95912r7987j0575B5187K77424
$$ 327847 176125 41502 481017 237849 147257 343169 245182 234607 25187 302611
13397C02611g1578E3262J53945n5522G1787J56325k4016L23234A41470a4841D47667
$$ 302611 -71578 53262 207207 151685 71787 228112 204096 527330 141470 -14841 447667
13385f3E2834K00749p4782N2739Q4675H2211k8905K1930C5618L19972C56K25433
$$ -63 52834 253583 178801 231540 316215 82211 53306 75236 35618 355590 356 225789
13373B25789m1866P1346A01272L45326G5829a885B55751I8752d4636E01117B47182
$$ 225789 183923 255269 101272 446598 75829 -1885 255751 98752 -44636 501117 247182
13361C45261A65624G1873M2052h9605B05728b7882E2578O3502l1648J91387A11737
$$ 345261 165624 71873 113925 -89605 205728 -27882 52578 116080 84432 275819 111737
13349F3796L29141j13538r4100A6336L12079A57677N8446j4374R7961N646j26213
$$ 63796 392937 279399 185299 16336 328415 157677 216123 201749 299710 305356 179143
13338A79143K70680r8676D5624L62889D9531j4863L67011A04530J23642m0722
$$ 179143 449823 351147 45624 408513 49531 34668 401679 104530 228172 187450
13328A87450B4479N28304e7809B2396K05635C8418O2099C0684K31792I5994J78317
$$ 187450 24479 552783 -57809 22396 228031 38418 100517 30684 262476 95994 274311
13317B74311n3985L0870D2674K08900q0414K34317j69667I968J40415o396a54546
$$ 274311 220326 251196 42674 251574 171160 405477 235810 9968 150383 143987 -154546
13305B98230b18072C15484a04657A28811L6964p9146K44391I7677J24768K7035
$$ 298230 -218072 315484 -104657 128811 165775 86629 331020 97677 222445 249480
13295B49480D4936K41044a15860A41147h6575A95673i5478A37011K017b056F7445
$$ 249480 44936 285980 -115860 141147 -86575 195673 -95478 137011 139028 -2056 67445
13283A55995i7179G5993A6084a41866E8353M4783p594Q0260i7181B27028J22852
$$ 155995 -97179 75993 16084 -141866 58353 103136 95542 175802 -97181 227028 349880
13272C49880I7762O7917J60683j38849B3791L15951H4623M2773a9461d818A18518
$$ 349880 97762 165679 326362 187513 23791 339742 84623 127396 -19461 -4818 118518
13260b1167D07193m358F8923A0492b7565r865E0176a88547a9962A07469i3037
$$ -21167 407193 402835 68923 10492 -27565 -37430 50176 -188547 -19962 107469 -93037
13248D4387A9209K29088j06096j4153q786b10265C1112J22429b28960A64897C2605
$$ 44387 19209 248297 142201 128048 119262 -210265 31112 153541 -228960 164897 32605
13236D2776J78507a88492A04659Q8006d1864A81321d5631D21586a27553B25071
$$ 42776 221283 -188492 104659 192665 -41864 181321 -45631 421586 -127553 225071
13225H5479L7864k8458A6189K05191k1605C1615A0697L6411K39340j22597b36847
$$ 85479 123343 94885 16189 221380 199775 31615 10697 47108 286448 163851 -236847
13213a08191G8016e9511D63205A66435J7676J3613c57272B16191D4445J02883
$$ -108191 78016 -59511 463205 166435 184111 197724 -357272 216191 44445 147328
13203A47328p1489J74620j03796b08785F9010f9699A95123R6099J14353A76691
$$ 147328 75839 250459 146663 -208785 69010 -69699 195123 291222 405575 176691
13192A3327g0345k8260o8023f1202C0048A4903J01578E4028J87702r1053K0161
$$ 13327 -70345 -98605 -166628 -61202 30048 14903 116481 54028 241730 150677 170838
13181A70838M255J05797F0013h3500a2922D07151a09062q7278C10339j51009a1246
$$ 170838 175093 280890 60013 -83500 -12922 407151 -109062 -196340 310339 159330 -11246
13169a5998B75504r6410E2547L60087A68569n8951n3110N977K25594g6584B51285
$$ -15998 275504 179094 52547 412634 168569 109618 56508 62485 288079 -76584 251285
13157D2847a6508A73034f8723J9115F3127K34660B1166L04861j46555c0196B92079
$$ 42847 -16508 173034 -68723 -49608 63127 297787 21166 326027 179472 -30196 292079
13145A55470a4694l6324j49797A28666b81827f6873G56R8100M5546c07393m0652
$$ 155470 -14694 -51018 -200815 128666 -281827 -66873 756 98856 144402 -307393 -348045
13134c48045e9784j88119J09439I857d0012A53495a58737B07072a8469B31261
$$ -348045 -59784 -247903 -138464 9857 -40012 153495 -158737 207072 -18469 231261
13123A7944J84413b1931k23774A02687a45994L8059A86114P4550C2026J2254b69245
$$ 17944 202357 -21931 -245705 102687 -145994 -107935 186114 260664 32026 44280 -269245
13111a54189B82060A13426j7814M9327p0535K45755k2988j6625A08092e8525n3807
$$ -154189 282060 113426 95612 144939 74404 320159 297171 280546 108092 -58525 -112332
13100a12332e1665A64262m5188N5579a70491B62567K4580l3863j9251p7835K8546
$$ -112332 -51665 164262 119074 174653 -170491 262567 287147 253284 234033 156198 184744
13089A84744N1563a95503E3602h3380k5824E8400f1854B1190L47111a59133B57402
$$ 184744 236307 -195503 53602 -83380 -109204 58400 -61854 21190 368301 -159133 257402
13077B65903m4985Q1673a3917B84183l1512K67412A09390A2417K49630a3517N99
$$ 265903 220918 302591 -13917 284183 252671 520083 109390 12417 262047 -13517 -12918
13066a2918I5790i5764a2893k4377D0875b9276H128J11118J29243o7919N506a48831
$$ -12918 95790 -95764 -12893 -37270 40875 -29276 8128 119246 248489 180570 186076 -148831
13053A31516J21602i8161m836D0102g8705A6454d0321A73882b8440E53448A76004
$$ 131516 253118 -98161 -102997 40102 -78705 16454 -40321 173882 -28440 553448 176004
13041d4471p6757e7294C06462a37032G1863J15931J64559C5255P6896a34522F2477
$$ -44471 -121228 -57294 306462 -137032 71863 187794 352353 35255 112151 -134522 62477
13029I4634a36981G2378K63834I7401c1415B68538o1867B1160J36362J38837h0062
$$ 94634 -136981 72378 336212 97401 -31415 268538 206671 21160 157522 296359 -80062
13017a50478A54058o4975k7290b033j8417A90766b06617g1023C74092M7086A71084
$$ -150478 154058 89083 61793 -2033 -20450 190766 -206617 -71023 374092 421178 171084
13005b6531k01010I8388a43519D23886I631K95732c03928B35833n0980R4315b0237
$$ -26531 -227541 98388 -143519 423886 9631 305363 -303928 235833 184853 279168 -20237
12993a6840j69038A90316b17113C13781b4112j3988m8984B51644D0833O9294m4795
$$ -16840 -185878 190316 -217113 313781 -24112 -38100 -87084 251644 40833 110127 65332
12982F5332L0921b45355D4524c7810j23233b8553J1345B923e5818k11758A60137
$$ 65332 96253 -245355 44524 -37810 -161043 -28553 -17208 2923 -55818 -267576 160137
12970c4696I1323J01999d2358C7546K3564j3243h4023j45215M3662C41865H6248
$$ -34696 91323 193322 -42358 37546 61110 47867 -84023 -229238 -185576 341865 86248
12958f4794I4404a02344E0427J44273K29371B04322a6912B58530a34499N5080
$$ -64794 94404 -102344 50427 194700 424071 204322 -16912 258530 -134499 -79419
12948g9419j3522F6903r824J00032b2393G099M4703L8342b65198B78166A9003
$$ -79419 -92941 66903 57079 157111 -22393 7099 51802 90144 -265198 278166 19003
12936b9662m2611A14585g4403B86238A17833i3024A86384j2417K46M4743a61682
$$ -29662 -72273 114585 -74403 286238 117833 -93024 186384 173967 174213 218956 -161682
12924a61025b7902o6843C22032b02965h0597m6751G9058o833R1758b27700B33294
$$ -161025 -27902 -94745 322032 -202965 -80597 -127348 79058 72225 163983 -227700 233294
12912A15011J4888J4750J33401i4895C39014a32533F1648L73257d3937q9658M3786
$$ 115011 129899 144649 278050 -94895 339014 -132533 61648 434905 -43937 -133595 -89809
12901h9809k77651H4021f8925k81244G773b11132D862a68732a9067A53207a74020
$$ -89809 -367460 84021 -68925 -350169 7773 -211132 4862 -168732 -19067 153207 -174020
12889A06623l3235b10345B9585b18501b3053F7583a42969j80438H603K33701j07934
$$ 106623 73388 -210345 29585 -218501 -23053 67583 -142969 -323407 8603 242304 134370
12878A34370L26506A58956b1976A63422a16402G7702d841E6321j8161J88855N6441
$$ 134370 460876 158956 -21976 163422 -116402 77702 -4841 56321 38160 227015 283456
12867B83456r997c7686k41653B55765a30017C40348A13327d58535a41034G6197
$$ 283456 273459 -37686 -279339 255765 -130017 340348 113327 -458535 -141034 76197
12856a0244H0100k8675A9726O455P2340b2496C01902b2832D7833K24294j33118
$$ -10244 80100 51425 19726 26181 98521 -22496 301902 -22832 47833 272127 139009
12845A39009b91807B55985a93329e8732j75532c9066l43984A29797L2987b03056
$$ 139009 -291807 255985 -193329 -58732 -234264 -39066 -383050 129797 162784 -203056
12834e7506j16617A37182a58264k70h248G326b86350j55232E0234B68b35145G7133
$$ -57506 -174123 137182 -158264 -158534 -8248 7326 -286350 -441582 50234 268 -235145 77133
12821A15870b50111I7629g6085F5636B9477d9605E424K2508M6298Q6317D7367
$$ 115870 -250111 97629 -76085 65636 29477 -49605 5424 27932 74230 160547 47367
12809C4349N39137C4775b62417F4260b78577A27226l6351b69453a12572k0651
$$ 34349 573486 34775 -262417 64260 -278577 127226 90875 -269453 -112572 -133223
12799a33223A55700A9177a52131I6505a76025A5383R1671A1444a41486J4968p1976
$$ -133223 155700 19177 -152131 96505 -176025 15383 107054 11444 -141486 -126518 -198494
12788a98494A50942e1752j30144h6515A5179R4839a34648l38N77a7885n937A04092
$$ -198494 150942 -51752 -181896 -86515 15179 110018 -134648 -134986 -134409 -17885 -23822 104092
12775d5316p4964l9719I7744c15093e5859j26521A54930J12231j19712D3786g0408
$$ -45316 -120280 -159999 97744 -315093 -55859 -182380 154930 267161 147449 43786 -70408
12763H2552f5564b0652B98081A279P6226b24507A89156a53431B11079A01698c7822
$$ 82552 -65564 -20652 298081 1279 77505 -224507 189156 -153431 211079 101698 -37822
12751h2302j21858A2993R2352k9346i5935K5676r5181A67201D7277R0187K4655
$$ -82302 -204160 12993 105345 75999 -95935 -70259 -165440 167201 47277 137464 162119
12740A62119E577J09111e4666B17468C6806P4308c2889j74512B00855c79568G874
$$ 162119 5577 114688 -54666 217468 36806 111114 -32889 -207401 200855 -379568 7874
12728A3752K16959b13614A95902l1886a86994o4197A83121E2729J32898g4373
$$ 13752 230711 -213614 195902 164016 -186994 -251191 183121 52729 185627 -74373
12717A60155c5421G5746a53942F9274e6254A71294a7514A64487Q8061j12342o0744
$$ 160155 -35421 75746 -153942 69274 -56254 171294 -17514 164487 252548 140206 79462
12706G9462Q0844b209B52078c4380B51959I6791O2578E2756e4796b1594N262A38127
$$ 79462 160306 -2209 252078 -34380 251959 96791 159369 52756 -54796 -21594 -16332 138127
12693E1793A3166N4026e0754B5970j1594l089J07766R7207I1140b13360A80353
$$ 51793 13166 67192 -50754 25970 14376 11287 119053 216260 91140 -213360 180353
12681B36926q2149b54375c001I2544L6439a23031C9762n798j854M1462a17031
$$ 236926 154777 -254375 -3001 92544 128983 -123031 39762 33964 32110 73572 -117031
12669d3559C78341c3381A65788q0651J95632n3407F6148K92140H9337d6338k06805
$$ -43559 378341 -33381 165788 85137 280769 227362 66148 358288 89337 -46338 -253143
12658b53143E3175A2467f5638j18549H2829E221N040K23110j16465a4963j33222
$$ -253143 53175 12467 -65638 -184187 82829 5221 10261 233371 116906 -14963 -148185
12647a48185j29573A81796p1592c12314d5406K0240r5467C52507i6663B22815
$$ -148185 -277758 181796 110204 -312314 -45406 -25166 -120633 352507 -96663 222815
12636A87763m8584a60899J2585B06202a49558B64468p5831J17891I0463J71543
$$ 187763 139179 -160899 -148314 206202 -149558 264468 188637 306528 90463 262006
12626B62006q0247a50220A27012a69728A81867n8142a65299K1716C6062j0009
$$ 262006 181759 -150220 127012 -169728 181867 123725 -165299 -143583 36062 26053
12616B6053J86471K9344g427r0858C7137a2496B5499K76649g1927I7079a36145
$$ 26053 212524 241868 -7427 -98285 37137 -12496 25499 302148 -71927 97079 -136145
12604e0480h938B82504b8582A31096M06743c34165J36368A38182B9230f2591B2220
$$ -50480 -8938 282504 -28582 131096 537839 -334165 -197797 138182 29230 -62591 22220
12592I1205C5865K41551A33414J51288A17159h5677B17212o5808b5124k63568
$$ 91205 35865 277416 133414 284702 117159 -85677 217212 151404 -25124 -288692
12582b88692C07983A06972D774J92741a17009B82530B7041K15134A5893a69340
$$ -288692 307983 106972 4774 197515 -117009 282530 27041 242175 15893 -169340
12571a37744M9166B23845j1121j01914K27257E9840A8062a11124D47440i7353
$$ -137744 -88578 223845 212724 110810 338067 59840 18062 -111124 447440 -97353
12560d7893l24041d8129E6019b78433A42061a55888C9467b34690B13924a47799
$$ -47893 -371934 -48129 56019 -278433 142061 -155888 39467 -234690 213924 -147799
12549B2501b5679q0300J5315c2634j1377B53207p9787h0047B87315I8230K38809
$$ 22501 -25679 -105979 -90664 -32634 -44011 253207 173420 -80047 287315 98230 337039
12538C37039K24449F6315b64258f3128k92112a8378H9442J80317B5076N1270b122
$$ 337039 561488 66315 -264258 -63128 -355240 -18378 89442 269759 25076 76346 -2122
12526a30482I8108P2318b31438P2485j19400B3739M9690d0861A29748h6620B74072
$$ -130482 98108 170426 -231438 -158953 -278353 23739 73429 -40861 129748 -86620 274072
12514A08441a67589A43658C4784e9324k106B16066o0862d8958A82362b4723A82617
$$ 108441 -167589 143658 34784 -59324 -61430 216066 155204 -48958 182362 -24723 182617
12502D47492A47763j360R7847d2133H791J58422a06462A84083a72457A10265a25071
$$ 447492 147763 146403 244250 -42133 8791 167213 -106462 184083 -172457 110265 -125071
12490d4309p8347J761A88315O6972a41165k27314E3963a80860K7636D4770a81595
$$ -44309 -122656 -120895 188315 255287 -141165 -368479 53963 -180860 -153224 44770 -181595
12478a80767e7216D1709a55496j05878B75071f6858r829k34173C495h1615B26325
$$ -180767 -57216 41709 -155496 -261374 275071 -66858 -76687 -310860 3495 -81615 226325
12466c4553B69174C4698b05636A62682j6546K6130k8144a49576P2481A27446N0160
$$ -34553 269174 34698 -205636 162682 146136 172266 144122 -149576 -77095 127446 177606
12455A77606a95180b2937k68719C2064C485b9233k26423J13112N3855r2474D07282
$$ 177606 -195180 -22937 -291656 32064 3485 -29233 -255656 -142544 -88689 -181163 407282
12443A12006a44112I3749J4221B2918h6734J9969n7071p9757H9104k0802d32034
$$ 112006 -144112 93749 107970 22918 -86734 -66765 -123836 -203593 89104 68302 -432034
12431B1211O5009a56211M7088J4249J502A0208b06711L4411r1055C3798K4512
$$ 21211 86220 -156211 -109123 -94874 -93372 10208 -206711 -172300 -263355 33798 58310
12420E8310A7437K77029Q9459A89730b87238a2635j13592j26251O2942Q6387A30427
$$ 58310 17437 294466 383925 189730 -287238 -12635 -126227 -252478 -189536 -103149 130427
12408b43384D7712O7820k3478a91280A60116b78581b5135g816j36864j77869G9138
$$ -243384 47712 115532 92054 -191280 160116 -278581 -25135 -7816 -144680 -322549 79138
12396a39181A15417J25697M8119j04527b90299A94266B413J99330K7877b51902
$$ -139181 115417 241114 289233 184706 -290299 194266 2413 201743 229620 -251902
12385A83176b71750E7244c68843f3078B64065F0354J08392j8179P1602f3889B47216
$$ 183176 -271750 57244 -368843 -63078 264065 60354 168746 150567 222169 -63889 247216
12373F5694d4719k44966j26410I3652J58659A11752E063R7328Q548a2426F513
$$ 65694 -44719 -289685 -416095 93652 252311 111752 5063 102391 110939 -12426 6513
12361a36794G3861c3635k28056L9885d8295j85226J06876A68376Q2174k2028h0887
$$ -136794 73861 -33635 -261691 -221806 -48295 -233521 -126645 168376 250550 228522 -80887
12349B93942B8575a82568b2372j2475C91728A74198c78554A88672p6381a53605
$$ 293942 28575 -182568 -22372 -34847 391728 174198 -378554 188672 112291 -153605
12338A72608b7697B3040K72930p8768G5837O434N707i8982J6120b3531G5687L33200
$$ 172608 -27697 23040 295970 217202 75837 82271 87978 -98982 -82862 -23531 75687 408887
12326D08887a4814E2746J478b78748a03923r1422A26276R433j1949b58014Q6053
$$ 408887 -14814 52746 54224 -278748 -103923 -195345 126276 135709 123760 -258014 -171961
12315a71961A85535a25367D5150J1161a81288B94664a42345f0295A1017J66045
$$ -171961 185535 -125367 45150 56311 -181288 294664 -142345 -60295 11017 177062
12305A77062a8602j83327h9931B49366a40507M7558b8986A31825b61373A88222
$$ 177062 -18602 -201929 -89931 249366 -140507 -92949 -28986 131825 -261373 188222
12294B06736h3067A73364f9265J3874A34214D0782J31075J61087b13943J9400
$$ 206736 -83067 173364 -69265 -55391 134214 40782 171857 332944 -213943 -194543
12284a94543e8434N407k10713A23938h9665j03760e2460D4237J59351J20031F6516
$$ -194543 -58434 -53027 -263740 123938 -89665 -193425 -52460 44237 203588 323619 66516
12272B47414k6347b98654q1315C385J16885d008E2659a61481n804C77790A44443
$$ 247414 221067 -298654 -379969 3385 120270 -4008 52659 -161481 -167285 377790 144443
12260A64010H0564J22453a40303C6674a33701e5792j97986A54424k5447K00243
$$ 164010 80564 203017 -140303 36674 -133701 -55792 -253778 154424 128977 329220
12250C29220C9248J11136b13440i1812C37434b5175A13464a14603G8335l257b44644
$$ 329220 39248 150384 -213440 -91812 337434 -25175 113464 -114603 78335 75078 -244644
12238A79110A964R2778a23304B24610B0765K33811K18450A25980J19251F7406
$$ 179110 1964 94742 -123304 224610 20765 254576 473026 125980 245231 67406
12227F8307J08942a07030B36841C9806J46480p82I1160N62252k45065j18077J4055
$$ 68307 177249 -107030 236841 39806 186286 185504 91160 653412 408347 290270 304325
12216C04325j35368J9524K6323j8286B5307f571C4073J07228K3258m8697a8883
$$ 304325 168957 188481 214804 196518 25307 -6571 34073 141301 164559 115862 -18883
12204h6068A59536b14536M9083C0897J15470O3814Q5617A19954Q4979p595r5511
$$ -86068 159536 -214536 -165453 30897 146367 210181 295798 119954 204933 197338 101827
12193A01827P4986M05193B23819p0183J64857D6738K39337A33423d327C5663K53873
$$ 101827 176813 582006 223819 153636 318493 46738 286075 133423 -4327 35663 289536
12182B89536a70737g5130C2827J58177d1017l7186A69754G5886K43499a8182j8880
$$ 289536 -170737 -75130 32827 191004 -41017 -78203 169754 75886 319385 -18182 -37062
12171c7062o6613a0565D29397j35189L534i8850A01161P3670c4182B79439A28556
$$ -37062 -103675 -10565 429397 294208 297742 -98850 101161 174831 -34182 279439 128556
12159E0989a30508I707d9141j6650c607B50889I6327J20029b21788A07241a70886
$$ 50989 -130508 9707 -49141 -65791 -3607 250889 96327 216356 -221788 107241 -170886
12147a844H1642R266Q7351b28059A64639D0619i7869A03883B1039a44945K6654
$$ -1844 81642 90908 178259 -228059 164639 40619 -97869 103883 21039 -144945 -118291
12136a18291A62947M0850b9725l83490h7700A99120E6461B2018J52793m3066g6911
$$ -118291 162947 203797 -29725 -413215 -87700 199120 56461 22018 174811 131745 -76911
12124A31475l7868a59030F1030J3116j5113P662h4480b0277B33112e1193C604
$$ 131475 93607 -159030 61030 74146 59033 66695 -84480 -20277 233112 -51193 3604
12112C8775a80675Q9660k79498a48760j39635i84A3260K124L50879c73502F6982
$$ 38775 -180675 -91015 -370513 -148760 -288395 -984 13260 15384 366263 -373502 66982
12100a85948j62244A01211c61395B44524p7539p3280b04277f3755j93973C21983
$$ -185948 -348192 101211 -361395 244524 166985 93705 -204277 -63755 -257728 321983
12089E9417k0406N6607K02008i4872H22333R54375q10762B08879A4706b27665
$$ 59417 39011 95618 297626 -94872 822333 1776708 965946 208879 14706 -227665
12078b22830I8606a6898p4732l0603a1585l27150D8922i6093k36949i0046J1530
$$ -222830 98606 -16898 -91630 -122233 -11585 -338735 48922 -96093 -333042 -90046 -78516
12067g8516H7721h3506C20766c64049J79590A07318b5555j36010M0540A53067
$$ -78516 87721 -83506 320766 -364049 -184459 107318 -25555 -161565 -121025 153067
12056D0104Q540O6083a51064f9731j19567E7732J21619f6761b2965B31843a09105
$$ 40104 48644 114727 -151064 -69731 -189298 57732 179351 -66761 -22965 231843 -109105
12044a4725B06396C657L6396f6328q934A61779A1600b51044Q4282H7734a06200
$$ -14725 206396 3657 40053 -66328 -75262 161779 11600 -251044 -166762 87734 -106200
12032e0038j93511A47965a07972o630D5300h2780B7627J1277K8358f3814C39714
$$ -50038 -243549 147965 -107972 -114602 45300 -82780 27627 38904 67262 -63814 339714
12020e7516B50574b9320B75502a17736h131A2363c5305H973O1308f8476A45847
$$ -57516 250574 -29320 275502 -117736 -8131 12363 -35305 8973 70281 -68476 145847
12008a21090A63690n0180c30928B74138j5265a26485I9121M38279A41758k0264
$$ -121090 163690 113510 -330928 274138 258873 -126485 99121 537400 141758 121494
11998A21494n0019i1269j36517A95h0089m375o876B95062g470l95873g9097j32300
$$ 121494 71475 -91269 -227786 195 -80089 -84464 -91340 295062 -7470 -403343 -79097 -211397
11986b11397j74770l7319d2506o8064C9812J08945m1144J04041n388O8318g2973
$$ -211397 -386167 -423486 -42506 -110570 39812 148757 107613 211654 206266 274584 -72973
11974c7814k9712p0781j54927c4484j05478e5432A07363J8011M7134D5274b55649
$$ -37814 -67526 -138307 -293234 -34484 -139962 -55432 107363 125374 172508 45274 -255649
11962b63558b7727k82026E9515J67679e0807B13052i75j16900A84807F9258K9772
$$ -263558 -27727 -309753 59515 227194 -50807 213052 -975 -117875 184807 69258 99030
11951I9030b77057k6748J19853P6484C3349b01348P1720D9591a95490f6309B8003
$$ 99030 -277057 -303805 -183952 -107468 33349 -201348 -129628 49591 -195490 -66309 28003
11939b6216j39253j15376g419k81147g4779j27334A5609d3071j3178b0069I2987
$$ -26216 -165469 -280845 -7419 -288566 -74779 -202113 15609 -43071 -56249 -20069 92987
11927A47078h7436n1938A30082i648C1591J25516a76715A18386i4017k27062B10985
$$ 147078 -87436 -139374 130082 -9648 31591 157107 -176715 118386 -94017 -321079 210985
11915b29895A13386C0649L0142h502k32008E5421M6325O8241h1292A99227b18122
$$ -229895 113386 30649 60791 -8502 -240510 55421 101746 169987 -81292 199227 -218122
11903H5649e9858j87818G7046O4421n5424L3396a94080B31503C0703c0850n7245
$$ 85649 -59858 -247676 77046 141467 86043 119439 -194080 231503 30703 -30850 -88095
11892h8095A47633a79146j22142B6920a22073A42707a67662j13354C4036a44087
$$ -88095 147633 -179146 -301288 26920 -122073 142707 -167662 -281016 34036 -144087
11881C6017J07058b9952j27215j44483a19555A11314L7202f1039o8085K7928L8349
$$ 36017 143075 -29952 -157167 -301650 -119555 111314 148516 -61039 -129124 -101196 -62847
11870f2847k3559q1715K3932J7309L6520o6278C3998b04839H7727B7760J59142
$$ -62847 -86406 -168121 -144189 -126880 -90360 -156638 33998 -204839 87727 27760 186902
11859A86902i0605m839G800J24166C1935j5243a5031j3888I8415K34729A0911
$$ 186902 -90605 -95444 7800 131966 31935 16692 -15031 -28919 98415 333144 10911
11847b56664C3545c96583a60835k02057J59658p8884g3225l3071q3366g0391B75370
$$ -256664 33545 -396583 -160835 -362892 -203234 -282118 -73225 -106296 -189662 -70391 275370
11835b11292B96001b847j01343A30852a36934c5537m0231b8425k71770a23368
$$ -211292 296001 -2847 -104190 130852 -136934 -35537 -75768 -28425 -300195 -123368
11824F6330h931j4388B46453a2237A39111D0918a76694l2033i4122A39511e247
$$ 66330 -8931 -23319 246453 -12237 139111 40918 -176694 -208727 -94122 139511 -5247
11812b19536l2968Q3676D9697F440a93771A73359c02678D2650c70370D0359J40183
$$ -219536 -252504 -168828 49697 6440 -193771 173359 -302678 42650 -370370 40359 180542
11801A80542H6008a11770e2500r9211j47217F9477a63987B39483a4588E8517a57969
$$ 180542 86008 -111770 -52500 -151711 -298928 69477 -163987 239483 -14588 58517 -157969
11789c86272a62107c1567i088o5635B03755b15711i1635h248B04160b09478i6564
$$ -386272 -162107 -31567 -9088 -74723 203755 -215711 -91635 -8248 204160 -209478 -96564
11777c54912D3409q43P0526O6629F8252j2872p037M0736a05510K739i386j66329
$$ -354912 43409 42566 113092 179721 68252 55380 48343 89079 -105510 -102771 -9386 -175715
11765a75715j65529O2763B82104d8287I7206d557A09026b73725A6392m182a36200
$$ -175715 -341244 -278481 282104 -48287 97206 -4557 109026 -273725 16392 12210 -136200
11753a87545b8826k40638O4169k33092C64046c16567f2387A30933a15753M9115
$$ -187545 -28826 -269464 -205295 -438387 364046 -316567 -62387 130933 -115753 -66638
11743f6638b0042B50492c1389B7915A3037a29140n6027a1986j79785O3123M881
$$ -66638 -20042 250492 -31389 27915 13037 -129140 -185167 -11986 -191771 -128648 -123767
11732a23767B41904Q0981F3115J96090h9629A51183I414O4019a5887q063j4183
$$ -123767 241904 322885 63115 259205 -89629 151183 9414 73433 -15887 -23950 -38133
11721c8133q9747A03642b17192B13409b1800H4072a33463F7498K85214D237N0987
$$ -38133 -127880 103642 -217192 213409 -21800 84072 -133463 67498 352712 4237 55224
11710E5224k3667J40257b10896i8844C74398a18743A58382A9902K44663r2242
$$ 55224 31557 171814 -210896 -98844 374398 -118743 158382 19902 264565 172323
11700A72323a63577A25358M3702J70511f1775j1474r6805I6116K55206A13485
$$ 172323 -163577 125358 169060 339571 -61775 -73249 -170054 96116 351322 113485
11689a7969q5331E8855b55355R7014G1134J35278r7015a23480d7487A22536J7173
$$ -17969 -103300 58855 -255355 -158341 71134 206412 109397 -123480 -47487 122536 139709
11678A39709J28178n5127F4247a48674A22740A3006a52180i124B37220B895a20058
$$ 139709 267887 212760 64247 -148674 122740 13006 -152180 -9124 237220 2895 -120058
11666B615L29965b09808n6052H5093C7441J1741J6998L42416A02139b48217G2971
$$ 2615 332580 -209808 -265860 85093 37441 49182 66180 408596 102139 -248217 72971
11654b14570D8679L06798a1441k1469m6168j22828B02662g8519B9863b67070B18590
$$ -214570 48679 355477 -11441 -32910 -79078 -201906 202662 -78519 29863 -267070 218590
11642d74687d1586P709m1935j28213E2975e4229l6125m0325K5409d1176j39515
$$ -474687 -41586 -33877 -75812 -204025 52975 -54229 -90354 -130679 -105270 -41176 -180691
11631a80691f1290B86763C3875b56807d4546j22463A1812a9753j40436a5875C82341
$$ -180691 -61290 286763 33875 -256807 -44546 -167009 11812 -19753 -160189 -15875 382341
11619A42288i1261A79664H3843L4606b82211A83792b32451a06631j5904j28603
$$ 142288 -91261 179664 83843 118449 -282211 183792 -232451 -106631 -122535 -251138
11609b51138A1949e239j69713o5864A06657m8633b93980A58317n8577C9146c0476
$$ -251138 11949 -5239 -174952 -240816 106657 58024 -293980 158317 99740 39146 -30476
11597a54711A2296c52282B54450A20408J9617i0492m36564D3081R6282M9151e9190
$$ -154711 12296 -352282 254450 120408 140025 -90492 -527056 43081 139363 188514 -59190
11585A63639L7059Q244b2482A02452P2608G5593J86224P6546q4027R488b8817
$$ 163639 200698 208942 -22482 102452 175060 75593 261817 338363 254336 263824 -28817
11573A83766a49282D9608A8609a82355j6169B20602q7183b80514I9802J32901
$$ 183766 -149282 49608 18609 -182355 -198524 220602 133419 -280514 99802 232703
11563B32703n6743J07957I3403a23172j05727B63058b72644A23782J44466E9078
$$ 232703 175960 283917 93403 -123172 -228899 263058 -272644 123782 268248 59078
11552H9993b5282H3446f7679K3006m6712A27149Q7333a32770H618L26759j04696
$$ 89993 -25282 83446 -67679 -44673 -91385 127149 214482 -132770 8618 335377 230681
11541B30681E55a47707B6133O6175a0563D38621A53183L8737h8671j99523b2637
$$ 230681 555 -147707 26133 92308 -10563 438621 153183 191920 -88671 -288194 -22637
11529F7640J29301q9976i2873j56771F4718R2004b03730O2145k8457A71398d1409
$$ 67640 196941 106965 -92873 -249644 64718 156722 -203730 -141585 -170042 171398 -41409
11517d4051m275F6384Q4728O5175d5318l7573r7644B17935m5313a73062B41664
$$ -44051 -48326 66384 151112 216287 -45318 -82891 -180535 217935 172622 -173062 241664
11505c7927j9809r314A08033c8719A35917E2120a9280C27035A16905b58500R9603
$$ -37927 -57736 -67050 108033 -38719 135917 52120 -19280 327035 116905 -258500 -158897
11494a58897A0306O2215a46636C92591I9452A1018a61687A1262J60770M7788j01112
$$ -158897 10306 72521 -146636 392591 99452 11018 -161687 11262 172032 219820 118708
11483A18708k4012k4654c3137j30006f0012a0184E6090P307J01838J15261h9061
$$ 118708 94696 70042 -33137 -163143 -60012 -10184 56090 63397 165235 280496 -89061
11471D01880j77216B427K04084h303k805A93873Q2252d3886K1937B24709D3516
$$ 401880 224664 2427 206511 -8303 -11108 193873 276125 -43886 -21949 224709 43516
11459c19910E3159h1669A89558o7364d2788C2020e8380C6342j252p062J22708
$$ -319910 53159 -81669 189558 122194 -42788 32020 -58380 36342 35090 28028 150736
11448A50736G2277L450M5793k9340a82531B80781D4724A7082P0929b7892j05584
$$ 150736 72277 75727 121520 92180 -182531 280781 44724 17082 88011 -27892 -133476
11437a33476A5660L7878f8790r5203j02309D36624G7149j5420K98210K6668o4462
$$ -133476 15660 53538 -68790 -163993 -266302 436624 77149 61729 359939 386607 322145
11426C22145D4629b20008A30105D3422h3413l3160a8739j63879F3239i0864p1263
$$ 322145 44629 -220008 130105 43422 -83413 -116573 -18739 -182618 63239 -90864 -162127
11415a62127A09226c0119q4784D3477c0868l0648j15582D8633i5992m9109A01570
$$ -162127 109226 -30119 -114903 43477 -30868 -61516 -177098 48633 -95992 -145101 101570
11403A69691f9063B27738G3900l1460q506M5406a94486i6214j84303G7502d46672
$$ 169691 -69063 227738 73900 42440 33934 79340 -194486 -96214 -280517 77502 -446672
11391a46091A53084a40240j75274a33347B11128f5480q5283A92135A4381c7969
$$ -146091 153084 -140240 -315514 -133347 211128 -65480 -150763 192135 14381 -37969
11380c35353L5891h1857C08589e7538m372j44047M558f6952j00048e9956H1447
$$ -335353 -299462 -81857 308589 -57538 -61910 -205957 -201399 -66952 -167000 -59956 81447
11368b74694N4947O4166D4368J42131b39509d3254K592I5792a92238j83179C11375
$$ -274694 -219747 -155581 44368 186499 -239509 -43254 -40662 95792 -192238 -375417 311375
11356d8710k9903p1276E7530a25137j40253Q1042E0415A8828c754A56333j7534
$$ -48710 -78613 -149889 57530 -125137 -265390 -184348 50415 18828 -3754 156333 138799
11345A38799c7449q5711o019B40530H297i219p0109A0021Q1618J7883a11424A13580
$$ 138799 -37449 -123160 -129179 240530 8297 -9219 -79328 10021 91639 109522 -111424 113580
11332b37330b634I4407J58251b71114P9743A21958O8908a70321P0832C17345c66707
$$ -237330 -2634 94407 252658 -271114 -191371 121958 190866 -170321 -99489 317345 -366707
11320d4338j35338B10031b081n4847o2112A99956c85211a2142C5545a12629l8044
$$ -44338 -179676 210031 -2081 -56928 -119040 199956 -385211 -12142 35545 -112629 -150673
11309a50673O2868j21622A03189a08181d2121n8796D6237c07219J28037B7274
$$ -150673 -87805 -209427 103189 -108181 -42121 -100917 46237 -307219 -179182 27274
11298B0772h1659B54184b04662D0159a34146q2012G6230c44876e7956l39944J90805
$$ 20772 -81659 254184 -204662 40159 -134146 -216158 76230 -344876 -57956 -397900 -207095
11287b07095B9553a75576K0980A43652m692o7714K05600g2310j2520H732M8023
$$ -207095 29553 -175576 -154596 143652 138960 71246 276846 -72310 -84830 8732 56755
11276E6755a1268A69375a34425M4122l22982a7352A07877a32908e1942E395c59846
$$ 56755 -11268 169375 -134425 -90303 -413285 -17352 107877 -132908 -51942 5395 -359846
11264A80209b34696J06131G8011b62980a28113k8415C1602a26085B17644b90102
$$ 180209 -234696 -128565 78011 -262980 -128113 -156528 31602 -126085 217644 -290102
11253C9663a34895I629N6898J69257F0298d8070q6259q3549i256I4937c26838
$$ 39663 -134895 9629 66527 235784 60298 -48070 -134329 -217878 -9256 94937 -326838
11241A92607g4392I2228h520j14824k31250H5979K52875j63244b8752j32580L7304
$$ 192607 -74392 92228 -8520 -123344 -354594 85979 338854 175610 -28752 -161332 -124028
11230a24028A57010c33543a25795j29067A91073B1428a98791D6217b09564Q2845
$$ -124028 157010 -333543 -125795 -254862 191073 21428 -198791 46217 -209564 -126719
11220a26719G622e17579B4145n484a72626k39379g114n7281k6682b287A311b98217
$$ -126719 7622 -517579 24145 18661 -172626 -412005 -7114 -64395 -91077 -2287 1311 -298217
11207c71863A23986g512A00495b33712d3293m984B9144a60657C3105J28322c40978
$$ -371863 123986 -7512 100495 -233712 -43293 -48277 29144 -160657 33105 161427 -340978
11195a33948N7278B91794b71388M9449o5781B27690h2230a7552A26151I289a66726
$$ -133948 -76670 291794 -271388 -221939 -287720 227690 -82230 -17552 126151 9289 -166726
11183A97469A1625a26001j00813a1054j86138A38952a18210k5000A07430b72228
$$ 197469 11625 -126001 -226814 -11054 -197192 138952 -118210 -143210 107430 -272228
11172i32k48680E3603J55095a41522k04984I9618l6128q760b65983b4076E7759
$$ -932 -249612 53603 208698 -141522 -346506 99618 63490 54730 -265983 -24076 57759
11160f3513E0923L1008e7338B23710a24595e2432k56279F0096i7023k57419B64843
$$ -63513 50923 81931 -57338 223710 -124595 -52432 -308711 60096 -97023 -354442 264843
11148d4283B89589E299d4069L038q3267k65289e2354j05184C97522a4679j93543
$$ -44283 289589 5299 -44069 -41031 -124298 -389587 -52354 -157538 397522 -14679 -208222
11137b08222K101Q7984a3334B44563G642J06023R7040n0362J53407b0120j06924
$$ -208222 -206121 -118137 -13334 244563 7642 113665 210705 160343 313750 -20120 -127044
11126a27044A56488p4883a7471Q071k1814A22992Q7204e2464D97424e6709A59584
$$ -127044 156488 81605 -17471 -9400 -31214 122992 210196 -52464 497424 -56709 159584
11114B41743I5878m6552b62174J1113B13186o8345k8765j7800A4122b1826G4488
$$ 241743 95878 49326 -262174 -251061 213186 144841 116076 98276 14122 -21826 74488
11102F2327J52627M4100G8882K7267H855J93436N1066m4481l7808m0038L09242
$$ 62327 214954 259054 78882 106149 8855 202291 253357 208876 171068 131030 440272
11091D40272B0789a4933B76968m4600E0349K6544J74325q6279J91135k0691J3760
$$ 440272 20789 -14933 276968 232368 50349 76893 251218 164939 356074 335383 349143
11080C49143a51434d968q4804I0987J93812j07475D5774J06720o5415J2602J02529
$$ 349143 -151434 -4968 -89772 90987 284799 177324 45774 152494 87079 99681 202210
11069B02210A01047a9308C29854a11581C53760j07893J84103o650j89688Q4600
$$ 202210 101047 -19308 329854 -111581 353760 245867 429970 423320 233632 318232
11059C18232q533j19197L29172p7860m91Q4411n3283A09044N88868k68461m3323
$$ 318232 309699 190502 519674 441814 441323 525734 472451 109044 697912 429451 386128
11048C86128Q8726k4935K89904j00457B75726O0000J55769K39707B71360K32177
$$ 386128 474854 449919 739823 639366 275726 335726 491495 731202 271360 503537
11038E03537k32342L47937J95981C61766J65852j224j97476o2714C0058L42839
$$ 503537 271195 619132 815113 361766 527618 526394 328918 266204 30058 372897
11028C72897r2399j2725J66144L8383K87546j70032k86834R0950m8324L9305M06261
$$ 372897 280498 267773 433917 472300 759846 589814 302980 393930 345606 384911 791172
11017G91172B92694K26595A66153K51337K08480j51041Q9168B58990L2420A28400
$$ 791172 292694 519289 166153 417490 625970 474929 564097 258990 291410 128400
11006D91616L09419C07077L150p9768K88420m006l5641P771j69275J16562N9869
$$ 491616 801035 307077 310227 230459 518879 514873 479232 487003 317728 434290 494159
10995D94159K27724C43592A42427J96615J3484J10027K77789P7241k84342K13280
$$ 494159 721883 343592 142427 339042 352526 462553 740342 817583 533241 746521
10985G46521j25366J3521o737Q6925P9063j94502J60430k66765L94267R0733M635
$$ 746521 621155 634676 627939 714864 793927 599425 759855 493090 887357 978090 982725
10974I82725K13334K87884J37530K29812j76249J91504q7585k27524P5521n2085
$$ 982725 1196059 1483943 1621473 1851285 1675036 1866540 1778955 1551431 1626952 1574867
10964A574867l69580N6067j77331K28780o23196M70934L63935j33827p474N3595
$$ 1574867 1205287 1261354 1084023 1312803 689607 1160541 1524476 1390649 1383175 1436770
10954A436770l0056l26201k866j72396J81055j52162l13860n1062j20955K76591
$$ 1436770 1406714 1080513 1077647 905251 1086306 934144 620284 569222 448267 724858
10944G24858A54140R1139E5143L5748K82537A52271L23130I0092J86843j15196
$$ 724858 154140 245279 55143 90891 373428 152271 475401 90092 276935 161739
10934A61739b24583C00548B9119Q9971Q3169P6606a89119f8217m9591F2879p883
$$ 161739 -224583 300548 29119 119090 202259 278865 -189119 -68217 -117808 62879 54996
10923E4996a63337j3243P4014E6934i7233e348E7210J03821b83027A25350b30952
$$ 54996 -163337 -176580 -102566 56934 -97233 -5348 57210 161031 -283027 125350 -230952
10911a19878A45512c4556M706B7967L4377a09236d7032q3598k11874a06227E1232
$$ -119878 145512 -34556 -29850 27967 62344 -109236 -47032 -130630 -342504 -106227 51232
10899C0971h9115C4299a67286g275j08477A77399a07785M7484q0071f9478D7034
$$ 30971 -89115 34299 -167286 -7275 -115752 177399 -107785 -60301 -140372 -69478 47034
10887G569P3615H734J52160c4672j17132p7966e9945A71378e3851m2649k41138
$$ 7569 81184 8734 160894 -34672 -151804 -229770 -59945 171378 -53851 -96500 -337638
10876c37638B2551B486d410k05357P0756j46001p3102A07359a7923j03721G0188
$$ -337638 22551 2486 -4410 -209767 -139011 -285012 -358114 107359 -17923 -121644 70188
10864g2488k4818A41478c2196j59763A0164b19595j7037i7838a0218k32587E6820
$$ -72488 -97306 141478 -32196 -191959 10164 -219595 -236632 -97838 -10218 -242805 56820
10852I2414m4870c8341a692l186j98127A96195b63421G6770a5159F710J7625b14533
$$ 92414 47544 -38341 -1692 -4878 -203005 196195 -263421 76770 -15159 6710 24335 -214533
10839B97217C6819J53444E229e8869A29033P7489b18649g8349A78763f8869B40396
$$ 297217 36819 190263 5229 -58869 129033 206522 -218649 -78349 178763 -68869 240396
10827a94880d1235B34741d6401k38329B36651E5736f3882G2853a56655A13671
$$ -194880 -41235 234741 -46401 -284730 236651 55736 -63882 72853 -156655 113671
10816b55544P1342I9660h8301K8438j4197q0562B26789I2610h2935k77238a53915
$$ -255544 -184202 99660 -88301 -59863 -74060 -154622 226789 92610 -82935 -360173 -153915
10804e1949D719Q2935e5805B06665I5451a74109B67741A084J27783G634J134b33765
$$ -51949 4719 87654 -55805 206665 95451 -174109 267741 1084 128867 7634 8768 -233765
10791a38207j0621j4077A10589N2317l0439D1238a85100E1680e7079j56718J02605
$$ -138207 -148828 -162905 110589 162906 132467 41238 -185100 51680 -57079 -213797 -111192
10780a11192j49613E7679i0542E0770g3051F3577a29024f4416G6176C1347O5063
$$ -111192 -260805 57679 -90542 50770 -73051 63577 -129024 -64416 76176 31347 96410
10769I6410a81110D4723d8885l9775B33499q6205J89081d6719k51037F6168d931
$$ 96410 -181110 44723 -48885 -88660 233499 147294 336375 -46719 -297756 66168 -4931
10757i4720B51201b44001J07349G0199B3496d3818A17820J6435C8229i8924k62997
$$ -94720 251201 -244001 -136652 70199 23496 -43818 117820 134255 38229 -98924 -361921
10746c61921i0591i84k7779p8601l5749L0599j8815o1565I4816a00761D1223d13444
$$ -361921 -90591 -984 -28763 -107364 -143113 -112514 -131329 -192894 94816 -100761 41223 -413444
10733B49338c34659J28830A10227a42309D0962K42691o6596a28791b9177m0770
$$ 249338 -334659 -205829 110227 -142309 40962 283653 217057 -128791 -29177 -69947
10723f9947l8776j19039G157L09439b31371A89321b42372A92996d20726N4271
$$ -69947 -108723 -227762 7157 316596 -231371 189321 -242372 192996 -420726 -366455
10713c66455A26505E4915e514j37576K799f9401B64822i2381A00589i2491I5219
$$ -366455 126505 54915 -5514 -143090 -140291 -69401 264822 -92381 100589 -92491 95219
10701I5511b18853E4455c69462e5918c715D48357A26619k8984b4316A73520a53455
$$ 95511 -218853 54455 -369462 -55918 -3715 448357 126619 97635 -24316 173520 -153455
10689c2205B67952j0530i339A86511b6227j13100N4992j71104J20390B48009B1017
$$ -32205 267952 257422 -9339 186511 -26227 -139327 -84335 -255439 -135049 248009 21017
10677c3769r2661L3499k28523e6267C9614f1889G410f9130A29644a18664L7568
$$ -33769 -126430 -92931 -321454 -56267 39614 -61889 7410 -69130 129644 -118664 -81096
10666h1096n3801j0461o6627A42655a35306C0106f9867B23358d25537A07856b58515
$$ -81096 -134897 -145358 -211985 142655 -135306 30106 -69867 223358 -425537 107856 -258515
10654F7362h2817a631l83117J32407i52G5010K4499b7113j20576b2264B36995
$$ 67362 -82817 -1631 -384748 -252341 -952 75010 99509 -27113 -147689 -22264 236995
10642h2495h729D08502A22600h96E5098e7811A46401m0608n2575k5084c2300q7809
$$ -82495 -8729 408502 122600 -896 55098 -57811 146401 105793 53218 28134 -32300 -120109
10630a20109L052a894n9774k43825O7222M4302b1374f711j5165l3633j55369B77745
$$ -120109 -117057 -1894 -61668 -305493 -238271 -193969 -21374 -6711 -21876 -55509 -210878 277745
10617A42928m6365b69194Q322Q1445B66254f9948j44111b298p9684d945k98510
$$ 142928 96563 -269194 -260872 -179427 266254 -69948 -214059 -2298 -81982 -4945 -303455
10606c03455F8049M6865i499B26621a27355k38282J81874m5590a05210A26396
$$ -303455 68049 114914 -9499 226621 -127355 -365637 -183763 -229353 -105210 126396
10595G1729a61925L3129j42534A24000E1572K2081a39732k4420F9834M9169a25055
$$ 71729 -161925 -128796 -271330 124000 51572 73653 -139732 -164152 69834 119003 -125055
10583H4268i0137c1817A05416c83236a13645m8086o0907A4882a21824M583d0000
$$ 84268 -90137 -31817 105416 -383236 -113645 -161731 -222638 14882 -121824 -117241 -40000
10571d44338A75136F6456R2112J94723e6380k44865J32771b3675j0558j68143
$$ -444338 175136 66456 158568 353291 -56380 -301245 -168474 -23675 -34233 -202376
10561b02376k16141B751i968A05262g1510j55562J11788a0654k35340g9641j5766
$$ -202376 -418517 2751 -9968 105262 -71510 -227072 -115284 -10654 -245994 -79641 -95407
10550i5407E7294a86437j61027g8945B21814i6555F0813a63477j11922J30341
$$ -95407 57294 -186437 -347464 -78945 221814 -96555 60813 -163477 -275399 -145058
10540a45058I4762m0856J74962b34757l7766N9423J03859j35064d2782D4006a84335
$$ -145058 94762 53906 228868 -234757 -272523 -213100 -109241 -244305 -42782 44006 -184335
10528A67068p5546J26009f3522n7747p2235l7948A21077a65354A52315d47484
$$ 167068 91522 217531 -63522 -121269 -193504 -231452 121077 -165354 152315 -447484
10517A97239L4477j8759J08727J3936A6828b31567F31a55214A45079h8401A25269
$$ 197239 231716 212957 321684 335620 16828 -231567 631 -155214 145079 -88401 125269
10505E177b20970G0656a23805A92444H3836a87148A76842K6463b15747J05534
$$ 5177 -220970 70656 -123805 192444 83836 -187148 176842 203305 -215747 -110213
10495a10213A75163b50317i6105A86284k3215a76321N2336A0341J35310a34812
$$ -110213 175163 -250317 -96105 186284 163069 -176321 -123985 10341 145651 -134812
10484a70974d6604n7520D63341E6569J57365K57589A47939L04479j25910e38031
$$ -170974 -46604 -104124 463341 56569 213934 471523 147939 452418 326508 -538031
10473B37397k2667f8045B00713E1001A4644e2591j46057H9804l0137e5344A40684
$$ 237397 214730 -68045 200713 51001 14644 -52591 -198648 89804 59667 -55344 140684
10461b750l0256l5415j55362f8248E1326a57640L7325j4600k02406j28728C7542
$$ -2750 -33006 -68421 -223783 -68248 51326 -157640 -120315 -134915 -337321 -466049 37542
10449b4809l35673A76663P1856a05589k06419D1507D988h3507c3623j6015l7587
$$ -24809 -360482 176663 248519 -105589 -312008 41507 4988 -83507 -33623 -49638 -87225
10438h7225r0918G9440b07375O9673A15547O9263F2564c8966Q449A67736L9771
$$ -87225 -178143 79440 -207375 -137702 115547 184810 62564 -38966 -30517 167736 207507
10427B07507a18255B28534N0207a27694E7152R1540d2750l730A13159f9698K6429
$$ 207507 -118255 228534 278741 -127694 57152 148692 -42750 -46480 113159 -69698 -43269
10416d3269j80345G7055f2528G7587L02178b81453B04457a15303A43198n9760
$$ -43269 -223614 77055 -62528 77587 379765 -281453 204457 -115303 143198 83438
10406H3438A8974L0938a31152a7860k36204A4852K40127h9566j91892E6270K2383
$$ 83438 18974 49912 -131152 -17860 -254064 14852 254979 -89566 -281458 56270 78653
10395G8653j0881a86475D15212A76428P4709D9455J03677a36578A59599J13736
$$ 78653 67772 -186475 415212 176428 251137 49455 153132 -136578 159599 273335
10385B73335a47930d355H7316b40862J20031H6994k3662O1536N7667c8105E8917
$$ 273335 -147930 -4355 87316 -240862 -120831 86994 63332 124868 182535 -38105 58917
10373D1622A6431J47943R4124j09479P4787J03000j33684L7691D1017J05681K22252
$$ 41622 16431 164374 258498 149019 223806 326806 193122 230813 41017 146698 368950
10362C68950P5588B01234a807I9172D4773K5804L44420a31932C55430A39145J31888
$$ 368950 444538 201234 -1807 99172 44773 70577 414997 -131932 355430 139145 271033
10351B71033H4721J57924L38542H5584r097M2495a07311b2850A68466E3853J66333
$$ 271033 84721 242645 581187 85584 76487 118982 -107311 -22850 168466 53853 220186
10340B20186m8976O24046E3310M04249A9039J19195M5788E9705K3218J00903e1203
$$ 220186 171210 795256 53310 457559 19039 138234 184022 59705 82923 183826 -51203
10328b28106b9277p7104j42888J19452n7418A66927H1946A3377R139e3812k21721
$$ -228106 -29277 -106381 -249269 -129817 -187235 166927 81946 13377 22516 -53812 -275533
10317b75533J08327d2458A88529l7735K44555j89643O0792e6016A76595b1142
$$ -275533 -167206 -42458 188529 150794 395349 205706 266498 -56016 176595 -21142
10306A76559a30465B66714e6311B15063a06792B7971a18685k17767B86186d9119
$$ 176559 -130465 266714 -56311 215063 -106792 27971 -118685 -336452 286186 -49119
10295a29930D6670c41626Q0826B7768a88866l9668A76797e527o5264o516L4963
$$ -129930 46670 -341626 -260800 27768 -188866 -228534 176797 -5527 -70791 -77307 -42344
10284d2344c775j7788G9768d7681A77419a74911e9385k47459A59860F823J9989
$$ -42344 -3775 -21563 79768 -47681 177419 -174911 -59385 -306844 159860 6823 26812
10273B6812c4980R92H55b9702A00408i5122j00671N8191A32025n8745B8035J15496
$$ 26812 -34980 -33988 855 -29702 100408 -95122 -195793 -137602 132025 73280 28035 143531
10261A43531J8638a4686A53756j5944F791P06556b2020C3710L7223G810a84721
$$ 143531 162169 -14686 153756 137812 6791 713347 -22020 33710 70933 7810 -184721
10249B00417j2407I1238C982O913b13792A31551h3867I9900b94993C7152a49057
$$ 200417 188010 91238 3982 10895 -213792 131551 -83867 99900 -294993 37152 -149057
10237a48255M2433d8477C52110h5919K8700a3032k29830A34173d48109f586B7562
$$ -148255 -105822 -48477 352110 -85919 -57219 -13032 -242862 134173 -448109 -6586 27562
10225d08309A60659b82018I0809b7705p2777k3402F9468b5446A6870K7249J71762
$$ -408309 160659 -282018 90809 -27705 -100482 -123884 69468 -25446 16870 44119 215881
10214B15881j06029k6161b98482j2965a02495B4845a86858f1331j15388q698a0794
$$ 215881 109852 83691 -298482 -311447 -102495 24845 -186858 -61331 -176719 -185417 -10794
10202A66586e2941b1180i893l12443C6122d46574J33869J43514P4417k57329a7731
$$ 166586 -52941 -21180 -9893 -322336 36122 -446574 -312705 -169191 -94774 -352103 -17731
10190b0565k88115d431D8789N455O7450g8809L8543j39145e987E0467c00449A45279
$$ -20565 -308680 -4431 48789 54244 121694 -78809 -40266 -179411 -5987 50467 -300449 145279
10177b14156d3986k48883a1644j36581F663J76941a40797C10870I0386A8819J83548
$$ -214156 -43986 -292869 -11644 -148225 6663 183604 -140797 310870 90386 18819 202367
10166B02367c20450f325E6461f9015E7141a4347j52927H1317b5220K124o9420
$$ 202367 -320450 -6325 56461 -69015 57141 -14347 -167274 81317 -25220 -23096 -92516
10155i2516A43416M1712l1494C5877K2567b8744k42614m2495J13027I544O4752
$$ -92516 143416 185128 153634 35877 58444 -28744 -271358 -313853 -200826 9544 74296
10144G4296a00620A05341i0938j54227B20242h3974B27942c64376i1730A13419
$$ 74296 -100620 105341 -90938 -245165 220242 -83974 227942 -364376 -91730 113419
10133A67472c7150m6310C2992a95481B33112c1007m346G1833k0598a47594B1946
$$ 167472 -37150 -83460 32992 -195481 233112 -31007 -35353 71833 51235 -147594 21946
10121C7202b14728c6445C97566a34595m6413n4686j22567A192a27066o7326f9651
$$ 37202 -214728 -36445 397566 -134595 -181008 -235694 -358261 1192 -127066 -194392 -69651
10109B2623b47363c421A24717b02768C15193d15920E4880f6159k20723J16065
$$ 22623 -247363 -3421 124717 -202768 315193 -415920 54880 -66159 -286882 -170817
10099a70817j0710Q4Q7800m4823r2915A63667a82400M5215f2404j5408A02683
$$ -170817 -181527 -181443 -93643 -138466 -231381 163667 -182400 -137185 -62404 -77812 102683
10087a11084B45914C5646a13979I149a77387j35308a54987j00521a04312o9048
$$ -111084 245914 35646 -113979 9149 -177387 -312695 -154987 -255508 -104312 -173360
10077a73360f8602k02042A30802J54591a82184j25562P3620B84492c63339A01991
$$ -173360 -68602 -270644 130802 285393 -182184 -307746 -234126 284492 -363339 101991
10066b39032g923r7014F433c18692B62832A08483a20027k65298P5104O6391h2108
$$ -239032 -7923 -104937 6433 -318692 262832 108483 -120027 -385325 -310221 -243830 -82108
10054b07359Q9450G5182i6586C71399c82157A73824g3583j00103d2525a3327l62281
$$ -207359 -117909 75182 -96586 371399 -382157 173824 -73583 -173686 -42525 -13327 -375608
10043c75608B74595a7481q3830A75426D52c52007a58279c4409B98576g7738m131
$$ -375608 274595 -17481 -101311 175426 452 -352007 -158279 -34409 298576 -77738 -81869
10032h1869k16012a7805j83105c6063A84140a52736f0344b2748j31631d4826j76623
$$ -81869 -297881 -17805 -200910 -36063 184140 -152736 -60344 -22748 -154379 -44826 -221449
10021b21449D2665d18799a84893j74005C71334b48747e3243A30114K0731i3858
$$ -221449 42665 -418799 -184893 -358898 371334 -248747 -53243 130114 150845 -93858
10010C8939M8070b29686G1920P584e7216j98346B03878B607J05996c08672c3358
$$ 38939 87009 -229686 71920 79504 -57216 -255562 203878 2607 108603 -308672 -33358
9998a65393A32922M1087a52328D0054J32887a80962C76046a24274D1814m603a18458
$$ -165393 132922 174009 -152328 40054 172941 -180962 376046 -124274 41814 37211 -118458
9986B338e9508O941E8806R9874a83190Q5972m071k7230l8864q4116e3103B0525
$$ 2338 -59508 -52567 58806 158680 -183190 -97218 -101289 -128519 -167383 -251499 -53103 20525
9973I9511i8826B54652b3094F2167b5502l8545k69857c6944C51880b41597q9099
$$ 99511 -98826 254652 -23094 62167 -25502 -64047 -333904 -36944 351880 -241597 -330696
9962c30696i2780K8013q3803c1992m9246a8876k6905A58867a50833D8849N5925
$$ -330696 -92780 -64767 -148570 -31992 -81238 -18876 -45781 158867 -150833 48849 104774
9951A04774J43856C9829A9267a36085j40129a7697I4818b72070p6094i1828A12437
$$ 104774 248630 39829 19267 -136085 -276214 -17697 94818 -272070 -348164 -91828 112437
9939c11607B8814a13537h262l51419a07091K158C3278i4437D9011J84266g2320
$$ -311607 28814 -113537 -8262 -359681 -107091 -104933 33278 -94437 49011 233277 -72320
9927h0386G0498a68743f4220q9314N4900J2376k041K5060B55923A21388a50160
$$ -80386 70498 -168743 -64220 -153534 -98634 -86258 -88299 -63239 255923 121388 -150160
9915D9577B0447P2342a41893M2223l5530A49693b62190A29665b92182D23103c64898
$$ 49577 20447 92789 -141893 -99670 -135200 149693 -262190 129665 -292182 423103 -364898
9903b24119a06267F6321b02767l6316J00007O2347b9023A73988c43309J23745
$$ -224119 -106267 66321 -202767 -239083 -139076 -76729 -29023 173988 -343309 -219564
9893b19564k2852h0300A02588c25811F4822J24556J2341a33094D15628a60508
$$ -219564 -242416 -80300 102588 -325811 64822 189378 201719 -133094 415628 -160508
9882a93854O1338D6569e5799o5415k09A05542h2803j08897n2255b2739j09203
$$ -193854 -132516 46569 -55799 -121214 -121423 105542 -82803 -191700 -243955 -22739 -131942
9871a31942A63389J0708a87229p2710j05058H7897e7276C02010b20575O4031B6519
$$ -131942 163389 174097 -187229 -259939 -364997 87897 -57276 302010 -220575 -156544 26519
9859b85513A56175b92800h7360A04799a54647j258j5221r7441a00842o0884B69163
$$ -285513 156175 -292800 -87360 104799 -154647 -155905 -171126 -268567 -100842 -161726 269163
9847E1697B0531a44052b0248l01312N7639a12632N5623B7521b16111B99353a07943
$$ 51697 20531 -144052 -20248 -321560 -263921 -112632 -57009 27521 -216111 299353 -107943
9835A20336L0379l4365g0802k28309B48689d4588j41341P1157j9119O6732q9174
$$ 120336 150715 116350 -70802 -299111 248689 -44588 -185929 -114772 -133891 -67159 -156333
9824a56333L8969A5944f7016l51597b00048G924K03205b31483B3448a35489D1531
$$ -156333 -117364 15944 -67016 -418613 -200048 7924 211129 -231483 23448 -135489 41531
9812b71122M4915G7190c4351j0125g118j10610A1291g7586k74348a0117o6753
$$ -271122 -226207 77190 -34351 -44476 -7118 -117728 11291 -77586 -351934 -10117 -76870
9801g6870B2374b7410p5348J3642a4301k55319a19559e3897A19415a48825e4546
$$ -76870 22374 -27410 -102758 -89116 -14301 -269620 -119559 -53897 119415 -148825 -54546
9789c6081J146H5979a34276p9860p414d1997c270j83071h4171m11589a6594F2088
$$ -36081 -34935 85979 -134276 -214136 -221550 -41997 -3270 -186341 -84171 -495760 -16594 62088
9776i6519j3988E9839c03513R9325c8528o814k9216A85584g3403P628k0043E5571
$$ -96519 -110507 59839 -303513 -204188 -38528 -45342 -74558 185584 -73403 -65775 -85818 55571
9763e4891K4098j43455b3062l38134i306l64527H1872a5833D7914a13456a3490
$$ -54891 -30793 -174248 -23062 -361196 -9306 -373833 81872 -15833 47914 -113456 -13490
9751c8090l8694C4735c61164a65195A23680a48186F1720b53704E6520o696c044
$$ -38090 -76784 34735 -361164 -165195 123680 -148186 61720 -253704 56520 49824 -3044
9739b43560e7222l3868I2477c5680E9937a14316F3918c14190M0448k0175J7771
$$ -243560 -57222 -91090 92477 -35680 59937 -114316 63918 -314190 -273742 -293917 -276146
9728b76146J0160a19114B0211J14491a3982j79626M2679n0482H3647b23149A04655
$$ -276146 -265986 -119114 20211 134702 -13982 -193608 -150929 -201411 83647 -223149 104655
9716A22399A7711a75851O2910k38589A88786a37057B13137d78361b34290A91835
$$ 122399 17711 -175851 -112941 -351530 188786 -137057 213137 -478361 -234290 191835
9705a55726A10281f3758m7388D2376J81430b06360e233j39465B6343K03703q7026
$$ -155726 110281 -63758 -111146 42376 223806 -206360 -5233 -144698 26343 230046 143020
9694A43020d2565j37223H3237L832a99897F0875J83547b05320K8983A81523a04360
$$ 143020 -42565 -179788 83237 87069 -199897 60875 244422 -205320 -176337 181523 -104360
9682A66122b19539N6337E436K6460M0178M8372R7803b38533G0189J38397c1440
$$ 166122 -219539 -163202 5436 31896 72074 120446 218249 -238533 70189 208586 -31440
9670c2290m874k35040J2793a11894j3580e9894I9295b12998e5423b0904A25061
$$ -32290 -37164 -272204 -259411 -111894 -125474 -59894 99295 -212998 -55423 -20904 125061
9658A89843g7928c5073k43807i1107n3514K6599B9401M8245c16346f8763b795
$$ 189843 -77928 -35073 -278880 -91107 -144621 -118022 29401 77646 -316346 -68763 -2795
9646G7664a22739F1181g1866A18557J28009b26214A5591d24003a6948A2864K48091
$$ 77664 -122739 61181 -71866 118557 246566 -226214 15591 -424003 -16948 12864 260955
9635B60955E5506K41280a47138A14979a37918A8178b12629f4561k93087K3706
$$ 260955 55506 296786 -147138 114979 -137918 18178 -212629 -64561 -357648 -333942
9625c33942a31989B04631d824j27893j47064m5111B27840C9103g2994P57A37514
$$ -333942 -131989 204631 -4824 -132717 -279781 -324892 227840 39103 -72994 -72237 137514
9613a31749A04390b35958K2212I8422K43207f1873B00313c02138f3395j53364
$$ -131749 104390 -235958 -213746 98422 341629 -61873 200313 -302138 -63395 -216759
9603b16759e2983A88969E5579j356d75531d3605a0907q1754k22172J07434j43858
$$ -216759 -52983 188969 55579 54223 -475531 -43605 -10907 -92661 -314833 -207399 -351257
9592c51257I8826B8728b36110D2527c18803D622J61508b59335f487F2137F25L42508
$$ -351257 98826 28728 -236110 42527 -318803 4622 166130 -259335 -6487 62137 625 343133
9580C43133d5564j23007j47850a6623j62874j58905a65840B8389a28882l34933
$$ 343133 -45564 -168571 -316421 -16623 -179497 -338402 -165840 28389 -128882 -463815
9570d63815a77035I7786a8588A6829N4513A4676M392J00693N4907a95140j9567
$$ -463815 -177035 97786 -18588 16829 71342 14676 19068 119761 174668 -195140 -214707
9559b14707B00460a91111M1982q0256O015A81231a82028B55151c08094c6207k6537
$$ -214707 200460 -191111 -149129 -229385 -223370 181231 -182028 255151 -308094 -36207 -62744
9548f2744J4692j30277A8815K9042b95218I0413c01985J03087R3797L5259H308
$$ -62744 -48052 -178329 18815 47857 -295218 90413 -301985 -198898 -105101 -69842 8308
9536A37973b35649r0120M7895R1736e9934F9950b98053L6417J22281B91094c8156
$$ 137973 -235649 -325769 -277874 -186138 -59934 69950 -298053 -261636 -139355 291094 -38156
9524A49318a91783P2177C50660a63474m3306J02494A69305J59820a04393j5356
$$ 149318 -191783 -119606 350660 -163474 -206780 -104286 169305 329125 -104393 -119749
9514a19749p4128M8871D8670J4649I118i5476a1405j31005j75378K7137a17973
$$ -119749 -193877 -145006 48670 63319 9118 -95476 -11405 -142410 -317788 -290651 -117973
9502C16197D5855O9968g3453n1934H073d05011R9451a19772d6112j6335o1606
$$ 316197 45855 115823 -73453 -125387 8073 -405011 -305560 -119772 -46112 -62447 -124053
9491a24053m699j86964a46426B82155E0729M2683l4398c97259h6123D2467f7148
$$ -124053 -128752 -315716 -146426 282155 50729 93412 59014 -397259 -86123 42467 -67148
9479c97739J84947O7403A28598a8226q5571c8107H1557a08053b9092B04699A6024
$$ -397739 -212792 -145389 128598 -18226 -103797 -38107 81557 -108053 -29092 204699 16024
9467a64464N9816D114M5270b18239a8429j21732A04470J30043A08942r088d8143
$$ -164464 -104648 4114 49384 -218239 -18429 -140161 104470 234513 108942 99854 -48143
9455A1598d6854B33426b40037A82004b32658d7359A60715A1348Q6174c53633F8670
$$ 11598 -46854 233426 -240037 182004 -232658 -47359 160715 11348 97522 -353633 68670
9443b14599A49720e3400H6038a62673F1804b3471k19688A0455i7455a6352B27244
$$ -214599 149720 -53400 86038 -162673 61804 -23471 -243159 10455 -97455 -16352 227244
9431a23503N795J1093j91119J30645g5480r9554e8654k0143B43569E6872R1885
$$ -123503 -117708 -106615 -297734 -167089 -75480 -175034 -58654 -78797 243569 56872 148757
9420A48757c5962j7077G7501C6980g1240k07833c0032j93148H9648M9969m4745
$$ 148757 -35962 -53039 77501 36980 -71240 -279073 -30032 -223180 89648 139617 94872
9409I4872L0726g5910j74416A5041b42007O0461Q4921A59405b97916G6741O3145
$$ 94872 125598 -75910 -250326 15041 -242007 -181546 -96625 159405 -297916 76741 139886
9398A39886a27307c2226a1477o5190l55029E6767A0272Q255e5430R800q839a1765
$$ 139886 -127307 -32226 -11477 -76667 -431696 56767 10272 18527 -55430 -45630 -54469 -11765
9385e6125q4535P098L9434j90633C1702a30190N0970j09446A76262a29969H4705
$$ -56125 -140660 -133562 -94128 -284761 31702 -130190 -79220 -188666 176262 -129969 84705
9373i6674a357j51050D7769b77277a30502k9886c0389j70926j02053A37304B2604
$$ -96674 -1357 -152407 47769 -277277 -130502 -160388 -30389 -201315 -303368 137304 22604
9361D9060h9891j95498H0922c7199J1128j61201M1134n4995J4794H4818c04655
$$ 49060 -89891 -285389 80922 -37199 -26071 -187272 -146138 -201133 -186339 84818 -304655
9349a08136b242G8740i1813j9782j4574j18716G6077b37375B07655b35497L3825
$$ -108136 -2242 78740 -91813 -111595 -126169 -244885 76077 -237375 207655 -235497 -201672
9338b01672B20338e5719A10295K1253c58236Q098I677a58360f6962q531A15697
$$ -201672 220338 -55719 110295 131548 -358236 -350138 9677 -158360 -66962 -75493 115697
9326e1837r7057B92922A24947a8701k48828I2200D489J75094f19360g1729b5881
$$ -51837 -148894 292922 124947 -18701 -267529 92200 4489 179583 -619360 -71729 -25881
9314b24081D3837a71934j2032d8133n5809k6174j17190a02781a6181A36631c34013
$$ -224081 43837 -171934 -183966 -48133 -103942 -130116 -247306 -102781 -16181 136631 -334013
9302a6765p7173J0166k1930A73828b14812A24273R9696f165n7729F5248a60474
$$ -16765 -93938 -83772 -105702 173828 -214812 124273 223969 -6165 -63894 65248 -160474
9290f7524A23377P6a5302n2629j95101b6188F5084b29234a11787B28245b8552
$$ -67524 123377 123453 -15302 -67931 -263032 -26188 65084 -229234 -111787 228245 -28552
9278A5740a06355g353q6507I1752a67861B51888E793b375B17754C9339R3589C388
$$ 15740 -106355 -7353 -93860 91752 -167861 251888 5793 -2375 217754 39339 132928 3388
9265H9592b03922e530q4142A0896J62274f7239K4108B26779c35897D1050d3333
$$ 89592 -203922 -5530 -89672 10896 173170 -67239 -43131 226779 -335897 41050 -43333
9253E3997c3897B60762b52941J14285e2379B35495c41136C9005b90865J15505
$$ 53997 -33897 260762 -252941 -138656 -52379 235495 -341136 39005 -290865 -175360
9243a75360q9547f2849J4469F0573J51805b06083F4482J21549a48585L0896e6079
$$ -175360 -264907 -62849 -48380 60573 212378 -206083 64482 186031 -148585 -117689 -56079
9231b48059a13737j81610l5621a45765I9518c24643A23377B9999c41797g3053
$$ -248059 -113737 -295347 -330968 -145765 99518 -324643 123377 29999 -341797 -73053
9220e0983J4337n2284B16037C3513M5110R5124i7667j22516c8947A14843a19839
$$ -50983 -36646 -88930 216037 33513 78623 173747 -97667 -220183 -38947 114843 -119839
9208B37214a97214L9342a7842C5544g6957j4611j56796H1531R450j6074e9480
$$ 237214 -197214 -157872 -17842 35544 -76957 -91568 -248364 81531 90981 74907 -59480
9196a36595A25909n2162K39628f4987k29827a13616j62234a0414k07223B19634
$$ -136595 125909 73747 313375 -64987 -294814 -113616 -275850 -10414 -217637 219634
9185D7345L5086A07a84762j06646A1185c2207A49510i6920B5737b9149A44817
$$ 47345 82431 107 -184762 -291408 11185 -32207 149510 -96920 25737 -29149 144817
9173a36050j15880A92981F4121Q6138l3509m2182e5679F2192a6277l72284A66140
$$ -136050 -251930 192981 64121 150259 116750 74568 -55679 62192 -16277 -388561 166140
9161a18428j02735a04256G562o5e9840L869C5130J89507a15890C72a05271j20028
$$ -118428 -221163 -104256 7562 7497 -59840 -55971 35130 224637 -115890 372 -105271 -225299
9149b25299E6508c9505j42210N0632q4138D3719e8124j64305F2387K04546g1340
$$ -225299 56508 -39505 -181715 -131083 -215221 43719 -58124 -222429 62387 266933 -71340
9137a63856b7625m2162j74184f7672J4620A39500a59433A53418a13043J3457K8672
$$ -163856 -27625 -69787 -243971 -67672 -53052 139500 -159433 153418 -113043 -99586 -70914
9126g0914C8210b10231G518a4006H2586l4411b25854P8705k2568h4424k375A4046
$$ -70914 38210 -210231 7518 -14006 82586 48175 -225854 -147149 -169717 -84424 -86799 14046
9113A88741a08466I5658N3289O6741q4765F2371c11111B18277A06968a24610B83241
$$ 188741 -108466 95658 148947 215688 130923 62371 -311111 218277 106968 -124610 283241
9101a04869l20705b4475o5476D2043a24713I1590L1705J31059m2927a08896j78010
$$ -104869 -425574 -24475 -89951 42043 -124713 91590 123295 254354 211427 -108896 -286906
9090b86906j06360A87220J33710j50924a23698A37249b77523E455K3772h0165
$$ -286906 -393266 187220 320930 170006 -123698 137249 -277523 5455 29227 -80165
9079c60950B01731H9006a80843b8377k2760l6728B68744g395E3837i8065k1457
$$ -360950 201731 89006 -180843 -28377 -51137 -87865 268744 -7395 53837 -98065 -119522
9068a19522F6b96092B45858C186c99908B6682a3381p0038k6197f141j35657r1028
$$ -119522 66 -296092 245858 3186 -399908 26682 -13381 -83419 -109616 -6141 -141798 -232826
9056b32826d0984A60493b28204H3301f980j22902a1372p2227A25911b97083A41232
$$ -232826 -40984 160493 -228204 83301 -6980 -129882 -11372 -83599 125911 -297083 141232
9044B71314j06355c88394a87846i1906B33742d1560m3355a4736A01290b52614
$$ 271314 164959 -388394 -187846 -91906 233742 -41560 -84915 -14736 101290 -252614
9033b33309A25132c0170p0217k514j82594A77193c08684J37737G7577O0270c8087
$$ -233309 125132 -30170 -100387 -102901 -285495 177193 -308684 -170947 77577 137847 -38087
9021A11594l1655g5628j50202D9744K98374D1387b87113o9687f3454n2102B8480
$$ 111594 79939 -75628 -225830 49744 348118 41387 -287113 -356800 -63454 -115556 28480
9009b47684J10722M815r6456B14278e678j61506C8568l580O4590g1484B30348
$$ -247684 -136962 -132147 -228603 214278 -5678 -167184 38568 34988 99578 -71484 230348
8997b8502f421k3955j94633a10922A7477L4907b23088p992A03816e988l19293
$$ -28502 -6421 -30376 -225009 -110922 17477 52384 -223088 -231080 103816 -5988 -325281
8986c25281M6398N016B26798H173b14626Q5220b178B80987c6735H2299B0970L8287
$$ -325281 -278883 -273867 226798 8173 -214626 -129406 -2178 280987 -36735 82299 20970 59257
8974E9257a12887C01512a97270f8930j2090G0969j3404e2704k25081B2280c10548
$$ 59257 -112887 301512 -197270 -68930 -81020 70969 57565 -52704 -277785 22280 -310548
8962h0849B182i7598c9849m75424B64756n558a08825A24199P7003E5066i0503
$$ -80849 2182 -97598 -39849 -515273 264756 259198 -108825 124199 201202 55066 -90503
8950a15058N3914A65879F0198K5745K76340a3318D1504h823q5837C16024b885
$$ -115058 -61144 165879 60198 85943 362283 -13318 41504 -8823 -94660 316024 -2885
8938d7026L450A6482b40242d8894D5686Q6866O0827d4037j6964j39546e6007G2358
$$ -47026 -43576 16482 -240242 -48894 45686 132552 193379 -44037 -61001 -200547 -56007 72358
8925d5145I6914P3745M42521J364710L513898R798085D545751A485440D87014
$$ -45145 96914 170659 613180 1977890 5491788 15289873 4545751 1485440 487014
8915E08684j50274n6831q2025R9105j7259g5421k90407B76075n8111O5290g6777
$$ 508684 358410 301579 219554 318659 301400 -75421 -365828 276075 217964 283254 -76777
8903h0191m869l89346B11356b41900j30221h5704j58503I4659M8354d57B5647
$$ -80191 -85060 -474406 211356 -241900 -372121 -85704 -244207 94659 143013 -457 25647
8891b35737R4035A06425J4227a26332A59115m4250B3457a45873P23a6173A33902
$$ -235737 -141702 106425 120652 -126332 159115 114865 23457 -145873 -145150 -16173 133902
8879g5032j26720j338l3927e4579b308j47521G1712k1742Q9296a90148D2215M1143
$$ -75032 -201752 -203090 -237017 -54579 -2308 -149829 71712 49970 139266 -190148 42215 83358
8867H3358d8687j5683k9294C02936a54801B44655h8030k22749B1130b44303g5344
$$ 83358 -48687 -64370 -93664 302936 -154801 244655 -88030 -310779 21130 -244303 -75344
8855f5823k22763e5476G830Q7450h7448C15258C9398c57832a66728g4811j27663
$$ -65823 -288586 -55476 7830 95280 -87448 315258 39398 -357832 -166728 -74811 -202474
8844b02474L6674L1731j21825j8125a12781B54896a61346B06654a9625j04810
$$ -202474 -165800 -134069 -255894 -274019 -112781 254896 -161346 206654 -19625 -124435
8834a24435h752k65760J10598B4242B951b81878h9171C4940M574a2998l31090
$$ -124435 -8752 -274512 -163914 24242 2951 -281878 -89171 34940 39514 -12998 -344088
8823c44088g9341j79378h0224b4643l28278o8358h4175q3571J5794O4237m8765
$$ -344088 -79341 -258719 -80224 -24643 -352921 -421279 -84175 -167746 -151952 -87715 -136480
$$ [...]
##END NTUPLES=NMR SPECTRUM
##END=
