##TITLE=NES1068_159122.0013_001_9705792_3LNsZ8qjEM
##JCAMPDX= 6.0         $$ Bruker NMR JCAMP-DX V2.0
##DATA TYPE= NMR SPECTRUM
##DATA CLASS= NTUPLES
##ORIGIN= BRUKER
##OWNER= Administrator
$$ 1.72 TOPSPIN		Version 2.1
$$ 2016-05-01 15:52:45.817 -0700  Administrator@X
$$ Compression mode = diff/dup
##.OBSERVE FREQUENCY= 400.02188249412
##.OBSERVE NUCLEUS= ^1H
##.ACQUISITION MODE= SIMULTANEOUS (DQD)
##.ACQUISITION SCHEME= undefined
##.AVERAGES= 64
##.DIGITISER RES= 22
##SPECTROMETER/DATA SYSTEM= spect
##.PULSE SEQUENCE= noesygpps1d.comp
##.SOLVENT NAME= COFFEE_meoh
##.SHIFT REFERENCE= INTERNAL, COFFEE_meoh, 1, 14.9617
##AUDIT TRAIL= $$ (NUMBER, WHEN, WHO, WHERE, PROCESS, VERSION, WHAT)
$$ ##TITLE= Audit trail, TOPSPIN		Version 2.1
$$ ##JCAMPDX= 5.01
$$ ##ORIGIN= Bruker BioSpin GmbH
$$ ##OWNER= Administrator
$$ $$ E:\/data/COFFEE/nmr/NES1068_159122.0013_001_9705792_3LNsZ8qjEM/22/pdata/1/auditp.txt
$$ ##AUDIT TRAIL=  $$ (NUMBER, WHEN, WHO, WHERE, PROCESS, VERSION, WHAT)
(   1,<2016-05-01 15:52:40.958 -0700>,<Administrator>,<X>,<go>,<TOPSPIN 2.1>,
      <created by zg
	started at 2016-05-01 15:41:11.396 -0700,
	POWCHK enabled, PULCHK disabled,
       configuration hash MD5:
       21 0F 79 D6 B3 7B B4 F6 88 20 88 DB 03 48 BD 9F
       data hash MD5: 64K
       4A B5 4B 44 6C 85 61 F2 36 C4 4C 72 89 4F 70 E7>)
(   2,<2016-05-01 15:52:44.067 -0700>,<Administrator>,<X>,<proc1d>,<TOPSPIN 2.1>,
      <Start of raw data processing
       efp LB = 0.3 FT_mod = 6 PKNL = 1 PHC0 = 0 PHC1 = 0 SI = 128K 
       data hash MD5: 128K
       B6 4A B2 07 1F 47 A7 25 EC 3D 27 3B E4 CA F6 06>)
(   3,<2016-05-01 15:52:44.927 -0700>,<Administrator>,<X>,<proc1d>,<TOPSPIN 2.1>,
      <pk PHC0 = -85.66589 PHC1 = 0 
       data hash MD5: 128K
       7A B1 C0 0D 88 4B EA 11 5C EA 18 3E 68 85 86 4A>)
(   4,<2016-05-01 15:52:45.317 -0700>,<Administrator>,<X>,<proc1d>,<TOPSPIN 2.1>,
      <abs ABSG = 1 
       data hash MD5: 128K
       6E 76 8C A1 63 96 44 18 C0 33 F0 20 C8 56 2D 51>)
(   5,<2016-05-01 15:52:45.411 -0700>,<Administrator>,<X>,<proc1d>,<TOPSPIN 2.1>,
      <abs ABSG = 2 
       data hash MD5: 128K
       7D F6 BA 3E DD B1 1E E5 8D 34 31 0B BB 85 4E 9B>)
(   6,<2016-05-01 15:52:45.505 -0700>,<Administrator>,<X>,<proc1d>,<TOPSPIN 2.1>,
      <abs ABSG = 3 
       data hash MD5: 128K
       8C 9C 5A 64 A5 A5 0F 57 F5 5A E4 DA 49 6D DC 2A>)
(   7,<2016-05-01 15:52:45.583 -0700>,<Administrator>,<X>,<proc1d>,<TOPSPIN 2.1>,
      <abs ABSG = 4 
       data hash MD5: 128K
       C3 E8 75 3C AB FE 18 73 0A E6 5E CA E0 E1 DD 2A>)
(   8,<2016-05-01 15:52:45.661 -0700>,<Administrator>,<X>,<proc1d>,<TOPSPIN 2.1>,
      <abs ABSG = 5 
       data hash MD5: 128K
       5C B2 C9 BB 77 92 C5 70 05 25 2D AC 06 D2 11 2F>)
$$ ##END=
$$ 
$$ $$ hash MD5
$$ $$ 7E BE AC DE AE 2D D5 D2 03 B3 49 5B 6E 26 52 41
##$RELAX= 
##$RELAX= 
##$RELAX= 
##$RELAX= 
##$RELAX= 
##$RELAX= 
##$RELAX= 
##$RELAX= 
$$ Bruker specific parameters
$$ --------------------------
##$DU= <E:\>
##$EXPNO= 22
$$ [...]
150 150 150 150 150 150 150 150
##$TP07= 0
##$TPNAME0= <>
##$TPNAME1= <>
##$TPNAME2= <>
##$TPNAME3= <>
##$TPNAME4= <>
##$TPNAME5= <>
##$TPNAME6= <>
##$TPNAME7= <>
##$TPOAL= (0..7)
0.5 0.5 0.5 0.5 0.5 0.5 0.5 0.5
##$TPOFFS= (0..7)
0 0 0 0 0 0 0 0
##$TUNHIN= 0
##$TUNHOUT= 0
##$TUNXOUT= 0
##$USERA1= <user>
##$USERA2= <user>
##$USERA3= <user>
##$USERA4= <user>
##$USERA5= <user>
##$V9= 5
##$VALIST= <valist>
##$VCLIST= <CCCCCCCCCCCCCCC>
##$VD= 0
##$VDLIST= <DDDDDDDDDDDDDDD>
##$VPLIST= <PPPPPPPPPPPPPPP>
##$VTLIST= <TTTTTTTTTTTTTTT>
##$WBST= 2048
##$WBSW= 25
##$XGAIN= (0..3)
0 0 0 0
##$XL= 0
##$YL= 0
##$YMAX_a= 5375789
##$YMIN_a= -11484670
##$ZGOPTNS= <>
##$ZL1= 120
##$ZL2= 120
##$ZL3= 120
##$ZL4= 120
##$ABSF1= 14.9617
##$ABSF2= -5.596481
##$ABSG= 5
##$ABSL= 3
##$ALPHA= 0
##$AQORDER= 0
##$ASSFAC= 0
##$ASSFACI= 0
##$ASSFACX= 0
##$ASSWID= 0
##$AUNMP= <proc_prof1d_extract.lims>
##$AXLEFT= 0
##$AXNAME= <>
##$AXNUC= <1H>
##$AXRIGHT= 0
##$AXTYPE= 0
##$AXUNIT= <>
##$AZFE= 0.1
##$AZFW= 0.1
##$BCFW= 0
##$BC_mod= 0
##$BYTORDP= 0
##$COROFFS= 0
##$CY= 15
##$DATMOD= 1
##$DC= 0
##$DFILT= <>
##$DTYPP= 0
##$F1P= 0
##$F2P= 0
##$FCOR= 0.5
##$FTSIZE= 131072
##$FT_mod= 6
##$GAMMA= 0
##$GB= 0
##$INTBC= 1
##$INTSCL= 1
##$ISEN= 128
##$LB= 0.3
##$LEV0= 0
##$LPBIN= 0
##$MAXI= 10000
##$MC2= 0
##$MEAN= 0
##$ME_mod= 0
##$MI= 0
##$NCOEF= 0
##$NC_proc= -2
##$NLEV= 6
##$NOISF1= 0
##$NOISF2= 0
##$NSP= 0
##$NTH_PI= 0
##$NZP= 0
##$OFFSET= 14.9617
##$PC= 1
##$PHC0= -85.66589
##$PHC1= 0
##$PH_mod= 1
##$PKNL= yes
##$PPARMOD= 0
##$PPDIAG= 0
##$PPIPTYP= 0
##$PPMPNUM= 2147483647
##$PPRESOL= 1
##$PSCAL= 4
##$PSIGN= 0
##$PYNMP= <proc.py>
##$REVERSE= no
##$SF= 400.020009355376
##$SI= 131072
##$SIGF1= 0
##$SIGF2= 0
##$SINO= 400
##$SIOLD= 131072
##$SPECTYP= <>
##$SREGLST= <1H.CDCl3>
##$SSB= 0
##$STSI= 131072
##$STSR= 0
##$SW_p= 8223.68421052631
##$SYMM= 0
##$S_DEV= 0
##$TDeff= 65536
##$TDoff= 0
##$TI= <>
##$TILT= no
##$TM1= 0
##$TM2= 0
##$TOPLEV= 0
##$USERP1= <user>
##$USERP2= <user>
##$USERP3= <user>
##$USERP4= <user>
##$USERP5= <user>
##$WDW= 1
##$XDIM= 131072
##$YMAX_p= 468241439
##$YMIN_p= -9975
##$CURPLOT= <Network HP LaserJet P1505>
##$CURPRIN= <$Network HP LaserJet P1505>
##$DFORMAT= <normdp>
##$LAYOUT= <+/1D_H.xwp>
##$LFORMAT= <normlp>
##$PFORMAT= <normpl>
##$SURQMSG= 1
$$ End of Bruker specific parameters
$$ ---------------------------------
##NTUPLES= NMR SPECTRUM
##VAR_NAME=  FREQUENCY,     SPECTRUM/REAL,   SPECTRUM/IMAG
##SYMBOL=    X,             R,               I
##VAR_TYPE=  INDEPENDENT,   DEPENDENT,       DEPENDENT
##VAR_FORM=  AFFN,          ASDF,            ASDF
##VAR_DIM=   131072,        131072,          131072
##UNITS=     HZ,            ARBITRARY UNITS, ARBITRARY UNITS
##FACTOR=    0.0627417313425164, 1,          1
##FIRST=     8223.62146879497, -392,         -51791
##LAST=      0,             1555,            -51880
##MIN=       0,             -9975,           0
##MAX=       8223.62146879497, 468241439,    0
$$ Real data points
##PAGE= N=1
##DATA TABLE= (X++(R..R)), XYDATA
$$ [...]
61386F59578n2J741K860L666M388M685M416M075M037M171M409M771M684L350J007
61371G11786j182k716m079n468o425o902p313p321n952l213j99K486M945O525
61357F74972N992L573R84j040l438o419q366q212p136o783p226p779q374q982
61343F11766q962q107p266o995o703n948n280m966m163k436p45K3L60R76J503
61328E53057J480J441J914K434K562K919M144N752P081Q405J0210J2234J4113
61315F27746J6068J8066J9359J9571J9328J9014J8060J6246J4459J3267J1877
61304H13061R516O690M149J713q45k977m406n849p613q717q581q333r143j0356
61290G68309j0609r746q368o457l897j464J48J561L609N766O957P300P761Q691
$$ plain form
61386 659578 659526 661267 664127 667793 672181 676866 681282 685357 689394 693565 697974 702745 707429 710779 711786
61371 711786 710604 707888 703809 698341 691916 685014 677701 670380 664428 661215 661016 663502 668447 674972
61357 674972 680964 684537 685521 684481 681043 674624 666258 658046 650910 644127 636901 629122 620748 611766
61343 611766 602804 594697 587431 580436 573733 567785 562505 557539 553376 550940 550195 550218 550578 551554 553057
61328 553057 554537 555978 557892 560326 562888 565807 569951 575703 582784 591189 601399 613633 627746
61315 627746 643814 661880 681239 700810 720138 739152 757212 773458 787917 801184 813061
61304 813061 822577 829267 833416 835129 834284 831307 826901 821052 813439 804722 796141 787808 778665 768309
61290 768309 757700 747954 739586 733129 729232 727768 727916 729477 733086 738852 745809 753109 760870 769561
61276G69561R861J1291J2893J3945J4029J3796J3757J3215J1545R670Q787Q321
61264I10671O724L935J511N71P93J393J997K626L611N463Q219J1314J4465J8083
61250I91376K2373K6899L1604L7191M3619M9326N2867N4193N3268M8679L9295
61239A450690K6513J3449K311o139j1450j3414j2872j1117q642n322j412K715
61227A425310P349J2901J8977K4914L0544L5396L7784L6067L0303K1586J0448
61216A691579k695j6006k6854l4014l8070l9847l9636l7834l5107l1707k7575
61205A362234k3096j8973j5431j2406j0352j0035j1493j3855j6124j7619j7974
61194A194876j7311j6271j5297j4233j3005j2211j2416j3332j4326j5298j6521
$$ plain form
61276 769561 779422 790713 803606 817551 831580 845376 859133 872348 883893 893563 902350 910671
61264 910671 917395 921330 922841 923412 924205 925598 927595 930221 933832 939295 947514 958828 973293 991376
61250 991376 1013749 1040648 1072252 1109443 1153062 1202388 1255255 1309448 1362716 1411395 1450690
61239 1450690 1477203 1490652 1492963 1486824 1475374 1461960 1449088 1437971 1429329 1424007 1422595 1425310
61227 1425310 1432659 1445560 1464537 1489451 1519995 1555391 1593175 1629242 1659545 1681131 1691579
61216 1691579 1688884 1672878 1646024 1612010 1573940 1534093 1494457 1456623 1421516 1389809 1362234
61205 1362234 1339138 1320165 1304734 1292328 1281976 1271941 1260448 1246593 1230469 1212850 1194876
61194 1194876 1177565 1161294 1145997 1131764 1118759 1106548 1094132 1080800 1066474 1051176 1034655
61183A034655j8022j9563k0786k1061j9905j7910j6398j5731j4903j3259j1414
61172H45703r929q328o377n048n038n434n012m009l361l102k725k315k118j749
61158G81158j039r31k319m644o814q698j0536j1723j1539j0429r225p711n309
61145F90241k491j93J621L455M922N304N057N293O097O620O590O498O483O159
61131G51656N390M340L036J631P35O88J052J434K104L058L486L112L082M443O621
61116G95868Q420R560J0128R634P877N731L771J185k612o433q891j0382j1906
61103H11950j3022j2796j1740j0942j0143q610p065o699p028o701n846n570n775
61090G00013n508n008n268n969n870m999m463m401m078l624l733l926l074j468
$$ plain form
61183 1034655 1016633 997070 976284 955223 935318 917408 901010 885279 870376 857117 845703
61172 845703 835774 827446 821069 816021 810983 805549 800537 796528 793167 790065 787340 785025 782907 781158
61158 781158 780119 779188 776869 772225 765411 756713 746177 734454 722915 712486 703261 695550 690241
61145 690241 687750 687557 689178 692633 697555 702859 707916 713209 719306 725926 732516 739014 745497 751656
61131 751656 757046 761386 764422 766053 766788 767476 768528 769962 772066 775124 778610 781722 784804 789247 795868
61116 795868 804288 813848 823976 833610 841487 847218 850989 852174 849562 843129 834238 823856 811950
61103 811950 798928 786132 774392 763450 753307 744697 737632 730933 723905 717204 711358 705788 700013
61090 700013 694505 689497 684229 678260 672390 667391 662928 658527 654449 650825 647092 643166 640092 638624
61076F38624l75J52J086K358L018L261M201N756O754P088P787R043J0073J0817
61062G09643J1851J2827J2966J2799J3433J4392J4366J3668J3593J3709J2427
61051H55674J0097Q754Q773Q560P779P958R476J0841J1597J3075J5452J6900J6653
61038A001589J6310J7061J8204J9479K2146K6343K9970L1652L2591L4075L5550
61027A284970L6639L8706M2776M8080N4254O2513P2970Q3266R1900J00585J11352
61016B028011J24111J39620J62049J95050K37344K85687L40140M02816M74158
61007D388986N56260O58583P94145R70654J191661J460960J762847K021306K095453
60998A5900855J858212J311295O20910K0980l30473m08839k69423J6432L53406
$$ plain form
61076 638624 638249 638401 639487 641845 644863 648124 652325 658081 664835 671923 679710 688753 698826 709643
61062 709643 721494 734321 747287 760086 773519 787911 802277 815945 829538 843247 855674
61051 855674 865771 874525 883298 891858 899637 907595 917071 927912 939509 952584 968036 984936 1001589
61038 1001589 1017899 1034960 1053164 1072643 1094789 1121132 1151102 1182754 1215345 1249420 1284970
61027 1284970 1321609 1360315 1403091 1451171 1505425 1567938 1640908 1724174 1816074 1916659 2028011
61016 2028011 2152122 2291742 2453791 2648841 2886185 3171872 3512012 3914828 4388986
61007 4388986 4945246 5603829 6397974 7368628 8560289 10021249 11784096 13805402 15900855
60998 15900855 17759067 19070362 19691272 19712252 19381779 18972940 18703517 18719949 19073355
60989A9073355N88891N54015J78524m36949j078617j556422j796039j828743j726878
60980A1971137j555529j359882j167715r92137q36150o99527n82407m84062m01816
60971C891912l32797k75785k30433j95499j68522j47014j29391j14815j02631
60962B195025r2188q3033p4988o8014o2037n6944n2535m8691m5652m3854m3167
60951A523922m2596m1276l9484l8108l7363l6744l6021l5389l4668l3222l0956
60940A118095k8555k6559k4882k3322k1929k0608j9065j7298j5569j3855j2065
60929H94388j0680j0254j0183r025o336l241r06P02K112L375M302M975N453N527
60915H70209N154M578L783K365L78j366k190k343k538l020l420l312k865l040
$$ plain form
60989 19073355 19662246 20216261 20394785 19957836 18879219 17322797 15526758 13698015 11971137
60980 11971137 10415608 9055726 7888011 6895874 6059724 5360197 4777790 4293728 3891912
60971 3891912 3559115 3283330 3052897 2857398 2688876 2541862 2412471 2297656 2195025
60962 2195025 2102837 2019804 1944816 1876802 1814765 1757821 1705286 1656595 1610943 1567089 1523922
60951 1523922 1481326 1440050 1400566 1362458 1325095 1288351 1252330 1216941 1182273 1149051 1118095
60940 1118095 1089540 1062981 1038099 1014777 992848 972240 953175 935877 920308 906453 894388
60929 894388 883708 873454 863271 854246 847910 844669 843763 844465 846577 849952 854254 859229 864682 870209
60915 870209 875363 879941 883724 886089 886467 885101 882911 880568 878030 875010 871590 868278 865413 862373
60901H62373m816q049j1483j4220j6464j8290j8685j6917j4130j2129j1074r791
60889G06325p990o612o139o073o166o640p157p014o433o272o436o052n207m867
60875F17267n011m574l550l241l999m533m087l563l644l474k199m34P63J170Q52
60860E77743m24k278l435l216k328j512m89J012K383L086L431L680L402K448J519
60845E85022J045N12m62j440k190l220m535n094m306l072k423k156j661j113r12
60830E53995p50k20M09P34R44J321J637J489O56j154l984o919q627r033r237r635
60814E11626r408q281p328p304p494o977n941n029m422m165m368m564m010k943
60800D29392k413k467k007q39k37p88j370j083o47q12r32k32P65J200J136R76
$$ plain form
60901 862373 857557 849508 838025 823805 807341 789051 770366 753449 739319 727190 716116 706325
60889 706325 698335 691723 685584 679511 673345 666705 659548 652534 646101 639829 633393 627341 622134 617267
60875 617267 612256 607682 604132 600891 596892 592359 588272 584709 581065 577591 575392 574958 575721 576891 577743
60860 577743 577319 575041 571606 568390 566062 564550 564061 565073 567456 570542 573973 577653 581055 583503 585022
60845 585022 586067 586579 586117 584677 582487 579267 574732 569638 565332 562260 559837 557681 556020 554907 553995
60830 553995 553245 553025 553434 554168 555112 556433 558070 559559 560215 559061 555077 548158 539531 530498 521261 511626
60814 511626 502218 493937 486609 479305 471811 464834 458893 453864 449442 445277 440909 436345 432335 429392
60800 429392 426979 424512 422505 421666 421429 420641 419271 418188 417541 416729 415797 415565 416330 417530 418666 419642
60784D19642O97N14J031J998K199J366P99J281J973K225K879M550O153O479N884
60769D59670N221M447L488L125L676M078L543K854K835K808J928P09o0p15j696
60754D95911k375k231j911j875j319J78J290P23r21k500m105n966p032o497n444
60739D55926n220n329m714l902l925m240l783l051l113l373k511r10r5k79m46
60724D11035l73o15r47o52r1j89p29q14n96r01j540j668j496j878k622k840k715
60707C90369l102l671l192j680n60n74r72r27m86K3M84Q51J328K448M192N531
60691C90062N671N195N064N244N313N564O266O648N922M600L618K912K147J852
60677D56078K364K595J400o00k120l192m364m918l897k206j635k206k450j975
$$ plain form
60784 419642 420339 420853 421884 423882 426081 427447 428246 429527 431500 433725 436604 441154 447307 453786 459670
60769 459670 464891 469338 472826 475951 479627 483705 487248 490102 492937 495745 497673 498382 498322 497607 495911
60754 495911 493536 491305 489394 487519 486200 486378 487668 488391 487470 484970 480865 474899 467867 461370 455926
60739 455926 450706 445377 440663 436761 432836 428596 424813 421762 418649 415276 412765 411855 411760 411481 411035
60724 411035 410662 410047 409100 408448 408357 408168 407439 406625 406029 405128 403588 401920 400424 398546 395924 393084 390369
60707 390369 387267 383596 380404 378724 378164 377590 376618 375691 375205 375228 375712 376563 377891 380339 384531 390062
60691 390062 395733 400928 405992 411236 416549 422113 428379 435027 440949 445549 449167 452079 454226 456078
60677 456078 458442 461037 462437 461837 459717 456525 452161 447243 443346 441140 439505 437299 434849 432874
60663D32874j772k167k376k031j506q05L45J406J576J242J475K322L015L456L975
60648D41029L993K593J81j997l644n250o501o581n783n167m827m004k737j750
60634C99555r57K95J710K339K254K374K799K928K998L952N758P390Q301Q640Q241
60619D58577O869N133L713K144k25k578l658l794m148m436l489j739j002j773
60605D49594k752l064l110l105k584j562n86M39J917L269L590L462M290O009P216
60590D63023P461P580P780P390O504N955N569M267K051M2j498l295n163n983n750
60575D95933n707o086n678m032k263j196m11M75J115J478K083K953L669M467N812
60560D92612P024P010O234O092O482O018M607L612L386K904K111K291L563M347
$$ plain form
60663 432874 431102 428935 426559 424528 423022 422217 422562 423968 425544 426786 428261 430583 433598 437054 441029
60648 441029 445022 447615 447796 445799 442155 436905 430404 423823 418040 412873 408046 404042 401305 399555
60634 399555 398598 398893 400603 402942 405196 407570 410369 413297 416295 420247 426005 433395 441696 450336 458577
60619 458577 465446 470579 474292 476436 476211 473633 469975 466181 462033 457597 454108 452369 451367 449594
60605 449594 446842 443778 440668 437563 434979 433417 432831 433270 435187 438456 442046 445508 449798 455807 463023
60590 463023 470484 478064 485844 493234 499738 505693 511262 515529 517580 517622 516124 512829 507666 501683 495933
60575 495933 490226 484140 478462 474430 472167 470971 470560 471035 472150 473628 475711 478664 482333 486800 492612
60560 492612 499636 506646 512880 518972 525454 531472 536079 539691 543077 545981 548092 550383 553946 558293
60546E58293M044M106N641P895J0033J2530J5826J9299K2446K5668K9149L2332
60534G47262L5060L7615L9137L7641L2262K4049J4165L031q301j7846k4582k9112
60522H90381l1880l2353l0550k7653k4445k0699j6718j3662j1696r476o192k572
60510F62485Q10M414Q308J1619J4286J7683K2610K8177L3470L8656M3749M7823
60498I34090N0317N1548N1145M7708M0958L2701K4816J7840J2259R386R688J1577
60486A294033J2910J2528R690L530n826j6910k8372l9584m9313n5586n7817n7527
60474A021756n6086n3257m8776m3725l9200l5090l1213k8260k6538k5073k2991
60463F11547k0642j8523j6391j4250j2809j2154j1279r740q366p559o407m373
$$ plain form
60546 558293 562337 566443 572084 579979 590012 602542 618368 637667 660113 685781 714930 747262
60534 747262 782322 819937 859074 896715 928977 953026 967191 970222 961921 944075 919493 890381
60522 890381 858501 826148 795598 767945 743500 722801 706083 692421 680725 671249 665057 662485
60510 662485 663295 667709 676017 687636 701922 719605 742215 770392 803862 842518 886267 934090
60498 934090 984407 1035955 1087100 1134808 1175766 1208467 1233283 1251123 1263382 1272768 1282456 1294033
60486 1294033 1306943 1319471 1329161 1332691 1326865 1309955 1281583 1241999 1192686 1137100 1079283 1021756
60474 1021756 965670 912413 863637 819912 780712 745622 714409 686149 659611 634538 611547
60463 611547 590905 572382 555991 541741 528932 516778 505499 495759 487393 479834 473427 469054
60451D69054k399j383r79p28r19j403j169p4N33m7o11m4R80J427J611K239L022
60434D69110L431L702M119M391M543N144N893N553M001K808K858L167L039L511
60420E25270N341P364Q281Q542Q936Q923P912O831O707P004O942P319R322J2483
60406F37177J5352J7313J8452J8579J7778J7068J7142J7238J6411J5051J4045
60395H21606J3344J2467J1577J1014J0514R750Q795P402N000K013j05q98j471
60382I11008k296k178m71J461K268K469K884K896J869Q04Q39J357J186O30P36
60367I25462J588K874N019Q268J1648J4261J6659J9533K2011K2692K1426J8809
60355A090250J4867R574L737j863p345j2759j7361k0856k4073k7238k8978k8245
$$ plain form
60451 469054 466655 465272 464293 463565 462646 461243 460074 460000 460533 460486 459875 459831 460811 462238 463849 466088 469110
60434 469110 472541 476243 480362 484753 489296 494440 500333 505886 509887 512695 515553 518720 521759 525270
60420 525270 530611 537975 546256 554798 563734 572657 580569 587400 594107 601111 608053 615372 624694 637177
60406 637177 652529 669842 688294 706873 724651 741719 758861 776099 792510 807561 821606
60395 821606 834950 847417 858994 870008 880522 890272 899067 906469 911469 913482 913377 912479 911008
60382 911008 908712 906534 906063 907524 909792 912261 915145 918041 919910 920714 921553 922910 924096 924726 925462
60367 925462 927050 929924 934943 943211 954859 969120 985779 1005312 1027323 1050015 1071441 1090250
60355 1090250 1105117 1114691 1118428 1116565 1109220 1096461 1079100 1058244 1034171 1006933 977955 949710
60343I49710k5960k3550k1310j9386j8656j9080j8818j6741j4301j3260j2984
60332G45664j1873j0019q370o529l531J10L179N762Q644J1576J3747J5211J6179
60319G79750J5913J3921J1206Q729N778J577k727n640p658r995j2093j2507j1399
60306G74855j0055q626o453l876j737J81K324L675K932P03j445l359n799q289
60292G35031r568r674r553r144p779o011n037m759m268l729l905m324l915l069
60278F50296k987l420k939j297L94J576K629L583M153M802O144P622Q322Q603
60264F87481R331J0068R784Q856Q483Q590Q079O827N620M409K393m15l311o171
60250G60024r039j1010j1217j0414r872r260p419m674k394p00J509M413P048Q938
$$ plain form
60343 949710 923750 900200 878890 859504 840848 821768 802950 786209 771908 758648 745664
60332 745664 733791 723772 715402 708873 705342 705452 708631 714393 723037 734613 748360 763571 779750
60319 779750 795663 809584 820790 829519 835297 836874 834147 828507 820849 810854 798761 786254 774855
60306 774855 764800 756174 749721 745845 744108 744289 746613 750288 753220 753923 752478 749119 743320 735031
60292 735031 725463 715789 706236 697092 689313 683302 678265 673506 669238 665509 661604 657280 653365 650296
60278 650296 647309 643889 640950 639653 640047 641623 644252 647835 651988 656790 662934 670556 678878 687481
60264 687481 696812 706880 716664 725520 734003 742593 750672 757499 763119 767528 769921 769506 766195 760024
60250 760024 750985 739975 728758 718344 708472 699212 691793 687119 684725 684025 685534 689947 696995 705933
60236G05933J0355J1247J1476J1668J2267J2416J1442J0590J1348J2882J3310
60225H34934J2783J2944J3899J4232J3791J3959J5164J6453J7667J9800K2976
60214A008602K5965K8026K9482L0544L1249L2474L5076L8097L9572L9031L7474
60203A375592L5168L1361K6064K0113J3608O113j632q075j2765j6212j8146j7935
60191A433254j6343j4794j3171j0416p012m654l584k544j283p62q83l59R81K013
60177A360443K610L828N690P048P864R242J0883J0903Q708N810L267N71k344m247
60163A430276m608m496m676m594m005l805m663o352q922j2814j7358k0969k3335
60150A309679k5726k8624l0823l1413l0865k9637k7318k3874k0225j7023j4159
$$ plain form
60236 705933 716288 727535 739011 750679 762946 775362 786804 797394 808742 821624 834934
60225 834934 847717 860661 874560 888792 902583 916542 931706 948159 965826 985626 1008602
60214 1008602 1034567 1062593 1092075 1122619 1153868 1186342 1221418 1259515 1299087 1338118 1375592
60203 1375592 1410760 1442121 1468185 1488298 1501906 1508019 1506387 1498312 1485547 1469335 1451189 1433254
60191 1433254 1416911 1402117 1388946 1378530 1371518 1366864 1363280 1360736 1359453 1358691 1357808 1357449 1358430 1360443
60177 1360443 1363053 1366881 1372571 1379619 1387483 1396725 1407608 1418511 1427219 1433029 1436296 1436867 1434523 1430276
60163 1430276 1425668 1421172 1416496 1411902 1407897 1404092 1399429 1393077 1384155 1371341 1353983 1333014 1309679
60150 1309679 1283953 1255329 1224506 1193093 1162228 1132591 1105273 1081399 1061174 1044151 1029992
60139A029992j1742j0172r089p789o704o762p344o836n372m981o565q733j0076
60126I27827j0676j0909j0621j0094j0102j0525j0444r880r683r663q729p143
60114H09358o467o923o985o101n554n925n897m576k946k059j472o00J60N31J118
60099G55662K081K475J853J158J339K165L090M103N279O436P597Q759R314Q888
60085H20199Q349Q514Q357O407L384J208j99k562n846q057q687r468j1089j1990
60071G98520j1290j0237r717q836p143n810n319m258j748R60K714M293O676R240
60057G58045J1003J2051J2551J1905J0062Q159O796N146K573k61k619m477n554
60044H25380n222l961l073k538j090J097K022Q82q20j932l148m841n826n392m410
$$ plain form
60139 1029992 1018250 1008078 998989 991200 984496 977734 970390 963554 958182 953201 946636 937903 927827
60126 927827 917151 906242 895621 885527 875425 864900 854456 844576 834893 825230 816501 809358
60114 809358 802891 795968 788983 782882 777328 771403 765506 760930 757984 755925 754453 753853 754013 754544 755662
60099 755662 757743 760218 762071 763229 764568 766733 769823 773926 779205 785641 793238 801997 811311 820199
60085 820199 828548 837062 845419 851826 855210 856418 856219 853657 847811 839754 831067 821599 810510 798520
60071 798520 787230 776993 767276 758440 751297 745487 740168 735910 734162 735122 737836 742129 748805 758045
60057 758045 769048 781099 793650 805555 815617 823776 830572 835718 838291 838030 835411 830934 825380
60044 825380 820158 816197 813124 810586 809496 810593 812615 813497 812677 810745 807597 802756 796930 791538 787128
60029G87128l411j667P68K497L339M975P831R862R890R543J0033R657O567J849
60015H58861k516o603j1138j4884j6097j5363j4568j4068j2927j1102r397p903
60003G22295o204m532l330k340j231l21K74J121K178K320J236L83Q41J640J507
59988G15837Q99Q59J085O98j29o22o44k89Q93L138N764Q031R868J1176J1657J1812
59972G80033J2805J4636J5886J5718J4642J2886R855N878K437j04k968o344q573
59959H66787q875q652q856q362o316l799j630J236N501R774J2842J5648J9256
59946H84554K2859K5633K8598L2643L6473L8591L9553M0248L9576L6066L0354
59935A255148K3995J7150R418J698m809j0378j5731k0350k3436k5428k7022k7824
$$ plain form
60029 787128 783717 782050 782818 785315 788654 793629 801460 811322 821212 830755 840788 850445 857012 858861
60015 858861 856345 849742 838604 823720 807623 792260 777692 763624 750697 739595 730198 722295
60003 722295 716091 711559 708229 705889 704658 704337 704611 705732 707910 710230 711466 711849 712690 714330 715837
59988 715837 716736 717595 718680 719378 719249 718627 717983 717694 718587 721725 727489 735520 745388 756564 768221 780033
59972 780033 792838 807474 823360 839078 853720 866606 876461 882339 884776 884672 881704 875360 866787
59959 866787 857912 849260 840404 832042 825726 821927 820297 821533 827034 836808 849650 865298 884554
59946 884554 907413 933046 961644 994287 1030760 1069351 1108904 1149152 1188728 1224794 1255148
59935 1255148 1279143 1296293 1305711 1307409 1302600 1292222 1276491 1256141 1232705 1207277 1180255 1152431
59923A152431k7402k6348k4977k2405j8361j4246j1127q303n337l482l425l642
59911I83376k878k327l389n132o111o793p975q573p432n718n068m794l277p38
59897I13171J645M001O727Q629Q568P763Q044Q978R111Q817R466J0779J1471J1624
59883A028794J2007J1965J0364P970O631O815P804R559J2402J5772J9112K3157
59871A172352K8593L4638M0550M6991N3913N8604N8023N1681M0367K4022L612
59860A613346j6657l2109m1722m7035m8474m5671m0135l4261k8243k0889j2941
59849A245209o708k771K94L317O082R022J2933J7350K1338K5333L0022L4165L5886
59836A431472L5455L4714L4597L5450L8660M5417N4709O4964P6578R0077J02699
$$ plain form
59923 1152431 1125029 1098681 1073704 1051299 1032938 1018692 1007565 999262 993925 990443 987018 983376
59911 983376 980498 978171 974782 969650 963539 956746 948771 940198 932766 927048 921980 917186 913909 913171
59897 913171 914816 918817 925544 934173 942741 950504 958548 967526 976637 985454 994920 1005699 1017170 1028794
59883 1028794 1040801 1052766 1063130 1071100 1077731 1084546 1092350 1101909 1114311 1130083 1149195 1172352
59871 1172352 1200945 1235583 1276133 1323124 1377037 1435641 1493664 1545345 1585712 1609734 1613346
59860 1613346 1596689 1564580 1522858 1475823 1427349 1381678 1341543 1307282 1279039 1258150 1245209
59849 1245209 1238501 1235730 1236024 1239341 1245423 1254445 1267378 1284728 1306066 1331399 1361421 1395586 1431472
59836 1431472 1466927 1501641 1536238 1571688 1610348 1655765 1710474 1775438 1852016 1942093 2044792
59825B044792J09845J09329J01627Q6973O5531M0094J5440n170k0699l0392l4134
59814B483236l4381l4718l6470l9025m2820m8970n6276o1670o3795o3656o2035
59803A939420n9081n6220n5429n6434n7197n7232n7695n8314n7170n3810m9843
59792A320995m5998m1184l4992k8737k3470j8971j5005j1670q422m612q96J803
59780A088841M234P695J1503J4003J5430J7189J8778J8293J5868J3721J2812J2136
59768A250503J1260J0701R817P149L145j87k475n079p838q638o784m025j618J045
59754A256976M271O922Q242Q746Q718P718N888L882J455j933n298p066p622q605
59740A282294j0003j0439j0019j0129j0585r885q303p782q567q877q151p766q190
$$ plain form
59825 2044792 2154637 2263966 2365593 2452566 2518097 2558191 2573631 2568461 2547762 2517370 2483236
59814 2483236 2448855 2414137 2377667 2338642 2295822 2246852 2190576 2128906 2065111 2001455 1939420
59803 1939420 1880339 1824119 1768690 1712256 1655059 1597827 1540132 1481818 1424648 1370838 1320995
59792 1320995 1274997 1233813 1198821 1170084 1146614 1127643 1112638 1100968 1092546 1087934 1087038 1088841
59780 1088841 1093075 1100770 1112273 1126276 1141706 1158895 1177673 1195966 1211834 1225555 1238367 1250503
59768 1250503 1261763 1272464 1282281 1289430 1292575 1292388 1289913 1284834 1276996 1268358 1261574 1257549 1255931 1256976
59754 1256976 1261247 1268169 1276411 1285157 1293875 1301593 1307481 1311363 1312818 1310885 1305587 1298521 1290899 1282294
59740 1282294 1272291 1261852 1251833 1241704 1231119 1221234 1212931 1205149 1196582 1187705 1179554 1171788 1163598
59727A163598q366q310r405j1535j2709j2217j1455j1165j0549r608r532j0087
59715A038660r435p264n402m728m125l131k812l231k817j128L70J028J932L293
59701A001210L670K609J457P26o71k675l333j829K83J831L540N862P858R119J0335
59686A039992J1186J0294Q156P292Q557R958J0210J0588J2004J3185J3201J3217
59674A167840J4054J4516J3654J2462J1825J0949R193P326N600K756j724o352
59662A262099r802j2348j4149j4325j2903j1425j0559r237p189n979o398p155
59650A140630p329p766q856r349q723q385r097r463q390o926o333o483p289r475
59636A026766j2664j4917j5428j5492j5723j4883j2583j0406q859n996q58M338
$$ plain form
59727 1163598 1155232 1146922 1137517 1125982 1113273 1101056 1089601 1078436 1067887 1058279 1048747 1038660
59715 1038660 1029225 1021961 1016559 1011831 1007706 1004575 1001763 998532 995715 994587 994957 995985 997917 1001210
59701 1001210 1004880 1007489 1008946 1009672 1009001 1006326 1002993 1001164 1001447 1003278 1006818 1012680 1020538 1029657 1039992
59686 1039992 1051178 1061472 1069628 1076920 1085477 1095435 1105645 1116233 1128237 1141422 1154623 1167840
59674 1167840 1181894 1196410 1210064 1222526 1234351 1245300 1254493 1261819 1267419 1270175 1268451 1262099
59662 1262099 1252297 1239949 1225800 1211475 1198572 1187147 1176588 1167351 1160162 1154183 1147785 1140630
59650 1140630 1133301 1125535 1116679 1107330 1098607 1090222 1081125 1071662 1063272 1056346 1050013 1043530 1036241 1026766
59636 1026766 1014102 999185 983757 968265 952542 937659 925076 914670 905811 899815 898957 903295
59624I03295P450R485J2359J5761J8395K0407K2463K3944K3948K2697K0484J6806
59612A117494J1842P160L669O28k225l615l010j911j569j473j380k513n231p647
59598A110219q190p611p071o268m853l567k674j414l11j531n455r302j0862j1154
59584A029956j1783j2203j1547j0711j0449r609p361n136m302l888k594j047j35
59571I39191Q24K284K903J728L9q62j602k677k695o97J894L753N873R216J2400
59556I71572J3979J4910J6414J7513J7144J6563J7179J7945J7579J7308J8714
59545A156820K0762K1785K2575K4230K4555K0049J0870R71o232j0068j1365j1505
59533A263447j2238j4410j7115j9406k1759k4537k6569k6893k6449k6263k5507
$$ plain form
59624 903295 910745 920230 932589 948350 966745 987152 1009615 1033559 1057507 1080204 1100688 1117494
59612 1117494 1129336 1136496 1140165 1140793 1138568 1134953 1131943 1130032 1128463 1126990 1125610 1123097 1117866 1110219
59598 1110219 1102029 1094418 1087347 1081079 1076226 1072659 1069985 1068571 1068260 1066729 1061274 1051972 1041110 1029956
59584 1029956 1018173 1005970 994423 983712 973263 963654 956293 951157 946855 942967 940373 939326 939191
59571 939191 940015 942299 945202 946930 946969 946107 944505 941828 939133 938436 940330 944083 949956 959172 971572
59556 971572 985551 1000461 1016875 1034388 1051532 1068095 1085274 1103219 1120798 1138106 1156820
59545 1156820 1177582 1199367 1221942 1246172 1270727 1290776 1301646 1302617 1296385 1286317 1274952 1263447
59533 1263447 1251209 1236799 1219684 1200278 1178519 1153982 1127413 1100520 1074071 1047808 1022301
59522A022301k3240k0455j8474j6799j4510j2226j0827r756q503q107r253j0531
59510H59620j0576j0167j0216r632p458n223m693m983m325l058k350j546O23L478
59496G89494N535O891Q276R069Q563P756P734P808P381P857J0352J3297J4852
59483I04865J5848J7694J9214J8534J6385J4485J2238Q165L303q1k019m025n895
59470A018711o373o101o742p944q156p653p927q705q475p300o476o052n236m501
59456I21070m727n024l953k074p50N38K985N588O395N840N974P063P683P598P690
59441I61896P675O522M680L282J848p41l730n561o656q361r969r680p884o633
59427I26688o323n661m331k951r78K483O322Q891J1197J5468K0635K2513J8772
$$ plain form
59522 1022301 999061 978606 960132 943333 928823 916597 905770 896014 887511 879404 870151 859620
59510 859620 849044 838877 828661 819029 811571 806348 801655 796672 792347 789289 786939 785393 786016 789494
59496 789494 795029 801920 810196 819265 827828 835584 843318 851126 858507 866364 876716 890013 904865
59483 904865 920713 938407 957621 976155 992540 1007025 1019263 1027428 1030731 1030650 1028631 1024606 1018711
59470 1018711 1012338 1006237 999495 991551 983395 975742 967815 959110 950635 943335 936859 930807 925571 921070
59456 921070 916343 911319 907366 905292 904542 905080 908065 913653 920048 925888 931862 938925 946608 954206 961896
59441 961896 969571 976093 980773 984055 985903 985162 981432 975871 969215 960854 950885 941205 933321 926688
59427 926688 920365 914704 910373 907422 906444 908927 915249 924140 935337 950805 971440 993953 1012725
59414A012725J1151K757m185p798o854k429K827P660J2923J9120K4836K7619K5428
59401A125780J7888P629o29m025l891k837j094K278O349R304J1271J3491J5639
59388A197153J6536J6652J7220J7765J7023J5433J4206J2935J0734Q650Q268Q926
59376A361501R026Q865R298Q736M807j909q844j5115k1136k5710k7095k6246k5549
59363A250629k4972k2905k0060j8788j8914j7962j5335j2736j0595p795m889m031
59351A071647n283o386o488o939q107q528p672o611n613l792j345N54K080M368
59337A011885O978Q430Q921R722J0379R644Q682R908J2838J4582J4377J4150J4520
59324A155016J3823J1415Q391M669j253q892j5383j9165k1242k2380k1909j9838
$$ plain form
59414 1012725 1023876 1026633 1022448 1014650 1007796 1005367 1008194 1015854 1028777 1047897 1072733 1100352 1125780
59401 1125780 1143668 1151297 1150668 1146643 1142752 1139915 1138821 1141099 1147448 1156752 1168023 1181514 1197153
59388 1197153 1213689 1230341 1247561 1265326 1282349 1297782 1311988 1324923 1335657 1344307 1352575 1361501
59376 1361501 1370527 1379392 1388690 1397426 1402233 1400324 1391480 1376365 1355229 1329519 1302424 1276178 1250629
59363 1250629 1225657 1202752 1182692 1163904 1144990 1127028 1111693 1098957 1088362 1080567 1075678 1071647
59351 1071647 1066364 1059978 1053490 1046551 1038444 1029916 1022244 1015633 1010020 1006228 1004883 1005437 1007517 1011885
59337 1011885 1018863 1027293 1036214 1045936 1056315 1065959 1074641 1084549 1097387 1111969 1126346 1140496 1155016
59324 1155016 1168839 1180254 1188645 1193314 1192061 1183169 1167786 1148621 1127379 1104999 1083090 1063252
59312A063252j7266j4286j0057n178j196K231O921J2836J7980K1360K3116K2114
59300A121827J6948R393L448P22j66R8K136M878N818M749L765L153R19l187o875
59285A167626r108j1134j3121j3399j1773j0103q810o183j929K007M746P301R477
59272A105597R542P589N827M823K986K53j541k586n443j0453j4724j6701j7905
59259A067264j9073j8628j6405j4846j4867j4268j1955j0038r884r702q100o633
59247I12865o775p381p205p076p733q245q240r030j0924j2149j1887j1687j2491
59234G92042j3027j2479j1922j1836j1056r366q273q063p147n351m649n468n667
59221F77738m407l588m104m205l134k773l921m505l315k129k170j867j91J113
$$ plain form
59312 1063252 1045986 1031700 1021643 1016465 1015269 1017500 1024421 1037257 1055237 1076597 1099713 1121827
59300 1121827 1138775 1148168 1151616 1152338 1152172 1152270 1154406 1159284 1165102 1169851 1173616 1176769 1177688 1174501 1167626
59285 1167626 1158518 1147384 1134263 1120864 1109091 1098988 1090178 1083995 1082066 1084073 1088819 1096120 1105597
59272 1105597 1115139 1122728 1128555 1133378 1136364 1136617 1135076 1132490 1127047 1116594 1101870 1085169 1067264
59259 1067264 1048191 1029563 1013158 998312 983445 969177 957222 947184 937300 927598 919498 912865
59247 912865 906090 898709 891504 884428 876695 868450 860210 851180 840256 828107 816220 804533 792042
59234 792042 779015 766536 754614 742778 731722 722356 714083 706020 698873 693522 688873 683405 677738
59221 677738 673331 669743 665639 661434 658300 655527 651606 647101 643786 641657 639487 637620 637429 638542
59207F38542Q42P02K188M055N032O073P872R042Q890R093J0632J1965J2179J2854
59193G39961J4739J5708J4374J2624J2198J1689R480O743M855K548j562n952q407
59180H28998r238r852j0022q861o681l954k06M350Q012J0033J1863J4711J8051
59167H47204K1646K6365L1885L6315L9436M3306M8193N1026M9417M4097L5987
59156A274877K4342R851l987j4807k3702l1623l6767l7760l6175l3604k9362k3342
59144A037941j7920j4460j1109o496k501q11J92K487N391P955J1299J5871J9541
59131A047380K1048K2304K4598K5784K4195K2092K1944K2246K0393J7011J4142
59120A283137J1668Q721O243N060L672Q82j782k948m085o594q968r754j0513j2784
$$ plain form
59207 638542 639384 640086 642274 646329 651361 657434 665306 674348 683238 692331 702963 714928 727107 739961
59193 739961 754700 770408 784782 797406 809604 821293 830773 837516 842371 844919 843357 837405 828998
59180 828998 819760 809908 799886 791025 784344 780390 780184 784534 792546 802579 814442 829153 847204
59167 847204 868850 895215 927100 963415 1002851 1046157 1094350 1145376 1194793 1238890 1274877
59156 1274877 1299219 1309070 1305083 1290276 1266574 1234951 1198184 1160424 1124249 1090645 1061283 1037941
59144 1037941 1020021 1005561 994452 987956 985455 984644 984836 987323 992714 1000669 1011968 1027839 1047380
59131 1047380 1068428 1090732 1115330 1141114 1165309 1187401 1209345 1231591 1251984 1268995 1283137
59120 1283137 1294805 1303526 1309769 1314829 1318501 1319383 1317601 1314653 1310568 1303974 1295006 1285252 1274739 1261955
59106A261955j4842j4747j3902j4324j4981j4142j2829j2634j2593j1586j1308
59095A114067j3340j5707j5881j4993j5502j6797j6670j5208j3867j2552j0782
59084I52768r760j0227j0334q696p210p758q585p340n235m561m426k824q00p21
59070H64291k104k853k936l454l774k993k467l608m932m455l064k350j285J543
59056H25559M628N981O723Q616J0142Q851N678L150J131j928n304p302q479r989
59042H47457j0516q535n786m752m418k330R54L218M685O829Q797Q841P823P572
59028H59839P292N320K835K053K270J441R2p3J58r89k564k409r47J25J218L414
59012H79075N501O113O898R746J2884J3619J2947J3355J4119J3059J1077J0468
$$ plain form
59106 1261955 1247113 1232366 1218464 1204140 1189159 1175017 1162188 1149554 1136961 1125375 1114067
59095 1114067 1100727 1085020 1069139 1054146 1038644 1021847 1005177 989969 976102 963550 952768
59084 952768 943008 932781 922447 913751 906541 898783 890198 882858 877623 873062 868636 865812 865012 864291
59070 864291 862187 859334 856398 852944 849170 846177 843710 840102 835170 830715 827651 825301 824016 825559
59056 825559 830187 836168 842891 851507 861649 870500 876178 879328 880459 878531 873227 865925 857446 847457
59042 847457 836941 828406 822620 817868 813450 811120 812074 815292 819977 826806 835603 844444 852267 859839
59028 859839 867131 872451 875286 877339 879609 881050 881142 881069 881227 880238 877674 875265 874318 874443 875661 879075
59012 879075 884576 890689 897587 907333 920217 933836 946783 960138 974257 987316 998393 1008861
59000A008861J0600R727R267J1643J5497J7747J8932K1787K6065K9490L2535L7425
58988A249576M3590M8854N3901O0753O7872P1505P0798O7027N9126M5088K6833
58977A864923Q755p728k3529l7056m5380m9358n2400n4765n4160n1323m9506m8706
58965A399767m5779m0325l5356l1965k8308k4113k1337j9991j7807j4477j1970
58954A108339j0588q835p138p354q734q670p301p138q312q498p274o194m912j716
58940A005675K288M130L900M323N731O025N255N657P297Q278Q963J1312J4359
58927A093193J5280J4666J5821J8976K1319K2586K5443L0090L3663L5304L6697
58916A363038L7106L3092K3902J2500Q21j1256k2022k8191k9777k9951k9473k6028
$$ plain form
59000 1008861 1019461 1029188 1038455 1050098 1065595 1083342 1102274 1124061 1150126 1179616 1212151 1249576
58988 1249576 1293166 1342020 1395921 1456674 1524546 1596051 1666849 1733876 1793002 1838090 1864923
58977 1864923 1873678 1865950 1842421 1805365 1759985 1710627 1658227 1603462 1549302 1497979 1448473 1399767
58965 1399767 1353988 1313663 1278307 1246342 1218034 1193921 1172584 1152593 1134786 1120309 1108339
58954 1108339 1097751 1088916 1081778 1074424 1065690 1057020 1049719 1042581 1034269 1025771 1018497 1012303 1007391 1005675
58940 1005675 1007963 1012093 1015993 1020316 1026047 1032072 1037327 1042984 1050281 1058559 1067522 1078834 1093193
58927 1093193 1108473 1123139 1138960 1157936 1179255 1201841 1227284 1257374 1291037 1326341 1363038
58916 1363038 1400144 1433236 1457138 1469638 1470459 1459203 1437181 1408990 1379213 1349262 1319789 1293761
58904A293761j9546j3183q296l165K555O859R483J2354J5438J6820J7256J9684
58892A350020K3783K6111K6182K7129K9535K9892K6315K0654J3826M206p894j9023
58880A550736k7346l4113l9371m0925l8709l5602l2655k8102k1960j6969j3827
58869A221157j0276n984l556l573l348j885j421k925m687o379r738j4210j6713
58856A136462j6828j7436j9242j9639j7995j6907j7047j5962j3230j1611j1712
58845I58853j0779q388p893j0491j3017j3441j3541j4276j3678j1285r726r906
58833H22432r320p008n388n411m690k186K6J323L916Q058J0864J1585J2998J5969
58819H53168J7863J8040J9357K2158K2344J7749J1313N578p21q242j4500j8187
$$ plain form
58904 1293761 1274215 1261032 1252736 1249571 1252126 1258985 1268468 1280822 1296260 1313080 1330336 1350020
58892 1350020 1373803 1399914 1426096 1453225 1482760 1512652 1538967 1559621 1573447 1577653 1569759 1550736
58880 1550736 1523390 1489277 1449906 1408981 1370272 1334670 1302015 1273913 1251953 1234984 1221157
58869 1221157 1210881 1204897 1201341 1197768 1194420 1192535 1191114 1188189 1183502 1177123 1167385 1153175 1136462
58856 1136462 1119634 1102198 1082956 1063317 1045322 1028415 1011368 995406 982176 970565 958853
58845 958853 948074 939686 931793 921302 908285 894844 881303 867027 853349 842064 832338 822432
58833 822432 813112 806104 800716 795305 790615 788429 788455 789778 793694 801752 812616 824201 837199 853168
58819 853168 871031 889071 908428 930586 952930 970679 981992 987570 986849 978607 964107 945920
58807I45920k1128k3705k3395k0109j7710j7854j7479j4676j1802j0337q240m921
58795G54564l407m722n482l926l003m587n983n290m863o301p070n321l072j605
58781F89932J247O223J0256J1872J3611J6040J5056Q740J496k442m369o379o749
58768G54534m178j626j579j986p13M53K1K84K788M841M372L682M801N692M810
58753G76196M599O665Q264P473P119R580J2403J3082J3541J5713J7396J6735J6118
58740I24884J7439J8018J5615J2915J2673J2856J1007R067R355J0064R235R039
58728A072167J1683J5217J7718K1488K8636L6489M1743M5152M7986M7824M2234
58717A428337L2748K1360P153r763k5335l6587m5201n2636n6520n5718n3766n3017
$$ plain form
58807 945920 924792 901087 877692 857583 839873 822019 804540 789864 778062 767725 759485 754564
58795 754564 751157 746435 740953 737027 734024 729437 723454 718164 713301 707000 699930 694609 691537 689932
58781 689932 691179 697402 707658 719530 733141 749181 764237 772977 774473 772031 767662 761283 754534
58768 754534 750356 748730 747151 745165 744452 744905 744926 745210 747998 752839 757211 760893 765694 771386 776196
58753 776196 780795 787460 795724 803197 810316 819896 832299 845381 858922 874635 892031 908766 924884
58740 924884 942323 960341 975956 988871 1001544 1014400 1025407 1034474 1043829 1053893 1063128 1072167
58728 1072167 1083850 1099067 1116785 1138273 1166909 1203398 1245141 1290293 1338279 1386103 1428337
58717 1428337 1461085 1482445 1489598 1479835 1454500 1417913 1372712 1320076 1263556 1207838 1154072 1101055
58705A101055n0556m4338l7909l4264l0419k3313j5840j1606q701m181J74K195
58693H42297M556R847J5031J6515J6191J6653J5144Q419p69q110j4447k1892k7645
58680H71790k8176k5744k4416k3145j9038j3827j0799q644m429M97L332N192Q175
58667G30768J0544J0385J0074J1514J1043N097l072q375j1480j5242j7917j6721
58655G16618j4226j4254j4897j2451q744p725q125o458m077m302n604m542k484
58642F08729k633l487j942R1q94l041k493o78j266k844j734O61M79j303j200k47
58626E86198j599l720l072j205k051m438m321k214j545j863m91J330Q16k70J408
58611E62963M049L759J793J928L149J951n85r82j61j177k625j285J216J347N91
$$ plain form
58705 1101055 1050499 1006161 968252 933988 903569 880256 864416 852810 844109 839928 840102 842297
58693 842297 846853 856700 871731 888246 904437 921090 936234 944653 943884 935774 921327 899435 871790
58680 871790 843614 817870 793454 770309 751271 737444 726645 718001 713572 714069 717401 722593 730768
58667 730768 741312 751697 761771 773285 784328 789425 786353 777978 766498 751256 733339 716618
58655 716618 702392 688138 673241 660790 652046 644321 636196 629738 625661 621359 615755 611213 608729
58642 608729 606096 602609 600667 600758 599864 596823 594330 593652 592386 589542 587808 588469 588948 587645 586445 586198
58626 586198 584599 580879 577807 576602 574551 570113 565792 563578 562033 560170 559679 561009 561825 561555 562963
58611 562963 567012 570771 572564 574492 577641 579592 579007 578025 577864 576687 574062 572777 573993 575340 575931
58596E75931K392N092N091M218O441J0060J0832J0075J1777J4386J3480J0242
58584F80017R170R708Q178N803O627R606J0817J1331J4881J9906K2140K2825K6095
58571H57104L0389L0990K8805K8095K7618K2937J5517J0547P555K217m286o934
58559A050554o312p213r274q204n028m738o994p389o861j0342j6950k0995k1990
58546I18264k4296k7574k7180k3574k1777k1832j9191j4369j2621j4034j3316
58535F98500r706p939r061r204p702p690q623o812l251k324l190j233K692L528
58521F27985J802K674N987O931O015Q436J3828J6576J6196J7328J9624J7892J2408
58508G73682Q877P837M513o66j904J013K237J043K959Q800J3082J4504J7580K2560
$$ plain form
58596 575931 578323 583415 588506 592724 599165 609225 620057 630132 641909 656295 669775 680017
58584 680017 689187 698895 707073 712876 719503 729109 739926 751257 766138 786044 808184 831009 857104
58571 857104 887493 918483 947288 975383 1003001 1025938 1041455 1052002 1059557 1061774 1057488 1050554
58559 1050554 1044242 1037029 1027755 1019551 1014523 1009785 1002791 995402 988541 978199 961249 940254 918264
58546 918264 893968 866394 839214 815640 793863 772031 752840 738471 725850 711816 698500
58535 698500 688794 680855 671794 662590 654888 647198 638575 631763 628512 626188 622998 621765 624457 627985
58521 627985 629787 632461 638448 645379 651394 659830 673658 690234 706430 723758 743382 761274 773682
58508 773682 782559 790396 794909 794243 792339 793352 795589 796632 799591 808391 821473 835977 853557 876117
58494H76117K4034K1106J8900J8675J6392J2217J1322J3911J4367J1415R140P284
58482A054880J000q804j5520j8121k1806k6664k6856k2236j9349j9442j6800j0553
58470H49729o605n984k766M355R775J2287J7267K5463L0868L1814L2702L2962
58458A031867K6171J2481j1q566j8370k9725l5433l3872l2113l2813l0443k3830
58446H25343j9682j9894j7888j1532p351p871p148l043j501m260m709m43K214
58433G22235O82Q32M755O224K981J286L447L217j620m503k742k479o038p004l043
58418G18230r72l694m743j179P63j631k062J996L930J149N90N202P964N501M589
58403G35633Q713J1285Q733P327J0304J1253P047M334O460O949K745O76L870N167
$$ plain form
58494 876117 900151 921257 940157 958832 975224 987441 998763 1012674 1027041 1038456 1047596 1054880
58482 1054880 1055880 1047076 1031556 1013435 991629 964965 938109 915873 896524 877082 860282 849729
58470 849729 843124 837140 834374 838729 848504 860791 878058 903521 934389 966203 998905 1031867
58458 1031867 1058038 1070519 1070508 1061942 1043572 1013847 978414 944542 912429 879616 849173 825343
58446 825343 805661 785767 767879 756347 748996 741125 733977 730934 729433 725173 720464 720021 722235
58433 722235 722917 723749 728504 734728 737709 738995 742442 745659 744039 739536 736794 734315 728277 721273 718230
58418 718230 717258 713564 708821 707642 708405 706774 704712 706708 710638 711787 712377 717579 725543 731044 735633
58403 735633 744346 755631 764364 771691 781995 793248 800295 804629 811089 818038 820783 821459 825329 830496
58389H30496J057j330J716L173p08k849O65K891j10j572K142M091R09P0N042P737
58373H53420L994J915O133Q724M696J651M661O447K179q47K071L591o02k494K534
58358H98073O001K583N26N353Q876N444L216P953J1425P707N114R856J3723J0371
58344I96221P862J2307J5182J0004N521Q883J1762O965K681O100Q955L930n87
58331A095786L151P203M062J732P547J3096J0742R048J5936K2728K1018J9124
58319A231173K5343L1134K7698K3006K5469K7169K0487J4678J8353K2152J6588
58308A483250J0175J1795J2472L428n306l437K4m834q868k260N254L116P38Q564
58294A514111J6768J4418J1393J9072K7788K6126K3762L1775L9359L4151K6605
$$ plain form
58389 830496 831553 830223 831939 835112 834404 831555 832220 835111 835001 833429 835571 839662 840571 840641 845683 853420
58373 853420 857414 859329 865462 874186 878882 880533 885194 891641 893820 892973 895044 898635 898033 895539 898073
58358 898073 904074 906657 907183 912536 921412 926856 930072 938025 949450 957157 962271 972127 985850 996221
58344 996221 1004083 1016390 1031572 1041576 1047097 1055980 1067742 1074707 1077388 1083488 1092443 1096373 1095786
58331 1095786 1098937 1106140 1110202 1111934 1119481 1132577 1143319 1152367 1168303 1191031 1212049 1231173
58319 1231173 1256516 1287650 1315348 1338354 1363823 1390992 1411479 1426157 1444510 1466662 1483250
58308 1483250 1493425 1505220 1517692 1521120 1515814 1512377 1512401 1507567 1498699 1496439 1501693 1504809 1505547 1514111
58294 1514111 1530879 1545297 1556690 1575762 1603550 1629676 1653438 1685213 1724572 1758723 1785328
58283A785328K9582L3108K4778J5637J9528K6344K2483J8104K6544L6667L4176
58272B072279L0347M0426N3529N3733N0648N8545O5806N6928M4147M4889M8603
58261B619880L8936K7401L0858L7324K9481K0045K7554L9382L6289L0804M2356
58250B980310N7622N5915N0454O2625P9158P8076P2838Q5875J03072J01143R4981
58239C822069J09337J29112J28207J21664J36579J57905J58045J53123J72455
58230E088496J99726K04296K02891K27512K60999K70049K72793L04653L47517
58221G378932L65100L77162M22316M79845N09264N33517N97323O78622P32816
58212A2074897P87172Q92939J023364J125349J230935J403445J618156J822375
$$ plain form
58283 1785328 1814910 1848018 1872796 1888433 1907961 1934305 1956788 1974892 2001436 2038103 2072279
58272 2072279 2102626 2143052 2196581 2250314 2300962 2359507 2425313 2482241 2526388 2571277 2619880
58261 2619880 2658816 2686217 2717075 2754399 2783880 2803925 2831479 2870861 2907150 2937954 2980310
58250 2980310 3037932 3093847 3144301 3206926 3286084 3364160 3436998 3522873 3625945 3727088 3822069
58239 3822069 3931406 4060518 4188725 4310389 4446968 4604873 4762918 4916041 5088496
58230 5088496 5288222 5492518 5695409 5922921 6183920 6453969 6726762 7031415 7378932
58221 7378932 7744032 8121194 8543510 9023355 9532619 10066136 10663459 11342081 12074897
58212 12074897 12862069 13755008 14778372 15903721 17134656 18538101 20156257 21978632
58204B1978632K066757K439556K922628L466153M148232N082341O221865P454104
58196E5780268Q831777J0500842J2491538J4860299J7946896K2148845K7541253
58189A70101718L4101866M1940470N0175892N5270810N1849940L6840123J3072869
58182D53353688j1954722l1206093m1971475m5494961m4325631m0596676l5812950
58175B01991180l0940884k6372576k2163150j8408607j5256378j2680184j0517588
58168F5651813q699470p248757o103904n135152m306746l660715l166844k734093
58160B4596132k345439k047073j824599j612124j405004j249813j138537j017820
58152A1955723q88199p95329p35650o63198n78237n21364m89882m43090l81994
$$ plain form
58204 21978632 24045389 26484945 29407573 32873726 37021958 42104299 48326164 55780268
58196 55780268 64612045 75112887 87604425 102464724 120411620 142560465 170101718
58189 170101718 204203584 246144054 296319946 351590756 403440696 440280819 453353688
58182 453353688 441398966 410192873 368221398 322726437 278400806 237804130 201991180
58175 201991180 171050296 144677720 122514570 104105963 88849585 76169401 65651813
58168 65651813 56952343 49703586 43599682 38464530 34157784 30497069 27330225 24596132
58160 24596132 22250693 20203620 18379021 16766897 15361893 14112080 12973543 11955723
58152 11955723 11067524 10272195 9536545 8873347 8295110 7773746 7283864 6840774 6458780
58143F458780l45050l32191l07403k70062k52488k52479k36362k04508j89033
58134D069204j90472j78606j52649j40978j43936j34178j11653j03251j09553
58125B803928j04740q7926q3578r2198q9896p6051p3518q2133p8625o2460n6670
58114A916133o2917n9701m5650m1686m9210m7749l5544l1982l8112l4259j8989
58103A450334j2012j6026j2969q09K464n552p490p25j562j1752j4498p420o768
58090A355215j5066j6598q958p760j5794j8069j1918j2054k1130k4332j8216j6675
58078A168645k3261k5059j9010j7567k3236k3620j6578j4849k0971k2674j7587
58067I44233j7799k5353k7799k2656k1996k8064k8495k0700j7301k1972k3230
$$ plain form
58143 6458780 6113730 5781539 5474136 5204074 4951586 4699107 4462745 4258237 4069204
58134 4069204 3878732 3700126 3547477 3406499 3262563 3128385 3016732 2913481 2803928
58125 2803928 2699188 2611262 2527684 2435486 2345590 2269539 2196021 2113888 2035263 1972803 1916133
58114 1916133 1853216 1793515 1747865 1706179 1656969 1609220 1573676 1541694 1503582 1469323 1450334
58103 1450334 1438322 1422296 1409327 1408518 1410982 1405430 1397940 1397215 1395653 1383901 1369403 1361983 1355215
58090 1355215 1340149 1323551 1314593 1306833 1291039 1272970 1261052 1248998 1227868 1203536 1185320 1168645
58078 1168645 1145384 1120325 1101315 1083748 1060512 1036892 1020314 1005465 984494 961820 944233
58067 944233 926434 901081 873282 850626 828630 800566 772071 751371 734070 712098 688868
58056F88868j7538j5677k0548k1160j4537j1660j5679j5831q944n731r610j0127
58044E21826l703m97m351n823j511n92n810p324k036L3m916p370l282j564o158
58029D66922q612n190l836p481p745j949Q15k923m342L08K566j352l089J445M380
58014D29917J639N77M905P423M820M451R497J2436J0113J0370J6786K1656K1149
58001E55739K2554K9253L3135K9541K5437K5200K2371J3422N963N217N383K289
57989G75504J755P597J3864J6711K1739L2045M1069M4775M8912N6881O2232O0651
57977A183735N7541N6495N2004M1149L0799K5499J9344P338o216j7849l1951n0174
57965A367714o4918p1116p3905p7321p6419o8235n9547n5509n1079m1790l2773
$$ plain form
58056 688868 671330 655653 635105 613945 599408 587748 572069 556238 547294 541563 531953 521826
58044 521826 518123 517626 513275 507452 505941 505349 499539 492215 490179 490212 485296 477926 474644 473080 466922
58029 466922 458310 453120 449284 441803 434058 432109 432924 430001 425659 425967 428533 427181 424092 425537 429917
58014 429917 431556 432133 437038 444461 449281 453732 463229 475665 485778 496148 512934 534590 555739
58001 555739 578293 607546 640681 670222 695659 720859 743230 756652 762615 767832 773215 775504
57989 775504 777259 784856 798720 815431 837170 869215 910284 955059 1003971 1060852 1123084 1183735
57977 1183735 1241276 1297771 1349775 1390924 1421723 1447222 1466566 1473904 1467688 1449839 1417888 1367714
57965 1367714 1302796 1231680 1157775 1080454 1004035 935800 876253 820744 769665 727875 695102
57954F95102k8858k5713j9136j3475j2658j2137p890m229m761m681j26L917L025
57941E68380J789M786P847O458M424N901P076L867J50J89N78k487n446m530l142
57926E95840m561m686L31O652J0276J4557K2732L0489L3522L5115L8476L8821
57914H17564L1091J8718P023n125j9453l1118l5687l6839l9327m0512l6729l1581
57902E98025k9824k8893k4507j9089j6746j5454j1853q556r062j0601r365p772
57890D06303r323j1440j0498q866r900j1064r036o504o985p996o294m652o334
57877B97411q045n562j479k00j07K234M824M378L168M778P410P953Q112J0064
57863C34939J0967Q488O618R042J1865J0090O315N529O137L954O18L3M62j990
$$ plain form
57954 695102 666244 640531 621395 607920 595262 583125 575235 571006 566245 561564 561438 565355 568380
57941 568380 570169 574955 582802 589260 593684 599585 606661 610528 610678 610867 611445 608958 603512 598982 595840
57926 595840 591279 586593 586924 593576 603852 618409 641141 671630 705152 740267 778743 817564
57914 817564 848655 867373 874396 869271 849818 818700 783013 746174 706847 666335 629606 598025
57902 598025 568201 539308 514801 495712 478966 463512 451659 443103 434041 423440 414075 406303
57890 406303 396980 385540 375042 366176 356276 345212 336176 329672 322687 314691 308397 303745 297411
57877 297411 289366 283804 282325 282125 282018 284252 289076 293454 296622 301400 308810 316763 324875 334939
57863 334939 345906 354394 361012 370054 381919 392009 398324 403853 409990 413944 414562 414595 415057 413067
57849D13067n706o834o587p963q904o146k302j681k436k77L384M372L690N088
57835C80765P639P919O944P843R306Q198O093O437P844O850M694M715N663M216
57821D75126J651J504K994L032K137K265J600k198o325o739m928m570m523j689
57807D59337K203L527L672O299J0339J2555J4425J9525K6513L1596L5568M1464
57795F67023M7346M8410M4307L7780K8386J4482o45j1705j8754k5065k9878l0229
57783G71458k7899k7203k7516k5144k1086j9635k0542j9871j7478j6592j6926
57772E31566j5307j2441j1997j3560j3297j1174j0745j2163j2037j0028r132r581
57760C90104q684o530n838o347n333l242k945l862k924p79q88k893l162j632j758
$$ plain form
57849 413067 407361 400527 393940 385977 377073 370927 368625 366944 364508 364231 367615 371987 375677 380765
57835 380765 388404 396323 403267 411110 420416 428614 434707 441144 448988 455838 460532 465247 470910 475126
57821 475126 476777 478281 481275 484307 486444 488709 490309 488111 481786 475047 470119 465549 461026 459337
57807 459337 461540 465067 468739 475038 485377 497932 512357 531882 558395 589991 625559 667023
57795 667023 714369 762779 807086 844866 873252 887734 887089 875384 856630 831565 801687 771458
57783 771458 743559 716356 688840 663696 642610 622975 602433 582562 565084 548492 531566
57772 531566 516259 503818 491821 478261 464964 453790 443045 430882 418845 408817 399685 390104
57760 390104 381420 374890 369052 362705 357372 354130 351185 347323 344399 343620 342732 339839 336677 335045 333287
57745C33287l794m367k900k310l078k626r15p72k224k087K52K122K828M387O785
57730C24588P699P090O917O438L139j835m593m862n933q312q997p292n822n403
57716C02822m204k259j623j821k88K469L396K490K677M152M271L096L473N395
57702C24046N823M442M046M947M471K411J509K054J526j25l37O33j44k310k344
57687C50648j20O04r58j315P33K201J932K640N456Q127J0125J3975J9944K5003
57673D38995K8807L5150M5664N7556O9428Q3274R7662J04119R4090O6520K7160
57662A148425j5420n1672p4247q2750q2695p8445p0529o0018n0339m2904l5722
57651E03684k8144k2616k0006j7623j3893j0760r551q664p238o939q203q659p192
$$ plain form
57745 333287 329493 325126 322226 319916 316838 314212 313297 312525 310301 308214 308466 310588 313416 317803 324588
57730 324588 332287 339377 346294 352732 355871 354036 349443 344581 338648 330336 321339 314047 308225 302822
57716 302822 298618 296359 294736 292915 292627 295096 298492 300982 303659 307811 312082 315178 318651 324046
57702 324046 329869 334311 338357 343304 347775 350186 351695 353749 355275 355150 354813 355446 355302 352992 350648
57687 350648 350528 351132 350174 348859 349592 351793 353725 356365 361821 369948 380073 394048 413992 438995
57673 438995 467802 502952 548616 606172 675600 758874 856536 960655 1054745 1121265 1148425
57662 1148425 1133005 1081333 1007086 924336 841641 763196 692667 632649 582310 539406 503684
57651 503684 475540 452924 432918 415295 401402 390642 381091 372427 365189 358250 350047 341388 334196
57638C34196n820n878o097n847o401p612p363n663n124o167o147m527m204o117
57624B51229p318o255n289n941o244n002m178m765m647k908k011l237m180l170
57610A86084k114k510k706j562q44j535j678l22L20r72k040j546j481l035l950
57595A60109k731j485j833j927l74P22l44j686j488j281k506l366k224p94q82
57580A37910j162k14N05k84q65K29J272P03K06J326K143N94j733k396k001k210
57564A34023k501j952j667k417k394k69J989K174J262J115J310R69J119K473L423
57549A38657K904K626L839M794M069L455M486N153L314N55p34j415l287n175n060
57534A58181l883l712m082l483k627k939l545k914j767j469j326k84O20K85MJ095
$$ plain form
57638 334196 328376 322498 316401 310554 304153 296541 289178 283515 278391 272224 266077 261550 257346 251229
57624 251229 243911 237656 232367 226426 220182 215180 211002 206237 201590 198682 196671 193434 189254 186084
57610 186084 183970 181460 178754 177192 176348 174813 173135 172813 173133 172161 170121 168575 167094 164059 160109
57595 160109 157378 155893 154060 152133 151759 152481 152137 150451 148963 147682 145176 141810 139586 138792 137910
57580 137910 136748 136534 137039 136755 135890 136119 137391 138094 138300 139626 141769 142363 140630 138234 136233 134023
57564 134023 131522 129570 127903 125486 123092 122823 124812 126986 128248 129363 130673 131642 132761 135234 138657
57549 138657 141561 144187 148026 152820 156889 160344 164830 169983 173297 173852 173118 171703 168416 163241 158181
57534 158181 154298 150586 146504 143021 140394 137455 133910 130996 129229 127760 126434 126150 126770 127055 127059 128154
57518A28154K146J494L46M83J056O54L84J621K776J696n37j477j278j594k205
57503A33719j874j124j080j117m72m59k169l834l475k374k700l620l066j675j477
57488A03203k141j927j050p97o34N26J505O60p62m15J152J601Q39O17J048P75
57472A04200n2o6O46R40R04J181R90n11j943j525q2L60j13r8K52n7m70J5N45q6
57452A05030r01m60L20k4m58O74K236K093R42Q92J495Q65l51N8J696K122J078
57435A17307N74J072J103M65M96J223J338Q45Q34R59P0j045n77R87J476O09M6
57418A27782K36K23K14J310K851L067K124J676J704P46r91j759j348j113j177
57403A35545n73R5p04k282k317o71M35J51n0P08J628K345L340M077L420J973J505
$$ plain form
57518 128154 130300 131794 132140 132623 133679 134333 134717 136338 139114 140810 140273 138796 137518 135924 133719
57503 133719 131845 130721 129641 128524 128052 127593 125424 121590 118115 115741 113041 109421 106355 104680 103203
57488 103203 101062 99135 98085 97288 96654 97180 98685 99345 98583 98168 99320 100921 101760 102377 103425 104200
57472 104200 104148 104082 104728 105668 106572 107753 108743 108232 106289 104764 104682 105042 104929 104831 105083 105026 104556 104571 105116 105030
57452 105030 104129 103669 103989 103965 103507 104181 106417 108510 109452 110344 111839 112704 112353 112411 114107 116229 117307
57435 117307 117881 118953 120056 120521 121017 122240 123578 124423 125257 126216 126286 125241 124664 125651 127127 127736 127782
57418 127782 128018 128241 128455 129765 132616 135683 137807 139483 141187 141933 140942 139183 137835 136722 135545
57403 135545 134972 135067 134363 132081 129764 129093 129528 129679 129629 130337 131965 134310 137650 141727 145147 147120 148625
57386A48625K019J967J217J099J683J782J598K472M011M342L271K348J877P63
57372A79074p08j012m87j154l198m646m923n611p214q089p391o267n475m358k782
57357A15759j629q45N62K338L153L145L667M498M102K712K148K466J909M73J62
57342A44620J197J424K57k99M30L25j630l265k722j180l10K51J167J565Q61K63
57326A42954P06J144M46p10j239j212q60K31J710K066Q87j94Q7Q60Q75L49k8l08
57308A47764n06OJ268K267K436K305K151J500M90Q3M09M93Q1OL55J51o47p76J34
57289A59970R05R13R50J386J388O29l4j30j14J03J205K706L151K543K457L309
57273A81337L661K810J891J740J795J739K121K816K918K742L606N198N605M483
$$ plain form
57386 148625 150644 152611 153828 154927 156610 158392 159990 162462 166473 170815 174086 176434 178311 179074
57372 179074 178366 177354 176867 175713 172515 167869 162946 157335 150121 142032 134641 128374 122899 118541 115759
57357 115759 114130 113285 113847 116185 119338 122483 126150 130648 134750 137462 139610 142076 143985 144458 144620
57342 144620 145817 147241 147498 147199 147629 147954 146324 143059 140337 139157 138847 139098 140265 141830 142691 142954
57326 142954 143660 144804 145250 144540 143301 142089 141229 141460 143170 145236 146123 145929 146016 146876 147751 148100 148072 147764
57308 147764 147258 147264 148532 150799 153235 155540 157691 159191 159681 159764 160173 160666 160747 160753 161108 161259 160612 159836 159970
57289 159970 160875 161788 162738 164124 165512 166141 166107 165977 165863 165966 167171 169877 173028 175571 178028 181337
57273 181337 184998 187808 189699 191439 193234 194973 197094 199910 202828 205570 209176 214374 219979 224462
57259B24462L636L765L431K118J505K464L464L374L311M189M832M128K926K312
57245B69917K026K005L250N682P205O534N077M555M689M679M946N748N971N016
57231C37300M249M963O407P265P539P619P115N953N162N326N625N520N710O432
57217D22185O605N753M998N044N060M585M602N499O057N705N711O789P683P539
57203E03815P594Q844J0169J0440J0469J1113J1437J0628R908J0572J1717J1863
57191F28569J1303J1132J1350J1591J2250J3359J3913J3721J4204J5902J7106
57180G74400J6645J6062J7136J9126K0441K1221K2175K2552K1545K0264K0188
57169I91755K0885K1300K1868K3350K4919K5503K5837K7083K8651K9397K9830
$$ plain form
57259 224462 228098 231863 235294 237412 238917 241381 244845 248219 251530 255719 260551 264679 267605 269917
57245 269917 271943 273948 277198 282880 290085 296619 301696 306251 310940 315619 320565 326313 332284 337300
57231 337300 341549 346512 352919 360184 367723 375342 382457 388410 393572 398898 404523 410043 415753 422185
57217 422185 428790 434543 439541 444585 449645 454230 458832 464331 470388 476093 481804 488593 496276 503815
57203 503815 511409 520253 530422 540862 551331 562444 573881 584509 594417 604989 616706 628569
57191 628569 639872 651004 662354 673945 686195 699554 713467 727188 741392 757294 774400
57180 774400 791045 807107 824243 843369 863810 885031 907206 929758 951303 971567 991755
57169 991755 1012640 1033940 1055808 1079158 1104077 1129580 1155417 1182500 1211151 1240548 1270378
57158A270378L1061L2562L3127L3080L3605L4689L5585L6487L7916L9279L9830
57147A657599M0320M1928M4405M6771M8990N1432N3610N5083N6733N9534O2786
57136B219191O5074O6188O6777O6934O6594O6477O7304O8779P0456P2708P5689
57125B972171P8374P9884Q0855Q2426Q4835Q8116R3099J00613J10424J21995J35405
57114D028197J50694J66964J82765J96909K09096K21035K36755K60204K92552
57105E945171L33427L84424M49482N32476O37288P70280R40125J155215J423563
57096A2571451J754243K154894K627042L165968L763703M408065N079682N754191
57088D1279239O406579P008796P523913P905064Q093914Q014528P584515O762723
$$ plain form
57158 1270378 1301439 1334001 1367128 1400208 1433813 1468502 1504087 1540574 1578490 1617769 1657599
57147 1657599 1697919 1739847 1784252 1831023 1880013 1931445 1985055 2040138 2096871 2156405 2219191
57136 2219191 2284265 2350453 2417230 2484164 2550758 2617235 2684539 2753318 2823774 2896482 2972171
57125 2972171 3050545 3130429 3211284 3293710 3378545 3466661 3559760 3660373 3770797 3892792 4028197
57114 4028197 4178891 4345855 4528620 4725529 4934625 5155660 5392415 5652619 5945171
57105 5945171 6278598 6663022 7112504 7644980 8282268 9052548 9992673 11147888 12571451
57096 12571451 14325694 16480588 19107630 22273598 26037301 30445366 35525048 41279239
57088 41279239 47685818 54694614 62218527 70123591 78217505 86232033 93816548 100579271
57080A00579271N597518M211842K726885J207459l15402j791991l147724m320534
57072A04747324n281620o020625o531975o822019o913849o835777o612403o270439
57064E3458617n843120n362219m851530m331740l824718l348192k911134k517709
57056B0468255k170985j870179j609919j385851j197019j040707r10022p99166
57048I484407p06539o30187n65066n07655m58850m19346l86114l55921l28509
57039E126220l03818k79815k55439k32035k09805j86477j61272j36166j11612
57030C249781q6010o2204m9553n5293p6543j03545j27663j43863j49698j46253
57020B249156j38113j29190j19939j10044j00860r3138q5379p6833o9314o3908
$$ plain form
57080 100579271 106176789 110388631 113115516 114322975 114007573 112215582 109067858 104747324
57072 104747324 99465704 93445079 86913104 80091085 73177236 66341459 59729056 53458617
57064 53458617 47615497 42253278 37401748 33070008 29245290 25897098 22985964 20468255
57056 20468255 18297270 16427091 14817172 13431321 12234302 11193595 10283573 9484407
57048 9484407 8777868 8147681 7582615 7074960 6616110 6196764 5810650 5454729 5126220
57039 5126220 4822402 4542587 4287148 4055113 3845308 3658831 3497559 3361393 3249781
57030 3249781 3163771 3101567 3052014 2996721 2920178 2816633 2688970 2545107 2395409 2249156
57020 2249156 2111043 1981853 1861914 1751870 1651010 1557872 1472493 1395660 1326346 1262438
57010A262438n8867n2982m7926m4894m2093l8134l4857l3952l3686l1861k9322
56999H13864k7602k5783k2747k0037j9299j9009j6821j3291j0335p755m137L84
56987F27432M952J0096J6547K3075K7501K8411K4492J4472j07j4200k3702k8847
56975G10122l1501l1566k8494k3970k0186j7044j3489r972p252m517r99K333M931
56962E28396Q585J4825K2410K9746L7567M6124N1343M7356L2417J0353j2785l1548
56950G84789m2361m5131m3220l9956l5816l0153k3873j8420j3656q872m526j065
56938D77740K630P776J3889K0151K7177L5964M6178N6336O3552O2464M7994K1686
56926H83537p302k9978m4224n2199n4754n1923m6085m0452l5635l0760k6467k3737
$$ plain form
57010 1262438 1203571 1150589 1102663 1057769 1015676 977542 942685 908733 875047 843186 813864
56999 813864 786262 760479 737732 717695 698396 679387 662566 649275 638940 631185 627048 627432
56987 627432 632384 642480 659027 682102 709603 738014 762506 776978 776871 762671 738969 710122
56975 710122 678621 647055 618561 594591 574405 557361 543872 533900 526648 522131 521132 523465 528396
56962 528396 536981 551806 574216 603962 641529 687653 738996 786352 818769 829122 816337 784789
56950 784789 742428 697297 654077 614121 578305 548152 524279 505859 492203 483331 478805 477740
56938 477740 480370 488146 502035 522186 549363 585327 631505 687841 751393 813857 861851 883537
56926 883537 876235 846257 802033 749834 695080 643157 597072 556620 520985 490225 463758 440021
56914D40021k1489j8418j5835j5483j6032j4934j2442j0640r653q051n998m904
56902B86142m635l938k816j896m58K257M890N832O146P939J0938J3409J5348J7956
56888C57114K1126K4195K7754L1545L1915K5077J2284j304j2173j9865k4083k4236
56876D49349k1639j8743j6061j2544q482n144k042K333P392J1237J4298J9119
56864D19073K6565L5316M5089N7110P0524Q0674Q1711O9787M4858J1950j9796
56853I22861m2365n3859n7242n5395m9705m2035l4529k7455j9827j1882m556K827
56841E26838J1678K1536L1108M1292N4369P0884Q9922J10910J30762J39738J25643
56830A354680Q4847K7297l0277p4541j00121j08745j06303r8770q8968p7195o4191
$$ plain form
56914 440021 418532 400114 384279 368796 352764 337830 325388 314748 305095 297044 291046 286142
56902 286142 281507 277569 274753 272857 272399 274656 279546 285378 291524 299463 310401 323810 339158 357114
56888 357114 378240 402435 430189 461734 493649 518726 531010 529706 517533 497668 473585 449349
56876 449349 427710 408967 392906 380362 371880 366736 364694 367027 374419 385656 399954 419073
56864 419073 445638 480954 526043 583153 653677 734351 816062 885849 930707 942657 922861
56853 922861 880496 826637 769395 714000 664295 622260 587731 560276 540449 528567 524011 526838
56841 526838 538516 560052 591160 632452 686821 757705 847627 958537 1089299 1229037 1354680
56830 1354680 1439527 1466824 1436547 1362006 1261885 1153140 1046837 948067 859099 781904 717713
56819G17713n1721m0652l0547k1058j2097k863P435J8406K9641M2446N8478P6953
56807G92134R4011J03418R7243O9802K4825k3304n9622p9470q7196q7172q0843
56796G63826p0652o0541n1696m2222l1653k2056j4334p296p37M290Q626J4745
56784D90300K2982L1442L9736M8645N5517N4185M1183J9244n833k8753m5147n2641
56772F70860n2976n0290m6509m1019l4565k9612k6458k2826j8139j4535j2874
56761C21057j1410r407q375q702q596p538p266q222q479p339o525o688o187m563
56747B11760l647l983l643k012j184k120k872k187j483j652j370j85R1j098j544
56732A82871o4J426J475J456K384K680J287K6N28J564J580J282J573J510M10l64
$$ plain form
56819 717713 665992 625340 594793 573735 561638 558775 566210 584616 614257 656703 715181 792134
56807 792134 886145 989563 1086806 1156608 1181433 1158129 1098507 1019037 931841 844669 763826
56796 763826 693174 632633 580937 538715 507062 485006 470672 463376 462639 466929 475555 490300
56784 490300 513282 544724 584460 633105 688622 742807 783990 803234 797401 768648 723501 670860
56772 670860 617884 567594 521085 480066 445501 415889 389431 366605 348466 333931 321057
56761 321057 309647 300240 291865 283163 274567 267029 259763 251541 243062 235723 229198 222510 216323 211760
56747 211760 208113 204130 200487 198475 197291 195171 192299 190112 188629 186977 185607 185422 185513 184415 182871
56732 182871 182807 184233 185708 187164 189548 192228 193515 193541 194069 195633 197213 198495 200068 201578 201988 201624
56716B01624L12J427J880K146K489K015Q84Q54K213K834J724O39P00M89q21j531
56700B19878n37N74M39J86Q68J447J262J696L433M769M634M595N959P525Q171
56685B64899Q946J0646J1924J1725J0922R978P766M410K233K100J846K30q51p7
56671C46697Q14N10O51K365L643K857J740K123K747K186J830K964L851K769J234
56656C78981J128J328K41q91m77J18j098l259m517n210o372p275p168p209q041
56641C30279p907n815l999m414n410m842l746l857m150l156k150k666l234k040
56627B72893m15l19o15O49K479K937K784L596M329L313J693J341J254m49k724
56612B92746l331k642k383k346j615j235k298l266k497j477k183l301k655j321
$$ plain form
56716 201624 201936 203363 205243 207389 209878 211893 212777 213631 215844 218678 220402 221041 221741 222230 221409 219878
56700 219878 219341 219915 220354 220540 221408 222855 224117 225813 229246 234015 238649 243244 249203 256728 264899
56685 264899 273845 284491 296415 308140 319062 329040 336806 341216 343449 345549 347395 347625 346774 346697
56671 346697 347511 348021 348672 351037 354680 357537 359277 361400 364147 366333 368163 371127 374978 377747 378981
56656 378981 380109 381437 381678 380787 380310 380428 379330 376071 371554 366344 359972 352697 345529 338320 330279
56641 330279 322372 316557 312558 308144 302734 297892 294146 290289 286139 282983 280833 278167 274933 272893
56627 272893 272478 272159 271544 272193 274672 277609 280393 283989 288318 291631 293324 294665 295919 295470 292746
56612 292746 289415 286773 284390 282044 280429 279194 276896 273630 271133 269656 267473 264172 261517 260196
56598B60196j546k441j659K90J279J555K706M050L802K569K194K441K151K158
56584B79745L548M729L789K153K259L290K976J915K140K933K217P95J088K687
56570C16264L237K780L289M683N173M885N543P199Q489R253R809Q867N428J448
56556C96347n95j431l048m760m776l932m090m431l255j855k609m674n605n787
56542C45499p139q903q966q090q541r744r533q477q628r190p819n221m070m346
56528B36832m025l282l722m477l535j936k162l365k738o69N0p30q97n51j443k818
56512B00532k501j352j857l153k340j6N76o93r97k4j39j364j306qP2j112j165
56495A83153J9K83k71M05J673Q59j579k506j633j563k462j835K16Q20k90l58J029
$$ plain form
56598 260196 258650 256209 254550 254840 256119 257674 260380 264430 268232 270801 272995 275436 277587 279745
56584 279745 283293 288022 291811 293964 296223 299513 302489 304404 306544 309477 311694 312489 313577 316264
56570 316264 319501 322281 325570 330253 335426 340311 345854 353053 361542 370795 380604 389471 394899 396347
56556 396347 395752 394321 391273 386513 381737 377805 373715 369284 366029 364174 361565 356891 351286 345499
56542 345499 338360 329457 320491 312401 303860 294116 284583 276106 267478 258288 250469 245248 241178 236832
56528 236832 232807 229525 225803 221326 217791 215855 213693 210328 207590 206921 206971 206241 205344 204793 203350 200532
56512 200532 198031 196679 194822 191669 189329 189313 189889 189196 188199 188175 188036 186672 185366 185358 185430 184318 183153
56495 183153 183172 183455 183184 183589 185262 186121 184542 182036 180403 178840 176378 174543 174759 175579 175289 174931 175960
56478A75960J251j45n98M78P69j78j7J729K693K019J422J396N96o78o89j6p81
56461A85211k252j779J48O69m5P35K654K622P36L40J883K353J148Q87J878J441
56445A98629o60j599r71j325k662k110K87J217K43M59K266K536R15P68K644K973
56429B03610P31o71K33P27l60n64P54Q04j032j701m19k82k142k775j039rq86p60
56411A94219J434K615J470Q43J882J731n35j507L17J634M13o44M36J453Q34O18
56395B07213J843K110M40n02N26J056J9j80J161J232o49j209O10J462J8m05J695
56378B16440K900J218m03O0J98j397j958q1J257M30K52K158L070J350O1R92J245
56361B27792p24j648L45J943P63m11O90J678P78M88K163K696N23q59P33K087Q91
$$ plain form
56478 175960 177211 177066 176468 176946 177715 177537 177520 179249 181942 183961 185383 186779 187375 186697 186008 185992 185211
56461 185211 182959 181180 181328 181997 181952 182687 185341 187963 188699 189039 190922 193275 194423 195310 197188 198629
56445 198629 197969 196370 195399 194074 191412 189302 189589 190806 191049 191508 193774 196310 197225 197993 200637 203610
56429 203610 204341 203670 203903 204630 204270 203706 204460 205264 204232 202531 202112 201830 199688 196913 195874 195865 194979 194219
56411 194219 195653 198268 199738 200581 202463 204194 203659 202152 202469 204103 204516 203872 204308 205761 206595 207213
56395 207213 209056 211166 211606 211104 211630 212686 212705 212525 213686 214918 214269 213060 213670 215132 215150 214745 216440
56378 216440 219340 220558 220155 220215 220413 219016 217058 216977 218234 218664 218916 221074 224144 225494 225555 226547 227792
56361 227792 227068 225420 225765 227708 228471 228060 228750 230428 231206 231694 233857 236553 237076 236217 236950 239037 239928
56344B39928J42K086L714K641J647K858L339J100m20J401L371K584J720L285M297
56329B73693K059l07N17K117J383L56J626K883J418n49k49N18m13r07J036K862
56313B88043K205J361K525L506K585K478M889O543N268M389O273P390M924K419
56299C44798L380N045M159L140M717O090M401K489L292M009J827r4J511L645K780
56284C95189J483L057N002M146L016M686O604N870N327P922J0488R677Q587J0914
56270D81968J3997J4408J4797J8311K1905K2334K3094K8030L3707L5730L7063
56259G45344M2260M8889N2728N6165O3246P1310P5811P8615Q3537Q8341Q9162
56248A495408Q8134Q8659Q7969Q2342P4640O8623O0970M7393L1492J8982Q173
$$ plain form
56344 239928 240070 242156 245870 248511 250158 253016 256355 257455 257035 258436 261807 264391 266111 269396 273693
56329 273693 275752 275445 275962 278079 279462 279818 281444 284327 285745 285196 284947 285465 285052 284145 285181 288043
56313 288043 290248 291609 294134 297640 300225 302703 307592 314135 319403 323792 330065 337455 342379 344798
56299 344798 348178 353223 357382 360522 365239 371329 375730 378219 381511 385520 387347 387253 388764 392409 395189
56284 395189 396672 399729 404731 408877 411893 416579 423183 429053 434380 442302 452790 462467 471054 481968
56270 481968 495965 510373 525170 543481 565386 587720 610814 638844 672551 708281 745344
56259 745344 787604 836493 889221 945386 1008632 1079942 1155753 1234368 1317905 1406246 1495408
56248 1495408 1583542 1672201 1760170 1842512 1917152 1985775 2046745 2094138 2125630 2144612 2152785
56237B152785n046j7955k5915l1544l9779m8391n2579n4442n8573o2897o3288
56226A692376o2683o5918o9925o8888o4931o3860o4326o1175n5720n2754n1046
56215A011150m6493m1168l9479l9043l4924k9202k6838k5966k1934j6899j5618
56204F73586j5798j2564q324q112r449p108l586m332o910n707k959m046o291l852
56190E74548N11K39k622j675J238j29l796l195Q9m10l288k271J158O86k290j457
56174E57336J937J907QK204O362N766K280L174P459Q341O551Q205J2065J2118
56160F35713J0220J2819J7792J8032J5488J7870K4023K6638K6906L2120M1106
56149H78727M6682N0384O0021P4545Q6202R5718J10063J26689J35222J33608J27826
$$ plain form
56237 2152785 2147739 2129784 2103869 2072325 2032546 1984155 1931576 1877134 1818561 1755664 1692376
56226 1692376 1629693 1563775 1493850 1424962 1360031 1296171 1231845 1170670 1114950 1062196 1011150
56215 1011150 964657 923489 884010 844967 810043 780841 754003 728037 706103 689204 673586
56204 673586 657788 645224 636900 628788 619339 612231 608645 604313 597403 591696 588737 584691 578400 574548
56190 574548 575059 575298 572676 571001 572239 572110 568314 565119 565208 564798 561510 559239 560397 561083 558793 557336
56174 557336 559273 561180 561188 563392 569754 575520 577800 580974 588433 596774 603325 611530 623595 635713
56160 635713 645933 658752 676544 694576 710064 727934 751957 778595 805501 837621 878727
56149 878727 925409 975793 1035814 1110359 1196561 1292279 1402342 1529031 1664253 1797861 1925687
56138A925687J17611R8175P4656N8791N1910M6112M0462L9956M0358L1192J3424
56127B538334j996j2258k2962l2190l2253k7019k9736m3121n8312p2870r2110
56116B113507j12733j23632j23837j22339j19955j09255r2365q0188p3306o2289
56106A093608m7386l8824l6846l0983k0336j4999j5973j3400o337m382p879o584
56094H49679J48K018j624m63N857O582J552K420R945J2054P192P166J3675J4842
56080I31043Q734P255J2547J2664N263K329O608O633J41j204M560N211j272k064
56066I98448N367P994K759K421J0012J2693P474P367J5248J7532J0904R042J5592
56053A122853J7102J0261Q987J6674J9043J2615J2056K0890K3753J6551J4872
$$ plain form
56138 1925687 2043298 2141473 2216129 2274920 2326830 2372942 2413404 2453360 2493718 2524910 2538334
56127 2538334 2536338 2524080 2501118 2468928 2436675 2409656 2379920 2336799 2278487 2205617 2113507
56116 2113507 2000774 1877142 1753305 1630966 1511011 1401756 1309391 1229203 1155897 1093608
56106 1093608 1046222 1007398 970552 939569 919233 904234 888261 874861 868524 864142 856263 849679
56094 849679 849827 851845 850221 849758 855615 862197 863749 866169 876114 888168 895360 902526 916201 931043
56080 931043 939777 947032 959579 972243 977506 979835 986443 993076 993217 992013 996573 1001784 1000512 998448
56066 998448 1003815 1011809 1014568 1016989 1027001 1039694 1047168 1054535 1069783 1087315 1098219 1107261 1122853
56053 1122853 1139955 1150216 1159203 1175877 1194920 1207535 1219591 1240481 1264234 1280785 1295657
56042A295657K3212K5849J8065J5806K4093K6985J9620J8433K8290L1932K3859
56031A551801K1704L1661L6350K9757K9555M1231M5561L6102L2895M3779M9066
56020A949462M0511L7693M8922N4362M5730M3478N6193O2886N4732N3397O7940
56009B515306P5703O6851O4637P9655Q8418Q0217P9380R6964J07514R9156R8213
55998C452014J17457J30019J22653J23101J45098J59750J52716J54400J80473
55989D737681J99822J96233K02186K34689K59788K59837K71081L13022L48160
55980G022499L56096L76492M31436M79835M99390N35086O12199O84651P28042
55971A1725726P95122R15743J036755J130325J260424J466731J692817J912884
$$ plain form
56042 1295657 1318869 1344718 1362783 1378589 1402682 1429667 1449287 1467720 1496010 1527942 1551801
56031 1551801 1573505 1605166 1641516 1671273 1700828 1742059 1787620 1823722 1856617 1900396 1949462
56020 1949462 1989973 2027666 2076588 2130950 2176680 2220158 2276351 2339237 2393969 2447366 2515306
56009 2515306 2591009 2657860 2722497 2802152 2890570 2970787 3050167 3147131 3254645 3353801 3452014
55998 3452014 3569471 3699490 3822143 3945244 4090342 4250092 4402808 4557208 4737681
55989 4737681 4937503 5133736 5335922 5570611 5830399 6090236 6361317 6674339 7022499
55980 7022499 7378595 7755087 8186523 8666358 9165748 9700834 10313033 10997684 11725726
55971 11725726 12520848 13436591 14473346 15603671 16864095 18330826 20023643 21936527
55963B1936527K210689K641871L151206L729717M503397N541526O737987Q023740
55955E8476660R521953J1349156J3498526J6121274J9651968K4403509L0369657
55948A83392703L7669269M6377268N4785114N8136378N0895932L1623995N360780
55941D68241439j9530057l6928085m5565433m7440987m5150117m0714667l5562599
55934A97349494l0519802k5837869k1566686j7851319j4794006j2283908j0164079
55927F4331825q417194p049953n950519n002186m213148l612237l128833k685549
55919B4272206k305926k027576j801410j570943j365260j224510j111645r80651
55911A1884285q59090p84547p26800o46961n70536n31413n02466m48730l93940
$$ plain form
55963 21936527 24147216 26789087 29940293 33670010 38173407 43714933 50452920 58476660
55955 58476660 67998613 79347769 92846295 108967569 128619537 153023046 183392703
55948 183392703 221061972 267439240 322224354 380360732 431256664 462880659 468241439
55941 468241439 448711382 411783297 366217864 318776877 273626760 232912093 197349494
55934 197349494 166829692 140991823 119425137 101573818 86779812 74495904 64331825
55927 64331825 55914631 48864678 42914159 37911973 33698825 30086588 26957755 24272206
55919 24272206 21966280 19938704 18137294 16566351 15201091 13976581 12864936 11884285
55911 11884285 11025195 10240648 9513848 8866887 8296351 7764938 7262472 6813742 6419802
55902F419802l70369l54954l16411k76182k63676k57784k29584j98703j92511
55893C959628j91567j68575j41608j37264j38831j20618r7961r5287r8855q7279
55883B681783p5658q4444r6396q8370p5166p9252q6983p6888o2412o4876p1404
55872A819934o0820m5140m5166m9785l9263k5374k9263m1345m1022l5299m0993
55861A366464m8805m1469k8919l0149l7814l4473k6584k9350l4845k7780j6766
55850A009510j8375k5675k3057j6762k0618k6985k1678j2899j5922k3388j9753
55839G84398j1210j2627j8433j4782p506j0000j5960j1655l121m068q762l671
55827F62603N579N351P20M784J2321J0158L268M740R887N960k164j362L953N76
$$ plain form
55902 6419802 6049433 5694479 5378068 5101886 4838210 4580426 4350842 4152139 3959628
55893 3959628 3768061 3599486 3457878 3320614 3181783 3061165 2963204 2867917 2769062 2681783
55883 2681783 2606125 2521681 2425285 2336915 2261749 2182497 2095514 2018626 1956214 1891338 1819934
55872 1819934 1759114 1713974 1668808 1619023 1579760 1554386 1525123 1483778 1442756 1407457 1366464
55861 1366464 1317659 1276190 1247271 1217122 1179308 1144835 1118251 1088901 1054056 1026276 1009510
55850 1009510 991135 965460 942403 925641 905023 878038 856360 843461 827539 804151 784398
55839 784398 773188 760561 742128 727346 719840 709840 693880 682225 679104 675036 666274 662603
55827 662603 668182 673533 674253 679037 691358 701516 704784 709524 719411 725371 723207 721845 725798 726374
55813G26374p828q635n278r767j8182j8066j2792j4639k0605j8754j1914j1801
55801E68113j5760j2382m438l657q212p321k830m540r252o033K474M819K011L639
55787E06631P788N313o44K80N693N460K053N940J5053J8972J9354K5950L5508
55774F53351L4679K1694O737o431k0948l2259l1799k3177j7365j4376o456M293
55762E67943Q945Q923J2444J7089J3535L614k799n922j3613k3853k7403k5402
55750E33501k6857l0965k9260k3134k1615k3764k0684j3380j1257j4147j3056
55739C05382p685o329r146q243l776l503o841n595j39J088k207k303Q03l64n125
55724B46017n246r11m65m171l925P24J910r06j69M323M579p4j793N44j37m285
$$ plain form
55813 726374 718546 709911 704633 694866 676684 658618 645826 631187 610582 591828 579914 568113
55801 568113 552353 539971 535533 531876 523664 516343 513513 508973 499721 493688 496162 500981 502992 506631
55787 506631 514419 519732 519088 519368 525061 530521 532574 538514 553567 572539 591893 617843 653351
55774 653351 688030 709724 716461 710030 689082 656823 625024 601847 584482 570106 563650 567943
55762 567943 576888 585811 598255 615344 628879 632493 629694 623772 610159 586306 558903 533501
55750 533501 506644 475679 446419 423285 401670 377906 357222 343842 332585 318438 305382
55739 305382 297697 291368 282222 273979 270203 266700 259859 254264 254125 255213 253006 250703 251506 251142 246017
55724 246017 240771 239860 239395 235224 231299 232023 233933 233027 232858 237181 241760 241686 239893 240437 240300 236015
55708B36015m362L08J959q25j034K497K957o43j484J433J398k472l342r2P21j882
55692B31152j367L098M643J918J345M285M722J717J362M419M678J638K063O783
55678B72456Q642N823M689P036P079L682L127O851Q505O031M850O388N211K84
55664C50654k512j782l011p136q323n724n683r523j0726p251n091o479o005j727
55650B69681J075N02J498N502P426O133P184J2050J5254J5213J7176K2381K5037
55637D06112K3238K2043K2622J9275J0681L306Q6l704r807j3016j1505j0584j2294
55624D46453j1547o459k214r05K202Q351J1662R744P821Q215N887j428q609j2877
55610D56296j8137k5440k9166k7109k4692k4742k2955j7718j4496j5701j5997
$$ plain form
55708 236015 231653 231961 233920 233095 232061 234558 237515 236872 235388 236821 238219 235747 232405 232313 233034 231152
55692 231152 229785 232883 237526 239444 240789 245074 249796 251513 252875 257294 261972 263610 265673 272456
55678 272456 281098 286921 291610 298646 305725 309407 312534 319385 327890 333921 338771 345159 350370 350654
55664 350654 348142 346360 343349 336213 327890 322166 316483 306960 296234 288983 283892 277413 271408 269681
55650 269681 270756 271258 272756 278258 285684 291817 299001 311051 326305 341518 358694 381075 406112
55637 406112 429350 451393 474015 493290 503971 507277 507363 503659 493852 480836 469331 458747 446453
55624 446453 434906 428447 426233 425328 427530 435881 447543 457287 465108 473323 479210 477782 469173 456296
55610 456296 438159 412719 383553 356444 331752 307010 284055 266337 251841 236140 220143
55599B20143j2407r507r881r162n398l615n967o933l587j120k811l947j301N87
55585A45094j495l147j068O56j140k592q86m4k729m496k213j05j470k363L68K604
55569A24974P58j434o4K061J652J013K297K624M62j70K746M642K614R56K965M744
55553A52840K888R42K210L424J661M02K491M007J564j031J60J936K52k437k511
55538A68798j906l311m377k827j707l665n555m334k725l522m055j870p1j395k745
55523A24733j172N08m36j150Q69K410P37p70R99K888J756O52K715M793L504J948
55507A44984L932O976P356O903Q554J0336R994J0371J4018J7575J7656J7110J9259
55494B95024K1220J9312J5853J3984J0961L407n469j0768j3612j7406k0858k1298
$$ plain form
55599 220143 207736 198229 188348 179186 173788 170173 164206 157273 153686 152566 149755 145808 144507 145094
55585 145094 143599 140452 139384 140040 138900 136308 135422 135378 132649 128153 125940 125835 124365 122002 122370 124974
55569 124974 125732 124298 124234 126295 127947 128960 131257 133881 134343 134173 136919 141561 144175 145131 148096 152840
55553 152840 155728 156670 158880 162304 163965 164367 166858 170865 172429 171398 171558 173494 173746 171309 168798
55538 168798 166892 163581 159204 156377 154670 151005 145450 141116 138391 134869 130814 128944 128873 127478 124733
55523 124733 123561 124069 123633 122483 123352 125762 126499 125729 126728 129616 131372 132024 134739 139532 143036 144984
55507 144984 148916 155892 163248 170151 178705 189041 199035 209406 223424 240999 258655 275765 295024
55494 295024 316244 335556 351409 365393 376354 379761 374292 363524 349912 332506 311648 290350
55482B90350k0595k1341k1251j7744j3836j3122j3204j0464p105o850p788o170
55470A30880l442k911l207j531K44p94k459j319P43J67j625j346j75q34j807n95
55454A09989P01q01k820j874K63J58q17K23J428l21k997k827r96p82j178M05K252
55437A00006J472q5P66K316J356l96L71J928P45j589j280N87M33r40l95J078M89
55420A06862r09N6K081J719r4o3J008J07j763j461L8n13k309k053k24J35p26l23
55402A01568P79K56j044p97o0j191k881k456j029j175j819o58P40k35j874j116
55386H7008O40L38p77J49J626N82j417r01R24N72j095r12K13o64k258j361O51
55369H3318K43j365m03K090J969m14j105J91L81n82k2J595J463J88O55K160J684
$$ plain form
55482 290350 269755 248414 227163 209419 195583 182461 169257 158793 151688 144838 137050 130880
55470 130880 127438 124527 121320 119789 120033 119239 116780 115461 116204 116371 114746 113400 113225 112391 110584 109989
55454 109989 110690 109889 107069 105195 105458 105616 104799 105022 106450 106129 103132 100305 99309 98527 97349 97754 100006
55437 100006 101478 101393 102159 104475 105831 105435 105806 107734 108479 106890 105610 106197 106630 105690 105295 106373 106862
55420 106862 105953 106009 108090 109809 109715 109652 110660 110767 109004 107543 107581 107068 104759 102706 102482 102617 101891 101568
55402 101568 102347 102603 101559 100762 100702 99511 96630 94174 93145 91970 90151 89493 90233 89998 88124 87008
55386 87008 87648 87986 87209 87358 88984 89566 88149 87248 88172 88744 87649 86737 86950 86286 84028 82667 83318
55369 83318 83561 82196 81793 83883 85852 85438 84333 84524 84905 84323 84301 85896 87359 87547 88202 90362 92046
55352I2046j42k73P58J75j155l10J562J088p72m68J195N91j466j007J456J620
55336I4898p26j553r5L27r67j166k5l47k076k076j49O72m6J99J357Q79p74o29
55318H7703Q92N27j485j605L47R07n11q65L96M24j302k118j462j480k089j016
55302G7263J060J026q48j220J90M97l71M13K574K752Q20J15J056O92j017p87J484
55285H5699K113L75l14R68J168n27j097L16P40p39j229K82J088J30k11Q22R02
55268I0486m19n97O76N41j395j906j02Q97k13q09K49N12r42j557l55Q6j310j978
55250H1864n98N64P9m15o3l66j364q10J305J987M35n37L67J059O13Q33J895J368
55232H8216q57j595N8J107J99k04R63J120r29k474j653k76J03N58J369P58j139
$$ plain form
55352 92046 91904 91631 92389 92564 91409 91099 92661 93749 92977 92509 93704 94295 92829 91822 93278 94898
55336 94898 94172 92619 92524 92851 91884 90718 90693 90346 88270 86194 86045 86717 86671 86870 88227 89106 88332 87703
55318 87703 88595 89122 87637 86032 86379 87286 86775 85910 86306 86730 85428 83310 81848 80368 78279 77263
55302 77263 78323 79349 78501 77281 77471 77968 77597 78010 80584 83336 84156 84271 85327 86019 85002 84215 85699
55285 85699 87812 88187 87873 88841 90009 89482 88385 88701 89441 88702 87473 87755 88843 88973 88762 89584 90486
55268 90486 90067 89470 90146 90687 89292 87386 87284 88181 87968 87159 87408 87920 86978 85421 85066 85152 83842 81864
55250 81864 81266 81830 81909 81494 81431 81065 79701 78891 80196 82183 82618 82081 82448 83507 84120 84953 86848 88216
55232 88216 87359 85764 85822 86929 87128 86924 87887 89007 88078 85604 83951 83675 83778 84336 85705 86463 85324
55215H5324j472L21J220O1m21J142K221J184N5K73K43p85q52N60R54m92j128J43
55197H8551O55r38j965o55P65M58J48J205J816P79R3J013J420o4j201j26J309
55180I3263R98m5k99m55j070q12O33J118l39j594j044JL51Q67J684J093r25j759
55162I1666n33K43p67j444l88M97k30j022o65n10j256j177M06J430P76J53N77
55145H7756O64KK31J252N75j830k538m11J256M60l98N49J276K40m94M75R49n24
55127H9490j564l43J044O60K28J377K338J486M69P15N97r18j627j57J143M40l18
55110I5060N36J099q9p86O79J885P10n36O58K369J840L46L68J058M95l76L1M95
55092A05842n47j672j129j60l80n94M72J232K93m88N88J604N12r31l81R04P70
$$ plain form
55215 85324 83852 84173 85393 85454 85033 86175 88396 89580 89635 89908 90151 89366 88514 89074 90028 89536 88408 88551
55197 88551 89206 88268 86303 85648 86413 86871 87019 88224 90040 90819 90912 91925 93345 93281 92080 91954 93263
55180 93263 94261 94216 93917 93462 92392 91580 92213 93331 92992 91398 90354 90355 90706 91573 93257 94350 93425 91666
55162 91666 91133 91376 90609 89165 88777 89274 89044 88022 87357 86847 85591 84414 84820 86250 87026 87179 87756
55145 87756 88420 88422 88653 89905 90480 88650 86112 85701 86957 87417 87019 87568 88844 89084 88590 89065 90014 89490
55127 89490 87926 87583 88627 89287 89515 90892 93230 94716 95185 95900 96497 95579 93952 93795 94938 95378 95060
55110 95060 95596 96695 96606 95820 96499 98384 99094 98558 99216 101585 103425 103771 104139 105197 105692 105316 105347 105842
55092 105842 105295 103623 102494 102334 101954 101360 101832 103064 103357 102869 103457 105061 105573 104642 104261 105165 105935
55075A05935K24R92J746O84p24l83M68k83j544j137J85N02L09Q58J107j78j472
55058A07289r71O7k34r50n77k43j279k032o34J397J789J400J949K314Q02j091
55042A08996j034M4j50j183j261p88j142j635j031k50n18p52J53P06m18j445n73
55025I7719N77m0r80j11J208O59o38k99Q02L52q88m86J237K038J715J694J982
55008A06541J773J657K190J995K78q39M38K161J711k9q94j358k646l379j981k36
54992A07382m78j479r47J28l06j108j89J134M59j017o01R89J252O64J228J991
54976A09102P56j200q99J013J449K94J3P65N34n75o40J10j65j006m21J032J057
54959A11219j39l60M93P61O72J700L071K828J671J748K516J833L51O10K436L420
$$ plain form
55075 105935 106159 107151 108897 109581 108857 108474 108942 108659 107115 105978 106163 106665 106974 107832 108939 108761 107289
55058 107289 106318 106385 106151 105201 104624 104381 103102 101070 100436 101833 103622 105022 106971 109285 110087 108996
55042 108996 107962 108006 107856 106673 105412 104624 103482 101847 100816 100566 100048 99296 99449 100155 99737 98292 97719
55025 97719 98296 98256 97276 97165 98373 99032 98394 98095 98897 99249 98361 97875 99112 101150 102865 104559 106541
55008 106541 108314 109971 112161 114156 114434 113595 114033 116194 117905 117876 116982 115624 112978 109599 107618 107382
54992 107382 106904 105425 104478 104606 104300 103192 103003 104137 104596 103579 102978 103967 105219 105883 107111 109102
54976 109102 109858 108658 107759 108772 110221 110515 110528 111293 111827 111252 110612 110722 110557 109551 109130 110162 111219
54959 111219 111080 110720 111213 111974 112646 114346 117417 120245 121916 123664 126180 128013 128364 128974 131410 134830
54943A34830L423M459O516P615P708Q517R869R951Q811P876O536L141j230l913
54929B14109m932o276p668p297n995o296p660p199m898l678m216m207k956k399
54915A38432l068l132k071j461j634j162p1M4n74P8K041L183L006L196M184M611
54899A45602M394M951O217O776O949Q299J0114R936P694N712M516K245j499m830
54885B17076o880q588r928r673q139p130o951o480n879o133o371n000l004k555
54871A24365l038k219o48p37k033j872m03k54j330q37J219J656q4p77Q11J815
54855A15634M70j047q34k22o06r83m85j67n74n46J90K25o31p34J26k0j654k585
54837A05557j602k45J97M59R64O96m79j094o84l96m23L87J770J858M61m69j63
$$ plain form
54943 134830 138253 142712 149228 156843 164551 173068 182937 192888 201699 209575 216111 219252 218022 214109
54929 214109 209177 202901 195233 187936 181941 175645 167985 160786 155888 152210 147994 143787 140831 138432
54915 138432 135364 132232 130161 128700 127066 125904 125833 125877 125303 125381 127422 130605 133611 136807 140991 145602
54899 145602 149996 154947 161164 167940 174889 183188 193302 203238 210932 216644 221160 223405 221906 217076
54885 217076 210196 201608 191680 182007 173868 166738 159787 153307 147428 141295 134924 129924 126920 124365
54871 124365 121327 119108 118460 117723 115690 113818 113415 113161 111831 110994 112213 113869 113785 113008 113819 115634
54855 115634 116104 115057 114223 114001 113395 112412 111927 111760 111186 110640 110830 111055 110424 109690 109816 109796 108142 105557
54837 105557 103955 103710 103907 104366 105330 106026 105547 104453 103769 103373 102950 103337 105107 106965 107426 106957 106794
54820A06794J37N5O33J570J233n4j61R87J146j02o40J10K36p22p49P05J547R68
54802A13693Q25J839K158J098N96J418J601K96l41J043K677K985L012L774M280
54787A40954M089M764O968Q805Q861Q252Q021P201N080K773J067q42l225m902
54773A97866n537o293p256p066n877n650o537o320m467l291l810m011k717j610
54759A27424j729j484j8Q72J65k84Q16J791J237O20J431K636L070L663N068N852
54743A51130N262N103O640Q166P921O972O907O937N557L106O08k031m824o684
54729B00770p164p338p634p019n533n007n905o175m773l507l708l957l019k236
54715A27795k785l251k184o95l20m68r9K12j39k57L28L36q51j622p60N09P70N24
$$ plain form
54820 106794 106931 106986 107619 109189 110422 110368 110207 111194 112340 112238 111598 111708 111944 111222 110473 111178 112725 113693
54802 113693 114518 116357 118515 119613 120209 121627 123228 123524 123183 124226 126903 129888 132900 136674 140954
54787 140954 145043 149807 156775 165580 174441 182693 190714 197915 202995 205768 206835 205993 202768 197866
54773 197866 192329 186036 178780 171714 165837 160187 153650 147330 142863 139572 135762 131751 129034 127424
54759 127424 125695 124211 124193 125065 125230 124946 125762 127553 128790 129410 130841 133477 136547 140210 145278 151130
54743 151130 156392 161495 168135 176301 184222 191194 198101 205038 210595 213701 214309 212278 207454 200770
54729 200770 193606 186268 178634 171615 166082 161075 155170 148995 144222 140715 137007 133050 130031 127795
54715 127795 125010 121759 119575 118880 118560 118092 117993 118205 118066 117809 118137 118473 117622 116000 115240 115749 116519 117043
54697A17043M25k21j521j897o93M09J67l03J3K19k57k14P56R18n36j697j111j45
54679A11355k03k76O10J141K17p62m00K19j92p01j57N68M74L67Q38O75o94j535
54661A11544o72L45M1n30k04q7j133j832q21N70O77K43M36M66m43j004k19M82
54643A07859j70q21l3J011Q32M05J054J774J220K60J08J3p67r83J36Q27k38j266
54625A11221m33Q19M29n98k92O50M99q5M85J562J533P53M73L64k35l86O05J257
54607A18621M61j11J133K540J928L67R3O10J93n27O7J163Q56l33n87j50m20q84
54589A25020j37J180J441R99J211J682J294P62J240J672M81j287j492m56j07n80
54573A32923o35l96q72j664j768j668k089j975k98J416J195j10l86K79N20O32
$$ plain form
54697 117043 117468 117247 115726 113829 113136 113545 113712 113409 113422 113641 113384 113170 113926 114844 114308 112611 111500 111355
54679 111355 111152 110876 111486 112627 112844 112082 111682 111901 111709 111008 110851 111419 111893 112260 113098 113773 113079 111544
54661 111544 110872 111217 111258 110728 110524 110437 109304 107472 106651 107221 107898 108141 108577 109043 108600 107596 107377 107859
54643 107859 107689 106868 106835 107846 108678 109083 110137 111911 113131 113391 113499 113512 112745 111762 111898 112725 112487 111221
54625 111221 110788 111607 112036 111438 111146 111796 112295 112210 112695 114257 115790 116543 117016 117380 117145 116759 117364 118621
54607 118621 119082 118971 120104 122644 124572 124939 125032 125642 125835 125308 125375 126538 127394 127061 126474 126324 125904 125020
54589 125020 124883 126063 127504 128503 129714 131396 132690 133452 134692 136364 136845 135558 134066 133610 133503 132923
54573 132923 132288 131892 131020 129356 127588 125920 123831 121856 121558 122974 124169 124059 123673 123952 124472 125104
54557A25104J577K401J684L59J37L93l18j075j46J445J272m85j637j603j408j014
54541A26686K11J193M76r99j330q80j144j599q10M28L15n73l76N66O06J15N56
54524A23441J238M69r12p29N71P73m4M4R31P70k98l91M09L03n33j45J338J727
54506A28962O63P6M88L01q83j481r03l43k52K21J036J143P04Q91J557J671J670
54489A35521K682L782L057J045K11J132K196K760L559M223L592K353K279K962
54475A71354K390O23k72R3Oj078j977k441l326m149l600k377k367l174k781j496
54459A45428j599l065l319j706m85p72j008k38L64J71J76O16L80m92n56K24K63
54442A34382n55n96L56N94k94p48l08k98r27p88J40J53q56r17M02J102L90o1N66
$$ plain form
54557 125104 126681 129082 130766 131125 131262 131655 131337 130262 130116 131561 132833 132348 130711 129108 127700 126686
54541 126686 126897 128090 128566 127567 126237 125357 124213 122614 121804 122232 122547 121974 121598 122164 122770 122885 123441
54524 123441 124679 125148 124236 123507 124078 124851 124807 124851 125782 126552 126254 125863 126272 126575 126042 125897 127235 128962
54506 128962 129625 129701 130189 130490 129607 128126 127223 126880 126628 126849 127885 129028 129732 130623 132180 133851 135521
54489 135521 138203 141985 145042 146087 146298 147430 149626 152386 155945 160168 163760 166113 168392 171354
54475 171354 173744 174367 174095 174188 174194 173116 171139 168698 165372 161223 157623 155246 152879 149705 146924 145428
54459 145428 143829 140764 137445 135739 135254 134482 133474 133236 133600 133771 133947 134563 134943 134451 133895 134119 134382
54442 134382 133827 133231 133587 134181 133887 133139 132831 132533 131606 130818 130958 131111 130255 129338 129740 130842 131232 131171 131737
54423A31737P73j93q33k77K28OL06J673K584K099J438J592J657Q66O8J0J48J27
54405A44009M24Q34L76o18o41K90M37n73j077m08l9p81j409j016l91j24L21R32
54387A40546P93R5J73R75R30j31n33J67M23k14q5J546L066L268L071L443L890
54370A61423L934L955L814K804J491J278J767J085q47k094k140k525l599l793
54356A66553k809k374k922k700j200k38o17q58l87o69j923k056l61R49N31N9Q82
54339A49860J681J351J183K187L028K595J950J887J231m79j400m96M10k79j358
54324A63351j446j477k404k862j567J73O40L32L13M4j015j657r84k26m87o68K18
54307A50278P73m31k137k353j407q20o90k86J06o9k84p1j61r42j271l98N33L82
$$ plain form
54423 131737 132510 132317 131484 131207 131435 131441 131747 133420 136004 138103 139541 141133 142790 143656 143724 143734 143882 144009
54405 144009 144433 145267 145643 145025 144384 144674 145111 144538 143461 143053 143014 142233 140824 139808 139417 139293 139614 140546
54387 140546 141339 141434 141607 142582 143512 143381 142848 143015 143438 143224 143139 144685 147751 151019 154090 157533 161423
54370 161423 165357 169312 173126 175930 177421 178699 180466 181551 180704 178610 176470 173945 170346 166553
54356 166553 163744 161370 158448 155748 154548 154310 153693 152835 152448 151779 149856 147800 147439 148388 148919 148978 149860
54339 149860 151541 152892 154075 156262 159290 161885 163835 165722 166953 166474 165074 164578 164988 164709 163351
54324 163351 161905 160428 158024 155162 153595 153768 154408 154740 155053 155097 154082 152425 151441 151215 150728 150060 150278
54307 150278 151051 150620 148483 146130 144723 143903 143213 142927 143033 142964 142680 142609 142448 141506 140235 139837 140370 140752
54289A40752k23m30o99j355j410l92M74L89L96J241J795J263Q56J550K217J749
54273A48173J112J400J772J239O22Q84J295R94O27P14K75j127j983j307m80p53
54257A53457j004nJ117R03J18N0P4p82j600j198m73p61j404j132m67n75j044q93
54239A44381m74m81l94K30L97n73j487j271r08j477k029j377k96R6M25J400J909
54222A38071J012J05P33J826J580N29K66N43J64n12m14J6k37o72l41J56j46n26
54204A42153P7R16P65K61P52J959K788L332M106M502L989L575M130M663M158L525
54188A85651L745L750K311L36j002k525n010o785o145m484m084m439l772k664
54174A54883k871l761l327j858j307j729j516o13m35r61q65k24k96r15q13j52
$$ plain form
54289 140752 140529 140099 139400 138045 136635 136243 136717 137106 137502 138743 140538 141801 142657 144207 146424 148173
54273 148173 149285 150685 152457 153696 154318 155202 156497 157491 158118 158832 159107 157980 155997 154690 154210 153457
54257 153457 152453 152448 153565 154468 154586 154636 154710 153928 152328 151130 150657 149896 148492 147360 146893 146318 145274 144381
54239 144381 143907 143426 143032 143262 143659 143086 141599 140328 139420 137943 135914 134537 134241 134337 134762 136162 138071
54222 138071 139083 139188 139921 141747 143327 143856 144122 144665 144829 144317 143903 143919 143682 143010 142669 142825 142679 142153
54204 142153 142230 143146 143911 144172 144924 146883 149671 153003 157109 161611 165600 169175 173305 177968 182126 185651
54188 185651 189396 193146 195457 195793 194791 192266 187256 180471 174326 169842 165758 161319 157547 154883
54174 154883 152012 148251 144924 143066 141759 140030 138514 137901 137466 136505 135640 135416 135120 134205 133392 133240
54158A33240j52n71j81O28M02n87p03P3K01n53q17j19O38J111J725K077J355J25
54140A37892l35j78l59m42O78K308K676J818J360J594J244N1p37n74j73J60P52
54123A47735J126L71j047j698j274o12M4R97J645J063k54r09o70l07L6N95Q34
54106A47675K99m9P13J574J161K58M51J189P60n52r33j99K13J04O31J789K322
54089A57406K197K696L907M512M162L901M048L828L162K782K525J469k43j543
54075A94809k276l146m068m385m295m274l677j903k27k74j318j424o41m41p32
54060A61728j62R61R47j18l79O42J504J624J907K449K221J363J293K166K543J925
54044A82614J362J312J141R77J746L184L958L983M369N043M765L617L082L437
$$ plain form
54158 133240 133088 132517 132336 132964 133366 132779 132076 132149 132350 131797 130980 130861 131499 132610 134335 136412 137767 137892
54140 137892 137557 137379 137020 136578 137256 139564 142240 144058 145418 147012 148256 148307 147570 146996 146823 146983 147735
54123 147735 148861 149232 148185 146487 145213 144601 144645 145642 147287 148350 148096 147187 146517 146210 146246 146841 147675
54106 147675 147974 147925 148638 150212 151373 151631 152082 153271 154031 153479 152546 152347 152560 152664 153295 155084 157406
54089 157406 159603 162299 166206 170718 174880 178781 182829 186657 189819 192601 195126 196595 196352 194809
54075 194809 192533 189387 185319 180934 176639 172365 168688 166785 166558 166284 164966 163542 162901 162460 161728
54060 161728 161566 162527 163474 163356 162977 163619 165123 166747 168654 171103 173324 174687 175980 178146 180689 182614
54044 182614 183976 185288 186429 187406 189152 192336 196294 200277 204646 209689 214454 218071 221153 224590
54030B24590L454K896K831L230K719J141j0j54k76o92n35L4l96j991l147l120
54014B30574k970l344l517l161k991l097k696j984k152l107l300k236j159p09
54000A94151j54P17J007N46K34J11q19k375k997k266j573j761k069j880j619j460
53984A77793j066q12j308j762r04N41P02k30l28N72P04j26o6J208J668O09m7P14
53966A77862J224L59m21J37Q48M79n8K91P47M67L31J214K253K489K534L047L243
53949A97046K457J610J628J891J653J597K519L804M477M662M786M587L921L394
53935B40032L264K925K188J720J623J072L1k89M88J076O51K32R27K333L571M526
53919B66370N214N249M753M510M636M428L882L830M194L867K678J690J175L01
$$ plain form
54030 224590 228044 230940 233771 237001 239720 240861 240851 240697 240421 239729 239194 239228 238832 236841 233694 230574
54014 230574 227604 224260 220743 217582 214591 211494 208798 206814 204662 201555 198255 196019 194860 194151
54000 194151 193997 194714 195721 196267 196501 196612 195793 193418 190421 188155 186582 184821 182752 180872 179253 177793
53984 177793 176727 175915 174607 172845 171941 172482 173184 172954 172626 173198 173902 173776 173710 174918 176586 177195 177148 177862
53966 177862 179086 179445 179024 179161 180009 180488 180430 180721 181468 181935 182266 183480 185733 188222 190756 193803 197046
53949 197046 199503 201113 202741 204632 206285 207882 210401 214205 218682 223344 228130 232717 236638 240032
53935 240032 243296 246221 248409 250129 251752 252824 252855 252566 253054 254130 254781 255013 255940 258273 261844 266370
53919 266370 271584 276833 281586 286096 290732 295160 299042 302872 307066 310933 313611 315301 316476 316777
53905C16777q34j046m71p67k169k796j856j107j959l343l832l810m104m391m382
53890B79910m779n735o061n238m519m817n228m803m143l978l800l078k333j985
53876B19413j666j463k117l184l024j502n79j240k018j755j512k236k832k178
53862A92107j099o32k29O73J072J79r17j009o39p22q68o01n86j130j099J30J238
53845A85868J047M21N71J054J041R90J460J760J306Q40Q80N54n78j282p62j98
53829A94972n53o80N43J993K135J452J105P76j21o15L09J671K070K026K733L717
53813B13533L800L371L601M363M820N161N914O459O025N294N235N246M185K360
53799B79367R24J14m13m49J14M46K2l14N1J95o66j500j165m66p43j610j935j935
$$ plain form
53905 316777 315943 314897 314426 313659 311490 308694 306838 305731 303772 300429 296597 292787 288683 284292 279910
53890 279910 275131 269396 263335 258097 253578 248761 243533 238730 234587 230609 226809 223731 221398 219413
53876 219413 217747 216284 214167 210983 207959 206457 205878 204638 202620 200865 199353 197117 194285 192107
53862 192107 191008 190376 190147 190820 191892 192071 191154 190145 189506 188784 187916 187315 186729 185599 184500 184630 185868
53845 185868 186915 187336 187907 188961 190002 190992 192452 194212 195518 196358 197238 197792 197214 195932 195170 194972
53829 194972 194419 193739 194282 196275 198410 199862 200967 201743 201622 201007 201316 202987 205057 207083 209816 213533
53813 213533 217333 220704 224305 228668 233488 238649 244563 251022 257047 262341 267576 272822 277007 279367
53799 279367 280291 280405 279992 279543 279657 280103 280125 279811 279862 280057 279391 277891 276726 276260 275517 273907 271972 270037
53781B70037k378k827k516k044k341k884k678k087k031k234j982j697k062k503
53767B37773k224j760j936k290k132k020k528k664j371M48J256J162J146J076
53753B23936L94k82k13j68j043j857j239P1L40l27m18L06P41N12J78k43j057j670
53735B17961j287m32j33j86K12P93Q12O21R03J153O29K6M38J379J675J558J991
53718B28113K661K608K243K693L632L692K727J842J506J327J319J754K097J657
53704B59871P90J66n67j894k993k751j578n67K89J473K409K315J817J956K338
53689B63074K043J515J713K147J727Q31O51J093J229J126J350J364M18o54m92
53674B79135M94Q89O58Q40J415J476J034P51M22m33j041m41O12O98K4k09Mp7j19
$$ plain form
53781 270037 267659 264832 262316 260272 257931 255047 252369 250282 248251 246017 244035 242338 240276 237773
53767 237773 235549 233789 231853 229563 227431 225411 222883 220219 218848 219296 220552 221714 222860 223936
53753 223936 224330 224048 223835 223667 222624 220767 219528 219599 219939 219612 219194 219500 220241 220753 220931 220688 219631 217961
53735 217961 216674 216242 216109 215923 216135 216928 217740 218361 219264 220417 221046 221072 221510 222889 224564 226122 228113
53718 228113 230774 233382 235625 238318 241950 245642 248369 250211 251717 253044 254363 256117 258214 259871
53704 259871 260661 260827 260260 258366 255373 252622 251044 250477 250766 252239 254648 256963 258780 260736 263074
53689 263074 265117 266632 268345 270492 272219 273050 273701 274794 276023 277149 278499 279863 280281 279627 279135
53674 279135 279629 280518 281176 282016 283431 284907 285941 286692 287114 286681 285640 285199 285811 286509 286533 286324 286328 286251 286132
53655B86132M96Q36l12j997k247j078j04K59Q53J553J510J179J654K357J823M43
53639B93357o8L96M32n9J49R51R32Q7k3R27J584J473J588K064J766O23J20Q34
53621C07133J597J558J228J077R50J069J859K634K268J209R03J367J384R68J291
53606C28495K212K290J454J255K102K620K224K013K521K783K300J912J994J765
53592C57940R86O25J083J464J133M88j46q53j225p05L3j86j050j244q12r21j434
53575C55176j027J96N72l16j070j048j194j791j773q75k80m42l98J33J44n07m92
53558C45008O63J716J869J794J767R86m33q94K45J543J723J262Q88L84j96J1J029
53541C59365J571J085O32R39J288J201J473K542L523L726L680L856L920L939M663
$$ plain form
53655 286132 286628 287464 287152 285155 282908 281830 281726 281985 282838 284391 285901 287080 288734 291091 292914 293357
53639 293357 293289 293685 294117 294058 294207 295158 296090 296177 296154 297081 298665 300138 301726 303790 305556 306179 306299 307133
53621 307133 308730 310288 311516 312593 313543 314612 316471 319105 321373 322582 323485 324852 326236 327204 328495
53606 328495 330707 332997 334451 335706 337808 340428 342652 344665 347186 349969 352269 354181 356175 357940
53592 357940 358926 359551 360634 362098 363231 363719 363573 362720 361495 360790 360823 360637 359587 358343 357531 356610 355176
53575 355176 354149 354345 354917 354601 353531 352483 351289 349498 347725 346850 346570 346128 345730 345863 346007 345500 345008
53558 345008 345671 347387 349256 351050 352817 353803 353370 352476 352721 354264 355987 357249 358137 358521 358325 358336 359365
53541 359365 360936 362021 362653 363592 364880 366081 367554 370096 373619 377345 381025 384881 388801 392740 397403
53526C97403N917O395N818N569O434P435P747P946Q481Q599P837P039O900O926
53512D96446O746O949P857Q881R785J1079J2552J3078J2587J2500J3496J4533
53500F26489J4868J5262J6251J7009J6958J6840J7211J7401J6968J6693J7043
53489H08993J7211J6603J5893J5676J5466J4982J4848J5191J4955J3626J2236
53478I75680J1759J1852J1964J2329J3047J3540J3570J3560J3348J2184J0382
53467A113215R271Q954P981N864L906K780J313j258l860n525o896q567r721r736
53453A107721r479r747r982r733r751j0536j1329j1696j2467j3948j4866j4357
53441I69830j3393j3025j2813j2175j1699j1777j1536j0367r039q060o614m328
$$ plain form
53526 397403 403320 409715 415533 421102 427536 434971 442718 450664 459145 467744 475581 482620 489520 496446
53512 496446 503192 510141 517998 526879 536664 547743 560295 573373 585960 598460 611956 626489
53500 626489 641357 656619 672870 689879 706837 723677 740888 758289 775257 791950 808993
53489 808993 826204 842807 858700 874376 889842 904824 919672 934863 949818 963444 975680
53478 975680 987439 999291 1011255 1023584 1036631 1050171 1063741 1077301 1090649 1102833 1113215
53467 1113215 1122486 1131440 1139421 1145285 1149191 1151971 1153284 1152026 1148166 1142641 1135745 1127178 1117457 1107721
53453 1107721 1098242 1088495 1078513 1068780 1059029 1048493 1037164 1025468 1013001 999053 984187 969830
53441 969830 956437 943412 930599 918424 906725 894948 883412 873045 864006 855946 849332 845004
53429H45004k397j604r54L12J109M87m53l06N17J109J961L689N231N323M681M898
53413H68607O072P209Q123R311J0680J1851J3107J4757J6328J7374J8269J9279
53401A020967J9902K0024K0569K2006K3549K4739K6387K8819L0805L1564L2267
53390A301598L4053L6054L6961L7194L7850L8716L8992L8982L9413M0013M0134
53379A719960L9907L9468L8165L5772L3383L1830L0419K8393K6315K4706K2759
53368B071077J9944J7382J6023J4732J1904P743L330j397o920j2634j7693k2433
53356B101058k7314l1495l4037l5474l6668l7317l7089l6956l7667l8187l7401
53345A711453l6092l5337l4377l2111k9579k8629k9064k9326k9188k9530l0091
$$ plain form
53429 845004 842607 841003 840049 840361 841470 841957 841504 841198 841715 842824 844785 848474 853705 859028 863709 868607
53413 868607 874679 881888 890011 899322 910002 921853 934960 949717 966045 983419 1001688 1020967
53401 1020967 1040869 1060893 1081462 1103468 1127017 1151756 1178143 1206962 1237767 1269331 1301598
53390 1301598 1335651 1371705 1408666 1445860 1483710 1522426 1561418 1600400 1639813 1679826 1719960
53379 1719960 1759867 1799335 1837500 1873272 1906655 1938485 1968904 1997297 2023612 2048318 2071077
53368 2071077 2091021 2108403 2124426 2139158 2151062 2158805 2162135 2160738 2153818 2141184 2123491 2101058
53356 2101058 2073744 2042249 2008212 1972738 1936070 1898753 1861664 1824708 1787041 1748854 1711453
53345 1711453 1675361 1640024 1605647 1573536 1543957 1515328 1486264 1456938 1427750 1398220 1368129
53334A368129k9660k8163k6576k5131k3419k1846k1152k0857j9826j8059j6353
53323A117087j4757j2901j1288j0646j0532j0132r869j0633j2020j2892j3052
53312I88365j2910j2207j0749r564r609r959r056p086n420m341l168j986j366
53299H90944q60L75J907K731L224M539O500P912Q650R611J0867J1721J2400J3932
53285I84453J6306J8274J9023J8732J7674J6115J4871J4660J5068J5229J5089
53274A165494J4943J4350J2801J0736Q656O061K656l48j770k436l903n987p462
53261A213791q429j0007j2247j4245j5926j7836j9592k0336k0383k0663k1024
53250A033103k0847k0760k1671k2682k2072k0100j8656j8355j8038j7142j6409
$$ plain form
53334 1368129 1338469 1310306 1283730 1258599 1235180 1213334 1192182 1171325 1151499 1133440 1117087
53323 1117087 1102330 1089429 1078141 1067495 1056963 1046831 1036962 1026329 1014309 1001417 988365
53312 988365 975455 963248 952499 942935 933326 923367 914311 907225 901805 897464 894296 892310 890944
53299 890944 890084 890459 892366 895097 898321 902860 909360 917272 925922 935533 946400 958121 970521 984453
53285 984453 1000759 1019033 1038056 1056788 1074462 1090577 1105448 1120108 1135176 1150405 1165494
53274 1165494 1180437 1194787 1207588 1218324 1226980 1233041 1235697 1235349 1233579 1231143 1227240 1221253 1213791
53261 1213791 1205362 1195355 1183108 1168863 1152937 1135101 1115509 1095173 1074790 1054127 1033103
53250 1033103 1012256 991496 969825 947143 925071 904971 886315 867960 849922 832780 816371
53239H16371j6195j6016j5947j6624j7671j7864j7068j6359j6110j5621j4712
53228F36184j4096j3910j3383j2226j0966r805q435p032o132n624m983m410m497
53215E20685n136n966p397r742j1853j2295j1460j0915j0994j0871j0528j0735
53203D02793j1193j0635q906p247o409o034n888o137o413o120n601n639n953n674
53189C04944n040n008n466n439m877m569m576m319l996m171m256l199j497o93
53175B47838j013j281j068j071j444j530j252j145j118p27m12q43j412j128n41
53160B31853r02j839j979j326r24o14M52J435O55j300k020r75n1j67j32N81P44
53143B23491r4n01L32J248J303J216J588J691J088O58R63J271J069R58J218J115
$$ plain form
53239 816371 800176 784160 768213 751589 733918 716054 698986 682627 666517 650896 636184
53228 636184 622088 608178 594795 582569 571603 561798 553363 546331 540199 534575 529592 525182 520685
53215 520685 515549 509583 502186 492444 480591 468296 456836 445921 434927 424056 413528 402793
53203 402793 391600 380965 372059 364812 358403 352369 346481 340344 333931 327811 322210 316571 310618 304944
53189 304944 299904 294896 289430 283991 279114 274545 269969 265650 261654 257483 253227 250028 248531 247838
53175 247838 246825 245544 244476 243405 241961 240431 239179 238034 236916 236189 235777 234934 233522 232394 231853
53160 231853 230951 229112 227133 225807 224883 224269 224721 226156 226811 225511 223491 222516 222465 222298 222166 222747 223491
53143 223491 223397 222896 223228 224476 225779 226995 228583 230274 231362 232020 232983 234254 235323 236281 237499 238614
53127B38614M57K53R45J533J274Q17R01J284J614K005K186J504J82p42j102j664
53111B50061k383k289j446j188j947k630k629k595k656j937n24L5q96j973k007
53096B22996j534j374j285r69q38r49o26J13K74l38o29j16L04J21M4L96M28p1
53078B15947j90L03L53m07q74n51m76j136j388o07o1p80j724j545o96l14l00J1
53060B05565L87K38j75k55j3L02P79J324J428R87M59n4p87j236n48P34J041K49
53042B10425k6Q85J634J225M89K42j24j069j654j142l41k03m40m91n02m30L35
53025B08813J558J918J053K66M06P07N76O42J081Q47k09m89P88K048J910J327
53009B23242J647K345K467K576L356L883L225K419K817L615L091J272n09j768
$$ plain form
53127 238614 239071 239324 240269 241802 243076 243893 244794 246078 247692 249697 251883 253387 253569 252827 251725 250061
53111 250061 247678 245389 243943 242755 240808 238178 235549 232954 230298 228361 227837 227872 226976 225003 222996
53096 222996 221462 220088 218803 217834 216996 216047 215421 215534 215808 215470 214841 214725 215029 215150 215194 215590 216018 215947
53078 215947 215757 216060 216413 216006 215132 214581 214105 212969 211581 210974 210913 210133 208409 206864 206168 205854 205554 205565
53060 205565 205952 206190 206015 205760 205747 206049 206828 208152 209580 210567 211026 210972 210185 208949 208401 209135 210176 210425
53042 210425 210399 211284 212918 214143 214632 214874 214750 213681 212027 210885 210544 210341 209901 209410 208908 208478 208813
53025 208813 210371 212289 213342 213608 214014 214721 215297 215939 217020 217867 217658 217169 217957 220005 221915 223242
53009 223242 224889 227234 229701 232277 235633 239516 242741 245160 247977 251592 254683 255955 255446 253678
52995B53678k834l390k902j880j208p73o9N33M60J07J65M48N75Q39J369J406N91
52978B47115n1L61J129J299J228J528J657J024L78N05O22l01j556j762j067o54
52962B51455p35o65m52o17j042j296j604k193k422j756r43r34j325j176o11l44
52946B33340l28j77k29q67j447j205n46k45j11L58Q20Q49R56J529J659M79j091
52929B33744j514q77m21m61k96K28O27R01J360J697J359N55k08r85j831k013j092
52912B30773p9j75r15r70k45J70j42m94l24K14P46R70P58N73J215K520L162K445
52894B40202J340R01P78L74K92J260K586L120K911K642K238J408P31P77R00K67
52878B62727o35q93p94j185j854j985j604j271r71n62n98j368j980j643j108j388
$$ plain form
52995 253678 250844 247454 244552 242672 241464 240691 240622 241155 241615 241722 241887 242335 242910 243749 245118 246524 247115
52978 247115 247064 247425 248554 249853 251081 252609 254266 255290 255668 256173 256795 256494 254938 253176 252109 251455
52962 251455 250720 250055 249603 248986 247944 246648 245044 242851 240429 238673 237730 236796 235471 234295 233684 233340
52946 233340 233012 232835 232606 231739 230292 229087 228541 228296 228185 228543 229363 230212 231168 232697 234356 234835 233744
52929 233744 232230 231353 230932 230471 230175 230403 231030 231931 233291 234988 236347 236902 236694 235709 233878 231865 230773
52912 230773 230694 230519 229604 228634 228389 228559 228417 227923 227599 227813 228559 229529 230287 230860 232075 234595 237757 240202
52894 240202 241542 242443 243221 243595 243887 245147 247733 250853 253764 256406 258644 260052 260783 261560 262460 262727
52878 262727 262092 261199 260405 259220 257366 255381 253777 252506 251535 250973 250375 249007 247027 245384 244276 242888
52862B42888j992j966j732k212k861k478j442j234k096k811k678k108j500r02
52848B14876o08q30r77m71J90K04j73k04QlqL26M87N0l02J1J80n20j058j57J361
52827B12382J732J055Q84J502J692J052N46O76P97M03k75r93j672k050k125k510
52811B13096l266l177j495M18P02m28j283j138m98L24J180J374O65K67J103J935
52795B09779J204k22l62N85P99J70K98J344J623O02k37p4N9n69j107p95j80J05
52777B13022L04O66Q78Q52Q80Q60M78J83O47J392J309M38k37n08q88j060k64R21
52759B19873J029J09k68M69J177J103R12J118J202Q11N07P08J119J476J761J636
52743B34742Q37P2K15Q29Q31L90N12J013P66j76n58n5L67L71N71R23O54J05N39
$$ plain form
52862 242888 240896 238930 237198 234986 232125 229647 228205 226971 224875 222064 219386 217278 215778 214876
52848 214876 214268 213438 212461 211990 212180 212384 212211 212007 212015 212012 212004 212330 212817 212867 212565 212576 212756 212236 211178 211021 212382
52827 212382 214114 215169 216053 217555 219247 220299 220845 221521 222318 222721 222446 221453 219781 217731 215606 213096
52811 213096 209830 206653 205158 205576 206278 205850 204567 203429 202931 203255 204435 205809 206474 206741 207844 209779
52795 209779 210983 210761 210399 210984 211783 211953 212251 213595 215218 215820 215583 215509 215568 214999 213892 213097 212917 213022
52777 213022 213326 213992 214870 215722 216602 217462 217940 218123 218770 220162 221471 221909 221672 221164 220276 219216 218952 219873
52759 219873 220902 221011 220743 221212 222389 223492 224404 225522 226724 227535 228042 228750 229869 231345 233106 234742
52743 234742 235579 235651 235866 236695 237526 237916 238428 239441 240207 240031 239473 239418 239785 240156 240727 241650 242304 242409 242948
52724B42948J860K405J529N04L08L85J50m6j56r10k252k846j989o56Onl01q25
52706B40109j296j141n34l40p50j078j135j380j688j375o59n52j115j322q98o36
52690B24210p04l31M74P22K59P3L25k8j170j829j395q58q33m82O19J316O40n67
52672B20441r33l50L78P44O54K70J61P10J238Q62J34L47J216J119j61r51m19K32
52654B25692Q5m7O00J317J380J258J321R28j09o05K32J452J860J616J363J001
52638B39344L97J09M17O43L27nL3n6n12o35j01L26J26j46j06l49j108j471q96
52619B36337k53l74o67k64N26R82J200J613K071K235K203K018J381M16j43J9M43
52602B49743Q73J517K012J439j10j303j432j238j433j671j602j551j576j108j11
$$ plain form
52724 242948 244808 247213 248742 249246 249554 249939 250089 250043 249887 248977 246725 243879 241890 241234 241240 241235 240934 240109
52706 240109 238813 237672 237138 236798 236048 234970 233835 232455 230767 229392 228733 228181 227066 225744 224846 224210
52690 224210 223506 223175 223649 224371 224630 224703 225028 225000 223830 222001 220606 219748 218915 218433 219052 220368 221008 220441
52672 220441 219508 219158 219536 220280 220934 221204 221365 222075 223313 224175 224309 224656 225872 226991 226830 225879 225460 225692
52654 225692 225777 225730 226330 227647 229027 230285 231606 232534 232425 231820 232052 233504 235364 236980 238343 239344
52638 239344 239741 239850 240267 240910 241237 241232 241265 241209 240697 240062 239961 240287 240413 240267 240161 239812 238704 237233 236337
52619 236337 236084 235710 235043 234779 235305 236287 237487 239100 241171 243406 245609 247627 249008 249424 249281 249300 249743
52602 249743 250616 252133 254145 255584 255474 254171 252739 251501 250068 248397 246795 245244 243668 242560 242449
52587B42449N93O48N33L85j75p66n16J53j74j379j687n97K44j12m94k5L35nJ47
52568B39557J407K131R99o08p93q1j29r37j370j351j479j386m34P33J051Q11R48
52551B39069J224P44l18r46q52n71l56o6L01P59J488K251K427K139K271K813K592
52534B54969J339M99J005J835J913J768K098K236J613J214J980L015L029K332
52520B80845J907J716J465J755K772L168K072R37J464K803K927J804J059J191
52506C07885J317J153J219J381R95J81o10j765l687n336n350m158l315l129k736
52491B84045k086k033k563k713k255j959k057j902j249o71n25n54n16m27j97K36
52475B62574O83J139J947K917L098K128R22K69k46j015j324o96j04n12j237j232
$$ plain form
52587 242449 243042 243690 244223 244608 244433 243667 243151 243304 243130 241751 240064 239467 239711 239599 239105 239080 239415 239410 239557
52568 239557 240964 243095 244094 243486 242693 242612 242483 241546 240176 238825 237346 235960 235526 236259 237310 238121 239069
52551 239069 240293 241037 240719 239773 238921 238350 237994 237928 238229 238988 240476 242727 245154 247293 249564 252377 254969
52534 254969 256308 256807 257812 259647 261560 263328 265426 267662 269275 270489 272469 275484 278513 280845
52520 280845 282752 284468 285933 287688 290460 293628 295700 296637 298101 300904 303831 305635 306694 307885
52506 307885 309202 310355 311574 312955 313950 314131 313521 311756 308069 302733 297383 293225 289910 286781 284045
52491 284045 281959 279926 277363 274650 272395 270436 268379 266477 265228 264557 264032 263478 262962 262535 262338 262574
52475 262574 263257 264396 266343 269260 272358 274486 275408 275677 275431 274416 273092 272396 272292 271780 270543 269311
52459B69311r12j158j513j103m33n45j111j146q06p66n20P69K304K552J625R08
52443B67456P11K68k19M35K270L832M163L649K880K084J707K125K765K703K051
52428B98880J566J194L48o88j097j030j315j849j735r15k79j15J78Q64J548K051
52412B97606K515K671K130J216N64J37m56r90j071r76j087j050n75l92j128j972
52396B97142j823j118j029j507j674j558j812k191j947j341j152j176p13j2L56
52381B78445R69K509L917L534J723L99K77N47Q83J580J935Q13j068j650o07K01
52365B94407k90r89q40l72l36l92k3N66J033J326J275P92N24J066J732J471P78
52348C01728J055K214K743K179J619J614J514J215J639K928L904L928L746L978
$$ plain form
52459 269311 268399 267241 265728 264625 264192 263647 262536 261390 260584 259818 259298 260067 262371 264923 266548 267456
52443 267456 268167 268435 268216 268651 270921 274753 278916 282565 285445 287529 289236 291361 294126 296829 298880
52428 298880 300446 301640 301988 301300 300203 299173 297858 296009 294274 293359 293080 292965 293143 294007 295555 297606
52412 297606 300121 302792 304922 306138 306702 306839 306383 305393 304322 303346 302259 301209 300634 300242 299114 297142
52396 297142 295319 294201 293172 291665 289991 288433 286621 284430 282483 281142 279990 278814 278101 278089 278445
52381 278445 279414 281923 285840 289374 291097 291496 291773 292320 293203 294783 296718 297531 296463 294813 294206 294407
52365 294407 294117 293128 292288 291916 291580 291188 291165 291731 292764 294090 295365 296157 296681 297747 299479 300950 301728
52348 301728 302783 304997 307740 309919 311538 313152 314666 315881 317520 320448 324352 328280 332026 336004
52334C36004M270M427M867N535N772N663N993O583O316N270M996O065P130P182
52320D16073P070P806Q902R462R683J0175J0853J1408J2077J3064J4065J4932
52308E45570J6004J7239J7891J7597J6961J6585J6360J6014J5596J5039J4038
52297G24894J2621J1147R720Q342P426P143O592M908K913K247K951L553L377L017
52283H10851K549J240o06j531j228j096j838k379k015j810k717l908m192l741
52269G87579l210k306n32J623L340M628N896P059P909Q729R844J1105J2195J2891
52255H66750J2832J1889J0907J0969J1719J1616J0187Q664P960P415O174M555
52243I81637L198K087J133O97O94L13p29j621j847k100l041m224m998n541o159
$$ plain form
52334 336004 340274 344701 349568 355103 360875 366538 372531 379114 385430 390700 395696 401761 408891 416073
52320 416073 423143 430949 439851 449313 458996 469171 480024 491432 503509 516573 530638 545570
52308 545570 561574 578813 596704 614301 631262 647847 664207 680221 695817 710856 724894
52297 724894 737515 748662 758382 766724 774150 781293 787885 792793 795706 797953 800904 804457 807834 810851
52283 810851 813400 814640 814034 812503 811275 810179 808341 805962 803947 802137 799420 795512 791320 787579
52269 787579 784369 782063 781531 783154 786494 791122 797018 804077 811986 820715 830559 841664 853859 866750
52255 866750 879582 891471 902378 913347 925066 936682 946869 955533 963493 970908 977082 981637
52243 981637 984835 986922 988055 988752 989446 989759 989030 987409 985562 983462 980421 976197 971199 965658 959499
52228I59499o544o507o624p247p666p075n821m869m565m515m244l509k409j454
52214H86450j056p99P8J490K631L256L833M419M527M241M217M287L482J731K26
52199I23013m06r28j928k766k832k608k682k720k249j556j179j183j400j609j283
52184H95684j27R36N09j258k651k679k036j509j012o45j101k180k531j722j081
52169H76597j442j646n26R71J084k75j759k568k918l035k819k263j467n94j01
52154H57239m27j172j418j167j436k526l390l255k698k471k402k166k052k191
52140H28468k042j342o41k76J60P94J083R34J038J425J114o9p13J88J797K947
52124H34865L888N433P518R631J1673J3367J3875J3002J1808J1195J0867J0409
$$ plain form
52228 959499 952955 946448 939824 932577 924911 917836 912015 907146 902581 898066 893822 890313 887904 886450
52214 886450 885394 884595 884673 886163 888794 892050 895883 900302 904829 909070 913287 917574 921056 922787 923013
52199 923013 922607 921679 919751 916985 914153 911545 908863 906143 903894 902338 901159 899976 898576 896967 895684
52184 895684 895557 896493 897002 895744 893093 890414 888378 886869 885857 885212 884111 881931 879400 877678 876597
52169 876597 875155 873509 872983 873954 875038 874763 873004 870436 867518 864483 861664 859401 857934 857340 857239
52154 857239 856812 855640 854222 853055 851619 849093 845703 842448 839750 837279 834877 832711 830659 828468
52140 828468 826426 825084 824443 824167 824327 825121 826204 827138 828176 829601 830715 830646 829933 830121 831918 834865
52124 834865 838753 844186 851704 861335 873008 886375 900250 913252 925060 936255 947122 957531
52112I57531J0215J0399J0181R372R199J0471J2130J2869J3009J3487J4077J4046
52100A096986J3560J3050J2123J0469Q977Q511Q324P168N305L920L113J924Rk045
52086A191394l865n574p111q200q821r095q947q414p746o825n268l474k590k810
52072A102654k818j655p5P29O74K70j96j48J280L695N218M932M293M857O047O549
52056A136306O602P095P571P016N817N162N066M702M144M129M464M251L389K488
52042A208202J580J63j734l696n732p896r685j0769j1740j3023j3837j3392j2395
52029A106046j2064j2353j2503j2593j3160j3827j3779j3143j2631j2267j1721
52018I66005j1260j1132j0663r329q044p974q704r073r179r861j0770j0766j0004
$$ plain form
52112 957531 967746 978145 988326 997698 1006897 1017368 1029498 1042367 1055376 1068863 1082940 1096986
52100 1096986 1110546 1123596 1135719 1146188 1155165 1163676 1172000 1179168 1184473 1188393 1191506 1193430 1193439 1191394
52086 1191394 1187529 1181955 1174844 1166644 1157823 1148728 1139781 1131367 1123621 1116796 1111528 1108054 1105464 1102654
52072 1102654 1099836 1098181 1098106 1098835 1099509 1099779 1099583 1099435 1100715 1104410 1109628 1114560 1118853 1123710 1129757 1136306
52056 1136306 1142908 1150003 1157574 1164590 1170407 1175569 1180635 1185337 1189481 1193610 1198074 1202325 1205714 1208202
52042 1208202 1209782 1209945 1208211 1204515 1198783 1190887 1181202 1170433 1158693 1145670 1131833 1118441 1106046
52029 1106046 1093982 1081629 1069126 1056533 1043373 1029546 1015767 1002624 989993 977726 966005
52018 966005 954745 943613 932950 923621 915577 907603 898899 889826 880647 870786 860016 849250 839246
52005H39246r896j1026j2616j3980j5189j6220j6754j6885j6994j7029j6817j6783
51993F59057j7363j8004j7772j6588j4969j3051j0872q957p497n622k707K98K205
51980E28158L460N237P263Q297Q294Q519R732J1821J4982J9693K5635L1882L7755
51967G20728M2067M2052L5013K1197L824j3574k8624l9540m5234m6331m4705m1651
51955F05222l7488l2697k8151k4127k0308j6752j3867j1613r724q375p605o604
51943C87911m792l077k712l380l827l781l744l498k563j671j902k631k257p31
51929C47345M98Q59J089J352R86K40K82J165J654J326J030R54J56j543l053l919
51913C50421m975o508p487p396p084p049o441m804l276k951l193k756j603o19
$$ plain form
52005 839246 829350 818324 805708 791728 776539 760319 743565 726680 709686 692657 675840 659057
51993 659057 641694 623690 605918 589330 574361 561310 550438 541481 533984 528362 525655 525953 528158
51980 528158 531618 536855 544118 552415 560709 569228 578960 590781 605763 625456 651091 682973 720728
51967 720728 762795 804847 839860 861057 864881 851307 822683 783143 737909 691578 646873 605222
51955 605222 567734 535037 506886 482759 462451 445699 431832 420219 410495 402120 394515 387911
51943 387911 383119 380042 377330 373950 370123 366342 362598 359100 356537 354866 352964 350333 348076 347345
51929 347345 347843 348702 349791 351143 352129 352369 352651 353816 355470 356796 357826 358780 358936 357393 354340 350421
51913 350421 345446 338938 331451 324055 316971 309922 303481 298677 295401 292450 289257 286501 284898 284279
51899B84279k30k26l59l19M27K110M262O160P401P942Q020Q067Q131P598O076
51884C49339M308L474L769M466N053N408N227M389L525L154K573Q97j224k308
51870C92050k246k305l101m089m996o167p362p807p604p626p894p579o740o461
51856C10073o937p043o225n257m677l959k868k117k019j772p94L20Q44Q61O47
51841B69077J58l45j35R02J938K314K211J989J690J383J137N82n60j539j298j11
51825B79393O73N26J16j55n66r49o79R7N71P59J459K539K899K345J912J979J777
51808B94696J122R02J254J086J14l36M66J280Q35k72p20l78L1J96J37k15n23L0
51790B99705J530K892L250L020K930K907K546J880J107K43n58j003j231j643k105
$$ plain form
51899 284279 284049 283823 283464 283145 283572 285682 289944 296104 303505 311447 319467 327534 335665 343263 349339
51884 349339 353647 357121 360890 365356 370409 375817 381044 385433 388958 392112 394685 395582 394358 392050
51870 392050 389804 387499 384398 380309 375313 369146 361784 353977 346373 338747 330853 323274 316534 310073
51856 310073 303136 296093 289868 284611 279934 275975 273107 270990 268971 267199 266405 266725 267569 268430 269077
51841 269077 269235 268890 268755 269657 271595 273909 276120 278109 279799 281182 282319 282901 282341 280802 279504 279393
51825 279393 280066 280592 280708 280553 279987 279038 278359 278456 279027 279786 281245 283784 286683 289028 290940 292919 294696
51808 294696 295818 296720 297974 299060 299174 298838 299304 300584 301419 301147 300427 300049 300080 300276 300413 300198 299675 299705
51790 299705 301235 304127 307377 310397 313327 316234 318780 320660 321767 322010 321452 320449 319218 317575 315470
51775C15470k143j915j889j746r23m1k26j057j036j82j26j157j452l2J541J578
51759C04664N51k24n86r68j200j172j433k080k226j574j221j900k741k889k856
51744B82145l096k650p04J652K773K561J929J145R6o24m13K04M04M53J078K127
51728B89080K842K929K418J172m36j191m44P81J175Q96R31J356J388P23j92q93
51712C02535j127q54n90j141k382l045k402j236m95M7Q20J213M79q49j600j472
51696B87901r40k90K91K22p58j809j818p93L44J035J480K093L081M271N053M966
51680C04329M516M708N677O617P268Q313R951J1328J1865J1963J1810J0698Q225
51667D17268M936J174l397q339j1899j2897j2087j0756r213p498o267n854n603
$$ plain form
51775 315470 313327 311412 309523 307777 306854 306813 306587 305530 304494 304312 304186 303029 301577 301545 303086 304664
51759 304664 305215 304991 304405 303437 302237 301065 299632 297552 295326 293752 292531 290631 287890 285001 282145
51744 282145 279049 276399 275695 277347 280120 282681 284610 285755 285851 285227 284814 285018 285422 285875 286953 289080
51728 289080 291922 294851 297269 298441 298005 296814 296370 297151 298326 299222 300153 301509 302897 303620 303428 302535
51712 302535 301408 300554 299964 298823 296441 293396 290994 289758 289263 289310 290130 291343 291822 290973 289373 287901
51696 287901 286961 286671 286962 287184 286426 284617 282799 282006 282350 283385 284865 286958 290039 294310 299363 304329
51680 304329 308845 313553 319230 325847 333115 341428 351379 362707 374572 386535 398345 409043 417268
51667 417268 422204 423378 419981 411642 399743 386846 374759 364003 354790 347292 341025 335171 329568
51654C29568n135n115n857o438o209n879n989n796m803l942l880l697k722k115
51640B61991k861l611k589m09R85J262J458J651J115K03%M22N39M39R21J601J278
51623B64395N3o71l02L39N71M94J93l43n73K5R23J312J508K322L411L778L676
51606B81111M353O034P639Q455Q628Q064O307L655J055j181l311m866m928l766
51592C17249k743k329j611q0J453K177K465L112M313N858P582R239J0470J1288
51578C68443J2093J3090J4132J5169J6399J7913J9550K0937K1347J9795J5792
51567E54660R823K865m126j0100j4048j5901j6588j6686j5819j3933j2120j1228
51555D36799j0646r551q420q095q176p750p008o709o586n784m500l689l457l047
$$ plain form
51654 329568 324433 319318 313461 307023 300814 294935 288946 283150 278347 274405 270525 266828 264106 261991
51640 261991 259130 255519 252930 252521 253506 254768 256226 257877 258992 259195 259195 259617 260156 260595 261516 263117 264395
51623 264395 264448 263777 263475 263814 264385 264879 265072 264729 264156 264181 265104 266416 267924 270246 273657 277435 281111
51606 281111 285464 291498 299137 307592 316220 324284 330591 334246 335301 334120 330809 325943 321015 317249
51592 317249 314506 312177 310566 310486 311939 314116 316581 319693 324006 329864 337446 346685 357155 368443
51578 368443 380536 393626 407758 422927 439326 457239 476789 497726 519073 538868 554660
51567 554660 564483 567348 563222 553122 539074 523173 506585 489899 474080 460147 448027 436799
51555 436799 426153 416602 408182 400087 391911 384161 377153 370444 363858 358074 353574 349885 346428 343381
51541C43381k309j857j906k065k174k258j966j079k91l88j004j248j206j624k416
51526C19590k770k527k297k373k544k758k994k810j984j195j119j355j234j030
51512B90600j226j324p31J1K27N43J716K780K275O96k53l52p34j338q34Q01J873
51495B94730J512O61J30m69j229j266k99N84N82K87N11J177J949K938M077M852
51479C10727N078N076M857M106L217L269M681O752Q676R977R916P745L841m37
51465C87481m250p618j0290j1548j1377j0607r620q109o281n005m453l799k716
51452B91808j945j935k025j511n68L97J319K076K316K112J948J866J418O89L19
51437B98284L41m0j118k131k366k065j788j628j310n98N73J834K388J863Q42k7
$$ plain form
51541 343381 341072 339215 337309 335244 333070 330812 328846 327767 327476 327088 326084 324836 323630 322006 319590
51526 319590 316820 314293 311996 309623 307079 304321 301327 298517 296533 295338 294219 292864 291630 290600
51512 290600 289374 288050 287319 287330 287557 288100 289816 292596 294871 295567 295314 294962 294228 292890 292056 292857 294730
51495 294730 296242 296903 297033 296564 295335 294069 293770 294354 294936 295223 295734 296911 298860 301798 305875 310727
51479 310727 315805 320881 325738 329844 333061 336330 341011 347763 356439 366416 376332 384077 387918 387481
51465 387481 383231 375613 365323 353775 342398 331791 322171 314062 307781 302776 298323 294524 291808
51452 291808 289863 287928 285903 284392 283824 284221 285540 287616 289932 292044 293992 295858 297276 297965 298284
51437 298284 298625 298585 297467 295336 292970 290905 289117 287489 286179 285581 286154 287988 290376 292239 293081 293054
51421B93054r65k218l001k507j481j299j839j810r58l00k33j21J41j49r46j188
51405B74180n25K20O01J170K139K850L058L319L711L523K763K580L606N055O025
51390C14275O631P298Q003Q626R083Q875P632O193N868O465O379M885K841R26
51376D03980j172l395m839n316n862o979p800p753p616q102q739q951r003r063
51362C09390q533p140n582m375l204k033j599k035k309j827j302j256r47J51J142
51347B68541J089N43N55J060J352J390J571J813J782J480R95K75l74m07q1l46
51331B81238j239j510m97Q93J732K381L338M037L876L385L220K936J901N96j34
51316C06153m90j262k458l462m066m490m705m537m151l824l506l052k520k018
$$ plain form
51421 293054 292089 289871 286870 284363 282882 281583 279744 277934 276976 276676 276443 276322 276463 276314 275368 274180
51405 274180 273655 273875 274476 275646 277785 280635 283693 287012 290723 294246 297009 299589 303195 308250 314275
51390 314275 320906 328204 336207 344833 353916 362791 370423 376616 382484 388949 395328 400213 403054 403980
51376 403980 402808 399413 394574 389258 383396 376417 368617 360864 353248 345146 336407 327456 318453 309390
51362 309390 300857 293717 288135 283760 280556 278523 276924 274889 272580 270753 269451 268195 267248 267399 268541
51347 268541 269630 270173 270728 271788 273140 274530 276101 277914 279696 281176 282171 282446 282072 281665 281584 281238
51331 281238 279999 278489 277992 278885 280617 282998 286336 290373 294249 297634 300854 303790 305691 306287 306153
51316 306153 305663 304401 301943 298481 294415 289925 285220 280683 276532 272708 269202 266150 263630 261612
51302B61612j590j369j237n22J110K613K676J791J743K891L738L586L705N039
51288B85786O604P241P330P408O700M520J909L01m87j426k349k380j637j048q56
51273C17616n54J09R75J860K287J443p00k897m075m481m688m436l504k659k574
51258B93722k663k117j315j036j048p38l86n04n50K89J577K200K039J836J800
51243B93106J548J154J035J000M87m08j074j360j486j317o04K51N81M84P17J693
51227B95807L135M495N244N055M130K982J645j97k062k705j863r41j134j843j892
51212C09856j328r65r51r74j180j751k095j580o59l20q02j577k107k017j204l32
51196B90014l92j095r00O19J774J261K49M69J484J658R03M10L18l09j460k036
$$ plain form
51302 261612 260022 258653 257416 256894 258004 260617 263293 265084 266827 269718 273456 277042 280747 285786
51288 285786 292390 299631 306961 314369 321069 325589 327498 327799 327312 325886 323537 321157 319520 318472 317616
51273 317616 317062 317171 318146 320006 322293 323736 323036 320139 316064 311583 306895 302459 298955 296296 293722
51258 293722 291059 288942 287627 286591 285543 284805 284419 283915 283365 283654 285231 287431 289470 291306 293106
51243 293106 294654 295808 296843 297843 298330 297922 296848 295488 294002 292685 292081 292332 292913 293397 294114 295807
51227 295807 298942 303437 308681 313736 317866 320848 322493 322296 320234 317529 315666 314725 313591 311748 309856
51212 309856 308528 307563 306612 305638 304458 302707 300612 299032 298373 298053 297251 295674 293567 291550 290346 290014
51196 290014 289622 288527 287627 288246 290020 291281 291530 291999 293483 295141 296044 296454 296772 296463 295003 292967
51180B92967j763j525j754j896j653j316q66PQ42O97l43j155j136p80n22j82K72
51163B79894M39K76K43M48M25Pl17j40L64Q30J100J129R40O53L39l7l74m40l92
51144B85387o53j054p63L11J048O44j43k04L08N29L73L39M27L27K59N53P81L95
51126B88864k28l36l9L3m2L15J011J360J226J117J282J462J431J170P65O06J172
51109C01169K150K449J724J006J080J227O24o8K22J170J750K047K827L937M577
51094C27891M834N521O672P564P993Q382Q801Q979Q970Q861Q232O925N700N059
51080D30384M121J981n52k081k818m013n708o818p111p306p382o580n052l884
51066C77181l392k873k106j574j179k22J149J910J724J263R69P84J115K538M421
$$ plain form
51180 292967 291204 289679 287925 286029 284376 283060 282194 282201 283043 283740 283397 282242 281106 280326 279804 279622 279894
51163 279894 280333 280609 280852 281300 281725 281732 281415 281275 281639 282469 283569 284698 285638 286291 286630 286593 286219 285779 285387
51144 285387 284734 283680 282917 283228 284276 284920 284777 284573 284881 285410 285783 286122 286549 286876 287135 287688 288469 288864
51126 288864 288636 288300 288261 288294 288252 288567 289578 290938 292164 293281 294563 296025 297456 298626 299391 299997 301169
51109 301169 303319 305768 307492 308498 309578 310805 311429 311361 311583 312753 314503 316550 319377 323314 327891
51094 327891 332725 338246 344918 352482 360475 368857 377658 386637 395607 404468 412700 419625 425325 430384
51080 430384 434505 436486 435934 433853 431035 427022 421314 414496 407385 400079 392697 386117 381065 377181
51066 377181 373789 370916 368810 367236 366057 365835 366984 368894 370618 371881 372850 373634 374749 377287 381708
51051C81708N276M721L844L467L347L160K973K477J088r26k490l058k848j943
51037D00796l84R03P84l67j052q27p26j280j725j444q80m72M2Q11J368J377R97
51020C97921L45m59p44M3J181J435R35R95K009L003L439L927M851N653N984O224
51004D36742O484O268N531M882M449L724K816K590L242M061M852O271Q393J0296
50990E10601J1516J2528J3338J2994J1201R191Q264Q500R498J1280J3841J6717
50978F49469J9681K3012K6747L0455L4055L7902M1845M5221M7966N0648N3345
50967A060346N5578N7326N8755N8937N6512N1899M7059M2674L7377L0437K3340
50956A580240J7627J2879Q076L543K39j749k655j964O74M131O527O934N636L383
$$ plain form
51051 381708 386984 391705 395549 399016 402363 405523 408496 410973 412061 411135 408645 405587 402739 400796
51037 400796 400412 401315 402099 401732 400680 399853 399127 397847 396122 394678 393798 393326 393368 394179 395547 396924 397921
51020 397921 398266 397807 397063 397106 398287 399722 400657 401652 403661 406664 410103 414030 418881 424534 430518 436742
51004 436742 443226 449494 455025 459907 464356 468080 470896 473486 476728 480789 485641 491912 500305 510601
50990 510601 522117 534645 547983 560977 572178 581369 589633 598133 607631 618911 632752 649469
50978 649469 669150 692162 718909 749364 783419 821321 863166 908387 956353 1007001 1060346
50967 1060346 1115924 1173250 1232005 1290942 1347454 1399353 1446412 1489086 1526463 1556900 1580240
50956 1580240 1597867 1610746 1618822 1622365 1622604 1620855 1618200 1616236 1616910 1621041 1627568 1634502 1640138 1643521
50942A643521J013q77k610n171q854j2992j7350k2590k8749l4535l9020m2905
50930A428881m7018n0649n2639n3285n3761n4140n3347n0914m7640m4398m1226
50919H79864l7769l4056l0538k7549k4826k1798j8474j5798j4547j4112j3126
50908F27271j1175r058p464o309n420m803m140k955j468l04N85J724K831L047
50894E82362K591K792M145N614O267O347O294O027N728O026O860P317P106O970
50880F62446P151O864N947N678P014R219J1146J2765J4552J6424J8147J9956K2039
50867H19348K4195K6599K9898L4098L8431M2854M8420N5480O2880O9730P6642
50856A328575Q4337R2233R9425J05922J11882J16758J20191J22644J24104J23179
$$ plain form
50942 1643521 1644534 1643657 1641047 1635876 1627022 1614030 1596680 1574090 1545341 1510806 1471786 1428881
50930 1428881 1381863 1331214 1278575 1225290 1171529 1117389 1064042 1013128 965488 921090 879864
50919 879864 842095 808039 777501 749952 725126 703328 684854 669056 654509 640397 627271
50908 627271 616096 607038 599574 593265 587845 583042 578902 575947 574479 574175 574760 576484 579315 582362
50894 582362 584953 587745 591890 597504 603771 610118 616412 622439 628167 634193 641053 648370 655476 662446
50880 662446 669597 676461 682408 688086 695100 704319 715465 728230 742782 759206 777353 797309 819348
50867 819348 843543 870142 900040 934138 972569 1015423 1063843 1119323 1182203 1251933 1328575
50856 1328575 1412912 1505145 1604570 1710492 1822374 1939132 2059323 2181967 2306071 2429250
50846B429250J18631J10779J00529Q8030P3447N7961M2820K8273J4546K930n378
50835C061818j0742j4201j5810j4876j1202n191K555J0807J7698K1985K3578K2155
50823C088574J6497O225p022k1333l6368n2230o7774q1663r4129j06014j16632
50812B528131j24229j28096j28771j26513j21184j13473j04899r6431q8031p9396
50802A417108p0481o1483n2996m5690l9367l2978k6185k0089j5623j2304r335
50791A030577o917n391m147k651j566j633k274k632l075m221n391n619n464o178
50777I73418p692q930r688j0541j1382j1598j1432j1639j1971j1472j0038q425
50765H48610o938n428m209l618l030j724l21P9j66K53J447K391K967M188O283
$$ plain form
50846 2429250 2547881 2658660 2759189 2847219 2920666 2978627 3021447 3049720 3064266 3067196 3061818
50835 3061818 3051076 3036875 3021065 3006189 2994987 2989796 2992351 3003158 3020856 3042841 3066419 3088574
50823 3088574 3105071 3111296 3104274 3082941 3046573 2994343 2926569 2844906 2750777 2644763 2528131
50812 2528131 2403902 2275806 2147035 2020522 1899338 1785865 1680966 1584535 1496504 1417108
50802 1417108 1346627 1285144 1232148 1186458 1147091 1114113 1087928 1067839 1052216 1039912 1030577
50791 1030577 1023660 1018269 1014122 1011471 1009905 1008272 1005998 1003366 1000291 996070 990679 985060 979596 973418
50777 973418 965726 956796 947108 936567 925185 913587 902155 890516 878545 867073 857035 848610
50765 848610 841672 836244 832035 828417 825387 823663 823342 823421 823255 823508 824955 827346 830313 834501 840784
50750H40784Q261R746J1689J4834J8775K3037K7871L3420L9060M4130M8627N2903
50738A173137N7221O1628O5633O8195O8734O8051O7334O6523O4508O0780N5759
50727A877503M9634M1970L2572K1917J0725j01r318j6034k0404k2875k3118k0725
50715A921746j6484j1798p066j856L507P915J0905J2830J3477J1800P187j26r843
50702A942194k1556l3800m4597n3318o0828o7465p2031p3348p1710o8247o3663
50691A311631n8213n2167m5769l9136l2652k6838k1703j6628j1147n338N79O478
50679A009097J2006J6611K0096K2706K4694K6066K6686K6191K4087K0459J6397
50668A245096J3104J0837R183P976P162O231M623K565O87r13k495l845m534m719
$$ plain form
50750 840784 849045 858791 870480 885314 904089 927126 954997 988417 1027477 1071607 1120234 1173137
50738 1173137 1230358 1291986 1357619 1425814 1494548 1562599 1629933 1696456 1760964 1821744 1877503
50727 1877503 1927137 1969107 2001679 2023596 2034321 2034220 2024902 2008868 1988464 1965589 1942471 1921746
50715 1921746 1905262 1893464 1886398 1884542 1888049 1895964 1906869 1919699 1933176 1944976 1952163 1952037 1942194
50702 1942194 1920638 1886838 1842241 1788923 1728095 1660630 1588599 1515251 1443541 1375294 1311631
50691 1311631 1253418 1201251 1155482 1116346 1083694 1056856 1035153 1018525 1007378 1002040 1002619 1009097
50679 1009097 1021103 1037714 1057810 1080516 1105210 1131276 1157962 1184153 1208240 1228699 1245096
50668 1245096 1258200 1269037 1278220 1286196 1293358 1299589 1304212 1306777 1307464 1306551 1304056 1300211 1295677 1290958
50654A290958m736m130k053J462N504R408J3045J6231J8829K1276K4115K7005
50642A416914K8978K9540K8753K6605K3278J9696J6728J4078J0984P773N532M412
50630A633271L405J740o67m020q560j3458j6924j7754j6047j2533q151m105j147
50617A535050J269M066O863Q398Q455Q037P485N948L039m57m049q505j4575k1640
50603A539384k8414l4243l9174m3340m6751m9251n0349m9545m6965m3372l9526
50592A068454l5956l3035l0542k7474k3185j8493j4738j1923q911n299j921N19
50580H57496K111K925K756K014J707K204K821K955K759K484K179K208L136M791
50566H94546O286P284Q402J0119J2159J4217J6404J8692K0669K2135K3201K3702
$$ plain form
50654 1290958 1286222 1282092 1280039 1281501 1287005 1296413 1309458 1325689 1344518 1365794 1389909 1416914
50642 1416914 1445892 1475432 1504185 1530790 1554068 1573764 1590492 1604570 1615554 1623327 1628859 1633271
50630 1633271 1636676 1638416 1637749 1633729 1625169 1611711 1594787 1577033 1560986 1548453 1540302 1536197 1535050
50617 1535050 1536319 1540385 1547248 1555646 1564101 1572138 1579623 1585571 1588610 1588153 1584104 1575599 1561024 1539384
50603 1539384 1510970 1476727 1437553 1394213 1347462 1298211 1247862 1198317 1151352 1107980 1068454
50592 1068454 1032498 999463 968921 941447 918262 899769 885031 873108 864197 858898 856977 857496
50580 857496 859607 862532 865288 867302 869009 871213 874034 876989 879748 882232 884411 886619 889755 894546
50566 894546 900832 908116 916518 926637 938796 953013 969417 988109 1008778 1030913 1054114 1077816
50554A077816K3245K2001K0664J9527J8380J7375J7113J7723J8757K0075K2003
50543A294679K4460K6893K9170L1799L5058L8770M2870M7421N2081N6538O1360
50532A741099O7286P3639P8684Q1678Q3353Q4207Q3570Q0901P6727P1670O5439
50521B588253N7423M7577L6272K3751J0150m411j9702l4957m8765o0108o9212
50510B526271p6469q1066q1924p9579p5712p0893o4345n5890m6436l6451k5645
50499A831861j4533m542M001J2323K0897K8232L2797L4660L4260L0800K3149J1542
50487B045447k591j7749l2599m5881n6896o5606p1795p4899p4975p3066p0174
50476A459216o6672o2912n9402n6070n2332m8271m4662m1487l7756l3217k9000
$$ plain form
50554 1077816 1101061 1123062 1143726 1163253 1181633 1199008 1216121 1233844 1252601 1272676 1294679
50543 1294679 1319139 1346032 1375202 1407001 1442059 1480829 1523699 1571120 1623201 1679739 1741099
50532 1741099 1808385 1882024 1960708 2042386 2125739 2209946 2293516 2374417 2451144 2522814 2588253
50521 2588253 2645676 2693253 2729525 2753276 2763426 2759015 2739313 2704356 2655591 2595483 2526271
50510 2526271 2449802 2368736 2286812 2207233 2131521 2060628 1996283 1940393 1893957 1857506 1831861
50499 1831861 1817328 1812786 1816787 1829110 1850007 1878239 1911036 1945696 1979956 2010756 2033905 2045447
50487 2045447 2042856 2025107 1992508 1946627 1889731 1824125 1752330 1677431 1602456 1529390 1459216
50476 1459216 1392544 1329632 1270230 1214160 1161828 1113557 1068895 1027408 989652 956435 927435
50465I27435k5860k3057j9675j5950j2460r062n506k146P36L484O330Q983J1508
50452H44760J4585J8289K1770K4882K8745L3572L6858L5163K7306J5139J919r271
50440A093717j6379j9084j8689j6732j3868j0311o550l088M6K994N700Q162J0455
50427A016373J2469J4195J6316J9531K3297K6364K8643L1266L4562L7471L9365
50416A299852M0942M2676M3776M3517M2319M0668L8286L5147L2063K9215K5377
50405A713838J9706J3126O836M33p251j6282k5660l4487m2168m8220n2703n6197
50393A470971n8610n8993n7066n3827m9909m4646l7767l0572k4219j8026j0919
50382A026417l474K990Q470J3919J9414K4093K7363K8938K8099K4170J7428Q767
$$ plain form
50465 927435 901575 878518 858843 842893 830433 821371 815865 813719 814455 817939 824269 833252 844760
50452 844760 859345 877634 899404 924286 953031 986603 1023461 1058624 1085930 1101069 1102988 1093717
50440 1093717 1077338 1058254 1039565 1022833 1008965 998654 992104 989016 989062 992056 997756 1005918 1016373
50427 1016373 1028842 1043037 1059353 1078884 1102181 1128545 1157188 1188454 1223016 1260487 1299852
50416 1299852 1340794 1383470 1427246 1470763 1513082 1553750 1592036 1627183 1659246 1688461 1713838
50405 1713838 1733544 1746670 1753506 1753939 1746688 1730406 1704746 1670259 1628091 1579871 1527168 1470971
50393 1470971 1412361 1353368 1296302 1242475 1192566 1147920 1110153 1079581 1055362 1037336 1026417
50382 1026417 1022943 1025933 1034403 1048322 1067736 1091829 1119192 1148130 1176229 1200399 1217827 1226594
50370A226594j063j1119j9959k6694l1671l5293l7028l6547l4908l3419l2095
50359I26798l0400k8680k7574k6726k5390k3781k2568k1589k0150j8179j5984
50348F65777j3488j0689q337p008o140m950l660k778j938n74R52K089L237N004
50334F17497O959Q353R374J0568J1723J2519J3546J5455J7786J9863K1991K4492
50322G90126K6468K7057K7229K8734L1957L6258M1692M8836N7617O7830P9527
50311A263331R0486R4018Q2471N4249J6175k1204m9826o6683p3168p2913o9021
50300A247915o2573n4069m5344l8560l3792k9500k5133k1534j8848j6034j2682
50289H89846r491o593l104J221N488R381J3791J9145K4416K8538L1602L4013L5496
$$ plain form
50370 1226594 1225531 1214412 1194453 1167759 1136088 1100795 1063767 1027220 992312 958893 926798
50359 926798 896398 867718 840144 813418 788028 764247 741679 720090 699940 681761 665777
50348 665777 652289 641600 633263 626255 620115 615165 611505 608727 606789 606215 607167 609256 612493 617497
50334 617497 624456 632809 642183 652751 664474 676993 690539 705994 723780 743643 765634 790126
50322 790126 816594 843651 870880 899614 931571 967829 1009521 1058357 1115974 1183804 1263331
50311 1263331 1353817 1447835 1530306 1584555 1600730 1579526 1529700 1463017 1389849 1316936 1247915
50300 1247915 1185342 1131273 1085929 1047369 1013577 984077 958944 937410 918562 902528 889846
50289 889846 880355 873762 870658 871879 877367 886748 900539 919684 944100 972638 1004240 1038253 1073749
50276A073749L5574L4252L1787K8564K5380K2940K0976J8724J6274J4237J2067
50265A334524Q106J624o258j4088k1217k7192l1267l3239l3766l3360l1902k9562
50253A082403k7310k5961k5552k5876k6801k7650k7239k5150k2203j9338j6704
50242H12619j4156j1853r805p618n129k820j196j98M82R21J017P02M2n57m53M61
50226G62459J399J660J550J519R53j021l819n802o403o605p118p376o721n556
50212G19119m711m471m616m872n007m971n042n369n510n077m587m807n477n624
50198F48978n048m459m183l821l146k372j467k28R29J296J026R02J047R79R15
50183F31348J661L072L972L968M020M821N830O430O946P892R227J0890J3191J6137
$$ plain form
50276 1073749 1109323 1143575 1175362 1203926 1229306 1252246 1273222 1291946 1308220 1322457 1334524
50265 1334524 1342630 1344254 1337996 1323908 1302691 1275499 1244232 1210993 1177227 1143867 1111965 1082403
50253 1082403 1055093 1029132 1003580 977704 950903 923253 896014 870864 848661 829323 812619
50242 812619 798463 786610 776805 769187 764058 761238 760042 759844 760326 761247 762264 762966 763008 762451 761998 762459
50226 762459 763858 765518 767068 768587 769540 768519 764700 758898 752495 745890 738772 731396 724675 719119
50212 719119 714408 709937 705321 700449 695442 690471 685429 680060 674550 669473 664886 660079 654602 648978
50198 648978 643930 639471 635288 631467 628321 625949 624482 624254 625183 626479 627505 628407 629454 630433 631348
50183 631348 633009 636081 640053 644021 648041 652862 658692 665122 672068 679960 689187 700077 713268 729405
50169G29405J9196K2241K5928L0704L6155M1772M7447N2838N6904N8652N7922
50158A179164N5200N1287M7243M3950M1458L9206L6709L3424K8255K0317J0086
50147A586299j167j2880k5021l6672m6279n3433n8822o2391o3192o1450n9008
50136A105984n6975n4439n0367m5369m0622l6351l2387k9073k6475k3650j9867
50125F90409j5813j2624j0320q177n979m030k433j151l13J96R09J911K435J956
50111F36976J072N80L26k59j061j542j704j916k083j710p12L63Q84O59L3l79l59
50094F29168m51j182k035j898o43O11R86P86O21N80O59J251K554M137N583O952
50078F47679Q345R552J0480J1309J1990J2274J2417J3022J3915J4145J3372J2326
$$ plain form
50169 729405 748601 770842 796770 827474 863629 905401 952848 1005686 1062590 1121242 1179164
50158 1179164 1234364 1285651 1332894 1376844 1418302 1457508 1494217 1527641 1555896 1576213 1586299
50147 1586299 1585132 1572252 1547231 1510559 1464280 1410847 1352025 1289634 1226442 1164992 1105984
50136 1105984 1049009 994570 944203 898834 858212 821861 789474 760401 733926 710276 690409
50125 690409 674596 661972 651652 643475 637496 633466 631033 629882 629569 629765 630674 632585 635020 636976
50111 636976 638048 638628 638954 638695 637634 636092 634388 632472 630389 628679 627967 628330 629214 629873 629906 629527 629168
50094 629168 628717 627535 625500 623602 622959 623570 624556 625342 625963 626543 627202 628453 631007 635144 640727 647679
50078 647679 656024 665576 676056 687365 699355 711629 724046 737068 750983 765128 778500 790826
50066G90826J1470J0254Q370O674O064O177N996N206M218L402K925K939L372L895
50052H71788M378N069O195P936J0744J4782J9116K2459K4914K7736L1195L3963
50040A080275L5048L4938L4203L2479K9675K6832K4672K2493J9617J6715J4429
50029A371376J1692O882j22q286j7071k6202l4423m0097m2924m3829m3370m1457
50017A092169l8576l5932l4194l2942l1516k9693k7550k5275k3168k1321j9437
50006G72565j7350j5375j3695j1840r434o949n051l567j962m69P5o03j989l656
49992F80700n628p887j0044j1574j2070j1426j0078q822q040p364o314m928l543
49979E72982k396j821k174l230m170m618n052n767o150n609m577l864l524l076
$$ plain form
50066 790826 802296 812550 820920 827594 833658 839835 845831 851037 855255 858657 861582 864521 867893 871788
50052 871788 876166 881235 887430 895366 906110 920892 940008 962467 987381 1015117 1046312 1080275
50040 1080275 1115323 1150261 1184464 1216943 1246618 1273450 1298122 1320615 1340232 1356947 1371376
50029 1371376 1383068 1389950 1389828 1381542 1364471 1338269 1303846 1263749 1220825 1176996 1133626 1092169
50017 1092169 1053593 1017661 983467 950525 919009 889316 861766 836491 813323 792002 772565
50006 772565 755215 739840 726145 714305 704871 697922 692871 689304 687342 686873 686948 686345 684356 680700
49992 680700 675072 667185 657141 645567 633497 622071 611993 603171 595131 587767 581453 576525 572982
49979 572982 570586 568765 566591 563361 559191 554573 549521 543754 537604 531995 527418 523554 520030 516954
49965E16954k442j918j553j189q00l21N09J697K785L474L990M415M289L320J854
49950E35064K20j669l593m783n055n277o000o493o065n394n407n637m972l441
49936D71498k039j097j64Q24J413J581J756J979J990J932K078K121J686J372K121
49921D89051L733N000N296N023M497L540K295J413J095P90J76l05j94K61M19j21
49905E21969j357k861l882l966l554l507m003m349l976l104k361k122k372k878
49891D77677l285l246k633j636p51n16r63j314o98P93K179K779K805K631K269
49876D76091J860J844K235K389J943J302P90J87m02k09R21J893J880J582J872
49861D96178K136J250m25j414j104r1J075K114K360J306j65n20L37R76N67j06
$$ plain form
49965 516954 514512 512594 511041 509852 509052 508731 509240 510937 513722 517196 521186 525601 529890 533210 535064
49950 535064 535284 533615 530022 525239 520184 514907 508907 502414 496349 490955 485548 479911 474939 471498
49936 471498 469459 468362 468198 469022 470435 472016 473772 475751 477741 479673 481751 483872 485558 486930 489051
49921 489051 492784 497784 503080 508103 512600 516140 518435 519848 520943 521733 521909 521604 521410 521671 522090 521969
49905 521969 520612 517751 513869 509903 506349 502842 498839 494490 490514 487410 485049 482927 480555 477677
49891 477677 474392 471146 468513 466877 466126 465610 464647 463333 462635 463428 465607 468386 471191 473822 476091
49876 476091 477951 479795 482030 484419 486362 487664 488454 488641 488239 488030 488951 490844 492724 494306 496178
49861 496178 498314 499564 499139 497725 496621 496530 497605 499719 502079 503385 503220 502700 503037 504013 504580 504474
49845E04474p8N57J271J953K563K742K345J791J472J248Q19J74o04j510k376k851
49829E13990k772k264j477n41K10M93N10P26J216J655J821J708J193K00q26j148
49813E14694n72L26Q52P51J52o31j263j622j850k018j972j746j733k063k154j461
49797D97690m29m6n58j221j316q74k79L63J242K338L124K949J864Q36P18J154
49781E07555J177P47P49J401J737J144L07j7j46n96r59p36m84r67j725j637o15
49764E06935L62O76O47P26R47J131J067O64K86N12J170J281N05j43J85Q45Q18
49747E18614L54L40O80O46L62O46J563K382K693K611K098J145L41K26M26L96N18
$$ plain form
49845 504474 504396 504953 506224 508177 510740 513482 515827 517618 519090 520338 521157 521331 520727 519217 516841 513990
49829 513990 511218 508954 507477 506936 507146 507639 508149 508875 510091 511746 513567 515275 516468 516668 515842 514694
49813 514694 514122 514448 515300 516051 516203 515572 514309 512687 510837 508819 506847 505101 503368 501305 499151 497690
49797 497690 497261 497215 496657 495436 494120 493246 492967 493330 494572 496910 500034 502983 504847 505683 506401 507555
49781 507555 508732 509479 510228 511629 513366 514510 514817 514800 514654 514058 513099 512363 511879 510912 509187 507550 506935
49764 506935 507297 507973 508620 509346 510293 511424 512491 513155 513441 513953 515123 516404 516909 516766 516951 517796 518614
49747 518614 518968 519308 519988 520634 520996 521642 523205 525587 528280 530891 532989 534134 534475 534701 535127 535523 536041
$$ [...]
##END NTUPLES=NMR SPECTRUM
##END=
