##TITLE=NES1069_159122.0009_002_9705601_bkJBSS0dfe
##JCAMPDX= 6.0         $$ Bruker NMR JCAMP-DX V2.0
##DATA TYPE= NMR SPECTRUM
##DATA CLASS= NTUPLES
##ORIGIN= BRUKER
##OWNER= Administrator
$$ 1.72 TOPSPIN		Version 2.1
$$ 2016-04-30 14:11:41.989 -0700  Administrator@X
$$ Compression mode = diff/dup
##.OBSERVE FREQUENCY= 400.02188249412
##.OBSERVE NUCLEUS= ^1H
##.ACQUISITION MODE= SIMULTANEOUS (DQD)
##.ACQUISITION SCHEME= undefined
##.AVERAGES= 8
##.DIGITISER RES= 22
##SPECTROMETER/DATA SYSTEM= spect
##.PULSE SEQUENCE= zg30
##.SOLVENT NAME= COFFEE_meoh
##.SHIFT REFERENCE= INTERNAL, COFFEE_meoh, 1, 14.98509
##AUDIT TRAIL= $$ (NUMBER, WHEN, WHO, WHERE, PROCESS, VERSION, WHAT)
$$ ##TITLE= Audit trail, TOPSPIN		Version 2.1
$$ ##JCAMPDX= 5.01
$$ ##ORIGIN= Bruker BioSpin GmbH
$$ ##OWNER= Administrator
$$ $$ E:\/data/COFFEE/nmr/NES1069_159122.0009_002_9705601_bkJBSS0dfe/10/pdata/1/auditp.txt
$$ ##AUDIT TRAIL=  $$ (NUMBER, WHEN, WHO, WHERE, PROCESS, VERSION, WHAT)
(   1,<2016-04-30 14:11:34.708 -0700>,<Administrator>,<X>,<go>,<TOPSPIN 2.1>,
      <created by zg
	started at 2016-04-30 14:10:28.896 -0700,
	POWCHK enabled, PULCHK disabled,
       configuration hash MD5:
       21 0F 79 D6 B3 7B B4 F6 88 20 88 DB 03 48 BD 9F
       data hash MD5: 64K
       ED 57 86 D0 C3 13 D5 09 0B 32 3D 23 52 B6 F3 50>)
(   2,<2016-04-30 14:11:37.989 -0700>,<Administrator>,<X>,<proc1d>,<TOPSPIN 2.1>,
      <Start of raw data processing
       efp LB = 0 FT_mod = 6 PKNL = 1 PHC0 = 0 PHC1 = 0 SI = 32K 
       data hash MD5: 32K
       23 0D 44 AF AC 7B E0 8E C9 C5 BD 4D 22 B3 2E 7E>)
(   3,<2016-04-30 14:11:38.271 -0700>,<Administrator>,<X>,<proc1d>,<TOPSPIN 2.1>,
      <pk PHC0 = 95.02075 PHC1 = 0 
       data hash MD5: 32K
       7E F4 79 D3 D6 34 04 A2 3A BB 89 70 8B F7 37 73>)
(   4,<2016-04-30 14:11:38.380 -0700>,<Administrator>,<X>,<proc1d>,<TOPSPIN 2.1>,
      <abs ABSG = 1 
       data hash MD5: 32K
       1E F1 CB 8F 3B D1 82 D8 BC FB E9 37 AC A8 9C D0>)
(   5,<2016-04-30 14:11:38.442 -0700>,<Administrator>,<X>,<proc1d>,<TOPSPIN 2.1>,
      <abs ABSG = 2 
       data hash MD5: 32K
       37 74 2F B9 15 13 F0 A3 8C 68 C2 00 E9 94 57 6C>)
(   6,<2016-04-30 14:11:38.505 -0700>,<Administrator>,<X>,<proc1d>,<TOPSPIN 2.1>,
      <abs ABSG = 3 
       data hash MD5: 32K
       CE 77 0C CE AA 98 5B B3 20 D6 72 D7 26 A6 56 68>)
(   7,<2016-04-30 14:11:38.567 -0700>,<Administrator>,<X>,<proc1d>,<TOPSPIN 2.1>,
      <abs ABSG = 4 
       data hash MD5: 32K
       FD 66 59 C7 00 BA 56 B3 AB 08 BE DF 12 7C EB E6>)
(   8,<2016-04-30 14:11:38.646 -0700>,<Administrator>,<X>,<proc1d>,<TOPSPIN 2.1>,
      <abs ABSG = 5 
       data hash MD5: 32K
       BF 61 A8 76 B0 45 5E 81 77 56 E2 D7 00 04 BC 96>)
$$ ##END=
$$ 
$$ $$ hash MD5
$$ $$ 6F C6 0B E4 8D BC 9C 79 F4 CE 63 3C E4 28 E3 EE
##$RELAX= 
##$RELAX= 
##$RELAX= 
##$RELAX= 
##$RELAX= 
##$RELAX= 
##$RELAX= 
$$ Bruker specific parameters
$$ --------------------------
##$DU= <E:\>
##$EXPNO= 10
$$ [...]
150 150 150 150 150 150 150 150
##$TP07= 0
##$TPNAME0= <>
##$TPNAME1= <>
##$TPNAME2= <>
##$TPNAME3= <>
##$TPNAME4= <>
##$TPNAME5= <>
##$TPNAME6= <>
##$TPNAME7= <>
##$TPOAL= (0..7)
0.5 0.5 0.5 0.5 0.5 0.5 0.5 0.5
##$TPOFFS= (0..7)
0 0 0 0 0 0 0 0
##$TUNHIN= 0
##$TUNHOUT= 0
##$TUNXOUT= 0
##$USERA1= <user>
##$USERA2= <user>
##$USERA3= <user>
##$USERA4= <user>
##$USERA5= <user>
##$V9= 5
##$VALIST= <valist>
##$VCLIST= <CCCCCCCCCCCCCCC>
##$VD= 0
##$VDLIST= <DDDDDDDDDDDDDDD>
##$VPLIST= <PPPPPPPPPPPPPPP>
##$VTLIST= <TTTTTTTTTTTTTTT>
##$WBST= 2048
##$WBSW= 25
##$XGAIN= (0..3)
0 0 0 0
##$XL= 0
##$YL= 0
##$YMAX_a= 580779
##$YMIN_a= -491978
##$ZGOPTNS= <>
##$ZL1= 120
##$ZL2= 120
##$ZL3= 120
##$ZL4= 120
##$ABSF1= 14.98509
##$ABSF2= -5.573092
##$ABSG= 5
##$ABSL= 3
##$ALPHA= 0
##$AQORDER= 0
##$ASSFAC= 0
##$ASSFACI= 0
##$ASSFACX= 0
##$ASSWID= 0
##$AUNMP= <proc_prof1d_extract_pilot.lims>
##$AXLEFT= 0
##$AXNAME= <>
##$AXNUC= <1H>
##$AXRIGHT= 0
##$AXTYPE= 0
##$AXUNIT= <>
##$AZFE= 0.1
##$AZFW= 0.1
##$BCFW= 0
##$BC_mod= 0
##$BYTORDP= 0
##$COROFFS= 0
##$CY= 15
##$DATMOD= 1
##$DC= 0
##$DFILT= <>
##$DTYPP= 0
##$F1P= 0
##$F2P= 0
##$FCOR= 0.5
##$FTSIZE= 32768
##$FT_mod= 6
##$GAMMA= 0
##$GB= 0
##$INTBC= 1
##$INTSCL= 1
##$ISEN= 128
##$LB= 0
##$LEV0= 0
##$LPBIN= 0
##$MAXI= 10000
##$MC2= 0
##$MEAN= 0
##$ME_mod= 0
##$MI= 0
##$NCOEF= 0
##$NC_proc= -8
##$NLEV= 6
##$NOISF1= 0
##$NOISF2= 0
##$NSP= 0
##$NTH_PI= 0
##$NZP= 0
##$OFFSET= 14.98509
##$PC= 1
##$PHC0= 95.02075
##$PHC1= 0
##$PH_mod= 1
##$PKNL= yes
##$PPARMOD= 0
##$PPDIAG= 0
##$PPIPTYP= 0
##$PPMPNUM= 2147483647
##$PPRESOL= 1
##$PSCAL= 4
##$PSIGN= 0
##$PYNMP= <proc.py>
##$REVERSE= no
##$SF= 400.02
##$SI= 32768
##$SIGF1= 0
##$SIGF2= 0
##$SINO= 400
##$SIOLD= 32768
##$SPECTYP= <>
##$SREGLST= <1H.CDCl3>
##$SSB= 0
##$STSI= 32768
##$STSR= 0
##$SW_p= 8223.68421052631
##$SYMM= 0
##$S_DEV= 0
##$TDeff= 65536
##$TDoff= 0
##$TI= <>
##$TILT= no
##$TM1= 0
##$TM2= 0
##$TOPLEV= 0
##$USERP1= <user>
##$USERP2= <user>
##$USERP3= <user>
##$USERP4= <user>
##$USERP5= <user>
##$WDW= 1
##$XDIM= 32768
##$YMAX_p= 439193829
##$YMIN_p= -638344
##$CURPLOT= <Network HP LaserJet P1505>
##$CURPRIN= <$Network HP LaserJet P1505>
##$DFORMAT= <normdp>
##$LAYOUT= <+/1D_H.xwp>
##$LFORMAT= <normlp>
##$PFORMAT= <normpl>
##$SURQMSG= 1
$$ End of Bruker specific parameters
$$ ---------------------------------
##NTUPLES= NMR SPECTRUM
##VAR_NAME=  FREQUENCY,     SPECTRUM/REAL,   SPECTRUM/IMAG
##SYMBOL=    X,             R,               I
##VAR_TYPE=  INDEPENDENT,   DEPENDENT,       DEPENDENT
##VAR_FORM=  AFFN,          ASDF,            ASDF
##VAR_DIM=   32768,         32768,           32768
##UNITS=     HZ,            ARBITRARY UNITS, ARBITRARY UNITS
##FACTOR=    0.250966925370066, 1,           1
##FIRST=     8223.43324360094, -128511,      -92390
##LAST=      0,             -55252,          -44465
##MIN=       0,             -638344,         0
##MAX=       8223.43324360094, 439193829,    0
$$ Real data points
##PAGE= N=1
##DATA TABLE= (X++(R..R)), XYDATA
$$ [...]
19565A76549f7100F2444A3550a28332K0560Q415B04409J1320a7794q0220k41c4165
19552b55679F6419b62574j61115B50808g5372H169h1515K4630j14462E8926b23654
19540c1537C06829e3412A18029a00696n4554m2243E0148M2497N1062c5109B52592
19528C99772b8414d730k32297B16J27928M760J14326H936a64214A44179b56779
19516h2986A41783f7434m0980H1980a05563n4490f7069d010l03557a45498a2442
19504h001H5662l094K95016a0964j62695a7387C4894b7122A17289k0205J46074
19493B43158p407D7395P361b51128a11514i896k16766B13627p8449c29279B01475
19481b76406a1395j08866k77758a02610c3354m2649A72244A4806a69386P7789
$$ y = [176549, -67100, 62444, 13550, -128332, -107772, -99357, 204409, 215729, -17794, -98014, -98255, -34165, -255679, 66419, -262574, -423689, 250808, -75372, 8169, -81515, -56885, -171347, 58926, -223654, -31537, 306829, -53412, 118029, -100696, -155250, -197493, 50148, 92645, 143707, -35109, 252592, 399772, -28414, -4730, -237027, 216, 128144, 132904, 247230, 8936, -164214, 144179, -256779, -82986, 141783, -67434, -108414, 81980, -105563, -160053, -67069, -4010, -307567, -145498, -12442, -8001, 85662, 82568, 377584, -10964, -173659, -17387, 34894, -27122, 117289, 97084, 243158, 235751, 47395, 54756, -251128, -111514, -9896, -226662, 213627, 135178, -329279, 201475, -276406, -11395, -120261, -398019, -102610, -33354, -76003, 172244, 14806, -169386, -91597]
19471i1597C90981c45726g8024A11500g7400F6648b51496J0638a12092q4576j00830
19460b97498J32378b8661j64435A2442a44292b9874J1486j52559A29936D1273
19449c1524A54786a80272A08732b33909B205b870A7021b52312E5935c8192j66821
19438b05013m364R5386L8324D818a22719k40810a50131I8189K2196l2480A1222
19426I7238c22707a27359j26986F6701a32018A28571o2761a15657L7154c326m8058
19415e1384p0877F4180a03799A56551n9285a67925J4710c4565C1516N234f8071
19403b67511o9415L9377e1488j54432G9669b0729j87685B97445a7872j19767D0254
19391E0181a40617L7219l1816e4403k70001b320q6621l50245a84541P2048A36737
$$ y = [-91597, 390981, -345726, -78024, 111500, -77400, 66648, -251496, -240858, -112092, -196668, -297498, -165120, -28661, -193096, 12442, -144292, -29874, -18388, -170947, 129936, 41273, -31524, 154786, -180272, 108732, -233909, 2205, -2870, 17021, -252312, 55935, -38192, -205013, -209377, -113991, -75667, 4818, -122719, -363529, -150131, 98189, 120385, 87905, 11222, 97238, -322707, -127359, -254345, 66701, -132018, 128571, 65810, -115657, -78503, -3326, -51384, -122261, 64180, -103799, 156551, 97266, -167925, -153215, -34565, 31516, 36750, -68071, -267511, -336926, -297549, -51488, -205920, 79669, -20729, -208414, 297445, -17872, -137639, 40254, 50181, -140617, -103398, -135214, -54403, -324404, -2320, -88941, -439186, -184541, -112493, 136737]
19379c50255d0916C06826G0644g8273k6238E207N3144b51305A62636d70403a34100
19367a40786D5938L5073K90698C3612g0902G5311J58702f031A01389M740a37364
19355a3043B07033D0591c4181A84442a07577b929I7189m5358d03242A98044E3566
19343b88988B18491a89575f5534p8005A23893E2377B3050b44269J205j13622f2494
19331a01424B23868a42714B6930d5694j78799p837E62b43862P1347D6344c2748
19319D3969a08808j64593A55563a49685D2043a13131j13213P8778j81129J26609
19309b02086i2827B1257b63314C1469b17608g7046A90142D2376f0323k53092e1054
19297b73262B83807j35104a15405m7072A94631E1301a09219G5575J3182a68604
$$ y = [-350255, -40916, 306826, 70644, -78273, -104511, 5207, 58351, -251305, 162636, -470403, -134100, -140786, 45938, 81011, 371709, 33612, -70902, 75311, 234013, -6031, 101389, 106129, -137364, -13043, 207033, 40591, -34181, 184442, -107577, -2929, 97189, 51831, -403242, 198044, 53566, -288988, 218491, -189575, -65534, -143539, 123893, 52377, 23050, -244269, -243064, -356686, -62494, -101424, 223868, -142714, 26930, -45694, -224493, -232330, 562, -243862, -172515, 46344, -32748, 43969, -108808, -273401, 155563, -149685, 42043, -113131, -226344, -147566, -328695, -202086, -92827, 21257, -263314, 31469, -217608, -77046, 190142, 42376, -60323, -313415, -51054, -273262, 283807, 148703, -115405, -162477, 194631, 51301, -109219, 75575, 88757, -168604]
19286G036c5911j89867i467B2890J33592a99349d3130m5042L0635E7534M0549
19275I8083b0114p3423j00253f3676k83618D2038J2044M0324h709k82568Q7611
19264b03666p3322B1188N246q237a13597o7485B772J7317O9234J17345a71555
19252b60418g7544J877G9599Q1541m3943a59014e6244j68910A16496B9807g1117
19240a63243j13592A06782a66566L2064C19867A6016b26509F3222j6040K3247
19230G0429d5655j80722A33247a33024l0934a9430G1597b3795B79081a04001B9873
19218b82626B06102C5380N5907a93879E4724B2846b41162e573F471a74016j17249
19207b91265A97232a8345I7935a13629c4337r6750K4648A42422b90951c3386C6441
$$ y = [7036, -35911, -225778, -9467, 22890, 156482, -199349, -43130, -88172, -57537, 57534, 98083, -20114, -93537, -193790, -63676, -347294, 42038, 54082, 94406, -8709, -291277, -203666, -276988, 21188, 26434, 18197, -113597, -181082, 2772, 20089, 89323, 206668, -171555, -260418, -77544, -75667, 79599, 161140, 117197, -159014, -56244, -225154, 116496, 29807, -71117, -163243, -276835, 106782, -166566, -134502, 319867, 16016, -226509, 63222, 47182, 70429, -45655, -226377, 133247, -133024, -163958, -19430, 71597, -23795, 279081, -104001, 29873, -282626, 206102, 35380, 91287, -193879, 54724, 22846, -241162, -5573, 6471, -174016, -291265, 197232, -18345, 97935, -113629, -34337, -131087, -106439, 142422, -290951, -33386, 36441]
19195b68969B8932b11941A14841b9678j33839j2068B07380l9436F9387a43516
19184a98529D0603b18940H9135b2300I2767i1822k53247J65641D92657i4494P805
19173h6689o7351B940O9930R3308b5658D39876e38885C31575b62601M7784B21714
19161G920h9223j7038k66264a0578l3500a014p1653j2864a0231A33276i1258j8109
19149a09367A4154d56396b19316A03761g9800A21061c2626k46325a26300n061
19139a31361j4189L8598C7992a79840n5894B25902I0304K8518d10335F292c09580
19127I0015a80173j45370h6024K5979E5409b64676A60301a18311q5302j28781
19117c32394a03946c0021F2173a78243a7526j32292A7531f7702k61982C87057
$$ y = [-268969, 28932, -211941, 114841, -29678, -163517, -175585, 207380, 167944, 69387, -143516, -198529, 40603, -218940, 89135, -22300, 92767, -91822, -345069, -179428, 492657, -94494, -86689, -154040, 2940, 72870, 166178, -25658, 439876, -538885, 331575, -262601, -214817, 221714, 7920, -89223, -106261, -372525, -10578, -44078, -1014, -72667, -85531, -10231, 133276, -91258, -109367, 14154, -456396, -219316, 103761, -79800, 121061, -32626, -278951, -126300, -131361, -145550, -106952, 37992, -179840, -235734, 225902, 90304, 118822, -410335, 6292, -309580, 90015, -180173, -325543, -86024, -60045, 55409, -264676, 160301, -118311, -203613, -332394, -103946, -30021, 62173, -178243, -17526, -149818, 17531, -67702, -329684, 387057]
19106c3902l1156E7823b67274d8766b4381B45847c15390d8333C5432J16290A8175
19094E2070F462J46518c90050Q8335A07464B8682K53745b59994J15078e7184k97279
19083c54463a23285c0046l4712E7080J51289A630a8267A50046K2835G6097D531
19071a47852B7700R4544D901b28271F0657b56912R1131p7569B02129b0930j17056
19060a37986D550h8069j31428Q8725A5505a17536a2009F4318J20716a77501p1249
19049b48750B26067g6828n9320j4065j84842a51248B54328e5724j72597j75467
19039d03788a35545L5653L6574p0786A9646b64009H6985l3827K9453k0431L86410
19028D48590F3600L509b8F9499J81726B9573Q9984N1858K3637b48116h5009I597
$$ y = [-33902, -65058, 57823, -267274, -48766, -24381, 245847, -315390, -48333, 35432, 151722, 18175, 52070, 6462, 152980, -390050, -301715, 107464, 28682, 282427, -259994, -144916, -57184, -354463, -123285, -30046, -64758, 57080, 208369, 1630, -18267, 150046, 172881, 76097, 4531, -147852, 27700, 122244, 4901, -228271, 60657, -256912, -165781, -243350, 202129, -20930, -137986, 4550, -88069, -219497, -130772, 15505, -117536, -12009, 64318, 185034, -177501, -248750, 226067, -76828, -136148, -150213, -335055, -151248, 254328, -55724, -228321, -403788, -135545, -99892, -63318, -134104, 19646, -264009, 86985, 53158, 82611, 62180, 448590, 63600, 67109, -28, 69499, 251225, 29573, 119557, 171415, 195052, -248116, -85009, 9597]
19015b03380A66759a21586o2865A9588a7790B526a68223k613L8749b8154A84007
19003A04936a88990A56912b91249f8435j05178N1929A30811b88628J31092A8870
18992b43964J6483c2791r8832j49316H1059k1438g3783a0174F8711a62729F802
18980b4796J0035n0028K3206B25923g135B48577c67737i9464D7569b37681I2784
18968a5905A38722g2950j94142a11947A3627b48769B63547j23101J28968g4053
18957A90890F1489M1319d5696j13665a889r7052K5130l8603D88090b4097P337
18946a6760j72743B21091h2073c131l00719C82416a88331A08505a14184B90186
18935g4348k98872A59546R2944a86188B2040b82067P9615q8856m9168C1954f7148
$$ y = [-203380, 166759, -121586, -184451, 19588, -17790, 2526, -168223, -170836, -132087, -28154, 184007, 104936, -188990, 156912, -291249, -68435, -173613, -121684, 130811, -288628, -157536, 18870, -243964, -227481, -32791, -131623, -280939, 81059, 59621, -73783, -10174, 68711, -162729, 6802, -24796, -14761, -64789, -41583, 225923, -7135, 248577, -367737, -99464, 47569, -237681, 92784, -15905, 138722, -72950, -267092, -111947, 13627, -248769, 263547, 140446, 269414, -74053, 190890, 61489, 102808, -45696, -159361, -1889, -98941, -73811, -112414, 488090, -24097, -16760, -189503, 221091, -82073, -3131, -303850, 382416, -188331, 108505, -114184, 290186, -74348, -373220, 159546, 252490, -186188, 22040, -282067, -202452, -291308, -340476, 31954, -67148]
18923d20638i718E1368a12024A55624g3063j0978A07403c02727A66198g9846D00889
18911c12579A41373n0855g2907C4953d7578A80013a46266c2179E19704e9476B781
18899A33047j7479L8567b21638M3218A21362O9153g9674m64253b58206P148H8512
18887A01806b23835A853i0261G8365a4038E6450b73341B21098a44467B10288b31354
18875c16432a29069B63017A9378R0457a09005j03284L999j22692B4454h6211A03410
18863a61556e0804k41489J31326A19993b17826m9377A11491a49237j44572g7787
18852E5105a38746j651j34511B34698C3173Q9056k6760a03492L6429r4323b1499
18840B6876i6519B16895k2197A8937b98732a45100H2876h3927B09910a36964j98487
$$ y = [-420638, -9718, 51368, -112024, 155624, -73063, -84041, 107403, -302727, 166198, -79846, 400889, -312579, 141373, 90518, -72907, 34953, -47578, 180013, -146266, -32179, 519704, -59476, 2781, 133047, 115568, 154135, -221638, -178420, 121362, 190515, -79674, -543927, -258206, -251058, 88512, 101806, -223835, 1853, -90261, 78365, -14038, 56450, -273341, 221098, -144467, 210288, -231354, -316432, -129069, 263017, 19378, 109835, -109005, -212289, -208290, -330982, 24454, -86211, 103410, -161556, -50804, -292293, -160967, 119993, -217826, -267203, 111491, -149237, -293809, -77787, 55105, -138746, -140397, -274908, 234698, 33173, 122229, 95469, -103492, -67063, -161386, -21499, 26876, -96519, 216895, 194698, 18937, -298732, -145100, 82876, -83927, 209910, -136964, -335451]
18829c35451G265J1937a92153o1113f6091l9825k38969B38635H7675a24424A26042
18817b00527j0282A69500l967f6383F7701h3648A74096P5094A9882a7041j0441
18806b7482B07761E7989c17229d8298k22041H3515i9280o4089N5665j18002A03091
18794G7243d7629n1815A39806m2295b43633b9832k19657A51758j3776Q698c13371
18782B21712G2639i9046K001A58429D8781b3590j17627B3313a66740j13273i0988
18770H3018c98164R9657A57772f2826k6363B51825h7772A94518a94511B03572
18759B52094c2383j12571D2744e2977j579J3257C3866d28242a52469B36272j13008
18748A23264J38195h6650L3090A69632a72605H7754c3521A85196G3696c9174m6734
$$ y = [-335451, 7265, 19202, -192153, -253266, -66091, -105916, -344885, 238635, 87675, -124424, 126042, -200527, -210809, 169500, 165533, -66383, 67701, -83648, 174096, 249190, 19882, -17041, -27482, 207761, 57989, -317229, -48298, -270339, 83515, -99280, -163369, -107704, -225706, 103091, 77243, -47629, -99444, 139806, 97511, -243633, -29832, -249489, 151758, 137982, 146680, -313371, 221712, 72639, -99046, -97045, 158429, 48781, -23590, -141217, 23313, -166740, -280013, -90988, 83018, -398164, -298507, 157772, -62826, -89189, 251825, -87772, 194518, -194511, 203572, 252094, -32383, -144954, 42744, -52977, -54556, -41299, 33866, -428242, -152469, 236272, 123264, 261459, -86650, -53560, 169632, -172605, 87754, -33521, 185196, 73696, -39174, -85908]
18737h5908H0542c3881r9410r984b4324B69537A8466d1819l066j47174e5332k97555
18725c52887a39533c1591A02322d62982E0530g3421A04928A0564f2525i01j61893
18714a62794B911g2923A58374B642d109A58029d18347d1404k6570B30822c6943
18702e1971B6625a59235C18989r9787b23221B1981j76J6269d30671A06806Q9476
18691A96282d4961A03670A8793c17047R9526J00618m4610M3787A0400P23a64633
18679a31936A24687f3345b4923B9495a32267N738b9008B77408A9974M6403k7542
18668C8835a86742B03119a53666M8416A13585a88051f7821C7181b01701A78631
18657b33703E1643j3956a93378A03830R654B5000o843M7880i3767I583J6209b25587
$$ y = [-85908, 80542, -33881, -133291, -143275, -24324, 269537, 18466, -41819, -44885, -192059, -55332, -352887, -139533, -31591, 102322, -462982, 50530, -73421, 104928, 10564, -62525, -901, -162794, 2911, -72923, 158374, 2642, -4109, 158029, -418347, -41404, -67974, 230822, -36943, -51971, 26625, -159235, 318989, 219202, -223221, 21981, 21805, 38074, -430671, 106806, 196282, -44961, 103670, 18793, -317047, -217521, -116903, -161513, -117726, 10400, 11123, -164633, -131936, 124687, -63345, -24923, 29495, -132267, -126529, -29008, 277408, 19974, 66377, 38835, -186742, 203119, -153666, -105250, 113585, -188051, -67821, 37181, -201701, 178631, -233703, 51643, 37687, -193378, 103830, 113484, 25000, 18157, 66037, -93767, 9583, 25792, -225587]
18644h1836k27455d7444j09170J288k44205a49818B15524c1939j51990j63754
18634c47683c5376k6781l631i111B5975h6177A60295N8653e1517j88423c0341
18622B8588a02331q9050E1150M0763K26042g6902H7225a43943H6874J11358a30171
18610A32115A2718b24187E6089a51192n3409O4327c0955A6776a32276c1819o7399
18599i9218L3754j56468h5996k30158J19993q386m0595d3570H5381B7621P6245
18588A03866f3325m4420k9404C25281f4619k2398F2371a22024C1891b89565r2315
18577c81880e8460B8059d1804A0403h1248b2815p2628C5846J8022c0740j1127
18566d1867A1434h8111A16395J61434b3502M396D1919a08390J9688j53396A91162
$$ y = [-81836, -309291, -47444, -156614, -155326, -399531, -149818, 215524, -31939, -183929, -347683, -35376, -62157, -65788, -9111, 25975, -86177, 160295, 218948, -51517, -239940, -30341, 28588, -102331, -191381, 51150, 91913, 317955, -76902, 87225, -143943, 86874, 198232, -130171, 132115, 12718, -224187, 56089, -151192, -204601, -140274, -30955, 16776, -132276, -31819, -99218, -65464, -221932, -85996, -316154, -196161, -204547, -245142, -43570, 85381, 27621, 103866, -63325, -107745, -137149, 325281, -64619, -87017, 62371, -122024, 31891, -289565, -381880, -58460, 28059, -41804, 10403, -81248, -22815, -95443, 35846, 53868, -30740, -41867, 11434, -88111, 116395, 277829, -23502, -19106, 41919, -108390, -88702, -242098, 191162]
18554g5937E257J51976n812O0871a25734A1544J7153R8133a52223B03731c7535
18542a68045G0364b43965A1974J05460e2270j6634n5445a0894l69358g614k43987
18531b51601A8755c41679J02985g6182j36999D0793b20218J0862C3780c56808
18520A60343C8801h5334o4681k9747F3696M8152f2896d609l6795m227C9390C549
18507b25723a2395j04520B4525i4797k34190j7828A99800D6174A5052b11621J120
18496b10501i2541n4969B34a32516B59851b5471B19911a24604f2257A71257b13874
18484a74127C024h6545l94B00418b46635J3993B99210q2603a08365k30219d2056
18472d6626l37567R2417A39192c51466a47051P1761j30584D3152j4791K35907
$$ y = [-75937, 5257, 157233, 151421, 212292, -125734, 11544, 28697, 126830, -152223, 203731, -37535, -168045, 70364, -243965, 11974, 117434, -52270, -68904, -124349, -10894, -380252, -7614, -251601, 18755, -341679, -238694, -76182, -213181, 40793, -220218, -209356, 33780, -356808, 160343, 38801, -85334, -150015, -179762, 63696, 111848, -62896, -4609, -41404, -45631, 39390, 3549, -225723, -12395, -116915, 24525, -94797, -328987, -346815, 199800, 46174, 15052, -211621, -210501, -92541, -147510, 234, -132516, 259851, -25471, 219911, -124604, -62257, 171257, -213874, -174127, 3024, -86545, -86939, 200418, -246635, -232642, 299210, 216607, -108365, -338584, -42056, -46626, -384193, -291776, 139192, -351466, -147051, -75290, -205874, 43152, 28361, 264268]
18462B64268C3843K6689k5968K30471I9332l4424l1167h7859A38642c94034d7206
18450b2905j60771Q8934l86699K21130L4531g7678C6424a32736q2683g2628A74920
18438a58210g4964G7822a25708n2840I7461e6967J0321A81022a74657c6876A40142
18426D8684a74A4403a06632C0995e2037j69242d8219A53671a89073O9131n1903
18415a71845A16098P5468F7046c62745c9720n0643j10521j5918k1055o0399D8298
18403b63120L1869b38l1212k7231B3740I359b054k9474l04255K0705E3412R8127
18391A51539b07147g7689q7087m9529e0374B44859i7379M7859i366k12315k3718
18380b45399J16419j87510k407B50357C4367h1758j84175B5359b37972q31B8147
$$ y = [264268, 33843, 60532, 34564, 265035, 99332, 64908, 33741, -87859, 138642, -394034, -47206, -22905, -183676, -94742, -481441, -260311, -225780, -77678, 36424, -132736, -215419, -72628, 174920, -158210, -74964, 77822, -125708, -178548, 97461, -56967, -46646, 181022, -174657, -36876, 140142, 48684, -174, 14403, -106632, 30995, -52037, -221279, -48219, 153671, -189073, -119942, -171845, 116098, 191566, 67046, -362745, -39720, -90363, -200884, -216802, -237857, -298256, 48298, -263120, -231251, -238, -31450, -58681, 23740, 9359, -2054, -31528, -335783, -315078, 53412, 151539, -207147, -77689, -164776, -214305, -50374, 244859, -97379, -49520, -9366, -221681, -245399, -128980, -316490, -318897, 250357, 34367, -81758, -265933, 25359, -237972, -238803, 28147]
18368H2810a24796K0302j42896I9200m9458M2175i8398F8287J73016e838k19098
18357b24936B43052a10555j43144I5590c04320B81155j38204d5761r6773C19959
18346d8672A82476b90701a36294B95130j42947a09049G2845j2665J41827d3396
18335a41889A52386a3604n6877a4300j01086l454C46389A69540F456P7246J85791
18324B69493c8080J4745j08684A81041a68910q4595G4322f6888q1848c5113A14980
18312a38834Q497A05117J01530C8699M1715h3497j31203G9044b26056q1330J42151
18301a65235A4288a14316A53944d7528F9209d1661j47981F9185c55039B8601a28278
18289a51911A79750b54678A29431L5c07333C4834b17535A1247L50556b69226A21669
$$ y = [82810, -124796, -104494, -247390, 99200, 49742, 91917, -98398, 68287, 241303, -5838, -224936, 243052, -110555, -253699, 95590, -304320, 281155, 142951, -45761, -142534, 319959, -48672, 182476, -290701, -136294, 295130, 152183, -109049, 72845, 60180, 202007, -43396, -141889, 152386, -13604, -70481, -14300, -115386, -118840, 346389, 169540, 6456, 83702, 269493, -38080, -23335, -132019, 181041, -168910, -253505, 74322, -66888, -148736, -35113, 114980, -138834, -130337, 105117, 206647, 38699, 80414, -83497, -214700, 79044, -226056, -307386, -165235, 14288, -114316, 153944, -47528, 69209, -41661, -189642, 69185, -355039, 28601, -128278, -151911, 179750, -254678, 129431, 129466, -307333, 34834, -217535, 11247, 361803, -269226, 121669]
18277b30793Q2538C76695a01424E5167a34205E9783J13402a33328f0646a2862
18266A72465J1994d4106D7211a45866a5874P349G8741i6833J3352k0466P085A84059
18253a87512E0297f0220k9340j5534G0231b34966j57858K3789a2303A10637a91696
18241A07368i0132A964c3898B4277a36941B05251K7550c1837B76402c06754B3141
18229a74151q0493J05823B37592h2984L4303k31109d0336j82408A94771G1863
18218b66684d7801k70692A13103E219e4871j56809B77814A07887R0809a29939
18207d9745I9260c8934F0865K294d2249A38243n1122R4242e9151B60390b03518
18195D3588b46342H372a6060q5691I1815D3567b6725p6528o3657f9459p8148j88949
$$ y = [-230793, -148255, 376695, -101424, 55167, -134205, 59783, 173185, -133328, -60646, -12862, 172465, 184459, -44106, 47211, -145866, -15874, -8525, 78741, -96833, -83481, -103947, -96862, 184059, -187512, 50297, -60220, -89560, -105094, 70231, -234966, -392824, -369035, -12303, 110637, -191696, 107368, -90132, 1964, -33898, 24277, -136941, 205251, 232801, -31837, 276402, -306754, 23141, -174151, -254644, -148821, 237592, -82984, -48681, -279790, -40336, -222744, 194771, 71863, -266684, -47801, -318493, 113103, 5219, -54871, -211680, 277814, 107887, 198696, -129939, -49745, 99260, -38934, 60865, 63159, -42249, 138243, 87121, 181363, -59151, 260390, -203518, 43588, -246342, 8372, -16060, -101751, 91815, 43567, -26725, -103253, -166910, -69459, -147607, -336556]
18183c36556J45725j74328J77632M0377f2075j19693e5462C0877N9640m4584a99825
18171a50461G3481a46964e9118F4394a9991E5210d6549r0375c7547G3942a66737
18159a72209b7502A17755A330K34682i9856j3937B28979d28213e656b825E5566
18147a71233B04296d4181A0787g3298p8846c2737l11779I0570k2900c1119J5007
18136a6112I3816e2970I2850K19311H0637J9084C359N6633b28701g0564m8110
18125a18674O331j15782J08023G1674c08863f3572a9124A87585h55r8823F3922
18113A09287L2695a40617C9094a6097B9614b75012D6762j0551c43700n5697B01477
18101A45931b9897k25437A01134a89060F2048P4985e5672e933k38512b8019j1497
$$ y = [-336556, -190831, -365159, -187527, -147150, -62075, -181768, -55462, 30877, 90517, 45933, -199825, -150461, 73481, -146964, -59118, 64394, -19991, 55210, -46549, -136924, -37547, 73942, -166737, -172209, -27502, 117755, 1330, 236012, -99856, -113793, 228979, -428213, -5656, -2825, 55566, -171233, 204296, -44181, 10787, -73298, -152144, -32737, -344516, 90570, 67670, -31119, -16112, 93816, -52970, 92850, 312161, 80637, 99721, 3359, 59992, -228701, -70564, -118674, -112343, -228125, -120102, 71674, -308863, -63572, -19124, 187585, -855, -99678, 63922, 109287, 141982, -140617, 39094, -16097, 29614, -275012, 46762, 36211, -343700, -399397, 201477, 145931, -29897, -255334, 101134, -189060, 62048, 137033, -55672, -5933, -244445, -28019, -39516]
18090c9516G7951L3384c22046C6266a30027K9415b2374D5386a94655P5636A29322
18078d61559A27266a27953j11908B7331L55704D5614F866f8022E5196b00993A12792
18066F4573K98525A54944a57845j34952A04166J5364a2786H088g8836c7988G765
18054a1708C5822E803J81395a28626n6437A76461k053q0434c8176A4818b73017
18042E2858c53703e5582A99528a42425k001I6570j3712b34612c6836a3831A02206
18030a66547m4713A29757P0207a2754j80811A9619a67198O3441j87789a9492C5110
18018c9090k13003R0076b1134A04261a008B1171J25447a88431c087F7209b016
18006i1170M1720j28115d2643J3776G731c17366P6506A62248B0980Q2794K9001
$$ y = [-39516, 77951, 111335, -322046, 36266, -130027, -100612, -22374, 45386, -194655, -119019, 129322, -461559, 127266, -127953, -239861, 27331, 383035, 45614, 6866, -68022, 55196, -200993, 112792, 64573, 363098, 154944, -157845, -292797, 104166, 119530, -12786, 8088, -78836, -37988, 7765, -11708, 35822, 5803, 187198, -128626, -185063, 176461, 174408, 93974, -38176, 14818, -273017, 52858, -353703, -55582, 199528, -142425, -144426, 96570, 82858, -234612, -36836, -13831, 102206, -166547, -211260, 129757, 199964, -12754, -193565, 19619, -167198, -103757, -291546, -19492, 35110, -39090, -252093, -162017, -21134, 104261, -1008, 21171, 146618, -188431, -3087, 67209, -2016, -91170, -49450, -177565, -42643, -28867, 7731, -317366, -240860, 162248, 20980, 103774, 132775]
17995A32775P2295F7623b98682J26963B37784a81887M9209A31648i22n9062k3012
17984h2996c8371B26906b79507h5370A13456a17212N4492A95208G4686J13683
17974A88369J70666A08048l9760k6899b4494B0925c3440E4467J10829M9059j02863
17963A11492b94072O0569o9487M1099A06501j8366g8166A77474a38559k4300A64252
17951I8912A5838J74759m2608a29112O169G097a88025e9122a9197C52342g440
17939B9072K78555A07869a33870D2228L6359g6365L8076C06487b631G5203e2842
17927C59967A40687E5928M4939b42522B27363a43916R627O885A0487a76778g416
17915a59984F814g5191H6585a95556I4824c6688o1497j74053A56900p0422h822
$$ y = [132775, 205070, 67623, -298682, -171719, 237784, -181887, -132678, 131648, -922, -59984, -82996, -38371, 226906, -279507, -85370, 113456, -117212, -62720, 195208, 74686, 188369, 359035, 108048, 68288, 41389, -24494, 20925, -33440, 54467, 165296, 214355, 111492, -294072, -233503, -302990, -261891, 106501, 88135, -78166, 177474, -138559, -162859, 164252, 98912, 15838, 190597, 147989, -129112, -122943, 7097, -188025, -59122, -19197, 352342, -7440, 29072, 307627, 107869, -133870, 42228, 78587, -76365, -38289, 306487, -2631, 75203, -52842, 359967, 140687, 55928, 100867, -242522, 227363, -143916, -134289, -127404, 10487, -176778, -7416, -159984, 6814, -75191, 86585, -195556, 94824, -36688, -98185, -272238, 156900, 86478, -8822]
17903E8844c18644A9487a61525A59687a75703D2913J3830N8614L7016g1894m7665
17892a19559B87b05685j07226F3021J35232n705a50226e2038A64158d6485A18756
17880I3427m0866e4134A4805N8573h3318L9051I7880d882j9700k13560h925k32254
17868b41179J16612d3585o583F3291J44034c17301A77563q3313a32333F8667e4867
17856H9196N5837a03596A68282C1056f7998K864F3237d2417l18895A59797l0409
17845A29388N8007d02940a63758A17032b08749g0526K3882A72483l164a14831
17834A03353a34367A21327e6769j49763q9538A54378n4683J157b1779n7544D0245
17822A66272b54682C2869J53369c1591A13713e1519L622A99079G8619N944K5508
$$ y = [58844, -318644, 19487, -161525, 159687, -175703, 42913, 56743, 115357, 152373, -71894, -119559, 287, -205685, -312911, 63021, 198253, 192548, -150226, -52038, 164158, -46485, 118756, 93427, 52561, -54134, 14805, 73378, -83318, -44267, 97880, -4882, -24582, -238142, -8925, -241179, -124567, -43585, -50168, 63291, 207325, -317301, 177563, 94250, -132333, 68667, -54867, 89196, 145033, -103596, 168282, 31056, -67998, -65134, 63237, -42417, -361312, 159797, 129388, 187395, -402940, -163758, 117032, -208749, -70526, -46644, 172483, 169319, -114831, 103353, -134367, 121327, -56769, -206532, -296070, 154378, 99695, 100852, -21779, -79323, 40245, 166272, -254682, 32869, 186238, -31591, 113713, -51519, -47897, 199079, 78619, 84563, 110071]
17811A10071c2300G8152J29308r5287N6947b04047f9895d429B46207I3386a2741
17799A6208a25062C03699j41045a9227A02093g9299j73948a08375A07479E0219
17788d1493k32263c9435A27183f3576A57072o7817O2208a12727H624b20802a9269
17776A3184b440r315D2667e7092J8872E7148a51027D6031b18832J00799c8321
17764D5161G954M04708G233K8429I568c00016J14284c9973j03332C19861a3403
17752F225c93951a60661B47058I7620N2855D8961N1342a45768j67648B65389H5729
17740B35469a45633j78826A05778K14246b2241A52950a91177C57693a54119G826
17729A24322b29364A3197e0524G3592J06442E3950K47680D4258A3128K09401A6178
$$ y = [110071, -32300, 78152, 207460, 112173, 169120, -204047, -69895, -4429, 246207, 93386, -12741, 16208, -125062, 303699, 162654, -19227, 102093, -79299, -253247, -108375, 107479, 50219, -41493, -273756, -39435, 127183, -63576, 157072, 89255, 151463, -112727, 8624, -220802, -19269, 13184, -2440, -11755, 42667, -57092, -38220, 57148, -151027, 46031, -218832, -118033, -38321, 45161, 7954, 412662, 7233, 35662, 9568, -300016, -185732, -39973, -143305, 319861, -13403, 6225, -393951, -160661, 247058, 97620, 150475, 48961, 100303, -145768, -313416, 265389, 85729, 235469, -145633, -324459, 105778, 320024, -22241, 152950, -191177, 357693, -154119, 7826, 124322, -229364, 13197, -50524, 73592, 180034, 53950, 301630, 44258, 13128, 222529, 16178]
17717B93727b02907E8508a07759M1724D30913a15588b2315F238b61270A25428
17706A484d1496l2833A01767b54982A51674J2268b42273F8529J90496b515B3485
17694C78443c5433A16303g0768j62263a11102G672g0469A13088K39787J3457C1564
17682h9032B58439e0902F9378b91541A81474G3761i1117m3106B15674A01015d5963
17670a8875k6353B5569b53401A3331e2394B76743f7470m3424A20921a54620n4934
17659b09554B12973a02787A00072L22681A6664K22714A3478L46343o3280j37307
17649A59234e532A25089b13550e1502E31568b55657H0454b32268I6487a20825
17638a62150B73482a93098I8972e2650q5109f5852B06779a21791j12999C05935
$$ y = [293727, -202907, 58508, -107759, -66035, 430913, -115588, -22315, 6238, -261270, 125428, 1484, -41496, -74329, 101767, -254982, 151674, 163942, -242273, 68529, 259025, -2515, 23485, 378443, -35433, 116303, -70768, -233031, -111102, 7672, -70469, 113088, 352875, 366332, 31564, -89032, 258439, -50902, 69378, -291541, 181474, 73761, -91117, -134223, 215674, 101015, -45963, -18875, -45228, 25569, -253401, 13331, -52394, 276743, -67470, -110894, 120921, -154620, -209554, 212973, -102787, 100072, 422753, 16664, 239378, 13478, 359821, 296541, 159234, -5532, 125089, -213550, -51502, 531568, -255657, 80454, -232268, 96487, -120825, -162150, 273482, -193098, 98972, -52650, -137759, -65852, 206779, -121791, -234790, 305935]
17627A51137b89038J29539d8310A43448J09957b09658A04838k1755a60722d0349
17616a01438E9058b36971d2678p7800b8868A65885a6573A30262c1293j48539j84964
17605c64796H1409a73321A6668f7759A70605J90209C5483J97077a3280D64106
17594I6080b57302C55013A33291f636I938d9859r048B397e647n407r9869E4351
17581a29862J2828A15158J304b23344A40074f936B15182J24057A29807n8083M6407
17570A18131a93690j24121a35344A20964e7429F1572L01175A74122f1697J7952
17560d3745A07794n0629f1960k53825C1816Q9673C5332J86554E9321P5649L249
17549A38219a88648C30212a6596C92804A9244b25551m5732l7932B74243f8041
$$ y = [151137, -289038, -159499, -48310, 143448, 253405, -209658, 104838, 83083, -160722, -40349, -101438, 59058, -236971, -42678, -120478, -28868, 165885, -16573, 130262, -31293, -179832, -364796, 81409, -173321, 16668, -67759, 170605, 360814, 35483, 232560, -13280, 464106, 96080, -257302, 355013, 133291, -6636, 9938, -49859, -58907, 2397, -5647, -11054, -110923, 54351, -129862, -117034, 115158, 116462, -223344, 140074, -6936, 215182, 339239, 129807, 71724, 118131, -193690, -317811, -135344, 120964, -57429, 61572, 362747, 174122, -61697, -43745, 107794, 57165, -61960, -315785, 31816, 121489, 35332, 221886, 59321, 134970, 138219, -188648, 330212, -16596, 392804, 19244, -225551, -271283, -309215, 274243, -68041]
17538A60310p2344c3967B73954r4688G8014i350B19106B339a25449A08930e0002
17526B69061E0939h130B54642B721K83565q265I5227K7812C0565K05689o9971
17515A66283J67621l6403H4323K31283a2112F47337B24025j7553e2567C11337
17504E4321k1456b65805A13864C7022a73843A68044J09910o5593N2676m5505F920
17492B05686H1815J51817A09237K30033F6460i7531A8556J28819J48988B7854
17481B34499j4259g544r7195I1280Q6360J73533a27248B8319J65381l5315j8980
17470A39405f1379C13336A22494c23896D4457L65517G3794N2778K28983A75814
17459a5173A1049g683B25096b188B5894K10808N1508j9450E5312g492B25942d6777
$$ y = [160310, 87966, -33967, 273954, 179266, 78014, -9350, 219106, 2339, -125449, 108930, -50002, 269061, 50939, -8130, 254642, 2721, 286286, 278021, 95227, 123039, 30565, 236254, 166283, 333904, 297501, 84323, 315606, -12112, 647337, 224025, 206472, -52567, 311337, 54321, 32865, -265805, 113864, 37022, -173843, 168044, 277954, 212361, 265037, 219532, 6920, 205686, 81815, 233632, 109237, 339270, 66460, -97531, 18556, 147375, 296363, 27854, 234499, 220240, -7544, -104739, 91280, 177640, 351173, -127248, 28319, 193700, 158385, 139405, -61379, 313336, 122494, -323896, 44457, 409974, 73794, 126572, 355555, 175814, -15173, 11049, -7683, 225096, -2188, 25894, 236702, 288210, 268760, 55312, -7492, 225942, -46777]
17446E6491P252K24960k6693L0237a40572D35864j68675J65998A45473g7793B26084
17434I5037c6552B54861a21794A48597G2261A7737J49354J08201G7022M54755
17424E31777j78173o4915E5651a06267D09769I0067K7723e3655B32524C9854K83588
17413C23442a25122B92458q8290O5903D2768J18479l0026n1838A0713J91027J44056
17402C45796C5292K24521J808b4843C29269j55879j1303P0294C1523K36605k7250
17391B40878A12328J50772b33598A06717A2911L14095A18070R0410E5960O238
17381F2198P5891D8876a41254B20447A1874K39555n6039O7300A5963K45497B5214
17369E9615K45807h9559B1288J64862A6587K0150N65608A56415P0646L216J9131
$$ y = [56491, 63743, 288703, 262010, 292247, -140572, 435864, 267189, 433187, 145473, -77793, 226084, 95037, -36552, 254861, -121794, 148597, 72261, 17737, 167091, 275292, 77022, 531777, 353604, 288689, 55651, -106267, 409769, 90067, 117790, -53655, 232524, 39854, 323442, -125122, 292458, 204168, 270071, 42768, 161247, 131221, 79383, 10713, 201740, 345796, 35292, 259813, 261621, -24843, 329269, 173390, 162087, 232381, 31523, 268128, 240878, 112328, 263100, -233598, 106717, 12911, 327006, 118070, 208480, 55960, 62198, 138089, 48876, -141254, 220447, 11874, 251429, 195390, 262690, 15963, 261460, 25214, 59615, 305422, -89559, 21288, 186150, 16587, 36737, 602345, 156415, 227061, 230277, 249408]
17358B49408k4792k1241J826o313k3883n3169K1967E6782K06719b05077A46195
17346A23645a62064G1197J18626J819D0257L32689A36141b80565R0622B54175
17335D35723B4444K49930A35755d1717A11062K14508J00578A63539c2706A04598
17324b8491A73068O7462A18084L36855A5720J85777I6375Q2665e0032C85624C5626
17312A0929b10228H4630h1839B57106A16039m8524M981l4778e7530A70569O1228
17301B31797k8494D7316K08604H7351a8731l9278A24K73011A29348B9358Q0591
17290A09949K46933Q3425I7328L2297m5491J15329r5384J58045D5844M60569a78076
17278a17003F40219k75846J60329c3678B57671k4895e9753C08286j32069L6149
$$ y = [249408, 224616, 203375, 205201, 198888, 175005, 121836, 143803, 56782, 263501, -205077, 146195, 123645, -162064, 71197, 189823, 191642, 40257, 372946, 136141, -280565, -189943, 254175, 435723, 24444, 274374, 135755, -41717, 111062, 325570, 426148, 163539, -32706, 104598, -28491, 173068, 240530, 118084, 454939, 15720, 201497, 96375, 179040, -50032, 385624, 35626, 10929, -210228, 84630, -81839, 257106, 116039, 67515, 72496, 37718, -57530, 170569, 231797, 203303, 47316, 255920, 87351, -18731, -58009, 124, 273135, 129348, 29358, 109949, 356882, 440307, 97328, 129625, 84134, 199463, 104079, 262124, 45844, 506413, -178076, -117003, 640219, 364373, 524702, -33678, 257671, 232776, -59753, 308286, 176217, 212366]
17268B12366K67585I9607K80070l8161A24365J66493J09442j33216j00308k7621
17258A39155A360a18240D12267b6728A59158j4598K21506A41861P9590p8476K81464
17247D24439j84466H3954L34827A27928J639J29734E4003b4650B13497J9433n5427
17236A77503l1226f2776A32713J3921e1639B64200c52035A82902n5490J37667
17226B65079j28116J37306j11587f1094A42375l7354L62701A76642l2907e7994
17215C91947Q7527m1199P78B12473n7136l3798b8678B67711E2520L32481A82510
17203B5007L07588I6647B2418K99018j22389R4258O4073o2422K025k1136R6604
17192C72449j04493A07193K37246A18467L20529A3228K52261J0277l5410Q1982
$$ y = [212366, 479951, 99607, 379677, 341516, 124365, 290858, 400300, 267084, 166776, 139155, 1360, -118240, 412267, -26728, 159158, 144560, 366066, 141861, 221451, 142975, 424439, 239973, 83954, 418781, 127928, 129567, 259301, 54003, -24650, 213497, 232930, 177503, 146277, -62776, 132713, 146634, -51639, 264200, -352035, 182902, 127412, 265079, 136963, 274269, 162682, -61094, 142375, 105021, 467722, 176642, 143735, -57994, 391947, 479474, 438275, 439053, 212473, 155337, 121539, -28678, 267711, 52520, 385001, 182510, 25007, 332595, 96647, 22418, 321436, 199047, 293305, 357378, 294956, 296981, 275845, 372449, 267956, 107193, 344439, 118467, 438996, 13228, 265489, 275766, 240356, 322338]
17182C22338j31535L01099A5502M3296K70403r8166H6422M95067A85553L29841
17172E15394B05810K12185j87968I8195J97755q0647M8034M18603B65840I6280
17161D93003j21287F1551N77268e1171C22231J8808O8278r4193M5100j1091J53950
17150E03083B32877J34068K531J73399r1314j45905N872n1020l9048M42557k86777
17139C77240K76841k30647o4060j55776Q9731O2966K2481j22522O592A4628K81147
17128B95775N96265m43563K0196O1651k18026j17469H3704J8567M55238k05736
17118C51773K48724H8934K97658j48057L31369q9807j21491M81988C04944A27597
17107D63226l3331P7279N9750k39025l3009P2092L6524L09408o8411k26924N00355
$$ y = [322338, 190803, 491902, 15502, 58798, 329201, 231035, 86422, 581489, 185553, 515394, 205810, 417995, 230027, 98195, 295950, 215303, 263337, 681940, 265840, 96280, 493003, 371716, 61551, 638819, -51171, 322231, 341039, 409317, 315124, 360224, 349133, 503083, 232877, 366945, 369476, 542875, 451561, 305656, 311528, 260508, 221460, 664017, 377240, 654081, 423434, 359374, 203598, 293329, 356295, 378776, 256254, 262846, 14628, 295775, 892040, 448477, 468673, 530324, 312298, 194829, 83704, 102271, 557509, 351773, 600497, 88934, 386592, 238535, 569904, 480097, 358606, 840594, 304944, 127597, 463226, 429895, 507174, 566924, 327899, 294890, 366982, 403506, 712914, 644503, 417579, 917934]
17096I17934C20173R6974J12101k707j05914m4733J10245m4369r1525K8097R8628
17085D76970L02770l43356q4130j57372M86802l36256M2997j12265K98377A65097
17074G10446A50078J59092L34415k14607J43642N0028J38550k65603P815m5288
17064D58122Q1924P7891J10919k94443J19515J7415J6028n577J44380K2454k93601
17053D55027K47172J27808k14854l948J18816j1454j5214j35379K34985L7618
17043H40577l51085P727J26262n4310O7462O000j9642k52991L48712L04458C96508
17031F58723k7559J2055j43175L13927O7934J18009k78005p8709K1884j06595
17021E58489K72499j44562k31900J54407J6474L17171m13424K48931M9803j379
$$ y = [917934, 320173, 417147, 529248, 526541, 420627, 375894, 486139, 441770, 350245, 378342, 476970, 779740, 436384, 352254, 194882, 681684, 345428, 388425, 276160, 574537, 165097, 710446, 150078, 309170, 643585, 428978, 572620, 622648, 761198, 495595, 503410, 458122, 540046, 617937, 728856, 434413, 553928, 571343, 587371, 581794, 726174, 748628, 455027, 702199, 830007, 615153, 611205, 730021, 718567, 703353, 567974, 802959, 840577, 489492, 497219, 623481, 569171, 636633, 642633, 622991, 370000, 718712, 1023170, 396508, 658723, 631164, 643219, 500044, 813971, 881905, 999914, 721909, 643200, 665084, 558489, 830988, 686426, 454526, 608933, 625407, 942578, 529154, 778085, 827888, 826509]
17011H26509j34512P5678K61005k36488J28074j13402l77573M13081j93431l166
17001F45775j7060J87521Q7277q2971N1306J35681L9759k93583j52811M99863
16991A100757k79179J9194J09701J88814l84039J36129N0643j62519J67471n4139
16981H92833j25822O22333m83244r3638M09863j96691L17878k72963q2593K01123
16971A189079k31300K22105n7139J27709j52356m3437j46503K45857Q095j84771
16961I77339J98991j80272K86784j5950l12500Q2195M4194L98164n09613N16798
16951A486130k60329o8824J9116p0890L86734M534j65858l05377J86551M4152
16941A255939l805J78007l03041J97257N1198L60828m38097K07992k16287M06996
$$ y = [826509, 691997, 767675, 1028680, 792192, 920266, 806864, 429291, 842372, 648941, 645775, 628715, 816236, 903513, 820542, 871848, 1007529, 1047288, 753705, 600894, 1100757, 821578, 840772, 950473, 1139287, 755248, 891377, 942020, 779501, 946972, 892833, 767011, 1389344, 906100, 812462, 1222325, 1025634, 1343512, 1070549, 987956, 1189079, 957779, 1179884, 1122745, 1250454, 1098098, 1054661, 908158, 1154015, 1162110, 977339, 1176330, 996058, 1282842, 1266892, 954392, 1036587, 1080781, 1478945, 969332, 1486130, 1225801, 1156977, 1176093, 1105203, 1491937, 1496471, 1330613, 1025236, 1211787, 1255939, 1252134, 1430141, 1127100, 1324357, 1375555, 1736383, 1298286, 1506278, 1289991, 1696987]
16931A696987k94129K19367k05114J15389K65699j00510k89967p8961J20794K77876
16921A727431j12290R6507k06622M52932j95701p0831J21780M0646r4897K03188
16911A962143j31706l28253K53077K56291m8265J00234J26514j5900n40316L56585
16901A990404J96801j16436j1110J33873P9418j23854L87784m80973J07917Q5295
16891B249119q0466J36640R9686k05966L18133M2740J77355m04194N28847j37283
16881B724611K08378k53407q8790K70530j66025M1469K56639j46736J15904r9909
16871B862664J73962N6331k1186N2856J11931O861K41629k26635K28323l74684
16861C112052K72122l54001L71469k8061J62363j4774L50030m6951J64068k47676
$$ y = [1696987, 1402858, 1622225, 1417111, 1532500, 1798199, 1697689, 1407722, 1328761, 1449555, 1727431, 1615141, 1711648, 1505026, 1957958, 1762257, 1691426, 1813206, 1853852, 1758955, 1962143, 1830437, 1502184, 1755261, 2011552, 1963287, 2063521, 2190035, 2174135, 1633819, 1990404, 2187205, 2070769, 2059659, 2193532, 2272950, 2149096, 2536880, 2055907, 2163824, 2249119, 2168653, 2305293, 2404979, 2199013, 2517146, 2559886, 2737241, 2333047, 2861894, 2724611, 2932989, 2679582, 2590792, 2861322, 2695297, 2736766, 2993405, 2846669, 2962573, 2862664, 3036626, 3092957, 3071771, 3124627, 3236558, 3243419, 3485048, 3258413, 3486736, 3112052, 3384174, 3030173, 3401642, 3373581, 3535944, 3521170, 3871200, 3824249, 3988317, 3740641]
16851C740641N00459k57778J67858n2515m33K97999m3549j91301L15718m7836
16841D429263L30104k12376M16284m76980Q56246l19204K83968j95574K09148
16832E320879M58357k53455k56391N51055o5145M52367k73948J28098P9584L93098
16822F534499j62506J63772J2520N01664j04557p8518J42268N4992M45701p1417
16812G438418J89327K12266P6067L11665N362O60258k79706J85288P59757l3184
16802I525518j12719M39565K39063M28019J11406J87512R1649K85901O22029L67876
16792A2185819J83403J03153P5880J32548M13807Q56987k16033P97788L19468
16783A4852820L53834N56773M16026L14684N89282L09222N88727O29493M15990
$$ y = [3740641, 4241100, 3983322, 4151180, 4098665, 4098232, 4396231, 4352682, 4161381, 4477099, 4429263, 4759367, 4546991, 4963275, 4486295, 5342541, 5023337, 5307305, 5111731, 5320879, 5779236, 5525781, 5269390, 5820445, 5755300, 6207667, 5933719, 6061817, 6141401, 6534499, 6371993, 6535765, 6548285, 7049949, 6945392, 6866874, 7009142, 7064134, 7509835, 7438418, 7627745, 7840011, 7916078, 8227743, 8233105, 8893363, 8613657, 8798945, 9558702, 9525518, 9412799, 9852364, 10091427, 10519446, 10630852, 10818364, 10910013, 11195914, 11817943, 12185819, 12369222, 12472375, 12548255, 12680803, 13094610, 13951597, 13735564, 14533352, 14852820, 15206654, 15763427, 16179453, 16494137, 17083419, 17392641, 17981368, 18610861, 19026851]
16774A9026851J033640O56634L91088N65855P79051O84108Q04789P33007Q38231
16765B5513254Q02035J154373Q35017J027910J098236R30721J167908J151672
16757C3681126J366563J474631J114709J402885J443561J623800J720382J775584
16749D5603241K131027J537644K015479K294278J826403K803829K434080K201699
16741F2847680K399928L207712K423012L080132K943205K658153L374943L079302
16733H6014067L142328L339638L278760L178345L249243K926009K682557K612930
16725A10423877K744728K586052J966780J512039J704536R31352Q85945K6612
16717A22781921M43858q39514n01172j177414j361370k246772k145664k481412
$$ y = [19026851, 20060491, 20717125, 21108213, 21674068, 22453119, 23137227, 23942016, 24675023, 25513254, 26315289, 27469662, 28304679, 29332589, 30430825, 31361546, 32529454, 33681126, 35047689, 36522320, 37637029, 39039914, 40483475, 42107275, 43827657, 45603241, 47734268, 49271912, 51287391, 53581669, 55408072, 58211901, 60645981, 62847680, 65247608, 68455320, 70878332, 73958464, 76901669, 79559822, 82934765, 86014067, 89156395, 92496033, 95774793, 98953138, 102202381, 105128390, 107810947, 110423877, 113168605, 115754657, 117721437, 119233476, 120938012, 121869364, 122755309, 122781921, 123225779, 122386265, 121885093, 120707679, 119346309, 117099537, 114953873, 112472461]
16709A12472461k585627k720728k740820l343850k988800l128452l353470k977798
16701H8632916l506791k836958l363199k883040l241080k215853l511762k368110
16693F4706123k139760k889056k136345k419726k220669j771365k050363j865900
16685D7212939j924549j644183j835567j352815j687060j415593j170772j235865
16677C4946535j629619r33399r67831j026215j545615q94205m83945j228035o28782
16668B5608889p77011p81631j226409k54156q03389r14509k90835n92194p41755
16659A9227000k89567n23080n71565n80042m25309n80296o73046R9077n03596
16650A5179576l86776l06773n52935l41419l29722k62066l64375m03928l99313
$$ y = [112472461, 109886834, 107166106, 104425286, 101081436, 98092636, 94964184, 91610714, 88632916, 85126125, 82289167, 78925968, 76042928, 72801848, 70585995, 67074233, 64706123, 62566363, 59677307, 57540962, 55121236, 52900567, 51129202, 49078839, 47212939, 45288390, 43644207, 41808640, 40455825, 38768765, 37353172, 36182400, 34946535, 33316916, 32383517, 31415686, 30389471, 28843856, 27949651, 27465706, 26237671, 25608889, 24831878, 24050247, 22823838, 22569682, 21766293, 20851784, 20560949, 19968755, 19227000, 18937433, 18414353, 17842788, 17262746, 16837437, 16257141, 15584095, 15683172, 15179576, 14792800, 14486027, 13933092, 13591673, 13261951, 12999885, 12635510, 12231582, 11832269]
16641A1832269l40569K89316n58148m40021o5342m99298j1629k12885j3384m65504
16631I514805k59508O3107k91277j93173j8815l55807j59434j16416l04524l74406
16621G504552j19640n3531j75821p4283k48553R2301o12745K08108j85723k9136
16611F305529O994L8844k78106k1316q517j65925k55682K01083n943l52113J74345
16600E639193m45655q051p0723k75421j0213p5687j30805L4223J02791j23514
16590D636138k84149J36376j43518j45207j43517q2399K58809j62196p1009l8425
16580C960903j02003o2742j42580J58579l573l14336k16552q4503L90936k18973
16570C365156J87292j72513p1720k0882Q5793j85515k1754j23529o0600n1830
$$ y = [11832269, 11491700, 11781016, 11222868, 10782847, 10717505, 10218207, 10206578, 9993693, 9980309, 9514805, 9255297, 9318404, 9027127, 8833954, 8815139, 8459332, 8299898, 8183482, 7878958, 7504552, 7384912, 7331381, 7155560, 7081277, 6832724, 6925025, 6312280, 6520388, 6334665, 6305529, 6312523, 6351367, 6073261, 6051945, 6043428, 5877503, 5621821, 5822904, 5816961, 5464848, 5639193, 5193538, 5185487, 5114764, 4839343, 4829130, 4753443, 4622638, 4656861, 4759652, 4636138, 4351989, 4488365, 4344847, 4199640, 4056123, 3973724, 4232533, 4070337, 3999328, 3960903, 3858900, 3796158, 3653578, 3812157, 3808584, 3494248, 3277696, 3193193, 3584129, 3365156, 3552448, 3379935, 3308215, 3287333, 3373126, 3187611, 3165857, 3042328, 2981728, 2929898]
16560B929898o1486R2655o4122R594J07295l75643K11031j91459j01782J43202
16550B699183j21728j9090N8612j28184J05012n24274M76155l97406J75382K60877
16540B584539k69034K29919l16635p6864K80516k77219K22995n2981j54959J02935
16530B273212j97847j39058j41919K69234L7249r9514M5350K7035j13900k26167
16520A733675K02907j97552j60376O2220P1330O5274j42289j60077J68949j69938
16510A474123J86679j8396j74257k5739L54075j19236M5221j26784K3274k78518
16500A340442L90413m3872j69409k38826J28902n9928J32788N3807l65686k02529
16490I66102O81121j03445j52823K935k15647N7584J16530r8411K09683l5902
$$ y = [2929898, 2868412, 2961067, 2896945, 2906539, 3013834, 2638191, 2849222, 2657763, 2555981, 2699183, 2577455, 2558365, 2616977, 2488793, 2593805, 2069531, 2545686, 2148280, 2323662, 2584539, 2315505, 2545424, 2228789, 2151925, 2432441, 2155222, 2378217, 2325236, 2170277, 2273212, 2075365, 1936307, 1794388, 2063622, 2100871, 2001357, 2046707, 2073742, 1959842, 1733675, 1936582, 1739030, 1578654, 1640874, 1712204, 1777478, 1635189, 1475112, 1644061, 1474123, 1660802, 1642406, 1468149, 1442410, 1796485, 1677249, 1722470, 1595686, 1618960, 1340442, 1730855, 1686983, 1517574, 1278748, 1407650, 1347722, 1480510, 1534317, 1168631, 966102, 1647223, 1543778, 1390955, 1393890, 1178243, 1235827, 1352357, 1253946, 1463629, 1427727]
16480A427727Q4754l59453Q211J60859j2291N7472j3461o0532r2930j67070O9563
16469A102849K29775k90871P89k5033K09561l61865N18746j23652k53148P4451
16459A081602J27437k52641M01754k70590l0737k49365N00097k58257l3979J0783
16449A026104K12693q0137k81805q3397L13628j93789N9398j52570J29074j24518
16439H24681J91760k48545p5083K3137m1909L45922J29350k38452O8805m18003
16429E61663J92175L77766k31339J7284m1185L78783n36516K61546l3978k57372
16419F88827m7795L38102L5534k19909K76233l63850j50191O50O973K865K56947
16408H24386k04817N9764M3676J89531D22107K12206K97662j26328j14187P2856
$$ y = [1427727, 1512481, 1153028, 1161239, 1322098, 1309807, 1367279, 1353818, 1293286, 1200356, 1033286, 1102849, 1332624, 1041753, 1042542, 1017509, 1227070, 865205, 1383951, 1260299, 1007151, 1081602, 1209039, 956398, 1358152, 1087562, 1056825, 807460, 1307557, 1049300, 1015321, 1026104, 1238797, 1158660, 876855, 793458, 1107086, 913297, 972695, 820125, 949199, 824681, 1016441, 767896, 692813, 715950, 674041, 1019963, 1149313, 910861, 979666, 561663, 753838, 1131604, 900265, 917549, 876364, 1255147, 718631, 980177, 946199, 688827, 641032, 979134, 1014668, 794759, 1070992, 707142, 556951, 557601, 564574, 567439, 824386, 619569, 679333, 723009, 912540, 422107, 634313, 931975, 805647, 691460, 764316]
16398G64316j23187K32716j93036N2369k20327M10179l48640m9827J26932K14055
16388H65550j86714k24399J99919A98879M06666L19171n0561l19125J78267Q4013
16378H17310m9355k66664R4487J82243k64800J57405j8274C12971M46066j00584
16368F58453m6385O119k1483J36163l21601L18458j32483N0314j86141j34248
16358C27166M36356k31996Q2943M4989J10253C04414L06540n8772B58645K68921
16348E27566k58987J24661K10502j41161K3672j18631l2953J7406L69261l05849
16338D15487L50825J9051k85418B17453J73489o486R0975Q4319O2890k04473A00265
16326B10416L50813K76423k56452j93961J3280f943E40015J83041k84503o3073
$$ y = [764316, 641129, 873845, 680809, 733178, 512851, 923030, 574390, 524563, 651495, 865550, 678836, 454437, 654356, 198879, 605545, 924716, 874155, 555030, 733297, 817310, 767955, 501291, 595778, 778021, 513221, 670626, 652352, 312971, 759037, 658453, 612068, 618187, 596704, 732867, 411266, 729724, 597241, 647555, 461414, 327166, 763522, 531526, 614469, 659458, 769711, 304414, 610954, 552182, 258645, 527566, 268579, 393240, 603742, 462581, 486253, 367622, 334669, 352075, 721336, 415487, 766312, 785363, 499945, 217453, 390942, 384456, 475431, 559750, 622640, 418167, 100265, 210416, 561229, 837652, 581200, 387239, 400519, -6943, 540015, 723056, 438553, 375480]
16316C75480r8189J74068l6190J35007j729k68025K30950j53589L22652A42147
16305D46826J75282M5171l21316J97863B15286M44645j91205A07386N38525q7519
16295E58392k22086A26222K48628J34305j30095k7653L796L6800R3872k35184
16285B50691P9675J57441A68038J97169J38763k16540B3344a54489C17154m0957
16275B76197K76007m6516q3316J1150B8049M79700A82157L2990M23790D5259a90837
16263D14394q0911J23994j08586A55219F3192J43034J9313M9027J14881H0414
16252B63098J5416P5985a5678B28186J11383o1937K04998j06037n4629R8649k5456
16241C95157H1173J14502A7587K08714O2779M44518l52401l6748A13591C8872
$$ y = [375480, 277291, 451359, 415169, 550176, 548447, 280422, 511372, 357783, 680435, 142147, 446826, 622108, 667279, 345963, 543826, 215286, 659931, 468726, 107386, 645911, 558392, 336306, 126222, 374850, 509155, 379060, 351407, 355203, 392003, 485875, 250691, 330366, 487807, 168038, 365207, 503970, 287430, 23344, -154489, 317154, 276197, 552204, 505688, 422372, 433522, 28049, 507749, 182157, 215147, 638937, 45259, -190837, 414394, 333483, 457477, 348891, 155219, 63192, 206226, 225539, 274566, 389447, 80414, 263098, 278514, 354499, -15678, 228186, 339569, 277632, 482630, 376593, 321964, 420613, 395157, 81173, 195675, 17587, 226301, 289080, 733598, 381197, 344449, 113591, 38872]
16230B27733m5781l0554j6118J92406C0764M12471j58087k0960G5480L29986n3561
16219C51905A8098J70867E6185N81667A92880j8052K5105a35516A36597K84044
16209D20641j1814j82208A07056K84988b108B0062K4504P5335K49395B6592L7360
16198F3952J03272P4027b6975B87894k3444j5746A13096C8033J03522J23739n5916
16187B09378m718o8864A1426J45577M29713D2955K48471p9413k3522R7046L10715
16176E96252A38159P596f5022C49773r6329L7756j17347K84674k3911A39863o3833
16165G6030Q2739E7921K8672a80918Q0427r4867C42288D5000J42568e798k5644
16154c1442B74036j3150J05677j27458A13549f4343m8677B23562B0592J22511
$$ y = [227733, 181952, 151398, 135280, 327686, 30764, 443235, 285148, 264188, 75480, 405466, 351905, 18098, 188965, 56185, 637852, 192880, 174828, 199933, -135516, 136597, 420641, 408827, 226619, 107056, 392044, -2108, 20062, 44566, 119901, 369296, 26592, 63952, 167224, 241251, -26975, 287894, 264450, 248704, 113096, 38033, 141555, 265294, 209378, 204660, 135796, 11426, 157003, 586716, 42955, 291426, 212013, 188491, 285537, 596252, 138159, 145755, -65022, 349773, 253444, 291200, 173853, 458527, 434616, 139863, 76030, 158769, 57921, 86593, -180918, -100491, -195358, 342288, 45000, 187568, -5798, -31442, 274036, 260886, 366563, 239105, 113549, -64343, -113020, 223562, 20592, 143103]
16144A43103q474D3990J28072Q720g7839A68195J57620J63496j84130A24267J85877
16133C10144A02360K0022k9142a85434P6931a4579B35731c2843j10832A67261
16122D50906i7524D53470C4244a30548c3098j43330A57506B6657L91392a71804
16111h0074I0601J79127A04720J13424G2317C0121c0013k97395B65677D9675h2203
16099h1662B68960e2035B95878b8513n9403n4946G7367J72531c28314B5032K45830
16088B70862D5187D572K71199o3796p7153A5015L65786a3108E3910J52425I1589
16076A92480p0022J92624j49156A609J93388K09926A17021Q4281c418D841L1865
16065C6706Q6950d0996H0115B5521a54828G5971Q5775a43530C845a54150C14205
$$ y = [143103, 134629, 43990, 172062, 180782, -77839, 168195, 325815, 489311, 305181, 124267, 310144, 102360, 122382, 93240, -185434, -108503, -14579, 235731, -32843, -143675, 167261, 450906, -97524, 453470, 34244, -130548, -33098, -176428, 157506, 26657, 418049, -171804, -80074, 90601, 269728, 104720, 218144, 72317, 30121, -30013, -327408, 265677, 49675, -82203, -81662, 268960, -52035, 295878, -28513, -87916, -142862, 77367, 249898, -328314, 25032, 270862, 45187, 4572, 275771, 211975, 134822, 15015, 380801, -13108, 53910, 206335, 91589, 192480, 122458, 315082, 165926, 1609, 194997, 404923, 117021, 201302, -3418, 4841, 36706, 123656, -40996, 80115, 25521, -154828, 75971, 161746, -143530, 3845, -154150, 314205]
16053C44021j16794G2093l3597J87282r5957c1495l3078E2230K50721a27372A794
16041b454l6986A14031K41719o4851J7302j50543F2799P3179c073j1057B52050
16029A65290d9765D1610K68922j13847I6654A3942J45714f1103B08163C8478J97890
16018B36368J34695j25721o7879k4846a892A86331b00769A23170a39465L7205
16008a02260I749a36597j5622P726A11183l4478O3359c06023a163B4052a0110
15996f4872D8251O8497A3671o632Q7204C4503a25211B12385j1428M16863k40081
15985C77739q994j00973r1973J53391n9034a2479A00458J97767l8226n4260H564
15973B6378P3468A9357d764j62958I5581a85476j89703G7182J5364O7878N272
$$ y = [344021, 227227, 72093, 38496, 225778, 129821, -31495, -64573, 52230, 302951, -127372, 1794, -2454, -39440, 114031, 355750, 290899, 308201, 157658, 62799, 135978, -3073, -14130, 252050, 165290, -49765, 41610, 310532, 196685, 96654, 13942, 159656, -61103, 208163, 38478, 236368, 371063, 245342, 177463, 152617, -1892, 186331, -200769, 123170, -139465, -102260, 9749, -136597, -152219, -144493, 111183, 76705, 140064, -306023, -1163, 24052, -10110, -64872, 48251, 116748, 13671, 7039, 94243, 34503, -125211, 212385, 200957, 617820, 377739, 368745, 267772, 175799, 329190, 270156, -12479, 100458, 298225, 259999, 205739, 8564, 26378, 99846, 19357, -4764, -167722, 95581, -185476, -375179, 77182, 92546, 160424, 165696]
15962A65696g0334I2114A7542a77166a1010F2672j9427J3671c8629A66249R2381
15951B58630a51012M8139C66674a63052A26698i5398a9355j95353l5190n801A93433
15939g0221A07841J51602h6769l6925j28341B13542q4826j8434m1448c16434a55267
15927H3644e7883B71069h3655l536j09865G382O2834b43950o4385A91916b12603
15915a18322A93378a2912D52017F9120c19911d2257A7413h4722j73393J21909
15905a36206C06055b67710I9538h3690B67203F0215J47719b22297g430D6885b10338
15893f4606A40842f8744n3697I3365c71633A28026N3237k968k8313j4719l0718
15882A04545C6941f0075A04923h3309j93666h4482A36228b17923L4580b5133l2079
$$ y = [165696, -70334, 92114, 17542, -177166, -11010, 62672, 43245, 56916, -38629, 166249, 258630, -151012, -102873, 366674, -163052, 126698, -95398, -19355, -214708, -249898, -255699, 193433, -70221, 107841, 259443, -86769, -123694, -252035, 213542, 128716, 110282, 68834, -316434, -155267, 83644, -57883, 271069, -83655, -87191, -197056, 7382, 70216, -243950, -308335, 191916, -212603, -118322, 193378, -12912, 452017, 69120, -319911, -42257, 17413, -84722, -258115, -136206, 306055, -267710, 99538, -83690, 267203, 60215, 207934, -222297, -7430, 46885, -210338, -64606, 140842, -68744, -122441, 93365, -371633, 128026, 181263, 178295, 149982, 135263, 104545, 36941, -60075, 104923, -83309, -276975, -84482, 136228, -217923, -183343, -25133, -57212]
15871e7212A31023a66642B04717J6798A00911L67239A09132g9391j21270i0867
15860B10374a44795d4131K85E0356e3997k64710B46442H2734C5446M398L7278
15849G7122A543J60290a02458A25057c165r3027K7440r3901l3593K6324e7792
15837C94274D8295f875B08077a43479A14732b4897A03444I913g7253I3669O5476
15826A59145J28332E0270c7558C345a36894M9250k61295F9008j0615b06377O4691
15815a41686L1531A95534a78991e9870H7814J01512D6987a45801H7564J6992a34898
15803a6718l74188B42805a68974E4288k1720J30778o4443l8307R3592O0978C6544
15791A4650N12433A72813i8615A21605a21599j82377b4928C12581A2022P2613
$$ y = [-57212, 131023, -166642, 204717, 221515, 100911, 468150, 109132, -79391, -200661, -90867, 210374, -144795, -44131, -43846, 50356, -53997, -318707, 246442, 82734, 35446, 39844, 77122, 1543, 161833, -102458, 125057, -3165, -96192, -68752, -162653, -196246, -169922, -57792, 394274, 48295, -6875, 208077, -143479, 114732, -24897, 103444, 9913, -77253, 93669, 159145, 287477, 50270, -37558, 3345, -136894, -87644, -348939, 69008, 58393, -206377, -141686, -110155, 195534, -178991, -59870, 87814, 189326, 46987, -145801, 87564, 104556, -134898, -16718, -390906, 242805, -168974, 54288, 32568, 163346, 98903, 60596, 154188, 215166, 36544, 14650, 527083, 172813, -98615, 121605, -121599, -303976, -24928, 312581, 12022, 84635]
15781H4635j8383a09559A67168g1611o2336d9796A85374F0811c42937C8797K06926
15770B45723b83945a9492I0034d5684k02335b1549k2911j81126h4594C06940I3520
15758a21485A61190K1896F3854j5069P1553a48003L492A05532a79716d3155N120
15747c8035J5162C90462A36362J65452D4593a86513A67957I43a34627F948d8101
15735A47764r632c0675j32816M6302B6402J23609a01874L2196b6043A09170b29840
15723a33736A70969c1418C5771N1371h9393L5262o2841k92443a5368D7682f3721
15711h9670k712r301L8710j91384A30995K42423F471M6266i443A35967i2179A08362
15698d8553I072b19704f9453F4709a14106C3592E044P4766k4809k4216A912c96197
$$ y = [84635, 66252, -109559, 167168, -71611, -133947, -49796, 185374, 60811, -342937, 38797, 245723, -283945, -19492, 90034, -45684, -248019, -21549, -44460, -225586, -84594, 306940, 93520, -121485, 161190, 183086, 63854, 48785, 120338, -148003, -144511, 105532, -179716, -43155, -38035, -22873, 390462, 136362, 301814, 44593, -186513, 167957, 943, -134627, 6948, -48101, 147764, 138132, -30675, -163491, -117189, 26402, 150011, -101874, -69678, -26043, 109170, -229840, -133736, 170969, -31418, 35771, 87142, -89393, -54131, -116972, -409415, -15368, 47682, -63721, -89670, -92382, -101683, -62973, -254357, 130995, 373418, 6471, 52737, -9443, 135967, -92179, 108362, -48553, 9072, -219704, -69453, 64709, -114106, 33592, 5044, 79810, 55001, 30785, 1912, -396197]
15685B8232b2292l18220a11144j00805A27427d26585e4690B52358D0607h7600
15674a65665f5495j63258A34509c3508j53694O622D9505J21262c71334f0558l27288
15663c87846g2156B5859K25228i3609C2137M2978B7306f9767k73033G0378J05939
15652A76317E6188o140b15719L5964b6469E0370J44254D4062Q8511J20357a90462
15640e9973I9549c1912k02843A03939a42324A7840J17690b83139D6048K05267
15630B51315D4408a43085l3289D8863Q0610J60097a33622J2749j80100A447L02466
15619C03913m3208a41261A10998b492j6459k31019f2244m440b7615j0919n3155
15608i1689b8544p4318I3437G762J43617a98065r6571i5196C31302i1927n0345
$$ y = [28232, -22292, -340512, -111144, -211949, 127427, -426585, -54690, 252358, 40607, -87600, -165665, -65495, -228753, 134509, -33508, -187202, -180580, 49505, 170767, -371334, -60558, -387846, -72156, 25859, 251087, -93609, 32137, 75115, 27306, -69767, -342800, 70378, 176317, 56188, 50048, -215719, -179755, -26469, 50370, 194624, 44062, 132573, 252930, -190462, -59973, 99549, -31912, -234755, 103939, -142324, 17840, 135530, -283139, 46048, 251315, 44408, -143085, -176374, 48863, 129473, 289570, -133622, -120873, -300973, 1447, 303913, 260705, -141261, 110998, -2492, -18951, -249970, -62244, -66684, -27615, -38534, -91689, -28544, -102862, 93437, 7762, 151379, -198065, -294636, -95196, 331302, -91927, -142272]
15597a42272b6199k6179A75422i7088B5703K31741q9514n8315k3774k4892b60514
15585B25204b18374A82413a96947D1663J80743h9351C76387j49777H1596j0090
15575G1506j4859j9247a10779k62288e1297K503j28985A5024J48036d26596J89695
15564b36901D4231a82595F1909J29196e2141j18939H4971q486K85295A10955l1445
15553G9510J92548b10858c483A70418a97950F9349g3614A39155f9880k24354n360
15542b99594B44785g0644j55477K8816A59853a40408R11a5562k8461q454A18937
15530a26142B57502a54739L7853N1792j79183d9022E1643j4298b43625A09321
15519A15461f0387A00214L0452b35917j0129Q2054H4764A8325a4107r4209B17077
$$ y = [-142272, -26199, -52378, 175422, -97088, 25703, 257444, 167930, 109615, 85841, 60949, -260514, 225204, -218374, 182413, -196947, 41663, 222406, -89351, 376387, 226610, 81596, 71506, 56647, 37400, -110779, -373067, -51297, -48794, -177779, 15024, 163060, -426596, -236901, 44231, -182595, 61909, 191105, -52141, -171080, 84971, 76485, 361780, 110955, 79510, 272058, -210858, -3483, 170418, -197950, 69349, -73614, 139155, -69880, -294234, -299594, 244785, -70644, -226121, -197305, 159853, -140408, -139497, -15562, -44023, -52477, 118937, -126142, 257502, -154739, -116886, -65094, -244277, -49022, 51643, 37345, -243625, 109321, 115461, -60387, 100214, 130666, -235917, -246046, -163992, 84764, 18325, -14107, -108316, 217077]
15507a08840B70470e5104A01188K9005e7091m0886k84382E9941b10759I6203b19523
15495c77718b2618a0626k57523o2591a10138j59579a02146B43915a22210I9947
15484b45687A42489k18a49252M9134B09858d5235B548c65344G5301K2528d2649
15472a10511A00443N2045q499g0025m8968e7249b2700C1249g7755l205l26182
15461d07142d445j74392r5775O2712D00135E085P2147a77088A92567a41759G3131
15449a59855J7127C31320l1895a52948A45378a01018j28769O7787G4602e1843
15438A11738a08546B12832C0211a51964c280F7714l2073a60371o1723O0828f8643
15426A01845D0451K93037p5930q5828a90937b4441k82676F1595c19739A71307
$$ y = [-108840, 270470, -55104, 101188, 130193, -57091, -97977, -382359, 59941, -210759, 96203, -219523, -377718, -22618, -10626, -268149, -330740, -110138, -269717, -102146, 243915, -122210, 99947, -245687, 142489, 142271, -149252, -100118, 209858, -45235, 2548, -365344, 75301, 97829, -42649, -110511, 100443, 152488, 143989, -70025, -118993, -57249, -22700, 31249, -77755, -80960, -407142, -4445, -178837, -274612, -211900, 400135, 5085, 77232, -177088, 192567, -141759, 73131, -159855, -142728, 331320, 299425, -152948, 145378, -101018, -229787, -162000, 74602, -51843, 111738, -108546, 212832, 30211, -151964, -3280, 67714, 35641, -160371, -222094, -161266, -68643, 101845, 40451, 333488, 257558, 171730, -190937, -24441, -307117, 61595, -319739, 171307]
15415C08001J14216a99518e3085I298h1830k2074k9510j6673E3190K11825D1202
15403f277l05464a41949k9687A84015a55710c7581o4302A66165J04839a0162A52840
15391C35936j27122b29231i7347H4362K5052a44951M8799B6101b2630B39325D567
15379D4637b1871k97911d6366C21331a89877A70800k1193F5624A1762Q9928P6616
15368A78306M1566D1794J25925e2986G3898P4325F0234A5167Q9577J31269h7056
15356I0990J65711G8411L6027e1301j04062G3953b89191e5149B59942p652c2899
15344e7618J639G0672Q5639A8155J44650j2966I118Q0998E78a2450B00197a38635
15331b1139q7029B67386h1745l44002J81846A05645g8542B21513p5046D3067e9934
$$ y = [308001, 422217, -199518, -53085, 9298, -81830, -103904, -133414, -150087, 53190, 265015, 41202, -6277, -311741, -141949, -171636, 184015, -155710, -37581, -101883, 166165, 271004, -10162, 152840, 335936, 208814, -229231, -97347, 84362, 109414, -144951, -96152, 26101, -22630, 239325, 4567, 44637, -21871, -319782, -46366, 321331, -189877, 170800, 149607, 65624, 11762, 101690, 178306, 219872, 41794, 167719, -52986, 73898, 148223, 60234, 15167, 104744, 236013, -87056, 90990, 256701, 78411, 114438, -51301, -155363, 73953, -289191, -55149, 259942, 252290, -32899, -57618, -55979, 70672, 156311, 18155, 162805, 149839, 9118, 90116, 578, -12450, 200197, -138635, -21139, -108168, 267386, -81745, -425747, -243901, 105645, -78542, 221513, 146467, 43067, -59934]
15319a16674A82957J73945e1623I0441l3673K97932A8986K64660a7043G7647R2846
15308A70493a15230D1520a78312a0021C99901e0069A74946D0594J22213f0203
15297B70412j15056b21594c1184I9953a59975g7693A26818d8884m6263A26416
15286a80230C21741D0467r762L3616b01329j34192a312k5377k20607G0892d591
15274i4507H3286b30183g177m7m8437B76969D5136J69932c7112A94538e5557C51251
15261F7530k0347g4335A90343J8951a26548A43177K9980K5654K13503L15222K44420
15250I71956j28690q4227q8343j84344A24882b96620J39663A2844b43969A50616
15239A4849R7734a6178A46602J13502p2990d9749E19369B724K62232j07020b31341
$$ y = [-116674, 182957, 356902, -51623, 90441, 56768, 354700, 18986, 283646, -17043, 77647, 170493, -115230, 41520, -178312, -10021, 399901, -50069, 174946, 40594, 162807, -60203, 270412, 155356, -221594, -31184, 99953, -159975, -77693, 126818, -48884, -95147, 126416, -180230, 321741, 40467, 30705, 64321, -201329, -335521, -1312, -26689, -247296, 70892, -4591, -94507, 83286, -230183, -7177, -7224, -55661, 276969, 45136, 215068, -37112, 194538, -55557, 351251, 67530, 47183, -74335, 190343, 209294, -126548, 143177, 173157, 198811, 412314, 727536, 971956, 843266, 759039, 670696, 486352, 124882, -296620, -156957, 12844, -243969, 150616, 14849, 112583, -16178, 146602, 260104, 187114, -49749, 519369, 2724, 264956, 157936, -231341]
15227C98928A20766a11408r5805A56312K10993e0753B24426q1586k1570O4822
15217A86092K01807E6475J47423d6698n8512A4081K17686A12259a28155B07590
15206f4440J6496A16370J60691m5381f2255B11614h7192H429M2753N8140a00263
15194B21542K617j04112M8882d6926C8926a9488m5670j01507g0407B27519m2290
15183A85229J54221A34800k4891D2193K9060j2153j8050K44103B8159a73457A67273
15171b95043G2440M0247L4200m4605b21002f9367j58751O4649A11920I838a91478
15159A87249A5108b13B64297P4973H7386J8864J76252p7507J23359A44562h6771
15147a06410H0004J04039a04485A22990c4407C20005f8360A1547J40280m2250
$$ y = [398928, 120766, -111408, -207213, 156312, 367305, -50753, 224426, 142840, 121270, 186092, 387899, 56475, 203898, -46698, -105210, 14081, 231767, 112259, -128155, 207590, -64440, -47944, 116370, 277061, 231680, -62255, 211614, -87192, 8429, 51182, 109322, -100263, 221542, 224159, 120047, 168929, -46926, 38926, -19488, -65158, -166665, -70407, 227519, 185229, 339450, 134800, 109909, 42193, 71253, 59100, 41050, 285153, 28159, -173457, 167273, -295043, 72440, 112687, 146887, 102282, -221002, -69367, -228118, -163469, 111920, 9838, -191478, 187249, 15108, -213, 264297, 339270, 87386, 106250, 282502, 204995, 328354, 144562, -86771, -106410, 80004, 184043, -104485, 122990, -34407, 320005, -68360, 11547, 151827, 109577]
15137A09577j2691J27418g1380m9715C9558L22818j01492b403A43650F3945d479
15125D9121J99636f9890I4651a6492q037A22571L10062I73J79509C9873g5215
15113c6444F5213f3032D9277b88769k4167A75561J7045k4430b3116A89623d6319
15101a04892K9288A13311b72288A79124H1597O2143K18557b5816A56253J97422
15091C53675A052b1127I1187k5593K4183L09986A96421o0551F6066L70868a3224
15079H772J26947a900B36174r4231H555Q8384f4616J7655b0119k24417b2082A10110
15066I2218d5456D8054L53167j68197g3911B57668n504a36674G6116B2444J37149
15055A59593J31034I036J63526C4104L22656R1419A67189J77729r6537k9553f9126
$$ y = [109577, 96886, 224304, -71380, -121095, 39558, 362376, 260884, -2403, 143650, 63945, -4479, 49121, 248757, -69890, 94651, -16492, -24529, 122571, 432633, 973, 180482, 39873, -75215, -36444, 65213, -63032, 49277, -288769, -312936, 175561, 192606, 168176, -23116, 189623, -46319, -104892, -75604, 113311, -272288, 179124, 81597, 143740, 362297, -25816, 156253, 353675, 1052, -21127, 91187, 65594, 89777, 399763, 196421, 135870, 66066, 436934, -13224, 8772, 135719, -1900, 236174, 141943, 8555, 96939, -64616, -46961, -20119, -244536, -22082, 110110, 92218, -45456, 48054, 401221, 233024, -73911, 257668, 252164, -136674, 76116, 22444, 159593, 290627, 9036, 172562, 34104, 356760, 448179, 167189, 344918, 248381, 218828, -69126]
15043C05420I8086L40002A94390K2961a97965A25801A119K12620G75J48170N6122
15032B05067k6460B8596c54541D49388A52696c1544G9097K50509k2932j19578
15022A87096a27862A72821D5814k1394g5239A38426k2680K06980a91933B39389
15011B85616j37776B4698h6391B8580K00776f7778B16578a0505A9183M11639K9331
15000D60153j56973E0107K47371f9182A65530L44089A55790J77251P6734k01237
14990B08538M2224D6418B175K37813h9950D6143J21547O941K25782A17895J22934
14979B40829j14725m4827d9639D70010K5263k25137p6536L8039n3129K74681A22264
14967D37215L0138j62346q1086Q8467J02269j20321F8232N5897M05278A95048
$$ y = [305420, 98086, 438088, 194390, 217351, -197965, 125801, 1119, 213739, 775, 148945, 205067, 178607, 28596, -354541, 449388, 152696, -31544, 79097, 329606, 306674, 187096, -127862, 172821, 45814, 24420, -75239, 138426, 115746, 322726, -191933, 239389, 285616, 147840, 24698, -86391, 28580, 229356, -67778, 216578, -10505, 19183, 430822, 460153, 303180, 50107, 297478, -69182, 165530, 509619, 155790, 333041, 409775, 208538, 250762, 46418, 2175, 239988, -89950, 46143, 167690, 174631, 400413, 117895, 240829, 126104, 81277, -49639, 470010, 495273, 270136, 193600, 231639, 178510, 453191, 122264, 437215, 467353, 305007, 223921, 312388, 414657, 294336, 68232, 124129, 529407, 195048]
14956C30711B8795M83483j05347J77561L1401j91236o4246R6429o0038j65927
14946B30875J98612o5890n347L0599j27657N1719A42317D1813a46258B37011a18687
14934A85368r033J77459o2729p8186o3596K10276A75469L88337A64869N91325
14924G56194A80016J12208p4528M15945a08206C98394A05609K37246J18477j06778
14914C54554j26062l8022h2073D72869K4654p0947I1600L62413k25013F9626b24562
14902D18470P4014o8873j18313A14115J23865K32767A52695K55631j89749r7308
14892A21269J26952K36300A64062N4157k353J67271A36981M92568A70759L01404
14882D72163r257j17991j48202J27521J7779J29681m2205k1616A63422K81972
$$ y = [330711, 28795, 512278, 406931, 584492, 615893, 424657, 360411, 456840, 396802, 230875, 429487, 363597, 358250, 388849, 261192, 312911, 142317, 41813, -146258, 237011, -118687, 185368, 176335, 353794, 291065, 212879, 149283, 359559, 175469, 563806, 164869, 756194, 180016, 292224, 217696, 633641, -108206, 398394, 105609, 342855, 461332, 354554, 228492, 190470, -82073, 472869, 497523, 426576, 91600, 454013, 229000, 69626, -224562, 418470, 492484, 423611, 305298, 114115, 237980, 470747, 152695, 408326, 218577, 121269, 248221, 484521, 164062, 218219, 215866, 383137, 136981, 629549, 170759, 472163, 462906, 344915, 196713, 324234, 342013, 471694, 429489, 407873, 163422, 445394]
14872D45394o7014q8053K4986A33069K86264P2456B24484j3195N6162J59679A52583
14860E26208L9146A98576J38539j00277K00197I5806M77029k66024G8817L51312
14850D30129J8973o1885J58615I2761K54150O3253Q050j00962K79030k08306K62030
14839F50006B33317J21066Q4694j61158K49761q5817o5821j53066K22886B14350
14828E44813k50106J63247A96050J53126L77230g8601A17142M17034o0054o4107
14818D10015j83550L09221q4603j69304J92276l1142O77r1137J16261j18351K32621
14807E82984k30903K12878Q1427B15094L13776p8609R4348B60196N7970K02731
14797E20897j98280l4613M81598C70605L59904B47408J02896J42559m2129o14
$$ y = [445394, 378380, 290327, 315313, 133069, 419333, 491789, 224484, 211289, 267451, 427130, 152583, 526208, 565354, 198576, 337115, 236838, 437035, 95806, 572835, 306811, 78817, 430129, 449102, 387217, 545832, 92761, 346911, 410164, 418214, 317252, 596282, 387976, 650006, 233317, 354383, 439077, 277919, 527680, 441863, 376042, 222976, 445862, 214350, 544813, 294707, 457954, 196050, 349176, 726406, -78601, 117142, 534176, 474122, 410015, 226465, 535686, 451083, 281779, 474055, 442913, 443590, 352453, 468714, 350363, 582984, 352081, 564959, 646386, 215094, 528870, 450261, 544609, 260196, 318166, 520897, 322617, 288004, 769602, 370605, 730509, 247408, 350304, 492863, 450734, 450120]
14787D50120j30978J86062o3861k11956L40934P0978O0715B53113R9928P7844
14777D30885j15438O68673m09952k42069L20741K10803D7160K84159K37522J48304
14767G17145B46459L2121K34359j47617K46999k60041K26997J71576k06128B53160
14756C51422j15594Q3025J47916j7919j33805K85314j01821j23658N3716K29908
14746F58504P6451k52585J59011j38177j76698M88733j32187k35318J48072k61596
14736C34210L12395n5544j8965Q3380r8412R631q400N07422m06093p9897k42388
14725C37339L45250J43482k38001L06145j44629P9267l05102J42461j0681M0102
14715F95633J82724C91649k1199N35268k81518M637m8862J82497J43243k2999
$$ y = [450120, 319142, 505204, 441343, 229387, 570321, 641299, 702014, 253113, 353041, 430885, 315447, 984120, 574168, 332099, 652840, 863643, 47160, 331319, 568841, 717145, 246459, 278580, 512939, 365322, 612321, 352280, 579277, 750853, 544725, 253160, 351422, 235828, 318853, 466769, 448850, 315045, 600359, 498538, 374880, 428596, 658504, 734955, 482370, 641381, 503204, 326506, 815239, 683052, 447734, 595806, 334210, 646605, 591061, 572096, 655476, 557064, 566695, 558295, 1065717, 659624, 579727, 337339, 682589, 826071, 588070, 894215, 749586, 828853, 523751, 666212, 655531, 695633, 878357, 391649, 370450, 905718, 624200, 628837, 579975, 762472, 905715, 882716]
14705H82716k34577K71135l14685j37672J61306J19508j39644O106P2610J79234
14695H66037k73311K16952K9618k14188K06965k47681K28644j99195P1833K81368
14685I67042m57274L03302l14934J34884K39752j14640L20251k38845R1925j32377
14675G99086j89711M88647k45723L2849l642j8680J53389l2805O365j78650K10482
14664A021607m43995K79212n7413J38584J28939m59801K09245l5944j59659M71755
14654A092530l84636J61742M24521j43609l01058j64029K35228K3428N0409J16246
14644A110772J1706l13879M68610m87468m7241K53976R8778n5294K17683l13585
14634I44058j82087M49995k77136R531n6434O68286o18995N30689k82376k21593
$$ y = [882716, 648139, 919274, 604589, 466917, 628223, 747731, 608087, 614193, 686803, 866037, 592726, 809678, 839296, 625108, 832073, 584392, 813036, 613841, 685674, 967042, 509768, 813070, 498136, 633020, 872772, 758132, 1078383, 839538, 931463, 799086, 609375, 1098022, 852299, 885148, 881506, 862826, 1016215, 983410, 989775, 811125, 1021607, 577612, 856824, 799411, 937995, 1066934, 607133, 816378, 780434, 620775, 1092530, 707894, 869636, 1294157, 1150548, 849490, 685461, 920689, 944117, 994526, 1110772, 1122478, 808599, 1277209, 789741, 742500, 996476, 1095254, 1039960, 1257643, 944058, 761971, 1211966, 934830, 944361, 887927, 1556213, 937218, 1467907, 1185531, 963938]
14624I63938K35618K9402m40898K99533J46941k47469K20746M9784r102l6350
14614A212143P1769J22999M4063n28176N94013k82977n3432K21607k01632K86788
14604A487165n8143k34441K78628n9154k68958p1630K20320K69230n19649M85606
14594A528974j11450j03319L57127l03164J30844j73908N70342p31954N08534
14585A672026j44633j86934J09887l7929J62852n8227J35019J03555J399l23706
14575A433309N29250k35969J77966r9923j31071j94675L09747K14064l4211m9650
14565A918837J38259k64582L63690k38014K82864k1788j97089N01724J26396q7135
14555B523162L34160l2575L08094M45477L84738J689487J970925N926211R100033
$$ y = [963938, 1199556, 1228958, 788060, 1087593, 1234534, 987065, 1207811, 1257595, 1248493, 1212143, 1283912, 1406911, 1450974, 922798, 1516811, 1233834, 1180402, 1402009, 1200377, 1487165, 1429022, 1194581, 1473209, 1414055, 1145097, 1073467, 1293787, 1563017, 1043368, 1528974, 1417524, 1314205, 1671332, 1368168, 1499012, 1325104, 1895446, 1163492, 1672026, 1527393, 1340459, 1450346, 1412417, 1575269, 1517042, 1652061, 1755616, 1757015, 1433309, 1962559, 1726590, 1904556, 1804633, 1673562, 1478887, 1788634, 2002698, 1968487, 1918837, 2057096, 1792514, 2156204, 1918190, 2201054, 2179266, 1982177, 2483901, 2610297, 2523162, 2857322, 2824747, 3132841, 3578318, 3963056, 5652543, 7623468, 13549679, 22649712]
14546B2649712J4911705k186829A4466649F150755k921020q01034m95205l54649
14538A578847j51412K76506K06698l75216L79719k33215K25570k11061q8283K16354
14528A824507j47521N29326n28229K79631j41536n9146N06747j73741j42340q6917
14518A860781M02343j23535J21834J45575j13583J26607k53125J34969J57989
14509B459855q6541K00046J78966m54775n4705K99773j85581Q4745n1338K69345
14499B659790o6608M57461m62136P2366J00204Q7716J60199q3164K90461k7688
14489C188601j05775m6858j86163K33790P2068M58800m04023M1696J85521j81844
14479C255813m9345K92770j80685M01014j59253K09780j78308j05729K0495p6442
$$ y = [22649712, 37561417, 35374588, 14466649, 6150755, 3229735, 2428701, 1933496, 1578847, 1427435, 1703941, 1910639, 1535423, 1915142, 1681927, 1907497, 1696436, 1608153, 1824507, 1676986, 2206312, 1678083, 1957714, 1816178, 1757032, 2263779, 2090038, 1947698, 1860781, 2263124, 2139589, 2261423, 2406998, 2293415, 2420022, 2166897, 2301866, 2459855, 2373314, 2573360, 2752326, 2297551, 2242846, 2542619, 2357038, 2441783, 2390445, 2659790, 2593182, 3050643, 2588507, 2660873, 2761077, 2848793, 3008992, 2925828, 3216289, 3188601, 3082826, 3035968, 2849805, 3083595, 3155663, 3614463, 3210440, 3252136, 3437657, 3255813, 3206468, 3499238, 3318553, 3719567, 3560314, 3770094, 3591786, 3486057, 3506552, 3430110]
14469C430110J91628q1947L45161j49945l8313J24247K93407K4057m09411L50827
14459D079821J73848k53441J91524K16067n2671l3969J66424q5051K35825j61182
14449D477195K19298J08753p9926j24709K57060j11419J99474J03767m0461K05548
14439E214580l04632J79281J07608J72428j26161K31188J99483k93843L18458
14430E698390j5439M2059o9120K20820R1784K19382J18686n0187L2592J45770
14420F434737K49767L4627K69538P1424j73565k3157N56085l27143J46506L53821
14410G592640q55O6371J17826J80271L872K99968K35320m56852N15675J3342L80564
14399H948142R5191O8498J16233L16326J45580Q6722N9198j8374L87361L29688
$$ y = [3430110, 3621738, 3539791, 3884952, 3735007, 3696694, 3820941, 4114348, 4138405, 3728994, 4079821, 4253669, 4000228, 4191752, 4407819, 4355148, 4321179, 4487603, 4402552, 4638377, 4477195, 4696493, 4805246, 4725320, 4600611, 4857671, 4746252, 4945726, 5049493, 5009032, 5214580, 4909948, 5089229, 5196837, 5369265, 5243104, 5474292, 5673775, 5379932, 5698390, 5682951, 5725010, 5655890, 5876710, 5968494, 6187876, 6306562, 6256375, 6288967, 6434737, 6684504, 6719131, 6988669, 7060093, 6886528, 6863371, 7419456, 7092313, 7238819, 7592640, 7591785, 7658156, 7775982, 7956253, 7960125, 8260093, 8495413, 8038561, 8554236, 8567578, 8948142, 9043333, 9111831, 9228064, 9544390, 9689970, 9776692, 9835890, 9817516, 10204877, 10534565]
14389A0534565j40781M36691N15867l13555L51768J75340L55733K04069L2037
14380A2151734P3469K55746M52454k3936M50926K92108M6301N55075R9413L55117
14370A4708407L0886N58341J65378M22516M673P85242K0439M06140M04772J99883
14360A7706677Q84936J50304M42913M37821M98751L05005P89964L34097M31425
14351B1981893P48716N06355L96566P39162L25844N79983R47269N01455O40870
14342B7368113J030036Q31761O42886N59821J236771P40450R13198J130175Q16328
14333C5269539J121542Q08425J148650J131479J621951J169132J256325J621500
14325D5148543J627253J291555J684239J929086K002154J552867J920946K458973
$$ y = [10534565, 10393784, 10830475, 11346342, 11032787, 11384555, 11559895, 11915628, 12119697, 12151734, 12225203, 12480949, 12933403, 12909467, 13360393, 13652501, 13698802, 14253877, 14353290, 14708407, 14739293, 15297634, 15463012, 15885528, 15890201, 16675443, 16695882, 17102022, 17506794, 17706677, 18591613, 18741917, 19184830, 19622651, 20121402, 20426407, 21216371, 21550468, 21981893, 22730609, 23236964, 23633530, 24372692, 24698536, 25278519, 26225788, 26727243, 27368113, 28398149, 29229910, 29872796, 30432617, 31669388, 32409838, 33323036, 34453211, 35269539, 36391081, 37199506, 38348156, 39479635, 41101586, 42270718, 43527043, 45148543, 46775796, 48067351, 49751590, 51680676, 53682830, 55235697, 57156643, 59615616]
14317E9615616K418423J890111K524733K692006K728188L328999L054231L211476
14309H1463783L273955L813733M006658M078899M308952M638208N017593N506044
14301A16107825N614119O233394O005748P348184O817621P947419Q280925Q841381
14293A73196616R483051R866524J0332371J1649927J1383485J2888872J3058925
14286B51859771J3817808J4344283J4775939J5186667J5358407J5452890J5141481
14279C55937246J5299616J4040657J3481400J2289036J1251146R226186O402613
14272D37927900J265929k10793m43347l67809k884632l469335o772954r392836
14264D15652123j1911161j3234380j4929922j5416547j5652202j5712918j5314970
$$ y = [59615616, 62034039, 63924150, 66448883, 69140889, 71869077, 75198076, 78252307, 81463783, 84737738, 88551471, 92558129, 96637028, 100945980, 105584188, 110601781, 116107825, 121721944, 127955338, 133961086, 141309270, 148126891, 156074310, 164355235, 173196616, 182679667, 192546191, 202878562, 214528489, 225911974, 238800846, 251859771, 265677579, 280021862, 294797801, 309984468, 325342875, 340795765, 355937246, 371236862, 385277519, 398758919, 411047955, 422299101, 431525287, 437927900, 439193829, 438983036, 438539689, 438171880, 435287248, 431817913, 425044959, 415652123, 403740962, 390506582, 375576660, 360160113, 344507911, 328794993, 313480023]
14257C13480023j5384703j4878768j4660075j3847466j3209680j2658689j2308380
14250B16532262j0988850j0731519j0084452r574676q926659q217696p515886
14243A50492524p447320p113803o698200o082689n622427n153746m802470m892538
14235A02679331m943350l930507l882683l766276k864356l928495l150182l420116
14227G2793366k664187k645388k349612k523288k456971k126450k162005j808113
14219E4057352j793059j917097j531069j431864k065937j150211j054526j341507
14211D1772082j377113j221141j104196j171849l75506j503257j075298j100130
14203C2843592q36985q43770r87525l00397j003462q15729q83001o88059p19604
$$ y = [313480023, 298095320, 283216552, 268556477, 254709011, 241499331, 228840642, 216532262, 205543412, 194811893, 184727441, 175152765, 166226106, 158008410, 150492524, 143045204, 135931401, 129233201, 123150512, 117528085, 112374339, 107571869, 102679331, 97735981, 93805474, 89922791, 86156515, 83292159, 79363664, 76213482, 72793366, 70129179, 67483791, 65134179, 62610891, 60153920, 58027470, 55865465, 54057352, 52264293, 50347196, 48816127, 47384263, 45318326, 44168115, 43113589, 41772082, 40394969, 39173828, 38069632, 36897783, 36522277, 35019020, 33943722, 32843592, 32006607, 31162837, 30175312, 29874915, 28871453, 28055724, 27172723, 26484664, 25765060]
14194B5765060m68920o32549n79743n65989p37049l72674n12472m61948l86588
14185B1047128n34470o50564l70741n65691j41549n28307m17976n09030k36345
14176A7092455m29731k97330m12132k20177l74698k01127m56651p2893l82967
14167A4244749n05750R9432n6853o43679m46991p3521l03587J16747k62404m10946
14157A1757197k9983o5185j84577k13187l22617k50412m5148p44938M02612n01637
14147I802125K2316j31688j50645K3374k60707j70104J59380l51677k46284j01341
14137H594749j29908j504k39865R4525m62989n91k39553J44986j59250K6326j47052
14126G479874n7934l68508J29732k29235l36847R8984P6778l83788J21664k45005
$$ y = [25765060, 25296140, 24663591, 24083848, 23517859, 22780810, 22408136, 21895664, 21433716, 21047128, 20512658, 19862094, 19491353, 18925662, 18784113, 18255806, 17837830, 17328800, 17092455, 16662724, 16365394, 15953262, 15733085, 15358387, 15157260, 14700609, 14627716, 14244749, 13738999, 13838431, 13781578, 13137899, 12690908, 12617387, 12313800, 12430547, 12168143, 11757197, 11727214, 11662029, 11477452, 11264265, 10941648, 10691236, 10646088, 9901150, 10303762, 9802125, 9824441, 9692753, 9542108, 9565482, 9304775, 9134671, 9294051, 8942374, 8696090, 8594749, 8464841, 8463337, 8223472, 8317997, 7855008, 7854417, 7614864, 7759850, 7600600, 7626926, 7479874, 7421940, 7053432, 7183164, 6953929, 6617082, 6716066, 6792844, 6409056, 6530720, 6285715]
14116F285715k3939j30619k53771M45326k33066o9297j16747m5740j01648k12345
14106E543869J59895k8202m37741J85126j71009j51752P5918J31328l37221q8760
14096D881451J60090J7846j46038k7541r702l11698K84329m8830k23909k96160
14086D279838J21742r9015Q9147k63331J64741J6712r4251j83063K38307k82139
14076C988688o9401m06892M53272k59683J83807l10153N1476J38885n97352K59647
14066C432294O0056o8663J74358P6568l19423J34297k23700L1324j46643J03009
14056C253477n4009j3839k7753J82275k45884q7241j01834q7620K65124q619k58828
14045B815249P7410J4856j39877r2541o9933K31300o6170J3742k15263J74857
$$ y = [6285715, 6261776, 6131157, 5877386, 6322712, 6089646, 6020349, 5903602, 5857862, 5756214, 5543869, 5703764, 5675562, 5237821, 5422947, 5251938, 5100186, 5176104, 5307432, 4970211, 4881451, 5041541, 5059387, 4913349, 4885808, 4876106, 4564408, 4848737, 4799907, 4575998, 4279838, 4401580, 4302565, 4391712, 4128381, 4293122, 4309834, 4215583, 4032520, 4270827, 3988688, 3919287, 3512395, 3965667, 3705984, 3889791, 3579638, 3631114, 3769999, 3172647, 3432294, 3492350, 3423687, 3598045, 3674613, 3355190, 3489487, 3265787, 3297111, 3150468, 3253477, 3199468, 3185629, 3157876, 3340151, 3094267, 3007026, 2905192, 2817572, 3082696, 3074077, 2815249, 2892659, 2907515, 2767638, 2675097, 2605164, 2836464, 2770294, 2784036, 2568773, 2743630]
14035B743630r9540R4531j76628m1653K51405m71233L27914j39295j08310K03866
14025B584687l39332J25462j36711M4359k742j1164m8474Q7746p7352l63387K54713
14014B117805J37430j78711K2145M8703o3863q5680J19169j88294J20356l65020
14004A684040K83803k467K14423n85637l6254N01399n58854M24037j51562k2063
13994A750865J82034J34080n08515M97615J69662J165248L047810Q373167J6632277
13985C1444243Q894553j8692540j0515090m564164j804527r03032m43650n0883
13977C364910n13044m57675J19570J63853k38514k34135J11865j06435k34869
13968A975526K844n5038K32461k99349J86211O398l86395q1786P8409N37304l52582
$$ y = [2743630, 2644090, 2738621, 2561993, 2520340, 2771745, 2300512, 2628426, 2489131, 2380821, 2584687, 2245355, 2370817, 2234106, 2278465, 2275723, 2264559, 2216085, 2303831, 2226479, 1863092, 2117805, 2255235, 2076524, 2098669, 2147372, 2083509, 1997829, 2116998, 1928704, 2049060, 1684040, 1967843, 1965376, 2179799, 1594162, 1557908, 2059307, 1500453, 1924490, 1772928, 1750865, 1932899, 2066979, 1558464, 2056079, 2225741, 3390989, 6438799, 14811966, 31444243, 40338796, 21646256, 11131166, 6567002, 4762475, 3859443, 3415793, 3364910, 2851866, 2394191, 2513761, 2677614, 2439100, 2204965, 2316830, 2210395, 1975526, 1978370, 1923332, 2155793, 1856444, 2042655, 2049053, 1662658, 1580872, 1659281, 2196585, 1844003]
13957A844003L1102J9403k01049K49975m83265M91383o8794k39505p3083J03285
13947A673455k26545K34187K6862k52807K55484k62567J89626L026n2738m45777
13937A142206O82039k47354l8771J45781j41392m06611L96334j67112r8069M28035
13927A695086o0903o82909L11374K94157l20896K87472l23498O8459j16957L9851
13917A191236L00276J82832k10902j61386J71128L7445j67080n6303o9951k25171
13907I92124L32565J7147k79066K1973J42636j39059J94458m07258N66927E34417
13896A402534j62771j71911K21990j49855j47106K43449j67854M1840M5681j57871
13886I98126j47445O8701K47967J55310l46003R5550M2804Q1367p7132q6055O7670
$$ y = [1844003, 1875105, 1894508, 1693459, 1943434, 1460169, 1951552, 1882758, 1643253, 1570170, 1673455, 1446910, 1681097, 1707959, 1455152, 1710636, 1448069, 1637695, 1640721, 1587983, 1142206, 1824245, 1576891, 1538120, 1683901, 1542509, 1135898, 1532232, 1365120, 1267051, 1695086, 1634183, 951274, 1262648, 1556805, 1235909, 1523381, 1199883, 1268342, 1151385, 1191236, 1491512, 1674344, 1463442, 1302056, 1473184, 1510629, 1343549, 1287246, 1217295, 992124, 1324689, 1341836, 1062770, 1084743, 1227379, 1088320, 1282778, 875520, 1442447, 534417, 1402534, 1239763, 1067852, 1289842, 1139987, 992881, 1236330, 1068476, 1110316, 1155997, 998126, 850681, 919382, 1167349, 1322659, 976656, 1072206, 1115010, 1196377, 1119245, 1033190, 1100860]
13875A100860k5618q2327O0290R217l24656J05080q4489J35214J91702j65353
13865I19920n7015J10031K7627m21761P9298K74139m2674o9230j09986J2324r7666
13854F25007J24831P1984N3974J3724J86709j02200K72407n21118j00594l7645
13844E87079J93361K06136J36913j64018L673k15209N8561L68560l38346m5454
13834G91256j70352Q3687M6776J55607M1956m09218K99618k71204o6129q7397
13824D14600K68790K98738j25361K38619k83806J33850Q8212n5654j97638C57583
13813F02898K28102n9340l7207p6909J67057J5212l12043p1070J92166j9972Q754
13802F37648k9023l4775n3740L08493J91022m61016K06257l3053j23998J46529
$$ y = [1100860, 1075242, 992915, 1053205, 1062422, 737766, 842846, 758357, 893571, 1085273, 919920, 862905, 972936, 1000563, 578802, 658100, 932239, 889565, 820335, 710349, 722673, 625007, 749838, 821822, 875796, 889520, 1076229, 974029, 1246436, 725318, 624724, 587079, 780440, 986576, 1123489, 959471, 963144, 747935, 806496, 1175056, 836710, 791256, 620904, 704591, 751367, 906974, 948930, 539712, 839330, 568126, 501997, 414600, 683390, 982128, 856767, 1095386, 811580, 945430, 1033642, 977988, 780350, 357583, 602898, 831000, 771660, 734453, 657544, 824601, 839813, 527770, 456700, 648866, 628894, 637648, 608625, 573850, 520110, 828603, 1019625, 558609, 764866, 731813, 607815, 754344]
13792G54344j48187K90898m20237N0260J96058J08460m6548l29797K82760k82989
13782D55022K42513J85557m28816J77876n7400k42619l5508L12228l8892J60750
13772G30711k75359K93047l68827M75434k10370J38544J65944D65255J87917J6790
13762F69962j36122o7017O4740j75115K36635j52901P7040r158p9703K62290J8781
13751G09432j75268j47975M31533l90554j21167J25582j813P7877j04256K3518
13741D26909j3528J22664k2322j11620n8646K38057j23181O7053o3798j5885K2159
13730D67862j13343N8105k2419J05562K34983B86366M93007j59281r1432q5554
13720D43106j3730j64564K2649N7548j12084J40634K20211k16342K47488q6156
$$ y = [754344, 606157, 897055, 476818, 527078, 723136, 831596, 785048, 455251, 738011, 455022, 697535, 883092, 454276, 632152, 574752, 332133, 296625, 608853, 569961, 730711, 455352, 748399, 379572, 855006, 644636, 783180, 949124, 465255, 653172, 669962, 533840, 466823, 531563, 356448, 593083, 440182, 517222, 508064, 428361, 690651, 709432, 534164, 386189, 817722, 427168, 306001, 431583, 429770, 507647, 403391, 426909, 413381, 536045, 513723, 402103, 343457, 581514, 458333, 525386, 461588, 445703, 467862, 354519, 412624, 390205, 495767, 730750, 286366, 779373, 620092, 528660, 443106, 429376, 264812, 287461, 345009, 232925, 373559, 593770, 377428, 624916, 538760]
13710E38760P5845k7972j72389J9914o6026J31832K6511N6020J38203B00973L71178
13699E72151j46017j99631L65795k33990l9425J19789P7370O1714k64052P9573
13689C93277K9743r8432K12807J58032k67678J87704R324A97002a7463D85671
13678D53813N1462j31459O1052J70018A84007P8966Q0112R1521j14039A22147
13667B81595J73756O7008j38120O6045j55134j10883K73463j38257m1736J68868
13657D46605J06882A90159o987J3000e3838D15156J69509j84033L12137B29887
13646D97681j42058A31099J43699Q4012A42123K15509O3795L2020J53867B26934
13635C61812K11464A76022M4279L04802k9063B43139Q1339A19504M27338j39300
$$ y = [538760, 614605, 586633, 414244, 434158, 368132, 499964, 526475, 582495, 720698, 200973, 572151, 426134, 226503, 592298, 358308, 318883, 438672, 516042, 577756, 313704, 393277, 423020, 324588, 537395, 695427, 427749, 615453, 624777, 197002, -17463, 485671, 453813, 505275, 373816, 434868, 604886, 184007, 262973, 343085, 434606, 320567, 122147, 281595, 455351, 522359, 384239, 450284, 295150, 184267, 457730, 319473, 277737, 446605, 553487, 190159, 183172, 196172, -53838, 415156, 584665, 400632, 712769, 229887, 497681, 355623, 131099, 274798, 358810, 142123, 357632, 421427, 453447, 607314, 226934, 361812, 573276, 176022, 220301, 525103, 496040, 243139, 324478, 119504, 546842, 407542]
13625D07542K08121j26686k952j75390c3498l7943F53295k67590R9786r8408j74364
13614B12719J54290N0254A27363O5754N50464C23526n4280J40398j59607h8052
13603C08477K20278C4971M27013C7120M35916j88938l1647L1358L7678O3006K6930
13592D11423J2916R853A22310K87051A81628O9809K42783k656k27761N8225m2645
13581B79383J12197j3975l4868N9645n2084q4992M6031a5924I3587a03856n0834
13570a54690D17176H0014J78734j01650o1420J90904M7450J08430j14533A25750
13559C68074l0236P6808j09298j27603R5884J59533l5752j44440n9506I2121J62101
13548B54222F7488i6137d2209B26541j7790L2422m1240j8329G9759j9241J09957
$$ y = [407542, 615663, 488977, 486025, 310635, -33498, -71441, 653295, 385705, 485491, 387083, 212719, 367009, 417263, 127363, 193117, 743581, 323526, 269246, 409644, 250037, -88052, 308477, 528755, 34971, 461984, 37120, 473036, 284098, 252451, 283809, 321487, 384493, 411423, 424339, 434192, 122310, 409361, 181628, 251437, 494220, 491564, 263803, 322028, 279383, 391580, 377605, 342737, 402382, 350298, 265306, 311337, -15924, 93587, -103856, -154690, 417176, 80014, 258748, 157098, 95678, 286582, 334032, 442462, 327929, 125750, 368074, 337838, 414646, 305348, 177745, 273629, 433162, 397410, 252970, 193464, 92121, 254222, 67488, -96137, -42209, 226541, 208751, 241173, 199933, 181604, 79759, 60518, 170475]
13537A70475J402k3737b1088A36980M1277E2614L5758b06139C11548l2782o5114
13526B13652I6054K94840j03719M5640m8107A41860K21038C5356K76636A31692
13515G4322K47831K00431j61479A40654C3875j729K61652J89101B20322M6923
13505B67245M0449K6884p9125P6620j39876J84368n0403f609A74859J16222K6107
13494C17188l5333A0240L5141J66797G4669J24470F3495g2392D3396J70791G9098
13482A76555n848Q4593F8844J93250k7407c3579B58139O5667r3016J15406q7427
13471B58769M8879n0469a9528C29256G8423J9446l8930R9674K62824k2847F5273
13459G8247K54371c5277C72779j44437D4864K57831J16987j35456L74394l14903
$$ y = [170475, 171877, 148140, -21088, 136980, 178257, 52614, 88372, -206139, 311548, 278766, 213652, 96054, 390894, 287175, 332815, 284708, 141860, 362898, 35356, 311992, 131692, 74322, 322153, 522584, 361105, 140654, 33875, 32146, 293798, 482899, 220322, 267245, 307694, 334578, 255453, 332073, 192197, 376565, 326162, -6609, 174859, 291081, 317188, 281855, 10240, 45381, 212178, 74669, 199139, 63495, -72392, 43396, 214187, 79098, 176555, 170707, 255300, 68844, 262094, 234687, -33579, 258139, 323806, 230790, 346196, 258769, 307648, 257179, -19528, 329256, 78423, 97869, 58939, 158613, 421437, 398590, 65273, 78247, 332618, -35277, 372779, 228342, 44864, 302695, 419682, 284226, 658620, 343717]
13449C43717j32352J67228n9365j19135Q2553k6886R3525A62796K6158g4588B29855
13437C22732a34891D41624A65626C7211K45369g6829A67069d6395B99532A11716
13426D8473K49638m8014A6324g3199F1079L9317J75147r5155l3317Q263K49910
13415D05244B2956K94405m881O6956O6334o1300j50927q2836c9339D29782j11591
13404C18191i7213B15957H1918d0172A50861A7911a86098B57545A15367b74285
13393A28095J7551J32642J99581j43457A29409L20904A21910P0190J22100C996
13382A59825J423J0319L13110E4102Q8503J08992f8393B30045K87922j94409i6546
13370I8192b47018B33039p2595N3817R892A7992J73136n6293J43007g0721A63153
$$ y = [343717, 211365, 378593, 319228, 200093, 282646, 255760, 349285, 162796, 188954, -74588, 229855, 322732, -134891, 441624, 165626, 37211, 282580, -76829, 167069, -46395, 299532, 111716, 48473, 298111, 250097, 16324, -73199, 61079, 100396, 275543, 180388, 147071, 155334, 405244, 22956, 317361, 312480, 379436, 445770, 384470, 233543, 150707, -39339, 429782, 318191, -97213, 215957, 81918, -40172, 150861, 17911, -186098, 257545, 115367, -274285, 128095, 145646, 278288, 477869, 334412, 129409, 450313, 121910, 192100, 314200, 3996, 159825, 161248, 171567, 484677, 54102, 142605, 251597, -68393, 230045, 517967, 323558, -96546, 98192, -247018, 233039, 160444, 214261, 224153, 17992, 191128, 134835, 277842, -70721, 163153]
13358C30527M3011n5384a33000A62586L11539b50640B63518A19562a47696G6899
13347B60956j06762I551J25137a57480a4568B19790j8355L51188B63958L4649
13337B98607o7954J84849E3941Q6382a40593A19863j6339C5618c5063l7213A30252
13325A63898J06397A17042B8679J39181K26638l301A28937C3569K21142J00533
13315C55244f3548A81625L1503O3597j30861h5556K0095C1213j0964J23072N8202
13304B01523g9489B46824B5310L98138j93971M5139D5508K80253F5086c9821A81882
13292C89268B9620c2283B38237l1441D8029O7944k3677C4410c05418A70050P1827
13281B41877o4820K03180n5687C9780j7512K09938K19978k23916J29310r2227
$$ y = [330527, 373538, 318154, -133000, 162586, 474125, -250640, 263518, 119562, -147696, 76899, 260956, 154194, 9551, 134688, -157480, -14568, 219790, 201435, 552623, 263958, 298607, 230653, 415502, 53941, 140323, -140593, 119863, 103524, 35618, -35063, -72276, 130252, 163898, 270295, 117042, 28679, 167860, 394498, 391197, 128937, 33569, 254711, 355244, -63548, 181625, 213128, 276725, 145864, -85556, -65461, 31213, 20249, 143321, 201523, -79489, 246824, 25310, 423448, 229477, 274616, 45508, 325761, 65086, -39821, 181882, 389268, 29620, -32283, 238237, 206796, 48029, 115973, 92296, 34410, -305418, 170050, 241877, 177057, 380237, 324550, 39780, 22268, 232206, 452184, 228268, 357578, 265351]
13271B65351b58437A03118K02997o7956A04827M4530L96980a7447F4535J21629
13261A86164J29113e0044A76970G1115b60389d9696P582A22511K39983j74207
13251A88287m0367d8501H3452d5895A40525h138C7781M3362K9745j2305h7235
13239A21954L3506Q1801o2978D5215K44710o9975l1311a50648A60976p726i7690
13227A49910J19586f3423G4639B7075J39897f69j48222A07032l8552J96826B6020
13215a31156A77893b4775j06167B9519a13535K3786E0716J89305N3624j27597
13205A66048J69837j09053p4978n249a24955B10487E2438J49388o8578o3400J60642
13194B30490A9407b40587A41313a013l9400A93155B492J36072b07045i4863A87017
$$ y = [265351, -258437, 103118, 306115, 238159, 104827, 149357, 546337, -17447, 64535, 186164, 315277, -50044, 176970, 71115, -260389, -49696, -42114, 122511, 362494, 188287, 147920, -48501, 83452, -45895, 140525, -8138, 37781, 81143, 110888, 98583, -87235, 121954, 155460, 237261, 174283, 45215, 289925, 219950, 188639, -150648, 160976, 153250, -97690, 149910, 269496, -63423, 74639, 27075, 166972, -669, -148891, 107032, 68480, 265306, 26020, -131156, 177893, -24775, -130942, 29519, -113535, -89749, 50716, 240021, 293645, 166048, 335885, 226832, 151854, 146605, -124955, 210487, 52438, 201826, 133248, 69848, 230490, 19407, -240587, 141313, -1013, -40413, 193155, 2492, 138564, -207045, -94863, 187017]
13182a52698I4406j1653N5568J50873K3011F7255f5596B3227P821a36821C71386
13170i8744B65201l3423A02994C7783b89186B98030j01508D3846J31448a26242
13159h6037D4356N0914a49035j2488I1865M2187C3754f6861A51810R4554m25H3719
13146I5184R2639b11753c1072G627c37502B0597p32a07463C34850a1799H9010
13134F6332e8229B37001E5662M5055K33769j13300a31221Q568A37676c99847A7993
13122A61923J05440r9346b13789A13868B1917K49829A08374a1331A43445i6480
13111A89592G4118R688M3821B3785J81316E3182a1911r2835A2994N0365M1726
13100A05085a51897j02204g3777m4150j26647f6061q8910B66299d5207j36641
$$ y = [-152698, 94406, 82753, 138321, 289194, 312205, 67255, -65596, 23227, 31048, -136821, 371386, -98744, 265201, 231778, 102994, 37783, -289186, 298030, 196522, 43846, 175294, -126242, -86037, 44356, 95270, -149035, -161523, 91865, 134052, 33754, -66861, 151810, 246364, 245939, 83719, 95184, 187823, -211753, -31072, 7627, -337502, 20597, 19865, -107463, 334850, -11799, 89010, 66332, -58229, 237001, 55662, 100717, 334486, 221186, -131221, -122653, 137676, -399847, 17993, 161923, 267363, 168017, -213789, 113868, 21917, 271746, 108374, -11331, 143445, -96480, 189592, 74118, 83806, 127627, 23785, 205101, 53182, -11911, -104746, 12994, 63359, 105085, -151897, -254101, -73777, -117927, -244574, -66061, -154971, 266299, -45207, -181848]
13090a81848P9482a6850I2197B2111J61303l6374o3874a96204p571B11764a57913
13078E26069k19613a98474D390b88388B15512M11D8268K4248P1113N3352c7519
13066A63345a37732C636M2185A9438K78263J47945A07336j3851j3507Q7691o3455
13055A04214a86076j4094A51795p1335a81573H1653k5705J94092c5448q4594D2140
13043E1872b70116l2104R7993P9266B24297a75414a8552C33285M4133b9647A36687
13031f0557B21502E667O8265h4039A9234K09324J62398a48476B30736r2833c0368
13019B14179a06498B45825i996r6541A24221m5427L3568J3298j0894M9301b47614
13007a08673A90991l7903p0075f6885j16961f706k45182i9134B35363o0407O5180
$$ y = [-181848, -102366, -16850, 92197, 22111, 183414, 147040, 83166, -196204, -203775, 211764, -157913, 526069, 306456, -198474, 4390, -288388, 215512, 215923, 48268, 72516, 143629, 196981, -37519, 163345, -137732, 3636, 45821, 19438, 297701, 445646, 107336, 93485, 79978, 167669, 104214, -186076, -200170, 151795, 80460, -181573, 81653, 55948, 250040, -35448, -120042, 42140, 51872, -270116, -302220, -204227, -124961, 224297, -175414, -18552, 333285, 377418, -29647, 136687, -60557, 221502, 5667, 73932, -84039, 19234, 228558, 390956, -148476, 230736, 137903, -30368, 214179, -106498, 245825, -9996, -106537, 124221, 78794, 112362, 125660, 114766, 164067, -247614, -108673, 190991, 153088, 83013, -66885, -183846, -6706, -251888, -99134, 235363, 174956, 240136]
12996B40136G5106B6627b98506D19727a01874C55601g6802A34763e63j25707l7368
12985a63638e0423B45530i4885C61513a08667q2372A71679E2443J75211N240B7364
12973E493d1760E23661d7481i034C1996a47706B34325D5430a44109A81272c7644
12961C70100k825E6914a1540k5242r6606k3745B1285E43L15863F4088h4779r6353
12949a81132A2753c07983C2245J80448A04821M0284n3827K28922E1391L0455J66978
12938B48824p0163a52076c2584A44195C4537O4956a89156R1199A05482a91881
12927D27334b26342R0758E0203J3202c4552G8024K859a97380F835L02248E8530
12915B24098E6361P4305f3668q1974a9539j6083C44098j40145q0469a87792c7916
$$ y = [240136, 75106, 26627, -298506, 419727, -101874, 355601, -76802, 134763, -563, -126270, -163638, -50423, 245530, -94885, 361513, -108667, -191039, 171679, 52443, 227654, 232894, 27364, 5493, -41760, 523661, -47481, -9034, 31996, -147706, 234325, 45430, -144109, 181272, -37644, 370100, 367275, 56914, -11540, -36782, -133388, -157133, 21285, 543, 316406, 64088, -84779, -181132, 12753, -307983, 32245, 212693, 104821, 145105, 91278, 320200, 51391, 81846, 248824, 178661, -152076, -32584, 144195, 34537, 99493, -189156, -97957, 105482, -191881, 427334, -226342, -135584, 50203, 63405, -34552, 78024, 80883, -197380, 6835, 309083, 58530, 224098, 56361, 130666, -63668, -145642, -19539, -35622, 344098, 203953, 123484, -187792, -37916]
12903a6744E3872J4515J88117F2388J60205I204c0947I5516a58798G7371a24299
12891A71439B8150K12132I0968a01934F2107e8648B45565a6812k0763l70690I6856
12879i7185C60520b69893h4204p3903A5823N8090R1078b19471C87473A43315J00739
12868B44054a13109B2447b0038k6902A11391a76391r18e69j82698B924Q7238b10535
12855B02652k5731B9299N4233a85181A9500J8523N2958i1607k1808A95115O0753
12844B55868c42037a11919B33099a5591j66244G2847O8198J96553a24676m0989
12834a65665o8089B7721N1096l2991a49367F6739J4206B4081J19385K1683L5898
12823B01047a96532I7527j704a44984C9590J77313I712J78212D6076L0736a79455
$$ y = [-16744, 53872, 68387, 256504, 62388, 222593, 9204, -30947, 95516, -158798, 77371, -124299, 171439, 28150, 240282, 90968, -101934, 62107, -58648, 245565, -16812, -37575, -408265, 96856, -97185, 360520, -269893, -84204, -158107, 15823, 73913, 164991, -219471, 387473, 143315, 244054, -113109, 22447, -20038, -46940, 111391, -176391, -177309, -569, -183267, 2924, 90162, -210535, 202652, 176921, 29299, 83532, -185181, 19500, 38023, 90981, -91607, -113415, 195115, 255868, -342037, -111919, 233099, -15591, -181835, 72847, 141045, 337598, -124676, -165665, -233754, 27721, 78817, 45826, -149367, 66739, 80945, 24081, 143466, 165149, 201047, -196532, 97527, 95823, -144984, 39590, 216903, 9712, 187924, 46076, 76812, -179455]
12811B8473a53294H6534A9054a29925j80556P3816B9619M14209F8685d05175H5429
12799b11724F9151h9102A79173n96j5602d8808A50019a11742F8506i8277d6538
12787G1713i7820j29700a407A3591J2401O6785J62895b27851B46591H8004D1530
12775b21607Q7593N091A28846b20672o5606C7317a53193A52949a45875l12067
12765d57942J91589e8848A32601i0095a0142B11247m2110a4157A27298j2890A4219
12753A4090M6568c6355c026A0778b07739h3076A247L038a4712A05582f7396q8528
12741a55924I3650i7805A46049K94068H7863q739J60790i7793A34635N5771E562
12729A26537e2309B09493a1882q632k22785C5258i9933H4960j8163R5708n9694
$$ y = [28473, -153294, 86534, 19054, -129925, -310481, -236665, 29619, 443828, 68685, -405175, 85429, -211724, 69151, -89102, 179173, 178577, 162975, -48808, 150019, -111742, 68506, -98277, -46538, 71713, -97820, -227520, -1407, 13591, 25992, 92777, 255672, -227851, 246591, 88004, 41530, -221607, -134014, -128923, 128846, -220672, -286278, 37317, -153193, 152949, -145875, -457942, -266353, -58848, 132601, -90095, -10142, 211247, 169137, -14157, 127298, 114408, 14219, 14090, 60658, -36355, -3026, 10778, -207739, -83076, 1247, 4285, -14712, 105582, -67396, -155924, 93650, -97805, 146049, 440117, 87863, 79124, 239914, -97793, 134635, 190406, 5562, 126537, -52309, 209493, -11882, -20514, -243299, 35258, -99933, 84960, 66797, 162505, 102811]
12718A02811j2181a01043I2394C2290R9548d37j97560n4238B92353K8335A11487
12706f1065I6050l0842a88765A08520J29419R540C8210c09159B76017g963r4658
12695a02621p6302A9651M4164h4393A23886M4014a98475A60403k7666a98471C49166
12683C30122A16954k6976A3541C333L3515a1318B4837N8975J6965D6722Q6942
12672A33664R5030a71019m645B55625G361J39088F8030a19073o4695A83020P8041
12661B61061B8061Q7216L7415e0254E2343i9100q3425C40877b98036B45781D0748
12649B73625A08113i2030B56454j00936J78264a2126k7750k01746C4501K03231
12639B37732M9220R4049B6470J4325O1368b8371k53393A8500J5705a20397A48333
$$ y = [102811, 90630, -101043, 92394, 32290, 131838, -437, -197997, -252235, 292353, 320688, 111487, -61065, 96050, 65208, -188765, 108520, 237939, 247479, 38210, -309159, 276017, -7963, -102621, -178923, 19651, 63815, -84393, 123886, 167900, -198475, 160403, 132737, -198471, 349166, 330122, 116954, 89978, 13541, 3333, 36848, -11318, 24837, 83812, 100777, 46722, 133664, 228694, -171019, -175664, 255625, 7361, 146449, 68030, -119073, -183768, 183020, 261061, 28061, 115277, 152692, -50254, 52343, -99100, -182525, 340877, -298036, 245781, 40748, 273625, 108113, -92030, 256454, 155518, 333782, -12126, -39876, -241622, 34501, 237732, 286952, 381001, 26470, 40795, 102163, -28371, -281764, 18500, 34205, -120397, 148333]
12627A52448L5371l5843A4321K6121Q3840O7820n982O0332i0095o3119E24946
12615B12593d5429j57579g4259m060E1825j252P6651b29778P416B41975F9997
12603A56628e0572A86511I736K94434b70429g0047q4558J4665B82456r1316a55447
12591D1553L38c2669gA90648b98695O5122E1811N0458m9506H327a89913b2280
12578A50647b31753Q9009d708A28873L163K95460a02917B15504a467G3503b14522
12566I8476m1481J83750q3338a62926H3736B5886i5639A39223J96955a90225O5530
12555a24695G1206K25972J3553j18894g1939a2897k2685o7226C8093a09402A53667
12543B26528d464A26617a7036k7975G2518K40738b09438L6862C30485b741j19225
$$ y = [152448, 187819, 151976, 14321, 40442, 124282, 192102, 186120, 246452, -90095, -153214, 524946, 212593, -45429, -203008, -74259, -78319, 51825, 50573, 127224, -229778, -222362, 241975, 69997, 156628, -50572, 186511, 9736, 304170, -270429, -70047, -154605, -139940, 282456, 191140, -155447, 41553, 41891, -32669, -7, 190648, -298695, -233573, 51811, 102269, 52763, 8327, -189913, -22280, 150647, -231753, -142744, -4708, 128873, 132036, 427496, -102917, 215504, -1467, 73503, -214522, 98476, 56995, 240745, 157407, -162926, 83736, 25886, -95639, 139223, 336178, -190225, -124695, 71206, 297178, 310731, 191837, -71939, -12897, -35582, -102808, 38093, -109402, 153667, 226528, -4464, 126617, -17036, -45011, 72518, 313256, -209438, -172576, 330485, -2741, -121966]
12532a21966B43940a23749I8739i147j06802G1211d36944a96943B93466i3437
12521A02135i0760k17981C36981a5829A31121D7527j4224a99699A84953b14219
12510a47943A61576b80544C25460a37658K5984j51519m0667a36683H2215J11554
12500A93769b6392j18219I8823i9908L5872r3555B08457M5373D0674a40215r2850
12489b33065A26797B3987O880a47342B4035M55993D7616J83510i7490a5867A85535
12477C00456e8182A54441f7667k2356r2098c5982C98837A8176L578J20951b41690
12465C62689a06533B620L9613b91380h5218D4226J6669a52680G72a69946g1672
12453B20070H9677M3090d4948j50498K9202g0440A75695i6241G0798K98021a83746
$$ y = [-121966, 243940, -123749, 98739, -9147, -115949, 71211, -436944, -196943, 293466, -93437, 102135, -90760, -308741, 336981, -15829, 131121, 47527, 33303, -199699, 184953, -214219, -147943, 161576, -280544, 325460, -137658, -111674, -263193, -303860, -136683, 82215, 193769, -26392, -144611, 98823, -99908, -64036, -157591, 208457, 253830, 40674, -140215, -233065, 126797, 23987, 30867, -147342, 24035, 480028, 47616, 231126, -97490, -15867, 185535, 300456, -58182, 154441, -67667, -90023, -182121, -35982, 398837, 18176, 21754, 142705, -241690, 362689, -106533, 2620, 42233, -291380, -85218, 44226, 60895, -152680, 772, -169946, -71672, 220070, 89677, 132767, -44948, -195446, -166244, -70440, 175695, -96241, 70798, 368819, -183746]
12441b9469C13418a90344N7938j9042j01293d5254j18521k84474a01463A15330
12430c9867G2497P2074b82829i1579n0529K964j74185C1475J04567a0005C97686
12418e1843B35010g9904B35889l2356N4564a15618A43545b45390a00712A7291
12407H2180k533g4811j56E8810a4541q2499I9120m0327L29422j87127g788A96304
12394A37013d1016j4147D53194b2825o4756j85076J00694B15342d917A52891m4728
12383A08163g2513A5242J77907c9920k26560A10506a98276E0203N9513d2481B0548
12371a74891B0684a0009A44333o0156B2932a10206j37295A34307a67671A34738
12360A91025a33945D9793a14875N3560L590J7811j29303A21048Q0612g6123L7619
$$ y = [-29469, 313418, -190344, -132406, -151448, -252741, -45254, -163775, -448249, -101463, 115330, -39867, 72497, 144571, -282829, -91579, -142108, -139144, -313329, 31475, 136042, -10005, 397686, -51843, 235010, -79904, 235889, 203533, 258097, -115618, 143545, -245390, -100712, 17291, 82180, 79647, -74811, -74967, 58810, -14541, -97040, 99120, 58793, 388215, 201088, -7788, 196304, 137013, -41016, -55163, 453194, -22825, -87581, -272657, -171963, 215342, -4917, 152891, 108163, -72513, 15242, 193149, -39920, -266480, 110506, -198276, 50203, 109716, -42481, 20548, -174891, 20684, -10009, 144333, 84177, 22932, -110206, -247501, 134307, -167671, 134738, 191025, -133945, 49793, -114875, -61315, -57725, -39914, -169217, 121048, 201660, -76123, -38504]
12349c8504j13847C2681c43098a28491K1494p8553c7668A63186c78101B4982f0601
12337b7842B19614C0301f6357J7940k15530d5089D9508C691K8723a43385j69815
12326c13200I8731h5719D3161L15996I2663a37817L4752d9706l21057A31367b58316
12314C4052K42384B6705d8883j17785a7231B37077A01786b51865A986b88311A2861
12302B03633D1587a39588j0348p2321E8614a8052l38877d760k04162M1263D7685
12290a6808B12818a60522C1547f3104n3792b7990j22077a5353j80764D7825K20135
12279B67960i0395A71196n3145d9562I4521b79268A93352p6145K35450A5915P7085
12268I3000b78135A66178h2163E6893p042d1369j16281j01773a09220M8346C25814
$$ y = [-38504, -152351, 32681, -343098, -128491, -106997, -185550, -37668, 163186, -378101, 24982, -60601, -27842, 219614, 30301, -66357, -48417, -263947, -45089, 49508, 3691, 32414, -143385, -313200, 98731, -85719, 43161, 359157, 92663, -137817, -103065, -49706, -370763, 131367, -258316, 34052, 276436, 26705, -48883, -166668, -17231, 237077, 101786, -251865, 1986, -288311, 12861, 203633, 41587, -139588, -149936, -222257, 58614, -18052, -356929, -4760, -208922, -167659, 47685, -16808, 212818, -160522, 31547, -63104, -116896, -27990, -150067, -15353, -196117, 47825, 267960, -90395, 171196, 118051, -49562, 94521, -279268, 193352, 117207, 352657, 15915, 93000, -278135, 166178, -82163, 56893, 49851, -41369, -157650, -259423, -109220, -60874, 325814]
12256h6489A05753F911a72604a2102I387j993b52785P9672J6099c133G5870J95671
12244B71541l1786I0682J29894D884c5371E05167A54252J1609L1416K3128j07712
12233A12693b4030D5535a0364B88707j32984N3587F6733K63379D399O3290J46712
12222B14401c5492B12683m5144J06175c7976k59165A38727P5896A01941d4219
12211f3132j21449j982a3398D0532N40A6547J82996I3302M51371j60610A87013
12199b0773a893n7951l27236A4560R0696L8711c9471j69114B30792b43537B76651
12187C20905c4162n2135K6027C08967A28497c5477n9239B31066A00187J97373
12177B97560k2426B6510b67813C32852C6597a31585D7838J8990j4179K56633G6438
$$ y = [-86489, 105753, 6911, -172604, -12102, 9387, 7394, -252785, -173113, -157014, -3133, 75870, 271541, 239755, 90682, 220576, 4884, -35371, 505167, 154252, 165861, 197277, 220405, 112693, -24030, 45535, -10364, 288707, 155723, 209310, 66733, 330112, 4399, 67689, 214401, -35492, 212683, 167539, 273714, -37976, -297141, 138727, 214623, 101941, -44219, -63132, -184581, -186563, -13398, 40532, 41072, 16547, 199543, 93302, 544673, 384063, 187013, -20773, -1893, -59844, -387080, 14560, 105256, 143967, -39471, -208585, 230792, -243537, 276651, 320905, -34162, -86297, -60270, 308967, 128497, -35477, -94716, 231066, 100187, 297560, 275134, 26510, -267813, 332852, 36597, -131585, 47838, 66828, 52649, 309282, 76438]
12165B72709q5115B6341f2239H6887K78716A47714J65499A43136D3389J58194
12155B01583J76867g7557b5538A85894F0492a73196A57481M6422r4867C7536b8219
12143f0007B7733J92408j447h4672J2929B27529E2990J57895a9262C61696h0399
12131h3498C4058J29280a87821b2056B53071p0491J38041A37924m657c7380C18025
12119G899J74442a47657A51736e441B02056a38008e5476B57921g9339C28904a50189
12107D5137j7963a17276B49289g2977a6069k55852B72232h4647A15534A1165c889
12095B26691n2889K0046d66958G3809a64562P7961A13176a92138o4532I3845D445
12083a1138A04279n957C8392K14254N0605N37881M848A68382J91575j78524o6521
$$ y = [272709, 187594, 26341, -62239, 86887, 365603, 147714, 313213, 143136, 43389, 201583, 378450, -77557, -25538, 185894, 60492, -173196, 157481, 203903, 109036, 37536, -28219, -60007, 27733, 220141, 218694, -84672, -71743, 227529, 52990, 210885, -19262, 361696, -80399, -83498, 34058, 163338, -187821, -22056, 253071, 182580, 320621, 137924, 133267, -37380, 318025, 7899, 182341, -147657, 151736, -5441, 202056, -138008, -55476, 257921, -79339, 328904, -150189, 45137, 27174, -117276, 249289, -72977, -16069, -271921, 272232, -84647, 115534, 11165, -3889, 226691, 173802, 193848, -466958, 73809, -164562, -86601, 113176, -192138, -256670, 93845, 4445, -11138, 104279, 98322, 38392, 252646, 303251, 841132, 845980, 168382, 359957, 181433, 114912]
12072A14912a34827f3611A51085b3745I7825a85871o2926D7226a13668e0173j56480
12061b06653a8344j03665B89809I7810c32832A99546B3435M6697N0317p40G399
12049E9921a8818B44941f6604k22090L5500A50138J31999C7268A503a19516F0856
12037b4057B15749f0326m12053f4257r1678M200o5498R0462D0421i9430A84224
12025g3886l4934l522j12426G9673A744K1565c7053Q618j39509j9018B999J25166
12013A28165l8261J8275N6592a77062A81716d2605l8380A24365b20899a9816k53046
12002b72862A21525a67132j6509b5596A16548B4400i5996A01445i6666A49779
11991C068a57238P1950E0228k1206a74843p0422A26735c9647q241A20351f8445
$$ y = [114912, -134827, -63611, 151085, -23745, 97825, -185871, -248797, 47226, -113668, -50173, -206653, -18344, -122009, 289809, 97810, -332832, 199546, 23435, 70132, 120449, 119709, 7399, 59921, -18818, 244941, -66604, -288694, -253194, 150138, 282137, 37268, 1503, -119516, 60856, -24057, 215749, -60326, -472379, -64257, -155935, -151735, -217233, -126771, 40421, -99430, 184224, -73886, -108820, -112342, -224768, 79673, 1744, 23309, -37053, -28435, -167944, -186962, 2999, 128165, 89904, 108179, 164771, -177062, 181716, -42605, -80985, 124365, -220899, -19816, -272862, 121525, -167132, -183641, -25596, 116548, 24400, -95996, 101445, -96666, 149779, 3068, -157238, -85288, 50228, 29022, -174843, -245265, 126735, -39647, -47888, 120351, -68445]
11979B27431F3970b63369B24098b31226C84664h0068j27884d8413B2962d2975
11968D8207M8966f3504D4897e3452K6202B12527o447A7306h4961j14745c7262
11956C45813j63279a0700j08665a3690j78335B07719B124K57423C927a22366c7262
11944a75745F7135a375j23990N1165C04293g3005k6537A49107b06332H2329d36585
11932D3091b59343e104B51623a44900b8759a0839n7167A7117d0507G7108c05929
11920a97006K3903j66547G7347h212j10775j89819J09873D7735L6990a862q2814
11909h4676F8385B3229a87872k0523A51340B5459h9619l02466A16262a73818J753
11898a72065C4022b5798E4252f2783n2578k5821n4923B29619J49257b83612G9844
$$ y = [227431, 63970, -263369, 224098, -231226, 384664, -80068, -207952, -48413, 22962, -42975, 48207, 97173, -63504, 44897, -53452, -27250, 212527, 206080, 17306, -84961, -199706, -37262, 345813, 182534, -10700, -119365, -13690, -192025, 207719, 2124, 259547, 3927, -122366, -37262, -175745, 67135, -1375, -125365, -74200, 304293, -73005, -99542, 149107, -206332, 82329, -436585, 43091, -259343, -5104, 251623, -144900, -28759, -10839, -68006, 17117, -40507, 77108, -305929, -197006, -173103, -339650, 77347, -8212, -118987, -308806, -198933, 47735, 84725, -1862, -84676, 68385, 23229, -187872, -208395, 151340, 25459, -89619, -392085, 116262, -173818, -172065, 34022, -25798, 54252, -62783, -115361, -141182, -196105, 229619, 378876, -283612, 79844]
11886b15722A35193K0880b87191E7801b46069R1951a9622B1640g5193B67837E6556
11874a5102D3091K71985a20937a0091A4778b73308i1043o7197H3072C7321K45544
11863B82865A0398J34195J04567b1403p9237A0314J76875a29479l6021k144A07908
11851c58605A21872b40392E0900Q0453a0476A6808a04453C1340N7077J11637a70540
11839g3238J1816B41151a39344I2341R2855A0717h5095k45103i8363E0818c86454
11827B2758e280m54265K29688k9257d2567C35495i181l43824R5966r2809J01518
11816b48330C0779J7024a12241L9983j18013F2683m224c9510l4953A58621b34389
11804i6055c2707B4042n805e0918B30861e6577D2691J05703B9393N6713K36388
$$ y = [-215722, 135193, 156073, -287191, 57801, -246069, -154118, -19622, 21640, -75193, 267837, 56556, -15102, 43091, 315076, -120937, -10091, 14778, -273308, -91043, -158240, 83072, 37321, 282865, 10398, 144593, 249160, -21403, -100640, 10314, 187189, -129479, -165500, -167644, 107908, -358605, 121872, -240392, 50900, 131353, -10476, 16808, -104453, 31340, 88417, 200054, -170540, -73238, -61422, 241151, -139344, 92341, 185196, 10717, -85095, -330198, -98363, 50818, -386454, 22758, -5280, -459545, -229857, -259114, -42567, 335495, -9181, -353005, -257039, -349848, -248330, 30779, 47803, -112241, -72258, -190271, 62683, 58459, -39510, -74463, 158621, -234389, -96055, -32707, 24042, 18237, -50918, 230861, -56577, 42691, 148394, 29393, 86106, 322494]
11793C22494H0584a14118c3311A48146h8770C7213a838o08083a51120A3675c9183
11781b14209Q5844r8066i0219B55418n3491b26699r7262F6405i2196B0898j889
11770A9009R0545K6460a218l32131a11428A47084M3704a90650A93886h019G2723
11758b96778j22486A65089K7958e5093H6882K39061a27529C519J45303j6479c46427
11746f8810B48748c9349j04894M3982j40432C5404H99d2495K733j9361j78378
11735b37501a14670j7827Q757L3948c714l75289a53288r6000B03253a46850B4568
11723b53297d4401D5769K28908D3532K95942a2002H9571K42439a00198k0162A21593
11711e4223A25901b59274d205A04278b66001Q4508a696A14321a76610C21660a82210
$$ y = [322494, 80584, -114118, -33311, 148146, -88770, 37213, -1838, -609921, -151120, 13675, -39183, -214209, -128365, -226431, -90219, 255418, 201927, -226699, -323961, 66405, -92196, 20898, 19009, 109554, 136014, -1218, -333349, -111428, 147084, 190788, -190650, 193886, -8019, 72723, -296778, -419264, 165089, 193047, -55093, 86882, 325943, -127529, 3519, 148822, 132343, -346427, -68810, 248748, -39349, -144243, -100261, -240693, 35404, 899, -42495, -39762, -59123, -237501, -114670, -132497, -123740, -89792, -3714, -379003, -153288, -249288, 203253, -146850, 24568, -253297, -44401, 45769, 274677, 43532, 339474, -12002, 89571, 332010, -100198, -120360, 121593, -54223, 125901, -259274, -4205, 104278, -266001, -181493, -1696, 114321, -176610, 321660, -182210]
11699a3642E0323J60174k9978a62872g4765j47141g2515k97726A31841B879L65565
11688C68444F7119d9817A19185b85650a16499A1302a43047e3469j06216B45052
11677d4296A09406b2785k45272a3847A3098h5431k16110Q6311A22633A5599h1804
11665C02544b05041B80948j07276D6427q411b7811A50668A7605J57769n5487m1747
11654G8140N4445B1570g9601i616n0459A20491g0001k79891J69343A59914a05565
11642f039l1827q914G7118O3366K17086A65290f8726A80575H5110a18350l1937
11631a50287A9710b97489C13344A9565K06435p3524b48286D92066E4833o378i1247
11619a89414A19471O7602g0264C975J49152k2880h4801A03819J81797I1944a25843
$$ y = [-13642, 50323, 210497, 180519, -162872, -74765, -221906, -72515, -370241, 131841, 2879, 368444, 67119, -49817, 119185, -285650, -116499, 11302, -143047, -53469, -159685, 245052, -44296, 109406, -22785, -268057, -13847, 13098, -85431, -301541, -215230, 122633, 15599, -81804, 302544, -205041, 280948, 173672, 46427, 38016, -27811, 150668, 17605, 175374, 119887, 78140, 132585, 21570, -79601, -9616, -60075, 120491, -70001, -349892, -180549, 159914, -105565, -6039, -37866, -46780, 77118, 140484, 357570, 165290, -68726, 180575, 85110, -118350, -150287, 19710, -297489, 313344, 19565, 226000, 152476, -248286, 492066, 54833, 48455, -91247, -189414, 119471, 187073, -70264, 3975, 153127, 130247, -84801, 103819, 285616, 91944, -125843]
11607A76477g0605a72j8164j65304H75J3943b99564C6744a51213C87956f1420
11595A97540D8250M5686K40501b48942A707M5364O8385G190R3737J40366E9953
11583a80435m0298A14616K76125h3306d398l5049A06646k39j4869b86624e9645
11571A81059f1379j225B70366q9768n1032a59832A58270a71641b9233r5667A50969
11559b5799r951J214k38468e4851B6077L1931R769a8292C01594J2171b88840a04825
11546a37566B00009c14641G9308Q8476a70741f0049A41231m6328J79500g8974
11535A61921A9882b10592e4797B12938q2720e4053F4733K32516E2463b29891F5834
11523B47812h8900k7549j66262D51396A67510f4448A1775J9780N4672c316q4901
$$ y = [176477, -70605, -172, -18336, -183640, 875, 14818, -299564, 36744, -151213, 387956, -61420, 197540, 48250, 93936, 334437, -248942, 1707, 47071, 115456, 7190, 100927, 241293, 59953, -180435, -220733, 114616, 390741, -83306, -4398, -39447, 106646, 106407, 91538, -286624, -59645, 181059, -61379, -62604, 270366, 180598, 129566, -159832, 158270, -171641, -29233, -124900, 150969, -25799, -35750, -34536, -273004, -54851, 26077, 58008, 67777, -18292, 301594, 313765, -288840, -104825, -137566, 200009, -314641, 79308, 167784, -170741, -60049, 141231, 94903, 274403, -78974, 161921, 19882, -210592, -54797, 212938, 130218, -54053, 64733, 297249, 52463, -229891, 65834, 247812, -88900, -116449, -282711, 451396, 167510, -64448, 11775, 31555, 86227, -3316, -88217]
11512h8217j39250G6691K11667D6756R0244K1841c2373C16167c5667D02556A80805
11500A49583n5488B4538J21032J64780g2112J3693q7800c738j52864A15617H698
11488E4680b15298d1988M509B61689J54792a24562C00175A4412h8457H0263K8923
11477A09186D6244R4018e9073B03886f1561A51321R8088q0917a67733I1602d0134
11465C7021a32798B8346Q1602m9340J59529c216k6659I7544L32759A80246a28138
11453H4026P83a31525A23179R6287a95181A96312f6565j2356p5751A74947c60263
11441B13139b6436H4530f9205K5042J9518A01115g5909k1454k22840I8454a63452
11429F6368c20027C3171a01846F5402O0959i6890j76281C7510J02758a66702h42
$$ y = [-88217, -227467, 76691, 288358, 46756, 137000, 158841, -32373, 316167, -35667, 402556, 180805, 149583, 94095, 24538, 145570, 310350, -72112, -58419, -146219, -3738, -156602, 115617, 8698, 54680, -215298, -41988, -37479, 261689, 416481, -124562, 300175, 14412, -88457, 80263, 109186, 46244, 140262, -59073, 203886, -61561, 151321, 249409, 168492, -167733, 91602, -40134, 37021, -132798, 28346, 109948, 60608, 220137, -3216, -29875, 97544, 430303, 180246, -128138, 84026, 84809, -131525, 123179, 219466, -195181, 196312, -66565, -78921, -154672, 174947, -360263, 213139, -26436, 84530, -69205, -44163, -24645, 101115, -75909, -97363, -320203, 98454, -163452, 66368, -320027, 33171, -101846, 65402, 126361, -96890, -273171, 37510, 140268, -166702, -842]
11417g1432B873M4508c53024A13988d6375A16953a84061b1608H6870J64115O495
11406B57480j15110D5268a94987i2326M1684A60774D5904a6215A00601m35F700
11394A73198a52414g4925k78683a50365A46288D8956J28779h4425B24528b00973
11383a75873B05024k3443M824a8255k49879a8127B4800b02072A93931a11621i849
11371c262j2097l3816H5418a60591E0085K9932J82657b76790C6768b70328h9585
11359B97261B7700b82189J14837J3704l3706E2380J62048n2388p9507e0242k64637
11348c14879D9408K30770b34527d0022E8474J94998a74922a4834A05772K34417
11338C40189f8154I4210O2878e7536n2214C9539J75503a55345q9849d0547B29478
$$ y = [-71432, 2873, 47381, -353024, 113988, -46375, 116953, -184061, -21608, 86870, 250985, 257480, 142370, 45268, -194987, -92326, -50642, 160774, 45904, -16215, 100601, 100166, 6700, 173198, -152414, -74925, -353608, -150365, 146288, 48956, 177735, -84425, 224528, -200973, -175873, 205024, 181581, 186405, -18255, -268134, -18127, 24800, -202072, 193931, -111621, -9849, -3262, -15359, -49175, 85418, -160591, 50085, 80017, 262674, -276790, 36768, -270328, -89585, 297261, 27700, -282189, -167352, -153648, -187354, 52380, 214428, 162040, 82533, -50242, -314879, 49408, 280178, -234527, -40022, 58474, 253472, -174922, -14834, 105772, 340189, -68154, 94210, 157088, -57536, -109750, 39539, 215042, -155345, -245194, -40547, 229478]
11326b22787o6669b7716l15299A54094a68918C6075J16160a38710r6217d1535
11315H8705L4942P5220n2937A8210b75968B56400b03526c6196A53588a43937d4888
11303E4112a37584C1839l379b70623B52360A8694J07043b53818J08228m60Q350
11292a37700A07133A9692M1763a4331r1781C4098d91802B25285g4626l71833A77627
11280a1005j01184A98394a02290F6682h5786c6512A53893e08192E5008b76463
11269D7469b74086a517j14677m8829A96164a73315b3050J0844k43802b930A0549
11257B77287C6245a6365r2250P172b0367o1380C47289B1060a9374l6259B57007
11245f9307j69026G0910J97387C4973L0716c33947R1864R7943L3776H6883a38280
$$ y = [-222787, -289456, -27716, -343015, 154094, -168918, 36075, 152235, -138710, -234927, -41535, 88705, 123647, 198867, 145930, 18210, -275968, 256400, -203526, -36196, 153588, -143937, -44888, 54112, -137584, 31839, 28460, -270623, 252360, 18694, 125737, -253818, -145590, -146050, -137700, 107133, 19692, 61455, -14331, -106112, 34098, -491802, 225285, -74626, -446459, 177627, -11005, -112189, 198394, -102290, 66682, -85786, -36512, 153893, -508192, 55008, -276463, 47469, -274086, -1517, -116194, -165023, 196164, -173315, -23050, -12206, -256008, -2930, 10549, 277287, 36245, -16365, -108615, -101443, -20367, -81747, 347289, 21060, -19374, -55633, 257007, -69307, -238333, 70910, 268297, 34973, 65689, -333947, -242083, -144140, -110364, 86883, -138280]
11233a90578d8416A42666n7924b45237H9587a12767A5717J03694a81926C4004
11222g8705b0309p5537A32476D5026J25944h6548A16617L9295F1219J3726e4963
11210A98781o1604a33676L8657C16152b51135d8095k93814e9684E2983K2328c6347
11198a18555B76281I9910G859J49574a84533A36842l2310D013b7523F9082J4506
11187H3588b17306d0640l08452k3391A83495r563f2069j66850C1672c39748A8671
11175A04023M6828p1929f5393J107n1930K0712J7372E892h3822m8496Q935A71923
11162a28713A70042k4202j084n4571m4887h0134j00213L9267m48520c2042C99598
11150B10553d3815j15166H0995a52332A32845h5753J3125K7820k20101A93855
$$ y = [-190578, -48416, 142666, 84742, -245237, 89587, -112767, 15717, 119411, -181926, 34004, -78705, -20309, -95846, 132476, 45026, 170970, -86548, 116617, 155912, 61219, 74945, -54963, 198781, 137177, -133676, -95019, 316152, -251135, -48095, -341909, -59684, 52983, 75311, -36347, -118555, 276281, 99910, 7859, 157433, -184533, 136842, 104532, 4013, -27523, 69082, 83588, -217306, -40640, -349092, -372483, 183495, 173932, -62069, -228919, 31672, -339748, 18671, 104023, 150851, 78922, -65393, -64286, -116216, -95504, -78132, 5892, -83822, -132318, -123383, 171923, -128713, 170042, 145840, 144756, 90185, 45298, -80134, -180347, -141080, -589600, -32042, 399598, 210553, -43815, -158981, 80995, -152332, 132845, -85753, -72628, -44808, -264909, 193855]
11139B25954F985J59556D9790a28575b3521A25011d8047A3383J1472J76603B0888
11127C78840A08016n0706J11426c3758j66085A99436d2613B75488K2800a77208
11116B38945a50940j7539A4844J01057a37851l8756j28093B2948c7613A91688
11105a51485D3030O7622g7270J9329J4528G7944R0502j8934l0801L14825A00460
11093F3081J52012B4046J13485l7488J88133j10147J8508a18995B46326j07273
11083A39053e8093A65168d725A37677J17640e0255j75414F6118B7075d8751I7766
11071B5215L83189a48055B14314n0794a51806H8622g6943A20281J15130G6013
11060B63391n5559q9691N1537Q232j1336L29297A39319M63905R0222C02584K79956
$$ y = [225954, 6985, 166541, 49790, -128575, -23521, 125011, -48047, 13383, 24855, 201458, 20888, 378840, 108016, 57310, 168736, -33758, -199843, 199436, -42613, 275488, 298288, -177208, 238945, -150940, -168479, 14844, 115901, -137851, -176607, -304700, 22948, -37613, 191688, -151485, 43030, 110652, -77270, -57941, -43413, 77944, 168446, 149512, 118711, 433536, 100460, 63081, 215093, 24046, 137531, 100043, 288176, 178029, 196537, -118995, 246326, 139053, -58093, 165168, -4725, 137677, 255317, -50255, -225669, 66118, 27075, -48751, 97766, 25215, 408404, -148055, 214314, 163520, -151806, 88622, -76943, 120281, 235411, 76013, 263391, 207832, 118141, 169678, 177910, 166574, 495871, 139319, 603224, 693446, 302584, 582540]
11049E82540k62955L45470k43241J65661j01393p557n9014P1985B44597K31697
11039D76294k05877r5943L27031j3802J2320j49505n5490j04458M90371j69112
11029E11829p678l8995p305q0846M3639J94462l5483B23338j0713J39593g4183
11017D42443p0152J17804j01940N7019j21333J19704O7004n9925j80040M19276
11007F89860C02516L01334m3154k13787A67047J35065L25757k74110j65673L58464
10997E46550K3427k12865A72101L74317o282A26926M58425j33239l9121A30956
10986D69814J19649j59794m0455N74147D53126J39560J75028O25l2996J64681
10976I00024J36202L81073j73480L72768p6634o5988K62253K7175n02029K99971
$$ y = [582540, 319585, 665055, 421814, 587475, 486082, 478525, 419511, 491496, 244597, 476294, 270417, 174474, 501505, 487703, 500023, 350518, 295028, 190570, 680941, 511829, 504151, 465156, 457851, 377005, 420644, 615106, 579623, 223338, 212625, 352218, -74183, 442443, 372291, 490095, 388155, 445174, 323841, 443545, 510549, 450624, 270584, 689860, 302516, 603850, 560696, 346909, 167047, 302112, 627869, 353759, 188086, 546550, 569977, 357112, 172101, 546418, 540136, 126926, 585351, 452112, 412991, 130956, 469814, 589463, 429669, 389214, 963361, 453126, 592686, 767714, 768339, 735343, 900024, 1036226, 1417299, 1243819, 1616587, 1539953, 1473965, 1736218, 1763393, 1261364, 1561335]
10966A561335l27388P7853j98930K1859k44538m8138K65609K0871o7719J1951
10956A072765M16827r8258n44464M9530J74782l66547r7938P0882j34722j00754
10946D42103A33660L8632G4753Q4854J37382j4680I5699c8730B04781b8442G7591
10934C09613j21295c0922j25537F7232a21765J0592G2593J39083j4431o7297e6201
10922b85270A56267p5143J29866A9259g7263p8152B07085a33087C12529b10669
10911E3822a76801m8945c5714p8646A72917i2551d153G1300c16037a12405I2016
10899a36165A07835g9910A26735f3194j38438A44417n4661O1105a61693o4945
10889b26638P4658k29398C44027A51355b15096A36388k9821a70594O1454n9967
$$ y = [1561335, 1233947, 1311800, 1112870, 1134729, 890191, 842053, 1107662, 1128533, 1060814, 1072765, 1489592, 1391334, 846870, 896400, 1071182, 704635, 606697, 677579, 542857, 442103, 133660, 172292, 74753, 159607, 296989, 282309, 95699, -38730, 204781, -28442, 77591, 309613, 188318, -30922, -156459, 67232, -121765, -111173, 72593, 211676, 197245, 129948, -56201, -285270, 156267, 81124, 210990, 19259, -77263, -155415, 207085, -133087, 312529, -210669, 53822, -176801, -225746, -35714, -114360, 172917, -92551, -4153, 71300, -316037, -112405, 92016, -136165, 107835, -79910, 126735, -63194, -201632, 144417, 89756, 150861, -161693, -226638, -151980, -381378, 344027, 151355, -215096, 136388, 106567, -170594, -109140, -169107]
10879a69107L3102f5849q13A2623f7198j59205C8199J0672b5190E0808a194o8336
10867f9530e399r0386c9963j07655A68O1387a95821E7499E159a45862A3335d8241
10854a925B3960K12299r0145h4823B59162G9434i8754B11976d8442m9325l5874
10843a33641A03760a68244n9348Q5603C1416a97514a2235A06576J69804p5304
10833B01076H403P7572a5418A92272L7159b26044L6593B51364j09086C2020J2026
10822D4046h6134K1808B43956a19416A34520f2891j23802A29012a32655j42984
10812b75639a26966C3023J45160a61962B7661a21592G8643P8784n9712a7473j04007
10801a21480L5906q5183h815B70937a56049l8136i4379B37675a27589o4952J2718
$$ y = [-169107, -136005, -65849, -66662, 12623, -67198, -226403, 38199, 48871, -25190, 50808, -1194, -69530, -5399, -95785, -39963, -147618, 168, 61555, -195821, 57499, 5159, -145862, 13335, -48241, -1925, 23960, 236259, 146114, -84823, 259162, 79434, -98754, 211976, -48442, -97767, -133641, 103760, -168244, -227592, -141989, 31416, -197514, -12235, 106576, 276380, 201076, 8403, 85975, -15418, 192272, 229431, -226044, -189451, 251364, 142278, 32020, 44046, -86134, -64326, 243956, -119416, 134520, -62891, -186693, 129012, -132655, -275639, -126966, 33023, 178183, -161962, 27661, -121592, 78643, 157427, 97715, -17473, -121480, -85574, -170757, -8815, 270937, -156049, -194185, -94379, 237675, -127589, -192541, -179823]
10790a79823J5023M2726d2379q64p9864G7587K09560b1629o8512n5705A63867
10778i1214m5014o3953b7017q9595j23617h6603j07657A41663E9685K34272I102
10766c22185e5965A45252a65773j51092A72333a53736B14211J06240A25783b60995
10755I130a38757A23680c51933Q9129B42343p6516i975H4314K7668b16354B6384
10743A46621J20234b14314n138A07597D43a7454R98B808P4883c84849A41251g4410
10730a99592P1112H2335J17392e5079o600k28063g2434B2890h9650B4212a22924
10718b80655e5237j53492g9842G7688Q7601g3952j9868B8034P1537k3643a11586
10706a04009A10600P9791a53783E6568L8827J52901a44400E9792b34872A37893
$$ y = [-179823, -164800, -122074, -42379, -43243, -123107, 77587, 287147, -21629, -90141, -145846, 163867, -91214, -136228, -200181, -27017, -116612, -240229, -86603, -194260, 141663, 59685, 293957, 9102, -322185, -55965, 145252, -165773, -316865, 172333, -153736, 214211, 320451, 125783, -260995, 9130, -138757, 123680, -351933, -262804, 242343, 165827, -9975, 84314, 111982, -216354, 26384, 146621, 266855, -214314, -219452, 107597, 443, -17454, -16456, 2808, 77691, -384849, 141251, -74410, -199592, -128480, 82335, 199727, -55079, -61679, -289742, -72434, 22890, -89650, 24212, -122924, -280655, -55237, -208729, -79842, 77688, 165289, -73952, -93820, 28034, 99571, 75928, -111586, -104009, 110600, 190391, -153783, 56568, 95395, 248296, -144400, 59792, -234872, 137893]
10695e8869c527j07544D1002f6908K03q7691f9274k86169A04387J03427a97469
10683g3829j59261E5686c8615j6944o2240D0140c48674a26550A62735b0790j00627
10672a21417l64262c3788A52174C9689a74311A82929b07l39936J13919d4457j8869
10661f3326F69R4347b1228n9349j24047D9522b55635k7552G8696b17563a04184
10649f8238A0800c37089A46539a3806F9219d2426o8637R389F7801J17885a6114
10637I7689h1701m9178j19283O4919Q4918o3351B32870a49270H3700a51266N4506
10626i6760D5809J0017d9989A45806h8262B38354a60898B06112C4397j6474a62393
10614a24707l4113l56154E848a92964f892A22973a13714A47809C4050K2363e6754
$$ y = [-58869, -3527, -111071, 41002, -66908, -66705, -154396, -69274, -355443, 104387, 207814, -197469, -73829, -233090, 55686, -38615, -55559, -117799, 40140, -348674, -126550, 162735, -20790, -121417, -485679, -33788, 152174, 39689, -174311, 182929, -207, -340143, -226224, -44457, -63326, 669, 95016, -21228, -80577, -204624, 49522, -255635, -283187, 78696, -217563, -104184, -68238, 10800, -337089, 146539, -13806, 69219, -42426, -111063, -101674, 67801, 185686, -16114, 97689, -81701, -130879, -250162, -185243, -100325, -163676, 232870, -149270, 83700, -151266, -96760, 45809, 55826, -49989, 145806, -88262, 238354, -160898, 206112, 34397, 17923, -162393, -124707, -158820, -514974, 5848, -192964, -6892, 122973, -113714, 147809, 34050, 56413, -56754]
10602d8514j97380A23265b4423k75310A5327a71990q8080P7781E7957a07407c9282
10590B29717I7795P1959a44303A76081D9570J8880j3908O3786i7236m85071H9081
10578A01667a92357N5145F5346c6223A34528b50169B32526k1465d9616k14516
10568b64132n0927J38760J3674q5329A57269c9574H8119b80343g154j44608F7092
10556b05389B23872c7369q5616H8244d59594A69521c5362E3540c7193j76774a6639
10544E2905g3360r6449C4851J80290b64352b4407B7990d3033I1284c80666a72229
10532A14278m9736g4596D2883d70975a21177b7871k72444D7133Q7364m9599c35
10520A31282C0959a40629O4539j17687Q5127I0881m2506J10010c69804A32492
$$ y = [-48514, -245894, 123265, -24423, -299733, 15327, -171990, -260070, -182289, 57957, -107407, -39282, 229717, 97795, 169754, -144303, 176081, 49570, 68450, 54542, 118328, -97236, -582307, 89081, 101667, -192357, -137212, 65346, -36223, 134528, -250169, 232526, 211061, -49616, -264132, -315059, -176299, -162625, -247954, 157269, -39574, 88119, -280343, -7154, -151762, 67092, -205389, 223872, -37369, -122985, 88244, -459594, 169521, -35362, 53540, -37193, -213967, -16639, 52905, -73360, -169809, 34851, 215141, -264352, -24407, 27990, -43033, 91284, -380666, -172229, 114278, 64542, -74596, 42883, -470975, -121177, -27871, -300315, 47133, 134497, 84898, -335, 131282, 30959, -140629, -76090, -193777, -108650, 90881, 48375, 158385, -369804, 132492]
10509a12671p244A70438f7742E4324i53H9627l0849b79533G3582K2537a08338
10497a95000q808A41110b74598N9337C7493b52600A30160b1013A39891c7971B46450
10485a63832E5364a80350D49178d1193C05327l0193A11221J90311q6687b34268
10474A34574e6551J9959j56171E3549a01035D2757N8624J96177H5920a45249A66557
10462B42721a93754O3510l9200H7772c87456A2046K76431a0362j447l1112G0093
10450a43975B02009B0139a24344A2802a97325A92357g8914p5873F0129b8793k617
10439c1410F2661a67141L451b8602q2884d5474j66584d8480k85660J2432A8102
10427B25069f0849j96827A37267o888a08520N3640A4059K16920m7611M5927j01413
$$ y = [-112671, -119915, 170438, -67742, 54324, -953, 89627, 58778, -279533, 73582, 96119, -108338, -195000, -203808, 141110, -274598, -215261, 37493, -252600, 130160, -21013, 139891, -37971, 246450, -163832, 55364, -180350, 449178, -41193, 305327, 275134, 111221, 301532, 214845, -234268, 134574, -56551, -36592, -192763, 53549, -101035, 42757, 101381, 297558, 85920, -145249, 166557, 242721, -193754, -130244, -169444, 87772, -387456, 12046, 288477, -10362, -11809, -42921, 70093, -143975, 202009, 20139, -124344, 12802, -197325, 192357, -78914, -154787, 60129, -28793, -31410, 62661, -167141, -163690, -28602, -111486, -45474, -212058, -48480, -334140, -321708, 18102, 225069, -60849, -257676, 137267, 130379, -108520, -54880, 14059, 230979, 183368, 229295, 127882]
10416A27882P8763a72410c549B29511f045o5990b7059j78289b0962A2689K51077
10405B63766b68301D0179J141J20275O5576b07611C2055e8194m3440A56987i802
10393a71515h675C01402I3307M9159d9823H0682L7284b36316C55068e5016E8044
10381c46574A83833K5924J1519K0600o9964L52433E9783N9824J83512K2720a91207
10369B65954D1153f0081J5899B48637A711K40927j20462Q4642m334f408A22151
10357A79614a49898P4832K1826F8382A5488P2423J34021L85259B00883K84755
10347D85638A10681J72727D0982L78545j44273i8019C52960A07323f056D00942
10336D50895F3635L5898h6127G8030c4576B17456E9855b69504R0446N7065D10367
$$ y = [127882, 206645, -172410, -3549, 229511, -6045, -72035, -27059, -205348, -20962, 12689, 263766, -268301, 40179, 41320, 161595, 227171, -207611, 32055, -58194, -101634, 156987, -9802, -171515, -8675, 301402, 93307, 142466, -49823, 80682, 117966, -236316, 355068, -55016, 58044, -346574, 183833, 209757, 221276, 241876, 171912, 524345, 59783, 119607, 303119, 325839, -191207, 265954, 41153, -60081, -44182, 248637, 1711, 242638, 122176, 206818, 202484, -6408, 122151, 179614, -149898, -75066, -53240, 68382, 15488, 87911, 221932, 607191, 200883, 485638, 110681, 283408, 40982, 419527, 275254, -98019, 352960, 107323, -6056, 400942, 450895, 63635, 99533, -86127, 78030, -34576, 217456, 59855, -269504, -179058, -121993, 410367]
10324d8481E90516B42274C6068J1806a25439A72624a55108C13691j44800n0637
10314A18254J57250a6075E5299B6063a06405j82501a02701b7429o9768k9057B80539
10302B2793L2165A3160a60489M8026D410b04615A17324d5825C24249D2747K86083
10291C28830i1016j89274C5330A4363d0557A38307c61780J57148A19859a07201
10280c65385C6324f7014A55022c2129j25015A45735c0681A25661e6858A39961
10269E3238Q0828d0365I2202d8509A79853h400B79289A34903N4084n3859J26494
10258B61622J00761n5512j50663B2470J53713G6401M90540B03183I939J12502
10248A22441a43233j00328d4313J0916R989G9704b24412a3781A52005a32814A55780
$$ y = [-48481, 590516, 242274, 36068, 47874, -125439, 172624, -155108, 313691, 168891, 118254, 275504, -16075, 55299, 26063, -106405, -288906, -102701, -27429, -97197, -126254, 280539, 22793, 54958, 13160, -160489, -112463, 4410, -204615, 117324, -45825, 324249, 42747, 328830, -91016, -280290, 35330, 14363, -40557, 138307, -361780, -204632, 119859, -107201, -365385, 36324, -67014, 155022, -32129, -157144, 145735, -30681, 125661, -56858, 139961, 53238, 134066, -40365, 92202, -48509, 179853, -8400, 279289, 134903, 188987, 135128, 261622, 362383, 306871, 156208, 22470, 176183, 76401, 566941, 203183, 9939, 122441, -143233, -243561, -44313, -33397, -23408, 79704, -224412, -13781, 152005, -132814, 155780]
10236b19890b3432B84904a06812J1846m2349B0065J67430c36671c2123l9799j0787
10225h2709k5793C8675O9677E3489b6750n7480l5717B73595A661a3894A7893a63139
10212b34505M6263f2230n3710d5211j8650m6865d7122B56810R234D2731a66785
10200a01481f361E5304a99674A961K89822h3673G5271b40877G6126k8509a26277
10188b02976a01064A82497C5967a60703A04306a25847C1938J8431a03980M4089
10178e9891I135Q5500a30726I3909d5719j28014q3473j9053A9208K89729b17221
10166F1062k5338K75429c80054G3065a52642l6280B45856h4049m5395L7945k55355
10155c46854J18835j7385k18041A49304b73000R1527g8479p9984F3338c09268
$$ y = [-219890, -23432, 284904, -106812, -94966, -137315, 20065, 187495, -336671, -32123, -71922, -82709, -108502, 38675, 108352, 53489, -26750, -84230, -119947, 273595, 1661, -13894, 17893, -163139, -234505, -188242, -62230, -115940, -45211, -63861, -110726, -47122, 256810, 266044, 42731, -166785, -101481, -6361, 55304, -199674, 1961, 291783, -83673, 75271, -240877, 76126, 47617, -126277, -202976, -101064, 182497, 35967, -160703, 104306, -125847, 31938, 50369, -103980, -59891, 9135, 94635, -130726, 93909, -45719, -173733, -257206, -276259, 19208, 308937, -217221, 61062, 35724, 311153, -380054, 73065, -152642, -188922, 245856, -84049, -129444, -91499, -346854, -228019, -245404, -463445, 149304, -273000, -181473, -78479, -158463, 63338, -309268]
10144b42277D0795a13294j44405J12394I2262J20459r8491E5461c669j35264q0430
10133b19363R8895j78962B0944a11472M7940R388a0647j2448D6432a55565A15672
10121c47547i4281F2993g836A12922m9379h2892G7821b45628i4742r695K2148
10110h2289l6927H5702C2077K8448K0355J79666H5519b1474r1724M2965b4222
10098a83282A1207a93417m4847C286a22528D075g8139C45754a89534b5010A34005
10086f071q0250o445d5790B59013a17366A64328i1645o2844r9700a10056H7355
10074A25128O4935j3982H6848a17706A00286L5591P6713a81128b9691G0487J22071
10063A92558D4795e2153J1217A13126b68511k03852f1584B1753a06507A5934a71445
$$ y = [-242277, 40795, -113294, -257699, -145305, 92262, 212721, 114230, 55461, -3669, -138933, -219363, -120468, -299430, 20944, -111472, -63532, -54144, -10647, -23095, 46432, -155565, 115672, -347547, -94281, 62993, -7836, 112922, 63543, -82892, 77821, -245628, -94742, -104437, -82289, -119216, 85702, 32077, 60525, 80880, 260546, 85519, -21474, -113198, -70233, -24222, -183282, 11207, -193417, -238264, 3286, -122528, 4075, -78139, 345754, -189534, -25010, 134005, -6071, -86321, -92766, -45790, 259013, -117366, 164328, -91645, -154489, -254189, -110056, 87355, 125128, 190063, 176081, 86848, -117706, 100286, 135877, 212590, -181128, -29691, 70487, 192558, 44795, -52153, -40936, 113126, -268511, -472363, -61584, 21753, -106507, 15934, -171445]
10051a87895L193H9383a85985B4838a61042D8702a14518G6870a452l36312C9254
10039b64815j40550a0060A24414g1595G7632b5087A37445b4147r4342B46925H1067
10027a64223j03010e0021k78120a03052B41511I1580b91198A19293b1709g880
10016C1950b11866p4364B78381A38977f3851B6109d61161D9794I538J55228j3118
10005A51648I002d03399J54940I4112c5790A7551d6954j60206J379A46074c0563
9993H6220b9785m07901A99107b04227a1881n9831n2519R806B74650E9448J751
9982F1199B0513R630a66897O662A57425c29378J23588E1805b28744A2588d11724
9970B8155M6853h6993C780a28580c7001A17536a58384A5739d2862B5362M8481
$$ y = [-187895, -184702, 89383, -185985, 24838, -161042, 48702, -114518, 76870, -1452, -337764, 39254, -264815, -405365, -10060, 124414, -71595, 77632, -25087, 137445, -24147, -118489, 246925, 81067, -164223, -267233, -50021, -328141, -103052, 241511, 91580, -291198, 119293, -21709, -7880, 31950, -211866, -286230, 278381, 138977, -63851, 26109, -461161, 49794, 9538, 164766, 151648, 9002, -403399, -248459, 94112, -35790, 17551, -46954, -207160, -205781, 146074, -30563, 86220, -29785, -437686, 199107, -204227, -11881, -71712, -124231, -114425, 274650, 59448, 61199, 20513, 30143, -166897, -160235, 157425, -329378, -205790, 51805, -228744, 12588, -411724, 28155, 75008, -86993, 3780, -128580, -37001, 117536, -158384, 15739, -42862, 25362, 73843]
9959G3843b962B56606A885J7338R5622b9937B29898F8166c40150B4127b33720
9947b31917a00386K7583m416G6923a91503Q5584d9553B3448J23049c9084D4453
9935c49934a00803K5681A10015d0595q5169C3267f0017A65220G0001e0348A01056
9923b32739A41808b51253D7486c25156J54328j13318D4663b5844j3039H8452D706
9911b44159K3881A5475c20677J51418C32275b36246a08193j62547a08980A9181
9900c32410A80219A2505J02674P8862c48540J45803F4285c22199A03329b63744
9889a07225K4743K3086j11677O1998A53971E9519g7218B83133E5829a47345J677
9878a45668B9192a64100M9720k75121i3005b3955A60261a53880b8784k11007H5654
$$ y = [73843, -2962, 256606, 1885, 19223, 114845, -29937, 229898, 68166, -340150, 24127, -233720, -231917, -100386, -72803, -77219, 76923, -191503, -105919, -49553, 23448, 146497, -39084, 44453, -349934, -100803, -75122, 110015, -40595, -125764, 33267, -60017, 165220, 70001, -50348, 101056, -232739, 141808, -251253, 47486, -325156, -170828, -284146, 44663, -25844, -38883, 88452, 4706, -244159, -220278, 15475, -320677, -169259, 332275, -236246, -108193, -270740, -108980, 19181, -332410, 180219, 12505, 115179, 194041, -348540, -202737, 64285, -322199, 103329, -263744, -107225, -82482, -59396, -171073, -109075, 153971, 59519, -77218, 283133, 55829, -147345, -145668, 29192, -164100, -114380, -389501, -93005, -23955, 160261, -153880, -28784, -239791, 85654]
9866a95653G8097c02043h0584j45879e1761k37194K7159A35620J1887K288h0863
9854a8527F6617l2499g6836A2194m628J94370J2447h5411G3994N9525a19528I2070
9841b73322G2808b10786j08632J54523A29184E5902A2588a32194b4289k72355
9831b96644A61361b45358e4511K4060O382p8314k45433A45699m2711b40736o6930
9820c07666g9723I1020J1918b45663g6146H9450a29161A06412b54496m5984k35500
9809e35980f8253A40326K42938a03193j38127r1518B0110R3678L7484c86827m2097
9798d28924a95355P5029k21213a04966I4778a2341A77396h8601B8969P3291b23624
9786C04527f7500A01532A3575b69476a1D5999f4277e643l2267A80096c24043J47782
$$ y = [-195653, 78097, -302043, -80584, -226463, -51761, -288955, -261796, 135620, 147507, 149795, -80863, -18527, 66617, 34118, -76836, 12194, 7566, 201936, 214383, -85411, 73994, 133519, -119528, 92070, -273322, 72808, -210786, -319418, -164895, 129184, 55902, 12588, -132194, -24289, -296644, 161361, -245358, -54511, -30451, -24069, -102383, -347816, 145699, 102988, -240736, -307666, -79723, 91020, 102938, -245663, -76146, 89450, -129161, 106412, -254496, -300480, -535980, -68253, 140326, 383264, -103193, -241320, -332838, 20110, 113788, 151272, -386827, -428924, -195355, -120326, -341539, -104966, 94778, -12341, 177396, -88601, 28969, 102260, -223624, 304527, -67500, 101532, 13575, -269476, -11, 45999, -64277, -5643, -37910, 180096, -324043, -176261]
9774a76261H5336a09180A53704J12816j21007c11538A99216b78806I6384a98642
9763B97662c4111n06135i6762j532j81094E4066J2851a78148e4730o2633j05953
9752b23316c3380j28265a1740C0183j3236J7807b92554M0715E7486c925k19103
9741b23028J02482k5051K3412r3055i3017J0614A49131g1891p3192k091l9861
9730a87035I9806A0760J21892a1774k60546P9067f635k15685G0833K14800b29708
9718b1764j65654I1489a84736j7649j78850Q3361H6711a62188N9800J1924M1999
9707d8465H4779M2057b9348A52822c36052a7p9611J6004E4076j7226a81784K1570
9695a60214I11b69952d3146A31046c46681A76406a26100K9676H5547J6265i9842
$$ y = [-176261, 85336, -109180, 153704, 266520, 145513, -311538, 199216, -278806, 96384, -198642, 297662, -34111, -540246, -96762, -98294, -279388, 54066, 66917, -178148, -54730, -117363, -223316, -33380, -161645, -11740, 30183, 16947, 34754, -292554, -251839, 57486, -3925, -223028, -120546, -145597, -122185, -215240, -93017, -82403, 149131, -71891, -145083, -147174, -187035, 99806, 10760, 132652, -11774, -272320, -193253, -6635, -222320, 70833, 285633, -229708, -21764, -187418, 91489, -184736, -202385, -381235, -297874, 86711, -162188, -102388, -90464, -48465, 84779, 126836, -29348, 152822, -336052, -17, -79628, -63624, 54076, 36850, -181784, -160214, 911, -269952, -43146, 131046, -346681, 176406, -126100, -96424, 85547, 101812, -99842]
9683i6683b8466n2683F390a06367A17522c6178D92381d10632e1335j41362Q6416
9672a06281k66845B47427a3691L146B39359a13340m6306K7836A31652h5412J8576
9661f6836A61807Q9404a12825A24855f6472C71707a7655q2361g81q5801l30001
9650d16583J23468i0010c9839B29040e2344C7845J1728J1959f8433L1240B24410
9638d6000A22909M8710c3088k350o6269d1751j01709l47126a22236a5164A3795
9626a37250A59602l6559k6468a49364O9158B65794i4569F3135b32407J03201f2814
9614a52371a8414l31477a57866d1060k66167A61918D298b7497o0022l00281J12036
9603b75764A32144c70776J35242a5379j35749B18259e5338J9527C2790n818a97171
$$ y = [-96683, -28466, -81149, 6390, -106367, 117522, -36178, 492381, -410632, -51335, -192697, -106281, -373126, 247427, -13691, -10545, 239359, -113340, -159646, -131810, 131652, -85412, -66836, 161807, 251211, -112825, 124855, -66472, 371707, -17655, -100016, -781, -86582, -416583, -293115, -90010, -39839, 229040, -52344, 37845, 49573, 61532, -68433, -37193, 224410, -46000, 122909, 171619, -33088, -35438, -101707, -41751, -143460, -490586, -122236, -15164, 13795, -137250, 159602, 123043, 96575, -149364, -80206, 265794, -94569, 63135, -232407, -129206, -62814, -152371, -18414, -349891, -157866, -41060, -307227, 161918, 4298, -27497, -87519, -387800, -275764, 132144, -370776, -235534, -15379, -151128, 218259, -55338, -35811, 32790, 26972, -197171]
9591g1298l1394j58627e6321j31451r136C9431J9795L1987A1032a90485D7223
9579A45103d7421C7548K50894a63565K2509f2442k1310j44386C41435a43827l3572
9568a77399A13160h9626C50528A42354a68303A43770M822a05917o960A32956d8626
9556c6468j06513A16898c3235j26979g8401E6752a57142g8553b1171l29029A41409
9544f9144r8833J8608B0720d858k20732D5702O1820B1978b36898H7505a13943
9532A4660e6413G7351a18211H9723J59910h8260m5712H8584a72237C2001b01061
9520b58921i1195q0720c9512k1858o518A25616P6619b53986F8010g8556D6164
9508h6525k79209c3039E502a24997A05354a84108f5476p3095d1526o4576j89062
$$ y = [-71298, -102692, -261319, -56321, -187772, -196908, 39431, 59226, 91213, 11032, -190485, 47223, 145103, -47421, 37548, 288442, -163565, -141056, -62442, -83752, -228138, 341435, -143827, -177399, 113160, -89626, 350528, 142354, -168303, 143770, 148592, -105917, -112877, 132956, -48626, -36468, -142981, 116898, -33235, -160214, -78401, 56752, -157142, -78553, -21171, -350200, 141409, -69144, -167977, -149369, 20720, -4858, -225590, 45702, 107522, 21978, -236898, 87505, -113943, 14660, -56413, 77351, -118211, 89723, 249633, -88260, -133972, 88584, -172237, 32001, -201061, -258921, -91195, -171915, -39512, -61370, -67888, 125616, 202235, -253986, 68010, -78556, 46164, -86525, -365734, -33039, 5502, -124997, 105354, -184108, -65476, -138571, -41526, -106102, -295164]
9497b95164O1639n8005d6038A65600a26452k4360R823H2740O8290E8731R4881
9486A53612h5384k12525A0872B240a76572B28618j9260a12344d9072h862j67379
9475a76241j90452I8816a50520d4089A0238J76839r0120L4811b2396l257F7381
9463a48793k1296q6088L7085J06710C812i8197k44843A48602b63234a28493I1314
9451a05256c8751q5321E3626a50070I5777a06840d7760r0498l6853l4969k18003
9440d28083a54941B38503a94032K8137k0779n5009e6039b894j30838L8500a7984
9428b86302B11818G123a99916K906Q4526c5505j90399A5814A589e4211A69597
9416a54692j71402A93948a12462B80509b93249M4773J1220Q5102O5819A34789
$$ y = [-295164, -233525, -291530, -46038, 165600, -126452, -150812, -140989, 82740, 151030, 58731, 153612, -85384, -297909, 10872, 2240, -176572, 228618, 209358, -112344, -49072, -8862, -176241, -366693, 98816, -150520, -44089, 10238, 187077, 96957, 131768, -22396, -25653, 67381, -148793, -170089, -256177, -219092, -112382, 3812, -98197, -343040, 148602, -263234, -128493, 91314, -105256, -38751, -124072, 53626, -150070, 95777, -106840, -47760, -138258, -175111, -210080, -428083, -154941, 238503, -194032, -165895, -186674, -241683, -56039, -2894, -133732, -95232, -17984, -286302, 211818, 7123, -199916, -197010, -112484, -35505, -225904, 15814, 1589, -54211, 169597, -154692, -326094, 193948, -112462, 280509, -293249, -248476, -237256, -152154, -86335, 134789]
9405G8952i0029k66280i1035A26894m3729b51049h365A96154d06E6528B6889c3163
9392c9937o3068j10399d6270I3956J17512j5611a24977H3627a73005B8070J85985
9381B14055a72341g2775l7537d4272j4434A38708c59179a56400P7411D6873O9442
9370A16315b33632a06093j09398j32837A08939c6215G8741b1694A72494a13088
9359c08763g4597l60003K01267J15402H6282n878j0743A3335f2848A63214d9212
9347a56308D51509A32175d1758l436d735C87654g7984a5235I270c8810k76181
9336c14991f1417A32476a00763J5744d1383E024J84901f4853a8821k3286A37207
9324f3253q1103M1572n7071j74813E1957d30A06441b6231k14950a02576k7096
$$ y = [78952, -90029, -356309, -91035, 126894, 83165, -251049, -8365, 196154, -406, 56528, 26889, -33163, -39937, -103005, -213404, -46270, 93956, 211468, 195857, -124977, 83627, -173005, 28070, 214055, -172341, -72775, -110312, -44272, -58706, 138708, -359179, -156400, -78989, 46873, 116315, -233632, -106093, -215491, -348328, 108939, -36215, 78741, -21694, 172494, -113088, -308763, -74597, -434600, -233333, -117931, 86282, 80404, 69661, 13335, -62848, 163214, -49212, -156308, 451509, 132175, -41758, -45194, -4735, 387654, -77984, -15235, 9270, -38810, -314991, -61417, 132476, -100763, -85019, -41383, 5024, 189925, -64853, -18821, -42107, 137207, -63253, -144356, -102784, -159855, -334668, 51957, -430, 106441, -26231, -241181, -102576, -129672]
9313a29672p5242A34859c57925a398j16670A48213h2058B8084J42182q3097a58274
9301I9668a7076k26022d0291g448j56997j56373C45448i5219A24741M2576g2756
9289A50547B8865K17070b39336a01282E2476K1502a18091j17133C13623d03522
9278g9994A707b9159A24692b42457b3363k5564l9248j77534E0288J54584H7967
9266c47452h4511D837e7337q1006N9387k25764A53596J60488p3294j13981J7766
9255A44575i7436n2993j6011j24395c1239k37057J25966N2950n2438A31751a65648
9243a33877B2256a79334j02484A88715e3659C662b28990E5946b15977E0549J57184
9232B07733e18955b4075j68008R5678B546L447a55417B03456C2983Q0419D3853
$$ y = [-129672, -204914, 134859, -357925, -1398, -118068, 148213, -82058, 28084, 170266, 87169, -158274, 99668, -17076, -243098, -40291, -7448, -164445, -320818, 345448, -95219, 124741, 167317, -72756, 150547, 28865, 245935, -239336, -101282, 52476, 73978, -118091, -235224, 313623, -403522, -79994, 1707, -29159, 124692, -242457, -23363, -48927, -88175, -265709, 50288, 204872, 87967, -347452, -84511, 4837, -57337, -138343, -78956, -304720, 153596, 314084, 240790, 126809, 144575, -97436, -150429, -166440, -290835, -31239, -268296, -142330, -89380, -141818, 131751, -165648, -133877, 22256, -179334, -281818, 188715, -53659, 3662, -228990, 55946, -215977, 50549, 207733, -518955, -24075, -192083, -96405, 2546, 5993, -155417, 203456, 32983, 113402, 43853]
9220B1450c42033J53137K0185j09537c7537k13773m5941B5688M9785f3926H5552
9208A94158F9628a08985j25297d2821j10237o8696d8735A76053e1339j89404G5272
9196a78784M4358J1880L7764b1814l20046J36009E216L2135J97897D7172g3470
9184a67123o8881H5347a9731j52682d6625C1445L02464a2813I1712C5136P1476
9173A06612N3739n940b16013j1095f8643B3230O3315K66126H9930C776L33697
9162C37473a30021k2237O4315b1944k73791j750N918K3671A48366O4650h9952
9150a06410k73871A24944G207K9693L2625O9984F3245c07215E6583a21994j1542
9139a33536j00680N5478G4784J82829d4562q2059n2052A01731M5956a9079m8968
$$ y = [21450, -342033, -188896, -168711, -278248, -37537, -251310, -297251, 25688, 75473, -63926, 85552, 194158, 69628, -108985, -234282, -42821, -153058, -221754, -48735, 176053, -51339, -240743, 75272, -178784, -134426, -122546, -84782, -21814, -341860, -205851, 5216, 37351, 235248, 47172, -73470, -167123, -236004, 85347, -19731, -172413, -46625, 31445, 333909, -12813, 91712, 35136, 106612, 160351, 154411, -216013, -227108, -68643, 23230, 86545, 352671, 89930, 3776, 337473, -130021, -152258, -87943, -21944, -295735, -297485, -291567, -267896, 148366, 213016, -89952, -106410, -380281, 124944, 7207, 36900, 69525, 139509, 63245, -307215, 56583, -121994, -133536, -234216, -178738, 74784, 257613, -44562, -126621, -178673, 101731, 147687, -19079, -68047]
9128f8047A90985M5603j16124g4837A68963b4257m1770B04495A9588a06r9356
9117i9462k28951B14349L4597e107l25838B69910H9628a4239l4233k45291a08953
9105A25719B1020N565J73331c2189a4852b227j14848B81243a77718J2485J0254
9094a54979A7495c16791H624K8050a06951e0547l0849A48564F518P4335M3284
9083A24137a9555C44200b740k7061j9415r282A43566F2645h4520j70976C990c85133
9070B7921L9204a47200B5292J32095E3489b01341A47148L7954b181j14674j5700
9059a32555L7109I2367J03891a00708k09986a02370c4236l7191A77034B6791J17276
9048A44067a041j7917A05616a11306k00040C083c41390A9586a28537B70809d9474
$$ y = [-68047, 190985, 236588, 120464, -74837, 168963, -24257, -66027, 204495, 19588, -106, -99462, -328413, 214349, 248946, -5107, -330945, 269910, 89628, -14239, -48472, -293763, -108953, 125719, 21020, 26585, 199916, -32189, -14852, -2227, -117075, 281243, -177718, -165233, -154979, 17495, -316791, 8624, 36674, -106951, -50547, -81396, 148564, 6518, 80853, 124137, -19555, 344200, -2740, -29801, -49216, -58498, 143566, 62645, -84520, -255496, 3990, -385133, 27921, 67125, -147200, 25292, 157387, 53489, -201341, 147148, 185102, -2181, -116855, -132555, -95446, 92367, 196258, -100708, -310694, -102370, -34236, -71427, 177034, 26791, 144067, -1041, -18958, 105616, -111306, -311346, 3083, -341390, 19586, -128537, 270809, -49474]
9036A50378j3117j2763i7812p5567B78413c0904r1036B10858G3165a43734A38991
9024d030E1834l621K03668b55068Q3899c4825l0546F1180q726b01075R9876E0979
9011b73444A04e017I9462a32105K7127j4850A13661P2258k2207a7922j79116i2503
8998h270A96103b48820R3898C38600a18512A38587f810f11j44432g2201L5703
8987c6498k07817F9603L3335c9821g424k69364j5031N4028F6272c57535b2345
8975a44945d3532E337O0284a57444m8275k48037J55533A77c33426A17011i8034
8963A13316j8205d13970A48342l4993B9108g8779j00665l3161l8352a19899k5879
8952a45778M0505E4799M3373Q927O9124c53772H766J26955f2651E3229a69100
$$ y = [150378, 137261, 124498, -97812, -173379, 278413, -30904, -121940, 210858, 73165, -143734, 138991, -4030, 51834, 48213, 251881, -255068, -171169, -34825, -65371, 61180, 52454, -201075, -101199, 50979, -273444, 104, -5017, 99462, -132105, -104978, -119828, 113661, 185919, 163712, -17922, -197038, -92503, -8270, 196103, -248820, -154922, 338600, -118512, 138587, -6810, -611, -145043, -72201, -36498, -244315, 69603, 102938, -39821, -7424, -276788, -291819, -237791, 66272, -357535, -22345, -144945, -43532, 5337, 65621, -157444, -205719, -453756, -298223, 177, -333426, 117011, -98034, 113316, 95111, -413970, 148342, 113349, 29108, -78779, -179444, -212605, -250957, -119899, -145778, -105273, 54799, 98172, 107099, 176223, -353772, 8766, 135721, -62651, 53229, -169100]
8940b12902b7649k08833A46586c90507a76143A66534N9411m1458M8230b15560
8929a8684o9231A80338M6613n6507b6554G6127O54947K803282O491745L940037
8919A3966138C223970A155301E54668j48773A03564J07490J19495b64170b910
8909B21788Q0973J38808J90213B25016J1134b6926g532A6857b54691J26351C5938
8897A84730a08219B3933b80283a30873M6777A06570a03828j614K1479o7492r0714
8886b42169E1444a92858b6294C0235a86816A89021c1823q2180A56770a10895M7431
8875f3464I2101h1469a1316j49868D0351R7977a97464B4045a77476b9662B62652
8863A23140b04498B7721j3348a96349P3786H3145b48A34121n0426O1830E9541
$$ y = [-212902, -27649, -236482, 146586, -390507, -176143, 166534, 225945, 184487, 232717, -215560, -18684, -87915, 180338, 226951, 170444, -26554, 76127, 731074, 3534356, 10026101, 13966138, 3223970, 1155301, 554668, 405895, 103564, 211054, 330549, -264170, -2910, 221788, 302761, 441569, 631782, 225016, 236150, -26926, -7532, 16857, -254691, -128340, 35938, 184730, -108219, 23933, -280283, -130873, -84096, 106570, -103828, -105442, -83963, -151455, -242169, 51444, -192858, -26294, 30235, -186816, 189021, -31823, -114003, 156770, -110895, -63464, 92101, -81469, -11316, -161184, 40351, 138328, -197464, 24045, -177476, -29662, 262652, 123140, -204498, 27721, 14373, -196349, -122563, 83145, -248, 134121, 83695, 145525, 59541]
8851b35998j30907D2999R2491j6269a73047N3168m1250D7371a46616L9781K8429
8840g8406j00156j37578a4881A44364f5902C2936J25069g3468m03341A77344J35887
8829C13231b98820a22504k22937H9781a25302p9033e3200m8593A56261d43317
8818A21375g7490o8361j73538A2600J58326J51961g7553o3991o8231h9062B69956
8806a37508e3738o219a932k17587P5079H1941b77782J23471f7359J3229l5867
$$ y = [-235998, -366905, 42999, 135490, 119221, -173047, -119879, -161129, 47371, -146616, -106835, -78406, -178562, -316140, -14881, 144364, -65902, 32936, 158005, -73468, -476809, 177344, 313231, -298820, -122504, -345441, 89781, -125302, -204335, -53200, -101793, 156261, -443317, 121375, -77490, -145851, -319389, 12600, 170926, 322887, -77553, -141544, -209775, -89062, 269956, -137508, -53738, -59957, -1932, -219519, -144440, 81941, -277782, -154311, -67359, -54130, -89997]
$$ [...]
##END NTUPLES=NMR SPECTRUM
##END=
