##TITLE=NES1069_159122.0009_002_9705601_bkJBSS0dfe
##JCAMPDX= 6.0         $$ Bruker NMR JCAMP-DX V2.0
##DATA TYPE= NMR SPECTRUM
##DATA CLASS= NTUPLES
##ORIGIN= BRUKER
##OWNER= Administrator
$$ 1.72 TOPSPIN		Version 2.1
$$ 2016-04-30 14:24:46.192 -0700  Administrator@X
$$ Compression mode = diff/dup
##.OBSERVE FREQUENCY= 400.02188249412
##.OBSERVE NUCLEUS= ^1H
##.ACQUISITION MODE= SIMULTANEOUS (DQD)
##.ACQUISITION SCHEME= undefined
##.AVERAGES= 64
##.DIGITISER RES= 22
##SPECTROMETER/DATA SYSTEM= spect
##.PULSE SEQUENCE= noesygpps1d.comp
##.SOLVENT NAME= COFFEE_meoh
##.SHIFT REFERENCE= INTERNAL, COFFEE_meoh, 1, 14.96155
##AUDIT TRAIL= $$ (NUMBER, WHEN, WHO, WHERE, PROCESS, VERSION, WHAT)
$$ ##TITLE= Audit trail, TOPSPIN		Version 2.1
$$ ##JCAMPDX= 5.01
$$ ##ORIGIN= Bruker BioSpin GmbH
$$ ##OWNER= Administrator
$$ $$ E:\/data/COFFEE/nmr/NES1069_159122.0009_002_9705601_bkJBSS0dfe/12/pdata/1/auditp.txt
$$ ##AUDIT TRAIL=  $$ (NUMBER, WHEN, WHO, WHERE, PROCESS, VERSION, WHAT)
(   1,<2016-04-30 14:24:40.817 -0700>,<Administrator>,<X>,<go>,<TOPSPIN 2.1>,
      <created by zg
	started at 2016-04-30 14:13:11.192 -0700,
	POWCHK enabled, PULCHK disabled,
       configuration hash MD5:
       21 0F 79 D6 B3 7B B4 F6 88 20 88 DB 03 48 BD 9F
       data hash MD5: 64K
       63 13 C3 AE 08 4C 42 03 93 84 F5 D8 2B 46 16 85>)
(   2,<2016-04-30 14:24:44.099 -0700>,<Administrator>,<X>,<proc1d>,<TOPSPIN 2.1>,
      <Start of raw data processing
       efp LB = 0.3 FT_mod = 6 PKNL = 1 PHC0 = 0 PHC1 = 0 SI = 128K 
       data hash MD5: 128K
       4C 67 34 EF D4 3B 26 19 58 BE 22 81 99 E5 34 7E>)
(   3,<2016-04-30 14:24:44.989 -0700>,<Administrator>,<X>,<proc1d>,<TOPSPIN 2.1>,
      <pk PHC0 = -82.74353 PHC1 = 0 
       data hash MD5: 128K
       86 D4 36 25 1D E3 55 AB DF 6E FB A7 2B F3 0D 6F>)
(   4,<2016-04-30 14:24:45.396 -0700>,<Administrator>,<X>,<proc1d>,<TOPSPIN 2.1>,
      <abs ABSG = 1 
       data hash MD5: 128K
       4C A0 DA C3 B8 BF F6 70 58 61 F7 1E F3 D7 F3 EE>)
(   5,<2016-04-30 14:24:45.489 -0700>,<Administrator>,<X>,<proc1d>,<TOPSPIN 2.1>,
      <abs ABSG = 2 
       data hash MD5: 128K
       C2 9D 20 97 87 83 6B C6 F3 26 66 CC 8D 9D 75 5B>)
(   6,<2016-04-30 14:24:45.567 -0700>,<Administrator>,<X>,<proc1d>,<TOPSPIN 2.1>,
      <abs ABSG = 3 
       data hash MD5: 128K
       CF C1 4A B6 F8 D3 E6 37 87 49 D3 35 58 18 63 CA>)
(   7,<2016-04-30 14:24:45.661 -0700>,<Administrator>,<X>,<proc1d>,<TOPSPIN 2.1>,
      <abs ABSG = 4 
       data hash MD5: 128K
       07 03 1B 2C 10 05 88 FA 21 EF 94 79 A0 15 34 0B>)
(   8,<2016-04-30 14:24:45.771 -0700>,<Administrator>,<X>,<proc1d>,<TOPSPIN 2.1>,
      <abs ABSG = 5 
       data hash MD5: 128K
       8A 1A B6 A2 15 D8 02 99 C0 7B C6 1C 2A 21 AD 51>)
$$ ##END=
$$ 
$$ $$ hash MD5
$$ $$ 58 AF 11 D1 A4 05 A0 61 9B D9 76 E8 86 93 CA 88
##$RELAX= 
##$RELAX= 
##$RELAX= 
##$RELAX= 
##$RELAX= 
##$RELAX= 
##$RELAX= 
##$RELAX= 
$$ Bruker specific parameters
$$ --------------------------
##$DU= <E:\>
##$EXPNO= 12
$$ [...]
##$TP07= 0
##$TPNAME0= <>
##$TPNAME1= <>
##$TPNAME2= <>
##$TPNAME3= <>
##$TPNAME4= <>
##$TPNAME5= <>
##$TPNAME6= <>
##$TPNAME7= <>
##$TPOAL= (0..7)
0.5 0.5 0.5 0.5 0.5 0.5 0.5 0.5
##$TPOFFS= (0..7)
0 0 0 0 0 0 0 0
##$TUNHIN= 0
##$TUNHOUT= 0
##$TUNXOUT= 0
##$USERA1= <user>
##$USERA2= <user>
##$USERA3= <user>
##$USERA4= <user>
##$USERA5= <user>
##$V9= 5
##$VALIST= <valist>
##$VCLIST= <CCCCCCCCCCCCCCC>
##$VD= 0
##$VDLIST= <DDDDDDDDDDDDDDD>
##$VPLIST= <PPPPPPPPPPPPPPP>
##$VTLIST= <TTTTTTTTTTTTTTT>
##$WBST= 2048
##$WBSW= 25
##$XGAIN= (0..3)
0 0 0 0
##$XL= 0
##$YL= 0
##$YMAX_a= 4850351
##$YMIN_a= -10212238
##$ZGOPTNS= <>
##$ZL1= 120
##$ZL2= 120
##$ZL3= 120
##$ZL4= 120
##$ABSF1= 14.96155
##$ABSF2= -5.596632
##$ABSG= 5
##$ABSL= 3
##$ALPHA= 0
##$AQORDER= 0
##$ASSFAC= 0
##$ASSFACI= 0
##$ASSFACX= 0
##$ASSWID= 0
##$AUNMP= <proc_prof1d_extract.lims>
##$AXLEFT= 0
##$AXNAME= <>
##$AXNUC= <1H>
##$AXRIGHT= 0
##$AXTYPE= 0
##$AXUNIT= <>
##$AZFE= 0.1
##$AZFW= 0.1
##$BCFW= 0
##$BC_mod= 0
##$BYTORDP= 0
##$COROFFS= 0
##$CY= 15
##$DATMOD= 1
##$DC= 0
##$DFILT= <>
##$DTYPP= 0
##$F1P= 0
##$F2P= 0
##$FCOR= 0.5
##$FTSIZE= 131072
##$FT_mod= 6
##$GAMMA= 0
##$GB= 0
##$INTBC= 1
##$INTSCL= 1
##$ISEN= 128
##$LB= 0.3
##$LEV0= 0
##$LPBIN= 0
##$MAXI= 10000
##$MC2= 0
##$MEAN= 0
##$ME_mod= 0
##$MI= 0
##$NCOEF= 0
##$NC_proc= -2
##$NLEV= 6
##$NOISF1= 0
##$NOISF2= 0
##$NSP= 0
##$NTH_PI= 0
##$NZP= 0
##$OFFSET= 14.96155
##$PC= 1
##$PHC0= -82.74353
##$PHC1= 0
##$PH_mod= 1
##$PKNL= yes
##$PPARMOD= 0
##$PPDIAG= 0
##$PPIPTYP= 0
##$PPMPNUM= 2147483647
##$PPRESOL= 1
##$PSCAL= 4
##$PSIGN= 0
##$PYNMP= <proc.py>
##$REVERSE= no
##$SF= 400.020009415667
##$SI= 131072
##$SIGF1= 0
##$SIGF2= 0
##$SINO= 400
##$SIOLD= 131072
##$SPECTYP= <>
##$SREGLST= <1H.CDCl3>
##$SSB= 0
##$STSI= 131072
##$STSR= 0
##$SW_p= 8223.68421052631
##$SYMM= 0
##$S_DEV= 0
##$TDeff= 65536
##$TDoff= 0
##$TI= <>
##$TILT= no
##$TM1= 0
##$TM2= 0
##$TOPLEV= 0
##$USERP1= <user>
##$USERP2= <user>
##$USERP3= <user>
##$USERP4= <user>
##$USERP5= <user>
##$WDW= 1
##$XDIM= 131072
##$YMAX_p= 383871987
##$YMIN_p= -15314
##$CURPLOT= <Network HP LaserJet P1505>
##$CURPRIN= <$Network HP LaserJet P1505>
##$DFORMAT= <normdp>
##$LAYOUT= <+/1D_H.xwp>
##$LFORMAT= <normlp>
##$PFORMAT= <normpl>
##$SURQMSG= 1
$$ End of Bruker specific parameters
$$ ---------------------------------
##NTUPLES= NMR SPECTRUM
##VAR_NAME=  FREQUENCY,     SPECTRUM/REAL,   SPECTRUM/IMAG
##SYMBOL=    X,             R,               I
##VAR_TYPE=  INDEPENDENT,   DEPENDENT,       DEPENDENT
##VAR_FORM=  AFFN,          ASDF,            ASDF
##VAR_DIM=   131072,        131072,          131072
##UNITS=     HZ,            ARBITRARY UNITS, ARBITRARY UNITS
##FACTOR=    0.0627417313425164, 1,          1
##FIRST=     8223.62146879497, 1033,         -48524
##LAST=      0,             2228,            -47874
##MIN=       0,             -15314,          0
##MAX=       8223.62146879497, 383871987,    0
$$ Real data points
##PAGE= N=1
##DATA TABLE= (X++(R..R)), XYDATA
$$ [...]
$$ plain form
63724 168476 171390 173862 176001 177710 178594 178627 178397 178367 178440 178564 179215 180751 182675 184112 184865 185477 186364
63707 186364 187440 188719 190749 194069 198329 202320 205075 206892 209018 212193 215747 218351 219479 219769
63693 219769 220081 220678 221407 222132 222738 223148 223620 224589 225781 225859 223580 219292 214754 211460 209551 208373 207493
63676 207493 206863 206402 205922 205363 204733 203843 202372 200198 197489 194435 191076 187407 183492 179499 175752 172721
63660 172721 170711 169494 168464 167235 165884 164548 163089 161399 159791 158749 158389 158481 158926 159847 161201
63645 161201 162672 164097 165747 167985 170822 174029 177551 181592 186261 191330 196509 201939 208241 215931
63631 215931 224866 234530 244824 256262 269280 283704 299138 315518 332914 351106 369808 389097
63619 389097 408993 428709 446897 462723 476179 487265 495400 499877 500499 497614 491964 484687 477122
$$ packed form
63724A68476K914K472K139J709Q84L3k30l0P3J24O51J536J924J437P53O12Q87
63707A86364J076J279K030L320M260L991K755J817K126L175L554K604J128K90
63693B19769L12N97P29P25O06M10M72R69J192P8k279m288m538l294j909j178q80
63676B07493o30m61m80n59o30q90j471k174k709l054l359l669l915l993l747l031
63660A72721k010j217j030j229j351j336j459j690j608j042l60R2M45R21J354
63645A61201J471J425J650K238K837L207L522M041M669N069N179N430O302P690
63631B15931Q935R664J0294J1438J3018J4424J5434J6380J7396J8192J8702J9289
63619C89097J9896J9716J8188J5826J3456J1086Q135M477O22k885n650p277p565
$$ plain form
63606 477122 470347 465010 461454 459446 457749 454658 449280 441857 432733 421636 408349 393462 377999
63593 377999 362720 348164 334844 322880 311887 301752 293123 286540 281525 277174 273321 270467 268831
63580 268831 268248 268752 270516 273239 276406 280221 285561 292788 301123 309463 317387 325273 333796 343468 354313
63565 354313 365879 377831 390465 404312 419329 434980 451114 468132 486036 503716 519513
63554 519513 532177 541072 545766 545918 541683 534191 525458 517517 511342 506659 502950 500361 499261 499143
63540 499143 498536 496077 491279 484338 475653 465679 454757 442887 429963 416314 402668 389486 376665
63527 376665 364011 351669 339949 329007 318835 309208 299564 289377 278885 269142 261062 254555
63515 254555 248766 242912 236749 230575 225052 220829 218038 216177 214628 213142 211760 210491 209261 208003
$$ packed form
63606D77122o775n337l556k008j697l091n378p423r124j1097j3287j4887j5463
63593C77999j5279j4556j3320j1964j0993j0135q629o583n015m351l853k854j636
63580B68831n83N04J764K723L167L815N340P227Q335Q340P924P886Q523R672J0845
63565C54313J1566J1952J2634J3847J5017J5651J6134J7018J7904J7680J5797
63554E19513J2664Q895M694J52m235p492q733p941o175m683l709k589j100j18
63540D99143o07k459m798o941q685r974j0922j1870j2924j3649j3646j3182j2821
63527C76665j2654j2342j1720j0942j0172r627r644j0187j0492r743q080o507
63515B54555n789n854o163o174n523m223k791j861j549j486j382j269j230j258
$$ plain form
63501 208003 206585 204827 202767 200815 199401 198484 197599 196377 194969 194023 194321 196355 199979 204379 208464
63486 208464 211543 213755 215870 218539 221774 225143 228309 231093 233128 233940 233499 232314 230716 228483 225529
63471 225529 222534 220300 218713 216929 214536 212013 210009 208728 208094 208036 208370 208748 208950 209118 209668 211131
63455 211131 213945 218116 223132 228537 234473 241278 248726 256180 263482 271080 279218 287599 296084 305188
63441 305188 315504 326973 339065 351448 364284 378070 393390 410664 429988 451268 474494
63430 474494 499680 526627 554931 584012 612769 639404 662143 680114 693119 700876 703265 701255
63418 701255 696699 690937 684310 677115 670095 663595 657097 650079 642504 633917 622921 608468 591093
63405 591093 572067 551831 530117 507202 484059 461528 440252 421207 405239 392013 380369
$$ packed form
63501B08003j418j758k060j952j414r17q85j222j408r46K98K034L624M400M085
63486B08464L079K212K115K669L235L369L166K784K035Q12m41j185j598k233k954
63471B25529k995k234j587j784k393k523k004j281o34n8L34L78K02J68N50J463
63455B11131K814M171N016N405N936O805P448P454P302P598Q138Q381Q485R104
63441C05188J0316J1469J2092J2383J2836J3786J5320J7274J9324K1280K3226
63430D74494K5186K6947K8304K9081K8757K6635K2739J7971J3005P757K389k010
63418G01255m556n762o627p195p020o500o498p018p575q587j0996j4453j7375
63405E91093j9026k0236k1714k2915k3143k2531k1276j9045j5968j3226j1644
$$ plain form
63394 380369 369882 361294 355206 351211 348704 347842 349150 352652 357925 364770 373422 384246 397504 413245
63380 413245 431081 450109 469220 487535 504565 520148 534347 547284 559066 569922 580384
63369 580384 591144 602782 615689 629979 645013 659068 670054 676798 679417 678436 674052 666569 657100
63356 657100 647285 638335 630644 624152 618652 613680 608444 602094 593966 583518 570261 553962 534939
63343 534939 514040 492275 470464 449122 428600 409255 391491 375605 361618 349317 338546
63332 338546 329376 321891 315819 310560 305589 300721 296004 291535 287438 283778 280319 276629 272668 269093
63318 269093 266647 265388 264913 265192 266726 269867 274490 280501 288153 297581 308376 319950 331933 343782
63304 343782 354187 361421 364376 363088 358248 350501 340182 327581 313364 298677 284673 271876
$$ packed form
63394C80369j0487q588o088l995k507q62J308L502N273O845Q652J0824J3258J5741
63380D13245J7836J9028J9111J8315J7030J5583J4199J2937J1782J0856J0462
63369E80384J0760J1638J2907J4290J5034J4055J0986O744K619r81m384p483r469
63356F57100r815q950p691o492n500m972n236o350q128j0448j3257j6299j9023
63343E34939k0899k1765k1811k1342k0522j9345j7764j5886j3987j2301j0771
63332C38546r170p485o072n259m971m868m717m469m097l660l459l690l961l575
63318B69093k446j259m75K79J534L141M623O011P652R428J0795J1574J1983J1849
63304C43782J0405P234K955j288m840p747j0319j2601j4217j4687j4004j2797
$$ plain form
63292 271876 260234 249844 241237 234647 229382 224451 219642 215496 212268 209530 206913 204683 203218 202337
63278 202337 201605 201062 201152 202012 203267 204577 205965 207437 208662 209372 209795 210350 211043 211603 212118 212995 214257
63261 214257 215473 216627 218478 221515 225054 228066 230646 233819 237914 241972 245107 247791 251325 256495
63247 256495 263170 270848 279084 287573 296350 305855 316463 328050 340364 353669 368534 384930 402032
63234 402032 419125 436317 453973 471708 488504 503982 519094 535127 552230 569412 586014
63223 586014 602592 620106 638787 658328 678747 700284 722508 744240 764517 783069 799729
63212 799729 813996 825402 833723 838540 839170 835578 828943 820759 811546 800833 788180 773773 758100
63199 758100 741493 724027 705664 686538 667185 648416 630905 615181 602083 592749 587859 587175
$$ packed form
63292B71876j1642j0390q607o590n265m931m809m146l228k738k617k230j465q81
63278B02337p32n43R0Q60J255J310J388J472J225P10M23N55O93N60N15Q77J262
63261B14257J216J154J851L037L539L012K580L173M095M058L135K684L534N170
63247B56495O675P678Q236Q489Q777R505J0608J1587J2314J3305J4865J6396J7102
63234D02032J7093J7192J7656J7735J6796J5478J5112J6033J7103J7182J6602
63223E86014J6578J7514J8681J9541K0419K1537K2224K1732K0277J8552J6660
63212G99729J4267J1406Q321M817O30l592o635q184r213j0713j2653j4407j5673
63199G58100j6607j7466j8363j9126j9353j8769j7511j5724j3098r334m890o84
$$ plain form
63187 587175 590139 596536 606175 618246 631584 645495 659921 674909 690304 705976 722012 738627
63175 738627 756001 773998 791951 808987 824840 839984 854625 867877 878317 885041 887680 885783
63163 885783 878996 867762 853109 835590 814999 791314 765423 738654 711930 685593 659865 635269
63151 635269 612654 592742 575532 560293 546370 533786 522874 513723 506424 501455 499052 498398 498307
63138 498307 498787 501117 506251 513967 523908 536479 552012 569627 587640 604640 619427 630341 635759
63125 635759 635389 630364 621857 610218 595701 579345 562650 546758 532409 520290 510753 503253 496714
63112 496714 490668 485550 481684 478500 475177 471703 468707 466438 464543 462873 461842 461787 462452 463471 464885
63097 464885 466805 468800 470134 470495 470254 470088 470561 471857 473617 475186 476271 477203 478319 479402 480094 480581
$$ packed form
63187E87175K964O397R639J2071J3338J3911J4426J4988J5395J5672J6036J6615
63175G38627J7374J7997J7953J7036J5853J5144J4641J3252J0440O724K639j897
63163H85783o787j1234j4653j7519k0591k3685k5891k6769k6724k6337k5728k4596
63151F35269k2615j9912j7210j5239j3923j2584j0912r151p299m969k403o54r1
63138D98307M80K330N134P716R941J2571J5533J7615J8013J7000J4787J0914N418
63125F35759l70n025q507j1639j4517j6356j6695j5892j4349j2119r537p500o539
63112D96714o046n118l866l184l323l474k996k269j895j670j031n5O65J019J414
63097D64885J920J995J334L61k41j66M73J296J760J569J085R32J116J083O92M87
$$ plain form
63081 480581 481402 482716 484274 486067 488486 491793 495825 500308 505059 509880 514646 519615 525316 532045
63067 532045 539794 548677 558940 570458 582800 596101 611396 629585 650339 672544 695658 720095
63055 720095 746299 774016 802765 832575 863767 896160 928997 961712 994315 1026818 1058726
63044 1058726 1089596 1119858 1150498 1181893 1213409 1244331 1274759 1305388 1336682 1368377 1399419
63033 1399419 1428117 1452639 1471686 1484575 1490755 1489702 1481393 1466291 1444533 1415715 1379985 1338903
63021 1338903 1294602 1248503 1201477 1154883 1110559 1069816 1033130 1000854 973576 951649 934967
63010 934967 923410 917053 915795 919162 926629 937857 952602 970709 992216 1017037 1044543 1073764
62998 1073764 1104063 1135274 1167215 1199473 1231682 1263625 1295047 1325715 1355640 1384764 1412381
$$ packed form
63081D80581Q21J314J558J793K419L307M032M483M751M821M766M969N701O729
63067E32045P749Q883J0263J1518J2342J3301J5295J8189K0754K2205K3114K4437
63055G20095K6204K7717K8749K9810L1192L2393L2837L2715L2603L2503L1908
63044A058726L0870L0262L0640L1395L1516L0922L0428L0629L1294L1695L1042
63033A399419K8698K4522J9047J2889O180j053q309j5102k1758k8818l5730m1082
63021A338903m4301m6099m7026m6594m4324m0743l6686l2276k7278k1927j6682
63010I34967j1557o357j258L367P467J1228J4745J8107K1507K4821K7506K9221
62998A073764L0299L1211L1941L2258L2209L1943L1422L0668K9925K9124K7617
$$ plain form
62987 1412381 1437292 1458578 1475741 1488006 1494005 1492402 1482580 1464600 1438867 1405970 1366571 1321268
62975 1321268 1270731 1215994 1158436 1099540 1040886 984061 930083 878988 830527 785181 743929
62964 743929 707017 673621 642820 614344 588219 564323 542528 522781 504758 487873 471821
62953 471821 456694 442460 428869 416147 405074 395958 388005 380204 372491 365525 359537 353899 347821
62940 347821 341185 334653 329073 324750 321287 318248 315782 314272 313484 312601 311128 309286 307447 305704 304174
62925 304174 303190 302873 302868 302678 301970 300472 298074 295208 292651 290728 289132 287656 286522 285760 284822 283224
62909 283224 281137 279042 277210 275770 274794 273986 272741 270871 268821 266914 264975 263063 261895 261980 262806
62894 262806 263559 264203 265240 266764 268445 270194 272168 274204 275885 277131 278221 279191 279604 278967 277229
$$ packed form
62987A412381K4911K1286J7163J2265N999j603r822j7980k5733l2897l9399m5303
62975A321268n0537n4737n7558n8896n8654n6825n3978n1095m8461m5346m1252
62964G43929l6912l3396l0801k8476k6125k3896k1795j9747j8023j6885j6052
62953D71821j5127j4234j3591j2722j1073r116p953p801p713o966n988n638o078
62940C47821o636o532n580m323l463l039k466j510p88q83j473j842j839j743j530
62925C04174r84l17nj90p08j498k398k866k557j923j596j476j134p62r38j598
62909B83224k087k095j832j440r76q08j245j870k050j907j939j912j168Q5Q26
62894B62806P53O44J037J524J681J749J974K036J681J246J090R70M13o37j738
$$ plain form
62879 277229 274958 273139 272438 272443 272012 270666 269165 268331 267795 266601 264679 263009 262437 262940 263939 264783 264952
62862 264952 264341 263410 262756 262636 263165 264674 267344 270627 273528 275436 276323 276390 276054 276017 276708 277688 278143 277915
62844 277915 277469 276864 275526 273201 270590 268731 268101 268483 269307 269954 270110 270049 270345 271140 271988 272535 273074 274184
62826 274184 276072 278496 281182 284064 287172 290460 293830 297274 300896 304727 308529 311935 314825 317512
62812 317512 320445 323823 327476 331015 334106 336775 339530 343009 347524 353089 359781 367682 376533 385896
62798 385896 395778 406676 418911 432409 447281 464037 482942 503719 526307 551491 580280 613025
62786 613025 649555 689830 733998 782081 834015 889732 948759 1009938 1071852 1133255 1192859
62775 1192859 1249138 1300663 1346191 1384119 1412446 1429792 1435947 1431009 1414761 1387677 1351785 1309394
$$ packed form
62879B77229k271j819p01Nm31j346j501q34n36j194j922j670n72N03R99Q44J69
62862B64952o11r31o54j20N29J509K670L283K901J908Q87O7l36l7O91R80M55k28
62844B77915m46o05j338k325k611j859o30L82Q24O47J56o1K96P95Q48N47N39J110
62826B74184J888K424K686K882L108L288L370L444L622L831L802L406K890K687
62812C17512K933L378L653L539L091K669K755L479M515N565O692P901Q851R363
62798C85896R882J0898J2235J3498J4872J6756J8905K0777K2588K5184K8789L2745
62786F13025L6530M0275M4168M8083N1934N5717N9027O1179O1914O1403N9604
62775A192859N6279N1525M5528L7928K8327J7346O155m938j6248k7084l5892m2391
$$ plain form
62763 1309394 1261372 1207766 1149854 1090334 1031331 973266 915967 860037 806736 757080 711429
62752 711429 669594 631222 596252 564951 537213 512163 488931 467523 448366 431337 415963
62741 415963 402230 390282 379554 369275 359781 352328 347369 343939 340977 338395 336602 335757 335856 336908
62727 336908 338710 341015 344128 348666 354576 361004 367387 374043 381501 389909 399307 409814 421324 433729
62713 433729 447641 464171 483748 505925 530605 558585 590454 625850 664386 706609 753331
62702 753331 804640 860131 919566 982534 1047842 1113862 1179197 1242519 1302176 1356449 1403867
62691 1403867 1442856 1471486 1488145 1492163 1483455 1462155 1429179 1386670 1337050 1281741 1221409 1157264
62679 1157264 1091503 1026490 963885 904469 848345 795387 745826 700357 659481 622969 590196
$$ packed form
62763A309394m8022n3606n7912n9520n9003n8065n7299n5930n3301m9656m5651
62752G11429m1835l8372l4970l1301k7738k5050k3232k1408j9157j7029j5374
62741D15963j3733j1948j0728j0279r494p453m959l430k962k582j793q45R9J052
62727C36908J802K305L113M538N910O428O383O656P458Q408R398J0507J1510J2405
62713D33729J3912J6530J9577K2177K4680K7980L1869L5396L8536M2223M6722
62702G53331N1309N5491N9435O2968O5308O6020O5335O3322N9657N4273M7418
62691A403867L8989K8630J6659M018q708k1300l2976m2509m9620n5309o0332o4145
62679A157264o5761o5013o2605n9416n6124n2958m9561m5469m0876l6512l2773
$$ plain form
62668 590196 560721 534269 510487 489114 470166 453636 439229 426625 415657 405966 396855 387826
62656 387826 378892 370098 361240 352492 344730 338569 333409 328062 322035 315634 309188 302926 297378 293063
62642 293063 289756 286724 283730 281217 279440 278017 276463 274746 273179 272143 271976 272763 274107 275406 276393
62627 276393 277193 277880 278317 278402 278216 277901 277629 277660 278202 279280 280890 283148 286089 289568 293583 298431 304244
62610 304244 310713 317646 325437 334501 344534 355022 366320 379587 395612 414251 434993 457504
62598 457504 481620 507425 535427 566064 598730 631625 662803 691105 716088 737434 754553
62587 754553 766485 772225 771490 765130 754403 739941 721859 700724 677645 653268 627442 600193
62575 600193 572445 545405 519745 495740 473715 453801 435635 418824 403546 390246 378940
$$ packed form
62668E90196k9475k6452k3782k1373j8948j6530j4407j2604j0968r691r111r029
62656C87826q934q794q858q748p762o161n160n347o027o401o446o262n548m315
62642B93063l307l032k994k513j777j423j554j717j567j036j67P87J344J299R87
62627B76393Q00O87M37Q5j86l15k72L1N42J078J610K258K941L479M015M848N813
62610C04244O469O933P791R064J0033J0488J1298J3267J6025J8639K0742K2511
62598D57504K4116K5805K8002L0637L2666L2895L1178K8302K4983K1346J7119
62587G54553J1932N740p35o360j0727j4462j8082k1135k3079k4377k5826k7249
62575F00193k7748k7040k5660k4005k2025j9914j8166j6811j5278j3300j1306
$$ plain form
62564 378940 369207 360737 353476 347348 342203 337982 334624 331856 329317 326861 324540 322443 320733 319589
62550 319589 318816 317766 316064 314252 313221 313110 313252 313179 313042 312952 312583 311804 311228 311620 313100 315390 318565
62533 318565 322994 328630 334948 341699 349297 358318 369002 381452 395945 412753 431813 452815 475577
62520 475577 500167 526770 555573 586734 620346 656470 695110 735914 777802 819077 858063
62509 858063 893507 924464 950201 970438 985490 995986 1002685 1006574 1008631 1009207 1008109 1005695 1003445
62496 1003445 1002989 1004953 1009299 1016221 1025755 1036692 1046906 1054908 1060376 1063188 1062847 1059053 1051854 1040752
62482 1040752 1024457 1002113 974238 941987 906149 867442 827192 786883 747378 709127 672773
62471 672773 638827 607107 577312 550038 526422 506730 489960 474950 461246 448821 437574
$$ packed form
62564C78940r733q470p261o128n145m221l358k768k539k456k321k097j710j144
62550C19589p73j050j702j812j031j11J42p3j37r0l69p79n76L92J480K290L175
62533C18565M429N636O318O751P598R021J0684J2450J4493J6808J9060K1002K2762
62520D75577K4590K6603K8803L1161L3612L6124L8640M0804M1888M1275L8986
62509H58063L5444L0957K5737K0237J5052J0496O699L889K057N76j098k414k250
62496A003445m56J964M346O922R534J0937J0214Q002N468K812l41l794p199j1102
62482A040752j6295k2344k7875l2251l5838l8707m0250m0309l9505l8251l6354
62471F72773l3946l1720k9795k7274k3616j9692j6770j5010j3704j2425j1247
$$ plain form
62460 437574 427500 418939 412279 407587 404694 403382 403325 404073 405393 407546 410970 415659 420961 426092 430785
62445 430785 435391 440362 445834 451787 458306 465280 471942 477271 480994 483818 486468 488886 490570 491291
62431 491291 491080 489854 487467 483895 479077 472783 465032 456383 447470 438442 429292 420477 412682 406062
62417 406062 400198 394822 390129 386352 383372 380864 378563 376329 374176 372300 370994 370563 371323 373388 376309
62402 376309 379286 382018 384987 388609 392527 396206 399839 404014 408709 413327 417585 421721 425881 430057
62388 430057 434674 440431 447274 454142 460033 464868 469048 472788 476312 480290 485501 492146 499816 508090
62374 508090 517028 527241 539595 554680 572482 592749 615666 641801 671336 703817 738875 776768
62362 776768 817745 861107 905287 948701 990068 1027958 1060592 1086414 1104754 1115789 1120003 1117977
$$ packed form
62460D37574j0074q561o660m692k893j312n7P48J320K153L424M689N302N131M693
62445D30785M606M971N472N953O519O974O662N329L723K824K650K418J684P21
62431D91291k11j226k387l572m818o294p751q649q913r028r150q815p795o620
62417D06062n864n376m693l777k980k508k301k234k153j876j306m31P60K065K921
62402C76309K977K732K969L622L918L679L633M175M695M618M258M136M160M176
62388D30057M617N757O843O868N891M835M180L740L524L978N211O645P670Q274
62374E08090Q938J0213J2354J5085J7802K0267K2917K6135K9535L2481L5058L7893
62362G76768M0977M3362M4180M3414M1367L7890L2634K5822J8340J1035M214k026
$$ plain form
62350 1117977 1110605 1099148 1084684 1067530 1047425 1024298 998692 971431 943161 914349 885436
62339 885436 856690 828115 799792 772310 746630 723506 703026 684544 666991 649533 632145
62328 632145 615395 599577 584348 569331 554650 540628 527371 515050 504119 494767 486469 478688
62316 478688 471623 465688 460648 456104 452577 451027 451246 451694 451223 450129 449238 448786 448719 449332 450927 453290
62300 453290 456055 459260 463050 467159 471242 475454 480189 485393 490674 496081 502311 510031 519212 529209
62286 529209 539374 549648 560629 572970 586627 600810 614663 627725 639657 649948 658280 664950
62274 664950 670588 675522 679716 683318 687031 691918 698988 708925 722016 738295 757854 781021 808096
62261 808096 838751 871728 905278 938022 969279 998403 1024022 1044327 1058275 1066186 1069086 1067816
$$ packed form
62350A117977p372j1457j4464j7154k0105k3127k5606k7261k8270k8812k8913
62339H85436k8746k8575k8323k7482k5680k3124k0480j8482j7553j7458j7388
62328F32145j6750j5818j5229j5017j4681j4022j3257j2321j0931r352q298p781
62316D78688p065n935n040m544l527j550K19M48m71j094q91m52o7O13J595K363
62300D53290K765L205L790M109M083M212M735N204N281N407O230P720R181R997
62286E29209J0165J0274J0981J2341J3657J4183J3853J3062J1932J0291Q332O670
62274F64950N638M934M194L602L713M887P070R937J3091J6279J9559K3167K7075
62261H08096L0655L2977L3550L2744L1257K9124K5619K0305J3948P911K900j270
$$ plain form
62249 1067816 1062867 1054406 1042013 1024876 1002854 977002 948447 917163 882747 846173 809803 775581
62237 775581 744032 715135 689139 666176 645878 627940 612484 599486 588398 578777 570780 564612
62225 564612 559938 556259 553478 551738 551126 551836 554084 557454 560933 564144 568050 573872 581684 590645 600178
62210 600178 610219 620608 630964 641092 650898 659978 667716 673683 677588 679151 678540 676666 674407
62197 674407 671691 667948 663328 658822 655309 653148 652680 654254 657545 661489 665241 668758 672196 675287
62183 675287 677728 679862 682472 686011 690369 695357 701195 708511 718054 730467 746223 765552 788294
62170 788294 813837 841374 870129 899062 926397 949968 968417 981833 991072 996792 999330 998985
62158 998985 995799 989325 979159 965558 949097 929984 908337 884919 860837 836534 811826 787044
$$ packed form
62249A067816m949q461j2393j7137k2022k5852k8555l1284l4416l6574l6370l4222
62237G75581l1549k8897k5996k2963k0298j7938j5456j2998j1088r621p997o168
62225E64612m674l679k781j740o12P10K248L370L479L211L906N822P812Q961R533
62210F00178J0041J0389J0356J0128R806R080P738N967L905J563o11j874k259
62197F74407k716l743m620m506l513k161m68J574L291L944L752L517L438L091
62183F75287K441K134K610L539M358M988N838P316R543J2413J5756J9329K2742
62170G88294K5543K7537K8755K8933K7335K3571J8449J3416R239N720K538l45
62158I98985l186o474j0166j3601j6461j9113k1647k3418k4082k4303k4708k4782
$$ plain form
62146 787044 763366 741761 722288 704808 689742 677524 667723 659271 651414 644017 637160 630859 625112
62133 625112 619841 614840 610060 605893 602828 600815 599144 596934 593536 588624 582294 575223 568501 563010
62119 563010 558904 555685 552658 549270 545007 539220 531377 521666 511148 501017 491654 482676 473937 466063
62105 466063 459720 454676 450068 445513 441457 438345 435973 434001 432763 433002 434825 437420 439968 442505
62091 442505 445659 449760 454591 459922 465949 473085 481495 490971 501224 512230 524279 537647 552182
62078 552182 567299 582463 597531 612645 628026 644089 661458 680413 700402 720398 739664
62067 739664 757833 774347 788383 799412 807288 811628 811710 807347 799450 789274 777347 763425 747116
62054 747116 728088 705965 680653 652824 623759 594667 566409 539649 514810 491867 470541
$$ packed form
62146G87044k3678k1605j9473j7480j5066j2218r801q452p857p397o857o301n747
62133F25112n271n001m780m167l065k013j671k210l398m912o330p071o722n491
62119E63010m106l219l027l388m263n787p843r711j0518j0131r363q978q739p874
62105D66063o343n044m608m555m056l112k372j972j238K39J823K595K548K537
62091D42505L154M101M831N331O027P136Q410R476J0253J1006J2049J3368J4535
62078E52182J5117J5164J5068J5114J5381J6063J7369J8955J9989J9996J9266
62067G39664J8169J6514J4036J1029P876M340Q2m363p897j0176j1927j3922j6309
62054G47116j9028k2123k5312k7829k9065k9092k8258k6760k4839k2943k1326
$$ plain form
62043 470541 450796 432889 416980 402967 390716 380188 371277 363739 357289 351667 346685 342438 339350
62030 339350 337668 336958 336355 335423 334487 334117 334471 335193 335791 336095 336449 337369 338847 340114 340320 339398 338018
62013 338018 336772 335774 334991 334604 334863 335847 337484 339580 341749 343501 344602 345301 346146 347581 349618 351767
61997 351767 353353 354055 354023 353340 351593 348306 343606 338062 331914 325005 317515 310200 303594 297397 291067
61982 291067 284715 279024 274399 270633 267344 264394 261784 259445 257280 255284 253446 251624 249650 247601
61968 247601 245885 244993 245089 245868 246830 247711 248637 249801 251080 252083 252664 253266 254579 256843 259685 262758
61952 262758 266225 270379 275069 280028 285693 293087 302650 313608 324786 335673 346423 357273 368452
61939 368452 380325 393004 405858 417947 428966 439332 449350 458710 466934 473866 479493 483594
$$ packed form
62043D70541j9745j7907j5909j4013j2251j0528q911p538o450n622m982m247l088
62030C39350j682p10o03r32r36l70L54P22N98L04L54R20J478J267K06r22j380
62013C38018j246r98p83l87K59R84J637K096K169J752J101O99Q45J435K037K149
61997C51767J586P02l2o83j747l287m700n544o148o909p490p315o606o197o330
61982B91067o352n691m625l766l289k950k610k339k165j996j838j822j974k049
61968B47601j716q92R6P79R62Q81R26J164J279J003N81O02J313K264K842L073
61952B62758L467M154M690M959N665P394R563J0958J1178J0887J0750J0850J1179
61939C68452J1873J2679J2854J2089J1019J0366J0018R360Q224O932N627M101
$$ plain form
61927 483594 485788 485895 484180 481372 478377 475810 473799 472372 471930 473016 475758 479873 485186 491785 499664
61912 499664 508624 518572 529522 541202 553071 564922 577049 589617 602194 614237 625753 637192
61900 637192 648947 661285 674550 688970 704244 719547 733941 746575 756593 763190 765898 764667
61888 764667 759573 750564 737514 720529 700168 677429 653470 629254 605414 582421 560829 541276
61876 541276 524173 509363 496110 483608 471662 460809 451690 444375 438526 434069 431362 430593 431372
61863 431372 433116 435653 439184 443842 449625 456708 465396 475626 486825 498534 510968 524595 539205
61850 539205 553852 567828 581211 594098 605665 614671 620753 624612 626765 626819 624346 619959 615091
61837 615091 610994 608431 607998 610137 614888 622125 632012 644877 660768 679510 700991 724832 749779
$$ packed form
61927D83594K194J07j715k808k995k567k011j427m42J086K742M115N313O599P879
61912D99664Q960R948J0950J1680J1869J1851J2127J2568J2577J2043J1516J1439
61900F37192J1755J2338J3265J4420J5274J5303J4394J2634J0018O597K708j231
61888G64667n094r009j3050j6985k0361k2739k3959k4216k3840k2993k1592j9553
61876E41276j7103j4810j3253j2502j1946j0853r119p315n849m457k707p69P79
61863D31372J744K537L531M658N783P083Q688J0230J1199J1709J2434J3627J4610
61850E39205J4647J3976J3383J2887J1567R006O082L859K153N4k473m387m868
61837F15091m097k563m33K139M751P237R887J2865J5891J8742K1481K3841K4947
$$ plain form
61824 749779 773941 795621 813456 825806 830721 826834 814014 793145 765839 734482 701796 669789
61812 669789 639335 610891 585163 562704 543367 526662 512450 500904 492041 485615 481208 478041
61800 478041 475089 471878 469023 467476 467361 468004 468888 469953 471032 471761 472303 473565 476305 480411 485392
61785 485392 491205 498136 506023 514128 521856 529369 537528 547413 559831 574931 592234 611269 632259
61772 632259 655898 682372 710929 740631 771241 803059 836101 869891 903905 937564 969568
61761 969568 997718 1019827 1034616 1041534 1040078 1029881 1011467 986447 956794 924066 889340 853550
61749 853550 817653 782489 748616 716386 686198 658646 634196 612697 593409 575673 559388
61738 559388 544757 531812 520399 510333 501256 492609 484194 476617 470647 466176 462313 458567 455330
$$ packed form
61824G49779K4162K1680J7835J2350M915l887j2820k0869k7306l1357l2686l2007
61812F69789l0454k8444k5728k2459j9337j6705j4212j1546q863o426m407l167
61800D78041k952l211k855j547j15O43Q84J065J079P29N42J262K740M106M981
61785D85392N813O931P887Q105P728P513Q159R885J2418J5100J7303J9035K0990
61772F32259K3639K6474K8557K9702L0610L1818L3042L3790L4014L3659L2004
61761I69568K8150K2109J4789O918j456j0197j8414k5020k9653l2728l4726l5790
61749H53550l5897l5164l3873l2230l0188k7552k4450k1499j9288j7736j6285
61738E59388j4631j2945j1413j0066r077q647q415p577n970m471l863l746l237
$$ plain form
61725 455330 453007 451149 448994 446559 444700 444052 444275 444467 444122 443459 442886 442402 441668 440500 439014 437301
61709 437301 435315 433166 431144 429295 427285 424946 422582 420379 417914 414763 411302 408310 405939 403684
61695 403684 401279 398955 396855 394906 393418 393101 394210 396243 398789 402170 406863 412728 419224 426121
61681 426121 433616 441917 450918 460175 469069 477254 485007 492853 500801 508253 514635 519626 522670 522918
61667 522918 519896 513752 504584 492199 477046 460839 445545 431964 419820 409023 400263 394441
61655 394441 392026 393037 397318 404706 415040 427945 442598 457926 473139 487660 500328 509103
61643 509103 512092 508752 499885 486768 470592 452439 433272 413993 395712 379599 366121 354756
61631 354756 344887 336682 330541 326021 322097 318432 315673 314299 313869 313691 313731 314405 315729 317115 318022 318554
$$ packed form
61725D55330k323j858k155k435j859o48K23J92l45o63n73m84p34j168j486j713
61709D37301j986k149k022j849k010k339k364k203k465l151l461k992k371k255
61695D03684k405k324k100j949j488l17J109K033K546L381M693N865O496O897
61681D26121P495Q301R001R257Q894Q185P753P846P948P452O382M991L044K48
61667E22918l022o144r168j2385j5153j6207j5294j3581j2144j0797q760n822
61655C94441k415J011M281P388J0334J2905J4653J5328J5213J4521J2668Q775
61643E09103K989l340q867j3117j6176j8153j9167j9279j8281j6113j3478j1365
61631C54756r869q205o141m520l924l665k759j374m30j78M0O74J324J386R07N32
$$ plain form
61615 318554 319291 320541 321845 322307 321405 319306 316450 313092 309433 305888 302939 300824 299495 298672 297820
61600 297820 296431 294676 293452 293464 294486 295869 297433 299370 301557 303698 306052 309366 313886 318998 324070
61585 324070 329213 334840 340759 346119 350325 353843 357996 363846 371288 379334 387316 395508 404487 414323
61571 414323 424825 436347 449835 466073 485234 507080 531233 557279 585008 614581 646124
61560 646124 679003 711603 741763 767287 786332 797848 801741 798424 788350 772336 752127 729998
61548 729998 707637 685744 664739 645311 628038 612860 599278 586935 575839 566093 557534 549626
61536 549626 541796 534021 526954 521201 516522 511981 506885 501350 496033 491546 488016 484922 481453 477383
61522 477383 473522 471014 470333 471310 473904 478320 484390 491458 499107 507576 517423 529262 543923 562210
$$ packed form
61615C18554P37J250J304M62r02k099k856l358l659l545k949k115j329q23q52
61600B97820j389j755j224J2J022J383J564J937K187K141K354L314M520N112N072
61585C24070N143N627N919N360M206L518M153N850P442Q046P982Q192Q979R836
61571D14323J0502J1522J3488J6238J9161K1846K4153K6046K7729K9573L1543
61560F46124L2879L2600L0160K5524J9045J1516L893l317j0074j6014k0209k2129
61548G29998k2361k1893k1005j9428j7273j5178j3582j2343j1096r746q559p908
61536E49626p830p775p067n753m679m541n096n535n317m487l530l094l469m070
61522D77383l861k508o81R77K594M416O070P068P649Q469R847J1839J4661J8287
$$ plain form
61508 562210 584168 608988 635988 665449 698388 735922 779056 828558 884571 946538 1013706
61497 1013706 1085402 1160584 1237401 1313450 1386075 1452114 1507871 1550081 1577087 1589006 1587072
61486 1587072 1573294 1550653 1523175 1495515 1472216 1456823 1451241 1456018 1471479 1498394 1537298 1587422
61474 1587422 1646726 1712794 1783193 1854871 1923684 1984723 2033023 2064143 2074747 2063219 2029900
61463 2029900 1976800 1907239 1825606 1736909 1645898 1556331 1470910 1391665 1320083 1256964 1202468
61452 1202468 1156575 1119438 1091207 1071685 1060403 1057080 1061861 1075070 1096885 1127138 1165039 1208859
61440 1208859 1256045 1303659 1348283 1385306 1409058 1414796 1401141 1370650 1328240 1279333 1228939
61429 1228939 1181242 1139286 1105128 1080425 1066512 1063747 1071373 1088447 1114715 1150217 1194163 1244307
$$ packed form
61508E62210K1958K4820K7000K9461L2939L7534M3134M9502N6013O1967O7168
61497A013706P1696P5182P6817P6049P2625O6039N5757M2210K7006J1919j934
61486A587072j3778k2641k7478k7660k3299j5393n582M777J5461K6915L8904N0124
61474A587422N9304O6068P0399P1678O8813O1039M8300L1120J0604j1528l3319
61463B029900n3100o9561q1633q8697r1011q9567q5421p9245p1582o3119n4496
61452A202468m5893l7137k8231j9522j1282l323M781J3209K1815L0253L7901M3820
61440A208859M7186M7614M4624L7023K3752N738j3655l0491m2410m8907n0394
61429A228939m7697m1956l4158k4703j3913k765P626J7074K6268L5502M3946N0144
$$ plain form
61417 1244307 1296937 1346967 1388278 1414832 1422194 1408600 1375345 1326592 1268348 1206619 1145782
61406 1145782 1088307 1035462 987794 945185 907174 873523 844113 818223 794466 771801 750350
61395 750350 730795 713331 697748 684326 673839 666374 660803 656024 652333 650954 652338 655682 660209
61382 660209 666184 674257 684426 696243 709704 725233 742817 761705 780970 799954 818109 834851
61370 834851 849688 862190 871809 878042 880869 880706 877944 872821 865735 857238 847608 836819 825008
61357 825008 812472 799039 783974 766874 748335 729437 710860 692774 675183 658055 641413
61346 641413 625676 611572 599287 588007 576843 565998 556420 548410 541200 533972 526748 520114 514586
61333 514586 510530 508201 507387 507225 506835 506199 506139 507414 510101 513945 518987 525494 533296 541607 549794 558169
$$ packed form
61417A244307N2630N0030M1311K6554P362j3594l3255m8753n8244o1729o0837
61406A145782n7475n2845m7668m2609l8011l3651k9410k5890k3757k2665k1451
61395G50350j9555j7464j5583j3422j0487p465n571m779l691j379J384L344M527
61382F60209N975Q073J0169J1817J3461J5529J7584J8888J9265J8984J8155J6742
61370H34851J4837J2502R619O233K827j63k762n123p086q497r630j0789j1811
61357H25008j2536j3433j5065j7100j8539j8898j8577j8086j7591j7128j6642
61346F41413j5737j4104j2285j1280j1164j0845r578q010p210p228p224o634n528
61333E14586m056k329q14j62l90o36o0J275K687L844N042O507P802Q311Q187Q375
$$ plain form
61317 558169 567730 579112 592069 605960 620341 634868 648969 662048 673947 684917 695190 704872
61305 704872 714258 723901 734182 744950 755675 765774 774669 781655 786054 787583 786529 783463 778844
61292 778844 772874 765580 756921 746983 736332 726131 717545 710851 705431 700838 697561 696397 697335 699547
61278 699547 702443 706233 711492 718619 727731 738538 750110 761272 771499 781013 789722 796563 800385
61265 800385 801111 799536 796252 791431 785571 779772 775107 772179 771459 773639 779351 788849 802316 820406
61251 820406 844220 874753 912482 957490 1009885 1070029 1138230 1213872 1294467 1375295 1449978
61240 1449978 1511723 1554633 1574811 1571201 1545969 1504045 1451756 1395301 1339928 1289833 1248099
61229 1248099 1216505 1195825 1186756 1190380 1207389 1237078 1277490 1326363 1381202 1438242 1491841 1535273
$$ packed form
61317E58169R561J1382J2957J3891J4381J4527J4101J3079J1899J0970J0273R682
61305G04872R386R643J0281J0768J0725J0099Q895O986M399J529j054l066m619
61292G78844n970p294q659r938j0651j0201q586o694n420m593l277j164R38K212
61278F99547K896L790N259P127R112J0807J1572J1162J0227R514Q709O841L822
61265H00385P26j575l284m821n860n799m665k928p20K180N712R498J3467J8090
61251H20406K3814L0533L7729M5008N2395O0144O8201P5642Q0595Q0828P4683
61240A449978O1745M2910K0178l610k5232m1924n2289n6455n5373n0095m1734
61229A248099l1594k0680r069L624J7009K9689M0412M8873N4839N7040N3599M3432
$$ plain form
61217 1535273 1562224 1568067 1550948 1512579 1457873 1393238 1324718 1257088 1193663 1136300 1085827
61206 1085827 1042835 1007849 980503 958961 940776 924286 908997 894926 882115 870544 859964
61195 859964 849775 839489 829339 820079 812142 805327 799177 793251 787000 779874 771779 763148 754464
61182 754464 745860 737212 728241 718470 707449 695271 682597 669951 657209 644003 630480 617343
61170 617343 605158 593865 583109 572915 563863 556576 551166 547284 544618 543138 542798 543234 543812 543799
61156 543799 542416 538965 533138 525134 515415 504523 493212 482376 472509 463422 454807 446920 440356
61143 440356 435282 431304 428136 425973 425092 425297 425893 426126 425643 424638 423553 422551 421513 420648 420746 422457
61127 422457 425445 428766 431974 435404 439358 443600 447875 452525 458241 465435 474059 483847 494472 505505
$$ packed form
61217A535273K6951N843j7119l8369n4706o4635o8520o7630o3425n7363n0473
61206A085827m2992l4986k7346k1542j8185j6490j5289j4071j2811j1571j0580
61195H59964j0189j0286j0150r260p937o815o150n926o251p126q095q631q684
61182G54464q604q648q971r771j1021j2178j2674j2646j2742j3206j3523j3137
61170F17343j2185j1293j0756j0194r052p287n410l882k666j480l40M36N78j3
61156E43799j383l451n827q004r719j0892j1311j0836r867r087q615p887o564
61143D40356n074l978l168k163q81K05N96K33m83j005j085j002j038q65R8J711
61127D22457K988L321L208L430L954M242M275M650N716P194Q624R788J0625J1033
$$ plain form
61113 505505 516381 526485 535326 542776 549024 554106 557563 558853 558094 556121 553765 551330 548787 546103
61099 546103 543226 540029 536527 533004 529841 527344 525754 525204 525557 526521 528010 530179 532975 535839 538047
61084 538047 539247 539601 539524 539371 539255 539136 539162 539850 541663 544458 547707 551346 556021 562310 569969 578197
61068 578197 586428 594670 603256 612462 622304 632588 643236 654570 667016 680456 694105 707166
61056 707166 719493 731582 744162 757748 772219 786653 799953 811888 823381 835662 849462
61045 849462 865075 882677 902292 923809 947276 972810 1000005 1027957 1056242 1085350 1115695
61034 1115695 1146855 1178542 1211818 1248448 1289291 1334240 1383601 1438547 1500140 1568790 1644978
61023 1644978 1730103 1826985 1940681 2079031 2251583 2468137 2739512 3079606 3504755 4030675
$$ packed form
61113E05505J0876J0104Q841P450O248N082L457J290p59j973k356k435k543k684
61099E46103k877l197l502l523l163k497j590n50L53R64J489K169K796K864K208
61084E38047J200L54p7j53j16j19K6O88J813K795L249L639M675O289P659Q228
61068E78197Q231Q242Q586R206R842J0284J0648J1334J2446J3440J3649J3061
61056G07166J2327J2089J2580J3586J4471J4434J3300J1935J1493J2281J3800
61045H49462J5613J7602J9615K1517K3467K5534K7195K7952K8285K9108L0345
61034A115695L1160L1687L3276L6630M0843M4949M9361N4946O1593O8650P6188
61023A644978Q5125R6882J13696J38350J72552K16554K71375L40094M25149N25920
$$ plain form
61013 4030675 4672229 5447294 6377463 7479895 8754500 10172552 11664742 13109167 14338573
61004 14338573 15190262 15585947 15584158 15355629 15097472 14953594 14986602 15183550 15457326 15647329
60994 15647329 15557930 15042343 14078520 12774984 11305032 9827317 8446321 7215915 6156739
60985 6156739 5267690 4533315 3932213 3443576 3048630 2729982 2472572 2264758 2097126
60976 2097126 1960582 1846564 1748515 1662089 1584227 1512956 1447788 1389125 1336941 1290522 1249400
60965 1249400 1213797 1183961 1159568 1139849 1123704 1109489 1095293 1079892 1063303 1046217 1029163
60954 1029163 1012377 996121 980738 966413 953131 940848 929556 919115 909045 898520 886635
60943 886635 872782 856790 838736 818858 797807 776760 756918 738879 722745 708729 697303
$$ packed form
61013D030675O41554P75065R30169J102432J274605J418052J492190J444425J229406
61004A4338573Q51689L95685j789k28529k58157j43878L3008J96948K73776J90003
60994A5647329q9399n15587r63823j303536j469952j477715j380996j230406j059176
60985F156739q89049p34375o01102m88637l94946l18648k57410k07814j67632
60976B097126j36544j14018r8049q6426p7862p1271o5168n8663n2184m6419m1122
60965A249400l5603k9836k4393j9719j6145j4215j4196j5401j6589j7086j7054
60954A029163j6786j6256j5383j4325j3282j2283j1292j0441j0070j0525j1885
60943H86635j3853j5992j8054j9878k1051k1047j9842j8039j6134j4016j1426
$$ plain form
60932 697303 688685 682592 678711 677155 678141 681295 685445 689213 691831 693459 694721 695994 697310 698905
60918 698905 701413 705195 709828 714763 720259 726944 734507 741512 746743 750059 751626 751073 748027 743124
60904 743124 737805 733184 729513 726436 723225 718864 712580 704456 695227 685380 674825 663461 651681
60891 651681 640177 629562 620345 612948 607416 603193 599390 595279 590517 585088 579228 573322 567646 562166
60877 562166 556736 551543 547149 543973 541897 540618 540269 541293 543566 546030 547484 547482 546166 543508 539288
60862 539288 533811 528108 523219 519504 516748 514568 512608 510578 508326 505778 502921 500152 498494 498892
60848 498892 501157 504066 506665 508919 510877 511932 511473 509774 507536 504834 501182 496488 491222 485562
60834 485562 479027 471192 462391 453488 445190 437778 431247 425496 420430 415976 412030 408445 405115 401982
$$ packed form
60932F97303q618o093l881j556R86L154M150L768K618J628J262J273J316J595
60918F98905K508L782M633M935N496O685P563P005N231L316J567n53l046m903
60904G43124n319m621l671l077l211m361o284q124r229r847j0555j1364j1780
60891F51681j1504j0615r217p397n532m223l803m111m762n429n860n906n676n480
60877E62166n430n193m394l176k076j279l49J024K273K464J454kj316k658m220
60862E39288n477n703m889l715k756k180j960k030k252k548k857k769j658L98
60848D98892K265K909K599K254J958J055m59j699k238k702l652m694n266n660
60834D85562o535p835q801q903q298p412o531n751n066m454l946l585l330l133
$$ plain form
60820 401982 398860 395374 391229 386504 381595 376925 372644 368448 363738 358204 352347 347118 343003 339817
60806 339817 337449 336170 335860 335495 334020 331498 328917 327062 326058 325810 326335 327676 329818 332599 335372
60791 335372 337080 337193 336448 336119 336605 337282 337640 337956 338728 339998 341403 342572 343315 343727 344093 344443 344296
60774 344296 343251 341767 340884 341126 342112 343251 344371 345567 346888 348324 349789 351105 352297 353784 355801
60759 355801 357693 358440 357912 356934 356027 354843 353161 351651 351030 351029 350855 350355 349999 349844 349241 347603 345013
60742 345013 341868 338334 334449 330559 327369 325441 324707 324497 324049 322946 321226 319275 317652 316741 316392
60727 316392 316156 316010 316494 317794 319104 319461 318995 318689 318977 319315 319156 318657 318199 317876 317790 318280 319400 320601
60709 320601 321335 321648 321872 322087 322214 322238 321925 320739 318574 316318 315044 314683 314051 312354 310232 309008 309108
$$ packed form
60820D01982l122l486m145m725m909m670m281m196m710n534n857n229m115l186
60806C39817k368j279l10l65j475k522k581j855j004k48N25J341K142K781K773
60791C35372J708J13p45l29M86O77L58L16P72J270J405J169P43M12L66L50j47
60774C44296j045j484q83K42R86J139J120J196J321J436J465J316J192J487K017
60759C55801J892P47n28r78r07j184j682j510o21jj74n00l56j55o03j638k590
60742C45013l145l534l885l890l190j928p34k10m48j103j720j951j623r11l49
60727C16392k36j46M84J300J310L57m66l06K88L38j59m99m58l23q6M90J120J201
60709C20601P34L13K24K15J27K4l13j186k165k256j274l61o32j697k122j224J00
$$ plain form
60692 309108 309527 308921 307072 305012 303735 303149 302634 302284 302957 305061 307894 310393 312103 313164 313861 314527
60676 314527 315457 316422 316543 315127 312500 309630 307046 304546 301885 299289 297180 295724 294795 294227 293942 293889
60660 293889 293924 293842 293607 293551 294128 295357 296665 297495 298017 299103 301496 304984 308355 310233 310061 308327 305854
60643 305854 303060 299999 296810 293737 290765 287645 284338 281251 278967 277850 277757 277912 277324 275740 274025
60628 274025 273198 273296 273696 274313 275704 277969 280343 282130 283361 284334 285146 285982 287238 288941 290598 291962
60612 291962 293411 295158 296678 297449 297743 298100 298450 298396 298082 298120 298757 299649 300331 300482 299817 298231 296070 293991
60594 293991 292466 291526 290808 289779 288240 286814 286562 287901 290233 292816 295519 298368 300922 302701 303891
60579 303891 305053 306366 307596 308574 309241 309486 309398 309429 309865 310428 310912 311889 314176 317744 321691 325180 327951
$$ packed form
60692C09108M19o06j849k060j277n86n15l50O73K104K833K499J710J061O97O66
60676C14527R30R65J21j416k627k870k584k500k661k596k109j456r29n68k85n3
60660B93889L5q2k35n6N77J229J308Q30N22J086K393L488L371J878j72j734k473
60643C05854k794l061l189l073k972l120l307l087k284j117r3J55n88j584j715
60628B74025q27R8M00O17J391K265K374J787J231R73Q12Q36J256J703J657J364
60612B91962J449J747J520P71K94L57L50n4l14L8O37Q92O82J51o65j586k161k079
60594B93991j525r40p18j029j539j426k52J339K332K583K703K849K554J779J190
60579C03891J162J313J230R78O67K45q8L1M36N63M84R77K287L568L947L489K771
$$ plain form
60562 327951 330203 332566 335986 340989 347116 353580 360325 367819 375997 384199 392171 400452 409623 419760
60548 419760 430712 442400 454748 467885 482562 499909 520618 544747 572191 602700 635227
60537 635227 667791 698219 724573 744758 756489 758219 749910 732687 708110 678135 645270 612073
60525 612073 580388 551272 525531 503910 486688 473376 463092 455315 450219 448228 449302 452789
60513 452789 458053 465031 474113 485614 499649 516454 536633 561008 590195 624113 661799 701775
60501 701775 742518 782344 818896 849393 871828 885812 892214 892476 888560 882971 878144 875858 877364
60488 877364 883508 894138 907680 921742 933849 941298 941101 931150 911309 882774 846825 805029
60476 805029 760166 715498 672936 632873 595804 562810 534130 508533 484917 463721 445970
$$ packed form
60562C27951K252K363L420N003O127O464O745P494Q178Q202P972Q281R171J0137
60548D19760J0952J1688J2348J3137J4677J7347K0709K4129K7444L0509L2527
60537F35227L2564L0428K6354K0185J1731J730q309j7223k4577k9975l2865l3197
60525F12073l1685k9116k5741k1621j7222j3312j0284p777n096j991J074L487
60513D52789N264O978R082J1501J4035J6805K0179K4375K9187L3918L7686L9976
60501G01775M0743L9826L6552L0497K2435J3984O402K62l916n589m827k286J506
60488H77364O144J0630J3542J4062J2107P449j97r951j9841k8535l5949m1796
60476H05029m4863m4668m2562m0063l7069l2994k8680k5597k3616k1196j7751
$$ plain form
60465 445970 431546 419143 407569 396466 386097 376997 369600 363692 358438 353290 348611 344978 342224
60452 342224 339617 336803 334060 331740 329886 328388 327164 326220 325714 325924 326961 328647 330870 333869 337941
60437 337941 342999 348612 354385 360146 365930 371964 378415 384955 390770 395282 398699 401511 403647 404530
60423 404530 404003 402782 401806 401403 401377 401774 403202 406248 410760 415963 421186 426255 431244 436315 441952 448958
60407 448958 457878 468598 480817 494594 510059 526898 544642 563304 583123 603760 624484 645256
60395 645256 666938 690109 714167 737940 760728 782362 802633 821153 837587 851582 862603
60384 862603 870317 875184 878340 880757 882663 883873 884493 885099 886233 887873 889566 890938 891849 892100 891397
60369 891397 889768 887714 885711 883961 882860 883271 885807 890185 895872 903050 912147 922467 932045 938965
$$ packed form
60465D45970j4424j2403j1574j1103j0369r100p397n908n254n148m679l633k754
60452C42224k607k814k743k320j854j498j224r44n06K10J037J686K223K999M072
60437C37941N058N613N773N761N784O034O451O540N815M512L417K812K136Q83
60423D04530n27j221r76m03k6L97J428L046M512N203N223N069M989N071N637P006
60407D48958Q920J0720J2219J3777J5465J6839J7744J8662J9819K0637K0724K0772
60395F45256K1682K3171K4058K3773K2788K1634K0271J8520J6434J3995J1021
60384H62603P714M867L156K417J906J210O20O06J134J640J693J372R11K51p03
60369H91397j629k054k003j750j101M11K536M378N687P178R097J0320R578O920
$$ plain form
60355 938965 942157 940870 934273 922072 904908 883703 859060 831725 803143 774952 748063 722612
60343 722612 698664 676546 656581 638789 622911 608570 595470 583505 572603 562496 552823 543483
60331 543483 534658 526511 519098 512567 507164 503052 500372 499387 500249 502701 506397 511415 517916 525345 532567
60316 532567 538871 544291 548921 552590 555363 557602 559195 559397 557881 555391 552937 550892 549302 548386 548008
60301 548008 547097 544439 539849 533941 526916 518300 507928 496582 485532 475775 467738 461334 456171 451933
60287 451933 448596 446195 444477 442997 441456 439758 437937 436234 435146 435088 436011 437488 439058 440389 441420
60272 441420 442652 445102 449612 456124 463815 471873 479982 488221 496771 505740 515096 524723 534571 544695
60258 544695 555087 565459 575147 583202 588764 591582 592122 590876 587698 582220 574914 567284 560823 556050
$$ packed form
60355I38965L192j287o597j2201j7164k1205k4643k7335k8582k8191k6889k5451
60343G22612k3948k2118j9965j7792j5878j4341j3100j1965j0902j0107r673r340
60331E43483q825q147p413o531n403m112k680r85Q62K452L696N018O501P429P222
60316E32567O304N420M630L669K773K239J593K02j516k490k454k045j590r16l78
60301E48008r11k658m590n908p025q616j0372j1346j1050r757q037o404n163m238
60287D51933l337k401j718j480j541j698j821j703j088n8R23J477J570J331J031
60272D41420J232K450M510O512P691Q058Q109Q239Q550Q969R356R627R848J0124
60258E44695J0392J0372R688Q055N562K818N40j246l178n478p306p630o461m773
$$ plain form
60244 556050 552586 549822 547416 545630 545413 547842 553275 561265 571315 583344 597341 613015 630030
60231 630030 648177 667203 686792 706857 727403 748017 768041 787462 807119 827733 849185
60220 849185 871017 893205 916143 940371 966622 995643 1027577 1061876 1098100 1136345 1176657
60209 1176657 1218628 1261951 1306755 1352938 1399746 1446554 1493463 1540430 1586255 1629092 1667587
60198 1667587 1700929 1728297 1749146 1763879 1773605 1779388 1782251 1783511 1784333 1785124 1786008 1787666 1791051 1796450
60184 1796450 1803515 1811974 1821625 1831820 1841814 1851525 1861284 1870934 1879963 1888392 1896553 1903928 1909198 1911682
60170 1911682 1911854 1910073 1905649 1897659 1885988 1870995 1852759 1831361 1807582 1782643 1757363 1732019
60158 1732019 1706875 1682298 1658298 1634380 1610010 1584991 1559211 1532242 1503502 1472889 1440994
$$ packed form
60244E56050l464k764k406j786k17K429N433P990J0050J2029J3997J5674J7015
60231F30030J8147J9026J9589K0065K0546K0614K0024J9421J9657K0614K1452
60220H49185K1832K2188K2938K4228K6251K9021L1934L4299L6224L8245M0312
60209A176657M1971M3323M4804M6183M6808M6808M6909M6967M5825M2837L8495
60198A667587L3342K7368K0849J4733R726N783K863J260Q22P91Q84J658L385N399
60184A796450P065Q459R651J0195R994R711R759R650R029Q429Q161P375N270K484
60170A911682J72j781m424p990j1671j4993j8236k1398k3779k4939k5280k5344
60158A732019k5144k4577k4000k3918k4370k5019k5780k6969k8740l0613l1895
$$ plain form
60147 1440994 1408440 1375117 1340454 1304487 1268324 1233423 1200782 1170973 1144433 1121156 1100354
60136 1100354 1080988 1062621 1045429 1029452 1014292 999526 985070 971099 957858 945579 934320
60125 934320 923818 913569 902982 891521 879041 866129 853782 842524 832250 823140 816185 812289
60113 812289 811265 812283 814945 819314 825269 832628 841701 852830 865439 878326 890948 903652 916483
60100 916483 928629 939383 948908 957550 964866 969918 972255 972124 969818 965216 958072 948597 937651 926247
60086 926247 914770 902773 889658 875472 860817 846164 831570 816993 802556 788447 774781
60075 774781 761626 749143 737765 728201 720928 715549 711026 706799 703322 701235 700502 700786 702179 704932
60061 704932 708794 713197 717792 722215 725743 727907 729134 729962 729901 727987 724249 719573 714120 707010 697797
$$ packed form
60147A440994l2554l3323l4663l5967l6163l4901l2641k9809k6540k3277k0802
60136A100354j9366j8367j7192j5977j5160j4766j4456j3971j3241j2279j1259
60125I34320j0502j0249j0587j1461j2480j2912j2347j1258j0274r110o955l896
60113H12289j024J018K662M369N955P359R073J1129J2609J2887J2622J2704J2831
60100I16483J2146J0754R525Q642P316N052K337j31k306m602p144r475j0946j1404
60086I26247j1477j1997j3115j4186j4655j4653j4594j4577j4437j4109j3666
60075G74781j3155j2483j1378r564p273n379m523m227l477k087p33K84J393K753
60061G04932L862M403M595M423L528K164J227Q28o1j914l738m676n453p110r213
$$ plain form
60046 697797 687222 676149 664737 653144 642132 632309 623402 615007 607576 601963 598354 596277 595554
60033 595554 596674 600274 606547 615131 625375 636830 649602 664082 680302 697793 716139 735346
60021 735346 755573 776832 798998 821706 844047 864675 882340 895989 904392 906292 901271 890104
60009 890104 874014 853970 830892 806073 780903 756363 733114 711874 693370 677922 665252
59998 665252 654689 645670 638215 632889 630041 629185 629493 630820 633735 638500 644649 651764 660125 670191
59984 670191 681825 694344 707025 719297 730764 741497 752154 763513 775936 789363 803564
59973 803564 818162 832606 846395 859320 871421 882718 892905 901127 906171 907146 904030 897371 887647
59960 887647 875247 860901 845580 829987 814607 800229 787852 777936 770229 764473 760869 759770
$$ packed form
60046F97797j0575j1073j1412j1593j1012r823q907q395p431n613l609k077p23
60033E95554J120L600O273Q584J0244J1455J2772J4480J6220J7491J8346J9207
60021G35346K0227K1259K2166K2708K2341K0628J7665J3649Q403J900n021j1167
60009H90104j6090k0044k3078k4819k5170k4540k3249k1240j8504j5448j2670
59998F65252j0563r019p455n326k848q56L08J327K915M765O149P115Q361J0066
59984F70191J1634J2519J2681J2272J1467J0733J0657J1359J2423J3427J4201
59973H03564J4598J4444J3789J2925J2101J1297J0187Q222N044R75l116o659r724
59960H87647j2400j4346j5321j5593j5380j4378j2377r916p707n756l604j099
$$ plain form
59948 759770 761396 765975 773604 783875 796204 810748 828432 849730 873893 899699 926553 954585
59936 954585 984107 1015283 1047882 1080981 1113262 1143932 1172965 1200227 1224851 1245858 1262973
59925 1262973 1276347 1285868 1291282 1292787 1291053 1286857 1281155 1275281 1270522 1267363 1265482 1264526 1264669 1266358
59911 1266358 1269640 1273726 1277133 1278315 1276273 1270673 1261552 1249170 1234055 1216924 1198562 1179961 1162454
59898 1162454 1147350 1135370 1126690 1121322 1119110 1119492 1121825 1125950 1131961 1139516 1147983 1157307 1168128
59885 1168128 1180931 1195581 1211740 1229160 1247488 1266493 1286601 1308625 1332831 1359060 1387849
59874 1387849 1420555 1458045 1500207 1547282 1600767 1662260 1732032 1809389 1893842 1985058 2081940
59863 2081940 2182278 2282739 2378381 2462523 2528100 2569525 2583451 2568718 2526719 2461815 2380587
$$ packed form
59948G59770J626M579P629J0271J2329J4544J7684K1298K4163K5806K6854K8032
59936I54585K9522L1176L2599L3099L2281L0670K9033K7262K4624K1007J7115
59925A262973J3374R521N414J505j734m196n702n874m759l159j881r56J43J689
59911A266358L282M086L407J182k042n600r121j2382j5115j7131j8362j8601j7507
59898A162454j5104j1980q680n368k212L82K333M125O011P555Q467R324J0821
59885A168128J2803J4650J6159J7420J8328J9005K0108K2024K4206K6229K8789
59874A387849L2706L7490M2162M7075N3485O1493O9772P7357Q4453R1216R6882
59863B081940J00338J00461R5642Q4142O5577M1425J3926j4733m1999o4904q1228
$$ plain form
59852 2380587 2290212 2197301 2107439 2024868 1952342 1891400 1842509 1804706 1775717 1753300 1736566
59841 1736566 1725803 1721333 1722990 1730508 1743923 1763738 1790986 1826954 1872453 1927590 1992548 2068337
59829 2068337 2156435 2258000 2373815 2504557 2650500 2810896 2983708 3165284 3349646 3528448
59819 3528448 3692450 3833443 3945161 4023557 4067577 4079791 4065525 4030842 3981169 3921085 3854292
59808 3854292 3783160 3708323 3628735 3542296 3446982 3342064 3228520 3108489 2984647 2859906
59798 2859906 2736816 2616695 2499708 2386121 2277001 2173400 2075540 1983318 1897038 1817047
59788 1817047 1743297 1676044 1616449 1565628 1523440 1489024 1462210 1443429 1432408 1427956 1429166 1435983
59776 1435983 1448452 1465917 1487102 1510433 1534294 1557561 1580015 1601929 1623294 1643764 1663102
$$ packed form
59852B380587r0375r2911q9862q2571p2526o0942m8891l7803k8989k2417j6734
59841A736566j0763m470J657P518J3415J9815K7248L5968M5499N5137O4958P5789
59829B068337Q8098J01565J15815J30742J45943J60396J72812J81576J84362J78802
59819C528448J64002J40993J11718P8396M4020J2214j4266l4683m9673o0084o6793
59808C854292p1132p4837p9588q6439r5314j04918j13544j20031j23842j24741
59798B859906j23090j20121j16987j13587j09120j03601r7860r2222q6280p9991
59788A817047p3750o7253n9595n0821m2188l4416k6814j8781j1021m452J210O817
59776A435983J2469J7465K1185K3331K3861K3267K2454K1914K1365K0470J9338
$$ plain form
59765 1663102 1681112 1697227 1710583 1720365 1725704 1725672 1720002 1709622 1695820 1679230 1660382 1641012
59753 1641012 1623823 1610816 1602430 1598143 1597020 1597617 1598287 1598010 1596436 1593007 1586613 1576398 1562487 1545805
59739 1545805 1527526 1508585 1489163 1468721 1447144 1425741 1406425 1389867 1375162 1361307 1348114
59728 1348114 1335573 1323287 1311115 1299659 1289539 1280561 1272062 1263709 1255689 1248466 1242756 1239392 1238929
59715 1238929 1241501 1247182 1256124 1268255 1283250 1300999 1321673 1345078 1370344 1396530 1423185 1450062
59703 1450062 1476691 1502635 1527859 1552349 1575418 1595791 1612521 1625659 1635997 1644243 1650578 1655080
59691 1655080 1658423 1661857 1666386 1672193 1678937 1686182 1693278 1699263 1703474 1706059 1707475 1707809 1707184 1706649 1707888
59676 1707888 1711957 1718822 1728141 1739935 1754397 1771721 1792329 1816860 1845686 1878666 1915287 1954609
$$ packed form
59765A663102J8010J6115J3356R782N339l2n670j0380j3802j6590j8848j9370
59753A641012j7189j3007q386m287j123N97O70k77j574l429o394j0215j3911j6682
59739A545805j8279j8941j9422k0442k1577k1403j9316j6558j4705j3855j3193
59728A348114j2541j2286j2172j1456j0120q978q499q353q020p223n710l364m63
59715A238929K572N681Q942J2131J4995J7749K0674K3405K5266K6186K6655K6877
59703A450062K6629K5944K5224K4490K3069K0373J6730J3138J0338Q246O335M502
59691A655080L343L434M529N807O744P245P096N985M211K585J416L34o25n35J239
59676A707888M069O865R319J1794J4462J7324K0608K4531K8826L2980L6621L9322
$$ plain form
59664 1954609 1995008 2034474 2071215 2103684 2130173 2149132 2160031 2163381 2159696 2148929 2131007 2106300
59652 2106300 2075309 2038471 1996738 1951974 1906349 1861474 1818176 1776756 1737246 1699768 1664843
59641 1664843 1633094 1604387 1577517 1550831 1522854 1492214 1457484 1417597 1372417 1322777 1270138
59630 1270138 1216339 1163376 1113084 1066929 1026048 991239 962835 940725 924626 914362 909975
59619 909975 911646 919312 932162 948712 967576 987842 1008324 1026776 1040620 1048548 1051058 1049534
59607 1049534 1045273 1039345 1032673 1025906 1019460 1013788 1009304 1006002 1003492 1001458 999846 998622 997778 997649
59593 997649 998901 1002103 1007370 1014259 1021743 1028486 1033475 1036251 1036275 1032467 1023948 1011011 994889 976830
59579 976830 957913 939328 921955 905803 890673 877302 866956 859924 855288 852351 851437 853084 857172
$$ packed form
59664A954609M0399L9466L6741L2469K6489J8959J0899L350l685j0767j7922k4707
59652B106300l0991l6838m1733m4764m5625m4875m3298m1420l9510l7478l4925
59641A664843l1749k8707k6870k6686k7977l0640l4730l9887m5180m9640n2639
59630A270138n3799n2963n0292m6155m0881l4809k8404k2110j6099j0264m387
59619I09975J671P666J2850J6550J8864K0266K0482J8452J3844P928K510j524
59607A049534m261n928o672o767o446n672m484l302k510k034j612j224q44j29
59593I97649J252L202N267O889P484O743M989K776K4l808q519j2937j6122j8059
59579I76830j8917j8585j7373j6152j5130j3371j0346p032m636k937r14J647M088
$$ plain form
59566 857172 863181 870745 879724 890220 902625 917099 933086 950044 968610 990178 1015215 1042867
59554 1042867 1072265 1103202 1135293 1167579 1199451 1231032 1262184 1292115 1320611 1348741 1377529
59543 1377529 1406610 1434758 1460721 1482648 1497733 1504090 1502908 1497633 1490922 1483155 1473647 1462115
59531 1462115 1448562 1432628 1413733 1391661 1366695 1339304 1309895 1278837 1246549 1213493 1179952
59520 1179952 1145864 1111115 1076095 1041812 1009359 979402 952134 927443 905047 884677 866220
59509 866220 849571 834523 821140 810075 802000 796832 793916 792808 793277 794744 796622 799253 803700
59496 803700 810369 818654 828119 839044 851367 864009 875928 887097 897731 907173 914416 919354 922744
59483 922744 925044 925935 924904 921901 917419 912207 906757 900983 894620 887948 881671 876101 871120 867074
$$ packed form
59566H57172O009P564Q979J0496J2405J4474J5987J6958J8566K1568K5037K7652
59554A042867K9398L0937L2091L2286L1872L1581L1152K9931K8496K8130K8788
59543A377529K9081K8148K5963K1927J5085O357j182n275o711p767r508j1532
59531A462115j3553j5934j8895k2072k4966k7391k9409l1058l2288l3056l3541
59520A179952l4088l4749l5020l4283l2453k9957k7268k4691k2396k0370j8457
59509H66220j6649j5048j3383j1065q075n168k916j108M69J467J878K631M447
59496H03700O669Q285R465J0925J2323J2642J1919J1169J0634R442P243M938L390
59483I22744K300Q91j031l003m482n212n450n774o363o672o277n570m981m046
$$ plain form
59469 867074 864867 864792 865949 867326 868780 870513 872241 873544 874451 875027 874862 873601 871455 868516 863995
59454 863995 856911 847254 835853 823381 810041 795950 781274 766295 751832 739178 729016 720755
59442 720755 713477 707093 701925 697735 694030 690985 689090 688056 687001 685684 684716 684525 684877 685524 686637
59427 686637 688462 691065 694557 699106 704790 711935 721535 734730 751774 771866 793748 815705 835024
59414 835024 848600 854894 855179 852631 850435 850745 854754 862958 875294 891293 910130 930220 948758
59401 948758 962160 967779 965712 958898 951124 944820 940658 938681 939079 941974 947209 954708 964592 976778
59387 976778 990930 1007022 1025512 1046835 1071213 1099013 1130587 1165555 1202946 1242395 1284494
59376 1284494 1329508 1376493 1424151 1471749 1518411 1562114 1600178 1630405 1651171 1661172 1660161
$$ packed form
59469H67074k207p5J157J377J454J733J728J303R07N76j65j261k146k939m521
59454H63995p084r657j1401j2472j3340j4091j4676j4979j4463j2654j0162q261
59442G20755p278o384n168m190l705l045j895j034j055j317r68j91L52O47J113
59427F86637J825K603L492M549N684P145R600J3195J7044K0092K1882K1957J9319
59414H35024J3576O294K85k548k196L10M009Q204J2336J5999J8837K0090J8538
59401I48758J3402N619k067o814p774o304m162j977L98K895N235P499R884J2186
59387I76778J4152J6092J8490K1323K4378K7800L1574L4968L7391L9449M2099
59376A284494M5014M6985M7658M7598M6662M3703L8064L0227K0766J0001j011
$$ plain form
59365 1660161 1649731 1632479 1610441 1584929 1557554 1530540 1505973 1485292 1469353 1458408 1452140
59354 1452140 1450175 1452410 1458448 1467208 1477674 1489605 1502760 1515873 1527323 1536528 1543723 1548559 1550056
59341 1550056 1548054 1543678 1537972 1530878 1521975 1511571 1500483 1489063 1476958 1463793 1449840 1435937
59329 1435937 1422823 1410646 1399268 1388892 1380003 1372692 1366632 1361752 1358037 1354290 1347976 1337129 1321800
59316 1321800 1302875 1280226 1253227 1222710 1191105 1160424 1130982 1102014 1072682 1042506 1011899
59305 1011899 982670 957210 936686 920440 907346 897266 890924 888783 890360 894603 900968 910111
59293 910111 923202 940264 959589 979096 997751 1015185 1030649 1043310 1053171 1060613 1065256 1066388
59281 1066388 1064565 1061770 1059816 1059398 1060859 1064938 1072409 1083616 1098639 1117303 1138769 1161654 1184743
$$ packed form
59365A660161j0430j7252k2038k5512k7375k7014k4567k0681j5939j0945o268
59354A452140j965K235O038Q760J0466J1931J3155J3113J1450R205P195M836J497
59341A550056k002m376n706p094q903j0404j1088j1420j2105j3165j3953j3903
59329A435937j3114j2177j1378j0376q889p311o060m880l715l747o314j0847j5329
59316A321800j8925k2649k6999l0517l1605l0681k9442k8968k9332l0176l0607
59305A011899k9229k5460k0524j6246j3094j0080o342k141J577M243O365R143
59293I10111J3091J7062J9325J9507J8655J7434J5464J2661R861P442M643J132
59281A066388j823k795j954m18J461M079P471J1207J5023J8664K1466K2885K3089
$$ plain form
59268 1184743 1207158 1227792 1245185 1258152 1265978 1267922 1263124 1251263 1232885 1208947 1180515 1148918
59256 1148918 1115652 1081867 1048286 1015715 985137 957212 931996 909239 888590 869591 851907
59245 851907 835619 820908 807549 795075 783321 772308 761700 750974 740088 729497 719565 710406
59233 710406 702223 695226 689244 683855 678858 674279 670111 666523 664034 662931 662768 663019 663842 665484 667302
59218 667302 668302 668518 669016 670689 673797 678486 684768 692054 699657 707774 717131 727780 739214 751646
59204 751646 766091 783093 802348 823724 847589 873947 902239 932255 964280 998138 1032991
59193 1032991 1068262 1103636 1137958 1169294 1196581 1220060 1239536 1253379 1260018 1259403 1252151 1238169
59181 1238169 1217261 1190512 1160045 1127702 1094787 1062782 1033373 1007627 985661 967269 952638
$$ packed form
59268A184743K2415K0634J7393J2967P826J944m798j1861j8378k3938k8432l1597
59256A148918l3266l3785l3581l2571l0578k7925k5216k2757k0649j8999j7684
59245H51907j6288j4711j3359j2474j1754j1013j0608j0726j0886j0591r932r159
59233G10406q183o997n982n389m997m579m168l588k489j103j63K51Q23J642J818
59218F67302J000K16M98J673L108M689O282P286P603Q117R357J0649J1434J2432
59204G51646J4445J7002J9255K1376K3865K6358K8292L0016L2025L3858L4853
59193A032991L5271L5374L4322L1336K7287K3479J9476J3843O639o15p252j3982
59181A238169k0908k6749l0467l2343l2915l2005k9409k5746k1966j8392j4631
$$ plain form
59170 952638 942428 937274 937207 941726 950700 964929 985340 1011827 1043581 1080406 1122893 1171266 1224923
59157 1224923 1283183 1345495 1410518 1475769 1538537 1596430 1646790 1686503 1713013 1725167 1723059
59146 1723059 1707851 1682044 1648927 1611196 1570590 1529041 1489306 1453923 1424109 1399942 1380943
59135 1380943 1366418 1356198 1351430 1353715 1363116 1377940 1396769 1419493 1445862 1474392 1503598 1533133
59123 1533133 1562606 1590336 1614552 1635051 1652323 1665627 1673319 1674802 1670859 1662230 1649048 1631717
59111 1631717 1611273 1588585 1563899 1537254 1508773 1478582 1447154 1415782 1386157 1359319 1335352
59100 1335352 1313960 1294818 1277413 1261101 1245468 1230349 1215429 1200054 1183488 1165362 1146073
59089 1146073 1126792 1108742 1092305 1077123 1063125 1050971 1041266 1033831 1028070 1023633 1020428 1018406
$$ packed form
59170I52638j0210n154o7M519Q974J4229K0411K6487L1754L6825M2487M8373N3657
59157A224923N8260O2312O5023O5251O2768N7893N0360L9713K6510J2154k108
59146A723059j5208k5807l3117l7731m0606m1549l9735l5383k9814k4167j8999
59135A380943j4525j0220m768K285R401J4824J8829K2724K6369K8530K9206K9535
59123A533133K9473K7730K4216K0499J7272J3304P692J483l943q629j3182j7331
59111A631717k0444k2688k4686k6645k8481l0191l1428l1372k9625k6838k3967
59100A335352k1392j9142j7405j6312j5633j5119j4920j5375j6566j8126j9289
59089A146073j9281j8050j6437j5182j3998j2154r705p435n761m437l205k022
$$ plain form
59077 1018406 1017629 1018136 1019437 1020573 1020975 1020829 1020340 1019116 1016606 1012670 1007422 1001000 993736 986049 977896
59062 977896 968917 959318 949990 941447 933439 925991 920042 916492 915374 916457 919866 925390 931900 938262
59048 938262 944232 949708 953652 954637 952098 946390 938029 927524 915548 902580 888724 874415 860847
59035 860847 849114 839429 831699 826157 822681 820238 817964 816313 816130 817033 817736 817689 817338 816963 816290 815202
59019 815202 813947 812640 811400 810939 812176 815159 819076 823422 828517 834832 842428 851103 860599 870556
59005 870556 880744 891418 903077 915864 929458 943453 957575 971732 986181 1001442 1017793
58994 1017793 1035140 1053631 1073946 1096729 1122307 1151456 1185807 1226871 1275145 1330789 1394569
58983 1394569 1467266 1548623 1637774 1734339 1838004 1946997 2057712 2165679 2266146 2353936
$$ packed form
59077A018406p77N07J301J136M02j46m89j224k510l936n248o422p264p687q153
59062I77896q979r599r328q543q008p448n949l550j118J083L409N524O510O362
59048I38262N970N476L944R85k539n708q361j0505j1976j2968j3856j4309j3568
59035H60847j1733r685p730n542l476k443k274j651j83R03P03m7l51l75o73j088
59019H15202j255j307j240m61J237K983L917M346N095O315P596Q675R496R957
59005H70556J0188J0674J1659J2787J3594J3995J4122J4157J4449J5261J6351
58994A017793J7347J8491K0315K2783K5578K9149L4351M1064M8274N5644O3780
58983A394569P2697Q1357Q9151R6565J03665J08993J10715J07967J00467Q7790
$$ plain form
58973 2353936 2423912 2472136 2496386 2495835 2470950 2423804 2357895 2277421 2186776 2090328 1991953 1894676
58961 1894676 1800956 1712940 1632029 1558544 1492387 1433741 1382634 1338288 1299696 1266600 1239089
58950 1239089 1216453 1197189 1180146 1165026 1151752 1140014 1129477 1119925 1111155 1103121 1096144 1090689
58938 1090689 1087013 1085305 1085850 1088699 1093502 1100013 1108386 1118583 1130049 1142558 1156927 1174198 1194524
58925 1194524 1217574 1243785 1274518 1311091 1354206 1404111 1460805 1524229 1594457 1671128 1752239
58914 1752239 1834008 1912254 1983107 2041890 2082715 2100950 2096034 2071163 2030801 1979546 1922621
58903 1922621 1865503 1812457 1766023 1727793 1698795 1679231 1668683 1666633 1672311 1684565 1702828 1727772
58891 1727772 1760018 1798604 1841820 1889172 1941234 1997715 2057017 2117591 2178230 2236664 2288930
$$ packed form
58973B353936O9976M8224K4250n51k4885m7146o5909q0474r0645r6448r8375r7277
58961A894676r3720q8016q0911p3485o6157n8646n1107m4346l8592l3096k7511
58950A239089k2636j9264j7043j5120j3274j1738j0537r552q770q034o977n455
58938A090689l676j708N45K849M803O511Q373J0197J1466J2509J4369J7271K0326
58925A194524K3050K6211L0733L6573M3115M9905N6694O3424P0228P6671Q1111
58914A752239Q1769P8246P0853N8783M0825J8235m916k4871m0362n1255n6925
58903A922621n7118n3046m6434l8230k8998j9564j0548k050N678J2254J8263K4944
58891A727772L2246L8586M3216M7352N2062N6481N9302O0574O0639N8434N2266
$$ plain form
58880 2288930 2330450 2356998 2364989 2352497 2320770 2273876 2216432 2152184 2084552 2017022 1952201
58869 1952201 1891193 1834343 1781991 1734241 1690737 1651094 1615010 1581790 1550350 1519973 1490543
58858 1490543 1461926 1433701 1405493 1377004 1347699 1317184 1285924 1254905 1224580 1194730 1165287
58847 1165287 1136507 1108400 1080850 1054335 1029667 1006956 985600 965312 946249 928084 910043
58836 910043 892229 876056 862864 852685 844685 838265 833421 830516 829956 831827 835811 841726 849897
58823 849897 860618 873679 889053 907484 929493 954184 980039 1006472 1033390 1059587 1083008
58812 1083008 1102502 1117796 1127692 1129990 1123788 1110544 1092300 1070135 1045003 1018814 993645 970578
58800 970578 950024 932427 917944 906096 896563 889926 887078 888226 892835 900131 909406 920273 932895
$$ packed form
58880B288930M1520K6548P991j2492l1727m6894n7444o4248o7632o7530o4821
58869A952201o1008n6850n2352m7750m3504l9643l6084l3220l1440l0377k9430
58858A490543k8617k8225k8208k8489k9305l0515l1260l1019l0325k9850k9443
58847A165287k8780k8107k7550k6515k4668k2711k1356k0288j9063j8165j8041
58836I10043j7814j6173j3192j0179q000o420m844k905n60J871L984N915Q171
58823H49897J0721J3061J5374J8431K2009K4691K5855K6433K6918K6197K3421
58812A083008J9494J5294R896K298o202j3244j8244k2165k5132k6189k5169k3067
58800I70578k0554j7597j4483j1848r533o637k848J148M609P296R275J0867J2622
$$ plain form
58787 932895 947551 963891 981232 999644 1020057 1043072 1068273 1094865 1122247 1149680 1175914
58776 1175914 1199364 1218234 1230660 1235454 1232808 1223649 1208486 1187743 1163046 1136924 1110995 1085403
58764 1085403 1060203 1036239 1014355 994732 977401 962505 949684 938139 927683 918920 911944 905681
58752 905681 898965 891641 884353 877889 872876 869313 866238 862787 859698 858792 860682 864046 867436 870774
58738 870774 874673 879447 885380 892878 901631 910360 918125 925343 933145 942461 954165 969323 988792
58725 988792 1013175 1043480 1081151 1127074 1181219 1243357 1313110 1388881 1467448 1544843 1616690
58714 1616690 1677465 1720746 1741294 1736810 1707922 1657636 1591036 1514240 1432634 1350381 1271295
58703 1271295 1198734 1134182 1077222 1027541 985849 952316 925548 904143 888334 879242 877446 883147
$$ packed form
58787I32895J4656J6340J7341J8412K0413K3015K5201K6592K7382K7433K6234
58776A175914K3450J8870J2426M794k646r159j5163k0743k4697k6122k5929k5592
58764A085403k5200k3964k1884j9623j7331j4896j2821j1545j0456q763o976o263
58752I05681o716p324p288o464n013l563l075l451l089r06J890L364L390L338
58738H70774L899M774N933P498Q753Q729P765P218P802R316J1704J5158J9469
58725I88792K4383L0305L7671M5923N4145O2138O9753P5771P8567P7395P1847
58714A616690O0775M3281K0548m484k8888n0286o6600p6796q1606q2253p9086
58703A271295p2561o4552n6960m9681m1692l3533k6768k1405j5809r092j796N701
$$ plain form
58691 883147 896777 918373 946857 980654 1018394 1058218 1097047 1131170 1157102 1171518 1171454 1155706
58679 1155706 1125728 1084651 1035878 982890 929408 878819 833690 796034 767235 747197 734350
58668 734350 727052 724410 725405 728089 730246 730289 727149 720004 708545 693024 673966 652557 631078 611693
58654 611693 594625 578756 564019 551676 542012 533579 525417 518351 513224 509451 506296 504098 503107
58641 503107 502535 501958 502388 504686 508053 511297 514471 518055 521670 524927 528497 532916 537269 540445 542868
58626 542868 545544 548132 549393 548970 547377 544749 540922 536337 531653 526827 521602 516517 512421 509358
58612 509358 506817 504709 503252 502306 501536 500820 499989 498692 496993 495328 493521 490872 487714 485663 485641 486899
58596 486899 488736 491785 496621 502567 509069 516916 526751 537665 548647 560201 573039 586349 598870
$$ packed form
58691H83147J3630K1596K8484L3797L7740L9824L8829L4123K5932J4416o4j5748
58679A155706k9978m1077m8773n2988n3482n0589m5129l7656k8799k0038j2847
58668G34350p298k642R95K684K157M3l140p145j1459j5521j9058k1409k1479j9385
58654F11693j7068j5869j4737j2343r664q433q162p066n127l773l155k198r91
58641E03107n72n77M30K298L367L244L174L584L615L257L570M419M353L176K423
58626E42868K676K588J261m23j593k628l827m585m684m826n225n085m096l063
58612E09358k541k108j457r46p70p16q31j297j699j665j807k649l158k051k2J258
58596D86899J837L049M836N946O502P847R835J0914J0982J1554J2838J3310J2521
$$ plain form
58583 598870 610583 621778 631605 639297 645810 652375 658300 662109 664177 666318 669306 672648 676365 681192
58569 681192 687273 694262 702430 712106 722365 731758 740053 747831 754813 760105 763805 766847 769509 771358
58555 771358 772351 772645 771667 768631 763587 756721 747225 734280 718634 701884 684694 667078 649713
58542 649713 633427 618011 603116 589706 578986 570465 562779 555835 550364 545945 541453 537047 533671
58529 533671 530850 527091 522388 518259 515142 511793 507614 503792 501584 500960 501382 502630 504469 506642 509488
58514 509488 513668 519235 525765 533135 541194 549123 556281 563136 570134 576269 580313 582962 586201 590971
58500 590971 597073 604892 615359 628357 642922 658989 677394 698247 720739 744300 768431 791636
58488 791636 812086 829135 842832 852456 857131 857330 854023 846862 835110 819847 803134 785386 765817
$$ packed form
58583E98870J1713J1195R827P692O513O565N925L809K068K141K988L342L717M827
58569F81192O081O989Q168R676J0259R393Q295P778O982N292L700L042K662J849
58555G71358R93K94r78l036n044o866r496j2945j5646j6750j7190j7616j7365
58542F49713j6286j5416j4895j3410j0720q521p686o944n471m419m492m406l376
58529E33671k821l759m703m129l117l349m179l822k208o24M22J248J839K173K846
58514E09488M180N567O530P370Q059P929P158O855O998O135M044K649L239M770
58500E90971O102P819J0467J2998J4565J6067J8405K0853K2492K3561K4131K3205
58488G91636K0450J7049J3697R624M675J99l307p161j1752j5263j6713j7748j9569
$$ plain form
58475 765817 745182 725707 708252 691866 676332 662889 652088 643055 635359 629750 626687 625931 627816
58462 627816 632998 640657 648845 656865 665401 674007 680529 683441 682896 679038 671288 659986 647001 634009
58448 634009 621533 609972 599967 591386 583520 576571 571405 567715 564147 560462 557871 557034 557445 558899
58434 558899 561639 564854 566971 567853 568903 570759 572740 574732 577585 581251 584448 586602 588283 589480
58420 589480 589478 588750 588866 590044 590767 590322 589770 589998 590834 592448 595456 599191 602029 604069 607330 612706 618865
58403 618865 624836 631455 639369 647723 655748 663750 671642 678383 683683 688503 693167 696781 699186 701639
58389 701639 704890 708437 712226 717130 723197 729403 735678 743113 751609 759459 765874 771818 777809 783075
58375 783075 787412 791517 794913 796060 795333 795312 797184 799302 800277 800957 802202 803203 803414 803882 805325 806965
$$ packed form
58475G65817k0635j9475j7455j6386j5534j3443j0801r033p696n609l063p56J885
58462F27816N182P659Q188Q020Q536Q606O522K912n45l858p750j1302j2985j2992
58448F34009j2476j1561j0005q581p866o949n166l690l568l685k591q37M11J454
58434E58899K740L215K117Q82J050J856J981J992K853L666L197K154J681J197
58420E89480kp28J16J178P23m45n52K28Q36J614L008L735K838K040L261N376O159
58403F18865N971O619P914Q354Q025Q002P892O741N300M820M664L614K405K453
58389G01639L251L547L789M904O067O206O275P435Q496P850O415N944N991N266
58375G83075M337M105L396J147p27k1J872K118R75O80J245J001K11M68J443J640
$$ plain form
58359 806965 808488 811102 815415 820235 824620 829176 834399 839766 845413 852520 861021 869057 875682 882084
58345 882084 889338 897184 905708 915771 926931 937464 947246 958007 969893 980559 988680 995504 1001915
58332 1001915 1007082 1011305 1017019 1025264 1033995 1041635 1049597 1059587 1071106 1083360 1097104 1112844 1129638
58319 1129638 1147256 1167068 1189402 1212597 1236013 1261215 1288770 1316769 1344009 1371772 1400895
58308 1400895 1430045 1458408 1486979 1515482 1541072 1561832 1578609 1591970 1600673 1604825 1607163 1609408
58296 1609408 1610728 1611500 1614866 1622578 1632941 1644886 1660261 1679973 1701833 1724602 1750172 1779121
58284 1779121 1808057 1834204 1858877 1883757 1907642 1929787 1952620 1978121 2005140 2032931 2063379
58273 2063379 2096970 2130863 2164024 2199987 2241362 2285935 2331385 2379281 2430839 2483377 2534787
$$ packed form
58359H06965J523K614M313M820M385M556N223N367N647P107Q501Q036O625O402
58345H82084P254P846Q524J0063J1160J0533R782J0761J1886J0666Q121O824O411
58332A001915N167M223N714Q245Q731P640P962R990J1519J2254J3744J5740J6794
58319A129638J7618J9812K2334K3195K3416K5202K7555K7999K7240K7763K9123
58308A400895K9150K8363K8571K8503K5590K0760J6777J3361Q703M152K338K245
58296A609408J320P72L366P712J0363J1945J5375J9712K1860K2769K5570K8949
58284A779121K8936K6147K4673K4880K3885K2145K2833K5501K7019K7791L0448
58273B063379L3591L3893L3161L5963M1375M4573M5450M7896N1558N2538N1410
$$ plain form
58262 2534787 2587060 2641582 2695547 2746938 2798388 2852067 2905599 2957339 3010746 3068982 3130049
58251 3130049 3191891 3257369 3329336 3405753 3484644 3568939 3661418 3759929 3862682 3972911 4093064
58240 4093064 4219873 4350638 4488831 4637995 4796103 4961589 5138632 5330356 5533461
58231 5533461 5745945 5973284 6220312 6484394 6763818 7065211 7394837 7750549 8130626
58222 8130626 8542283 8992618 9479772 10002547 10569702 11189569 11859891 12579011 13358054
58213 13358054 14211590 15147494 16178584 17333287 18642174 20126764 21816338 23763374
58205 23763374 26029098 28671562 31767298 35429649 39790699 44992301 51224435 58750982
58197 58750982 67865589 78838104 91918160 107329608 125194101 145508957 168307217
$$ packed form
58262B534787N2273N4522N3965N1391N1450N3679N3532N1740N3407N8236O1067
58251C130049O1842O5478P1967P6417P8891Q4295R2479R8511J02753J10229J20153
58240D093064J26809J30765J38193J49164J58108J65486J77043J91724K03105
58231E533461K12484K27339K47028K64082K79424L01393L29626L55712L80077
58222H130626M11657M50335M87154N22775N67155O19867O70322P19120P79043
58213A3358054Q53536R35904J031090J154703J308887J484590J689574J947036
58205B3763374K265724K642464L095736L662351M361050N201602O232134P526547
58197E8750982R114607J0972515J3080056J5411448J7864493K0314856K2798260
$$ plain form
58190 168307217 193823325 222341409 253727464 286991600 320092267 349912877 372492583
58183 372492583 383871987 381540341 365638592 338939934 305600441 269661807 234202147
58176 234202147 201205781 171737837 146163267 124387598 106082575 90819644 78129627
58169 78129627 67562051 58739396 51358021 45157500 39916197 35465279 31677093 28438527
58161 28438527 25649539 23236993 21147435 19328029 17728651 16315910 15068188 13960131
58153 13960131 12965234 12068591 11262908 10535172 9869330 9258342 8701519 8192911 7723094
58144 7723094 7289298 6893153 6530923 6195416 5884905 5600967 5340052 5095784 4867196
58135 4867196 4656548 4461421 4276747 4102244 3940370 3789264 3644864 3507658 3380400
$$ packed form
58190A68307217K5516108K8518084L1386055L3264136L3100667K9820610K2579706
58183C72492583J1379404k331646j5901749k6698658l3339493l5938634l5459660
58176B34202147l2996366k9467944k5574570k1775669j8305023j5262931j2690017
58169G8129627j0567576q822655p381375o200521n241303m450918l788186l238566
58161B8438527k788988k412546k089558j819406j599378j412741j247722j108057
58153A3960131r94897q96643q05683p27736o65842o10988n56823n08608m69817
58144G723094m33796l96145l62230l35507l10511k83938k60915k44268k28588
58135D867196k10648j95127j84674j74503j61874j51106j44400j37206j27258
$$ plain form
58126 3380400 3261527 3147456 3038890 2938178 2842927 2748871 2656747 2569839 2487035 2404895
58116 2404895 2324473 2249497 2179608 2111741 2046530 1986979 1932145 1878324 1825418 1776378 1731292
58105 1731292 1687554 1645018 1605760 1569622 1534930 1502592 1474656 1449840 1425111 1400540 1378043
58094 1378043 1356719 1334218 1311405 1290843 1271807 1251660 1231059 1212903 1197025 1180753 1163984
58083 1163984 1148948 1135644 1122272 1109655 1100431 1094054 1087165 1078908 1071491 1065436 1058419 1049105 1038362
58070 1038362 1026517 1012986 998688 985376 972541 958193 942450 927146 912298 896367 879595
58059 879595 863608 847902 830202 810202 789783 769702 749194 728572 709089 690570 672288
58048 672288 655646 642695 632424 621951 610960 601466 593557 585150 575972 568097 562139 556366 550045
$$ packed form
58126C380400j18873j14071j08566j00712r5251r4056r2124q6908q2804q2140
58116B404895q0422p4976o9889o7867o5211n9551n4834n3821n2906m9040m5086
58105A731292m3738m2536l9258l6138l4692l2338k7936k4816k4729k4571k2497
58094A378043k1324k2501k2813k0562j9036k0147k0601j8156j5878j6272j6769
58083A163984j5036j3304j3372j2617r224o377o889q257p417o055p017r314j0743
58070A038362j1845j3531j4298j3312j2835j4348j5743j5304j4848j5931j6772
58059H79595j5987j5706j7700k0000k0419k0081k0508k0622j9483j8519j8282
58048F72288j6642j2951j0271j0473j0991r494p909q407r178p875n958n773o321
$$ plain form
58035 550045 544446 540072 535908 531784 528551 525613 521187 515273 509534 504113 497599 490353 484713 481420
58021 481420 478787 475926 473909 473168 472614 471988 472374 473793 474897 475614 477447 480591 483489 485924 489869
58006 489869 496402 504249 512237 520853 530573 541000 552497 566438 582931 600262 617346 634754
57994 634754 652798 670783 688913 708864 731657 756800 784200 815072 850421 890468 936091
57983 936091 989052 1050338 1120026 1198969 1288576 1388563 1496871 1611952 1732778 1856164 1976264
57972 1976264 2087154 2183719 2259779 2308253 2324437 2307361 2257728 2177392 2071912 1950802 1823190
57961 1823190 1694500 1567975 1447033 1334615 1231997 1139710 1058257 986972 923902 868006
57951 868006 819972 779944 746107 716622 691382 670771 654215 641032 631246 624429 619100 614283
$$ packed form
58035E50045n599m374m164m124l233k938m426n914n739n421o514p246n640l293
58021D81420k633k861k017p41n54o26L86J419J104P17J833L144K898K435L945
58006D89869O533P847P988Q616R720J0427J1497J3941J6493J7331J7084J7408
57994F34754J8044J7985J8130J9951K2793K5143K7400L0872L5349M0047M5623
57983I36091N2961O1286O9688P8943Q9607R9987J08308J15081J20826J23386J20100
57972A976264J10890R6565P6060M8474J6184j7076m9633q0336j05480j21110j27612
57961A823190j28690j26525j20942j12418j02618r2287q1453p1285o3070n5896
57951H68006m8034m0028l3837k9485k5240k0611j6556j3183r786o817n329m817
$$ plain form
57939 614283 610389 607735 605602 603598 602394 602170 601903 601161 600978 601846 602490 602068 602175 605190 611764 621294
57923 621294 633863 650352 671419 697608 729850 768861 814508 866276 923458 984288 1045880
57912 1045880 1105606 1161441 1210397 1247999 1270356 1275959 1264994 1238366 1198253 1148300 1092117
57901 1092117 1032364 971803 913689 860035 810635 764877 723475 687382 656128 628442 603675
57890 603675 581535 561252 542099 524112 507478 491876 477106 463562 451434 440328 430229
57879 430229 421757 414752 407833 400226 392947 387223 382889 379304 376715 375526 375191 375070 375590 377404 380123
57864 380123 382978 386078 389931 394313 398576 402505 406019 408664 410248 411231 411735 410995 408682 405859 403609
57849 403609 401547 398845 395941 394017 393323 393206 393316 393703 394098 394186 394240 394549 394564 393554 391768 390088 388853
$$ packed form
57939F14283l894k654k133k004j204k24k67p42j83Q68O44m22J07L015O574R530
57923F21294J2569J6489K1067K6189L2242L9011M5647N1768N7182O0830O1592
57912A045880N9726N5835M8956L7602K2357N603j0965k6628m0113m9953n6183
57901A092117n9753o0561n8114n3654m9400m5758m1402l6093l1254k7686k4767
57890F03675k2140k0283j9153j7987j6634j5602j4770j3544j2128j1106j0099
57879D30229q472p005o919p607p279n724m334l585k589j189l35j21N20J814K719
57864C80123K855L100L853M382M263L929L514K645J584R83N04p40k313k823k250
57849D03609k062k702k904j924o94j17J10L87L95Q8N4L09J5j010j786j680j235
$$ plain form
57832 388853 387830 387012 386676 386935 387920 390022 393258 396740 399325 400452 399834 397021 392002 385722 379284
57817 379284 373084 367317 362756 360295 360209 362493 367362 374742 383950 394694 407915 424966 446439 472397
57803 472397 503099 538712 578921 623623 673485 728977 789229 852382 916360 978436 1034626
57792 1034626 1080466 1112234 1127132 1123373 1101334 1064243 1016784 963092 906363 849412 794437
57781 794437 742580 694561 651289 613159 579333 548689 521046 496682 475186 455755 438189
57770 438189 422685 408999 396684 385806 376614 368816 361918 355877 350679 345812 340891 336341 332633
57757 332633 329382 326037 322918 320644 319004 317385 315880 315005 314732 314723 315136 316231 317615 318790 320036 321752
57741 321752 323341 323860 323485 323291 323841 324996 326830 329702 333590 338279 344064 351428 360331 370588 382442
$$ packed form
57832C88853j023q18l36K59R85K102L236L482K585J127o18k813n019o280o438
57817C79284o200n767m561k461q6K284M869P380R208J0744J3221J7051K1473K5958
57803D72397L0702L5613M0209M4702M9862N5492O0252O3153O3978O2076N6190
57792A034626M5840L1768J4898l759k2039l7091m7459n3692n6729n6951n4975
57781G94437n1857m8019m3272l8130l3826l0644k7643k4364k1496j9431j7566
57770D38189j5504j3686j2315j0878r192p798o898o041n198m867m921m550l708
57757C32633l251l345l119k274j640j619j505q75k73rM13J095J384J175J246J716
57741C21752J589N19l75j94N50J155J834K872L888M689N785P364Q903J0257J1854
$$ plain form
57726 382442 395734 408912 419986 428196 433723 436259 435133 430581 423651 414943 404653 393623 383055
57713 383055 373216 363645 354525 346542 339426 332083 324400 317666 312860 309617 307150 305047 302848 299908
57699 299908 296145 292075 287822 282923 277306 271549 266019 260686 255962 252614 250555 248742 246688 245161
57685 245161 244937 245746 246971 248631 251289 255620 262392 272164 284770 299935 318660 343154 375057
57672 375057 414560 461575 516642 579832 649271 721083 789740 847711 886004 897327 880011
57661 880011 839098 783586 722292 661328 604177 553098 509776 474597 446172 422480 402425
57650 402425 385740 371758 359313 347741 337098 327263 317823 308950 301352 295047 289082 282864 276888
57637 276888 271713 267065 262519 258261 254545 251018 247255 243498 240297 237756 235544 233252 230440 226805
$$ packed form
57726C82442J3292J3178J1074Q210N527K536j126m552o930q708j0290j1030j0568
57713C83055r839r571r120p983p116p343p683o734m806l243k467k103k199k940
57699B99908l763m070m253m899n617n757n530n333m724l348k059j813k054j527
57685B45161k24Q09J225J660K658M331O772R772J2606J5165J8725K4494L1903
57672C75057L9503M7015N5067O3190O9439P1812O8657N7971L8293J1323j7316
57661H80011m0913n5512o1294o0964n7151n1079m3322l5179k8425k3692k0055
57650D02425j6685j3982j2445j1572j0643r835r440q873p598o305n965o218n976
57637B76888n175m648m546m258l716l527l763l757l201k541k212k292k812l635
$$ plain form
57623 226805 222674 218883 215872 213378 211274 210002 209746 209785 209299 208412 207925 208327 209516 211172 212973 214666
57607 214666 216277 218073 220191 222623 225635 229605 234305 238902 242925 246646 250293 253635 256706 260097
57593 260097 263997 267563 269908 271092 271499 270867 268745 265434 261575 257109 251553 245178 239048 233791 229009
57578 229009 223992 218538 212997 207967 203996 201218 199212 197453 195777 194177 192372 189994 187003 183502
57564 183502 179388 174744 170397 167366 165674 164312 162582 160977 160471 161330 162974 164770 166686 169227 172893
57549 172893 177672 183005 188408 194095 200688 208090 214949 219645 221764 222185 221701 220059 216709 211983 206881
57534 206881 201871 196700 191560 187569 185507 184642 183528 181677 179799 178605 178088 177928 177896 177720 177193 176656
57518 176656 176945 178664 181780 185917 190562 194997 198551 201163 203328 205403 207400 209496 212136 215352
$$ packed form
57623B26805m131l791l011k494k104j272k56L9m86q87m87M02J189J656J801J693
57607B14666J611J796K118K432L012L970M700M597M023L721L647L342L071L391
57593B60097L900L566K345J184M07o32k122l311l859m466n556o375o130n257m782
57578B29009n017n454n541n030l971k778k006j759j676j600j805k378k991l501
57564A83502m114m644m347l031j692j362j730j605n06Q59J644J796J916K541L666
57549A72893M779N333N403N687O593P402O859M696K119M21m84j642l350m726n102
57534B06881n010n171n140l991k062q65j114j851j878j194n17j60l2j76n27n37
57518A76656K89J719L116M137M645M435L554K612K165K075J997K096K640L216
$$ plain form
57504 215352 218491 220991 223092 225457 228266 230921 232458 232134 229927 226642 223326 220420 217598 214354
57490 214354 210486 206093 201504 197234 193637 190603 187915 185746 184331 183289 181933 180232 178843 178094
57476 178094 177623 177075 176486 175837 174942 173964 173300 172773 171716 170095 168682 167754 166570 164748 163227 163032 163751
57459 163751 164173 163967 163853 164407 165562 167165 169259 171789 174534 177309 179872 181836 183165 184578 187022
57444 187022 190784 195462 200536 205566 210028 213480 215899 217586 218813 219715 220306 220421 219902 218899 217556
57429 217556 215320 211314 205757 200328 196438 193718 190882 187590 184614 182497 181024 179919 179243 178965 178774
57414 178774 178501 178294 178313 178594 179092 179467 178992 177223 174664 172344 170756 169640 168654 167677 166517 165000 163533
57397 163533 163073 164187 166379 168557 170022 170874 171542 172099 172160 171550 170868 171034 172314 174203 176254 178475
$$ packed form
57504B15352L139K500K101K365K809K655J537l24k207l285l316k906k822l244
57490B14354l868m393m589m270l597l034k688k169j415j042j356j701j389p49
57476A78094m71n48n89o49q95r78o64n27j057j621j413r28j184j822j521j95P19
57459A63751M22k06j14N54J155J603K094K530K745K775K563J964J329J413K444
57444A87022L762M678N074N030M462L452K419J687J227R02N91J15n19j003j343
57429B17556k236m006n557n429l890k720k836l292k976k117j473j105o76k78j91
57414A78774k73k07J9K81M98L75m75j769k559k320j588j116r86r77j160j517j467
57397A63533m60J114K192K178J465Q52O68N57O1o10o82J66J280J889K051K221
$$ plain form
57381 178475 180797 182799 184327 185794 187451 188901 189727 190045 190015 189482 188701 188676 190006 191939 193458 194764
57365 194764 196705 199198 201368 203018 204797 206949 208952 210457 211589 212303 212407 212350 212957 214153 214979 215113
57349 215113 215355 216229 217127 217450 217603 218052 218125 216748 214004 211119 209021 207591 206272 204810 203325 202040
57333 202040 201094 200417 199782 199097 198594 198600 199129 199766 199977 199598 199105 199268 200416 202205 204243 206613 209444 212308
57315 212308 214576 216218 217660 218976 219800 220038 220004 219801 219238 218500 218266 218865 219835 220636 221355 222433 224016
57298 224016 225899 227872 229909 232149 234720 237349 239275 239987 239992 240328 241394 242861 244708 247474 251166
57283 251166 254664 256768 257454 257689 258394 259892 262020 264364 266579 268690 270856 272847 274210 275059 276137
57268 276137 277836 279711 281224 282438 283677 285047 286660 288708 290850 292153 292251 292079 292802 294426 296219
$$ packed form
57381A78475K322K002J528J467J657J450Q26L18l0n33p81k5J330J933J519J306
57365A94764J941K493K170J650J779K152K003J505J132P14J04n7O07J196Q26J34
57349B15113K42Q74Q98L23J53M49P3j377k744k885k098j430j319j462j485j285
57333B02040r46o77o35o85n03ON29O37K11l79m93J63J148J789K038K370K831K864
57315B12308K268J642J442J316Q24K38l4k03n63p38k34N99R70Q01P19J078J583
57298B24016J883J973K037K240K571K629J926P12NL36J066J467J847K766L692
57283B51166L498K104O86K35P05J498K128K344K215K111K166J991J363Q49J078
57268B76137J699J875J513J214J239J370J613K048K142J303R8j72P23J624J793
$$ plain form
57253 296219 298066 300524 303662 306806 309547 312252 315328 318604 321766 324946 328488 332387 336308 340005
57239 340005 343476 346752 349752 352416 354915 357659 360997 364862 368754 372102 374617 376382 377756 379202
57225 379202 380993 383074 385367 388195 392048 396844 401794 406268 410535 415327 420840 426481 431552 435930
57211 435930 440041 444318 448723 452796 456160 458936 461533 464150 466735 469444 472838 477416 483150 489581
57197 489581 496204 502673 508781 514381 519326 523570 527528 532181 538464 546488 555567 565000 574525 584116
57183 584116 593852 604108 615448 628055 641480 655105 668593 681878 695051 708348 721892 735406
57171 735406 748585 761801 775917 791178 806745 821582 835411 848610 861700 875279 890055
57160 890055 906454 924352 943478 963888 985890 1009835 1036120 1065008 1096242 1129230 1163893
$$ packed form
57253B96219J847K458L138L144K741K705L076L276L162L180L542L899L921L697
57239C40005L471L276L000K664K499K744L338L865L892L348K515J765J374J446
57225C79202J791K081K293K828L853M796M950M474M267M792N513N641N071M378
57211D35930M111M277M405M073L364K776K597K617K585K709L394M578N734O431
57197D89581O623O469O108N600M945M244L958M653O283Q024R079R433R525R591
57183E84116R736J0256J1340J2607J3425J3625J3488J3285J3173J3297J3544J3514
57171G35406J3179J3216J4116J5261J5567J4837J3829J3199J3090J3579J4776
57160H90055J6399J7898J9126K0410K2002K3945K6285K8888L1234L2988L4663
$$ plain form
57149 1163893 1200847 1240447 1282094 1324884 1368516 1413178 1459024 1506345 1555896 1608317 1663341
57138 1663341 1720105 1778142 1837526 1898103 1959226 2020422 2081937 2144325 2207754 2271962 2336921
57127 2336921 2403303 2472161 2544140 2619355 2698256 2782280 2873124 2971521 3077351 3191023 3313949
57116 3313949 3447294 3590814 3743416 3904690 4075701 4258674 4456355 4671556 4907188
57107 4907188 5166811 5455151 5777859 6141192 6552768 7022976 7565528 8197225 8938468
57098 8938468 9814584 10856313 12099123 13582459 15348651 17439726 19892480 22734500
57090 22734500 25982183 29639506 33697466 38135011 42919579 48004455 53324589 58793001
57082 58793001 64291840 69650798 74624922 78903149 82164549 84157504 84755032 83962131
$$ packed form
57149A163893L6954L9600M1647M2790M3632M4662M5846M7321M9551N2421N5024
57138A663341N6764N8037N9384O0577O1123O1196O1515O2388O3429O4208O4959
57127B336921O6382O8858P1979P5215P8901Q4024R0844R8397J05830J13672J22926
57116C313949J33345J43520J52602J61274J71011J82973J97681K15201K35632
57107D907188K59623K88340L22708L63333M11576M70208N42552O31697P41243
57098H938468Q76116J041729J242810J483336J766192K091075K452754K842020
57090B2734500L247683L657323M057960M437545M784568N084876N320134N468412
57082E8793001N498839N358958M974124M278227L261400J992955N97528p92901
$$ plain form
57074 83962131 81888423 78711327 74642788 69902854 64703281 59241559 53698670 48234158
57066 48234158 42979928 38037275 33477104 29340934 25643424 22378087 19524125 17051149
57058 17051149 14922130 13096875 11535721 10201538 9060332 8082077 7241565 6517981
57050 6517981 5893699 5353674 4885328 4478062 4122767 3812060 3540560 3304308 3100004
57041 3100004 2924953 2777137 2654583 2554457 2472489 2402318 2335029 2260636 2171891 2067573
57031 2067573 1952224 1832951 1716215 1606247 1504847 1412164 1327966 1252207 1184390 1123006
57021 1123006 1066336 1013749 965737 922745 884314 849304 816705 786287 758545 733797 711294
57010 711294 689548 667679 646001 625150 605203 585919 567302 549438 532189 515450 499361
$$ packed form
57074H3962131k073708l177096m068539m739934n199573n461722n542889n464512
57066D8234158n254230m942653m560171m136170l697510l265337k853962k472976
57058A7051149k129019j825255j561154j334183j141206r78255q40512p23584
57050F517981o24282n40025m68346m07266l55295l10707k71500k36252k04304
57041C100004j75051j47816j22554j00126q1968p0171o7289p4393q8745j04318
57031B067573j15349j19273j16736j09968j01400r2683q4198p5759o7817o1384
57021A123006n6670n2587m8012m2992l8431l5010l2599l0418k7742k4748k2503
57010G11294k1746k1869k1678k0851j9947j9284j8617j7864j7249j6739j6089
$$ plain form
56999 499361 483944 468985 454665 441782 430771 420869 410824 400215 389685 380274 372989 368600
56987 368600 367171 367993 370488 374943 381768 390146 397898 402525 402149 395959 384555 369831 353891 337994
56973 337994 322756 308959 297502 288720 282371 278256 276348 276474 278556 283117 290880 301734 314724
56960 314724 329286 345934 365325 386937 408851 428461 443140 450637 449635 440364 424757 405806
56948 405806 386395 368300 352025 337472 324735 314383 307190 303658 303633 306416 311500 319262 330656
56935 330656 346193 365549 388279 414297 443122 472786 499789 520158 530651 529619 517461 496382
56923 496382 469445 439638 409549 381249 356024 334288 315955 300741 288042 277010 267165 258643
56911 258643 251531 245203 238744 231831 224816 218067 211585 205257 199189 193757 189428 186458 184729 184025
$$ packed form
56999D99361j5417j4959j4320j2883j1011r902j0045j0609j0530r411p285m389
56987C68600j429Q22K495M455O825Q378P752M627l76o190j1404j4724j5940j5897
56973C37994j5238j3797j1457q782o349m115j908J26K082M561P763J0854J2990
56960C14724J4562J6648J9391K1612K1914J9610J4679P497j002r271j5607j8951
56948D05806j9411j8095j6275j4553j2737j0352p193l532k5K783N084P762J1394
56935C30656J5537J9356K2730K6018K8825K9664K7003K0369J0493j032j2158k1079
56923D96382k6937k9807l0089k8300k5225k1736j8333j5214j2699j1032r845q522
56911B58643p112o328o459o913p015o749o482o328o068n432m329k970j729p04
$$ plain form
56897 184025 184461 186291 189347 193157 197822 204248 213254 224883 238860 255213 273991 294682 316248
56884 316248 337297 355855 369524 376530 376558 370365 359032 344034 327414 311109 296263 283598
56872 283598 274023 268189 265761 265924 268579 274492 284482 299080 318854 344300 375214 410469 448329
56859 448329 486492 521939 551262 571360 579810 575166 557798 530542 497975 464605 433592 406680
56847 406680 384721 368134 357206 352112 352785 359107 371404 390449 416875 451015 493275 543812
56835 543812 601380 663098 725638 785556 837784 875092 890904 882927 853607 807926 751805 691683
56823 691683 633235 579639 531845 490560 456985 431653 413930 403122 399169 401927 410808 425672
56811 425672 447285 476340 512467 554313 599691 645134 685861 716704 733076 731715 711979 677141
$$ packed form
56897A84025M36J830L056L810M665O426R006J1629J3977J6353J8778K0691K1566
56884C16248K1049J8558J3669P006K8o193j1333j4998j6620j6305j4846j2665
56872B83598r575n834k428J63K655N913R990J4598J9774K5446L0914L5255L7860
56859D48329L8163L5447K9323K0098Q450m644j7368k7256l2567l3370l1013k6912
56847D06680k1959j6587j0928n094O73O322J2297J9045K6426L4140M2260N0537
56835E43812N7568O1718O2540N9918N2228L7308J5812p977k9320m5681n6121o0122
56823F91683n8448n3596m7794m1285l3575k5332j7723j0808l953K758Q881J4864
56811D25672K1613K9055L6127M1846M5378M5443M0727L0843J6372j361j9736l4838
$$ plain form
56799 677141 633526 587488 543085 502295 466184 435155 408869 386943 369624 357417 350348 348025
56787 348025 350181 356861 368271 384482 404998 428492 453324 478112 501186 519575 529571 528853
56775 528853 517695 498092 472535 443839 414980 388075 363755 341949 322804 306438 292407
56764 292407 280114 269408 260300 252431 245406 239331 234508 230759 227451 223984 219947 215124 209799 204764
56750 204764 200594 197012 193260 188878 183791 177936 171315 164317 157600 151614 146449 142156 138958 137086
56736 137086 136373 136032 135050 133023 130485 128177 126242 124520 123301 123067 123587 124032 124129 124447 125425 126804 128261
56719 128261 129850 131515 132906 134067 135629 137824 139950 141347 142346 143610 145047 146004 146220 145972 145552
56704 145552 145163 145167 145880 147202 148764 150332 151848 153308 154894 156923 159420 162016 164548 167436 171244
$$ packed form
56799F77141m3615m6038m4403m0790l6111l1029k6286k1926j7319j2207p069k323
56787C48025K156O680J1410J6211K0516K3494K4832K4788K3074J8389R996p18
56775E28853j1158j9603k5557k8696k8859k6905k4320k1806j9145j6366j4031
56764B92407j2293j0706r108p869p025o075m823l749l308l467m037m823n325n035
56750B04764m170l582l752m382n087n855o621o998o717n986n165m293l198j872
56736A37086p13l41r82k027k538k308j935j722j219k34N20M45R7L18R78J379J457
56719A28261J589J665J391J161J562K195K126J397R99J264J437R57K16k48m20
56704A45552l89MP13J322J562J568J516J460J586K029K497K596K532K888L808
$$ plain form
56689 171244 176216 182514 190479 200247 211428 223509 236340 249961 264394 279821 296521 314215
56677 314215 331835 348305 363195 376332 387298 395801 402113 406621 409296 410167 410019 410026 410866 412640
56663 412640 415440 419462 424586 430236 435619 439969 442868 444659 446265 448249 450201 451314 451267 450281 448640
56648 448640 446539 444128 441282 437491 432277 425605 417695 408699 398748 388132 377295 366931 357986
56635 357986 350973 345188 339345 333200 327784 323635 319721 314782 309000 303479 298653 294212 290260 287532
56621 287532 286526 287198 289532 293667 299292 305447 311106 315706 319159 321631 323266 323878 323061 320730 317310
56606 317310 313214 308567 303714 299526 296705 295035 293624 291554 288128 283092 277063 271294 266499 262356
56592 262356 258513 255458 253866 253776 255106 258312 263656 270279 276958 283428 290070 296637 302278 306709 310442
$$ packed form
56689A71244M972O298P965R768J1181J2081J2831J3621J4433J5427J6700J7694
56677C14215J7620J6470J4890J3137J0966Q503O312M508K675Q71j48PQ40J774
56663D12640K800M022N124N650N383M350K899J791J606J984J952J113m7r86j641
56648D48640k101k411k846l791n214o672p910q996r951j0616j0837j0364q945
56635C57986p013n785n843o145n416m149l914m939n782n521m826m441l952k728
56621B87532j006O72K334M135N625O155N659M600L453K472J635O12q17k331l420
56606C17310m096m647m853m188k821j670j411k070l426n036o029n769m795m143
56592B62356l843l055j592r0J330L206N344O623O679O470O642O567N641M431L733
$$ plain form
56577 310442 313871 316935 319680 322340 324846 326946 328880 331314 334628 338811 343984 350314 357359 364189
56563 364189 370248 375672 380780 385706 390376 394288 396464 396280 394275 391519 388335 384353 379767 375642
56549 375642 372747 370737 368788 366550 364240 362133 360090 357351 352848 346104 337779 328961 319975 310259
56535 310259 299282 287147 274453 262048 250793 241020 232184 223492 214805 206566 199024 192040 185554
56522 185554 179693 174423 169567 165142 161306 158032 155161 152597 150160 147509 144601 141864 139508 137110
56508 137110 134451 132261 131382 131567 131905 132111 132451 132661 132054 130768 129899 130135 131080 132122 133211 134401 135290
56491 135290 135376 134680 133794 133486 134226 135784 137281 137976 137901 137565 137307 137253 137469 137667 137219 136066 135198 135450 136291
56472 136291 136698 136830 137742 139578 141170 141578 141079 140479 140243 140483 141017 141287 140877 140298 140604 142100 143968
$$ packed form
56577C10442L429L064K745K660K506K100J934K434L314M183N173O330P045O830
56563C64189O059N424N108M926M670L912K176j84k005k756l184l982m586m125
56549C75642k895k010j949k238k310k107k043k739m503o744q325q818q986r716
56535C10259j0977j2135j2694j2405j1255r773q836q692q687q239p542o984o486
56522A85554n861n270m856m425l836l274k871k564k437k651k908k737k356k398
56508A37110k659k190q79J85L38K06L40K10o07j286q69K36R45J042J089J190Q89
56491A35290Q6o96q86l08P40J558J497O95p5l36k58n4K16J98m48j153q68K52Q41
56472A36291M07J32R12J836J592M08m99o00k36K40N34K70m10n79L06J496J868
$$ plain form
56455 143968 145200 145354 144501 143135 142114 142018 142512 142911 143252 144110 145518 146853 147704 148097 147967 147277 146615
56438 146615 146779 147744 148853 149927 151309 152878 154028 154668 155269 155869 156078 156109 156693 157739 158194 157607 156814
56421 156814 156658 156941 157054 156836 156344 155561 154712 154202 153939 153412 152614 152129 152085 151892 151304 150808 150630 150251 149359
56402 149359 148448 148009 147873 147749 147681 147542 146844 145578 144590 144632 145535 146700 147842 148927 149966 151120 152474
56385 152474 153499 153446 152487 151738 151897 152603 153430 154610 156339 158105 159327 160138 161051 162290 163794 165491
56369 165491 167240 168853 170293 171516 172192 172087 171607 171392 171516 171734 172174 172911 173226 172462 171420 171622 173213
56352 173213 174889 175958 176976 178167 178783 178570 178416 178900 179423 179468 179517 180082 180904 181790 183082 184696 185861
56335 185861 186517 187849 190607 194000 197012 199779 202832 205977 208803 211396 213732 215296 216117 217217 219186
$$ packed form
56455A43968J232J54q53j366j021r6M94L99L41Q58J408J335Q51L93j30o90o62
56438A46615J64R65J109J074J382J569J150O40O01O00K09L1N84J046M55n87p93
56421A56814j56K83J13k18m92p83q49n10k63n27p98m85m4j93n88m96j78l79q92
56402A49359r11m39j36j24o8j39o98j266r88M2R03J165J142J085J039J154J354
56385A52474J025n3r59p49J59P06Q27J180J729J766J222Q11R13J239J504J697
56369A65491J749J613J440J223O76j05m80k15J24K18M40P37L15p64j042K02J591
56352A73213J676J069J018J191O16k13j54M84N23M5M9N65Q22Q86J292J614J165
56335A85861O56J332K758L393L012K767L053L145K826K593K336J564Q21J100J969
$$ plain form
56320 219186 221253 222626 223759 225344 226995 228032 228784 230043 231893 234014 236489 239300 241698 243094
56306 243094 244111 245887 248774 252388 256366 260326 263762 266747 270186 274631 279450 283803 287793 292007
56292 292007 296696 302102 308768 316576 324138 330018 334062 336946 339123 340907 342829 345105 347421 349916
56278 349916 353522 358621 364214 369335 374495 380859 388774 398005 408565 420318 432477 444623 457745
56265 457745 473428 492439 514779 540437 569313 601123 636229 675901 721011 771161 825819
56254 825819 885419 950534 1020728 1095040 1172738 1252686 1332879 1411626 1488452 1562915 1633192
56243 1633192 1696728 1751537 1796179 1829384 1850744 1860963 1860611 1849425 1827610 1796730 1758465 1713535
56231 1713535 1662753 1607862 1550192 1489670 1426368 1361840 1297721 1234260 1171694 1111711 1055781
$$ packed form
56320B19186K067J373J133J585J651J037P52J259J850K121K475K811K398J396
56306B43094J017J776K887L614L978L960L436K985L439M445M819M353L990M214
56292B92007M689N406O666P808P562N880M044K884K177J784J922K276K316K495
56278C49916L606N099N593N121N160O364P915R231J0560J1753J2159J2146J3122
56265D57745J5683J9011K2340K5658K8876L1810L5106L9672M5110N0150N4658
56254H25819N9600O5115P0194P4312P7698P9948Q0193P8747P6826P4463P0277
56243A633192O3536N4809M4642L3205K1360J0219l52j1186k1815l0880l8265m4930
56231A713535n0782n4891n7670o0522o3302o4528o4119o3461o2566n9983n5930
$$ plain form
56220 1055781 1003116 952130 903125 857652 815896 776563 738986 703643 670868 640609 613212
56209 613212 589107 567902 548904 532113 517724 505287 494503 486034 480265 475974 471553 466791
56197 466791 462203 457507 452301 447367 443690 440815 437720 434679 432677 431671 430993 430800 431537 432624 433315
56182 433315 434217 436291 439001 441197 443238 446381 450542 454431 457596 460656 463872 467094 470799 475649
56168 475649 481351 487302 493824 501362 509274 517044 525814 536877 549406 561662 573949 588423 606410
56155 606410 627880 653070 682695 716865 755786 801300 855948 920721 995307 1079924 1174807
56144 1174807 1278093 1385851 1493827 1597669 1692323 1773638 1840696 1895255 1939569 1976211
56134 1976211 2008603 2039026 2066218 2086827 2098701 2101246 2094080 2078069 2056728 2033516 2007818 1975871
$$ packed form
56220A055781n2665n0986m9005m5473m1756l9333l7577l5343l2775l0259k7397
56209F13212k4105k1205j8998j6791j4389j2437j0784q469n769m291m421m762
56197D66791m588m696n206m934l677k875l095l041k002j006o78j93P37J087O91
56182D33315R02K074K710K196K041L143M161L889L165L060L216L222L705M850
56168D75649N702N951O522P538P912P770Q770J1063J2529J2256J2287J4474J7987
56155F06410K1470K5190K9625L4170L8921M5514N4648O4773P4586Q4617R4883
56144A174807J03286J07758J07976J03842R4654Q1315O7058N4559M4314L6642
56134A976211L2392L0423K7192K0609J1874K545p166j6011k1341k3212k5698l1947
$$ plain form
56122 1975871 1934928 1883832 1820530 1742796 1652068 1553834 1453797 1355888 1263715 1180774 1108372
56111 1108372 1045558 991578 946493 909491 878918 854122 835135 820667 808651 798687 791668 787259
56099 787259 784126 782273 782527 783934 784488 784357 785622 788851 792666 796684 802009 808714 815606 822678 831092
56084 831092 840633 849898 858999 869351 880847 892105 903378 916203 930230 943483 955725 968372
56072 968372 981206 992566 1002761 1013694 1024935 1033945 1040623 1047887 1057160 1066892 1076246 1086601 1098524
56059 1098524 1110746 1123039 1136797 1152056 1167287 1182807 1200968 1222260 1244631 1267305 1291688
56048 1291688 1317961 1344376 1370541 1397658 1425008 1450111 1472944 1495962 1519368 1540748 1560189
56037 1560189 1581193 1605300 1630229 1654608 1680231 1708129 1736710 1765301 1795575 1828138 1861672
$$ packed form
56122A975871m0943n1096o3302p7734r0728r8234j00037r7909r2173q2941p2402
56111A108372o2814n3980m5085l7002l0573k4796j8987j4468j2016r964p019m409
56099G87259l133j853K54J407N54j31J265L229L815M018N325O705O892P072Q414
56084H31092R541R265R101J0352J1496J1258J1273J2825J4027J3253J2242J2647
56072I68372J2834J1360J0195J0933J1241R010O678P264R273R732R354J0355J1923
56059A098524J2222J2293J3758J5259J5231J5520J8161K1292K2371K2674K4383
56048A291688K6273K6415K6165K7117K7350K5103K2833K3018K3406K1380J9441
56037A560189K1004K4107K4929K4379K5623K7898K8581K8591L0274L2563L3534
$$ plain form
56026 1861672 1896521 1934955 1976935 2019936 2063745 2110777 2160918 2211183 2261435 2315098 2373022
56015 2373022 2432122 2491417 2553707 2619886 2687458 2756359 2830182 2909803 2991881 3075640 3164829
56004 3164829 3260891 3360658 3463099 3571771 3688129 3809209 3934503 4068273 4212345 4363645
55994 4363645 4521626 4690819 4873123 5065113 5266086 5481041 5712598 5958123 6218096
55985 6218096 6498767 6803060 7127787 7473492 7847633 8254235 8690506 9157981 9666571
55976 9666571 10223143 10827326 11483526 12205408 13003638 13882240 14852888 15939206 17161118
55967 17161118 18530437 20069613 21819685 23823538 26121168 28773063 31872529 35530471
55959 35530471 39876727 45095653 51442998 59219586 68758087 80447383 94725630 112013410
$$ packed form
56026A861672L4849L8434M1980M3001M3809M7032N0141N0265N0252N3663N7924
56015B373022N9100N9295O2290O6179O7572O8901P3823P9621Q2078Q3759Q9189
56004C164829R6062R9767J02441J08672J16358J21080J25294J33770J44072J51300
55994D363645J57981J69193J82304J91990K00973K14955K31557K45525K59973
55985F218096K80671L04293L24727L45705L74141M06602M36271M67475N08590
55976I666571N56572O04183O56200P21882P98230Q78602R70648J086318J221912
55967A7161118J369319J539176J750072K003853K297630K651895L099466L657942
55959C5530471M346256N218926O347345P776588R538501J1689296J4278247J7287780
$$ plain form
55951 112013410 132673455 157027682 185290202 217311057 252261040 288433335 323142657
55944 323142657 352723807 372961936 380267109 373171479 353078271 323617385 289125276
55937 289125276 253345952 218922041 187450555 159693373 135804412 115574827 98629889
55930 98629889 84525006 72796838 63024382 54865536 48038901 42298464 37441720 33318366
55922 33318366 29808573 26802325 24208014 21961777 20012104 18305909 16798999 15465832
55914 15465832 14286637 13235128 12287996 11435014 10669466 9977874 9347705 8775650 8259344
55905 8259344 7789001 7355166 6956778 6594021 6260609 5950240 5663499 5401413 5158784
55896 5158784 4930403 4717458 4521420 4337521 4160243 3989641 3826774 3668706 3513655
$$ packed form
55951A12013410K0660045K4354227K8262520L2020855L4949983L6172295L4709322
55944C23142657K9581150K0238129P305173p095630k0093208k9460886l4492109
55937B89125276l5779324l4423911l1471486k7757182k3888961k0229585j6944938
55930I8629889j4104883j1728168r772456q158846o826635n740437m856744m123354
55922C3318366l509793l006248k594311k246237j949673j706195j506910j333167
55914A5465832j179195j051509r47132q52982p65548o91592o30169n72055n16306
55905H259344m70343m33835l98388l62757l33412l10369k86741k62086k42629
55896E158784k28381k12945j96038j83899j77278j70602j62867j58068j55051
$$ plain form
55887 3513655 3365682 3228680 3100595 2978449 2863955 2759199 2661674 2568426 2480437 2398356
55877 2398356 2318652 2238696 2161187 2089193 2021269 1955717 1894851 1840475 1789600 1739243 1691132
55866 1691132 1647015 1603615 1557211 1509428 1463753 1419927 1376640 1336246 1301662 1271258 1241493
55855 1241493 1212114 1184533 1157632 1129521 1101191 1074388 1047962 1019998 991383 963736 936150
55844 936150 907664 880713 858400 840205 823718 808666 795931 784570 773117 762174 752745 743780
55832 743780 734115 724836 717052 709427 700735 692642 687082 683087 679063 675851 674384 672566 667868 661189
55818 661189 654939 649148 642712 636702 633002 631013 628834 626536 625351 624925 624112 623214 622719 621156 616863
55803 616863 610574 603788 596123 586844 577352 569329 561939 553687 545544 539292 534242 528668 523246 519869
$$ packed form
55887C513655j47973j37002j28085j22146j14494j04756r7525r3248q7989q2081
55877B398356p9704p9956p7509p1994o7924o5552o0866n4376n0875n0357m8111
55866A691132m4117m3400m6404m7783m5675m3826m3287m0394l4584l0404k9765
55855A241493k9379k7581k6901k8111k8330k6803k6426k7964k8615k7647k7586
55844I36150k8486k6951k2313j8195j6487j5052j2735j1361j1453j0943r429q965
55832G43780r665r279p784p625q692q093n560l995m024l212j467j818m698o679
55818F61189o250n791o436o010l700j989k179k298j185m26q13q98m95j563m293
55803F16863o289o786p665r279r492q023p390q252q143o252n050n574n422l377
$$ plain form
55789 519869 517995 515220 510693 505172 498564 490400 482118 476097 472896 471944 474226 481487 493184 506730
55775 506730 520230 532564 541400 543998 540155 532303 522891 513574 506314 502961 503839 508612 518124 533565
55761 533565 554388 579077 607441 640091 675986 712394 746863 777449 801548 816478 821102 815491
55749 815491 799731 774741 743400 708883 672354 633932 595034 557762 522690 489328 458228
55738 458228 430573 406167 383839 363478 345792 330526 316856 305130 296271 289704 283683 277422
55726 277422 271319 265528 259951 255115 251317 247437 242255 236389 231188 226525 221618 217262 214916 214011
55712 214011 212417 209408 206089 203104 200074 197265 195732 195666 196338 197593 199621 201381 201185 198959 196246
55697 196246 193995 192030 190509 190012 190147 189923 189574 190313 192217 194110 195653 197725 200608 203541 206355
$$ packed form
55789E19869j874k775m527n521o608q164q282o021l201r52K282P261J1697J3546
55775E06730J3500J2334Q836K598l843p852r412r317p260l353Q78M773R512J5441
55761E33565K0823K4689K8364L2650L5895L6408L4469L0586K4099J4930M624n611
55749H15491j5760k4990l1341l4517l6529l8422l8898l7272l5072l3362l1100
55738D58228k7655k4406k2328k0361j7686j5266j3670j1726q859o567o021o261
55726B77422o103n791n577m836l798l880n182n866n201m663m907m356k346r05
55712B14011j594l009l319k985l030k809j533o6O72J255K028J760j96k226k713
55697A96246k251j965j521m97J35k24l49P39J904J893J543K072K883K933K814
$$ plain form
55682 206355 209793 213852 217455 220278 223440 227848 233034 238020 242229 245325 247253 248673 250438 252603
55668 252603 254828 257436 260972 265020 268707 272066 275505 278284 279081 277915 275960 273599 270299 266338
55654 266338 262969 260638 258650 256837 256071 256875 258830 261675 265728 271083 277660 286224 298122 313833
55640 313833 332909 355357 381821 412330 446147 482912 522693 564744 607299 648515 686384
55629 686384 717983 740433 752919 756628 752792 742185 726485 708460 690413 673630 659454 649472
55617 649472 644372 643788 647416 655008 665206 675735 684994 692169 695714 693111 682493 663429 636209
55604 636209 601798 562599 521700 480958 440954 402788 368291 338178 311486 287310 265708
55593 265708 246604 229312 213691 200474 189843 180864 172771 165722 159889 154946 150778 147609 145186
$$ packed form
55682B06355L438M059L603K823L162M408N186M986M209L096J928J420J765K165
55668B52603K225K608L536M048L687L359L439K779P97j166j955k361l300l961
55654B66338l369k331j988j813p66Q04J955K845M053N355O577Q564J1898J5711
55640C13833J9076K2448K6464L0509L3817L6765L9781M2051M2555M1216L7869
55629F86384L1599K2450J2486L709l836j0607j5700j8025j8047j6783j4176r982
55617F49472n100n84L628P592J0198J0529R259P175L545k603j0618j9064k7220
55604F36209l4411l9199m0899m0742m0004l8166l4497l0113k6692k4176k1602
55593B65708j9104j7292j5621j3217j0631q979q093p049n833m943m168l169k423
$$ plain form
55580 145186 142984 141352 141175 142239 143362 144315 146060 148787 151398 153391 155512 157797 158676 157050 153883
55565 153883 150664 147489 143695 139322 134864 130404 125999 122188 119317 116986 114801 113016 111938 111425
55551 111425 111423 112158 113402 114431 115174 116479 118801 121534 124104 126646 129095 130682 131021 130798 130732 130716 130510
55534 130510 130340 130128 129021 126405 122699 118673 114800 111675 110038 109751 109626 108910 108125 107906 107994 107991 108147
55517 108147 108641 109015 109050 109422 110727 112590 114493 116725 119796 123581 127815 132799 138937 146131 154203
55502 154203 163402 173936 185664 198715 213815 231494 251611 274020 298921 326117 354775 384436
55490 384436 415271 446675 476422 501946 521704 534679 539521 535202 521975 500976 473427 440916
55478 440916 405733 370077 335304 302452 272775 246957 224399 204109 185910 170153 156747
$$ packed form
55580A45186k202j632j77J064J123R53J745K727K611J993K121K285Q79j626l167
55565A53883l219l175l794m373m458m460m405l811k871k331k185j785j078n13
55551A11425kP35J244J029P43J305K322K733K570K542K449J587L39k23o6j6k06
55534A30510j70k12j107k616l706m026l873l125j637k87j25p16p85k19Q8lJ56
55517A08147M94L74L5L72J305J863J903K232L071L785M234M984O138P194Q072
55502A54203R199J0534J1728J3051J5100J7679K0117K2409K4901K7196K8658K9661
55490C84436L0835L1404K9747K5524J9758J2975M842m319j3227k0999k7549l2511
55478D40916l5183l5656l4773l2852k9677k5818k2558k0290j8199j5757j3406
$$ plain form
55467 156747 145161 135011 125991 117661 109890 103109 97594 92917 88577 84733 81834 79924 78693 77722
55453 77722 76394 74216 71617 69752 69037 68573 67520 66283 65686 65642 65394 64648 63806 63343 63363 63474 62940 61487
55435 61487 60063 60036 61362 62459 62197 61030 59765 58330 56459 54591 53180 51961 50712 49963 50080 50353
55419 50353 49887 48788 47647 46498 45179 44106 43759 43851 43821 43693 43692 43527 42910 42263 42108 42176 41938 41588 41660
55400 41660 42029 42111 41787 41410 41193 41198 41625 42469 43188 43238 42677 41839 40848 39859 39194 38812 38197 37181 36195 35315
55380 35315 34005 32360 31559 32229 33330 33659 33523 33781 34074 33461 32239 31694 32227 32991 33263 33117 32837 32676
55362 32676 33110 34416 36020 37060 37456 37710 37857 37486 36586 35622 34904 34546 34747 35392 35705 35071 33932 33114
55344 33114 32661 32168 31829 32143 32873 33319 33476 33928 34715 35292 35562 35959 36475 36527 35903 35097 34552 34218 33917
$$ packed form
55467A56747j1586j0150r020q330p771o781n515m677m340l844k899j910j231r71
55453G7722j328k178k599j865p15m64j053j237n97m4k48p46q42m63K0J11n34j453
55435F1487j424k7J326J097k62j167j265j435j871j868j411j219j249p49J17K73
55419E0353m66j099j141j149j319j073l47R2l0j28jj65o17o47j55O8k38l50P2
55400D1660L69Q2l24l77k17NM27Q44P19N0n61q38r91r89o65l82o15j016r86q80
55380C5315j310j645q01O70J101L29j36K58K93o13j222n45N33P64K72j46k80j61
55362C2676M34J306J604J040L96K54J47l71r00r64p18l58K01O45L13o34j139q18
55344C3114m53m93l39L14P30M46J57M52P87N77K70L97N16N2o24q06n45l34l01
$$ plain form
55325 33917 33521 32807 31723 30813 30780 31656 32790 33542 33612 33022 32258 32023 32289 32017 30551 28807 28273 29188
55307 29188 30554 31588 32230 32506 32361 32035 31793 31419 30749 30374 30977 32226 33262 34024 35081 36365 37139
55290 37139 37207 37107 37095 36887 36468 36219 36134 35799 35244 34967 35093 35238 35234 35212 35021 34406 33755 33774 34392 34828 34714
55269 34714 34339 33827 33021 32241 32166 32790 33364 33484 33460 33499 33440 33342 33446 33500 33025 32402 32659 34015 35557 36577
55249 36577 37260 37793 37819 37161 36183 35052 33521 31814 30783 30690 30654 29857 28571 27530 26986 26915 27430 28467
55231 28467 29605 30677 31965 33363 34048 33507 32339 31449 30901 30132 28868 27338 25907 24938 24733 25254
55215 25254 26170 27357 28942 30687 31912 32342 32448 32593 32383 31419 30191 29647 30124 31188 32326 33320 34090
55198 34090 34591 34891 35095 35225 35251 35166 35028 35026 35338 35687 35275 33635 31442 29935 29629 30118 31029 32369 33829
$$ packed form
55325C3917l96p14j084r10l3Q76J134P52P0n90p64k35K66k72j466j744n34R15
55307B9188J366J034O42K76j45l26k42l74o70l75O03J249J036P62J057J284P74
55290C7139O8j00j2k08m19k49q5l35n55k77J26J45mk2j91o15o51J9O18M36j14
55269C4714l75n12q06p80p5O24N74J20k4L9n9r8J04N4m75o23K57J356J542J020
55249C6577O83N33K6o58r78j131j531j707j031r3l6p97j286j041n44p1N15J037
55231B8467J138J072J288J398O85n41j168q90n48p69j264j530j431r69k05N21
55215B5254R16J187J585J745J225M30J06J45k10r64j228n44M77J064J138R94P70
55198C4090N01L00K04J30K6q5j38kL12L49m12j640k193j507l06M89R11J340J460
$$ plain form
55179 33829 34657 34628 34525 35137 36259 37079 37226 36988 36771 36677 36489 35954 35215 34898 35416 36279 36555 36038 35395
55160 35395 35158 35218 35419 35908 36594 36876 36371 35495 34939 34852 34827 34447 33682 32987 33063 34171 35620 36351 36063 35381
55140 35381 34991 35121 35786 36852 37744 37838 37320 37031 37304 37603 37500 37238 37051 36707 36118 35720 35773 35902 35788
55121 35788 35763 36245 37084 37894 38561 38977 38847 38258 37914 38270 38859 39050 39052 39515 40416 41045 40971 40486 40130 40235
55101 40235 40921 42124 43526 44691 45334 45439 45220 45001 44983 45046 44967 44779 44697 44771 44960 45470 46519 47780 48553
55082 48553 48594 48310 48085 47893 47636 47286 46619 45418 44101 43492 43747 44133 44125 44075 44446 45025 45340 45366 45293 44993
55062 44993 44191 42945 41646 40715 40387 40530 40627 40325 39951 39991 40172 39750 38699 37767 37286 36830 36259 36136 36725
55043 36725 37558 38405 39720 41540 42943 43334 43425 44104 45108 45665 45714 45583 45091 44048 43126 43177 43968 44530
$$ packed form
55179C3829Q28k9j03O12J122Q20J47k38k17r4j88n35p39l17N18Q63K76n17o43
55160C5395k37O0K01M89O86K82n05q76n56q7k5l80p65o95P6J108J449P31k88o82
55140C5381l90J30O65J066Q92R4n18k89K73K99j03k62j87l44n89l98N3J29j14
55121C5788k5M82Q39Q10O67M16j30n89l44L56N89J91KM63R01O29p4m85l56J05
55101D0235O86J203J402J165O43J05k19k19j8O3p9j88q2P4J89N10J049J261P73
55082D8553M1k84k25j92k57l50o67j201j317o09K55L86qn0L71N79L15K6p3l00
55062D4993q02j246j299r31l28J43R7l02l74M0J81m22j051r32m81m56n71j23N89
55043C6725Q33Q47J315J820J403L91R1O79J004N57M9j31m92j043r22N1P91N62
$$ plain form
55025 44530 44504 44258 43942 43396 42912 43155 44216 45448 46279 46618 46507 45945 45082 44115 43015 41750 40656 40242
55007 40242 40745 42153 44320 46721 48549 49515 50195 51101 51917 52237 52475 53193 53993 54078 53611 53522 53985 54108
54989 54108 53281 51966 50867 50033 49118 48133 47584 48025 49413 50770 50784 49169 47164 46203 46354 46630 46536 46502
54971 46502 46949 47689 48349 48775 48975 49148 49731 50840 51838 52094 52056 52747 54178 55129 54723 53463 52367 51725
54953 51725 51118 50196 48988 47796 47110 47369 48558 50251 52146 54240 56372 58078 59173 60179 61856
54938 61856 64469 67765 71529 75925 81332 87995 95835 104421 113030 120655 126147 128678 128252 125605 121459
54923 121459 116040 109380 101792 93902 86436 80157 75611 72663 70499 68403 66322 64534 63142 62101
54909 62101 61345 60675 59955 59689 60689 62739 64246 64011 62815 62452 63585 65433 67256 69175 71609 74822
$$ packed form
55025D4530k6k46l16n46m84K43J061J232Q31L39j11n62q63r67j100j265j094m14
55007D0242N03J408K167K401J828R66O80R06Q16L20K38P18Q00Q5m67q9M63J23
54989E4108q27j315j099q34r15r85n49M41J388J357J4j615k005r61J51K76r4l4
54971D6502M47P40O60M26K00J73N83J109R98K56l8O91J431R51m06j260j096o42
54953E1725o07r22j208j192o86K59J189J693J895K094K132J706J095J006J677
54938F1856K613L296L764M396N407O663P840Q586Q609P625N492K531m26k647m146
54923A21459n419o660p588p890p466o279m546k948k164k096k081j788j392j041
54909F2101p56o70p20k66J000K050J507k35j196l63J133J848J823J919K434L213
$$ plain form
54893 74822 79098 84574 90803 97116 103472 110291 117413 123872 128763 131741 132647 131319 127905 122834 116423
54878 116423 109010 101416 94571 88662 83235 78166 73840 70291 66945 63452 60185 57702 56218 55715
54864 55715 56003 56532 56711 56558 56535 56690 56513 55697 54400 52754 50818 49127 48438 48651 48737 48004 46787 45669
54846 45669 44797 44245 44214 44421 44081 43027 42133 42053 42254 41939 41293 41017 41140 41096 40688 40240 40032 40186 40863 41963
54826 41963 42881 43210 43463 44376 45669 46211 45445 43984 42704 41874 41358 41173 41461 42195 43155 44068 44676 44872
54808 44872 44836 44903 45208 45623 46102 46905 48325 50191 51797 52447 52159 51700 51848 52679 53732 54686 55606 56596
54790 56596 57661 59010 61068 63987 67392 70855 74379 78205 82355 86660 91097 95879 101198 106999
54776 106999 112946 118504 123128 126382 127853 127136 124200 119737 114819 110042 105252 100124 94710 89355
$$ packed form
54893G4822M276N476O229O313O356O819P122O459M891K978R06j328l414n071o411
54878A16423p413p594o845n909n427n069m326l549l346l493l267k483j484n03
54864E5715K88N29J79j53k3J55j77q16j297j646j936j691o89K13Q6p33j217j118
54846D5669q72n52l1K07l40j054q94q0K01l15o46k76J23m4m08m48k08J54O77J100
54826D1963R18L29K53R13J293N42p66j461j280q30n16j85K88P34R60R13O08J96
54808D4872l6O7L05M15M79Q03J420J866J606O50k88m59J48Q31J053R54R20R90
54790E6596J065J349K058K919L405L463L524L826M150M305M437M782N319N801
54776A06999N947N558M624L254J471p17k936m463m918m777m790n128n414n355
$$ plain form
54762 89355 84402 80113 76645 73966 71945 70538 69630 68784 67580 66261 65599 65965 66928 67885 68632 69125
54746 69125 69226 69055 69223 70303 72306 74949 78134 81856 85913 90082 94425 99145 104343 110051 116180
54731 116180 122094 126593 128758 128647 126865 123654 118801 112325 104896 97557 91200 86136 81974 78039
54717 78039 74100 70496 67454 64669 61821 59166 57254 56331 56330 57112 58231 58771 58073 56527 55137 54336
54701 54336 53713 52926 52302 52318 52875 53299 52879 51344 49117 47124 46160 46330 47164 48213 49261 50095 50477 50472
54683 50472 50490 50841 51443 52083 52733 53439 54033 54231 54068 54107 55005 56789 58636 59590 59522 59128 58955 58755 58032
54664 58032 56922 56048 55683 55480 55109 54697 54447 54122 53243 51708 50005 48783 48363 48694 49625 50994 52450
54647 52450 53412 53485 52926 52463 52578 53081 53432 53290 52727 52126 51919 52249 52764 52986 52956 53244 54150 55183 55604
$$ packed form
54762H9355m953m289l468k679k021j407r08q46j204j319o62L66R63R57P47M93
54746F9125J01j71J68J080K003K643L185L722M057M169M343M720N198N708O129
54731A16180N914M499K165j11j782l211m853o476p429p339o357n064m162l935
54717G8039l939l604l042k785k848k655j912r23jP82J119N40o98j546j390q01
54701E4336o23p87o24J6N57M24m20j535k227j993r64J70Q34J049J048Q34L82n
54683E0472J8L51O02O40O50P06N94J98j63L9Q98J784J847R54o8l94j73k00p23
54664E8032j110q74l65k03l71m12k50l25q79j535j703j222m20L31R31J369J456
54647E2450R62P3n59m63J15N03L51j42n63o01k07L30N15K22l0K88R06J033M21
$$ plain form
54628 55604 55303 54865 54878 55391 55923 55823 54793 53244 52047 51729 52069 52561 52995 53388 53707 54010 54593 55510
54610 55510 56172 55968 55194 54807 55202 55780 55845 55431 54980 54631 54185 53557 52919 52443 52109 51797 51479 51382 51897 53173
54590 53173 54805 56115 56716 56671 56200 55529 55000 54873 54873 54311 52930 51433 50898 51794 53661 55550 56560 56277
54572 56277 55042 53727 52941 52536 52083 51627 51652 52375 53470 54541 55508 56391 57020 57185 56927 56547 56403 56769
54554 56769 57688 58848 59731 60030 59837 59420 58953 58524 58151 57661 56827 55850 55374 55738 56433 56709 56537 56520 56908
54535 56908 57253 57139 56748 56507 56584 56913 57368 57670 57501 56979 56672 56845 57037 56728 56124 55855 56106 56522 56848
54516 56848 57180 57636 58102 58321 58029 57129 56019 55472 55815 56415 56444 55961 55693 55911 56225 56471 57109 58468 60198
54497 60198 61756 62990 63961 64611 64903 64971 64863 64459 63870 63573 63822 64219 64224 63942 64166 65739 68953 73321
$$ packed form
54628E5604l01m38J3N13N32j00j030j549j197l18L40M92M34L93L19L03N83R17
54610E5510O62k04p74l87L95N78O5m14m51l49m46o28o38m76l34l12l18r7N15J276
54590E3173J632J310O01m5m71o71n29j27%n62j381j497n35Q96J867J889J010k83
54572E6277j235j315p86m05m53m56K5P23J095J071R67Q83O29J65k58l80j44L66
54554E6769R19J160Q83K99j93m17m67m29l73m90q34r77m76L64O95K76j72j7L88
54535E6908L45j14l91k41P7L29M55L02j69n22l07J73J92l09o04k69K51M16L26
54516E6848L32M56M66K19k92r00j110n47L43O00K9m83k68K18L14K46O38J359J730
54497F0198J558J234R71O50K92O8j08m04n89k97K49L97Nk82K24J573L214M368
$$ plain form
54479 73321 77801 81477 84224 86565 88880 91045 92857 94291 95125 94795 93090 90640 88386 86751 85648
54464 85648 84987 84718 84565 84186 83567 82963 82504 82141 81921 82022 82438 82807 82634 81702 80350 79279 78901 78878 78608
54445 78608 78093 77872 78011 77781 76687 75277 74426 74188 73908 73200 72233 71195 70067 68982 68316 68305 68828 69588
54427 69588 70283 70651 70653 70538 70531 70559 70513 70593 71085 71929 72877 73908 75102 76218 76871 77088 77271 77558 77670 77426
54407 77426 77013 76614 76153 75569 75014 74587 74125 73488 72813 72326 72027 71774 71568 71615 72121 73092 74333 75579 76678
54388 76678 77673 78661 79556 80010 79590 78146 76134 74533 74195 75178 76859 78666 80451 82098 83214 83561
54372 83561 83497 83599 83974 84365 84850 85990 88161 90972 93463 94761 94546 93115 91122 89160 87515 86193
54356 86193 85049 83879 82535 81002 79276 77233 74924 72918 71954 72052 72343 71984 70932 69653 68472 67507
$$ packed form
54479G3321M480L676K747K341K315K165J812J434Q34l30j705k450k254j635j103
54464H5648o61k69j53l79o19o04m59l63k20J01M16L69j73r32j352j071l78k3k70
54445G8608n15k21J39k30j094j410q51k38k80p08r67j038j128j085o66j1N23P60
54427F9588O95L68Kj15pK8m6Q0M92Q44R48J031J194J116O53K17J83K87J12k44
54407G7426m13l99m61n84n55m27m62o37o75m87k99k53k06M7N06R71J241J246J099
54388G6678R95R88Q95M54m20j444k012j601l38R83J681J807J785J647J116L47
54372H3561o4J02L75L91M85J140K171K811K491J298k15j431j993j962j645j322
54356H6193j144j170j344j533j726k043k309k006r64R8K91l59j052j279j181r65
$$ plain form
54340 67507 66788 66099 65040 63667 62736 62899 64015 65627 67687 70155 72256 72967 72215 70970 70150 69950
54324 69950 70136 70392 70418 70205 70227 70825 71517 71518 70849 70178 69620 68590 67014 65821 65771 66487 67183 67784 68703 69888
54304 69888 70720 70773 70193 69350 68421 67412 66439 65884 66080 66803 67312 67222 67109 67750 68964 69802 69886 69774 69864 69654
54284 69654 68503 66589 64705 63496 63237 63904 65119 66341 67380 68340 68947 68550 67188 66039 66266 67811
54268 67811 69874 72048 74303 76239 77250 77385 77337 77551 77854 77971 77865 77573 77182 76972 77048 76862 75676 73669
54250 73669 72018 71628 72220 72935 73411 73884 74508 75008 74939 74045 72385 70375 68676 67897 68286 69628 71350
54233 71350 72718 73168 72619 71465 70239 69342 69036 69421 70273 71054 71259 70811 70029 69324 68982 69118 69589 69927
54215 69927 69553 68258 66437 64787 63780 63460 63701 64524 66054 68222 70601 72641 74139 75388 76802
$$ packed form
54340F7507p19o89j059j373r31J63J116J612K060K468K101P11p52j245q20k00
54324F9950J86K56K6k13K2N98O92Jo69o71n58j030j576j193n0P16O96O01R19J185
54304F9888Q32N3n80q43r29j009r73n55J96P23N09r0j13O41J214Q38Q4j12R0k10
54284F9654j151j914j884j209k59O67J215J222J039R60O07l97j362j149K27J545
54268F7811K063K174K255J936J011J35m8K14L03J17j06k92l91k10P6j86j186k007
54250G3669j651l90N92P15M76M73O24N00o9q94j660k010j699p79L89J342J722
54233G1350J368M50n49j154j226q97l06L85Q52P81K05m48p82p05l42J36M71L38
54215F9927l74j295j821j650j007l20K41Q23J530K168K379K040J498J249J414
$$ plain form
54200 76802 78355 79557 80043 80034 80086 80544 81446 82804 84580 86435 87936 89113 90377 91718 92434 92027 90956
54183 90956 90077 89639 89296 88796 88017 86512 83834 80427 77548 75947 75171 74402 73537 73022 73035 73285 73460 73443
54165 73443 73161 72538 71581 70369 69027 67858 67291 67485 68071 68510 68609 68509 68293 67862 67201 66498 65938 65529
54147 65529 65219 65016 64836 64348 63232 61709 60619 60698 61767 62960 63711 64179 64574 64624 64142 63731 64241 65697
54129 65697 67339 68644 69670 70427 70693 70644 70922 71649 71977 71096 69272 67409 66019 65163 65030 65849 67273
54112 67273 68515 69196 69625 70156 70672 70865 70770 70780 71231 72085 73033 73834 74478 75009 75294 75272 75308 75877 76774 77092
54092 77092 76382 75493 75810 77754 80464 82834 84502 85766 86942 88077 89162 90433 92284 94752 97166
54077 97166 98611 98899 98799 99086 99614 99595 98544 96586 94062 91324 88957 87659 87595 88044 87948 86853 85295
$$ packed form
54200G6802J553J202M86rN2M58R02J358J776J855J501J177J264J341P16m07j071
54183I0956q79m38l43n00p79j505k678l407k879j601p76p69q65n15J3K50J75j7
54165G3443k82o23r57j212j342j169n67J94N86M39R9j00k16m31o61p03n60m09
54147F5529l10k03j80m88j116j523j090P9J069J193P51M68L95N0m82m11N10J456
54129F5697J642J305J026P57K66m9K78P27L28q81j824j863j390q56j33Q19J424
54112F7273J242O81M29N31N16J93r5J0M51Q54R48Q01O44N31K85k2L6N69Q97L18
54092G7092p10q89L17J944K710K370J668J264J176J135J085J271J851K468K414
54077I7166J445K88j00K87N28j9j051j958k524k738k367j298o4M49r6j095j558
$$ plain form
54060 85295 84281 84382 85341 86581 87957 89762 92067 94488 96760 99102 101685 104169 106311 108690 112115
54045 112115 116351 120179 122939 125382 128600 132570 136320 139345 142227 145785 150035 154299 158043 161214
54031 161214 163738 165171 165203 164379 163889 164520 166025 167619 168778 169351 169214 168251 166600 164562 162173 159137
54015 159137 155289 150923 146524 142350 138402 134718 131488 128766 126180 123117 119386 115625 112867 111602
54001 111602 111383 111385 111159 110722 110156 109389 108350 107122 105833 104511 103033 101293 99420 97823 96862 96492 96367
53984 96367 96357 96739 97707 98912 99685 99735 99454 99552 100418 101808 103133 104052 104696 105258 105573 105379 104793 104161 103466
53965 103466 102360 100859 99547 98943 99054 99654 100536 101326 101603 101516 101750 102557 103346 103720 104336 106025 108559
53948 108559 111070 113415 116126 119168 121791 123864 126453 130546 135765 140867 145131 148814 152504 156517
$$ packed form
54060H5295j014J01R59J240J376J805K305K421K272K342K583K484K142K379L425
54045A12115M236L828K760K443L218L970L750L025K882L558M250M264L744L171
54031A61214K524J433L2q24m90O31J505J594J159N73j37r63j651k038k389l036
54015A59137l848m366m399m174l948l684l230k722k586l063l731l761k758j265
54001A11602k19Kk26m37n66p67j039j228j289j322j478j740j873j597r61l70j25
53984I6367j0L82R68J205P73N0k81R8Q66J390J325R19O44N62L15j94n86o32o95
53965A03466j106j501j312o04J11O00Q82P90K77q7K34Q07P89L74O16J689K534
53948A08559K511K345K711L042K623K073K589M093N219N102M264L683L690M013
$$ plain form
53934 156517 160811 165100 168980 172177 174848 177571 180944 185045 189303 193057 196280 199552 203240 207043
53920 207043 210598 214159 218251 222887 227590 232013 236023 239340 241672 243204 244369 245149 245149 244379 243287
53905 243287 241957 239964 237313 234801 232978 231325 228973 225819 222345 218642 214246 208873 202800 196466
53891 196466 190092 183725 177426 171294 165461 160092 155345 151396 148439 146432 144831 142950 140738 138880
53877 138880 137885 137425 136810 135738 134257 132359 130136 128063 126483 124905 122448 119032 115558 112776 110478
53862 110478 108060 105410 102875 100706 98958 97709 96995 96566 96075 95513 95207 95406 96026 96851 97723 98480 98900
53845 98900 98840 98388 97792 97281 96993 96974 97175 97471 97769 98072 98404 98693 98827 98848 99040 99756 101084 102633 103740
53826 103740 103987 103590 103206 103369 104195 105559 107334 109312 111121 112495 113593 114908 116834 119405 122348
$$ packed form
53934A56517M294M289L880L197K671K723L373M101M258L754L223L272L688L803
53920B07043L555L561M092M636M703M423M010L317K332J532J165P80%p70j092
53905B43287j330j993k651k512j823j653k352l154l474l703m396n373o073o334
53891A96466o374o367o299o132n833n369m747l949k957k007j601j881k212j858
53877A38880r95m60o15j072j481j898k223k073j580j578k457l416l474k782k298
53862A10478k418k650k535k169j748j249p14m29m91n62l06J99O20Q25Q72P57M20
53845I8900o0m52n96n11k88j9K01K96K98L03L32K89J34K1J92P16J328J549J107
53826A03740K47l97l84J63Q26J364J775J978J809J374J098J315J926K571K943
$$ plain form
53811 122348 125278 127983 130679 133853 137657 141644 145400 149228 153755 158945 164020 168375 172025 175038
53797 175038 177148 178270 178888 179470 179867 179669 178878 177808 176584 175176 173703 172272 170653 168518 165835
53782 165835 162700 159014 154766 150383 146303 142398 138398 134705 132096 130570 129146 126958 124035 120953
53768 120953 118269 116423 115553 115079 114000 111986 109809 108400 107836 107574 107235 106710 105836 104557 103289 102626
53752 102626 102606 102623 102113 101150 100356 100391 101439 102958 104010 104080 103589 103345 103483 103257 102062 100366 99270 99197
53734 99197 99396 98944 97896 97096 97050 97508 98165 99197 100820 102769 104659 106555 108736 111099 113290 115188
53718 115188 116772 117691 117658 117247 117605 119149 121105 122554 123439 124255 125286 126509 127872 129213 130150 130436
53702 130436 130289 130094 129984 130030 130642 132335 135058 138012 140275 141500 142051 142585 143536 144899 146416 147816
$$ packed form
53811A22348K930K705K696L174L804L987L756L828M527N190N075M355L650L013
53797A75038K110J122O18N82L97j98p91j070j224j408j473j431j619k135k683
53782A65835l135l686m248m383m080l905m000l693k609j526j424k188k923l082
53768A20953k684j846q70m74j079k014k177j409n64k62l39n25q74j279j268o63
53752A02626k0J7n10r63p94L5J048J519J052P0m91k44J38k26j195j696j096p3
53734I9197J99m52j048q00m6M58O57J032J623J949J890J896K181K363K191J898
53718A15188J584R19l3m11L58J544J956J449Q85Q16J031J223J363J341R37K86
53702A30436j47j95j10M6O12J693K723K954K263J225N51N34R51J363J517J400
$$ plain form
53686 147816 148880 149484 149756 150051 150510 150767 150453 149894 149891 150829 152373 154044 155587 156668 156797 155860 154414
53669 154414 153134 152189 151363 150546 149927 149869 150652 152082 153384 153871 153767 153943 154782 155789 156416 156688 156822 156876
53651 156876 157042 157636 158424 158636 158147 157966 158909 160424 161504 162232 163417 165078 166366 166892 167183 167676 168222
53634 168222 168768 169721 171213 172664 173522 173995 174659 175713 176993 178408 180008 181783 183678 185714 187923
53619 187923 190266 192671 195010 197066 198770 200524 202947 206180 209654 212708 215256 217741 220590 223766
53605 223766 226778 229103 230762 232404 234601 237149 239397 241212 243151 245559 247966 249671 250588 251150 251603
53590 251603 251804 251672 251451 251427 251588 251720 251687 251518 251206 250561 249356 247561 245396 243166 241204 239919 239639
53573 239639 240229 241045 241496 241537 241412 241105 240368 239166 237760 236285 234591 232618 230691 229288 228683 228916 229923
$$ packed form
53686A47816J064O04K72K95M59K57l14n59lR38J544J671J543J081J29r37j446
53669A54414j280r45q26q17o19n8P83J430J302M87j04J76Q39J007O27K72J34N4
53651A56876J66N94P88K12m89j81R43J515J080P28J185J661J288N26K91M93N46
53634A68222N46R53J492J451Q58M73O64J054J280J415J600J775J895K036K209
53619A87923K343K405K339K056J704J754K423L233L474L054K548K485K849L176
53605B23766L012K325J659J642K197K548K248J815J939K408K407J705R17N62M53
53590B51603K01j32k21k4J61J32l3j69l12o45j205j795k165k230j962j285k80
53573B39639N90Q16M51M1j25l07p37j202j406j475j694j973j927j403o05K33J007
$$ plain form
53556 229923 231518 233277 234606 235023 234535 233746 233395 233583 233632 232921 231724 230849 230590 230488 230199 230099 230723 231981
53538 231981 233300 234377 235464 236977 239106 241809 244905 248118 251230 254314 257769 262010 267133 272915
53524 272915 279129 285775 292983 300683 308553 316335 324141 332265 340691 348990 356784 364246 371965 380378
53510 380378 389481 399145 409549 421094 433905 447693 462172 477400 493471 510044 526519 542658
53498 542658 558685 574754 590613 605898 620474 634410 647903 661330 675075 689133 703146
53487 703146 716900 730436 743548 755764 767156 778698 791234 804429 817299 829555 841719
53476 841719 854061 866140 877514 888286 898642 908291 916676 923558 929211 934114 938460 941774 943118
53463 943118 941895 938402 933277 926625 918123 907920 896911 886035 875687 865877 856474 847133 837392
$$ packed form
53556B29923J595J759J329M17m88p89l51J88M9p11j197q75k59j02k89j00O24J258
53538B31981J319J077J087J513K129K703L096L213L112L084L455M241N123N782
53524B72915O214O646P208P700P870P782P806Q124Q426Q299P794P462P719Q413
53510C80378R103R664J0404J1545J2811J3788J4479J5228J6071J6573J6475J6139
53498E42658J6027J6069J5859J5285J4576J3936J3493J3427J3745J4058J4013
53487G03146J3754J3536J3112J2216J1392J1542J2536J3195J2870J2256J2164
53476H41719J2342J2079J1374J0772J0356R649Q385O882N653M903M346L314J344
53463I43118j223l493n125o652q502j0203j1009j0876j0348r810r403r341r741
$$ plain form
53450 837392 826994 815830 803594 789987 775415 760990 747595 735251 723479 711824 699958
53439 699958 687847 676117 665721 656899 648935 641321 634654 629906 627212 625915 625407 625363 625476 625635 626243
53424 626243 627748 629973 632451 635291 639064 643860 649192 654924 661618 669692 678783 688332 698391 709418
53410 709418 721600 734764 748754 763538 779074 795391 812737 831330 851099 871925 894116
53399 894116 918335 944932 973580 1003590 1034466 1066098 1098631 1132301 1167211 1203097 1239389
53388 1239389 1275723 1312362 1349870 1388240 1426556 1463727 1499501 1534529 1569405 1603832 1636815
53377 1636815 1667558 1696026 1722680 1747805 1771172 1792326 1811081 1827580 1841828 1853298 1861213
53366 1861213 1865204 1865480 1862328 1855567 1844628 1829012 1808603 1783701 1754980 1723408 1689992 1655515
$$ packed form
53450H37392j0398j1164j2236j3607j4572j4425j3395j2344j1772j1655j1866
53439F99958j2111j1730j0396q822p964p614o667m748k694j297n08m4J13J59O08
53424F26243J505K225K478K840L773M796N332N732O694Q074R091R549J0059J1027
53410G09418J2182J3164J3990J4784J5536J6317J7346J8593J9769K0826K2191
53399H94116K4219K6597K8648L0010L0876L1632L2533L3670L4910L5886L6292
53388A239389L6334L6639L7508L8370L8316L7171L5774L5028L4876L4427L2983
53377A636815L0743K8468K6654K5125K3367K1154J8755J6499J4248J1470P915
53366A861213L991K76l152o761j0939j5616k0409k4902k8721l1572l3416l4477
$$ plain form
53354 1655515 1620527 1585520 1550900 1516746 1482703 1448408 1414070 1380516 1348621 1318733 1290711
53343 1290711 1264269 1239009 1214226 1189153 1163608 1138098 1113111 1088548 1064191 1040454 1018181
53332 1018181 997740 978758 960798 943873 928178 913726 900569 889055 879490 871562 864311 856615
53320 856615 847689 837293 825745 813713 801839 790570 780319 771498 764176 757830 751714 745517 739549
53307 739549 734390 730513 728138 727172 727215 727828 728966 731043 734513 739389 745281 751905 759486 768563 779377
53292 779377 791487 804089 816720 829598 843336 858423 874928 892469 910342 927839 944608
53281 944608 960643 975906 990064 1002746 1013953 1024003 1033029 1040723 1046630 1050592 1052761 1053216 1051775
53268 1051775 1048283 1042974 1036342 1028683 1019952 1010069 999081 986856 972898 956833 938961 920087
$$ packed form
53354A655515l4988l5007l4620l4154l4043l4295l4338l3554l1895k9888k8022
53343A290711k6442k5260k4783k5073k5545k5510k4987k4563k4357k3737k2273
53332A018181k0441j8982j7960j6925j5695j4452j3157j1514r565p928p251p696
53320H56615q926j0396j1548j2032j1874j1269j0251q821p322o346o116o197n968
53307G39549n159l877k375r66M3O13J138K077L470M876N892O624P581R077J0814
53292G79377J2110J2602J2631J2878J3738J5087J6505J7541J7873J7497J6769
53281I44608J6035J5263J4158J2682J1207J0050R026P694N907L962K169M55j441
53268A051775l492n309o632p659q731r883j0988j2225j3958j6065j7872j8874
$$ plain form
53256 920087 900864 881587 862470 843648 824866 805634 786002 766863 749148 732845 717102
53245 717102 701195 685141 669399 654201 639283 624158 608597 592820 577209 561881 546644
53234 546644 531369 516258 501756 488374 476594 466681 458382 450940 443628 436214 428834 421574 414403
53221 414403 407473 401179 395746 390794 385495 379241 372094 364512 356663 348277 339143 329478 319584 309460
53207 309460 299081 288848 279271 270346 261763 253716 246905 241532 236886 232243 227701 223665 219916 215737
53193 215737 210814 205490 200178 194959 189794 184751 179890 175177 170599 166289 162453 159264 156754 154741
53179 154741 152917 151074 149149 147020 144506 141660 138814 136194 133739 131516 129999 129577 129968 130499 130836
53164 130836 131042 131056 130584 129568 128357 127323 126597 126251 126434 127144 128091 128912 129382 129388 128902 128084 127257 126695 126484
$$ packed form
53256I20087j9223j9277j9117j8822j8782j9232j9632j9139j7715j6303j5743
53245G17102j5907j6054j5742j5198j4918j5125j5561j5777j5611j5328j5237
53234E46644j5275j5111j4502j3382j1780r913q299p442p312p414p380p260p171
53221D14403o930o294n433m952n299o254p147p582p849q386r134r665r894j0124
53207C09460j0379j0233r577q925q583q047o811n373m646m643m542m036l749m179
53193B15737m923n324n312n219n165n043m861m713m578m310l836l189k510k013
53179A54741j824j843j925k129k514k846k846k620k455k223j517m22L91N31L37
53164A30836K06J4m72j016j211j034p26l46J83P10R47Q21M70Om86q18q27n62k11
$$ plain form
53145 126484 126532 126543 126112 125150 124203 124003 124575 125147 125096 124714 124762 125534 126700 127901 129094 130275 131285 132108
53127 132108 133065 134432 135965 137098 137651 138051 138746 139634 140249 140311 139824 138832 137448 136111 135389 135356 135442 135001
53109 135001 133798 131909 129532 127123 125296 124229 123420 122367 121240 120484 120037 119477 118833 118620 119000 119463
53093 119463 119590 119691 120326 121436 122302 122276 121332 119927 118516 117268 116200 115489 115415 115858 116070 115367 114066
53076 114066 113314 113812 115015 115846 115929 115708 115558 115332 114921 114748 115244 116031 116140 115184 113925 113368 113574 113781
53058 113781 113611 113593 114314 115530 116498 116921 117123 117381 117541 117418 117226 117409 118103 118911 119202 118654 117637 116994
53040 116994 117319 118430 119608 120273 120351 120090 119752 119424 118968 118138 116863 115440 114338 113867 114089 114904 116055
53023 116055 117208 118245 119414 120898 122300 122903 122514 121794 121590 122076 122727 123036 123106 123486 124499 125852 127008
$$ packed form
53145A26484M8J1m31r62r47k00N72N72n1l82M8P72J166J201J193J181J010Q23
53127A32108R57J367J533J133N53M00O95Q88O15O2m87r92j384j337p22l3Q6m41
53109A35001j203j889k377k409j827j067q09j053j127p56m47n60o44k13L80M63
53093A19463J27J01O35J110Q66k6r44j405j411j248j068p11p4M43K12p03j301
53076A14066p52M98J203Q31Q3k21j50k26m11j73M96P87J09r56j259n57K06K07
53058A13781j70j8P21J216R68M23K02K58J60j23j92J83O94Q08K91n48j017o43
53040A16994L25J111J178O65P8k61l38l28m56q30j275j423j102m71K22Q15J151
53023A16055J153J037J169J484J402O03l89p20k04M86O51L09P0L80J013J353J156
$$ plain form
53006 127008 127827 128574 129336 129817 129894 129980 130458 131043 131147 130753 130459 130697 131382 132324 133518 134880 136090 136933
52988 136933 137544 138128 138628 138852 138841 138973 139733 141339 143500 145590 147165 148230 148886 148999 148496 147763 147302
52971 147302 147100 146743 146092 145362 144623 143739 142884 142507 142664 142881 142901 143060 143653 144320 144429 143775 142666 141615
52953 141615 141140 141496 142313 142800 142572 142001 141561 141191 140572 139679 138729 137908 137448 137637 138370 139034 139222 139268 139707
52934 139707 140501 141244 141819 142345 142717 142700 142298 141561 140315 138625 137248 136894 137146 136891 135777 134523 133678
52917 133678 132958 132032 131161 130597 130056 129333 128904 129251 129974 130292 130176 130273 130759 131020 130659 130192 130380 131267 132257
52898 132257 132912 133291 133573 133727 133672 133466 133115 132353 130869 128769 126602 124849 123591 122825 122813 123795 125400
52881 125400 126791 127558 128175 129359 131166 133042 134638 136200 138099 140267 142277 143823 144931 145755 146313
$$ packed form
53006A27008Q19P47P62M81P7Q6M78N85J04l94k94K38O85R42J194J362J210Q43
52988A36933O11N84N00K24j1J32P60J606K161K090J575J065O56J13n03p33m61
52971A47302k02l57o51p30p39q84q55l77J57K17K0J59N93O67J09o54j109j051
52953A41615m75L56Q17M87k28n71m40l70o19q93r50q21m60J89P33O64J88M6M39
52934A39707P94P43N75N26L72j7m02p37j246j690j377l54K52k55j114j254q45
52917A33678p20r26q71n64n41p23m29L47P23L18j16R7M86K61l61m67J88Q87R90
52898A32257O55L79K82J54n5k06l51p62j484k100k167j753j258p66j2R82J605
52881A25400J391P67O17J184J807J876J596J562J899K168K010J546J108Q24N58
$$ plain form
52866 146313 146431 145852 144463 142537 140645 139119 137619 135441 132386 129126 126541 124806 123296 121390 119193
52851 119193 117464 116932 117631 118809 119542 119539 119262 119191 119202 118879 118281 117970 118285 118947 119457 119549 119210 118587 117997 117661
52831 117661 117314 116495 115440 115208 116469 118480 119746 119544 118450 117548 117564 118628 120311 121813 122531 122592 122563
52814 122563 122637 122435 121605 120272 118804 117519 116736 116736 117444 118342 118852 118683 117796 116358 114827 113748 113252 112959
52796 112959 112544 112091 111717 111204 110355 109507 109281 109855 110777 111445 111524 110952 109866 108672 107969 108173 109157 110273
52778 110273 110812 110641 110384 110757 111629 112079 111546 110526 109791 109237 108130 106356 104715 103904 103882 104536 106258
52761 106258 109207 112403 114323 114517 114110 114600 116468 119024 121281 122795 123855 125015 126403 127586 128249
52746 128249 128762 129688 130832 131370 131048 130665 131043 131991 132769 133257 134028 135364 136762 137541 137535 137057 136507 136158
$$ packed form
52866A46313J18n79j389j926j892j526j500k178l055l260k585j735j510j906k197
52851A19193j729n32O99J178P33lk77p1J1l23n98l11L15O62N10R2l39o23n90l36
52831A17661l47q19j055k32J261K011J266k02j094r02J6J064J683J502P18O1k9
52814A22563P4k02q30j333j468j285p83%P08Q98N10j69q87j438j531j079m96k93
52796A12959m15m53l74n13q49q48k26N74R22O68P9n72j086j194p03K04R84J116
52778A10273N39j71k57L73Q72M50n33j020p35n54j107j774j641q11k2O54J722
52761A06258K949L196J920J94m07M90J868K556K257J514J060J160J388J183O63
52746A28249N13R26J144N38l22l83L78R48P78M88P71J336J398P79om78n50l49
$$ plain form
52728 136158 136112 136317 136681 137096 137272 136744 135380 133743 132566 131935 131422 130980 131080 131844 132665 133044 133324 134159
52710 134159 135587 137074 138186 138786 138814 138370 137849 137541 137152 136173 134702 133463 133002 133214 133653 133903 133577
52693 133577 132432 130698 129007 127841 127265 127192 127549 128037 128140 127697 127193 127179 127550 127700 127278 126495 125716 125056
52675 125056 124469 124045 124052 124647 125631 126554 127082 127207 127092 126838 126460 126004 125481 124803 123916 122969 122214 121804 121855 122499
52655 122499 123588 124501 124730 124620 125042 126237 127463 127961 127753 127176 126231 124904 123750 123473 124032 124683 124862
52638 124862 124611 124238 124043 124360 125342 126630 127599 128034 128189 128226 128072 127822 127674 127348 126229 124388 122804 122116
52620 122116 121768 120984 120043 119794 120274 120736 120847 120917 120874 120061 118445 117136 117113 118023 118890 119475 120209 121102 121600
52601 121600 121465 121099 120856 120591 120072 119410 118854 118496 118335 118418 118773 119355 120113 120885 121269 120952 120219 119802 120135
$$ packed form
52728A36158m6K05L64M15J76n28j364j637j177o31n13m42J00P64Q21L79K80Q35
52710A34159J428J487J112O00K8m44n21l08l89r79j471j239m61K12M39K50l26
52693A33577j145j734j691j166n76p3L57M88J03m43n04j4L71J50m22p83p79o60
52675A25056n87m24PN95R84R23N28J25j15k54l78m56n23o78q87r47p55m10N1O44
52655A22499J089R13K29j10M22J195J226M98k08n77r45j327j154k77N59O51J79
52638A24862k51l73j95L17R82J288R69M35J55L7j54k50j48l26j119j841j584o88
52620A22116l48p84r41k49M80M62J11P0m3q13j616j309k3R10Q67N85P34Q93M98
52601A21600j35l66k43k65n19o62n56l58j61Q3L55N82P58P72L84l17p33m17L33
$$ plain form
52582 120135 121023 122143 123431 124795 125832 126206 126051 125706 125235 124508 123596 122787 122314 122287 122759 123566 124219 124264
52564 124264 123702 122846 121855 120721 119593 118752 118249 117845 117369 116923 116701 116825 117334 118077 118663 118837 118949 119678
52546 119678 121204 122956 124343 125398 126431 127389 127936 128040 128069 128280 128560 128771 129083 129750 130715 131740 132856
52529 132856 134417 136532 138674 140088 140562 140544 140571 140853 141448 142489 143910 145249 146067 146517 147143 148166 149292
52512 149292 150194 150829 151175 151013 150170 148748 146905 144616 141897 139105 136734 134940 133496 132221 131213
52497 131213 130588 130154 129516 128473 127176 125866 124610 123440 122595 122375 122670 122917 122705 122231 121935 121875 121753
52480 121753 121407 120967 120614 120560 121220 122908 125240 127252 128313 128626 128714 128829 129045 129475 129983 130100 129651 129198
52462 129198 129316 129626 129191 127833 126461 125951 126217 126591 126701 126682 126802 127209 127872 128521 128805 128674 128509 128720
$$ packed form
52582A20135Q88J120J288J364J037L74j55l45m71p27r12q09m73k7M72Q07O53M5
52564A24264n62q56r91j134j128q41n03m04m76m46k22J24N09P43N86J74J12P29
52546A19678J526J752J387J055J033R58N47J04K9K11K80K11L12O67R65J025J116
52529A32856J561K115K142J414M74j8K7K82N95J041J421J339Q18M50O26J023J126
52512A49292R02O35L46j62q43j422j843k289k719k792k371j794j444j275j008
52497A31213o25m34o38j043j297j310j256j170q45k20K95K47k12m74k96o0j22
52480A21753l46m40l53n4O60J688K332K012J061L13Q8J15K16M30N08J17m49m53
52462A29198J18L10m35j358j372n10K66L74J10j9J20M07O63O49K84j31j65K11
$$ plain form
52444 128720 129362 130226 131087 131653 131555 130717 129680 129252 129859 131348 133338 135468 137458 139288 141373 144175
52428 144175 147472 150288 151855 152517 153453 155513 158426 161174 163029 164206 165498 167365 169506 171413 173144
52413 173144 175224 177783 180122 181291 180891 179188 176685 173824 170860 167762 164367 160890 158135 156807
52399 156807 156672 156779 156487 155938 155473 155054 154504 153934 153563 153311 152931 152474 152308 152666 153382 154102 154605 154877 155038
52380 155038 155282 155848 156962 158728 160981 163230 164941 166034 167019 168526 170631 172737 174107 174492 174220
52365 174220 173754 173273 172814 172679 173354 174839 176416 177505 178538 180429 183178 185624 186829 187130 187460 188124
52349 188124 188780 189256 189748 190358 191058 192099 193941 196677 199920 203298 206685 209918 212787 215534 218994
52334 218994 223951 230455 237895 245546 253008 260404 268310 277288 287351 298035 309013 320377 332220
$$ packed form
52444A28720O42Q64Q61N66r8q38j037m28O07J489J990K130J990J830K085K802
52428A44175L297K816J567O62R36K060K913K748J855J177J292J867K141J907J731
52413A73144K080K559K339J169m00j703k503k861k964l098l395l477k755j328
52399A56807j35J07k92n49m65m19n50n70l71k52l80m57j66L58P16P20N03K72J61
52380A55038K44N66J114J766K253K249J711J093R85J507K105K106J370L85k72
52365A74220m66m81m59j35O75J485J577J089J033J891K749K446J205L01L30O64
52349A88124O56M76M92O10P00J041J842K736L243L378L387L233K869K747L460
52334B18994M957O504P440P651P462P396P906Q978J0063J0684J0978J1364J1843
$$ plain form
52321 332220 344236 356006 367505 379156 391500 404967 419763 435701 452143 468293 483659
52310 483659 498192 512009 525068 537163 548154 558081 566913 574320 580008 584322 588142 591933 595231
52297 595231 597437 598757 599803 600451 599840 597558 594191 590484 586536 582195 577693 573445 569522 565782 562314
52282 562314 559338 556832 554652 552945 552069 552170 553092 554671 556878 559749 563413 568181 574383 582072 591021
52267 591021 600939 611540 622505 633559 644624 655812 667263 678968 690638 701751 711942 721385
52255 721385 730523 739272 746768 752112 755177 756530 756828 756545 755999 755179 753587 750577 745909 739858 732905
52240 732905 725594 718538 712167 706373 700624 694477 687844 680844 673686 666765 660615 655545 651373 647624
52226 647624 644022 640770 638291 636668 635445 634146 632914 632396 632999 634527 636590 638986 641514 643843 645911
$$ packed form
52321C32220J2016J1770J1499J1651J2344J3467J4796J5938J6442J6150J5366
52310D83659J4533J3817J3059J2095J0991R927Q832P407N688M314L820L791L298
52297E95231K206J320J046O48o11k282l367l707l948m341m502m248l923l740l468
52282E62314k976k506k180j707q76J01R22J579K207K871L664M768O202P689Q949
52267E91021R918J0601J0965J1054J1065J1188J1451J1705J1670J1113J0191R443
52255G21385R138Q749P496N344L065J353K98k83n46q20j592l010m668o051o953
52240G32905p311p056o371n794n749o147o633p000p158o921o150n070m172l749
52226F47624l602l252k479j623j223j299j232n18O03J528K063K396K528K329K068
$$ plain form
52211 645911 648231 651416 655524 660080 664599 668868 672981 677331 682263 687386 691553 693967 695040 695673
52197 695673 695961 695356 693925 692565 691755 690867 689141 686798 684666 683132 681960 680896 679889 678727 676975
52182 676975 674391 671204 667879 664726 661801 659058 656504 654231 652299 650589 648800 646693 644391 642439
52168 642439 641446 641527 642075 642153 641172 639178 636643 634196 632497 631952 632320 632781 632606 631663 630218 628568 627023
52151 627023 625872 625011 623916 622344 620834 620096 620072 620056 619535 618476 616946 615059 613260 612107 611726 611924
52135 611924 612852 615033 618754 623902 630378 637966 645811 652850 659176 666283 675502 686733 699128 712406
52121 712406 726754 741868 756985 771901 787261 803604 820560 837234 853137 868410 883160
52110 883160 896806 908383 917578 925173 932120 938373 943106 945953 947450 948174 948150 947275 945607 942790 937895
$$ packed form
52211F45911K320L185M108M556M519M269M113M350M932N123M167K414J073O33
52197F95673K88o05j431j360q10q88j726k343k132j534j172j064j007j162j752
52182F76975k584l187l325l153k925k743k554k273j932j710j789k107k302j952
52168F42439r93Q1N48P8r81j994k535k447j699n45L68M61j75r43j445j650j545
52151F27023j151q61j095j572j510p38k4j6n21j059j530j887j799j153l81J98
52135F11924R28K181L721N148O476P588P845P039O326P107R219J1231J2395J3278
52121G12406J4348J5114J5117J4916J5360J6343J6956J6674J5903J5273J4750
52110H83160J3646J1577R195P595O947O253M733K847J497P24k4q75j668k817m895
$$ plain form
52095 937895 930539 921747 913017 904772 896371 887399 878215 869297 860760 852688 845374 839029 833568 828819
52081 828819 824720 821344 819012 818316 819635 822632 826541 830999 836330 843113 851758 862302 874154 886092
52067 886092 897066 907090 916938 926925 936486 945033 952667 959766 966358 972199 977066 980626 982350 982017
52053 982017 980125 977445 974210 970020 964414 957276 948761 939110 928649 917781 906836 895887 884729
52040 884729 873086 860914 848432 835831 823061 810061 797011 784104 771271 758523 746428
52029 746428 735677 726096 716649 706673 696602 687123 678138 669090 659935 651151 642887 634719 626351 618032
52015 618032 610129 602650 595359 588068 580546 572352 563082 552824 542232 532042 522392 512547 501341
52002 501341 488105 473241 457887 443026 428908 415231 401660 388144 374866 362011 349641
$$ packed form
52095I37895p356q792q730q245q401q972r184q918q537q072p314o345n461m749
52081H28819m099l376k332o96J319K997L909M458N331O783Q645J0544J1852J1938
52067H86092J0974J0024R848R987R561Q547P634P099O592N841M867L560J724l33
52053I82017j892k680l235m190n606p138q515r651j0461j0868j0945j0949j1158
52040H84729j1643j2172j2482j2601j2770j3000j3050j2907j2833j2748j2095
52029G46428j0751r581r447r976j0071r479q985r048r155q784q264q168q368q319
52015F18032p903p479p291p291p522q194r270j0258j0592j0190r650r845j1206
52002E01341j3236j4864j5354j4861j4118j3677j3571j3516j3278j2855j2370
$$ plain form
51991 349641 337803 326707 316588 307350 298543 289890 281736 274709 269062 264601 261188 258898 257536
51978 257536 256385 254770 252781 251072 249947 248862 246945 243834 239867 235585 231286 227094 223186 219752
51964 219752 216807 214278 212290 211070 210503 210052 209361 208745 208738 209263 209596 209258 208653 208715 210116 212918 216760
$$ packed form
51991C49641j1838j1096j0119r238q807q653q154p027n647m461l413k290j362
51978B57536j151j615j989j709j125j085j917l111l967m282m299m192l908l434
51964B19752k945k529j988j220n67m51o91o16pN25L33l38o05O2J401K802L842
$$ [...]
##END NTUPLES=NMR SPECTRUM
##END=
