##TITLE=NES1069_159122.0009_002_9705601_bkJBSS0dfe
##JCAMPDX= 6.0         $$ Bruker NMR JCAMP-DX V2.0
##DATA TYPE= NMR SPECTRUM
##DATA CLASS= NTUPLES
##ORIGIN= BRUKER
##OWNER= Administrator
$$ 1.72 TOPSPIN		Version 2.1
$$ 2016-05-01 16:46:59.427 -0700  Administrator@X
$$ Compression mode = diff/dup
##.OBSERVE FREQUENCY= 400.02188249412
##.OBSERVE NUCLEUS= ^1H
##.ACQUISITION MODE= SIMULTANEOUS (DQD)
##.ACQUISITION SCHEME= undefined
##.AVERAGES= 8
##.DIGITISER RES= 22
##SPECTROMETER/DATA SYSTEM= spect
##.PULSE SEQUENCE= zg30
##.SOLVENT NAME= COFFEE_meoh
##.SHIFT REFERENCE= INTERNAL, COFFEE_meoh, 1, 14.98509
##AUDIT TRAIL= $$ (NUMBER, WHEN, WHO, WHERE, PROCESS, VERSION, WHAT)
$$ ##TITLE= Audit trail, TOPSPIN		Version 2.1
$$ ##JCAMPDX= 5.01
$$ ##ORIGIN= Bruker BioSpin GmbH
$$ ##OWNER= Administrator
$$ $$ E:\/data/COFFEE/nmr/NES1069_159122.0009_002_9705601_bkJBSS0dfe/10/pdata/1/auditp.txt
$$ ##AUDIT TRAIL=  $$ (NUMBER, WHEN, WHO, WHERE, PROCESS, VERSION, WHAT)
(   1,<2016-05-01 16:46:52.427 -0700>,<Administrator>,<X>,<go>,<TOPSPIN 2.1>,
      <created by zg
	started at 2016-05-01 16:45:46.255 -0700,
	POWCHK enabled, PULCHK disabled,
       configuration hash MD5:
       21 0F 79 D6 B3 7B B4 F6 88 20 88 DB 03 48 BD 9F
       data hash MD5: 64K
       A5 2B 54 8D 38 68 B5 F0 B7 5F FC D9 C3 FB A1 53>)
(   2,<2016-05-01 16:46:55.474 -0700>,<Administrator>,<X>,<proc1d>,<TOPSPIN 2.1>,
      <Start of raw data processing
       efp LB = 0 FT_mod = 6 PKNL = 1 PHC0 = 0 PHC1 = 0 SI = 32K 
       data hash MD5: 32K
       CA F6 A2 9A 81 8A F5 F9 4D FF 4B 51 6F 2B 37 EB>)
(   3,<2016-05-01 16:46:55.755 -0700>,<Administrator>,<X>,<proc1d>,<TOPSPIN 2.1>,
      <pk PHC0 = 95.28442 PHC1 = 0 
       data hash MD5: 32K
       DD 56 59 CF AA D2 A7 F2 0C B8 26 CD 4D 51 91 3A>)
(   4,<2016-05-01 16:46:55.864 -0700>,<Administrator>,<X>,<proc1d>,<TOPSPIN 2.1>,
      <abs ABSG = 1 
       data hash MD5: 32K
       8E CC 42 9D 45 C7 33 0A D9 FC 06 F4 8D 75 17 AE>)
(   5,<2016-05-01 16:46:55.927 -0700>,<Administrator>,<X>,<proc1d>,<TOPSPIN 2.1>,
      <abs ABSG = 2 
       data hash MD5: 32K
       B5 BA 93 6C CA F1 33 60 4E E9 34 29 F9 41 57 49>)
(   6,<2016-05-01 16:46:55.989 -0700>,<Administrator>,<X>,<proc1d>,<TOPSPIN 2.1>,
      <abs ABSG = 3 
       data hash MD5: 32K
       1B 5C 0F A6 0D 1D 0F BB 0D CD DE 3B C1 58 F1 AF>)
(   7,<2016-05-01 16:46:56.052 -0700>,<Administrator>,<X>,<proc1d>,<TOPSPIN 2.1>,
      <abs ABSG = 4 
       data hash MD5: 32K
       09 AF 5C B1 0D 3D 99 78 B0 6D 2F 2A F8 04 A5 CE>)
(   8,<2016-05-01 16:46:56.114 -0700>,<Administrator>,<X>,<proc1d>,<TOPSPIN 2.1>,
      <abs ABSG = 5 
       data hash MD5: 32K
       7C F8 91 98 2A B3 CC 7C C7 DB 67 3C D2 2C 6B 01>)
$$ ##END=
$$ 
$$ $$ hash MD5
$$ $$ 5E 6F 00 48 03 73 58 53 EC 0B B3 EC AD E5 C9 57
##$RELAX= 
##$RELAX= 
##$RELAX= 
##$RELAX= 
##$RELAX= 
##$RELAX= 
##$RELAX= 
$$ Bruker specific parameters
$$ --------------------------
##$DU= <E:\>
##$EXPNO= 10
$$ [...]
##$TP= (0..7)
150 150 150 150 150 150 150 150
##$TP07= 0
##$TPNAME0= <>
##$TPNAME1= <>
##$TPNAME2= <>
##$TPNAME3= <>
##$TPNAME4= <>
##$TPNAME5= <>
##$TPNAME6= <>
##$TPNAME7= <>
##$TPOAL= (0..7)
0.5 0.5 0.5 0.5 0.5 0.5 0.5 0.5
##$TPOFFS= (0..7)
0 0 0 0 0 0 0 0
##$TUNHIN= 0
##$TUNHOUT= 0
##$TUNXOUT= 0
##$USERA1= <user>
##$USERA2= <user>
##$USERA3= <user>
##$USERA4= <user>
##$USERA5= <user>
##$V9= 5
##$VALIST= <valist>
##$VCLIST= <CCCCCCCCCCCCCCC>
##$VD= 0
##$VDLIST= <DDDDDDDDDDDDDDD>
##$VPLIST= <PPPPPPPPPPPPPPP>
##$VTLIST= <TTTTTTTTTTTTTTT>
##$WBST= 2048
##$WBSW= 25
##$XGAIN= (0..3)
0 0 0 0
##$XL= 0
##$YL= 0
##$YMAX_a= 614394
##$YMIN_a= -523609
##$ZGOPTNS= <>
##$ZL1= 120
##$ZL2= 120
##$ZL3= 120
##$ZL4= 120
##$ABSF1= 14.98509
##$ABSF2= -5.573092
##$ABSG= 5
##$ABSL= 3
##$ALPHA= 0
##$AQORDER= 0
##$ASSFAC= 0
##$ASSFACI= 0
##$ASSFACX= 0
##$ASSWID= 0
##$AUNMP= <proc_prof1d_extract_pilot.lims>
##$AXLEFT= 0
##$AXNAME= <>
##$AXNUC= <1H>
##$AXRIGHT= 0
##$AXTYPE= 0
##$AXUNIT= <>
##$AZFE= 0.1
##$AZFW= 0.1
##$BCFW= 0
##$BC_mod= 0
##$BYTORDP= 0
##$COROFFS= 0
##$CY= 15
##$DATMOD= 1
##$DC= 0
##$DFILT= <>
##$DTYPP= 0
##$F1P= 0
##$F2P= 0
##$FCOR= 0.5
##$FTSIZE= 32768
##$FT_mod= 6
##$GAMMA= 0
##$GB= 0
##$INTBC= 1
##$INTSCL= 1
##$ISEN= 128
##$LB= 0
##$LEV0= 0
##$LPBIN= 0
##$MAXI= 10000
##$MC2= 0
##$MEAN= 0
##$ME_mod= 0
##$MI= 0
##$NCOEF= 0
##$NC_proc= -8
##$NLEV= 6
##$NOISF1= 0
##$NOISF2= 0
##$NSP= 0
##$NTH_PI= 0
##$NZP= 0
##$OFFSET= 14.98509
##$PC= 1
##$PHC0= 95.28442
##$PHC1= 0
##$PH_mod= 1
##$PKNL= yes
##$PPARMOD= 0
##$PPDIAG= 0
##$PPIPTYP= 0
##$PPMPNUM= 2147483647
##$PPRESOL= 1
##$PSCAL= 4
##$PSIGN= 0
##$PYNMP= <proc.py>
##$REVERSE= no
##$SF= 400.02
##$SI= 32768
##$SIGF1= 0
##$SIGF2= 0
##$SINO= 400
##$SIOLD= 32768
##$SPECTYP= <>
##$SREGLST= <1H.CDCl3>
##$SSB= 0
##$STSI= 32768
##$STSR= 0
##$SW_p= 8223.68421052631
##$SYMM= 0
##$S_DEV= 0
##$TDeff= 65536
##$TDoff= 0
##$TI= <>
##$TILT= no
##$TM1= 0
##$TM2= 0
##$TOPLEV= 0
##$USERP1= <user>
##$USERP2= <user>
##$USERP3= <user>
##$USERP4= <user>
##$USERP5= <user>
##$WDW= 1
##$XDIM= 32768
##$YMAX_p= 354162300
##$YMIN_p= -647964
##$CURPLOT= <Network HP LaserJet P1505>
##$CURPRIN= <$Network HP LaserJet P1505>
##$DFORMAT= <normdp>
##$LAYOUT= <+/1D_H.xwp>
##$LFORMAT= <normlp>
##$PFORMAT= <normpl>
##$SURQMSG= 1
$$ End of Bruker specific parameters
$$ ---------------------------------
##NTUPLES= NMR SPECTRUM
##VAR_NAME=  FREQUENCY,     SPECTRUM/REAL,   SPECTRUM/IMAG
##SYMBOL=    X,             R,               I
##VAR_TYPE=  INDEPENDENT,   DEPENDENT,       DEPENDENT
##VAR_FORM=  AFFN,          ASDF,            ASDF
##VAR_DIM=   32768,         32768,           32768
##UNITS=     HZ,            ARBITRARY UNITS, ARBITRARY UNITS
##FACTOR=    0.250966925370066, 1,           1
##FIRST=     8223.43324360094, -86744,       40773
##LAST=      0,             -253544,         -51085
##MIN=       0,             -647964,         0
##MAX=       8223.43324360094, 354162300,    0
$$ Real data points
##PAGE= N=1
##DATA TABLE= (X++(R..R)), XYDATA
$$ [...]
19520b10448A36362b4702A68081p619a53090j71242d3654H4392c6574I1886M9458
19509A41344o4145c03559A09537h6784A59945P6288a30150L353O0522L711k01748
19498b64312k6267B31402h0346j51563h0181k02469a7951l4078k26642A04852
19487a31666d9212A02233f402j0389j95259J288k48538A5133K55579a25659K4525
19476a01134j22144A30503J46796I5933a91819O665D2444a43824k63433A57630
19465e2346p7317j28339k8068a8757B14077F547J41979p2180a81688D9148b99219
19453D6297b5705j04896B15071L8920g4923j06133I2390b40206E1971i2359A87988
19441A87896a12183q3519M6315D7105a17907k27911b4545o8617E3547a80377b0193
$$ plain form
19520 -210448 136362 -24702 168081 160462 -153090 -324332 -43654 84392 -36574 91886 141344
19509 141344 77199 -303559 109537 -86784 159945 236233 -130150 -126797 -66275 -62564 -264312
19498 -264312 -290579 231402 -80346 -231909 -80181 -282650 -17951 -52029 -278671 104852
19487 -131666 -49212 102233 -6402 -16791 -212050 -210762 -459300 15133 270712 -125659 -101134
19476 -101134 -223278 130503 277299 95933 -191819 -185154 42444 -143824 -407257 157630
19465 -52346 -129663 -258002 -286070 -18757 214077 6547 148526 76346 -181688 49148 -299219
19453 46297 -25705 -130601 215071 253991 -74923 -181056 92390 -240206 51971 -92359 187988
19441 187896 -112183 -195702 -149387 47105 -117907 -345818 -24545 -93162 53547 -180377 -20193
19429a04927d6003C17165a03027H0061C0368a99586K3329j1280e3071B1914O6290
19418H8204k533b0487q1031N716a1206A14382a47063A8913f2797j39392L0252
19407a71937N3440e998k14724O548e0662A92272a90310A41340e6002j26875j23545
19396c06422E0435d8442j40254j6832c4899B24842g4675F2491f28695d0195m0325
19385h0520l17499g6458D2280J63844l4242b67969e2908A47218c851l88291c0810
19373A58804c155m6258a2539j98174H6294a31688d3895B08114I9281c27486H5717
19361A12187a83578E7346K35128A4961b64478j4956F9574a92141A19717b70004
19350b92547A77018b71728h628B8340J1167a90881j6465G0832g7926E1528f5685
$$ plain form
19429 -104927 -46003 317165 -103027 80061 30368 -199586 -176257 -187537 -53071 21914 88204
19418 88204 85671 -20487 -101518 -95802 -11206 114382 -147063 18913 -62797 -202189 -171937
19407 -171937 -118497 -5998 -220722 -214174 -50662 192272 -190310 141340 -56002 -182877 -306422
19396 -306422 50435 -48442 -188696 -205528 -34899 224842 -74675 62491 -628695 -40195 -80520
19385 -80520 -398019 -76458 42280 206124 171882 -267969 -52908 147218 -3851 -392142 -30810
19373 158804 -3155 -49413 -12539 -210713 86294 -131688 -43895 208114 99281 -327486 85717
19361 112187 -183578 57346 292474 14961 -264478 -279434 69574 -192141 119717 -270004
19350 -292547 177018 -271728 -8628 28340 39507 -190881 -207346 70832 -77926 51528 -65685
19338a67113K7082E960i9091o5011r9364R0516i051j7894B4636b90479C4986g8573
19325C0770b472A07710b10123k8546i4981j9197H9403f3286E2763a89244O903
19314a82341d9755A36906c57234H5476a68753B64746H6476a47831m7946A13839
19303D76J48592b21608Q7041A49523E8634k3374b49390A51213J18137c89294A9879
19291a20415E0847a7518A5724c95975D73954a78906I3063b2151q3460n6390B66034
19279A77057d42295h8009b9316o6149a6859D1449N2628j3900k7100c43247H5247
19267A61850a79918h4527K6954A76670a13294C9062p973b40918a16239k5964B1509
19255g5925C4917d4972c20n5617G4600B9832a14711B5522c52372A36482a08030
$$ plain form
19338 -167113 -140031 5960 -99091 -164102 -263466 -172950 -9051 -26945 24636 -290479 34986 -78573
19325 30770 -2472 107710 -210123 -238669 -94981 -114178 89403 -63286 52763 -189244 -182341
19314 -182341 -49755 136906 -357234 85476 -168753 264746 86476 -147831 -195777 113839
19303 476 149068 -221608 -134567 149523 58634 35260 -249390 151213 269350 -389294 19879
19291 -120415 50847 -17518 15724 -395975 473954 -178906 93063 -22151 -105611 -162001 266034
19279 177057 -442295 -88009 -29316 -95465 -16859 41449 94077 80177 53077 -343247 85247
19267 161850 -179918 -84527 -57573 176670 -113294 39062 31089 -240918 -116239 -142203 21509
19255 -75925 34917 -44972 -320 -55937 74600 29832 -114711 25522 -352372 136482 -108030
19243b50257O9491A22671i5305C6587o802Q7912C5170c47868b5932A67019n9335
19232A07684J1227L5746b05462j25311B847e583j98461b7162A71926m5104F2008
19220a18646k9466o4171k0109g5234L5970o4889C4997b59682H554L1847c11582
19208E2263f7939l55299a27095e5305j4810E8353a72937N1180D0636a88649j8813
19197b07462A51758m7048Q1819F434a24816p090K7109k69114e2105r0582D06403
19185I7329O8241e8959B65916A6945b15601a07230A41982d23527J83237F4981
19174G5041d3048r7543h501j29994Q776M7696l34736G2680h5030H6513f4637b6054
19161b98146i690F9978i9851j98598a04956B90714A05258a33900B11543f5886
$$ plain form
19243 -250257 -180766 122671 -95305 36587 29785 117697 35170 -347868 -25932 167019 107684
19232 107684 118911 154657 -205462 -330773 2847 -5583 -204044 -27162 171926 126822 62008
19220 -118646 -148112 -212283 -232392 -75234 -39264 -104153 34997 -259682 8554 40401 -311582
19208 52263 -67939 -423238 -127095 -55305 -70115 58353 -172937 -121757 40636 -188649 -207462
19197 -207462 151758 104710 186529 6434 -124816 -131906 -104797 -373911 -52105 -142687 406403
19185 97329 165570 -58959 265916 16945 -215601 -107230 141982 -423527 -240290 64981
19174 75041 -43048 -140591 -8501 -138495 -129719 -82023 -416759 72680 -85030 86513 -64637 -26054
19161 -298146 -9690 69978 -99851 -298449 -104956 290714 105258 -133900 211543 -65886
19150b4749j39933N4167A48237g9990b4568j10925I1878d5547A17830M1540a23097
19138A209h9441A34167g908l3002l0211C6785L8549A0627a40558J3252j65804
19127b93110H0462b15712B15291b26278B2859a75917l53033D5614e0250H5062
19116C35314E3715a66822j12029A22118K96784i0872J0606k25705a21634A21664
19105b60172H6803J05269b8972j6196j76893c2764E167J05613c0090k6059D5554
19093a82550I8623e3540k44151c1373n7362a3237B1433b5132n9201c8332A60186
19081i3410A33941h2260l01435a10229k36611p7963H393c57106B80151a04837
19070A83722a51097r5665K4303i0455P295c2941m4519B2830e0580A1897J34505
$$ plain form
19150 -24749 -164682 -110515 148237 -79990 -24568 -135493 91878 -45547 117830 159370 -123097
19138 1209 -89441 134167 -7908 -40910 -71121 36785 75334 10627 -140558 -127306 -293110
19127 -293110 80462 -215712 215291 -226278 22859 -175917 -528950 45614 -50250 85062
19116 335314 53715 -166822 -278851 122118 418902 -90872 -80266 -305971 -121634 121664
19105 -260172 86803 192072 -28972 -45168 -222061 -32764 5167 110780 -30090 -56149 45554
19093 -182550 98623 -53540 -297691 -31373 -88735 -13237 21433 -25132 -84333 -38332 160186
19081 -93410 133941 -82260 -383695 -110229 -346840 -424803 8393 -357106 280151 -104837
19070 183722 -151097 -246762 -222459 -90455 -83160 -32941 -77460 22830 -50580 11897 146402
19059A46402E1518M2302a19032q4119o9387a29373j1457C65216a54873I8458K9457
19048A27915b672H2964p350K58253P2488f195D93195a0005j50200j70507d8418
19036d13851C4542J34334a46336C1245b76984A09180A6779f349I0461e4545D16130
19024C24730a46531q1775J04157a0098j36560O2260F0238d9271j08154M7564r714
19013a19575a9454D4619a40855E2924L7346b9019o274j50029j69713F6777a71114
19001E8601d29882a60104a8533l92964I3488c4305j51640Q2407A83242d00778
18990F9702B2262L9171d6737j5670D2418B551a45194D8659g8486a1480B46468
18978b88392G5531e03671a82802B71307r3143d6371a9856O199D9294a46131a0272
$$ plain form
19059 146402 51518 93820 -119032 -203151 -272538 -129373 -140830 365216 -154873 98458 127915
19048 127915 -2672 82964 75614 333867 406355 -6195 493195 -10005 -160205 -330712 -48418
19036 -413851 34542 168876 -146336 31245 -276984 109180 16779 -6349 90461 -54545 416130
19024 324730 -146531 -228306 -124149 -10098 -146658 -84398 60238 -49271 -157425 -109861 -119575
19013 -119575 -19454 44619 -140855 52924 90270 -29019 -35293 -185322 -355035 66777 -171114
19001 58601 -429882 -160104 -18533 -411497 93488 -34305 -185945 -103538 183242 -400778
18990 69702 22262 61433 -46737 -62407 42418 2551 -145194 48659 -78486 -11480 246468
18978 -288392 75531 -503671 -182802 271307 178164 -46371 -19856 -13657 49294 -146131 -10272
18966a76461B38224a26179F0537B2228e8773k39840A78435F9069g6646A0309j551
18955H758b7005A84662o3364O8986n6506D295J40511D9781c54011d8928p8043
18944a26971r8111G7596B5812b6005j35231K1508p1108E4457a2025A6330J53310
18933A69640M6432L680f2510o0585J8760Q102A45708b18733I3497a63373l6407
18922a99780b3917i211m21327b05581K9027B75820g0305H8464K4062d4543L051
18911d1492A66940f6531A5450a18927o250A08902i1284q9924r7427L7664K5153
18900b15818A02552c6536p238j32790A32248a5089r2784b7809A52933j9000a75131
18888b9397m75608B9716a55232O7081A86b80792A07646i5117m0291o8649l37777
$$ plain form
18966 -176461 238224 -126179 60537 22228 -58773 -298613 178435 69069 -76646 10309 8758
18955 8758 -27005 184662 121298 190284 133778 4295 144806 49781 -354011 -48928 -126971
18944 -126971 -225082 77596 25812 -26005 -161236 -139728 -210836 54457 -12025 16330 169640
18933 169640 216072 219752 -62510 -123095 -104335 -96233 145708 -218733 93497 -163373 -199780
18922 -199780 -23917 -9211 -430538 -205581 -176554 275820 -70305 88464 112526 -44543 -41492
18911 -41492 166940 -66531 15450 -118927 -125177 108902 -91284 -181208 -278635 -240971 -215818
18900 -215818 102552 -36536 -43774 -176564 132248 -15089 -107873 -27809 152933 133933 -175131
18888 -29397 -505005 29716 -155232 -88151 186 -280792 107646 -95117 -135408 -204057 -541834
18877e41834b29878E1275D88a40678B08848n3221P779d6477H6441i3863a3086
18865d1406A34273K3853J19868a81238A11109b65740D4408b15971f933j39853
18855a46786k30724A04538P2456b47902J09415f6267A85311H3838a21436a59n7066
18844e7225K1347A60801b306D765a20456j55424A25390a19498F2063a23409C1442
18832C0799l569c25720G8579c07448H6513O36a12560j0078a7857B8074L5337N4526
18820A17937i2630j23006I8365l1967b17477a03212A31850a43562b5993j3735
18810c9728j73369F2585a02480F6509K36411b92660A73372a05663q7732q1747
18800b75142a8635G6618a19258o4057B46914I6860A587J98401i0043j55542A54435
$$ plain form
18877 -541834 -229878 51275 488 -140678 208848 155627 163406 -46477 86441 -93863 -13086
18865 -41406 134273 158126 277994 -181238 111109 -265740 44408 -215971 -6933 -146786
18855 -146786 -377510 104538 176994 -247902 -138487 -66267 185311 83838 -121436 -159 -57225
18844 -57225 -35878 160801 -2306 4765 -120456 -275880 125390 -119498 62063 -123409 31442
18832 30799 27230 -325720 78579 -307448 86513 87149 -112560 -122638 -17857 28074 63411 117937
18820 117937 -92630 -215636 98365 66398 -217477 -103212 131850 -143562 -25993 -39728
18810 -39728 -213097 62585 -102480 66509 302920 -292660 173372 -105663 -193395 -275142
18800 -275142 -18635 76618 -119258 -183315 246914 96860 1587 199988 -90043 -245585 154435
18788a03207B1013g6458q3695E6453L41261e0986q9757A40325a46239A14528a33894
18776B5757c18149a01685q7506A55066a24961k7882j53024d9542k00988g4713
18765F8015A4803b25918o6724B22179f8959A09018c9920C1502N6644C5244p694
18754B7550i7106k70139D8932b7108k77723h0942L4759E0173j5068c70469c2002
18742g8622A68549n5537b68142I5089J02582m9074e335A19634f6236E6260i3714
18730a1607k50033e6920k45097B4601b9456g548H3555d5191B36165c8539H4866
18718D06222A71035Q4933c60834A89698a85180D572K9734b22093H0548e6725k82999
18707c39724C13801G1200M5429c11809J2252e6333J339j43982g6316k4996B7812
$$ plain form
18788 -103207 21013 -76458 -160153 56453 397714 -50986 -140743 140325 -146239 114528 -133894
18776 25757 -318149 -101685 -189191 155066 -124961 -152843 -305867 -49542 -250530 -74713
18765 68015 14803 -225918 -292642 222179 -68959 109018 -39920 31502 88146 35244 27550
18754 27550 -97106 -367245 48932 -27108 -304831 -80942 -46183 50173 35105 -370469 -32002
18742 -78622 168549 113012 -268142 95089 197671 148597 -5335 119634 -66236 56260 -93714
18730 -11607 -261640 -56920 -302017 24601 -29456 -7548 83555 -45191 236165 -38539 84866
18718 406222 171035 255968 -360834 189698 -185180 4572 34306 -222093 80548 -56725 -339724
18707 -339724 313801 71200 116629 -311809 -299557 -56333 -54994 -198976 -76316 -101312 27812
18695c8372k1806G8535O5759c15725A35542a28276m6188C9553b816j47824O8705
18684h1935p0985A20461l8073j453b06886B39647b03613D0566o700c09133J41416
18673a67717B6668J45044a78186n7750h9749A1643a64305e4288A95032E5478J46123
18662B01601B711f9306j92404b8378C6766c8352A10596a5925j67285F7968o860
18651F1108c61702J62877k13533b8116B36177a98778e9003D3148a21503A36847
18640e3962k07387I545P8605l0716a23211A00701d00753R7953J17879F9070C0752
18628a5657r4599j55244P2161A77293b10173O669A74390a69457Q885c6073k00843
18617b36916A79229i1439d0011E2909b19668R5184O952J6049j34281a10479M9735
$$ plain form
18695 -38372 -60178 78535 144294 -315725 135542 -128276 -174464 39553 -2816 -150640 -81935
18684 -81935 -152920 120461 82388 80935 -206886 239647 -203613 40566 33866 -309133 -167717
18673 -167717 26668 171712 -178186 -235936 -89749 11643 -164305 -54288 195032 55478 201601
18662 201601 2711 -69306 -261710 -28378 36766 -38352 110596 -15925 -183210 67968 61108
18651 61108 -361702 -198825 -412358 -28116 236177 -198778 -59003 43148 -121503 136847
18640 -53962 -261349 9545 88150 57434 -123211 100701 -400753 -302800 -184921 69070 30752
18628 -15657 -110256 -265500 -193339 177293 -210173 -203504 174390 -169457 -160572 -36073 -236916
18617 -236916 179229 -91439 -40011 52909 -219668 -124484 -117532 -101483 -235764 -110479 -60744
18606f0744l95474J86172e0620j16675m8894A86838a26898f0606C2198a89943
18595a12835N1167k72245A19902L0588c2528C4131J60286a6285l0879a2490A15796
18583A19865K7237b64753a8888A5133c75060A63000a69838f3969A0254a58733
18572A3784a28751m8646K5923j2980m4330A6425a19276g672C08959c64553A62833
18560B0324d1493j15614A85775g6903J1181A59620a34A3208N6819a55012O4015
18549i0997j3400A8549e7315G7501P9954m4916d8006A31560n3418g0692J1300
18538e9392r400B8833D887N790J7044Q628h9589k993j9897n5525P2970C14961
18525a97571A34313e7523j04861M197f0428B72567f7832J7029c847j18667C7568
$$ plain form
18606 -60744 -456218 -270046 -50620 -167295 -216189 186838 -126898 -60606 32198 -189943
18595 -112835 -61668 -333913 119902 150490 -32528 34131 194417 -16285 -47164 -12490 115796
18583 119865 147102 -264753 -18888 15133 -375060 163000 -169838 -63969 10254 -158733
18572 13784 -128751 -177397 -151474 -164454 -208784 16425 -119276 -7672 308959 -364553 162833
18560 20324 -41493 -157107 185775 -76903 -65722 159620 -134 13208 70027 -155012 -90997
18549 -90997 -104397 18549 -57315 77501 157455 112539 -48006 131560 78142 -70692 -59392
18538 -59392 -68792 28833 4887 10677 27721 36349 -89589 -92582 -112479 -168004 -95034 314961
18525 -197571 134313 -57523 -162384 -158187 -60428 272567 -67832 -50803 -3847 -122514 37568
18513a84395B35171G928K17511b07363q1472J06074j04173I4524a19164b1552
18502I0101c4862r0418j38764F6865J00453c3614K571G5539a7851j24317e3830
18490b31582J850A81532g6355L7143q7250K1150k9984M4908A63627a37287q833
18479a46120B83946a97834B4440J16434D9946c4115j31527j0965C32149a98265
18468e3609k23183C8212a21714d0855q9298p7885A26391b24268A06340K70767
18458C77107a51051B53310b39960f0933E2839c46223B34816a88267E3856b28415
18447e4372A97417M9216a57366r2349d4660k2953m3052B24841D3759a88053J4823
18436a73230B54359a65301b6029C25650a22335n6326F1683a80945d732G2157A5459
$$ plain form
18513 -184395 235171 7928 225439 -207363 -288835 -182761 -286934 94524 -119164 -21552
18502 90101 -34862 -125280 -264044 66865 167318 -33614 -31043 75539 -17851 -142168 -53830
18490 -231582 -229732 181532 -76355 -39212 -126462 -105312 -135296 -90388 163627 -137287 -146120
18479 -146120 283946 -197834 24440 140874 49946 -34115 -165642 -176607 332149 -198265
18468 -53609 -276792 38212 -121714 -40855 -130153 -208038 126391 -224268 106340 377107
18458 377107 -151051 253310 -239960 -60933 52839 -346223 234816 -188267 53856 -228415
18447 -54372 197417 246633 -157366 -249715 -44660 -67613 -110665 224841 43759 -188053 -173230
18436 -173230 254359 -165301 -26029 325650 -122335 -178661 61683 -180945 -4732 72157 15459
18424I3524i0508j48196F4001g7295L4396J3896j42605B02678i2991K7155A23417
18412C1597K40818a81014A02171l2760g5629A97356M5667i2992d0076D0888a25218
18400d2252C3408c84587B51657E1820r681a12450j03858d171l4479A10896a65716
18388A75601d1633p4003q4552B6610K3162b34648I2403e2209j11566A70172Q5611
18377B55783c58845B30252G4146e3220r8881B610J8099G576b06498E4972k4396
18366C0576d6319C11287a97634e7929l825b5679k25127i7758h140j45737j25181
18355b79058Q0696G2898L7912a82287Q9864A6911J97770j3890f5284B17471e1444
18343a75520A1462c9300j57646C08169a02306F8263M4352b0555k36928A0243J1821
$$ plain form
18424 93524 -90508 -238704 64001 -77295 -42899 -29003 -171608 202678 -92991 -65836 123417
18412 31597 272415 -181014 102171 69411 -75629 197356 243023 -92992 -40076 40888 -125218
18400 -42252 33408 -384587 251657 51820 42139 -112450 -216308 -4171 -38650 110896 -165716
18388 175601 -41633 -115636 -200188 26610 49772 -234648 92403 -52209 -163775 170172 255783
18377 255783 -358845 230252 74146 -53220 -152101 2610 20709 7576 -206498 54972 30576
18366 30576 -46319 311287 -197634 -57929 -61754 -25679 -250806 -97758 -8140 -153877 -279058
18355 -279058 -198362 72898 110810 -182287 -92423 16911 214681 200791 -65284 217471 -51444
18343 -175520 11462 -39300 -196946 308169 -102306 68263 112615 -20555 -257483 10243 22064
18332B2064P0703i9797K9309J4686b0117A90087L5255I1735b8073j34996j20052
18321b83121B3972b27362k32371C9950b47665A01021L5705J10960k824a33928
18310C3137b12016N5856q2347A73646a44835H4282l4349b15036m7077H044K45606
18299B53650a99957i6859E0026G095J08682a17814p6849h2494F7602c87106a3190
18287h7051j19154a6647m4807B9410a248p3229b1230j66138I3023b96263A93635
18275a68799j14337a32250A31365C7227K47771C0510c9164A17098b21312E1412
18264B41965c03712f7685G0245J32956c5321G6516g8884j30535l7989R0253j66419
18253c23574g3934j80816J22907A77593l5192a42592A1306h9703j28146A81728
$$ plain form
18332 22064 92767 -99797 -70488 -55802 -20117 190087 225342 91735 -28073 -163069 -283121
18321 -283121 23972 -227362 -459733 39950 -247665 101021 136726 247686 244862 -133928
18310 33137 -212016 -156160 -238507 173646 -144835 84282 49933 -215036 -262113 8044 253650
18299 253650 -199957 -96859 50026 7095 115777 -117814 -194663 -82494 67602 -387106 -13190
18287 -87051 -206205 -16647 -61454 29410 -1248 -74477 -21230 -187368 93023 -296263 193635
18275 -168799 -283136 -132250 131365 37227 284998 30510 -39164 117098 -221312 51412
18264 241965 -303712 -67685 70245 203201 -35321 76516 -78884 -209419 -247408 -157155 -323574
18253 -323574 -73934 -254750 -131843 177593 142401 -142592 11306 -89703 -217849 181728
18242H1712a25559A55237f4520A43354c84317A58617a04815o6271O771O2143A48225
18230h6300B51377l0363q7164a33920A43870b37478A0987e4829o5740l304r9886
18219b23759B2879h4981p8348A37456K2918F3107R497j7275c93685A72168O1129
18208B33297F2494b98887A62425N9359i2032B91237c06332f516B09062K6076a76156
18196C78887j76532H4027m1899a8840A70922G3525J54916C2169d1316j29791K2250
18185a48857m80f3206J4842l7897A29260g3432b2217j76844i332m5988b7516C7355
18172A4440b76027B51708C678a30107C5738O1284d06974B79744m2156a82702K8400
18161a54302k631C160b98070B76786g2515k119A72012a00442n7183j14899J06047
$$ plain form
18242 81712 -125559 155237 -64520 143354 -384317 158617 -104815 -171086 -164315 -102172 148225
18230 -86300 251377 221014 133850 -133920 143870 -237478 10987 -54829 -120569 -123873 -223759
18219 -223759 22879 -84981 -163329 137456 160374 63107 72604 55329 -393685 172168 233297
18208 233297 62494 -298887 162425 221784 -92032 291237 -306332 -6516 209062 235138 -176156
18196 378887 202355 84027 42128 -18840 170922 73525 228441 32169 -41316 -171107 -148857
18185 -148857 -149337 -63206 -48364 -86261 129260 -73432 -22217 -199061 -9332 -55320 -27516 37355
18172 14440 -276027 251708 3678 -130107 35738 97022 -406974 279744 237588 -182702 -154302
18161 -154302 -156933 3160 -298070 276786 -72515 -74634 172012 -100442 -157625 -272524 -166477
18150a66477F1214c8567C9019b9476J0853B86254j19338o6258j0225m5214b58475
18138A47432h801C12431e9219b3614l07861B43638r7644a1824E0352c09554A31166
18126d6080a3930A02286a57730j32054B60397A15085a06383a6827l41736G1435
18115a44330A75403b29178N0648F5028e2827F9711e9173A18165J60994a90415
18104D2124a25308B76145D0311g9861k13256G2255b54277d7557D10533a11160
18093b70592B2839K83126b41777a3267r3959k10202A3289a16158k99180A23030
18082i61D0482f4540A69782G5218B4770G480c46532A04177a68497F0360F695e5463
18069a42516j64005A09793L3455b40518E3886J28349J8279a77360Q1220B19889
$$ plain form
18150 -166477 61214 -38567 39019 -29476 -18623 286254 166916 100658 90433 45219 -258475
18138 147432 -8801 312431 -59219 -23614 -331475 243638 145994 -11824 50352 -309554 131166
18126 -46080 -13930 102286 -157730 -289784 260397 115085 -106383 -16827 -358563 71435
18115 -144330 175403 -229178 -178530 65028 -52827 69711 -59173 118165 279159 -190415
18104 42124 -125308 276145 40311 -79861 -293117 72255 -254277 -47557 410533 -111160
18093 -270592 22839 305965 -241777 -13267 -107226 -317428 13289 -116158 -415338 123030
18082 -961 40482 -64540 169782 75218 24770 7480 -346532 104177 -168497 60360 6695 -55463
18069 -142516 -306521 109793 143248 -240518 53886 182235 200514 -177360 -96140 219889
18058a36382J6204A056J67768a72894r4329i7748A27547M7131J2246a60179D4258
18046B22e8740j17231Q4227B1374a7906C27842d9173A21403k6404b11534H7566
18034C4084J0771J6302J0696a1721B07028a70267f3511F5656b90094A98350d7825
18022a97229A66121B4989M07160b79009D6589a06461I1011J18688a41286o298
18012a47584B54374D5779N923B1168O378A021L22388E4060b73270A18613K622
18001A21235b0498A35326i5697B72825B665J96154D3883b1094j40414j21113a9636
17989a32980l14234a98326B78752A10425P1529i5524K0042n3591G8718b5921j20161
17978a46082G8876j4415P6743c8256k37790H7941N2373e0187j19405N7163k05239
$$ plain form
18058 -136382 -120178 1056 168824 -172894 -267223 -97748 127547 174678 186924 -160179 44258
18046 222 -58740 -175971 -91744 21374 -17906 327842 -49173 121403 94999 -211534 87566
18034 34084 44855 61157 71853 -11721 207028 -170267 -63511 65656 -290094 198350 -47825
18022 -197229 166121 24989 432149 -279009 46589 -106461 91011 209699 -141286 -147584
18012 -147584 254374 45779 51702 21168 27546 1021 323409 54060 -273270 118613 121235
18001 121235 -20498 135326 -95697 272825 2665 198819 43883 -21094 -161508 -282621 -19636
17989 -132980 -447214 -198326 278752 110425 181954 -95524 -75482 -129073 78718 -25921 -146082
17978 -146082 78876 64461 141204 -38256 -276046 87941 140314 -50187 -169592 -112429 -317668
17967c17668J21548a5115G7476a50403G1568K00406e5006a2000p5872A39956N45
17956A40501J62349c65928B82801e3789B99174G6859N586b91552A35788m0114
17946I5674K141a34361E8526f7481A7354b16523G4461a02691d3906M553B3038
17934C20619a75885A12486d4833H4404J3794O8572b07496D484K10299F7773b92720
17922a3972j2078C49100c27239b5456j7688j28453C65043a1448F8721B4800a67832
17910B53050n0198a07942H10L6431a98995E5015d0846p3367C4730O0403A9028
17898a17541K3928F3073c72013a55429C0408b55817A77538a5050C38750c3890
17887A97662C0927a86765M8572N2536B61901a82113I999a292A44553c1280F3282
$$ plain form
17967 -317668 -196120 -15115 77476 -150403 71568 271974 -55006 -12000 -87872 139956 140501
17956 140501 302850 -365928 282801 -53789 299174 76859 82445 -291552 135788 95674
17946 95674 97815 -134361 58526 -67481 17354 -216523 74461 -102691 -43906 -39353 23038
17934 320619 -175885 112486 -44833 84404 98198 166770 -207496 4484 214783 67773 -292720
17922 -13972 -26050 349100 -327239 -25456 -43144 -171597 365043 -11448 68721 24800 -167832
17910 253050 202852 -107942 810 37241 -198995 55015 -40846 -114213 34730 95133 19028
17898 -117541 -93613 63073 -372013 -155429 30408 -255817 177538 -15050 338750 -33890
17887 197662 30927 -186765 -138193 -85657 261901 -182113 9999 -1292 144553 -31280 63282
17875i6003A33035a52523G1115a45113A56084a2078A01218n0577g8648E6622K27009
17864B83631b64027D2153J54759M7976h3775k3366A96862g9358j37919a8409k53470
17853b71879H0774a46495G8709K82801b1950j74819A00479a48629J0224a9347
17842b45800G5407M7616i2238C5489a86053B788P7188a23951J2661L1006E68N3741
17830E4309o754I418J37270L6858q1641L2145B7172K79830j53209p543k2544P222
17818A30928c7764G5621C2815a4777C17270A12927N5150b06080b6306D49417a13459
17806c37326r4255C80116b5293p7479k90272A8807P2303A0157M2270b11005g4348
17794a27248H4636J04089r3897a7697L682j82618c7974I484h6275j36075H4012
$$ plain form
17875 -96003 133035 -152523 71115 -145113 156084 -12078 101218 50641 -78648 56622 283631
17864 283631 -264027 42153 196912 244888 -83775 -107141 196862 -79358 -217277 -18409 -271879
17853 -271879 80774 -146495 78709 361510 -21950 -196769 100479 -148629 -138405 -19347
17842 -245800 75407 123023 -92238 35489 -186053 2788 79976 -123951 -111290 -80284 568 54309
17830 54309 47555 9418 146688 183546 101905 134050 27172 307002 153793 146250 123706 130928
17818 130928 -37764 75621 32815 -14777 317270 112927 168077 -206080 -26306 449417 -113459
17806 -337326 -431581 380116 -25293 -102772 -393044 18807 91110 10157 52427 -211005 -74348
17794 -127248 84636 188725 94828 -17697 -14015 -196633 -37974 9484 -86275 -222350 84012
17782H281a91646A7087g7467J6835m39677b6139G3990b88026d2040q7094A5384
17770A48062D1602Q7152i9815l4663C3214J15217k7148G052M8360f9822p5141
17759a44963d6687k88265B50927B9562K47713n8896I9606J31031L2473b63288
17748D83539a04702E184J13185j0390a29680I2962b82566k2381A3372b57888C7979
17736A86937a00206d1343G7474E012K9603j6698J8785c5615j46595L5217j59833
17725c06826J50252H6875O4786c02038O6901C34016r2583c0840o9657G2160B947
17713e9222a0859j44297G3803J88637a8392B53208A12617a39837d7577A01743
17702b98895a20945j17744H9983D4198N7366F256M13937G1068k4466Q4738K93546
$$ plain form
17782 8281 -191646 17087 -77467 -60632 -500309 -26139 73990 -288026 -42040 -129134 15384
17770 148062 41602 128754 -99815 -134478 33214 148431 121283 7052 55412 -69822 -144963
17759 -144963 -46687 -334952 250927 29562 277275 218379 99606 230637 263110 -263288
17748 483539 -104702 5184 118369 107979 -129680 92962 -282566 -304947 13372 -257888 37979
17736 186937 -100206 -41343 77474 5012 34615 17917 36702 -35615 -182210 -146993 -306826
17725 -306826 -156574 86875 151661 -302038 -235137 334016 241433 -30840 -100497 72160 2947
17713 -59222 -10859 -155156 73803 262440 -18392 253208 112617 -139837 -47577 101743
17702 -298895 -120945 -238689 89983 44198 101564 6256 420193 71068 46602 131340 424886
17691D24886B4432r142K90442A32863c46377g9794G4753j6699a05335A72764K1573
17680A94337B7321K60965E193a68171A23188J07127a29838B10574P3213p4293
17670B09494N9453j05261c2262I580b6987F7483Q628j0040a39856B21875N3700
17659B75575a69121C23080C3777b93822O0183c1767e212b240j27252E3344a93181
17647c0962p5341k2508c3732A33278f007k28161A25016a52868A80555D6232N7711
17636A03943a07086C1065J27249i3581K144A90267M5423b67874A34859L2790b0545
17624B9493g607C0627K9560J30347G3644K29475D6467R9263K7387j1778l2520
17613A28819J2797c9694A46720J01716d3572k0905K9623k62935o9530B37110J57600
$$ plain form
17691 424886 24432 15290 305732 132863 -346377 -79794 74753 58054 -105335 172764 194337
17680 194337 27321 288286 5193 -168171 123188 230315 -129838 210574 283787 209494
17670 209494 268947 163686 -32262 9580 -26987 67483 76111 66071 -139856 221875 275575
17659 275575 -169121 323080 33777 -293822 -233639 -31767 -5212 -2240 -129492 53344 -193181
17647 -30962 -106303 -128811 -33732 133278 -6007 -234168 125016 -152868 180555 46232 103943
17636 103943 -107086 31065 158314 -93581 -91437 190267 235690 -267874 134859 167649 -20545
17624 29493 -7607 30627 60187 190534 73644 303119 46467 145730 173117 161339 128819
17613 128819 141616 -39694 146720 248436 -43572 -64477 -34854 -297789 -367319 237110 394710
17602C94710h0692A28982J02958b27309A32422M3397d42632a21017A86201A8634
17591a1649C93949A78820a72937f8872K2392G6281O0049n9970a48010A62842N5397
17580B18239a88549L2524E5251N8731b1859A19725J55905J10170A80973d1124
17569A17901C3737j6296J42026D3750g1092B5185a695k37787C7617L5672a43610
17557C01342j00146G6968c04950i1248A94453D3525J45411G0779K19606b7115
17546I8825L9298C0043b61457E0189a24202A05450c15996A30698n1346F217J16122
17535A22339K42009b48868I4751P4894l8229C9053J9443L31712j49396c79555
17524B29667J41525G5294a73329B05089D2740M15881G466b7249A08872a74097
$$ plain form
17602 394710 -80692 128982 231940 -227309 132422 175819 -442632 -121017 186201 18634
17591 -11649 393949 178820 -172937 -68872 -46480 76281 136330 76360 -148010 162842 218239
17580 218239 -188549 -156025 55251 113982 -21859 119725 275630 385800 180973 -41124
17569 117901 33737 17441 159467 43750 -71092 25185 -1695 -239482 37617 73289 -143610
17557 301342 201196 76968 -304950 -91248 194453 43525 188936 70779 290385 -27115
17546 98825 138123 30043 -261457 50189 -124202 105450 -315996 130698 79352 6217 122339
17535 122339 364348 -248868 94751 169645 131416 39053 58496 390208 240812 -379555
17524 229667 371192 75294 -173329 205089 42740 458621 7466 -27249 108872 -174097
17513C06606j5482m2952j21647D806J39120n3240M3675l5082K031D7717O4356
17502A12073P8631q8479B9013L1319J04373J65865q8518E5952f4009L0368j98261
17491b31902C02798G8309J59321N3123B7506a3233G8651L92651k05394J71000
17481D36908D4399h136B73987K4198A40331P9112a85498G685K12659p0033m3125
17470A07186C1997e8019C34132l7427H4987K99420A60896K72450j69862b25909
17459A36507K03363I4149M998j1871A0589J70824N1641H1587j0670M76457h7897
17447A90363g2210A07926J71593C8665J25939J01398e9127D4266J39856A5016
17436C43594j54051j6584E9440l342m157J02943n4079A3848K71854j034j38198
$$ plain form
17513 306606 291124 248172 126525 4806 143926 90686 134361 99279 101310 47717 112073
17502 112073 190704 102225 29013 60332 164705 330570 242052 55952 -64009 -33641 -231902
17491 -231902 302798 78309 237630 290753 27506 -13233 78651 471302 265908 436908
17481 436908 44399 -8136 273987 298185 140331 219443 -185498 7685 220344 150311 107186
17470 107186 31997 -58019 334132 296705 84987 384407 160896 433346 263484 -225909
17459 136507 339870 94149 99147 87276 10589 181413 233054 81587 70917 547374 -87897
17447 190363 -72210 107926 279519 38665 164604 266002 -59127 44266 184122 15016
17436 343594 189543 172959 59440 56098 51941 154884 100805 13848 285702 284668 146470
17425A46470L51615a48017D59923a3072B27513o2177L20531j61124I9361M52622
17415E51983B71049p208e3116A48295L15869p3813j04386c2824B32507K45122
17405D77629G6556l2405M1255J79944E3127J64182F9770J05682J13021A6568L83751
17394D00319E3029Q8988M43644k11459A3982M15882N1264k33615k8455A5954J75935
17383A91889D4958c5551K687A69204n305b901H269J67781J36204j43574a8866
17371e4208A69604j3895a21968E67764A42309K47694b9315a3774B96834n4381
17361B42453q206A13401Q6068J30364m7648g8278A75317H3981b5770B2013K73903
17350B95916m5573A22346K81884b2857A38980B8032J30862B0729M09838a57442
$$ plain form
17425 146470 498085 -148017 459923 -13072 227513 165336 485867 324743 99361 551983
17415 551983 271049 263841 -53116 148295 464164 390351 285965 -32824 232507 477629
17405 477629 76556 44151 85406 265350 53127 217309 69770 175452 288473 16568 400319
17394 400319 53029 142017 585661 374202 13982 429864 481128 247513 219058 15954 191889
17383 191889 44958 -35551 -32864 169204 163899 -2901 8269 176050 312254 168680 -18866
17371 -54208 169604 155709 -121968 567764 142309 390003 -29315 -13774 296834 242453
17361 242453 234247 113401 199469 329833 282185 -78278 175317 83981 -25770 22013 295916
17350 295916 250343 122346 404230 -22857 138980 28032 158894 20729 430567 -157442
17339c4470C16553j5339G6460Q5283J53234J22819j96136f5295C09142n4826i780
17327H6597e7109C91473j44464n3251I4891J10204H4615a19106A92729H48e372
17315C85458A31957L3168m8768l5413K65220j15076B3485Q4167a83264E735O5124
17304G0859C861K55813o9733b6816L043B24132H1013P0094o9626J30282r6627
17293A15136M73566q2658C8278K34905Q4985A47530O9806r2784J40959J25770
17283C91281l8885A09004K91712J33150A60830O5890c54487F9747e0906A4470
17272A75861j8067J93186n5167H5930K61073b5726C01410o3369q7584L1823L26361
17261E08641j66424j30014H8679L16617m8234j47145j00179Q281K93300B991N12671
$$ plain form
17339 -34470 316553 301214 76460 161743 314977 437796 241660 -65295 309142 254316 -9780
17327 86597 -57109 391473 247009 193758 94891 205095 84615 -119106 192729 848 -5372
17315 385458 131957 165125 116357 80944 346164 231088 23485 107652 -183264 5735 70859
17304 70859 3861 259674 189941 -26816 -23773 224132 81013 151107 81481 211763 115136
17293 115136 588702 506044 38278 273183 358168 147530 217336 124552 265511 391281
17283 391281 352396 109004 400716 533866 160830 226720 -354487 69747 -50906 14470
17272 175861 157794 350980 295813 85930 347003 -25726 301410 238041 150457 182280 508641
17261 508641 342217 212203 88679 405296 357062 209917 109738 118019 411319 2991 515662
17250E15662H5634J45386J26152j10023A9530K67552R3187P9534A10503C4130
17239A27708K26660j37382K6411q0535K91024A97670K33412l5758e0047B88525
17228B66709j1025j02129J5723K83245j40981P71L9378j46418q3902A9878L41909
17217C61787F0388A0136L6047L36421p8389k1431L1636j54541P623l4732L10593
17206D43363k21486K95342j07171j00531k1525A36274J41040j3930M5893M25060
17196G34337A24336J20848M1899K72228k26279j21934K44294j08149p7433R2580
17186C62390J3125q6223B850Q5519L05669n4400q3312k3440I261K37530L31860
17175E78651O4276j18484o8165L66053B76697k9991j4336O7360q1573L25089j46418
$$ plain form
17250 515662 85634 231020 357172 247149 19530 287082 380269 459803 110503 34130
17239 127708 354368 216986 243397 162862 453886 197670 431082 395324 -50047 288525
17228 266709 255684 153555 169278 452523 311542 312313 351691 205273 121371 19878 361787
17217 361787 60388 10136 46183 382604 304215 282784 314420 159879 167502 132770 443363
17206 443363 221877 517219 410048 309517 287992 136274 277314 263384 309277 734337
17196 734337 124336 245184 287083 559311 333032 211098 455392 347243 269810 362390
17186 362390 375515 289292 2850 88369 394038 339638 256326 232886 9261 246791 578651
17175 578651 642927 524443 456278 822331 276697 246706 232370 299730 218157 543246 396828
17164C96828J89964n7303B46719K10425K15933k74879l8395q4308j4443J42054
17154D03106j54760J16716J61889j11788o0000m1614A49016E9074O43487C47651
17143E43690J07829k27980J95799A01034L78453B20325J90724j20664L68269K93034
17133I51688C04797J36794o055Q6217B26974J67812j32912J87721J5200k00412
17123B64383K25346r6139O5208K69178C20912K24202A51696J61949K5817K77711
17113F17173j71037j8459J664j99805L76758j67538j24315K79200k31188R2912
17103D55365J80638j28039J82246B22299M29094k00489L23054j90414k74924M4335
17093C52955K03767r2851l7067K91811j46831k62609M35524o2453j94050j3114
$$ plain form
17164 396828 586792 529489 246719 457144 673077 398198 359803 275495 261052 403106
17154 403106 248346 365062 526951 415163 355163 313549 149016 59074 702561 347651
17143 543690 651519 423539 619338 101034 479487 220325 411049 290385 658654 951688
17133 951688 304797 441591 435536 521753 226974 394786 261874 449595 464795 264383
17123 264383 489729 393590 458798 727976 320912 545114 151696 313645 339462 617173
17113 617173 446136 427677 429341 229536 606294 438756 314441 593641 362453 455365
17103 455365 636003 507964 690210 222299 651393 450904 773958 583544 308620 352955
17093 352955 556722 463871 426804 718615 571784 309175 744699 682246 488196 475082
17083D75082J61870A82376N13503p650L3311k69617Q3458L02782k48340r3208
17073D96615L8026L56121k84467J7825K14822C15361K82134K01260k21332M35034
17063A012457D76377K71220M3086l34960J14780N0427O669K53943k34813J82659
17053H29388j06624C20575K27989J20926m0915L57749l67639Q8753J48788J08453
17043I64679D05856M23190J25214k78172j34365L222J24459K01774l31551K12344
17033G51971P4404j28667J72813j32981J75189m7859j80712M58471J17816j86744
17023A073701E13668N78757k38347K75193J0726j26641l21833K8070J59118K57199
17013A135910m06592O8021k4693K81214j91336J02401K05599j07313l10419L34740
$$ plain form
17083 475082 636952 182376 695879 688229 721540 451923 535381 838163 589823 496615
17073 496615 534641 890762 606295 624120 838942 315361 597495 798755 577423 1012457
17063 1012457 476377 747597 790683 455723 570503 620930 627599 881542 646729 829388
17053 829388 722764 320575 548564 669490 628575 986324 618685 707438 856226 964679
17043 964679 405856 829046 954260 676088 541723 544945 669404 871178 539627 751971
17033 751971 826375 697708 870521 737540 912729 864870 684158 1142629 1260445 1073701
17023 1073701 513668 1092425 854078 1129271 1139997 1013356 691523 719593 878711 1135910
17013 1135910 729318 797339 772646 1053860 862524 964925 1170524 1063211 752792 1087532
17003A087532J85349j90056k13765j33885L73277J46161k18623J3488k98738L62000
16993A112740k1189O1743J2497P7899k5705q8409J55412L0555k10381L20538k35723
16982A189977J07205m57438K06735K34173n3235J205j13578M03380j84635K4038
16972A357827k34073K33484j32948K07807k7532J03073j74688K06347j49374K54271
16962A644194Q4656Q5507n51824P4857M84382j42131M2868j12634J43046k8310
16952A724611n1332m9160l46627L97993k75422K26162J03448q5491J50379j04159
16942A690402J39452k84792J16976J26244P6231j98306K43691L9712k48481L20165
16932B021294j65811J81477k22033J31324N626n4304J21712Q2860M0992j51347
$$ plain form
17003 1087532 1272881 1082825 869060 735175 1108452 1254613 1035990 1049478 750740 1112740
16993 1112740 1091551 1153294 1165791 1243690 1217985 1129576 1284988 1315543 1105162 1425700 1189977
16982 1189977 1297182 839744 1046479 1280652 1227417 1228622 1115044 1518424 1333789 1357827
16972 1357827 1123754 1357238 1224290 1432097 1404565 1507638 1332950 1539297 1389923 1644194
16962 1644194 1728850 1814357 1262533 1337390 1821772 1679641 1722509 1609875 1752921 1724611
16952 1724611 1673279 1624119 1277492 1675485 1400063 1626225 1729673 1644182 1794561 1690402
16942 1690402 1829854 1545062 1662038 1788282 1864513 1666207 1909898 1949610 1701129 2021294
16932 2021294 1855483 2036960 1814927 1946251 1951877 1897573 2019285 2102145 2143137 1991790
16922A991790M66680n7853j90515K79250l85479J55008J86857L24606n44090Q2598
16912B308852m6337N29876j91685j7917J0721r3159L21997q8023Q2886j92808
16902B624403M65288l32785L2689K71695j73802J06325j91923K11550Q2844o3199
16892C033085k0095M44364k90807O10220n3873m07772M04175k90140Q6110L62867
16882C878134k62235N39406j57045r7506J56201J33161K76568m8369l48590L24689
16872D394414o0147P6917L5212L34241J99928j30212R1082N9235L70286J35398
16862E506354j25089L7431m0168J79609J10525l38735L14951J81137m2539M63173
16852F246649M1388m7619L26161L7880J45183P4995K53591J14139k19223M54649
$$ plain form
16922 1991790 2458470 2400617 2210102 2489352 2103873 2258881 2445738 2770344 2226254 2308852
16912 2308852 2262515 2792391 2600706 2582789 2593510 2500351 2822348 2734325 2817211 2624403
16902 2624403 3089691 2756906 2789595 3061290 2887488 2993813 2801890 3013440 3096284 3033085
16892 3033085 3012990 3457354 3166547 3776767 3722894 3315122 3719297 3429157 3515267 3878134
16882 3878134 3615899 4155305 3998260 3900754 4056955 4190116 4466684 4418315 4069725 4394414
16872 4394414 4334267 4411184 4446396 4780637 4980565 4850353 4941435 5000670 5370956 5506354
16862 5506354 5381265 5418696 5378528 5558137 5668662 5329927 5644878 5826015 5783476 6246649
16852 6246649 6288037 6240418 6566579 6604459 6749642 6824637 7078228 7192367 6973144 7427793
16842G427793j08856J74298K81316K91080J33766J38873j81307Q66409j19678
16833H903694o1208K55501K18025j42011O46775p1225M12658N57542j25151L56158
16823A0950758M2436M71787L1553L71312L05248M78447K04274K33366L65253L36291
16813A3790725K4706N96269M5732O64983L17972P18062m6543L95171O10017O55088
16803A7772182M00148N98487n1691P37668M90719L82669R43287N12104N89761
16794B2375334P32259L96504P75422N86984P71225Q16492O59717N96942J091950
16785B8802829J030097O05085J218748L33391J479998O96148J073147J053543
16777C6292986J323287P17869J126601J484169R53053J289754R99161J556147
$$ plain form
16842 7427793 7318937 7493235 7774551 8065631 8199397 8338270 8156963 9023372 8903694
16833 8903694 8842486 9097987 9316012 9174001 9820776 9749551 10162209 10719751 10594600 10950758
16823 10950758 10993194 11464981 11496534 11867846 12173094 12651541 12855815 13089181 13454434 13790725
16813 13790725 13815431 14411700 14457432 15122415 15440387 16158449 16111906 16507077 17117094 17772182
16803 17772182 18172330 18770817 18719126 19456794 19947513 20330182 21273469 21785573 22375334
16794 22375334 23107593 23504097 24279519 24866503 25637728 26454220 27113937 27710879 28802829
16785 28802829 29832926 30438011 31656759 31990150 33470148 34166296 35239443 36292986
16777 36292986 37616273 38334142 39460743 40944912 41897965 43187719 44186880 45743027
16769D5743027J343779J473276J551643J246082J158304J682334J089850J546277
16761E6834572J733241J508226J372206J672956J505257J693757J804269J297685
16753F9422169J849822J676980J384802J634806J777942J648718J780402J367596
16745H2543237J391278K052745Q42278J843422J445591J313123J406486J624707
16737I4462867J102194J264468R67880J045742R66984Q84412N80903Q56775L53607
16728A02485832O02891m9211K98913j69472m44430k12099r24077n45496j276831
16719I9766020j204637j550149j492358j490782k187067k549787j895245k384324
16711H5011671k642047k333823k590854k260482k749511k568324k447838k609756
$$ plain form
16769 45743027 47086806 48560082 50111725 51357807 52516111 54198445 55288295 56834572
16761 56834572 58567813 60076039 61448245 63121201 64626458 66320215 68124484 69422169
16753 69422169 71271991 72948971 74333773 75968579 77746521 79395239 81175641 82543237
16745 82543237 83934515 85987260 86829538 88672960 90118551 91431674 92838160 94462867
16737 94462867 95565061 96829529 97797409 98843151 99810135 100694547 101275450 102132225 102485832
16728 102485832 103088723 103039512 103338425 103168953 102724523 102512424 101588347 101042851 99766020
16719 99766020 98561383 97011234 95518876 94028094 91841027 89291240 87395995 85011671
16711 85011671 82369624 80035801 77444947 75184465 72434954 69866630 67418792 64809036
16703F4809036k109480k430787k497041k126429k254909j718736k457272j624974
16695D7589408j840331j539081j797806j576851j686259j312030j721849r57162
16687C5158039j299503j021904j208531j333705o24083j165941j153266o02364
16679B6748742j173021q19366k70927j108709o53145o96422n90985p14717n00638
16670B0220812n66975m43535r76246p123q35682j42275q62450m92398n0515p54112
16660A5089501j51053j59978p57308j05493j72859m73283l99377o6873o57527
16651A2145750j16954j28441k23553m42572K35243q87549r413m14302l15894j31232
16641I711083J35113k21882j52674l95796j98577k81200q4427j99377k80967j27735
$$ plain form
16703 64809036 62699556 60268769 57771728 55645299 53390390 51671654 49214382 47589408
16695 47589408 45749077 44209996 42412190 40835339 39149080 37837050 36115201 35158039
16687 35158039 33858536 32836632 31628101 30294396 29670313 28504372 27351106 26748742
16679 26748742 25575721 24756355 24485428 23376719 22723574 22027152 21436167 20721450 20220812
16670 20220812 19653837 19210302 18234056 18226933 17391251 17248976 16386526 15894128 15843613 15089501
16660 15089501 14938448 14778470 14021162 13915669 13742810 13269527 12870150 12803277 12145750
16651 12145750 12028796 11900355 11676802 11234230 11469473 10581924 10572511 10158209 9842315 9711083
16641 9711083 9846196 9624314 9471640 9075844 8877267 8596067 8511640 8312263 8031296 7903561
16631G903561O1591j80332l08677j41170O1358l72695l5785O6476j38176l77889
16621F538262J81438j57764k72236l8729R956m94475L6485N8728j53174n17022
16611E191469K87687M4640l11965J06076k05827q2265M9110k85222K9960L5370
16601D859033k39350j82241K93540q1151m42601K73760J2881n42814K47912L3118
16591D232087r3333j36221p8490k55931J18575J80137m12189O2425j78546k49162
16581C189352M36568l47287L78814p3987j72658l82968K60696J61035k11448J28413
16571C366530j09498j37860j79621M4307q480P1832l49386J50860J87497m05999
16561B630182q3121J68947l9774j53188J25119j83665N6430L3774k17760P9928
$$ plain form
16631 7903561 7965152 7784820 7476143 7334973 7396331 7023636 6987851 7054327 6916151 6538262
16621 6538262 6719700 6561936 6289700 6250971 6260927 5766452 5802937 5861665 5708491 5191469
16611 5191469 5479156 5523796 5211831 5317907 5112080 5029815 5078925 4793703 4823663 4859033
16601 4859033 4619683 4437442 4730982 4649831 4207230 4480990 4493871 3951057 4198969 4232087
16591 4232087 4138754 4002533 3924043 3668112 3786687 3966824 3554635 3617060 3438514 3189352
16581 3189352 3625920 3278633 3657447 3583460 3410802 3027834 3288530 3449565 3238117 3366530
16571 3366530 3257032 3119172 2939551 2983858 2975378 3047210 2697824 2848684 3036181 2630182
16561 2630182 2547061 2716008 2676234 2523046 2648165 2464500 2520930 2554704 2336944 2416872
16551B416872j34599K90556m04259J41599m1546L1910p8990k99963M32518j55617
16541B198481l75628K42933j02859K18178l11816L5966L63929l38288q451j84542
16531A737903J43449j06992K1520K98708j81677j06486K63847n45927L20733p5912
16521A769166j35495n2862R8496K5296Q479K80903m17832L41299k35329l3807
16511A648314P1439o0521q4912Q1490J1722l10145K35771L8147m01817O06310
16501A835798l73936M46288o54984J19382Q8481k42362L93055k49135L61877k52024
16491A472440j44412M10074n21398N1175J88688K0886k52335r2289J32884j00957
16481A164756L13427j37194J00451k10433J98974j29466k97725J88671R8419k56979
$$ plain form
16551 2416872 2282273 2572829 2168570 2310169 2268623 2300533 2221543 1921580 2354098 2198481
16541 2198481 1822853 2065786 1962927 2181105 1869289 1905255 2269184 1930896 1922445 1737903
16531 1737903 1881352 1774360 1795880 2094588 1912911 1806425 2070272 1524345 1845078 1769166
16521 1769166 1633671 1580809 1679305 1704601 1713080 1993983 1576151 1917450 1682121 1648314
16511 1648314 1719753 1659232 1574320 1655810 1667532 1357387 1593158 1631305 1229488 1835798
16501 1835798 1461862 1908150 1253166 1372548 1461029 1218667 1611722 1362587 1724464 1472440
16491 1472440 1328028 1738102 1216704 1267879 1456567 1477453 1225118 1132829 1265713 1164756
16481 1164756 1478183 1340989 1441440 1231007 1429981 1300515 1002790 1191461 1289880 1032901
16471A032901n3914J20228J1106l5400j33245L68167k9906k98931K32168m49041
16461G64133L33921j47000m9570j03391M87449l2706j1551D66709O35106j34703
16451I67112Q4331K61080l65272K06741k12467o3189K2440J36102j91233Q8863
16441I34508j93605N0458J96124k78652o1826J66288K83115m7481j28844D59006
16430A304224E03448J51035J36607j10173J44114O1487R273n4818N5910j93129
16420G03754O5090q8226L47273k89130Q4453J96895m71116M35633j5681j46392
16410H22553J15830j30934k48236j20647K94737o0463J87108j86420o6634K20637
16400H27531q0588K5519q570j94736J0937L15301q0206J24403m11268k8268P409
$$ plain form
16471 1032901 978987 1099215 1110321 1074921 941676 1309843 1279937 981006 1213174 764133
16461 764133 1098054 951054 901484 798093 1285542 1252836 1241285 466709 1101815 967112
16451 967112 1051443 1312523 947251 1153992 941525 878336 900776 1036878 845645 934508
16441 934508 740903 791361 987485 708833 647007 813295 1096410 1048929 920085 459006
16430 1304224 503448 654483 791090 680917 825031 886518 895791 840973 896883 703754
16420 703754 768844 680618 1027891 738761 823214 1020109 548993 984626 968945 822553
16410 822553 938383 807449 559213 438566 733303 672840 859948 673528 606894 827531
16400 827531 746943 772462 763892 569156 580093 895394 815188 939591 528323 500055 507464
16389E07464r324M6282J55633M6933j30530j79257n0585L33857j80958L39928
16379H79443k87678j21225K1512p6345K74554l23031j24057J62387J0170J89281
16369F05011O7812P8632k48073K83420B48745L92439j24689J7179P9819J64554
16359G78047l22875B11368M14873j45226J68613C23072M88042C61473k5606J61332
16349D97199q3152J06360A37352M25851n458o5425N9242n5892J1086K011J86240
16338F95007k35988J85250J3027B15590M23956k22003R493l3901Q4784j87739
16328B90180M42976C20616o7658J84351Q7879J54941j86241j98243L14926A07386
16317D32613m5156j84405R1539K4927A11617J77383M50280k58176L5859B49611
$$ plain form
16389 507464 498140 544422 700055 746988 616458 437201 386616 720473 539515 879443
16379 879443 591765 470540 492052 415707 690261 367230 243173 405560 415730 605011
16369 605011 672823 751455 503382 786802 248745 641184 516495 533674 613493 778047
16359 778047 455172 211368 626241 481015 649628 323072 811114 361473 335867 497199
16349 497199 414047 520407 137352 563203 557745 492320 551562 495670 506756 508767 695007
16338 695007 459019 644269 657296 215590 639546 417543 427036 393135 477919 290180
16328 290180 733156 320616 252958 437309 525188 680129 493888 295645 610571 107386
16317 432613 387457 203052 294591 319518 111617 289000 739280 481104 516963 249611
16306C84940K3698J09875k50189O4997L7642p8524J9653J19795j47007L13267
16296E98147B89339J25149r3981K05355k31823O5176L7290l8660l2258L406j51366
16285A77627K04877J45482p272J99522C04689J26657A58192G8744L97658Q0866
16275E57268j02712n2445o7670j06031L87193k17638K2749J27B8846L09954j61998
16264A76802J83975A46402L33564B1150J62068K5005J48691j47525D4480a6537
16253E27399k58161j25489K55766n277A54995J41737a85565P3977A82924o6779
16243A16145K62948p7105p8891r6834n2035Q5267A0315L81652j43894d2661C27538
16231D4789R9724b5759D1999l870Q2747N161L34765A90430H9980O4083L63149
$$ plain form
16306 384940 408638 518513 268324 333321 370963 292439 312092 431887 284880 598147
16296 598147 289339 414488 320507 525862 294039 359215 396505 357845 325587 328993 177627
16285 177627 382504 527986 520714 720236 304689 431346 158192 78744 476402 557268
16275 557268 454556 402111 334441 228410 615603 397965 420714 420841 28846 338800 176802
16264 176802 360777 146402 479966 21150 183218 208223 356914 209389 44480 -16537
16253 527399 269238 143749 399515 394238 154995 296732 -185565 -111588 182924 116145
16243 116145 379093 301988 223097 126263 74228 159495 10315 391967 248073 -42661 327538
16231 44789 144513 -25759 41999 38129 120876 126037 460802 190430 89980 154063 517212
16220E17212C5575P6888L53266k23982j09332K10271j62500J84056j02620o7661
16210A93961i3135D8694B2972J29234E7729J76651m5522k8808J99004a6819B71073
16198F1779K37020K21373B54761a04690b5080C35970j10439C6879K90519j38557
16188A88841m8974F2082K23316j08326D1144K18406m6749J54279E1284K17769
16178B69053j03317k4203M3619Q9294C1189a59628P6400E4137A9736K58400A24382
16166A45578J04689n9184l7088K23049a73500N6275C00658j05585r7250a09444
16155B19972o4738R7P3973J7418b19627B39447c7809o5522A27132E598K36146
16144B41744j09733J42920H3526K24008l2565p9668J56490a43433e6755B80679
$$ plain form
16220 517212 35575 112463 465729 241747 132415 342686 180186 364242 261622 193961
16210 193961 -93135 48694 22972 152206 57729 234380 188858 160050 359054 -16819 271073
16198 61779 298799 520172 254761 -104690 -25080 335970 225531 36879 327398 188841
16188 188841 139867 62082 285398 177072 41144 259550 212801 367080 51284 269053
16178 269053 165736 141533 185152 274446 31189 -159628 -83228 54137 19736 278136 124382
16166 145578 250267 191083 153995 377044 -173500 -117225 300658 195073 97823 -109444
16155 219972 155234 155331 229304 246722 -219627 239447 -37809 -103331 127132 5598 241744
16144 241744 132011 274931 83526 307534 274969 195301 351791 -143433 -56755 280679
16133c1874B28384M5576b728B18658b8627j79643D05546b68117B25021j10017
16123A15004K00956A8473K09957p4561E7241O8152a10816n4111B21358m3528E950
16111B58787r1089p37K4137h0165a6632q275B27092f2097b8548k6014A2294h9748
16098a76391B6303a07419a2467F9500K09268B4053J33413l7157J05033H253b0742
16086C8990L60416p697a02325A55987L8538L33806F3603J60518c93714A56312
16075C02638A22650j5881J19680r8527J16602f8260C00629H7180b87815B5834
16064B28986A04358K75660A72992E0524K08823C4323C492K88272E3447J58324
16054B11771a06565e549D06248D8010K74576h5471l1023D949J10481a60503A24248
$$ plain form
16133 -31874 228384 273960 -2728 218658 -28627 -208270 405546 -268117 225021 115004
16123 115004 315960 18473 228430 153869 57241 125393 -110816 -164927 221358 177830 5950
16111 258787 167698 166961 191098 -80165 -16632 -24907 227092 -62097 -28548 -54562 12294 -89748
16098 -176391 26303 -107419 -12467 69500 278768 24053 157466 120309 225342 8253 -20742
16086 38990 399406 391709 -102325 155987 194525 528331 63603 224121 -393714 156312
16075 302638 122650 106769 226449 127922 244524 -68260 300629 87180 -287815 25834
16064 228986 104358 380018 172992 50524 259347 34323 3492 291764 53447 211771
16054 211771 -106565 -5549 406248 48010 322586 -85471 -116494 4949 115430 -160503 124248
16042D09720b11811f182A89208k4408Q1229I4617i0327B36399a79079A73862J19915
16031B93777f7880E2597J11749M618N0472k3075j1561M5571a20p0134B12869a17452
16018A00836L29196A30892E2785N09187h5701n2789J833O5212K8198B9560l686
16007B5874J64930b37608i7189B6824h2387D4535J71394a61270I5021K43138I6538
15995C7387e0461A67990a25079A39080L7374n1058B7429b30016B58291n5519I3637
15983b33116O2608B07354F1800P7995O7269M3171j1285a1618j17900C4178g0116
15971B21098I8562Q644J46406a04214o9075F5371B9668J13432a41901F5832A3028
15959b00800h1751A24495c94735B4606L9224c24075g5135D1716J71054b39346
$$ plain form
16042 409720 -211811 -6182 189208 164800 246029 94617 -90327 236399 -179079 173862 293777
16031 293777 -67880 52597 164346 168964 219436 196361 184800 230371 -120 -70254 212869 -117452
16018 100836 430032 130892 52785 561972 -85701 -138490 -136657 -71445 -43247 29560 25874
16007 25874 190804 -237608 -97189 26824 -82387 44535 215929 -161270 95021 338159 96538
15995 37387 -50461 167990 -125079 139080 176454 125396 27429 -230016 258291 202772 93637
15983 -233116 -170508 207354 61800 139795 207064 250235 238950 -11618 -129518 34178 -70116
15971 221098 98562 107206 253612 -104214 -173289 65371 29668 143100 -141901 65832 13028
15959 -200800 -81751 124495 -394735 24606 63830 -324075 -75135 41716 212770 -239346
15948C88888j49418i8039A37401c10575B0496a21494D96411A3868e1290E3817
15937B85080f9420B48804F842g3388B98756A13474i1302k64655A84658a3724F148
15925D3917a12031k10746F8497a13561L8696k16524C14062D1253H615g0842q9759
15914a60601A98761f2085p898j74666J14041f866k69118e5786j69409P9424B5223
15902I9349m3305M2040i5586B77428r7154b23364C7620c9996C26794A25958b04385
15890e6688E9616j3022m509M4824J06428D7033a7292A25585J58174F9265a86927
15878A16717b83260a8409k8702G6072J7793J22711b81399a39197D31715e9801
15867f577k0095k76507C27454b60160c9667j77561E0070a994D8994J00351J69069
$$ plain form
15948 388888 239470 -98039 137401 -310575 20496 -121494 496411 13868 -51290 53817
15937 285080 -69420 248804 6842 -73388 298756 113474 -91302 -355957 184658 -13724 6148
15925 43917 -112031 -322777 68497 -113561 -74865 -291389 314062 41253 8615 -70842 -160601
15914 -160601 198761 -62085 -69983 -244649 -130608 -6866 -275984 -55786 -225195 -145771 25223
15902 99349 56044 98084 -95586 277428 180274 -223364 37620 -39996 326794 125958 -204385
15890 -56688 59616 46594 42085 86909 193337 47033 -17292 125585 283759 69265 -186927
15878 116717 -283260 -18409 -47111 76072 93865 216576 -281399 -139197 431715 -59801
15867 -6577 -26672 -303179 327454 -260160 -39667 -217228 50070 -1994 48994 149345 318414
15856C18414a28112b516o6607A86345b09842H0611M5140b18420R0941A52488g662
15844b22393j9649i9692l6968A84264b72893B92404C3993J77196n9030b86343
15833a4914l7154C02276c13227a18851A94630b3975C2349J14403b64357q7080
15823c51437n1487b9410A6476M2110K57941N5482a1188l5190A03710k2009J09774
15812A91475j2060h3407G8526a05210j9749e0789A12684L7623J22747A01657a28992
15800a43587B52754d45702f5085k11573C3787A3463a25143p7540C9811a52211
15789c9303j48307D95628h9515A75246a2128A97461M4174b8034F503J78146d572
15777c5498B2658a30459N5292C79055D457a95649H0381a31963N0644k56204D2888
$$ plain form
15856 318414 -128112 -2516 -69123 186345 -209842 80611 125751 -218420 -127479 152488 -7662
15844 -222393 -242042 -99692 -136660 184264 -272893 292404 33993 211189 152159 -286343
15833 -14914 -52068 302276 -313227 -118851 194630 -23975 32349 146752 -264357 -351437
15823 -351437 -402924 -29410 16476 58586 316527 372009 -11188 -46378 103710 81701 191475
15812 191475 179415 -83407 78526 -105210 -124959 -50789 112684 150307 273054 101657 -128992
15800 -143587 252754 -445702 -65085 -276658 33787 13463 -125143 -202683 39811 -152211
15789 -39303 -187610 495628 -89515 175246 -12128 197461 241635 -28034 6503 184649 -4572
15777 -35498 22658 -130459 -75167 379055 4457 -195649 80381 -131963 -81319 -337523 42888
15765B3500J60173a88652M8150A80615B8614L1616f6032E2197J62744e6582k10478
15754b67060i5173r6828L0830M8065A77463F0344J3859e7573A1387a13211K6914
15743h6297A14742c06934j0983a03985M3361k07745B83325d2247r7751D0460l722
15732C6738O8259a96931c3988D56705B18356j04505j5894l3049c07904a0424B12271
15720G4862f9224E3916f1520j78537E781b37677B42092j09290a23540j33182B165
15708E6734A685d4675I9555K45920L206j46162b60411B7822k277g8618F8285c11586
15695c6356k99886a44261O4735b443C12163H3231a70964j49336n6316B29829b84579
15683C06851f5428H418K50922b08993d7392Q462o9498n8012r7286E1654K13481
$$ plain form
15765 23500 183673 -188652 -140502 180615 28614 60230 -66032 52197 214941 -56582 -267060
15754 -267060 -95173 -192001 -161171 -113106 177463 60344 74203 -57573 11387 -113211 -86297
15743 -86297 114742 -306934 -317917 -103985 -60624 -268369 283325 -42247 -139998 40460 36738
15732 36738 104997 -196931 -33988 456705 218356 113851 97957 64908 -307904 -10424 212271
15720 74862 -69224 53916 -61520 -240057 5781 -237677 242092 132802 -123540 -256722 2165
15708 56734 1685 -44675 99555 345475 348681 202519 -260411 27822 25545 -78618 68285 -311586
15695 -36356 -336242 -144261 -79526 -2443 312163 83231 -170964 -320300 -376616 229829 -284579
15683 306851 -65428 8418 259340 -208993 -47392 -38930 -108428 -166440 -263726 51654 265135
15672B65135a01706A13564a940q7696A88040c44769A18781b87398c3212j3980
15662d7192A96917K0760A5259K45434P5785a22275G1274j1684Q083b1389j84067
15651b05456K2587B17066h1226K7671B3780a41840E4145a09433q0248h3766k06223
15640b89989h9111j58466B9720O8349F667N1934N9059b06302J00425B94718Q5189
15629C79907b589k54398i4852A40921c29178E8009K99450h6071g253m0133l7346
15618h4732B66354q5351a82997j01125l2518g5791D6635i6587A03569b01586O8075
15607a33511M4585B37086c7792l8893B61872h8040G659a42778j29065A87132G8836
15595I2197d6792A11669b6875A23683J26602B7899a66058g5736A00260P6733g886
$$ plain form
15672 265135 -101706 113564 -1940 -89636 188040 -344769 118781 -287398 -33212 -47192
15662 -47192 196917 217677 15259 260693 336478 -122275 71274 59590 67673 -21389 -205456
15651 -205456 -182869 217066 -81226 -53555 23780 -141840 54145 -109433 -189681 -83766 -289989
15640 -289989 -89111 -247577 29720 98069 6667 58601 117660 -206302 -105877 294718 379907
15629 379907 -2589 -256987 -94852 140921 -329178 58009 357459 -86071 -7253 -47386 -84732
15618 -84732 266354 181003 -182997 -284122 -316640 -75791 46635 -96587 103569 -201586 -133511
15607 -133511 -88926 237086 -37792 -76685 261872 -88040 7659 -142778 -271843 187132 78836
15595 92197 -46792 111669 -26875 123683 250285 27899 -166058 -75736 100260 176993 -7886
15583a55745B42490j17560j5477b95877N2730a05336N807k9869A02086J62659
15573B64745a54667B79402a63377F0909K11819a3053B6108K7594P5120Q6707a35449
15561A36882I555J94687a1995I779h4952A73706a94448b3720B53843a25831A71724
15549A15272C8867d4806j24615l0384K3129I2863a2347j29803j05427C75392a84708
15537g3642A86729B5195J12708c7397l4476o0585q7869d1461n0872B4866e9372
15525a09378e1420B85780b71400e0782k23864A50429n1132Q3320K6838a80900
15514B28973M508b02039B66559j12932D4881a51893m926C7794a63251A44586o0926
15503H3660a19349L6653D9868k0386b82831J1356O9514A4619a13697n7045d778
$$ plain form
15583 -155745 242490 124930 109453 -295877 -243147 -105336 -99529 -129398 102086 264745
15573 264745 -154667 279402 -163377 60909 272728 -13053 26108 53702 128822 215529 -135449
15561 136882 9555 204242 -11995 9779 -84952 173706 -194448 -23720 253843 -125831 171724
15549 115272 38867 -44806 -169421 -199805 -176676 92863 -12347 -142150 -247577 375392 -184708
15537 -73642 186729 25195 137903 -37397 -71873 -132458 -220327 -41461 -92333 24866 -59372
15525 -109378 -51420 285780 -271400 -50782 -274646 150429 99297 182617 209455 -180900
15514 228973 233481 -202039 266559 153627 44881 -151893 -156819 37794 -163251 144586 83660
15503 83660 -119349 -82696 49868 29482 -282831 -271475 -201961 14619 -113697 -170742 -4778
15491b43730g8320A58859f0691A60135i298k1497E8530b03587F927a8365j39088
15480a57453F7954g923E5644a23412A28455J9839m2866c66588A1704a20311H8973
15468A88597q0057a09247G273i9615I3533c42839c4877C02479c37611b510A18819
15456B05645a4258l9425E7091A9379L44821g57D8137K45346b40505e8341j03021
15445a61362P7945k610J1861l0340A66312a23284E78923A88894l9240b44460i0833
15433C26329g7736K2054A43281K2357a1783K450H3989E309a42400J4380A27653
15421A80315F168d3910C9600J62851J69836d28231c9345A5581b64810L7827e4459
15409g4043q3602A46593Q1980F3967J51698C8528h5682K4889b0616A9005M6407
$$ plain form
15491 -243730 -78320 158859 -60691 160135 -9298 -30795 58530 -203587 6927 -18365 -157453
15480 -157453 67954 -7923 55644 -123412 128455 148294 105428 -366588 11704 -120311 88973
15468 188597 108540 -109247 7273 -99615 93533 -342839 -34877 302479 -337611 -2510 118819
15456 205645 -14258 -53683 57091 19379 364200 -757 48137 293483 -240505 -58341 -161362
15445 -161362 -83417 -86027 -74166 -104506 166312 -123284 578923 188894 149654 -244460 -90833
15433 326329 -77736 -55682 143281 165638 -11783 -9333 83989 5309 -142400 -128020 127653
15421 180315 6168 -43910 39600 202451 372287 -428231 -39345 15581 -264810 -226983 -54459
15409 -74043 -157645 146593 228573 63967 215665 38528 -85682 -60793 -20616 19005 65412
15398F5412a50863K894d8966A22312J06142a55824H2101d5139G7879L8768a6305
15386C5284L08568m0608A28927a35673A27237J16669q0028a89201P4505j30846
15376b45542A7417f0340A14262k4658k4209a67456A99340J47982f6199B29530
15365i7741D572L1935K22888a04057A2935i6232D9424b66321A81117A730a76268
15353a46982k0554I6161b12681b0986B27480E1562A8508J79959m3929G3832j7994
15342E5838g9556I9612m6988P9488a47775R114G1352l0001j4724J98281F307J58291
15330A64598f336l2690l3623F3044K99763a8010C2666K40144a38781a2087C2472
15318A41243L0397a80169H224h8081G0341j2444K71687A27877K07264a17934b5036
$$ plain form
15398 65412 -150863 -147969 -48966 122312 228454 -155824 82101 -45139 77879 116647 -16305
15386 35284 343852 303244 128927 -135673 127237 243906 163878 -189201 -114696 -245542
15376 -245542 17417 -60340 114262 89604 65395 -167456 199340 347322 -66199 229530
15365 -97741 4572 36507 259395 -104057 12935 -96232 49424 -266321 181117 1730 -176268
15353 -146982 -167536 96161 -212681 -20986 227480 51562 18508 198467 154538 73832 55838
15342 55838 -79556 99612 52624 132112 -147775 -138661 71352 41351 26627 224908 6307 164598
15330 164598 -6336 -39026 -72649 63044 362807 -18010 32666 272810 -138781 -12087 32472
15318 141243 171640 -180169 8224 -88081 70341 57897 329584 127877 335141 -117934 -25036
15306E1205J07366l8531K12212G0918M44858G6344b30953A06844K42455j13298
15296B36001O9921j18542b8480A44559Q1177E0482a7037n5810n5134c2997D6051
15284b5843D9607J59749a73062A23370J566n6182J53206c1657D92917B36043B6860
15272B66111a4476B00417k2817a57954C88765i6531H510J92599D1940L44980j61339
15261B25581H9887a6179B53899E2835K18315k7990P8345j41310K2758p9824h3001
15249C29565F206a05124C10910b39200A80789g1459A01788O8212D4119L5661M0864
15238A20644a83796B14152d6487m6237B65468j27626n8368O76J55153b8296j90914
15227b19210D7330M1551B5786b94663a4170j54152p8466B4360c1161g076A39997
$$ plain form
15306 51205 158571 120040 332252 70918 515776 76344 -230953 106844 349299 236001
15296 236001 305922 187380 -28480 144559 225736 50482 -17037 -72847 -127981 -32997 46051
15284 -25843 49607 209356 -173062 123370 124936 68754 221960 -31657 492917 236043 26860
15272 266111 -14476 200417 177600 -157954 388765 -96531 8510 201109 41940 386920 225581
15261 225581 89887 -16179 253899 52835 271150 243160 321505 180195 202953 123129 -83001
15249 329565 6206 -105124 310910 -239200 180789 -71459 101788 170000 44119 79780 120644
15238 120644 -183796 214152 -46487 -92724 265468 137842 79474 80150 235303 -28296 -219210
15227 -219210 47330 88881 25786 -294663 -14170 -168322 -246788 24360 -31161 -7076 139997
15215b64312D3588f7307D0859d7216G5744a57230C44355j24212e5612A14164E7058
15203A39397j8895a66035d5863C56273j5150j43826a59018b381A40196l7796a63851
15191B56743p3757Q3326N6218B6400L3773J26535f727A13585k5391K95870B1986
15179C21417b14004o0316a09171l7359e5072B60907k4314H9213b42913g6700E7820
15167b08392Q9704L9154a2501A59030F4559k0026a01932C94491E6173K58817a27104
15155B33458M7174k804A27979L393a02283b5626C8895J37034q5555R454J17266
15144B17094p5587J9692j2721D1051M0378M23634c61343i844n1185B81470F7791
15132A63920M7134A549c180A73970J47235r6535j01365O8540N3255e7826E6217
$$ plain form
15215 -264312 43588 -67307 40859 -47216 75744 -157230 344355 220143 -55612 114164 57058
15203 139397 120502 -166035 -45863 356273 341123 197297 -159018 -2381 140196 102400 -163851
15191 256743 182986 266312 322530 26400 60173 186708 -6727 113585 88194 384064 21986
15179 321417 -214004 -274320 -109171 -146530 -55072 260907 236593 89213 -242913 -76700 57820
15167 -208392 -118688 -79534 -12501 159030 64559 44533 -101932 394491 56173 314990 -127104
15155 233458 280632 277828 127979 131372 -102283 -25626 38895 175929 90374 99828 217094
15144 217094 141507 161199 148478 41051 81429 505063 -361343 -9844 -61029 281470 67791
15132 163920 211054 1549 -3180 173970 321205 224670 123305 191845 245100 -57826 56217
15120B59782A02219n0766P3783J35441j04580L5933n7094J17649K11407a80507
15109C42911J65196a01501B42424o3862l6745b47906B70404o1734o3601K42383
15099C87452j74840h9440J6594C51457p3308F5824J07108p237b04741A9108K67828
15088B86936k9392B1972L50763e7435C99948c0506a998H7748j1593J08560b13522
15076A58478J73401b61415D28979q0867A4417R8919J85224b9376A13632K03367
15066C16999i8858B38805D7318J85122h6272B13146I7256J42478e9023C77833
15055A42516L23950A11630K46101r0873J20807j09271A25977n4228J99775J14076
15045C85600A74290L1303K02994g845C45319q9113e3121B24289K79034A98137
$$ plain form
15120 259782 102219 51453 125236 260677 156097 192030 134936 252585 463992 -180507
15109 342911 508107 -101501 242424 178562 141817 -247906 270404 208670 145069 387452
15099 387452 212612 -89440 -72846 351457 278149 65824 172932 165695 -204741 19108 286936
15088 286936 257544 21972 372735 -57435 399948 -30506 -1998 87748 76155 184715 -213522
15076 158478 331879 -261415 428979 348112 14417 113336 298560 -29376 113632 316999
15066 316999 -98858 238805 47318 232440 -86272 213146 97256 239734 -59023 377833
15055 142516 466466 111630 357731 266858 387665 278394 125977 71749 271524 385600
15045 385600 174290 205593 408587 -7845 345319 256206 -53121 224289 503323 198137
15034a325C74335j09506J60746K7958k04343o276N9231n2069A24912k4202K10392
15023C11102A05346L52379j3099o4653L423A06950J98084I7719J32757K13021
15013D43497j43212J1160A1431K75248N3961c3116I0174C2108J15655n8981K22204
15002C10986f3095C04355r6158R2599k7575g790B25283N8999j15209Q9173r155
14991B49091n8653M19633A60318h0327G45415k37163f2110D37421A45575a58214
14980B62842K43802k42257n4316N9171J43742n1646b9014A92728L24113j98872
14970C17969j02232J51468G4811J80415O5552I3142J81013j16602l1298K6552
14960A52807K51544J10034j13747o6703j5591Q6762J21619C8372L46826P3886
$$ plain form
15034 -1325 374335 264829 425575 453533 249190 242914 302145 250076 124912 100710 311102
15023 311102 105346 457725 444626 379973 383396 106950 305034 97719 230476 443497
15013 443497 300285 311445 11431 286679 340640 -33116 90174 32108 147763 88782 310986
15002 310986 -63095 304355 208197 300796 273221 -7790 225283 284282 169073 258246 249091
14991 249091 190438 610071 160318 -80327 745415 508252 -62110 437421 145575 -158214
14980 262842 506644 264387 210071 269242 412984 361338 -29014 192728 516841 317969
14970 317969 215737 367205 74811 255226 320778 93142 274155 157553 126255 152807
14960 152807 404351 514385 400638 333935 318344 405106 526725 38372 385198 459084
14950D59084j18557j46997L78474k05868K00027j63577F3588Q9951b22273C53968
14939A24305K06657Q6827p7621J07151J1978j04184j39413J38983A42051K95539
14929D37590N4320j08379j06514K6489r1472A04769n1954Q5419K26587A79828
14918A75773J89158j24960A12534A7032K58096K68237k11573a81585C38003K00647
14908E38650P8364A20714K86684j54223J24341J24214J21303F4272K61376j44124
14898A81524P8512J66958A53645J93222J69540A75700K84789A88729L38316j15270
14888D11775L43248C28330K44559A63388K88354j04740r716N8171p5721J50954
14878D70690j03922K90198j80459A66856K35280A59982J39280J32948J43092Q1724
$$ plain form
14950 459084 340527 193530 572004 366136 566163 402586 63588 153539 -222273 353968
14939 124305 330962 417789 340168 447319 459297 355113 215700 354683 142051 437590
14929 437590 491910 383531 277017 303506 212034 104769 52815 138234 364821 179828
14918 175773 364931 239971 112534 17032 275128 543365 331792 -181585 338003 538650
14908 538650 617014 120714 407398 253175 377516 501730 623033 64272 325648 181524
14898 181524 260036 426994 153645 346867 516407 175700 460489 188729 527045 411775
14888 411775 755023 328330 572889 163388 451742 347002 337286 395457 319736 470690
14878 470690 366768 656966 476507 166856 402136 159982 299262 432210 575302 657026
14868F57026k78356N864j40211K32111k36836J28372J87637k10830j7187A46603
14857E6829L70509M9219A1140L53344K63554A53069L38760o8809j25315J87470
14847D85175I8772M69404k00206j59622J61386M5988J10659j27055K9419K05860
14837F34605K2182N5288j77998k6627B04190K99076j09675J41591k7992j28113
14827C79077A81097N40701k94872n3205R6711P2289k34081O1776J4858Q9402J84313
14816F58989j13813j37593K39907P481J03997l74969J08762J10815o6259j98788
14806C38529K82724j34139J62698B68105M15012k20574K22266o4563J92879j69190
14796F43935k149k1414J63487K3841l2500r8727j74988Q1627j6328o6326K06725
$$ plain form
14868 657026 378670 384534 244323 476434 239598 367970 555607 344777 327590 146603
14857 56829 427338 476557 11140 364484 628038 153069 491829 423020 297705 485175
14847 485175 98772 568176 367970 208348 369734 415722 526381 399326 428745 634605
14837 634605 656787 712075 534077 507450 204190 503266 393591 535182 507190 379077
14827 379077 181097 721798 426926 373721 470432 542721 308640 370416 385274 474676 658989
14816 658989 545176 407583 647490 654971 758968 383999 492761 603576 537317 338529
14806 338529 621253 487114 649812 268105 683117 462543 684809 620246 813125 643935
14796 643935 641786 620372 783859 807700 775200 676473 501485 583112 566784 500458 707183
14785G07183j01740K25764A78162N82460R3700j54408j33755o6200J71557l14766
14775C56750K59953q2381R176L7422M0232j6342B98796N82695j45515R3951k56062
14764E73865r5203r1859L24050J97508j84559Q8576C05620M55639l21588K18075
14754F57746j33566J64701O0550k91748N08198k80520O24J00785j23709J19458
14744G82519O8485k94649R2999r524K42414C16537K43612P6755L77689p2999R4184
14733A035778j72824Q3250j82264K24356m72036O03183k94452l8229R646p4004
14723G22404J43041j16353p9106J90958K3040J11672m74902L78845K11944k56667
14713H54876L13271l99339Q3459J58081K18744l45582q7707M43683l82783q2064
$$ plain form
14785 707183 605443 831207 178162 760622 854322 699914 566159 499959 671516 356750
14775 356750 616703 534322 543498 580920 621152 604810 298796 881491 735976 829927 573865
14764 573865 478662 386803 710853 908361 723802 812378 305620 761259 439671 657746
14754 657746 524180 688881 749431 457683 965881 685361 685985 786770 663061 782519
14744 782519 851004 556355 649354 639830 882244 316537 560149 636904 1014593 941594 1035778
14733 1035778 862954 946204 763940 988296 516260 1119443 824991 786762 796408 722404
14723 722404 865445 749092 669986 860944 883984 995656 520754 899599 1111543 854876
14713 854876 1168147 768808 852267 1010348 1229092 883510 795803 1239486 856703 774639
14703G74639j13463L50148m1809J18413K4314m49431L38010j44759J14623J53580
14693A124265k89876K29493m4041j31065l8586N3881O1178O422M2323L7635K78156
14682A329785F21702K82002k4768K08J4079M64563m77070p1422L45260K5249j77143
14671A002660J24251j34605O1931J62130J39709k28909K0705j29857O0747L46596
14661A425358l11623K29030l07552K0675J77088L26590l92746j99573L01696k52156
14651A016787K54674r439j01474K46567j73922K7139j03233K11058j19456m2000
14641A206701Q2046J82057l64854Q5289p1723M43567k57745M5914N2168K13430
14631A616850J14065n38742J69562j48183L25150J63996k22159j01526k57669
$$ plain form
14703 774639 661176 1011324 969515 1087928 1112242 662811 1000821 856062 970685 1124265
14693 1124265 834389 1063882 1019841 888776 850190 904071 965249 971671 1013994 1051629 1329785
14682 1329785 621702 903704 878936 879144 893223 1357786 880716 809294 1154554 1179803 1002660
14671 1002660 1126911 992306 1054237 1216367 1356076 1127167 1147872 1018015 1078762 1425358
14661 1425358 1113735 1342765 1035213 1055888 1232976 1559566 1166820 967247 1268943 1016787
14651 1016787 1271461 1262022 1160548 1407115 1233193 1260332 1157099 1368157 1248701 1206701
14641 1206701 1288747 1470804 1105950 1191239 1119516 1563083 1305338 1351252 1403420 1616850
14631 1616850 1730915 1192173 1361735 1213552 1538702 1702698 1480539 1379013 1121344
14622A121344O09908j67061L03916n39058M37947k71l29919L40181p0062J43855
14612A850780l74035K08490M24678n50503N2460O7543R6932K9684L38788j47711
14602A997106N8732J88442k13159J38490j54773J48318K73317N3240j10890j77816
14592B201007L33119R3385k4676o5821K65017l1341L66507k50016l47142M82794
14582C022833J71882j17262J16858J23762M02016k56056k11288O21881k72709
14573C601917J66068L6085N8009Q1012M46480M69548j97335L694K94528m9372
14563D910634J96522L25659j5271R6323M69724L22431j97672M45580j25829J02200
14553F530301M23060O2465P6631K04115j32701J224073M25894L877j078843j180196
$$ plain form
14622 1121344 1731252 1564191 1868107 1329049 1766996 1766725 1436806 1776987 1706925 1850780
14612 1850780 1476745 1685235 2109913 1559410 1611870 1679413 1776345 1806029 2144817 1997106
14602 1997106 2055838 2244280 2031121 2169611 2014838 2163156 2436473 2489713 2378823 2201007
14592 2201007 2534126 2627511 2602835 2537014 2802031 2770690 3137197 2887181 2540039 3022833
14582 3022833 3194715 3077453 3194311 3318073 3720089 3464033 3252745 3874626 3601917
14573 3601917 3767985 3804070 3862079 3943091 4389571 4859119 4661784 4665478 4960006 4910634
14563 4910634 5107156 5432815 5417544 5513867 5983591 6306022 6108350 6553930 6428101 6530301
14553 6530301 6953361 7015826 7092457 7296572 7163871 8387944 8813838 8817715 7738872 6558676
14543F558676j285800j307830r64954k56486j99815J38970o09192N19357m15172
14534B177754N55756r5134k21828O5270n0868K6607j90373L47109P6377l4575
14524B656095J26498M24482l66232M2866j09566J21167j9380J44554J63082j20057
14514C063509K76132n93389M96168k21220o5987L85553j52488p5037m6508N67610
14504C634343j4382R4014P4327o4933j64079J48027P6062m2845Q125n3668P394
14493C702385K70188L9937K43812j41565K11193n60613O80081k45316J10813j80575
14483D130340K89805O0447l02734L09776J08162Q7007J23028o9369p0341L98786
14473E064907n49327P15930l76226M66259l69041L62210k2407n1569M10032k56581
$$ plain form
14543 6558676 5272876 3965046 3000092 2743606 2543791 2682761 2073569 2592926 2177754
14534 2177754 2733510 2638376 2416548 2481818 2430950 2457557 2267184 2614293 2690670 2656095
14524 2656095 2782593 3207075 2840843 2883709 2774143 2895310 2875930 3020484 3183566 3063509
14514 3063509 3339641 2746252 3242420 3021200 2955213 3340766 3188278 3113241 3066733 3634343
14504 3634343 3619961 3713975 3788302 3723369 3559290 3707317 3783379 3740534 3748659 3694991 3702385
14493 3702385 3972573 4012510 4256322 4114757 4325950 3765337 4445418 4200102 4310915 4130340
14483 4130340 4420145 4480592 4177858 4487634 4595796 4682803 4805831 4736462 4666121 5064907
14473 5064907 4515580 5231510 4855284 5321543 4952502 5314712 5292305 5240736 5650768 5394187
14463E394187J25022L54107O767m8227k35326K21004K21666M19909n56624L22891
14453F225376J71594j3736M56926j28588j85372L37619J63100J95460j29852J4434
14443G106961L26347J3681K39318J04189L73911j50554J51173k51258L58411K45532
14433H517711k29498N75512L6856j70469M71166K01813k03847M64256j32303O47948
14423A0179145q1713k520L68426n9049K24015N32507m4695L53853P7494K70704
14413A1818167L66794J12361M74599q5895M42352O7714L41887M83179j4948L2275
14403A4038485N86651N87581M2517j72115J039614k17726M19161M52547K00929
14394A6977644N50660L85335L02551M83100L20787M73513k5377R27932L65879
$$ plain form
14463 5394187 5519209 5873316 5880083 5831856 5596530 5817534 6039200 6459109 5902485 6225376
14453 6225376 6396970 6383234 6840160 6711572 6526200 6863819 7026919 7222379 7092527 7106961
14443 7106961 7433308 7446989 7686307 7790496 8164407 8013853 8165026 7913768 8272179 8517711
14433 8517711 8288213 8863725 8900581 8730112 9201278 9403091 9199244 9663500 9531197 10179145
14423 10179145 10097432 10094912 10463338 10404289 10628304 11160811 11116116 11469969 11547463 11818167
14413 11818167 12184961 12297322 12771921 12686026 13128378 13196092 13537979 14021158 14006210 14038485
14403 14038485 14625136 15212717 15255234 15083119 16122733 15905007 16324168 16776715 16977644
14394 16977644 17528304 17913639 18216190 18699290 19020077 19493590 19468213 20396145 20762024
14385B0762024M63769N99855J92536N45866Q54944L62334N89294M98671O09479
14376B5478772J002910M82434O08147O88463O65189P14728N98690J318719N01513
14367C2059565O89514J292827P37811Q12274J173830N83949J382836J140974J090176
14358D0963756J216642J240905J226013J205309J106879J387279J284628J757371
14350E1388782J133027J767212J492975K016179J487999K294017J969501K027017
14342F5576709K153758K044414K757794K010902K475195K472470K715343K859850
14334H5066435K689468L336454K758705L503455L727925L259306M171791L788960
14326A12302499L862510L997200L880688M214759L414159L822228M486804L598135
$$ plain form
14385 20762024 21225793 21825648 22018184 22564050 23418994 23781328 24370622 24869293 25478772
14376 25478772 26481682 26964116 27572263 28260726 28925915 29640643 30239333 31558052 32059565
14367 32059565 32749079 34041906 34779717 35591991 36765821 37349770 38732606 39873580 40963756
14358 40963756 42180398 43421303 44647316 45852625 46959504 48346783 49631411 51388782
14350 51388782 52521809 54289021 55781996 57798175 59286174 61580191 63549692 65576709
14342 65576709 67730467 69774881 72532675 74543577 77018772 79491242 82206585 85066435
14334 85066435 87755903 91092357 93851062 97354517 101082442 104341748 108513539 112302499
14326 112302499 116165009 120162209 124042897 128257656 131671815 135494043 139980847 143578982
14318A43578982M070258M308935N425137M901095M989389N904471M956533M199455
14310A82334255M461043L914789L412302K731964M327243M208539J669317J803194
14302B08862646K794243L984874L854133L416630K823909N321230N501176P254014
14294B43812855M251064L199932N118923J433137J481373M0705n10292J726365
14286B60554062L766004M736794O542322P088595N256041L510188J694246P53202
14278B93901454M303143N918584K534174j310119j69668M777462J0997101J9615308
14270C40567439J0675959J325861j090185K683226l574559o965976j3123385j9558409
14262C10939971k0173940j9877500j8353695j6081732j5043514j3733810j2733063
$$ plain form
14318 143578982 147649240 151958175 157383312 162284407 167273796 173178267 178134800 182334255
14310 182334255 186795298 190710087 194122389 196854353 201181596 205390135 207059452 208862646
14302 208862646 211656889 215641763 219495896 222912526 225736435 231057665 236558841 243812855
14294 243812855 248063919 251263851 256382774 257815911 259297284 259337989 258827697 260554062
14286 260554062 264320066 269056860 275599182 282687777 287943818 291454006 293148252 293901454
14278 293901454 298204597 304123181 306657355 305347236 305177568 309955030 320952131 340567439
14270 340567439 351243398 352569259 351479074 354162300 350587741 343621765 330498380 310939971
14262 310939971 290766031 270888531 252534836 236453104 221409590 207675780 194942717
14255A94942717j1518151j0670468r874704q878375q712503p663697p236755o462829
14247A23925235o036689n727946n275699m813921m626494m239978m154173l634792
14239H5415543l336458l598064k955398l500319k172885k797957k672433j984869
14231F2397160k208593k295277j918620j726103k261758j286736j751567j693887
14223D7254619j131039j221089j437706j341128j015834j324681r29738j257743
14215C7595661o06848j383444n90107j038952p05442j118502o61848j001050n18875
14206B9970593q47571o94168p96618o21906m62729o50525n49363j026281l60063
14197B3961369q62021j30677q23677j13991m93992n75791l09661p99120l54798
$$ plain form
14255 194942717 183424566 172754098 162879394 154001019 145288516 137624819 130388064 123925235
14247 123925235 117888546 112160600 106884901 102070980 97444486 93204508 89050335 85415543
14239 85415543 82079085 78481021 75525623 72025304 69852419 67054462 64382029 62397160
14231 62397160 60188567 57893290 55974670 54248567 51986809 50700073 48948506 47254619
14223 47254619 46123580 44902491 43464785 42123657 41107823 39783142 38853404 37595661
14215 37595661 36988813 35605369 35015262 33976310 33270868 32152366 31490518 30489468 29970593
14206 29970593 29123022 28428854 27632236 27010330 26547601 25897076 25347713 24321432 23961369
14197 23961369 23099348 22968671 22144994 22031003 21537011 20961220 20651559 19852439 19497641
14188A9497641k31775j64614n58134j99082n08748j79432p25047o06875L1966
14179A6355900o34826P7023m86674n08186J04583l67232k10120k83481j78787
14170A3868200r3288p67086p8310j05233k52848k53990j28166j3516l43603l23926
14160A1508234j89077M9115l84474n1550j61315m05720J26944k45297j40925j22832
14150I983103k92776J55737n40918k959j54603q7772k51037j07643p5719m0681
14140H584732j83554J16114l43203m68123l8813J1669r6240k01759R2192l30241
14130G142774j64714Q3320J37148N6376l12785k05994n4298n9764J74610m92310
14120F304363L46688k91764J60495o31629J06807P1187o882l47034K11340k39934
$$ plain form
14188 19497641 19265866 19101252 18543118 18344036 17835288 17655856 16930809 16323934 16355900
14179 16355900 15721074 15798097 15311423 14803237 14907820 14540588 14330468 14046987 13868200
14170 13868200 13774912 13007826 12929516 12824283 12571435 12317445 12189279 12175763 11832160 11508234
14160 11508234 11319157 11368272 10983798 10932248 10770933 10365213 10492157 10246860 10105935 9983103
14150 9983103 9690327 9846064 9305146 9302187 9147584 9059812 8808775 8701132 8625413 8584732
14140 8584732 8401178 8517292 8174089 7705966 7667153 7678822 7582582 7380823 7473015 7142774
14130 7142774 6978060 7061380 7198528 7254904 6942119 6736125 6681827 6622063 6796673 6304363
14120 6304363 6651051 6359287 6519782 5888153 5994960 6066147 6059265 5712231 5923571 5683637
14110E683637j35333K55658l9825l08565J95725k29546R7158j50830k07067J52078
14100E313090m96214L05205L5675k69041j78582j58422N26730l91833o7908J7533
14090D636233j05367r1061j25151L2187j45747n0528j9674J96120j68063k57199
14080C901750K95577k14566N2820Q2843m93472L92261r4546R9227m77811J49160
14070C693243P1752M12407n11893k65835K18235j50082K61431l42373K27668l61042
14060C253511P7956M59703m06640k02999L2882O1406L63327j35741k66205J70315
14050C407515m47804J26422k663K61777j30607n6324j02570l16023K13559k0265
14040B933017m8212N7161P5018j86251K20169m65162L46499K38110j57698N7634
$$ plain form
14110 5683637 5548304 5803962 5764137 5455572 5651297 5421751 5518909 5368079 5161012 5313090
14100 5313090 4816876 5122081 5157756 4888715 4710133 4551711 5078441 4686608 4618700 4636233
14090 4636233 4530866 4439805 4314654 4346841 4201094 4150566 4130892 4327012 4158949 3901750
14080 3901750 4197327 3982761 4035581 4118424 3624952 4017213 3922667 4021894 3544083 3693243
14070 3693243 3764995 4177402 3665509 3399674 3617909 3467827 3729258 3386885 3614553 3253511
14060 3253511 3331467 3791170 3384530 3181531 3214413 3275819 3639146 3503405 3237200 3407515
14050 3407515 2959711 3086133 3083470 3345247 3214640 3158316 3055746 2739723 2953282 2933017
14040 2933017 2884805 2941966 3016984 2830733 3050902 2585740 2932239 3170349 3012651 3070285
14030C070285K93012n2287j93090j38245K10106O9448j75862K30423l60044O52243
14020C605989l22569O5732P4818l58523O12361q0369k81661K82979J8260k01546
14010C415471L58549L20539J6036J35534J60385o5955r7543J86329K46711j14497
14000D561559K78929J39567L53365j98217M11678L26894K60493K84570N2996p9409
13990F392425L91155J20638N33672J412099j76187q8183j131254j528450j172087
13981D753828j200146k81858k44207k74207m01838k84120j62711L11744n18961
13972A697524N43298j55889k73303L91165k80540J70230l58289M1118j3201N1573
13962A813686J23765l62242L51164r6879K72262j42366k37965P688K137l63183
$$ plain form
14030 3070285 3363297 3311010 3117920 2979675 3189781 3259229 3083367 3313790 2953746 3605989
14020 3605989 3283420 3349152 3423970 3065447 3677808 3597439 3315778 3598757 3617017 3415471
14010 3415471 3774020 4094559 4110595 4246129 4406514 4340559 4243016 4429345 4676056 4561559
14000 4561559 4840488 4980055 5333420 5135203 5546881 5873775 6134268 6418838 6471834 6392425
13990 6392425 6783580 6904218 7437890 8849989 8673802 8585619 7454365 5925915 4753828
13981 4753828 3553682 3271824 3027617 2753410 2351572 2067452 1904741 2216485 1697524
13972 1697524 2240822 2084933 1811630 2202795 1922255 2092485 1734196 1775314 1762113 1813686
13962 1813686 1937451 1575209 1926373 1829494 2101756 1959390 1721425 1729113 1731250 1368067
13952A368067L3073M34387o7654L5944k10023K72581l30201N5840l01579K53609
13942A544044L15885k09731k30991o8459M21306l36368K87930m13136L9990O8428
13932A418898q8955L60569l59045K30779J58846j52241k77231j50304K54241K81493
13922A677050l79769J32949o6943o4973J97892l1970l0547k28750J19731l0340
13912A294330L174p1621j19279M26372k70415j97105K49815R2843j07146R7803
13902A398771k30807J48351l41408L04021k0178K3876J40273m61755n7019J6451
13892I20576K67906K68423M5179j58634j71112J69765k89138J83099j11083J79423
13882A304404q4756j87561j46881q5461o3212K29852P6197J12082l38188K87125
$$ plain form
13952 1368067 1401140 1835527 1767873 1803817 1593794 1866375 1536174 1592014 1290435 1544044
13942 1544044 1859929 1650198 1419207 1350748 1772054 1435686 1723616 1310480 1350470 1418898
13932 1418898 1329943 1690512 1331467 1562246 1721092 1568851 1291620 1141316 1395557 1677050
13922 1677050 1297281 1430230 1363287 1298314 1496206 1464236 1433689 1204939 1324670 1294330
13912 1294330 1297504 1225883 1106604 1532976 1262561 1065456 1315271 1408114 1300968 1398771
13902 1398771 1167964 1316315 974907 1278928 1258750 1282626 1422899 961144 904125 920576
13892 920576 1188482 1456905 1502084 1343450 1172338 1342103 1052965 1236064 1124981 1304404
13882 1304404 1219648 1032087 885206 799745 736533 966385 1042582 1154664 816476 1103601
13872A103601j49073k85799K49777J71193j46750l9745j91394K62045L9788M3159
13862A056802j85926j15646r914R4533M60193n60654L55703l7303k3808j56083
13852H77897j77310K21899k37889L45465j26658k0468m211K66199j38486q8916
13842I17522j33034K83191j55750j06372L4260J38525j75941j09734j168j18711
13832E72788J82720j04001K67181k1757p3527O6459K2504q7869N4471o563m7706
13821H24700j7691r9382L5987J25732j70839O4900k5154P5862L7462M0290n2550
13810H39317K99172p0580l80355j06650K18711J44844k68315J87155q8660l43341
13800D31298Q0686K69679j95316L26274l59681Q7667J9953n3927m9813k4598L27142
$$ plain form
13872 1103601 954528 668729 918506 1089699 942949 903204 711810 973855 1013643 1056802
13862 1056802 870876 755230 745316 839849 1300042 739388 1095091 1057788 1033980 877897
13852 877897 700587 922486 684597 1030062 903404 882936 878725 1144924 1006438 917522
13842 917522 784488 1067679 911929 805557 839817 978342 802401 692667 691499 572788
13832 572788 755508 651507 918688 896931 823404 889863 912367 824498 878969 872406 824700
13821 824700 807009 707627 743614 869346 698507 763407 738253 814115 851577 891867 839317
13810 839317 1138489 1067909 687554 580904 799615 944459 676144 863299 774639 431298
13800 431298 511984 781663 586347 912621 552940 640607 660560 606633 556820 532222 859364
13789H59364J68861l60814k89802L61711k44732K72965B84714M61250j19533j90194
13779D36237N0494J42712L6284m0629j9651q2717J70615J44490l44053M35900
13769I29682l94399r9806N39296l61105j49179A59732M40974j57976B16111M33798
13759F49909j75488A15944L40659O5232p7964E2189O21554M5416k06205n8118
13749D54836K73993o1924O2023j96767n9257J14350p4769R2219k7816k19327J02514
13738D60075m294K11209k24177A79545N37171k16540J21502K06151C31397Q311
13728C39708J8006K29245k48077L19662m2415B32757M23319j2407J21169l03884
13718D60954M11304l16875M37736l48423M3030l31842L16840l9041Q1984l19887
$$ plain form
13789 859364 1028225 667411 377609 739320 494588 767553 284714 745964 626431 436237
13779 436237 486731 629443 665727 625098 605447 522730 693345 837835 493782 929682
13769 929682 535283 435477 974773 613668 464489 159732 600706 442730 216111 649909
13759 649909 474421 115944 456603 521835 443871 52189 673743 719159 512954 454836
13749 454836 728829 666905 728928 532161 472904 587254 512485 604704 576888 357561 460075
13738 460075 455781 666990 442813 179545 716716 500176 621678 827829 331397 339708
13728 339708 357714 586959 338882 658544 616129 232757 656076 643669 764838 460954
13718 460954 872258 555383 993119 644696 687726 355884 672724 633683 715667 395780
13708C95780J0006L9817M3370m2675j32731J22303J12797j94995j55338K92351
13698D90685q9016J9485K45808C05437N9404J28156p9736L48177k77390J92456
13688F76504l02755M884Q5231A41897L51252j94655N1470L03628j49518j58636
13678C45438J30323o444K08109k88194L3900k08688N9575j5255J56012k0621J7213
13667D11368M0546K3397k7078j29999K87485J4447Q135r4144B43651N3306o9196
13656B27761L66613j69156A61995J36956q6359M28884j88182j64165M6134K21337
13646E56600j39499N0989A75374m8146M58882B30489F9554P9050J68967A44632
13635C71385l3745J19971f356F4233N46569k33977J74480B54039K36757q3689
$$ plain form
13708 395780 405786 445603 488973 446298 313567 435870 548667 353672 198334 490685
13698 490685 401669 421154 666962 305437 364841 492997 413261 761438 484048 676504
13688 676504 373749 378633 463864 141897 493149 298494 349964 653592 504074 345438
13678 345438 475761 469317 677426 389232 423132 214444 274019 258764 414776 394155 411368
13667 411368 451914 475311 448233 318234 605719 620166 628301 534157 243651 296957 227761
13656 227761 594374 425218 161995 298951 212592 641476 453294 289129 335263 556600
13646 556600 417101 468090 175374 127228 586110 230489 69554 148604 317571 144632
13635 371385 337640 457611 -6356 64233 610802 376825 551305 254039 490796 407107
13625D07107K11553k57634j12414J04352j44961n8458L60525j42468N3010j43205
13615B77407J42977k5522K24713A22957L92167j2400r6236A50541L1185J45462
13605C27188A10499L18176q2811A58681K53992j08119G9271K18880J27319L862
13595D29332n8335A09594K60442n3859A52752J03084I5878Q13780A33981K26884
13585C60865A48288P5971K42260r8618j27633N8231M35986B29264J14643j51199
13575A92708K18577A28064J98028K11205k32787p9870q0103M4609I0781J53956
13565B44737J32336M7221m2034b1937B89462q5131J5806k9324d8959E63464j06242
13554D57222j39648k6694q6684J08691J2113K3968R0411A03959k9572R0931O2288
$$ plain form
13625 407107 618660 361026 248612 352964 208003 149545 510070 367602 420612 277407
13615 277407 420384 394862 619575 122957 515124 502724 406488 150541 181726 327188
13605 327188 110499 428675 345864 158681 412673 304554 79271 298151 425470 429332
13595 429332 370997 109594 370036 316177 152752 255836 95878 909658 133981 360865
13585 360865 148288 224259 466519 367901 240268 298499 734485 229264 343907 192708
13575 192708 411285 128064 326092 537297 304510 224640 144537 189146 90781 244737
13565 244737 377073 424294 382260 -21937 289462 204331 220137 190813 -48959 563464 457222
13554 457222 317574 290880 204196 312887 325000 348968 439379 103959 74387 165318 227606
13543B27606D2780J57384N7362J75818q0847r7305a28036O3219B76020n6172m7372
13532A72476l0436P8109O2996K26646I3654M31979A33454L11434J77818k52522
13522C70184Q8370j73116g3480A95879J68239A75579Q8336a08659B22575D1905
13511D54673D0323a8025B06543L13729j75577j66785q1728J65772E1899K66240
13501C18139a5184A57002J14456M8527o1749j8272B5082J9221L98263j78466Q1919
13490C46019Q6297j84990A7504J21290J30033J42399n5119E6656Q3726J01696
13480B42078o1794J05591p9043Q1072n4019m7030M6599q0026C8861J81053G3068
13468b8173D44454f140A92408F7056J53643l9944l5454k1730J61475j01191J4909
$$ plain form
13543 227606 42780 200164 257526 433344 352497 255192 -128036 -64817 276020 219848 172476
13532 172476 142040 220149 283145 509791 93654 525633 133454 444888 622706 370184
13522 370184 458554 285438 -73480 195879 364118 175579 263915 -108659 222575 41905
13511 454673 40323 -18025 206543 520272 344695 177910 96182 261954 51899 318139
13501 318139 -15184 157002 271458 319985 258236 239964 25082 44303 442566 264100 346019
13490 346019 432316 247326 17504 138794 268827 411226 356107 56656 140382 242078
13480 242078 180284 285875 206832 287904 233885 186855 233454 153428 38861 219914 73068
13468 -28173 444454 -6140 192408 67056 220699 180755 145301 123571 285046 183855 198764
13457A98764N1752J02516j41722j476r0488L29173f6293B30850J28349A33575
13446B88136F3208J79456C5985K42700R4586C6625R3315l0475J35315n6271D1434
13434B35999a4943k28948E56446A45107K10164j41287h6251B14204K31326G0726
13423e7583B89774j34497L1710i0061A83548J78135J38004k46249j4188F3628
13412D34895A80970J19286A20487O8801J42760p9659j726D9425j9466K93340J2459
13401C35758E2206M02145h5247j24416e2739B31260a82411A71807J39719J32873
13391D44399A14270m9706M9788C5900J70961C0508J37899K18686A47657n5663
13381I1994K5476J15544P6084K0451Q4227a258B01344j0674M8454G3432M3023
$$ plain form
13457 198764 250516 353032 211310 209834 119346 448519 -66293 230850 359199 133575
13446 288136 63208 242664 35985 278685 373271 36625 129940 99465 234780 178509 41434
13434 235999 -14943 -243891 556446 145107 355271 213984 -86251 214204 445530 70726
13423 -57583 289774 155277 186987 -90061 183548 361683 499687 253438 239250 63628
13412 434895 180970 300256 120487 189288 332048 252389 250663 49425 29959 323299 335758
13401 335758 52206 454351 -85247 -209663 -52739 231260 -182411 171807 311526 444399
13391 444399 114270 64564 114352 35900 206861 30508 168407 387093 147657 91994
13381 91994 117470 233014 309098 329549 413776 -1258 201344 190670 239124 73432 116455
13370A16455N3126J99024h7762E68873j82868A27311e3192C08231C5L03150j42862
13359A60323K86967A11734h8650B05774j3370e9194E4090L37887Q1258A46465
13348A95153I0792l3082g869A53077k6156K24376J17942A42919J84585g8974b3883
13336a13996A79601M8710P4647a88088D15486F5605J14085h3711A18759n4282
13326F4477i6630C94163j35963P959J3688R1737H0258b87238A96188J95363j28229
13315B63322F0661B0629M32101j26883O5858a7254B17269J38191b6535B73586
13304c8197A20184d046C5046a88875C74954a46951e2921C5323J13305h5435G9328
13292H1089N9280a42151H5329j9070L1617K29494A3891a2947A58150R1371J25757
$$ plain form
13370 116455 169581 368605 -87762 568873 386005 127311 -53192 308231 35 303185 160323
13359 160323 447290 111734 -88650 205774 192404 -59194 54090 391977 473235 146465
13348 195153 90792 57710 -7869 153077 126921 351297 469239 142919 327504 -78974 -23883
13336 -113996 179601 228311 302958 -188088 415486 65605 179690 -83711 118759 64477
13326 64477 -96630 394163 258200 266159 279847 371584 80258 -287238 196188 391551 263322
13315 263322 60661 20629 452730 325847 391705 -17254 217269 355460 -26535 273586
13304 -38197 120184 -4046 35046 -188875 374954 -146951 -52921 35323 148628 -85435 79328
13292 81089 140369 -142151 85329 66259 97876 327370 13891 -12947 158150 249521 375278
13281C75278A23011b46240F4181N681K32618j1407J10612A74062a21049A83747
13270A95512N7847E681K1184M49840k09446a25076m4504A3191N46409j46388b87345
13258B2468L32817j05576c5452H8587Q9694p9966h1406F2056b00444B92104J06994
13247C99098a50533b2316k1130B03842J21625j58434b53678G7472a77730c540
13236G1646l4661a6250C63873N2855A20359e0283C07509n4116D1332p594O0547
13225I4285a6729A29344K40982a97463B15811f8047C62652H6783K92982j35035
13215B44730E8355b28459b1400C29154d8799A39774Q9934a01994B60591c8300
13204e942G8099d8305j85076b0097H2780f1014H683J21531J75921B9192P6777
$$ plain form
13281 375278 123011 -246240 64181 69862 302480 291073 401685 174062 -121049 183747
13270 195512 253359 5681 26865 476705 267259 -125076 -169580 13191 559600 413212 -287345
13258 22468 355285 249709 -35452 88587 178281 98315 -81406 62056 -200444 292104 399098
13247 399098 -150533 -22316 -43446 203842 325467 167033 -253678 77472 -177730 -3540
13236 71646 36985 -16250 363873 416728 120359 -50283 307509 253393 41332 33738 94285
13225 94285 -16729 129344 370326 -197463 215811 -68047 362652 86783 379765 244730
13215 244730 58355 -228459 -21400 329154 -48799 139774 229708 -101994 260591 -38300
13204 -5942 78099 -48305 -233381 -20097 82780 -61014 8683 130214 306135 29192 105969
13193A05969a88777B73592f8289C5792a46436F3243d981o4781o6681C68855i7438
13181E8177J27351O8637r4590d7706k0390H5838A0933a58089g638B51312j00175
13170A51137J51418A35459a75445B9321K67927A28194J11005A07997A1457b5127
13159A78099Q0365D0911J18761d6978G3903J69229K4647J2769A07934L2390n3858
13148H6466P5055r556J22860c251H1212n96R362J00309J85773h8801B40137j09981
13136A30156f0296B5433L77604q4926A44198C0451q997a60097O8060A54021g2640
13124b0234B04444G2310b20827A26838f0223B5737r367O6072J46422a33732k540
13113a36272D4389J26217c1197B07346l6355p7034j606f3092B19705a56135B97252
$$ plain form
13193 105969 -188777 273592 -68289 35792 -146436 63243 -4981 -69762 -136443 368855 -97438
13181 58177 185528 254165 159575 -47706 -68096 85838 10933 -158089 -7638 251312 151137
13170 151137 302555 135459 -175445 29321 297248 128194 239199 107997 11457 -25127
13159 178099 258464 40911 159672 -46978 73903 243132 267779 280548 107934 140324 86466
13148 86466 161521 151965 274825 -3251 81212 80616 89978 190287 376060 -88801 240137 130156
13136 130156 -60296 25433 403037 318111 144198 30451 21454 -160097 -92037 154021 -72640
13124 -20234 204444 72310 -220827 126838 -60223 25737 16370 82442 228864 -133732 -136272
13113 -136272 44389 170606 -31197 207346 170991 93957 92351 -63092 219705 -156135 297252
13101C10437f7232A01196f575j3300e057B34759a13577A53205F1140a34906E6685
13089g6912r1221B82228E7831f5094A4067L8383J48972I1421N631D3477R4917
13078A38394a86089A47188K13196A10853K9873D287d1120B63383a8012l9973A60164
13066C9779C255c9393n9958b0379l04026A24838i7508A61294A8395g2561D40561
13054A65387G9829a26732B64764f0159E8112M9156O1303f9678B11561b17361Q3499
13043a33862q8837c0665D84278C4180a18129A16691a20364G3446J31982K9100
13033B34528A9490a57539M1065B86320d1525j43435E6497A4610L31859o7595b39982
13021A3371R3211J06054a465A30471J85989F4582g5236C18998j12539J40098l4917
$$ plain form
13101 310437 -67232 101196 -6575 -19875 -5057 234759 -113577 153205 61140 -134906 56685
13089 -76912 -168133 282228 57831 -65094 14067 52450 201422 91421 97052 43477 138394
13078 138394 -186089 147188 360384 110853 140726 4287 -41120 263383 -18012 -57985 160164
13066 39779 3255 -39393 -99351 -20379 -324405 124838 -97508 161294 18395 -72561 440561
13054 165387 79829 -126732 264764 -60159 58112 107268 168571 -69678 211561 -217361 -133862
13043 -133862 -222699 -30665 484278 34180 -118129 116691 -120364 73446 205428 234528
13033 234528 19490 -157539 -116474 286320 -41525 -184960 56497 14610 346469 278874 -239982
13021 13371 106582 212636 -1465 130471 316460 64582 -75236 318998 206459 346557 311640
13010C11640j0625a18876b4439F0787j0800J18537J55203P499A27533K05101Q8150
12999D20784F5205e211D8500J24324K01463q9307a50006j50691A87428I3489a98238
12987b5827l3770B1248i5182q377B65014E3729J23481a12182c5711L991p7123
12976a08843A52134L2483g6160C86071F2138a40201a9133A57765J2870L8733j7935
12965A91433o7843K29407j52902d9034B58177f3179B62384i0312C4399J76823
12955B11222K6163A11316N5092a24276J0179A49682m3096L49540c9034k36129
12945b75163J18E01320A07708a74414A02468N4117D7873J9371l3052A0599i9184
12933a07558A66502q2041N0036a02390A20688f3795M118D3911Q078h4064H2756
$$ plain form
13010 311640 301015 -118876 -24439 60787 49987 168524 323727 331226 127533 332634 420784
12999 420784 65205 -5211 48500 172824 374287 284980 -150006 -300697 187428 93489 -198238
12987 -25827 -59597 21248 -95182 -103559 265014 53729 177210 -112182 -35711 -31720 -108843
12976 -108843 152134 184617 -76160 386071 62138 -140201 -19133 157765 170635 209368 191433
12965 191433 123590 352997 200095 -49034 258177 -63179 262384 -90312 34399 211222
12955 211222 237385 111316 166408 -124276 -114097 149682 106586 456126 -39034 -275163
12945 -275163 -275045 501320 107708 -174414 102468 156585 47873 67244 34192 10599 -99184
12933 -107558 166502 84461 134497 -102390 120688 -63795 -59677 43911 51989 -84064 82756
12921A31986E6943J02210b21844d4098I8563R0876e2809A46363N3132a1994l45934
12910c57928a68866A71953d8372a1351j53521b0791B0086J4261K64730C3736L42030
12899C75766b07181R3498q6395A85593c44583H1434J01476G7536J06695f6783
12888d3412C14417a06295c2592Q274q3962B46799C5372A5264r04J11988i3985
12876C7055i8238j4345H0410a49259I1450a79569d2527A18003c932F8245B5379
12864B46463a9500o8927G4580b8181A29183c83614N5925A28129a39412r6929B27845
12852a82743A67543K7037j4690a2259j0885j88752M3289J4180d0443l18703B33602
12840A24963D9472A459K13228c44910D9442j4577p669J05035B519a53728j08980
$$ plain form
12921 131986 56943 159153 -221844 -44098 98563 189439 -52809 146363 199495 -11994 -357928
12910 -357928 -168866 171953 -48372 -11351 -164872 -20791 20086 34347 299077 33736 375766
12899 375766 -207181 -113683 -200078 185593 -344583 81434 182910 77536 184231 -66783
12888 -43412 314417 -106295 -32592 -24318 -108280 246799 35372 15264 14360 126348 -93985
12876 37055 -98238 -112583 80410 -149259 91450 -179569 -42527 118003 -3932 68245 25379
12864 246463 -19500 -88427 74580 -28181 129183 -383614 -327689 128129 -139412 -236341 227845
12852 -182743 167543 194580 179890 -12259 -23144 -211896 -168607 -154427 -40443 -359146 233602
12840 124963 49472 1459 214687 -344910 49442 34865 27196 132231 2519 -153728 -262708
12829b62708c2553H1328l0959K27682a0139A91657f4838J1942i835k74642B95574
12817h5270l70383a672j03007b7916G0264R9287D0741a15111E5666e5965l16071
12806c72036A86384m0472J98161a103j84929A7985K05698b55034g4005q7409b0829
12794F8935a63863B8083J19991C074K96218j13627a33464e6296A12602P1097a10204
12782a52826C6517a9955H032a44358B9429J12241D0960c17765J43991q2996A20797
12770A25688c2138j45199A7226M2194J64336d4825q0667N7559C2493a06113F5997
12758G6269b58244B82634h6159c9163B4087Q881Q9435i7865F8972K04949A30880
12746f9217C24749h4249j19300L4410C66518e3723q9935f3943m9174j12439f6780
$$ plain form
12829 -262708 -32553 81328 50369 278051 -10139 191657 -64838 -52896 -9835 -284477 295574
12817 -85270 -455653 -1672 -104679 -27916 70264 169551 40741 -115111 55666 -55965 -372036
12806 -372036 186384 145912 344073 -1103 -186032 17985 223683 -255034 -74005 -161414 -20829
12794 68935 -163863 28083 148074 3074 299292 185665 -133464 -56296 112602 183699 -110204
12782 -152826 36517 -19955 8032 -144358 29429 141670 40960 -317765 -173774 -256770 120797
12770 125688 -32138 -177337 17226 59420 223756 -44825 -125492 -67933 32493 -106113 65997
12758 76269 -258244 282634 -86159 -39163 24087 32968 122403 -97865 68972 273921 130880
12746 -69217 324749 -84249 -203549 -169139 366518 -53723 -143658 -63943 -113117 -225556 -66780
12734B02061r1042k8640g7852D0062J50994m0977J65820G3801K43949A40843L1907
12723A72750G1848c2254m030G1481a53302a3378m8446j19883O4761m323d9579
12711D3590J86751a08587H8895R3964A3091J43435F8564M9237f7851A76718h0707
12699f6500H5946k6185M5101B2082f9621D2178A5598K49131G1185h0227G8951
12687C87977A34814b2615D5231a560r5091A20235L6603D7850B982J72029d58526
12675A8109K88662A22981L4825e4413l21057C7506Q6973b58283C14818d4756m3934
12664h8690L6116B17053F0160a15938A55795f6525m1667A71432E9049J83185j19094
12653A23140e052A3017b54460f2079a1769e249C3810a25656j0484a5530B1008
$$ plain form
12734 202061 111019 82379 -77852 40062 191056 150079 315899 73801 317750 140843 172750
12723 172750 71848 -32254 -36284 71481 -153302 -13378 -61824 -181707 -116946 -121269 -49579
12711 43590 230341 -108587 88895 182859 13091 156526 68564 117801 -67851 176718 -80707
12699 -66500 85946 59761 104862 22082 -69621 42178 15598 264729 71185 -80227 78951
12687 387977 134814 -22615 45231 -1560 -96651 120235 156838 47850 2982 175011 -458526
12675 18109 306771 122981 157806 -54413 -375470 37506 124479 -258283 314818 -44756 -88690
12664 -88690 -52574 217053 60160 -115938 155795 -66525 -108192 171432 59049 242234 123140
12653 123140 -5052 13017 -254460 -62079 -11769 -5249 33810 -125656 -136140 -15530 21008
12641A4833O001J77995H1569e3783A65111C7357A4773a53532o3773g71B38638
12629A60413B4941i5977r5206B03814H5011C1299a42306c580p5782D2301d6684
12617c62230J80887B14802A6134J59770K040h1855H4868J08314b029q7190l45355
12606d34574c3101A16960a21346A266a21391b915C2726b1645A99115b31084h8097
12594g0002A42975a7699j48775B42487f980H9857B3873R2592e7630C2491A4958
12582A39406J3327a92277b9142M506l60696A87843m4635a90286E0890a93294E5771
12570I1315a00511A8609J90511D0416O6067k2462c2117j65032c034A4207Q6059
12559A00266P1815l7276K66816g1083c0223A35456a05825C05135D4741k2001K79648
$$ plain form
12641 14833 20834 198829 81569 -53783 165111 37357 14773 -153532 -217305 -771 238638
12629 160413 24941 -95977 -191183 203814 85011 31299 -142306 -3580 -79362 42301 -46684
12617 -362230 -181343 214802 16134 175904 177944 -81855 84868 193182 -2029 -89219 -434574
12606 -434574 -33101 116960 -121346 1266 -121391 -2915 32726 -21645 199115 -231084 -88097
12594 -70002 142975 -17699 -166474 242487 -6980 89857 23873 116465 -57630 32491 14958
12582 139406 152733 -192277 -29142 -24636 -385332 187843 143208 -190286 50890 -193294 55771
12570 91315 -100511 18609 209120 40416 106483 84021 -32117 -197149 -3034 14207 100266
12559 100266 172081 134805 401621 -71083 -30223 135456 -105825 305135 44741 22740 302388
12548C02388D2903J78247O1480j04635A2465d6653I3474i427j75759D9288a04528
12536E4447f0779b4832j02054j54364B07508c60005J79236A54479F6424P540d39515
12524a50275A22218H613K23867h531j77457B12960D5668J98713E5760b91615J38868
12513a52747A82358a71887j13498a03989j28023j06859G3952l2428O458J19478
12503A67460a55451G5810a28710N6895A03713c3600l0269q4486G6141R8352b6453
12491D78771e4379B28920A10004J3511m0607Q7045a68072h2901k82304i1573A5517
12479B96554b87198a33353A22136Q7581I2154R5700b54281J19412b1202F1309
12468c35503D8472J74170I5688d3821C5416a37302j62411P9930A30504f6856l36144
$$ plain form
12548 302388 42903 221150 282630 177995 12465 -46653 93474 -9427 -185186 49288 -104528
12536 54447 -60779 -24832 -126886 -281250 207508 -360005 -180769 154479 66424 73964 -439515
12524 -150275 122218 8613 232480 -8531 -185988 212960 45668 244381 55760 -291615 -152747
12513 -152747 182358 -171887 -285385 -103989 -232012 -338871 73952 41524 47982 167460
12503 167460 -155451 75810 -128710 -71815 103713 -33600 -63869 -148355 76141 174493 -26453
12491 478771 -54379 228920 110004 123515 82908 169953 -168072 -82901 -365205 -91573 15517
12479 296554 -287198 -133353 122136 209717 92154 187854 -254281 -134869 -21202 61309
12468 -335503 48472 222642 95688 -43821 35416 -137302 -299713 -219783 130504 -66856 -403000
12457d03000A13252i7768j06303Q6201G567L03501e4941j41013C8650J99238a9097
12445A68095c6948p2694k58604m5682A88989G070a63177j61124e3291A66669c400
12433a37720c2270E8739e872E6416b89331A70264a30405K9485F0598B1788h43
12421b14202P6124A78803G1031a11675N580A79130a97750B56690m7669a59589
12410a49783G5413c1559j19311C49137A22789b91414Q3786B1258a50944j09584
12400b60528C86329a56799b4785j72070j1670B16504B9358A0744b57547a28159
12389d3382A28636g1316o1209B69424e737p6096a6111E8778a52989A00801B6731
12377H6965c1209A22796i1910I9456O5378o4864e8146J8100k41197A0202P7305
$$ plain form
12457 -403000 113252 -97768 -204071 -117870 7567 311068 -54941 -195954 38650 237888 -19097
12445 168095 -36948 -109642 -368246 -413928 188989 7070 -163177 -324301 -53291 166669 -3400
12433 -137720 -32270 58739 -5872 56416 -289331 170264 -130405 -100920 60598 21788 -843
12421 -214202 -138078 178803 71031 -111675 -106095 179130 -197750 256690 209021 -159589
12410 -149783 75413 -31559 -150870 349137 122789 -291414 -207628 21258 -150944 -260528
12400 -260528 386329 -156799 -24785 -196855 -208525 216504 29358 10744 -257547 -128159
12389 -43382 128636 -71316 -132525 269424 -5737 -81833 -16111 58778 -152989 100801 26731
12377 86965 -31209 122796 -91910 99456 164834 99970 -58146 -40046 -281243 10202 87507
12366H7507J4160c51190C05468c18508B91355h8217G1534b7478A8966a26261B11257
12354B9850d03479E2640J68254g3161A21779a57420H261c8669A33370E2819O2478
12343A15297M6632c036A89277e7483j50446l02260i8598A7890M7009c38914A29797
12331a15442J6608b425E945f6639N68B55962m6786e9683A39337f9141D595L13746
12319C18341g4949A47836J94415B2012a29440j39452a209j34686A53769J24446
12309B78215G1112J71593j6970r1589a08106A78424G2785J62281A01851d0446
12298G8475J87547E0232j6310N4251k70L37147a84237A46102H702K27234a14901
12286B00123a5290A92347P0311l2069p7669E9792j6821e935A30562N1597p4742
$$ plain form
12366 87507 101667 -351190 305468 -318508 291355 -88217 71534 -27478 18966 -126261 211257
12354 29850 -403479 52640 220894 -73161 121779 -157420 8261 -38669 133370 52819 115297
12343 115297 161929 -3036 189277 -57483 -207929 -510189 -98598 17890 64899 -338914 129797
12331 -115442 -98834 -2425 5945 -66639 -66071 255962 209176 -59683 139337 -69141 4595 318341
12319 318341 -74949 147836 342251 22012 -129440 -268892 -1209 -135895 153769 278215
12309 278215 71112 242705 225735 134146 -108106 178424 72785 235066 101851 -40446
12298 78475 266022 50232 33922 88173 87903 425050 -184237 146102 8702 235936 -114901
12286 200123 -15290 192347 262658 230589 152920 59792 42971 -5935 130562 182159 107417
12275A07417b20878B69036e7114B07486F0234b83B00074i5394H1763i4330H6453
12263e1312B48772A16528l4409e2529p7634A69239b76336D4637B1403J63219c2648
12251H0064K80672A58314c07259A77927a89610H6129O8543b8650D08826j46154
12241B62672c6025D3061b5800C11778j41011f9896G9137g4122j31721N4057B60705
12229A47670p910b6073A62725K9046Q7501G5264b21788B39232J56294B7517L4177
12218F1694L0600b23074B53523n5596M2447q0018d0983E038J1721K91416h9462
12206D4664P6594J55216E7057b71284C39748H1899e20127B76476G568e9836o2709
12195a22545A34373N5564D9047J47182b4313j11A67964I718b73102b756B87756
$$ plain form
12275 107417 -220878 269036 -57114 207486 60234 -283 200074 -95394 81763 -94330 86453
12263 -51312 248772 116528 82119 -52529 -130163 169239 -276336 44637 21403 184622 -32648
12251 80064 360736 158314 -307259 177927 -189610 86129 154672 -28650 408826 262672
12241 262672 -36025 43061 -25800 311778 170767 -69896 79137 -74122 -205843 -151786 260705
12229 147670 139760 -26073 162725 191771 279272 75264 -221788 239232 395526 27517 61694
12218 61694 92294 -223074 253523 197927 240374 160356 -40983 5038 16759 308175 -89462
12206 44664 121258 276474 57057 -271284 339748 81899 -520127 276476 7568 -59836 -122545
12195 -122545 134373 189937 49047 196229 -24313 -24424 167964 9718 -273102 -2756 287756
12183a32029D50048j09332a41500A31454b74722A27694a52728A1112b29871A49683
12172A14257b6256d138j25576A54167e735k33721A95055M3534o0361O9805I4008
12160B30656k0911a62155A40256e868k26364B25487J4756A05158q425a37587C7339
12148B69590D7424a82503F5739J57976J13540f4962l2875K4705R527R523k7604
12137h1686B27319F7675f7026A67347c5550l06372C5302K67309a42905O2233j4221
12126i4893A52852C7685P7551c2839B28687N7494c6358k66391A32317n7058f7608
12114H5748b58433e3581J1861j61372A93485a78332n3565d5733k8172A63497a44423
12102h2772B25919N0632a85225B70096m2933i5324E7093b2110j58032F3605b08901
$$ plain form
12183 -132029 450048 340716 -141500 131454 -274722 127694 -152728 11112 -229871 149683
12172 114257 -26256 -4138 -129714 154167 -5735 -239456 195055 238589 178228 248033 94008
12160 230656 209745 -162155 140256 -5868 -232232 225487 240243 105158 96733 -137587 37339
12148 269590 47424 -182503 65739 223715 337255 -64962 -97837 -73132 -63605 -54082 -81686
12137 -81686 227319 67675 -67026 167347 -35550 -341922 35302 302611 -142905 -80672 -94893
12126 -94893 152852 37685 115236 -32839 228687 286181 -36358 -302749 132317 75259 -67608
12114 85748 -258433 -53581 -41720 -203092 193485 -178332 -231897 -45733 -73905 163497 -144423
12102 -82772 225919 276551 -185225 270096 227163 -95324 57093 -22110 -180142 63605 -208901
12090C1997J34771J21415a53321A13674a15017G3925j3904A0314K40837a31035
12079C04336c1526B72737A7174b51566d8872p4498a6175A62979D2956a7367j13451
12068a30818A35292j7171b5735o2905j43327C3057a10162A11911h7267k38154
12058c25421j4072E0716A548M1342J20485a96182D1188J38894a41372B57526C5345
12046b566A4960O0263L788b74205C71445A21736C6112a54749M787k3011O0343
12035a12630A02286a86095Q8166B01957a00657j44092a5750m0054B35939g3713
12024a2734r4519N2312j01765A62934e2307A76688a46468I8331h8354G1667b28110
12012b76342A16397a10204L7981A54604F4342e3976K6841j99532I5966c55991
$$ plain form
12090 31997 166768 288183 -153321 113674 -115017 73925 60021 10314 251151 -131035
12079 304336 -31526 272737 17174 -251566 -48872 -123370 -16175 162979 42956 -17367 -130818
12068 -130818 135292 118121 -25735 -88640 -231967 33057 -110162 111911 -87267 -325421
12058 -325421 -339493 50716 1548 42890 163375 -196182 41188 180082 -141372 257526 35345
12046 -2566 14960 75223 79011 -274205 371445 121736 36112 -154749 -149962 -172973 -112630
12035 -112630 102286 -186095 -97929 201957 -100657 -244749 -15750 -55804 235939 -73713
12024 -12734 -107253 -54941 -156706 162934 -52307 176688 -146468 98331 -88354 71667 -228110
12012 -276342 116397 -110204 -72223 154604 64342 -53976 -27135 -226667 95966 -355991
12001a3599j7348k55799G4533E670M2579R126a00312B37852a37531A1584a5892
11989d9394B12059a2266A64985A8338a17533H9554K00746h2626O841A1081J49326
11978A60407a14306A28011F2994j8107a34737A26816j2896m3497J58860a33297
11967a59667A70513b96270B1452e5393A7761b19905J07710F6647h298B75461j28539
11956A46922R0209j4097f8243A12363a24732E1280k3039b48239g451B7046a07335
11944F5408r224M7360a29527K34e4494C27820A17599d78913D539c59551J71197
11933a88354d4398G6710g7201n1099A8320b02365A42382a59185q99f1861j26697
11922a88558P1767H9050d9242j13418N7959D5442j4778d1208k16461h628B080
$$ plain form
12001 -13599 -30947 -286746 74533 5670 48249 57375 -100312 237852 -137531 11584 -15892
11989 -49394 212059 -12266 164985 18338 -117533 89554 290300 -82626 -75785 11081 160407
11978 160407 -114306 128011 62994 44887 -134737 126816 113920 70423 229283 -133297
11967 -159667 170513 -296270 21452 -55393 17761 -219905 -112195 66647 -8298 275461 146922
11956 146922 237131 223034 -68243 112363 -124732 51280 28241 -248239 -7451 27046 -107335
11944 65408 56184 103544 -129527 -129293 -54494 327820 117599 -478913 4539 -359551 -188354
11933 -188354 -44398 76710 -77201 -128300 18320 -202365 142382 -159185 -160084 -61861 -188558
11922 -188558 -116791 89050 -49242 -162660 -104701 45442 30664 -41208 -257669 -8628 2080
11910c20771g6601B28138f3974f848m79861a92773R0225B14097H2692J22885C9230
11898E02633b6400F1522B8821b1602q0569k65581a18148E3104d77960K02125O9293
11887b06542h473C30858E3985M6911a50840E9054b71292d3313p2009d3114A88470
11875A53306C7665a48398q3821b2414A06292K5690J04101c16615k4947C79098
11864b28830J00174L8749j50905L8264a2407B61268b85328B8427a91951j16086
11854c08037a29891K5617j23439a0544j33604A05115b25992c9693r1175k7822
11844a58690a9036k16158A18052D1972d0270D35276a33336B40858g0158b9252
11833a1224N259j89587e5811G1990a06848H198M0896a17789A53439n7244j1729
$$ plain form
11910 -320771 -76601 228138 -63974 -6848 -486709 -192773 -102548 214097 82692 205577 39230
11898 502633 -26400 61522 28821 -21602 -102171 -367752 -118148 53104 -477960 -275835 -206542
11887 -206542 -8473 330858 53985 100896 -150840 59054 -271292 -43313 -115322 -43114 188470
11875 153306 37665 -148398 -232219 -22414 106292 131982 236083 -316615 -341562 379098
11864 -228830 -128656 -89907 -240812 -202548 -12407 261268 -285328 28427 -191951 -308037
11854 -308037 -129891 -104274 -227713 -10544 -144148 105115 -225992 -39693 -130868 -158690
11844 -158690 -19036 -235194 118052 41972 -40270 435276 -133336 240858 -70158 -29252
11833 -11224 -5965 -195552 -55811 71990 -106848 8198 49094 -117789 153439 96195 84466
11822H4466Q1438c18840a29709G3842a50125k05294a48017B41329b0560I6881
11811b44467J18862A51907k1970h3837b2118j39724E1858L570a54654b3292B76513
11799h0660n4527b0891D8797b48859h6886o4881C3176b55411p7858M9307o9396
11788c53358a7479k0970l1908B55603o7757P1534a35835E5162L0789J45553c5021
11776i2631b3645k01308A4300a25926F8551b88653e669K829C6291b06858B4502
11764b2579j07179M8582B1898a71164E355Q2657J88324K22041g8873j25201A49519
11752A58535k0005b45533A69375P9156G2162a76724r8075h9857B90209F1107P6488
11741A37595K5176g2776j38956J01842A22616B3407f4896A47890d6800p9232j15364
$$ plain form
11822 84466 165904 -318840 -129709 73842 -150125 -355419 -148017 241329 -20560 96881
11811 -244467 -125605 151907 129937 -83837 -22118 -161842 51858 55428 -154654 -23292 276513
11799 -80660 -135187 -20891 48797 -248859 -86886 -151767 33176 -255411 -333269 -283962 -353358
11788 -353358 -17479 -38449 -70357 255603 187846 259380 -135835 55162 85951 231504 -35021
11776 -92631 -23645 -224953 14300 -125926 68551 -288653 -5669 -2840 36291 -206858 24502
11764 -22579 -129758 -81176 21898 -171164 5355 88012 276336 498377 -78873 -204074 149519
11752 158535 138530 -245533 169375 248531 72162 -176724 -274799 -89857 290209 61107 137595
11741 137595 162771 -72776 -211732 -109890 122616 23407 -64896 147890 -46800 -126032 -241396
11730b41396B1487K08767a08550E33608r3226D7621b99694D54683c1680k22838
11720b54518E4052e6708j34941J182P1528A11670b73619A21282d498j11761c8687
11708D7094a94085b5863j65409N4902B60393F2987B1566b42820h7321H8504K58605
11697C47109l0266D9818J35339G1914L6682c0913H6117a84118c7367B82768K98516
11686E81284D328L36764b6206A07224K5418m0902a59917e9398j9462j67100a02058
11674a87680B12039K6832i0489C01444a41727A95200q5505a06888D1718J01727
11664A43445M9139C1948a60165m0335R4148L5147I2500g0834A16185d845l4597
11653c9442B05467a00585k11331L8337e6014B46654b75674A82906b18506l183
$$ plain form
11730 -241396 21487 230254 -108550 533608 440382 47621 -299694 454683 -31680 -254518
11720 -254518 54052 -56708 -191649 -190467 -118939 111670 -273619 121282 -4498 -116259 -38687
11708 47094 -194085 -25863 -191272 -136370 260393 62987 21566 -242820 -87321 88504 347109
11697 347109 316843 49818 185157 71914 108596 -30913 86117 -184118 -37367 282768 581284
11686 581284 4328 341092 -26206 107224 132642 91740 -159917 -59398 -78860 -245960 -102058
11674 -187680 212039 238871 -90489 301444 -141727 195200 109695 -106888 41718 143445
11664 143445 192584 31948 -160165 -200500 -106352 -71205 92500 -70834 116185 -4845 -39442
11653 -39442 205467 -100585 -311916 -273579 -56014 246654 -275674 182906 -218506 -221689
11643b21689Q5816r3771A46887C463J1793c06941G0798g9733j7209J4685A24774
11631a11443r3101D0068K13514F8545j8549a40814e7854J5717F9797a59632f2155
11619H3427J75168a35694L102N9964j01078j8205E02874b4330j71526b6415p7797
11608a04212R833E8212J06509B9265J2730g5906q7174a8897k08789J6228D1875
11596i01G8772i1526j85916D2291K6709h5803I8949b17851M817f849k75376e899
11583E1165K54535A43030m8377l4706J61179h2883q0483C2776a63425e8771a2005
11571A45175K3894c9046k37081a19980E9723K36553I7402c54885i4051A38188
11560I6141k9104a25299D30080o0326C0864I006R8783m9465h7824B95474a0232
$$ plain form
11643 -221689 -135873 -229644 146887 3463 15256 -306941 70798 -79733 -96942 -82257 124774
11631 -111443 -204544 40068 253582 68545 49996 -140814 -57854 -42137 69797 -159632 -62155
11619 83427 258595 -135694 -132592 -72628 -173706 -191911 502874 -24330 -195856 -26415 -104212
11608 -104212 -94379 58212 164721 29265 41995 -75906 -163080 -18897 -227686 -211458 41875
11596 -901 78772 -91526 -277442 42291 69000 -85803 98949 -217851 -213034 -6849 -282225 -5899
11583 51165 305700 143030 94653 59947 221126 -82883 -163366 32776 -163425 -58771 -12005
11571 145175 169069 -39046 -276127 -119980 59723 296276 97402 -354885 -94051 138188
11560 96141 67037 -125299 430080 369754 30864 9006 107789 58324 -87824 295474 -10232
11548C3520g6201B28954e0153a5523A19460J67620a2136B66961a62808B07357
11537B43591L5246B3597K9257J47870j046J76469A0220N232J9702J91685j2731
11526B14108K12458A26422f0215B02681P1569A29150J1455c22965B07488L664
11516B11152j8104J7940Q4055B2561g5531A48483J57392l0728b78919B65849B0359
11504C5743M4206M375L3286c23159I6312m0244b25378B17302E0872B4949d9223
11492B24766m6715a04314c5160j38703r5323a00098B32148A07810e6995B30884
11481i7955H3360a18823A94261a05334D3639N3372J54819C3657K208J382d9317
11469b1452A5418J7324c9183A95030G4869B6582P9113K13857b30358A60167d8566
$$ plain form
11548 33520 -76201 228954 -50153 -15523 119460 287080 -12136 266961 -162808 207357
11537 243591 278837 23597 52854 200724 199678 376147 10220 15452 35154 226839 214108
11526 214108 426566 126422 -60215 202681 274250 129150 140605 -322965 207488 211152
11516 211152 193048 210988 295043 22561 -75531 148483 305875 275147 -278919 265849 20359
11504 35743 79949 84324 117610 -323159 96312 56068 -225378 217302 50872 24949 -49223
11492 224766 178051 -104314 -35160 -173863 -269186 -100098 232148 107810 -56995 230884
11481 -97955 83360 -118823 194261 -105334 43639 97011 251830 33657 35865 37247 -49317
11469 -21452 15418 32742 -39183 195030 74869 26582 105695 319552 -230358 160167 -48566
11457B21167d1259j98913g7093j52096D69737g0463k30092A23785b12372r6796
11447c09168E9857c2295j41882h4793K3107A63835E1946b4208D4111a45470A47144
11435b94312A54633k217a3276j77718a1899G7050a06761j0822a9578B51802a64001
11423A3258J8538L2717a59787G9624a77020A59493J02320b24339A99822J3827
11413B13649J79134a48495j86626B33305M5795g6933A0185a97520N697F3751j3697
11402E0054g7270o714b8455k0219A85033f0179j18089A2762P525J20035R4542
11391B34864a37332f4480j3796a2122B04318G8971K083K56455g233A44337i2500
11379g2855D41426A5705a4265j26288A74385a95756A14409d4409k4412B24025
$$ plain form
11457 221167 -41259 -240172 -77093 -229189 469737 -70463 -300555 123785 -212372 -309168
11447 -309168 59857 -32295 -174177 -84793 -61686 163835 51946 -24208 44111 -145470 147144
11435 -294312 154633 152416 -13276 -190994 -11899 77050 -106761 -117583 -19578 251802 -164001
11423 13258 31796 64513 -159787 79624 -177020 159493 261813 -224339 199822 213649
11413 213649 392783 -148495 -335121 233305 279100 -76933 10185 -197520 -191823 63751 50054
11402 50054 -77270 -83984 -28455 -48674 185033 -60179 -178268 12762 20287 140322 234864
11391 234864 -137332 -64480 -78276 -12122 204318 78971 81054 337509 -7233 144337 -92500
11379 -72855 441426 15705 -14265 -140553 174385 -195756 114409 -44409 -68821 224025
11368b54695j84732a92227g2864A49962a13508C8435i1219A68261c2893Q060G2768
11356c63188a34086D754i936B90821b78519A331Q6872j4969C2771b77362e85C661
11343c2722B95549n2100c9450A40053c42157d1946k16656a8155A15030a49734
11332D1486c89617e7118M295h977k15499e5720A35772j3282K0261b66344A07991
11320c8315k05692F5194c4948A86944G2986c96348d0122j78598A57455a12018
11309c51155A6226N2366B3994K992b7644A84269d6734N274j12854P2338b0725
11297a1462D595Q102a81141a8554p2185n263C10224C9335b23482C1515J65926
11286A97441a25802e962n2592F2059N8464L3569p5349d29142D4267a1563k10136
$$ plain form
11368 -254695 -439427 -192227 -72864 149962 -113508 38435 -91219 168261 -32893 -24833 72768
11356 -363188 -134086 4754 -9936 290821 -278519 1331 88203 73234 32771 -277362 -585 3661
11343 -32722 295549 243449 -39450 140053 -342157 -41946 -258602 -18155 115030 -149734
11332 41486 -389617 -57118 -52823 -8977 -224476 -55720 135772 122490 142751 -266344 107991
11320 -38315 -244007 65194 -34948 186944 72986 -396348 -40122 -218720 157455 -112018
11309 -351155 16226 68592 23994 26986 -27644 184269 -46734 -41460 -154314 -81976 -20725
11297 -11462 4595 12697 -181141 -18554 -90739 -96002 310224 39335 -223482 31515 197441
11286 197441 -125802 -5962 -58554 62059 120523 154092 78743 -429142 44267 -11563 -221699
11275b21699c5543r3614G6789a56165a0847E1129J38108A7418f7237p1032A50799
11263d3347j66208f9728q9783A53624b50312a24873A76903a89044H8275A3145
11252D8227a64470G7274J17117o6263F3565H532J08912b15514G6344Q002d778
11240i6045K3595A95062d16184i5265M0521J5836A38572f1288k24779a14799B9658
11228A13924b75612J35038h680B6817K18143A735M0518d21985a43528D4353K03998
11217B48351e1520A78626A8670l535L0976J87731D1700P7703b55246f0089C1185
11205A52382a01897A32230a44781D569J71490c16835C16296a83225O6983B16884
11194A13722l181a4642A92893b39682k40151B7960a37788C01624j34801C9965
$$ plain form
11275 -221699 -35543 -129157 76789 -156165 -10847 51129 189237 17418 -67237 -138269 150799
11263 -43347 -209555 -69728 -159511 153624 -250312 -124873 176903 -189044 88275 13145
11252 48227 -164470 77274 194391 128128 63565 8532 117444 -215514 76344 84346 -4778
11240 -96045 -72450 195062 -416184 -95265 -54744 -38908 138572 -61288 -286067 -114799 29658
11228 113924 -275612 -140574 -8680 26817 244960 1735 42253 -421985 -143528 44353 248351
11217 248351 -51520 178626 18670 15135 46111 233842 41700 119403 -255246 -60089 31185
11205 152382 -101897 132230 -144781 4569 176059 -316835 316296 -183225 -116242 216884
11194 113722 110541 -14642 192893 -239682 -479833 27960 -137788 301624 166823 39965
11183a88488j55017a62275d8058N33j4954e622F5664c52449H5379d31905d9271
11171c2981G3605g5983b3853A72521a26821g797B0745c1303p0121A88097B4641
11159b86512g4913A31373b7076F8648L6954P4381a34875n4182P9364A82507a61478
11147B14420e36495B68831n225I7583k0238k7371J18996a31994F8479b22821i7652
11135e5717a5368j94161A04537R0236B2057J20555P2263B3301a58478B46000G0465
11123A42432O0157h8322p7631g8096q7187A02104l2615k5226K11793F3887f000
11111B68452p7870D8576a9373A64565b34264C81099H2191c07063C62415j46905
11101B15510m2779i8716j7282C18343A30490N3114L59176g2422a6397A67889k1057
$$ plain form
11183 -188488 -343505 -162275 -48058 -47525 -62479 -5622 65664 -352449 85379 -431905 -49271
11171 -32981 73605 -75983 -23853 172521 -126821 -7797 20745 -31303 -101424 188097 24641
11159 -286512 -74913 131373 -27076 68648 105602 179983 -134875 -189057 -109693 182507 -161478
11147 214420 -536495 268831 263606 97583 77345 49974 168970 -131994 68479 -222821 -97652
11135 -55717 -15368 -209529 104537 194773 22057 142612 214875 23301 -158478 246000 70465
11123 142432 202589 -88322 -165953 -78096 -165283 102104 69489 44263 256056 63887 -6000
11111 268452 190582 48576 -19373 164565 -234264 381099 82191 -307063 362415 215510
11101 215510 172731 -98716 -115998 318343 130490 183604 542780 -72422 -16397 167889 146832
11090A46832a59233A44974K17918N7206j33165p4014P3795M7591A31001C7350
11079C09351l7624K7844N891L2355c6498I0427J07486o3858J396M78011k07850
11068D05612A63742J76228J29174J31841B60321K72117k02444O4745J65490o9959
11058D90270M5384j99499j22769M78425j58614K39964q0498n2056k68774P5432
11048D47265M12098B93404L09672R5732k05710L9025J72425k66568A46003M715
11038A50718L06906A94844J03847P8258K36809j72638r9651K43000n0674k44927
11028B88868j41293J46583K70083j04871J55093P9401l43922L2674M4038q6905
11018C39749J79149k1644j33942K03323j5851L4547k73054K11299p6580M21210
$$ plain form
11090 146832 -159233 144974 362892 420098 286933 212919 286714 334305 131001 37350
11079 309351 271727 299571 305462 337817 -36498 90427 197913 134055 135451 613462 405612
11068 405612 163742 339970 469144 600985 260321 532438 329994 394739 560229 490270
11058 490270 535654 336155 213386 691811 533197 773161 692663 640607 371833 447265
11048 447265 859363 293404 603076 698808 493098 532123 704548 437980 146003 150718
11038 150718 457624 194844 298691 376949 613758 441120 341469 584469 533795 288868
11028 288868 147575 294158 564241 459370 614463 693864 349942 382616 426654 339749
11018 339749 518898 497254 363312 566635 550784 585331 312277 523576 446996 868206
11008H68206l46328K10917k57486J64134k26341O9942L26314k27364B70059J14125
10998C84184K56078M4819j24986J59250R2823q1762j31357J62043J01568O2657
10988I25317r1227o4589m7462K33439J38528J41929n32059J32086K89175j91174
10978I33963K43734j02995j40255L04348k65711J2036j7719k8805j0162L10189
10968A238623o2753l06771K80136m63520J39035M0701j51209M1595k17122J05325
10958F44040j50604K05438j33820j29984n0314K2244f1369C4922e4404A15683
10947B49967a8123D08258d9604D5535K96241I8361C0591g9302A27079h9947A0877
10935A20570M9894a12103k11853A15267d4168G8902B67e132k86740l56092E5308
$$ plain form
11008 868206 521878 732795 475309 639443 413102 483044 809358 581994 270059 384184
10998 384184 640262 685081 560095 719345 812168 730406 599049 761092 862660 925317
10988 925317 834090 769501 722039 955478 1094006 1235935 703876 835962 1125137 933963
10978 933963 1177697 1074702 934447 1238795 973084 985120 967401 938596 928434 1238623
10968 1238623 1175870 869099 1149235 685715 824750 865451 714242 755837 538715 644040
10958 644040 493436 698874 565054 435070 384756 407000 -61369 34922 -54404 115683
10947 249967 -18123 408258 -49604 45535 341776 98361 30591 -79302 127079 -89947 10877
10935 120570 170464 -112103 -323956 115267 -44168 78902 267 -5132 -291872 -647964 55308
10923e296A61845c18120f0015j0946C66491A5433b86269A80016a62932A24471
10912b58365b4795H8149J14248b65971A50825J07434b8570H9924j8118c2057j54701
10901a86758a7872E2959K7475G075L4867a71063C4445a86503H8980P3019b05215
10889a71403d1185p6147j01442N7016D7983O4082L1405i1476C400M33602i2260
10877a43116M1147L3741G9667c0271k2989B2461e6165A27174K2894J1107a58727
10865C5403A0962L98132B02242M2381a47461O0638A7385J86182a62902a0349j3936
10854b4285A33063a65029j96967a56200M2320l0244c5178m0614B24266A08592
10843a68311J6893N3917c7598J7193m4933B18938a11072k1592K0961j98554b3753
$$ plain form
10923 -5296 161845 -318120 -60015 -70961 366491 15433 -286269 180016 -162932 124471
10912 -258365 -24795 88149 202397 -265971 150825 258259 -28570 89924 71806 -32057 -186758
10901 -186758 -17872 52959 80434 7075 41942 -171063 34445 -186503 88980 161999 -205215
10889 -171403 -41185 -117332 -218774 -161758 47983 112065 143470 -91476 3400 437002 -92260
10877 -143116 -101969 -68228 79667 -30271 -53260 22461 -56165 127174 150068 161175 -158727
10865 35403 10962 409094 202242 244623 -147461 -86823 17385 203567 -162902 -10349 -24285
10854 -24285 133063 -165029 -361996 -156200 -113880 -144124 -35178 -75792 224266 108592
10843 -168311 -151418 -97501 -37598 -20405 -65338 218938 -111072 -132664 -111703 -310257 -23753
10831b77413G6801a69365C3649a41914A7275a35796o1116k5889b5346H2841K06893
10820B89734A8433c3565l462o2683D9713b48695C52494j65274a90210O9863C8568
10808F3036N7152e4507p8656D1145K00848h8095j27566C771b1346j26255j28177
10797b75778a6683j48089A40888i8616B4193a43531l6407r8413C5722N0554J04157
10786A90433a1914A0190a80350j01286J12655B2909g8040l9733k358A19454a06335
10774F9110d13670F0091a11582I9887A8534R5379j3763L0196a15844D2038c7184
10762d2418q2259A38525J45487d2993k61103Q3151q5353c2344I0710J60299f645
10750a04247C72528A10624P8830e4686A53018J02919b61859a00454j14468q8936
$$ plain form
10831 -277413 76801 -169365 33649 -141914 17275 -135796 -196912 -222801 -25346 82841 289734
10820 289734 18433 -33565 -37027 -99710 49713 -248695 352494 187220 -190210 -120347 38568
10808 63036 120188 -54507 -133163 41145 241993 -88095 -215661 3771 -21346 -147601 -275778
10797 -275778 -16683 -164772 140888 -98616 24193 -143531 -179938 -278351 35722 86276 190433
10786 190433 -11914 10190 -180350 -281636 -168981 22909 -78040 -117773 -120131 119454 -106335
10774 69110 -413670 60091 -111582 99887 18534 113913 100150 130346 -115844 42038 -37184
10762 -42418 -124677 138525 284012 -42993 -304096 -220945 -306298 -32344 90710 251009 -6645
10750 -104247 372528 110624 189454 -54686 153018 255937 -261859 -100454 -214922 -303858
10740c03858O2508E2813a35575F8581e3572K1940j14389b7464n7906o2236A38439
10728e3018j27251F8760a01299K1671A98261b55439g1035A20573C5273b40330
10717d3984C1612j675b31364A9024a82959m0258L7795m5752A7704Q5202d9102
10705A33670c30257F0302a40027N6910r2855P0875l35283A30150d1005A04048
10694B46656F2627b16994P7210B49886b34350f3061J087l8738p8437C1912M3141
10683G5053a12831A0401b41897n1372a28373C4251a35742O6668l139l8907L3603
10672g7517L2309n4414J6535j1679G5412k4324f2137j17028F9637a4976B34609
10660B31625b36833h2970A71538e0927q493A39629J57252a18804A31076b35467
$$ plain form
10740 -303858 -241350 52813 -135575 68581 -53572 -31632 -146021 -27464 -85370 -147606 138439
10728 -53018 -180269 68760 -101299 -79628 198261 -255439 -71035 120573 35273 -240330
10717 -43984 31612 29937 -231364 19024 -182959 -223217 -185422 -231174 17704 102906 -49102
10705 133670 -330257 60302 -140027 -83117 -175972 -105097 -440380 130150 -41005 104048
10694 246656 62627 -216994 -139784 249886 -234350 -63061 -61974 -100712 -179149 31912 75053
10683 75053 -112831 10401 -241897 -293269 -128373 34251 -135742 -69074 -72213 -111120 -77517
10672 -77517 -45208 -99622 -83087 -94766 75412 51088 -62137 -179165 69637 -14976 234609
10660 231625 -236833 -82970 171538 -50927 -59420 139629 296881 -118804 131076 -235467
10649D5022J7638a0584j47244e7771A2093d6656j38874h4619b2704D5629R6758
10638A42387b4955j05908j15789J22680H8919N650a26499B70803f3521f428I2456
10626d5366j10338a7518G0136e1285r6291k45486A25722c31805H2323J37216b59478
10614e95610E9918J396a00589j21677N9486j366b0988A77296D7223d3086k1149
10603f4235j30816k61944A5061Q1505h6923B78606D5193a17621B39541r1294c14894
10591c96905A70968r948a67950j31236g0240r465q0624A68936B9397g3670c2651
10579a75580l333A20054f1202H214b01025A3102M8073a13759l7456j39319a776
10567f1879G306L1741J15013C1090J33402b2753q3494B98364a28689j00897A17352
$$ plain form
10649 45022 62660 -10584 -157828 -57771 12093 -46656 -185530 -84619 -22704 45629 142387
10638 142387 -24955 -130863 -246652 -123972 88919 94569 -126499 270803 -63521 -6428 92456
10626 -45366 -155704 -17518 70136 -51285 -147576 -393062 125722 -331805 82323 219539 -259478
10614 -595610 59918 61314 -100589 -222266 -162780 -164146 -20988 177296 47223 -43086 -64235
10603 -64235 -195051 -456995 15061 96566 -86923 278606 45193 -117621 239541 148247 -314894
10591 -396905 170968 161020 -167950 -299186 -70240 -79705 -160329 168936 29397 -73670 -32651
10579 -175580 -178913 120054 -61202 8214 -201025 13102 61175 -113759 -151215 -290534 -1776
10567 -61879 7306 39047 154060 31090 164492 -22753 -106247 298364 -128689 -229586 117352
10555b61193C9962b15457N959h8568H7590K48927A5168M02468A70316d1616C2692
10543a97834a4184l3044j13164c6067n4846E3912c1733j81903c9479E9147b565
10531b41010a11344M334b0501A54425e6000j30342i0734B5272b78976k4333A4272
10519A80387i645j3661L61j12288A30892a4958A22646l0810a08298r0029L4356
10508a63971n209d1309B30577D5039c04748a18648p1129e3119j10995B76979a24577
10496b36595g3941a3678p3574n9898A47259b06636A6677b2011j57480M4777A82547
10484b30761G7429L2070J71882c466l38080Q9235B4049a39657j29546c092A05746
10472b48063N0637B36879f3341G705e8993F5689a69710Q3118C52354a21310b4402
$$ plain form
10555 -261193 39962 -215457 -209498 -88568 87590 336517 15168 417636 170316 -41616 32692
10543 -197834 -14184 -47228 -160392 -36067 -90913 53912 -31733 -213636 -39479 59147 -2565
10531 -241010 -111344 -107010 -20501 154425 -56000 -186342 -90734 25272 -278976 -303309 14272
10519 180387 -9645 -23306 -22945 -135233 130892 -14958 122646 91836 -108298 -198327 -163971
10508 -163971 -169180 -41309 230577 45039 -304748 -118648 -189777 -53119 -164114 276979 -124577
10496 -236595 -73941 -13678 -87252 -147150 147259 -206636 16677 -22011 -179491 -134714 182547
10484 -230761 77429 109499 281381 -3466 -341546 -252311 24049 -139657 -269203 -3092 105746
10472 -248063 -197426 236879 -63341 7705 -58993 65689 -169710 -86592 352354 -121310 -24402
10460B82946D4239K2878P7903J91513g9943b3325m9268e734k36508B01654B4465
10448c42039g0846C48037b22300m5744A8057K3505L58751A9871K0941J63987h144
10436A9666c0617B09095a38314j31120C11123c35739c3749k14573D00902i29q2854
10425h3783c5090A45591a46143p6861J00472c190p3487A09225f7793K8329B21503
10413c3123k3239A68915o3675a5512D627K7715K39266c04274B17021J67373a29814
10401a42007B59820K56325i6864a0508m7045B21625J67819H2171a1689B5925J89889
10390B15814q0369P9642k9090c4331A63373l9661k8771L479L2826J40749f2727
10378A33901A6987J90J84345f3008C11444J0222A01533R0230K6209I7526K87509
$$ plain form
10460 282946 44239 67117 145020 336533 -79943 -23325 -72593 -5734 -242242 201654 24465
10448 -342039 -70846 348037 -222300 -268044 18057 41562 400313 19871 40812 204799 -8144
10436 19666 -30617 209095 -138314 -269434 311123 -335739 -33749 -248322 400902 -929 -83783
10425 -83783 -35090 145591 -146143 -223004 -122532 -3190 -76677 109225 -67793 -39464 221503
10413 -33123 -56362 168915 105240 -15512 4627 32342 271608 -304274 217021 384394 -129814
10401 -142007 259820 516145 -96864 -10508 -57553 221625 389444 82171 -11689 25925 215814
10390 215814 135445 215087 185997 -34331 163373 123712 94941 98420 131246 271995 -62727
10378 133901 16987 17177 201522 -63008 311444 321666 101533 191763 217972 97526 385035
10367C85035j04297N9575j53720m0150d6687D2178e2715C6001a16389B55126a43325
10355E00231B37997R7137q2171O6907q5690a3242C3829D7a32338G441a76033d9796
10342D0147L50480A82509a57603A64655L3298c5681C65459A69915F8636b83558
10331c78372E0475J43448d4684B81307e7072K5576A08343J37547O1731A52879
10320D7833J07524B5470J17230a39520D54432h9726A33487E4698a57898E6585
10309b10364D3958b34913A07472d0110j44983A54134a32857c9685B9623b80920
10298i4199b9246a2484K77m4819K7866r3975q5336D1438J01714C6255Q1976g4756
10285d50983E6254c08364c899q6272b0174p4723j13427A7824J06103m9613P0377
$$ plain form
10367 385035 280738 340313 186593 146443 -46687 42178 -52715 36001 -116389 255126 -143325
10355 500231 237997 335134 252963 319870 234180 -13242 33829 47 -132338 7441 -176033 -49796
10342 40147 390627 182509 -157603 164655 197953 -35681 365459 169915 68636 -283558
10331 -378372 50475 193923 -44684 281307 -57072 -31496 108343 245890 307621 152879
10320 47833 155357 25470 142700 -139520 454432 -89726 133487 54698 -157898 56585
10309 -210364 43958 -234913 107472 -40110 -185093 154134 -132857 -39685 29623 -280920
10298 -94199 -29246 -12484 -12207 -57026 -29160 -123135 -208471 41438 143152 36255 118231 -74756
10285 -450983 56254 -308364 -3899 -90171 -20174 -94897 -208324 17824 123927 74314 144691
10274A44691E509b44183B24325b27017b8302A98663A0935b56010J04765o0412
10264b11657i1991A26916a93363A17807d855k44893F7534m100L3219b9747q9220
10253a18967E899a39803N804A364b49089F5844M0127M8859B4117a62547d8084
10241a37254A3636a00317B8304a2154B16941c9543J8829F5714J6698b69897j58057
10230d27954c417j20442O0087c86j75764A01649a89237K4435j566m6747O8962
10219a44153m9465B60171r1599K77789a98086g1033r0933c6317l1621A37037b37815
10207a12635c2982A84059a51649f1211E2732e5350j41249N2588k8179Q6029p3249
10196a59410N5527B2453J79617f0356I4306f0153j45695B21372A4037a64442A23305
$$ plain form
10274 144691 5509 -244183 224325 -227017 -28302 198663 10935 -256010 -151245 -211657
10264 -211657 -91991 126916 -193363 117807 -4855 -249748 67534 63434 96653 -29747 -118967
10253 -118967 5899 -139803 -133999 1364 -249089 65844 105971 154830 24117 -162547 -48084
10241 -137254 13636 -100317 28304 -12154 216941 -39543 -20714 65714 82412 -269897 -427954
10230 -427954 -3417 -123859 -63772 -386 -176150 101649 -189237 -164802 -166368 -213115 -144153
10219 -144153 -193618 260171 168572 446361 -198086 -71033 -161966 -36317 -67938 137037 -237815
10207 -112635 -32982 184059 -151649 -61211 52732 -55350 -196599 -144011 -172190 -86161 -159410
10196 -159410 -103883 22453 202070 -60356 94306 -60153 -205848 221372 14037 -164442 123305
10184c4809k39322i0917J8357c5261q5134n6954A51096a61355f372A13861b21707
10172G0294a91750C40575d9230B55213p8939a10927o9732N189m618j89584B6219
10160e4658o8162k53062f1239A36598a82562D8513a54586B5855b61508G0334j2576
10149E7758J9587j9943d9315j13115r8195E5493a35380q975P895a9414A00988
10137b23836f1704j43499M1503o463P1335K940G3020P78a62308B83315a66175
10125f5658r9040N3271L1274A28007e7434k39626J19218A34076A0031a16931B65254
10113A32820P4234d420A55255E5810a50624P726F4839b60080A22614g645j7537
10102b5182o6518b7322l46231D5618b61531P6085f6918h569j75714E00128A93135
$$ plain form
10184 -34809 -274131 -90917 -72560 -35261 -120395 -177349 151096 -161355 -6372 113861 -221707
10172 70294 -191750 340575 -49230 255213 176274 -110927 -180659 -175470 -180088 -369672 26219
10160 -54658 -122820 -375882 -61239 136598 -182562 48513 -154586 25855 -261508 70334 57758
10149 57758 77345 57402 -49315 -162430 -260625 55493 -135380 -144355 -136460 -19414 100988
10137 -223836 -61704 -205203 -163700 -170163 -98828 -95888 73020 73798 -162308 283315 -166175
10125 -65658 -164698 -111427 -80153 128007 -57434 -297060 -177842 134076 10031 -116931 265254
10113 132820 207054 -4420 155255 55810 -150624 -142898 64839 -260080 122614 -7645 -25182
10102 -25182 -91700 -27322 -373553 45618 -261531 -185446 -66918 -8569 -184283 500128 193135
10090E3509i2431l2792L9644C9009b61129Q4054j443c5310o4698l34036P2037
10079c62007C3359e4938C9914b32184B53200D1933a58670d5200A41172E3355A6759
10067c13098I5860e2826D4911a1493m7424P196j16152A7222J94876b70155F2380
10055A31420B3710j1011K38101b37775a15430r3714P9335D8314d386C0728a23182
10043a8779l1529k0337B2217N2665c93665E8443b35365h208r4490D4458L46035
10032C90493F0912h900I4608a6500B0416a32001e1358j59288o6997m4939d3901
10020a33086j48666J39802n04358b49604d387B4234P931a76866A90688H2638K20584
10009C03222a65394j32355q2377J49004j3507d6097q8099p1378N5020G8437K17450
$$ plain form
10090 53509 -92431 -125223 -85579 39009 -261129 -177075 -178518 -35310 -100008 -434044 -362007
10079 -362007 33359 -54938 39914 -232184 253200 41933 -158670 -45200 141172 53355 16759
10067 -313098 95860 -52826 44911 -11493 -58917 -51721 -167873 17222 212098 -270155 62380
10055 131420 23710 12699 250800 -237775 -115430 -209144 -129809 48314 -4386 30728 -123182
10043 -18779 -50308 -70645 22217 74882 -393665 58443 -235365 -8208 -102698 44458 390493
10032 390493 60912 -8900 94608 -16500 20416 -132001 -51358 -210646 -277643 -322582 -43901
10020 -133086 -281752 -141950 -646308 -249604 -4387 24234 32165 -176866 190688 82638 303222
10009 303222 -165394 -297749 -380126 -231122 -244629 -46097 -134196 -205574 -150554 78437 295887
9998B95887g5559k81361F9121a10844j939a6192M721e424A27152a77751k8026
9987b05777h7494c119j18973E4683c79825A77965a48933c5064B7613J75379A9733
9975b3507r5620r1358j11788c5384H3409M8756a83454j16839d0255g804A34157
9963B36081d5020k10640n8666h9396B91285b3436m043j3163k30269F5891b09007
9951D6192b02436h5117j957j20865G7735M1421Q3092e1143A69518a46598f0045
9939A9269b6030k22034i7200F619a1757A394g4893F7560j4738g4796l45226f186
9926a4349D4500R2535M6832n7654m4735a88791b587n8601H9942b9337k43211h7246
9913B97690a52661j9874k00340d9521q2880B14596E0182g2057A67785a69782A9094
$$ plain form
9998 295887 -75559 -356920 69121 -110844 -112783 -16192 -11471 -5424 127152 -177751 -205777
9987 -205777 -87494 -3119 -122092 54683 -379825 177965 -148933 -35064 27613 202992 19733
9975 -23507 -119127 -210485 -322273 -35384 83409 132165 -183454 -300293 -40255 -7804 134157
9963 236081 -45020 -255660 -314326 -89396 291285 -23436 -27479 -40642 -270911 65891 -209007
9951 46192 -202436 -85117 -87074 -207939 77735 119156 202248 -51143 169518 -146598 -60045
9939 19269 -26030 -248064 -97200 6619 -11757 1394 -74893 67560 52822 -74796 -420022 -6186
9926 -14349 44500 137035 183867 126213 81478 -188791 -2587 -61188 89942 -29337 -272548 -87246
9913 297690 -152661 -172535 -372875 -49521 -132401 214596 50182 -72057 167785 -169782 19094
9901c7304l2183n6970k59477I606f4265k0037l4543j1445I3378H438b54135A1673
9888E1981j4350a77713c7979j72167D0983b2231j76391e5275A55636B2744a16298
9876a4722j20414B50881A13963k3112J8040d9545E6691a27136c4171l4024Q661
9865e9534k17220E6901b28392h0712D5141B2150b59351j84049a17898a0827l9358
9854e0185I5881b79654h0005K3826j38227R7159A6919K4120K4168h0376r6799
9843a77175F328J2813b01268c4710j14234a5873m3248j67325E8390b90193J09352
9832a80841I8367a59401B19654a15979j33341C28450a33168C7749h4748K2266
9822f2482b5243p980b401j00324j7195l0263M6525k295q5691G2873b02622e2322
$$ plain form
9901 -37304 -69487 -126457 -385934 9606 -64265 -84302 -118845 -130290 93378 8438 -254135 11673
9888 51981 37631 -177713 -37979 -210146 40983 -22231 -198622 -55275 155636 22744 -116298
9876 -14722 -135136 250881 113963 90851 108891 -49545 56691 -127136 -34171 -68195 -59534
9865 -59534 -276754 56901 -228392 -80712 45141 22150 -259351 -443400 -117898 -10827 -50185
9854 -50185 95881 -279654 -80005 -56179 -194406 -97247 16919 41039 65207 -80376 -177175
9843 -177175 6328 19141 -201268 -34710 -148944 -15873 -59121 -226446 58390 -290193 -180841
9832 -180841 98367 -159401 219654 -115979 -249320 328450 -133168 37749 -84748 -62482
9822 -62482 -25243 -33223 -2401 -102725 -119920 -150183 -103658 -105953 -191644 72873 -202622 -52322
9809F6683a67331j61178a46311k0453M8357d5376D7820J35746a4720k85984A89246
9797c3832j09131N7421G4433a06833o5153B8875J52370i0276O145q2775C5797
9785A60522E8537J8580f0921G758e6022k61574M8199B0939a88444r0854H8912
9773h8505l8368A26233a48958K5260c0715j62640E4842d7990M922n986G1882N5256
9761A27138h5742j27264g4141r1312D1790L4657a61740k0846L4023j39940a4487
9749b4005k72782i9441c9090P011r4305B9449a94087j02494A88555k1646f4696
9737E7170c77594B08368r0637a06859q4499g150l8379j17939M0711r2152j84695
9726c99604J34796B7860c8221j95639mb011j03409j04776B39580o4057A4701a80510
$$ plain form
9809 66683 -167331 -328509 -146311 -166764 -118407 -45376 47820 183566 -14720 -300704 189246
9797 -33832 -142963 -85542 74433 -106833 -171986 28875 181245 -90276 -84131 -166906 35797
9785 160522 58537 77117 -60921 7758 -56022 -317596 -269397 20939 -188444 -279298 88912
9773 -88505 -126873 126233 -148958 -123698 -30715 -193355 54842 -47990 -43068 -49054 71882 127138
9761 127138 -85742 -213006 -74141 -165453 41790 76447 -161740 -182586 -148563 -288503 -14487
9749 -24005 -296787 -99441 -39090 -32079 -126384 29449 -194087 -296581 188555 166909 -64696
9737 57170 -377594 208368 117731 -106859 -191358 -7150 -45529 -163468 -122757 -214909 -399604
9726 -399604 -264808 27860 -38221 -233860 -233864 -2011 -105420 -210196 239580 175523 14701 -180510
9713c21426C0755b84540F0345a09945m04105g404j13796C43h2172D532a92920
9701A07773a84080L1898R074B9175i236j58054M9040A81259J6203a81712g9704
9689A06131C0277J4633f4765j97014F9489a64425g3053j40486F8010f5162A09856
9677A25218n8754J18904F5803d17021B26426A6477i1774B29929r3333b19283F5171
9665f7156F7964h5661j09717A06991o17J77572c53814c689I4838g6352i060A16609
9652C6455b3539C1060M8283g178j78351C030J9829M3289a40952O8698j85834c2547
9639a79774A2461d9198j47600J8723j45379a24827J3059j29466e4710j2175j32948
9628a99833e4193k37416d8918C4432h9360A87103b9249j23841m7739b0229B5588
$$ plain form
9713 -321426 30755 -284540 60345 -109945 -514050 -7404 -121200 343 -82172 4532 -192920
9701 107773 -184080 -152182 -143108 29175 -9236 -167290 -118250 181259 197462 -181712 -79704
9689 106131 30277 44910 -64765 -261779 69489 -164425 -73053 -213539 68010 -65162 109856
9677 125218 66464 185368 65803 -417021 226426 16477 -91774 229929 136596 -219283 65171
9665 -67156 67964 -85661 -195378 106991 106374 283946 -353814 -3689 94838 -76352 -9060 116609
9652 36455 -23539 31060 79343 -7178 -185529 3030 22859 66148 -140952 -72254 -258088 -32547
9639 -179774 12461 -49198 -196798 -178075 -323454 -124827 -111768 -241234 -54710 -66885 -199833
9628 -199833 -54193 -291609 -48918 34432 -89360 187103 -29249 -153090 -200829 -20229 25588
9616b20853D4219J34897H8177a78898q5053L5028B32133a86018H8050d21281h5080
9604A85950q5565b9081k87374a29542E7138a9360l63778A06602Q3151b86141d6455
9592B28906b79996B14817f6041B71633l7782d5709C4778c09290I0269k702b57623
9580E6402b88107A08264b05227M9268l0802a5987k28259A61947i2372I181b71097
9568d7544p6866j1342E7923a62727c2992k6097j22798A53204C194b12664r2013
9557c04677F556a08440A9371b89960A22114a06810B43333A00368h8724k85013
9547c73737a83165i0247m5337n5148a3156m4108D320b06314A12965n54i0380M0892
9535d9488k26179A7749d4271l2153B26844c17472a39783n3456C3302M3530O0055
$$ plain form
9616 -220853 44219 179116 88177 -178898 -263951 -228923 232133 -186018 88050 -421281 -85080
9604 185950 100385 -29081 -316455 -129542 57138 -19360 -383138 106602 189753 -286141 -46455
9592 228906 -279996 214817 -66041 271633 233851 -45709 34778 -309290 90269 87567 -257623
9580 56402 -288107 108264 -205227 -155959 -186761 -15987 -244246 161947 -92372 9181 -271097
9568 -47544 -124410 -135752 57923 -162727 -32992 -59089 -181887 153204 3194 -212664 -304677
9557 -304677 6556 -108440 19371 -289960 122114 -106810 243333 100368 -88724 -373737
9547 -373737 -183165 -90247 -135584 -190732 -13156 -57264 4320 -206314 112965 112411 -90380 -49488
9535 -49488 -275667 17749 -44271 -76424 226844 -317472 -139783 -193239 33302 76832 136887
9524A36887b9104j09885f8202J4701A86528c22376i1213j48391A41470m7429C4663
9512a13799I1444J80805I8603a34574m0657b0475k01538N2394P8066B02476a85985
9500a23490B12973I1231h0122n8574N7606b7304R287j97808F3582P7141a45142
9488B99668a75679H7145b8399m2283K6133j34047C19667E6529a22851k78775A79743
9476c18995A14590m2655d23814B82283a93329I4547a43468I4035O8351J3452i8013
9464g7623E1476e9130j30543Q8636q1791Q3698k87966f9025C1958h7045B90013
9452h5862D762b4644q9183A44194f30803e3818j35367D0812b78138b383m1977
9441d4360k3444j42038B2506h3139j980k82645i3704B07687b24086C5199b76649
$$ plain form
9524 136887 -29104 -138989 -68202 -53501 186528 -322376 -91213 -239604 141470 94041 34663
9512 -113799 91444 272249 98603 -134574 -175231 -20475 -222013 -169619 -91553 202476 -185985
9500 -123490 212973 91231 -80122 -138696 -81090 -27304 -18017 -215825 63582 140723 -145142
9488 299668 -175679 87145 -28399 -70682 -44549 -178596 319667 56529 -122851 -401626 179743
9476 -318995 114590 71935 -423814 282283 -193329 94547 -143468 94035 162386 175838 -98013
9464 -77623 51476 -59130 -189673 -101037 -182828 -99130 -387096 -69025 31958 -87045 290013
9452 -85862 4762 -24644 -113827 144194 -630803 -53818 -189185 40812 -278138 -2383 -44360
9441 -44360 -67804 -209842 22506 -83139 -85119 -367764 -93704 207687 -224086 35199 -276649
9429e3654A8310O440O9304h0438K739j76216e327j51713d1958H6052f8468F2968
9416H252a14543A56238D5116b02777P3045B73555E237L1329b7871G9488a39628
9404i3033J8922A2923c58120B40389c43541B44789a4710j26467j41045G0147a67058
9392a26580B6334b5475A76236c60358a57750A63010L9996A1954b00650h3391A5169
9380a5235j62535O0997j28092C10284A05752a88805R4392p1581A35886H907c57337
9368e70686B15713B1695J94927b12287h0017k86367B9711a17119A7900b08079
9357a07656q486n6752C7543K31557m3375F2394c0197a3634k21345D15364H7648
9345a2880j77481j33615A38459i8461n7489j25346a11334m243H8532a11928H8156
$$ plain form
9429 -53654 18310 24750 94054 -80438 -77699 -253915 -5327 -157040 -41958 86052 -68468 62968
9416 8252 -114543 156238 45116 -202777 -129732 273555 5237 36566 -27871 79488 -139628
9404 -93033 -74111 12923 -358120 240389 -343541 244789 -14710 -141177 -282222 70147 -167058
9392 -126580 26334 -25475 176236 -360358 -157750 163010 203006 11954 -200650 -83391 15169
9380 -15235 -177770 -116773 -244865 310284 105752 -188805 -94413 -165994 135886 8907 -357337
9368 -570686 215713 21695 216622 -212287 -80017 -366384 29711 -117119 17900 -208079
9357 -107656 -116142 -172894 37543 269100 225725 62394 -30197 -13634 -234979 415364 87648
9345 -12880 -190361 -323976 138459 -98461 -155950 -281296 -111334 -115577 88532 -111928 88156
9333f9745g542l7045j70855n1395H692K23302c11680O9895a4087G1833a28562
9321c394j46398j95322B27102L7625G2233g3991A46076f778r7748G6101a59394
9309c67193b6537m54431d7317l8301o9336G7136O6141c7707a619D8961a85122
9297H250J07163A8475a82913A08220B3413h2715j0043j03519f1331H2687i6570
9285B1359J5047b10341F1961R403e6788k1453k17294g2422j4693M309j90894b1943
9272d1226B38135c10593C41337c97985F7581a4386A4058J34206o6050A8660b76275
9260A30201f4360q3945j75963q4210a82609j3809M4602B36111J7569A21524C6111
9248A44755c68586J66376B33874d7811E2403a24011d1551j47626d4297j25362
$$ plain form
9333 -69745 -7542 -44587 -215442 -266837 8692 231994 -311680 -241785 -14087 71833 -128562
9321 -3394 -149792 -345114 227102 264727 72233 -73991 146076 -6778 -104526 76101 -159394
9309 -367193 -26537 -480968 -47317 -85618 -154954 77136 143277 -37707 -1619 48961 -185122
9297 8250 115413 18475 -182913 108220 23413 -82715 -92758 -196277 -61331 82687 -96570
9285 21359 36406 -210341 61961 71364 -56788 -78241 -295535 -72422 -87115 -82806 -273700 -21943
9272 -41226 238135 -310593 341337 -397985 67581 -14386 14058 148264 82214 18660 -276275
9260 130201 -64360 -148305 -324268 -408478 -182609 -196418 -151816 236111 253680 121524 36111
9248 144755 -368586 -202210 233874 -47811 52403 -124011 -41551 -189177 -44297 -169659
9238a69659M6522D629e6471A1000J05175a61039d4333j98748b6697r2611j8815
9227a38123r7080h7271l5966m7255e3695A11580L7556h3970H0639O0216F9071
9215a30161o7212B3143g448C1725K1323o162b36610R6800J2584k24993E9045f7993
9202a83630M8610j29890D7602a00820A10638b96493I7450h2129A12972h6053k5952
9191a12005B33193b35721L6858k09419a10977A83091b96473a28010B71810B4139
9180e5001G2346c7982j70978H604c0629B65160o1401c6519j88350n1537a17783
9168E9010L5620h9368j1853b6769j98278b0461A34950J01867a32455m087A24939
9156h1501B2210a08584F4398b56587J12296B3792P3646f4923A7191a14559L5334
$$ plain form
9238 -169659 -123137 4629 -56471 11000 116175 -161039 -44333 -243081 -26697 -119308 -138123
9227 -138123 -235203 -87271 -123237 -170492 -53695 111580 149136 -83970 80639 140855 69071
9215 -130161 -197373 23143 -7448 31725 53048 46886 -236610 -139810 -127226 -352219 59045 -67993
9202 -183630 -135020 -264910 47602 -100820 110638 -296493 97450 -82129 112972 -86053 -112005
9191 -112005 233193 -235721 -198863 -408282 -110977 183091 -296473 -128010 271810 24139
9180 -55001 72346 -37982 -208960 8604 -30629 265160 203759 -36519 -224869 -276406 -117783
9168 59010 94630 -89368 -101221 -26769 -225047 -20461 134950 236817 -132455 -136542 124939
9156 -81501 22210 -108584 64398 -256587 -144291 23792 97438 -64923 17191 -114559 -79225
9145g9225A01474c58242a43481H8353a30761k5013E6768d828k74475a15343B46041
9133b77247j6947a09369d4783a5971r7444c9879B09687H1598i727j83446q7069
9122b80242J05220L8115a8635C72506j50438f2412D4381J30444f5613k85251a74918
9110a55236A12647J32347a05035J7540n4574j12420f0726C49390A58545A2743
9099b640H388a15790j76193b3613K324q5166I0591a18510A21815b5014j40610
9088a65624b6557D6010L58400a09279q2157O2848b9545h708j87129j04900A81904
9076A97994a35957k04226b6970j16179C4471a50066C51022b13003h9034D4700
9065A12910a6738j5040A08696e17067a02239j31207E3335c5533G8633P3433D4877
$$ plain form
9145 -79225 101474 -358242 -143481 88353 -130761 -155774 56768 -4828 -279303 -115343 246041
9133 -277247 -294194 -109369 -44783 -15971 -113415 -39879 209687 81598 -9727 -193173 -280242
9122 -280242 -175022 -136907 -18635 372506 222068 -62412 44381 174825 -65613 -350864 -174918
9110 -155236 112647 244994 -105035 -87495 -142069 -254489 -60726 349390 158545 12743
9099 -2640 8388 -115790 -291983 -23613 -21289 -106455 90591 -118510 121815 -25014 -165624
9088 -165624 -26557 46010 404410 -109279 -191436 -128588 -29545 -8708 -195837 -300737 181904
9076 197994 -135957 -340183 -26970 -143149 34471 -150066 351022 -213003 -89034 44700
9065 112910 -16738 -31778 108696 -517067 -102239 -233446 53335 -35533 78633 152066 44877
9053A38954c0720A67695D7731a43041j46526C4443a50812Q175c5317D7799Q72
9042D8671b01414A95392a48950q5864i8000B1440b52849q545i8044B69392c25891
9030i7349F1500a71033Q1006A32037L4537p03K78602b01326j45681B0255b27446
9018A71280c78976D33903a68422a1217q6262j3385A31397q031a69040c39n0877
9007e1216j15729j63856A86187H8513f896l06303I606a05967b6260l0523k96114
8996c52897l7664A94193a4935A41765q497f7473k26598D29862i35A38476M6870
8985A85346A5477K60823r9083L37B1095e0316l49883C0387K00586d7308k99450
8974c46758c860A40029a09134l7326M7198B61733D9744J4326J50782J17830a2086
$$ plain form
9053 138954 -30720 167695 47731 -143041 -289567 34443 -150812 -142637 -35317 47799 48671
9042 48671 -201414 195392 -148950 -234814 -98000 21440 -252849 -261394 -98044 269392 -325891
9030 -97349 61500 -171033 -90027 132037 166574 165871 444473 -201326 -347007 20255 -227446
9018 171280 -378976 433903 -168422 -11217 -97479 -110864 131397 123366 -169040 -339 -51216
9007 -51216 -166945 -330801 186187 88513 -6896 -313199 9606 -105967 -26260 -56783 -352897
8996 -352897 -390561 194193 -14935 141765 133268 -67473 -294071 429862 -935 138476 185346
8985 185346 15477 276300 177217 177554 21095 -50316 -400199 30387 230973 -47308 -346758
8974 -346758 -3860 140029 -109134 -146460 -99262 261733 49744 64070 214852 332682 -12086
8962A70029R0386a78182h9017C94055J07667J8751n0808j57021j44463a1639A68549
8950B57092n8744J02056m2208L28306q4391p2983J61043j34106L56711k90413
8940E22363L06359j26643j68376J19469j78137K28411j56775L19852l90234M57097
8930I33386j07794J90856l9523J24024J5397k6613K5573O0045M28583K3433o34015
8919I93352M0093j75242k78957a301F660K52025n750D4516A1410a059o0434j78986
8907b40479A10650a42622d0200j21882h0711n960k328a176k62918l1718i4373
8895B24782f7025j31700j41664b5844N589j54900i661l1842A31650a44450d214
8883A92034D8323J7515a81413d3994B5068P2134a6112q1209A21919I597e5569
$$ plain form
8962 170029 260415 -178182 -89017 394055 501722 520473 469665 312644 168181 -11639 168549
8950 257092 198348 300404 258196 586502 502111 429128 590171 456065 812776 522363
8940 522363 828722 702079 533703 653172 475035 703446 546671 866523 476289 933386
8930 933386 825592 1016448 976925 1100949 1116346 1089733 1115306 1175351 1603934 1627367 993352
8919 993352 1033445 858203 579246 -1301 6660 258685 252935 44516 11410 -1059 -61493 -240479
8907 -240479 110650 -142622 -40200 -162082 -80711 -86671 -88999 -1176 -264094 -295812 -94373
8895 224782 -67025 -198725 -340389 -25844 -20255 -175155 -9661 -41503 131650 -144450 -4214
8883 192034 48323 65838 -181413 -43994 25068 97202 -16112 -97321 121919 9597 -55569
8871B3078J51962a99991m2046f0819j46067G6828a19544B43765f2465o7280A12716
8859D5838h0838j13669d0213a5683j42287e9598B23814j01013a40287p7944B13697
8847b0033B60975b30190J07615M0867j60657j9662A94465b4005m4915l0402L6116
8836f3206C3492J37520n6720a11674H3153a08589a9051A16372a51128o1496Q4085
8825a28539d5129j19536G5878b01736R2175G9368l7559b81253M7777C8391c35860
$$ plain form
8871 23078 175040 -199991 -242037 -60819 -206886 76828 -119544 243765 -62465 -129745 112716
8859 45838 -80838 -194507 -40213 -15683 -157970 -59598 223814 122801 -140287 -218231 213697
8847 -20033 260975 -230190 -122575 -81708 -242365 -262027 194465 -24005 -68920 -99322 -63206
8836 -63206 33492 171012 114292 -111674 83153 -108589 -19051 116372 -151128 -212624 -128539
8825 -128539 -45129 -164665 75878 -201736 -109561 79368 41809 -281253 -233476 38391 -335860
$$ [...]
##END NTUPLES=NMR SPECTRUM
##END=
