##TITLE=NES1070_159122.0012_001_9705698_1gwYXIC89o
##JCAMPDX= 6.0         $$ Bruker NMR JCAMP-DX V2.0
##DATA TYPE= NMR SPECTRUM
##DATA CLASS= NTUPLES
##ORIGIN= BRUKER
##OWNER= Administrator
$$ 1.72 TOPSPIN		Version 2.1
$$ 2016-04-30 19:35:54.474 -0700  Administrator@X
$$ Compression mode = diff/dup
##.OBSERVE FREQUENCY= 400.02188249412
##.OBSERVE NUCLEUS= ^1H
##.ACQUISITION MODE= SIMULTANEOUS (DQD)
##.ACQUISITION SCHEME= undefined
##.AVERAGES= 8
##.DIGITISER RES= 22
##SPECTROMETER/DATA SYSTEM= spect
##.PULSE SEQUENCE= zg30
##.SOLVENT NAME= COFFEE_meoh
##.SHIFT REFERENCE= INTERNAL, COFFEE_meoh, 1, 14.98509
##AUDIT TRAIL= $$ (NUMBER, WHEN, WHO, WHERE, PROCESS, VERSION, WHAT)
$$ ##TITLE= Audit trail, TOPSPIN		Version 2.1
$$ ##JCAMPDX= 5.01
$$ ##ORIGIN= Bruker BioSpin GmbH
$$ ##OWNER= Administrator
$$ $$ E:\/data/COFFEE/nmr/NES1070_159122.0012_001_9705698_1gwYXIC89o/10/pdata/1/auditp.txt
$$ ##AUDIT TRAIL=  $$ (NUMBER, WHEN, WHO, WHERE, PROCESS, VERSION, WHAT)
(   1,<2016-04-30 19:35:47.099 -0700>,<Administrator>,<X>,<go>,<TOPSPIN 2.1>,
      <created by zg
	started at 2016-04-30 19:34:41.380 -0700,
	POWCHK enabled, PULCHK disabled,
       configuration hash MD5:
       21 0F 79 D6 B3 7B B4 F6 88 20 88 DB 03 48 BD 9F
       data hash MD5: 64K
       C4 DA 3B E7 38 A4 D8 04 2E 76 C5 72 74 F5 80 38>)
(   2,<2016-04-30 19:35:50.442 -0700>,<Administrator>,<X>,<proc1d>,<TOPSPIN 2.1>,
      <Start of raw data processing
       efp LB = 0 FT_mod = 6 PKNL = 1 PHC0 = 0 PHC1 = 0 SI = 32K 
       data hash MD5: 32K
       0B FD 20 6D B4 39 95 72 A3 27 FC D1 45 CA B5 0D>)
(   3,<2016-04-30 19:35:50.724 -0700>,<Administrator>,<X>,<proc1d>,<TOPSPIN 2.1>,
      <pk PHC0 = 94.75708 PHC1 = 0 
       data hash MD5: 32K
       44 D9 12 C1 E5 9F A3 93 4D A6 C6 D0 14 40 DE 79>)
(   4,<2016-04-30 19:35:50.849 -0700>,<Administrator>,<X>,<proc1d>,<TOPSPIN 2.1>,
      <abs ABSG = 1 
       data hash MD5: 32K
       45 1D 22 1D E1 63 33 79 EF E4 C9 C7 F2 E5 AC 61>)
(   5,<2016-04-30 19:35:50.896 -0700>,<Administrator>,<X>,<proc1d>,<TOPSPIN 2.1>,
      <abs ABSG = 2 
       data hash MD5: 32K
       41 AA 63 D5 49 B6 34 DE 12 12 D7 60 B7 80 51 2F>)
(   6,<2016-04-30 19:35:50.958 -0700>,<Administrator>,<X>,<proc1d>,<TOPSPIN 2.1>,
      <abs ABSG = 3 
       data hash MD5: 32K
       5B 7D 4B 89 04 95 A9 8D D5 F8 BF A8 77 25 BC AD>)
(   7,<2016-04-30 19:35:51.021 -0700>,<Administrator>,<X>,<proc1d>,<TOPSPIN 2.1>,
      <abs ABSG = 4 
       data hash MD5: 32K
       4C A6 5D 97 B6 D9 43 D1 62 37 57 57 9E 67 E3 B1>)
(   8,<2016-04-30 19:35:51.099 -0700>,<Administrator>,<X>,<proc1d>,<TOPSPIN 2.1>,
      <abs ABSG = 5 
       data hash MD5: 32K
       AA E2 29 64 C7 45 06 90 7E 53 2C 19 68 38 45 62>)
$$ ##END=
$$ 
$$ $$ hash MD5
$$ $$ CB 91 05 1F FA DE 0A C0 EB 77 4C 2A 50 67 BC FA
##$RELAX= 
##$RELAX= 
##$RELAX= 
##$RELAX= 
##$RELAX= 
##$RELAX= 
##$RELAX= 
$$ Bruker specific parameters
$$ --------------------------
##$DU= <E:\>
##$EXPNO= 10
$$ [...]
150 150 150 150 150 150 150 150
##$TP07= 0
##$TPNAME0= <>
##$TPNAME1= <>
##$TPNAME2= <>
##$TPNAME3= <>
##$TPNAME4= <>
##$TPNAME5= <>
##$TPNAME6= <>
##$TPNAME7= <>
##$TPOAL= (0..7)
0.5 0.5 0.5 0.5 0.5 0.5 0.5 0.5
##$TPOFFS= (0..7)
0 0 0 0 0 0 0 0
##$TUNHIN= 0
##$TUNHOUT= 0
##$TUNXOUT= 0
##$USERA1= <user>
##$USERA2= <user>
##$USERA3= <user>
##$USERA4= <user>
##$USERA5= <user>
##$V9= 5
##$VALIST= <valist>
##$VCLIST= <CCCCCCCCCCCCCCC>
##$VD= 0
##$VDLIST= <DDDDDDDDDDDDDDD>
##$VPLIST= <PPPPPPPPPPPPPPP>
##$VTLIST= <TTTTTTTTTTTTTTT>
##$WBST= 2048
##$WBSW= 25
##$XGAIN= (0..3)
0 0 0 0
##$XL= 0
##$YL= 0
##$YMAX_a= 607890
##$YMIN_a= -513974
##$ZGOPTNS= <>
##$ZL1= 120
##$ZL2= 120
##$ZL3= 120
##$ZL4= 120
##$ABSF1= 14.98509
##$ABSF2= -5.573092
##$ABSG= 5
##$ABSL= 3
##$ALPHA= 0
##$AQORDER= 0
##$ASSFAC= 0
##$ASSFACI= 0
##$ASSFACX= 0
##$ASSWID= 0
##$AUNMP= <proc_prof1d_extract_pilot.lims>
##$AXLEFT= 0
##$AXNAME= <>
##$AXNUC= <1H>
##$AXRIGHT= 0
##$AXTYPE= 0
##$AXUNIT= <>
##$AZFE= 0.1
##$AZFW= 0.1
##$BCFW= 0
##$BC_mod= 0
##$BYTORDP= 0
##$COROFFS= 0
##$CY= 15
##$DATMOD= 1
##$DC= 0
##$DFILT= <>
##$DTYPP= 0
##$F1P= 0
##$F2P= 0
##$FCOR= 0.5
##$FTSIZE= 32768
##$FT_mod= 6
##$GAMMA= 0
##$GB= 0
##$INTBC= 1
##$INTSCL= 1
##$ISEN= 128
##$LB= 0
##$LEV0= 0
##$LPBIN= 0
##$MAXI= 10000
##$MC2= 0
##$MEAN= 0
##$ME_mod= 0
##$MI= 0
##$NCOEF= 0
##$NC_proc= -8
##$NLEV= 6
##$NOISF1= 0
##$NOISF2= 0
##$NSP= 0
##$NTH_PI= 0
##$NZP= 0
##$OFFSET= 14.98509
##$PC= 1
##$PHC0= 94.75708
##$PHC1= 0
##$PH_mod= 1
##$PKNL= yes
##$PPARMOD= 0
##$PPDIAG= 0
##$PPIPTYP= 0
##$PPMPNUM= 2147483647
##$PPRESOL= 1
##$PSCAL= 4
##$PSIGN= 0
##$PYNMP= <proc.py>
##$REVERSE= no
##$SF= 400.02
##$SI= 32768
##$SIGF1= 0
##$SIGF2= 0
##$SINO= 400
##$SIOLD= 32768
##$SPECTYP= <>
##$SREGLST= <1H.CDCl3>
##$SSB= 0
##$STSI= 32768
##$STSR= 0
##$SW_p= 8223.68421052631
##$SYMM= 0
##$S_DEV= 0
##$TDeff= 65536
##$TDoff= 0
##$TI= <>
##$TILT= no
##$TM1= 0
##$TM2= 0
##$TOPLEV= 0
##$USERP1= <user>
##$USERP2= <user>
##$USERP3= <user>
##$USERP4= <user>
##$USERP5= <user>
##$WDW= 1
##$XDIM= 32768
##$YMAX_p= 438503264
##$YMIN_p= -722523
##$CURPLOT= <Network HP LaserJet P1505>
##$CURPRIN= <$Network HP LaserJet P1505>
##$DFORMAT= <normdp>
##$LAYOUT= <+/1D_H.xwp>
##$LFORMAT= <normlp>
##$PFORMAT= <normpl>
##$SURQMSG= 1
$$ End of Bruker specific parameters
$$ ---------------------------------
##NTUPLES= NMR SPECTRUM
##VAR_NAME=  FREQUENCY,     SPECTRUM/REAL,   SPECTRUM/IMAG
##SYMBOL=    X,             R,               I
##VAR_TYPE=  INDEPENDENT,   DEPENDENT,       DEPENDENT
##VAR_FORM=  AFFN,          ASDF,            ASDF
##VAR_DIM=   32768,         32768,           32768
##UNITS=     HZ,            ARBITRARY UNITS, ARBITRARY UNITS
##FACTOR=    0.250966925370066, 1,           1
##FIRST=     8223.43324360094, -40014,       -249932
##LAST=      0,             37128,           -24234
##MIN=       0,             -722523,         0
##MAX=       8223.43324360094, 438503264,    0
$$ Real data points
##PAGE= N=1
##DATA TABLE= (X++(R..R)), XYDATA
$$ [...]
23857 -168707 260346 -111312 44039 -94122 6253 119647 -194406 146160 67732 -195890
23846 -371622 -95864 19374 -100938 -22533 -369574 83508 -121563 -43739 224372 -23020 227396
23834 -74564 -68568 53699 -120389 57540 290613 -181304 57241 193421 -149425 -34699 -393211
23823 -393211 90007 -8669 251918 -176076 8944 -50530 16402 -103115 89040 69322 -354707
23811 -247722 11327 69926 -117639 -134865 -22731 -228838 -281879 -102684 5964 65672 -29755
23799 -362656 -159734 -122936 -73206 -133204 -39375 -76986 -53152 -310034 -177449 197792 -174857
23787 116092 117571 -95483 238454 22032 -175689 81747 -181015 31898 149909 69343 147694
23776 147694 160002 8828 32485 111737 -54562 203217 -34838 -12228 153586 -149348 76276
23764 195639 11785 7109 59071 233175 209693 -97958 -13760 13348 -16707 -63562 -245385
23753 -245385 231575 68515 -36662 -88166 -277505 -141407 40880 157662 324497 -61307
23742 -177840 -93308 -6891 13017 -128175 128519 108189 163866 167506 80842 -29851 -100334
23731 -100334 267970 -3390 455429 61556 -20321 -107443 268270 26534 8593 330447 28122
23719 8911 104951 170562 792 -45859 136067 72330 -68434 -324063 113404 372 -118350 -177952
23707 -177952 -54386 -78749 -257332 -76178 112023 37113 199352 25634 89446 -53034 65510
23695 -23995 99066 125399 221601 268905 -265344 -1921 168128 -95348 24219 -242598 -167502
23684 -167502 -92735 69294 -137348 -203683 32193 -78748 188279 -224055 155422 -176049
23673 214644 -360334 -198601 -145670 127556 -356174 165401 -247574 168407 -50816 -160808
23663 -160808 128466 6 -255908 32167 727 -33981 56971 -241810 -55830 273800 -316300 -245372
23651 -245372 200351 -100279 -157735 117961 -188760 108725 -85201 -131008 207172 94300
23640 128906 -17236 389478 185144 -216844 -25000 26430 -210611 173487 14956 -53594
23629 335659 -225495 -221641 -190546 124166 -153006 -205029 175393 154685 -54533 -136005 229977
23617 43117 -221256 -84879 13994 -19377 -107712 258016 -26696 66086 14730 59258 -28422
23605 -218417 -258281 232534 79877 -73952 -306483 -137572 68580 -58004 -334667 -17707 -141131
23594 -141131 83347 -1308 -43072 256127 15697 216735 102006 135402 138537 150258 72 195148
23582 195148 79686 -75247 143900 -135678 361377 117673 16235 -205498 124020 -273167
23571 -168553 176481 -82884 435003 -28202 71019 249490 252648 -221463 -181865 -157148 -186454
23560 -186454 -378637 190339 258697 73430 -80947 35390 -66588 -109254 -205299 -239102 -366318
23549 -366318 -193939 -159793 -11127 -24024 -384534 -149039 188841 -272577 -184000 198285
23538 393999 59504 -310840 -10312 -249855 210624 290781 -76068 129223 71581 156795 -82344
23526 198130 -29683 -104017 65968 6940 -114365 -76620 -45273 -163095 -252822 -134946 103932
23514 93815 -79906 65300 -159854 -199824 -311373 125498 195738 -29055 -218214 -74323 124892
23502 -6596 258162 67382 94717 -390179 -42352 122429 20570 -2968 59217 -71768 103112
23490 -122254 -133209 28327 217083 74960 -112391 -183885 133354 64738 -88203 -211400 -362253
23479 -362253 -419542 155904 208456 -111740 36515 -200205 109623 46039 -14401 180251
23468 185 6883 -54469 -159904 -19213 30283 -42655 127162 88422 185956 -271546 -37867 195991
23455 -37588 47652 -189336 -114873 -172525 -258158 66391 -66335 -123828 204280 -282788 30264
23443 47290 -172795 -165753 46953 -265996 20266 50381 50619 224795 268090 342525 -9285 194813
23430 -31006 -210662 -275971 97489 8508 -107655 -133556 -17633 166242 14251 -239383 -77524
23418 20008 -224074 7611 -14577 -113108 -79794 -116288 -111547 -151712 214889 40413 23696 84363
23406 84363 -173851 -256474 -57575 -12438 -99486 -151926 -47103 -83500 224608 49044 -131707
23394 -126980 192672 9960 363510 123022 60999 106652 -31583 47026 -199709 -57206 -36607
23383 -36607 152674 178041 65537 83775 366853 203122 202972 -59218 109695 -13523 -143205
23372 -143205 -48307 71824 68722 -131308 137186 -123164 39225 349073 -45018 -200490 60199
23360 -6514 136347 -164325 -431488 -12138 -124823 265815 187672 308510 203342 -32609
23349 26365 28281 62580 218446 -225531 181285 -63760 110079 96736 223075 -6384 314469
23337 -130597 150343 68205 244078 126062 -138081 -21857 -71618 -30166 180387 -51080
23326 -132825 84686 168409 38825 -208931 200484 60295 170106 220173 -95154 -64620 -67690
23315 -67690 -117234 -251231 -310723 59679 -168919 154842 -163767 -108271 -315845 59519 -204629
23303 -264596 -83808 -73887 -47597 -40589 45125 122814 -28786 268615 98664 234026 -215194
23291 -53039 -196099 128830 -5749 -204381 -301245 -128697 31655 -548047 186798 -237682
23280 -132611 119744 -62460 125015 -103979 -88528 150626 66802 266897 -156659 116068
23269 -365218 -203586 -115137 -367905 41472 -6128 15064 -2529 -184512 264854 -141064 34629
23257 25201 -178050 -88871 -105096 -23673 -62133 -296836 -284763 -105478 71775 322609 -225767
23245 47678 91947 -233586 164354 -16487 -57974 -306696 92793 179820 307195 26000 -120517
23233 76359 216864 -233069 -147348 -69049 -16926 -135992 -159180 256311 -3312 -183479 -7312
23221 10197 -145839 271174 206093 -1143 -75505 -201395 361762 78765 284753 -44525 88773
23209 4902 -367004 218118 -13876 195490 291495 -281712 -70522 -240217 -66133 -80455 6544
23197 -130093 74741 28881 -379341 -72117 24835 -403255 -159536 -225343 -121201 76795 -96789
23185 -33937 92516 210032 -170074 5454 -10136 -186855 -129799 -198367 115519 63437 -4162
23173 -63150 -215352 -90984 -18889 -135265 -77227 -167242 6461 93855 378190 98494 -58364
23161 -230087 -197696 -337269 -341367 192549 -96463 67284 -129669 113263 -67922 89369 51100
23150 51100 145163 -18601 164052 313994 -81938 -161946 9380 -47990 140713 -70568 -181193
23139 -181193 -68214 -144909 -231883 -31219 71093 -241422 109856 50988 -84051 510513 24910
23127 -106290 -137577 117135 105458 -21111 180205 204814 -180936 -56550 -218503 80871 22501
23115 62346 -181931 262987 2042 -152257 -61266 132154 217764 68807 278387 43693 100515
23104 100515 62086 -48375 -101200 -10368 239338 199503 192369 39609 59869 -121069 289407
23092 -32354 -207652 -14718 79837 204734 153164 46521 41134 -230538 45749 240440 -293169
23080 107373 -109767 -297499 -106001 139492 29449 69995 -212428 -71494 -59059 162974
23069 5251 -143194 225373 -57917 -104134 -146958 6979 -222102 167575 11244 280 187379
23058 187379 -294007 112832 -256564 -11509 -184997 161857 193864 -200723 -21675 178883
23047 69804 -133413 -32482 185439 -107297 -193768 315069 6928 -163551 -196555 -140333 -59480
23035 -58112 69952 -60366 -32043 129925 -331024 86878 150092 10684 -26359 -240850 -1733
23023 -96839 -107776 156536 81525 -128063 20424 100707 -43452 90290 -185204 -178770 224558
23011 47202 -126163 77614 81875 -600140 15408 35517 121755 44296 -148514 29602 -106305
22999 85269 -186513 24523 104017 -142687 -421263 88786 -60887 -137128 13237 24496 -61831
22987 -128854 241607 -276748 187099 -194760 45897 49110 -147983 -149077 111832 60715 259889
22976 259889 265827 -172247 -162746 -111325 100346 -188846 88244 -193556 -207577 232186 54186
22964 138280 24640 42186 102859 -221210 -187876 -14454 1264 -50014 100026 53465 -424714
22952 24075 24243 -222020 270304 162878 -146276 12160 18454 33797 170223 132522 -96044
22940 -114380 -277578 -298828 96329 -189252 110977 -44094 -32479 -311968 108268 -7810 170438
22928 -205998 -42904 -93902 140194 -15911 -56682 -4920 -82586 18048 170738 -36100 -347296
22917 -347296 47579 -98573 -185113 205363 -249031 111579 -266841 -261937 -295954 -287310 241938
22905 91838 -40742 -307152 -427435 68280 91477 -113755 -32143 631147 -167674 -43827 -230950
22894 -230950 4590 36731 27610 -371923 -121279 -101269 344198 -213877 93694 -427491 -333198
22883 -333198 192387 -85276 121906 -265102 -148359 -208017 368895 -84820 101592 -34288
22872 167831 -196408 -53120 -115054 -106433 -75246 54132 -90345 -125882 255703 223738 -368791
22860 -143378 198112 109934 106674 786 87003 -293011 -62952 -78840 -38259 398346 47409
22848 -44799 153379 150042 -32538 -160423 -26379 150939 85027 -87993 -164064 77546 14043
22836 188233 -150653 -116274 -118734 -390059 -345737 -73670 -6539 -34780 97475 -119764 172059
22824 30330 -241631 405224 -203555 27494 -114738 -9661 -155683 -10387 118554 -80268 209789
22812 -104882 -26321 -49259 -150412 -273427 -283892 -234172 -155506 108472 -122597 -200963 -167616
22801 -167616 -104864 -107219 91547 108353 -71470 62208 119059 104268 243527 -118744 -233611
22790 -233611 -290524 -119339 -43677 12259 37125 9009 223521 -102924 24467 -120269 141574
22778 39948 -173681 -230637 11423 -198391 194971 33064 -154574 314365 235214 -76448 213668
22766 -93826 -31741 -107762 -174049 -219205 -211078 -238038 -98106 -3338 -24870 -125902 6900 232646
22754 232646 -100968 52531 -76220 -140435 -220654 144561 -240678 -321939 319574 -259787
22743 25388 -167632 -274489 -203548 -84498 47443 57719 57827 199335 138190 -2587 106377
22731 -175555 -116994 -246077 8358 -94142 70303 -96481 -52552 -167832 284303 -28789 140573
22719 195308 -228872 -291101 110796 -50469 99150 398035 41097 182938 -168924 151682
22708 -125483 105499 111937 -266909 77012 -197088 -186080 142747 -143403 81196 3649 163264
22697 163264 -113874 153559 160310 -208242 75672 -248159 -39839 -203125 87977 71574 -142297
22685 -112997 -116154 -136778 -218683 246530 -79595 141460 -55793 -132076 155393 114851 -89713
22673 -252380 -11092 -127645 -128898 33439 152464 -39857 -76101 25945 -55290 15966 111018
22662 111018 -123268 -12931 -151452 81725 -147914 -129495 75720 -56277 -233098 820 10120
22651 10120 101290 -330571 -211848 112264 -33920 -76904 169214 232018 69718 126042 -196999
22639 -230142 -311892 166030 169121 -80725 54450 116573 -154947 244416 -78996 -25520 4991
22627 45964 63929 -12953 -81717 37737 -189646 33802 124026 152510 162792 -142763 -163987
22616 -163987 -138049 89351 -73467 9948 -112165 176401 -171103 125457 97431 2696 146605
22605 146605 48008 -280282 -172418 -210391 -152881 124802 122085 -112085 -163474 131634 -162593
22593 275384 -22472 104200 -76262 87925 42436 49779 -156031 74835 149169 125498 131394
22582 131394 -409826 92638 66715 69762 -50711 -28219 47326 371962 -134738 69158 -47352
22570 81353 -7041 -37056 -1874 41540 -75916 -4636 -47093 -114618 -44719 163075 -207662 44485
22557 -98770 -106618 -119895 26538 -27242 23999 10245 -5873 -320281 -53203 -157847 -123523 -98352
22545 -98352 -76592 -123982 34918 404153 -452809 151159 53063 5288 -74668 229868 -39624
22533 -48644 -246118 36690 -204159 -131607 169165 -224510 44152 138661 -38603 141151 72494
22522 72494 -89848 -130046 161498 -343672 404426 57665 25543 -223957 -223501 -41361 116264
22510 268878 -179855 -239576 185989 -122291 -172671 159875 33145 211395 1136 -62243 -143792
22499 -143792 -13869 222203 85616 75578 -35373 -271453 -56726 -134553 83167 -130311 213258
22487 -38490 83325 -84836 -12981 -125100 -139844 -169750 37644 54524 -83165 123349 -443870
22475 -365301 -56291 -276612 -1051 -297384 -101650 -415653 -35897 27982 -377461 -97016 -19034
22463 18286 145945 -26450 -120298 -241875 -37205 115954 -130930 40569 227117 3175 -32907
22451 -27381 56393 53609 141903 -145620 -29339 152114 34277 51979 -238578 201441 73445
22439 209689 -283029 -525651 -217753 112766 -355655 -382913 17122 46648 -124993 -152907
22429 -152907 151152 -20985 -203591 49733 7264 -104735 -349917 -235857 -278066 11370 -65089
22417 -118766 245279 -5271 -20603 -35021 65721 52377 -140330 -226153 -131104 204089 -147348
22405 -58536 65053 -102682 -215150 320739 60210 111456 -181689 -123055 -42183 -23858 237572
22393 -143839 -134652 -11474 -54679 -90641 -91746 104437 -185544 -137217 -206531 -84469 336300
22381 -103477 11348 166516 47752 -262781 -132902 18576 85526 -171743 -33564 183949
22370 -126321 223517 -59309 -47569 49223 -14270 268219 -265639 164791 -87347 67771 -322068
22358 -58594 150743 -69232 14168 -186928 -15740 -29320 -67970 86966 120781 -293904 -165634
22347 -165634 -93082 -39943 -99983 15473 -8459 -12175 -186815 -88573 116663 -227121 -409551
22336 -409551 -194302 -277474 -285061 -221639 -15997 54323 -231374 -324358 114352 76540 94871
22325 94871 -60683 61100 120806 -154798 -87672 -21271 -220967 72228 66834 226872 639 -72775
22312 -49457 246114 -81443 -219830 158736 -377188 -254380 55215 17280 -164884 79991
22301 -71810 -168623 -296378 378793 -173309 3882 -7472 99271 -62995 -112336 98252 134370
22290 134370 25987 -170041 -323387 -229083 -50540 -323011 73447 -129225 44057 174329
22280 174329 157431 52541 -18925 -27493 -258401 164151 -219852 -303185 9427 -141405 -33598
22268 124086 78341 419449 58646 -121481 13906 -106379 41966 -37640 12590 106778 74710
22257 74710 96639 -104346 8881 2910 -158073 297776 107105 144173 13407 11333 63118
22246 63118 5051 -110709 -216744 264459 97221 133254 200644 64422 353668 28039 198351
22235 198351 113062 -28667 35573 18429 -225136 -48529 -137976 -239988 62097 -18786 -244378
22224 -244378 119988 159448 -129348 14891 -343643 -8587 50525 167596 285310 -402516
22213 -68069 106552 26535 -39529 290445 -267702 22275 -128201 -138832 77587 -61205 129228
22201 248914 11031 -176897 -286672 145102 -57829 -127484 -2804 -109638 -89225 194148 16164
22189 76963 64012 -4330 -125122 109102 -95063 -222979 -68532 -433048 -314450 329183 143086
22177 -43694 16757 -93 15812 -134631 119182 149092 -270247 -67709 26266 188855 -292144
22165 -52114 -290453 90681 -110427 51552 -73517 -67100 323013 -120078 134028 43464 59470
22154 59470 -210514 -254838 -430137 186603 -92722 -209660 -228536 -150918 -254958 264975
22143 245807 -185418 -30919 103277 100370 -336561 -118531 -203026 82904 178119 -459112 -68346
22131 323553 -73976 -184224 15988 -209949 199847 243477 -56054 -10956 -319665 120445
22120 -196215 -192124 -270962 -160323 125360 -116839 -175138 326459 37542 337297 -87359 -39472
22108 371575 -35117 134852 -71572 54656 -193486 68996 -68227 -107277 7091 -144560 -85097
22097 -85097 -205203 -87009 -64088 -61389 122542 -87920 320049 102529 133637 116844 -89905
22085 -282144 -93557 -138218 -1669 -204542 -386789 -169671 -432022 182686 165042 -235877
22074 -1096 -153566 406871 -273914 -40643 -304629 5824 -323526 19242 17955 20334 -121675
22062 -362254 -43715 -115118 -63588 -118238 183280 -21510 -161231 131523 -34543 14245 287176
22051 287176 227002 -114908 93645 -113560 -69728 100112 -137034 -58962 -109802 32953 -19813
22039 -267691 -62971 -91191 -194774 41152 110673 -192244 104043 11344 -153430 -14003 -175774
22028 -175774 -300988 151967 -177507 -43408 -79491 249723 -126728 -47638 -24935 198224
22017 73209 308230 -260606 112086 -170575 170424 181081 98696 74177 -4522 144112 84631
22006 84631 63168 -193804 -1201 81684 -184448 -141450 -103882 -48641 9153 -93895 -415474
21995 -415474 -48149 121016 -26337 108202 78866 -188258 11882 416551 -58976 -101255 26933
21983 -166996 21299 -21574 -24438 -222663 -100487 93847 277748 -125290 -56889 -208419 101415
21971 -126189 -355555 62135 17281 -109557 30736 97035 75611 -245955 -79437 -155453 -105223
21960 -105223 -331094 -107073 7654 -209068 -302493 -168967 -111553 104077 109597 82690 -149083
21948 124900 37004 294187 177247 -361222 -82648 -131516 117861 -45273 -263231 155338
21937 -351689 -229282 116708 56449 5962 192716 -338847 -29711 -418385 -11646 -140460
21927 -140460 93957 32256 -140536 -73376 -29553 104276 -27998 -41547 -278046 236445 363484
21916 363484 -194135 -231918 -77512 -403875 45860 -60810 -212002 151087 -210870 210028
21905 -84449 -136133 -135054 -70275 214096 -84873 -106326 83013 -117312 12341 -148263 -181271
21894 -181271 -207377 -225843 144977 186625 221110 31763 -26108 -97047 -461058 -148967 71224
21882 -45588 4094 173251 -56752 145571 -106435 -121960 91022 104522 -96677 119641 213255
21871 213255 156447 -39105 118496 -26040 56492 133563 -187591 -67741 -55018 145691 -53677
21859 -83262 53780 -481986 -131339 -94227 205111 20186 -128703 -191427 153169 -90997 11449
21847 -318495 338232 -226776 142674 -181962 -109701 -158463 82735 -177841 -20102 -49330
21837 -49330 139031 14397 -89457 -28870 33452 -172644 -34341 -381082 -24400 -234094 65231
21825 -18615 -225347 69238 -35719 -261774 -163140 44046 -128836 -51711 255711 4677 34934
21814 34934 84170 -208825 -137826 36731 -80845 -190293 18712 -308694 397491 -107210 294878
21802 -94215 -256211 -100665 -277426 -161258 -14289 20428 -56066 -112057 50597 83249 36004
21790 -262636 -89858 -143553 -29452 -88782 -199522 -170613 8188 -167087 255703 -33986 -204761
21779 -204761 233235 -46419 112506 -212663 136595 15036 60832 34410 -471687 34730
21768 -27338 -203582 -7970 249583 -118765 122181 -264470 174965 257012 -230959 145192
21757 -148289 309285 -18790 -60168 170264 -385875 41030 -114711 22689 -39038 -136718 229201
21745 -88999 -164359 -100612 58484 47838 -53232 19937 53214 241341 82473 166847 -151063
21733 1303 -46142 316019 104038 -212260 -367983 6000 -150077 105395 -159079 -206311 -41128
21721 -217701 -198343 -114079 -59142 -266932 191330 10585 -39538 33623 -145044 -152892 160252
21709 -280686 40371 -147327 -4234 73918 -172022 -176839 18603 -91372 184692 -142957 166088
21697 74380 -358813 62539 -38336 -129968 162276 130881 -32945 209252 -194393 25715 214518
21686 214518 -107630 32077 6909 -77382 -240559 -174891 -409177 -50478 -120710 126808 212207
21675 212207 -50156 -160747 -109915 -507554 -24942 153839 32706 36433 -216577 -29357 -9344
21663 -170411 -15677 -122312 -292967 -155863 -120010 98947 299189 185356 157413 -42014
21652 -42165 -202344 -24590 -266010 27230 -88814 -120593 -250891 48582 -264761 199802 -206675
21640 -59162 -289366 -140088 -31717 -248277 39597 -160530 9521 87690 134504 130190 -220085
21628 -23073 -158856 7123 -168676 51471 -120093 -19034 -164257 121443 -67430 -322644 132223
21616 367198 216148 82461 -281700 -73854 -227498 -193893 -109302 29729 -184616 -45752 -70199
21605 -70199 -58293 -71340 -79463 -133334 55142 92484 72393 -49732 -9855 108004 -296294 181679
21592 -158149 -148823 -40 169211 -127454 33410 24930 19808 -140148 -126091 -44928 241136 -135891
21579 114610 -87973 9321 -86866 166925 -66785 -422014 -268755 -224726 169764 144728 -99528
21567 -20290 -278066 -505488 -9887 -200120 -52384 37728 75960 86301 -158380 -98168 -266800
21556 -266800 -256241 -91292 -107447 -138264 14840 -404171 -51700 53696 -33406 -83435 -16034
21544 -162812 119664 -250409 58090 325712 -187046 -351871 34783 -97567 -90415 -406237
21534 -406237 -6041 -49011 267126 -272703 146556 -86754 134783 -118944 -43398 -94372 2309
21522 -330908 -292841 119656 40326 -7899 -181276 -114895 -284374 17581 -45490 52242 83483
21511 83483 66930 -67934 -285149 242006 -452052 19832 -257961 -50151 -87931 -517952 20946
21499 -117631 -11740 -85490 -116539 -106271 268881 -172870 151440 -126311 -71310 -166951 -1426
21487 -52706 144088 98186 54717 -91927 -167530 -54481 186331 155236 -98474 -216132 231314
21475 259404 -331613 198766 55328 -175497 -155854 -229378 -23855 -97953 -184746 -26400 -127270
21464 -127270 33078 80183 -119672 -49605 164830 -127961 -66786 -259271 -116724 43086
21453 48397 -44117 452197 -110482 142405 -142309 -11806 -88869 -93287 157410 -104076 298052
21441 -111015 191659 185117 289021 -162647 -215253 -295866 143641 213485 2972 -74497 -217874
21430 -217874 8887 70730 80885 -47700 -324558 -303562 69113 404690 -318851 -121237 123897
21418 17828 -425718 -84877 -393013 -270986 19611 -71475 -14816 57725 154431 -214449 -237966
21407 -237966 -46781 -178880 -223693 -86953 27051 19750 235550 -276850 -60308 -225159 -171745
21396 -171745 -102715 -192661 -101006 -261619 -250654 -325585 -190922 275525 108132 246254
21386 246254 107648 -11523 46550 148029 -25415 -586339 187932 -73662 -38553 -10407 62323
21374 128986 -297610 -466371 -220775 -195541 205533 191463 55841 309097 -346748 74651
21363 69465 265285 176661 -242173 230370 110275 158005 -67768 -30390 -133428 161185
21352 111166 129105 -204787 -119489 -129414 -182981 -259854 -13044 -222754 -171211 -29735 180960
21340 -180409 -204707 -63442 -12833 -71951 -152170 199386 -169041 -448742 21794 -340607 30138
21328 -49617 144852 -80358 -254176 -101790 149370 30433 5885 -220715 191854 -113635
21317 -126226 -94966 51030 39840 96806 -393160 54740 -235625 -235315 -142522 63554 8556 6623
21305 6623 -165590 -126190 17401 -88371 161695 -201145 -59496 -307315 -73174 27633 -193543
21293 -163152 -58812 67051 165628 43151 121685 261042 -187836 -226411 -49876 -45046 -56472
21282 -56472 80203 -116565 -89594 -391556 -229456 -219177 121194 -281992 -12612 63380 123337
21271 123337 -45358 16651 -62424 216699 26812 35242 -62993 -243319 -23815 -54189 -208835
21260 -208835 -483778 -31722 163421 -18708 99324 -284834 111367 123401 63513 -285990
21249 81297 -300856 -159572 141177 -192433 -71460 -168103 -210784 -7309 -3822 -59492 -180639
21238 -180639 138740 -264656 -236793 -104186 6729 125120 174767 127441 -135520 -306209
21228 -306209 -376328 252956 -257356 138241 40844 21296 76959 35111 -262828 162100
21217 83565 -25735 80152 -8554 -13122 73157 -111972 93316 -26791 166462 35244 -54626 28492
21204 66010 25440 -199169 -203229 21021 -103017 -115375 -7942 161034 -75371 -171012 -222926
21193 -222926 -63698 244392 30959 236047 -158089 -278525 -1091 28585 -84887 258360 202193
21182 202193 -115574 -298880 271611 308160 -144782 -197776 -171731 -50887 -289336 -55121
21171 -297874 -127611 -108452 -123913 -265751 10548 -223511 -25077 -145963 114320 -249960
21160 333753 -130399 -276460 92700 -52454 -170391 -127679 -860 -106677 11656 -217269 -37366
21148 -75293 27754 144156 -146914 -4386 98495 -29672 -29215 -589305 -148139 -264469 -107257
21136 -158303 -120626 -123027 -116442 85982 -103178 -402246 -223031 -340354 -79434 -68836 215426
21124 -215257 -149816 3207 48989 3236 65204 37753 44997 -91748 -125303 5605 194754 -339027
21111 78186 -46072 -275982 -110565 64532 -276973 39503 -36114 -16371 -103681 1837 175281
21100 175281 -306760 -125083 -73539 -11160 43750 -189655 16252 -194106 -32003 -348665
21090 -348665 6151 46156 -67786 -128471 114346 -258644 -134175 -61373 -320463 33260 206003
21079 206003 -87240 -45025 -119493 52367 -1545 -1040 268385 107297 91854 -108846 -335955
21068 -335955 204135 86592 466404 179577 -176186 -38695 21969 -42757 80907 -50444 4201
21056 4258 48483 100502 73520 -140001 96499 -74734 -17148 -184936 -67952 -206142 -338954
21045 -338954 -160265 71307 -75268 20781 -192607 -113838 -159463 -73204 -27613 103281 -98136
21033 23112 214604 -185455 208496 212620 -41995 -408528 -9925 109014 -132644 -414062 -229785
21022 -229785 238779 -362864 -284164 -328274 9013 -34963 -72989 -29451 -55674 130094 -341587
21010 -219790 -28556 36561 -166672 -49022 100600 -73528 -145892 -253149 -68141 -59866 204
20998 89504 -90452 80239 -126875 -61977 119951 -179773 87785 -211652 195751 -101347
20987 -298323 -358962 14463 -200021 -197101 108598 129609 293321 -21704 211088 -14136 16946
20975 -139853 -46592 -73717 -138095 157876 100646 123868 -277472 -125041 241424 -87914 -152418
20964 -152418 20617 339471 105682 221599 49332 -281753 257050 1190 267306 -236777
20953 256466 -53622 -72799 -60274 -91299 -67194 178796 -215357 -265508 -194711 89913 52043
20942 52043 78716 -146679 -196128 34258 -79187 -10824 290109 -154129 253758 104905 157712
20931 157712 109197 -204711 19461 268857 -340043 -186917 -56829 -72804 6220 141023 170884
20920 170884 -51941 -5774 38739 -178509 405 164657 119210 -152194 -357856 148179 3444
20908 -169001 -1933 -48458 -214703 -125774 -354394 115280 -103274 -92826 118281 -59367 -276164
20897 -276164 -57092 57664 86422 -36229 383306 -132687 -97218 84935 -68542 343985 -56983
20885 -147944 33636 -79215 -95497 -91411 -116844 246475 11369 -18924 27599 -396147 -166924
20873 111854 -111756 -242283 -199464 -120945 92330 -26344 167433 -693 30466 -159051 -140074
20862 -140074 95804 -64942 -23911 -166353 -161628 -92917 -63024 126 -120167 -201448 -132127 -201299
20850 -201299 119147 -2780 -78602 -100543 -64764 -123906 -176089 72571 -74529 -295764 -190683
20839 -190683 -10427 -29989 -31890 -47561 -207654 109226 -74792 -51976 44550 -76322 -15420
20827 -126203 182113 -72410 -268584 532739 -106983 -397560 58972 -6830 -169442 193972
20816 297440 -324020 351007 -89418 -224215 -29593 -219790 -62585 -196611 -64077 -73322 316298
20804 -72514 118066 208796 -172428 87696 15706 -17725 108456 -147694 358022 -373539
20793 35848 -129656 -74205 -27650 -134235 -462989 158321 117955 -53289 -250707 158819
20782 -219600 -98779 -113666 -401409 -109194 -322293 7336 -339292 -72430 118577 -152061
20771 -82596 40609 -109774 -5676 -212314 286828 152922 -39833 -192433 -215945 -230739 -267360
20760 -267360 -43977 -62015 179671 -21938 30036 293305 -129467 -188675 -33335 272656 -311000
20748 -38991 -78726 42606 -200966 -5009 50223 -105675 -344359 -75658 21254 -399771 334694
20736 135537 227454 -178391 -269608 -177302 -220857 -11602 54786 -53661 -80091 -452938 209754
20724 -328226 213114 -127766 -133944 -14348 -20023 315582 166490 -2360 -125337 349648 -327691
20712 -124091 -20269 -134503 -154288 -178783 -64858 -30645 108021 -111459 -50943 -112530 -298935
20701 -298935 -47421 -200933 -83443 -44953 -304796 142934 -303367 -325126 -171349 -40670
20690 193961 344 -15435 -155698 263385 -283966 -158553 -78481 -220369 -183807 23143 -10923
20678 -278538 -169491 -60431 129036 -172813 -264365 59503 -75508 -130115 10388 -241655 -190625
20667 -190625 290569 -33624 39132 -41115 40074 3762 352595 -3892 71312 -278826 -374097
20656 -374097 119694 -53268 -46874 -222925 125936 -110769 -440713 157336 -327795 -196294
20646 -196294 -49356 -212874 152094 537620 -16416 -247453 42231 -160114 -40997 61785
20635 165849 206431 -345446 44603 -239084 -73613 -104610 -33318 -6759 -102307 121108 -35998
20623 183275 32878 -136974 54788 -170812 136481 280426 190626 -91001 -216845 -192422
20613 -192422 -310974 -71840 -150064 -294721 -194279 -8168 -82808 64089 -291919 -274059 375119
20601 -35654 -35601 35815 279914 -138882 -241430 -273718 -12185 -222359 -202015 -59166 281389
20589 -199316 125565 -257766 -129189 166603 -180815 73701 226795 -84889 229882 -210129
20578 61049 177433 -115563 -168717 -102790 398719 -45341 -122399 -99880 -170333 -179348 -64712
20566 203890 67211 -67467 61293 -249098 -88839 35286 -78250 10888 -223231 45842 17862
20554 -192971 38414 193785 57223 8717 -99617 -82138 -52776 13425 -160222 -45093 -211183
20543 -211183 -39171 -56415 -6971 109225 -174955 -88660 -41151 95462 54099 268494 -111760
20531 -72429 -45175 -1159 -81729 -294471 -68333 -272647 -68977 -91267 -201224 7459 203911
20520 203911 -218522 -95852 -89318 150372 83604 -17546 -38691 90876 166069 -19125 76172
20508 -239995 -150611 41083 -39700 -87791 -193456 -156909 -310013 -382548 105439 -123248 -143984
20497 -143984 -99570 -58618 -129270 -204750 54929 -137048 181448 -290941 12630 -220902 -180951
20486 -180951 -176590 -264366 -308788 71702 -124789 -15350 86627 -3785 -140917 -134937 -90103 -346030
20474 -346030 4650 -223221 -55416 271369 -83304 254128 -184048 228539 90646 291790
20464 291790 67215 -207120 277509 27248 -117015 28184 -366614 24723 -21075 32073 175146
20453 175146 140930 -164599 -267292 338233 -405479 -47803 127881 306551 144614 -61504
20442 -18128 -73460 -31250 -162403 57354 -150951 170957 -119267 427704 44692 53447 448168
20431 448168 -265306 -48357 127117 -250714 -292763 -173423 -10508 -122469 -356459 -274644
20421 -274644 -73738 -223515 48071 -200625 -402171 394963 93923 58153 304049 -61401
20410 -194705 143932 -56091 -97061 -18005 191343 258605 381569 -262972 -258841 -186148 341743
20398 50178 201628 17956 -123926 -39290 -313743 -166094 -47361 -85989 115076 22211 -244271
20386 201807 -143253 -39513 -265868 79745 41789 131090 125905 -150652 -61786 299825 -15997
20374 -216511 -16420 -59861 -216019 -448856 18189 9894 104500 155886 -96050 -20265 -189591
20363 -189591 225372 134513 115064 54880 256995 86849 -62301 -123921 179674 26146 -143939
20351 -30776 -146398 -112662 -38696 -107716 -365074 -179331 -118128 -146912 -173414 202950 -126251
20339 -106848 40019 159015 -246880 18574 -453541 -35003 -177931 -30607 -236049 268744
20328 -180317 48239 -18511 -174233 223658 -329465 -199747 -121735 -42784 79679 22451 -90283
20316 -418578 -55876 -116085 -330532 -13113 -352928 -148991 -301953 95732 -134987 161623
20305 -207342 178953 -311813 49068 -276017 -173495 -78457 -92649 -179919 -16379 -51144 50424
20293 -155880 -60777 48370 59163 232062 -196932 -291282 -104325 -149423 22904 -381458 46039
20281 1038 74117 -177861 -124737 129460 -175882 21478 -244420 -231346 -105931 32289 201240
20270 201240 -121008 -5633 222204 -100332 101241 -178273 18197 136407 -169058 -298127
20260 -298127 881 -322329 42848 78870 38810 91405 -124626 -11050 -487756 -101573 428531
20248 -365741 -13531 -178256 42803 -57420 -283697 -1438 -55724 -224827 -25280 -234243 -163080
20237 -163080 -228533 -280103 -51863 -262578 -83326 -192631 -146456 -880 129121 -223059 -267940
20226 -267940 -57636 -354101 -82193 -3546 179606 -1711 74727 160965 -28934 -268862 -26416
20214 62892 221298 73279 -57111 51094 -223660 -290940 -69524 122060 58123 476538 17090
20202 -113791 -77164 -2726 160171 -14415 -136862 -245744 117675 238184 -182800 27200
20191 32133 -164235 -73968 78125 -98280 114913 -87523 145276 282641 206297 143703 -168768
20179 -295096 -84264 13918 28561 115969 -197586 -162938 -121729 -158069 -23034 58957 13742
20167 312631 -187526 108045 -121004 -83508 -100789 9189 -169930 -263909 83987 111071 4677
20155 -41882 114157 -226569 -95736 -19741 -52469 136853 26299 239371 28315 -112376 -54392
20143 201022 61183 24667 -88354 -111828 -52138 -38749 27409 -157216 112504 -26175 261392
20131 5696 131205 -217335 -143945 87821 32930 86337 -5767 135294 -159419 -45450 -195440
20120 -195440 -24471 207945 -39198 -257101 -196741 -165357 -321004 -130239 -79592 -113267 61408
20108 176020 199759 -306848 20016 153779 35146 -137983 246398 -3897 -188381 -226098 -31047
20096 -296393 19704 -223595 262745 154037 -134521 206736 -132206 -31366 -43146 161923
20085 -174357 -53721 178579 40230 -199394 -185943 -176897 -159083 -193859 347798 -56900 334395
20073 -89779 -437527 -27419 -143589 159432 -312017 -42886 40583 -233286 138812 19758
20062 140976 -341038 -254096 -207969 -53011 -42912 61120 -89302 -31524 -161485 232610 -376371
20050 110460 32375 41919 -191660 -92451 -12508 216631 -358412 -378695 -86344 141201 -8643
20038 -122979 -81538 145016 -15907 -258959 -327111 -75129 -82777 38353 233523 -299942 -42107
20026 -301034 -68775 362198 -50571 -40865 124196 -323259 128510 118268 -111119 22631 8266
20014 -219273 -202995 132199 22823 92047 -186786 94904 -351958 -80927 46886 135779 -33939
20002 475178 -9074 15092 1958 83549 277001 196527 -108513 96842 -200076 -2729 129002
19990 -238016 -15873 94746 167916 -323065 -25399 -39425 243857 -95892 -114090 -168023 -63246
19978 50859 -91444 148425 -156854 192444 90582 -387171 55452 -45277 94109 -88442 40333
19966 -106308 -371070 250222 4901 107381 -158653 -37216 -81182 -85250 -52633 253275 -315958
19954 -170939 -264291 18876 -111902 -217719 -106233 -281113 273910 -327702 -14543 -246840
19944 -246840 -123793 -154448 289487 169888 60514 -95661 126963 -233622 -643379 -141532
19933 65386 -111004 -114792 -177691 60513 -172632 29114 -151537 -419649 101946 -84051 9673
19921 -253986 29760 -109511 -137117 -203309 167358 16011 -125982 -136486 14968 195330 16681
19909 -167954 -522474 -42877 139838 2754 223361 -48528 -65949 192750 -298879 -227497 -104405
19897 -71454 -66951 -265544 72550 -258626 204990 -57254 119683 -226111 -52623 -45485 -319830
19886 -319830 76489 -283679 77504 152099 71104 157806 -245695 -169136 -39091 171179 -304010
19874 -231621 -401385 -359410 89502 -192726 -295682 -257260 164277 -202989 -199700 298736
19863 -237861 -170820 28851 -189406 18060 -307609 -158991 18841 -36830 -120995 -188979 -53798
19851 -15026 11931 -68525 88768 225452 20994 174880 62568 213605 -84959 -77559 -340563
19840 -340563 206415 -264894 -110916 48161 -92779 -115794 -102174 -74585 26398 -72321 191267
19828 104121 -413804 -518829 -302113 -74580 -46628 -2443 159179 -55950 58702 -107675 -150309
19817 -150309 22853 -117773 11265 -35774 6634 -87622 57563 45937 32008 -143345 -82996
19806 -82996 -111654 86470 175070 -226473 -154213 -274970 -117332 101099 101786 38012 148306
19795 148306 -215961 -221683 -186945 -172052 31626 265146 -135453 115702 -131461 85088 -68930
19783 -99029 88600 -314028 -311353 19216 -264679 -61969 3828 30495 109861 -30526 40215 -315598
19770 -159407 55818 17986 65047 -134829 151234 -258908 -149983 -40456 270924 -336900
19759 34224 288629 -91466 83503 -93411 165150 135964 -79015 -223307 58302 120260 153726
19748 153726 11114 -92883 -174912 -118639 137261 249991 -81824 -116529 75951 -230393 -379528
19737 -379528 64496 42940 -309358 -19479 51632 -284708 91881 -108063 -218524 98588 152620
19726 152620 -39725 165137 139429 -120858 39602 32953 -362448 -232841 48951 -204809 11887
19714 7665 62602 -156993 -3631 -306963 115263 -98354 269064 -124859 -442109 -177571 -170844
19703 -170844 28728 209001 -190266 -114100 191173 610286 -39412 160968 154836 195122 274206
19692 274206 132839 -220558 1763 106885 -223656 26440 -161528 54928 86921 -39628 -69162
19681 -69162 -365035 11680 -42183 -80219 -184855 -111053 -94543 -34205 303483 -446037 -49121
19669 263081 -198022 23523 -370900 -137475 76926 -34176 -137076 -34677 78845 -32009 -87764
19658 -87764 62269 58707 -215096 -411761 -33141 76249 95196 -85389 -47619 102923 -17454
19646 230413 -58142 90910 -88079 -33488 -49674 -152673 -131227 -202594 -253218 23021 178591
19635 178591 -282402 -131327 45957 -208741 -349157 -164725 -112862 83518 -42147 -21212
19625 -21212 -264040 -84074 -69588 -271176 176984 40560 217606 77831 -140855 237445
19614 82717 158678 27887 -242574 6972 -102286 -42468 -153723 -207884 100827 -111359 -305215
19603 -305215 17135 -213041 -369704 135602 -130905 -77013 -319606 -200222 -38527 -29012
19593 -29012 36546 -40272 -207611 -239274 -32461 16265 95597 48165 -17749 9618 43451 -25053
19580 -192917 -328834 -32732 -120000 -48263 146421 20565 -55914 -41192 -61014 81922 6887
19568 52623 -3860 -201410 -202440 -209912 14903 -132383 -121758 -213238 -497032 38316 -206720
19556 -17748 45340 82802 104676 -52198 -151580 -88680 23646 -69378 105995 -82551 -135737
19545 -135737 -156556 -130856 -351377 -330943 -184381 -133610 105344 -94983 38620 205405 -11663
19533 88943 -130826 -142154 -1790 38982 -57307 150439 246702 -50635 37474 -113273 -128733
19522 -128733 36386 -348647 -303673 -79643 59971 -186900 65638 -318756 50282 -195642 -16628
19510 -444562 254506 -306846 -263613 15000 -41161 -96481 154291 132092 -190800 -66702 -89865
19499 -89865 55609 38894 -196874 84324 24125 -356199 -213085 -267909 -16578 131242 123085
19488 123085 202837 187237 206431 303700 65305 153628 -420464 -118376 -341907 109252 -189046
19476 -255003 -122034 -76469 401189 -386255 29690 -24347 -43343 -48200 -237280 -229295 -232022
19465 -232022 80059 117097 174447 -80040 -217431 24497 -150001 -154471 29413 -25701 208025
19453 -132508 -223821 256837 -37438 216915 208393 40731 67860 -139571 63696 -152178 -316090
19442 -316090 48092 45137 -359602 -122488 -179090 -345874 -21946 -69058 -108500 120289 -49048
19430 -130690 -205378 -131034 105334 125113 -13913 55188 283305 -101327 -222452 56812 -34491
19418 123973 -14856 -3390 -7660 37594 -52378 97087 -61238 -85315 -421379 -171660 -93536
19407 -93536 -124295 -213161 114554 44928 35945 165606 -153202 -140079 -219189 -108656 -95999
19396 -95999 258784 8003 210513 9014 -26422 70933 -310731 229469 -141707 149653 27061
19384 128856 -405708 -184855 -233855 142510 -255219 183855 -106806 -388645 -58296 -183327
19374 -183327 14705 -90331 -123035 -78584 39426 -257919 -150443 100641 -8753 66528 -126510
19362 -170349 -161225 -299402 -277289 -4302 182039 -406297 5391 -400116 29942 -70067 -337427
19351 -337427 22808 -174677 176926 -2846 -29000 103983 174018 -156764 146316 -168942
19340 260615 -235787 -35706 -4111 -32397 67998 227698 264444 -106537 -72830 -87012 39837
19328 209570 50339 -84865 121695 -304961 188913 -199423 45102 221055 -69923 277872
19317 -24481 -227990 -210618 -415327 -403821 116436 -406635 -59438 97979 -168059 -212206 -34091
19305 -480158 -188296 -44310 172495 40121 125371 -260481 80893 301408 108818 -131137
19294 -48238 -339059 23903 147558 -126397 -455077 -48527 -349810 158504 -56662 -139402
19284 -139402 18090 -72191 22245 -608 -252332 -351504 7323 70632 -1013 118512 -63966 -101996
19272 -101996 -180478 179797 312353 -36044 -138241 -54668 -544607 121225 -117176 35614
19261 -83104 -139557 103184 -123528 3481 193659 190736 -168745 -209131 -185242 25030 -353143
19249 -131075 -265513 67762 114752 -19811 -206039 -67178 -238083 -158041 -89188 -52084 49008
19237 36354 -100580 -98473 81892 -168097 -64872 -168448 -45519 -122569 3650 -75707 -24583
19225 247871 -77478 176056 40802 -55374 -249586 -54931 22438 -182305 184493 -338543
19214 -531882 16424 -8910 21108 234923 -139254 -13636 97588 -448916 -38583 -225569 21891
19202 -282009 -200647 -45685 -297122 -183352 -257152 213473 51939 51139 284773 -64315 -59977
19191 -59977 -181037 -232310 -264287 -26391 -124662 139487 76015 170573 -45783 -292868 26409
19179 74015 -318056 -64678 156651 -312760 222493 -396975 -158672 -28606 -20658 -153826
19169 -153826 83835 -164334 -361172 -257895 113462 154124 -77851 -364537 -43609 -95940
19159 -95940 69011 40202 -19714 -213629 -192145 -472259 -33311 -232933 -41406 121858 35771
19147 -920 -32806 -158671 55125 12650 162967 -234428 -198570 -245957 219240 264638 -282336
19135 -120996 233166 -171208 -21055 51131 64829 -88304 122394 -199404 -21190 -240822
19125 -240822 -118137 -143482 9706 -221269 -232988 57556 -44688 -112696 -204015 2444 -129787
19113 -249450 84236 105932 -276673 46450 204520 282500 61974 181131 -295912 -51702 173148
19101 -128367 426440 105495 -387501 -59439 -20838 241744 -156436 -260628 -22102 -179458
19091 -179458 -7267 -45803 -31474 -154909 -270831 -242465 -37551 65458 -11924 -252166 -7058
19079 62678 188252 39228 -31499 -137971 -316448 -124601 -89759 329411 125663 -83672
19068 -181691 -59185 21794 -94856 -363950 -50972 -70628 115006 -53290 -39255 278524 -168342
19056 -15121 -91045 -216988 -161537 37748 78707 -410476 120422 -249021 -347233 -157775 -54760
19044 -286990 175503 -63378 -330708 -132417 -129896 -192156 -184280 56299 -107811 -90500 102729
19032 -89584 242975 -358711 119159 131884 -50479 -300298 -98759 -30025 60692 -145827 -81732
19021 -81732 188910 6766 -155087 83876 161377 -210585 -371520 -187628 85186 65497 -8191
19009 -52503 9242 -25987 -15801 -35859 -98544 -67152 -57605 -128542 -179968 -250701 32901 -213870
18996 -30828 -889 -104556 114103 -111673 -197661 -56826 -188652 -224706 -1141 -17185 -71235
18985 -71235 -174086 -88320 216751 127166 151989 -284856 -104325 -390881 -65576 -81971 -66140
18974 -66140 -132321 -90359 74950 -117966 172801 88946 152126 168846 -77336 -125097 -109975
18963 -109975 396 -135682 96423 151992 24237 -96252 199069 -185335 -52473 67066 -120813
18951 -199106 -16082 -100140 98397 23423 95365 12685 149718 179261 -78924 -18551 -101807
18940 -101807 -79439 -242453 -152664 -300922 -153340 -36125 -253166 149297 -4220 -265468
18930 -265468 216956 -126795 -353474 -150083 377640 147131 -104169 440935 -210814 232894
18919 -117204 -125296 6994 -288545 138334 -80806 -138650 133545 -237167 -1554 -145080 -159511
18908 -159511 72025 -277370 -72474 -7044 164902 64247 110076 -104324 140914 52286 1887
18896 -52936 108384 168286 -190779 61911 47507 -63549 -144929 -118198 63284 -158390 -63439
18884 3995 -80836 31591 182112 -49282 -37765 -309522 49296 19455 -47931 99639 -35188
18872 17045 -31165 -461424 68792 -23290 -133341 200324 58426 -330115 -316346 -9414 77987
18860 -78646 -254512 287997 -36799 84000 -26846 -37613 -29688 23592 -93736 68538 -108156
18848 -91982 -152340 82756 -93746 62390 122043 163259 -108285 -150586 69533 -10391 126737
18836 -148816 -10236 -107760 -9653 435295 153582 -76891 -547675 117141 36239 60234 -215587
18824 142116 -281465 -171969 -18898 -59324 -99653 72909 -203971 64738 16817 -133182 248934
18812 -138690 263959 271544 113511 -126895 113627 -201640 -177789 131885 -26294 -340083
18802 -340083 -18608 219537 -60388 53386 86603 -160815 -58468 -48116 -261464 364074 -91973
18790 9521 50751 136354 96239 -166199 48971 113686 -305281 -29984 -34414 -361760 54449
18778 -185709 -256905 -35027 138253 45704 -336570 234821 10592 -34739 18845 -161934 124416
18766 -466612 180092 25622 -303392 145854 -72238 -169340 209018 78971 -295898 -230848
18756 -230848 117743 -37008 106403 -250057 -60360 -134498 -415134 37739 42143 -119906 -208780
18745 -208780 104067 -99005 57585 -85115 -180681 -38115 -266958 -120136 59743 -339014 106184
18733 -185430 -323574 5588 22249 31960 -173680 271801 -77639 -282442 -44827 191658 104174
18722 104174 -76712 -85269 19930 -92688 111772 -187945 227413 307308 -244025 147977 101975
18711 101975 -301077 -97944 -85695 453379 -340571 -106830 -123068 -101905 197357 -158280
18700 -43125 -102682 257972 -95353 -240544 -113951 -7769 -289726 -231213 -99140 -104066 -111524
18689 -111524 110258 -143260 -10719 484369 -142960 -276425 79940 165282 196891 57100
18678 -143174 -41301 -129408 -281689 -7268 -77278 -45252 -151754 237786 -191420 99989 -94673
18666 96745 7869 -279046 12141 41802 63965 -96122 -30373 -63066 79759 -123175 107493
18654 -411481 -197896 29890 -73946 -230842 -123341 -42157 206613 -43306 -90487 -247965
18644 -247965 -257007 -91635 125063 115061 2043 -166865 -115829 202402 -110186 1355 -400315
18632 -145928 -25300 -251544 -25443 -256546 7792 131712 -159199 -82468 -82712 -414441 119063
18620 -117101 151997 78109 -4786 -142816 -183190 168444 -46398 27936 52047 59607 -158295
18608 -105924 228271 -381926 150102 22650 -10022 -313710 44646 -115642 -151466 36515
18597 271386 139989 70647 53346 -146261 150681 30601 -70236 -53982 -177133 4044 -40631
18585 -64400 -26923 86636 81733 -44062 -141646 47192 -41894 -2910 -241463 -100051 76912 -151950
18572 180213 -108169 -414799 -182662 66505 205605 138594 -267903 -491755 80190 -294853
18561 -324971 -7431 45244 -27055 -234242 40644 239983 -125583 -31998 -171356 1493 114138
18550 114138 -94105 82579 43902 -105522 -155116 -254437 -271528 -62179 104512 -257119 -97552
18538 -15425 132746 -218329 246483 -61724 -142942 241530 -196589 -76854 -191810 -197535 -12289
18526 134111 -91567 -99891 -5960 321865 33996 21596 -181706 145013 -310927 142791 21539
18514 -17783 -15788 -55655 136534 -34044 93808 19923 -28679 -44116 -4084 -218387 31755 -167265
18501 88294 -197972 -179448 32976 -151845 -96678 -386847 -48988 -100657 146514 -117144 9618
18489 -170332 154946 -58213 -9140 121921 -62894 -145298 -293179 21239 -71641 140917 50254
18477 -541674 203374 -156436 -44239 -213829 55394 -280439 14032 -2807 91464 20564 51912
18466 51912 -218617 -182155 36392 39844 -18219 102825 104598 -11162 -185977 -19788 136008
18454 204103 -128848 -47279 75697 -48632 -52693 -150459 -31470 76610 -42138 -231088 -160016
18443 -160016 -88260 177884 340643 -129623 49041 -250141 139465 -137148 -1394 -125311
18433 -125311 -173284 -186381 195754 199493 -96118 74128 19602 36332 -353383 -22145 152307
18421 -265370 -265644 -248489 -5789 -112500 -20465 -283882 -205726 -169285 218729 -6395 60859 287581
18409 287581 45428 152674 178074 -95908 68749 301546 -230027 -28383 -87580 -247938 38458
18397 19865 16039 -128854 38650 -247904 75379 40020 326406 -200224 -198557 -122434 246759
18385 -20218 159717 -68781 -262705 95689 132890 264056 -326338 -149401 -181707 97271 -66499
18373 -93022 147648 -251260 -79487 199752 292257 39872 -75758 106962 39909 19243 -105922
18361 -360324 31958 -318015 -194938 69302 -30048 -126910 -411682 5802 155099 -194712 -111737
18350 -111737 31329 -240414 23849 101085 -83415 87668 -147267 -83233 -178449 -15865 -411452
18339 -411452 50432 -193263 -95071 4214 -28158 -251470 -278507 135149 41204 101745 62746
18328 62746 -235700 -205574 212187 -56834 123347 27159 -185382 277016 -251610 82129
18317 -52940 -333006 28816 31596 -353946 -115917 -82210 204746 -286601 122759 -226490
18306 -2349 -73092 319061 -196743 64582 -226302 142178 102477 -361247 209821 -33749 -199674
18295 -199674 51903 -35810 -33308 186155 -140013 -101004 -6160 139411 -220129 27350 -73704
18283 56687 195391 -190564 35427 314677 36237 -241835 -91528 -243751 75736 21138 -44282
18271 -91681 -32611 127470 45260 77061 -142259 -113149 -187143 208952 122403 -180738 -72941
18259 323062 233938 -43468 61313 -14280 -133201 272335 -341819 49606 -178099 192303
18248 30134 -31801 182572 97983 -174670 628 -34890 -54468 -390358 -55594 -146184 57150
18236 -330460 169096 -198 88790 64766 120630 -3403 68149 -196782 309141 -74116 222518
18224 -114645 -82061 164699 57978 -387526 -44767 10152 -186965 5453 -304172 -7900 -127841
18213 -127841 128546 85061 96205 -330327 272004 -11945 60064 -38367 10648 -58030 -65191
18202 -65191 -184738 -75278 -140908 6814 -79260 -99193 -72394 -441564 225610 47122 -89011
18190 23508 -320016 -26848 284771 -104146 -116060 -12798 81880 -146934 187506 78925 271460
18179 271460 -146578 156883 6258 184296 -44775 26181 -67896 198450 -125091 -306023
18169 -306023 130609 144916 -229951 32168 76512 163319 77050 -260014 -5610 -240828 -136422
18158 -136422 -14268 -183133 -61525 -43496 -3157 98864 74928 121380 -20237 99017 -116407
18146 -79210 8114 273055 254655 -43524 -108460 59112 -16610 -246328 235500 -106472 -125605
18135 -125605 -168963 -20654 -41189 135124 -2005 -285646 107278 219170 174166 -110178 44865
18123 182084 262673 45630 -308081 -155144 -275595 296001 104534 78867 -58779 41401
18112 -118337 -129274 -120845 -67842 101962 84869 -223047 111442 19769 -156033 31266 -24110
18100 -202868 -101729 -85399 204875 74342 -62757 113964 96395 -182591 22114 35237 17614
18088 -69240 -99324 -14646 -71456 237829 -65903 -24323 183730 78815 47399 166449 255417
18077 255417 -364410 72792 273578 1965 138792 -97868 -65913 62208 -49429 26602 126332
18066 126332 -178802 213064 133906 92140 17694 111496 282510 -43026 182570 22 179744
18055 179744 -31290 234896 -29510 -82841 -318288 -3269 -127375 81823 35803 141005 -31392
18043 -3613 23410 -17557 103343 285514 -313222 168784 -146700 -19833 -376227 165805
18032 -47507 -154553 6382 46609 -88319 -136601 232440 207535 -174825 -228254 -68339 22000
18020 -458743 257162 -420698 -10082 -277458 42511 864 144105 -59391 185980 115395 233329
18009 233329 -83852 226540 21621 282081 205553 -85038 -10529 -1003 70297 82064 -185768
17997 249829 -104907 -55830 217335 -90914 -87894 -180509 -17375 -338129 -60868 -158882 22165
17985 -131378 -121004 153340 -157121 265065 54789 -115455 58269 4651 45488 -151818 -72396
17973 3843 20510 -74396 -109662 -110648 -248440 -119212 112022 64006 206863 -210803 208785
17961 -163405 -73298 -88733 -227525 -84421 92670 -134493 -60607 -136833 -90462 5917 6172 -260389
17948 -266611 249102 44586 -254508 -348101 267229 -62441 4475 -79725 100332 -376317 97025
17936 353755 207505 -77886 -133526 -65539 -154583 -70016 -213315 -241965 -141263 -93833 139920
17924 -78768 -103718 -49467 92128 371962 57718 52874 -45442 153521 -31487 30485 391133
17913 391133 1227 -7127 110972 -11804 -428750 168972 80365 -107966 26693 -40202 20957
17901 -48371 293664 -123384 -124369 53330 -267605 78900 141384 157092 137577 -224439 76789
17889 -150180 -49357 241764 -5152 -185055 4969 -94258 168271 97922 -207380 40428 353384
17878 353384 144789 29566 -11846 6359 -150269 123903 161060 -57951 70791 -233802 -212654
17867 -212654 -153885 -81697 68908 -124113 184418 -85870 -57406 18041 70484 -91470 -164842
17856 -164842 93247 -306343 360214 91001 -13891 130362 -104860 -277753 142705 147179
17846 147179 -97075 197771 -43154 -124029 -191542 65700 -304558 51071 6637 269888 56336
17834 169252 -14737 191385 138709 -379765 -60687 255556 -164145 -527845 140414 71615
17824 71615 141138 136978 35525 -184694 -221242 -193817 -200207 145043 215864 288563 -203263
17812 188583 182738 115393 -67163 -84215 62763 -67148 40293 166744 264893 269536 97593 -171891
17799 4390 -2244 195793 -148163 -331938 -69874 -23951 -241100 -79099 120988 86093 176100
17788 176100 225961 -101123 108556 -199544 137646 -62507 172365 74819 57870 -218076
17777 63448 -174626 -83192 -124670 165176 -119319 287556 123793 -165608 -247847 -4697 -922
17765 989 -130353 44099 -203600 400328 245984 -46016 284931 104779 -161 -156636 -12789
17753 -84442 69468 -19022 -134844 -148320 52184 -35051 62463 155022 -251275 358244 -12211
17741 211580 108946 24863 139347 62734 -200441 -37418 189684 -75498 173922 -283130
17730 33028 65766 631536 208372 179429 34996 60625 -239722 -35615 -12231 46940 8057
17718 191321 -47331 -164903 -182592 205434 8645 326158 179853 -116498 -73132 -30517 77242
17706 6449 -75908 -52186 -113137 -205033 12980 -265852 57934 66505 -173324 396825 205888
17695 205888 74526 349122 48347 131254 -304499 111189 380741 -43160 -269202 -22263
17684 393210 72854 -40951 631638 59565 161361 221497 157660 161914 -39066 42498 172275
17673 172275 55197 -235410 77925 3743 52662 -86178 -61389 71752 -20849 -35488 374164
17661 -56777 246272 109983 -46693 3937 169865 4082 69382 205211 34602 266507 351508
17650 351508 156858 -103143 -101029 126689 158702 243141 -120326 -224595 89568 -113331
17639 -72825 11903 266739 381710 -362413 156548 -17914 200714 51426 -116310 140297
17628 -94967 -22462 -31471 261848 -99656 -186032 65756 329846 -127270 -200751 173643 -106852
17616 82252 -5287 299505 104654 -175178 199698 312428 -45668 -252105 102087 167390
17606 167390 312505 231292 176100 8271 200241 180267 33334 -261696 -6528 91458 154910
17595 154910 69810 267021 98046 -185880 65635 -8157 102977 425093 210562 18385 110859
17584 110859 -127648 156759 212216 -87587 -122551 96519 381436 269153 88942 61615 -94384
17572 -114505 134261 13515 -200741 226205 14074 141292 -44000 244350 -90839 -138769
17562 -138769 185633 -11238 219638 156234 114244 15365 -93123 241198 -312492 -149562
17551 194179 -19337 123874 -139562 79448 73670 5206 241252 34677 242044 135556 13976
17539 -52926 55674 76974 426563 8030 -124696 -16466 -157010 310132 220410 -188536 -123832
17528 -123832 30156 11202 -57725 -33858 32700 218660 246202 175498 42286 167959 -173749
17516 320893 -66159 523290 205679 128138 47772 -124491 176266 81026 406472 200060
17505 -270903 314476 413643 97317 -137348 102234 -91660 293336 11615 143538 238912
17495 238912 -216670 183582 -169188 37121 79203 224328 -209426 35665 -22832 -95205
17485 -95205 -80615 96500 284932 6191 600584 2618 409998 143925 390307 202745 221119
17474 221119 93233 473448 27458 -323430 108297 125122 -104991 -154280 232493 200971
17464 200971 239969 195022 -206999 2319 41353 76111 250374 -57832 295586 39897 128724
17453 128724 82331 -68894 -72765 -27445 -33542 198029 318877 37437 266082 139820 328764
17442 328764 271777 394077 403401 68912 163975 168673 224192 140139 483757 123128 319338
17431 319338 76670 266631 89994 93287 -49084 107482 74513 194055 343095 282904 200019
17420 200019 20801 -28126 196123 118875 440969 379522 142371 183740 254413 274227 202118
17409 202118 281098 183805 88965 113359 374706 63539 108778 254196 310481 347157 -157719
17397 69223 510869 253481 116039 209840 245494 -75649 475651 -58960 13401 188503 31623
17385 -4143 143788 86058 -23130 294110 381012 69622 180325 206759 94956 118751 147239
17374 147239 87368 -6214 386406 522605 239389 300345 -124854 229 289445 -26681 184017
17362 165879 60152 85361 191013 237716 27485 270163 278854 16658 316266 7994 132286
17351 132286 340500 -18800 186895 301803 250075 192674 353044 250551 28728 -115158
17340 -213195 313235 -21801 221184 287706 260200 -34780 316049 468602 201938 242880
17330 242880 132888 209228 214265 162507 -113741 324617 269451 37921 409830 226347 319608
17319 319608 521837 575852 339615 194170 330627 114955 561994 -49504 97821 -112589
17308 182156 256832 60314 72585 164190 -23112 254544 199132 124160 399486 307342 474194
17297 474194 281481 320998 343755 191722 438507 -85621 76267 209441 139737 -41817 289579
17285 254651 504540 159118 133288 641505 39813 230818 228607 154156 549106 250582
17274 221561 -130804 -8504 63935 499573 472223 149055 535652 356772 286223 -17428 26991
17262 269499 105248 101220 83216 431528 21002 358624 181241 31418 254080 19327 252421
17251 252421 18472 -6916 173721 428234 376916 381686 244556 450179 370533 228538 215120
17240 215120 160590 581912 189304 346625 345913 324634 -158715 497115 334833 88158 137726
17229 137726 -72879 453820 214672 274570 152325 219202 598712 587915 428934 360057
17219 360057 134707 103869 140387 367547 515238 -154503 -10057 175554 233267 37164
17208 343458 297524 545072 120994 171166 25139 607283 115667 562609 201691 78712
17197 178891 575986 336844 232295 443918 364631 354925 295120 287112 -60081 137747 565623
17186 565623 372769 485771 193111 325207 196625 477493 323634 88521 229627 219858
17176 219858 662948 311045 308025 570132 72546 372185 267883 263734 611785 371121
17166 371121 511192 456404 321708 308269 486579 366696 202006 230408 488099 325367
17156 325367 347319 356938 381955 648079 690090 260445 272763 327805 470304 606374 168167
17144 148367 337748 515722 645844 728442 199110 278342 285446 511792 184016 184562 585707
17133 585707 196179 462612 668857 307261 564843 211978 223147 337896 178171 273930
17123 273930 593257 391423 261384 256562 504276 369530 355769 532232 369166 436835
17113 436835 309654 623485 611183 411108 604209 475108 330928 403528 312232 554542
17103 554542 613882 498326 448148 483648 433563 468723 478958 162633 780833 576587 878618
17092 878618 234553 444067 581189 533024 420364 365475 567195 534192 369707 320573
17082 320573 680019 475250 643760 565019 836757 823130 418568 803584 623705 642056
17072 642056 419146 827811 734872 586095 634187 649168 598234 479210 509120 540600 698623
17061 698623 665099 650488 725265 566025 818314 262086 730689 521073 601283 789701
17051 789701 627052 512008 394360 492282 506068 356500 626647 641447 729501 452698
17041 452698 894838 632793 767356 778701 613857 666062 460287 700534 819442 909355
17031 909355 793772 679755 998405 898671 786314 704989 907796 687727 938992 1004908
17021 1004908 465706 420550 874011 910858 763697 896787 894820 964036 707863 770482
17011 770482 876701 661677 928461 934907 854458 610197 903890 745569 982966 873864
17001 873864 763469 1104716 979189 1133257 690444 1037343 1152811 863792 1222110 1089090
16991 1089090 865064 994491 1248890 1076421 999681 1324272 1051939 942970 1136844 1121092
16981 1121092 1170367 1183811 1218427 1160247 979522 1331191 1205629 1067009 969883 978484 1208520
16970 1208520 1152468 1422801 1134798 840047 998066 1190387 1471707 1229609 1116168 932740
16960 932740 1381437 1666723 1478903 1134056 1080966 1471380 1716868 1518356 1450833 1374202
16950 1374202 1215528 1425931 1373964 1384978 1493580 1701485 1795322 1569989 1666101 1409067
16940 1409067 1736243 1495689 1596570 1681734 1553139 1508937 1741415 1557686 1797737 1753373
16930 1753373 1400497 1981567 1881890 1291866 1753394 1721574 1812950 1503919 2039918 1793041
16920 1793041 2249741 1809462 1881510 1834415 1708937 1840464 2322264 1788859 1928271 1919122
16910 1919122 2442226 1723102 2113480 2123783 2140933 2284746 2159519 2484451 2233096 2428849
16900 2428849 2212610 2082464 2339232 2413750 2502346 2223658 2402357 2324955 2467196 2432201
16890 2432201 2430457 2682049 2656709 2729772 2561888 2843455 2491735 2937300 2477639 2832153
16880 2832153 2807043 2662411 2849990 2981380 2734817 3193679 3339571 3265409 3270384 3134153
16870 3134153 3067087 3404861 3224540 3185820 3609075 3391667 3351236 3712611 3539922 3575927
16860 3575927 3604831 3908006 4082646 3606478 3900495 3870288 3836877 3605145 4194363 4008003
16850 4008003 3866625 4465140 4203352 4483847 4295882 4276281 4442022 4251984 4669941 4592427
16840 4592427 4788106 4994703 4986365 5247855 4951304 5038536 5239653 5218955 5404261 5497212
16830 5497212 5488454 5850503 6026579 5727547 6086522 6053931 6444716 6193860 6414754 6595035
16820 6595035 6839833 6790459 7308931 7174364 7141898 7510561 7351305 7603888 7857723 7641655
16810 7641655 7733184 8089810 8176806 8567435 8603019 8681186 9091905 9179770 9484394 9641725
16800 9641725 9679528 9766315 10170287 10507712 10686606 11166933 11485542 11536605 11907205 12168663
16790 12168663 12230542 12697039 12775763 13499029 13627440 13877700 14394230 14782754 14952544 15443874
16780 15443874 16157801 16561336 16756842 17217172 17996012 18286997 18875230 19279486 19661625
16771 19661625 20525547 21345325 22242382 22486367 23563416 24019170 24647954 25853478 26744697
16762 26744697 27201213 28506017 29605277 30542028 31234456 32670648 33639801 34992544 36051076
16753 36051076 37731363 39155862 40728568 42428549 44132298 45701042 47524570 49450156
16745 49450156 51086403 53580898 55583667 58137001 60386612 63287343 65459059 68147092
16737 68147092 71340372 74490459 77645226 81077529 84032444 87322195 91333002 94704010
16729 94704010 98548992 102096675 106019392 109412842 113048092 116465863 119926824 123009294
16721 123009294 125924022 128875125 130930826 133079846 134540677 135644244 136124910 136388869
16713 136388869 136196585 135380997 133789796 132593247 130686740 127940817 125130514 122485774
16705 122485774 118720190 115444220 111727540 108210798 104451617 100370683 96580347 92981225
16697 92981225 89301691 85484817 81924663 78531656 75635800 72167119 69248628 66396376
16689 66396376 63269229 60562835 58286056 55513827 53357475 51255627 49077537 47033047
16681 47033047 45071109 43404370 41563783 40054716 38651136 36950528 35653696 34253440
16673 34253440 32974596 31708938 30455354 29601494 28328597 27672648 26358266 25705971
16665 25705971 24655246 23919744 22893670 22243999 21571979 21129745 20279945 19648685 18943143
16656 18943143 18278778 17940944 17335099 17102278 16399938 15895244 15484433 15022942 14248762
16647 14248762 14239455 13631530 13499207 12999856 12912310 12572144 12124055 11902650 11398345 11524663
16637 11524663 11064215 10681822 10674634 10176270 10211081 9632122 9658771 9252924 9030096 8582746
16627 8582746 8958619 8568100 8164125 8052676 8004156 7883315 7657943 7761908 7122260 7333178
16617 7333178 7184984 6679308 6360241 6663447 6315833 6382712 6239539 5810712 6080014 5859039
16607 5859039 5787092 5793908 5801922 5541481 5411413 5211705 4941893 5078763 4933753 4827444
16597 4827444 4776054 4496837 4674895 4925165 4389955 4607741 4142839 4253573 4133782 4168418
16587 4168418 4206180 3933933 3792962 3919669 3843775 3800997 3482702 3446043 3649582 3463838
16577 3463838 3763020 3569843 3409846 3368267 3644956 3355989 3302803 3079414 3054870 3230877
16567 3230877 2730023 2962059 2807111 2954205 2804695 2915873 2742112 2777802 2596418 2529320
16557 2529320 2807953 2651851 2203759 2385418 2370180 2610289 2255875 2512616 2208879 2494409
16547 2494409 2043438 2194289 1779568 2017827 2043594 2034211 1975943 1950844 2176838 1986489
16537 1986489 2027997 1897351 2152205 1724970 1833830 1856370 1868309 1735497 1727024 1745846
16527 1745846 1809846 2048223 1628412 1689798 1882976 1983210 1679981 1568678 1611544 1599158
16517 1599158 1757116 1849298 1509131 1362174 1544309 1546842 1380061 1682296 1311907 1578557
16507 1578557 1309095 1491910 1428770 1442659 1115650 1663834 1266387 1604001 1271822 1162811
16497 1162811 1687100 1309611 981154 1128516 1461321 865082 1211418 1117504 1086816 1098282
16487 1098282 1204089 1434642 1073129 1077354 885816 779917 1302869 749964 1135368 924720
16477 924720 1198073 1297532 1130439 1046270 1182877 783097 1164093 1184210 1125380 790284
16467 790284 1075900 884586 958083 975378 909502 1156188 1063610 844671 845875 613705 719716
16456 719716 1015304 759157 1065340 921398 759846 813230 964882 829155 790614 1029331
16446 1029331 727853 1033743 980063 1213301 717802 703361 675477 676149 1072715 663318
16436 663318 1028712 505389 1001706 562004 744601 663105 521276 774593 696007 686394
16426 686394 764094 489081 458215 325343 715623 726732 574936 505603 408809 575895
16416 575895 600893 785841 439121 786842 935287 692323 417867 683698 639913 577868
16406 577868 818424 538977 504673 506922 652505 334792 624313 642583 461739 428613
16396 428613 845386 692078 666754 367498 310337 356038 508990 598720 665021 541455
16386 541455 232464 917218 217788 545732 396922 333352 544244 576025 235503 880849
16376 880849 344202 428918 350598 431814 421894 475595 224028 550762 586652 538681 393388
16365 393388 405242 591318 187084 441367 383118 423736 249684 398665 361725 604899
16355 604899 596249 431504 669362 324961 325972 151469 349677 403713 251557 304848 503395
16344 503395 298508 292232 324799 397246 412829 299175 161919 249610 373211 366459 414778
16333 414778 494715 355568 231080 -11114 53480 -62377 190522 196181 225245 -174952 380351
16321 223904 411113 203003 526667 582305 -6165 343711 317323 203350 188090 369705
16311 369705 322982 65165 67599 -93757 -58171 410560 -107765 -35954 84625 2902 275737
16300 275737 115010 278124 114591 -20407 227040 342566 191534 40208 286556 413204
16290 413204 182488 -23632 340293 157564 54374 466036 13515 315556 289260 531754
16280 531754 344070 294106 341987 393168 415521 289871 277361 498486 234678 274852 320327
16269 320327 5832 502680 -20052 188080 175888 53249 193808 322311 19252 -23670 116385
16257 41696 292078 61360 375134 1121 232652 548800 20912 -105728 417863 55072 342045
16246 342045 336943 170388 329390 345423 339201 223848 179277 148540 -157737 478107 211322
16234 386908 144237 80242 110350 48780 271636 359458 99929 429936 168812 104885 122591
16223 122591 13251 335690 151972 52628 237193 183129 64547 -744 -35126 112297 114333
16212 114333 176061 110063 351698 -110598 189655 240307 96754 269701 -154492 230438
16201 115046 -48232 128219 192913 151192 270150 -80612 91709 -120799 57513 -47798 -157689
16190 -157689 339812 136370 -14543 173235 307535 390003 186342 -34503 28183 -180880
16179 166656 -120387 -5610 22463 87468 39972 55033 198092 191119 131237 45619 -152427
16167 393162 48484 290998 243736 240044 16477 41180 135827 55643 -19678 -155955 502995
16155 131914 185705 -234238 137949 224453 -149716 190509 -63787 -94465 376696 312846
16145 312846 396912 183059 251599 63594 42949 265799 89776 -32239 -55568 -3286 -103129
16134 -103129 -3416 34330 107138 34614 311836 318594 142483 405574 238789 -37485 -76858
16123 -76858 -325832 98442 402921 212525 -70558 157330 181700 -26060 -49921 122638 -141743
16111 -45472 -70349 -118411 520075 -70659 261839 36469 192454 73699 -237232 -31860 -34070
16100 -34070 203315 302959 126991 32018 367457 -68905 144401 276149 170438 174022 187203
16089 187203 -223427 133428 -11090 -56598 -60885 117038 238432 59753 27157 241578 -426110
16077 -118185 -253052 -19685 -117095 177569 -99715 89011 -27820 -80006 -102852 105944 73057
16066 73057 134659 137828 -83677 670 95061 152271 -252951 -48220 -189752 131889 53224 -13210
16053 -280253 -112291 102343 239592 -39016 15654 -89890 89293 97538 353469 -18892 -47273
16042 -47273 87269 209820 -508480 146388 4420 32544 97150 -6160 -212538 -80764 187730
16030 68559 -250265 205300 -5617 -143022 106559 -136836 99433 -144260 186674 50193
16019 -276042 12635 -8504 344588 -24034 -191046 180784 5569 -3890 -125209 197211 2948
16007 78221 -52967 233264 74670 193903 93153 102231 -38065 -157726 -28629 -141720 58692
15995 -6240 134053 139709 84358 -248568 38153 222516 94831 448136 283818 505494 441785
15984 441785 380687 271656 172745 -213239 154029 28874 -110722 96779 27219 -32457 -81211
15973 -81211 -8675 402210 -143175 -69521 183998 -65680 64220 67042 -92893 277862 -177755
15961 -236968 12697 -58569 171451 -195659 -216715 -98390 -35175 2285 -323756 -47631 11875
15949 -188015 -224169 109409 225982 71010 -133270 -177920 8350 7876 -26959 -95005 -168031
15938 -168031 -53949 146508 -196567 55339 298088 29796 253811 -73943 -54909 114750
15927 36463 -53456 -40347 -18568 -52529 232993 49878 49240 -123157 -44951 -70746 39653 81523
15915 81523 -66169 -185656 274679 95414 129660 129938 -34437 -25837 -168166 -26812 -124722 153267
15902 -216808 -122686 -135437 251098 -50414 26464 -128416 -111548 123313 135672 123025 -20864
15890 178637 -83090 226384 47762 -252837 -164839 -222070 52537 -71087 69843 115818 137352
15879 137352 59672 328502 179152 -108150 -240367 -101722 126975 -95957 222590 185428
15869 185428 -155986 -47629 22221 -97537 -29035 -110408 -144912 15357 -89931 -179624 114779
15857 -150747 -193235 101920 -309886 15958 153716 -24329 -192074 -223418 66068 52744 -147399
15845 46733 -57278 244864 -203874 -184207 34956 -72933 -72086 23313 135310 -83648 -15169
15833 149457 180103 -199203 213549 -86423 -78989 121558 1020 2941 -156971 -141506 19716
15821 148347 -180088 -36309 -176115 -58312 58082 -272480 2666 -10617 -133724 -234816 -81534
15809 -246158 197723 -39374 351092 -43961 -36724 192005 211406 -82034 340635 -76351 164205
15797 -346467 235987 -142270 85758 175607 140086 272289 -176640 209541 257184 -185673
15786 -188631 236934 88848 268890 -180466 -68138 144390 -70147 -159691 121721 68280
15776 68280 -81316 -35900 91739 57215 -33575 -278679 401589 -63996 -178513 99913 155178
15765 155178 -102783 -232714 -143506 27300 119603 288007 44833 -171531 -382461 107976
15754 -378683 -56006 5134 -84987 -161512 -13508 -106865 289254 14372 -141139 162658 -1785
15742 -4980 111413 74476 -39682 10434 418125 -143443 63340 179598 -3268 -165439 125979
15730 -181054 101261 143885 17865 87217 -189489 251747 -114882 120138 -171329 36945
15719 -144934 -6279 69833 -18806 -5960 219766 -295453 -67322 -342549 187871 99110 -355148
15707 -160572 76467 -4475 -306632 181163 123977 -311635 213640 57671 99628 -55539 -198486
15696 -198486 59162 401941 -15348 64061 322199 82652 -6672 203385 81340 -9781 -198739
15685 -198739 157876 142464 -98630 17359 45613 -312189 152338 -143149 -128831 -174529 411437
15673 -184701 117669 -60579 -115681 -95381 256628 -200642 42138 -5923 -234092 -27389 115078
15661 -62163 80856 -167946 -62508 -40558 -104512 -225054 -268332 46814 262013 -132445 -37112
15649 -267087 101942 89943 106277 -53617 -33018 103353 -89058 -8420 -160769 377376 -322401
15637 238428 -245702 -93022 -24712 -182734 -155421 -14531 79855 -319790 80120 -67311 -208087
15626 -208087 7819 43758 179449 13428 21093 50902 127806 344626 -118521 58579 -146050
15614 50810 -333341 -297378 -76698 -259812 232059 -271958 -307638 153270 250461 323625 -58155
15602 22122 -285470 218014 -167852 148846 -10774 23288 -63450 25105 16108 -98014 140760
15590 -214896 -216470 144364 -71334 -71019 -78311 256663 31804 -207576 -137145 2929 244856 -101682
15577 282065 112665 165878 106011 -128881 -103728 -204450 13203 279408 38048 -70200 45021
15565 -113712 -549043 -263562 84071 -7583 156588 188524 77258 -14853 -318576 23719 68567
15554 68567 271699 116317 4823 -63696 150539 60936 -61064 -18511 -256428 -120750 92110
15542 37269 89123 252058 248325 41453 -34841 -22409 5365 19017 318241 92853 53205 -64696
15529 71998 119782 187463 -207087 -224468 -30143 -534662 208963 168413 12526 -62508 -22510
15517 195851 291767 40216 255571 -584629 -19025 -207218 -42346 98626 166395 211653 222000
15506 222000 -19977 -15803 -287692 -78110 -128544 -253629 70650 -158517 148717 -143297 154318
15494 13430 -3749 -224837 -329084 146604 -280975 167466 165578 380879 -52050 -106521 5378
15482 -115141 -141806 -115225 1737 -26512 63716 287124 -167536 217283 -189320 -74718 45679
15470 226236 143279 -17085 221205 88867 131205 -76362 54510 121427 -69023 -109951 111665
15458 69117 53880 -74154 189580 -263451 192592 251882 -66202 168562 406991 -150819
15447 39255 -296784 14177 -25421 72995 -263686 -176695 -206794 67752 76133 -48038 -204423
15436 -204423 -125941 -88938 22057 77899 50883 -68982 -235341 34337 294942 95454 -124111
15424 10932 -234884 125330 131948 71037 17680 -194783 -41831 340626 -284945 13008 44025
15413 44025 198053 64797 296670 279825 -58855 -295820 -113560 150557 -214372 124563
15402 265652 -97781 -64397 183259 -98328 -182367 -77766 516955 64705 -100483 367436 -174994
15390 41560 -368526 -89728 -67010 -144376 -171754 -25676 308985 -58961 176506 -98809 92190
15378 -111736 147403 356118 179361 203163 66393 -20261 -155885 155066 -5204 -94800 246185
15366 213975 -66831 43832 76661 86737 142499 -46885 248816 155598 190284 -167344 135909
15354 -80799 150824 301000 -270438 294454 110354 23519 -49858 267413 -139711 58143
15343 28897 40350 121189 -7204 61818 278297 3587 159539 299467 -113878 -54733 191170
15331 -245404 45714 -23851 70667 360714 -167953 263377 12516 48456 118840 -96311 -116876
15320 -116876 221632 80401 59076 -32681 256 -250983 -275294 35397 308865 62846 346635
15309 346635 132205 168996 378441 399765 208501 323570 260524 93583 210342 273466
15299 273466 206044 -35329 195713 226918 -54329 -223218 83192 -98315 139155 -104652 144246
15287 -207194 127317 -44238 187748 225757 -19549 -83744 -59812 147086 1939 252811 -80966
15275 89014 -324991 34124 52154 -152721 -162016 -73947 33774 48854 2054 490836 -34694
15263 103197 -117500 35534 -82127 -148512 151696 -44623 221799 79326 -59327 38180 255721
15252 255721 382313 904793 1178529 935519 1127475 741685 219470 101620 358853 266876
15242 266876 72435 232810 195649 60615 -183487 126115 46582 -164310 153442 130492
15232 130492 -117094 -170517 89103 35926 314818 -30424 48034 204847 166327 -115611 -229273
15221 -229273 161974 -179717 8792 -56805 56629 22872 11527 191424 67823 -294217 35571
15209 131741 -183300 28846 88307 -133967 265963 37857 238968 -2979 37396 -1925 -161952
15198 -161952 186370 -336046 145303 62181 6062 -356731 1401 123353 108893 125921 53140
15186 243097 31248 88275 -133323 126011 107599 63391 170689 83232 239974 70524 150821
15175 150821 184077 126785 360793 -29748 -108300 157601 -90326 757 26520 -106878 414185
15163 104541 126231 45338 202988 18990 93488 92049 180526 -62126 144245 100904 145867
15152 145867 -54298 217669 -145823 194517 4976 -247599 55401 106955 58325 20512 78485
15141 78485 214476 401465 28188 172805 109539 -496871 131607 39142 16918 343075
15131 343075 194313 117915 -123198 63743 91212 81712 93739 285568 452118 90761 456889
15120 456889 356571 -41267 260147 -67695 12759 151293 -159133 23244 262635 66078
15109 -98065 136691 149235 151926 134177 229066 393986 218236 331497 -29502 58613 313457
15098 313457 70118 229090 -15321 357832 -153453 287193 80558 107981 197900 122643 8880
15086 33232 -11084 185973 139278 130062 72614 115034 80589 380082 182492 -70864 -14392
15074 76338 102775 507491 -146206 162097 -141789 166294 310926 225962 382433 2975
15063 158071 54553 -176639 157056 102554 91003 129811 168260 -97381 280309 -60261 94825
15051 321341 355545 396869 -51359 215992 -59110 193543 252849 121374 26362 285079 241493
15040 241493 309244 76957 129377 159988 193669 130473 37793 202384 60149 118923 28657
15028 96399 3520 -41312 26129 291763 210404 255380 256040 160152 152890 89993 275809 -131959
15015 148757 50231 76547 375604 234631 -99547 309313 281227 146635 -85360 325821
15004 86182 441660 99662 81368 191677 454408 270649 379224 250675 -146765 329887
14993 58961 245548 1610 321251 -212309 186293 468942 203694 234915 462792 250479
14983 250479 293036 444094 485412 185534 430137 492897 217688 -120528 63470 390527
14973 390527 351974 141304 14098 229332 432712 623921 265560 289261 185825 254056
14963 254056 646965 290195 440964 379039 322486 422930 272054 364642 449871 506035
14953 506035 608378 295028 379713 99357 525516 146035 309110 334426 477961 378170
14943 378170 156651 65617 252667 383377 48353 269586 135126 369736 295718 249117
14933 249117 331972 87909 38684 51555 226756 547615 373860 210731 161608 194531 197294
14922 197294 554027 504105 368093 313121 73862 360351 339768 406029 97345 297532 270377
14911 270377 376218 240660 494996 237504 233173 226187 364568 385862 141814 162326 356126
14900 356126 161307 388042 243100 229354 663789 174715 370902 273326 400985 448045
14890 448045 68429 276741 -32075 240157 452001 450653 313762 348588 243111 347326
14880 347326 141801 240139 432896 882978 203784 484340 474190 383390 131812 194733
14870 194733 227835 519908 175142 12984 380002 540393 464806 82457 268078 303877
14860 303877 264551 463920 290755 219146 457440 162966 303287 481886 189353 425412
14850 425412 -81590 113748 385553 383811 317266 327751 707327 557986 429708 402303 513504
14839 513504 469183 154683 457302 209715 80478 17619 407986 440071 285812 548262
14829 548262 321392 468024 395019 400054 432885 741534 595081 383484 654812 583286
14819 583286 511393 71597 498396 399496 498597 422764 450981 346910 592432 589246 408514
14808 408514 442663 419135 584403 296570 377848 333930 486510 379431 499044 557857
14798 557857 460592 573380 612613 554294 387570 486381 660161 721632 462698 689251
14788 689251 586363 662927 194039 613827 345865 535842 485149 304949 487773 630788
14778 630788 906548 475979 874929 356920 601362 527289 529930 639393 636375 564020 488251
14767 488251 600232 527002 508716 423820 453922 614210 407548 532545 710805 654509
14757 654509 602232 510802 669429 653925 768336 463091 331874 824477 417067 666032
14747 666032 708528 560118 618814 771477 641838 867383 601541 404818 424295 710466
14737 710466 815039 506820 570214 740004 751427 857136 624731 532215 946685 798046
14727 798046 756026 778609 772533 576041 937011 975398 1071201 643800 363835 919803 935567
14716 935567 608941 849458 748015 663287 862472 570129 622759 668787 795593 861236
14706 861236 932338 966682 750240 779684 919314 864285 799358 971762 688095 844887
14696 844887 696276 647299 1000564 601590 544543 823509 1070366 934203 797163 813124
14686 813124 1235964 823596 598490 989487 987025 629074 1096463 947053 979879 726221
14676 726221 1227429 1060303 991629 873172 1128584 885024 884230 943360 915363 724015 1192932
14665 1192932 1296875 916587 897094 868346 1184812 959374 805003 1099203 1206484 944895
14655 944895 1378606 1017229 878464 1103668 937434 1079061 916631 960199 1141502 848578
14645 848578 827733 1146599 1032506 1058429 1290893 1166466 1193061 957030 935312 1260940
14635 1260940 1071697 1269638 958805 1358913 1260137 1336176 1145364 1249095 1288119 1013567
14625 1013567 1031685 940512 1395188 1278631 1292959 1000220 1439702 1151698 1350095 1367736
14615 1367736 1311186 1290327 1578238 1177615 1371083 1223537 1082972 1286635 1523590 1114945
14605 1114945 1326441 1429680 1431333 1462512 1480630 1348788 1570378 1526964 1764994 1427610
14595 1427610 1713654 1389522 1419805 1363094 1686958 1608807 1372843 1854181 1551890 1455540
14585 1455540 1479827 1643946 1954182 1497394 2114750 1977612 1668119 2170610 1687066 1481751
14575 1481751 2104039 1981310 1919076 1910288 1928060 2017562 2050305 2134630 2379266 2397826 2027350
14564 2027350 2266707 2117930 2341443 2189954 2491270 2583006 2521754 2773932 2860920 3021327
14554 3021327 3242737 3742772 3994679 4400727 5304316 7651592 12733203 23798532 43725534
14545 43725534 33509213 15862577 7991089 3724584 2321630 2239147 1625709 1872854
14537 1872854 2086264 1785960 1783479 2007056 2032884 1885990 1933303 1941262 1843567 2084295 2227533
14526 2227533 1991373 2151849 2171516 2062018 2186485 2097093 1962087 2425906 2358870 2403887
14516 2403887 2422153 2448082 2525366 2294598 2597047 2562191 2656884 2622198 2681079 2589479 2752348
14505 2752348 2723075 2617382 2542287 3002899 2924702 2670298 2941873 2778990 2880259 3167458
14495 3167458 3020699 3159322 3107091 3314751 3360143 3340879 3233228 3223384 3195738 3230154 3372655
14484 3372655 3448847 3311196 3594371 3586176 3510886 3462348 3703500 3741805 3672596 3954524 3666188
14473 3666188 3603363 3861750 3767987 3710196 4239945 4194556 4143227 4225517 4304733 4395206 4349525
14462 4349525 4087670 4356154 4515439 4700965 4395904 4798288 4709967 4843284 5056663 4979272
14452 4979272 4656230 4740481 4886039 5376056 5276519 5014715 5521977 5327098 5448294 5262863
14442 5262863 5019583 5703816 5815134 5889637 5856537 5800332 6128020 5910003 5890961 5737801
14432 5737801 6513514 5923964 6481342 6088380 6612528 6509580 6656583 6750592 6800680 6984658
14422 6984658 7237782 7193126 7232121 7210411 7530908 7585444 7560888 7812889 7949908 7695445
14412 7695445 8366602 7969655 8323958 8316743 8280469 8813982 9002339 9148153 9149926 9255584
14402 9255584 9321229 9300779 9549698 9614434 10092682 9980297 10290653 10434582 10630896 10875300
14392 10875300 10988832 11316520 11717428 11584653 11808499 12099253 12072418 12293249 12128676
14383 12128676 12709922 12731612 13040920 13596678 13943944 14134919 14251250 14464694 14674692
14374 14674692 14632155 15178485 15783908 16083404 16004228 16741673 16748048 17230857 17872248 18140878
14364 18140878 18655797 19055643 19242373 19650538 20175057 20725493 20888685 21367608 21894647
14355 21894647 22883898 23217635 23548431 24088513 24480793 25232596 26220470 26324273 27504857
14346 27504857 28069487 28687234 29510046 30229943 30953949 31884524 32906124 33580989 34739403
14337 34739403 35258112 36460995 37579115 38889350 39995572 41342715 42327592 43365224
14329 43365224 44952044 46497536 47962537 49525828 51050285 53106609 55159439 56972086
14321 56972086 58858269 61146950 63272179 65745655 68228976 71181812 73402804 76734882
14313 76734882 79515085 83233906 86567080 90302104 94043300 98406943 102174664 106569541
14305 106569541 111318122 115971836 121160237 126975851 132595622 138901992 145766188 152603664
14297 152603664 160250289 168037149 176216560 185175431 194595865 204325424 214596630 225402228
14289 225402228 236204203 247975953 260394057 273718301 286962395 300720664 314936365
14282 314936365 329400255 343793022 358064404 372551786 385988205 399122014 410964605
14275 410964605 421634357 430698089 436136283 437702128 437662662 438503264 437376075 430205488
14267 430205488 427010679 421488748 413803658 404159658 392680798 379830082 366076030
14260 366076030 351768587 337067098 321842205 307260498 292113275 277802306 264059526
14253 264059526 250747763 237866595 225658484 214428190 203533934 192945711 183512417
14246 183512417 174225604 165963568 158093977 150457376 143312204 136489151 130021493 124381600
14238 124381600 119047022 113964337 108823222 103814023 99227177 94873402 91521959 88115862
14230 88115862 84462349 80903514 78006240 74832548 72008164 69234585 67006986 64360518
14222 64360518 62126146 60008743 58002334 56146474 53970472 52321768 50504402 49068947
14214 49068947 47624900 46129171 44852133 43032107 42117966 40626442 39665117 39174489
14206 39174489 37652867 36701013 35526757 34459356 33378802 33169963 31942665 31035993
14198 31035993 30059673 29240508 28663011 28140262 27508251 26468986 26004280 25236603 24789706
14189 24789706 23970983 23789954 23159528 22335348 22124605 21415232 20973097 20676898 20106616
14180 20106616 19876571 19033401 18795504 18577389 18459560 17985667 17338346 17329474 16798805 16382041
14170 16382041 16184615 15564532 15693450 14848005 15166474 14709753 14485910 14119278 13758550
14161 13758550 13819107 13516360 13556019 13031284 12769361 12586924 12296657 11989605 11951307 11733547
14151 11733547 11753029 11233186 10737082 10929718 10756783 10924501 10337849 10677103 9819655
14142 9819655 9743269 9909005 9831753 9180000 9334811 9467204 9248549 9003557 8754762 8824958
14132 8824958 8555969 8508894 8211133 8174285 8023012 7748642 7905930 7737116 7760227 7582618
14122 7582618 7460060 7361781 7424648 7033960 7273598 6856882 6808209 6678036 6477473 6931586
14112 6931586 6515764 6550111 6655099 6281022 6309199 6336245 5986184 5990563 5888658 5663922
14102 5663922 5737570 5454362 5613117 5522963 5197924 5360173 5269344 5395606 5325346 5099866
14092 5099866 5172572 5029314 5009882 4879938 4829454 4827829 4855134 4631700 4533049 4746295 4538175
14081 4538175 4548606 4562345 4367826 4497895 4103779 4310880 4090404 4355912 4287673 4258508
14071 4258508 4290231 4114240 3848467 3975434 3626719 3782574 3993165 3878887 3803180 3750779
14061 3750779 3823108 3850452 3638036 3841985 3620453 3193982 3785227 3522963 3408007 3255170
14051 3255170 3102264 3379321 3395579 3291727 3283122 3292550 3165208 3266748 3441718 3105636
14041 3105636 2990453 2575393 3162117 3122000 3012453 2809284 2707271 2839240 2837365 2928349
14031 2928349 2941559 2857483 2866683 2674192 2342442 2731954 2885650 2607886 2668349 2263305
14021 2263305 2492675 2644922 2590155 2649793 2503122 2336200 2381593 2267261 2393939 2326255
14011 2326255 2425975 2380932 2400477 2419792 2130404 2193306 2175705 1947503 2203748 2390528
14001 2390528 2177226 1755979 1952958 1926659 2122118 1993898 1860081 1958946 2127976 1605624
13991 1605624 2197919 2452522 3037820 6569507 13748219 33615065 40802039 21856311
13983 21856311 12783121 7788012 5539881 4522914 3694187 3391037 3224847 2970460 2572527
13974 2572527 2496311 2595102 2374879 2636973 2590777 2305236 2374594 1942677 2295680 2391961
13964 2391961 2325847 2337027 2070670 1947791 1872938 1886062 2041025 1739216 1670996 2189064
13954 2189064 2001635 1771594 1796684 2025556 1831352 1790980 1758708 1823481 1822040 1653285
13944 1653285 1878327 1482346 1760397 1792927 2003736 1921717 1811348 1387580 1729454 1337923
13934 1337923 1563624 1533911 1585462 1863149 1528904 1649616 1804954 1530772 1626447 1392685
13924 1392685 1442494 1482783 1668173 1545535 1546514 1690933 1636549 1463956 1367831 1176787 1542364
13913 1542364 1472461 1359670 1405185 1504017 1356561 1563632 1381412 1449644 1578922 1458621
13903 1458621 1228422 1566065 1289099 1439601 1205213 1220475 1230410 1290016 1390764 1079496
13893 1079496 1019714 1077054 1208182 1049145 1519618 1244905 1174544 1230275 1248708 1567063
13883 1567063 1064292 1249041 919945 1356564 1426734 1034880 1079361 1023021 978884 1001508
13873 1001508 1325297 1250723 911504 996704 1188168 1329917 1101747 1362723 1052045 877066
13863 877066 888052 981229 1084978 922463 1077063 1166071 1281984 937131 908800 898081
13853 898081 1041483 1046566 1012528 999645 1025952 1066902 1093020 811562 1006977 646136 802531
13842 802531 878753 711170 1020769 989318 823973 1167951 1164630 1007638 852952 1129927
13832 1129927 884312 1003331 827882 1002776 749062 979982 813844 805856 884715 977030
13822 977030 827523 816759 717959 749226 929589 630387 629982 565978 735003 713578 780816
13811 780816 610885 885283 768128 682904 1096844 810195 779630 931016 510920 563260
13801 563260 867675 620911 676502 360643 590868 545910 1026644 591156 695661 559470
13791 559470 689289 748724 718379 607116 903413 634926 494100 634777 751070 654758
13781 654758 836066 630075 792109 903880 543127 676076 687266 759703 810022 685100
13771 685100 685356 592583 396621 533197 716882 632260 707782 651080 450441 407516 676290
13760 676290 738715 622703 853779 866475 443287 629202 633994 347675 604779 673101
13750 673101 589240 787374 620783 381083 658868 766630 467639 610160 546165 507882
13740 507882 774169 527199 656386 594813 772160 515791 489953 875291 801364 540216
13730 540216 329929 601846 626232 700308 575564 506722 640114 477131 578233 600920
13720 600920 414086 263588 516394 443765 614954 521553 238104 588731 757222 607903
13710 607903 521902 410738 467795 541842 604151 218145 482897 279941 779428 568478
13700 568478 648210 284262 514879 384528 557465 406855 587562 634297 485616 554593
13690 554593 750277 278964 288324 405514 540235 425418 564532 124365 573098 670492
13680 670492 553598 757499 641044 387938 512948 573033 534339 429541 350874 261312
13670 261312 418317 273978 359460 311906 476795 25527 734203 362197 640129 451830
13660 451830 667464 407181 467813 334549 379817 484623 432043 308347 178552 356541
13650 356541 251620 426425 350960 292338 474945 246423 445550 547671 477899 665954
13640 665954 294700 350699 232348 224231 310550 843181 321970 570601 602189 308015
13630 308015 433578 539458 357365 537766 172890 620301 478699 639145 421640 217513
13620 217513 575658 571589 105926 258990 281916 766378 -38454 130349 587640 358877
13610 358877 429401 601946 378709 302703 450020 454260 347753 316907 176232 145718 267540
13599 267540 199491 291324 403901 -12638 682718 422085 492930 434371 454210 228675 346191
13588 346191 203615 539923 103574 120643 398639 441248 803972 424233 265711 366895
13578 366895 312860 215213 181009 321099 425855 107097 442092 226666 287742 69603
13567 325516 439123 330692 259487 229958 422121 526188 406156 88060 237949 266529
13557 266529 154681 326098 503639 510316 587117 422365 375549 27405 369107 418496 291062
13546 291062 316872 463935 267045 587395 344770 528025 457410 201637 365469 155981
13535 336290 136387 111287 267603 115132 267356 -18052 288865 182788 328148 285914
13525 285914 308578 204046 271308 456160 26918 133488 696763 296495 231024 317311
13515 317311 638914 235442 310491 28721 276839 81413 507292 248070 255533 329226 -9680
13503 441199 80845 343106 216318 548024 322288 224569 153658 101554 208419 267904
13493 267904 505983 475560 344832 207088 214089 184558 266362 340729 5196 520676 129923
13481 532561 307323 46920 82594 167955 65720 -15900 197019 282376 389436 423132 -195244
13469 247813 -6586 339943 -144557 114621 393629 228225 413770 199532 246026 423967
13459 423967 483130 211930 374801 84085 36274 257728 4454 475894 104155 241292
13449 241292 -48169 145445 164551 168697 112543 125708 -11581 42858 148163 392970 223808
13438 223808 509332 63268 487706 160078 370163 436393 114231 187108 28333 317228
13428 317228 184890 64172 433793 214987 248533 307840 335385 375355 8760 408715 395299
13417 395299 394297 308109 276547 195952 294049 -167391 88848 281089 37034 278699 310196
13406 310196 411361 215634 92106 86412 163522 564582 244133 321870 259939 445718 -283303
13394 305512 36161 205035 215374 -6752 362654 202445 5730 112529 162616 190457 95046
13382 259621 517587 57282 300056 366439 144341 3347 85235 161591 121907 221080 422548
13371 422548 73761 127864 155009 186136 182662 166423 280730 270598 196277 390571 355978
13360 355978 128277 -29924 107936 118325 231163 101256 -37284 -33330 192301 -194693
13349 130681 279426 134674 225095 263463 52004 289054 -82873 302416 212423 408065
13339 408065 347997 100823 418412 246239 320959 33657 86766 288566 -54647 217656
13328 108590 255109 174730 80941 246006 110416 323233 -121889 172524 215404 103215
13317 182238 62359 -21725 457678 -46765 -75800 179601 333179 71580 -8765 154349 11051
13305 69426 382491 51056 339796 -13953 355761 211987 309779 272537 118197 119534 -7002
13293 281781 256320 116484 263841 113691 63884 159570 79660 -78144 -211675 276000
13282 280877 126628 155933 32565 -81023 58995 282514 299278 -134442 85896 359711 139725
13270 30206 254383 167463 58982 28077 124387 106702 319050 57363 93279 319205 61599
13258 -65385 12580 188627 295582 269965 203404 208723 91234 -50820 42461 258357 -125897
13246 253592 -100282 171822 111683 -58314 244741 25182 340655 13286 106889 340079
13236 340079 34716 158144 198856 -147855 -183156 157051 363880 92548 186321 19407 -145072
13224 286011 16745 88203 -24455 -12815 190347 316091 -125618 318702 42292 125905 279368
13213 279368 212291 267591 165902 33400 119797 -108667 -84067 378859 170010 87612 144234
13202 144234 113021 29843 150420 17584 267979 87488 37146 325846 227657 -46946 -119981
13191 -119981 125526 -64388 54741 213207 167436 158751 65063 147317 265206 -150724 -21848
13179 27512 -94766 103941 52719 84813 -57213 361285 41302 134054 -46407 150244 58168
13167 -72806 -66453 106989 251216 378103 -85025 19102 56226 301249 173151 -255443 -19960
13155 135151 184782 398343 -44590 142335 173456 42437 -115712 87598 -15180 14278 193314
13144 193314 78416 210910 510214 -9368 28598 326741 42642 377512 258762 71780 190216
13133 190216 16801 -94675 -294100 309374 313562 -519052 315974 363441 81928 -83764 111536
13121 228187 -7936 -130143 74120 64253 -35086 59773 160549 -153934 98485 62425 -452461
13109 74868 454155 107701 -32490 140884 40670 17572 149214 -93109 73277 -20024 -29720
13098 -29720 112548 220312 -10369 105374 153142 -13504 57139 15767 -163993 91126 264838
13087 264838 138854 110957 129060 -49380 86518 71568 -132073 -141310 83728 28860 -77971
13075 -57865 -133427 126172 319086 153222 227869 132678 -43852 -2522 208201 -51442 251249
13063 8121 73447 104815 189526 -149126 334544 111936 246601 314510 -119710 235083 315590
13052 315590 -216178 66677 41405 307562 -4099 85116 -64772 -9840 102793 205415 149210
13041 149210 131457 241984 -22237 -89561 256447 18870 283 191049 357243 558354 -155308
13029 254288 153257 -74019 104653 -42517 103335 154480 -94283 -136608 -42474 -298942 148955
13017 173514 254915 184958 -105792 -141461 100152 -40349 269900 371899 253240 22252
13006 75707 -93753 337428 109034 -38549 -59031 308874 243821 134285 83415 86472 132785
12995 132785 421308 -44084 -2472 -131958 187439 28454 161244 39453 205326 146848 183250
12984 183250 -398572 -33880 107447 12421 10991 233418 -55123 514010 205965 -169848
12973 -17995 -132169 49305 -5258 -68701 149606 -261864 431947 90071 -61757 252497 53140
12961 146586 241937 120802 -309917 -261174 -59617 118187 43613 103824 -27964 -186367 -10945
12949 50176 20657 -45368 -285347 12211 -122212 255517 83078 -37661 -153844 206328 -79301
12937 -197879 -4602 -147610 167294 349623 34118 -154568 -235857 187465 -183717 40693
12926 -16688 -120762 -22939 112277 41749 92022 -42085 -53049 -54710 42619 149047 74911
12915 74911 197073 81605 34250 256467 -193233 141933 -259991 85761 5278 -92909 331
12903 -62391 15471 -241590 -23972 -74605 176848 -49724 -52989 45806 -96000 -24036 85562
12891 95882 210750 278196 123985 156627 180781 435619 385055 -37672 -112468 96564 -300453
12879 58731 -107978 -219355 -114942 -105102 -30764 168428 41429 -20175 -377443 113469 -184649
12867 -77905 -50777 258773 -179723 -260538 -39195 177725 291515 -111047 185910 284171
12857 284171 117058 -27954 -13231 202483 -108542 124445 -25572 109259 105265 -206875
12846 45433 143153 -5221 243654 -171018 -68340 169464 173446 100200 128694 57873 -2721 152997
12833 64051 8893 73861 29525 -47847 -69457 -88010 11108 58675 111547 -164129 -22990 -48485
12821 -48485 131499 -113657 86060 25976 -116198 1162 80110 -116760 -216347 162506 -54267
12809 -86732 224526 190522 80239 -108987 114094 125125 -210457 52396 -21022 -73900 128474
12797 -251171 -31050 -50645 -1208 86923 80686 93858 -7677 130730 -331813 -163864 4675 136603
12785 136603 46976 227357 120035 29978 28520 -182549 -257734 154512 -393074 -255427
12775 -255427 91406 215248 242794 -33718 191515 39798 -54311 64728 427240 -296806 187581
12763 -135492 167063 162019 204349 208606 25864 79696 -138528 -84038 24608 -64182 -30106
12751 12560 -154860 -57914 -108260 58452 -235243 414130 -6133 -873 -140064 112530 142889
12740 142889 408279 53340 368868 -43994 103118 -28523 97491 243944 -125256 192093
12729 42296 -103658 20146 68575 -81672 -21062 -54255 200935 -266136 -236773 -126042 -115610
12718 -115610 182325 219517 31555 -538514 123462 59858 119136 -130700 171978 -87887
12707 45409 57125 380976 227963 387151 133953 -47891 -117558 147696 -50428 -84694 104983
12695 67965 -93600 152781 -53211 42492 116531 -208398 -250986 216692 -248263 15469 -114415
12683 -192120 427947 -125949 -46523 337591 -193571 -233575 -191763 355316 103045 197041
12673 197041 120241 -24 11034 215802 79650 270321 351622 -219957 118828 122565 -113456
12661 -283587 39583 76574 -43342 130931 -40891 -70099 175810 126127 171014 -103823 -140368
12650 -140368 148867 22669 -20071 90243 145936 268157 -166667 89753 132156 199995 86911
12638 21648 -163777 34481 111588 160237 94709 126917 -53786 312866 177856 16889 326995
12627 326995 2624 154859 169158 12138 59848 -64556 -186082 -117676 -125138 -108838 261760
12615 -10051 48021 -91454 -50914 253589 -111452 2881 72354 38122 -234724 24400 45246
12604 45246 -1966 486164 25285 89871 -30601 -25982 29728 -272721 227558 -70584 20956
12592 -46042 -296600 117897 178508 171781 47195 -3365 91682 -130986 77267 316031 -17519
12580 346442 -425660 164933 -84663 107107 73074 -15139 238621 61954 -144824 -95471
12570 -95471 -131017 -315040 -29106 -31471 -322082 -150187 173916 -314224 -59738 -58958 -46064
12559 -46064 -116856 -28590 186036 194877 306793 -128640 -77857 -71012 -203064 89144 -113331
12547 -290893 39800 -15700 -151400 -5343 -39700 136761 155781 -14150 -99514 37764 251679
12536 251679 69909 -210088 45258 -23226 -45117 -13722 98158 346535 -43273 -50483 203453
12524 -35247 28162 338725 127289 -298698 -217883 68899 215984 -129055 19683 -133653
12513 83025 -215123 197010 -163786 116854 200501 -113247 198178 79309 197432 78569
12502 -111202 46743 -147047 112428 234723 101938 -51148 -139069 -52119 -246980 108967
12491 -169951 58197 122279 22506 173412 150850 82556 1842 -74449 39316 37300 -255158
12479 115445 -131709 205389 144741 -142548 8380 68324 86347 205119 176293 174023 -70392
12467 -37271 -35053 -184507 -71670 -108605 -7210 109173 -69938 -22524 120785 -122947 96968
12455 -86557 -129047 15608 185449 33818 307172 19312 -8337 13553 -431488 283479 -236591
12443 -164297 -34225 -19566 -258237 553554 26323 154731 39294 -229839 -262786 92155 111693
12432 111693 68358 15483 196991 -129423 -212740 323327 105308 45328 128218 -12553 79613
12420 -74355 -67287 87637 221264 -332783 150620 -181133 -127571 250380 -106665 60337 -35822
12408 50481 -81648 -77057 242556 149110 125695 -16807 101195 -24962 -43319 -78433 5116 -166732
12395 58190 292181 144681 -205556 -1078 185635 193311 86277 -66496 202130 -39900 141237
12383 63005 196537 -71258 158321 28623 150793 -65950 77346 15148 93319 -39666 124601
12371 -30952 74082 298210 80389 -154675 -91266 -49763 -212262 -163657 329196 40022 113147
12360 113147 -76135 126813 4164 -316494 300094 -101386 60091 -221473 -122018 167017
12349 -156748 -248774 -98139 -124576 -117591 177221 123930 359112 -20639 107327 142494 -204880
12337 238844 -36829 296791 34060 -190667 -76665 224999 117683 -120338 -125635 193344
12326 -210165 184726 120402 42055 54844 132210 -168749 -12174 176109 -46582 -182352 -9666
12314 47421 279174 -161570 -205155 -147729 -2447 -4830 140890 20476 -67283 -175847 199885
12302 -159543 -23165 -189996 86506 -56441 -22898 207847 -224357 6406 198089 -153186 -271077
12291 -271077 -121308 285914 53311 108177 -66956 -263871 46882 49921 12010 163107 -45856
12279 -78764 -18194 78739 358710 189035 125159 -177167 -65440 -31781 128634 139177 -148449
12267 91075 234463 -219859 237764 -201289 103509 -23683 -81616 270664 267726 392122
12257 392122 130413 -82022 251274 -49685 -33204 230533 -40083 56198 238506 323074 246534
12246 246534 -144275 242854 90551 46396 171231 100027 67080 -159664 144499 127747
12236 127747 242294 -84378 115116 191321 199332 202360 -125931 71280 251898 -43323 -26298
12225 -26298 -44864 1515 170462 239779 178842 196332 121443 402854 261971 159173 210866
12214 210866 205340 243157 -100648 -351335 193953 -79329 345052 -68155 -65893 229613 -256296
12202 -237490 98957 300201 -88174 -14022 23391 202812 462280 -9132 153847 -57027 256817
12190 227909 227243 -32589 224603 84044 97725 9378 -292650 -48299 -229653 -27272 -252456
12179 -252456 267148 52310 390127 -7539 258321 54653 -163881 124444 287069 84651
12168 -71903 10944 261234 216582 280887 -2106 -48255 -37467 297849 108436 217544 375529
12157 375529 -158504 -59641 82719 -87037 -167006 -14254 94766 251867 214183 77042 -183799
12145 133021 43855 -122329 -225912 -139274 -101770 139810 -196771 356714 -85797 140249
12134 191135 90257 -20364 -227523 -304874 63636 -66481 -163132 -73963 114368 -9086 156645
12122 183091 86074 -122455 -105966 -33954 75624 -13810 -123934 -232395 256596 -214765
12111 119845 94109 5988 -81689 293901 -9598 -106311 310719 144685 -241375 -36400 -181109
12100 -181109 -430873 -105124 232409 60537 249249 -27999 139301 37606 91528 -71879
12089 63626 228180 -122630 -190347 8662 35824 366673 411879 592283 992236 349842 147024
12077 329453 -347560 63594 111151 -108907 -231776 -318669 -210329 158046 362335 -124398
12066 1077 -38747 99315 -49146 88160 44456 -239203 141961 37059 199807 -145427 -212679
12055 -212679 -13571 164160 -116871 30317 -13072 -60493 193617 28088 -358347 -298582 30732
12043 2965 119081 -37215 73721 -179301 -71900 -15368 152539 -231917 145623 124032 -59509
12031 72329 60357 -37553 369982 189777 101566 -462132 255529 273092 31681 -62708 -1609
12019 101755 8734 110948 -444855 147794 261191 -78525 327278 137269 -43250 340285
12008 15693 92097 -342506 99536 -126869 96095 169330 172474 -164611 -1917 -18523 109062
11996 237441 195518 197464 31736 -55811 306668 53630 -68385 -86905 1742 -120159 182593
11984 -391473 180233 -120150 -19986 81551 331310 -134596 -343394 -108601 -179087 -108409
11974 -108409 -35243 -156519 -114519 -42704 162578 193350 82325 122427 -198299 -15355 -45804
11963 -45804 -262305 40791 -53512 80604 -119829 50145 -122097 126486 2153 -177834 18825
11951 135459 -202792 -61555 -162418 61394 123073 197092 -182900 -197952 90296 -82275 56829
11939 2626 -140404 282964 191512 -78572 194814 89159 288533 -326993 -180503 -67937 -101061
11928 -101061 -171689 -102789 185540 157354 239900 -608 165295 55042 89337 76526 14551
11916 -161189 99795 174420 49593 -24780 -140417 -71884 195336 212885 149918 54056 -32863
11904 -153776 -156621 236524 -132240 -295163 23077 146431 219988 -138207 13245 -423216
11893 -182030 -186635 51643 -409205 -268600 92532 24833 -11101 -162042 -231668 252359 179253
11882 179253 90597 -4693 -209143 -102133 -238687 -61406 -178720 -265416 -147784 -16012 -110327
11871 -110327 210812 184185 -234767 -89811 -222993 -21286 -455525 -172814 54638 -133462
11860 101392 165192 75352 166226 -141928 -155215 119376 -144037 -18551 -54609 -297392 -59204
11848 69214 255841 135266 -128499 24368 -359290 -62830 -123842 -16824 65620 64267 -218444
11836 -184391 -83096 -126959 -18334 -73882 79506 -136488 -85546 -148714 -180909 -198202 -3099
11824 -136170 42200 -304398 104217 36243 58624 -151485 -146146 -36404 27139 127147 -307896
11812 44761 42120 145496 15762 -365786 142494 -269415 152480 -233449 135304 110720
11802 110720 -219436 88149 88391 -4412 -2334 147562 -153319 91227 -157053 31011 -299494
11790 -198432 -203779 319436 -24177 -281822 -80809 332628 -73094 -2647 18714 27262 -80954
11778 235593 -382185 103521 -143709 -17209 -68247 163183 -318081 -238207 -139979 179210
11767 88712 -239565 -163094 -126711 -66879 152715 14176 340058 211756 -178903 202018
11756 -227648 49068 -347036 -19098 32025 -97768 -311327 247209 35312 -335581 -131184
11745 -71687 -19238 -253434 -114128 -52518 -100287 209595 -58112 -312485 -51600 -73836 116410
11733 -118900 -68536 -229846 47444 84097 135557 -64128 191632 -216950 150710 -1245 -235001
11722 -235001 -19783 -224031 215735 18537 -36236 176672 76409 204149 -102464 241268
11711 9751 157177 200232 -124523 133394 -121441 55190 44504 19128 162371 176434 117167
11700 117167 270489 142608 155281 70403 60588 -224946 -132650 -85069 154754 126966 -64899
11688 -122636 402230 -112837 28566 -304758 -142 176464 -75654 46818 -252572 -12021 292030
11676 160680 -44264 234189 29153 128259 159139 -306714 168998 1770 -174908 -97067 43167
11664 41343 -5103 91496 13371 261895 28492 90765 -231799 220812 -160981 -74265 67777
11652 211535 -21831 -89275 -4672 241586 134500 119618 92069 -282734 207577 -187332 -151299
11641 -151299 -169992 45326 253247 -109544 55810 -73279 -42500 33872 -190020 -91148 65097
11629 59361 53643 24141 66550 -132963 -66353 159333 -120691 -5256 -76445 32494 -215147
11617 -48912 57159 51163 89645 -409033 40297 102190 -253493 -103077 -283334 6160 -234668
11605 13377 -152757 21799 -255100 -83555 234094 99112 -98493 -195064 -39685 187543 -77059
11593 141075 118021 -40032 -157881 181182 147311 223107 -32851 -121375 117388 -122004 13834
11581 246221 45867 16513 -19704 -31201 -166578 103519 118739 73088 -73517 66984 346685
11570 346685 396734 122235 -26386 270304 -64774 -62203 61304 -35592 -48604 188670 -137730
11558 -66022 -330159 173651 -29516 341054 -128893 65672 47797 -112005 238353 -77248
11547 -42878 -23863 239893 -35118 -42091 213885 176818 640444 -55307 156650 -103158 -287892
11536 -287892 221358 135135 -92710 139662 -86703 -55746 217527 30424 231299 -86214 208226
11524 -96427 178729 70430 -348179 -6241 -6035 -169209 65669 -2207 184515 322040 38668
11512 -66882 57899 -232427 341171 -9539 204271 -159813 -346644 76159 -81018 -50271 -59723
11501 -59723 -36227 -74532 215524 24412 293982 93563 3738 41856 306762 -118322 -48427
11489 174225 288369 128132 83785 209824 87671 283714 -123562 29312 72605 -48153
11478 101354 135862 135742 295636 229723 10580 -8593 110157 56709 -82504 164729 8181 52512
11466 52512 357200 212860 27611 130218 75467 353098 51463 -277083 -8487 28452 241335
11455 241335 -15104 196127 240145 73110 -47033 95804 150601 -4124 68826 182925 241509
11444 241509 -132915 -100781 69708 97567 -102395 -209301 41481 -170390 -72956 -196255
11434 -196255 -16261 -18329 41663 -133165 -150776 -200871 -229094 -77835 101790 31543 327695
11423 327695 350251 133539 229091 -312052 -411712 34572 61897 -228495 84502 48203 182356
11412 182356 -85672 102486 56151 46341 115071 152711 294022 -170193 74115 -44868 -281579
11401 -281579 -77107 -133507 14444 -71904 -386530 154080 -246981 111075 -84851 248571
11390 -70704 -33478 128059 6139 -86580 135925 25109 381287 -222650 121956 -101335 -4162
11378 193473 -148614 86828 305128 -192209 -6644 104278 -180526 -350257 -80445 75660
11367 71535 -110732 -260431 49251 -340057 -152988 -11549 127483 -100706 -144902 -63725
11356 -38122 51823 78371 -211676 94290 225655 148428 99890 98744 -173957 -144758 8774
11344 31472 -196208 178864 201662 339662 436173 115933 5125 136619 -232395 269 -32774
11332 289224 139033 -302791 77448 -107108 131092 108831 31009 189979 -173771 -202747
11322 -202747 195 209546 20978 148255 -236271 -56078 -57413 76381 84148 186476 -147628
11310 30198 189769 -24390 -76769 -21792 -134717 -432275 -278883 -79325 6953 -340992 7466
11298 -109658 209913 -210572 84735 196211 -327926 -141830 14638 -162191 -321762 -33769
11287 137136 -197709 -132567 109410 122352 393208 152708 131697 1335 -190883 -70342 -230925
11276 -230925 -23125 -143875 31333 -115889 -69483 244119 -128814 -45084 -159986 -75271
11265 -42040 -184637 -214666 69925 161214 -189758 182885 94306 -213373 -24759 -259431 -203464
11254 -203464 20263 -276100 5526 -143179 -34392 -185389 -108353 78860 -210914 -220845 -188655
11243 -188655 108697 34519 -170638 -174684 -167628 -249687 -8631 -57 -220934 -42042 -70464 111714
11230 175473 144016 156082 -124402 237261 34602 69698 -161707 158751 -125304 192447
11219 -210878 -176450 81266 -292170 -131067 -106280 -333182 -124125 -134113 -240934 -291533 -289968
11208 -289968 135673 -65455 -222098 -62519 -233121 -245383 -256160 -237428 3864 227157 -317385
11196 -101542 -151267 -239267 111092 -276339 -236501 -225968 130043 -165820 -26453 159625
11185 -297336 -140331 -40623 -54599 -68114 19600 -216928 217692 -363741 -198494 -174251
11175 -174251 -332812 62809 -338957 -258393 -214577 -97091 34164 72822 -50288 127631 30109
11163 -394493 -3351 -338796 44782 -178921 -114493 -25728 -223930 -110902 -105914 19672 -83580
11151 -49262 -335049 -227635 -7946 -71968 125489 26089 -97278 57444 120557 196799 95757
11139 213141 -100599 247687 -90894 223499 -200386 -200358 84478 -124815 317153 -133749 228826
11127 -114123 -102505 255243 109819 67510 67946 188760 148075 354899 -151031 -233027 33021
11115 -15578 155763 -134775 217153 234258 94391 -163043 53136 59364 314934 -182257 405709
11103 63450 -69200 120302 -98239 245996 -27836 18925 192472 236609 95954 284510 -72550
11091 178599 73239 -67894 396436 94033 -94174 406969 147616 131382 500430 204317
11080 67672 268134 69806 -138032 -149689 1679 143392 356342 224476 122156 368895
11070 368895 3054 499544 22147 157639 320911 49986 106653 185732 -43851 388206 419056
11059 419056 254539 416122 297849 270023 761753 305087 291675 540140 693196 59815
11048 241933 322866 534753 548191 374129 530044 516329 364040 598778 676388 576676
11038 576676 275547 461314 429441 383027 539148 379916 629032 587774 468907 485593
11028 485593 441826 426509 272603 557502 263637 282382 384581 306122 373101 319446 186772
11017 186772 271180 464015 295221 648242 337520 564907 588504 523408 315869 409200
11007 409200 303163 483902 466831 474555 353217 -32214 607445 113312 370940 298608
10997 298608 416327 457567 474279 368393 329951 562509 623938 443541 339300 760837
10987 760837 521638 427970 619252 650541 805856 459820 317589 584874 1009836 972775
10977 972775 978974 1069216 1134432 1160033 1472741 1442098 1703182 1700397 1675686 1507135 1730100
10966 1730100 1504528 1242832 1151478 1109955 1137244 1119255 1358629 1218582 700272 1222966
10956 1222966 898166 1092411 1009862 1301515 770331 995065 776507 747005 790264 682171
10946 682171 530043 347685 433978 384246 237592 191377 -30591 186802 174878 -84 211456
10934 215357 32953 73499 -15442 -81720 209896 189179 118976 185386 53278 20585 186099
10923 186099 -146249 153660 27861 -90984 25354 224503 60356 -253667 -6238 -137424 128562
10911 28121 -102332 118087 -136400 -153670 -148511 92328 530920 -58558 58299 109682 54730
10899 -93729 -51540 -65097 130096 66995 78172 -20723 276368 -23735 -302051 -327702 -72623
10887 -192138 -162334 -381868 -509 -161070 121026 -199374 -68010 320588 -323000 -251614 -148629
10876 -148629 -260436 -259183 207167 69707 144805 -244813 -206270 -177134 17611 95093 -112879
10864 31931 -29122 209635 -18095 53492 -22542 -197170 28818 3323 -170997 -24359 247668
10852 -113370 -36477 278097 -70625 -258582 -118378 -78041 411166 9918 67624 21185 -118285
10840 38436 -38302 -199554 -177662 -94297 -201502 -103907 128865 124641 23581 128962 73985
10829 73985 -194020 -103257 -144360 -304519 -113146 230675 170472 -106534 101386 32318
10818 23385 -84833 -52980 55217 -187763 -197732 -222746 33239 76681 64488 -232860 -305020
10807 -305020 -5355 54123 -231614 -189974 -10143 -220350 -164212 165961 -127123 233674 -187370
10795 -238047 -248808 -234765 -68298 426517 -458077 61653 -163874 -181103 -281012 -196335 -186107
10784 -186107 -148122 -32919 133404 119153 275647 -215148 -140541 108196 -57186 -67827 16675
10772 -65457 -190181 321027 135231 -203478 -104440 -75541 83509 -128780 120622 -61883
10761 -322070 -62959 56408 144652 -212655 71444 210453 103598 -117105 -181835 186490
10750 -39471 -224257 52792 -126225 81791 -53908 204645 76965 234231 -83654 -29070 174235
10738 -3930 -44384 -70325 -212084 -204735 -113909 -31349 -39637 -374524 -143257 -184039 17792 63902
10726 63902 -211189 386075 -222802 -268797 188355 -72190 98852 -332191 -313177 -13403 -87686
10715 -87686 30710 -164168 -42582 -139225 57026 188446 -293353 37859 423280 172966 -253454
10703 7720 211299 -242750 -66773 122301 -86147 -60847 140933 24464 -127100 -213868 -36772
10691 87731 30302 -6641 -150211 140442 -36446 -121921 -345895 235000 -194804 128614 123266
10680 123266 -13612 -50559 -124626 29727 -204645 43199 40478 -142133 290808 -194261 108904
10668 -28714 93527 -165642 -378407 232104 33591 95969 138134 -240140 -82867 208240 5324
10656 128107 89240 -181695 -98061 -62636 -97199 -7628 -58423 -175191 52084 -101333 62776
10644 -140233 -155121 -63589 213557 115147 132872 203111 42202 205401 -29777 -373331 30374
10632 279382 -178946 -224841 24206 -110254 102428 -26877 132798 -312775 -114152 -94351
10622 -94351 12442 -301516 -110411 179492 -2902 -217610 -201018 163742 -364909 -206589
10612 -206589 92243 20181 -91812 24585 -43423 -96726 116685 -160107 -53101 139850 -111770
10600 -166329 -109721 -137479 -13669 -104409 4442 -216933 -317910 5711 -135315 34329 144419
10589 144419 38024 -24980 98521 34902 222067 -121644 33007 -258066 6252 -143210 -108600
10578 -108600 -341126 36193 8653 -31216 53204 224087 -124919 -229540 54715 -230255 -91076
10566 -132365 -47444 44842 -405169 82629 32344 -80964 -230924 -158971 -112309 -23436 7934
10554 162092 -277135 -134822 -227320 -52208 -59630 73211 -288810 -144067 -22480 -232305 282858
10542 44969 -245921 -290 -14256 -248430 -173270 -54157 -76601 -158718 -424774 -24271 -121989
10531 -121989 99677 143679 -59694 133476 148605 -58753 125043 87405 85645 -141187 18933
10519 44091 -22870 -7743 -76972 -235695 -69659 69626 126957 49852 -142446 -40528 -39635 -124822
10507 -124822 98515 55880 -355794 -255138 -279557 -110535 -25473 -219669 57470 1680 62093
10496 62093 -153957 56951 -144380 -36276 -303676 -56647 -104933 169278 17390 -335838 -439035
10485 -439035 73281 173599 254447 99298 147429 488311 281988 180326 125086 77436 111169
10474 111169 27557 -43167 260931 -32431 -63897 -45237 250549 -177150 -207031 -552562 -106980
10462 -92257 37855 -243356 -143285 -143583 -60767 -81804 -175120 -58070 -74412 -9665 82229 96177
10450 96177 177477 24917 -54658 87874 27100 -198647 -58503 68348 179887 -122264 -165548
10439 -165548 6268 47099 14630 -201096 26233 -70132 55648 185336 84071 -311314 278559
10427 94442 49369 16691 -133613 -66275 -87014 -9958 32913 -234272 -162292 74929 -193135
10415 -380693 -112570 5235 -46413 -25694 -5059 -296844 43907 -99024 -130567 176402 25232
10403 -144 -143993 -51013 289198 -101487 -267847 72211 242303 263382 -233495 -886 -9977
10392 -9977 352528 -93405 -131544 69927 191750 172549 -68347 105280 10366 49972 -188033
10380 381797 -28641 211901 48803 -3128 100333 213354 455066 183406 -44467 179515
10369 351568 216051 409070 346337 53456 249939 62533 -194196 324060 -28394 186098
10358 124560 267618 119589 36489 172328 -141008 418514 189132 264616 22177 243937
10348 243937 231152 365597 677647 417013 221237 403994 310443 -82919 -184927 128499
10337 246145 -106900 392292 290852 148436 34762 73066 -123145 54560 182572 183929
10327 183929 155639 -162113 92258 9863 298640 -34724 -688 -20136 275096 245461 -216477
10315 -73855 26186 -121090 -10877 -113352 -157066 175087 29631 -366562 -39594 -69683 356946
10303 -199776 -154189 -145155 314155 64750 -120687 105568 117058 -65436 -67918 -115597 -171595
10292 -171595 -129401 -71085 -126742 199094 -90368 314943 46039 18196 -224498 58224 -153673
10280 -4097 108621 -97382 81952 -148043 -278617 47391 -45923 265918 22176 -125046 -63844
10269 -63844 170342 -301728 67134 -203083 -2866 -100008 -245440 -232383 242436 150470 32095
10257 82131 431732 516480 205485 -19761 -98972 349421 -26462 -69064 -155472 -170433 -232281
10246 -232281 194077 85161 47898 67100 -99982 32812 -89634 208589 -84688 -71878 -364779
10235 -364779 -208510 -148796 -345003 11456 54981 -212033 -89677 -91002 -49924 -233986 153382
10223 82236 7987 -18647 40731 1156 -134872 -127154 -9982 -204774 -114455 -134597 -191024 -229270
10211 -229270 -192181 -71415 8680 -194992 -9560 -7333 -84070 40101 429997 13039 -294829
10199 -220622 7631 425182 -51292 176065 4392 -91415 -114557 -118100 -109373 92334 -166064 -9461
10186 -265893 -168816 -144629 -237331 -151640 24755 -43015 72268 -121577 -189971 -361548 -189992
10175 -189992 -138215 -17000 -36431 -54564 -144010 -208712 -35176 -260899 -251296 -121450 -228207
10164 -228207 -118758 -86870 -91990 -164521 31639 -246884 -254903 -251784 -42779 78113 -84659 27760
10151 244292 30902 -225058 32399 80937 -274482 -111364 1109 19528 -280678 153695 -136680
10139 -191699 -255787 -192823 19162 98141 130537 -45415 70217 -268963 -224619 16301 671 -115825
10126 -194227 148685 85204 -125179 111935 -52266 -341240 -88216 -76434 -61909 -11434 55926
10114 -18690 -21594 20801 129021 -222490 25739 -177685 -48720 -141226 217902 109495 -62285
10102 -124849 73752 -368729 -125261 44806 42290 58117 71661 -368658 233820 231828 55482
10090 131062 74040 118872 -239992 -232952 -86533 -72703 -149772 -248686 -188117 -133899 494351
10078 107775 -306284 -441751 -136219 -50551 48244 -25831 11813 328088 -399198 -24533
10067 249664 -137587 -4970 74693 -149150 -75597 -344539 -124662 -10287 399181 12858 32039
10056 32039 147180 -146888 128452 -182961 401 -148416 -102890 294484 -69796 110951 63937
10045 63937 -49930 -475356 -20027 68591 19119 178985 108040 -162686 12976 34453 -122027
10033 -42113 183841 131690 48905 -39566 -53713 103237 -252812 36449 -46177 -135955 14016
10021 149944 -35881 -61399 99037 -211110 -170848 123351 17983 -400922 -47717 -98886 -249870
10010 -249870 29281 -37452 -193033 -157391 -104351 -334411 60907 3852 410850 -310539 217060
9998 -150505 207045 -277977 288380 -32453 -258928 47490 -155273 -36608 52837 -205829
9987 64761 195011 212134 -137192 -31240 -144426 13155 -154712 -404959 -104808 -312456
9977 -312456 -131029 -144166 -46337 431689 -189289 -24564 -232195 123387 -308000 -315957 -84361
9965 129404 6056 -137166 -338327 69680 149789 43799 -47999 71650 83167 223460 7913
9953 143323 -277613 -216264 -24387 -16121 -173150 -975 -332766 94421 -1653 23937 -218140 -268006
9941 -268006 260598 -226023 -96983 88656 -153499 -109836 156641 -224842 -236901 77187 -348149
9929 3673 -25529 -310026 -236205 -87422 -83234 -51712 38007 -336655 -37164 -312801 127059
9917 -20483 -113722 40836 23893 -190650 -62552 248665 -194266 3885 131855 114361 -272933
9905 -39784 -85539 -63042 155951 -219743 2978 24985 81420 35561 28498 231107 205255 -136931
9892 -208533 -65207 -263886 -44267 72151 -154480 -145360 145212 281257 -94172 49384 116778
9881 116778 -44658 -102630 -137675 -200758 -385662 46699 73665 -170900 -55958 -88426 68257
9869 49345 -29816 -302791 -6806 -368543 -142279 121338 -83858 -102249 -24121 -25258 -85685
9858 -85685 -197418 -29787 -82143 219340 199273 183657 173652 -203561 -216083 -172821 92006
9846 18495 -263926 39991 -237266 14496 174923 -21699 35993 -220071 -61946 146171 -189844
9834 -109779 206091 -59780 -144089 -67609 -146272 141115 -15627 -62643 -298767 -103964 -113453
9823 -113453 -52152 84006 220657 -316834 -21378 -375538 -86405 19645 202761 -98977 -38996
9811 -154871 -232297 -5413 105604 -41837 192337 76260 -6813 50370 193865 -148820 -240368
9800 -240368 190227 -239587 -204874 -180855 -61596 147950 94396 154285 -204524 -269593 112875
9788 -86870 -263238 29209 -205232 254563 -68618 -141322 -32432 -45113 -45789 -54102 239682 -118165
9775 -133074 -149069 233235 -71391 -268668 -104115 -273388 -115508 -362295 -147336 -354036
9765 -354036 -112954 -128652 -109266 -89133 -140109 -220350 39732 -287084 258825 89947 32483
9753 55707 -335154 196416 23039 77644 -525990 265035 -202172 -10995 -163241 -130159 4348
9741 -115345 -41655 -30926 -118417 -232967 -149408 120379 -57733 151468 -158146 200374 562031
9730 562031 -37294 131700 74230 -116246 37570 265247 -229565 -176069 -2744 214397 -38763
9718 211336 -498874 13646 -342669 -299634 170141 94950 -279320 16063 218449 360583
9708 360583 -93076 -320220 -106426 217253 -149037 -241681 332349 88188 -44034 -187976
9698 -187976 -116544 -134766 -209389 67620 42267 -189143 94523 -117327 -119142 -366360 80855
9686 -31315 -17979 -95085 -221373 -119220 82893 102887 208091 285788 91730 338222 160993
9674 207532 -36488 41467 -359068 -46700 384591 24208 -174845 -60017 -29194 -204134 57792
9662 199262 -107296 322973 -99037 123701 51185 -78092 -235999 -72133 9436 7524 -55775
9650 397606 55167 9549 -199723 -40672 29315 -46784 55914 124941 72602 85642 -25531 -187163
9638 -187163 172287 -103163 81592 -63959 -77179 -46093 44484 -26273 -229574 113653 -349369
9626 -134499 54376 132891 113957 264098 -14663 -97358 42276 29376 16105 -70463 8857 -343125
9613 26469 -265311 -12028 84451 63935 221325 161755 -165468 -187941 -4742 -219405 -427002
9602 -427002 -128299 68777 -188619 -87853 -38865 -272808 -87669 123006 128749 169050 43926
9590 -190983 28435 -72834 34710 -105301 29792 -329515 -179869 38921 -77072 -23715 -125957
9579 -125957 38946 46526 -85371 -84556 193854 -116801 46812 65969 266547 12298 151823
9568 151823 -57582 -208279 -135332 15541 -18269 -182132 86025 -222222 -40637 -68409 -539666
9557 -539666 -131272 -107142 -145580 -274962 196666 -179517 -21613 -298833 -45353 -25339 9846
9545 -259629 -234225 -238448 260125 -177365 -91970 -36233 -573075 -112974 -183423 356906 29014
9533 -296787 -202363 269930 -125115 -105538 -27281 -33285 -412998 28640 -103349 128179 -260638
9521 144851 -127870 -114370 230507 -26828 -358974 -178845 -241130 245623 72857 -166358
9510 29778 199036 -31394 -175013 -54887 -33658 158920 30371 -193871 -436665 53543 -74065
9498 -238830 -114657 -113735 -30251 18146 -167160 184467 -175881 140487 -370158 -354458 -105302
9486 -190952 19072 149937 155014 88319 -58156 -308186 -185273 342122 -101595 -123458 236407
9474 -312851 -145902 -247198 -268237 -168704 116295 -20710 -141725 -171500 -366807 95855 -303095
9462 34566 151320 11557 228878 6475 -153164 -80037 289322 -103163 -210049 38916 -13583
9450 18822 -378995 -57889 -26108 73460 155857 -229290 154828 127773 -25873 -104848 -34917
9438 -84061 -57629 -209896 -70470 -207909 -73320 -306388 -333531 170795 -232056 296257 11656
9426 -261339 -226762 42006 56240 32699 263408 -123919 -162378 135638 -11980 -14184 -31432
9415 -31432 -245227 -164891 36521 49347 26025 -228452 81090 -79076 -55778 -185513 263433
9403 -143723 -122361 -134765 -101832 30988 143926 -293318 348049 97196 -36186 -24223 110278
9391 -96951 -142021 84627 189475 -2883 -77479 34844 -19691 76105 -65093 203851 111865 -96511
9378 130462 -137195 -143062 410452 -8312 -36682 -230731 -182381 -52874 -338825 169871 -72018
9366 217249 50711 -111552 256906 102290 40365 -133741 -141923 -266603 -314092 -84580 -276304
9355 -276304 -120376 81813 -49204 190757 -118104 -400152 -261543 -237338 -22755 47614 82875
9344 82875 -359494 12521 76286 -172763 34865 -185042 -129063 -70813 -179407 -69503 270745
9332 -150113 -15368 54594 -175373 -237163 1020 67671 -129315 -54842 11394 -88264 232741
9320 -40887 -295051 -408115 -96774 -104836 -85076 69269 -36816 130120 113732 5089 -130131
9308 -104527 -50824 -165000 -221530 -274586 -93478 87370 97784 -229411 53896 -209175 -196018
9297 -196018 110941 -14864 132265 -96117 81302 213005 71852 -168099 -2218 -138591 153680
9285 178502 -10361 90350 286107 61298 128969 -100799 -244393 256666 -167683 -226472 -55100
9273 -179214 52184 -60658 -70175 79584 -312064 49444 -440329 -110360 -239753 -93206 -205572
9262 -205572 -257685 -68427 -182202 -91606 -46526 -185892 -60984 30638 23139 14518 -133711
9250 -290406 -7412 -268624 -145698 118249 5291 -181556 -343302 194029 -25810 -102727 14341
9238 58437 51398 -251672 -39922 129027 -218586 -348319 -175307 -322948 -62128 97005 251267
9227 251267 19828 -120294 -54465 -146739 -119724 134864 231055 22765 87455 -153910 203305
9215 108743 192031 52213 691 -97858 102363 -165982 -178460 -16816 81969 -21441 -129416
9204 -129416 -130046 228770 68533 -171819 -118016 -142205 -152511 -260829 99448 221945 -185133
9192 -3390 -54402 -157087 54536 -240713 -108106 -47952 -94861 -109799 -98346 -117923 84111
9180 -404354 -199540 113230 -250038 98892 21176 54478 -28165 -401824 67725 -57372 -22756
9168 -216195 128526 -122324 100109 279547 -119316 -181519 -114743 25984 -59969 -48592 350842
9156 38854 324753 -314524 -69127 -94592 96141 93417 9445 196568 293889 144297 26999
9144 47388 -22683 -179236 -19517 -2365 223613 395010 -299238 -7216 -377129 104028 -187598
9132 26055 -259275 29115 -151632 156916 -96162 -242176 17493 -237161 -280879 -127082 -168029
9121 -168029 19543 -194425 -108374 10305 -77668 5998 -199687 -98053 60570 -248392 -197235
9110 -197235 -30254 -99888 -80590 -45365 125496 -169300 -277201 -234938 -254538 135185 223319
9099 223319 2134 -221167 -174480 -344461 52014 -388094 46170 246654 -38423 -46345 -40233
9088 -40233 -213 -208440 -52498 66772 98474 -37423 -46064 -98381 244737 -51798 27030 132722
9076 132722 -14651 55675 -38900 -43461 -172528 -273170 -112150 169642 77807 82639 29573
9064 73662 3520 -337490 -80282 -445627 -277092 -22609 -13978 215394 49010 -519994 -179130
9052 -279512 -118240 -142171 -153951 32540 -273199 5096 -259535 159969 -199728 -122714 389323
9040 -196433 -13695 73185 -119475 207122 34923 -226603 137831 -150128 54469 -22954 -45088
9029 -45088 -137956 -16785 208186 135541 319166 -214523 75063 -216429 29462 129338 10559
9017 -6654 32708 -198022 -77114 -237699 76300 -99656 -41661 -126640 -188853 -85508 93227 -105725
9004 -89456 287 -147755 -11857 -34565 90955 171926 46750 -290815 108410 43977 -86512 -221188
8992 -221188 -308370 189167 -179047 -310860 -222471 131194 -277249 -198239 -95062 -22017 -26263
8981 -26263 196325 -148984 -176774 44003 294620 -195270 171980 102183 229113 -143685
8970 -373021 -297799 31669 831 6550 -71282 -201808 129638 78920 -245109 -192241 -31662 -143716
8958 -143716 23285 -217289 14479 -310530 -119593 -123198 13948 128536 390605 183449 -213915
8946 88827 73509 161048 -313076 -113604 -163073 -210238 238624 -73619 -124834 73471 -166364
8934 -340814 160381 166731 230906 -5569 255067 154856 53821 -53918 48600 335950 355459
8923 355459 964638 2094916 7047004 16382775 5122979 2663829 1404977 660806 155722
8913 273433 91254 51272 68617 165540 -43702 158093 535514 134871 -32968 -25025 49989
8901 -82277 271865 252860 -29187 -12694 -223404 -31708 76190 -83410 -82564 -160426 6036 -200149
8888 74448 -107971 -285971 133446 -235906 162081 -154517 -34090 -149945 -89352 131351
8877 218739 -69086 -65917 3915 28225 -72902 55895 -82320 55817 111841 -49814 89136 -484977
8864 48466 -206601 -2474 -190117 -66510 -33234 -25473 -66051 -81013 -88851 -91085 -30450 -70210
8852 -70210 234647 -121061 -229619 -321671 341703 -262487 41635 -147860 -94378 -131260 122498
8840 20714 245422 154088 92425 -279862 244784 -191890 -17012 169815 -276825 -256963 -172663
8829 -172663 -121336 -111282 208357 160515 11643 15151 -148205 149255 -30854 333247 -189168
8817 -132995 -2919 -7836 139588 162556 -68199 116012 -266805 227780 -342248 4084 60459
8806 60459 -260621 -25321 -83233 -68026 169480 52275 -20034 131884 11023 208307 -174999
8794 26481 255319 79094 118841 21832 -62807 84780 -162182 -290921 -8778 -26181 -329394
8783 -329394 -100334 150993 -61138 -20949 -137872 -206595 -427954 284637 128870 -92376
8772 -206384 30401 19141 -203692 -14871 -222252 381272 -98828 -112886 32088 -349881 99815
8760 -51023 15552 -208205 71990 -74970 -40236 -174845 -136766 -154337 -184740 -291079 -171275
8749 -171275 -122789 -260021 -34049 -217070 -71995 -106587 85700 -30457 -170906 17016 -168109
8737 34869 -207411 253483 107878 71801 -187060 258694 -107909 -10254 -89602 60932 -44175
8725 -336414 -59324 -189821 77186 46452 -200402 341275 -247128 50030 305090 -130821
8714 61806 -171635 -51850 61738 -299255 -29291 -43537 134654 -208594 -53112 -20861 164971
8702 -438976 -51657 -108177 81650 21823 -238937 210573 42706 -47187 -39665 74678 102981
8691 102981 -92671 48769 163497 21602 -163547 161504 -42977 -61745 11901 183083 -140909
8679 6604 18824 -45037 -152493 94926 -137547 -35479 26381 -88265 -120923 -124152 56421 -89862
8666 229630 -142590 -220279 124505 -259989 212261 74641 -106908 25784 -210206 -203584 -18788
8654 -206995 39267 -166931 -201430 -145456 -277270 -128902 -32504 229869 -53678 -78961 -155122
8643 -155122 -11717 48770 28787 -182424 61816 -11264 -164736 -61139 -40506 57234 27200
8631 -204971 -26451 115402 -273768 -48638 68473 72885 -214809 -48637 -289631 15752 -6186
8619 -90304 -214175 140806 -197213 -50963 40090 -103719 154618 308013 -137171 296256
8608 -161646 29971 -56146 171369 18149 -125452 -6529 223869 175279 -16723 185 26168 -183160
8595 61969 -138335 -126611 73489 -207399 138351 -290278 240489 -129308 296732 -46351
8584 -15601 90941 -301560 -199160 -317748 -92268 3988 88048 99045 -237789 -36656 40511
8572 181098 212933 -177705 164350 -266324 -197174 -296188 81327 325076 -80580 -186155 35264
8560 -163476 -77539 18483 188740 63099 82372 91058 -72849 68850 -202963 -187470 38869
8548 55328 97453 -81073 -182478 19603 -157562 62926 -55007 255106 -62329 -119781 162083
8536 -370213 60353 175021 85172 191655 -53671 -286112 111101 -300071 191649 -82271
8525 119000 103568 -128803 42652 337420 -64642 -51109 -210071 -223254 -80114 104589 -218779
8513 -100234 -35680 -187191 -132840 121267 -218161 20 55061 -152339 -447583 358612 25063
8501 -302432 -10722 -70163 -55540 -62200 -207354 -245227 -16632 -317573 60073 -211879 -58215
8489 -10331 -31344 165411 -5736 -205629 -70434 113288 -146676 -348612 148035 -19552 -65371
8478 -65371 -128015 -5271 147964 -174220 -279717 199615 -115451 -62836 79056 125616 45410
8466 47958 -53783 -140195 108954 -99997 39669 60210 -91308 -326368 -196542 150057 22486
8454 -91948 207560 -6548 39647 -20094 -287065 -118536 36764 184165 -207941 179360 -22420
8442 -182877 122897 -98367 -44714 179419 -99383 -176636 -130790 -103759 -110065 23784 99130
8431 99130 -174848 39734 -88882 188112 -54428 -173336 203195 -225593 -127285 -46420 36820
8419 -189940 4294 347850 -11582 -174195 180932 92186 6359 -138648 40946 196362 -59990
8407 43458 -283452 27131 196507 259201 -88011 8369 -119656 -110537 -26383 -196246 302018
8395 -230835 -44295 135862 -147808 249517 -135794 176123 -124497 -126207 195715 -217853
8384 150006 -82739 176924 -419277 175650 -17536 -102036 -158398 5855 139380 -210846 -212630
8373 -212630 -119934 -322118 -92922 -31401 -25380 24094 -107847 -41407 -266381 -193176 -339190
8362 -339190 -111098 253600 -152830 -54811 -159259 163362 156833 -155179 -126763 -123288 46562
8350 -150744 127090 -188870 328709 -149210 89965 72055 -7451 151435 -72190 30766 281011
8339 281011 -218514 -48283 -54023 127384 -200094 66142 -278252 278221 54840 -56990 -239403
8328 -239403 172984 -147578 90003 -6405 134587 102341 272496 -91415 204901 -70798 -201254
8317 -201254 -189327 358267 85535 19969 -193168 -109245 -131140 272500 88506 -113585 81885
8305 -151349 -115607 8821 -102920 15792 -25141 33944 87639 -236401 -177691 -303014 -215220
8294 -215220 -200442 -158613 35043 56760 -380269 -374649 -90595 114322 -53138 -246191 -193248
8283 -193248 -361897 -115330 -143317 -103792 271743 139526 87915 341876 216546 -161557
8272 -219242 132784 31014 369669 -205882 -298504 -186651 94916 159416 -8390 249996 -118896
8260 -259646 88230 34621 52030 1233 -72544 120255 36111 -83867 -108733 -34018 -94391 64346
8247 119210 -197786 -174225 -89366 -59470 214751 -152434 169826 -112002 97905 174935 -80913
8235 129369 -7740 -52770 -87913 26985 208054 43139 36795 126760 -132490 -29284 -136158
8224 -136158 1188 -48627 -14691 -136354 122566 -318898 -177030 -89249 259344 98789 -269852
8212 119296 -78289 33347 -108978 -142739 141056 -56811 -300326 -150178 -10267 24111 -63861
8200 -67204 55003 -46378 18903 -158826 -119507 28894 -34275 -68075 -126890 183192 -68818
8188 -28040 30656 364220 118227 -137871 97069 86980 -81635 4944 -34941 -52652 148156
8176 188280 -454324 -181716 175925 27117 -127151 164859 140741 332673 86838 -232466
8165 72940 -96553 -20185 -196205 -74490 -124454 227753 -274841 86531 -76850 93542 178306
8154 178306 -43731 32522 187893 -81261 1707 64404 -2169 -208629 111696 7385 -29247 -290180
8142 -290180 41333 93507 51479 -46473 -235972 21760 -70399 57108 -231450 63528 -41074
8130 -133764 -25138 130966 -28437 54548 -290259 -239800 173283 146541 71663 -192717 -162076
8119 -162076 -66056 -121015 77942 -278066 149461 193686 267353 -185533 -103120 24426 182087
8108 182087 -66454 -106452 -124313 -147864 -271117 -21102 -851 -340825 -69767 -70606 -177654 -53432
8095 -116311 205858 242739 -260100 -223 -323557 -6667 134741 -120480 -120800 145156 -19794
8083 -283777 -271428 241402 -5490 321873 237285 337950 -215407 -76862 -5445 25571 -3048
8071 108754 248506 -6020 -5928 -224058 -86875 198239 -9969 -234300 183257 84219 46169 513
8058 107021 -424129 -93275 -77433 25749 -41649 -4312 -18406 -141430 69990 -100947 -202955
8047 -202955 21478 57102 170831 -98051 -210607 167994 -102800 -9247 136763 -211387 -356771
8036 -356771 20556 69060 -58731 -162314 -244390 85120 149821 110521 -562192 -208632 -109944
8025 -109944 155032 -134303 -89262 22313 257831 -247356 99234 -184962 -109475 -131220 112255
8013 566424 16289 -401352 -113011 -63082 -81665 -145754 127715 -30520 -238685 13637 -66339
8001 281276 295815 111187 -108263 232522 -474659 -185548 -276320 96838 -106517 322916
7990 135429 -90647 3632 153585 -114057 -46248 -106714 128224 -278398 106338 -1618 -113710
7979 -113710 -208562 -146220 -95202 -149930 -95004 -109678 -248033 103866 34741 -255236 113382
7967 -213290 910 -84914 106550 -63355 -134984 -228140 -305142 -76189 97647 267276 87760 -38619
7954 -400807 -21004 88234 155222 -126610 -144013 -294254 239003 -148933 -145104 116225 -256692
7942 -106125 -66596 182544 125594 2336 -7660 120547 15208 154353 -335735 148491 196999
7931 196999 47734 -322259 -66259 -352458 -63610 92293 -17633 -216937 1064 -55023 -209306
7920 -209306 120866 -15620 241989 -188318 -248028 -327204 160615 -144904 -36793 -158192
7910 -158192 -129924 -39467 -174691 94982 -196147 -336973 -238285 -46829 -162556 -77955 -137921
7899 -137921 27536 -9296 187006 -299140 -174103 398819 124843 -118287 258650 101808
7888 -10654 -111374 29580 289000 120298 28546 94686 -112643 151706 41357 -175266 -257116
7877 -257116 322868 -235172 142932 308402 -291826 -198157 -221693 87801 41111 -96246 113931
7865 18718 196182 306454 -368132 103341 -30002 -225675 -272941 -285870 -17532 -63068 118320
7853 89876 -356381 -110211 144513 64143 -120137 -88928 -46989 -7123 141192 -101120 -110968
7842 -110968 53418 278704 -264471 -51933 -93051 137685 41934 -61015 -118102 -132405 199254
7830 -219485 213894 -285432 6392 -94177 325188 67390 -123003 87891 11594 -21830 -113823
7819 -113823 -217019 -168057 12886 94485 -60485 188275 12228 -122375 355108 -47063 -54211
7808 -54211 67396 74719 12707 -168662 23775 -123445 102254 44975 -302068 22009 -87086
7796 -381468 -48403 170546 -94396 -160194 11544 61954 -16217 -238907 -289930 -134568 -83927
7785 -83927 -103925 -267732 134604 160653 38885 -62506 -41165 307491 179938 59524 40207
7774 40207 14482 -201797 -1360 85689 27091 -309446 -58890 -28751 -39334 166139 -116220
7762 136046 -272731 -255299 103938 131563 207373 -63032 164956 56963 -34802 -189814 -229434
7751 -229434 1020 -47871 223291 -116508 -29000 276150 -166118 -95426 109423 -22290 -70250
7740 -70250 15217 -105683 -57710 32851 -28447 78875 -180208 1486 -13341 -76192 77904 -92579
7727 -137189 -336759 57181 189235 -417607 -133231 -68876 -94908 78625 -18227 -166697 25644
7715 55825 65442 -25207 24523 -11088 234290 75058 -174723 6697 48691 23868 14070 62849
7703 62849 -38371 150205 -46723 46857 38821 -274614 -216357 -51441 -6053 93071 -30290 75977
7690 19088 -115675 13285 -162624 -78654 -90892 16116 2246 -136295 -99580 -387683 56763
7678 -403377 51199 109060 3265 -223536 -289216 79414 168581 -483476 68873 156181 -373279
7666 -174865 -208651 24898 -403574 -124529 99851 -378701 -40515 -244063 -138408 -43167 -34613
7655 -34613 102574 -116801 -250860 48498 -34510 -40386 -510979 69887 78033 123078 -91967
7643 -247381 -27528 31995 -259942 74754 11388 -164992 -8792 116713 144286 -181876 -20642
7631 -263262 -113156 73927 94672 -266548 -41013 235882 166822 118556 8437 -178228 143061
7619 -328930 -169135 -216875 -189929 -8412 12159 430061 56290 -159926 -43170 -57218 -177697
7608 -177697 -5996 40311 -10758 -128287 -62941 82390 120030 -21914 -54590 197295 -8915 -204744
7596 -204744 194467 52594 -55676 -1608 67250 140850 -280598 -143952 -62863 -227926 -30034
7584 227737 105670 249933 -165581 -286232 -37951 191984 78872 -235303 -332771 698 -25137
7572 -64341 -189333 180450 115712 -42946 -149670 -180389 -653 236001 55858 -52602 -257334
7561 -257334 -146164 -163808 -60692 -34348 12919 -68561 59198 58655 128598 -248986 -123205
7549 -85602 19659 76424 -256728 -438002 -147251 67008 -259942 -11057 -131681 -16293 106197
7537 51599 -161153 30569 -218446 -101982 135714 41068 -71965 -13352 63422 150403 -268310
7525 -76271 36630 -304403 -230422 92498 -79933 440714 -122800 377308 -48694 -113650 -157538
7514 -157538 -27096 -51208 140388 -62087 87557 7563 -14707 250999 78144 10821 -2723 -146267
7502 -146267 4608 -195265 -155005 -103497 -99573 -68289 132705 -142098 -64851 198811 -252592
7490 -147468 393681 -142204 64334 209637 -123252 -82110 281465 351040 30166 247443
7480 247443 321652 -197008 -219490 -81555 -29224 63287 98122 -61446 -305121 278266 -287575
7468 263470 -175762 124729 10025 110842 92976 -231047 -114392 79969 -89930 17236 -269104
7456 139662 -204951 112001 -155156 59251 -52320 -49958 -253181 -274725 280800 72845 -293729
7444 -99551 83809 -118995 -131583 -315556 138464 65535 149012 -130983 -118755 97906 53999
7433 53999 392526 -6957 -84352 -53982 -161029 -14196 40607 -43087 -33341 136250 -55419 93964
7420 -38540 -196802 112077 -96887 -247731 -187220 -150616 19613 138664 -2160 -160340 -375757
7409 -375757 5731 11221 43441 -115673 172634 -55440 -192476 -368366 198222 159836 -339260
7397 -73651 38 222 -280242 -33203 100738 -81690 -68353 249489 -16160 131603 256668 18993
7384 -60235 5291 61743 -11149 -16501 -216074 41116 -202139 335345 -35346 82002 -124368
7372 -115360 -121302 -255900 -241257 229531 104508 79695 215417 65663 122974 188790 173101
7361 173101 47057 -82277 6770 -14015 83594 232426 202278 -18376 -91537 -39228 -140399
7350 -140399 152917 -282052 49576 -293000 -5189 14389 460820 -118163 12671 -27107 -140688
7339 -140688 -4614 71971 -63642 -331107 -109907 37678 -195485 -157109 -133635 94037 -280501
7327 -133345 101609 125005 203809 -90525 -318874 71970 -96273 -30391 117903 96316 44481
7315 -18469 15983 -48083 -269956 7183 -325716 -101036 -99222 -23094 -42160 291259 47875
7303 -99407 -157791 180291 109445 -42900 -232831 -331294 -116646 -64198 -270813 35425 61962
7292 61962 40103 -117388 402017 -322016 211331 -35906 4333 -3984 8711 -159731 33314
7280 25164 412336 94913 -91097 134733 66146 114685 64227 -2743 369848 -315834 115713
7268 57319 -90025 -216350 -95688 68301 24783 -36796 58818 -72809 -134384 64827 -23002 -606361
7256 -606361 38769 -213300 112979 -122058 -164182 221631 -244745 81413 -240937 -100936
7245 273488 -40027 -14776 -29507 -151351 287028 292 21274 -7209 62780 -131855 10168 -331620
7232 -70253 -32173 7584 210262 74754 -5342 -187655 -244846 -372582 72899 -143871 46982
7220 -90581 22642 -193078 60337 177255 -98581 95365 125472 77039 -274316 39984 -247888
7208 36720 -222452 -80821 -341624 -324346 243601 74914 -91474 48022 79548 46128 26730
7197 26730 202406 -463638 -112213 127743 -82806 265914 12081 18197 -58769 140361 -18961
7185 -197521 -172969 71530 -49404 255269 -104714 -44463 94756 237417 215949 -162087 -73240
7173 10177 -403017 -109478 125923 -205144 -150360 -185951 -43148 -259650 184050 83783 -101939
7161 36649 353571 -98770 39063 228845 122427 -101999 169329 169233 -65610 -84730 -182262
7150 -182262 102153 -45171 -160769 14585 111522 -221466 -65863 -171514 3569 -110697 -102945
7139 -102945 -260638 -214110 -138062 -226029 156748 -51594 -22165 28625 -143457 294401 12179
7127 -287309 -97613 -179667 -21099 -152673 205725 185572 226894 -138980 -192704 176425 -178467
7115 -66829 -110305 -79810 -9249 -88849 -60920 -69714 -23414 -198995 107235 -10054 -25497 187356
7102 -27822 111073 29506 128071 44155 -129610 -110659 -214594 154911 -62709 -97314 156430
7090 -23567 -102561 -35156 21001 -65175 -165810 -178248 -113273 62111 -244179 167624 -378638
7078 205761 -133120 -39422 408234 -93573 72544 -138831 12019 184619 293655 -325060
7067 60402 -167321 -323438 -160521 173088 -59493 119084 62883 430196 86537 238452
7057 238452 104938 -48413 -115380 45201 -8602 330481 83232 -188516 31231 -5452 -53391
7046 -53391 -123824 215254 -41523 22358 225686 -150283 -353620 111081 298349 -15533 102250
7034 -167613 -261023 -84035 131790 153719 38051 321166 121765 -47840 205536 113563 -156027
7022 85 272225 -72250 -77151 -36274 -294317 52176 -62025 -34221 -165742 -76281 38231 -179089
7009 31908 45414 -26918 -126531 134208 70721 -32447 -4930 -180088 6344 -62343 -69431 -26540
6996 264151 168143 -84667 41172 4656 -151884 370620 292675 52623 -90534 -141420 112852
6984 85769 22280 -12253 -41658 -191823 48601 81382 -97377 43167 69755 164542 212128 -12725
6971 107435 52118 -123272 173800 61692 19809 32006 -116008 126312 -30460 308961 92788
6959 30621 144978 45000 79922 -122954 -57740 275031 -54966 -57295 61383 -379432 325945
6947 160812 192640 33102 -73700 -170797 -104565 69865 27416 25401 -36550 98189 -236228 151841
6934 -367 -58591 19238 -155442 155563 248157 158437 35592 -135306 -157033 -53517 -229301
6923 -229301 -128033 -17014 167834 -254851 -151667 17620 -50533 19867 50926 72231 -3060
6911 -313421 115915 184814 95827 -24485 -319175 61332 112588 62847 17374 426279 -429536
6899 117878 211609 -205615 26005 230287 -55128 195264 -43629 -10499 129454 82674 6231
6887 -60448 -50549 -74344 -199112 -152273 -279384 98168 -516331 -149351 -111778 -52111 82849
6875 -369520 -10389 128095 79851 46272 -209682 -104013 -283141 125444 -438067 215166
6864 224045 109571 -72452 -44554 -76548 -175197 49528 82889 187721 -138128 -126871 -294337
6853 -294337 5512 -63950 -29857 -332099 22430 33608 197246 -13651 -270570 3638 -83786
6841 66809 -124895 -61562 -173077 127216 206436 -178768 288631 17901 40100 66722 168278
6830 168278 -266144 -216049 -200554 129341 2727 -107858 244631 -100924 346178 -362762
6819 -367027 107317 -247148 44342 -541 -198959 47799 -22973 -25984 -15775 67414 -62626 32210
6806 8690 326615 134064 -35285 -176708 155495 -7034 -326397 -157261 -440906 128766 -547789
6794 120932 210144 -158288 39906 -111896 -7091 -167715 -75620 -58814 26300 -133863 7793
6782 -108176 166300 192377 68142 183970 -221643 247640 -49313 -137969 -432268 -65001 260341
6770 -100176 -63689 -128496 -65914 503493 439186 -41798 -78310 -207133 59146 33067 -135486
6758 -23521 -184257 90729 -90303 113507 -167689 -175653 57198 34088 -6503 -316817 202924
6746 29588 -154906 51246 -230544 -368778 -137422 -185688 -678 -165496 -79918 5582 195287
6735 195287 107868 127066 243747 31422 -78199 53263 -45866 -257010 -7711 206678 11519
6723 51374 -84136 -28005 1262 -37125 113641 -86925 71156 18297 153186 176266 -154629
6711 -167956 275676 105334 3176 47904 -49302 -77059 196793 -21914 -51919 6909 43422
6700 43422 -141756 -136952 187251 387971 -108258 31006 -50081 293 114328 -212892 254218
6688 97543 -112755 165630 317482 82202 15948 326978 102899 97055 -141202 -7210 -288538
6677 -288538 4184 -163265 2421 -53725 12363 -194526 -72572 141939 88096 123986 -1461 220439
6664 -265989 182163 26283 -308867 56719 64482 232743 139093 -335841 -92489 -108784 -184263
6653 -184263 100277 34319 -181048 -236383 -143468 148283 -156538 242776 -187517 -239625
6643 -239625 -205723 245021 85894 -159445 58652 -125443 -41505 108970 -61902 -162731 255986
6631 -78992 -29312 -37899 -39012 -191232 222185 -136345 -62773 -243011 -56797 145070 -102040
6619 1354 132935 446100 189512 -96579 -283180 201710 193792 -265907 -174039 16394 74917
6608 74917 -172945 -177342 -116446 -35115 350241 -27788 203030 -110401 188137 -181062 -55106
6596 120790 -46826 16932 -157181 101155 132694 -5427 -63541 -13772 -189487 74598 -87836
6584 -75422 -156359 128429 -227141 -193996 -50983 -48742 215119 78919 -185559 82504 74007
6573 74007 19985 -50675 25995 -214093 133310 40568 -183402 97844 -31657 211554 -110478
6561 -93210 -119050 -112824 -14448 -85086 9367 -4682 196047 -269186 154189 -179114 -247479 -87906
6548 -222512 -77127 -47773 -222870 -260443 -41294 -1937 2951 132166 -12561 106146 80626
6537 80626 37479 -3056 185359 -75968 -8514 -44391 -167671 -246728 -65310 16402 25500 -269105
6524 -25314 -179953 -171858 72271 -170080 303556 6898 -20966 3541 -22150 -301550 -291460 32483
6511 -179328 -39500 234081 135165 42282 -77701 -110698 22670 -129505 -33308 -392029 -4155
6499 -47377 -34718 -172043 -130935 45372 113192 145217 213609 237757 24363 -99621 233548
6487 101603 120655 -119728 114283 296129 -92240 -149612 -16644 -78853 -222398 5892 -267412
6475 13226 183355 -104074 -50829 64543 -14530 -196001 230491 167302 -237718 -178362 -130709
6464 -130709 -181640 63050 239015 -25983 -29224 -37853 -324626 187869 271059 -247503 -32657
6452 -99215 19714 -184535 157657 -33314 112261 -204117 -89339 84533 -81191 204089 87628
6440 -149700 -64529 164792 59769 -187084 187761 17143 -82838 270765 -48645 60462 -176033
6428 163502 -62823 -155694 -345937 81010 -198316 -337680 339388 -302356 207923 -80323
6417 3962 115043 -258306 -100734 315469 132020 -39938 -136527 227132 153060 -177238 -188573
6406 -188573 103655 14218 209591 -44068 -174538 38352 122073 -5694 177173 -139133 -68669
6394 165770 -74700 96576 134504 342036 47838 54441 90158 50027 -59164 -11119 -123772
6383 -123772 166242 174189 -82796 112087 -211037 -172491 -107764 -147529 -209159 -11033 -4083
6371 -911 114051 -85648 -48950 65446 -75020 -277884 63462 193800 66675 3084 -81915 127394
6358 -339556 -74642 31459 -320933 121964 49619 49821 -194205 -198446 -107507 99226 -58196 48715
6345 249056 -7775 20452 5298 65230 -31262 46158 63391 -44528 -54821 17682 324098 -76705
6332 -195021 225671 -178786 -25799 -177768 95248 -48066 177610 -137084 14749 232294
6322 232294 41721 -62594 3996 -185484 -136950 359084 213714 277227 64050 -8559 -153098
6311 -153098 142088 28965 -77516 16618 -197150 -159290 8023 29479 76817 16041 -150995
6299 -68368 -59069 242121 -123830 31611 98261 34097 16394 45029 -99648 -154015 101996
6287 231344 -71591 -13593 44882 -149645 74000 19464 12795 29511 201991 192673 47365 1258
6274 176809 275933 216443 -223006 -208100 -2062 -86260 -247948 -161884 354945 -65185 -33475
6263 -33475 -254546 339285 289552 62390 -133418 -22600 -343482 -109807 223467 -6987 -246899
6252 -246899 -242500 253009 -73104 -71631 -8791 -65676 -116327 -34563 -54968 -76159 75321 -33801
6239 102661 248842 -402811 65440 -154364 -249117 -206905 -233177 -196881 -80870 256625 121947
6227 82861 -160951 868 -49232 -25942 -315031 -123628 -2630 -36706 -61203 -47664 -260093 -118049
6214 -80195 276593 70827 133967 -247162 76702 -239404 -260389 -136617 392227 88937 77656
6203 77656 108914 -41840 -227178 29260 3934 119273 226659 -57174 75116 -179343 234261
6191 26467 406563 48804 -169444 100301 112411 -169368 47606 -106216 167541 -159059
6180 -201252 -86005 441144 -149770 127536 -100428 -140751 152290 -91544 -89410 140646 -132600
6168 -23905 -227407 274665 40041 297359 118610 19518 226959 -381067 -181992 98882
6157 -98707 382488 -322298 25453 -27540 -62964 -127668 30885 -270147 -244448 307772 -77478
6145 -87442 91891 73777 121039 173147 -255899 193985 -63855 -131492 -30874 129697 180232
6134 180232 8672 50423 71828 226027 89361 157942 146052 -169697 117445 145453 -10808
6122 -81726 245246 121922 -63173 -151427 -142036 10745 -11994 213850 50383 181100 -222166
6110 6877 -133691 -297678 -102350 132445 -200881 46042 119980 -281624 -84130 -103065 -120049
6099 -120049 -4239 -111755 52561 58137 114156 183519 265843 -301779 -40581 -305781 -157612
6088 -157612 331242 50855 29457 -91113 -55415 34647 -96233 -249052 -401141 142727 196214
6077 196214 25726 15205 -176283 -244274 -17469 116341 -285233 -308183 -131778 164964 54632
6065 135798 -246517 199481 63671 16574 -226772 -32940 -51396 105726 -310797 -97285 74232
6053 34898 16561 68437 -183423 -128119 -44083 15590 28502 162084 -54625 -175183 -119851
6042 -119851 13827 -81965 -95372 267717 210343 -29180 81042 139770 22398 80925 218196
6031 218196 104581 288189 -36905 -417585 20438 103507 -44654 262798 107914 369900
6021 369900 74233 126643 -171634 -61274 -303031 132014 -164798 118432 182716 -128732
6010 206980 -25367 -158539 -172435 -68075 -262297 -454040 110853 79228 -152708 19642 -53482
5998 145026 -319531 -128150 221893 20417 -20375 -79774 -113828 -152571 254793 20027 -253249
5986 220539 9852 -42493 37058 -111040 101851 -201303 386316 121666 -116221 -558739
5976 -558739 50676 91461 -37738 155235 295283 -77705 -236624 -7321 100519 -199054 31999
5964 96534 161154 -4924 100075 -79756 148282 -20437 -185578 85909 26355 -49360 -55394 -51356
5952 -51356 42186 -13934 282440 -30363 256479 249080 -252177 -133438 -166477 -86726 290040
5940 14511 134841 15366 244092 -203380 70048 -31140 -80981 100158 -6372 -69145 -118102
5929 -118102 4722 -282974 68072 -146256 -110110 180723 -167643 96245 -114104 -115819 -196905
5918 -196905 -287207 -73679 -52851 -160767 -213270 169323 41645 -171892 -115615 -99455 120956
5906 -10929 -13678 60039 33389 -40146 -246649 225681 -148799 278117 19166 -34698 32396
5894 138433 -63489 -96782 98261 -49467 -352629 -82970 -204111 -272462 -174649 -182580 -123049
5883 -123049 -28213 -192950 304827 116399 70123 56549 -230676 169269 95627 -12339 -188250
5872 -188250 167506 71505 184643 95054 303245 180021 177351 -114503 74259 15110 216190
5861 216190 -22351 124546 -150878 -46900 59659 -44764 104740 -84485 191273 -117642 86390
5849 25582 69660 -300153 -132116 34288 146466 124487 -1336 267319 359286 176523 37185
5837 116434 -53724 -137395 5730 53396 -79245 -302609 50812 -31707 209096 -89162 -121296
5826 -121296 -78633 404017 -39169 -206809 -108926 -401593 216118 -164938 138623 322353
5816 322353 -241632 48392 -149877 82201 -281352 289969 -31775 -4532 -154552 -161123 65739
5804 -58303 -72897 -72838 72026 392687 28935 -11393 29447 -149212 -176943 99743 -38391 -55807
5792 -55807 -182693 215068 -40367 -81854 210323 235098 -7781 -95506 186698 27970 309095
5781 309095 -108094 -794 -11697 -213699 73643 -16041 -308006 -142478 102791 43866 117732
5770 117732 -29818 -15593 -93996 -51637 5477 -107991 33026 16093 162911 218129 382948
5759 382948 124234 54036 -64952 -19777 -5934 52615 42973 1023 -126736 -126226 -75072 33450
5746 24479 19464 21482 15831 -82366 87594 211276 23502 -88040 -30467 -88212 30049 11429
5733 206673 234440 -51226 108937 -309228 51199 -26314 -252267 374211 194916 -207304
5722 -130020 -223054 -132417 368747 263451 -15928 -21097 227692 -195591 31488 85856 9365
5710 65127 292851 -262720 432944 -104086 149095 -182945 -139531 107933 -349328 114124
5699 -268894 -44435 65776 -122752 110093 -87572 71368 -16436 -131617 168852 -141871 33114
5687 -203934 31001 18974 -91776 -226965 -19646 -156717 10643 16204 85967 135131 31272
5675 -24724 133028 -214430 -14026 -451904 -285949 -69528 -71396 -44780 134061 -99963 -7213
5663 273046 59803 41834 255527 96954 10521 67079 28148 -18061 225824 -19123 169625
5651 -279287 32641 -179909 -64284 144413 1396 -71446 16251 -114571 -187261 36065 -210230
5639 80726 161609 112158 -79959 245017 24699 271582 254243 291665 -253389 -270635 296372
5627 -213914 -286156 -10059 -197077 -117553 -29038 44808 -152422 24881 -14208 -131871 -110234
5616 -110234 119810 28447 692 11170 -193738 273295 8755 -310317 74975 -81051 -141114
5605 -141114 -47567 -112407 45821 51167 -67331 156851 51915 63936 48914 48841 249977 -107258
5592 285222 292673 -61638 -49408 -274326 151403 -142384 -353943 57862 -174119 -45252 -130168
5581 -130168 -100336 232373 -226902 -10992 54029 -92208 266327 297678 39328 -131495 13394
5569 30979 -18468 -16707 336054 -136247 270105 -204073 88878 16089 133528 -132097 -11895
5557 249982 25679 55719 -71968 -7410 -16329 304462 -149447 -95067 -6488 -3655 250933 -371738
5544 -246245 282669 -185288 17202 5819 198944 -69201 23457 83950 32769 -97915 41866
5532 80767 -61496 -68296 -313678 -82177 -77198 87846 -50164 -62809 -25854 -72808 322243 181627
5520 181627 -358832 299039 -276579 -17594 -48090 -96357 182008 28659 -63584 -123252 96609
5508 -30815 177193 -81976 120186 -314529 107917 -154381 118992 -309607 57771 143363
5498 143363 -141070 129738 105016 137075 191731 92661 -194591 142238 207967 308493 33126
5486 -16435 21399 -19712 -72105 -159 194697 -5836 38318 13719 -31918 205121 3517 -151045
5473 -183188 322644 -15123 178251 120686 32471 -158193 271300 168984 60001 30209 101366
5462 101366 101792 301801 -202186 -26926 -59246 28579 218095 174178 127225 -264061 -25061
5450 120865 72442 -5596 109182 35633 280082 -34832 73050 -201173 -135609 356734 105012
5438 -82017 164771 -30221 -101986 -9226 146503 -143018 -22224 -102870 -46911 -68544 62938
5426 -66367 -200264 158234 69939 49121 -11497 157267 -51845 -69923 -9180 -107517 16313
5414 145310 165754 -240164 137177 152168 72524 154383 56048 -152739 119455 -312278 87214
5402 -180722 101347 -61958 -197950 10988 9185 19100 -149019 -200003 -187787 92143 -77398
5390 -161566 -116630 35115 -12480 -54059 -46739 290845 -3946 -70383 -107700 45359 206744 393593
5378 393593 50249 -135917 7289 -213370 171792 311713 205093 -68231 -55445 -10151 -230308
5367 -230308 -98578 94164 -168973 -210258 128738 196022 36786 -73576 -60349 38481 95422
5356 95422 -170476 -119914 90042 25619 -159483 -91294 135345 99273 -3831 -55181 -223996
5345 -223996 90736 353581 -71295 -55917 -278944 59113 68467 266488 -214882 144371 -16920
5333 287377 -95267 -238738 37116 27612 211590 245533 -98410 -114687 160416 160057 -20229 286213
5320 261550 -19594 -35065 -159919 -151319 138385 240453 55392 49275 188800 -35674 36546
5308 -49892 -159556 -118540 40342 54618 219547 141260 -269093 23825 14502 -341282 -35313
5296 -303883 52676 187993 30988 65798 69442 -130819 101909 56508 148313 -767 -123294
5285 -123294 142071 -32052 112774 178022 -95860 -25814 101649 275906 -48281 -62230 118207
5273 33536 18652 93153 10143 76477 -7579 -36402 -10107 139494 -212694 -80109 -91851 -82903
5261 -82903 110927 -231529 -31245 33743 -65915 72062 -58831 282512 -190474 41610 67837
5250 67837 39594 -230104 77951 28836 -150981 -14549 65674 -26707 -4850 100782 -266456
5238 -18571 411625 -124148 132602 17563 -101444 246266 -175431 -2423 -119045 -136863 -60119
5226 20268 -201657 -108474 10436 77019 -73919 25556 64097 -348017 167374 192797 -215878
5214 13213 157537 -140618 261625 35090 4528 13566 134185 -386917 45981 242543 64138
5202 -34351 -38260 -151627 11425 113352 44292 -127336 -98792 -222185 18402 183978 120804
5191 120804 -43501 -116151 13043 -212131 219513 -62125 -220187 -231425 -14537 159523 64056
5179 -204800 -60811 -39525 -154427 268029 47092 -147862 -101491 334970 -36157 -257933 298689
5167 129410 222198 133520 123179 145013 -172965 102298 -45095 8734 80652 18142 251670
5156 251670 389759 231135 226587 39646 127046 -80365 -108010 -46776 46954 51801 71836 9677
5143 -180210 -150343 -131183 157884 -252044 -217763 157713 205752 249387 -61995 321083 239610
5132 239610 -248474 151714 -348325 147593 -40924 19228 -186257 -382675 32376 57892
5122 57892 -529024 259106 -10150 -129222 -37371 -9511 -124234 -118202 110512 282261 -338225
5110 474851 -30713 97479 21803 -11735 23112 -291370 61176 -42970 -118599 85272 172980
5099 172980 130608 14033 105297 -109014 -20777 -145231 4150 -116601 -76861 -306100 23087
5087 -523118 -141167 68513 -57141 251185 22978 -163596 -13150 14059 117455 -75933 342245
5075 172219 42710 -107698 2411 76788 -196250 -83154 101826 -359688 398027 -49254 94006
5063 223016 4755 171675 -106731 -300732 -173013 -325554 15001 140916 112912 -154383
5052 69541 -128640 162581 283813 -163961 -121696 128458 -30848 87108 22942 551 164506
5041 164506 38998 173398 -158487 -204642 31662 -36198 134874 3140 54100 -104406 126536
5029 175485 -184770 857 -132475 132396 141415 192280 -153976 -220758 -127293 -75397 -144881
5018 -144881 -226433 -113469 -55400 89392 -223147 215476 13775 41711 -186860 37270 28321
5007 28321 84852 -64126 -111308 -194071 -388 210981 276065 -60045 -75424 64195 -87183 -54973
4995 -54973 -346007 355273 31244 -90621 135871 252779 165787 -53033 67746 34895 154449
4984 154449 -11328 207610 -89331 138607 -170583 -40713 365639 108166 -65880 240797
4973 -78497 -92518 218094 497461 -72413 -12216 -120962 195984 -21493 243044 -111682 -78281
4962 -78281 -424635 221146 -418484 -27341 136300 -62426 5624 -66607 -143662 -52342 263492
4950 -23841 -375708 -87585 110242 49528 -133023 2982 209269 -41936 -32090 -37788 75789 198062
4938 198062 291251 -461506 335247 -295332 257921 202411 65923 121267 239070 209333 -113335
4926 134678 -63826 365324 -7996 -165192 -90110 20722 -243810 19900 24872 46988 -38955
4914 64014 163006 -431623 184996 151434 120664 -171597 -67473 -36046 29668 -100206 1224
4902 42537 93284 -41271 -23817 205658 207761 141789 -1521 -11023 236876 101978 140842 545701
4890 545701 -65051 95548 139399 -11744 -293115 39154 -89550 -48581 -1131 118922 137713
4879 137713 89723 188152 -111499 -270534 59916 -60889 -159025 115015 -22845 -45248 -48188
4868 -48188 148204 -62643 -84100 -7196 207006 38521 -254275 -6554 -41483 53112 -172181
4856 -152309 -124995 14681 28251 -116402 -37605 141768 394806 -57671 144520 -311673 -41390
4844 175245 180743 -254954 -184961 49422 -9006 -48449 345591 492566 104020 16337 -36597
4832 -143383 144825 46613 -6545 -45832 -196979 -137207 -117692 22758 -149574 196384 -285590
4820 -8753 220289 27385 -181814 -124066 215909 -4407 -86509 -122199 413780 -369340 -5557
4808 -205112 104933 2986 31455 156724 -78102 211820 -237536 -290768 148677 -11266 -191370
4797 -191370 -289533 95552 123428 -195516 222599 76938 -27790 -136308 -123632 -82175 -92443
4786 -92443 -18290 83436 -157964 52452 -174326 -52419 143342 104976 -16662 -145347 3668
4774 288842 -57118 -44104 59875 -423065 -15400 190012 96117 137656 69229 140034 47221
4762 -103103 -214190 117403 97562 -189120 -42352 114873 28814 -174133 28328 29615 -141353
4750 168463 -34382 -43089 16061 -183929 173798 41119 -216558 243359 -51766 -288639 -11306
4738 168022 214879 443289 248417 -148188 227914 175261 124313 -156082 -49864 15489 106269
4727 106269 129227 -105390 -297947 -78194 -203915 76380 188045 -276072 47980 6664 271973
4716 271973 -125398 44036 -150042 24245 33160 233439 -94153 -45189 102905 -61220 -135841
4705 -135841 91872 189032 -329150 188011 45577 -55238 -129863 -39488 -299483 -46861 27255
4693 -8421 -199820 20853 267254 41289 258759 -310498 158132 -61986 140566 -239075 341978
4681 98686 64737 100228 -69896 -95875 61144 18407 -357664 322835 -147614 157479 -260965
4669 44414 -15055 -221289 -68647 -44478 324381 152695 -224038 -196778 -52738 -24378 -151052
4658 -151052 -104791 57814 272581 93114 49001 131094 46632 138132 -98994 -20207 229168
4646 -188656 5805 122817 -231000 -233106 115854 11748 -39297 290933 -155676 82033 -134928
4634 507480 136551 -133870 63278 192908 -3810 52500 -22439 -126792 -117791 -167386 -73288
4622 -1731 115459 -28386 34408 20164 295766 18283 -213494 91554 -74736 -33091 34743
4610 44161 22059 -384666 -9163 -18778 -390620 -16730 -73175 69783 271198 235929 212679 246118
4598 246118 -107642 291630 177896 50258 -34959 48953 302841 -126693 -159593 20003 68239
4587 68239 32296 4888 43265 199515 -314280 -194497 365200 -227592 -8374 26077 -54052
4575 135528 -132682 -9316 7599 -255377 -126816 166524 -23107 228675 -147778 193060 -62854
4563 19254 67894 27023 226804 28415 157290 -116679 -138988 -70147 28010 50326 96244
4552 96244 6815 439655 -52199 -3529 244641 -211444 137406 -88722 -438635 -99361 138623
4540 -13890 -141740 -5871 154706 -54056 62980 419021 35916 58667 100807 -82371 152170
4528 -406935 55048 22969 -177415 -184024 87945 153988 69538 -11809 -91385 44504 -24668 255592
4515 139297 127483 -9981 124740 182141 123138 83808 24314 298928 -118816 -98150 -117179
4504 -117179 38207 169134 -137297 -302042 165667 57482 176083 38430 -114946 -56703
4493 27264 -164399 265685 178961 402657 67828 15288 234496 -70820 11829 -15941 -67739
4482 -67739 45150 21857 53763 -39490 181205 -160985 -9548 109341 -191065 489136 -64693
4470 -52954 -68893 298131 58416 103255 45461 199824 65727 -261124 166148 187639 22001
4458 -225444 516475 102267 -223519 -57516 52092 -88123 -8617 -94170 -30343 -41116 114983
4446 95507 -374544 -185931 -83028 -328505 -5452 -180468 -56923 -161906 88197 -15856 366714
$$ [...]
##END NTUPLES=NMR SPECTRUM
##END=
