##TITLE=NES1070_159122.0012_001_9705698_1gwYXIC89o
##JCAMPDX= 6.0         $$ Bruker NMR JCAMP-DX V2.0
##DATA TYPE= NMR SPECTRUM
##DATA CLASS= NTUPLES
##ORIGIN= BRUKER
##OWNER= Administrator
$$ 1.72 TOPSPIN		Version 2.1
$$ 2016-04-30 19:48:57.833 -0700  Administrator@X
$$ Compression mode = diff/dup
##.OBSERVE FREQUENCY= 400.02188249412
##.OBSERVE NUCLEUS= ^1H
##.ACQUISITION MODE= SIMULTANEOUS (DQD)
##.ACQUISITION SCHEME= undefined
##.AVERAGES= 64
##.DIGITISER RES= 22
##SPECTROMETER/DATA SYSTEM= spect
##.PULSE SEQUENCE= noesygpps1d.comp
##.SOLVENT NAME= COFFEE_meoh
##.SHIFT REFERENCE= INTERNAL, COFFEE_meoh, 1, 14.96165
##AUDIT TRAIL= $$ (NUMBER, WHEN, WHO, WHERE, PROCESS, VERSION, WHAT)
$$ ##TITLE= Audit trail, TOPSPIN		Version 2.1
$$ ##JCAMPDX= 5.01
$$ ##ORIGIN= Bruker BioSpin GmbH
$$ ##OWNER= Administrator
$$ $$ E:\/data/COFFEE/nmr/NES1070_159122.0012_001_9705698_1gwYXIC89o/12/pdata/1/auditp.txt
$$ ##AUDIT TRAIL=  $$ (NUMBER, WHEN, WHO, WHERE, PROCESS, VERSION, WHAT)
(   1,<2016-04-30 19:48:52.411 -0700>,<Administrator>,<X>,<go>,<TOPSPIN 2.1>,
      <created by zg
	started at 2016-04-30 19:37:22.958 -0700,
	POWCHK enabled, PULCHK disabled,
       configuration hash MD5:
       21 0F 79 D6 B3 7B B4 F6 88 20 88 DB 03 48 BD 9F
       data hash MD5: 64K
       AD 2D 71 07 60 A6 C3 85 94 03 B4 A5 2A AA 7B F3>)
(   2,<2016-04-30 19:48:55.802 -0700>,<Administrator>,<X>,<proc1d>,<TOPSPIN 2.1>,
      <Start of raw data processing
       efp LB = 0.3 FT_mod = 6 PKNL = 1 PHC0 = 0 PHC1 = 0 SI = 128K 
       data hash MD5: 128K
       29 52 52 73 56 AE 6F 40 25 77 A8 09 02 F4 28 21>)
(   3,<2016-04-30 19:48:56.677 -0700>,<Administrator>,<X>,<proc1d>,<TOPSPIN 2.1>,
      <pk PHC0 = -83.05664 PHC1 = 0 
       data hash MD5: 128K
       D9 8C 51 54 53 21 F0 25 77 E4 6D 47 03 49 ED 31>)
(   4,<2016-04-30 19:48:57.067 -0700>,<Administrator>,<X>,<proc1d>,<TOPSPIN 2.1>,
      <abs ABSG = 1 
       data hash MD5: 128K
       E4 F0 E0 7B 82 8B BE 46 E3 0D 55 D4 A9 CD 64 3B>)
(   5,<2016-04-30 19:48:57.177 -0700>,<Administrator>,<X>,<proc1d>,<TOPSPIN 2.1>,
      <abs ABSG = 2 
       data hash MD5: 128K
       C4 45 88 65 1E C4 5B 17 06 E4 3E D7 CF A4 40 86>)
(   6,<2016-04-30 19:48:57.271 -0700>,<Administrator>,<X>,<proc1d>,<TOPSPIN 2.1>,
      <abs ABSG = 3 
       data hash MD5: 128K
       86 D0 49 E8 C2 E0 CC 24 4B DB 7B 81 83 2A D8 4A>)
(   7,<2016-04-30 19:48:57.349 -0700>,<Administrator>,<X>,<proc1d>,<TOPSPIN 2.1>,
      <abs ABSG = 4 
       data hash MD5: 128K
       86 49 8C 48 D2 92 C2 04 CB 9C 23 B7 FD 57 44 2F>)
(   8,<2016-04-30 19:48:57.474 -0700>,<Administrator>,<X>,<proc1d>,<TOPSPIN 2.1>,
      <abs ABSG = 5 
       data hash MD5: 128K
       26 CD BB 15 1C 8F 83 1D 56 03 4E 36 F6 0A 25 A2>)
$$ ##END=
$$ 
$$ $$ hash MD5
$$ $$ 92 23 68 1F FC 5B 78 53 DD 8A 78 DF D8 B2 A7 85
##$RELAX= 
##$RELAX= 
##$RELAX= 
##$RELAX= 
##$RELAX= 
##$RELAX= 
##$RELAX= 
##$RELAX= 
$$ Bruker specific parameters
$$ --------------------------
##$DU= <E:\>
##$EXPNO= 12
$$ [...]
##$TP07= 0
##$TPNAME0= <>
##$TPNAME1= <>
##$TPNAME2= <>
##$TPNAME3= <>
##$TPNAME4= <>
##$TPNAME5= <>
##$TPNAME6= <>
##$TPNAME7= <>
##$TPOAL= (0..7)
0.5 0.5 0.5 0.5 0.5 0.5 0.5 0.5
##$TPOFFS= (0..7)
0 0 0 0 0 0 0 0
##$TUNHIN= 0
##$TUNHOUT= 0
##$TUNXOUT= 0
##$USERA1= <user>
##$USERA2= <user>
##$USERA3= <user>
##$USERA4= <user>
##$USERA5= <user>
##$V9= 5
##$VALIST= <valist>
##$VCLIST= <CCCCCCCCCCCCCCC>
##$VD= 0
##$VDLIST= <DDDDDDDDDDDDDDD>
##$VPLIST= <PPPPPPPPPPPPPPP>
##$VTLIST= <TTTTTTTTTTTTTTT>
##$WBST= 2048
##$WBSW= 25
##$XGAIN= (0..3)
0 0 0 0
##$XL= 0
##$YL= 0
##$YMAX_a= 5065542
##$YMIN_a= -11236923
##$ZGOPTNS= <>
##$ZL1= 120
##$ZL2= 120
##$ZL3= 120
##$ZL4= 120
##$ABSF1= 14.96165
##$ABSF2= -5.596532
##$ABSG= 5
##$ABSL= 3
##$ALPHA= 0
##$AQORDER= 0
##$ASSFAC= 0
##$ASSFACI= 0
##$ASSFACX= 0
##$ASSWID= 0
##$AUNMP= <proc_prof1d_extract.lims>
##$AXLEFT= 0
##$AXNAME= <>
##$AXNUC= <1H>
##$AXRIGHT= 0
##$AXTYPE= 0
##$AXUNIT= <>
##$AZFE= 0.1
##$AZFW= 0.1
##$BCFW= 0
##$BC_mod= 0
##$BYTORDP= 0
##$COROFFS= 0
##$CY= 15
##$DATMOD= 1
##$DC= 0
##$DFILT= <>
##$DTYPP= 0
##$F1P= 0
##$F2P= 0
##$FCOR= 0.5
##$FTSIZE= 131072
##$FT_mod= 6
##$GAMMA= 0
##$GB= 0
##$INTBC= 1
##$INTSCL= 1
##$ISEN= 128
##$LB= 0.3
##$LEV0= 0
##$LPBIN= 0
##$MAXI= 10000
##$MC2= 0
##$MEAN= 0
##$ME_mod= 0
##$MI= 0
##$NCOEF= 0
##$NC_proc= -2
##$NLEV= 6
##$NOISF1= 0
##$NOISF2= 0
##$NSP= 0
##$NTH_PI= 0
##$NZP= 0
##$OFFSET= 14.96165
##$PC= 1
##$PHC0= -83.05664
##$PHC1= 0
##$PH_mod= 1
##$PKNL= yes
##$PPARMOD= 0
##$PPDIAG= 0
##$PPIPTYP= 0
##$PPMPNUM= 2147483647
##$PPRESOL= 1
##$PSCAL= 4
##$PSIGN= 0
##$PYNMP= <proc.py>
##$REVERSE= no
##$SF= 400.020009378905
##$SI= 131072
##$SIGF1= 0
##$SIGF2= 0
##$SINO= 400
##$SIOLD= 131072
##$SPECTYP= <>
##$SREGLST= <1H.CDCl3>
##$SSB= 0
##$STSI= 131072
##$STSR= 0
##$SW_p= 8223.68421052631
##$SYMM= 0
##$S_DEV= 0
##$TDeff= 65536
##$TDoff= 0
##$TI= <>
##$TILT= no
##$TM1= 0
##$TM2= 0
##$TOPLEV= 0
##$USERP1= <user>
##$USERP2= <user>
##$USERP3= <user>
##$USERP4= <user>
##$USERP5= <user>
##$WDW= 1
##$XDIM= 131072
##$YMAX_p= 395090894
##$YMIN_p= -11496
##$CURPLOT= <Network HP LaserJet P1505>
##$CURPRIN= <$Network HP LaserJet P1505>
##$DFORMAT= <normdp>
##$LAYOUT= <+/1D_H.xwp>
##$LFORMAT= <normlp>
##$PFORMAT= <normpl>
##$SURQMSG= 1
$$ End of Bruker specific parameters
$$ ---------------------------------
##NTUPLES= NMR SPECTRUM
##VAR_NAME=  FREQUENCY,     SPECTRUM/REAL,   SPECTRUM/IMAG
##SYMBOL=    X,             R,               I
##VAR_TYPE=  INDEPENDENT,   DEPENDENT,       DEPENDENT
##VAR_FORM=  AFFN,          ASDF,            ASDF
##VAR_DIM=   131072,        131072,          131072
##UNITS=     HZ,            ARBITRARY UNITS, ARBITRARY UNITS
##FACTOR=    0.0627417313425164, 1,          1
##FIRST=     8223.62146879497, 3432,         -48216
##LAST=      0,             5278,            -48329
##MIN=       0,             -11496,          0
##MAX=       8223.62146879497, 395090894,    0
$$ Real data points
##PAGE= N=1
##DATA TABLE= (X++(R..R)), XYDATA
$$ [...]
61291G73311j0532j0353r115p261n226l201j440j26J043K587M445O081P391Q775
$$ 773311 762779 752426 743311 736050 730824 727623 726183 726057 727100 729687 734132 740213 747604 756379
61277G56379J0208J1171J1651J2225J2838J2612J1282R732Q401O377K984p49l351
$$ 756379 766587 777758 789409 801634 814472 827084 838366 848098 856499 862876 865860 865111 861760
61264H61760m706n449n453m175j940N10L249O790J0866J4812J8791K3394K8482
$$ 861760 857054 851605 846152 841977 840037 840547 843796 850586 861452 876264 895055 918449 946931
61251I46931L3632L9314M6215N3711O0487O6432P2163P6731P7405P2088O0666
$$ 946931 980563 1019877 1066092 1119803 1180290 1246722 1318885 1395616 1473021 1545109 1605775
61240A605775M3956K3223J205j8126l2001m0263m3985m3887m0607l5157k8139
$$ 1605775 1649731 1672954 1674159 1656033 1624032 1583769 1539784 1495897 1455290 1420133 1391994
61229A391994j9407r169J547J2129K2944L3812M2982M8641N0468M8535M1606K8195
$$ 1391994 1372587 1363418 1364965 1377094 1400038 1433850 1476832 1525473 1575941 1624476 1666082 1694277
61217A694277R215j1588l0060m3841n2512n6669n7242n5195n1404m6718m1849
$$ 1694277 1703492 1691904 1661844 1618003 1565491 1508822 1451580 1396385 1344981 1298263 1256414
61206A256414l7085l2340k7701k3640k0592j8599j7496j6963j6334j4888j2685
$$ 1256414 1219329 1186989 1159288 1135648 1115056 1096457 1078961 1061998 1045664 1030776 1018091
61195A018091j0537r007p935p095o574o257n756n231n496o805q324r407j0518
$$ 1018091 1007554 998547 990612 983517 976943 970686 964930 959699 954203 947398 939074 929667 919149
61182I19149j2177j3779j4401j4194j3975j3845j3229j1938j0332q581o671m885
$$ 919149 906972 893193 878792 864598 850623 836778 823549 811611 801279 792698 786027 781142
61170G81142l502k169m21J372K406K666K911L569M433N337O197O399N176K672
$$ 781142 777640 775471 775050 776422 778828 781494 784405 787974 792407 797744 803941 810340 815516 818188
61156H18188j19k619m884o550o705n278l491k275j145O40K591L721M196N133O865
$$ 818188 818069 815450 810566 804016 797311 792033 788542 786267 785122 785762 788353 792074 796270 801403 808268
61141H08268Q463R019Q652Q004P473P195P226P327P009O109N032M125L164J900
$$ 808268 816731 825750 834402 842406 849879 857074 864300 871627 878636 884745 889777 893902 897066 898966
61127H98966P71M73R63J433J406J310J785K862M121N254O070O302N846N027M139
$$ 898966 899737 900210 901173 902606 904012 905322 907107 909969 914090 919344 925414 931716 937562 942589 946728
61112I46728K887P20k286n364p898r868j1374j2266j2453j2190j1711j0906r705
$$ 946728 949615 950335 948049 942685 934787 924919 913545 901279 888826 876636 864925 854019 844314
61099H44314q512p832p594p220o408n582n363n762o091n800n216n114n550n597
$$ 844314 835802 827970 820376 813156 806748 801166 795803 790041 783950 778150 772934 767820 762270 756673
61085G56673m673l619l760n016n825n111l551k458k168k100j892j645j243l02
$$ 756673 752000 748381 744621 739605 733780 728669 725118 722660 720492 718392 716500 714855 713612 713310
61071G13310J137K472L316L975M882N950O759P199P585Q136Q643Q722Q369Q096
$$ 713310 714447 716919 720235 724210 729092 735042 741801 749000 756585 764721 773364 782086 790455 798551
61057G98551Q480R556J0722J1190J0637R494Q628Q691R673J1108J2640J4229J5851
$$ 798551 807031 816587 827309 838499 849136 858630 867258 875949 885622 896730 909370 923599 939450
61044I39450J7395J8955K0882K3206K5363K6852K7983K9511L1660L3897L5602
$$ 939450 956845 975800 996682 1019888 1045251 1072103 1100086 1129597 1161257 1195154 1230756
61033A230756L6604L7289L8638M1908M7668N5192O3297P1631Q0568R0095R9812
$$ 1230756 1267360 1304649 1343287 1385195 1432863 1488055 1551352 1622983 1703551 1793646 1893458
61022A893458J10178J22894J39822J62361J91986K30326K77996L34214L98530
$$ 1893458 2003636 2126530 2266352 2428713 2620699 2851025 3129021 3463235 3861765
61013C861765M72610N59743O63163P85901R32085J105756J303111J498972J637572
$$ 3861765 4334375 4894118 5557281 6343182 7275267 8381023 9684134 11183106 12820678
61004A2820678J643687J460508J095059O33889K08147p0640j57528p7550R9272
$$ 12820678 14464365 15924873 17019932 17653821 17861968 17791328 17633800 17556250 17655522
60995A7655522K81145L69296K81580r076m47459r13281j281178j481245j517574
$$ 17655522 17936667 18305963 18587543 18578467 18131008 17217727 15936549 14455304 12937730
60986A2937730j441483j311163j167737j032008r10194q00214o97648o00453n09994
$$ 12937730 11496247 10185084 9017347 7985339 7075145 6274931 5577283 4976830 4466836
60977D466836m28874l58917l00806k54078k16969j87058j62462j42059j24818
$$ 4466836 4037962 3679045 3378239 3124161 2907192 2720134 2557672 2415613 2290795
60968B290795j09714r6301q4567p4135o4357n5249m7528m1542l6864l3247l1118
$$ 2290795 2181081 2084780 2000213 1926078 1861721 1806472 1758944 1717402 1680538 1647291 1616173
60957A616173l0743l1433l2105l2216l1715l0557k8754k6770k5342k4920k5432
$$ 1616173 1585430 1553997 1521892 1489676 1457961 1427404 1398650 1371880 1346538 1321618 1296186
60946A296186k6492k7619k8370k8493k8012k7102k5896k4442k2742k0845j8881
$$ 1296186 1269694 1242075 1213705 1185212 1157200 1130098 1104202 1079760 1057018 1036173 1017292
60935A017292j6943j4912j2576j0086q059o971o587o267n745n267n071m964m542
$$ 1017292 1000349 985437 972861 962775 954716 947745 941158 934891 929146 923879 918808 913844 909302
60922I09302l566k153o56O51J761K738L325L112K175J106J71j085k988m893n794
$$ 909302 905736 903583 902927 903578 905339 908077 911402 914514 916689 917795 917966 916881 913893 909000 903206
60907I03206n530m844m399m229m149m208m739o128q397j0791j2200j2283j1774
$$ 903206 897676 892832 888433 884204 880055 875847 871108 864980 856583 845792 833592 821309 809535
60894H09535j1253j0264q316o096m678l938k994j960j906l005m066m314m348m751
$$ 809535 798282 788018 779702 773606 768928 764990 761996 760036 758130 755125 751059 746745 742397 737646
60880G37646m986m527m047m359m874m334k775j590j643k361k835k994l282l788
$$ 737646 732660 728133 724086 719727 714853 710519 707744 706154 704511 702150 699315 696321 693039 689251
60866F89251m273m739n462o462p267p378o808o007n263m516l764l361l630m304
$$ 689251 684978 680239 674777 668315 661048 653670 646862 640855 635592 631076 627312 623951 620321 616017
60852F16017m744m600l976l070k060j312j126j310j469j777k900m923o944q059
$$ 616017 611273 606673 602697 599627 597567 596255 595129 593819 592350 590573 587673 582750 575806 567747
60838E67747q304q279q212p916p367o786o104m916l085j213j50o1j52M09J379
$$ 567747 559443 551164 542952 535036 527669 520883 514779 509863 506778 505565 505415 505354 505202 505611 506990
60823E06990J610N07j189k404l070l740m360m337l789l578l911l882k936j832
$$ 506990 508600 509107 507918 505514 502444 498704 494344 490007 486218 482640 478729 474847 471911 470079
60809D70079j515j779j875j772j988k502k821k837k825k687k077j235r21j350
$$ 470079 468564 466785 464910 463138 461150 458648 455827 452990 450165 447478 445401 444166 443245 441895
60795D41895j853j851j510j223r97p57p77j323k060k321j936j446j520k256l183
$$ 441895 440042 438191 436681 435458 434461 433704 432927 431604 429544 427223 425287 423841 422321 420065 416882
60780D16882l744l652k910j743o65k92p09j022r7K056M070M741M379M216M713
$$ 416882 413138 409486 406576 404833 404168 403876 403167 402145 402048 404104 408174 412915 417294 421510 426223
60765D26223N142M759L775K901K398J937J171J66o47p92j48Q94J754K239K562
$$ 426223 431365 436124 439899 442800 445198 447135 448306 448472 447825 447033 446885 447779 449533 451772 454334
60750D54334K839K812K268J474Q61M93R7m37r03j068q33k02N79Q05j57j959l320
$$ 454334 457173 459985 462253 463727 464588 465081 465178 464741 463838 462770 461937 461735 462314 463119 462962 461003 457683
60733D57683l453k997l056l651l841l269k649k557k618k347k087k412l126l572
$$ 457683 454230 451233 448177 444526 440685 437416 434767 432210 429592 427245 425158 422746 419620 416048
60719D16048l658l800m031l920l391k939k931l244l676m138m359l974l108k410
$$ 416048 412390 408590 404559 400639 397248 394309 391378 388134 384458 380320 375961 371987 368879 366469
60705C66469k286k487k587k468k135j502o28J69O75R63J131J178J277J747K614
$$ 366469 364183 361696 359109 356641 354506 353004 352376 352545 353220 354183 355314 356492 357769 359516 362130
60690C62130L557M341M957N265N049M499M084L792L160K249J838K204K523K041
$$ 362130 365687 370028 374985 380250 385299 389798 393882 397674 400834 403083 404921 407125 409648 411689
60676D11689J104L62l13j274k069k041j576j637k226k416j925j557j778j954j434
$$ 411689 412793 413155 412842 411568 409499 407458 405882 404245 402019 399603 397678 396121 394343 392389 390955
60661C90955o35l50n87o91l03L42Q56J055J002R80J276J761J887J312L67m14r60
$$ 390955 390320 389970 389383 388692 388389 388731 389587 390642 391644 392624 393900 395661 397548 398860 399227 398813 397853
60644C97853j661k752l991m868n008m367l272k199j442r77o39k80K09Q41J409
$$ 397853 396192 393440 389449 384581 379573 375206 371934 369735 368293 367316 366677 366397 366606 367447 368856
60629C68856J621J518J566K179L206M097M489M482M329M011L269J974M72o22j024
$$ 368856 370477 371995 373561 375740 378946 383043 387532 392014 396343 400354 403623 405597 406069 405447 404423
60614D04423j058j235j631j854j612j055n37k22n8L2M8n7l48p98j179j208r10
$$ 404423 403365 402130 400499 398645 397033 395978 395441 395219 395161 395193 395241 395184 394836 394038 392859 391651 390741
60597C90741n79l23J73J203K483L404L791M109M760N457N550M844L854L183K833
$$ 390741 390162 389839 390012 391215 393698 397102 400893 405002 409762 415219 420769 425613 429467 432650 435483
60582D35483K279J083o45k371l512l798l391k762k328k075j583n39Q31J947K496
$$ 435483 437762 438845 438200 435829 432317 428519 425128 422366 420038 417963 416380 415841 416672 418619 421115
60567D21115K764L297M293N474O455P057P265P117O801O716P145P847Q217P910
$$ 421115 423879 427176 431469 436943 443398 450455 457720 464837 471638 478354 485499 493346 501563 509473
60553E09473P156O394N813N417N320N721O635P899R406J1207J3394J6047J9208
$$ 509473 516629 523023 528836 534253 539573 545294 551929 559828 569234 580441 593835 609882 629090
60540F29090K2766K6369K9626L2269L3916L3807L1107K5549J7623Q220j639j0809
$$ 629090 651856 678225 707851 740120 774036 807843 838950 864499 882122 890342 888703 877894
60528H77894j8232k3410k6497k7891k7881k6761k4907k2560j9717j6397j2909
$$ 877894 859662 836252 809755 781864 753983 727222 702315 679755 660038 643641 630732
60517F30732r636o657l761q06K090M751P253R949J3136J6758K0576K4609K9073
$$ 630732 621096 614439 610678 609872 611962 616713 623966 633915 647051 663809 684385 708994 738067
60504G38067L3803L8035M1036M2589M2613M0680L6490L0578K3949J7237J0814
$$ 738067 771870 809905 850941 893530 936143 976823 1013313 1043891 1067840 1085077 1095891
60493A095891N537K545K132L586O067Q955J1151J1141Q219L000l713j1708k0587
$$ 1095891 1101428 1103973 1106105 1109691 1115758 1124713 1135864 1147005 1155224 1158224 1154511 1142803 1122216
60480A122216k9084l5998m1198m4915m6676m5944m3410m0514l7879l5107l2012
$$ 1122216 1093132 1057134 1015936 971021 924345 878401 834991 794477 756598 721491 689479
60469F89479k9064k6551k4239k2049k0296j8968j7519j5681j3814j2190j0515
$$ 689479 660415 633864 609625 587576 567280 548312 530793 515112 501298 489108 478593
60458D78593q596o890n926n518n032m215l358k784k533k491k581k706k622j980
$$ 478593 469997 463107 457181 451663 446631 442416 439058 436274 433741 431250 428669 425963 423341 421361
60444D21361o04J174K601L212L318L612M359N246N900O304O712P416Q413R112
$$ 421361 420757 421931 424532 427744 431062 434674 439033 444279 450179 456483 463195 470611 479024 488136
60430D88136Q651O906M918L743L191K372J307R84J759K729L079L148L614M337
$$ 488136 496787 503693 508611 512354 515545 517917 519224 520208 521967 524696 527775 530923 534537 538874
60416E38874M797N064N610O483P422Q536J0122J1977J3573J4907J6493J8484K0383
$$ 538874 543671 548735 554345 560828 568250 576786 586908 598885 612458 627365 643858 662342 682725
60403F82725K1733K2583K3167K3636K4220K5109K5937K5877K4679K3211K2534
$$ 682725 704458 727041 750208 773844 798064 823173 849110 874987 899666 922877 945411
60392I45411K2708K2822K2005J9945J6640J2314P686L825J402K73o4J11O60J290
$$ 945411 968119 990941 1012946 1032891 1049531 1061845 1069531 1073356 1074758 1075031 1074967 1075078 1075738 1077028
60378A077028J697J835J752J288L25p48j322j319j200j127o35O50K443M338O467
$$ 1077028 1078725 1080560 1082312 1083600 1083925 1083177 1081855 1080536 1079336 1078209 1077574 1078224 1080667 1085005 1091472
60363A091472R134J2030J4342J5450J5099J3080R341M378j022o512j2216j8024
$$ 1091472 1100606 1112636 1126978 1142428 1157527 1170607 1179948 1184326 1183304 1176792 1164576 1146552
60351A146552k3345k7654l0758l2452l2479l1140k9396k7950k6613k4854k2661
$$ 1146552 1123207 1095553 1064795 1032343 999864 968724 939328 911378 884765 859911 837250
60340H37250k0493j8679j7312j6382j5609j4400j2492j0431q909p826o534m833
$$ 837250 816757 798078 780766 764384 748775 734375 721883 711452 702543 694717 688183 683350
60328F83350l050j183J253M272P006Q698R607J0368J0881J0431Q774O494M270
$$ 683350 680300 679117 680370 684642 691648 700346 709953 720321 731202 741633 750407 756901 761171
60315G61171K208R7k083m092n682o683o990o632n824m853l866k874j927j281j283
$$ 761171 763379 763476 761393 757301 751619 744936 737946 731314 725490 720637 716771 713897 711970 710689 709406
60300G09406k002l016l770m253n064o583q314r370r493r128q579p645o222m731
$$ 709406 707404 704388 700618 696365 691301 684718 676404 667034 657541 648413 639834 632189 625967 621236
60286F21236l577k650j757j204j394k014k245j748j018o20m32J75J642L769N849
$$ 621236 617659 615009 613252 612048 610654 608640 606395 604647 603629 603009 602577 602752 604394 608163 614012
60271F14012P244P967Q561R328R959J0141J0205J0652J1284J1467J1075J0572
$$ 614012 621256 629223 637784 647112 657071 667212 677417 688069 699353 710820 721895 732467
60259G32467J0094R230P859O435N148L458R49j866m093n442o180o484o273n429
$$ 732467 742561 751791 759650 766085 771233 774691 775640 773774 769681 764239 758059 751575 745302 739873
60245G39873l832j453J256L478M994O679R412J2775J5458J6807J7380J7938J8536
$$ 739873 736041 734588 735844 739322 744316 750995 760407 773182 788640 805447 822827 840765 859301
60232H59301J8736J8361J7793J7640J8156J8967J9573K0162K1482K3707K5877
$$ 859301 878037 896398 914191 931831 949987 968954 988527 1008689 1030171 1053878 1079755
60221A079755K6995K7309K7959K9577L1890L4446L7146L9992M2884M5736M8383
$$ 1079755 1106750 1134059 1162018 1191595 1223485 1257931 1295077 1335069 1377953 1423689 1472072
60210A472072N0489N1949N3202N4634N5809N5841N4374N1499M6901M0031L1373
$$ 1472072 1522561 1574510 1627712 1682346 1738155 1793996 1848370 1899869 1946770 1986801 2018174
60199B018174K2653J5360R568M504k32m335p194q272p514n684l917k644j368L00
$$ 2018174 2040827 2056187 2065755 2070259 2070027 2065692 2058498 2050226 2042712 2037028 2033111 2030467 2029099 2029399
60185B029399J852K565K496K333K451K609K482K153K123K962M794O986Q543Q909
$$ 2029399 2031251 2033816 2036312 2038645 2041096 2043705 2046187 2048340 2050463 2053425 2058219 2065205 2073748 2082657
60171B082657Q157O360L291r63n659j0131j4488j9035k3235k6017k7141k7636
$$ 2082657 2090814 2097174 2100465 2099502 2093843 2083712 2069224 2050189 2026954 2000937 1973796 1946160
60159A946160k8610l0125l1507l2474l3452l4858l6545l8151l9737m1586m3414
$$ 1946160 1917550 1887425 1855918 1823444 1789992 1755134 1718589 1680438 1640701 1599115 1555701
60148A555701m4196m3146m0662l7899l5465l2947k9740k6003k2515j9849j7994
$$ 1555701 1511505 1468359 1427697 1389798 1354333 1321386 1291646 1265643 1243128 1223279 1205285
60137A205285j6696j5864j5495j5395j5192j4811j4680j5261j6412j7513j8283
$$ 1205285 1188589 1172725 1157230 1141835 1126643 1111832 1097152 1081891 1065479 1047966 1029683
60126A029683j9006j9813k0192j9604j8192j6420j4362j1884r308p244n754m299
$$ 1029683 1010677 990864 970672 951068 932876 916456 902094 890210 880902 873658 867904 863605
60114H63605k525p02P57J737K358K858L522M396N118N377N422N682O103O315O335
$$ 863605 861080 860378 861135 862872 865230 868088 871610 876006 881124 886501 891923 897605 903708 910023 916358
60099I16358O367O161N248L857K791K388K309K357K613K726K039O78m62j128k121
$$ 916358 922725 928886 934134 937991 940782 943170 945479 947836 950449 953175 955214 955892 955430 954302 952181
60084I52181l828n438o275o892q064r506j0548j1342j2382j3323j3397j2573j1362
$$ 952181 948353 942915 936640 929748 921684 912178 901630 890288 877906 864583 851186 838613 827251
60071H27251r818p768n749m588m085l204j597Q1J512L263N647P892R056R134Q731
$$ 827251 817433 809665 803916 799328 795243 792039 790442 790523 792035 795298 800945 808837 817893 827027 835758
60056H35758Q051O808M849K389k47k780m980o693p940q853r506r870r816r211
$$ 835758 843809 850617 855466 857855 857608 854828 849848 843155 835215 826362 816856 806986 797170 787959
60042G87959q060o495m620k524m94J118K390L861N737P424Q251Q445Q861R852
$$ 787959 779899 773404 768784 766260 765766 766884 769274 773135 778872 786296 794547 802992 811853 821705
60028H21705J0959J1735J2361J3365J5017J7095J8968J9849J9168J6830J3053
$$ 821705 832664 844399 856760 870125 885142 902237 921205 941054 960222 977052 990105
60017I90105Q126K457l353q794j3673j7812k0731k2019k1883k0939j9610j8013
$$ 990105 998231 1000688 997335 988541 974868 957056 936325 914306 892423 871484 851874 833861
60005H33861j6256j4371j2151r555p138n510m423l084j346N8O65R71J665K710
$$ 833861 817605 803234 791083 781528 774390 768880 764457 761373 760027 760085 760750 761721 763386 766096
59991G66096L584L998M021L811L664M012M993O180P077P731Q539R648J0919J2351
$$ 766096 769680 773678 777699 781510 785174 789186 794179 800359 807436 815167 823706 833354 844273 856624
59977H56624J4069J5891J7227J7700J7560J7288J6907J5906J3921J1213Q298N198
$$ 856624 870693 886584 903811 921511 939071 956359 973266 989172 1003093 1014306 1022604 1027802
59965A027802J360l449q374j1960j3459j3448j2976j2390j1281r414p180n003
$$ 1027802 1029162 1025713 1017339 1005379 991920 978472 965496 953106 941825 932411 925231 920228
59953I20228k704R9L198N970Q336J0970J4253J7584K0197K2292K4671K7457K9944
$$ 920228 917524 917623 920821 926791 935127 946097 960350 977934 998131 1020423 1045094 1072551 1102495
59940A102495L1733L3295L5135L7017L8388L9091L9214L8466L6103L1434K4281
$$ 1102495 1134228 1167523 1202658 1239675 1278063 1317154 1356368 1394834 1430937 1462371 1486652
59929A486652J5298N931k295q752j3840j7987k0921k2105k1510j9686j7331j4926
$$ 1486652 1501950 1507881 1505586 1496834 1482994 1465007 1444086 1421981 1400471 1380785 1363454 1348528
59917A348528j2521r754o506l564j993j780j918k097l306o063r115j0954j1847
$$ 1348528 1336007 1326253 1319747 1316183 1314190 1312410 1310492 1308395 1305089 1299026 1289911 1278957 1267110
59904A267110j3098j4728j5306j3956j1230p867m009l3L050M685N546O576P881
$$ 1267110 1254012 1239284 1223978 1210022 1198792 1190925 1186916 1186883 1189933 1194618 1200164 1206740 1214621
59891A214621R053J0076J1235J2516J3634J4466J5082J5561J6101J7057J8534
$$ 1214621 1223674 1233750 1244985 1257501 1271135 1285601 1300683 1316244 1332345 1349402 1367936
59880A367936K0174K1732K3762K7344L3046M0306M7999N5570O3541P2708Q2831
$$ 1367936 1388110 1409842 1433604 1460948 1493994 1534300 1582299 1637869 1701410 1774118 1856949
59869A856949R2379R9687J03931J04482R9740Q7461O6690L9142Q715k0094m3664
$$ 1856949 1949328 2049015 2152946 2257428 2357168 2444629 2511319 2550461 2559176 2539082 2495418
59858B495418o0155o9627p3314p2691o9147o4001n8088n1281m2988l3253k2937
$$ 2495418 2435263 2365636 2292322 2219631 2150484 2086483 2028395 1977114 1934126 1900873 1877936
59847A877936j2864l290N696J3857K0965K6867L1427L5000L8961M4976N3466O3498
$$ 1877936 1865072 1861782 1867478 1881335 1902300 1929167 1960594 1995594 2034555 2079531 2132997 2196495
59835B196495P4328Q6240R9501J13461J27483J42099J58162J74950J89805J99555
$$ 2196495 2270823 2357063 2456564 2570025 2697508 2839607 2997769 3172719 3362524 3562079
59825C562079K01746J94768J77831J51429J17656P9904M2158Q206j9206l8998
$$ 3562079 3763825 3958593 4136424 4287853 4405509 4485413 4527571 4535777 4516571 4477573
59815D477573n1796n9534o4943p0814p8937q9379j00765j11356j19956j26071
$$ 4477573 4425777 4366243 4301300 4230486 4151549 4062170 3961405 3850049 3730093 3604022
59805C604022j29521j30148j28041j24078j19924j17009j15371j13768j10983
$$ 3604022 3474501 3344353 3216312 3092234 2972310 2855301 2739930 2626162 2515179
59796B515179j06753j01468r5410q8597q1026p2826o4280n5850m7939m0568l3523
$$ 2515179 2408426 2306958 2211548 2122951 2041925 1969099 1904819 1848969 1801030 1760462 1726939
59785A726939k6808k0613j4774q744k328L949R442J3936J7342J9459K0331K0467
$$ 1726939 1700131 1679518 1664744 1656000 1653672 1657621 1667063 1680999 1698341 1717800 1738131 1758598
59773A758598K0191J9193J7242J4943J3123J1661R587O229J748l391q801j3958
$$ 1758598 1778789 1797982 1815224 1830167 1843290 1854951 1864538 1870767 1872515 1869124 1860323 1846365
59761A846365j8158k0819k1576k0152j6664j2038p477l393N56M225O489O485M812
$$ 1846365 1828207 1807388 1785812 1765660 1748996 1736958 1729481 1726088 1726644 1730869 1737358 1743843 1748655
59748A748655K812R74j324m501p953j0755j2749j4526j6468j8228j9152j9048
$$ 1748655 1751467 1752441 1751117 1746616 1738663 1727908 1715159 1700633 1684165 1665937 1646785 1627737
59736A627737j8417j7929j7796j7680j7226j6568j6151j6189j6468j6768j7213
$$ 1627737 1609320 1591391 1573595 1555915 1538689 1522121 1505970 1489781 1473313 1456545 1439332
59725A439332j7950j8654j8666j7670j6001j4184j2377j0439q278n976l604j149
$$ 1439332 1421382 1402728 1384062 1366392 1350391 1336207 1323830 1313391 1305113 1299137 1295533 1294384
59713A294384J409M036O624Q956J0784J2069J3089J4184J5470J6819J7958J8415
$$ 1294384 1295793 1299829 1306453 1315409 1326193 1338262 1351351 1365535 1381005 1397824 1415782 1434197
59701A434197J7647J5580J2917J0649R203Q327P707P420P757Q822J0449J2298
$$ 1434197 1451844 1467424 1480341 1490990 1500193 1508520 1516227 1523647 1531404 1540226 1550675 1562973
59689A562973J3969J5164J5780J5817J5261J4252J3263J2889J3374J4520J5953
$$ 1562973 1576942 1592106 1607886 1623703 1638964 1653216 1666479 1679368 1692742 1707262 1723215
59678A723215J7383J8638J9758K1021K2562K3931K4383K3758K2789K2294K2112
$$ 1723215 1740598 1759236 1778994 1800015 1822577 1846508 1870891 1894649 1917438 1939732 1961844
59667A961844K1059J7924J2515N718j352q123j4447j9951k3987k6405k7925k9387
$$ 1961844 1982903 2000827 2013342 2019060 2017708 2009585 1995138 1975187 1951200 1924795 1896870 1867483
59655A867483l0823l1686l1755l1325l0576k9337k7601k5838k4504k3514k2459
$$ 1867483 1836660 1804974 1773219 1741894 1711318 1681981 1654380 1628542 1604038 1580524 1558065
59644A558065k1191k0076j9767k0780k3165k6474l0028l3282l5914l7742l8682
$$ 1558065 1536874 1516798 1497031 1476251 1453086 1426612 1396584 1363302 1327388 1289646 1250964
59633A250964l8683l7613l5363l2132k8381k4267j9475j3831p843k276K678P391
$$ 1250964 1212281 1174668 1139305 1107173 1078792 1054525 1035050 1021219 1013376 1011100 1013778 1021169
59621A021169J2166J6927K1309K4648K6074K5130K2270J8376J3950R202M623Q77
$$ 1021169 1033335 1050262 1071571 1096219 1122293 1147423 1169693 1188069 1202019 1211221 1215844 1216721
59609A216721j866l855n084n236m358l080k040j563j771k477k895k100L1K724
$$ 1216721 1214855 1211000 1205916 1200680 1196322 1193242 1191202 1189639 1187868 1185391 1182496 1180396 1180427 1183151
59595A183151N162P043Q308Q814Q390O816L777o76n697j0167j3641j6270j8042
$$ 1183151 1188313 1195356 1203664 1212478 1220868 1227684 1231461 1230785 1225088 1214921 1201280 1185010 1166968
59582A166968j8731j8528j7880j6730j4680j1950r340p089m633j768Q45K644L908
$$ 1166968 1148237 1129709 1111829 1095099 1080419 1068469 1059129 1052040 1047407 1045639 1046484 1049128 1053036
59569A053036N217O767Q473J0135J1314J1762J2130J3464J5834J8336K0583K3064
$$ 1053036 1058253 1065020 1073493 1083628 1094942 1106704 1118834 1132298 1148132 1166468 1187051 1210115
59557A210115K5742K7582K8114K8265K8800K9080K8290K6992K6258K6077K5844
$$ 1210115 1235857 1263439 1291553 1319818 1348618 1377698 1405988 1432980 1459238 1485315 1511159
59546A511159K5803K6606K7628K6960K3200J6631Q829J747l222o169q527j1469
$$ 1511159 1536962 1563568 1591196 1618156 1641356 1657987 1666816 1668563 1665341 1659172 1650645 1639176
59534A639176j4748j7660k0436k3658k6972k9515l1357l3237l5122l6213l6385
$$ 1639176 1624428 1606768 1586332 1562674 1535702 1506187 1474830 1441593 1406471 1370258 1333873
59523A333873l6310l6059l4869l2585l0180k8312k6475k4196k2109k0971k0312
$$ 1333873 1297563 1261504 1226635 1194050 1163870 1135558 1109083 1084887 1062778 1041807 1021495
59512A021495j8988j6775j4498j2804j1477j0077q579p152n685l958k105o17K82
$$ 1021495 1002507 985732 971234 958430 946953 936876 928297 921145 915460 911502 909397 908780 909062
59499I09062R65J967L359M767N915O716O980O511N609M945M747M650M500M734
$$ 909062 910027 911994 915353 920120 926035 932751 939731 946242 951851 956796 961543 966193 970693 975427
59485I75427N585O568P157P462P660P371O227M589K998J365m80j888k044j340
$$ 975427 981012 987580 994737 1002199 1009859 1017230 1023457 1028046 1031044 1032409 1031929 1030041 1027997 1026657
59471A026657j132k036l284l840l511k866k690l499n039o228o198n396n005n444
$$ 1026657 1025525 1023489 1020205 1016365 1012854 1009988 1007298 1003799 998760 992532 986334 980938 975933 970489
59457I70489o128o700p481q517r096q719p789o811n571l766j925q19k07J007L243
$$ 970489 964361 957661 950180 941663 932567 923848 916059 909248 903677 899911 897986 897167 896960 897967 901210
59442I01210N546O730O778O567O478N988M739L351K560K029Q79p10j347j51K138
$$ 901210 906756 913486 920264 926831 933309 939297 944036 947387 949947 951976 952855 952145 950798 950647 952785
59427I52785M174N488O419P312Q467J0380J3216J6170J7997J7939J5776J1458
$$ 952785 956959 962447 968866 976178 984645 995025 1008241 1024411 1042408 1060347 1076123 1087581
59415A087581N602l4l463m066k749o09K007N304R437J3911J7138J6974J2637N948
$$ 1087581 1093183 1093149 1089686 1085620 1082871 1082262 1084269 1089573 1099010 1112921 1130059 1147033 1159670 1165618
59401A165618j4l447m553m244l147j637K89L299P893J3233J7828K1488K5453L0193
$$ 1165618 1165604 1162157 1157604 1153360 1150213 1148576 1148865 1152164 1160057 1173290 1191118 1212606 1238059 1268252
59387A268252L4316L6445L7190L8296M0407M2659M4221M5257M6311M7488M8391
$$ 1268252 1302568 1339013 1376203 1414499 1454906 1497565 1541786 1587043 1633354 1680842 1729233
59376A729233M8395M6741M2634L5592K5802J4134J810r915j9925k7360l1928l4109
$$ 1729233 1777628 1824369 1867003 1902595 1928397 1942531 1944341 1934426 1914501 1887141 1855213 1821104
59364A821104l4815l4701l3939l2612l0838k8489k5315k1647j8419j6049j3894
$$ 1821104 1786289 1751588 1717649 1685037 1654199 1625710 1600395 1578748 1560329 1544280 1530386
59353A530386j1307q753p223o981p605q802j0423j1889j2582j2652j2699j2794
$$ 1530386 1519079 1510326 1503103 1496122 1488517 1479715 1469292 1457403 1444821 1432169 1419470 1406676
59341A406676j2497j1753j0909r919q430o637n226m334l306j626N61L011N730
$$ 1406676 1394179 1382426 1371517 1361598 1353168 1346531 1341305 1336971 1333665 1332039 1332600 1335611 1341341
59328A341341Q563J0976J2465J2780J1718R112M981o35p745j5720k2985k8090
$$ 1341341 1349904 1360880 1373345 1386125 1397843 1406955 1411936 1411301 1403556 1387836 1364851 1336761
59316A336761l0926l2111l1633k9072k4835j9963j4778r006l333N11J644R32l07
$$ 1336761 1305835 1273724 1242091 1213019 1188184 1168221 1153443 1144437 1141104 1141615 1143259 1144191 1143884
59303A143884j432j934j049J396M554P663J0889J4508J8002K0627K2262K3141
$$ 1143884 1142452 1140518 1139469 1140865 1145419 1153082 1163971 1178479 1196481 1217108 1239370 1262511
59291A262511K3171K2051J9686J6184J1877P462L651N12k189l975l822j507K025
$$ 1262511 1285682 1307733 1327419 1343603 1355480 1362942 1366593 1367105 1364916 1360941 1357119 1355612 1357637
59278A357637N898R953J3932J7019J8717J9274J8800J6823J3256Q876M202j255
$$ 1357637 1363535 1373488 1387420 1404439 1423156 1442430 1461230 1478053 1491309 1500185 1504387 1503132
59266A503132p854j4803k1003k6307l1079l5105l7750l8820l8666l7792l6743
$$ 1503132 1495278 1480475 1459472 1433165 1402086 1366981 1329231 1290411 1251745 1213953 1177210
59255A177210l5858l4676l2273k8740k5549k3817k2891k1444j9255j7026j5063
$$ 1177210 1141352 1106676 1074403 1045663 1020114 996297 973406 951962 932707 915681 900618
59244I00618j3157j1460j0404r882r320q459p435o288m998l898l358l145k577
$$ 900618 887461 876001 865597 855715 846395 837936 830501 824213 819215 815317 811959 808814 806237
59231H06237j378O2J152J592J509J325J303J166M70n91j298j388j299j261r86
$$ 806237 804859 804921 806073 807665 809174 810499 811802 812968 813438 812847 811549 810161 808862 807601 806615
59216H06615m86l28n76l88O70J785K091K064K801M494O482Q337J0069J1658J3221
$$ 806615 806129 805801 805225 804837 805507 807292 809383 811447 814248 818742 825224 833561 843630 855288 868509
59201H68509J5300J8152K1075K3105K4162K4812K5264K5243K4658K3596K1896
$$ 868509 883809 901961 923036 946141 970303 995115 1020379 1045622 1070280 1093876 1115772
59190A115772J9281J5794J1640O843J528l832q776j3082j6295j7774j7634j6932
$$ 1115772 1135053 1150847 1162487 1169330 1170858 1167026 1158250 1145168 1128873 1111099 1093465 1076533
59178A076533j6186j4505j1001o323j768K505P280J2759J8421K4097L0110L6509
$$ 1076533 1060347 1045842 1034841 1028518 1026750 1029255 1036535 1049294 1067715 1091812 1121922 1158431
59166A158431M3091M9954N7111O3846O9407P3887P7335P8328P4774O6134N3653
$$ 1158431 1201522 1251476 1308587 1372433 1441840 1515727 1593062 1671390 1746164 1812298 1865951
59155A865951L8568K1417L265j3847k8201l9188m6505m9689m9014m5853m1535
$$ 1865951 1904519 1925936 1929201 1915354 1887153 1847965 1801460 1751771 1702757 1656904 1615369
59144A615369l6429l0601k4610j9049j3900q900m086N19N337J0822J6851K2824
$$ 1615369 1578940 1548339 1523729 1504680 1490780 1481880 1477794 1478313 1483650 1494472 1511323 1534147
59132A534147K8131L2227L4651L5380L4996L4206L3259L1887K9622K6076K1185
$$ 1534147 1562278 1594505 1629156 1664536 1699532 1733738 1766997 1798884 1828506 1854582 1875767
59121A875767J5394R411L704j695o859j1709j6124k0054k3455k6193k8186k9533
$$ 1875767 1891161 1900572 1904276 1902581 1895722 1884013 1867889 1847835 1824380 1798187 1770001 1740468
59109A740468l0456l1027l0982k9968k8099k6020k4101k1865j8930j6202j5181
$$ 1740468 1710012 1678985 1648003 1618035 1589936 1563916 1539815 1517950 1499020 1482818 1467637
59098A467637j5952j7051j7670j8812k1340k4033k4931k3942k2673k1928k0860
$$ 1467637 1451685 1434634 1416964 1398152 1376812 1352779 1327848 1303906 1281233 1259305 1238445
59087A238445j8703j6044j3877j2357j0973r391p666o012m665l687k857k007j399
$$ 1238445 1219742 1203698 1189821 1177464 1166491 1157100 1149434 1143422 1138757 1135070 1132213 1130206 1128807
59074A128807j362j708k004k324l100m309n417o233p207q589r797r935q718o628
$$ 1128807 1127445 1125737 1123733 1121409 1118309 1114000 1108583 1102350 1095143 1086554 1076757 1066822 1058104 1051476
59060A051476m385k364m82J469L436N197O695P972Q733Q425O913M540J473k367
$$ 1051476 1047091 1044727 1044245 1045714 1049150 1054347 1061042 1069014 1077747 1086172 1093085 1097625 1099098 1096731
59046A096731o506r815j1791j3162j4615j5548j4955j3016j0936r450q321p065
$$ 1096731 1090225 1080410 1068619 1055457 1040842 1025294 1010339 997323 986387 976937 968616 961551
59034I61551n414l310j104M09Q00O15N51M83Kn46m63J20M31K91L30J070K444M176
$$ 961551 956137 952827 951723 952132 952932 953547 954098 954581 954583 954037 953574 953694 954125 954416 954746 955816 958260 962436
59016I62436N909P204Q039R092J0853J2761J4000J4727J5635J6608J6939J6674
$$ 962436 968345 975549 983588 992680 1003533 1016294 1030294 1045021 1060656 1077264 1094203 1110877
59004A110877J6671J7344J8322J9369K0651K2087K3387K4916K7583L1648L6429
$$ 1110877 1127548 1144892 1163214 1182583 1203234 1225321 1248708 1273624 1301207 1332855 1369284
58993A369284M1346M6577N2533N9362O7140P5901Q5321R4823J03933J12069J18041
$$ 1369284 1410630 1457207 1509740 1569102 1636242 1712143 1797464 1892287 1996220 2108289 2226330
58982B226330J20319J17666J09222R4413P3626M8664K1895m847l0009n1705o8588
$$ 2226330 2346649 2464315 2573537 2667950 2741576 2790240 2812135 2807288 2777279 2725574 2656986
58971B656986q0986r0203r6768j00266j00557r8125r3465q7173q0294p3579o6682
$$ 2656986 2576000 2485797 2389029 2288763 2188206 2090081 1996616 1909443 1829149 1755570 1688888
58960A688888n9093n1494m4961l9305l3597k7973k3404j9913j6780j4304j3574
$$ 1688888 1629795 1578301 1533340 1494035 1460438 1432465 1409061 1389148 1372368 1358064 1344490
58949A344490j4303j4748j4112j3289j2772j1605r112o066l263l39L064O160Q061
$$ 1344490 1330187 1315439 1301327 1288038 1275266 1263661 1254549 1248483 1245220 1244881 1247945 1254105 1262166
58936A262166R011R845J1037J2892J5664J8909K1699K4058K7166L1655L6784M1875
$$ 1262166 1271177 1281022 1292059 1304951 1320615 1339524 1361223 1385281 1412447 1444102 1480886 1522761
58924A522761M7377N3681O0049O5582P0276P4063P5570P2808O4674N1199L3207
$$ 1522761 1570138 1623819 1683868 1749450 1819726 1893789 1969359 2042167 2106841 2158040 2191247
58913B191247J2531q021k5802l9352m8224n2440n2531m9372m3671l6091k7806
$$ 2191247 2203778 2195757 2169955 2130603 2082379 2029939 1977408 1928036 1884365 1848274 1820468
58902A820468j9915j2248l941M699J2164J7924K3083K8332L2831L6009L8968M2999
$$ 1820468 1800553 1788305 1784364 1789063 1801227 1819151 1842234 1870566 1903397 1939406 1978374 2021373
58890B021373M7676N1527N3475N2655M7834L8362K5060R316p852k5072m0010n0833
$$ 2021373 2069049 2120576 2174051 2226706 2274540 2312902 2337962 2347278 2339426 2314354 2274344 2223511
58878B223511n7621o1424o2687o1516n8640n4885n0317m4988l9865l5869l2573
$$ 2223511 2165890 2104466 2041779 1980263 1921623 1866738 1816421 1771433 1731568 1695699 1663126
58867A663126k8900k4693k0704j7586j5836j6051j8127k0653k2267k3189k4569
$$ 1663126 1634226 1609533 1588829 1571243 1555407 1539356 1521229 1500576 1478309 1455120 1430551
58856A430551k6655k8649k9828k9928k8829k6916k5357k4941k4961k4162k2515
$$ 1430551 1403896 1375247 1345419 1315491 1286662 1259746 1234389 1209448 1184487 1160325 1137810
58845A137810k1053k0298j9848j9338j8758j7910j6487j4740j3286j2264j1300
$$ 1137810 1116757 1096459 1076611 1057273 1038515 1020605 1004118 989378 976092 963828 952528
58834I52528j0192q953p301m865j863J013L442N761Q441J1566J4788J7616J9946
$$ 952528 942336 933383 926082 921217 919354 920367 923809 929570 938011 949577 964365 981981 1001927
58821A001927K2369K5494K8906L1321L1908L0738K7801K2563J5001O215k586j0957
$$ 1001927 1024296 1049790 1078696 1110017 1141925 1172663 1200464 1223027 1238028 1244243 1241657 1230700
58809A230700j8549k4453k7947k9303k9220k8151k6538k4852k2840j9692j5616
$$ 1230700 1212151 1187698 1159751 1130448 1101228 1073077 1046539 1021687 998847 979155 963539
58798I63539j2123j0042q387o092l702k194j184J87J515J791J267J171J967L171
$$ 963539 951416 941374 932987 926895 923193 920999 919815 920002 921517 923308 924575 925746 927713 930884
58784I30884M486N906O956P086O625O283N972N115L779K402P59j649m374o274
$$ 930884 935370 941276 948232 955318 961943 968226 974198 979313 983092 985494 986253 984604 980230 973956
58770I73956o920o808o387n732m977m198l045j346K46R85J153J624K601L530L908
$$ 973956 967036 960228 953841 948109 943132 938934 935889 934543 934789 935774 936927 938551 941152 944682 948590
58755I48590L535K433J218J009K168L712M683N324O112O624O543O847Q521J0776
$$ 948590 952125 954558 955776 956785 958953 962665 967348 972672 978784 985408 991951 998798 1007319 1018095
58741A018095J2037J2146J2158J2474J2736J3101J4002J4940J5151J5366J7248
$$ 1018095 1030132 1042278 1054436 1066910 1079646 1092747 1106749 1121689 1136840 1152206 1169454
58730A169454K1028K5322K9373L4109M0590M8685N7464O5770P2161P5288P4537
$$ 1169454 1190482 1215804 1245177 1279286 1319876 1368561 1426025 1491795 1563956 1639244 1713781
58719A713781O9525N9290M3208K2641N38k0575l9254n4238o4530p0493p3480p4095
$$ 1713781 1783306 1842596 1885804 1908445 1908983 1888408 1849154 1794916 1730386 1659893 1586413 1512318
58707A512318p1931o7147o1002n4508m7657m0251l2518k4690j6872r488k978K973
$$ 1512318 1440387 1373240 1312238 1257730 1210073 1169822 1137304 1112614 1095742 1086254 1083276 1086249
58695A086249R044J5088K0276K4272K7234K8713K7643K3336J5590M112j0639k6143
$$ 1086249 1095293 1110381 1130657 1154929 1182163 1210876 1238519 1261855 1277445 1281557 1270918 1244775
58683A244775l8834m6843n0748n1669n0057m6495m2152l7740l3054k7949k2911
$$ 1244775 1205941 1159098 1108350 1056681 1006624 960129 917977 880237 847183 819234 796323
58672G96323j8342j4240j0777q321o696n366m440m473n228n768n898o357p400
$$ 796323 777981 763741 752964 744643 737947 732581 728141 723668 718440 712672 706774 700417 693017
58659F93017q358q857r263r632r360q301p164o374n579m555l683l085k366j464
$$ 693017 684659 675802 666539 656907 647547 639246 632082 625708 620129 615574 611891 608806 606440 604976
58645F04976q80o56j23R42J864K143K132K283K521K687K782K637K099J707K172
$$ 604976 604096 603440 603317 604259 606123 608266 610398 612681 615202 617889 620671 623308 625407 627114 629286
58630F29286L082L104J703k76j962l362m618n490n929o281o502o050m862l614
$$ 629286 632368 635472 637175 636899 634937 631575 626957 621467 615538 609257 602755 596705 591843 588229
58616E88229k737k009j374j213j511j589j081m26j20j44l49o91r65r15o46l19
$$ 588229 585492 583483 582109 580896 579385 577796 576715 576289 576169 576025 575676 574985 574020 573105 572459 572140
58600E72140L36J469K424K602K687L879O088Q131R493J0654J1774J2440J2651
$$ 572140 572476 573945 576369 578971 581658 585537 591625 599756 609249 619903 631677 644117 656768
58587F56768J2708J2247J0743Q923Q090Q085P580O444O063O999Q178Q892R833
$$ 656768 669476 681723 692466 701389 709479 717564 725144 731588 737651 744650 752828 761720 771553
58574G71553J1522J3299J4628J5897J7131J7351J6007J3861J1721R436O762M060
$$ 771553 783075 796374 811002 826899 844030 861381 877388 891249 902970 912406 919168 923228
58562I23228J567r04l085m266m586n033n824o153o004o652q783j1493j3782j5627
$$ 923228 924795 923891 920806 916540 911954 906921 901097 894944 888940 882288 873505 862012 848230 832603
58548H32603j7056j7632j7508j7488j7445j6206j3708j1602j0872j0516r483q331
$$ 832603 815547 797915 780407 762919 745474 729268 715560 703958 693086 682570 673087 664756
58536F64756p902p802p407o983o791o368n690n659o415o605n406l802k714j439
$$ 664756 656854 649052 641645 634662 627871 621503 615813 610154 603739 597134 591728 587926 585212 583773
58522E83773P13K779L815M776O952R636J1150J1409J1636J2177J2298J1792J1182
$$ 583773 584486 587265 591080 595856 602808 612444 623594 635003 646639 658816 671114 682906 694088
58509F94088J0492R179P261N582M985N793P819J0242J2046J3119J4529J7193K0922
$$ 694088 704580 713759 721020 726602 731587 737380 745199 755441 767487 780606 795135 812328 833250
58496H33250K4929K8421L0294K9452K6051K1522J6910J2233P723M155J302k312
$$ 833250 858179 886600 916894 946346 972397 993919 1010829 1023062 1030785 1034940 1036242 1033930
58484A033930p189j1853j5055j7445j9924k1853k2274k1584k0528j8755j5870
$$ 1033930 1026741 1014888 999833 982388 962464 940611 918337 896753 876225 857470 841600
58473H41600j2822j0677q897o368l255m29K171N151Q301J0986J3234J5118J5701
$$ 841600 828778 818101 809204 802836 799581 799152 801323 806474 814775 825761 838995 854113 869814
58460H69814J3883R827M472j767q667j5153j9839k2307k3057k2644k1586k0456
$$ 869814 883697 893524 897996 896229 887562 872409 852570 830263 807206 784562 762976 742520
58448G42520j9288j7493j5017j2756j1287j0125q783p490o234m397k112o18l56
$$ 742520 723232 705739 690722 677966 666679 656554 647771 640281 634047 629650 627538 626920 626564
58435F26564r5J085K350K698K565K652K552J843J236J268J124M5j312k111k619
$$ 626564 626469 627554 629904 632602 635167 637819 640371 642214 643450 644718 645842 645887 644575 642464 639845
58420F39845k997k358n10Q95N99k67o3R08J612K451M072N335M777L340L335N210
$$ 639845 636848 634490 633980 634875 635474 635207 635144 636052 637664 640115 644187 649522 654299 657639 660974 666184
58404F66184P245Q146Q176P963P792P841P938P474O445N814N949N812M766L838
$$ 666184 673429 681575 689751 697714 705506 713347 721285 728759 735204 741018 746967 752779 757545 761383
58390G61383L968M373M136L908M440M784L779K065R00K19l45N3J960L814L784
$$ 761383 765351 769724 773860 777768 782208 786992 790771 792836 793736 793955 793610 793663 795623 799437 803221
58375H03221K392J427J327J584K456M120N242M643L386L070L112K050M61J69J248
$$ 803221 805613 807040 808367 809951 812407 816527 821769 826412 829798 832868 835980 838030 838491 838660 839908
58360H39908K240K732L461M378M778M930N588O479O992P602Q806R689R419R032
$$ 839908 842148 844880 848341 852719 857497 862427 868015 874494 881486 889088 897894 907583 917002 926034
58346I26034R735J0561R986Q647Q125Q139P497O674O861P391O803N662N646O558
$$ 926034 935769 946330 956316 964963 973088 981227 988724 995398 1002259 1009650 1016453 1022115 1027761 1034319
58332A034319O943O954P894R500J0361J0656J1871J4191J6550J8794K1505K4164
$$ 1034319 1041262 1048216 1056110 1065610 1075971 1086627 1098498 1112689 1129239 1148033 1169538 1193702
58320A193702K5740K6487K7139K7217K6303K5819K7136K9145L0129L0689L1923
$$ 1193702 1219442 1245929 1273068 1300285 1326588 1352407 1379543 1408688 1438817 1469506 1501429
58309A501429L2217K9084K3144J7053J1434N200q60m385m968m349l400j688N56
$$ 1501429 1533646 1562730 1585874 1602927 1614361 1619561 1618701 1614316 1609348 1604999 1601599 1599911 1600467
58296A600467K755N541R387J2804J4531J6132J9458K3160K4929K5495K6799K7919
$$ 1600467 1603222 1608763 1618150 1630954 1645485 1661617 1681075 1704235 1729164 1754659 1781458 1809377
58284A809377K6863K4847K4565K5568K5697K5794K8350L2656L5996L8685M3014
$$ 1809377 1836240 1861087 1885652 1911220 1936917 1962711 1991061 2023717 2059713 2098398 2141412
58273B141412M8080N0759N1306N2834N5551N6551N5176N3656N2546N0358M7603
$$ 2141412 2189492 2240251 2291557 2344391 2399942 2456493 2511669 2565325 2617871 2668229 2715832
58262B715832M6403M6273M5039M3515M4344M6772M7808M8030N0791N6060O0694
$$ 2715832 2762235 2808508 2853547 2897062 2941406 2988178 3035986 3084016 3134807 3190867 3251561
58251C251561O4445O9826P6365Q1055Q4433R0092R8036J04751J09819J16194J23953
$$ 3251561 3316006 3385832 3462197 3543252 3627685 3717777 3815813 3920564 4030383 4146577 4270530
58240D270530J30288J35782J43941J54405J63479J71386J81875J94668K05925
$$ 4270530 4400818 4536600 4680541 4834946 4998425 5169811 5351686 5546354 5752279
58231E752279K16231K30274K48267K65894K83028L03998L28864L53505L78854
$$ 5752279 5968510 6198784 6447051 6712945 6995973 7299971 7628835 7982340 8361194
58222H361194M10542M48589M87439N27144N74095O29445O87732P48490Q17808
$$ 8361194 8771736 9220325 9707764 10234908 10809003 11438448 12126180 12874670 13692478
58213A3692478Q96784R80965J073702J187328J328489J495782J694923J941834
$$ 13692478 14589262 15570227 16643929 17831257 19159746 20655528 22350451 24292285
58205B4292285K247319K614702L057863L606184M287372N122868O143564P386255
$$ 24292285 26539604 29154306 32212169 35818353 40105725 45228593 51372157 58758412
58197E8758412Q866592J0584805J2576932J4930145J7708924K0872818K4297192
$$ 58758412 67625004 78209809 90786741 105716886 123425810 144298628 168595820
58190A68595820K7860573L1420936L4566630L6286722L4957448K8991017J7977137
$$ 168595820 196456393 227877329 262443959 298730681 333688129 362679146 380656283
58183C80656283L492269j1286437k3114748l0245620l2870850l2363734l0218779
$$ 380656283 384148552 372862115 349747367 319501747 286630897 254267163 224048384
58176B24048384k7481937k4710185k2106306j9655650j7285668j4997041j2865670
$$ 224048384 196566447 171856262 149749956 130094306 112808638 97811597 84945927
58169H4945927j0957323r288853p858810o663870n679103m859628m172665l605670
$$ 84945927 73988604 64699751 56840941 50177071 44497968 39638340 35465675 31860005
58161C1860005l141653k751456k414588k126534j881280j665058j470988j302928
$$ 31860005 28718352 25966896 23552308 21425774 19544494 17879436 16408448 15105520
58153A5105520j160623j035197r22070q24783p43384o71573o07523n55488n14576
$$ 15105520 13944897 12909700 11987630 11162847 10419463 9747890 9140367 8584879 8070303
58144H070303m77126m40113m07546l80005l52264l23068k97123k75518k53725
$$ 8070303 7593177 7153064 6745518 6365513 6013249 5690181 5393058 5117540 4863815
58135D863815k30903k11839j97651j83490j67507j53700j43809j34477j24503
$$ 4863815 4632912 4421073 4223422 4039932 3872425 3718725 3574916 3440439 3315936
58126C315936j17076j12773j07720j00791r5509r2962q9674q4374q0054p7546
$$ 3315936 3198860 3086087 2978367 2877576 2782067 2689105 2599431 2515057 2435003 2357457
58116B357457p3729o7986o3813o2079n9054n3209m7773m4523m1056l6368l3165
$$ 2357457 2283728 2215742 2151929 2089850 2030796 1977587 1929814 1885291 1844235 1807867 1774702
58105A774702l2332l0788k7126k3988k2572k0186j5648j1980j1221j1404j0913
$$ 1774702 1742370 1711582 1684456 1660468 1637896 1617710 1602062 1590082 1578861 1567457 1556544
58094A556544j1153j2570j2793j1071j0155j1385j2287j1319j0598j1602j2428
$$ 1556544 1545391 1532821 1520028 1508957 1498802 1487417 1475130 1463811 1453213 1441611 1429183
58083A429183j1800j1661j3202j4292j3489j2870j4211j5936j6399j6839j8440
$$ 1429183 1417383 1405722 1392520 1378228 1364739 1351869 1337658 1321722 1305323 1288484 1270044
58072A270044j9783j9761j9990k1778k3505k3555k3104k3721k4785k5393k6192
$$ 1270044 1250261 1230500 1210510 1188732 1165227 1141672 1118568 1094847 1070062 1044669 1018477
58061A018477k7277k6944k4692k2864k3120k3819k2982k1368k0401j9452j7491
$$ 1018477 991200 964256 939564 916700 893580 869761 846779 825411 805010 785558 768067
58050G68067j5304j3927j2724j0978r489q869q146o734n807o118o450n805n094
$$ 768067 752763 738836 726112 715134 705645 696776 688630 681896 676089 669971 663521 657716 652622
58037F52622n068m704l272j984j832j872j297j288k915n032n997n897n507m684
$$ 652622 647554 642850 639578 637594 635762 633890 632593 631305 628390 623358 617361 611464 605957 601273
58023F01273l340k422k431k430j749j075q28k32J001J989K601L987O163P478P612
$$ 601273 597933 595511 593080 590650 588901 587826 586998 586766 587767 589756 592357 596344 602507 609985 617597
58008F17597Q539J1065J3143J3413J3812J6472K0338K3260K5307K7478K8995K8543
$$ 617597 626136 637201 650344 663757 677569 694041 714379 737639 762946 790424 819419 847962
57996H47962K6851K5604K4943K4220K4151K6046K9810L4580M0371M7387N4823
$$ 847962 874813 900417 925360 949580 973731 999777 1029587 1064167 1104538 1151925 1206748
57985A206748O2042O9931P9333Q9288R8371J06462J13448J17545J16948J12104
$$ 1206748 1268790 1338721 1418054 1507342 1605713 1712175 1825623 1943168 2060116 2172220
57975B172220J04324R3176P7208N6482L2323N365k4135n4313q1945j04506j20728
$$ 2172220 2276544 2369720 2446928 2503410 2535733 2541098 2516963 2462650 2380705 2276199 2155471
57964B155471j29807j31717j28051j21230j12821j03441r3602q3696p3750o4142
$$ 2155471 2025664 1893947 1765896 1644666 1531845 1428404 1334802 1251106 1177356 1113214
57954A113214n5795m8883m2343l5562k9472k4955k1336j7699j4481j2386j0733
$$ 1113214 1057419 1008536 966193 930631 901159 876204 854868 837169 822688 810302 799569
57943G99569q391n588l494k621k651l020k853j308J066K547K655K943M416N949
$$ 799569 791178 785590 782096 779475 776824 773804 770951 769643 770709 773256 775911 778854 783270 789219
57929G89219O620P812J1051J5407J9167K2823K8109L5055M2182M8883N5326O0625
$$ 789219 795839 803651 814702 830109 849276 872099 900208 935263 977445 1026328 1081654 1142279
57917A142279O3105O2043N7263M7735L2714J3953n247k2957l8802n1738n9999
$$ 1142279 1205384 1267427 1324690 1372425 1405139 1419092 1413845 1390888 1352086 1300348 1240349
57906A240349o3428o3898o2947o0556n6510n1483m6347m1496l7092l3190k9556
$$ 1240349 1176921 1113023 1050076 989520 933010 881527 835180 793684 756592 723402 693846
57895F93846k6188k3680k2295k1134j9247j6986j5176j3612j1695r863q890q255
$$ 693846 667658 643978 621683 600549 581302 564316 549140 535528 523833 513970 505080 496825
57883D96825o832m807l425l006k741k176j471m25J273K958L688L863M717O301
$$ 496825 489993 485186 481761 478755 476014 473838 472367 471942 473215 476173 479861 483724 488441 494742
57869D94742P497P951Q473R416J0119J0128R635Q680P022N014L327J929L67j071
$$ 494742 502239 510190 518663 528079 538198 548326 557961 566641 573663 578677 582004 583933 584300 583229
57855E83229j758k105l151m848o171o891p728q736r037q384p546o882n962m793
$$ 583229 581471 579366 576215 571367 565196 558305 550577 541841 532804 524420 516874 509992 504030 499237
57841D99237l982l362j989Q3J436J338P66P17Q42O01N97J621L166L990L773L458
$$ 499237 495255 491893 489904 489987 491423 492761 493527 494244 495086 495687 496284 497905 501071 505061 508834 512292
57825E12292M045N561P067P547O831N673M719L823K785K140K437L247L907M819
$$ 512292 516337 521898 528965 536512 543343 549016 553735 557558 560343 562483 564920 568167 572074 576893
57811E76893O769R281J1144J2445J4625J8356K2804K7315L2380L8396M4821N1129
$$ 576893 583662 592943 604087 616532 631157 649513 672317 699632 732012 770408 815229 866358
57799H66358N7445O3489O7891O9139O6381N8835M5675K7392O535j3773l1457m5343
$$ 866358 923803 987292 1055183 1124322 1190703 1249538 1295213 1322605 1329140 1315367 1283910 1238567
57787A238567n4492n8765n9485n8550n6958n4669n1513m7709m3731m0099l7061
$$ 1238567 1184075 1125310 1065825 1007275 950317 895648 844135 796426 752695 712596 675535
57776F75535l4227l0914k7094k3599k1147j9570j8219j6656j4727j2462j0229
$$ 675535 641308 610394 583300 559701 538554 518984 500765 484109 469382 456920 446691
57765D46691q577p588o739n551m052k527j242m79l72n53l90L43J386K447L276
$$ 446691 438114 430526 423787 418236 414184 411657 410415 409936 409564 409011 408621 408964 410350 412797 416073
57750D16073L490L016K630L180M322M896M596M333M749N386N694N853O178O518
$$ 416073 419563 422579 425209 428389 432711 437607 442203 446536 451285 456671 462365 468218 474396 480914
57736D80914O834P603R062J0703J1992J2946J3471J2796J0298O444K238j849n796
$$ 480914 487748 495351 504413 515116 527108 540054 553525 566321 576619 583063 585301 583452 577656
57723E77656r236j1547j2600j2903j2940j2763j2247j1414j0407r406q497p668
$$ 577656 568420 556873 544273 531370 518430 505667 493420 482006 471599 462193 453696 446028
57711D46028o838n885m610k936j222p3M34Q97J613J945J231l8p66o65l33j43K8
$$ 446028 439190 433305 428695 425759 424537 424464 424898 425795 427408 429353 430584 430546 429780 429115 428782 428639 428667
57694D28667J32no9L61Q28M77m14n15O76K187L146L979N456P585R996J2628J5462
$$ 428667 428799 428794 428725 429086 429914 430391 429977 429462 430138 432325 435471 439450 444906 452491 462487 475115 490577
57677D90577J8361K1697K6353L2546L9438M6514N4496O3977P3504P9545P8003
$$ 490577 508938 530635 556988 589534 628972 675486 729982 793959 867463 947008 1025011
57666A025011O5791M2405J1382k0191m5106n9849o5440o5262o2404n8431n3657
$$ 1025011 1090802 1133207 1144589 1124398 1079292 1019443 954003 888741 826337 767906 714249
57655G14249m8223m2847l8327l4521l0610k6411k2627j9681j7170j4820j3029
$$ 714249 666026 623179 584852 550331 519721 493310 470683 451002 433832 419012 405983
57644D05983j1971j1129j0199r530r068p977o058m514m281m571m181l348l002
$$ 405983 394012 382883 372684 363154 354086 346109 340051 335537 331256 326685 322504 319156 316154
57631C16154k900k061o24K85L52K65J70o08k031k964k776k257k284k521k109j043
$$ 316154 313254 311193 310569 310854 311206 311471 311641 311033 309002 306038 303262 301005 298721 296200 294091 293048
57615B93048j56j2l53m81M8J047J891K184K135K155K281K291K176K055J869J507
$$ 293048 292892 292880 292527 292046 292094 293141 295032 297216 299351 301506 303787 306078 308254 310309 312178 313685
57599C13685J106P46K03n91j098q73l90m33r23j167j109j423k289l057l283l279
$$ 313685 314791 315537 315740 315149 314051 313178 312788 312355 311432 310265 309156 307733 305444 302387 299104 295825
57583B95825l310l062k318j479r47n81j76M7q0j87R3M21J46p72j732k235k253
$$ 295825 292515 289453 287135 285656 284709 284128 283952 283999 283919 283732 283825 284246 284392 283620 281888 279653 277400
57566B77400j978j603j350j398j667j832j632j074l51M32J386K631L939M737M733
$$ 277400 275422 273819 272469 271071 269404 267572 265940 264866 264515 264947 266333 268964 272903 277640 282373
57551B82373M355M307M724N076M955M562M336M329M067K879M07k851n555o495
$$ 282373 286728 291035 295759 300835 305790 310352 314688 319017 323084 325963 326370 323519 317964 311469
57537C11469n743m560m033m122m119l662k956k306j801j393j006o31l31k5O22
$$ 311469 305726 301166 297133 293011 288892 285230 282274 279968 278167 276774 275768 275137 274806 274781 275403
57522B75403J727K613K246O87m82K44K506M480M946M294L548L135K905K763K719
$$ 275403 277130 279743 281989 282676 282194 282438 284944 289424 294370 298664 302212 305347 308252 311015 313734
57507C13734K620K301J897J647J448R44Oj091k009k683l253l856m442m748m528
$$ 313734 316354 318655 320552 322199 323647 324591 324597 323506 321497 318814 315561 311705 307263 302515 297987
57492B97987l877l194k636j904q70j26l97j459k257k157j555j075p58l54J01M54
$$ 297987 294110 290916 288280 286376 285506 285380 284983 283524 281267 279110 277555 276480 275722 275368 275469 275923
57476B75923P87J101J036M05k69l54j7M7l70q23r44p48l01L50R41J290J737K582
$$ 275923 276710 277811 278847 279252 278983 278629 278612 278659 278289 277466 276522 275774 275473 275823 276764 278054 279791 282373
57458B82373L176K505Q12l21Q7J240J868J950K302L101L696L665L208K595J914
$$ 282373 285549 288054 288866 288545 288632 289872 291740 293690 295992 299093 302789 306454 309662 312257 314171
57443C14171J399J354J595J542R62L11J46M77Q66R18N53l2n37p81q00p55p25o54
$$ 314171 315570 316924 318519 320061 321023 321334 321480 321957 322823 323741 324294 324262 323725 322944 322144 321389 320664 320010
57425C20010m91l06k76m64n72j33Q85J820K048J804J826K236K405J999J469J237
$$ 320010 319519 319213 318937 318473 317901 317768 318653 320473 322521 324325 326151 328387 330792 332791 334260 335497
57409C35497J060O56L70O20J138J400J472J732K036J899J431J338J862K383K335
$$ 335497 336557 337213 337583 338203 339341 340741 342213 343945 345981 347880 349311 350649 352511 354894 357229
57394C57229J972J927K343K818K928K623K169J894J993K419K905L099K781K089
$$ 357229 359201 361128 363471 366289 369217 371840 374009 375903 377896 380315 383220 386319 389100 391189
57380C91189J535J543J939K138J937J770K108K894L772M462M669M078K907K077
$$ 391189 392724 394267 396206 398344 400281 402051 404159 407053 410825 415287 419956 424034 426941 429018
57366D29018K220K786K662J534R7r57j502j604j287q01o22q67j119r91n84j99
$$ 429018 431238 434024 436686 438220 438317 437360 435858 434254 432967 432166 431544 430677 429558 428567 427983 427784
57350D27784J10N25J168J885K247J863R26L40Q93K301L474L729L331K845K451
$$ 427784 427894 428419 429587 431472 433719 435582 436508 436848 437741 440042 443516 447245 450576 453421 455872
57335D55872K126K018K277K710K937K857K726K861L386M239N225O012O218N658
$$ 455872 457998 460016 462293 465003 467940 470797 473523 476384 479770 484009 489234 495246 501464 507122
57321E07122M641L860L853M508N334O118O977P731P815P094O355O483P480Q646
$$ 507122 511763 515623 519476 523984 529318 535436 542413 550144 557959 565053 571408 577891 585371 594017
57307E94017R430R684R398Q882Q889R860J1057J1246J0307R454R687J0646J1379
$$ 594017 603447 613131 622529 631411 640300 650160 661217 672463 682770 692224 701911 712557 723936
57294G23936J1570J1597J1757J2007J2354J3047J4234J5630J6581J6668J6316
$$ 723936 735506 747103 758860 770867 783221 796268 810502 826132 842713 859381 875697
57283H75697J6557J7903J9595K0399K0053J9505J9784K1076K2894K4551K5377
$$ 875697 892254 910157 929752 950151 970204 989709 1009493 1030569 1053463 1078014 1103391
57272A103391K5089K4249K3986K4877K6443K7892K8971K9896L0851L1930L3203
$$ 1103391 1128480 1152729 1176715 1201592 1228035 1255927 1284898 1314794 1345645 1377575 1410778
57261A410778L4555L5651L6334L6883L7630L8569L9572M0753M2315M4235M6329
$$ 1410778 1445333 1480984 1517318 1554201 1591831 1630400 1669972 1710725 1753040 1797275 1843604
57250A843604M8535N0977N3825N7132O0676O3948O6519O8303O9318O9439O9014
$$ 1843604 1892139 1943116 1996941 2054073 2114749 2178697 2245216 2313519 2382837 2452276 2521290
57239B521290O9489P2381P7222Q1280Q1970P9145P4566O9743O4976O0094N5181
$$ 2521290 2590779 2663160 2740382 2821662 2903632 2982777 3057343 3127086 3192062 3252156 3307337
57228C307337N0645M7234M5979M7387N0653N4189N7072N9541O1968O3964O4687
$$ 3307337 3357982 3405216 3451195 3498582 3549235 3603424 3660496 3720037 3782005 3845969 3910656
57217C910656O3709O1368N8506N6031N4365N3186N1933N0626M9855M9942N0531
$$ 3910656 3974365 4035733 4094239 4150270 4204635 4257821 4309754 4360380 4410235 4460177 4510708
57206D510708N1159N1792N2521N3214N3886N4990N6788N8635N9554N9532N9598
$$ 4510708 4561867 4613659 4666180 4719394 4773280 4828270 4885058 4943693 5003247 5062779 5122377
57195E122377O0465O1653O2271O2248O2374O3303O4891O6482O7501O7899O8124
$$ 5122377 5182842 5244495 5306766 5369014 5431388 5494691 5559582 5626064 5693565 5761464 5829588
57184E829588O8617O9254O9514O9307O9292P0089P1561P3208P4906P6775P8644
$$ 5829588 5898205 5967459 6036973 6106280 6175572 6245661 6317222 6390430 6465336 6542111 6620755
57173F620755Q0164Q1263Q2049Q2865Q4999R0301R8292J03886J00145Q4339O0432
$$ 6620755 6700919 6782182 6864231 6947096 7032095 7122396 7220688 7324574 7424719 7509058 7569490
57162G569490L5425J4823J815k215Q91N468N872J337m505q543j0806j2438j3748
$$ 7569490 7604915 7619738 7621553 7619338 7620229 7625697 7631569 7632906 7628401 7619858 7609052 7596614 7582866
57149G582866j5086j7757k2646k9056l5947m3326n1399n9180o4927o7491o6480
$$ 7582866 7567780 7550023 7527377 7498321 7462374 7419048 7367649 7308469 7243542 7176051 7109571
57138G109571o1860n4259m5293l6686k9237k3181j9093j7719j9104k2434k6577
$$ 7109571 7047711 6993452 6948159 6911473 6882236 6859055 6839962 6822243 6803139 6780705 6754128
57127F754128l0337l2505l2217k9334k4297j7875j1101m874O83O207J2267J9005
$$ 6754128 6723791 6691286 6659069 6629735 6605438 6587563 6576462 6571588 6572271 6578478 6590745 6609750
57115F609750K6554L5122M4432N3949O4073P6517R2987J14102J39970J71107K08313
$$ 6609750 6636304 6671426 6715858 6769807 6833880 6910397 7003384 7117486 7257456 7428563 7636876
57104G636876K52418L04975L68908M48008N46197O67749Q17584J000579J220227
$$ 7636876 7889294 8194269 8563177 9011185 9557382 10225131 11042715 12043294 13263521
57095A3263521J477559J770434K093550K439299K798278L158133L501386L803038
$$ 13263521 14741080 16511514 18605064 21044363 23842641 27000774 30502160 34305198
57087C4305198M028126M134815M094318L924664L704489L530297L433625L332807
$$ 34305198 38333324 42468139 46562457 50487121 54191610 57721907 61155532 64488339
57079F4488339L076462K547332J736190P34836l21114j302983k116073k717546
$$ 64488339 67564801 70112133 71848323 72583159 72262045 70959062 68842989 66125443
57071F6125443l126113l406096l625717l819049l978866m077004m088453m003300
$$ 66125443 62999330 59593234 55967517 52148468 48169602 44092598 40004145 36000845
57063C6000845l827342l578108l279442k955636k626951k308309k010439j741086
$$ 36000845 32173503 28595395 25315953 22360317 19733366 17425057 15414618 13673532
57055A3673532j504830j302258j130282r83852q57825p48036o51659n67238m94058
$$ 13673532 12168702 10866444 9736162 8752310 7894485 7146449 6494790 5927552 5433494
57046E433494m31146l76823l29253k87324k51092k21533j99403j83658j71066
$$ 5433494 5002348 4625525 4296272 4008948 3757856 3536323 3336920 3153262 2982196
57037B982196j58025j42997j27159j13367j05353j06809j18850j37435j54661
$$ 2982196 2824171 2681174 2554015 2440648 2335295 2228486 2109636 1972201 1817540
57028A817540j63912j63516j55587j42943j28089j13545j01090r0690q1301p2631
$$ 1817540 1653628 1490112 1334525 1191582 1063493 949948 848858 758168 676867 604236
57018F04236o5185n8970n3223m7437m1816l6685l2122k8197k5024k2551k0679
$$ 604236 539051 480081 426858 379421 337605 300920 268798 240601 215577 193026 172347
57007A72347j9321j7958j5628j2042q390o165n371m603k851m34J759L216L840
$$ 172347 153026 135068 119440 107398 99008 92843 87472 82869 80018 79584 81343 84559 88399
56994H8399L813L688M117N242O603P774Q812J0099J1972J4402J6748J7893J6865
$$ 88399 92212 95900 100017 105259 111862 119636 128448 138547 150519 164921 181669 199562 216427
56981B16427J3301P345l59q278j4290j7203j7683j7128j5985j3923j1241q922
$$ 216427 229728 237073 236714 228436 214146 196943 179260 162132 146147 132224 120983 112061
56969A12061p275n514l004p9K678N343Q380J1971J6047K0592K5541L0373L3853
$$ 112061 104786 99272 96268 96189 98867 104210 112590 124561 140608 161200 186741 217114 250967
56956B50967L4087K9248J9034N696o968j6047k0978k2773k2544k0946j8473j5622
$$ 250967 285054 314302 333336 339032 332064 316017 295039 272266 249722 228776 210303 194681
56944A94681j2778j0126p592m815j411K553O560J0259J3929J8206K3425K9216
$$ 194681 181903 171777 164185 159370 157959 160512 167072 177331 191260 209466 232891 262107
56932B62107L4543L7990L8113L3745K4443J1101l758j6809k5623k9755l0247k8512
$$ 262107 296650 334640 372753 406498 430941 442042 438284 421475 395852 366097 335850 307338
56920C07338k5832k3293k1393j9730j7616j5029j2659j1108j0404j0194j0039
$$ 307338 281506 258213 236820 217090 199474 184445 171786 160678 150274 140080 130041
56909A30041r593q855q200p857p508o681n334l664j724L41K034L164M416O512
$$ 130041 120448 111593 103393 95536 88028 81347 76013 72349 70625 70966 73000 76164 80580 87092
56895H7092R001J0798J1813J3058J4997J6874J8023J8844J9840K0367J9188J5846
$$ 87092 96093 106891 118704 131762 146759 163633 181656 200500 220340 240707 259895 275741
56883B75741J0798M580k375r071j3913j5792j5092j3312j1690j0272q363n628
$$ 275741 286539 291119 288744 279673 265760 249968 234876 221564 209874 199602 191239 185611
56871A85611k404R90M702Q842J3047J6998K0965K5362L0181L5326M0945M6434
$$ 185611 183207 184197 188899 197741 210788 227786 248751 274113 304294 339620 380565 426999
56859D26999M9348M6561L6814K1660M125j2652k5701l2836l3974l1239k7157k3010
$$ 426999 476347 522908 559722 581382 585507 572855 547154 514318 480344 449105 421948 398938
56847C98938j8967j4835j0190m484K230R233J6188K3692L2262M1534N1102O1411
$$ 398938 379971 365136 354946 350462 352692 361925 378113 401805 434067 475601 526703 588114
56835E88114P2717Q3074Q8162Q3383O6453L8946O194k4709m8104o1892o7101o6076
$$ 588114 660831 743905 832067 915450 981903 1020849 1027043 1002334 954230 892338 825237 759161
56823G59161o1308n5060m8807m2812l6618k9949k2827j5139o790J835J0179J8375
$$ 759161 697853 642793 593986 551174 514556 484607 461780 446641 439851 441686 451865 470240
56811D70240K7265L7399M8227N8057O4264O3649N3631L4149Q690j6892l7106m9178
$$ 470240 497505 534904 583131 641188 705452 769101 822732 856881 865571 848679 811573 762395
56799G62395n3576n2734m9227m4684l9753l4546k9145k3815j8921j4458r910m800
$$ 762395 708819 656085 606858 562174 522421 487875 458730 434915 415994 401536 391626 386826
56787C86826O87O024J1223J6868K3131K9105L3167L3601K9034J9170N574q692
$$ 386826 387513 393537 404760 421628 444759 473864 507031 540632 569666 588836 594410 585718
56775E85718k0725k9050l3443l4330l2738l0142k7592k5136k2465j9721j7296
$$ 585718 564993 535943 502500 468170 435432 405290 377698 352562 330097 310376 293080
56764B93080j5237j3427j2014j1159j0560r816r090q864r085r113q572p817p463
$$ 293080 277843 264416 252402 241243 230683 220867 211777 202913 193828 184715 176143 168326 160863
56751A60863p644p937p876p481p185p117o723n527m132l732m468n045m445l181
$$ 160863 153219 145282 137406 129925 122740 115623 108900 103373 99241 95509 91041 85996 81551 78370
56737G8370k311j825r56L32J139R54L00o0K5K40K93J19q0J28J006K230L054K979
$$ 78370 76059 74234 73278 73610 74749 75703 76003 75943 75968 76208 76501 76620 76540 76668 77674 79904 82958 85937
56719H5937K137J105M92N33Q83R27M79O6K69J042J870K350K398K104J710J526
$$ 85937 88074 89179 89671 90204 91087 92014 92493 92559 92828 93870 95740 98090 100488 102592 104302 105828
56703A05828J578J556J351J362J961K918L777M516N416O428P151P501Q017R385
$$ 105828 107406 108962 110313 111675 113636 116554 120331 124847 130263 136691 143842 151343 159360 168745
56689A68745J1714J4352J6375J7476J8208J9164K0062K0098J9034J7240J4770
$$ 168745 180459 194811 211186 228662 246870 266034 286096 306194 325228 342468 357238
56678C57238J1321P434M619L753M032M190L956L621L071K190J680K319L718M764
$$ 357238 368559 375993 380612 384365 388397 392587 396543 400164 403235 405425 407105 409424 413142 417906
56664D17906N022M837M317L288K091J423J307J050L56l62p89j156j754k621l854
$$ 417906 422928 427765 432082 435370 437461 438884 440191 441241 441597 441235 440446 439290 437536 434915 431061
56649D31061n543p369q765r565j0022j0179r844r134q522q174p769p016o007n071
$$ 431061 425518 418149 409384 399819 389797 379618 369774 360640 352118 343944 336175 329159 323152 318081
56635C18081m637n049o047o625n921m213k542j438o00M28J728L181M554N508N899
$$ 318081 313444 308395 302348 295723 289802 285589 283047 281609 281009 281437 283165 286346 290900 296408 302307
56620C02307N949N755M954L332J404j82j433k630l553l865l844l932l903l370
$$ 302307 308256 314011 318965 322297 323701 323519 322086 319456 315903 312038 308194 304262 300359 296989
56606B96989k818l171m418n602o019n644m601l097j798j240j043m65M36J200K096
$$ 296989 294171 291000 286582 280980 274961 269317 264716 261619 259821 258581 257538 257073 257509 258709 260805
56591B60805L675N397O114N797N489N531N240M501M141M395M421L820L291L255
$$ 260805 264480 269877 275991 281788 287277 292808 298048 302549 306690 311085 315506 319326 322617 325872
56577C25872L169K814K911L754M476M508M593N401O258O270N817N797O199O473
$$ 325872 329041 331855 334766 338520 342996 347504 352097 357498 363756 370026 375843 381640 387839 394312
56563C94312O651O986O957N730L381P43j633l647n072n620n429m877m150l485
$$ 394312 400963 407949 414906 420636 424017 424760 423127 419480 414408 408788 403359 398482 394332 390847
56549C90847l458m424n929p254q312r554j1162j2797j3910j4075j3305j2286j1928
$$ 390847 387389 382965 377036 369782 361470 351916 340754 327957 314047 299972 286667 274381 262453
56536B62453j2389j2958j3016j2571j1680j0150q239o838o322n905m779l372k684
$$ 262453 250064 237106 224090 211519 199839 189689 181450 174612 168290 162385 157606 154234 151550
56523A51550k840l094k972k726k736l015l236k987k127j106o36q51j164j101q16
$$ 151550 148710 145616 142644 139918 137182 134167 130931 127944 125817 124711 124075 123224 122060 120959 120143
56508A20143n69k80J23M27M86M32K93j3k07J08O35N73q0m43j91p9n03p26l11j83
$$ 120143 119574 119294 119417 119844 120330 120762 121055 121042 120835 120943 121578 122151 122071 121628 121437 121358 120855 120129 119818 119635
56488A19635j192k471k490j179J05M10l8n92p51k12Q21J480J129K15l31k77l3
$$ 119635 118443 115972 113482 112303 112408 112818 112780 112188 111437 111225 112046 113526 114655 114870 114539 114262 114229
56471A14229K45O86J112J150Q65P12Q82J117J079N88k32q22o38N3L45l2k98J22
$$ 114229 114474 115160 116272 117422 118287 118999 119881 120998 122077 122665 122433 121611 120973 121026 121371 121339 121041 121163
56453A21163P35R29R73J283J444R25J92J24O81J095J086R83R19P70P13J063J611
$$ 121163 121898 122827 123800 125083 126527 127452 127644 127768 128449 129544 130630 131613 132532 133302 134015 135078 136689
56436A36689J837J609J180P38M44N62J011J116N01k29k75K15M82K11l64j029j613
$$ 136689 138526 140135 141315 142053 142497 143059 144070 145186 145687 145458 145183 145398 145880 146091 145727 144698 143085
56419A43085j807j600j469j587j413o46N5Q0j02J55M62J77k13K35J245J658J204
$$ 143085 141278 139678 138209 136622 135209 134563 134618 134698 134596 134751 135213 135390 135177 135412 136657 138315 139519
56402A39519P50P82Q54O19L27J31k16p41j030q17j76P27J582J818J225N35O32
$$ 139519 140269 141051 141905 142524 142851 142982 142766 142025 140995 140178 140002 140729 142311 144129 145354 145889 146521
56385A46521J380J878J694J112M50r7k19J47L75k7m61K2J224J991J757J011L39
$$ 146521 147901 149779 151473 152585 153035 152938 152719 152866 153241 153214 152753 152775 153999 155990 157747 158758 159097
56368A59097j10j95K23Q30J100J018R38R12Q28R72J602K201K036J239N06k6o24
$$ 159097 158987 158792 159015 159845 160945 161963 162901 163813 164641 165613 167215 169416 171452 172691 173197 173171 172547
56351A72547r68m19P35J443J383J277J625K092K363K615K901K884K534K396K862
$$ 172547 171579 171160 171895 173338 174721 175998 177623 179715 182078 184693 187594 190478 193012 195408 198270
56336A98270L671M302M412L870K867J988J620J451J024N52N80J049J450J679J964
$$ 198270 201941 206243 210655 214525 217392 219380 221000 222451 223475 224027 224607 225656 227106 228785 230749
56321B30749K107J621O58mQ7O44J173J445J475J562K098K985L620L829M310N503
$$ 230749 232856 234477 235135 235131 235218 235862 237035 238480 239955 241517 243615 246600 250220 254049 258359 263862
56305B63862O699O946O300N401M499L723L587M219M737M442L969M152M450L854
$$ 263862 270561 277507 283807 289208 293707 297430 301017 305236 309973 314415 318384 322536 326986 330840
56291C30840K676K075K251K532K759L126L152K397J778K504M048M898N089O064
$$ 330840 333516 335591 337842 340374 343133 346259 349411 351808 353586 356090 360138 365036 370125 376189
56277C76189Q055R601R930R953J0479J1180J1898J3402J6049J8972K1336K3335
$$ 376189 384244 393845 403775 413728 424207 435387 447285 460687 476736 495708 517044 540379
56265E40379K5552K8186L1378L5342L9878M4487M9064N3768N8342O2488O6521
$$ 540379 565931 594117 625495 660837 700715 745202 794266 848034 906376 968864 1035385
56254A035385P0624P3900P5498P6244P7375P8086P6220P1374O5294N9005N1556
$$ 1035385 1106009 1179909 1255407 1331651 1409026 1487112 1563332 1634706 1700000 1759005 1810561
56243A810561M2143L1607K1078J0757O49q877j7841k6560l4467m0414m4580m8502
$$ 1810561 1852704 1884311 1905389 1916146 1916795 1907918 1890077 1863517 1829050 1788636 1744056 1695554
56231A695554n2720n5970n7349n7635n7847n7909n7470n6699n5583n3765n1633
$$ 1695554 1642834 1586864 1529515 1471880 1414033 1356124 1298654 1241955 1186372 1132607 1080974
56220A080974n0190m9253m7359m4025m0666l8424l6583l4010l0845k7816k5070
$$ 1080974 1030784 981531 934172 890147 849481 811057 774474 740464 709619 681803 656733
56209F56733k2553k0454j8575j6281j3735j2038j1511j1071r912q639p967p544
$$ 656733 634180 613726 595151 578870 565135 553097 541586 530515 520603 511964 503997 496453
56197D96453o824n998n284m325k993j896j458j308j022n75K25J679L292M049L825
$$ 496453 489629 483631 478347 474022 471029 469133 467675 466367 465345 464770 464995 466674 469966 474015 477840
56182D77840L461L371L311L543M717O395P278P185P294Q177R192J0022J1092J2180
$$ 477840 481301 484672 487983 491526 496243 502638 509916 517101 524395 532572 541764 551786 562878 575058
56168E75058J2442J2171J2645J3904J4580J4384J4675J5989J7129J7505J8279
$$ 575058 587500 599671 612316 626220 640800 655184 669859 685848 702977 720482 738761
56157G38761K0318K3003K5955L0053L5763M2343M9528N8187O8428P8940Q9050
$$ 738761 759079 782082 808037 838090 873853 916196 965724 1023911 1092339 1171279 1260329
56146A260329R9308J09091J15632J16610J11987J02669Q9544P4895O2367N4004
$$ 1260329 1359637 1468728 1584360 1700970 1812957 1915626 2005170 2080065 2142432 2196436
56136B196436M8846M5136M1819L7203K8900J6720L625p488j5999k1954k5122k7160
$$ 2196436 2245282 2290418 2332237 2369440 2398340 2415060 2418685 2411197 2395198 2373244 2348122 2320962
56124B320962l1944m1811n5394p0389q5805r9955j09341j11938j09438j04267
$$ 2320962 2289018 2247207 2191813 2121424 2035619 1935664 1826323 1714385 1604947 1500680
56114A500680r6621q6436p5682o6222n7501m8719m1136l5939l1804k7042k2250
$$ 1500680 1404059 1317623 1241941 1175719 1118218 1069499 1028363 992424 960620 933578 911328
56103I11328j8580j5337j1621q383o512m799k170N2N68P67K348M282M892N093
$$ 911328 892748 877411 865790 857407 850895 846096 843926 843978 844546 845313 847661 851943 856835 861928
56089H61928O641Q795R654R486R906J0954J1603J2023J2812J3192J2284J0992
$$ 861928 868569 877364 887018 896504 906410 917364 928967 940990 953802 966994 979278 990270
56077I90270J0481J0079Q793P419O987O765N924N437O167O914O638O664Q316J0352
$$ 990270 1000751 1010830 1019623 1027042 1034029 1040794 1046718 1052155 1058322 1065236 1071874 1078538 1086854 1097206
56063A097206J1197J1723J3246J4784J4979J4749J5406J6185J6211J6701J8547
$$ 1097206 1108403 1120126 1133372 1148156 1163135 1177884 1193290 1209475 1225686 1242387 1260934
56052A260934J9992J9616J9289K1118K3777K4925K4909K5029K4610K3117K2630
$$ 1260934 1280926 1300542 1319831 1340949 1364726 1389651 1414560 1439589 1464199 1487316 1509946
56041A509946K4663K6967K7098K6708K8528L1597L3431L4543L6751L9220M0277
$$ 1509946 1534609 1561576 1588674 1615382 1643910 1675507 1708938 1743481 1780232 1819452 1859729
56030A859729M0940M2683M3995M3223M2442M4310M7495M9422N0971N4045N7214
$$ 1859729 1900669 1943352 1987347 2030570 2073012 2117322 2164817 2214239 2265210 2319255 2376469
56019B376469N8489N9755O3478O7685O9277O9773P2519P6726P9604Q1880Q5800
$$ 2376469 2434958 2494713 2558191 2625876 2695153 2764926 2837445 2914171 2993775 3075655 3161455
56008C161455R0209R3042R6116J01914J08379J12585J16515J23275J30862J36034
$$ 3161455 3251664 3344706 3440822 3542736 3651115 3763700 3880215 4003490 4134352 4270386
55998D270386J40888J48917J58009J64656J71468J82790J96295K07229K17607
$$ 4270386 4411274 4560191 4718200 4882856 5054324 5237114 5433409 5640638 5858245
55989E858245K32516K50547K67022K83598L05141L30023L53472L77750M08668
$$ 5858245 6090761 6341308 6608330 6891928 7197069 7527092 7880564 8258314 8666982
55980H666982M44745M80541N18067N63668O16284O70647P29481Q00218Q82421
$$ 8666982 9111727 9592268 10110335 10674003 11290287 11960934 12690415 13490633 14373054
55971A4373054R71834J074230J200859J352699J524841J724650J969255K267194
$$ 14373054 15344888 16419118 17619977 18972676 20497517 22222167 24191422 26458616
55963B6458616K621325L050138L588067M264946N103745O135025P387480Q863972
$$ 26458616 29079941 32130079 35718146 39983092 45086837 51221862 58609342 67473314
55955F7473314J0559212J2512030J4812395J7546429K0769415K4546296K8931310
$$ 67473314 78032526 90544556 105356951 122903380 143672795 168219091 197150401
55948A97150401L3727694L8087446M0301883L8204654L0269609J6840334N08873
$$ 197150401 230878095 268965541 309267424 347472078 377741687 394582021 395090894
55941C95090894j4917259k6281654l2421788l4112974l2997910l0558036k7722364
$$ 395090894 380173635 353891981 321470193 287357219 254359309 223801273 196078909
55934A96078909k4935054k2314451j9806843j7356022j5001483j2834387j0909179
$$ 196078909 171143855 148829404 129022561 111666539 96665056 83830669 72921490
55927G2921490r233344p806398o621243n642589m823263m137479l574418l110701
$$ 72921490 63688146 55881748 49260505 43617916 38794653 34657174 31082756 27972055
55919B7972055k715262k373839k085552j841322j625937j435773j275121j139090
$$ 27972055 25256793 22882954 20797402 18956080 17330143 15894370 14619249 13480159
55911A3480159j016932r07883q17654p42872o74002o10283n57512n14050m72476
$$ 13480159 12463227 11555344 10737690 9994818 9320816 8710533 8153021 7638971 7166495
55902G166495m32557l99737l72746l44789l15369k89757k68189k46043k23336
$$ 7166495 6733938 6334201 5961455 5616666 5301297 5011540 4743351 4497308 4273972
55893D273972k04144j88034j71436j56051j46785j42552j37721j31311j26411
$$ 4273972 4069828 3881794 3710358 3554307 3407522 3264970 3127249 2995938 2869527
55884B869527j22055j14216j03819r5785r0840q5700q0183p6732p4029o8498o1229
$$ 2869527 2747472 2633256 2529437 2433652 2342812 2257112 2176929 2100197 2026168 1957670 1896441
55873A896441n6374n3543m8801m2324l8272l7744l8422m0315m5098n0451n1668
$$ 1896441 1840067 1786524 1737723 1695399 1657127 1619383 1580961 1540646 1495548 1445097 1393429
55862A393429m8722m5644m3470l9881l5204l2389l1262k8806k5113k3251k3381
$$ 1393429 1344707 1299063 1255593 1215712 1180508 1148119 1116857 1088051 1062938 1039687 1016306
55851A016306k2733k1268k1648k3662k4242k3102k2924k3859k3286k1106j9997
$$ 1016306 993573 972305 950657 926995 902753 879651 856727 832868 809582 788476 768479
55840G68479k0094j8750j5865j4278j4435j3696j1511j0201j0075q655n569l416
$$ 768479 748385 729635 713770 699492 685057 671361 659850 649649 639574 630919 625350 621934
55828F21934k941j873M99J928J431P88R41P83K76Q61K099J712m03j855k032k891
$$ 621934 618993 617120 617619 619547 620978 621766 622707 623490 623766 624627 626726 628438 628035 626180 624148 621257
55812F21257n024o765p791r662j2159j2933j1617j0565j0649j0107q334p067o812
$$ 621257 616233 609468 601677 592015 579856 566923 555306 544741 534092 523985 515651 508584 501772
55799E01772n778l560k323l093m006l497k177n98J787M402N270M109K995L160
$$ 501772 495994 492434 490111 487018 483012 479515 477338 476740 478527 482929 488199 492308 495303 498463
55785D98463L789M658P034J1198J5849K0656K6519L2571L5736L4033K7774J7396
$$ 498463 502252 506910 513944 525142 540991 561647 588166 620737 656473 690506 718280 735676
55773G35676L459j0704j9821k1589j8203j2410n054K990R924J5456K1091K6770
$$ 735676 739135 728431 708610 687021 668818 656408 651354 654344 664268 679724 700815 727585
55761G27585K9954K9110K5313J9418J0685m83j1400k0191k7528l3974l8295l9839
$$ 727585 757539 786649 811962 831380 842065 841582 830182 809991 782463 748489 710194 670355
55749F70355m0075m0202l9489l7359l4865l2816l0495k7486k4690k2447j9797
$$ 670355 630280 590078 550589 513230 478365 445549 415054 387568 362878 340431 320634
55738C20634j6646j4413j3496j2375j0266q380p444o376m615l430l600m022l868
$$ 320634 303988 289575 276079 263704 253438 245058 237614 231238 226623 223193 219593 215571 211703
55725B11703l958m695m872l832k682k056r56Q85J813R37j35L4L79o25k437l640
$$ 211703 207745 203050 198178 194346 191664 189608 188652 189537 191350 192287 192152 192186 192565 191940 189503 185863
55709A85863m038l925k903r64O29R98Q09P43L55m66o28L67J408J671J874K506
$$ 185863 181825 177900 174997 174033 174662 175660 176469 177212 177567 177101 176473 176840 178248 179919 181793 184299
55693A84299K721K161K041L055M000L833L289L128K654J507J060K296M001M679
$$ 184299 187020 189181 191222 194277 198277 202110 205399 208527 211181 212688 213748 216044 220045 224724
55679B24724M719N075N338M826M076L638K865J523R87K127L439L189K010J441
$$ 224724 229443 234518 239856 244682 248758 252396 255261 256784 257771 259898 263337 266526 268536 269977
55665B69977J246J85j556k807l424m018m327l678k437j408m17J081K684L805N085
$$ 269977 271223 271408 269852 267045 263621 259603 255276 251598 249161 247753 247336 248417 251101 254906 259991
55650B59991P501J0703J3543J5790J8029K0484K3131K6352L0256L4059L7151M0017
$$ 259991 267492 278195 291738 307528 325557 346041 369172 395524 425780 459839 496990 537007
55638E37007M2892M4337M2515L7225K9612K0545J0644J210o323j1557j4786j5978
$$ 537007 579899 624236 666751 703976 733588 754133 764777 765987 759664 748107 733321 717343
55626G17343j5095j2844j0079o887l076R92M825Q375J1379J2808J1760Q212K320
$$ 717343 702248 689404 679325 672438 669362 670354 675179 683554 694933 707741 719501 727713 730033
55613G30033n966j5814k5164l2466l7873m1846m3803m3291m1348l9255l6843l3328
$$ 730033 724067 708253 683089 650623 612750 570904 527101 483810 442462 403207 366364 333036
55601C33036k9093k5305k2380k0013j8067j6374j4339j1862r884q999q332o965
$$ 333036 303943 278638 256258 236245 218178 201804 187465 175603 165719 156720 148388 141423
55589A41423n529n042n020m239k778j739j347q29J7N49N32M82P58J191J647K196
$$ 141423 135894 130852 125832 121593 118815 117076 115729 114900 114917 115466 115998 116480 117238 118429 120076 122272
55573A22272K788L298L652L566K609R76m70j329k069k910l271k923k604k702k481
$$ 122272 125060 128358 132010 135576 138185 139161 138691 137362 135293 132383 129112 126189 123585 120883 118402
55558A18402j554r02j291j797j222m7N02M71P35J183R77L25L50J292K102J954
$$ 118402 116848 115946 114655 112858 111636 111589 112091 112562 113297 114480 115457 115782 116132 117424 119526 121480
55542A21480J110K33l49p12j252k385l839m629m238l288k556k021j483j258j466
$$ 121480 122590 122823 122474 121762 120510 118125 114286 109657 105419 102131 99575 97554 96071 94813 93347
55527I3347j394n49L87N68L74P38J626K174K048J786K055L073M490N408N149M321
$$ 93347 91953 91404 91791 92359 92733 93471 95097 97271 99319 101105 103160 106233 110723 116131 121280 125601
55511A25601M384N789P529Q802R966J1328J2474J3473J5404J8621K1914K4393
$$ 125601 129985 135774 143303 152105 162071 173399 185873 199346 214750 233371 255285 279678
55499B79678K6745K9583L1955L2946L3177L3121L1392K6517J9279J1355K822o979
$$ 279678 306423 336006 367961 400907 434084 467205 498597 525114 544393 555748 558570 551591
55487E51591j6951k4925l0251l3776l5683l5470l3691l1750k9984k7690k4907
$$ 551591 534640 509715 479464 445688 410005 374535 340844 309094 279110 251420 226513
55476B26513k2431k0200j7431j4304j1953j0648r514q036o569n388m513m289m857
$$ 226513 204082 183882 166451 152147 140194 129546 120032 111996 105427 100039 95526 91237 86380
55463H6380n260m483l063k344k389k203j660j562j895j738j013p15j218j756j801
$$ 86380 81120 76637 73574 71230 68841 66638 64978 63416 61521 59783 58770 58055 56837 55081 53280
55448E3280j644j506j238r61q85o70n2K57m00j084l95J216J961J393P54P23O92
$$ 53280 51636 50130 48892 47931 47046 46376 46324 46581 46181 45097 44702 45918 47879 49272 50026 50749 51441
55431E1441M45N82R45M41j003k039j958j567j411q19N00J462J216M05J1j07n03
$$ 51441 51886 52468 53413 53854 52851 50812 48854 47287 45876 45057 45557 47019 48235 48640 48651 48544 48041
55414D8041j033j219j055p73m60l17o13j056j004n04k22k50j5M73N03Q3J24P81
$$ 48041 47008 45789 44734 43961 43501 43184 42571 41515 40511 40007 39785 39535 39520 39993 40496 40579 40703 41484
55396D1484R34J4r20p33J38N35K43j10j17J50N19P41N78K16J18J67k71j191j726
$$ 41484 42418 42432 41512 40779 40917 41452 41695 41585 41468 41618 42137 42878 43456 43672 43790 43957 43686 42495 40769
55377D0769j435r62q85q03k65J69l33j520k255j873p99Q1K53j25m71m41l03n07
$$ 40769 39334 38372 37487 36684 36419 36588 36255 34735 32480 30607 29808 29889 30142 30017 29546 29105 28802 28295
55359B8295r59j117p43j11M63Q39Q92N88K16J32L36O51J010J227R15J32l58j89
$$ 28295 27336 26219 25476 25365 25828 26667 27559 28147 28363 28495 28831 29482 30492 31719 32634 32766 32408 32219
55341C2219j9l32l80N55J565J224j55r64p49n86r99j218p77k94k08q2L43O00N31
$$ 32219 32200 31868 31488 32043 33608 34832 34677 33713 32964 32378 31379 30161 29384 29090 28882 28800 29143 29743 30274
55322C0274O53J096J203O64m9o38j258j555p40Q54J642Q57l36n52M7M87M45K05
$$ 30274 30927 32023 33226 33890 33841 33203 31945 30390 29650 30504 32146 33003 32667 32115 32162 32649 33094 33299
55304C3299j06m80p55r51j259j466j150o55q54j628j736o52O05J114J292J734
$$ 33299 33193 32713 31958 31007 29748 28282 27132 26477 25623 23995 22259 21607 22212 23326 24618 26352
55288B6352J927J189l6q72j273j583j483m48J078K000J910J341Q45M39l4m98o59
$$ 26352 28279 29468 29432 28560 27287 25704 24221 23773 24851 26851 28761 30102 30947 31386 31352 30854 30195
55271C0195l25J79J04q28j734j513l73L82J60k84k06R3O2k20m09m21k05L48R23
$$ 30195 29870 30049 30153 29325 27591 26078 25705 26087 26247 25963 25757 25850 25912 25692 25283 24862 24657 25005 25928
55252B5928R38M57J85L18K32l76r74j180j310j526j331m72M85R52R92Q60O24N12
$$ 25928 26866 27323 27508 27826 28058 27682 26708 25528 24218 22692 21361 20889 21374 22326 23318 24178 24802 25314
55234B5314P69R65M47l55k19R15J670J300O73N67M64j29n80l40o8l94p44n32l72
$$ 25314 26083 27048 27495 27140 26921 27836 29506 30806 31479 32046 32510 32381 31801 31461 31393 30999 30255 29723 29351
55215B9351q68j227m98O09O85k61j004j002p12l50L47J245J791J815J529R30l7
$$ 29351 28483 27256 26758 27367 28052 27791 26787 25785 25073 24723 25070 26315 28106 29921 31450 32380 32343
55198C2343r11j139q36m92k43j3L4j84k88M6O21J250J989K425J649k51j569r99
$$ 32343 31432 30293 29457 28965 28722 28709 28743 28559 28271 28317 28938 30188 32177 34602 36251 36000 34431 33432
55180C3432N52J242P29Q8m8O3L03P73J040N31l96p99n10k07k69m66o15o83l97
$$ 33432 33984 35226 35955 36043 35995 36058 36361 37134 38174 38705 38309 37510 37000 36793 36524 36058 35443 34760 34363
55161C4363L37Q64M95l72p31l39J92M68N10K01n01j020p70j80r4l70r6Q36J482
$$ 34363 34700 35564 36059 35687 34956 34617 34809 35277 35787 35988 35487 34467 33697 33517 33423 33053 32957 33793 35275
55142C5275J217M24k59n34l18J62K31m37j011m78P38J192M47n02r16j167j568
$$ 35275 36492 36916 36657 36123 35805 35967 36198 35761 34750 34272 35010 36202 36649 36147 35231 34064 32496
55125C2496j558p27L23Q36R45J188J479J261L85n94r54m17O13J333J341J049R95
$$ 32496 30938 30211 30534 31370 32315 33503 34982 36243 36628 36034 35080 34663 35276 36609 37950 38999 39994
55108C9994R45K80q68j546j181k21N77R14Q68O29N45Q79J314J194M79j3L59J198
$$ 39994 40939 41219 40351 38805 37624 37403 37980 38894 39762 40391 40936 41815 43129 44323 44802 44789 45148 46346
55090D6346J570J060Q6o14n84P1P48Q66M24k1l1K14J63m53j286j710j456q91n20
$$ 46346 47916 48976 49062 48448 47864 47935 48683 49549 49973 49952 49921 50135 50298 49845 48559 46849 45393 44502 43982
55071D3982l20J41R20J479J396Q13K2q64j505j326m00K07k39r59o75M95J183P71
$$ 43982 43662 43803 44723 46202 47598 48411 48433 47569 46064 44738 44338 44545 44306 43347 42672 43167 44350 45121
55053D5121K20N76J452J616O24o77j195p44j12r7o62j039o50K84J088J328J061
$$ 45121 45341 45917 47369 48985 49609 48932 47737 46993 46881 46784 46122 45083 44433 44717 45805 47133 48194
55036D8194N99K51J25N1j88n28p52q28q42o49j01M33L68j76m54k16j4j32p6M82
$$ 48194 48793 49044 49169 49220 49032 48504 47752 46924 46082 45433 45332 45765 46133 45957 45503 45287 45273 45141 45065 45547
55016D5547J034J088R30R70R65O37L99O86J067Q31Q4m84n58l41o6L1l63j135j580
$$ 45547 46581 47669 48599 49569 50534 51171 51570 52256 53323 54154 54238 53754 53196 52855 52789 52820 52457 51322 49742
54997D9742j349j028j190j439j165o11l76k90K18J026J494J423J040L49o39j355
$$ 49742 48393 47365 46175 44736 43571 42960 42584 42294 42512 43538 45032 46455 47495 47844 47205 45850
54981D5850j249o11l4N94J603K489K384J396M97J93K25M01P21Q79N40K6j61k53
$$ 45850 44601 43990 43956 44550 46153 48642 51026 52422 52919 53112 53337 53738 54459 55338 55878 55904 55743 55490
54963E5490o87r89k96J054J710J170L47J74N53R73J232J308J252J329J689J968
$$ 55490 54803 53814 53518 54572 56282 57452 57799 57973 58526 59499 60731 62039 63291 64620 66309 68277
54947F8277J890K037L114M709N755O106O482P028P199P046P258P655P021M912
$$ 68277 70167 72204 75318 80027 85782 91888 98370 105398 112597 119643 126901 134556 141577 146489
54933A46489K413N10j223l580o290q302q970q377p058n842n366n397n098m179
$$ 146489 148902 149412 148189 144609 138319 130017 121047 112670 105612 99770 94404 89007 83909 79730
54919G9730l188k554k028j391q80o44l82J10O61J155J648J894J485P01M38J039
$$ 79730 76542 73988 71960 70569 69689 69045 68663 68773 69434 70589 72237 74131 75616 76317 76755 77794
54903G7794J964K803L792M979N769N837N782O283P145P658P424O444M881L085
$$ 77794 79758 82561 86353 91332 97101 102938 108720 115003 122148 129806 137230 143674 148555 151640
54889A51640J420k00k159m326o006o814o997o773o084n212m826n034n139m652
$$ 151640 153060 152860 150701 146375 140369 133555 126558 119785 113701 108489 103663 98629 93490 88838
54875H8838l954l528l269k941k620k315j762j067q73j410j972j820j123m90j28
$$ 88838 84884 81356 78087 75146 72526 70211 68449 67382 66509 65099 63127 61307 60184 59694 59566
54860E9566R4J57J8j68l34o51j063j121o55j85k52o81q93o93l44j47j98m28o72
$$ 59566 59660 59817 59835 59667 59333 58682 57619 56498 55843 55658 55406 54725 53832 53139 52795 52648 52450 52022 51350
54841E1350q37j002j135q79l3R20J315J200J104J122Q75L72L6p7k96n11k47L67
$$ 51350 50513 49511 48376 47497 47464 48384 49699 50899 52003 53125 54000 54372 54408 54331 54035 53524 53277 53644
54823E3644N93K56PJ85L62K94L61O80P16K50j33PL31N04P22J034R48L26j25J33
$$ 53644 54237 54493 54500 54685 55047 55341 55702 56382 57098 57348 57215 57222 57553 58057 58779 59813 60761 61087 60962 61095
54803F1095O72Q92Q95J011J161J258J576K140K436K285K334L035L868M171M183
$$ 61095 61767 62659 63554 64565 65726 66984 68560 70700 73136 75421 77755 80790 84658 88829 93012
54788I3012M506N123N680O219O924P528P587P058O068M531K433J46j933l700n031
$$ 93012 97518 102641 108321 114540 121464 128992 136579 143637 149705 154236 156669 156815 154882 151182 146151
54773A46151n762o117o523o729n982m435l403l587m045l665k782k442k744k905
$$ 146151 140389 134272 127749 121020 115038 110603 107200 103613 99568 95903 93121 90679 87935 85030
54759H5030k487j719r08l17j88l57k09M68J109J371J787K872M152M855M939M850
$$ 85030 82543 80824 79916 79599 79411 79054 78845 79313 80422 81793 83580 86452 90604 95459 100398 105248
54743A05248M787M867N384O231O695O389N709M783K907j38l146m872n559o037
$$ 105248 110035 114902 120286 126517 133212 139601 145310 150093 153000 152862 149716 144844 139285 133248
54729A33248o171n447m465m387n237n957n958n483m701l609k652k422k712k759
$$ 133248 127077 121630 117165 112778 107541 101584 95626 90143 85442 81833 79181 76759 74047 71288
54715G1288k331j767j232o87l23k25J3N11N32l71j224q39L43Q94N23J01q0n38
$$ 71288 68957 67190 65958 65271 64948 64723 64736 65247 65779 65408 64184 63345 63688 64582 65105 65206 65126 64588
54697F4588j145j033k09K39q0k05N31J371J283L61n86j034q82l06J04k62j146
$$ 64588 63443 62410 62201 62440 62360 62155 62686 64057 65340 65701 65115 64081 63199 62893 62997 62735 61589
54680F1589j568j168o77p97j243j391j160q34m52Q0N90P27L43m15j126j295p79
$$ 61589 60021 58853 58176 57379 56136 54745 53585 52751 52299 52379 52969 53696 54039 53624 52498 51203 50424
54663E0424k3M99Q47J268J546J290P51N89R07J130R29N52K23j43n26p29p79q73
$$ 50424 50401 50900 51747 53015 54561 55851 56602 57191 58098 59228 60157 60709 60932 60789 60263 59534 58755 57882
54645E7882q68m03L76Q31P03L91L64O86J136J329P96m76j639j767r98k79j42l72
$$ 57882 57014 56611 56987 57818 58521 58912 59276 59962 61098 62427 63223 62747 61108 59341 58343 58064 57922 57550
54627E7550p55j268j513q67M94J549J603R51K00l31m65p6N21P82O63O54Q89R63
$$ 57550 56795 55527 54014 53147 53641 55190 56793 57744 57944 57613 57148 57072 57593 58375 59038 59692 60581 61544
54609F1544P17N71P76R87Q47M63L6l67n34j33O80J248J224Q70M27j77p92r34n21
$$ 61544 62261 62832 63608 64595 65442 65905 65941 65574 65040 64907 65587 66835 68059 68929 69356 69179 68387 67453 66932
54590F6932j74l56p53q32n69k33P0K84J99k74q44j063o93J88J067J153J53j063
$$ 66932 66758 66402 65649 64817 64248 64015 64085 64369 64568 64294 63450 62387 61694 61882 62949 64102 64255 63192
54572F3192j199q9J060J185N20L8K20P63J086Q74L32J5J05J1p88j646j336K28
$$ 63192 61993 61904 62964 64149 64669 64707 64927 65690 66776 67650 67982 67997 68102 68113 67325 65679 64343 64571
54554F4571J646J724P70j82o86q93q29l66L04O75M43k28q32q88l30M41J051J541
$$ 64571 66217 67941 68711 68529 67843 66950 66121 65755 66059 66734 67177 66949 66117 65229 64899 65340 66391 67932
54536F7932J961J907J076%m98m37m69o46l74L50O98L30RL82J030J199P76L9q02
$$ 67932 69893 71800 72876 72876 72378 71941 71472 70826 70452 70802 71500 71830 71839 72221 73251 74450 75226 75265 74463
54517G4463j341r71K44J284J357Q08L78J56q8j67J66N61N30K10N6M1j86n41o03
$$ 74463 73122 72151 72395 73679 75036 75844 76222 76378 76290 76123 76289 76850 77380 77590 77646 77687 77501 76960 76357
54498G6357k39L53J058J796K175J802Q72O9j31K20P90J235J397J478J914K841
$$ 76357 76118 76471 77529 79325 81500 83302 84174 84243 84112 84332 85122 86357 87754 89232 91146 93987
54482I3987L830M363M294L732K787J710R42O84O29L79j37q46j760k719l278l228
$$ 93987 97817 102180 106474 110206 112993 114703 115645 116329 116958 117337 117200 116354 114594 111875 108597 105369
54466A05369k944k898l070l117k845k256j487r29j028j628j917j436o88l34k14
$$ 105369 102425 99527 96457 93340 90495 88239 86752 85823 84795 83167 81250 79814 79126 78792 78578
54451G8578J84O65N11l54j106j022k73M81P98O16J27l18m06j99j09l87o84m29
$$ 78578 78762 79427 79938 79584 78478 77456 77183 77664 78462 79078 79205 78887 78481 78282 78173 77786 77102 76673
54433G6673L44Q70N32k89o16q7P20J184J315J240P44j06m97J11R40P95k08q23
$$ 76673 77017 77887 78419 78130 77514 77427 78147 79331 80646 81886 82630 82524 82027 82138 83078 83873 83665 82842
54415H2842m54K89Q24J259J555J223K79m93p25r79j547j722j033k45k73p76p96
$$ 82842 82388 82677 83501 84760 86315 87538 87817 87324 86599 85620 84073 82351 81318 81073 80800 80024 79228
54398G9228j73N31J021J291J086L27k54Q4Q52Q40k01j199j154j74R65J639J665
$$ 79228 79055 79586 80607 81898 82984 83311 83057 83141 83993 84833 84632 83433 82279 82105 83070 84709 86374
54381H6374J313J126J362J667J655J585J952K580K764K335J848J701J591J158
$$ 86374 87687 88813 90175 91842 93497 95082 97034 99614 102378 104713 106561 108262 109853 111011
54367A11011N98L36L58K08n12j715k891l486l380k950k614k389j949j119j37M60
$$ 111011 111609 111945 112303 112511 111999 110284 107393 103907 100527 97577 94963 92574 90625 89506 89369 89829
54351H9829L20k91n93r3P28R75M99P0K38O25O10K22l1R1L60M07J7o58j058p26
$$ 89829 90149 89858 89265 89172 89900 90875 91374 91444 91682 92307 92917 93139 93108 93199 93559 93966 93983 93325 92267 91541
54331I1541K1L76M9m38o42o53n43j28L71K26p30j639j767j414j121p87k97j74
$$ 91541 91562 91938 91987 91549 90907 90254 89711 89583 89954 90180 89450 87811 86044 84630 83509 82722 82425 82251
54313H2251o62q83o2R92Q84k52r52n87m3j03m36m96m03m59n83o28o97p70n87j28
$$ 82251 81589 80706 80644 81636 82520 82268 81316 80729 80686 80583 80147 79651 79248 78789 78206 77578 76881 76111 75524 75396
54293G5396K60M37O55J015J308J471J697J882J566O96p1j22M35J091J574J875
$$ 75396 75656 76093 76748 77763 79071 80542 82239 84121 85687 86383 86312 86190 86625 87716 89290 91165
54277I1165J967J821J490J050N78K40K11M29O43O46L31k87q37p02J92R88Q76K71
$$ 91165 93132 94953 96443 97493 98071 98311 98522 98951 99594 100240 100571 100284 99447 98745 98937 99925 100801 101072
54259A01072L14J202J840J299j37j583k558k943k596j567l97L26N00L61nn95j137
$$ 101072 101386 102588 104428 105727 105590 104007 101449 98506 95910 94343 93946 94272 94772 95133 95128 94533 93396
54242I3396j208p19p9J91j06p52j339j610j611j515j376j093o22o2L59L96L5l60
$$ 93396 92188 91469 91390 91581 91475 90723 89384 87774 86163 84648 83272 82179 81557 81495 81854 82250 82285 81925
54224H1925l07K07O58O35L07k1m08r18j132n47O13J602K064K294K501K403J714
$$ 81925 81618 81825 82483 83118 83425 83404 82996 82078 80946 80399 81012 82614 84678 86972 89473 91876 93590
54207I3590O24l38p58n39K6L83K11r6K23J404K837L739L906L714L612L682L627
$$ 93590 94214 93876 93118 92579 92605 92988 93199 93103 93326 94730 97567 101306 105212 108926 112538 116220 119847
54190A19847L093K050Q29k05q79j135j081j178j942l172l886l432k370j812k126
$$ 119847 122940 124990 125819 125614 124735 123600 122519 121341 119399 116227 112341 108909 106539 104727 102601
54175A02601k765l120l011k493j778j288j295j497j365q32k71M2K8m15j156j535
$$ 102601 99836 96716 93705 91212 89434 88146 86851 85354 83989 83157 82886 82928 82956 82541 81385 79850
54159G9850r60J98R16P81L55K39L43K96O1j51k52l27m66o68p37l99L12Q88R05
$$ 79850 78890 79088 80004 80785 81140 81379 81722 82018 82079 81928 81676 81349 80883 80215 79478 79079 79391 80279 81184
54140H1184N60K80J09j24k78j45M9ok4M51J110J190P51O84J298J749J281K58n05
$$ 81184 81744 82024 82133 82009 81731 81586 81635 81629 81605 82056 83166 84356 85107 85791 87089 88838 90119 90377 89872
54121H9872p94q86q45n63k23k36p39j371j496o77Q29K049K160J383O62M66M24
$$ 89872 89078 88192 87347 86784 86561 86325 85586 84215 82719 82042 82871 84920 87080 88463 89125 89591 90015
54104I0015J71o3L9L61O32Q49J081J200J071Q34P44R13J273J586J504J027Q16
$$ 90015 90186 90123 90162 90523 91155 92004 93085 94285 95356 96190 96934 97847 99120 100706 102210 103237 104053
54087A04053J588L096M193M101L165K225J700J478J293Q89J38q38j767k472k769
$$ 104053 105641 108737 112930 117031 120196 122421 124121 125599 126892 127781 127919 127081 125314 122842 120073
54072A20073k394j476q82j344k330k571j763q22l53J27R71J481R42j06n12J3Q47
$$ 120073 117679 116203 115321 113977 111647 109076 107313 106491 106138 106265 107236 108717 109659 109553 109041 109054 109901
54055A09901J506J984K287K329K290K441K643K492J974J559J615K036K529K948
$$ 109901 111407 113391 115678 118007 120297 122738 125381 127873 129847 131406 133021 135057 137586 140534
54041A40534L366L903M519M903M745M123L481L122K955K774K542K278J993J748
$$ 140534 143900 147803 152322 157225 161970 166093 169574 172696 175651 178425 180967 183245 185238 186986
54027A86986J556J178M08m14o32k04J00l53j329k207k718k975l134l397l979m670
$$ 186986 188542 189720 190128 189714 189082 188878 188978 188625 187296 185089 182371 179396 176262 172865 168886 164216
54011A64216m834m169l208k657k563k475k212k001j966j949j785j533j391j481
$$ 164216 159382 155213 152005 149348 146785 144310 142098 140097 138131 136182 134397 132864 131473 129992
53997A29992j698j713j284m96L93J213J702J345nj470j858j118l83m04o86m72
$$ 129992 128294 126581 125297 124801 125194 126407 128109 129454 129449 127979 126121 125003 124620 124216 123530 123058
53981A23058J20M66L41n8m64n76j65M64O21K47O6L65M29k24p88l40N84P01q4n87
$$ 123058 123178 123644 123985 123927 123463 122887 122722 123186 123807 124054 124120 124485 124914 124690 123902 123562 124146 124847 124763 124176
53961A24176j10P61J257J358J332J105O10K28M59J313K263K736K542J999J626
$$ 124176 124066 124827 126084 127442 128774 129879 130489 130717 131176 132489 134752 137488 140030 142029 143655
53946A43655J674J985K364K801L267L538L568L668M044M396M329L882L329K780
$$ 143655 145329 147314 149678 152479 155746 159284 162852 166520 170564 174960 179289 183171 186500 189280
53932A89280K308K154K288K232J731J323J601K271K603K606K922L648M096L915
$$ 189280 191588 193742 196030 198262 199993 201316 202917 205188 207791 210397 213319 216967 221063 224978
53918B24978L702M206N326O208O109N037L713K933K704K169O75j241k309j924
$$ 224978 228680 232886 238212 244420 250529 255566 259279 262212 264916 267085 267760 266519 264210 262286
53904B62286o92L14M07m98j994l424m354m875n246n381n118m770m848n325n662
$$ 262286 261594 261908 262315 261817 259823 256399 252045 247170 241924 236543 231425 226655 221807 216482 210820
53889B10820n624n479n380n069m399l638l145l070l458m192m744m498l542k653
$$ 210820 205196 199717 194337 189268 184869 181231 178086 175016 171558 167366 162622 158124 154582 151929
53875A51929k302k088j467o19k29n97j329j813j752j335j030j162j618k013k128
$$ 151929 149627 147539 146072 145453 145224 144627 143298 141485 139733 138398 137368 136206 134588 132575 130447
53860A30447j980j584r16j67L69P18J150J553J327J90j204j890j692j245j019
$$ 130447 128467 126883 125967 125800 126169 126887 128037 129590 130917 131107 129903 128013 126321 125076 124057
53845A24057p57n6Q72J313Q55j59r83j109n41L10Q78P92J95l64n42n44o67o97
$$ 124057 123300 123244 124116 125429 126284 126125 125142 124033 123492 123802 124680 125472 125667 125303 124761 124217 123550 122853
53827A22853k22O23J237J441J681K179K475K205J815J924K377K503K127J707J636
$$ 122853 122631 123254 124491 125932 127613 129792 132267 134472 136287 138211 140588 143091 145218 146925 148561
53812A48561J880K361L081L838M242M161L867L664L634L783M035M073L484K297
$$ 148561 150441 152802 155883 159721 163963 168124 171991 175655 179289 183072 187107 191180 194664 196961
53798A96961J136O35Q32J232J427J435J442J366R22J40n06p39r81j778k881l548
$$ 196961 198097 198732 199564 200796 202223 203658 205100 206466 207388 207528 207022 206283 205302 203524 200643 197095
53782A97095l675l932m564m871m288l312k785k778k801k656k438k064j505j186
$$ 197095 193420 189488 184924 180053 175765 172453 169668 166890 164089 161433 158995 156931 155426 154240
53768A54240j515k173k477k203j560p23o4l47j813l315l379k033o89k55l37l31
$$ 154240 152725 150552 148075 145872 144312 143589 143525 143178 141365 138050 134671 132638 131949 131694 131357 131026
53752A31026k85l37k67J9K07J44O9R0K7JM13J131J450J193J001J139R27p2j064
$$ 131026 130741 130404 130137 130156 130363 130507 130576 130666 130693 130694 131107 132238 133688 134881 135882 137021 137948 137876 136812
53733A36812j035j57O20Q93R72J054J069J166J595K091K088J564J170J420K159
$$ 136812 135777 135620 136240 137133 138105 139159 140228 141394 142989 145080 147168 148732 149902 151322 153481
53718A53481K889L261L239L040K929K832K361J426O09N09Q76R08L76j07k3L31
$$ 153481 156370 159631 162870 165910 168839 171671 174032 175458 176067 176576 177452 178360 178736 178629 178606 178937
53702A78937L42m7l38j56L70Q90J260J540J747J776J593J338J195J171J165J102
$$ 178937 179279 179232 178894 178738 179108 179998 181258 182798 184545 186321 187914 189252 190447 191618 192783 193885
53686A93885R11M60k20o74l90N12J224J086L23k79k13L53R08J101R90R53J289
$$ 193885 194796 195256 195036 194362 193972 194484 195708 196794 197117 196838 196625 196978 197886 198987 199977 200930 202219
53669B02219J860K220K087J565Q46k7q91j267p92K44J126J491J563J628J580J237
$$ 202219 204079 206299 208386 209951 210797 210770 209879 208612 207820 208064 209190 210681 212244 213872 215452 216689
53653B16689Q07P24J035J254R30J61n63r07q88o55l00J10M89P81Q74O22J14j50
$$ 216689 217496 218220 219255 220509 221439 221600 221037 220130 219242 218587 218287 218397 218886 219667 220541 221163 221277 221127
53635B21127K69J039J240M08r19j862k040j551n85N11J141J020O67Q96J829K826
$$ 221127 221396 222435 223675 224083 223164 221302 219262 217711 217126 217637 218778 219798 220465 221361 223190 226016
53619B26016L227K900K117J326R43J009J163J159J277J778K297K267J791J448
$$ 226016 229243 232143 234260 235586 236529 237538 238701 239860 241137 242915 245212 247479 249270 250718
53605B50718J406J355J330J757K587L055K671J849J283J142J202J313J388J250
$$ 250718 252124 253479 254809 256566 259153 262208 264879 266728 268011 269153 270355 271668 273056 274306
53591B74306Q55M21J37k3m9J30L30R0o96j533j871j657j103l54L86P54O08K41
$$ 274306 275161 275582 275719 275696 275647 275777 276107 276197 275501 273968 272097 270440 269337 268983 269369 270123 270731 270972
53573B70972p3m63j076j653j826j656j479j403j261r34m93o9J58K7l99p64p60
$$ 270972 270899 270436 269360 267707 265881 264225 262746 261343 260082 259148 258655 258586 258744 258771 258372 257608 256848
53556B56848l92J41O57R44Q55N48M18N21M26j27p21p89l59J06M70R96J682K062
$$ 256848 256456 256597 257254 258198 259053 259601 260019 260540 260966 260839 260118 259329 258970 259076 259546 260542 262224 264286
53538B64286J841J434J531K250K958L019K599K497L150M088M573M568M663N149
$$ 264286 266127 267561 269092 271342 274300 277319 279918 282415 285565 289653 294226 298794 303457 308606
53524C08606N649N805N781N871N936N715N404N503O190P143P949Q441Q670Q787
$$ 308606 314255 320060 325841 331712 337648 343363 348767 354270 360460 367603 375552 383993 392663 401450
53510D01450R001R423R933J0367J0851J1732J3080J4392J5007J4863J4583J4714
$$ 401450 410451 419874 429807 440174 451025 462757 475837 490229 505236 520099 534682 549396
53498E49396J5108J5284J5257J5444J5787J5607J4694J3877J3927J4334J4030
$$ 549396 564504 579788 595045 610489 626276 641883 656577 670454 684381 698715 712745
53487G12745J3048J2549J3125J3953J3995J3319J2778J2794J3004J2887J2339
$$ 712745 725793 738342 751467 765420 779415 792734 805512 818306 831310 844197 856536
53476H56536J1678J1295J1330J1562J1672J1444J0660R152P275N994N891O226
$$ 856536 868214 879509 890839 902401 914073 925517 936177 945329 952604 958598 964489 970715
53464I70715N632L658J069j333l327m799n511n759o389p752r179r884r854r478
$$ 970715 976347 980005 981074 979741 976414 971615 966104 960345 953956 946204 937025 927141 917287 907809
53450I07809q976q578q742r613j0672j1321j1534j1607j1697j1896j2205j2164
$$ 907809 898833 890255 881513 871900 861228 849907 838373 826766 815069 803173 790968 778804
53438G78804j1091r074p221o420o392o349n986n324m217k726j454q61o32l03q
$$ 778804 767713 758639 751418 744998 738606 732257 726271 720947 716730 714004 712550 711689 711057 710754 710746
53423G10746PP8O58J566K446L452M748N800O075O073O652P745Q635R304J0406
$$ 710746 710753 710831 711489 713055 715501 718953 723701 729501 735576 741649 748301 756046 764681 773985 784391
53408G84391J2006J3481J4629J5811J6988J7693J8134J9219K1086K2727K3510
$$ 784391 796397 809878 824507 840318 857306 874999 893133 912352 933438 956165 979675
53397I79675K4152K5518K7292K8608K9395L0231L1277L2173L2806L3485L4285
$$ 979675 1003827 1029345 1056637 1085245 1114640 1144871 1176148 1208321 1241127 1274612 1308897
53386A308897L4865L5009L4980L5098L5247L4985L4081L2830L1722L0896L0033
$$ 1308897 1343762 1378771 1413751 1448849 1484096 1519081 1553162 1585992 1617714 1648610 1678643
53375A678643K8830K7350K5745K3880K1520J8813J6242J4074J2074R718O611K792
$$ 1678643 1707473 1734823 1760568 1784448 1805968 1824781 1841023 1855097 1867171 1876889 1883500 1886292
53363A886292j179m651p589j0629j4219j7984k1287k3989k6236k7872k8798k9608
$$ 1886292 1885113 1880462 1872873 1862244 1848025 1830041 1808754 1784765 1758529 1730657 1701859 1672251
53351A672251l1059l2911l4143l4288l3846l3202l2025l0128k8131k6753k5949
$$ 1672251 1641192 1608281 1574138 1539850 1506004 1472802 1440777 1410649 1382518 1355765 1329816
53340A329816k5307k4867k4938k5385k5666k5496k5019k4349k3365k2040k0624
$$ 1329816 1304509 1279642 1254704 1229319 1203653 1178157 1153138 1128789 1105424 1083384 1062760
53329A062760j9377j8272j7119j5841j4564j3435j2391j1250j0063r285r403j0356
$$ 1062760 1043383 1025111 1007992 992151 977587 964152 951761 940511 930448 921163 911760 901404
53317I01404j1468j1952j1527j0613r958r963j0231r959q825p303o025n043m046
$$ 901404 889936 877984 866457 855844 845886 835923 825692 815733 806908 799605 793580 788537 784491
53304G84491k925j853r50k60J19K38M96J304K587M000N404O809P994Q785R558
$$ 784491 781566 779713 778763 778503 778622 778860 779356 780660 783247 787247 792651 799460 807454 816239 825797
53289H25797J0917J2804J4466J5409J5840J6068J5911J5053J3695J2532J2164
$$ 825797 836714 849518 863984 879393 895233 911301 927212 942265 955960 968492 980656
53278I80656J2538J2909J2393J0850R069P865P137O164M636K890J236m04k113
$$ 980656 993194 1006103 1018496 1029346 1038415 1046280 1053417 1059581 1064217 1067107 1068343 1067939 1065826
53265A065826l772n336o908q443r805j1133j2709j4405j5745j6592j7340j8233
$$ 1065826 1062054 1056718 1049810 1041367 1031562 1020429 1007720 993315 977570 960978 943638 925405
53253I25405j8954j9057j8496j7569j6693j6260j6385j6705j6804j6774j6946
$$ 925405 906451 887394 868898 851329 834636 818376 801991 785286 768482 751708 734762
53242G34762j7132j6770j5894j5323j5570j6186j6413j6040j5336j4557j3848
$$ 734762 717630 700860 684966 669643 654073 637887 621474 605434 590098 575541 561693
53231E61693j3231j2533j1666j1006j0969j1162j0650r253p868p206o951o583
$$ 561693 548462 535929 524263 513257 502288 491126 480476 471223 463355 456149 449198 442615
53219D42615o249o224o271o194o440p368q365q576q108p801q072q732r581j0390
$$ 442615 436366 430142 423871 417677 411237 403869 395504 386928 378820 371019 362947 354215 344634 334244
53205C34244j0551r674q408p825p990p975p284o391n746n160m510m173m336m544
$$ 334244 323693 314019 305611 297786 289796 281821 274537 268146 262400 257240 252730 248557 244221 239677
53191B39677m447m381m724n130m972m268l575l247l233l445l749l746l104k115
$$ 239677 235230 230849 226125 220995 216023 211755 208180 204933 201700 198255 194506 190760 187656 185541
53177A85541j516j615j958j877j193k17N48O48r1j304k215k248j579q91o89r08
$$ 185541 184025 182410 180452 178575 177382 177165 177713 178361 178270 176966 174751 172503 170924 170033 169344 168436
53161A68436j167j239j219j345j717k194k486k352j683n32Q44J973K380K009J352
$$ 168436 167269 166030 164811 163466 161749 159555 157069 154717 153034 152502 153346 155319 157699 159708 161060
53146A61060R89R58P44o4j168j811j557p59j49l5PN09J374J942J838J446J313
$$ 161060 162049 163007 163751 163687 162519 160708 159151 158392 158243 158208 158215 158724 160098 162040 163878 165324 166637
53129A66637J410J302R00N95O19P64P72O59M63R6l34m16M4O26P39K69m34j015
$$ 166637 168047 169349 170249 170844 171463 172227 172999 173658 174121 174217 173883 173467 173511 174137 174876 175145 174711 173696
53111A73696j284j183q75p56j009j314j247q63n76n94q11j118j511j854j878j459
$$ 173696 172412 171229 170354 169598 168589 167275 166028 165165 164589 163995 163184 162066 160555 158701 156823 155364
53095A55364p49n0K77jp41j402j520j096m57P0K19j16o21o95j60M31M97P7m41
$$ 155364 154615 154565 154842 154841 154100 152698 151178 150082 149625 149695 149914 149798 149177 148482 148322 148753 149250 149327 148886
53076A48886r06j271j331j070q73r05o13M58J666J878R03l78j136j172n19O48
$$ 148886 147980 146709 145378 144308 143435 142530 141917 142375 144041 145919 146822 146444 145308 144136 143617 144265
53060A44265J705J973J547J117R36O47J63j15m5j9k44m58m98n40n50k47K13J69
$$ 144265 145970 147943 149490 150607 151543 152190 152353 152238 152193 152174 151930 151472 150974 150434 149884 149637 149850 150019
53042A50019o00j466j792j561r96j81O42J020R00P57Q54R09P37N94O38O29M52
$$ 150019 149419 147953 146161 144600 143604 143423 144065 145085 145985 146742 147596 148505 149242 149836 150474 151103 151555
53025A51555K54r7r31j832j694k74J192J536J114R73J251J259P10K2l81l78k0
$$ 151555 151809 151712 150781 148949 147255 146981 148173 149709 150823 151796 153047 154306 155016 155038 154657 154279 154259
53008A54259M05L97j09m31Q1J228K337L078L424L244K513J654J115R03R10J324
$$ 154259 154664 155061 154952 154521 154602 155830 158167 161245 164669 167913 170426 172080 173195 174098 175008 176332
52992A76332K137K724K482J622P43J9o26r96r14p61r75j284j140o27k93k73k86
$$ 176332 178469 181193 183675 185297 186040 186059 185433 184437 183523 182762 181787 180503 179363 178736 178443 178170 177884
52975A77884l11m83m73J89J187J570J004K24M8L99N52Pj033j884j974j360n82
$$ 177884 177573 177090 176617 176806 177993 179563 180567 180791 180839 181238 181790 181797 180764 178880 176906 175546 174964
52958A74964k8K97L15j79q96j005j80Q13J116Q28M81Q6n31r99r42q08j224j793
$$ 174964 174936 175233 175548 175369 174473 173468 173288 174101 175217 176045 176526 176612 176081 175082 174140 173332 172108 170315
52940A70315j643r43p16j153j273n09M09O08K86K35P07J214J168M41m68q00l32
$$ 170315 168672 167729 167013 165860 164587 164078 164487 165095 165381 165616 166323 167537 168705 169146 168678 167878 167546
52923A67546L10M71L70O13J068J017L61j70j14J80K46O8k44o57r17o40L8M70K96
$$ 167546 167856 168327 168697 169310 170378 171395 171756 171586 171472 171652 171898 171966 171722 171065 170148 169508 169546 170016 170312
52904A70312k51q26j243j212n42L08O04L60K50L99J79n56r93o13o7j27n07m10
$$ 170312 170061 169235 167992 166780 166238 166546 167150 167510 167760 168159 168338 167782 166789 166176 166109 165982 165475 165065
52886A65065K48R42J406J739J901J796J679J901K369K696K767K726K546K034J190
$$ 165065 165313 166255 167661 169400 171301 173097 174776 176677 179046 181742 184509 187235 189781 191815 193005
52871A93005J83q74j827k295k010j347j144j832k970l660l377k342j217n27l65
$$ 193005 193188 192314 190487 188192 186182 184835 183691 181859 178889 175229 171852 169510 168293 167766 167401
52856A67401n93j097j735k217k284j967j448q47l01r2k67m06j26K57J50l73o23
$$ 167401 166808 165711 163976 161759 159475 157508 156060 155213 154912 154820 154553 154147 154021 154278 154428 154055 153432
52839A53432l37p5l51r50j296j127n41K57R95J416J509J442J240Q34L70J06k1
$$ 153432 153095 153020 152669 151719 150423 149296 148755 149012 150007 151423 152932 154374 155614 156448 156818 156924 156903
52822A56903k93o59q02p40q10r84q30k92J00K0k93o45j207j880k013j265k00M58
$$ 156903 156610 155951 155149 154409 153599 152615 151785 151493 151593 151613 151320 150675 149468 147588 145575 144310 144110 144568
52804A44568P13R77J286J360J113O51Q5k71Q6J093J798J372K78k57J62O63K98
$$ 144568 145281 146258 147544 148904 150017 150668 150753 150482 150568 151661 153459 154831 155109 154852 155014 155677 155975
52787A55975p94j655j604q54j79j23n68j044j267j228r41m06J67M84N12L70l5
$$ 155975 155181 153526 151922 151068 150889 150766 150198 149154 147887 146659 145718 145312 145479 145963 146475 146845 146810
52770A46810p44j220p44M72J254Q74j0k58L96J345J967K030J567Q64M07M35O51
$$ 146810 146066 144846 144102 144574 145828 146702 146692 146434 146830 148175 150142 152172 153739 154603 155010 155445 156096
52753A56096O75N79P24J248J923K322K052J130K32J22P47J306J335J087P46P0
$$ 156096 156771 157350 158074 159322 161245 163567 165619 166749 166981 167103 167850 169156 170491 171578 172324 172394
52737A72394q34j243q65m32n87q73n81L2K81K88O46J192J197O57L29M78N32J68
$$ 172394 171560 170317 169452 169020 168433 167560 166979 167011 167292 167580 168226 169418 170615 171272 171601 172079 172611 172779
52719A72779j45O5N71Q45O45J2q28j400j254n12K61P53J052J158Q66K85j04j05
$$ 172779 172634 172699 173270 174115 174760 174772 173944 172544 171290 170778 171039 171792 172844 174002 174868 175153 175049 174944
52701A74944j33o19j414k049k293k285k278k349k277j729p43R5K31k43q35j293
$$ 174944 174811 174192 172778 170729 168436 166151 163873 161524 159247 157518 156775 156870 157101 156858 156023 154730
52685A54730j595j481o48N40J140O74l58j139j405j401j317j057m72K83P12M36
$$ 154730 153135 151654 151006 151546 152686 153360 153002 151863 150458 149057 147740 146683 146211 146494 147206 147642
52669A47642k11l32L95J133R22P1k34L75R94Q67L88K95N69P82J006J594K294K316
$$ 147642 147431 147099 147494 148627 149549 149620 149386 149761 150755 151622 152010 152305 152874 153656 154662 156256 158550 160866
52651A60866J396K87n8M72J104J048K39o86j077p85j12N47R19Q55M25p6l70m66
$$ 160866 162262 162549 162491 162963 164067 165115 165354 164668 163591 162806 162694 163241 164160 165015 165440 165364 164994 164528
52633A64528m93m29k10ql2j73j77j59m79j037j227p86k35j73n55r60j277j577
$$ 164528 164035 163606 163396 163388 163356 163183 163006 162847 162368 161331 160104 159318 159083 158910 158355 157395 156118 154541
52615A54541j611r89J08Q91Q19K14j75j7L91O38O56O08N28L07K7O5O69J503J853
$$ 154541 152930 151941 152049 152940 153759 153973 153798 153781 154172 154810 155466 156074 156602 156909 156936 157001 157670 159173 161026
52596A61026J383M52l25p11q40q26o17k59m6k18o40q73o36r3L52M81M50N99J079
$$ 161026 162409 162861 162536 161825 160985 160159 159542 159283 159237 159019 158379 157506 156870 156777 157129 157610 158060 158659 159738
52577A59738J695K014J740J045M46L15N66R12J279J743K162K219J827J281R03
$$ 159738 161433 163447 165187 166232 166678 166993 167559 168471 169750 171493 173655 175874 177701 178982 179885
52562A79885P97R22J163J227Q02n2q99j484j953k376k414j819r97o77j032j518
$$ 179885 180682 181604 182767 183994 184796 184744 183845 182361 180408 178032 175618 173799 172802 172125 171093 169575
52546A69575j509q65J35J109J752J873J451P12J28J82Q76J620J824J574J377J284
$$ 169575 168066 167201 167336 168445 170197 172070 173521 174233 174361 174543 175419 177039 178863 180437 181814 183098
52530A83098Q60N7m75l10J03K07K28O79J308J324N28m27r11q94o01j62K05J72
$$ 183098 183958 184015 183540 183230 183333 183540 183768 184447 185755 187079 187607 187180 186269 185375 184774 184612 184817 184989
52512A84989k89p53q11n80n08q56j393j612j253o55m89j018j847k405k451j989
$$ 184989 184700 183947 183136 182556 182048 181192 179799 178187 176934 176279 175790 174772 172925 170520 168069 166080
52496A66080j073J1P35Q58P23O73N46J57j15J82P52R28O58M72N92P65R71J516
$$ 166080 165007 165018 165753 166611 167334 168007 168553 168710 168595 168777 169529 170457 171115 171587 172179 172944 173915 175431
52478A75431K285K603K133J442J320J988L069L975M192L636K889K690L082L402
$$ 175431 177716 180319 182452 183894 185214 187202 190271 194246 198438 202074 204963 207653 210735 214137
52464B14137L213K736K190J390K26q62j389j498j742k400l191l643l496k888k178
$$ 214137 217350 220086 222276 223666 223892 223030 221641 220143 218401 216001 212810 209167 205671 202783 200605
52449B00605j564j000n77o52j233j521p98M12Q23J09o91p04k90j25J5P44J867
$$ 200605 199041 198041 197464 196812 195579 194058 193260 193672 194495 194604 193913 193209 192919 192794 192809 193553 195420
52432A95420K505K234J458O47j92j140j855j763p29N94J263J048O93R37J470J388
$$ 195420 197925 200159 201617 202264 202072 200932 199077 197314 196585 197179 198442 199490 200183 201120 202590 203978
52416B03978N55j66j63J87K69O2j87m87p77p02k63j74q85j650j418l70K58j40
$$ 203978 204533 204367 204204 204391 204660 204722 204535 204048 203271 202569 202306 202132 201247 199597 198179 197809 198067 197927
52398A97927q90j130p89k39L42Q95J144Q61K10m05p32p49m77L7O09R48Q60N22
$$ 197927 197037 195907 195118 194879 195221 196116 197260 198121 198331 197926 197194 196445 195968 196005 196614 197562 198422 198944
52380A98944M48J111K386L541L884L400K621K057J896K119K557K905K919K653
$$ 198944 199392 200503 202889 206430 210314 213714 216335 218392 220288 222407 224964 227869 230788 233441
52366B33441K300J917J525J324J463J655J430Q04K74Mm85j507k531k792k315j760
$$ 233441 235741 237658 239183 240507 241970 243625 245055 245859 246133 246137 245652 244145 241614 238822 236507 234747
52350B34747j335o01N70J497J593J242J207J577J882K060K504L202L583L438L295
$$ 234747 233412 232811 233381 234878 236471 237713 238920 240497 242379 244439 246943 250145 253728 257166 260461
52335B60461L591M125M697N563O757P538P257O324N627N356N183N253O031P269
$$ 260461 264052 268177 272874 278437 285194 292732 299989 306313 311940 317296 322479 327732 333763 341032
52321C41032Q048Q020P851Q256R255J0477J1577J2236J2348J2366J2846J3639
$$ 341032 349080 357100 364951 373207 382462 392939 404516 416752 429100 441466 454312 467951
52309D67951J4155J4355J4684J4993J4520J3221J2086J1689J1392J0512R418Q763
$$ 467951 482106 496461 511145 526138 540658 553879 565965 577654 589046 599558 608976 617739
52297F17739Q423Q001P690P686P349N892L604J583M61R4J73L78J89p03j883k680
$$ 617739 626162 634163 641853 649539 656888 662780 666384 667967 668428 668522 668695 669073 669262 668559 666676 663996
52281F63996k965k974k692k163j946k469l106k834j622l55N50J479K612L545M116
$$ 663996 661031 658057 655365 653202 651256 648787 645681 642847 641225 640870 641420 642899 645511 649056 653172
52266F53172M743N668O629P533Q715J0192J1326J1693J1654J1685J1648J1273
$$ 653172 657915 663583 670212 677745 686460 696652 707978 719671 731325 743010 754658 765931
52254G65931J0841J0798J0910J0384Q845O791N116M238L826L211K093P30n19j581
$$ 765931 776772 787570 798480 808864 817709 824500 829616 833854 837680 840891 842984 843714 843195 841614
52240H41614k430k839k817k988l898n125n757n692n690o096o380o198o009o187
$$ 841614 839184 836345 833528 830540 826642 821517 815760 810068 804378 798282 791902 785704 779695 773508
52226G73508o281n856n338n265n167m213k687j809j985k183j347K54J616K384
$$ 773508 767227 761371 756033 750768 745601 741388 738701 736892 734907 732724 731377 731631 733247 735631
52212G35631K982L641L928L457K551J969K058K491K752K622K167J455N04n31j287
$$ 735631 738613 742254 746182 749639 752190 754159 756217 758708 761460 764082 766249 767704 768208 767677 766390
52197G66390j400q81k23l7m19p86o27k53m27j160j523r82l41p35k033k988k881
$$ 766390 764990 764109 763886 763849 763430 762644 762017 761764 761337 760177 758654 757672 757331 756596 754563 751575 748694
52180G48694k247j941k117k441k686k767k590k251k084k170k110j611j006q02
$$ 748694 746447 744506 742389 739948 737262 734495 731905 729654 727570 725400 723290 721679 720673 719871
52166G19871r37q74l69K52N45L76j33p85j339j606j611j580j651j657j338p16
$$ 719871 718934 718060 717691 717943 718488 718864 718731 717946 716607 715001 713390 711810 710159 708502 707164 706448
52150G06448k30l24r47j517j544j157r13j074j356j382j152r58q98p17j35P15
$$ 706448 706218 705894 704947 703430 701886 700729 699816 698742 697386 696004 694852 693894 692996 692279 692144 692859
52134F92859J335J358R95Q47J288K232L456M874O280P257P721Q289R588J1290
$$ 692859 694194 695552 696547 697394 698682 700914 704370 709244 715524 722781 730502 738791 748379 759669
52120G59669J2370J2367J1842J1469J1238J0864J0499J0496J0739J0749J0410
$$ 759669 772039 784406 796248 807717 818955 829819 840318 850814 861553 872302 882712
52109H82712J0169J0352J0686J0649J0228R939J0066J0115R276P441N468M315
$$ 882712 892881 903233 913919 924568 934796 944735 954801 964916 974192 981633 987101 991416
52097I91416M116M242M007L025J192j206l397m670n058n206n518n831n888n748
$$ 991416 995532 999774 1003781 1006806 1007998 1006792 1003395 998725 993667 988461 982943 977112 971224 965476
52083I65476n529n203m811m551m479m366m014l368k320q09P29J541J545J640K647
$$ 965476 959947 954744 949933 945382 940903 936537 932523 929155 926835 926026 926755 928296 929841 931481 934128
52068I34128M203N206N116M348L647L510M086N172O247O829O836O464N885N300
$$ 934128 938331 943537 948653 953001 956648 960158 964244 969416 975663 982492 989328 995792 1001677 1006977
52054A006977N034N161N196M602L484K424J660R13j5r55j802k734l907n223o574
$$ 1006977 1012011 1017172 1022368 1026970 1030454 1032878 1034538 1035451 1035436 1034481 1032679 1029945 1026038 1020815 1014241
52039A014241p990r347j0334j0856j1231j1727j2170j2258j2036j1806j1670j1488
$$ 1014241 1006251 996904 986570 975714 964483 952756 940586 928328 916292 904486 892816 881328
52027H81328j1173j0800j0453j0127r756r239q521p808p560p998q677q795q044
$$ 881328 870155 859355 848902 838775 829019 819780 811259 803451 795891 787893 779216 770421 762377
52014G62377o955o369o703p775r093j0197j0906j1440j2253j3530j4904j5804
$$ 762377 755422 749053 742350 734575 725482 715285 704379 692939 680686 667156 652252 636448
52002F36448j6107j6220j6493j6784j6756j6426j6166j6170j6162j5730j4805
$$ 636448 620341 604121 587628 570844 554088 537662 521496 505326 489164 473434 458629
51991D58629j3693j2676j1666j0385q780p239o200n610m891l637k254j660k338
$$ 458629 444936 432260 420594 410209 401429 394190 387990 382380 377489 373852 371598 369938 367600
51978C67600l763m902n183m920m793n011n020m093k177r0J249J721K028K897M458
$$ 367600 363837 358935 353752 348832 344039 339028 334008 329915 327738 327648 328897 330618 332646 335543 340001
51963C40001O451Q720J1301J4107J6862J9448K2227K5738K9979L3901L5797L4343
$$ 340001 346452 355172 366473 380580 397442 416890 439117 464855 494834 528735 564532 598875
51951E98875K9355K1545J1687L93j1187k0989k7023k8997k8588k7814k7358k6642
$$ 598875 628230 649775 661462 661855 650668 629679 602656 573659 545071 517257 489899 463257
51939D63257k5159k3080k0618j7632j4242j1288r587r019q852q741q751q533p379
$$ 463257 438098 415018 394400 376768 362526 351238 341651 332632 323780 315039 306288 297755 290376
51926B90376n303l348k362k062j719j262j073j188j404j924l117m640n534n356
$$ 290376 285073 281725 279363 277301 275582 274320 273247 272059 270655 268731 265614 260974 255440 250084
51912B50084m680m258m175l996l446k626j838j353j260j407j553j534j205m67
$$ 250084 245404 241146 236971 232975 229529 226903 225065 223712 222452 221045 219492 217958 216753 216286
51898B16286M76J156J511K191L655N206N651M859L916L582L501L160K899L301
$$ 216286 216762 217918 219429 221620 225275 230481 236132 240991 244907 248489 251990 255150 258049 261350
51884B61350M178M772M665M002L035J950R90L09j31l32j76J49rj053k520l631
$$ 261350 265528 270300 274965 278967 282002 283952 284942 285251 285120 284788 284612 284761 284752 283699 281179 277548
51868B77548m202m618n087n459n646n706n583n193m742m576m718m913n018m986
$$ 277548 273346 268728 263641 258182 252536 246830 241247 236054 231312 226736 222018 217105 212087 207101
51854B07101m548l419j893p16l00l85n26n54m49k03K1n2m15o90o34m35l56l50
$$ 207101 202553 199134 197241 196525 196225 195840 195314 194760 194311 194108 194129 194077 193662 192972 192338 191903 191547 191197
51836A91197k71j95k90n06n92l32L77J470K526K813J915L23r09j195q85o16m51
$$ 191197 190926 190731 190441 189935 189343 189011 189388 190858 193384 196197 198112 198435 197526 196331 195446 194830 194379
51819A94379PQ72J669J937J736J418J095O32L4m88p27n46J68J225J934J674P39
$$ 194379 194386 195258 196927 198864 200600 202018 203113 203745 203779 203291 202564 202018 202186 203411 205345 207019 207758
51802B07758J20K69N95L90k00m77j14O60J487K074K222K029J911K139K511K770
$$ 207758 207878 208147 208742 209132 208932 208455 208341 209001 210488 212562 214784 216813 218724 220863 223374 226144
51786B26144K924K890K225Q01o51j300j225j069r57n72r0j71r18j625j735j361
$$ 226144 229068 231958 234183 234984 234333 233033 231808 230739 229782 229210 229120 228949 228031 226406 224671 223310
51770B23310p94j63K58J59k01j91J72J69m33r35q88q34j301j846j839j552j591
$$ 223310 222516 222353 222611 222770 222569 222378 222550 222719 222286 221351 220463 219629 218328 216482 214643 213091 211500
51753B11500j807j618j057o14l44L0L05j4p10r38l74M11Q31R25R45J000J188J577
$$ 211500 209693 208075 207018 206404 206060 206090 206395 206381 205671 204733 204359 204770 205601 206526 207471 208471 209659 211236
51735B11236J927J977K020K583L481L892L472K692J858P38n64j224q37j82j50
$$ 211236 213163 215140 217160 219743 223224 227116 230588 233280 235138 235876 235312 234088 233251 233069 232919
51720B32919m99m95k95o77j707k588k815k592k148j457p85o70j068j243q79o58
$$ 232919 232420 231925 231630 230953 229246 226658 223843 221251 219103 217646 216861 216191 215123 213880 213001 212343
51704B12343j270k336k946k828k489k351k381k417k407k235j789j205p68n39l70
$$ 212343 211073 208737 205791 202963 200474 198123 195742 193325 190918 188683 186894 185689 184921 184382 184012
51689A84012k39j88k4N29J218J324N99k36l56J56O12Q85J615L202N085O349O665
$$ 184012 183773 183585 183561 184090 185308 186632 187231 186995 186639 186795 187407 188292 189907 193109 198194 204543 211208
51672B11208O395O029N820N767N572M795L411K110J686K188L021L832M712N493
$$ 211208 217603 223632 229452 235219 240791 245586 248997 251107 252793 254981 258002 261834 266546 272039
51658B72039N477M189K035j78k012l431m473n323o357p599q398q165p244o462
$$ 272039 277516 281705 283740 283562 281550 278119 273646 268323 261966 254367 245969 237804 230560 224098
51644B24098o000n343m310l352k799k455k127j882j629j156q24j383k695l451
$$ 224098 218098 212755 208445 205093 202294 199839 197712 195830 194201 193045 192221 190838 188143 184692
51630A84692k776j434o49m65j52K71J69k85j22Q82J733J690J187Q61N70Km48k21
$$ 184692 181916 180482 179833 179368 179216 179487 179656 179371 179249 180131 181864 183554 184741 185602 186172 186174 185726 185505
51612A85505M57Q86R14J001J422K070K895L930M775M656L219J015j010k243k578
$$ 185505 185962 186848 187762 188763 190185 192255 195150 199080 203855 208511 211730 212745 211735 209492 206914
51597B06914k200j490r07p20p36n13J57J051J811K308K560K468J922J204Q90J122
$$ 206914 204714 203224 202317 201597 200861 200348 200505 201556 203367 205675 208235 210703 212625 213829 214719 215841
51581B15841J301Q76J53j80p6q8l03n9J078K626L855M686N483O428P424Q398R266
$$ 215841 217142 218018 218171 217991 217915 217827 217524 217465 218543 221169 225024 229710 235193 241621 249045 257443 266709
51564B66709R851J0289J1157J2819J4749J5964J5880J4445J1727P968L885K06
$$ 266709 276560 286849 298006 310825 325574 341538 357418 371863 383590 391558 395443 395649
51552C95649l043o259r289j1402j2310j2554j2630j2332j1369j0068r051q489
$$ 395649 392606 386347 377058 365656 353346 340792 328162 315830 304461 294393 285342 276853
51540B76853q082p573o896o054n177m574m389m397m318m177m010l492k314p73
$$ 276853 268771 261198 254302 248248 243071 238497 234108 229711 225393 221216 217206 213714 211400 210627
51526B10627M43J053J295J311R63L88J52N55J140J300J036P17L94j33o82p42k38
$$ 210627 211070 212123 213418 214729 215692 216080 216232 216787 217927 219227 220263 220980 221374 221241 220559 219817 219579
51509B19579K96M49M34O10R24J116J174J160R42M19j44m45o73j202j946k488k785
$$ 219579 219875 220324 220758 221368 222292 223408 224582 225742 226684 227103 226959 226514 225841 224639 222693 220205 217420
51492B17420l133l441l169k228j311r63q73m91K6Q7m07r63j197j155r85p23m51
$$ 217420 214287 210846 207677 205449 204138 203175 202302 201811 201837 201924 201517 200554 199357 198202 197217 196494 196043
51475A96043l10k31m0J79J75kP6O40J349J761J942K394L402M643N514N805N935
$$ 196043 195733 195502 195462 195641 195816 195814 195890 196530 197879 199640 201582 203976 207378 212021 217535 223340 229275
51458B29275O425P171P454O699N080L173J281o65k622m273n298n567n091m115
$$ 229275 235700 242871 250325 257024 262104 265277 266558 265893 263271 258998 253700 248133 243042 238927
51444B38927l271l239m059n020n396n101m512l926l421l028k758k501k158j843
$$ 238927 235656 232417 228358 223338 217942 212841 208329 204403 200982 197954 195196 192695 190537 188694
51430A88694j715j631j284p18m33p44j268j306o55K58J064J799K480K736K289
$$ 188694 186979 185348 184064 183346 182913 182169 180901 179595 178940 179198 180262 182061 184541 187277 189566
51415A89566J568J356J838K404K469K104J756J670J770J855J694J183N85L74P14
$$ 189566 191134 192490 194328 196732 199201 201305 203061 204731 206501 208356 210050 211233 211818 212192 212906
51400B12906J278J731K097K446K469J742L33j103j825j545n66N13J371K249L418
$$ 212906 214184 215915 218012 220458 222927 224669 225002 223899 222074 220529 219963 220476 221847 224096 227514
51385B27514M454M555L662K705K405K381J861Q26r3n09n39m13l93p89j596k343
$$ 227514 231968 236523 240185 242890 245295 247676 249537 250363 250270 249761 249222 248809 248416 247627 246031 243688
51369B43688k725l050l551l791l349k694k497k465j882j050r88j730k151j692
$$ 243688 240963 237913 234362 230571 227222 224528 222031 219566 217684 216634 215646 213916 211765 210073
51355B10073j127j252j884k637l589m589m856m095l166k820k569j663n26j51n56
$$ 210073 208946 207694 205810 203173 199584 194995 190139 186044 182878 180058 177489 175826 175300 175149 174593
51340A74593q75p49n21l33K0L58K52j08j11J89J49j37K80J591K518K003Q44O80
$$ 174593 173718 172969 172448 172115 172135 172493 172745 172637 172526 172715 172864 172727 173007 174598 177116 179119 179963 180643
51322A80643J774K816K863K444K472K813K558J375j30j274j950k289k180j568
$$ 180643 182417 185233 188096 190540 193012 195825 198383 199758 199628 198354 196404 194115 191935 190367
51308A90367q72o22p40o86k59K44O69J210J784J835J137L02%J09J29Q5L15O89
$$ 190367 189495 188873 188133 187447 187188 187432 188101 189311 191095 192930 194067 194369 194369 194478 194607 194692 195007 195696
51290A95696P58N68N78P60N20l24j145j345j068p84o23m75l37k37j9M37J027J580
$$ 195696 196454 197022 197600 198360 198880 198556 197411 196066 194998 194214 193591 193116 192779 192542 192523 192960 193987 195567
51272A95567K029K193J810R43J20k89m87p48p99j90R32J871K128J716Q59k23j178
$$ 195567 197596 199789 201599 202542 202662 202373 201886 201138 200339 200149 201081 202952 205080 206796 207655 207432 206254
51255B06254j680j851k159k741l137k847j951r68l18q1j26l05n24p04o86k94L61
$$ 206254 204574 202723 200564 197823 194686 191839 189888 188920 188602 188521 188395 188090 187566 186862 186176 185882 186243
51238A86243P62N11r5m13l74n28r41p87M65J976K468J939J585K025K561K430J941
$$ 186243 187005 187516 187421 187008 186634 186106 185165 184378 184843 186819 189287 191226 192811 194836 197397 199827 201768
51221B01768J823K070K154J927J679J446R74K86k25m09n28p48q37n29J02P57J179
$$ 201768 203591 205661 207815 209742 211421 212867 213841 214127 213902 213493 212965 212217 211380 210851 210953 211710 212889
51204B12889J250J015O94M98M36L70K20o9n77j210j616j589j427j546j878k103
$$ 212889 214139 215154 215848 216346 216782 217152 217372 217303 216726 215516 213900 212311 210884 209338 207460 205357
51188B05357k232k499k704k385j699j445j924k403k059j005Q3Q74J487J926K002
$$ 205357 203125 200626 197922 195537 193838 192393 190469 188066 186007 185002 185085 185959 187446 189372 191374
51173A91374J654J014K62k73r8R62K308K929K327R40k31m03L79J239J266M31n07
$$ 191374 193028 194042 194304 194031 193933 194895 197203 200132 202459 203399 203168 202765 203144 204383 205649 206080 205573
51156B05573j006j227j383j208n37J28K05j80n45q55j314j619j248l71K58M16
$$ 205573 204567 203340 201957 200749 200212 200340 200545 200365 199820 198965 197651 196032 194784 194413 194671 195087
51140A95087O20J088J274Q28L03M23J057J477J304P23M1n35p87o45l93m17o83
$$ 195087 195707 196795 198069 198897 199200 199623 200680 202157 203461 204184 204225 203690 202903 202258 201865 201448 200765
51123B00765q39p20m83k30J31N90Q72Q02N89N93Q39R73O94J23l14l16J3K79K14
$$ 200765 199926 199206 198723 198493 198624 199214 200086 200888 201477 202070 202909 203882 204576 204699 204385 204069 204082 204361 204575
51104B04575k1N4P22J690K266K016J202M85K99N86R95J199J003M72l4j09K52O28
$$ 204575 204554 204608 205330 207020 209286 211302 212504 212989 213288 213874 214869 216068 217071 217543 217509 217400 217652 218280
51086B18280P33P99J191J796K051J675J138J205K083L159L740L944M610O165P881
$$ 218280 219013 219812 221003 222799 224850 226525 227663 228868 230951 234110 237850 241794 246404 252569 260450
51071B60450Q557P839O478N358M683M242L902L560K890J638rj568k676l221l290
$$ 260450 269007 276846 283324 288682 293365 297607 301509 305069 307959 309597 309588 308020 305344 302123 298833
51056B98833l228l454l899l915l083j986j594k049k461k023r41j08j73j016j903
$$ 298833 295605 292151 288252 284337 281254 279268 277674 275625 273164 271141 270200 270092 269919 268903 267000
51041B67000k053j201K12J421J923J742J304J186J668K389K626K215J849K164
$$ 267000 264947 263746 263958 265379 267302 269044 270348 271534 273202 275591 278217 280432 282281 284445
51027B84445K845L135K942K780K755K471K003K033K663K917K056Q06M66J113J621
$$ 284445 287290 290425 293367 296147 298902 301373 303376 305409 308072 310989 313045 313851 314317 315430 317051
51012C17051J320Q22R83J804K768L696M701N561N820N444M894M453L931L201K624
$$ 317051 318371 319193 320176 321980 324748 328444 333145 338706 344526 349970 354864 359317 363248 366449 369073
50997C69073K657L313M340N665P260Q772R681R841R483Q815Q082P879Q816J0704
$$ 369073 371730 375043 379383 385048 392308 401080 410761 420602 430085 438900 446982 454861 463677 474381
50983D74381J2687J4333J6125J8571K1404K4069K6598K9424L2643L5891L8752
$$ 474381 487068 501401 517526 536097 557501 581570 608168 637592 670235 706126 744878
50972G44878M0963M2480M3696M5253M7212M8639M8506M6740M3964M0569L6609
$$ 744878 785841 828321 872017 917270 964482 1013121 1061627 1108367 1152331 1192900 1229509
50961A229509L2330K8055K3714J9157J4767J1103Q045N023K130K13k93J20P91
$$ 1229509 1261839 1289894 1313608 1332765 1347532 1358635 1366680 1371703 1373833 1374046 1373753 1373873 1374664
50948A374664J497K129K400K140J375q4k527n687q788j1450j4069j7137k0802
$$ 1374664 1376161 1378290 1380690 1382830 1384205 1384121 1381594 1375907 1367119 1355669 1341600 1324463 1303661
50935A303661k5119k9948l4436l7549l9427m1246m3313m4381m3583m1968m0931
$$ 1303661 1278542 1248594 1214158 1176609 1137182 1095936 1052623 1008242 964659 922691 881760
50924H81760m0078l7992l4664l1575k9479k7575k5115k2538k0419j8513j6458
$$ 881760 841682 803690 769026 737451 707972 680397 655282 632744 612325 593812 577354
50913E77354j4683j3716j3147j2138j0656r447q806q138o869n261l924k920j789
$$ 577354 562671 548955 535808 523670 513014 503567 494761 486623 479754 474493 470569 467649 465860
50900D65860m08O46R17Q40J296K408L351L489L201L232L651L984M081M246M590
$$ 465860 465452 466098 467015 467855 469151 471559 474910 478399 481600 484832 488483 492467 496548 500794 505384
50885E05384M898N200N885P054Q220Q887R167R517J0248J1422J2998J4798J6515
$$ 505384 510282 515482 521367 528421 536641 545528 554695 564212 574460 585882 598880 613678 630193
50872F30193J7988J9372K0822K2263K3610K5110K7230L0346L4658M0228M6765
$$ 630193 648181 667553 688375 710638 734248 759358 786588 816934 851592 891820 938585
50861I38585N3554N9875O5589P1085P6719Q2463Q8020R3035R7139J00089J01928
$$ 938585 992139 1052014 1117603 1188688 1265407 1347870 1435890 1528925 1626064 1726153 1828081
50850A828081J02783J02381R9968R4913Q7338P7984O7574N6527M5168L3991K3519
$$ 1828081 1930864 2033245 2133213 2228126 2315464 2393448 2461022 2517549 2562717 2596708 2620227
50839B620227J4057N767j016n671p664p063m612j229K558O590J0585J3838J5420
$$ 2620227 2634284 2640051 2639035 2633364 2625700 2618637 2614025 2612796 2615354 2621944 2632529 2646367 2661787
50826B661787J4552J0769M005n270j6134k7751l9799n2221o4646p6267q6269r4205
$$ 2661787 2676339 2687108 2691113 2685843 2669709 2641958 2602159 2549938 2485292 2409025 2322756 2228551
50814B228551r9954j03587j05276j05152j03244r9676r4802q8893q1871p3835
$$ 2228551 2128597 2025010 1919734 1814582 1711338 1611662 1516860 1427967 1346096 1272261
50804A272261o5659n8419n2183m6003l9361l2936k7610k3327j9499j6021j3182
$$ 1272261 1206602 1148183 1096000 1049997 1010636 977700 950090 926763 907264 891243 878061
50793H78061j1014r270p883o834n883m978m638n231o173o566o426o408o567o382
$$ 878061 867047 857777 849894 843060 837177 832199 827561 822330 816157 809591 803165 796757 790190 783808
50779G83808o027o427p779q977r090q564q405q795r165r116q655p928p197o783
$$ 783808 777781 771354 763575 754598 745508 736944 728539 719744 710579 701463 692808 684880 677683 670900
50765F70900o562n795l980j544O95K483M144N906P721R579J1497J3306J4738J5672
$$ 670900 664338 658543 654563 653019 653714 656197 660341 666247 673968 683547 695044 708350 723088 738760
50751G38760J6113J6189J6386J7463J9844K3236K7042L0891L4578L7983M1332
$$ 738760 754873 771062 787448 804911 824755 847991 875033 905924 940502 978485 1019817
50740A019817M5084M9147N2603N4664N5533N5846N5666N4589N2458M9406M5430
$$ 1019817 1064901 1114048 1166651 1221315 1276848 1332694 1388360 1442949 1495407 1544813 1590243
50729A590243M0553L5133K9364K2685J4502N405k960r310j3395j5393j5409j3765
$$ 1590243 1630796 1665929 1695293 1717978 1732480 1737885 1734925 1725615 1712220 1696827 1681418 1667653
50717A667653j1069p762m014k21K939N114O471P131O844N364K659j505p667j5908
$$ 1667653 1656584 1648822 1644808 1644587 1647526 1652640 1659111 1666242 1673086 1678450 1681109 1679604 1671937 1656029
50703A656029k5305l4418m2291m8735n3904n7772n9936n9891n7611n3887m9804
$$ 1656029 1630724 1596306 1554015 1505280 1451376 1393604 1333668 1273777 1216166 1162279 1112475
50692A112475m5819m1674l7151l2497k7951k3356j8526j3691r190m969p34L508
$$ 1112475 1066656 1024982 987831 955334 927383 904027 885501 871810 862620 857651 856917 860425
50680H60425P331J0348J2496J3968J4961J5482J5285J4074J1929R484P568O623
$$ 860425 867756 878104 890600 904568 919529 935011 950296 964370 976299 985783 993351 999974
50668I99974O467O585O566O396O365O695P309P922Q349Q602Q783R004R403J0062
$$ 999974 1006441 1013026 1019592 1025988 1032353 1039048 1046357 1054279 1062628 1071230 1080013 1089017 1098420 1108482
50654A108482J0933J1969J3318J5191J7464J9615K1172K2232K3339K4770K6029
$$ 1108482 1119415 1131384 1144702 1159893 1177357 1196972 1218144 1240376 1263715 1288485 1314514
50643A314514K6219K4991K2882K0557J8049J5081J1938R300P185M853K032n41
$$ 1314514 1340733 1365724 1388606 1409163 1427212 1442293 1454231 1463531 1470716 1475569 1477601 1477060
50631A477060k394m433p845j2240j5843j7508j7635j7045j5857j3877j1307q505
$$ 1477060 1474666 1470233 1462388 1450148 1434305 1416797 1399162 1382117 1366260 1352383 1341076 1332571
50619A332571n523k360N97K877M441N623O691P748Q820R622R362P074K331m389
$$ 1332571 1327048 1324688 1325285 1328162 1332603 1338226 1344917 1352665 1361485 1371107 1380469 1387543 1389874 1385485
50605A385485j1983j9303k5634l0929l5556l9772m3327m5514m5657m3782m0913
$$ 1385485 1373502 1354199 1328565 1297636 1262080 1222308 1178981 1133467 1087810 1044028 1003115
50594A003115l8445l6896l5441l3001k9585k6181k3406k0945j8307j5523j2817
$$ 1003115 964670 927774 892333 859332 829747 803566 780160 759215 740908 725385 712568
50583G12568j0141p488n244l702k453p51J590M054O127P735Q931R580R651R621
$$ 712568 702427 694939 689695 685993 683540 682789 684379 688433 694560 702295 711226 720806 730457 740078
50569G40078J0191J1562J3186J4393J5143J5909J6972J8124J9075J9805K0313
$$ 740078 750269 761831 775017 789410 804553 820462 837434 855558 874633 894438 914751
50558I14751K0404K0026J9468J8912J8091J6862J5808J5717J6631J7910J9220
$$ 914751 935155 955181 974649 993561 1011652 1028514 1044322 1060039 1076670 1094580 1113800
50547A113800K0808K2842K5095K7435L0064L3071L6242L9486M3041M7011N1231
$$ 1113800 1134608 1157450 1182545 1209980 1240044 1273115 1309357 1348843 1391884 1438895 1490126
50536A490126N5642O0357O5115O9249P2482P5193P7510P8760P8259P6177P3016
$$ 1490126 1545768 1606125 1671240 1740489 1812971 1888164 1965674 2044434 2122693 2198870 2271886
50525B271886O8569O2084N3271M2666L1075J9068O877n686j8971l2706m5564n6026
$$ 2271886 2340455 2402539 2455810 2498476 2529551 2548619 2555496 2549810 2530839 2498133 2452569 2396543
50513B396543o3627o8927p2336p3529p2142o8469o3216n6868m9546m1374l2718
$$ 2396543 2332916 2263989 2191653 2118124 2045982 1977513 1914297 1857429 1807883 1766509 1733791
50502A733791k4146j6139q813j956M619J0822J6443K1302K4957K6497K5046K0457
$$ 1733791 1709645 1693506 1684693 1682737 1687356 1698178 1714621 1735923 1760880 1787377 1812423 1832880
50490A832880J3238L767p913k1353l5135m7449n7187o4263o8948p1301p1383o9737
$$ 1832880 1846118 1849885 1841972 1820619 1785484 1738035 1680848 1616585 1547637 1476336 1404953 1335216
50478A335216o7247o4391o0908n6374n0967m5444m0413l5907l1669k7539k3439
$$ 1335216 1267969 1203578 1142670 1086296 1035329 989885 949472 913565 881896 854357 830918
50467H30918j9259j4983j0852p280m572k741j422j01J434K875L864M619N728P383
$$ 830918 811659 796676 785824 778544 773972 771231 769809 769708 771142 774017 777881 782500 788228 795611
50453G95611R250J1197J3607J6569J9137J9807J7686J3068P144J331l365o721
$$ 795611 804861 816058 829665 846234 865371 885178 902864 915932 923076 924407 921042 914321
50441I14321q899r757q951o821m578l086j917j73K192M510O583Q813J1290J3570
$$ 914321 905422 895665 886714 879893 875315 872229 870312 870139 872331 876841 883424 892237 903527 917097
50427I17097J5532J7639K0143K2679K5009K7538L0595L3655L5951L7516L9053
$$ 917097 932629 950268 970411 993090 1018099 1045637 1076232 1109887 1145838 1183354 1222407
50416A222407M0801M2203M2688M2352M1545M0182L7834L4334K9977K5014J9276
$$ 1222407 1263208 1305411 1348099 1390451 1431996 1472178 1510012 1544346 1574323 1599337 1618613
50405A618613J2487M814l163j1049j8935k6987l4895m1977m7722n2033n4950n6372
$$ 1618613 1631100 1635914 1632751 1621702 1602767 1575780 1540885 1498908 1451186 1399153 1344203 1287831
50393A287831n6096n4060n0470m5773m0492l5088k9832k4759j9626j4095q119
$$ 1287831 1231735 1177675 1127205 1081432 1040940 1005852 976020 951261 931635 917540 909421
50382I09421k199K999P314J1141J4692J7497J8831J8351J6116J2226O946R63m940
$$ 909421 907222 910221 917535 928676 943368 960865 979696 998047 1014163 1026389 1033335 1034298 1029358
50369A029358j0455j5638k0284k3920k6496k8612l0690l2315l2682l1601k9688
$$ 1029358 1018903 1003265 982981 959061 932565 903953 873263 840948 808266 776665 746977
50358G46977k7720k6061k4678k3376k1886j9894j7243j4206j1393r294p825o452
$$ 746977 719257 693196 668518 645142 623256 603362 586119 571913 560520 551226 543401 536949
50346E36949m891l508k850k865k844k224j165j97M44R69J606K339L059L788M613
$$ 536949 532058 528550 525700 522835 519991 517767 516602 516405 516849 517818 519424 521763 524822 528610 533223
50331E33223N490O249O820P360Q151R285J0535J1577J2333J3059J4090J5560J7399
$$ 533223 538713 544962 551782 559142 567293 576578 587113 598690 611023 624082 638172 653732 671131
50318F71131J9479K1747K4267K7268L1009L5502M0470M5717N1564N8626O7131
$$ 671131 690610 712357 736624 763892 794901 830403 870873 916590 968154 1026780 1093911
50307A093911P6527Q5570R2054R2233Q1506N7389K2631j5057m7126o8539p8872
$$ 1093911 1170438 1256008 1348062 1440295 1521801 1579190 1601821 1586764 1539638 1471099 1392227
50296A392227q0619p7126p1422o5413n9555n3528m7252m1008l4841k8583k2490
$$ 1392227 1311608 1234482 1163060 1097647 1038092 984564 937312 896304 861463 832880 810390
50285H10390j7212j2896q943m943j250J704M251P096J0402J3688J6477J8592K0030
$$ 810390 793178 780282 771339 766396 765146 766850 771101 778197 788599 802287 818764 837356 857386
50272H57386K0888K1373K1554K1206K0158J8584J6787J4841J2759J0771R000P073
$$ 857386 878274 899647 921201 942407 962565 981149 997936 1012777 1025536 1036307 1045307 1052380
50260A052380M423J013k651o209r770j3517j7225k0385k2658k4027k4651k4560
$$ 1052380 1056803 1057816 1055165 1048956 1039186 1025669 1008444 988059 965401 941374 916723 892163
50248H92163k3636k1925j9901j8187j6956j5875j4700j3591j2665j1620j0226
$$ 892163 868527 846602 826701 808514 791558 775683 760983 747392 734727 723107 712881
50237G12881q827p916p353o555n445m642m528m614m163l222k676l248m708o148
$$ 712881 704054 696138 688785 682230 676785 672143 667615 663001 658838 655616 652940 649692 644984 638836
50223F38836o941p226p480p859q190q405q592q650q332p704p158o819o361n612
$$ 638836 631895 624669 617189 609330 601140 592735 584143 575493 567161 559457 552299 545480 539119 533507
50209E33507m895m526m327m053l805l643l182k151j023m22k02L01J156J802K031
$$ 533507 528612 524086 519759 515706 511901 508258 505076 502925 501902 501480 501278 501579 502735 504537 506568
50194E06568K237K504K201R27o89j653j731j483j337j201r43q33j208j886k253
$$ 506568 508805 511309 513510 514437 513748 512095 510364 508881 507544 506343 505400 504567 503359 501473 499220
50179D99220k001j509j274j199q37k12K49N85J471L105M684N518O134P543R760
$$ 499220 497219 495710 494436 493237 492400 492188 492437 493022 494493 497598 502282 507800 513934 521477 531237
50164E31237J1945J3765J5728J8186K0888K3689K6888L0533L4018L6763L8720
$$ 531237 543182 556947 572675 590861 611749 635438 662326 692859 726877 763640 802360
50153H02360L9939M0090L8910L6752L4353L2228L0511K9141K7828K6013K3153
$$ 802360 842299 882389 921299 958051 992404 1024632 1055143 1084284 1112112 1138125 1161278
50142A161278J8930J3236O182j735r799j7555k4904l1575l6877m0227m1743m2064
$$ 1161278 1180208 1193444 1199626 1197891 1188092 1170537 1145633 1114058 1077181 1036954 995211 953147
50130I53147m1691m0655l8776l6088l2989k9930k6980k3895k0674j7812j5674
$$ 953147 911456 870801 832025 795937 762948 733018 706038 682143 661469 643657 627983
50119F27983j3885j1758r181o671m675l336k773l039l728m176m206m155m183m051
$$ 627983 614098 602340 593159 586488 581813 578477 575704 572665 568937 564761 560555 556400 552217 548166
50105E48166l680l344l177l015k859k939l104k825k053j448j413j475j059l27
$$ 548166 544486 541142 537965 534950 532091 529152 526048 523223 521170 519722 518309 516834 515775 515448
50091E15448K59O95J227J765K080K326K856L696M653N655O628P281P507P743Q452
$$ 515448 515707 516402 517629 519394 521474 523800 526656 530352 535005 540660 547288 554569 562076 569819 578271
50076E78271R421J0004J0007R853R909J0005R605Q300O179L896K251J476J103
$$ 578271 587692 597696 607703 617556 627465 637470 647075 655375 661554 665450 667701 669177 670280
50063F70280O05p0p20j251j632j789j822j947k042j723j041n52l11M64K192M050
$$ 670280 670885 670815 670095 668844 667212 665423 663601 661654 659612 657889 656848 656296 655985 656449 658641 662691
50047F62691N120N884P611J0522J3543J5818J7532J9205K1019K2986K5040K6733
$$ 662691 667811 673695 681306 691828 705371 721189 738721 757926 778945 801931 826971 853704
50035H53704K7513K7470K7174K6714K5583K3602K1239J8728J5719J2203Q986O663
$$ 853704 881217 908687 935861 962575 988158 1011760 1032999 1051727 1067446 1079649 1088635 1095298
50023A095298M628J838j927o211j0922j6374k2386k8083l2716l6188l8589l9675
$$ 1095298 1099926 1101764 1099837 1093626 1082704 1066330 1043944 1015861 983145 946957 908368 868693
50011H68693l9088l6869l3592k9989k6538k3304k0177j7181j4433j1813q952n853
$$ 868693 829605 792736 759144 729155 702617 679313 659136 641955 627522 615709 606757 600904
49999F00904l180j660j261j404j880l084n213p721r813j1201j1985j2098j1291
$$ 600904 597724 596064 594803 593399 591519 588435 583222 575501 565688 554487 542502 530404 519113
49986E19113r679p899o595n920n667n627n737o001o396o745o726o179n394m800
$$ 519113 509434 501535 494940 489020 483353 477726 471989 465988 459592 452847 446121 439942 434548 429748
49972D29748m333l526k396j770k288l395l960l696l349l358l049j512J096L555
$$ 429748 425415 421889 419493 417723 415435 412040 408080 404384 401035 397677 394628 393116 394212 397767
49958C97767M744M516L535K527J724R08o6j033j872k789l911m793m857m264l772
$$ 397767 402511 407027 410562 413089 414813 415721 415655 414622 412750 409961 406050 401257 396400 392136 388364
49943C88364l661l399k612j757j439j546j542j279r39m49M51J585K269J969Q74
$$ 388364 384703 381304 378692 376935 375496 373950 372408 371129 370190 369741 370192 371777 374046 376015 376889
49928C76889k58p18l72L36R59J571K405L154L210K589J974J638J069K3q98j279
$$ 376889 376631 375913 375541 375877 376836 378407 380812 383966 387176 389765 391739 393377 394446 394469 393571 392292
49912C92292j718k777l736l553k583k187k738l185k736j867j386j410j660j988
$$ 392292 390574 387797 384061 380508 377925 375738 373000 369815 367079 365212 363826 362416 360756 358768
49898C58768k144j716q19l24q58k007k854k949k407j472m10M84J193J998K932
$$ 358768 356624 354908 354089 353765 352907 350900 348046 345097 342690 341218 340808 341292 342485 344483 347415
49883C47415L534L426K860K354K108K097K397K983L450L306K490J304R9p15p03
$$ 347415 350949 354375 357235 359589 361697 363794 366191 369174 372624 375930 378420 379724 379823 379108 378405
49868C78405N9O87L25q06j621j505q38j80N16J481K306K199J039k27n25J93R99
$$ 378405 378464 379151 379476 378670 377049 375544 374706 374526 375042 376523 378829 381028 382067 381840 381315 381508 382507
49851C82507J115O90L70L60K66j69n12r7J129K429L046K988K830K816K504J513
$$ 382507 383622 384312 384682 385042 385308 385139 384627 384530 385659 388088 391134 394122 396952 399768 402272 403785
49835D03785L09k76j89k22p82j299j172p40o72q80p51k20J52P3k00m46o79p65
$$ 403785 404094 403818 403629 403407 402625 401326 400154 399414 398742 397862 397111 396891 397043 397116 396916 396470 395791 395026
49817C95026n37l46p21j397j471p81k57n61j128j146p84p82j336k092k808l335
$$ 395026 394489 394143 393422 392025 390554 389773 389516 388955 387827 386681 385897 385115 383779 381687 378879 375544
49801C75544l272k321r07J32M32K16k21o51p29k08O65J390J797K042K180K162
$$ 375544 372272 369951 369044 369176 369608 369824 369603 368952 368223 368015 368680 370070 371867 373909 376089 378251
49785C78251K144K291K399K114J475Q79N76N11N68N90L25k93r56j367j583j610
$$ 378251 380395 382686 385085 387199 388674 389553 390129 390640 391208 391798 392123 391830 390874 389507 387924 386314
49769C86314j149k77J25n60j542j525n69Q2n2j07N05J191J402J632K374K994K613
$$ 386314 385165 384888 385013 384453 382911 381386 380817 380899 380847 380740 381245 382436 383838 385470 387844 390838 393451
49752C93451J490O13L51L39L31L88M20L77O22J405K150K118J570J415J771J790
$$ 393451 394941 395554 395905 396244 396575 396963 397383 397760 398382 399787 401937 404055 405625 407040 408811 410601
49736D10601J012N0k86J03Q47J592K094K328K636L217L482K683J230M27O12O03
$$ 410601 411613 411663 411377 411480 412327 413919 416013 418341 420977 424194 427676 430359 431589 432016 432628 433231
49720D33231l95j431j170R2J007J195J532K543L712M509N169O019O815P118O882
$$ 433231 432836 431405 430235 430327 431334 432529 434061 436604 440316 444825 449994 456013 462828 469946 476828
49705D76828O344N753N347N213M981M097K549R72j33q08j121q49J4R10J333J507
$$ 476828 483172 488925 494272 499485 504466 508563 511112 512084 511951 511143 510022 509173 509187 510097 511430 512937
49689E12937K063L303N068P053Q792R560Q774O544L593O99j615l065l550l136
$$ 512937 515000 518303 523371 530424 539216 548776 557550 564094 567687 568386 566771 563706 560156 557020
49675E57020j861J93K593M584N760O432O936O772M942J119l818q446j1650j2989
$$ 557020 555159 555352 557945 562529 568289 574721 581657 588429 593371 594490 590672 582226 570576 557587
49661E57587j2687j1439r948q489p037n672m540l503k237q07K77P67J130J956
$$ 557587 544900 533461 523513 515024 507987 502315 497775 494272 492035 491228 491505 492272 493402 495358
49647D95358L116L770L238J660k43j881l169m206m834m782m182l579l249k812
$$ 495358 498474 502244 505482 507142 506899 505018 501849 497643 492809 488027 483845 480266 477017 474205
49633D74205j891q60m35o34o96j60N45P83N40K20Qj33q8K62O42O00K33J49N80
$$ 474205 472314 471454 471019 470385 469689 469529 470074 470857 471397 471617 471625 471492 471404 471666 472308 472908 473141 473290 473870
49614D73870R69P72K80J77M56M16j84n93o7J028J624J295O39L83N92Q99J041R55
$$ 473870 474839 475611 475891 476068 476524 476940 476756 476163 476096 477124 478748 480043 480682 481065 481657 482556 483597 484552
49596D84552O47K81J37L03N29N75M72L45K17J37K15L59L15J69L92J100J664J517
$$ 484552 485199 485480 485617 485920 486449 487024 487496 487841 488058 488195 488410 488769 489084 489253 489645 490745 492409 493926
49578D93926J013R39J439J945K112K191K475K854L077L103L147L563M542N650
$$ 493926 494939 495878 497317 499262 501374 503565 506040 508894 511971 515074 518221 521784 526326 531976
$$ [...]
##END NTUPLES=NMR SPECTRUM
##END=
