##TITLE=NES1070_159122.0012_001_9705698_1gwYXIC89o
##JCAMPDX= 6.0         $$ Bruker NMR JCAMP-DX V2.0
##DATA TYPE= NMR SPECTRUM
##DATA CLASS= NTUPLES
##ORIGIN= BRUKER
##OWNER= Administrator
$$ 1.72 TOPSPIN		Version 2.1
$$ 2016-05-01 14:01:40.802 -0700  Administrator@X
$$ Compression mode = diff/dup
##.OBSERVE FREQUENCY= 400.02188249412
##.OBSERVE NUCLEUS= ^1H
##.ACQUISITION MODE= SIMULTANEOUS (DQD)
##.ACQUISITION SCHEME= undefined
##.AVERAGES= 8
##.DIGITISER RES= 22
##SPECTROMETER/DATA SYSTEM= spect
##.PULSE SEQUENCE= zg30
##.SOLVENT NAME= COFFEE_meoh
##.SHIFT REFERENCE= INTERNAL, COFFEE_meoh, 1, 14.98509
##AUDIT TRAIL= $$ (NUMBER, WHEN, WHO, WHERE, PROCESS, VERSION, WHAT)
$$ ##TITLE= Audit trail, TOPSPIN		Version 2.1
$$ ##JCAMPDX= 5.01
$$ ##ORIGIN= Bruker BioSpin GmbH
$$ ##OWNER= Administrator
$$ $$ E:\/data/COFFEE/nmr/NES1070_159122.0012_001_9705698_1gwYXIC89o/10/pdata/1/auditp.txt
$$ ##AUDIT TRAIL=  $$ (NUMBER, WHEN, WHO, WHERE, PROCESS, VERSION, WHAT)
(   1,<2016-05-01 14:01:33.786 -0700>,<Administrator>,<X>,<go>,<TOPSPIN 2.1>,
      <created by zg
	started at 2016-05-01 14:00:27.942 -0700,
	POWCHK enabled, PULCHK disabled,
       configuration hash MD5:
       21 0F 79 D6 B3 7B B4 F6 88 20 88 DB 03 48 BD 9F
       data hash MD5: 64K
       8F A7 54 51 62 BD C3 B9 3A 3F C4 CA 13 47 7F C6>)
(   2,<2016-05-01 14:01:36.896 -0700>,<Administrator>,<X>,<proc1d>,<TOPSPIN 2.1>,
      <Start of raw data processing
       efp LB = 0 FT_mod = 6 PKNL = 1 PHC0 = 0 PHC1 = 0 SI = 32K 
       data hash MD5: 32K
       02 5E 6C 67 BB 27 CD 54 E3 1D 45 38 0A B1 6A 63>)
(   3,<2016-05-01 14:01:37.161 -0700>,<Administrator>,<X>,<proc1d>,<TOPSPIN 2.1>,
      <pk PHC0 = 93.82874 PHC1 = 0 
       data hash MD5: 32K
       83 FF 4D CC 87 BA B7 E9 DB F8 7E 5E 66 09 DA 5D>)
(   4,<2016-05-01 14:01:37.271 -0700>,<Administrator>,<X>,<proc1d>,<TOPSPIN 2.1>,
      <abs ABSG = 1 
       data hash MD5: 32K
       80 DE E5 C6 27 6B DA 52 C2 BC C5 57 52 2D A2 C7>)
(   5,<2016-05-01 14:01:37.349 -0700>,<Administrator>,<X>,<proc1d>,<TOPSPIN 2.1>,
      <abs ABSG = 2 
       data hash MD5: 32K
       3D 49 AD A1 78 D0 7E 28 B3 07 1E 69 23 19 FF BC>)
(   6,<2016-05-01 14:01:37.396 -0700>,<Administrator>,<X>,<proc1d>,<TOPSPIN 2.1>,
      <abs ABSG = 3 
       data hash MD5: 32K
       1C BB 3C 73 08 36 83 D1 AF C6 A2 6C 7D A0 E8 18>)
(   7,<2016-05-01 14:01:37.458 -0700>,<Administrator>,<X>,<proc1d>,<TOPSPIN 2.1>,
      <abs ABSG = 4 
       data hash MD5: 32K
       38 7E 05 27 EE D6 88 C8 41 01 86 A8 9D 9E D7 7C>)
(   8,<2016-05-01 14:01:37.521 -0700>,<Administrator>,<X>,<proc1d>,<TOPSPIN 2.1>,
      <abs ABSG = 5 
       data hash MD5: 32K
       0E C4 51 77 34 F8 37 C5 F5 70 96 F7 D0 10 EC 86>)
$$ ##END=
$$ 
$$ $$ hash MD5
$$ $$ 76 26 AB 6C C6 F4 87 70 21 A6 33 30 6E 82 72 AE
##$RELAX= 
##$RELAX= 
##$RELAX= 
##$RELAX= 
##$RELAX= 
##$RELAX= 
##$RELAX= 
$$ Bruker specific parameters
$$ --------------------------
##$DU= <E:\>
##$EXPNO= 10
$$ [...]
150 150 150 150 150 150 150 150
##$TP07= 0
##$TPNAME0= <>
##$TPNAME1= <>
##$TPNAME2= <>
##$TPNAME3= <>
##$TPNAME4= <>
##$TPNAME5= <>
##$TPNAME6= <>
##$TPNAME7= <>
##$TPOAL= (0..7)
0.5 0.5 0.5 0.5 0.5 0.5 0.5 0.5
##$TPOFFS= (0..7)
0 0 0 0 0 0 0 0
##$TUNHIN= 0
##$TUNHOUT= 0
##$TUNXOUT= 0
##$USERA1= <user>
##$USERA2= <user>
##$USERA3= <user>
##$USERA4= <user>
##$USERA5= <user>
##$V9= 5
##$VALIST= <valist>
##$VCLIST= <CCCCCCCCCCCCCCC>
##$VD= 0
##$VDLIST= <DDDDDDDDDDDDDDD>
##$VPLIST= <PPPPPPPPPPPPPPP>
##$VTLIST= <TTTTTTTTTTTTTTT>
##$WBST= 2048
##$WBSW= 25
##$XGAIN= (0..3)
0 0 0 0
##$XL= 0
##$YL= 0
##$YMAX_a= 521915
##$YMIN_a= -442423
##$ZGOPTNS= <>
##$ZL1= 120
##$ZL2= 120
##$ZL3= 120
##$ZL4= 120
##$ABSF1= 14.98509
##$ABSF2= -5.573092
##$ABSG= 5
##$ABSL= 3
##$ALPHA= 0
##$AQORDER= 0
##$ASSFAC= 0
##$ASSFACI= 0
##$ASSFACX= 0
##$ASSWID= 0
##$AUNMP= <proc_prof1d_extract_pilot.lims>
##$AXLEFT= 0
##$AXNAME= <>
##$AXNUC= <1H>
##$AXRIGHT= 0
##$AXTYPE= 0
##$AXUNIT= <>
##$AZFE= 0.1
##$AZFW= 0.1
##$BCFW= 0
##$BC_mod= 0
##$BYTORDP= 0
##$COROFFS= 0
##$CY= 15
##$DATMOD= 1
##$DC= 0
##$DFILT= <>
##$DTYPP= 0
##$F1P= 0
##$F2P= 0
##$FCOR= 0.5
##$FTSIZE= 32768
##$FT_mod= 6
##$GAMMA= 0
##$GB= 0
##$INTBC= 1
##$INTSCL= 1
##$ISEN= 128
##$LB= 0
##$LEV0= 0
##$LPBIN= 0
##$MAXI= 10000
##$MC2= 0
##$MEAN= 0
##$ME_mod= 0
##$MI= 0
##$NCOEF= 0
##$NC_proc= -8
##$NLEV= 6
##$NOISF1= 0
##$NOISF2= 0
##$NSP= 0
##$NTH_PI= 0
##$NZP= 0
##$OFFSET= 14.98509
##$PC= 1
##$PHC0= 93.82874
##$PHC1= 0
##$PH_mod= 1
##$PKNL= yes
##$PPARMOD= 0
##$PPDIAG= 0
##$PPIPTYP= 0
##$PPMPNUM= 2147483647
##$PPRESOL= 1
##$PSCAL= 4
##$PSIGN= 0
##$PYNMP= <proc.py>
##$REVERSE= no
##$SF= 400.02
##$SI= 32768
##$SIGF1= 0
##$SIGF2= 0
##$SINO= 400
##$SIOLD= 32768
##$SPECTYP= <>
##$SREGLST= <1H.CDCl3>
##$SSB= 0
##$STSI= 32768
##$STSR= 0
##$SW_p= 8223.68421052631
##$SYMM= 0
##$S_DEV= 0
##$TDeff= 65536
##$TDoff= 0
##$TI= <>
##$TILT= no
##$TM1= 0
##$TM2= 0
##$TOPLEV= 0
##$USERP1= <user>
##$USERP2= <user>
##$USERP3= <user>
##$USERP4= <user>
##$USERP5= <user>
##$WDW= 1
##$XDIM= 32768
##$YMAX_p= 409054975
##$YMIN_p= -692771
##$CURPLOT= <Network HP LaserJet P1505>
##$CURPRIN= <$Network HP LaserJet P1505>
##$DFORMAT= <normdp>
##$LAYOUT= <+/1D_H.xwp>
##$LFORMAT= <normlp>
##$PFORMAT= <normpl>
##$SURQMSG= 1
$$ End of Bruker specific parameters
$$ ---------------------------------
##NTUPLES= NMR SPECTRUM
##VAR_NAME=  FREQUENCY,     SPECTRUM/REAL,   SPECTRUM/IMAG
##SYMBOL=    X,             R,               I
##VAR_TYPE=  INDEPENDENT,   DEPENDENT,       DEPENDENT
##VAR_FORM=  AFFN,          ASDF,            ASDF
##VAR_DIM=   32768,         32768,           32768
##UNITS=     HZ,            ARBITRARY UNITS, ARBITRARY UNITS
##FACTOR=    0.250966925370066, 1,           1
##FIRST=     8223.43324360094, -93949,       -193237
##LAST=      0,             -88536,          -53973
##MIN=       0,             -692771,         0
##MAX=       8223.43324360094, 409054975,    0
$$ Real data points
##PAGE= N=1
##DATA TABLE= (X++(R..R)), XYDATA
$$ [...]
19587I0925d6976k72766C237a05675K2239D0523j9475Q2297a15685r945A69271
$$ 90925 -46976 -319742 3237 -105675 -83436 40523 21048 103345 -115685 -125630 169271
19575b0052j5936l20520f0210E5681J21165a13156d4794J44k33704i4110A10280
$$ -20052 -35988 -356508 -60210 55681 176846 -113156 -44794 -44650 -278354 -94110 110280
19563f2226I6372g309C5120e0241a2636A86090f7566J50K2306L797k64753f5665
$$ -62226 96372 -7309 35120 -50241 -12636 186090 -67566 -67416 -45110 -41313 -306066 -65665
19550f0911A11220E472J12406J3247a48376B01372c81104J63102d1138j86234
$$ -60911 111220 5472 117878 131125 -148376 201372 -381104 -218002 -41138 -227372
19540b27372A6062P8130b64144J11296c6994q823E9813L1626b18385j18828G310
$$ -227372 16062 94192 -264144 -152848 -36994 -45817 59813 91439 -218385 -337213 7310
19528a09503C8168A4780c14176G3441b45814p3189B00444b62385E12274c9964
$$ -109503 38168 14780 -314176 73441 -245814 -319003 200444 -262385 512274 -39964
19517A7995a09361j6916q5320O1432B85600O1875i0722G9948N8417i1726Q66K3676
$$ 17995 -109361 -126277 -211597 -150165 285600 347475 -90722 79948 138365 -91726 -90860 -67184
19505f7184L0457j06382i77k82584J04556A01963J67439D5039N7380N19h7168
$$ -67184 -36727 -143109 -977 -283561 -179005 101963 269402 45039 102419 102938 -87168
19493I9052a85371i491B13172b20812A12393a90596B56708d3267n777l1632B39015
$$ 99052 -185371 -9491 213172 -220812 112393 -190596 256708 -43267 -49044 -80676 239015
19481A3180b7636m6654J8821j14438O0519G6852a63889k44270a27560q3124O1865
$$ 13180 -27636 -74290 -55469 -169907 -109388 76852 -163889 -408159 -127560 -210684 -148819
19470a48819f1456f240A6322a04034k56054a29818n5760j3298N7409A71981f7487
$$ -148819 -61456 -6240 16322 -104034 -360088 -129818 -185578 -198876 -141467 171981 -67487
19458a99869K369q505R706d5460A13019H889a14048D9912a08715A20622b5135
$$ -199869 -197500 -206005 -196299 -45460 113019 8889 -114048 49912 -108715 120622 -25135
19446E8459b04796A69213a2860H8351A916J33188a69573A35317b17274J8565A81146
$$ 58459 -204796 169213 -12860 88351 1916 135104 -169573 135317 -217274 -198709 181146
19434a71864k22332f5998r9924L0981l338j00082a8458A5226K74510i8105d1168
$$ -171864 -394196 -65998 -165922 -134941 -138279 -238361 -18458 15226 289736 -98105 -41168
19422g3820q2886B7904N2563b10924M6189P9063b443j80843e3530A28484a10646
$$ -73820 -156706 27904 80467 -210924 -164735 -85672 -2443 -183286 -53530 128484 -110646
19410A82158B6704a35571a3627A09843D8049c65396a23373G3851a68106G1134
$$ 182158 26704 -135571 -13627 109843 48049 -365396 -123373 73851 -168106 71134
19399b6502H7593d0130F9571C1411A1952L03700F7962L485a0425j20445J7990
$$ -26502 87593 -40130 69571 31411 11952 315652 67962 71447 -10425 -130870 -112880
19388a12880B34998a73518H2584L0263b32883l7374g927j3913A5977M7397K3420
$$ -112880 234998 -173518 82584 112847 -232883 -270257 -7927 -21840 15977 63374 86794
19377H6794C3175b33498n0816j9023B07524a95312O0046j10807J02628A53028
$$ 86794 33175 -233498 -284314 -303337 207524 -195312 -135266 -246073 -143445 153028
19366f9989k13652J33345F5467b87453R0276F03a85260K0515A7404a01587H5689
$$ -69989 -283641 -150296 65467 -287453 -197177 603 -185260 -164745 17404 -101587 85689
19354a32357k26200B5593c0714r0726A35979j3206n4764Q3119a22151q5974J6205
$$ -132357 -358557 25593 -30714 -121440 135979 122773 68009 151128 -122151 -208125 -191920
19343a91920c1077k38951E6837K1894b32069c3781k10480N8700B18907g7125B61178
$$ -191920 -31077 -270028 56837 78731 -232069 -33781 -244261 -185561 218907 -77125 261178
19331d3040n3082C33262G6280C4448K40359A2672N145i2641k23616g3455G1167
$$ -43040 -96122 333262 76280 34448 274807 12672 17817 -92641 -316257 -73455 71167
19319c80925J9814a01989J7541j88391D4241c53166h917G8374A2055K56688g5847
$$ -380925 -361111 -101989 -84448 -272839 44241 -353166 -8917 78374 12055 268743 -75847
19307b94015A18613g5477B531O0150g3995F7857b50304O4358k89945A04104B143
$$ -294015 118613 -75477 2531 62681 -73995 67857 -250304 -185946 -475891 104104 2143
19295a98238m7379C07432j8909L0020r9886i4706j99927J21242G7868a26955I7617
$$ -198238 -245617 307432 288523 318543 218657 -94706 -294633 -173391 77868 -126955 97617
19283A76672d2345j49654I7450o933c79444J11637e0448l26362B35929K0173b07398
$$ 176672 -42345 -191999 97450 90517 -379444 -267807 -50448 -376810 235929 256102 -207398
19271b01963i8967j9394j6809O6249n1091j92512A12416C4469J9265h2393A35772
$$ -201963 -98967 -118361 -135170 -68921 -120012 -312524 112416 34469 53734 -82393 135772
19259d61057h0291b945H69f0025l58122J95490A17536b99268g8362c7431j58036
$$ -461057 -80291 -2945 869 -60025 -418147 -222657 117536 -299268 -78362 -37431 -195467
19248a95467O0260J4211B9494f4515o1251a1587j48528G9851J05695b42346a19839
$$ -195467 -135207 -120996 29494 -64515 -125766 -11587 -160115 79851 185546 -242346 -119839
19236c2098B9069b82830j1651a17345p2897j2366m4938J02581H3912d8992n7256
$$ -32098 29069 -282830 -294481 -117345 -190242 -202608 -247546 -144965 83912 -48992 -106248
19225a06248j9534j13590H5961l792j3228L9045a27758A00915b32953B04636d7840
$$ -106248 -125782 -239372 85961 82169 68941 107986 -127758 100915 -232953 204636 -47840
19213A17326b9788A55960a71731A87375h1377A89917c81804H4602L189a35995
$$ 117326 -29788 155960 -171731 187375 -81377 189917 -381804 84602 87791 -135995
19202b59016i2118q2810Q6095J9127j60317A83008e5472K6702B49086b72082A2384
$$ -259016 -92118 -174928 -88833 -69706 -230023 183008 -55472 -28770 249086 -272082 12384
19190c8079r4104A0938e6777A6809J34879B0410N3644M5262a7271L880B22042
$$ -38079 -132183 10938 -56777 16809 151688 20410 74054 119316 -17271 -13391 222042
19178a69959C8953c3286L345I0382m333b72153A435Q655d7565C7270a00706B16238
$$ -169959 38953 -33286 -29941 90382 86049 -272153 1435 10090 -47565 37270 -100706 216238
19165a61734g8406K9815i112q091m08044A54277b14960P7193M5820G5187J9559
$$ -161734 -78406 -48591 -9112 -17203 -425247 154277 -214960 -137767 -91947 75187 94746
19154I4746a76525J5261N5881K6106A28658c9433l39820a65561A34138K7306M6399
$$ 94746 -176525 -161264 -105383 -79277 128658 -39433 -379253 -165561 134138 161444 207843
19143B07843H3955K2680C9881a82973k04674g1304k91082N8094H020a52370o636
$$ 207843 83955 106635 39881 -182973 -387647 -71304 -362386 -304292 8020 -152370 -159006
19132a59006B10944d5443H8468g8283Q404r0141e251n6509q5275B16517D857c11903
$$ -159006 210944 -45443 88468 -78283 -69879 -160020 -5251 -61760 -147035 216517 4857 -311903
19119A18069K62505b09978E9102e8269m5751D5978b21825e1096D128R5829c03560
$$ 118069 380574 -209978 59102 -58269 -104020 45978 -221825 -51096 4128 99957 -303560
19107a73658O2228k15937j6624D8054J41741B3652Q3086R6149e23656I8910b16645
$$ -173658 -111430 -327367 -343991 48054 189795 23652 106738 202887 -523656 98910 -216645
19095A0565N3618d25922e4208A33963f5606B07575l7545i5405n836j61887I4075
$$ 10565 64183 -425922 -54208 133963 -65606 207575 170030 -95405 -101241 -263128 94075
19083i1849b9082q1943l8161f291k83739a2708j2270l4760F9009b9621C4181J0976
$$ -91849 -29082 -111025 -149186 -6291 -290030 -12708 -24978 -59738 69009 -29621 34181 45157
19071D5157L6408a55992A36397a15332j04992A78757Q8846H2762a42238D4011
$$ 45157 81565 -155992 136397 -115332 -220324 178757 267603 82762 -142238 44011
19060a12600c9699k01455h8042n8771A42048d3610p5118j03414B23006c18145
$$ -112600 -39699 -241154 -88042 -146813 142048 -43610 -118728 -222142 223006 -318145
19049B4009c25867b4758d893k07451N8582k37894b2167p7503c6932I7803c683
$$ 24009 -325867 -24758 -4893 -212344 -153762 -391656 -22167 -99670 -36932 97803 -3683
19037b03159A25088g631k902n9858D74450b33514H1179a76299c8181q5403a4254
$$ -203159 125088 -7631 -10533 -70391 474450 -233514 81179 -176299 -38181 -123584 -14254
19025e3041I3482c47820F279a61232k00708F8982L5750m6202h6682A5341a89932
$$ -53041 93482 -347820 6279 -161232 -361940 68982 104732 58530 -86682 15341 -189932
19013A41619h6702l20620A65859b06456N0706B8001a28330j22581J19470E9342
$$ 141619 -86702 -407322 165859 -206456 -155750 28001 -128330 -250911 -131441 59342
19002i7826K1930a9842A24703a04007G4376b36057B83091C7208b9821I6781a9816
$$ -97826 -75896 -19842 124703 -104007 74376 -236057 283091 37208 -29821 96781 -19816
18990G1786g5497b7318l08185D4807B396a88648I0018a81589A34153a73420b9699
$$ 71786 -75497 -27318 -335503 44807 2396 -188648 90018 -181589 134153 -173420 -29699
18978b47869E5254O6173b00369C05944q008H783a04445m1957A96089a22055n6887
$$ -247869 55254 121427 -200369 305944 297936 8783 -104445 -146402 196089 -122055 -178942
18967a78942P4179M7739A06341J4325a17973b1961b837j13818j58262J14734M5246
$$ -178942 -104763 -57024 106341 120666 -117973 -21961 -2837 -116655 -274917 -160183 -114937
18956a14937K5016K4812K8945j6254K2638K466j96883E5207f9416k1142A17721
$$ -114937 -89921 -65109 -36164 -52418 -29780 -27314 -224197 55207 -69416 -90558 117721
18944A03491a00816N475L2285J422q8073B48736h4659o1819A36525G580c97052
$$ 103491 -100816 -95341 -63056 -61634 -149707 248736 -84659 -146478 136525 7580 -397052
18932g1951k12058B99681b08345e0437G3490N7695f2129p7523a4392G5267b29958
$$ -71951 -284009 299681 -208345 -50437 73490 131185 -62129 -139652 -14392 75267 -229958
18920G7543j6062c07646I7135b0010C08439p654j09219m0053a46637B648i4306
$$ 77543 61481 -307646 97135 -20010 308439 300785 191566 151513 -146637 2648 -94306
18908D249F78e7246a2302k33070d2821j45555N7501B3026b03104f5090B38803
$$ 4249 678 -57246 -12302 -245372 -42821 -188376 -130875 23026 -203104 -65090 238803
18896A01256b16995J03540c579q7369I4654A1044d7764B92869D5230d6388j00118
$$ 101256 -216995 -113455 -3579 -90948 94654 11044 -47764 292869 45230 -46388 -146506
18885a46506A46423A479K6735J06235c2737I8135e13892B2408d7688E66b15658
$$ -146506 146423 1479 28214 134449 -32737 98135 -513892 22408 -47688 566 -215658
18873A06513G921K8795a13268A34892o67O2594b32926b0227j73199F0486a5163
$$ 106513 7921 36716 -113268 134892 134225 196819 -232926 -20227 -193426 60486 -15163
18861g1289B39427D4704N4809N3821n7455J16758E3926j7097a89392B55888m6252
$$ -71289 239427 44704 99513 153334 95879 212637 53926 36829 -189392 255888 209636
18850B09636h6400j12475H591b2533A79156b92512J38427B01309a88905A35842
$$ 209636 -86400 -198875 8591 -22533 179156 -292512 -154085 201309 -188905 135842
18839B06287L0627g3620B35002b19910I9394h6897k74103f4292j66433B78349
$$ 206287 236914 -73620 235002 -219910 99394 -86897 -361000 -64292 -230725 278349
18828b56351c9700k42775b4526P336k4184k227j6881j15819b3774j26714A23063
$$ -256351 -39700 -282475 -24526 -17190 -41374 -43601 -60482 -176301 -23774 -150488 123063
18816A81484d5541k13265C547L51070A49555O9469r4454R1275E6212D83a0105
$$ 181484 -45541 -258806 3547 354617 149555 219024 124570 215845 56212 483 -10105
18804C18112a74367A60531e2644j88500a03788p1619o862A53245d3536D3395a85578
$$ 318112 -174367 160531 -52644 -241144 -103788 -175407 -182269 153245 -43536 43395 -185578
18792b73430N8163J02068q2361j5711A6623J66057a60331F3905a57880B25848
$$ -273430 -215267 -113199 -195560 -211271 16623 182680 -160331 63905 -157880 225848
18781B30047c39117A0290K3558K567b44923A6358a72931f8704p3186j34902D1237
$$ 230047 -339117 10290 33848 36415 -244923 16358 -172931 -68704 -141890 -276792 41237
18769a84092d581G5082J31697D2519a64472a1207E5670a29593D3563b27928j32077
$$ -184092 -4581 75082 206779 42519 -164472 -11207 55670 -129593 43563 -227928 -360005
18758c60005a21122B73966a59691A65871c4681a3133G933c89l46600a22321K7612
$$ -360005 -121122 273966 -159691 165871 -34681 -13133 7933 -389 -346989 -122321 -94709
18747i4709I1869K11541a08583j47547e7517k37072J26222c0878j63104e7942
$$ -94709 91869 303410 -108583 -256130 -57517 -294589 -168367 -30878 -193982 -57942
18736a31970K8043j15260O1665R839K9201A36331b19389k04942A88528a51454
$$ -131970 -103927 -219187 -157522 -147683 -118482 136331 -219389 -424331 188528 -151454
18725I675K2047e1252n8815L3870A59976D3432a24049A5590g6429q3593I6201
$$ 9675 31722 -51252 -110067 -76197 159976 43432 -124049 15590 -76429 -160022 96201
18713F0368I08d4854l9910k95821M1065A4772i9529j08068k2858j368J10664K4903
$$ 60368 908 -44854 -84764 -380585 -339520 14772 -99529 -207597 -230455 -231823 -121159 -96256
18701i6256d455H5638b49776C6537c11729f0525A03992f9179r0649C8435P2298
$$ -96256 -4455 85638 -249776 36537 -311729 -60525 103992 -69179 -159828 38435 110733
18690A10733f7182j32570L0877M1600C8211e1072H6125f4146C1495b17693H7028
$$ 110733 -67182 -199752 -168875 -127275 38211 -51072 86125 -64146 31495 -217693 87028
18678A10148b44321B6953a4990G1613L843e4519B42441B2094b16536B6506a18844
$$ 110148 -244321 26953 -14990 71613 75456 -54519 242441 22094 -216536 26506 -118844
18666f5560k4870C34834b23270A87504b44858g3999m2066A24149e5327k59796
$$ -65560 -90430 334834 -223270 187504 -244858 -73999 -116065 124149 -55327 -315123
18656c15123C05148j24226l8947a44987b9402j64200o018A8601K58369j26107
$$ -315123 305148 180922 141975 -144987 -29402 -193602 -199620 18601 276970 150863
18646A50863a07208A95655a06531j20919J03186a1458H024c06905f6791B49283
$$ 150863 -107208 195655 -106531 -227450 -124264 -11458 8024 -306905 -66791 249283
18635i6313B89512E8971a45796N1289l3091G2535p708C54h1730A15291d2130o8478
$$ -96313 289512 58971 -145796 -94507 -127598 72535 64827 354 -81730 115291 -42130 -110608
18623a10608A2082c12197I5934h9218j88625a25575E2987g862G187R447b14732
$$ -110608 12082 -312197 95934 -89218 -277843 -125575 52987 -7862 7187 16634 -214732
18611a92691h8449j12154j16673c2667A72253g7120l860N733E203a04635B5709
$$ -192691 -88449 -200603 -317276 -32667 172253 -77120 -80980 -75247 5203 -104635 25709
18599F4406J65249b17696B9808Q0091d1716G5830a09012c3458p38n536k9430l9558
$$ 64406 229655 -217696 29808 109899 -41716 75830 -109012 -33458 -34196 -39732 -69162 -108720
18587a08720l140B75448f2459m4710L5602D4040i0619H0468H875a99945B51881
$$ -108720 -111860 275448 -62459 -107169 -71567 44040 -90619 80468 8875 -199945 251881
18575h7408K0210A64619C2923a62522a7294A4130a65853C1507K68437a5380H8581
$$ -87408 -67198 164619 32923 -162522 -17294 14130 -165853 31507 299944 -15380 88581
18563A46343C568b96071I5942d7070b622I1058b77899O5648A59827j3533b16049
$$ 146343 3568 -296071 95942 -47070 -2622 91058 -277899 -212251 159827 146294 -216049
18551h369q8416B9401d8676A47926l9177N8723c2701l20031i1158A04472a30850
$$ -8369 -96785 29401 -48676 147926 108749 167472 -32701 -352732 -91158 104472 -130850
18539c85678A7277d5880A4573b8802n2732C9261i8495A0464c19546b8680D07g2974
$$ -385678 17277 -45880 14573 -28802 -81534 39261 -98495 10464 -319546 -28680 407 -72974
18526A50699a36921m4067N2624J6249n2186k7931g4935j51941j19168B33472r4329
$$ 150699 -136921 -180988 -128364 -112115 -164301 -192232 -74935 -226876 -346044 233472 139143
18515A39143b92383G4342J94657b33097d2912k75564J24303J2826e0822j00261
$$ 139143 -292383 74342 268999 -233097 -42912 -318476 -194173 -181347 -50822 -151083
18505a51083A60945a33094d6210A02055F303b75513h0732B0016a08996l6971A39176
$$ -151083 160945 -133094 -46210 102055 6303 -275513 -80732 20016 -108996 -145967 139176
18493i2445G8593A1044P6281a12433k53223A40a25507p387j56568J19321j55624
$$ -92445 78593 11044 87325 -112433 -365656 140 -125507 -132894 -289462 -170141 -325765
18482c25765J59798C48646b24551f8654k90668A6105K34701e465E0616d9107r2459
$$ -325765 -165967 348646 -224551 -68654 -359322 16105 250806 -5465 50616 -49107 -141566
18471a41566G4320L7818C0879J09086b48626j47723D2921K88337a33921F661J4638
$$ -141566 74320 112138 30879 139965 -248626 -396349 42921 331258 -133921 6661 21299
18460B1299R338i6248A37987E8974a23065n5965O4018K737A44083c229j19416
$$ 21299 30637 -96248 137987 58974 -123065 -179030 -115012 -112275 144083 -3229 -122645
18449a22645l4906C31874i9394E3716a66693r2087J21410a1028I6621a52429C50190
$$ -122645 -157551 331874 -99394 53716 -166693 -258780 -137370 -11028 96621 -152429 350190
18437B0985c8052j19967L6013A03662J42293a12619B40677j19984a71378I044
$$ 20985 -38052 -158019 -122006 103662 245955 -112619 240677 120693 -171378 9044
18426E6894J14608J49522A24288a06169A98387b24226I35L7845j1479c05667O7147
$$ 56894 171502 321024 124288 -106169 198387 -224226 935 38780 27301 -305667 -238520
18415b38520K8568B8102g9571A19501B2087M3185g1024B41733G2260c3070n9016
$$ -238520 -209952 28102 -79571 119501 22087 65272 -71024 241733 72260 -33070 -92086
18404i2086M2872D5948c15030j41421b0438A45098L84062g6667n9411b4402k0017
$$ -92086 -49214 45948 -315030 -456451 -20438 145098 529160 -76667 -136078 -24402 -44419
18393d4419k23528a26412j58472G8602a12540I1524b59963P9026f7144B91418
$$ -44419 -267947 -126412 -284884 78602 -112540 91524 -259963 -180937 -67144 291418
18382a63129C6666a55031g3354B393e55618a53788H8152b4024J040B68003F6450
$$ -163129 36666 -155031 -73354 2393 -555618 -153788 88152 -24024 -22984 268003 66450
18370c74889C7245a85956L7593G4599C1274a16306B24446f6088r7612j18938h9978
$$ -374889 37245 -185956 -148363 74599 31274 -116306 224446 -66088 -163700 -282638 -89978
18358b23381j7917A65859c41018a1639K882j11805j14491Q6160B01283e8518B03882
$$ -223381 -241298 165859 -341018 -11639 -8757 -120562 -235053 -148893 201283 -58518 203882
18346b84669a9513k21970E6726J32083B3150a93849e6815F7779a5749j59874F7388
$$ -284669 -19513 -241483 56726 188809 23150 -193849 -56815 67779 -15749 -175623 67388
18334i4194a3671l8277k6613E7996J71732a85383j67331b0047k66759e7993J8660
$$ -94194 -13671 -51948 -78561 57996 229728 -185383 -352714 -20047 -286806 -57993 -39333
18323c9333l1085A19367b90337j12332J73274P0291g5624J0303a9121l173A14704
$$ -39333 -70418 119367 -290337 -402669 -229395 -159104 -75624 -65321 -19121 -22294 114704
18311a27919B1489c2865H3705b33971B1547f7033k5379E2408P7061a13667j1470
$$ -127919 21489 -32865 83705 -233971 21547 -67033 -92412 52408 129469 -113667 -125137
18300a25137c0323e606n1669j59272B1525d9450H71K8634a95242D0093a80577
$$ -125137 -30323 -5606 -57275 -216547 21525 -49450 871 29505 -195242 40093 -180577
18288b24398A31048O621l0542i4064E8048b14379H76K5890b9570k69144a20766
$$ -224398 131048 137669 107127 -94064 58048 -214379 876 26766 -29570 -298714 -120766
18276a51729k59808J90024N4857P9382E3595c19725B0919a92993A42386e2062
$$ -151729 -411537 -221513 -166656 -87274 53595 -319725 20919 -192993 142386 -52062
18265a84381j91022b9717B53287p964p1236k9814c6190E8200g640A57719Q6997
$$ -184381 -375403 -29717 253287 245323 174087 144273 -36190 58200 -7640 157719 244716
18254B44716D5631a92246H4060J21713c61687G8120J16752p0007a04960A24570
$$ 244716 45631 -192246 84060 205773 -361687 78120 194872 124865 -104960 124570
18243a52918G2960K2552a51822e0187m892I4572Q0388a34697A93380a95851J9349
$$ -152918 72960 95512 -151822 -50187 -55079 94572 174960 -134697 193380 -195851 -176502
18232a76502E1620K75780d4093j53078A03822m8659i0949C4621f7808b445k17877
$$ -176502 51620 327400 -44093 -197171 103822 55163 -90949 34621 -67808 -2445 -220322
18221b20322D2392d2967j94842j38909M0391J26796E2699i5642J7763m7084j49437
$$ -220322 42392 -42967 -237809 -376718 -336327 -209531 52699 -95642 -77879 -124963 -274400
18210b74400c0564j48356o2382a12106L4792F4253a82150B05710G8303b17727
$$ -274400 -30564 -178920 -241302 -112106 -77314 64253 -182150 205710 78303 -217727
18199c0628B54067a09112l795l1233K1048G5412g8039D9576Q8751a7865l1996
$$ -30628 254067 -109112 -112907 -144140 -123092 75412 -78039 49576 138327 -17865 -49861
18188d9861F3733b9269A69243n6286b48278I099a64349d0306H4259f2629E182
$$ -49861 63733 -29269 169243 112957 -248278 9099 -164349 -40306 84259 -62629 5182
18176B53642i6452A04526b92031C01480e3136K1573j36511o4455A00199a78416
$$ 253642 -96452 104526 -292031 301480 -53136 -31563 -168074 -232529 100199 -178416
18165E4129a49159N516I0888Q6889a86613g1947A5559a86661h0030b0608A36243
$$ 54129 -149159 -143643 90888 177777 -186613 -71947 15559 -186661 -80030 -20608 136243
18153A33645O3161h1595L752A49208a09205d9714A05447J45828a00710a6376A19141
$$ 133645 196806 -81595 -77843 149208 -109205 -49714 105447 251275 -100710 -16376 119141
18141a0609E21N6140P695J72444a82787e0717p9822A89092c22659B296a31935
$$ -10609 521 56661 64356 236800 -182787 -50717 -130539 189092 -322659 2296 -131935
18129D6082d11291b1457p1502A40991J54656c23852b6941l0975k49908A76284
$$ 46082 -411291 -21457 -92959 140991 295647 -323852 -26941 -57916 -307824 176284
18118G5751L4855i5204j48884A38235a1118k81758a4888l94749e8616A45972L13818
$$ 75751 110606 -95204 -244088 138235 -11118 -292876 -14888 -409637 -58616 145972 459790
18107D59790A43032c80370C6361O1185h1769j40356b850j48474A51031b44871
$$ 459790 143032 -380370 36361 97546 -81769 -222125 -2850 -151324 151031 -244871
18096G8888j4420P2101i5283k23733A07263c2016l99455F9474b51264b601k68946
$$ 78888 64468 136569 -95283 -319016 107263 -32016 -431471 69474 -251264 -2601 -271547
18085b71547e3187E3096a53083c9847D6376b39675E06919b65781G1980b50056
$$ -271547 -53187 53096 -153083 -39847 46376 -239675 506919 -265781 71980 -250056
18074E2615j2620a3725B53256a4899p4815G3520a33491B31343c90977a62630B51103
$$ 52615 39995 -13725 253256 -14899 -89714 73520 -133491 231343 -390977 -162630 251103
18062b49746f4977A10082J39459E871c1341j52812C2944K17253a94133A51066
$$ -249746 -64977 110082 249541 5871 -31341 -184153 32944 250197 -194133 151066
18051b44487j12967H8221c65724g1023A00014N6192b62648f3522I4265J5132K4390
$$ -244487 -357454 88221 -365724 -71023 100014 156206 -262648 -63522 94265 109397 133787
18040A33787f1795b3740C16321D8430J51175d7153C04825c9040A66671g8165k53804
$$ 133787 -61795 -23740 316321 48430 199605 -47153 304825 -39040 166671 -78165 -331969
18029c31969h2179A33290n7231f149l3220j35185H4483A9183c34159d2499A33905
$$ -331969 -82179 133290 76059 -6149 -39369 -174554 84483 19183 -334159 -42499 133905
18017E1561a91449G7393j8704J5183k2328a97751B58900b16810E4084b7935p3516
$$ 51561 -191449 77393 58689 73872 51544 -197751 258900 -216810 54084 -27935 -101451
18006a01451G646a52803M0421A8061h854B95401f2203I6909c20109B08743e9322
$$ -101451 7646 -152803 -112382 18061 -8854 295401 -62203 96909 -320109 208743 -59322
17994i8081j52962A28354q207J6536c1018E4327b9758k47147b0812p8261l8205
$$ -98081 -251043 128354 120147 136683 -31018 54327 -29758 -276905 -20812 -99073 -137278
17983a37278l2827B44838a2157D2697J15708g9455C59524b84128d2262l6585B76679
$$ -137278 -170105 244838 -12157 42697 158405 -79455 359524 -284128 -42262 -78847 276679
17971d32274a36328C19207h2589J2736j99247R9319f6120A69082B8915a95867
$$ -432274 -136328 319207 -82589 -69853 -269100 -169781 -66120 169082 28915 -195867
17960B82778c9724j55540h0596J9147g401j08253A69044e0965l19682H2212i3759
$$ 282778 -39724 -195264 -80596 -61449 -7401 -115654 169044 -50965 -370647 82212 -93759
17948f0863p1005j84845a53143E9337K39626A42722k9079a23605D3652M8788e3487
$$ -60863 -131868 -316713 -153143 59337 298963 142722 113643 -123605 43652 92440 -53487
17936d7929F8108c64624F9911d5233r5244B17331I0213c1101h232C26684l2187
$$ -47929 68108 -364624 69911 -45233 -140477 217331 90213 -31101 -8232 326684 294497
17925B94497a0311j83276l6553P126B434b25106D4436R5161a29842k16368A22809
$$ 294497 -10311 -193587 -230140 -223014 2434 -225106 44436 139597 -129842 -346210 122809
17913A38896l8997K09730f5046D0048a06836k9151A09393i4246j20451f326m66672
$$ 138896 99899 309629 -65046 40048 -106836 -135987 109393 -94246 -214697 -6326 -472998
17902d72998B49316a33154A53046a69782k80086A22917a34813A83502h1191A8222
$$ -472998 249316 -133154 153046 -169782 -449868 122917 -134813 183502 -81191 18222
17891F9710h1168a8255c092j16004A96583p4223L8389b15637C37000F5722M2093
$$ 69710 -81168 -18255 -3092 -119096 196583 122360 160749 -215637 337000 65722 107815
17880A07815e2194j87219A27583B4894a05257j0209C3820K3120a21446A71318
$$ 107815 -52194 -239413 127583 24894 -105257 -115466 33820 56940 -121446 171318
17869d3557A0853e8141H9873a18006D4000d4662j22272a2324j79476B91679a52393
$$ -43557 10853 -58141 89873 -118006 44000 -44662 -166934 -12324 -191800 291679 -152393
17857b3343A18417K5836F5946K7252K4406e2341A11187c36569A14406a84245A63232
$$ -23343 118417 144253 65946 93198 117604 -52341 111187 -336569 114406 -184245 163232
17845D8002K00619o5626F173k00b1058C20172a09164O523A5119b65983B7110d8193
$$ 48002 248621 182995 6173 5973 -21058 320172 -109164 -102641 15119 -265983 27110 -48193
17832a39546j39403i1296R438o8865A44447j7392m0121Q0189b26048I5141J27807
$$ -139546 -278949 -91296 -81858 -150723 144447 127055 86934 167123 -226048 95141 222948
17821B22948K5511D0322i2930A61130b23912h3306j26438j52355N4587O8080A62870
$$ 222948 248459 40322 -92930 161130 -223912 -83306 -209744 -362099 -307512 -239432 162870
17809C98001A61147J43135N513a52524K6209M4967B04254F1167A3289K57442b79437
$$ 398001 161147 304282 309795 -152524 -126315 -81348 204254 61167 13289 270731 -279437
17797F4132a63686A25226J76507I8147J25969g0342B68254b79580A86781l4130
$$ 64132 -163686 125226 301733 98147 224116 -70342 268254 -279580 186781 152651
17787A52651b19591h9511o2327b2979G151K88369h6021H1243b78570a02959o4566
$$ 152651 -219591 -89511 -151838 -22979 7151 295520 -86021 81243 -278570 -102959 -167525
17776a67525J2964B08996o3672n306d070B59841d4985J5956A68084e884A14233
$$ -167525 -154561 208996 145324 140018 -4070 259841 -44985 -29029 168084 -5884 114233
17764B90560h230o5666A56636n8582J5711j8422A247b183j74346G0487b9938r2145
$$ 290560 -8230 -73896 156636 98054 113765 95343 1247 -2183 -176529 70487 -29938 -122083
17752a22083A0486O7170L02326b02485O5881D3384c24925I0772l2455J73280C4832
$$ -122083 10486 77656 379982 -202485 -136604 43384 -324925 90772 58317 231597 34832
17740a40169A0332Q3524b5117j56421A31364J03783a50943a9536o7456b8065G4240
$$ -140169 10332 93856 -25117 -181538 131364 235147 -150943 -19536 -86992 -28065 74240
17728A36973a46940c0831A0797a21408A4961M6822h0140c9921A6775g2071H4817
$$ 136973 -146940 -30831 10797 -121408 14961 61783 -80140 -39921 16775 -72071 84817
17716a76103g1314G8600I083h1102D5802d8639A99831l8090J33541A19695a50858
$$ -176103 -71314 78600 9083 -81102 45802 -48639 199831 161741 295282 119695 -150858
17704A1011h5856E3613Q0925a61790d3482H0600b77652d4595J7163j10255C1581
$$ 11011 -85856 53613 134538 -161790 -43482 80600 -277652 -44595 -27432 -137687 31581
17692a05321A33574B0255L0329e2676C6792b5077A11691a86483A44669c4355B24033
$$ -105321 133574 20255 50584 -52676 36792 -25077 111691 -186483 144669 -34355 224033
17680g0479B4847N7820l8595c35243J54381d092B9663a55168r1678B43384F3004
$$ -70479 24847 82667 44072 -335243 -180862 -4092 29663 -155168 -246846 243384 63004
17668A38356a88313A4291K02035d3611p0157A48202m513c4750A04690b4388A31280
$$ 138356 -188313 14291 216326 -43611 -113768 148202 143689 -34750 104690 -24388 131280
17656G7437a93509B26527k496n2082P3973a17775A26705i915I2444L6650a13211
$$ 77437 -193509 226527 224031 171949 245922 -117775 126705 -9915 92444 129094 -113211
17644a33569B26572o9460o5160h6797A13188K1861C5441i6355A15853d439j64269
$$ -133569 226572 157112 91952 -86797 113188 135049 35441 -96355 115853 -4439 -168708
17633a68708j53980j0536J26546N5927e0217B85360b44483e8594r9513f923C9466
$$ -168708 -322688 -333224 -206678 -150751 -50217 285360 -244483 -58594 -158107 -6923 39466
17621B96050b41020B55615G0510g0448q6524A23397a53556j39082J0953C87895
$$ 296050 -241020 255615 70510 -70448 -156972 123397 -153556 -292638 -281685 387895
17610a02148C4450c39587D4211A7885i9904a525l52153B58288a16518B00156m4541
$$ -102148 34450 -339587 44211 17885 -99904 -1525 -353678 258288 -116518 200156 155615
17599A55615E7464M2665O9339F8214f169A3253b22995R3422j0308B54978b08108
$$ 155615 57464 100129 169468 68214 -6169 13253 -222995 -129573 -139881 254978 -208108
17587A42529f5701o8266O2500K7592j96359a07199L2658B85495j34667a69893
$$ 142529 -65701 -133967 -71467 -43875 -240234 -107199 -74541 285495 150828 -169893
17576G4013J37983J73643A07995n3156J76215F2681K45431E2149K54863A53008
$$ 74013 211996 385639 107995 54839 231054 62681 308112 52149 307012 153008
17565A77195P0413H7398a41993K4532A55480a0686B05633l5542b9100G891L40421
$$ 177195 247608 87398 -141993 -117461 155480 -10686 205633 170091 -29100 7891 348312
17554C48312j2615b27765C22169a12941d9610N84G6504e2017A26446g1836A04909
$$ 348312 335697 -227765 322169 -112941 -49610 -49026 76504 -52017 126446 -71836 104909
17542h8528p2647B9727m424c0422C0719J30934e6676b4500l2901j44734R8298
$$ -88528 -161175 29727 25303 -30422 30719 161653 -56676 -24500 -57401 -202135 -103837
17531a03837k8723A92999F3504a94728B41256B5970f2058B74877B2473K06688
$$ -103837 -132560 192999 63504 -194728 241256 25970 -62058 274877 22473 229161
17521B29161G4405K1936L5869B4058e8129A37235J46017o5031J0655C1971b38991
$$ 229161 74405 96341 132210 24058 -58129 137235 283252 218221 228876 31971 -238991
17509A99799j9267m6038J02526q2384J7903a49506B76143P6809C1270N9340J13865
$$ 199799 180532 134494 237020 154636 172539 -149506 276143 352952 31270 90610 204475
17498B04475B6849b16857a05034B67424P7497k5101b922D40560A87717q6131l236
$$ 204475 26849 -216857 -105034 267424 344921 319820 -2922 440560 187717 101586 98350
17487I8350M51380A28911d4359B44014k2274O4527L3400p8815a42498M44H4691
$$ 98350 549730 128911 -44359 244014 221740 286267 319667 240852 -142498 -142054 84691
17475A34760a25767G8680J69782r8531O355n0068M7746Q6673P0447d7402F5372
$$ 134760 -125767 78680 248462 149931 156286 106218 153964 240637 311084 -47402 65372
17463B76669A08386J91541a58651A52382a02099A37297J4065a56650D51727n2984
$$ 276669 108386 299927 -158651 152382 -102099 137297 151362 -156650 451727 398743
17453C98743a12618C54675j4042c10799C23753O1340m4562f2820A17591d5291
$$ 398743 -112618 354675 340633 -310799 323753 385093 340531 -62820 117591 -45291
17442A98117i9610M8549B14224r3565R4733A05792L9245a3678k0902B41108b11606
$$ 198117 -99610 -51061 214224 120659 215392 105792 145037 -13678 -34580 241108 -211606
17430f4747k53j296B12003a73767B81293N1440r3341D9821R8362O1264K30944
$$ -64747 -65000 -66296 212003 -173767 281293 332733 239392 49821 148183 209447 440391
17419D40391F8920J37829E1352J24558J56550A50719O6192b60464C48911e1496
$$ 440391 68920 206749 51352 175910 332460 150719 216911 -260464 348911 -51496
17408A32938a53284k40326h7692B7606K97884L990I2269O0670a44678O1173A38987
$$ 132938 -153284 -393610 -87692 27606 325490 329480 92269 152939 -144678 -83505 138987
17396B21260E1181O4311P8463H9179m0284E015a71596g330C01123D4991P7982
$$ 221260 51181 115492 193955 89179 48895 5015 -171596 -7330 301123 44991 122973
17385A22973E5991a96356F9015K35586j05017J14238j56529C8906b9056k0135
$$ 122973 55991 -196356 69015 304601 199584 313822 157293 38906 -29056 -49191
17375d9191l3377C51247A21870b65498N0442A43116k4587A1557J30808a0358B2889
$$ -49191 -82568 351247 121870 -265498 -215056 143116 118529 11557 142365 -10358 22889
17363a15840C04134n3915I6266K5868k6962J78739a2834G3864f9124H5428K59409
$$ -115840 304134 250219 96266 122134 95172 273911 -12834 73864 -69124 85428 344837
17352C44837F6018M8480K25547A23755K12586O634F7680O9894c8065C75576a6055
$$ 344837 66018 114498 340045 123755 336341 342975 67680 137574 -38065 375576 -16055
17340E5246a25050A10823h5201A19354L4430p4041C7255K59541a10542A29543
$$ 55246 -125050 110823 -85201 119354 153784 79743 37255 296796 -110542 129543
17329a81836A25454a4787H3727b534A09623f1050a1619B90362A09323Q091K4889
$$ -181836 125454 -14787 83727 -2534 109623 -61050 -11619 290362 109323 117414 142303
17318A42303E8314i979A99266i5200B57661q783r1621F3458J65250J21215F918
$$ 142303 58314 -9979 199266 -95200 257661 248878 157257 63458 228708 349923 6918
17306A37455n8934P1060Q2048O8166g1306A23877R5818r0769c2495D04611A67289
$$ 137455 78521 149581 231629 299795 -71306 123877 219695 128926 -32495 404611 167289
17294A45806j3460L17222F3929O2597I232O2857L2561i3022B76911D0954K00603
$$ 145806 132346 449568 63929 126526 9232 72089 104650 -93022 276911 40954 241557
17283B41557l3310N732j3839J22502J20134r8852A11209c5366C43582j06234N3576
$$ 241557 208247 213979 200140 322642 442776 343924 111209 -35366 343582 237348 290924
17272B90924A34654N0369P1951B8102P8010B0404P3907K40606j47897J91398j60343
$$ 290924 134654 185023 256974 28102 106112 20404 94311 334917 187020 378418 218075
17261B18075r4997N9571a8950A78849J56621h9908B09076J2893G4487C4522L00172
$$ 218075 123078 182649 -18950 178849 335470 -89908 209076 221969 74487 34522 334694
17250C34694q6462a52773j28265C32178n9236A16619J11947J01597J72588E5642
$$ 334694 248232 -152773 -281038 332178 272942 116619 228566 330163 502751 55642
17239C06447l0622A26898K82787j85120a81451A62286J04178J49091b78570D61472
$$ 306447 275825 126898 409685 224565 -181451 162286 266464 415555 -278570 461472
17228e7381B54704R5071r2922C1219R6821K94425A14361K30959q740L7790G0590
$$ -57381 254704 349775 256853 31219 128040 422465 114361 345320 336580 374370 70590
17216G5525K84619J1672A4850M07112E6580b6260C67199A70681L5896N0974J50637
$$ 75525 360144 371816 14850 421962 56580 -26260 367199 170681 206577 257551 408188
17205D08188F1032L17103A14539m2813l4997M01701K3106k05887L4058C8422L58432
$$ 408188 61032 378135 114539 71726 36729 438430 461536 255649 289707 38422 396854
17194C96854j94803J73435j01306K04864C7585J71773K94582k01949J73055j54288
$$ 396854 202051 375486 274180 479044 37585 209358 503940 301991 475046 320758
17184C20758D9650J67001q9080J18957a3074A91855n6716K97096q3222q585O7536
$$ 320758 49650 216651 127571 246528 -13074 191855 135139 432235 349013 340428 407964
17173D07964A16947K93169L8067N3212k10713D5297j4583K69405K9570j59224
$$ 407964 116947 410116 448183 501395 290682 45297 30714 300119 329689 170465
17163A70465J94709A36107r043j2097J12362P8900b19451A01544J35217Q9931
$$ 170465 365174 136107 127064 114967 227329 306229 -219451 101544 236761 326692
17153C26692j44046J19546n5359K14400f15A50718L75837A18240J79196j4683
$$ 326692 182646 302192 246833 461233 -615 150718 526555 118240 297436 282753
17143B82753J49047R6635k21302J39325j96725H0174M3477n9562K67679J4101
$$ 282753 431800 528435 307133 446458 249733 80174 123651 64089 331768 345869
17133C45869l0128j02912J04728P5442j44731J52474k00262J42961k5036n2029
$$ 345869 315741 212829 317557 392999 248268 400742 200480 343441 318405 266376
17123B66376K1848o6808L43420j13247B10901p8181R0078J67970j0607J41381
$$ 266376 288224 221416 564836 451589 210901 132720 222798 390768 380161 521542
17113E21542j80741J05036o7718J11937L5656p1074j31290p367j32529N8125J05855
$$ 521542 340801 445837 378119 490056 525712 454638 323348 315981 183452 241577 347432
17102C47432R2894k1491j66853L35177J64451C74648L3580K9924A94679L10183
$$ 347432 440326 418835 251982 587159 751610 374648 408228 438152 194679 504862
17092E04862R3228B81388Q868j44285M23255A64502K57233q6530R9704j73892
$$ 504862 598090 281388 290256 145971 569226 164502 421735 335205 434909 261017
17082B61017M41928l02581K75398k22382j15391G9784K77662J12631J91998B74435
$$ 261017 702945 400364 675762 453380 337989 79784 357446 470077 662075 274435
17071D30485A60245M58245j63886K07891k75421L43879j65575k8823q6306K14865
$$ 430485 160245 618490 454604 662495 387074 730953 565378 536555 450249 665114
17061F65114B16014K51546B02878M87268l19527Q8639J97591M9787j74711J38249
$$ 665114 216014 467560 202878 690146 370619 459258 656849 706636 531925 670174
17051F70174Q2459k79208J93387j59775J84894k80993R4700K4815k9571L3989
$$ 670174 752633 473425 666812 507037 691931 410938 505638 530453 500882 534871
17041E34871K75578C37259N18398B09655L27028A95913N36709k39260j65571N49550
$$ 534871 810449 337259 855657 209655 536683 195913 732622 493362 327791 877341
17031H77341k29992j06883k10821L80523k20006K49758l60039M24884K37446m73412
$$ 877341 647349 540466 329645 710168 490162 739920 379881 804765 1042211 568799
17021E68799n1337K60244j65199k52067K92154k0924J72385k75914J97759k04802
$$ 568799 517462 777706 612507 360440 652594 631670 804055 528141 725900 521098
17011E21098j396M79293l35253M38511D74406M66930l3478j86017K25580l39347
$$ 521098 519702 998995 663742 1102253 474406 941336 907858 721841 947421 608074
17001F08074R1303L3659K47292j22209j16795R1023j95165n7418M03764K5849
$$ 608074 699377 733036 980328 858119 741324 832347 637182 579764 983528 1009377
16991A009377k30104M9867L38506j17869j49885p5712K64547l07387K79833m30742
$$ 1009377 779273 829140 1167646 1049777 899892 824180 1088727 781340 1061173 630431
16981F30431L83679j52179K503j60108J55084M4633J26874j39739J77313Q222
$$ 630431 1014110 861931 864434 704326 859410 904043 1030917 891178 1068491 1076713
16971A076713p5098r9714M39209n27033L13435n6084r7575k59307K21767L27892
$$ 1076713 1001615 901901 1341110 814077 1127512 1071428 973853 714546 936313 1264205
16961A264205k98676j17850M14079k87631K55855r7377l73349M86573j94068J87698
$$ 1264205 965529 847679 1261758 974127 1229982 1132605 759256 1245829 1051761 1239459
16951A239459k77611K88655k43720K32587J9145Q3289k77324M16000k89458n2020
$$ 1239459 961848 1250503 1006783 1239370 1258515 1341804 1064480 1480480 1191022 1139002
16941A139002J02214j54648J58127J06130j93807L71950m08734K68870m70181
$$ 1139002 1241216 1086568 1244695 1350825 1157018 1528968 1120234 1389104 918923
16932I18923L83375L62912l68963L9879K2534K37070j70848J90422n226K50558
$$ 918923 1302298 1665210 1296247 1336126 1358660 1595730 1424882 1615304 1610078 1860636
16922A860636n33328o0588L11930N8267k41352K2717q9336K65891M229r3144J86905
$$ 1860636 1327308 1266720 1578650 1636917 1395565 1418282 1328946 1594837 1599066 1505922 1692827
16911A692827M6200p2167J6449P4224j53458J42610O8666J4198N6079K11211o6077
$$ 1692827 1739027 1666860 1683309 1757533 1604075 1746685 1815351 1829549 1885628 2096839 2030762
16900B030762k93460L91964m13036J39647K61424k13683K07991l82702L45006
$$ 2030762 1737302 2129266 1716230 1855877 2117301 1903618 2111609 1728907 2073913
16891B073913J28208j19828r9709K88762K29482k56102q8816M3179J56040q8949
$$ 2073913 2202121 2082293 1982584 2271346 2500828 2244726 2155910 2199089 2355129 2266180
16881B266180r8980j53586L93447K06644j9341k24355k81092L42136q1518J22601
$$ 2266180 2167200 2013614 2407061 2613705 2594364 2370009 2088917 2431053 2349535 2472136
16871B472136J34060j16584j53300M01450m38581N99745p4118R355J15096J3202
$$ 2472136 2606196 2489612 2336312 2737762 2299181 2898926 2824808 2834163 2949259 2962461
16861B962461J37747N0606p1639K85438k65971J49367O9945J55910k19279K72494
$$ 2962461 3100208 3150814 3079175 3364613 3098642 3248009 3317954 3473864 3254585 3527079
16851C527079j16074L7522k26307L7512K60922K16633L6831o067k8639M9875J43086
$$ 3527079 3411005 3448527 3222220 3259732 3520654 3737287 3774118 3768051 3739412 3789287 3932373
16840C932373j38531K64963M06194o6050l8463j78731K31912N11981n46193J81281
$$ 3932373 3793842 4058805 4464999 4398949 4360486 4181755 4413667 4925648 4379455 4560736
16830D560736j40741N27016n2547K31426k2061K75395r0263N1318n6619L02310
$$ 4560736 4419995 4947011 4894464 5125890 5103829 5379224 5288961 5340279 5283660 5585970
16820E585970j20356L83890J77137m4008M9994K19541J59225P7687J30486l3302
$$ 5585970 5465614 5849504 6026641 5982633 6032627 6252168 6411393 6489080 6619566 6586264
16810F586264J65933K18537L09332J3579O24159m42663N58333j46594J13946K37738
$$ 6586264 6752197 6970734 7280066 7293645 7917804 7475141 8033474 7886880 8000826 8238564
16800H238564K60784o6345L96523K05169J91120K18413M33889J80439k4833N21872
$$ 8238564 8499348 8433003 8829526 9034695 9225815 9444228 9878117 10058556 10033723 10555595
16790A0555595K76450L56364j2989K26616N06446J31428M00862J52162M94975
$$ 10555595 10832045 11188409 11175420 11402036 11908482 12039910 12440772 12592934 13087909
16781A3087909K66250N92292K6259M87612L71190O59022L94993K06739P10424
$$ 13087909 13354159 13946451 13972710 14460322 14831512 15490534 15885527 16092266 16802690
16772A6802690M34667M20497O12096O71848M20823R75823K71075Q63215Q48025
$$ 16802690 17237357 17657854 18269950 18941798 19362621 20338444 20609519 21472734 22320759
16763B2320759L21513J045380J069881L26787J167621Q01676J341426P97390J178633
$$ 22320759 22642272 23687652 24757533 25084320 26251941 27053617 28395043 29192433 30371066
16754C0371066J143287J418245J093283J201674J456886J249662J714646J855530
$$ 30371066 31514353 32932598 34025881 35227555 36684441 37934103 39648749 41504279
16746D1504279J645256J476632K047661K009131J906033K339189K368686K288909
$$ 41504279 43149535 44626167 46673828 48682959 50588992 52928181 55296867 57585776
16738E7585776K376871K959652K761387K752060K599626L439515K790573L616370
$$ 57585776 59962647 62922299 65683686 68435746 71035372 74474887 77265460 80881830
16730H0881830L321885L227696L167104L376650L255045L389890K947410L007505
$$ 80881830 84203715 87431411 90598515 93975165 97230210 100620100 103567510 106575015
16722A06575015K620728K643575J937858K073823J638993J159485Q61644M69746
$$ 106575015 109195743 111839318 113777176 115850999 117489992 118649477 119511121 119980867
16714A19980867n13743m42121r19305j594171j828235k266185k252425k874574
$$ 119980867 119467124 119025003 118105698 116511527 114683292 112417107 110164682 107290108
16706A07290108k879834k982594l446058l227376l057972l568709l346229l522995
$$ 107290108 104410274 101427680 97981622 94754246 91696274 88127565 84781336 81258341
16698H1258341l202098l127082l567577k705683k795115l346634j926926l005512
$$ 81258341 78056243 74929161 71361584 68655901 65860786 62514152 60587226 57581714
16690E7581714k512514k215047k163404k230648k090441k093621j658090j955564
$$ 57581714 55069200 52854153 50690749 48460101 46369660 44276039 42617949 40662385
16682D0662385j586095j458472j495850j725678j521554r59335j446608j056772
$$ 40662385 39076290 37617818 36121968 34396290 32874736 31915401 30468793 29412021
16674B9412021j190177r28063j166062q16654p15891r61983m41312j035719q45667
$$ 29412021 28221844 27293781 26127719 25311065 24595174 23633191 23191879 22156160 21310493
16665B1310493o20270j174161n67976o18760o82539r6694o46232o99751l74592
$$ 21310493 20690223 19516062 18948086 18329326 17646787 17550093 16903861 16204110 15829518
16656A5829518o20128l74224m97416n93566O8333n68343l33148m44312k15944
$$ 15829518 15209390 14835166 14337750 13744184 13812517 13244174 12911026 12466714 12250770
16647A2250770l55462k90151k88173k85204m60901p8936j71950k75164l94760
$$ 12250770 11895308 11605157 11316984 11031780 10570879 10491943 10319993 10044829 9650069
16638I650069l02426k98381j29394j11010j97272j99433k37244k17508q8171n81973
$$ 9650069 9347643 9049262 8919868 8808858 8611586 8412153 8174909 7957401 7869230 7287257
16628G287257J17296k16409R8723m79652j29682j80l3337l7706j11178k52153
$$ 7287257 7404553 7188144 7286867 6807215 6677533 6677353 6644016 6606310 6495132 6242979
16618F242979j39305k96129l90352N24384l78405m14714K18508j19097J7042j20038
$$ 6242979 6103674 5807545 5417193 5941577 5563172 5148458 5366966 5247869 5264911 5144873
16608E144873k25423l08707K65784l1099l43511m7907q4695K40034l76207q8948
$$ 5144873 4919450 4610743 4876527 4845428 4501917 4454010 4369315 4609349 4233142 4144194
16598D144194l03770L29838m85915L2303M47949l94820J28871k33107R4396p2877
$$ 4144194 3840424 4170262 3684347 3716650 4164599 3769779 3898650 3665543 3759939 3687062
16588C687062L41219n32995N3049q1717l32376J16954k82669L38848j73322K47148
$$ 3687062 4028281 3495286 3548335 3466618 3134242 3251196 2968527 3307375 3134053 3381201
16578C381201m14368M5678n5926j10908J75197l20362J96207Q0155k18544k60574
$$ 3381201 2966833 3012511 2956585 2845677 3020874 2700512 2896719 2976874 2758330 2497756
16568B497756R0612o2714k39K3414k55968K45566k35651N11447o25223J7033K32210
$$ 2497756 2588368 2525654 2525415 2548829 2292861 2538427 2302776 2814223 2189000 2206033 2438243
16557B438243j81101N4420l594l98171J64024M29598l75598l27023l629K45590
$$ 2438243 2257142 2311562 2307968 1909797 2073821 2503419 2127821 1800798 1797169 2042759
16547B042759K49527k17990o5570K09366k23655j32156l72084M03000q2666M3131
$$ 2042759 2292286 2074296 2008726 2218092 1994437 1862281 1490197 1893197 1810531 1853662
16537A853662L89505p45085k21925M83583P3368K2602l36597J3848K70850j84921
$$ 1853662 2243167 1498082 1276157 1759740 1833108 1855710 1519113 1532961 1803811 1618890
16527A618890L03163j97447l3960m32810K69293J94264m16630J19671o7228K87538
$$ 1618890 1922053 1724606 1690646 1257836 1527129 1721393 1304763 1424434 1357206 1644744
16517A644744n53340L92579l24707L54977q6713J90456j11912R9476k28202K5660
$$ 1644744 1091404 1483983 1159276 1514253 1427540 1617996 1506084 1605560 1377358 1403018
16507A403018l17002j64564J58021o5363M9707P8725K6018K13550k22604k1040
$$ 1403018 1086016 921452 1079473 1014110 1063817 1142542 1168560 1382110 1159506 1138466
16497A138466j90920L1505Q9564n9742o2625Q9408j7211j9811P1206j13502M17903
$$ 1138466 947546 979051 1068615 1008873 946248 1035656 1018445 998634 1069840 956338 1374241
16486A374241j89728l19668p9280M1598K57885j69524M23335n48221J50639Q8949
$$ 1374241 1184513 864845 785565 827163 1085048 915524 1338859 790638 941277 1030226
16476A030226l69272J67415J08618j37693K81951n14661M20932l47951m8781J15283
$$ 1030226 660954 828369 936987 799294 1081245 566584 987516 639565 590784 706067
16466G06067p2714L50970j63157j16047K05196J1437j75404k90716P129K70050
$$ 706067 633353 984323 821166 705119 910315 921752 746348 455632 462761 732811
16456G32811k14896q8382J22384J46342P4793q0335r0608k8006L75206l29461
$$ 732811 517915 429533 551917 698259 773052 692717 602109 574103 949309 619848
16446F19848j12825K17854l9360k52270L27719k95520J46192j0288K34843q336
$$ 619848 507023 724877 685517 433247 760966 465446 611638 601350 836193 827857
16436H27857K3774k81158K12374l65804K45370J31803j55196K2419B75930K58231
$$ 827857 851631 570473 782847 417043 662413 794216 639020 661439 275930 534161
16426E34161R5325J09795B37950N05065K83309j68287k76373K38990C80025L07450
$$ 534161 629486 739281 237950 743015 1026324 858037 581664 820654 380025 687475
16416F87475a504C88622R1994L46185l96807j27105L32643j2662j36205j44112
$$ 687475 -1504 388622 480616 826801 429994 302889 635532 622870 486665 342553
16406C42553j6683J95404J96322A77723L36337k49878K23793q376k19867O962
$$ 342553 325870 521274 717596 177723 514060 264182 487975 479599 259732 266694
16396B66694K05916R3738N8888j74358j09072j56998M72240j02730j31404A99012
$$ 266694 472610 566348 625236 450878 341806 184808 657048 554318 422914 199012
16385D21997K4797J87296j04507o491L7905k67995N8508L7294l7964J48082l8480
$$ 421997 446794 634090 529583 523092 560997 293002 351510 388804 350840 498922 460442
16374D60442K0246M836j72464q1247J69421J1342m5604j0295K27611j89513J09741
$$ 460442 480688 485524 313060 231813 401234 412576 366972 356677 584288 394775 504516
16363E04516j61875O0756p8468K1036A39465J63268p6349M36120g5212B04318
$$ 504516 342641 403397 324929 345965 139465 302733 226384 662504 -75212 204318
16352D42221J88841B75737K47677B04142J64318o8055J18810j16969J76371j53537
$$ 442221 631062 275737 523414 204142 368460 300405 419215 302246 478617 325080
16342C25080O2218j08419o0899J05965P1167R5039m448L8741P3126B88310K59924
$$ 325080 387298 278879 217980 323945 395112 490151 485703 524444 597570 288310 548234
16331E48234B06733l5705J1442K6043K56923B30274J16752a16936A75264O4094
$$ 548234 206733 171028 182470 208513 465436 230274 347026 -116936 175264 239358
16321B39358J85949b1175C52585A22520K37159q7362m6366O2839n4035K98628
$$ 239358 425307 -21175 352585 122520 359679 272317 225951 288790 234755 533383
16311E33383H858e9968B80778M9545r3662r1962J60755n4575H5837p04N4732K32233
$$ 533383 8858 -59968 280778 330323 236661 144699 305454 250879 85837 85133 139865 372098
16299C72098A05088M8290L14526j86486k8887k9262M1258m3892n9984K72765G6530
$$ 372098 105088 153378 467904 281418 252531 223269 264527 220635 160651 433416 76530
16287B12316J61341J02358E3870R3105K16776F211f270C16866b46619a09532B60611
$$ 212316 373657 476015 53870 146975 363751 6211 -6270 316866 -246619 -109532 260611
16275D94058A24000J56095Q6456o4276L399A12582J64229I7658J33368A7325J44331
$$ 494058 124000 280095 366551 302275 305674 112582 276811 97658 231026 17325 161656
16264A61656L9760O2523p1708B2757K46908q9155K33787a15892I1158J77285F3514
$$ 161656 201416 263939 192231 22757 269665 180510 414297 -115892 91158 268443 63514
16252A32508J7539h4386C71426j38721a72692k0307B4141K06887J33314F8895
$$ 132508 150047 -84386 371426 232705 -172692 -192999 24141 231028 364342 68895
16241B19799R0483b79565h4173C79031c02029A98462K06302c452C12883Q6903
$$ 219799 310282 -279565 -84173 379031 -302029 198462 404764 -3452 312883 399786
16231C99786A737L43730e9662F9561K62519g3383A16289b21214C24275M3972A23273
$$ 399786 1737 345467 -59662 69561 332080 -73383 116289 -221214 324275 368247 123273
16219D37349j06839I1211k7954J81928o8533c1624B49367L677G2774e8478o847
$$ 437349 330510 91211 63257 245185 176652 -31624 249367 253044 72774 -58478 -65325
16208f5325G8292k2961K4990L3258C4816J97872I3159a71540e9269j23578B76079
$$ -65325 78292 55331 80321 113579 34816 232688 93159 -171540 -59269 -182847 276079
16196D41639h6189C08578L2873G4782J41066m7010K61706C648J92864q802K64210
$$ 441639 -86189 308578 341451 74782 215848 168838 430544 3648 196512 187710 451920
16185D51920d70022A12571K26627B5549e2783C70560k5505j71127F3243e4889
$$ 451920 -470022 112571 339198 25549 -52783 370560 345055 173928 63243 -54889
16174a23124A23146a01867L1908B16465a43181c1021A55779k0319a82999B17034
$$ -123124 123146 -101867 -69959 216465 -143181 -31021 155779 135460 -182999 217034
16163a84372A85565C3391a89618Q0528Q774d9304A81842p5551A8930a68577C7682
$$ -184372 185565 33391 -189618 -109090 -100316 -49304 181842 106291 18930 -168577 37682
16151G2219i973A29530f8271N074d13q5518B49366L1934b7739A48244J50842j30864
$$ 72219 -9973 129530 -68271 -63197 -413 -85931 249366 281300 -27739 148244 299086 168222
16139A68222c39645h2873j39133a8052a467G5310a04029M2200D4891a03384c8557
$$ 168222 -339645 -82873 -222006 -18052 -1467 75310 -104029 -61829 44891 -103384 -38557
16127f8437B01019a655A3885a10763A27267m5921A0672K83323p6623E1408J18297
$$ -68437 201019 -1655 13885 -110763 127267 81346 10672 293995 217372 51408 169705
16116A69705b3580n7525B5698b59570d9477j03509D0668J41492b18478a3713n3030
$$ 169705 -23580 -81105 25698 -259570 -49477 -152986 40668 182160 -218478 -13713 -66743
16105f6743C538i6521A89670C5789l253a37359d8673M310B28304o5501n1884b2024
$$ -66743 3538 -96521 189670 35789 32536 -137359 -48673 -44363 228304 162803 110919 -22024
16092b00639f1368j19599g1483j2946A73432o8384i7834j2396B31092h2485i847
$$ -200639 -61368 -180967 -71483 -84429 173432 105048 -97834 -110230 231092 -82485 -9847
16080c8137A39550J1590J04226f9091E5665J74941A07724C9490K144a6523D51882
$$ -38137 139550 151140 255366 -69091 55665 230606 107724 39490 41634 -16523 451882
16068A5008f6364K8407q8672F9010c21975I0633J5563M3452a05574K6128A64583
$$ 15008 -66364 -37957 -126629 69010 -321975 90633 106196 149648 -105574 -79446 164583
16056H4615L8756J10767d1961l12081g2556b5972B5092b99502A81088f5923l0400
$$ 84615 123371 234138 -41961 -354042 -72556 -25972 25092 -299502 181088 -65923 -96323
16045i6323C21081E5444a19895B63150K439E9813a08034A29803J96116j43587
$$ -96323 321081 55444 -119895 263150 265589 59813 -108034 129803 325919 182332
16035A82332A8899b94703H4079J16576q9365K5102J06298O8521a13427B0201g180
$$ 182332 18899 -294703 84079 200655 111290 136392 242690 311211 -113427 20201 -7180
16023a62167B50286a2994G0180M8805B2600J96182k2268p3650c27544A77541a021
$$ -162167 250286 -12994 70180 118985 22600 218782 196514 122864 -327544 177541 -1021
16011A42454D6144K26183b38329h6056A09061a06412A54229b8823f219l45213
$$ 142454 46144 272327 -238329 -86056 109061 -106412 154229 -28823 -6219 -351432
16001c51432a14399A7991P295a53900d2765C52093A37967g2602B57453a57382
$$ -351432 -114399 17991 25286 -153900 -42765 352093 137967 -72602 257453 -157382
15990A92928b38440r255A73805P1049J45273A53209L62260q6421j27963j47962
$$ 192928 -238440 -247695 173805 244854 390127 153209 515469 429048 301085 153123
15980A53123Q916h865n6096A6h1405J6602l4630B44803A12950a50893B80927M6625
$$ 153123 162039 -8865 -64961 16 -81405 -64803 -99433 244803 112950 -150893 280927 327552
15968C27552A27163J16522a29027I6145l560J45984I2012a24291a3103j55401
$$ 327552 127163 243685 -129027 96145 92585 238569 92012 -124291 -13103 -168504
15958a68504G7151c99501O8866A3732c10414H606M6196P9275m2941N5203E428
$$ -168504 77151 -399501 -330635 13732 -310414 8606 54802 134077 91136 146339 5428
15946C4167K9722M1711J21250i2983k28449A42655d4774k13834I8724a69606j77329
$$ 34167 63889 105600 226850 -92983 -321432 142655 -44774 -258608 98724 -169606 -346935
15935c46935I5708J33919a43191m1579N4131a9501k37839g6052A49662b78616
$$ -346935 95708 229627 -143191 -184770 -130639 -19501 -257340 -76052 149662 -278616
15924A30285h2296B67105I5379M2265C3346b0478j31110j21406L4207h784o1496
$$ 130285 -82296 267105 95379 137644 33346 -20478 -151588 -272994 -238787 -8784 -70280
15913g0280A11662b1932j44962m5951A74349a18625I4015E597N9491B7332a7519
$$ -70280 111662 -21932 -166894 -212845 174349 -118625 94015 5597 65088 27332 -17519
15901A19873k4046a70718j34468a11686J0150a1113A39082b74010C2986a52983
$$ 119873 95827 -170718 -305186 -111686 -101536 -11113 139082 -274010 32986 -152983
15890i6044l808k4928A75584o5964d23999I0600L8376g8873m6840b35k56315A17648
$$ -96044 -99852 -124780 175584 109620 -423999 90600 128976 -78873 -125713 -235 -256550 117648
15877a09613I7696i1413n503H7073L3288J6345l4160d8705A0628R0113a13384
$$ -109613 97696 -91413 -96916 87073 120361 136706 102546 -48705 10628 100741 -113384
15865b74214O1447O2382Q190O2639j19699A41471D6280J29639a296B01475a44892
$$ -274214 -212767 -150385 -142195 -79556 -199255 141471 46280 175919 -1296 201475 -144892
15853D4159j916J19562b8367L613k0011b2347A15416R4776f5750j14250A22155
$$ 44159 42243 161805 -28367 -24754 -44765 -22347 115416 210192 -65750 -180000 122155
15841b84432C27559c461n6220E84a90905E057b01963n9429o7126A12872h9312
$$ -284432 327559 -3461 -59681 584 -190905 5057 -201963 -261392 -328518 112872 -89312
15829B63343A7599c1848D9461M8612m8873A5450c5644q6041N7379r8402k5232
$$ 263343 17599 -31848 49461 98073 49200 15450 -35644 -121685 -64306 -162708 -187940
15818a87940L6156A41898l3006b92015q2105K3185a26138K3013A87951c8853j02460
$$ -187940 -151784 141898 108892 -292015 -374120 -350935 -126138 -103125 187951 -38853 -141313
15807a41313A34962a35204b5561k37525A75937n8321K6500L04266a51513D46439
$$ -141313 134962 -135204 -25561 -263086 175937 117616 144116 448382 -151513 446439
15796B11546a21548B41212a63301A33842c0796J0555C18552I1296J21652G3670
$$ 211546 -121548 241212 -163301 133842 -30796 -20241 318552 91296 212948 73670
15785B3604a36347a9105A56751e2212f222m679I1850M6931b34190A64520a66919
$$ 23604 -136347 -19105 156751 -52212 -6222 -10901 91850 138781 -234190 164520 -166919
15773C10067G1509c99289B6881J02282B9121h1414r3364I8359P8052J20524i8626
$$ 310067 71509 -399289 26881 129163 29121 -81414 -174778 98359 176411 296935 -98626
15761i5878j4744I1774K9564N8967a41187j45744B9253K49997b06912B41639c40796
$$ -95878 -110622 91774 121338 180305 -141187 -286931 29253 279250 -206912 241639 -340796
15749B34114C2032f0415j23574B3067g8876A26971B8736K51687b36692B22237
$$ 234114 32032 -60415 -183989 23067 -78876 126971 28736 280423 -236692 222237
15738A09225a13059C5483b2139k42872D7893j3923a17723j3245K7119A0675b9194
$$ 109225 -113059 35483 -22139 -265011 47893 33970 -117723 -130968 -103849 10675 -29194
15726E5493j0597J37009b78380a5841D3460J05273a12086F3870J25371J65610
$$ 55493 44896 181905 -278380 -15841 43460 148733 -112086 63870 189241 354851
15716C54851a30868E9622c4405p0376a5454l84885J38667a20673H9898b65475
$$ 354851 -130868 59622 -34405 -104781 -15454 -400339 -261672 -120673 89898 -265475
15705f9533B75640a1509A65774D0744K00170a17896M8578K2429F728i3831q4867
$$ -69533 275640 -11509 165774 40744 240914 -117896 -69318 -46889 6728 -93831 -178698
15694a78698j82520A56387E1959R7332B7892J8335O753B5110G248K04017b77585
$$ -178698 -361218 156387 51959 149291 27892 46227 52980 25110 7248 211265 -277585
15682C11321c5239k68136a03038A5836e4224j00083E0547J79567n4628a7216B26984
$$ 311321 -35239 -303375 -103038 15836 -54224 -154307 50547 230114 175486 -17216 226984
15670a16846E6477j2050N1644b94450a00482B9170a14641I5261J58011g1545B2615
$$ -116846 56477 44427 96071 -294450 -100482 29170 -114641 95261 253272 -71545 22615
15658C13058e4991j65136J4185H8355l7273d8726G2989g1653o7117j33911j22893
$$ 313058 -54991 -220127 -205942 88355 51082 -48726 72989 -71653 -138770 -272681 -395574
15647c95574C67954j29266F0589b30390B86782b85411H4728h1962A02805a48134
$$ -395574 367954 238688 60589 -230390 286782 -285411 84728 -81962 102805 -148134
15636A62391d5666a7514I2292b13275j1385G6386a26913e7547j9905j69300I1814
$$ 162391 -45666 -17514 92292 -213275 -224660 76386 -126913 -57547 -77452 -246752 91814
15624a48805A05375D247a92299f1283A86813Q2756l7125a2346p4400c4952B1594
$$ -148805 105375 4247 -192299 -61283 186813 269569 232444 -12346 -86746 -34952 21594
15612B38966c71801c9585C1570P1581h211o9935o1816A54146a06383j11155m4240
$$ 238966 -371801 -39585 31570 103151 -8211 -78146 -139962 154146 -106383 -217538 -261778
15601b61778d2369j02989E337K5390N0411C358a9566A04109A4423Q4726k9183
$$ -261778 -42369 -145358 5337 30727 81138 3358 -19566 104109 14423 99149 69966
15590F9966J75810G6871a04675e984A67429K0053a18801E1831J7414c39739I9921
$$ 69966 245776 76871 -104675 -5984 167429 187482 -118801 51831 69245 -339739 99921
15578a98833F6554a8924k76221C68157f1383A50957C7823h7954j77776A1537L1449
$$ -198833 66554 -18924 -295145 368157 -61383 150957 37823 -87954 -265730 11537 42986
15567D2986O1637A6711Q1601a39708f7863j55051d2004A12682m8147g2657D3861
$$ 42986 104623 16711 98312 -139708 -67863 -222914 -42004 112682 64535 -72657 43861
15555C50384j38437g7902A37862N7011I0808P9443a45444K5562G8896h4908r0395
$$ 350384 211947 -77902 137862 194873 90808 170251 -145444 -119882 78896 -84908 -175303
15544a75303e9114r707J4589A89020o9653K56428A38071J28278D7225h5933A08432
$$ -175303 -59114 -68821 -54232 189020 119367 375795 138071 266349 47225 -85933 108432
15532A43979a73945B9988i6194k64073E5485b05012j95830J50535B74651a9885
$$ 143979 -173945 29988 -96194 -360267 55485 -205012 -400842 -250307 274651 -19885
15521a665m5791q1522K6906N374a0739A2864L21074d6740A72478f8591a5935j14226
$$ -1665 -47456 -128978 -102072 -96698 -10739 12864 333938 -46740 172478 -68591 -15935 -130161
15509a30161C7279L28022c6015n3782A3364R2151P892a31560E3726a35897J9895
$$ -130161 37279 365301 -36015 -89797 13364 105515 113407 -131560 53726 -135897 -116002
15498a16002a0176A22169a12514B7651c2686j90955E1311a72520b8192B39912
$$ -116002 -10176 122169 -112514 27651 -32686 -223641 51311 -172520 -28192 239912
15487A08371J07870b21355b6416n3810j28215i6665E0465b08771d1886B6809b14478
$$ 108371 216241 -221355 -26416 -80226 -208441 -96665 50465 -208771 -41886 26809 -214478
15475B09428E6897K88076a19550C7511N6566M7929b36363E225b103q1049B25045
$$ 209428 56897 344973 -119550 37511 94077 142006 -236363 5225 -2103 -83152 225045
15463I0210M0977b91554A40818d5885A67357K90920a28180k12640B3900J77215
$$ 90210 131187 -291554 140818 -45885 167357 458277 -128180 -340820 23900 201115
15453B01115a2178j60138a824B8544f5937k81017A32743J33100h8459C3229J73401
$$ 201115 -12178 -172316 -1824 28544 -65937 -346954 132743 265843 -88459 33229 206630
15442B06630a53827A32896m603c8329m5516B46837B0891E686b233G303a52240
$$ 206630 -153827 132896 128293 -38329 -83845 246837 20891 5686 -2233 7303 -152240
15430A62655h5898k9353k90685J66192K6687j65375a71105m7517Q5529J5820l6193
$$ 162655 -85898 -115251 -405936 -239744 -213057 -378432 -171105 -218622 -133093 -117273 -153466
15419a53466I7699J58994b3858B08834K7830e7382k04586c5185l8835r2123C6920
$$ -153466 97699 256693 -23858 208834 236664 -57382 -261968 -35185 -74020 -166143 36920
15407b6449l9065k6321D0210d05948G653R2004a24251F3783a92250A59190i3903
$$ -26449 -65514 -91835 40210 -405948 7653 99657 -124251 63783 -192250 159190 -93903
15395A54456d01282C3968a6136B0074d5414k44373N9211h9289k59113C0531b7195
$$ 154456 -401282 33968 -16136 20074 -45414 -289787 -230576 -89289 -348402 30531 -27195
15383E1610K8861c04036c1197F8676d8084n6611a491n8598k35501H1238K2456
$$ 51610 80471 -304036 -31197 68676 -48084 -104695 -1491 -60089 -295590 81238 103694
15372A03694l8821f1474j41177A3734i2604k0349A63626f8865A1687h3151F8754
$$ 103694 64873 -61474 -202651 13734 -92604 -112953 163626 -68865 11687 -83151 68754
15360B96251c606I4424A7688K77009e5142b4825r8354c730k6486J578j15833r14
$$ 296251 -3606 94424 17688 294697 -55142 -24825 -123179 -3730 -30216 -28638 -144471 -145385
15348a45385p4360D5623J83778j14462b05402D7196b34118H740K02519A9861J2451
$$ -145385 -219745 45623 229401 114939 -205402 47196 -234118 8740 211259 19861 32312
15337C2312J93732a43757O9602a2231A38838J4146O4832i9385A0152a74634G7639
$$ 32312 226044 -143757 -74155 -12231 138838 152984 217816 -99385 10152 -174634 77639
15325A0639a72780B29407a32035A49307a12122C34919a239m3018A14307a87582
$$ 10639 -172780 229407 -132035 149307 -112122 334919 -1239 -44257 114307 -187582
15314A18010j6663b19159A27746c22551C62997A26578F981J68554N3558a14234
$$ 118010 101347 -219159 127746 -322551 362997 126578 6981 175535 229093 -114234
15303D9735Q4950J9190a46141C23080a30505A45320j6828j5397l9042h6793A9183
$$ 49735 134685 153875 -146141 323080 -130505 145320 128492 113095 74053 -86793 19183
15291C41175A59807G8799J913K15340D8307L180J03522E8477K6537b66680I4005
$$ 341175 159807 78799 80712 296052 48307 51487 155009 58477 85014 -266680 94005
15279A27177a62512i286n4063j3187L3627I1612R6311B537J54166k5070K06736
$$ 127177 -162512 -9286 -63349 -76536 -42909 91612 187923 2537 156703 131633 338369
15268C38369g1781j89730K5724a13159A78161m0550E6464L97817b75326A11784
$$ 338369 -71781 -261511 -235787 -113159 178161 137611 56464 454281 -275326 111784
15257d1838b570G7443c9038q4455C94812L0180K19758M43474l99003O55370C97593
$$ -41838 -2570 77443 -39038 -123493 394812 424992 644750 1088224 689221 1344591 397593
15245B42693Q7034D924a19978o5965A61322m0999b1058B90171j04991G4900i0718
$$ 242693 329727 4924 -119978 -185943 161322 120323 -21058 290171 185180 74900 -90718
15233f369B81249e5566H2182Q9171J33994j47185k4354P001c3032j24468A24293
$$ -6369 281249 -55566 82182 171353 305347 158162 133808 140809 -33032 -157500 124293
15221B65510E891P63J22344c04157A73711a2590j31559B90486B296K14084O9703
$$ 265510 5891 6654 128998 -304157 173711 -12590 -144149 290486 2296 216380 286083
15210B86083A2138a19452a2101D40364j87377d8500B14661C8136J21096n578b75942
$$ 286083 12138 -119452 -12101 440364 252987 -48500 214661 38136 159232 153654 -275942
15198a0444B40484A6840a14529A73527h1944j7981M8773H5970i4507c3073I4452
$$ -10444 240484 16840 -114529 173527 -81944 -99925 -51152 85970 -94507 -33073 94452
15186D9863a95859R5115k24861J40741B86398p7261b95506P968J29467L0268J4928
$$ 49863 -195859 -100744 -325605 -184864 286398 209137 -295506 -287538 -158071 -127803 -112875
15175a12875j43326O9059B35559l4935Q6201a42069G379j186f695E5894a32983
$$ -112875 -256201 -187142 235559 200624 286825 -142069 7379 6193 -6695 55894 -132983
15163E1725K51039p5179j8078a7130A07417K6997N6709Q596o3363A4330J92633
$$ 51725 302764 227585 209507 -17130 107417 134414 191123 199719 136356 14330 206963
15152B06963k893C2552J16878j1126F0571h1614A90947J8344A2436L21979a21276
$$ 206963 204070 32552 149430 138304 60571 -81614 190947 209291 12436 334415 -121276
15140A59291i2632C39857A42290Q1066I7724f3375B5384K42979n1306q5265o1006
$$ 159291 -92632 339857 142290 223356 97724 -63375 25384 268363 217057 131792 70786
15129G0786J5604B8064J5302M0243a71093C953a42561k8197C89584f8951A46419
$$ 70786 86390 28064 43366 83609 -171093 3953 -142561 -170758 389584 -68951 146419
15117b36070A50671f0045p3975l0133J6676F0207I136J37099e0164m6268c7434
$$ -236070 150671 -60045 -134020 -164153 -147477 60207 9136 146235 -50164 -96432 -37434
15105C0515b70433f5339J5067A6983P8605a20366A08390g097A10864K44267c8889
$$ 30515 -270433 -65339 -50272 16983 95588 -120366 108390 -7097 110864 355131 -38889
15093E0001b20241f2166A13429k0346R7035G1981A0525K23737E7097M378j3760
$$ 50001 -220241 -62166 113429 93083 190118 71981 10525 234262 57097 61475 47715
15082D7715J12571J14343i0705A32691R1329D3027J21279a53291C06443b15161
$$ 47715 160286 274629 -90705 132691 224020 43027 164306 -153291 306443 -215161
15071c4502B5988M17744j74252j11375M1187q0438R7139J36042A61550m3215J29476
$$ -34502 25988 443732 269480 158105 199292 118854 215993 352035 161550 118335 247811
15060B47811B1492J4979M9655J46727O229b8160A67320O1957K0658E0230L1452
$$ 247811 21492 36471 86126 232853 239082 -28160 167320 229277 249935 50230 81682
15049H1682j2466K72836E1233k0854a11360B5929f8498B59810p8306N9651B3794
$$ 81682 69216 342052 51233 30379 -111360 25929 -68498 259810 181504 241155 23794
15037A43991A6641f3787B69094E5090K68532j53271m2196N5923J45612C2183L59319
$$ 143991 16641 -63787 269094 55090 323622 170351 128155 184078 329690 32183 391502
15026C91502A09745J53271B0876J65680k477k5330K9687Q0089L8598Q6443G7969
$$ 391502 109745 263016 20876 186556 184079 158749 188436 268525 307123 393566 77969
15014h942C10145m0474K82483b21258B32489J82760o6416D7694J11194L8876J28972
$$ -8942 310145 269671 552154 -221258 232489 415249 348833 47694 158888 197764 326736
15003C26736A28578L8793p0541b51455A7146K67838j12678Q2432a49403k2711
$$ 326736 128578 167371 96830 -251455 17146 284984 172306 254738 -149403 -172114
14993a72114B1977K07229A03741i1537C19966a03986B62384E3250J46982F7988
$$ -172114 21977 229206 103741 -91537 319966 -103986 262384 53250 200232 67988
14982A66896a56750B54227q4881m6032P0471K4808K31287B04633M681M1796E3729
$$ 166896 -156750 254227 169346 123314 193785 218593 449880 204633 209314 251110 53729
14970H6345P6617p468G3840R1312N4588J41731l9312j37092J68464I4221K81339
$$ 86345 162962 155494 73840 165152 219740 361471 322159 185067 353531 94221 375560
14959C75560j38523J4188h4885I7352L70595N8113B16762J0526e885D07071A56005
$$ 375560 237037 251225 -84885 97352 467947 526060 216762 227288 -5885 407071 156005
14947C72643p4176m028i7246A21891R4845J03795L4054A23786K8435R0345M4845
$$ 372643 298467 294439 -97246 121891 216736 320531 354585 123786 152221 242566 287411
14936B87411C5196K17973o4862p2414O0184L8265H0075K14991j12345n9150J5255
$$ 287411 35196 253169 188307 115893 176077 214342 80075 295066 182721 123571 138826
14925A38826L3882N17339A94654J49604K7965j04308j04837d8991G8730L51103
$$ 138826 172708 690047 194654 344258 372223 267915 163078 -48991 78730 429833
14915D29833P1738E4299J36822q5794J21653k9905J264L4502K97270B46563A01687
$$ 429833 501571 54299 191121 105327 226980 197075 198339 232841 530111 246563 101687
14903b4157B72810J07670j30533M5392H2415K67861J78323a6729C50769j0426
$$ -24157 272810 380480 249947 295339 82415 350276 528599 -16729 350769 340343
14893C40343E788d9646A55065K09222E5255R7421L93503j23600f7027B23693J59395
$$ 340343 5788 -49646 155065 364287 55255 152676 546179 422579 -67027 223693 383088
14882C83088O1115A27192J45466k0176j18291R9194m8642K19322j77297J42L85694
$$ 383088 444203 127192 272658 252482 134191 233385 184743 404065 226768 226910 612604
14871F12604B1170a17377B66119K57831j32073p5950k2421R575J12533j29789
$$ 612604 21170 -117377 266119 523950 391877 315927 293506 303081 415614 285825
14861B85825j7199j33876n8209K78067K6123N9623j59561n3197J0911J97762j53700
$$ 285825 268626 134750 76541 354608 380731 440354 280793 227596 238507 436269 282569
14850B82569n5174J75040J1164D1744R0357L07188E0449J63664K27469P3186B12834
$$ 282569 227395 402435 413599 41744 132101 439289 50449 214113 441582 514768 212834
14838C00756P997j00138j5674J61170A20320M58106B07742K30820j44475J06747
$$ 300756 308753 208615 192941 354111 120320 578426 207742 438562 294087 400834
14828D00834J6616J72937j95504K02204B97485O2272M8180J13601q8990B14296
$$ 400834 417450 590387 394883 597087 297485 359757 407937 521538 432548 214296
14817E04491m1621L3672K28218a01D49085j57664J24916l0523A90383M5291M6662
$$ 504491 462870 496542 724760 -101 449085 291421 416337 385814 190383 235674 282336
14806B82336m6450a4307B40447K25341j87781N90b6268C21033p7367n5487J67617
$$ 282336 235886 -14307 240447 465788 278007 278597 -26268 321033 243666 188179 355796
14795C55796c1281B95829J37747L15338l52287J30603j36274J10718j93979P746
$$ 355796 -31281 295829 433576 748914 396627 527230 390956 501674 307695 315441
14785C15441J46634l0824K0598A66453R1000K71363B40517J45093J46702m0394
$$ 315441 462075 431251 451849 166453 257453 528816 240517 385610 532312 491918
14775D91918J9214A37416K36019M590p3956J61004j48562j35981K78522n2047
$$ 491918 511132 137416 373435 378025 304069 465073 316511 180530 459052 407005
14765D07005j03157A22354L70587n107o9013j4321j19972K49049B56702K34021
$$ 407005 303848 122354 492941 487834 418821 404500 284528 533577 256702 490723
14755D90723j86545K80005k35042A39775K97172j90571J61664l1258J22629J70789
$$ 490723 304178 584183 349141 139775 436947 246376 408040 376782 499411 670200
14745F70200B36453K35655L21259j02334j95123J00449A30560L14851K67300j13436
$$ 670200 236453 472108 793367 691033 495910 596359 130560 445411 712711 599275
14735E99275p8913m8253k05228K20055J09372n1717J62889k35725K00605k57686
$$ 599275 520362 472109 266881 486936 596308 544591 707480 471755 672360 414674
14725D14674K3005J78708j58500O3616p9435J89353j4104J39559o41l5525l23439
$$ 414674 437679 616387 457887 521503 442068 631421 617317 756876 756235 720710 397271
14714C97271L00297K886k29914K28420j63341J9718N3322J08300r0247j32084
$$ 397271 697568 700454 470540 698960 535619 555337 608659 716959 626712 494628
14704D94628K58530l9117N2563k07575j97120J10170J72282B88145N8732Q2233
$$ 494628 753158 714041 766604 559029 361909 472079 644361 288145 346877 429110
14694D29110L98154j7357j92813j94266j23193K62538L6688q1110o7408K76979
$$ 429110 827264 809907 617094 422828 299635 562173 598861 517751 450343 727322
14684G27322J41504j94424L20837j77896k19398J75920l1057r7398L6373l4405
$$ 727322 868826 674402 995239 817343 597945 773865 742808 645410 681783 647378
14674F47378P7539p1648J72230j18197J50339j58318k17022L28430J27423j39012
$$ 647378 724917 653269 825499 707302 857641 699323 482301 810731 938154 799142
14664G99142j36248M27689j44807j68180r7561J24333r7994j14651L42496k01652
$$ 799142 662894 1090583 945776 777596 680035 804368 706374 591723 934219 732567
14654G32567O9997j94454L19660r6274k56455P3622L87001K8211l47875n7218
$$ 732567 802564 608110 927770 831496 575041 648663 1035664 1063875 716000 658782
14644F58782J17712Q7951l37645M18825p5294q4003K64737J2237m41458M76429
$$ 658782 776494 864445 526800 945625 870331 786328 1051065 1063302 621844 1098273
14634A098273p3403E12247N59473R3411j37638o2839k0157n1896o983J79259j65921
$$ 1098273 1024870 512247 1071720 1165131 1027493 964654 944497 892601 885618 1064877 898956
14623H98956r8700M70486l49278R2464j70862J74871M054r5076K5272M12369m47129
$$ 898956 800256 1270742 921464 1013928 843066 1017937 1021991 926915 952187 1364556 917427
14612I17427Q1247K84721o9955l6951J10491r4584K066K52435l55356j76906L5711
$$ 917427 998674 1283395 1213440 1176489 1286980 1192396 1194462 1446897 1091541 914635 950346
14601I50346L66732K3124k00129J6815k56258J90374Q9639J15492J94461n00907
$$ 950346 1317078 1340202 1140073 1156888 900630 1091004 1180643 1296135 1490596 989689
14591I89689K15717R7445M8585R9918l53072J0398L09324P7924k96096L05670
$$ 989689 1205406 1302851 1351436 1451354 1098282 1108680 1418004 1495928 1199832 1505502
14581A505502k6381J29554k86925L36730j63514J09921q6504O7009j9446q4633
$$ 1505502 1479121 1608675 1321750 1658480 1494966 1604887 1518383 1585392 1565946 1481313
14571A481313J55978k131J4420l2216J01629j25129J64333k15168L04335J13913
$$ 1481313 1637291 1635160 1649580 1617364 1718993 1593864 1758197 1543029 1847364 1961277
14561A961277k89480M30639J40656J5362l15506M72381K29254k35891O79452L08639
$$ 1961277 1671797 2102436 2243092 2258454 1942948 2415329 2644583 2408692 3088144 3396783
14551C396783L39099R32425J781685M815159Q272987K0410511p540232A1007472
$$ 3396783 3735882 4668307 6449992 11265151 19538138 39948649 32408417 11007472
14542D475548j974767q93789L43512l87819j95233J9646K84910J03398n46910
$$ 4475548 2500781 1606992 1950504 1562685 1367452 1387098 1672008 1775406 1228496
14533A228496M18676M4512j95861J37872J91606l2375j97873K19850J2622k24813
$$ 1228496 1647172 1691684 1495823 1633695 1825301 1792926 1595053 1814903 1827525 1602712
14523A602712L10644j84911J57982p8845j1864n7118L37467l13352J65105j17471
$$ 1602712 1913356 1728445 1886427 1807582 1795718 1738600 2076067 1762715 1927820 1810349
14513A810349M81241k41120j8025O7195j69082K06538l3131J3845j11251R4153
$$ 1810349 2291590 2050470 2032445 2099640 1930558 2137096 2103965 2117810 2006559 2100712
14503B100712J6784K86149j84146Q5804k85902J72538M26548k03005J07708j10625
$$ 2100712 2117496 2403645 2219499 2305303 2019401 2191939 2618487 2415482 2523190 2412565
14493B412565L82071q8120m2895o5064k5480K1957n5418K30507j14650r1077L53992
$$ 2412565 2794636 2706516 2663621 2598557 2573077 2595034 2539616 2770123 2655473 2564396 2918388
14482B918388j14061J3610n0659L47303j4396J21838j73397k8118p9614r5440
$$ 2918388 2804327 2817937 2767278 3114581 3100185 3222023 3048626 3020508 2940894 2845454
14472B845454K83472J12095k16988J61317J01241K1965L7208J60098k53045j11056
$$ 2845454 3128926 3241021 3024033 3185350 3286591 3308556 3345764 3505862 3252817 3141761
14462C141761K73490J37194j8607J43963L31482l21418O5568J01693J76440j67027
$$ 3141761 3415251 3552445 3533838 3677801 4009283 3687865 3753433 3855126 4031566 3864539
14452C864539L24097j70837K50639l18743J00524Q8145L21349Q9635k96790j55149
$$ 3864539 4188636 4017799 4268438 3949695 4050219 4138364 4459713 4549348 4252558 4097409
14442D097409M46639O8132m33969N67379l93272M30892K21457n28582N00861K10795
$$ 4097409 4544048 4612180 4178211 4745590 4352318 4783210 5004667 4476085 4976946 5187741
14432E187741k07309N4150J81269k08718J11557K99748M5798J32192j83798J43549
$$ 5187741 4980432 5034582 5215851 5007133 5118690 5418438 5464236 5596428 5412630 5556179
14422E556179K47813L3964k14473L13307p5377J19820M8616K62021J80154J79466
$$ 5556179 5803992 5837956 5623483 5936790 5861413 5981233 6029849 6291870 6472024 6651490
14412F651490j2549K79375k42877L90454j49399K47151j51053M10227j93075L69788
$$ 6651490 6638941 6918316 6675439 7065893 6916494 7163645 7012592 7422819 7229744 7599532
14402G599532P5974K44479r7164O7026L18071j621K98654j69794L36284K4374
$$ 7599532 7675506 7919985 7822821 7889847 8207918 8206297 8504951 8335157 8671441 8695815
14392H695815N33292N3018K50025J60983j6365J47091J44121L09894K58080l8654
$$ 8695815 9229107 9282125 9532150 9693133 9676768 9823859 9967980 10277874 10535954 10497300
14382A0497300O3167L49832L17211L15992P4711Q6503L09596L37150L36252O2452
$$ 10497300 10560467 10910299 11227510 11543502 11618213 11704716 12014312 12351462 12687714 12750166
14372A2750166K27298K7020M61276K63976L38478J08683L16097P28668j08444
$$ 12750166 12977464 13004484 13465760 13729736 14068214 14176897 14492994 15221662 15113218
14363A5113218P21977J93925N86936m1684L43260N65501J31320O12029O76566
$$ 15113218 15835195 16029120 16616056 16574372 16917632 17483133 17614453 18226482 18903048
14354A8903048L60469K25760Q21344K59709L34421P46905K87821P05877O50523
$$ 18903048 19263517 19489277 20310621 20570330 20904751 21651656 21939477 22645354 23295877
14345B3295877M05187O68695O33321O01276R28655N73375J139209P09605M60635
$$ 23295877 23701064 24369759 25003080 25604356 26533011 27106386 28245595 28955200 29415835
14336B9415835J175072N86445R09415J267087Q61211R81422J036174J264554J195649
$$ 29415835 30590907 31177352 32086767 33353854 34215065 35196487 36232661 37497215 38692864
14327C8692864J244331J392858J311760J492529J641658J277530J718962J906702
$$ 38692864 39937195 41330053 42641813 44134342 45776000 47053530 48772492 50679194
14319E0679194J791107K048231J943348J813803K781637K413521K183384K466595
$$ 50679194 52470301 54518532 56461880 58275683 61057320 63470841 65654225 68120820
14311F8120820K917154L147135L061799L433464L460798L646560M429349L869577
$$ 68120820 71037974 74185109 77246908 80680372 84141170 87787730 92217079 96086656
14303I6086656M559762N001876M947289N500333N676926O353036N950009P240703
$$ 96086656 100646418 105648294 110595583 116095916 121772842 128125878 134075887 141316590
14295A41316590P595752P413547Q533473R171021R119113J0050177J0813516J1505026
$$ 141316590 148912342 156325889 164859362 174030383 183149496 193199673 204013189 215518215
14287B15518215J1313622J2529267J2788419J3484963J3939855J4332761J4312470
$$ 215518215 226831837 239361104 252149523 265634486 279574341 293907102 308219572
14280C08219572J4665111J4296774J4145424J3571907J2631103J1536996R683038
$$ 308219572 322884683 337181457 351326881 364898788 377529891 389066887 398749925
14273C98749925O013788J070600J631610J589052j164519m289652m474728p477498
$$ 398749925 404763713 405834313 407465923 409054975 407890456 403600804 399126076 391648578
14265C91648578r530678j1647118j3122109j3931015j4805426j5446336j5544234
$$ 391648578 382117900 370470782 357348673 343417658 328612232 313165896 297621662
14258B97621662j4912925j4144343j4013449j3798952j2821872j2363441j1670777
$$ 297621662 282708737 268564394 254550945 240751993 227930121 215566680 203895903
14251B03895903j1153660j0397502r992809r311524q611233q021558p163503o985511
$$ 203895903 192742243 182344741 172351932 163040408 154429175 146407617 139244114 132258603
14243A32258603o906948o234997n484255n785749n183573m207493m765723m363469
$$ 132258603 125351655 119116658 113632403 107846654 102663081 98455588 93689865 89326396
14235H9326396l849581m062382l422531k981434k765983l396366k777780k483314
$$ 89326396 85476815 81414433 77991902 75010468 72244485 68848119 66070339 63587025
14227F3587025k442911k298338k562144k241211j827694j855634j801503j569315
$$ 63587025 61144114 58845776 56283632 54042421 52214727 50359093 48557590 46988275
14219D6988275j641256j563203j365615j868994p69576r22367j493440j285172
$$ 46988275 45347019 43783816 42418201 40549207 39779631 38857264 37363824 36078652
14211C6078652j290507r86212r52526p11581n66902j138743j143503q63047m19116
$$ 36078652 34788145 33801933 32849407 32137826 31570924 30432181 29288678 28425631 28006515
14202B8006515j044322m25011q91593p16806p76258p16399m17753q63100k7078
$$ 28006515 26962193 26537182 25645589 24928783 24152525 23436126 23018373 22155273 22128195
14193B2128195n55494q39345p03435m52292J14977q31127k50650n08240l40499
$$ 22128195 21572701 20733356 20029921 19577629 19692606 18861479 18610829 18102589 17762090
14184A7762090j91359r77252l10981J1134l48978q59051p7933k74470k88125l27806
$$ 17762090 17570731 16593479 16282498 16293632 15944654 15085603 15007670 14733200 14445075 14117269
14174A4117269l42577j66482j84462k81528k69838k01090l79178j46551n62525
$$ 14117269 13774692 13608210 13423748 13142220 12872382 12671292 12292114 12145563 11583038
14165A1583038R1610j08248m57794J26448m2918q79778L24745j92276l62751Q1776
$$ 11583038 11674648 11566400 11108606 11235054 11192136 10312358 10637103 10444827 10082076 10163852
14155A0163852k52875j48336l11991K11750n11484j78224q5842j86976J01919
$$ 10163852 9910977 9762641 9450650 9662400 9150916 8972692 8886850 8699874 8801793
14146H801793k47295r0658k91784J0677k76775k10436J07264k65957j16250J31020
$$ 8801793 8554498 8463840 8172056 8182733 7905958 7695522 7802786 7536829 7420579 7551599
14136G551599n02463M19735m13215J58974m34893J601j91461l2203j55396J09578
$$ 7551599 7049136 7468871 7055656 7214630 6779737 6781338 6589877 6557674 6402278 6511856
14126F511856m51755J95451J3076n8767m37887K14205l44732K30299o3587J14722
$$ 6511856 6060101 6255552 6268628 6209861 5771974 5986179 5641447 5871746 5808159 5922881
14116E922881r42883O35057j49120r3778k29895q9102P3853L6773p8236m99952
$$ 5922881 4979998 5615055 5465935 5372157 5142262 5053160 5127013 5163786 5085550 4585598
14106D585598M39059l88360N08641p71179N27257m04476j99825P4780n3826j4309
$$ 4585598 5024657 4636297 5144938 4373759 4901016 4496540 4296715 4371495 4317669 4303360
14096D303360j36384j68543L478K28223k81281L22033m79654N6805j33512J18658
$$ 4303360 4166976 3998433 4001911 4230134 3948853 4270886 3791232 3848037 3714525 3833183
14086C833183J2009j6136O7843k64111m9088O3631j01992J24958j73423q4499
$$ 3833183 3845192 3829056 3896899 3632788 3583700 3647331 3545339 3670297 3496874 3412375
14076C412375n9148k32951M41736L332l78159p5805j26019J22195J90051Q6495
$$ 3412375 3353227 3120276 3562012 3565344 3187185 3111380 2985361 3107556 3297607 3384102
14066C384102k12516l03328K80125q9727K5588q8687n4589N4510p5726L298J62981
$$ 3384102 3171586 2868258 3148383 3058656 3084244 2995557 2940968 2995478 2919752 2923050 3086031
14055C086031k96680Q6407l1212j54488R2823O0726l09795k3165J22598j48660
$$ 3086031 2789351 2875758 2844546 2690058 2782881 2843607 2533812 2510647 2633245 2484585
14045B484585L3771J23160J9200p2334k52156l7135J12580j43317J93094k71448
$$ 2484585 2518356 2641516 2660716 2588382 2336226 2299091 2411671 2268354 2461448 2190000
14035B190000J67206M39716m49444J42159P2631J34672m83417q8830k15515K4550
$$ 2190000 2357206 2796922 2347478 2489637 2562268 2696940 2213523 2124693 1909178 1933728
14025A933728K04894n2973j57508L10797k26583j98100p675K66249o1475j09282
$$ 1933728 2138622 2085649 1928141 2238938 2012355 1814255 1806580 2072829 2011354 1902072
14015A902072J96930K6006k60995m91085L56060Q6264k6440K32642q6060n38697
$$ 1902072 2099002 2125008 1864013 1372928 1728988 1815252 1788812 2021454 1935394 1396697
14005A396697J85427L04622l34965L25138j48103l58606L38468p3459O4629M3252
$$ 1396697 1582124 1886746 1551781 1876919 1728816 1370210 1708678 1635219 1699848 1743100
13995A743100k71835J7552P8201J33159j25899O05394N16698K983931O019376
$$ 1743100 1471265 1488817 1567018 1700177 1574278 2179672 2696370 5680301 11699677
13986A1699677J8976637R446195A7579374H607997l249644j086555p28078o71217
$$ 11699677 30676314 40122509 17579374 8607997 5358353 4271798 3543720 2872503
13978B872503l82231j3134k59898q7913L32492l95341j84436m52661L63251J79666
$$ 2872503 2490272 2477138 2217240 2129327 2461819 2066478 1882042 1429381 1792632 1972298
13968A972298j64653j17392O4983N6843k21115K80331k38776k02201L73945k47201
$$ 1972298 1807645 1690253 1755236 1812079 1590964 1871295 1632519 1430318 1804263 1557062
13958A557062j67952J83993J52377j57355k27034J78448P8032j17930N12417p21218
$$ 1557062 1389110 1573103 1725480 1568125 1341091 1519539 1597571 1479641 1992058 1270840
13948A270840J83894j96040M26425m26105o6971K15277n7129k9650R0664K8507
$$ 1270840 1454734 1258694 1685119 1259014 1192043 1407320 1350191 1320541 1411205 1439712
13938A439712M6596k2279k75238K07447l79972L93209r4067p727k4585j92446
$$ 1439712 1486308 1464029 1188791 1396238 1016266 1409475 1315408 1307681 1283096 1090650
13928A090650R3075j51956J68590l30545L75464n8209J2693j6518l6653K23186
$$ 1090650 1183725 1031769 1200359 869814 1245278 1187069 1199762 1183244 1146591 1369777
13918A369777R0057j68824k89650m4551M44978l89133K60682j43073K6185j54654
$$ 1369777 1459834 1291010 1001360 956809 1401787 1012654 1273336 1130263 1156448 1001794
13908A001794L0674K91302O810j71410p4512J06584l03327k88866P61045l02155
$$ 1001794 1032468 1323770 1330580 1159170 1084658 1191242 887915 599049 1360094 1057939
13898A057939J21870o9976P8950j78804m31941M52038k16553j24321K82095k52711
$$ 1057939 1179809 1109833 1188783 1009979 578038 1030076 813523 689202 971297 718586
13888G18586M29901k73095J59517k19726J19248j73006J88269J49921j61675l6904
$$ 718586 1148487 875392 1034909 815183 934431 761425 949694 1099615 937940 901036
13878I01036J12843l78216N03882l59764J85395J4556J5809k8036N6443m09390
$$ 901036 1013879 635663 1139545 779781 965176 979732 995541 967505 1023948 614558
13868F14558K00624K39036l02237N7088K67214m38176L05580k40484o2517K68742
$$ 614558 815182 1054218 751981 809069 1076283 638107 943687 703203 640686 909428
13858I09428J59494D41351N85963k35327Q1202j59516q7731L51105j44890J06995
$$ 909428 1068922 441351 1027314 791987 873189 713673 625942 977047 832157 939152
13848I39152j61372n1436o857J57598J28162m97676L83198r4794o1598J0779k477
$$ 939152 777780 726344 719487 877085 1005247 507571 890769 795975 734377 745156 742679
13837G42679L9625K6165j79153K73294l31582J00252j66421J11361K36427l71432
$$ 742679 782304 808469 629316 902610 571028 671280 504859 616220 852647 481215
13827D81215K27907n6933J44399C48666K93611r8487R2753p7164P1133M8444J29493
$$ 481215 709122 652189 796588 348666 642277 543790 636543 559379 630512 678956 808449
13816H08449j58025J55968j11226j40358j19504K68879J02849l92503N93384j29116
$$ 808449 650424 806392 695166 554808 435304 704183 807032 414529 1007913 878797
13806H78797C32611K45869r0323J95002J29006j99878N725l05196J86923j60161
$$ 878797 332611 578480 488157 683159 812165 612287 618012 312816 499739 339578
13796C39578L82504B28370K99500L41676C34563J37039n5813J04938J7156p3359
$$ 339578 722082 228370 527870 869546 334563 471602 415789 520727 537883 464524
13786D64524J14946J78688J67656k54693j85904O3341l5478J29381O016k24410
$$ 464524 579470 758158 925814 671121 485217 548558 513080 642461 648477 424067
13776D24067k1038L2130J93276O6118n6677M3763j16514O7731r2336j73296K97146
$$ 424067 403029 435159 628435 694553 637876 681639 565125 632856 540520 367224 664370
13765F64370j95954P9764k31449M90027l00850j99934J2348K02147P4830m2126
$$ 664370 468416 548180 316731 806758 505908 305974 318322 520469 595299 553173
13755E53173q0665B10126k7737K6428K92224k9555p3701P5825J8636K03135k53251
$$ 553173 472508 210126 182389 208817 501041 471486 397785 473610 492246 695381 442130
13744D42130O9227j40140K8481L79024C81033H9838j89M18393N0106J59244A53455
$$ 442130 511357 371217 399698 778722 381033 89838 89649 508042 558148 717392 153455
13732D54629j11813R2375L71799C26938K48928j82991J94823R6283R4521l21277
$$ 454629 342816 435191 806990 326938 575866 392875 587698 683981 778502 457225
13722D57225J13384k56925F8635J07664K06485j38441A04000K89238O4619J7262
$$ 457225 570609 313684 68635 176299 382784 244343 104000 393238 457857 475119
13712D75119J15440k73569J81471H1004N27655B78296R3364m4956c3071F35800
$$ 475119 590559 316990 498461 81004 608659 278296 371660 326704 -33071 635800
13701C06773o7976J96632o810q5533l5069J35839R2107k03973K012k4126m9946
$$ 306773 238797 435429 428619 343086 308017 443856 535963 331990 334002 309876 259930
13690B59930J38476j25644K14980K40637B08082M8115M67808A24240J62054L03699
$$ 259930 398406 272762 487742 728379 208082 256197 724005 124240 286294 589993
13680E89993k66006P9434J9278A82414Q1701B4015N16053F3635K37990K2854P7275
$$ 589993 323987 403421 422699 182414 264115 24015 540068 63635 301625 324479 401754
13669D01754B5295L22997A14713K53945p2503o7768J7046L85908k60584J93045
$$ 401754 25295 348292 114713 368658 296155 228387 245433 631341 370757 563802
13659E63802A51197K78823O8690A49389M05560B61373J54258p618K10486k99614
$$ 563802 151197 430020 498710 149389 554949 261373 415631 408013 618499 318885
13649C18885J17668l4865j58505j19279L40850J14059B00401R3895K98166r5516
$$ 318885 436553 401688 243183 123904 464754 578813 200401 294296 592462 496946
13639D96946A09380M62115A56884K6505K55267j48197b0959A68979K2138N2419
$$ 496946 109380 571495 156884 183389 438656 290459 -20959 168979 191117 243536
13629B43536J37885A29421K49220R4482A65632O5489R872K13147M2127R132B03106
$$ 243536 381421 129421 378641 473123 165632 231121 240993 454140 496267 505399 203106
13617E79535I2042K38206j21507R3311L5998m1170A12680L19023A91569G493L57136
$$ 579535 92042 330248 208741 302052 338050 296880 112680 431703 191569 7493 364629
13606C64629J39056A71771K56924N0342q8376J401A47239J55149A49876P9489
$$ 364629 503685 171771 428695 479037 390661 392062 147239 302388 149876 229365
13596B29365K54983r9746l94L3224j25191j38279a00887C86802J15737J14362
$$ 229365 484348 384602 384208 417432 292241 153962 -100887 386802 502539 616901
13586F16901i0185E49261j58181K4970r0028l2194r6170D3738L70528p5707A441
$$ 616901 -90185 549261 391080 416050 326022 293828 197658 43738 414266 338559 1441
13574C57859j28396a18959D03267A53331J17578H6029i731l3051A70939P766M11421
$$ 357859 229463 -118959 403267 153331 270909 86029 -9731 -42782 170939 178705 590126
13563E90126k23505O4696A88149L4330G9949K04745J17476J39124k62708a76726
$$ 590126 366621 431317 188149 222479 79949 284694 402170 541294 278586 -176726
13552B00469j6496L23982I1456O1118J34128m5740m4918K25109A44386K2589a9886
$$ 200469 183973 507955 91456 152574 286702 240962 196044 421153 144386 166975 -19886
13540B83415J72813K8700k26547R9100j10993j2462K5392J0205l8160K08005r9071
$$ 283415 456228 484928 258381 357481 246488 234026 259418 269623 231463 439468 340397
13529C40397j21557K98420A6680K09936Q3667E4223K42850j8931D3514L1744J47333
$$ 340397 218840 517260 16680 226616 310283 54223 297073 278142 43514 75258 222591
13518B22591r5073P2888M13707D8203Q8117f6448B38810G9609O06265G4958L04512
$$ 222591 127518 200406 614113 48203 136320 -66448 238810 79609 685874 74958 379470
13507C79470q1654A39110h2794A00142M84758B88792j07845l9571K44333j65368
$$ 379470 297816 139110 -82794 100142 584900 288792 180947 141376 385709 220341
13497B20341g5953I7356b72042D2259L85375A08090b51318C3588K04605P5473
$$ 220341 -75953 97356 -272042 42259 427634 108090 -251318 33588 238193 313666
13487C13666A46943G0803M3528J2026H3J59615A9925Q4743J30754a24749A45806
$$ 313666 146943 70803 114331 126357 83 159698 19925 104668 235422 -124749 145806
13475C98351A93193o1545m8511K1210a85595A63922K074Q6844R8504I2511D1060
$$ 398351 193193 131648 83137 104347 -185595 163922 165996 252840 351344 92511 41060
13463G8091K47097B2363K28421J14992K07337k33821b7268A16855m4961J00846
$$ 78091 325188 22363 250784 365776 573113 339292 -27268 116855 71894 172740
13453A72740Q4588K0533a9150B14914J3877F8555K502K22876e5396B83774D7244
$$ 172740 257328 277861 -19150 214914 228791 68555 71057 293933 -55396 283774 47244
13441A98373b06476F3342j9878A9419L62235A33730J39991m764f4330A74662k7358
$$ 198373 -206476 63342 43464 19419 381654 133730 273721 268957 -64330 174662 147304
13430A47304l9259J84329D3674K03911b5778C8409L13185A30442J78131K66541
$$ 147304 108045 292374 43674 247585 -25778 38409 351594 130442 308573 575114
13420E75114A27664j5939P9677J22161B0916L15170Q7616A11363J33112R819N08673
$$ 575114 127664 111725 191402 313563 20916 336086 423702 111363 244475 254294 762967
13409G62967i2887I0155A9420K86960j17903p7088O1960a8682j03946E4255J17777
$$ 762967 -92887 90155 19420 306380 188477 111389 173349 -18682 -122628 54255 172032
13398A72032M7858A028J68352L5261b15441C01288o7932f9684A26923O2462J48417
$$ 172032 219890 1028 169380 204641 -215441 301288 233356 -69684 126923 189385 337802
13387C37802J65058k41872B6977l842J14155J21187A00936C1482L62906j72927
$$ 337802 502860 260988 26977 23135 137290 258477 100936 31482 394388 221461
13377B21461G863J2342L49568A1877a87589A06667I574K15550P4570A39783J0388
$$ 221461 7863 20205 369773 11877 -187589 106667 9574 225124 299694 139783 150171
13366A50171l2980M45169D8013R1231j4798J09822I3558j7958p97J74970j00351
$$ 150171 117191 562360 48013 139244 124446 234268 93558 75600 74803 249773 149422
13355A49422j824M3803b4233j90902B88202f1410C50556A5945K81039b7074A17568
$$ 149422 147598 191401 -24233 -215135 288202 -61410 350556 15945 296984 -27074 117568
13343A20973n0404Q3570n7826K82932r0706n0828E5062N6318J93816j6738c3034
$$ 120973 70569 154139 96313 379245 288539 237711 55062 111380 305196 288458 -33034
13331B04106a32540A47977R7552l9753b33995H5358H934a20222c9083B83117J29325
$$ 204106 -132540 147977 245529 205776 -233995 85358 8934 -120222 -39083 283117 412442
13320D12442A61239p9210K79309A57590g2435C07401A09572L35250A70815E8142
$$ 412442 161239 82029 361338 157590 -72435 307401 109572 444822 170815 58142
13309a84119a6942C15849A03633a36136f3759B27427M2921n3885k969p3797P0149
$$ -184119 -16942 315849 103633 -136136 -63759 227427 270348 216463 213494 139697 209846
13298B09846b84558A26161Q2289m7470n1094D2277g743A96035M052A5483K95298
$$ 209846 -284558 126161 208450 160980 109886 42277 -7743 196035 200087 15483 310781
13287C10781a10566A25901O9508E0775f8390C20649A54346H193J5959J35296K73196
$$ 310781 -110566 125901 195409 50775 -68390 320649 154346 8193 24152 159448 432644
13276D32644D0170J60379j7486N4405a07082H0852c7319p2045e1898n8149K7936
$$ 432644 40170 200549 183063 237468 -107082 80852 -37319 -109364 -51898 -110047 -82111
13265h2111j98756A68645J02222A10262K91495l9427A75290a69479b4010C86900
$$ -82111 -280867 168645 270867 110262 401757 362330 175290 -169479 -24010 386900
13254A83531a40948C5886J76670J43192J29306f5479L1743A32826B1620g4706
$$ 183531 -140948 35886 212556 355748 485054 -65479 -33736 132826 21620 -74706
13243A79199q7648g2751A22462L6479e1497A07358K7053h8205D38582j73672f8950
$$ 179199 91551 -72751 122462 158941 -51497 107358 134411 -88205 438582 264910 -68950
13231C24778A3479b35057C15521I7782K94725j82809c9164B82903e5485A51235
$$ 324778 13479 -235057 315521 97782 392507 209698 -39164 282903 -55485 151235
13220e0560A03326b30701N0160A66766J2E7169K67119A59060E3678a36950B4995
$$ -50560 103326 -230701 -180541 166766 166778 57169 324288 159060 53678 -136950 24995
13208A75153J43380A44546b48285A180J44760m5554e2461B71965H7572a86134
$$ 175153 318533 144546 -248285 1180 145940 100386 -52461 271965 87572 -186134
13197A64885m8829b58971i6233A85090a0184p9912k7355A0555J59102l7480Q8555
$$ 164885 116056 -258971 -96233 185090 -10184 -90096 -117451 10555 169657 132177 220732
13186B20732b08225A08058K1754h429B34430K9182k3944A6713O3623a9476o2325
$$ 220732 -208225 108058 129812 -8429 234430 263612 239668 16713 80336 -19476 -81801
13175h1801j32996h1153j28097H648J04032M4107J74698A28344D3126c51923J74825
$$ -81801 -214797 -81153 -209250 8648 112680 156787 331485 128344 43126 -351923 -177098
13164a77098B2509m609L69784h7511p804A07326J35758f2465K9739D75378A60029
$$ -177098 22509 17900 387684 -87511 -95315 107326 243084 -62465 -32726 475378 160029
13152d8280B43480R7172B4679J3438K565L75759c2462B63343o5602g9987F687
$$ -48280 243480 340652 24679 38117 40682 416441 -32462 263343 197741 -79987 6687
13140D22680d9061D5959b00024F8339b40881B5860a4535B77847k7856r5418a53416
$$ 422680 -49061 45959 -200024 68339 -240881 25860 -14535 277847 249991 154573 -153416
13128C13138j10114D5006c46746H0670a42133N9457F0195a31615B09242J09703
$$ 313138 203024 45006 -346746 80670 -142133 -82676 60195 -131615 209242 318945
13118C18945B8552C448P492J42645J63775q8877p7084J85449a6727k53810H0834
$$ 318945 28552 3448 10940 153585 317360 228483 151399 336848 -16727 -270537 80834
13106c530H7556b52983e7559f150D36876A15256K71869H2266Q1679b8956m7740
$$ -3530 87556 -252983 -57559 -6150 436876 115256 387125 82266 163945 -28956 -76696
13095g6696A26241n4039a51827B5490K84481b71869L8381B0421K74574r3730q5612
$$ -76696 126241 72202 -151827 25490 309971 -271869 -233488 20421 294995 201265 115653
13084A15653a6528B1566L87159h1975J2702A16569F550c10467h6689a4717J409
$$ 115653 -16528 21566 408725 -81975 -69273 116569 6550 -310467 -86689 -14717 -13308
13073a3308I4849L10066B5418O9333R8076o9O4040B2476M0499g7078k4632B34034
$$ -13308 94849 404915 25418 94751 192827 192758 256798 22476 62975 -77078 -101710 234034
13060d7180j11472C62936A1510J1623d3139H6691i5574A42497a48235A7523a28831
$$ -47180 -158652 362936 11510 23133 -43139 86691 -95574 142497 -148235 17523 -128831
13048B77604i7403j77210B9334a057n1556B20687a44156O0900A1250a67051B6651
$$ 277604 -97403 -274613 29334 -1057 -52613 220687 -144156 -83256 11250 -167051 26651
13036g3899B53269m2064E7700J16341a87389B08678G4371a43293H0212M3716n7752
$$ -73899 253269 211205 57700 174041 -187389 208678 74371 -143293 80212 123928 66176
13025F6176h6648E3772P0300i124E6378J34925c946A44827F7541A4962g833j30767
$$ 66176 -86648 53772 124072 -9124 56378 191303 -3946 144827 67541 14962 -7833 -138600
13013a38600C43132l9077a18815L7448a2755l61070a17144j63100I5969a02531
$$ -138600 343132 304055 -118815 -81367 -12755 -373825 -117144 -280244 95969 -102531
13002D67226G7558C0059a19317A83220f4952A35950D0692P760J1731K65687c2643
$$ 467226 77558 30059 -119317 183220 -64952 135950 40692 48452 60183 325870 -32643
12990D2215A6467J83046m8977a9998n2418q675C03481C0539J04543b95939A3604
$$ 42215 16467 199513 150536 -19998 -72416 -81091 303481 30539 135082 -295939 13604
12978c953C40694o1939D9621a92341k4514A17686a87786K3193G8290d5182q3607
$$ -3953 340694 278755 49621 -192341 -216855 117686 -187786 -164593 78290 -45182 -128789
12967a28789B7364K29720a34647A31618K20112H4026P4375k5483n301b32269A03787
$$ -128789 27364 257084 -134647 131618 351730 84026 158401 132918 127617 -232269 103787
12955b00250B15525A5261i1503g752r7101L2335A89063q5631j3447Q0292g5724
$$ -200250 215525 15261 -91503 -7752 -104853 -72518 189063 103432 89985 170277 -75724
12943a39485I6475A7577h9265E30512h1782a7347A48941a6244k57971A69806d03428
$$ -139485 96475 17577 -89265 530512 -81782 -17347 148941 -16244 -274215 169806 -403428
12931a492C57942j31661c6567j80542n1526C34343a61552D593J34726J54370A9868
$$ -1492 357942 226281 -36567 -217109 -268635 334343 -161552 4593 139319 293689 19868
12919A01626B2121c18742h6625F2762j3138N3415P029a3021F6201K46997j1040
$$ 101626 22121 -318742 -86625 62762 49624 103039 110068 -13021 66201 313198 302158
12908C02158I4677b16547C66239b19189A16298d6839A7110a02031c4129m670a3325
$$ 302158 94677 -216547 366239 -219189 116298 -46839 17110 -102031 -34129 -38799 -13325
12896c5769l6452C5591c3138D6845a50320C97193g2473j45574D3926Q5076K17223
$$ -35769 -72221 35591 -33138 46845 -150320 397193 -72473 -218047 43926 129002 346225
12885C46225j11094G0708A1482a9626A25923A4660a89513F2246h9848j48930B7368
$$ 346225 235131 70708 11482 -19626 125923 14660 -189513 62246 -89848 -238778 27368
12873a11254A4607K3802i5655A13996M02b21638h8818H0653C1619a60402b240
$$ -111254 14607 38409 -95655 113996 114398 -221638 -88818 80653 31619 -160402 -2240
12861D50894d08133a87701c1539j52275H9737C8769r391J99943A14653a78504
$$ 450894 -408133 -187701 -31539 -183814 89737 38769 29378 229321 114653 -178504
12850e6352j73428A27687i5412A25884P5123g5366k52288e8911a7978q7995A45820
$$ -56352 -229780 127687 -95412 125884 201007 -75366 -327654 -58911 -17978 -105973 145820
12838A54752o0859c8404j55596K2633B7967J03747D4378K55704i756D4185A9299
$$ 154752 93893 -38404 -194000 -171367 27967 131714 44378 300082 -9756 44185 19299
12826c83047H4368L24362b80649i7705Q513B81336h1610A87425e1224o9551m2173
$$ -383047 84368 408730 -280649 -97705 -89192 281336 -81610 187425 -51224 -120775 -162948
12815a62948A68126C138d6657A83386c13049f0039b5904A09424A7649a97037F9720
$$ -162948 168126 3138 -46657 183386 -313049 -60039 -25904 109424 17649 -197037 69720
12803A10004a40771d8146A65896j1723a02718A34972K252f5439A84426G1865a08076
$$ 110004 -140771 -48146 165896 154173 -102718 134972 137224 -65439 184426 71865 -108076
12791D9788a04769A0517K5888j2770a14267M7143B04199c19866H5213d0727m9956
$$ 49788 -104769 10517 36405 23635 -114267 -67124 204199 -319866 85213 -40727 -90683
12780i0683B21558d1864A503b90459f7182o4358B01463b06009A0694c57504E3795
$$ -90683 221558 -41864 1503 -290459 -67182 -131540 201463 -206009 10694 -357504 53795
12768b9086f90B49625a8487o9679A12869b36236o822C02346b4174o3748m53744
$$ -29086 -690 249625 -18487 -88166 112869 -236236 -243058 302346 -24174 -87922 -541666
12757e41666d375l66043A73964f1713k33584C58521A24211d9825o3449B00842
$$ -541666 -4375 -370418 173964 -61713 -295297 358521 124211 -49825 -113274 200842
12746a16310D72489G2475g4792C32000B11J46501a35880r6250g1148n5305C5218
$$ -116310 472489 72475 -74792 332000 211 146712 -135880 -232130 -71148 -126453 35218
12734a81871H423K80055c07729A19784K15340d1242p0580c7648k00468F979J20811
$$ -181871 8423 288478 -307729 119784 335124 -41242 -111822 -37648 -238116 6979 127790
12723A27790J8053d7897A71069l1510n3581a39417J3909A66608J1678F2394J01963
$$ 127790 145843 -47897 171069 139559 85978 -139417 -125508 166608 178286 62394 164357
12712A64357b59302B66397A31281i0230g524B02501E7965j3837d7806B5672h610
$$ 164357 -259302 266397 131281 -90230 -7524 202501 57965 44128 -47806 25672 -8610
12700A43797c4384H3399b5275k65581e0772A6438g5489D5482a1940A3662M17723
$$ 143797 -34384 83399 -25275 -290856 -50772 16438 -75489 45482 -11940 13662 431385
12689D31385a62942b934r8594n8283I8013b11777K5004A08986g5788G0136A7702
$$ 431385 -162942 -2934 -101528 -159811 98013 -211777 -186773 108986 -75788 70136 17702
12677B70432b3243A7666a7329D828J06079J16226f1413J875B12148C9495a3973
$$ 270432 -23243 17666 -17329 4828 110907 227133 -61413 -59538 212148 39495 -13973
12665A03824c1499B30827d302B4104J30338M5825r2730f8956l8844A2779a81178
$$ 103824 -31499 230827 -4302 24104 154442 200267 107537 -68956 -107800 12779 -181178
12653A10196C1028h3133A98697E02L3833N2356g80k8009H2422e7252l8701A3931
$$ 110196 31028 -83133 198697 502 34335 86691 -780 -28789 82422 -57252 -95953 13931
12640A53468M1897d2844j2379B36242i5149A86070D3807i4833D66M8672O2287
$$ 153468 195365 -42844 -55223 236242 -95149 186070 43807 -94833 466 49138 111425
12629A11425j9212J5191n607M7670f841o7118H1228P0894L3593H5313M3260b38150
$$ 111425 92213 107404 101797 149467 -6841 -73959 81228 152122 185715 85313 128573 -238150
12616G2454J97351p0587R3141A33772K05197b08477e4889C6593J78489j04023
$$ 72454 269805 199218 292359 133772 338969 -208477 -54889 36593 215082 111059
12606A11059c5775A76811a7080k53081B26885b45461B8694J5384a5567m3529E7550
$$ 111059 -35775 176811 -17080 -270161 226885 -245461 28694 44078 -15567 -59096 57550
12594a2001j40899b2685j10897A37218J44251j02832b05354a6163A62471i6226
$$ -12001 -152900 -22685 -133582 137218 281469 178637 -205354 -16163 162471 -96226
12583a54213C8201c11690G6503K24718a73506G6938J74973d8862q661A5092R1045
$$ -154213 38201 -311690 76503 301221 -173506 76938 251911 -48862 -57523 15092 106137
12572A06137i77B47106q3042d8630F8505B7471K02981c2945l6940A48607a46293
$$ 106137 -977 247106 164064 -48630 68505 27471 230452 -32945 -69885 148607 -146293
12560c6258l2526B1156c6690I9741J8918J45982b24025A91559b37246C5398a65378
$$ -36258 -68784 21156 -36690 99741 118659 264641 -224025 191559 -237246 35398 -165378
12548e3733k08139G7939B9359d6436m6438j00192h679A29268B8994b8769j64327
$$ -53733 -261872 77939 29359 -46436 -92874 -193066 -8679 129268 28994 -28769 -193096
12537a93096C1512f4715q9319c6415q6418d0904A76170c51240a42279F0871b37076
$$ -193096 31512 -64715 -154034 -36415 -122833 -40904 176170 -351240 -142279 60871 -237076
12525b2145H5846K2135c0348a0063B55911h6561A19961e2074A3795R927J4780
$$ -22145 85846 107981 -30348 -10063 255911 -86561 119961 -52074 13795 23722 38502
12514C8502Q3731O5623G0133b59898a16303B16210i6139A83171a25432j49419
$$ 38502 122233 187856 70133 -259898 -116303 216210 -96139 183171 -125432 -274851
12504b74851E3420N0928P2948b48033E7364b7479D7385b57671g1267B50973H2418
$$ -274851 53420 104348 177296 -248033 57364 -27479 47385 -257671 -71267 250973 82418
12492a59416b32j22187e7761K8469j55773h5773A348J85183c4850A89788e3735
$$ -159416 -232 -122419 -57761 -29292 -185065 -85773 1348 186531 -34850 189788 -53735
12480b21097Q2875O5604k11246F0715L8715g1009C06628A06016k8871K067J95318
$$ -221097 -138222 -72618 -283864 60715 99430 -71009 306628 106016 77145 79212 274530
12469B74530E592a53431j34256a42665A13503a9311j77454K1144o2349O8725B48398
$$ 274530 5592 -153431 -287687 -142665 113503 -19311 -196765 -175621 -237970 -169245 248398
12457i5987L3852A54079o4444H318J53514J01963a38905p6437D456e3680B54928
$$ -95987 -62135 154079 89635 8318 161832 263795 -138905 -215342 4456 -53680 254928
12445e1313A46248b43571A2245a15589j92553a01790G8313a06713D3840a84916
$$ -51313 146248 -243571 12245 -115589 -308142 -101790 78313 -106713 43840 -184916
12434A34405k358a40408B5284d8098j41549E9544g9109I2543f5320E189a23079
$$ 134405 132047 -140408 25284 -48098 -189647 59544 -79109 92543 -65320 5189 -123079
12422G9893j4136R4206M1554J13380a14699N4859j48481n5583A04881P624J12857
$$ 79893 65757 159963 201517 314897 -114699 -59840 -208321 -263904 104881 112505 225362
12411B25362b9178k23039i3082A09256c57951J21301A65239a86631e7006k19563
$$ 225362 -29178 -252217 -93082 109256 -357951 -236650 165239 -186631 -57006 -276569
12401b76569E2497m803J06534O2132g9377A54577J44242a00448j37861d086B72876
$$ -276569 52497 47694 154228 216360 -79377 154577 298819 -100448 -238309 -4086 272876
12389C3364J3686k917j7372R1341b93463G2213J42491C7954N0171J05409a38661
$$ 33364 47050 44133 26761 118102 -293463 72213 214704 37954 88125 193534 -138661
12377e46632C58625j45950f8674A27926B2069a29081l519C9284O1699a10266N3766
$$ -546632 358625 212675 -68674 127926 22069 -129081 -132600 39284 100983 -110266 -56500
12366e6500A91683F664J49964E1541a77095H0351J1223k1111D135a83228J8683
$$ -56500 191683 6664 156628 51541 -177095 80351 91574 70463 4135 -183228 -164545
12355a64545A11668A272J23759L8111a1594q8460A4396b34638h2904C2011O4313
$$ -164545 111668 1272 125031 163142 -11594 -100054 14396 -234638 -82904 32011 96324
12344I6324f5751F9966a4359H2891L8601B9872a66935k9752b3955D0178b5670
$$ 96324 -65751 69966 -14359 82891 121492 29872 -166935 -196687 -23955 40178 -25670
12332h8155E392f9226B0827Q2827n1810J18304h2007H5260a58270B6843a85258
$$ -88155 5392 -69226 20827 103654 51844 170148 -82007 85260 -158270 26843 -185258
12320a07724F6430a96649j7662a1675l15364J21544c1469r4087j20586B0216i826
$$ -107724 66430 -196649 -214311 -11675 -327039 -205495 -31469 -125556 -246142 20216 -9826
12308A04847l6222D444c15868g570j98890F2652a032C24186F9776J22672c7124
$$ 104847 68625 4444 -315868 -7570 -206460 62652 -1032 324186 69776 192448 -37124
12296a71414A65681g5497A20436c30205B05934a83877P4551N4074C47798a13253
$$ -171414 165681 -75497 120436 -330205 205934 -183877 -109326 -55252 347798 -113253
12285B2842J10155J20009J5583a01675K5204q250B52866f6103J1392A43001a76716
$$ 22842 132997 253006 268589 -101675 -76471 -84721 252866 -66103 -54711 143001 -176716
12273b82436M6635F6578J36158C3806f3696A9792b23855B44722D7464a54998q8613
$$ -282436 -235801 66578 202736 33806 -63696 19792 -223855 244722 47464 -154998 -243611
12262b43611h2327a2162B50850a44761B13197b3374A3200K27192i0528j47544
$$ -243611 -82327 -12162 250850 -144761 213197 -23374 13200 240392 -90528 -238072
12252b38072K3072q7724C0085b29014C85131A74677G6053l4694j6524R641J13512
$$ -238072 -215000 -302724 30085 -229014 385131 174677 76053 41359 24835 34476 147988
12241A47988n5785a70529B39482j02397a62945A5071K37718a6984C17809A21777
$$ 147988 92203 -170529 239482 137085 -162945 15071 252789 -16984 317809 121777
12230B84758b57891E0568K12658k1239L00100B33033D582K75136a85711D35908
$$ 284758 -257891 50568 263226 241987 542087 233033 4582 279718 -185711 435908
12219e7400C17724H5356b28770g2423C8459K9875a37658A73868H0627l2713h5359
$$ -57400 317724 85356 -228770 -72423 38459 68334 -137658 173868 80627 47914 -85359
12207E8607j3527j4615j4167J49045c7502C80494A82136D5953b25972C07535E9879
$$ 58607 45080 30465 16298 165343 -37502 380494 182136 45953 -225972 307535 59879
12195B30280n4697K51829B08207j3195H0744L0945K65539h3743B03580I036J2549
$$ 230280 175583 427412 208207 195012 80744 111689 377228 -83743 203580 9036 21585
12184B1585J94963a04188j18415Q0806A91187a67781b0482C8308a6772n792J0778
$$ 21585 216548 -104188 -222603 -141797 191187 -167781 -20482 38308 -16772 -22564 -11786
12173a1786I0812d5420D2536g3249L6554p9210K8887A06380Q0487h8207p5681
$$ -11786 90812 -45420 42536 -73249 -36695 -115905 -87018 106380 186867 -88207 -163888
12162a63888A2943K58944F3617O3941E5500a02277r0408B31655O2231e7808B06095
$$ -163888 12943 271887 63617 127558 55500 -102277 -192685 231655 293886 -57808 206095
12150A43679P221O2325a00235D55687C9268e8392B79523F8804J29297j9394j3340
$$ 143679 150900 213225 -100235 455687 39268 -58392 279523 68804 198101 178707 165367
12139A65367a53886B46266H7240i6800c4013j13408f474k25479g7389D4024J11485
$$ 165367 -153886 246266 87240 -96800 -34013 -147421 -6474 -231953 -77389 44024 155509
12128A55509L6758o287a19566E05297B1410a23732d1868k96899D6543a71758b021
$$ 155509 192267 185980 -119566 505297 21410 -123732 -41868 -338767 46543 -171758 -2021
12116b60532l7426I9537J2642b07122A25638O8015B5304J95481a53752N7396o5953
$$ -260532 -297958 99537 112179 -207122 125638 193653 25304 220785 -153752 -96356 -162309
12105a62309A36347f4259A9357a84232A10239b10387E518L2792b42236J7909B2189
$$ -162309 136347 -64259 19357 -184232 110239 -210387 5518 38310 -242236 -224327 22189
12093f7113A55455l9265a30712C4533O7169a77803e6902A27435A9675N6045K27584
$$ -67113 155455 116190 -130712 34533 101702 -177803 -56902 127435 19675 75720 303304
12082C03304K09057P32680F05704a8372k58599B74922e8513j67554c8111k1462
$$ 303304 512361 1245041 605704 -18372 -276971 274922 -58513 -226067 -38111 -59573
12072e9573A27277D8610K90646B226M7481J95685a12856B12696L699D9341P6143
$$ -59573 127277 48610 339256 2226 49707 245392 -112856 212696 216395 49341 125484
12061A25484a59071N7480a8615k34352I6298j519a66754J8511A02904K64438j01460
$$ 125484 -159071 -101591 -18615 -252967 96298 94779 -166754 -148243 102904 367342 265882
12050B65882J29194i3790q6851F2301k0631A9999d7216B08842h8216B03079d589
$$ 265882 395076 -93790 -180641 62301 41670 19999 -47216 208842 -88216 203079 -4589
12038B49990a75745B49987F1389h5797C3500b50397a02575H2091J82006A08655
$$ 249990 -175745 249987 61389 -85797 33500 -250397 -102575 82091 264097 108655
12027a34757D4884J35469F875a0087B51401G0501Q4558D5501P0668E3208L28726
$$ -134757 44884 180353 6875 -10087 251401 70501 155059 45501 116169 53208 381934
12016C81934j04934K2127b26715P6578b3871k45423j73325a5397F8646J11225
$$ 381934 277000 299127 -226715 -150137 -23871 -269294 -442619 -15397 68646 179871
12006A79871a03259I5639J67830p3992D1002a7993j92329L0533g5509j5842B5419
$$ 179871 -103259 95639 263469 189477 41002 -17993 -210322 -179789 -75509 -91351 25419
11994a70869f9082m39003a25329C9176K13004a48932a1145k68083a26621b8487
$$ -170869 -69082 -508085 -125329 39176 252180 -148932 -11145 -279228 -126621 -28487
11983A19255f8903D53109b28487E1786L303a99584G2088b42192A62195E5881c17177
$$ 119255 -68903 453109 -228487 51786 55089 -199584 72088 -242192 162195 55881 -317177
11971h6293q3775B36800D4659b35388A50334K1665E4569K0897i5491E5174a59072
$$ -86293 -170068 236800 44659 -235388 150334 171999 54569 75466 -95491 55174 -159072
11959A33195a9330o6074D21328f4974G4584a52079A37231c4549r3711L4444m1600
$$ 133195 -19330 -85404 421328 -64974 74584 -152079 137231 -34549 -128260 -93816 -135416
11948a35416j6885P1430p3938J1171j2929A28786A276b04365b190k45762A53923
$$ -135416 -152301 -80871 -154809 -143638 -156567 128786 1276 -204365 -2190 -247952 153923
11936A7925M4426Q7520K78696A94964o006a30385q9277d0462k12148A29238g7494
$$ 17925 62351 149871 428567 194964 188958 -130385 -219662 -40462 -252610 129238 -77494
11924a8626m5404H8447k7828Q512b65473J15449c5360p1437j29407B55133c20154
$$ -18626 -64030 88447 60619 69131 -265473 -150024 -35360 -106797 -236204 255133 -320154
11912e5974n9065j6958K3349j38662J02460L9800n6679O6050C9015m059a52560
$$ -55974 -115039 -131997 -108648 -247310 -144850 -105050 -161729 -95679 39015 34956 -152560
11900B53168b85955j39857i6700A74520a97137G2198a67922A33289j0335c87738
$$ 253168 -285955 -425812 -96700 174520 -197137 72198 -167922 133289 122954 -387738
11889a49120j2404B68829b50594a24151E4891J99709d16909J9863g8099G0886
$$ -149120 -161524 268829 -250594 -124151 54891 254600 -416909 -397046 -78099 70886
11878g0977p0697k3988m1953N6520l080C19951b24007Q7956E2260K79595c1500
$$ -70977 -141674 -165662 -207615 -151095 -154175 319951 -224007 -136051 52260 331855 -31500
11866a7522r1221B76117b64318A67666c66100d3056E4921a5912D4369d00873H5070
$$ -17522 -108743 276117 -264318 167666 -366100 -43056 54921 -15912 44369 -400873 85070
11854A43932j4741c17093a46361j39875A35998a19741o8368B41812a18285d7995
$$ 143932 129191 -317093 -146361 -286236 135998 -119741 -188109 241812 -118285 -47995
11843A8911I004O0446O9394m6506a24088c9426l3361c593j6859j70342Q172a0936
$$ 18911 9004 69450 138844 92338 -124088 -39426 -72787 -3593 -20452 -190794 -182622 -10936
11830b33762I696a85181A0519a07348e1668a9751l83244a67645c0930J909j6405
$$ -233762 9696 -185181 10519 -107348 -51668 -19751 -402995 -167645 -30930 -29021 -45426
11819d5426A07774d144E8665b4229k22162A4667O3406K16764m5838a48101D762
$$ -45426 107774 -4144 58665 -24229 -246391 14667 78073 294837 248999 -148101 4762
11807c925j68857h3046j50341a00968r587A60363a93779A80354f556k33988a032
$$ -3925 -172782 -83046 -233387 -100968 -110555 160363 -193779 180354 -6556 -240544 -1032
11795A85107c42184B67618q6977c0661B56300A21042c29328A26915A6576J08513
$$ 185107 -342184 267618 180641 -30661 256300 121042 -329328 126915 16576 125089
11785A25089C117b11481c6719B08913b8011H1253J866c8574C1272e1133G2293
$$ 125089 3117 -211481 -36719 208913 -28011 81253 83119 -38574 31272 -51133 72293
11773g314A01801a77179k12082a3952m3827B96503b37423q0308D2272a6118l09098
$$ -7314 101801 -177179 -389261 -13952 -57779 296503 -237423 -317731 42272 -16118 -325216
11762c25216B13782a0236o4180k62391a24819j2117a1868k1780j37698E4142g5051
$$ -325216 213782 -10236 -74416 -336807 -124819 -136936 -11868 -33648 -171346 54142 -75051
11750d3610k30257g8157R857B39265b13399a5928j23470A24865a62168g6871j66981
$$ -43610 -273867 -78157 -68300 239265 -213399 -15928 -139398 124865 -162168 -76871 -243852
11739b43852E1339K0734K03434c6833A40855a08801H7113J49017a27605I4122
$$ -243852 51339 72073 275507 -36833 140855 -108801 87113 236130 -127605 94122
11728A20995a00004A33957m9197c1257B10402j2798a6447j59670f9980j58751
$$ 120995 -100004 133957 84760 -31257 210402 197604 -16447 -176117 -69980 -228731
11718b28731e4704C46228j08519a72903M6917c8048A20427c33221H8530o927N4549
$$ -228731 -54704 346228 237709 -172903 -125986 -38048 120427 -333221 88530 81603 136152
11707A36152C7680a45782B8638a05050o1993B3511J6966a81106G5600K5669J13536
$$ 136152 37680 -145782 28638 -105050 -167043 23511 40477 -181106 75600 101269 214805
11696B14805b3752A82383m1095d6144B1857J87908N0680C8006M7273N093g150
$$ 214805 -23752 182383 141288 -46144 21857 209765 260445 38006 85279 90372 -7150
11684G2929b19560c3383E4000F03K91600e5274G9501A5930K02529d3140A3580
$$ 72929 -219560 -33383 54000 603 292203 -55274 79501 15930 218459 -43140 13580
11672e4475j86087A78368B9826i3081a788k30301A23010b2881k49971e7519a1560
$$ -54475 -240562 178368 29826 -93081 -1788 -232089 123010 -22881 -272852 -57519 -11560
11660a20323A48166a76828H362K3677A4077K6804J0410a65394A92254J00247a23947
$$ -120323 148166 -176828 8362 32039 14077 40881 51291 -165394 192254 292501 -123947
11648b5798p6625k14941F3980b2062r7292G9010j463A0222J10841h9091h917k63683
$$ -25798 -102423 -317364 63980 -22062 -119354 79010 77547 10222 121063 -89091 -8917 -272600
11636b72600J1666F365b70364J7872f5815A7324e3517B88573F4543a33006A43787
$$ -272600 -260934 6365 -270364 -252492 -65815 17324 -53517 288573 64543 -133006 143787
11624H5165B0581a0467j73185j40996F0285R7512J32011b8772F2819J74478a42038
$$ 85165 20581 -10467 -183652 -324648 60285 157797 289808 -28772 62819 237297 -142038
11612b24866A38845a34755h601A07739O6176b3390C77774a86913A27153f3450
$$ -224866 138845 -134755 -8601 107739 173915 -23390 377774 -186913 127153 -63450
11601A55770l7271L8030l9933o940P6868G4914a55048A41804b95228A61666a44589
$$ 155770 118499 156529 116596 109656 186524 74914 -155048 141804 -295228 161666 -144589
11589i5455A34175h0137k747L7092D8521K5009f7483A02274a45850l6577q256
$$ -95455 134175 -80137 -82884 -45792 48521 73530 -67483 102274 -145850 -182427 -190683
11578a90683A98877a07901A93685m233Q6881a9158A13619i1423G3478b15549F7088
$$ -190683 198877 -107901 193685 189452 276333 -19158 113619 -91423 73478 -215549 67088
11566A11914j1508M3492J48017j8012p8807j9417c7253j2717A79758J19691a03084
$$ 111914 100406 143898 291915 273903 195096 175679 -37253 -49970 179758 299449 -103084
11554h0800G1372a24766k76241A76238a70759B99805e3500A34076i4020F27179
$$ -80800 71372 -124766 -401007 176238 -170759 299805 -53500 134076 -94020 627179
11543b70236h0831p8498B8087a84011C4926N5085i5243B16520J6204e8120D75213
$$ -270236 -80831 -159329 28087 -184011 34926 90011 -95243 216520 232724 -58120 475213
11531B08339r2394l9009c388C52820h6023A29469J3336b50345J19510J5748j63656
$$ 208339 115945 76936 -3388 352820 -86023 129469 142805 -250345 -130835 -115087 -278743
11520b78743P0394j02088A17364D4614a89521D678e455A32190A4282a29531b9478
$$ -278743 -208349 -310437 117364 44614 -189521 4678 -5455 132190 14282 -129531 -29478
11508a33974A20590J65544j06928c3754o3275C4313N1215i3908O311A05487E0503
$$ -133974 120590 286134 179206 -33754 -97029 34313 85528 -93908 -87597 105487 50503
11496c73477i2328R200j05683I6909J56126i0232b9983k5894A01257C696h0501
$$ -373477 -92328 -83128 -188811 96909 253035 -90232 -29983 -55877 101257 3696 -80501
11484A61590A590e3226a0296m8860A25356a42918C0437a7375B38097B7430O5266
$$ 161590 1590 -53226 -10296 -59156 125356 -142918 30437 -17375 238097 27430 92696
11473I2696M7289d8557B3714J01886J10664N2885e267j3521G3819E93K27975j2083
$$ 92696 139985 -48557 23714 125600 236264 289149 -5267 -18788 73819 593 228568 216485
11461B16485b03252b5716C88929I631L6338F928L90231a31239c2501B75870o72
$$ 216485 -203252 -25716 388929 9631 45969 6928 397159 -131239 -32501 275870 275198
11450B75198i3987A61752a12912B3855Q9241L7603n0289J06456H801J11670l4549
$$ 275198 -93987 161752 -112912 23855 113096 150699 100410 206866 8801 120471 85922
11439H5922a76001f985E642a56730C3814G233g5740D7524d8816A38552k7807a3516
$$ 85922 -176001 -6985 5642 -156730 33814 7233 -75740 47524 -48816 138552 110745 -13516
11426A30262A7561K48860g535C07630c07723C7187b14754h7304C9614a28875A88993
$$ 130262 17561 266421 -7535 307630 -307723 37187 -214754 -87304 39614 -128875 188993
11414a08218j66517a05819b0957F5448d00926A34441E0700P3296M5863J67746
$$ -108218 -274735 -105819 -20957 65448 -400926 134441 50700 123996 169859 337605
11404C37605b99395E0872a05061G0895b02069G6438L2110a46265N2468b9833A76132
$$ 337605 -299395 50872 -105061 70895 -202069 76438 108548 -146265 -93797 -29833 176132
11392d3998A57540K50550A33857D4025e144j44669G7258d219j61084A83513g6131
$$ -43998 157540 408090 133857 44025 -5144 -149813 77258 -4219 -165303 183513 -76131
11380E6952J6802a06705L1971G8070J03149N4706q5703j6112o5984a45888A42685
$$ 56952 73754 -106705 -74734 78070 181219 235925 150222 134110 68126 -145888 142685
11368c9569O163B12565m2332b78200c932B33137C1120M4710a51606K1072j17709
$$ -39569 -33406 212565 170233 -278200 -3932 233137 31120 75830 -151606 -130534 -248243
11357b48243C1151O385J7031g3428A00104c63802B9979H668j502O0788n799c8268
$$ -248243 31151 37536 54567 -73428 100104 -363802 29979 8668 7166 67954 62155 -38268
11344b55115A77158b32680N5453A23327k9850b08489B7642a19589G5189M8949
$$ -255115 177158 -232680 -177227 123327 93477 -208489 27642 -119589 75189 124138
11334A24138K6174a0831B2966O7673a73991A4743a48284E563a28679O1656k7650
$$ 124138 150312 -10831 22966 90639 -173991 14743 -148284 5563 -128679 -67023 -94673
11323i4673L8309A55410N959l0551k6287L80948b23805B22429b53212A2102J11801
$$ -94673 -56364 155410 161369 130818 104531 485479 -223805 222429 -253212 12102 123903
11312A23903l5395b59k36978F061b904j0604A93564m9869j4866a06473A17254
$$ 123903 88508 -259 -237237 6061 -2904 -13508 193564 143695 128829 -106473 117254
11300a17509A9175a28580K5801L6024k07651i8469I8327j3354b35166B03659a7779
$$ -117509 19175 -128580 -102779 -66755 -274406 -98469 98327 84973 -235166 203659 -17779
11288A59223b61048D7224h028l6740J414A26171a75070A69374a09870d3202G3235
$$ 159223 -261048 47224 -8028 -44768 -43354 126171 -175070 169374 -109870 -43202 73235
11276b58226k06203g5405j32047b9632A94153M3802a59254C0868b11564C5g5161
$$ -258226 -464429 -75405 -207452 -29632 194153 237955 -159254 30868 -211564 35 -75161
11264a02665r693C20520c1040H5621P5270a00766A33186J389d3258B08883a39578
$$ -102665 -112358 320520 -31040 85621 160891 -100766 133186 134575 -43258 208883 -139578
11252a26336A67077b27847d6201l8501r2389N7526o9453F161d78545A56746A4739
$$ -126336 167077 -227847 -46201 -84702 -177091 -119565 -189018 6161 -478545 156746 14739
11240E2956N751k8535c8211I5906j7633b51350a19400j02554C63056b93876f0328
$$ 52956 58707 30172 -38211 95906 78273 -251350 -119400 -221954 363056 -293876 -60328
11228a28108F6152N60864h6561d380B80064a31302j35682A06064e6055l63127
$$ -128108 66152 627016 -86561 -4380 280064 -131302 -266984 106064 -56055 -419182
11218d19182A37192a57222a1826A8588M0949a02801G7091Q1689h7462L4578j49219
$$ -419182 137192 -157222 -11826 18588 59537 -102801 77091 158780 -87462 -52884 -202103
11207b02103c6288B20793a43578l692J2628B83700a80779O5152A97095K52865
$$ -202103 -36288 220793 -143578 -147270 -134642 283700 -180779 -115627 197095 449960
11197D49960f1799F3591K932f4330K9334G0582b84993G5863H157c8840l3499j71207
$$ 449960 -61799 63591 66523 -64330 -34996 70582 -284993 75863 8157 -38840 -72339 -243546
11185b43546a1840C1805Q6352J9801a7454j90472J2139n1359f7408j12181P7371
$$ -243546 -11840 31805 118157 137958 -17454 -207926 -195787 -247146 -67408 -179589 -102218
11174a02218F0228a93784Q2193A32400b84389J18470H5898c72352e0079l89621
$$ -102218 60228 -193784 -111591 132400 -284389 -165919 85898 -372352 -50079 -439700
11164d39700a64869L9332B98439d0534A3881M861b30952B6070j0935O3622n574
$$ -439700 -164869 -125537 298439 -40534 13881 18742 -230952 26070 15135 78757 73183
11153G3183J07063b51517o0596P094e1929H9873J01947c27585J56280h0959q0993
$$ 73183 180246 -251517 -312113 -305019 -51929 89873 191820 -327585 -171305 -80959 -161952
11142a61952b2150j31995f6510j69510a13357M6290A77500b53752C0432a653A07602
$$ -161952 -22150 -154145 -66510 -236020 -113357 -67067 177500 -253752 30432 -1653 107602
11130c86605B90679h1720D04615I2686e0057j44200A20166c04834A80620B6952
$$ -386605 290679 -81720 404615 92686 -50057 -194257 120166 -304834 180620 26952
11119e0368A23568j6332C682a15817A12250a2716A02678K7233a45751A5248a95390
$$ -50368 123568 107236 3682 -115817 112250 -12716 102678 129911 -145751 15248 -195390
11107B70935b00113A79579q4489a26214B1319K44089a6981A85714e8685I7251
$$ 270935 -200113 179579 95090 -126214 21319 265408 -16981 185714 -58685 97251
11096d213I4230K15575C6608J89293D5468M60034B19621J2992A11370J84264j26163
$$ -4213 94230 309805 36608 225901 45468 505502 219621 232613 111370 295634 169471
11085A69471J07107c0640A0210C770g2966A62680P7872A18879D7063a15908E587
$$ 169471 276578 -30640 10210 3770 -72966 162680 240552 118879 47063 -115908 5587
11073a03026C44577b17221d2394E3576N3976L809N5304J95969A43785J94160p4671
$$ -103026 344577 -217221 -42394 53576 107552 111361 166665 362634 143785 337945 263274
11062B63274J37478g3463B88965e2703C62352L17463E2915L66057n7169K33602
$$ 263274 400752 -73463 288965 -52703 362352 679815 52915 418972 361803 595405
11052E95405j60662J6068j46062C8949K85713l7989O7276j15476R4024j40311
$$ 595405 434743 450811 304749 38949 324662 286673 353949 238473 332497 192186
11042A92186r720i246C96436J01979B32713J02074J65589A80488J2484N8065K63126
$$ 192186 182466 -9246 396436 498415 232713 334787 500376 180488 192972 251037 514163
11031E14163O7919k49315p0422K1961J80649K66939P0566l62620n3194j06512
$$ 514163 582082 332767 262345 284306 464955 731894 802460 439840 386646 280134
11021B80134K0545E8080O45207B44642K18823A11601P9075K53992P3692m6039
$$ 280134 300679 58080 703287 244642 463465 111601 190676 444668 518360 472321
11011D72321j30633p537A54895K67765j79837J09406m3818l6043L20375a84509
$$ 472321 341688 334151 154895 422660 242823 352229 308411 272368 592743 -184509
11000E18420k54914J8934J87452k08573J50807A60879B6717L65493l7834A30573
$$ 518420 263506 282440 469892 261319 412126 160879 26717 392210 354376 130573
10989C08581m9573o4882J79689K59999l16679N0849J00306K0057M0271j5401m4308
$$ 308581 259008 194126 373815 633814 317135 367984 468290 488347 528618 513217 468909
10978D68909L64645k10965P6856p25K26747N0809K19693J22356J68702j24182
$$ 468909 833554 622589 699445 698720 925467 976276 1195969 1318325 1487027 1362845
10968A362845l0277r9861o9492L3886k98396k19780N4613J54184J43579k33035
$$ 1362845 1332568 1232707 1163215 1197101 898705 678925 733538 887722 1031301 798266
10958G98266J31076K50562m83793K03888L37489j55682m38428K57838k41269k98484
$$ 798266 929342 1179904 696111 899999 1237488 1081806 643378 901216 659947 361463
10948C61463K95510B52370Q7617n6189j16786B3806K9739P3637n6572a73540a83
$$ 361463 656973 252370 339987 283798 167012 23806 53545 127182 70610 -173540 -183
10936A47848a14324C14290d4577j02652g0159K5729B5380f1959A83139i3827B39594
$$ 147848 -114324 314290 -44577 -147229 -70159 -44430 25380 -61959 183139 -93827 239594
10924E5197O3635a01141j38811f1971b7561F3612a8918r2831B8094M8292J2440
$$ 55197 118832 -101141 -239952 -61971 -27561 63612 -18918 -111749 28094 76386 88826
10913H8826A4228a4117E578Q8316f0414A70873A1398c10670a5851B89796c85980
$$ 88826 14228 -14117 5578 93894 -60414 170873 11398 -310670 -15851 289796 -385980
10901B24590d62271d2618A28870e6608p3482O1786q0304f2126q656J5935K5542
$$ 224590 -462271 -42618 128870 -56608 -130090 -68304 -148608 -62126 -70782 -54847 -29305
10890b9305j44452q2898a02789L3179B80408a59884P1201o3612o0376k8498A04633
$$ -29305 -173757 -256655 -102789 -69610 280408 -159884 -88683 -152295 -212671 -241169 104633
10878b45870M142a8520A91577J8339j9101N3158o4671e0274n4204A98132h5089
$$ -245870 -241728 -18520 191577 209916 190815 243973 179302 -50274 -104478 198132 -85089
10866A1196L906h6828D03312F9217d6034m6736j1048j03500A95539c13273C2725
$$ 11196 15102 -86828 403312 69217 -46034 -92770 -103818 -207318 195539 -313273 32725
10854D346N3458j3957b33264J01859k5106O0484K7716m7719F1004J14589R0118
$$ 4346 57804 43847 -233264 -131405 -156511 -96027 -68311 -116030 61004 175593 265711
10843B65711j500g4681H8753E831d016E9018Q0101D406K17179a185k01374i1819
$$ 265711 264211 -74681 88753 5831 -4016 59018 139119 4406 221585 -1185 -202559 -91819
10830A12173a62729n9457N9549q6631c1C9371A7088L08855j39322e9555m9598
$$ 112173 -162729 -222186 -162637 -249268 -31 39371 17088 325943 186621 -59555 -109153
10819a09153b2244n2236a2248o608B51971d4137C085R217M9846b63265L8229A1552
$$ -109153 -22244 -74480 -12248 -18856 251971 -44137 3085 12302 62148 -263265 -225036 11552
10806b00435O8323a6859q9615j03152L0697f8424G356c48869i0617B27156a11211
$$ -200435 -132112 -16859 -106474 -209626 -178929 -68424 7356 -348869 -90617 227156 -111211
10794b6495B4117a51823a9269r0456C4188K43400A16762A8559a92668g7865L6373
$$ -26495 24117 -151823 -19269 -109725 34188 277588 116762 18559 -192668 -77865 -41492
10783d1492K087G5933g2573G3888D555h6727A48202b91574J35652d9906H6541
$$ -41492 -39405 75933 -72573 73888 4555 -86727 148202 -291574 -155922 -49906 86541
10771D5260f1961j58795k09382H1114J02200J30522j50152n9587a53184j65202
$$ 45260 -61961 -220756 -430138 81114 183314 313836 163684 104097 -153184 -318386
10761c18386e108o9536C0865c6267C87821a23435b7552A16495b29349P9415j46281
$$ -318386 -5108 -74644 30865 -36267 387821 -123435 -27552 116495 -229349 -149934 -296215
10750b96215f3481j27283j25676a13066B82199a08036E7385e194o5269A34083
$$ -296215 -63481 -190764 -316440 -113066 282199 -108036 57385 -5194 -70463 134083
10739I7862a29944B56020A6559d5925A1435K2271b32364A94024D4214a48083f2175
$$ 97862 -129944 256020 16559 -45925 11435 33706 -232364 194024 44214 -148083 -62175
10727A01525a63162d9236G2827k3685a51096A96045g9371r7692I2018b53336g9576
$$ 101525 -163162 -49236 72827 49142 -151096 196045 -79371 -177063 92018 -253336 -79576
10715G8139R8560m1621c0414k16132b9052C1183P9430f6515A19854g0147m5752
$$ 78139 176699 135078 -30414 -246546 -29052 31183 110613 -66515 119854 -70147 -115899
10704a15899I7721A0586c51974a26001A18761a32007N7043j26631G5239o260a74760
$$ -115899 97721 10586 -351974 -126001 118761 -132007 -74964 -201595 75239 68979 -174760
10692b44712K5331j47017c6727A2201g8117C05852c97744a02104j71046e3104
$$ -244712 -219381 -366398 -36727 12201 -78117 305852 -397744 -102104 -273150 -53104
10681C0939i952C7365b62523H2271N6792a32073A18166c57360d6609B00369l0384
$$ 30939 -9952 37365 -262523 82271 139063 -132073 118166 -357360 -46609 200369 169985
10670A69985d4515m5435I6620j0431a26723k9946N467B5248c28797J34558D9507
$$ 169985 -44515 -89950 96620 86189 -126723 -156669 -151202 25248 -328797 -194239 49507
10658B07727b42371H696h7876m7869A12675c42609a28858E2169M5776C7396d39137
$$ 207727 -242371 8696 -87876 -135745 112675 -342609 -128858 52169 97945 37396 -439137
10646a19267N5384A42170g510A81985e0129A58442h4404r6454N9495N1095k08788
$$ -119267 -63883 142170 -7510 181985 -50129 158442 -84404 -180858 -121363 -70268 -279056
10635b79056c6144k1628q7380P0462K3614D8981c0384B75587b08709H6750L3761
$$ -279056 -36144 -57772 -145152 -74690 -51076 48981 -30384 275587 -208709 86750 120511
10624A20511a1255k02852G5127r542a902G3007A62J5173a79545A92795D3031b02339
$$ 120511 -11255 -214107 75127 65585 -1902 73007 162 15335 -179545 192795 43031 -202339
10611f1254k62793a60563D8551Q6849D42c6930j05745B19285c23966A39281Q542
$$ -61254 -324047 -160563 48551 135400 442 -36930 -142675 219285 -323966 139281 147823
10600A47823E3298h8364c7083d752A47138a18804c8710m7348j31007B6503Q789
$$ 147823 53298 -88364 -37083 -4752 147138 -118804 -38710 -86058 -217065 26503 35292
10589C5292K9373B6380d9096A7656b96725a38911A54569a07101j98970B6208b41777
$$ 35292 64665 26380 -49096 17656 -296725 -138911 154569 -107101 -306071 26208 -241777
10577C44123C0367a67199H1349K11513a75773e5659A52146k586b6465l43441P3955
$$ 344123 30367 -167199 81349 292862 -175773 -55659 152146 149560 -26465 -369906 -295951
10566b95951a04149m6485j8841j15877B8731c5141E2713O2169b66387k13675h8126
$$ -295951 -104149 -150634 -169475 -285352 28731 -35141 52713 114882 -266387 -480062 -88126
10554b76663A71285i1730E3828g9198B31510h1372A9952L3917Q1041f6503k30954
$$ -276663 171285 -91730 53828 -79198 231510 -81372 19952 53869 134910 -66503 -297457
10543b97457K1038a28232F6215J31096i6675r4066l12469I58e38278B07012A3974
$$ -297457 -276419 -128232 66215 197311 -96675 -190741 -503210 958 -538278 207012 13974
10531c9351k25100A78663a57469o386d9423p7277G7567C992a3142r1369I4902
$$ -39351 -264451 178663 -157469 -163855 -49423 -126700 77567 3992 -13142 -104511 94902
10519G9734K32774a73542E656d2278j67513c8479k5392a2597l37743B52641C4972
$$ 79734 312508 -173542 5656 -42278 -209791 -38479 -63871 -12597 -350340 252641 34972
10507b43753A54431a42318c0983j68318e7080F6796J8093a72262A76940g0155
$$ -243753 154431 -142318 -30983 -199301 -57080 66796 84889 -172262 176940 -70155
10496b51006A6577J43729F64b4467l89734A92821A0838b0029k75625g0970B4614
$$ -251006 16577 160306 664 -24467 -414201 192821 10838 -20029 -295654 -70970 24614
10484C6132a28958A97349Q5162A20477l7050M14280A35160a42617e5318k37099
$$ 36132 -128958 197349 282511 120477 83427 497707 135160 -142617 -55318 -292417
10474b92417C05138i6149A44075a93657k61799h2987A14219G696a4473r5874I1562
$$ -292417 305138 -96149 144075 -193657 -455456 -82987 114219 7696 -14473 -110347 91562
10462A86931q3880C3342c9386k71316B09504F4075i1973r4125A84282a990k08532
$$ 186931 103051 33342 -39386 -310702 209504 64075 -91973 -186098 184282 -1990 -210522
10451b10522H179K16334h7058F9209J39079E9117e1304A73623m0688o5133J22279
$$ -210522 8179 224513 -87058 69209 208288 59117 -51304 173623 132935 67802 190081
10440A90081A1746e2926j04091A74049k4892o0558d08578D7880b92411r0870a69937
$$ 190081 11746 -52926 -157017 174049 149157 88599 -408578 47880 -292411 -383281 -169937
10428b40229K3471J01038G92N3725a41834r1168B28321b38788B8843O8086J51821
$$ -240229 -216758 -115720 792 54517 -141834 -233002 228321 -238788 28843 96929 248750
10417B48750a24256G2197c72566a44439k7694b2352m9683F0629d13005J51324
$$ 248750 -124256 72197 -372566 -144439 -172133 -22352 -72035 60629 -413005 -261681
10407b61681E6849J34712G0776d25976I9584c15650B5644a19633A24622g6238
$$ -261681 56849 191561 70776 -425976 99584 -315650 25644 -119633 124622 -76238
10396f8343B22793b06575B47522B9743c8588q7144F1606a9638B8042J15420O2372
$$ -68343 222793 -206575 247522 29743 -38588 -125732 61606 -19638 28042 143462 205834
10385B05834q994a27001p6273p864I1831a22867O0549A98708A4521J22521C2470
$$ 205834 196840 -127001 -203274 -211138 91831 -122867 -62318 198708 14521 137042 32470
10373A26976A6964O5327R1022g0094K428A12394i0773D13080n3846j33608n7640
$$ 126976 16964 82291 173313 -70094 -67666 112394 -90773 413080 359234 225626 167986
10362A67986g7019B73644A00450J47143K31844a23745I9571A44a02041A29044
$$ 167986 -77019 273644 100450 247593 479437 -123745 99571 144 -102041 129044
10351B87626M7679A64688p052M06559k40448a27389C09113c2589C65037q9432
$$ 287626 335305 164688 157636 564195 323747 -127389 309113 -32589 365037 275605
10341B75605L2731M1059j68278a26332A50224i0668l4347C16049b31597B96465
$$ 275605 308336 349395 181117 -126332 150224 -90668 -125015 316049 -231597 296465
10330A93998A9972Q9422J5571J9756J52405j20015a05575A72819N4894b82722
$$ 193998 19972 109394 124965 144721 297126 177111 -105575 172819 227713 -282722
10319A31179e5131r9500f8090H9544G472N2333a44801G3893a4053j09470D19415
$$ 131179 -55131 -154631 -68090 89544 7472 59805 -144801 73893 -14053 -123523 419415
10307B8434O1570a27290A10257c4645G1777a40164J3137A01710l5195c7555r4543
$$ 28434 90004 -127290 110257 -34645 71777 -140164 -127027 101710 66515 -37555 -132098
10296a32098I7805f1469F7917j6072a74360Q4653c627B51062G9875l9167e7556
$$ -132098 97805 -61469 67917 51845 -174360 -89707 -3627 251062 79875 40708 -57556
10284a40106F521b7249k37185E1882K6194g331A8770b71157h9487o2502C7767
$$ -140106 6521 -27249 -264434 51882 78076 -7331 18770 -271157 -89487 -151989 37767
10272b64559I1661j305A5415b47186A35281E8002a87585q1599h1955o0837K0758
$$ -264559 91661 90356 15415 -247186 135281 58002 -187585 -269184 -81955 -142792 -122034
10261a22034B72493j346j6295E4072J33498C8038J63842c27378A1391J66010a1987
$$ -122034 272493 271147 254852 54072 187570 38038 201880 -327378 11391 177401 -11987
10249A8016O3513g8644D5564j3652J47248b22199r2035C0034a18390A61748a48758
$$ 18016 81529 -78644 45564 31912 179160 -222199 -314234 30034 -118390 161748 -148758
10237a54873j2596A42625b15902a02313m9758F2382M3582D3538b77952a02681
$$ -154873 -167469 142625 -215902 -102313 -152071 62382 105964 43538 -277952 -102681
10226b97291c3072A9892a7556j13409I77J96601a74785K7009A30065i5441r9393
$$ -297291 -33072 19892 -17556 -130965 977 197578 -174785 -147776 130065 -95441 -194834
10215a94834h3600A25200a16286A46413c4398o2098I3532b70607f9474l3402J0552
$$ -194834 -83600 125200 -116286 146413 -34398 -96496 93532 -270607 -69474 -102876 -92324
10204i2324n8771f8746r3644H8412b25332A04477i2384J703j62934A90783c6377
$$ -92324 -151095 -68746 -162390 88412 -225332 104477 -92384 -90681 -253615 190783 -36377
10192a27118F9425J7341d55268C057L61221I8307c21891a450n6523j3430C56928
$$ -127118 69425 86766 -455268 3057 364278 98307 -321891 -1450 -57973 -71403 356928
10180h9512k48513F3366B5399L6930L42448a60740b5323k16188J10230j83606
$$ -89512 -338025 63366 25399 62329 404777 -160740 -25323 -241511 -131281 -314887
10170c14887F4151a8159m2529j03663C1246a78047e3604k89026A0071N6893j4570
$$ -314887 64151 -18159 -60688 -164351 31246 -178047 -53604 -342630 10071 66964 52394
10159E2394c2093B5743a49200K4276a1924B14768c2414j88824c3500E8690J13315
$$ 52394 -32093 25743 -149200 -124924 -11924 214768 -32414 -221238 -33500 58690 172005
10148A72005A2447c05542B35596b28526B18457m75b24605I4907a27089l4212H2702
$$ 172005 12447 -305542 235596 -228526 218457 217982 -224605 94907 -127089 -161301 82702
10136c0855k05815B3134a98021l4312f6767A0923a50923k2645l9025f6521j35603
$$ -30855 -236670 23134 -198021 -232333 -66767 10923 -150923 -173568 -212593 -66521 -202124
10125b02124B897a08414c2220k30224j55724a74753l3358J4483a8702B17097D229
$$ -202124 2897 -108414 -32220 -262444 -418168 -174753 -208111 -193628 -18702 217097 4229
10113a11189j2179A282K41787b2773m4121J6174n7703d6255C20421D1884b40205
$$ -111189 -123368 1282 243069 -22773 -66894 -50720 -108423 -46255 320421 41884 -240205
10101e1940k7396A27090b09680H2669A8043K2236f0329A33241b03851e5742l59481
$$ -51940 -79336 127090 -209680 82669 18043 40279 -60329 133241 -203851 -55742 -415223
10090d15223G2197l0316a41131e7517j4988b0859j07011l5644O8179L1238D0960
$$ -415223 72197 41881 -141131 -57517 -72505 -20859 -127870 -163514 -95335 -64097 40960
10078C10931b5373G6946J36517F6442d9203j9242A9370a45013l01290A24646m3347
$$ 310931 -25373 76946 213463 66442 -49203 -68445 19370 -145013 -446303 124646 81299
10067H1299c4110a0463n256l25518i705A99772c01179A5653f2450B13565g5262
$$ 81299 -34110 -10463 -15719 -341237 -9705 199772 -301179 15653 -62450 213565 -75262
10055a14447G0126J7449c11258m2707E9367b15622F0305J4350c3796A717d124
$$ -114447 70126 87575 -311258 -353965 59367 -215622 60305 74655 -33796 1717 -4124
10043a87478o3760B57982j20126c4282j73836F7485L37823j88289k8685i6152
$$ -187478 -251238 257982 137856 -34282 -208118 67485 405308 217019 188334 -96152
10032d2853l38549J0682A67391a20283J7584A25124A2783L5827a82837c4075A08650
$$ -42853 -381402 -370720 167391 -120283 -102699 125124 12783 48610 -182837 -34075 108650
10020b45519N9440A00060R8463o2410a53509j01576B26465h1434j38675A01590
$$ -245519 -186079 100060 198523 136113 -153509 -255085 226465 -81434 -220109 101590
10009B16910k1842a021j43726l6133c8844j45213D12537A64820E3652a20801c2574
$$ 216910 195068 -1021 -144747 -180880 -38844 -184057 412537 164820 53652 -120801 -32574
9997b64688K1711l278B04595l0615b58074E2254a9062C5583d5812k50585a2542
$$ -264688 -242977 -246255 204595 173980 -258074 52254 -19062 35583 -45812 -296397 -12542
9985h0559A71284c24986A46185a82748b1235A23031J26748h3790K2859r027H3547
$$ -80559 171284 -324986 146185 -182748 -21235 123031 249779 -83790 -60931 -69958 83547
9973A20299E2346b93628E8978b58440a04300p013J9236K4327A13388M6242h8978
$$ 120299 52346 -293628 58978 -258440 -104300 -111313 -92077 -67750 113388 159630 -88978
9961a03753j06020B5820a36706F988b27558i2978j97120g1288c4144D6928e1075
$$ -103753 -209773 25820 -136706 6988 -227558 -92978 -290098 -71288 -34144 46928 -51075
9949B14994a01404A45370i8174D031a20594J3743a3636p526C0490a6258o7098
$$ 214994 -101404 145370 -98174 4031 -120594 -106851 -13636 -21162 30490 -16258 -83356
9938h3356b9300F8415Q688b31642h7643b5954G7180O1801M9832A056O4237b14049
$$ -83356 -29300 68415 77103 -231642 -87643 -25954 77180 138981 188813 1056 65293 -214049
9925c04821B21288b16127j59779R7433A47107d83964C3783J8699a86215N3852
$$ -304821 221288 -216127 -375906 -278473 147107 -483964 33783 52482 -186215 -132363
9915a32363j31290L7545h0394J4811k178H1258A1501a2440b542F7152a49290O3754
$$ -132363 -263653 -226108 -80394 -65583 -67761 81258 11501 -12440 -2542 67152 -149290 -85536
9903h5536I3399a02042l7902B80594B2297a44186E7287K1676d6304j61070I9822
$$ -85536 93399 -102042 -139944 280594 22297 -144186 57287 78963 -46304 -207374 99822
9891b69933l2830J05739n6568l0576L2368E6964b56256b5297k22556a05840c1756
$$ -269933 -302763 -197024 -253592 -284168 -251800 56964 -256256 -25297 -247853 -105840 -31756
9879E6451b38163N9912B65784B0462I326e8545B46746b0304f916I1075b30535
$$ 56451 -238163 -178251 265784 20462 9326 -58545 246746 -20304 -6916 91075 -230535
9867a60164N8852L002a0256k29339c0492q1412p1816B9385a48708B6706a30266
$$ -160164 -101312 -98310 -10256 -239595 -30492 -111904 -183720 29385 -148708 26706 -130266
9855C5215a87764A05898A6279g2301A11779a20225d5479h051j12366K898b4846
$$ 35215 -187764 105898 16279 -72301 111779 -120225 -45479 -8051 -120417 -117519 -24846
9843F3105K19323A36026c14663j88698c4863p0639D8557h5511C9215b6650E1194
$$ 63105 282428 136026 -314663 -503361 -34863 -105502 48557 -85511 39215 -26650 51194
9831H6616b56624J15127D56437c0112B83882c58892d3952p2997o0117j7349B47972
$$ 86616 -256624 -141497 456437 -30112 283882 -358892 -43952 -116949 -177066 -194415 247972
9819d90796A66641c86865C9562b21761B22923C993b32964i0605j02134G740b71022
$$ -490796 166641 -386865 39562 -221761 222923 3993 -232964 -90605 -192739 7740 -271022
9807a50002j37154P1852j8e577j2272j79911O4928A01473b4661p2147P755M3797
$$ -150002 -287156 -215304 -215322 -5577 -17849 -197760 -132832 101473 -24661 -96808 -89053 -45256
9795d5256B5497b91491J44850M1208A04517j7140C4363a2355G2819c56785a24796
$$ -45256 25497 -291491 -146641 -105433 104517 87377 34363 -12355 72819 -356785 -124796
9783i7922j50408a03641j81587B33138a22277j04165A28525K07483G4919P4275
$$ -97922 -248330 -103641 -285228 233138 -122277 -226442 128525 336008 74919 149194
9773A49194i9396D7558a46463B62188e4172A636N4935L6114R7793h3414A41735
$$ 149194 -99396 47558 -146463 262188 -54172 1636 56571 92685 190478 -83414 141735
9761a82959c5052C22043a55642l0684E1300a91075k3337M8151A50856n4794B3453
$$ -182959 -35052 322043 -155642 -186326 51300 -191075 -214412 -166261 150856 96062 23453
9749a69440g1488A00661l0873E481O1232q187f4979k15683C111J00039M5875c83478
$$ -169440 -71488 100661 69788 5481 66713 58526 -64979 -280662 3111 103150 149025 -383478
9736A74662a78068l4713A75187h8533j04299B208h159A60068D7281J12416a34451
$$ 174662 -178068 -212781 175187 -88533 -192832 2208 -8159 160068 47281 159697 -134451
9724b15789A16941b18533L0515A05776l0290a79684P5658E9819d5128A50921L9221
$$ -215789 116941 -218533 -188018 105776 75486 -179684 -104026 59819 -45128 150921 190142
9713A90142I0209a96540B08540k0821l8904b30537B455h2754J5469j0354H5057
$$ 190142 90209 -196540 208540 187719 148815 -230537 2455 -82754 -67285 -77639 85057
9701A94520K2912a60378A28789h250A48741a64826F2783a20798A3519P7534A5854
$$ 194520 217432 -160378 128789 -8250 148741 -164826 62783 -120798 13519 91053 15854
9689a83648k08982b4951j41236A41409o5014J76136a12085j34370j73481A19344
$$ -183648 -392630 -24951 -166187 141409 76395 252531 -112085 -246455 -419936 119344
9678B7489R3734b3435F7205d2743j21339Q637M8944a9076m66350A08231b89647
$$ 27489 121223 -23435 67205 -42743 -164082 -155445 -106501 -19076 -485426 108231 -289647
9666c22144a11044n3343m6352A28372c34464a40048M7747M2078n3292j98146A61709
$$ -322144 -111044 -164387 -210739 128372 -334464 -140048 -92301 -50223 -103515 -301661 161709
9654F7132a62920P1149l16663A17443A7175c11988A56124a01819e90k03470A74895
$$ 67132 -162920 -91771 -408434 117443 17175 -311988 156124 -101819 -590 -204060 174895
9642B811b83523A53742a4471l27635F6370f8875j68180c8350k6480l5658n3634
$$ 2811 -283523 153742 -14471 -342106 66370 -68875 -237055 -38350 -64830 -100488 -154122
9631a54122j33654a37693B1249e9212A62141B0682i0430a0199E1031h0695k5945
$$ -154122 -287776 -137693 21249 -59212 162141 20682 -90430 -10199 51031 -80695 -106640
9620a06640j71037a19835N3282F8733b21423a1281E7240L8876a28302n430n8905
$$ -106640 -277677 -119835 -66553 68733 -221423 -11281 57240 96116 -128302 -133732 -192637
9609a92637a2662j39756f0122A04629a03955j54559O6025A51292C3377a55023
$$ -192637 -12662 -152418 -60122 104629 -103955 -258514 -192489 151292 33377 -155023
9598a1255A92644a33035k109c2151j64782k05100L5730J72676a9461j00284M8463
$$ -11255 192644 -133035 -135144 -32151 -196933 -402033 -366303 -193627 -19461 -119745 -71282
9587g1282m1735M0475A84903a67488D53878a27730A89136b36033n998I1686d00752
$$ -71282 -113017 -72542 184903 -167488 453878 -127730 189136 -236033 -242031 91686 -400752
9575E15445c45464f6065j74996f8773p7661A36655a68381j00364h8655j05244
$$ 515445 -345464 -66065 -241061 -68773 -146434 136655 -168381 -268745 -88655 -193899
9565a93899C1371d8572F9940b79761J06502A21957h0731F3609B2943J71051m9400
$$ -193899 31371 -48572 69940 -279761 -173259 121957 -80731 63609 22943 193994 144594
9554A44594b87035i1496o1802g1660j95058N1681A53625J12703c12386A78350
$$ 144594 -287035 -91496 -153298 -71660 -266718 -215037 153625 266328 -312386 178350
9543b32859g6482k124a2105I3215a21861c2258l5940G778b59902B96835f1934
$$ -232859 -76482 -78606 -12105 93215 -121861 -32258 -68198 7778 -259902 296835 -61934
9531A13706j6138a82316A40558b72962B29357a11642j54968e9236A35931a10153
$$ 113706 97568 -182316 140558 -272962 229357 -111642 -266610 -59236 135931 -110153
9520A32198n9802J10538a1719k31689n0553E9344a82689d5962m28182a48855k59106
$$ 132198 72396 182934 -11719 -243408 -293961 59344 -182689 -45962 -474144 -148855 -407961
9509d07961J64377h8839j11368A79399b85151i1643k20346I177b30070q5775d1600
$$ -407961 -243584 -88839 -200207 179399 -285151 -91643 -311989 9177 -230070 -315845 -41600
9497b53943Q5438A63868f4612j14304C1830J8353R3614J64874b9363E4508M5750
$$ -253943 -168505 163868 -64612 -178916 31830 50183 143797 308671 -29363 54508 100258
9486A00258a32416F6447B6942a42380a0725I4242A3349o058c36683R2201a07740
$$ 100258 -132416 66447 26942 -142380 -10725 94242 13349 7291 -336683 -244482 -107740
9474c69198d3025A57488g4193K7746A49647k5282f3761A27174m6654c4414k99781
$$ -369198 -43025 157488 -74193 -46447 149647 124365 -63761 127174 80520 -34414 -334195
9463c34195K9062N9298M2616A7196a54604O0432a2643k338B30748a4509j50009
$$ -334195 -305133 -245835 -203219 17196 -154604 -94172 -12643 -14981 230748 -14509 -164518
9452a64518L828A16006J38691c5366A97201b47876K2389K4103D2434a48080l03246
$$ -164518 -160690 116006 254697 -35366 197201 -247876 -225487 -201384 42434 -148080 -451326
9441d51326B8706a39879G4482e5523o4411m1035k30676F1881Q505A3355d591j53818
$$ -451326 28706 -139879 74482 -55523 -119934 -160969 -391645 61881 70386 13355 -4591 -158409
9429a58409A10623g7695j4889K6603l18556A67037K5739i5144n4349A24376n9961
$$ -158409 110623 -77695 -92584 -65981 -384537 167037 192776 -95144 -149493 124376 64415
9418F4415B1550d94877A75235i0036q3796F6065b11971e0941A46968E2001J19684
$$ 64415 21550 -494877 175235 -90036 -173832 66065 -211971 -50941 146968 52001 171685
9407A71685J46402f0702j171a2778j93114B6882L813b67569N2074a6504E7972
$$ 171685 318087 -60702 -61873 -12778 -205892 26882 30695 -267569 -215495 -16504 57972
9395a26798j72325A51340m7148c8316B3162P368d5282A13823N6828f8413j1052
$$ -126798 -299123 151340 104192 -38316 23162 30530 -45282 113823 170651 -68413 -79465
9384g9465B94230a9380n2747l26312J33865A61944k4166L2272m3319e2100D9304
$$ -79465 294230 -19380 -72127 -398439 -264574 161944 137778 170050 126731 -52100 49304
9372a46601m7851J2161m988A52877i9483K5444A63554c5459B2453J24338G2753
$$ -146601 -194452 -182291 -187279 152877 -99483 -74039 163554 -35459 22453 146791 72753
9360b11211A11984D4095b17133G0711a78741d3510D1796d27851A40133b17918
$$ -211211 111984 44095 -217133 70711 -178741 -43510 41796 -427851 140133 -217918
9349d90745K37378a08391D5457a62070a774B1208k705J25288A1144M5976J54889
$$ -490745 -253367 -108391 45457 -162070 -1774 21208 18503 143791 11144 57120 212009
9338B12009E1989d38009g776l21680J17220Q4925A18807J12744A15481a62469
$$ 212009 51989 -438009 -7776 -329456 -212236 -127311 118807 231551 115481 -162469
9327A4508d4686J9373j24990B97913p7408a41778a9137l0256B80534a99180E1535
$$ 14508 -44686 -25313 -150303 297913 220505 -141778 -19137 -49393 280534 -199180 51535
9315a64448e5634H4278k7765b94902B41205i242H7102a71797H6246i9894F0594
$$ -164448 -55634 84278 56513 -294902 241205 -9242 87102 -171797 86246 -99894 60594
9303B04718a51649b8461p6917A40522b1384l4621A38P7219a18268e576A47690
$$ 204718 -151649 -28461 -105378 140522 -21384 -56005 138 77357 -118268 -5576 147690
9291h2591A88476i660j7302l9078p7765k6032B2737a91734Q5695q6899K5764A06812
$$ -82591 188476 -9660 -26962 -66040 -143805 -169837 22737 -191734 -106039 -192938 -167174 106812
9278a52392G5848d41601A42190i758j53257H5116a17399L9915b7416A3585O4071
$$ -152392 75848 -441601 142190 -9758 -163015 85116 -117399 -77484 -27416 13585 77656
9267G7656c25377O6158I0514K7263k2656R1551A9123b0006A38241b72731C1264
$$ 77656 -325377 -259219 90514 117777 95121 186672 19123 -20006 138241 -272731 31264
9255B0279a24078f2036F5866l0375a77932M4405c6340A4212O4689f8533J0041
$$ 20279 -124078 -62036 65866 35491 -177932 -133527 -36340 14212 78901 -68533 -58492
9244e8492J0379j27193J7501A04258A2654b61682l3700O7658h7872b7762B83381
$$ -58492 -48113 -175306 -157805 104258 12654 -261682 -295382 -227724 -87872 -27762 283381
9232C7368a80884F136J23450J166j7657K39409b8202B25421F3947a32064n858
$$ 37368 -180884 6136 129586 130752 113095 352504 -28202 225421 63947 -132064 -137922
9221a37922A8478b8147j53841A13005f54q1653m2057B4197a43597A68640e2241
$$ -137922 18478 -28147 -181988 113005 -654 -82307 -124364 24197 -143597 168640 -52241
9209b04182K8306k5810A80529E717c082A30305a83015A96931a50752A63389b83461
$$ -204182 -175876 -201686 180529 5717 -3082 130305 -183015 196931 -150752 163389 -283461
9197b33845P6485m8099O6873j3151B2925b0763k45054c7195j34944B53075a40783
$$ -233845 -157360 -205459 -138586 -151737 22925 -20763 -265817 -37195 -172139 253075 -140783
9185A29671n4975f3263n0681m3423l8249d6823k3934A65023O3862G2278c16163
$$ 129671 74696 -63263 -113944 -157367 -195616 -46823 -70757 165023 228885 72278 -316163
9173f4213j25898B47697j13968a81496f406B1627J24338d1680o1674j67421g8848
$$ -64213 -190111 247697 133729 -181496 -6406 21627 145965 -41680 -103354 -270775 -78848
9161A55517f0756J3767A03507D4990i7824r566c4617l45553f2418A64324n8433
$$ 155517 -60756 -46989 103507 44990 -97824 -107390 -34617 -380170 -62418 164324 105891
9150A05891b448o6617j39258A09641f4000r1165F7909K474D071a10821c7934k40747
$$ 105891 -2448 -69065 -208323 109641 -64000 -155165 67909 70383 4071 -110821 -37934 -278681
9138b78681A52669g3362B89726b41699A98565p5361a55178j38096c3379F6989
$$ -278681 152669 -73362 289726 -241699 198565 123204 -155178 -293274 -33379 66989
9127a13280N1442b2057n9122j60361F0303b10187g4035n3613K5104j07234N6849
$$ -113280 -61838 -22057 -81179 -241540 60303 -210187 -74035 -127648 -102544 -209778 -152929
9116a52929A23845k3462K8881e132p793k62640b6016A15255e8999B33249q461
$$ -152929 123845 100383 129264 -5132 -12925 -275565 -26016 115255 -58999 233249 224788
9105B24788G6966J47560a81519G9392f8142l74280O1571n4035a69207h1506A17233
$$ 224788 76966 224526 -181519 79392 -68142 -442422 -380851 -434886 -169207 -81506 117233
9093A04544a51873K8014I6685a27201o6460C12885A19511a11303o8546j0627H0567
$$ 104544 -151873 -123859 96685 -127201 -193661 312885 119511 -111303 -179849 -190476 80567
9081g2828h062C2554m300b18749A5872a57750G8275R4346F5352J86305g4479k17078
$$ -72828 -8062 32554 28254 -218749 15872 -157750 78275 172621 65352 251657 -74479 -291557
9069b91557G9898b5585A53609p4637a89280a7309m23577b0862j82627g4106B81478
$$ -291557 79898 -25585 153609 78972 -189280 -17309 -440886 -20862 -203489 -74106 281478
9057a11320a0706A19164j4652c24712J19261l7950d8472n1595A12296J51511m7621
$$ -111320 -10706 119164 104512 -324712 -205451 -243401 -48472 -100067 112296 263807 216186
9046B16186j01474J35371a2355j03646k03727H6442O6240J10187a60304A07102
$$ 216186 114712 250083 -12355 -116001 -319728 86442 152682 262869 -160304 107102
9035A44987a30942L142b6135A64354R0887h1409A398K94110c46017a54860j60618
$$ 144987 -130942 -127800 -26135 164354 255241 -81409 1398 295508 -346017 -154860 -315478
9024c15478a46541A85688G7630a03531B22852b05562C394a84243f5485A10153
$$ -315478 -146541 185688 77630 -103531 222852 -205562 3394 -184243 -65485 110153
9013a93415e96B02449a06084c6999G495a93384b7071j06623h750C7835i5903J9853
$$ -193415 -596 202449 -106084 -36999 7495 -193384 -27071 -133694 -8750 37835 -95903 -76050
9001g6050D6839c23464Q555A20250h9462r9142G483a50954f5270k24054j40450
$$ -76050 46839 -323464 -314909 120250 -89462 -188604 7483 -150954 -65270 -289324 -429774
8990d29774J10763a22112g747o4808D3170J13817a15686j38490A06170a67593
$$ -429774 -319011 -122112 -7747 -72555 43170 156987 -115686 -254176 106170 -167593
8979A13784q922J32356C2037K72297b67138N6992B74433a15340J8153d1803n3724
$$ 113784 104862 237218 32037 304334 -267138 -210146 274433 -115340 -97187 -41803 -95527
8968i5527J1130B68120i0094A60240J33177j34557c12802A25565a26330j8678
$$ -95527 -84397 268120 -90094 160240 293417 158860 -312802 125565 -126330 -145008
8958a45008j13547L417J3769F7756a25639j19251A17228g8380n234I343a18879
$$ -145008 -258555 -255138 -241369 67756 -125639 -244890 117228 -78380 -83614 9343 -118879
8946E4381b02288r4859D5977a75931M181K2877G4390c43563d2349B50865J49300
$$ 54381 -202288 -297147 45977 -175931 -171750 -148873 74390 -343563 -42349 250865 400165
8935D00165A67532R6682N299c549B87828N80F5295b4496H4778h6292b9137q2571
$$ 400165 167532 264214 269513 -3549 287828 288408 65295 -24496 84778 -86292 -29137 -111708
8923a11708G24829J216180N336200N177872B722776H98233B70740P9407A48602
$$ -111708 724829 1941009 7277209 12455081 2722776 898233 270740 350147 148602
8913E2469J4704M0023j4782D539a64683d8360F47716A10963Q2237e2224n0712
$$ 52469 67173 107196 92414 4539 -164683 -48360 647716 110963 193200 -52224 -102936
8902a02936A28827a99467F4800O8078l9447J0752h9622B5072c376B69542a22010
$$ -102936 128827 -199467 64800 132878 93431 104183 -89622 25072 -3376 269542 -122010
8890e5214j1151L132j60397r9440D20951a41670j21747A19660D8252N3813a3923
$$ -55214 -66365 -63233 -223630 -323070 420951 -141670 -263417 119660 48252 102065 -13923
8878H002K2363D993a23745A44769a697E0094e70l00175i6998A33015e1950k10438
$$ 8002 30365 4993 -123745 144769 -1697 50094 -570 -300745 -96998 133015 -51950 -262388
8866b62388h8411H0417a15868j93354A3771J44284b30247k46441E7404a06060
$$ -262388 -88411 80417 -115868 -309222 13771 158055 -230247 -476688 57404 -106060
8855C2815R7908b24418g2477A47887a3428B18079A1016N3333E596b27322N7814
$$ 32815 130723 -224418 -72477 147887 -13428 218079 11016 64349 5596 -227322 -169508
8844a69508h0718E8475a20082m2862a3116p5664B36474H5348b26326B03886a54331
$$ -169508 -80718 58475 -120082 -162944 -13116 -88780 236474 85348 -226326 203886 -154331
8832B32663a9235j18426I2194b00704h3798k23596e306m0077j15783P1462B99648
$$ 232663 -19235 -137661 92194 -200704 -83798 -307394 -5306 -45383 -161166 -89704 299648
$$ [...]
##END NTUPLES=NMR SPECTRUM
##END=
