##TITLE=NES1070_159122.0012_001_9705698_1gwYXIC89o
##JCAMPDX= 6.0         $$ Bruker NMR JCAMP-DX V2.0
##DATA TYPE= NMR SPECTRUM
##DATA CLASS= NTUPLES
##ORIGIN= BRUKER
##OWNER= Administrator
$$ 1.72 TOPSPIN		Version 2.1
$$ 2016-05-01 14:14:43.989 -0700  Administrator@X
$$ Compression mode = diff/dup
##.OBSERVE FREQUENCY= 400.02188249412
##.OBSERVE NUCLEUS= ^1H
##.ACQUISITION MODE= SIMULTANEOUS (DQD)
##.ACQUISITION SCHEME= undefined
##.AVERAGES= 64
##.DIGITISER RES= 22
##SPECTROMETER/DATA SYSTEM= spect
##.PULSE SEQUENCE= noesygpps1d.comp
##.SOLVENT NAME= COFFEE_meoh
##.SHIFT REFERENCE= INTERNAL, COFFEE_meoh, 1, 14.96154
##AUDIT TRAIL= $$ (NUMBER, WHEN, WHO, WHERE, PROCESS, VERSION, WHAT)
$$ ##TITLE= Audit trail, TOPSPIN		Version 2.1
$$ ##JCAMPDX= 5.01
$$ ##ORIGIN= Bruker BioSpin GmbH
$$ ##OWNER= Administrator
$$ $$ E:\/data/COFFEE/nmr/NES1070_159122.0012_001_9705698_1gwYXIC89o/12/pdata/1/auditp.txt
$$ ##AUDIT TRAIL=  $$ (NUMBER, WHEN, WHO, WHERE, PROCESS, VERSION, WHAT)
(   1,<2016-05-01 14:14:38.739 -0700>,<Administrator>,<X>,<go>,<TOPSPIN 2.1>,
      <created by zg
	started at 2016-05-01 14:03:09.114 -0700,
	POWCHK enabled, PULCHK disabled,
       configuration hash MD5:
       21 0F 79 D6 B3 7B B4 F6 88 20 88 DB 03 48 BD 9F
       data hash MD5: 64K
       E3 76 1B F0 0C 7E 42 3B C0 68 F7 53 98 60 BB 9D>)
(   2,<2016-05-01 14:14:41.942 -0700>,<Administrator>,<X>,<proc1d>,<TOPSPIN 2.1>,
      <Start of raw data processing
       efp LB = 0.3 FT_mod = 6 PKNL = 1 PHC0 = 0 PHC1 = 0 SI = 128K 
       data hash MD5: 128K
       86 9B 06 C2 47 9A EC 23 28 25 39 73 FC 9F 9D E4>)
(   3,<2016-05-01 14:14:42.817 -0700>,<Administrator>,<X>,<proc1d>,<TOPSPIN 2.1>,
      <pk PHC0 = -83.19946 PHC1 = 0 
       data hash MD5: 128K
       7A 20 39 E2 15 63 72 DB 11 17 E9 F0 57 D7 79 98>)
(   4,<2016-05-01 14:14:43.208 -0700>,<Administrator>,<X>,<proc1d>,<TOPSPIN 2.1>,
      <abs ABSG = 1 
       data hash MD5: 128K
       CE BE EE 80 8E BD D5 84 39 60 5B 11 FD CA 19 8E>)
(   5,<2016-05-01 14:14:43.302 -0700>,<Administrator>,<X>,<proc1d>,<TOPSPIN 2.1>,
      <abs ABSG = 2 
       data hash MD5: 128K
       DB 57 4A 98 FC 22 3F 33 46 B8 9B FC 8F 80 46 CA>)
(   6,<2016-05-01 14:14:43.411 -0700>,<Administrator>,<X>,<proc1d>,<TOPSPIN 2.1>,
      <abs ABSG = 3 
       data hash MD5: 128K
       69 E9 FB 92 6C FF 19 59 4F B8 29 A2 06 CD 2C 6B>)
(   7,<2016-05-01 14:14:43.489 -0700>,<Administrator>,<X>,<proc1d>,<TOPSPIN 2.1>,
      <abs ABSG = 4 
       data hash MD5: 128K
       C2 AC 16 39 F1 AC 49 E9 CD FF 3C EF A4 2C 9A 27>)
(   8,<2016-05-01 14:14:43.739 -0700>,<Administrator>,<X>,<proc1d>,<TOPSPIN 2.1>,
      <abs ABSG = 5 
       data hash MD5: 128K
       87 06 2B 1F D0 68 2D E5 9B D0 C5 44 FE F8 B5 92>)
$$ ##END=
$$ 
$$ $$ hash MD5
$$ $$ 8C 66 E8 B4 0F 07 15 A7 A5 47 22 28 D0 BA F7 E0
##$RELAX= 
##$RELAX= 
##$RELAX= 
##$RELAX= 
##$RELAX= 
##$RELAX= 
##$RELAX= 
##$RELAX= 
$$ Bruker specific parameters
$$ --------------------------
##$DU= <E:\>
##$EXPNO= 12
$$ [...]
##$TP07= 0
##$TPNAME0= <>
##$TPNAME1= <>
##$TPNAME2= <>
##$TPNAME3= <>
##$TPNAME4= <>
##$TPNAME5= <>
##$TPNAME6= <>
##$TPNAME7= <>
##$TPOAL= (0..7)
0.5 0.5 0.5 0.5 0.5 0.5 0.5 0.5
##$TPOFFS= (0..7)
0 0 0 0 0 0 0 0
##$TUNHIN= 0
##$TUNHOUT= 0
##$TUNXOUT= 0
##$USERA1= <user>
##$USERA2= <user>
##$USERA3= <user>
##$USERA4= <user>
##$USERA5= <user>
##$V9= 5
##$VALIST= <valist>
##$VCLIST= <CCCCCCCCCCCCCCC>
##$VD= 0
##$VDLIST= <DDDDDDDDDDDDDDD>
##$VPLIST= <PPPPPPPPPPPPPPP>
##$VTLIST= <TTTTTTTTTTTTTTT>
##$WBST= 2048
##$WBSW= 25
##$XGAIN= (0..3)
0 0 0 0
##$XL= 0
##$YL= 0
##$YMAX_a= 4737223
##$YMIN_a= -10131103
##$ZGOPTNS= <>
##$ZL1= 120
##$ZL2= 120
##$ZL3= 120
##$ZL4= 120
##$ABSF1= 14.96154
##$ABSF2= -5.596642
##$ABSG= 5
##$ABSL= 3
##$ALPHA= 0
##$AQORDER= 0
##$ASSFAC= 0
##$ASSFACI= 0
##$ASSFACX= 0
##$ASSWID= 0
##$AUNMP= <proc_prof1d_extract.lims>
##$AXLEFT= 0
##$AXNAME= <>
##$AXNUC= <1H>
##$AXRIGHT= 0
##$AXTYPE= 0
##$AXUNIT= <>
##$AZFE= 0.1
##$AZFW= 0.1
##$BCFW= 0
##$BC_mod= 0
##$BYTORDP= 0
##$COROFFS= 0
##$CY= 15
##$DATMOD= 1
##$DC= 0
##$DFILT= <>
##$DTYPP= 0
##$F1P= 0
##$F2P= 0
##$FCOR= 0.5
##$FTSIZE= 131072
##$FT_mod= 6
##$GAMMA= 0
##$GB= 0
##$INTBC= 1
##$INTSCL= 1
##$ISEN= 128
##$LB= 0.3
##$LEV0= 0
##$LPBIN= 0
##$MAXI= 10000
##$MC2= 0
##$MEAN= 0
##$ME_mod= 0
##$MI= 0
##$NCOEF= 0
##$NC_proc= -2
##$NLEV= 6
##$NOISF1= 0
##$NOISF2= 0
##$NSP= 0
##$NTH_PI= 0
##$NZP= 0
##$OFFSET= 14.96154
##$PC= 1
##$PHC0= -83.19946
##$PHC1= 0
##$PH_mod= 1
##$PKNL= yes
##$PPARMOD= 0
##$PPDIAG= 0
##$PPIPTYP= 0
##$PPMPNUM= 2147483647
##$PPRESOL= 1
##$PSCAL= 4
##$PSIGN= 0
##$PYNMP= <proc.py>
##$REVERSE= no
##$SF= 400.020009420569
##$SI= 131072
##$SIGF1= 0
##$SIGF2= 0
##$SINO= 400
##$SIOLD= 131072
##$SPECTYP= <>
##$SREGLST= <1H.CDCl3>
##$SSB= 0
##$STSI= 131072
##$STSR= 0
##$SW_p= 8223.68421052631
##$SYMM= 0
##$S_DEV= 0
##$TDeff= 65536
##$TDoff= 0
##$TI= <>
##$TILT= no
##$TM1= 0
##$TM2= 0
##$TOPLEV= 0
##$USERP1= <user>
##$USERP2= <user>
##$USERP3= <user>
##$USERP4= <user>
##$USERP5= <user>
##$WDW= 1
##$XDIM= 131072
##$YMAX_p= 417502242
##$YMIN_p= -11772
##$CURPLOT= <Network HP LaserJet P1505>
##$CURPRIN= <$Network HP LaserJet P1505>
##$DFORMAT= <normdp>
##$LAYOUT= <+/1D_H.xwp>
##$LFORMAT= <normlp>
##$PFORMAT= <normpl>
##$SURQMSG= 1
$$ End of Bruker specific parameters
$$ ---------------------------------
##NTUPLES= NMR SPECTRUM
##VAR_NAME=  FREQUENCY,     SPECTRUM/REAL,   SPECTRUM/IMAG
##SYMBOL=    X,             R,               I
##VAR_TYPE=  INDEPENDENT,   DEPENDENT,       DEPENDENT
##VAR_FORM=  AFFN,          ASDF,            ASDF
##VAR_DIM=   131072,        131072,          131072
##UNITS=     HZ,            ARBITRARY UNITS, ARBITRARY UNITS
##FACTOR=    0.0627417313425164, 1,          1
##FIRST=     8223.62146879497, -1868,        -44027
##LAST=      0,             272,             -44564
##MIN=       0,             -11772,          0
##MAX=       8223.62146879497, 417502242,    0
$$ Real data points
##PAGE= N=1
##DATA TABLE= (X++(R..R)), XYDATA
$$ [...]
67811 66157 66176 65454 64154 62113 59302 56444 54543 53879 53969 54441 55335 56452 57096 56852 56285 56366 57328 58457
67793 58457 58969 58797 58423 58252 58405 59006 60300 62328 64655 66627 67876 68448 68578 68563 68820 69683 71041
67776 71041 72356 73155 73384 73289 73147 73176 73426 73630 73397 72675 71879 71449 71474 71766 72047 72005 71501 70851 70564 70680
67756 70680 70787 70863 71561 73200 75016 75975 76023 75886 75865 75535 74587 73259 71887 70611 69665 69369 69639 69979
67738 69979 70100 70113 70002 69467 68534 67735 67317 66749 65524 64055 63266 63515 64431 65615 66977 68402 69585
67721 69585 70313 70603 70493 69911 68838 67451 66109 65309 65461 66442 67429 67542 66709 65678 65197 65424 66117 66986
67703 66986 67651 67655 66875 65840 65299 65494 66025 66398 66441 66180 65669 65193 65396 66774 68975 70985 72199 73093
67685 73093 74525 76580 78464 79532 79985 80408 80973 81437 81678 81879 82200 82552 82800 82989 83215 83382 83256 82809
67667 82809 82409 82486 82944 83083 82350 81104 80317 80425 80791 80537 79652 78894 78704 78682 78272 77603 77258 77347 77165 76008
67647 76008 74137 72700 72656 73918 75639 77113 78212 79103 79963 81039 82631 84676 86527 87390 86996 85755
67631 85755 84381 83482 83308 83636 83996 84262 84921 86527 88968 91617 94141 96721 99358 101434 102307 102113
67615 102113 101595 101230 100851 100164 99268 98467 97739 96657 94896 92605 90186 87839 85549 83489 82103 81635
67599 81635 81776 81974 81931 81573 80795 79690 78914 79211 80369 81141 80573 79150 78202 78431 79412 80423 81221 81917
67581 81917 82589 83242 83924 84565 84828 84324 83017 81354 80003 79453 79734 80441 81062 81332 81284 81114 81148 81823 83329
67562 83329 85182 86489 86862 86887 87443 88709 90057 90770 90571 89547 87993 86416 85377 85114 85403 85803 85875
67545 85875 85245 83786 81899 80318 79430 78987 78608 78251 77942 77357 76205 74890 74277 74688 75537 76132 76429
67528 76429 76792 77290 77608 77516 77117 76686 76512 76894 78020 79736 81508 82687 82879 82209 81330 81083 81878 83318
67510 83318 84495 84671 83726 82139 80717 80237 80954 82331 83401 83601 83240 83122 83768 84992 86125 86598 86424
67493 86424 86217 86673 87895 89267 89988 89720 88685 87321 85973 84881 84189 83847 83584 83119 82435 81799 81568
67476 81568 81967 82994 84390 85712 86581 87042 87577 88585 89865 90795 91117 91333 92151 93621 95044 95720 95611
67459 95611 95271 95278 95745 96261 96321 95944 95811 96519 97708 98264 97578 96320 95703 96191 97200 97868 97705 96621 94818
67440 94818 92861 91501 91176 91711 92568 93229 93377 93026 92608 92655 93166 93519 93196 92442 91965 92187 93032 94229
67422 94229 95398 95955 95470 94283 93460 93845 95298 96941 98053 98653 99326 100483 101700 101941 100716 98887
67406 98887 97861 97978 98274 97982 97613 98031 99064 99789 99957 100250 101152 102340 103386 104324 105172 105542 105260 104930
67388 104930 105266 106127 106773 106916 106857 106696 106143 105258 104753 105158 106085 106753 106893 106691 106110 104931 103455 102565
67370 102565 102790 103693 104511 105137 106050 107424 108765 109506 109643 109629 109831 110264 110683 110818 110592 110223 110049 110201
67352 110201 110609 111344 112691 114671 116711 118100 118670 118717 118401 117646 116679 116217 116796 118129 119347 119801 119442
67335 119442 118603 117636 116794 116241 116098 116364 116760 116720 115792 114163 112658 112122 112895 114788 117285 119624 121085
67318 121085 121510 121477 121721 122491 123607 124885 126176 127130 127370 126978 126543 126607 127209 128035 128855 129739 130901 132348
67300 132348 133723 134669 135389 136579 138526 140505 141426 140967 139748 138475 137373 136435 135756 135419 135396 135716 136473
67283 136473 137580 138835 140268 142034 143835 144941 145082 144904 145157 145762 146090 145865 145283 144448 143294 142048
67267 142048 141213 140969 141021 141216 141913 143474 145645 147742 149294 150317 151008 151444 151613 151587 151566 151770 152387 153592
67249 153592 155442 157600 159338 160136 160296 160605 161298 161763 161491 160906 160825 161460 162445 163541 164618 165117 164396
67232 164396 162820 161716 161858 162595 162919 162843 163129 164058 165150 165941 166381 166553 166624 167057 168294 170030 171351
67215 171351 171793 171822 172039 172429 172754 173303 174579 176396 177852 178371 178333 178489 179100 179897 180633 181271 181748 181967
67197 181967 182131 182670 183629 184486 184884 185289 186400 188022 189135 189225 188996 189451 190716 192188 193418 194255 194444
67180 194444 193895 193311 193748 195309 196960 197944 198708 199937 201307 201979 202041 202535 204035 205952 207459 208489
67164 208489 209437 210388 211124 211599 211936 212073 211836 211356 211101 211422 212304 213607 215331 217497 219846 221783 222747
67147 222747 222714 222342 222451 223259 224334 225389 226777 228856 231102 232511 232944 233470 235046 237244 238770 239014
67131 239014 238654 238823 240099 242282 244666 246402 246982 246667 246285 246440 247054 247788 248625 249807 251388 253137
67115 253137 254859 256532 258116 259428 260296 260719 260893 261153 261878 263269 265180 267253 269231 271046 272634
67100 272634 273834 274590 275097 275660 276455 277504 278801 280334 282017 283765 285653 287894 290511 293127 295219
67085 295219 296661 297927 299619 301823 304062 305895 307434 309171 311409 313959 316361 318316 319953 321737
67071 321737 324050 326828 329618 332055 334167 336137 337961 339498 340758 341915 343066 344210 345426 346859
67057 346859 348580 350707 353589 357496 361985 365984 368767 370629 372352 374289 376303 378377 380748 383383
67043 383383 385785 387503 388627 389642 391006 393015 395792 399127 402450 405289 407773 410478 413770 417502
67029 417502 421283 424783 427729 430075 432401 435763 440623 446079 450676 453996 456994 460679 465071 469670
67015 469670 474329 479133 483881 488307 492611 497130 501641 505641 509236 513035 517116 520875 524132 527659
67001 527659 532162 537358 542542 547608 552884 558336 563593 568618 573757 579169 584693 590313 596346 603065
66987 603065 610340 617643 624344 630189 635685 641649 648171 654424 659961 665669 672727 680968 689146 696705
66973 696705 704370 712815 721632 729984 737554 744467 750894 757264 764382 772772 782140 791872 801799 812064
66959 812064 822542 832828 842645 851975 860989 870168 880208 891397 903233 914933 926179 937109
66947 937109 947972 959218 971604 985517 1000184 1014119 1026519 1037917 1049408 1061651 1074681
66936 1074681 1088251 1102074 1115946 1129881 1144035 1158447 1172988 1187642 1202651 1218284 1234534
66925 1234534 1251132 1267757 1284267 1300808 1317772 1335509 1354062 1373205 1392717 1412481 1432325
66914 1432325 1451928 1471024 1489688 1508365 1527551 1547399 1567658 1588015 1608480 1629354 1650888
66903 1650888 1673126 1695985 1719217 1742296 1764698 1786443 1808079 1829968 1851888 1873512 1894920
66892 1894920 1916315 1937584 1958543 1979426 2000661 2022301 2044085 2065949 2087968 2109802 2130767
66881 2130767 2150586 2169681 2188567 2207292 2225634 2243438 2260539 2276659 2291725 2306126 2320329
66870 2320329 2334309 2347542 2359542 2370266 2380025 2389177 2397922 2406286 2414172 2421386 2427712 2433124 2437896
66857 2437896 2442259 2445944 2448351 2449346 2449443 2448943 2447259 2443639 2438264 2431970 2425058 2417115 2408032 2398326 2388172
66842 2388172 2376957 2364314 2350926 2337580 2323887 2308752 2291892 2274126 2256198 2238054 2219413
66831 2219413 2200369 2181111 2161550 2141605 2121491 2101373 2081011 2060163 2039174 2018626 1998397
66820 1998397 1977522 1955248 1931948 1908669 1885907 1863192 1839872 1815926 1791834 1767948 1744408
66809 1744408 1721507 1699597 1678439 1657043 1634557 1611258 1588325 1566595 1545719 1524629 1502683
66798 1502683 1480248 1458282 1437496 1417937 1399211 1380886 1362630 1344147 1325238 1305979 1286725
66787 1286725 1267848 1249547 1231943 1215200 1199362 1184106 1168817 1153067 1136973 1121009 1105462
66776 1105462 1090122 1074586 1058756 1042974 1027719 1013267 999554 986129 972309 957731 942898
66765 942898 928861 916171 904369 892750 881295 870475 860348 850387 840157 829688 819098 808341
66753 808341 797512 787018 777169 767784 758396 748661 738483 727980 717489 707346 697518 687635 677573
66740 677573 667811 658995 651279 644234 637281 630078 622646 615281 608255 601509 594767 587978 581385 575087
66726 575087 568830 562450 556200 550350 544696 538849 532853 527142 521878 516687 511161 505360 499645 494136
66712 494136 488533 482505 476194 470193 464972 460433 456131 451762 447186 442176 436607 430885 425679 421080
66698 421080 416525 411786 407463 404108 401290 398114 394311 390245 386072 381594 376892 372473 368671 365360
66684 365360 362359 359676 357256 354891 352512 350173 347618 344283 339974 335226 330752 326768 323040 319314
66670 319314 315484 311563 307767 304510 302038 300117 298240 296081 293661 291163 288764 286576 284620 282836
66656 282836 281117 279318 277285 275017 272774 270826 269082 267168 264933 262634 260518 258434 256019 253211
66642 253211 250432 248294 247119 246584 245884 244419 242399 240569 239292 238143 236474 234116 231408 228857 226911
66627 226911 225729 224831 223256 220497 217132 214178 211979 210172 208597 207648 207571 207945 208105 207717 206729 205147
66611 205147 203255 201717 201004 200811 200403 199418 197992 196257 194207 192081 190351 189195 188353 187662 187281 187150
66595 187150 186707 185610 184397 183860 183877 183453 181969 179872 177969 176491 175159 173812 172552 171444 170415
66580 170415 169481 168767 168240 167623 166711 165701 165029 164822 164611 163779 162266 160643 159339 158051 156156 153569
66564 153569 150874 148662 147091 146115 145747 145885 146159 146210 146030 145886 145954 146119 146096 145725 145178 144715 144161 142916
66546 142916 140835 138864 138232 138973 139814 139661 138725 137998 138161 139240 140811 142080 142208 140998 139098 137247
66530 137247 135644 134285 133412 133093 132796 131980 130871 130059 129567 128879 127781 126598 125643 125006 124810 125193 125901
66513 125901 126317 125929 124559 122369 120003 118450 118188 118582 118647 118245 117909 117726 117199 116193 115108 113974 112207
66496 112207 109672 107266 106000 105959 106500 106977 106959 106225 105029 104079 103908 104471 105447 106525 107251 107212 106684 106539
66478 106539 107091 107514 106897 105360 103615 101906 100077 98370 97340 97036 96942 96830 97093 98067 99413 100375 100434
66461 100434 99666 98678 98215 98611 99525 100312 100607 100421 99815 98758 97300 95679 94229 93217 92704 92504 92367
66444 92367 92267 92316 92397 92177 91616 91137 91034 91026 90695 90103 89592 89189 88625 87862 87175 86700 86248 85659 85061 84736
66424 84736 84904 85725 87278 89404 91632 93355 94248 94578 95037 96009 97053 97386 96908 96355 96277 96320 95787 94531
66406 94531 92914 91205 89550 88283 87721 87672 87664 87638 87952 88567 88753 87895 86325 84969 84251 83639 82391 80572
66388 80572 79086 78671 79087 79494 79434 79120 78900 78857 78907 78849 78266 76935 75442 74828 75377 76298 76889 77324 77858
66369 77858 77979 77104 75675 74726 74658 75160 76023 77117 77766 77205 75835 75131 75958 77642 78969 79451 79242 78451
66351 78451 77113 75567 74375 73900 74087 74508 74587 74067 73338 73020 73203 73369 73094 72472 71872 71642 72072 73119
66333 73119 74084 74117 73246 72458 72482 72968 73181 73040 73031 73384 73794 73871 73534 72993 72536 72328 72362 72608 73085 73617 73739
66312 73739 73248 72684 72736 73226 73342 72926 72735 73150 73471 73014 72235 72024 72342 72393 71897 71375 71203 71114 70780 70319
66292 70319 70011 69890 69838 69830 69887 69956 69928 69735 69399 69073 68917 68866 68631 68068 67360 66716 66125 65642 65694 66734 68595
66271 68595 70420 71230 70565 68778 66907 65922 65845 65814 65263 64674 64773 65308 65315 64474 63541 63353 63985 65064 66370
66252 66370 67738 68798 69260 69320 69408 69595 69509 68884 68006 67518 67766 68373 68519 67712 66187 64511 62975 61604
66234 61604 60568 60162 60382 60892 61481 62227 63054 63517 63286 62648 62208 62214 62381 62281 61696 60677 59525 58666 58355
66215 58355 58474 58730 58983 59248 59508 59746 60081 60591 60993 60856 60269 59964 60532 61685 62583 62769 62451 61968 61385
66196 61385 60726 60272 60378 61128 62314 63622 64727 65401 65712 65949 66178 66073 65368 64299 63365 62836 62780 63313
66178 63313 64323 65145 65113 64505 64296 64810 65218 64720 63628 62752 62172 61299 59945 58631 57800 57367 57227 57672
66160 57672 58977 60858 62679 64028 64849 65183 65075 64744 64572 64766 65096 65122 64664 63967 63342 62831 62350 61980
66142 61980 61868 61853 61600 61169 61110 61741 62639 63149 63164 63104 63282 63731 64527 65786 67216 68101 67919 66794 65214
66123 65214 63606 62286 61544 61460 61753 62068 62366 62799 63238 63189 62370 61260 60811 61523 62900 63976 64304 64204
66105 64204 64097 63930 63444 62719 62075 61589 61045 60416 60022 60150 60699 61339 61863 62276 62649 62972 63099 62842 62195
66086 62195 61396 60652 59899 59054 58447 58648 59764 61183 62191 62616 62709 62640 62457 62431 63069 64596 66525 67886
66068 67886 67996 67045 65947 65564 65994 66593 66637 65880 64552 63035 61667 60747 60508 60966 61769 62288 62033 61117
66050 61117 60223 59958 60264 60631 60821 61090 61703 62568 63466 64346 65132 65499 65173 64387 63739 63618 63964 64480 64803
66031 64803 64547 63572 62345 61688 61970 62736 63355 63807 64530 65610 66530 66791 66508 66173 65999 65739 65162 64528
66013 64528 64473 65446 67309 69463 71335 72711 73635 74125 74113 73621 72851 72034 71236 70406 69601 69116 69328 70406
65995 70406 72082 73747 74892 75497 75952 76610 77588 78997 81071 83859 87016 90189 93441 96902 100097
65980 100097 102193 103050 103524 104424 105520 105985 105522 104554 103470 102255 100912 99725 98920 98417 98171 98452 99525
65963 99525 101281 103365 105423 106910 106934 104805 100823 96177 91942 88455 85651 83564 82171 81096 79931
65948 79931 78790 78138 78053 78070 77818 77477 77362 77424 77490 77732 78456 79495 80275 80509 80426 80187 79504 78143 76527
65929 76527 75396 74969 74766 74321 73728 73345 73143 72629 71419 69754 68333 67702 67889 68612 69608 70639 71395
65912 71395 71685 71690 71735 71757 71291 70124 68739 67933 68097 68980 69983 70556 70487 69985 69416 68897 68305 67712 67439 67447
65892 67447 67030 65531 63184 60898 59360 58777 59276 60854 62823 63976 63699 62619 61815 61681 61835 61829 61514
65875 61514 60873 59975 59109 58562 58215 57688 56967 56519 56576 56675 56286 55698 55820 57076 58935 60657 62045 63144
65857 63144 63618 63058 61868 61187 61668 62739 63385 63357 63188 63251 63315 63090 62802 62928 63556 64198 64311 63922 63718
65838 63718 64381 65827 67171 67562 66932 65845 64816 64047 63696 63991 64925 66115 67102 67666 67778 67431 66705
65821 66705 65870 65233 64914 64874 65128 65773 66787 67916 68807 69171 68821 67714 66202 65107 65185 66331 67593
65804 67593 68229 68524 69146 69923 69895 68662 67105 66399 66759 67581 68428 69339 70357 71344 72266 73227 74153 74815
65786 74815 75162 75291 75061 74096 72323 70182 68247 66854 66154 66149 66527 66749 66513 65972 65380 64742 63992 63330
65768 63330 63161 63732 64925 66347 67624 68685 69685 70611 71104 70970 70762 71396 73113 75164 76637 77229
65752 77229 77049 76099 74413 72465 70899 69781 68456 66301 63422 60539 58324 57022 56591 56885 57576 58078
65736 58078 57894 57095 56224 55669 55340 55098 55128 55597 56227 56619 56845 57303 58013 58505 58473 58187 58222 58990 60478 62130
65716 62130 63098 63056 62700 63022 64138 65338 66178 66812 67238 67058 66342 65881 66065 66164 65379 64086 63288 63196 63159
65697 63159 62826 62591 62857 63495 64168 64751 65313 66018 67114 68723 70593 72315 73717 74815 75553 75970 76473
65680 76473 77416 78452 78813 78371 77898 78105 78795 79297 79415 79651 80589 82294 84237 85741 86559 87069 87803 88825
65662 88825 89729 90248 90545 90780 90683 89818 88231 86531 85249 84218 82805 80814 78923 77964 77830 77497 76270
65645 76270 74602 73363 72646 71834 70639 69460 68598 67684 66205 64244 62401 61151 60575 60548 60850 61133 61039
65628 61039 60548 60094 60185 60842 61519 61675 61412 61385 62020 63037 63827 64096 63927 63403 62521 61465 60688 60645 61534
65609 61534 63154 64853 65778 65551 64682 64018 63809 63676 63475 63678 64678 66092 67149 67615 67981 68822 70188
65592 70188 71642 72719 73366 74013 75230 77180 79442 81365 82506 82714 81986 80515 78811 77505 76863 76545
65576 76545 75971 74900 73602 72453 71485 70466 69367 68554 68369 68647 68888 68896 69041 69760 70938 71942 72314
65559 72314 72257 72315 72651 72876 72668 72316 72390 73016 73821 74628 75697 77098 78184 78173 77092 75749 74788 74185 73732
65540 73732 73597 74089 75024 75706 75628 75013 74477 74219 73745 72494 70581 68747 67708 67737 68680 70014 70903 70671
65522 70671 69386 67688 66015 64385 63036 62650 63508 64889 65813 66046 65911 65537 64972 64802 65748 67580 69180
65505 69180 69919 70402 71556 73459 75441 76974 78049 78820 79204 78934 77955 76820 76442 77185 78288 78627 78056
65488 78056 77467 77452 77469 76686 75213 73962 73448 73217 72477 71007 69321 68069 67372 66741 65647 64114 62684
65471 62684 61884 61857 62413 63215 63911 64264 64233 63898 63395 63044 63278 64124 64892 64808 63953 63202 63245 63968 64795 65272
65451 65272 65321 65237 65547 66613 68339 70441 72742 74935 76388 76855 77087 77918 78880 78680 77145 75624 75156
65434 75156 75260 75090 74737 74608 74359 73548 72814 73289 74995 76768 77711 77944 77964 78017 78223 78668 79185 79458 79441
65415 79441 79296 78992 78375 77644 77337 77860 79266 81302 83321 84473 84488 84093 84055 84127 83613 82748 82542 83213 83757
65396 83757 83371 82479 81908 81755 81617 81394 81236 81061 80692 80269 80043 79946 79791 79792 80417 81730 83265 84664 86178
65377 86178 88373 91394 94678 97457 99517 101337 103421 105797 108386 111547 115784 120967 126406 131778
65363 131778 137465 143797 150398 156565 161907 166291 169435 170945 170643 168643 165239 160830 155747 150051
65349 150051 143750 137320 131588 126857 122557 118109 113827 110501 108312 106643 104834 102706 100414 98198
65335 98198 96331 94921 93715 92367 90934 89772 88996 88365 87800 87665 88260 89241 89760 89180 87620 85806
65319 85806 84410 83490 82626 81625 80896 80944 81703 82661 83591 84711 86114 87485 88609 89805 91528 93681
65303 93681 95595 96614 96519 95534 94152 92877 91873 90909 89825 88941 88710 89009 89217 89016 88753 88794 88908 88666
65285 88666 88139 87776 87670 87399 86634 85548 84548 83893 83645 83654 83515 82939 82336 82557 83795 85141 85623 85313
65267 85313 84869 84358 83358 82100 81574 82164 82913 82703 81677 80881 80814 80998 80930 80760 80800 80865 80500 79729 79153
65248 79153 79244 79771 80102 80002 79833 79915 80042 79911 79809 80352 81491 82362 82336 81790 81440 81329 80967 80293 79827 79917
65228 79917 80328 80740 81154 81585 81733 81262 80240 79026 77887 76963 76472 76657 77463 78437 78981 78765 78013 77434
65210 77434 77701 78866 80414 81931 83496 85235 86798 87633 87676 87357 86940 86270 85271 84292 83686 83366 83071
65193 83071 82852 82919 83141 83085 82606 82071 81944 82345 83064 83747 83992 83595 82920 82842 84012 86230 88624 90404 91375
65174 91375 91888 92496 93523 94790 95800 96374 96979 98232 100205 102437 104562 106641 108893 111422 114284
65159 114284 117582 121358 125597 130348 135720 141796 148832 157503 168507 181711 195996 210154 223595
65146 223595 235998 246785 255599 263117 270731 279265 288361 297127 304885 311135 315244 316618 315070 310852
65132 310852 304527 296960 289121 281505 273720 264834 254178 241833 228593 215564 203505 192289 181180
65119 181180 169924 159312 150279 142702 135659 128820 122890 118508 115377 112807 110552 108598 106577 104117
65105 104117 101546 99651 98734 98449 98443 98589 98608 98157 97483 97361 98125 99306 100456 101729 103243 104548 105350
65088 105350 106317 108303 111030 113298 114478 115045 115552 115858 115657 115183 114909 114871 114734 114331 113829 113404 112977 112303
65070 112303 111246 109997 108897 107996 106978 105752 104868 104924 105768 106827 108071 109867 111855 112895 112570 111946
65054 111946 112159 112862 112854 111780 110340 108995 107423 105393 103401 102085 101455 100948 99961 98194 95821 93428
65038 93428 91553 90178 88941 87795 87115 87085 87423 87828 88303 88852 89195 89103 88809 88887 89844 91865 94726 97759
65020 97759 100154 101481 101880 101762 101483 101305 101346 101493 101670 102205 103581 105786 108338 111103 114558 118968 123830
65003 123830 128544 133249 138465 144209 149991 155510 160809 165870 170505 174616 178172 181060 183314 185290
64989 185290 187104 188115 187603 185837 183759 181619 178750 174858 170622 166586 162259 157015 151328 146294
64975 146294 142183 138186 133498 128099 122545 117553 113683 110879 108315 105234 101946 99433 97967 96791
64961 96791 95375 94288 94366 95500 96806 97635 97884 97565 96760 95923 95578 95590 95294 94548 94150 94836 96268 97440
64943 97440 97820 97622 97124 96383 95628 95349 95623 95767 95037 93489 91829 90613 89945 89822 90274 91108 91840 92107
64925 92107 92014 92009 92532 93702 95167 96344 97071 97917 99498 101616 103540 105069 106671 108476 109877 110534 111071
64908 111071 112137 113330 113766 113415 113028 112904 112598 111857 111042 110410 109689 108704 107838 107497 107549 107646 107734 107958 108401
64889 108401 109219 110664 112649 114605 116140 117521 119126 120686 121544 121462 120767 119807 118703 117556 116493 115486
64873 115486 114472 113626 113153 112735 111581 109206 106007 102922 100653 99313 98703 98692 99244 100132 100864 101083 100946
64856 100946 100825 100651 99911 98424 96736 95554 95049 94969 95120 95384 95562 95576 95647 95893 95923 95261 94104 93235 93207
64837 93207 93968 95233 96815 98602 100589 102979 105960 109342 112692 115781 118610 121103 123187 125147 127341
64822 127341 129459 130534 129921 127956 125473 123034 120809 118857 117161 115564 113945 112341 110758 108988
64808 108988 106804 104247 101661 99498 98093 97399 96911 96039 94674 93275 92389 92264 92861 93993 95369 96695
64792 96695 97819 98658 99076 99049 98831 98673 98470 98054 97762 98212 99523 101201 102886 104733 106925 109273 111514
64775 111514 113597 115492 117113 118606 120323 122286 124067 125340 126158 126515 126168 125133 123866 122625 121129
64760 121129 119168 117049 115085 113196 111404 110123 109397 108471 106829 105168 104476 104534 104246 103226 102130 101440
64744 101440 100888 100263 99914 100071 100292 99978 99095 98099 97435 97251 97335 97291 97047 97143 98131 99757 101166 101893 102148
64725 102148 102171 101901 101368 100781 100038 98719 96827 95067 94054 93674 93493 93405 93562 93991 94598 95307 95983 96478
64707 96478 96905 97610 98677 99837 100963 102297 103958 105616 106954 108097 109330 110737 112393 114614 117682
64692 117682 121546 125978 130640 134861 137850 139515 140587 141481 141524 139864 136746 133215 129888 126737 123858
64677 123858 121530 119515 117141 114365 112056 110954 110890 111344 112148 113173 113847 113674 113020 112809 113461 114587
64661 114587 115764 117108 118919 121148 123554 126203 129507 133752 138803 144245 149571 154133 157224 158526
64647 158526 158458 157839 157222 156712 156392 156572 157470 158906 160568 162433 164729 167539 170666 173862 177094 180579
64631 180579 184593 189126 193684 197552 200355 202197 203243 203400 202577 200948 198778 196236 193603 191322 189434
64616 189434 187213 183907 179806 176075 173489 171713 169871 167377 164140 160408 156638 153184 149970 146761
64602 146761 143813 141756 140671 139829 138679 137556 136928 136464 135585 134566 134131 133973 132739 129845 126550 124577
64586 124577 124188 124277 124007 123604 123656 124381 125742 127602 129431 130377 130122 129381 129142 129517 129807 129564 129123 128968
64568 128968 129036 128929 128565 128283 128381 128812 129290 129535 129414 129043 128776 128897 129233 129242 128599 127629 126999 127030 127430 127671
64548 127671 127462 126822 125860 124702 123547 122617 121988 121559 121209 120919 120718 120626 120642 120712 120723 120670 120779 121263 121924 122337
64528 122337 122490 122928 123999 125356 126533 127716 129415 131571 133658 135658 138291 141984 146136 149720 152227
64513 152227 153695 154233 153916 152870 151022 148000 143697 138774 134213 130489 127526 125239 123611 122368 121111
64498 121111 119825 118778 117955 117043 116028 115195 114436 113190 111373 109755 108959 108549 107663 106234 104966 104324
64482 104324 104146 104257 104846 106099 107796 109430 110445 110411 109430 108450 108650 110238 112147 113250 113570 114041 115294
64465 115294 117078 118676 119512 119523 119311 119905 121891 124722 127251 129007 130533 132397 134395 136060 137448
64450 137448 138857 140077 140559 140337 140149 140500 141083 141391 141478 141782 142504 143555 144955 146863 149255 151899 154666
64433 154666 157594 160695 163966 167625 172020 177189 182754 188428 194512 201731 210717 221674 234440 248713
64419 248713 264233 280694 297426 313287 327269 339334 350353 361007 370940 379151 384862 387685
64407 387685 387289 383558 377114 369123 360346 350592 339219 325866 310667 294163 277259 260920 245576
64394 245576 231105 217610 205848 196396 188663 181372 174014 167277 161994 158172 155259 152833 150693
64381 150693 148660 146787 145599 145656 146824 148209 148886 148618 147948 147685 148216 149229 150159 150908 151931 153591
64365 153591 155713 157949 160290 162990 166249 170203 174940 180067 184463 186941 187262 186264 185138 184826 185779
64350 185779 187725 189727 191057 192111 194006 197265 201436 206028 211146 217008 223507 230674 238948 248449
64336 248449 258521 268606 279212 291306 304996 319495 334227 349139 363801 376989 387510
64325 387510 394918 399050 399366 395434 388002 379105 370881 364392 359581 356147 354237 354334 356741 361502 368852
64310 368852 379499 394237 413389 436858 464694 497429 535848 580538 631657 689036 752500
64299 752500 821964 896868 975153 1052752 1124155 1183500 1225392 1245605 1242117 1215903 1170636 1111436
64287 1111436 1043641 972068 900498 831489 766746 707546 654465 606898 563540 523611 487310
64276 487310 455037 426722 402161 381414 364336 349992 337082 324948 313849 304238 296058 288758
64264 288758 281812 275118 268908 263224 257586 251409 244726 238125 231874 225565 218945 212607 207328 203018
64250 203018 198959 194999 191797 189773 188428 187017 185436 184108 183301 182919 182814 182905 183084 183258 183450 183657
64234 183657 183719 183517 183190 182944 182818 182882 183468 184755 186179 186840 186671 186650 187484 188564 188794 188187 187879 188611 189895
64215 189895 190926 191653 192524 193683 194958 196361 197982 199579 200894 202390 205134 209767 216009 223350 231797
64200 231797 241683 252997 265150 277253 288488 298441 307293 315554 323569 331485 339707 348981 359810
64187 359810 372151 386036 402168 421588 444996 472819 505751 544708 590261 642596 701984
64176 701984 768723 842268 920547 1000207 1077192 1146892 1204023 1243003 1259151 1250241 1217484 1165111
64164 1165111 1098727 1023750 944942 866610 792337 724260 662955 608232 559843 517457 480407
64153 480407 447806 418857 392960 369740 349077 330935 314997 300730 287900 276741 267422 259569
64141 259569 252606 246323 240859 236240 232240 228590 225128 221890 219240 217718 217373 217405 216850 215552 214096
64126 214096 212934 212067 211592 211906 213076 214464 215358 215712 215909 216071 215992 215625 215188 214800 214398 214078 214226 215161
64108 215161 216786 218666 220276 221209 221341 220953 220545 220430 220544 220695 220902 221420 222485 224044 225672 226836
64092 226836 227408 227907 228967 230514 231700 231817 231019 229913 228675 226981 224748 222429 220371 218239 215471
64077 215471 212194 209363 207945 208163 209572 211615 213960 216434 218924 221401 223934 226560 229239 231969
64063 231969 234930 238397 242525 247311 252709 258650 264953 271444 278297 285996 294683 303717 312250 320251
64049 320251 328498 337477 346682 355290 363070 370202 376449 381132 383856 384710 383729 380757 376096 370774 365796
64034 365796 361382 357176 352802 347902 342124 335609 329192 323519 318167 312305 306064 300482 296095 292453
64020 292453 289296 287272 286915 287591 288245 288749 289748 291403 293144 294654 296269 298217 300097 301425 302305 303271
64004 303271 304820 307213 310366 313749 316817 319781 323573 328763 334895 341231 347764 354987 362976 371360
63990 371360 380143 389908 401068 413328 426175 439582 453981 469773 487082 505844 525853 546812
63978 546812 568507 591012 614613 639522 665680 692878 721137 751086 784032 821611 865261
63967 865261 915938 974294 1041077 1117483 1205312 1306868 1424659 1561049 1718087 1897547
63957 1897547 2100998 2329633 2583777 2862341 3162743 3481619 3815754 4162221 4517442
63948 4517442 4876058 5230594 5571960 5890295 6175972 6420816 6618928 6766567 6861385 6901930
63938 6901930 6887590 6818445 6695053 6518961 6293951 6026703 5725939 5400788 5059798 4710859
63928 4710859 4361227 4017210 3683881 3365183 3064199 2783383 2524728 2289800 2079453
63919 2079453 1893360 1729872 1586461 1460393 1349125 1250402 1162340 1083598 1013374 951080
63909 951080 895924 846848 802873 763387 727903 695605 665364 636313 608186 581018 554796
63898 554796 529674 506219 484891 465246 446174 427128 408714 391812 376543 362511 349642
63887 349642 338185 328016 318662 310085 302786 296856 291453 285582 279075 272481 266403 261364 257895 256067
63873 256067 255053 253763 251928 250085 248551 247009 245165 243201 241327 239423 237411 235550 234007 232524
63859 232524 230871 229304 228179 227382 226580 225817 225436 225574 226065 226707 227177 226903 225474 223103 220275 217071
63843 217071 213307 209247 205579 202617 200060 197621 195366 193286 191069 188590 186210 184317 182869 181659
63829 181659 180628 179716 178835 178307 178854 180639 182672 183766 183863 183855 184240 184618 184598 184552 185146 186540 188342 190111
63811 190111 191603 192740 193704 195077 197640 201856 207472 213585 219187 223794 227589 230943 233911 236306
63797 236306 238096 239418 240187 239972 238415 235650 232266 229023 226567 225117 224293 223474 222506 221821 221735 221848
63781 221848 221409 220046 217829 214843 211148 207122 203359 200090 196986 193669 190116 186468 182771 179126
63767 179126 175757 172674 169533 166163 163023 160813 159692 159219 158925 158613 158257 158003 158215 159113 160401 161649
63751 161649 162941 164538 165927 166008 164587 162963 162442 162781 162744 161796 160465 159278 158296 157803 158578 161048 164630
63734 164630 168344 171783 175223 179034 183332 188046 193015 198001 202740 206979 210537 213452 216032 218565
63720 218565 220944 222809 224042 224889 225640 226478 227631 229292 231348 233529 235908 238807 242115 245246 248037
63705 248037 251151 255141 259550 263527 267000 270545 274286 277615 280123 282152 284193 286283 288320 290521
63691 290521 292992 295047 295536 294057 291522 289213 287368 284943 280847 275158 268982 263303 258368 254102
63677 254102 250592 247813 245251 242290 238917 235671 232884 230339 227725 225087 222643 220389 218085 215479
63663 215479 212436 208943 205171 201433 197948 194699 191599 188709 186152 183941 182120 181025 181108 182374 184156
63648 184156 185610 186326 186408 186259 186570 188258 191850 196761 201627 205599 209062 212910 217510 222727 228592
63633 228592 235360 243031 251428 260751 271437 283365 295725 308049 320891 335138 350981 367941
63621 367941 385648 404025 422766 441026 457747 472006 482972 489818 492025 489925 484894 478798
63609 478798 473022 467965 463459 459491 456247 453572 450799 447185 442176 435250 426021 414734 402312 389605
63595 389605 376837 364016 351519 339883 329265 319467 310417 302344 295573 290349 286634 283972 281868
63582 281868 280513 280717 282739 285663 288497 291536 295897 301844 308402 314726 321121 328357 336566 345262
63568 345262 354170 363611 374118 385926 398824 412401 426470 441243 457031 473781 490921 507440
63556 507440 521963 533021 539714 542140 540972 536711 529718 520863 511644 503469 497072 492620 490017 488896
63542 488896 488613 488482 487947 486474 483497 478649 472004 464034 455278 445955 435819 424529 412265 399746
63528 399746 387477 375267 362768 350208 338179 326929 316290 306151 296478 287018 277592 268714
63516 268714 261338 255874 251923 248959 246748 244977 243109 240865 238400 235861 233223 230728 228913 227864
63502 227864 226878 225205 222779 220007 217285 214992 213522 212961 213077 213901 215834 218815 221861 223993 225328
63487 225328 226782 228955 231801 235114 238732 242289 245317 247665 249573 251322 252984 254365 254928 253998 251382
63472 251382 247646 243531 239395 235537 232675 231386 231185 230866 229908 229026 229165 230488 232603 235298 238572
63457 238572 242168 245620 248841 252330 256600 261571 266715 271787 277213 283698 291636 300975 311437 322535
63443 322535 333573 344060 354255 364923 376491 388777 401635 415447 430776 447888 466909
63432 466909 488030 511249 536140 562137 588690 614774 638634 658560 673769 684185 689704 690285
63420 690285 686650 680177 672006 662705 652927 643818 636369 630571 625383 619428 611599 601227 587944 571662
63406 571662 552794 532411 511785 491676 472253 453801 437000 422229 409025 396783 385683
63395 385683 376389 369060 363314 359066 356712 356453 358091 361604 367329 375344 385226 396722 410221 426171
63381 426171 444343 463888 483786 502913 520061 534377 545752 554589 561373 566782 571972 578289
63369 578289 586482 596333 607084 618086 628897 638789 646405 650206 649435 644570 636777 627171 616776
63356 616776 606813 598474 592298 587973 584667 581228 576338 569069 559397 547693 533707 516704 496860
63343 496860 475860 455571 436525 418228 400595 384398 370365 358505 348480 340199 333710 328698
63331 328698 324364 319818 314585 308814 303059 297890 293620 290308 287871 286144 284927 284104 283739 284063 285354
63316 285354 287732 291029 294950 299486 305100 312379 321640 332951 346160 360432 373935 384630 391549
63303 391549 394838 394493 389773 380259 367032 352125 337079 322491 308781 296592 286209 277124 268594
63290 268594 260537 253604 248360 244568 241396 238294 235525 233660 232687 231886 230694 229355 228528 228456 228803 229176
63274 229176 229498 229888 230427 231092 231793 232495 233408 234935 237240 239957 242584 245062 247729 250732 253837 256838
63258 256838 259814 262842 265765 268526 271459 274929 278803 282699 286752 291704 298048 305352 312781 320064
63244 320064 327615 335843 344820 354679 365813 378355 391804 405502 419277 433306 447620 462192
63232 462192 477324 493353 509987 526444 542392 558306 574746 591764 609178 626978 645153
63221 645153 663599 682616 703173 726140 751299 777410 803041 827016 848246 865723 878806
63210 878806 887270 891063 890287 885466 877591 867804 857011 845562 833015 818344 800788 780624 758964
63197 758964 736786 714406 691886 669691 648830 630514 615840 605714 600836 601407 606644 614853
63185 614853 624421 634929 646953 660737 675549 690572 705816 721637 737792 753686 769263 784918
63173 784918 800606 815839 830552 845146 859400 871998 881521 887402 889667 888261 883014 873848 860669
63160 860669 843451 822728 799619 775046 749331 722937 697051 672878 650737 630389 611964
63149 611964 595865 582019 569872 559103 549780 541956 535710 531512 529865 530552 532860 536622 542420
63136 542420 550705 561394 574515 590437 608929 628453 646800 662064 672762 677652 676199 669078
63124 669078 657734 643515 627387 610084 592127 574022 556864 542340 531493 523694 517441 512033
63112 512033 507791 504844 502559 500365 498409 497010 495965 494776 493201 491315 489314 487515 486226 485348
63098 485348 484374 483008 481506 480220 479185 478437 478334 479099 480317 481360 482190 483314 485011 486987 488751
63083 488751 489947 490383 490175 489944 490529 492304 494981 498092 501467 505210 509446 514194 519311 524536 529811
63068 529811 535576 542514 550942 560667 571539 583861 598097 614339 632228 651222 670833 690837
63056 690837 711559 733898 758751 786256 815635 845804 876133 906626 937423 968213 998235
63045 998235 1026928 1054525 1081829 1109444 1137368 1165337 1193304 1221447 1249927 1278830 1308107
63034 1308107 1337255 1365044 1389869 1410382 1425613 1434492 1435690 1428246 1412234 1388564 1358251 1322153
63022 1322153 1281354 1237402 1192020 1146741 1102889 1061614 1023681 989459 959357 934105 914286
63011 914286 899729 889779 884135 882947 886044 892599 901956 914463 931045 951951 976227 1002355 1029205
62998 1029205 1056419 1084161 1112633 1141780 1171394 1201371 1231627 1261712 1290738 1317888 1342826
62987 1342826 1365445 1385406 1402060 1414513 1421532 1421624 1413694 1397577 1373686 1342322 1303765 1258926
62975 1258926 1209414 1156868 1102585 1047784 993699 941205 890687 842534 797444 756024 718339
62964 718339 684108 653083 624960 599123 574870 551909 530442 510742 492790 476316 461043
62953 461043 446863 433805 421790 410483 399518 388983 379500 371623 365185 359361 353394 347161 341105
62940 341105 335713 331142 327267 323939 321094 318677 316608 314901 313651 312805 312063 311126 309951 308707 307624
62925 307624 306934 306710 306572 305861 304357 302549 300841 298845 296046 292949 290786 290002 289762 289144 288153 287159
62909 287159 286038 284530 283024 282200 281994 281554 280347 278829 277862 277763 278140 278476 278712 279268 280543 282365 283958
62892 283958 284569 284178 283567 283679 284807 286325 287242 287148 286589 286394 286677 286731 285837 283943 281536 279178 277291
62875 277291 276085 275471 275133 274758 274103 272922 271194 269470 268587 268837 269660 270326 270631 270782 270933 271126 271444
62858 271444 271976 272795 274093 276020 278190 279768 280336 280379 280567 280930 281100 280981 280662 279961 278733 277518 277182
62841 277182 277797 278403 278071 276863 275560 274763 274454 274239 273850 273443 273413 273875 274450 274729 274799 275120 276051 277784
62823 277784 280547 284426 289038 293723 298123 302310 306403 310395 314309 318190 321909 325359 328824 332715
62809 332715 336897 340735 343989 347270 351342 356350 362052 368465 375879 384339 393618 403722 415127 428316
62795 428316 443279 459684 477415 496759 518002 541153 566279 594016 625348 660810 700204
62784 700204 743210 789963 840644 894770 951278 1009237 1068050 1126926 1184460 1238825 1288076
62773 1288076 1330202 1363254 1385740 1396955 1396942 1386254 1365748 1336431 1299392 1255873 1207302 1155127
62761 1155127 1100610 1044918 989274 934825 882372 832345 784956 740237 698060 658406 621587
62750 621587 588017 557756 530474 505879 484013 465114 449232 435885 424056 412818 402126
62739 402126 392741 385117 378690 372616 366916 362351 359338 357594 356747 356732 357528 359065 361506 365067 369458
62724 369458 374044 378745 384254 391091 398965 407377 416345 426147 436804 448300 461006 475411 491647
62711 491647 509730 530058 553206 579357 608427 640693 676788 717008 760960 808088 858286
62700 858286 911853 968966 1029201 1091350 1153586 1213855 1270167 1320589 1363219 1396448 1419216
62689 1419216 1430867 1430848 1418888 1395520 1362199 1320748 1272745 1219485 1162277 1102543 1041677 980995
62677 980995 921832 865496 812908 764322 719545 678480 641379 608513 579716 554350 531694
62666 531694 511277 492867 476229 460888 446235 431936 418267 405821 394796 384785 375383 366740
62654 366740 359250 352896 347245 341936 336805 331585 325959 320070 314641 310326 307042 304100 300949 297761
62640 297761 295322 294250 294247 294220 293348 291875 290613 289835 289001 287573 285763 284414 284307 285476 286960 287428 286425
62623 286425 284911 284204 284584 285435 286544 288442 291418 295053 299029 303650 309099 314894 320665 326926 334384
62608 334384 342897 351847 361209 371476 382680 394405 406904 421452 439201 460160 483566 508857
62596 508857 535874 564356 593686 623086 651809 679059 703846 725002 741388 752242 757444 757386
62584 757386 752524 743075 729246 711683 691497 669687 646642 622421 597509 572993 549809 528053
62572 528053 507316 487526 469076 452214 436791 422783 410663 400942 393470 387460 382115 377124
62560 377124 372691 369240 367022 365866 365248 364596 363542 362055 360515 359545 359489 360023 360470 360440 359937 359054 357962
62543 357962 357120 356999 357531 358344 359568 361883 365536 369860 374179 378714 384166 390733 397989 405605 413793
62528 413793 423141 434249 447358 462132 477999 494921 513607 534833 558833 585595 615266 647896
62516 647896 683076 720312 759492 800514 842603 884422 924700 962432 996732 1027101 1053825
62505 1053825 1077630 1098934 1117828 1134786 1150924 1167456 1185154 1204395 1225440 1248671 1274785
62494 1274785 1304544 1337708 1371945 1403194 1427562 1443109 1450091 1449836 1443318 1430311 1409471 1379223
62482 1379223 1338863 1289120 1232014 1170278 1106576 1042794 979883 918425 859278 803630 752558
62471 752558 706706 666230 630835 599918 572880 549329 528931 511265 495955 482831 471861
62460 471861 463095 456667 452510 449956 448134 447062 447859 451278 456379 461289 465117 468472 472184 476305
62446 476305 480559 485080 490266 496205 502583 509004 515150 520795 525857 530444 534756 538930 542814 545756
62432 545756 546784 545334 541789 537007 531282 524075 514833 503849 492159 480782 470210 460499 451644
62419 451644 443754 436845 430669 424979 419980 416258 414104 413104 412514 411882 411231 410920 411468 413230 416021
62404 416021 419310 422860 426796 430975 434899 438568 442782 448035 453678 458862 463835 469433 475597 481334
62390 481334 486088 490297 494544 498917 503305 507547 511205 513871 515900 518161 520926 523744 526645 530710
62376 530710 536962 545311 555021 565753 577680 591098 606497 624718 646505 671951 700731 732689
62364 732689 767839 805823 845642 885847 924792 960758 992055 1017251 1035557 1047179 1053127 1054430
62352 1054430 1051666 1045358 1036366 1025291 1011776 995097 975334 953264 929246 903164 875634 848266
62340 848266 822243 797409 773242 750050 728529 708780 690453 673493 657986 643510 629265
62329 629265 614841 600407 586323 572929 560626 549746 540358 532328 525308 518542 511190 503279 496034
62316 496034 490753 487569 485626 484140 482777 481351 479827 478554 477910 477675 477261 476564 476155 476569 477849 479827
62300 479827 482419 485454 488592 491681 494994 498885 503304 507938 512806 518501 525637 534165 543595 553935
62286 553935 565924 579876 594641 608454 620785 632629 644781 656592 666795 674834 680788 684544
62274 684544 685881 685240 683759 682645 682900 685515 691365 700901 714323 731939 753956 780010 809309
62261 809309 841139 874721 908521 940192 967464 989102 1005083 1016104 1022838 1025474 1023941 1018521
62249 1018521 1009909 998489 983878 965458 943107 917270 888769 858931 829380 801086 773887
62238 773887 747491 722570 700250 680850 663903 649185 636845 626622 617920 610793 605892 603146
62226 603146 601334 599413 597571 596496 596318 596944 598881 602848 608689 615372 622151 629314 637670 647654 659058
62211 659058 671473 684767 698968 713533 726910 737265 743798 747131 748269 747484 744383 738750 731033
62198 731033 722201 713412 705621 699186 693853 689316 685752 683672 683343 684526 686711 689444 692460 695639
62184 695639 698855 701835 704249 706012 707419 709020 711473 715511 721790 730678 742351 757110 775233
62171 775233 796310 818988 841676 863338 883333 900796 914644 924224 929605 931212 929540 925277
62159 925277 919217 911658 902029 889415 873444 854524 833377 810648 786989 763201 740084 718258
62147 718258 698205 680300 664594 650661 637956 626371 616208 607523 599711 591938 583893 575954
62135 575954 568632 562003 555690 549343 543133 537893 534734 534312 536250 539078 540783 539653 535085 527918
62121 527918 519955 512889 507522 503792 501251 499300 497116 493809 488838 482212 474258 465308 455683 445845
62107 445845 436419 428068 421315 416372 413058 410953 409692 409092 408996 409207 409743 411036 413581 417314 421547
62092 421547 425703 429953 434932 441005 448111 456195 465296 475108 484982 494731 505065 516750 529590
62079 529590 542780 556086 569994 584627 599202 612943 626038 639342 653465 668534 684403
62068 684403 700459 715263 727003 734606 738251 738752 736691 732240 725554 716985 706764 694583 679686
62055 679686 661531 640368 617101 592690 567842 543150 519204 496447 475077 455169 436734
62044 436734 419702 404090 390167 378184 367906 358799 350713 343976 338587 333764 328685 323466 319054
62031 319054 316241 315022 314740 314561 313901 312648 311094 309601 308402 307632 307330 307414 307883 308986 310820 312770
62015 312770 313902 314068 314130 314902 316362 318182 320441 323377 326895 330793 335077 339642 344087 348326 352883
62000 352883 358024 363025 366892 369384 370661 370457 368473 365220 361432 356824 350486 342456 333918 325740
61986 325740 317890 310477 304249 299517 295462 291126 286466 281891 277428 273048 269297 266783 265228 263691
61972 263691 261613 259175 256755 254565 252808 251694 251068 250331 248973 247122 245495 244772 245050 245986 247380
61957 247380 249356 251822 254122 255735 257217 259927 264727 271344 279026 287342 296120 305102 314027 322908
61943 322908 331944 341293 350994 360890 370574 379663 388240 396749 405370 413746 421396 428058 433513 437413
61929 437413 439524 439921 438820 436537 433716 431212 429398 427843 425964 423923 422604 422834 424844 428470 433673
61914 433673 440645 449354 459052 468566 477240 485349 493343 500981 507657 513335 518523 523353 527422 530704
61900 530704 534022 538224 543308 548657 553807 558681 563313 567602 571186 573431 573747 571932 568040 561953
61886 561953 553559 543307 532140 520749 509329 498116 487610 478050 469209 460884 453150 445935 438971
61873 438971 432472 427318 424121 422497 421609 421044 420884 421413 423145 426637 431807 437878 444462 452227 461950
61858 461950 473363 485585 498332 511977 526647 541986 557740 573793 589588 604146 616870
61847 616870 627820 637035 643945 647783 648426 646687 643845 640896 638181 635751 634023 633869 636022 640738
61833 640738 648211 658930 673308 691213 712195 735921 761995 789466 816815 842254 863716 878731
61821 878731 884802 880230 864766 839814 808080 772706 736403 701316 669306 641577 617858 596754
61809 596754 577422 560429 546551 535395 525846 517403 510285 504526 499718 495517 491804 488494 485652
61796 485652 483591 482359 481396 480221 479081 478298 477435 475996 474640 474661 476278 478386 480117 481751 483944
61781 483944 486894 490552 494877 499598 504361 509378 515287 522218 529675 537619 546864 558022 570802 584805
61767 584805 600269 617308 635014 652065 667889 682457 695153 704612 709711 710217 706466 698905 688081
61754 688081 674669 659305 642525 624903 607094 589696 573154 557718 543414 530097 517670
61743 517670 506239 496037 487256 479933 473837 468522 463725 459709 456896 455085 453392 451186 448801 447028
61729 447028 446072 445323 444061 442098 439730 437320 435069 433151 431858 431495 431984 432714 433046 432948 432888 433033 432837
61712 432837 431674 429717 427877 426866 426504 426001 424773 422870 420737 418794 417308 416396 415838 414929 412911
61697 412911 409729 406167 403127 400960 399561 398721 398198 397825 397933 399405 402886 408091 414260 421096 428851
61682 428851 437675 447393 457807 468692 479558 489932 499924 510024 520281 530095 538772 545781 550381
61669 550381 551570 548591 541215 529558 514205 496580 478541 461343 445433 431371 420231 412716
61657 412716 408484 406853 407755 411553 418428 428533 442341 459971 480112 500101 517181 529460 535895
61644 535895 535988 529707 517472 500177 479370 457180 435624 415791 397873 381901 368151 356833
61632 356833 347758 340499 334699 330046 326206 323013 320706 319664 319811 320448 320862 321027 321498 322626 324157
61617 324157 325679 327127 328578 329815 330406 330098 328907 327024 324958 323453 322717 321896 319941 316986 314256
61602 314256 312503 311284 310018 309074 309255 310692 312826 315208 317782 320559 323444 326375 329303 332101 334782
61587 334782 337702 341270 345529 350257 355419 361223 367702 374401 380599 385883 390590 395616 401567 408208
61573 408208 415092 422702 432409 445122 460474 477664 496638 517974 541986 568491 597274 628166
61561 628166 660609 693463 725147 753644 776476 791312 796924 793570 782541 765595 744645 721492
61549 721492 697527 673722 650927 630040 611877 596936 585222 576181 568934 562779 557508 553179
61537 553179 549737 546935 544516 542270 540025 537733 535591 533955 533104 532969 532894 531803 528984 524886 520832
61522 520832 517818 515910 514876 514891 516247 518824 522353 526954 532971 540489 549508 560411 573680 589221
61508 589221 606494 625414 646731 671513 700669 734974 775060 821109 872844 929959 992314
61497 992314 1059535 1130580 1203602 1275813 1343263 1401139 1444843 1471186 1479015 1469397 1445577 1412489
61485 1412489 1375667 1340065 1309500 1286712 1273549 1271015 1279463 1299200 1331027 1375936 1433952 1503314
61473 1503314 1580954 1663533 1747437 1827763 1897989 1951234 1981847 1986098 1962497 1912540 1841011
61462 1841011 1754715 1660464 1564102 1470592 1383838 1306092 1238068 1179862 1131412 1092117 1060767
61451 1060767 1036253 1018038 1005792 999138 998137 1003599 1016446 1036921 1064793 1099969 1142151 1189525
61439 1189525 1237882 1281132 1312888 1328255 1325201 1305056 1271907 1231130 1187861 1146084 1108545
61428 1108545 1077078 1052896 1036644 1028560 1028820 1037731 1055499 1081992 1116931 1159948 1209680 1262303
61416 1262303 1311149 1348325 1367334 1364976 1341810 1301494 1249563 1191949 1133657 1078039 1026778
61405 1026778 980358 938620 901081 867023 835605 806175 778541 752843 729196 707492 687512
61394 687512 669079 652077 636436 622089 608954 597041 586744 578898 574253 572784 573592 575597 578299
61381 578299 581958 587156 594220 603005 613193 624768 637921 652356 666886 680049 691089 700066
61369 700066 707140 712130 714798 715111 713144 709149 704044 699445 696680 695718 695332 694305 692226 689155 684947
61354 684947 679234 671986 663787 655434 647339 639364 631168 622585 613736 604934 596468 588343 580237 571923
61340 571923 563774 556578 550687 545542 540248 534453 528437 522613 517294 512867 509714 507831 506781 506212
61326 506212 506222 507160 509201 512213 515939 520243 525285 531451 539069 548237 558941 571103 584271 597409
61312 597409 609352 619491 627842 634632 640238 645488 651502 658901 667306 675672 682920 688326 691711 693444
61298 693444 694033 693519 691452 687445 681403 673182 662555 649865 636413 623835 613207 604841 598621
61285 598621 594210 591197 589436 589206 590828 594251 599215 605560 613090 621395 630228 639937 651061 663437
61271 663437 676046 687764 697947 706245 712234 715464 715710 713168 708625 703506 699418 697330 697232 698678
61257 698678 701608 706598 714450 725697 740469 758889 781629 810020 845388 888201 938055 994563
61245 994563 1058021 1128687 1204944 1281801 1351191 1404387 1435211 1441982 1427023 1394749 1350316 1299383
61233 1299383 1247764 1200206 1159406 1126526 1102551 1088728 1085804 1093523 1111232 1138710 1176054 1222721
61221 1222721 1276516 1332917 1385043 1424838 1445479 1443664 1420183 1378845 1325025 1264603 1202995
61210 1202995 1144258 1090816 1043867 1003795 970256 942426 919555 901129 886321 873651 861616
61199 861616 849614 837958 827119 817249 808352 800446 793428 787027 781032 775442 770387 766004 762384
61186 762384 759410 756655 753590 749862 745197 739152 731354 721984 711674 700844 689501 677838 666604
61173 666604 656560 647837 640153 633426 627813 623291 619686 617142 616188 617199 619989 624032 628886 634306
61159 634306 640083 645852 650942 654368 655166 652953 648242 642184 635938 630129 624768 619710 615333 612688
61145 612688 612759 615589 620332 626174 632867 640304 648015 655547 663142 671565 681135 691249 700931 709616
61131 709616 717263 723999 729896 734954 739109 742355 745015 747806 751442 756192 761904 768314 775188 782303
61117 782303 789545 797010 804756 812542 819994 826883 832840 836856 837596 834496 828252 820031 810526 799987
61103 799987 788768 777332 765868 754408 743300 733156 724229 716166 708488 701115 694307 688339 683354
61090 683354 679252 675584 671746 667500 663143 658996 654860 650241 645062 639888 635355 631586 628284 625257
61076 625257 622666 620729 619358 618229 617238 616731 617111 618313 619897 621802 624686 629223 635200 641712 648225
61061 648225 654964 662124 669277 676059 683070 691351 701035 711103 720543 729177 737282 745168 753427 762858
61047 762858 773556 784614 795467 807200 821776 840157 861878 886265 913186 942463 973343
61036 973343 1004870 1036378 1067497 1098284 1129651 1163293 1200951 1243925 1293195 1349469 1413033
61025 1413033 1483930 1562377 1648912 1744877 1853915 1982977 2140815 2335257 2572573 2859135
61015 2859135 3202564 3611954 4099688 4684781 5395207 6269689 7358355 8709051 10322667
61006 10322667 12092371 13784827 15112977 15872498 16043847 15785244 15339963 14942827 14772911
60997 14772911 14925963 15372595 15929538 16305372 16227703 15573300 14408796 12925505 11334069
60988 11334069 9793467 8395553 7180009 6152564 5299064 4597033 4023323 3556478 3176922
60979 3176922 2868002 2616690 2412223 2244418 2103964 1983681 1878592 1785068 1700496 1623417
60969 1623417 1553229 1489694 1432933 1383391 1341305 1306371 1278148 1256276 1239726 1226243 1213211
60958 1213211 1199074 1183602 1167042 1149555 1131395 1113149 1095570 1079281 1064552 1051173 1038614
60947 1038614 1026391 1014110 1001116 986451 969391 949927 928614 906252 883852 862549 843182
60936 843182 825995 810789 797171 784704 773270 763482 756303 751980 749653 748135 746661 744763 742045
60923 742045 738579 735045 732000 729321 726817 725038 724894 726675 729919 734026 738470 742530 745380 746515
60909 746515 745770 743048 738474 732840 727504 723650 721638 720836 719883 717341 712461 705253 695813 684017 670263
60894 670263 656094 643426 633182 625075 618588 613653 610420 608856 608703 609413 610088 609832 608310 605749
60880 605749 602414 598386 593864 589318 585245 581909 579387 577635 576523 575987 576155 577076 578241 578505 576684
60865 576684 572338 566111 559278 552767 546560 540251 534104 529062 525537 522639 519029 514186 508463 502322
60851 502322 496120 490492 486232 483653 482435 482139 482464 482955 482875 481563 478786 474742 469875 464639 459147
60836 459147 453080 446136 438517 430833 423652 417391 412461 409159 407380 406669 406533 406624 406798 407188 407960 408766
60820 408766 408700 407194 404679 401962 399198 395995 392343 388790 385727 383016 380400 377804 375242 372881 371216
60805 371216 370640 370758 370669 370024 369310 368916 368477 367504 366179 365072 364295 363353 361775 359622 357397 355614 354416
60788 354416 353531 352618 351667 350914 350380 349701 348472 346620 344374 341952 339359 336505 333573 331148 329717 328997
60772 328997 328175 327015 326368 327192 329391 332129 334986 338267 342281 346910 351817 356530 360365 362835 364221
60757 364221 365217 365997 366236 366089 366438 367890 370117 372538 375132 378139 381335 384024 385538 385463 383665 380421
60741 380421 376401 372328 368781 366360 365623 366536 368240 369691 370400 370467 370141 369523 368553 367080 365105 362996
60725 362996 361170 359526 357532 355002 352380 350019 347565 344445 340668 336805 333342 330379 327831 325610
60711 325610 323682 322078 320739 319251 316994 313782 310159 306875 304274 302317 300845 299493 297631 294904
60697 294904 291776 289192 287727 287291 287572 288348 289400 290477 291552 292966 295205 298545 302842 307583 312193
60682 312193 316445 320517 324592 328555 332209 335619 338937 341913 343819 343927 341996 338384 333934 329742
60668 329742 326705 325047 324315 323913 323599 323419 323337 323132 322669 322125 321843 322069 322834 323955 325070 325852 326422 327425
60650 327425 329403 332046 334309 335290 334724 332699 329364 325180 321037 317684 315144 312932 310640 308044 304954
60635 304954 301407 297976 295513 294495 294726 295556 296336 296951 298083 300547 304115 307473 309801 311857 314874
60620 314874 318840 322773 326358 330204 334390 337803 339341 339109 338109 337328 337337 338084 338694 338073 336123 333912
60604 333912 332337 331175 329773 328067 326389 324785 323105 321454 320012 318686 317475 316968 317959 320559 324010
60589 324010 327370 330250 333073 336704 341500 346557 350263 351922 352487 353407 355063 356641 357191 356395 354535
60574 354535 352186 349859 347689 345613 343972 343559 344779 347085 349584 351954 354429 357213 360326 363795
60560 363795 367622 371748 376365 382018 389123 397603 407216 417819 428896 439271 447879 454704 460618
60547 460618 466603 473584 482561 494188 508379 524972 544618 568346 596292 627334 659827 691945
60535 691945 721339 745314 761683 769049 766352 753096 730530 701993 671336 641043 612066 584994
60523 584994 560673 539750 522276 508066 497164 489628 485040 482654 482190 484102 488736 495447 503108
60510 503108 511564 522171 536740 556285 580959 610680 645332 684498 727265 772027 816256 856862
60498 856862 891269 918156 937113 948185 952362 952072 950396 949692 951278 956036 964239 974505 983639
60485 983639 988050 985255 974065 954020 925193 888489 845842 800000 753948 710114 669800 633301
60473 633301 600514 571280 545286 522016 500994 481967 464832 449523 436025 424320 414226
60462 414226 405321 397058 389038 381286 374277 368503 363946 360194 357076 354800 353309 351912 349951 347525
60448 347525 345235 343442 342183 341551 341668 342402 343543 345185 347588 350738 354400 358468 362890 367464 372123
60433 372123 377248 383140 389305 394874 399651 404137 408465 412022 414349 415784 416920 417945 418936 420354
60419 420354 422775 426355 430934 436481 443032 450288 457693 464962 472290 479980 488142 496945 507014 519178
60405 519178 533634 549580 566039 582965 601152 620987 641810 662744 683680 704960 726434
60394 726434 747491 767962 788398 809253 830065 849533 866249 879397 888986 895462 899078 899840
60382 899840 898252 895694 893687 892879 893095 894097 895791 897844 899665 900823 901160 900594 899206 897443 895840
60367 895840 894581 893760 894007 896409 901814 910558 922712 938020 955471 973290 989353 1001452 1007480
60354 1007480 1006110 997415 982422 962129 937316 909097 878951 848154 817737 788947 762997 740164
60342 740164 719668 700670 682950 666598 651575 637765 624976 612759 600666 588807 577781
60331 577781 568077 559951 553738 549638 547241 545972 546052 548317 553025 559590 567538 576869 587289 597933
60317 597933 608065 617151 624026 627124 626162 622683 618274 613154 607214 601492 597463 595410 594508 594182 594392
60302 594392 594831 594829 594005 592247 589024 583460 575222 564922 553684 542656 532743 524315 517154 511048 506231
60287 506231 502952 500907 499575 498836 498734 498815 498246 496561 493943 490953 488337 486790 486443 486798 487577 489327
60271 489327 492751 497818 504115 511646 520578 530456 540496 550529 560886 571489 581835 591888 602139
60258 602139 612623 622540 631055 637838 642674 645127 644911 642204 637436 631152 624052 616610 608654 599953
60244 599953 591338 584548 580723 579678 580940 584773 591663 601353 613053 626277 640956 656928 673900
60231 673900 691772 710434 729228 747134 763680 779438 795375 811899 828764 845842 863638
60220 863638 882804 903313 924586 946570 970251 996722 1026091 1057768 1091618 1128193 1167807
60209 1167807 1210022 1254209 1300145 1347763 1396648 1446036 1495047 1542687 1587806 1629150 1665229
60198 1665229 1694201 1714426 1725523 1728788 1726419 1720494 1712596 1703868 1695050 1686674 1679443 1674220 1671445
60185 1671445 1670838 1671827 1674048 1677274 1681234 1685770 1690817 1695958 1700364 1703643 1706508 1710144 1715035 1720787
60171 1720787 1726837 1732688 1737410 1739508 1737628 1731274 1720792 1706920 1690465 1672244 1653181 1634344
60159 1634344 1616495 1599297 1581189 1560549 1536998 1511278 1484011 1455127 1424459 1392173 1358304
60148 1358304 1322470 1284570 1245433 1206420 1168679 1133151 1100899 1072693 1048337 1026881 1007570
60137 1007570 990214 974724 960869 948541 937776 928278 919311 910287 901106 891713 881707 870685
60125 870685 858664 845869 832320 817983 803116 788156 773442 759415 746913 736819 729355 723950
60113 723950 719745 716057 712525 709291 707044 706540 707926 710736 714487 719043 724444 730701 737768 745401
60099 745401 753025 760080 766529 772730 778761 784226 788760 792285 794692 795783 795790 795428 795024 793889 791037
60084 791037 786329 780514 774243 767467 759795 751070 741470 731300 720833 710288 699903 689959 680668
60071 680668 672018 663895 656440 650108 645289 642012 640138 639624 640426 642308 645034 648663 653473 659619 666935
60056 666935 674956 682925 689900 695087 698109 698932 697632 694384 689490 683244 675822 667480 658756 650239
60042 650239 642135 634277 626668 619958 615266 613439 614437 617492 621960 627854 635287 643496 650883 656286
60028 656286 659984 663301 667526 673440 681520 692078 705109 720361 737650 756832 777236 797208
60016 797208 814452 826992 833848 834777 829555 817912 800389 778900 755959 733404 712182 693091
60004 693091 676924 663723 652573 642632 633985 627143 622146 618654 616662 616495 618109 620760 623480 625741
59990 625741 627773 630342 634027 638545 642994 646875 650582 654739 659502 664842 671048 678441 686875 696067
59976 696067 706239 717921 731258 745957 761779 778532 795640 812176 827335 840437 850598
59965 850598 856916 859066 857313 851956 843158 831332 817265 801866 786191 771642 759501 750138 743090
59952 743090 738039 735226 734874 736841 741091 747961 757615 769734 784164 801416 821938 845261 870459
59939 870459 897402 926904 959534 994751 1031399 1068612 1105873 1142353 1176549 1206570 1230597
59928 1230597 1247115 1255114 1254435 1246007 1231624 1213416 1193396 1173240 1154118 1136691 1121377 1108619
59916 1108619 1098697 1091325 1085745 1081324 1077870 1075247 1072934 1070092 1065826 1059328 1050142 1038573 1025550
59903 1025550 1011871 997855 983976 971412 961475 954648 950632 949133 950059 953048 957376 962543 968546
59890 968546 975442 982956 990760 998957 1008110 1018742 1030759 1043346 1055595 1067364 1079326 1092071
59878 1092071 1105552 1119704 1135371 1154171 1177571 1206438 1241305 1282650 1331011 1387251 1452623
59867 1452623 1528140 1613754 1708223 1809203 1912598 2011755 2098040 2162940 2200167 2206839 2183947
59856 2183947 2136107 2070167 1993295 1911940 1831768 1757440 1692002 1636924 1592945 1560455 1538958
59845 1538958 1526802 1521876 1522366 1526813 1534141 1544157 1557753 1576183 1600326 1630945 1669215 1716444
59833 1716444 1773265 1839490 1914861 1999799 2095470 2203357 2324910 2461434 2613816 2781512
59823 2781512 2960995 3144908 3322959 3483957 3617690 3716309 3775781 3797012 3785414 3748956
59813 3748956 3696136 3634754 3570772 3507013 3442787 3375209 3301123 3218179 3125131 3022204 2911512
59802 2911512 2796728 2681876 2569988 2462407 2359020 2259108 2162071 2067624 1975755 1886984
59792 1886984 1802626 1724363 1653333 1589786 1533630 1484971 1444010 1410688 1384622 1365243 1351919
59781 1351919 1344113 1341484 1343683 1350054 1359770 1372209 1386937 1403335 1420461 1437248 1452646 1465757
59769 1465757 1476344 1485146 1493172 1500552 1506349 1509413 1508846 1503708 1493133 1477249 1457604 1436410 1415646
59756 1415646 1397025 1382140 1372095 1367188 1367281 1372149 1381076 1392373 1403711 1412958 1418700 1420386 1418292
59743 1418292 1413053 1404876 1393422 1378716 1361873 1344526 1327690 1311493 1295796 1280659 1266270 1252734
59731 1252734 1240013 1227852 1215841 1203695 1191404 1178966 1166086 1152291 1137331 1121392 1105012
59720 1105012 1088899 1073702 1059847 1047593 1037211 1029060 1023551 1021169 1022279 1026648 1033255 1041026 1049712
59707 1049712 1059741 1071354 1084362 1098611 1113989 1129883 1145323 1159824 1173467 1185895 1196020
59696 1196020 1203246 1208464 1213301 1218795 1225271 1233014 1242307 1252989 1264562 1276708 1289282 1301928 1314085
59683 1314085 1325290 1335249 1343879 1351694 1359911 1369703 1381335 1394331 1408249 1422828 1437602 1452106
59671 1452106 1466700 1482733 1501466 1522888 1545729 1568448 1589917 1609038 1624043 1632748 1633854 1627778
59659 1627778 1615930 1599417 1578897 1555391 1530370 1504778 1478572 1451515 1423967 1396632 1370032
59648 1370032 1344604 1320850 1298964 1278653 1259724 1242516 1227372 1213887 1200971 1187336 1171612
59637 1171612 1152345 1128474 1099841 1067112 1031473 994578 958356 924362 893372 865795 842162
59626 842162 822953 808289 798172 792820 792455 796980 806108 819536 836786 857150 879936 904333
59614 904333 928739 950703 968061 979910 986387 988067 986029 981932 977232 972465 967694 963370 960227
59601 960227 958487 957649 956957 955825 954120 952421 951787 953000 956293 961936 970392 981288 992647 1001822
59587 1001822 1007047 1007781 1004065 996197 984706 970070 952665 933427 914100 896204 880088 865564
59575 865564 853015 843163 836137 831600 829571 830323 833635 838846 845492 853246 861522 869971 879157 889894
59561 889894 902039 914790 928188 943437 961631 982872 1006665 1032386 1059203 1086222 1113002
59550 1113002 1139519 1165645 1191150 1216223 1241549 1267887 1295772 1324909 1352921 1375157 1387180
59539 1387180 1387978 1380346 1368392 1355382 1343342 1332904 1322924 1311312 1296887 1279833 1260307 1237812
59527 1237812 1212409 1185454 1158284 1130899 1102545 1072918 1042219 1010734 979239 949281 922201
59516 922201 897996 875748 854919 835762 818741 804099 791841 781612 772647 764216 756167 748884
59504 748884 742844 738277 735018 732520 730292 728474 727745 728517 730523 733264 736596 740690 745714 751617 758007
59489 758007 764236 769905 775249 780703 786216 791515 796840 802733 809122 815307 820936 826184 830850 834117
59475 834117 835576 835789 835512 835044 834623 834619 834820 834232 832148 828852 824836 820027 814345 808344 802570 796822
59459 796822 790777 784832 779514 774398 768327 760512 750895 739878 728401 717906 709406 702718 697227
59446 697227 693051 690748 690230 690894 692715 696283 701736 708465 715882 723661 731156 737494 742582 747211 751782
59431 751782 755604 757916 758936 759412 759716 760161 761784 765894 772783 781652 792222 805911 824749 848824
59417 848824 874777 896938 910371 913568 908917 900814 893094 887704 885260 886419 892494 904608 922129
59404 922129 941821 958715 968423 969355 963134 952947 941557 930724 921797 915883 913212 913190 915655 921668
59390 921668 932441 947882 966912 988995 1014460 1043299 1074505 1106966 1140347 1174699 1209762
59379 1209762 1245248 1281562 1319739 1360590 1403917 1448299 1491444 1530914 1564674 1590829 1607099
59368 1607099 1611348 1603111 1584308 1558149 1527520 1494567 1461142 1428759 1398107 1369180 1342156 1317870
59356 1317870 1297241 1280396 1266586 1254939 1245111 1237135 1230794 1225366 1219937 1213715 1206017 1196374 1184918
59343 1184918 1172427 1159703 1147085 1134780 1123253 1112931 1103840 1096020 1089961 1086053 1083897 1082823
59331 1082823 1082864 1084473 1087475 1091244 1095987 1102928 1112935 1125584 1139647 1153641 1165622 1173321 1175053
59318 1175053 1170144 1158357 1139729 1115399 1087917 1060166 1034287 1011748 993484 979198 966929
59307 966929 954114 939220 922500 905737 891470 881688 876626 875015 875670 878414 883456 890822 900793
59294 900793 914083 930879 950284 971149 992780 1014251 1033789 1049715 1061520 1069371 1073127 1072745
59282 1072745 1069250 1064385 1059508 1055497 1053428 1054476 1059307 1068170 1081369 1098874 1119586 1141663 1163559
59269 1163559 1184224 1202548 1217260 1227339 1231962 1230218 1221431 1205744 1183952 1156925 1125600 1091256
59257 1091256 1055269 1018785 982975 949166 918059 889172 861780 836144 813183 793212 775774
59246 775774 760433 746892 734500 722561 711172 700986 692205 684504 677832 672387 667795 663243 658584
59233 658584 654453 651101 647980 644851 642474 641670 642296 643638 645383 647683 650591 653847 657041 659729 661594
59218 661594 662709 663467 664133 664623 664785 664655 664371 664150 664362 665395 667334 670037 673509 677976 683559 690198
59202 690198 697902 706868 717321 729466 743498 759494 777360 797034 818431 840920 863245 884445
59190 884445 904543 923758 941287 955539 965412 970611 970846 965572 954768 939357 920625 899801
59178 899801 878352 858073 840454 826191 815380 807827 803208 801488 803376 809892 821333 837148
59166 837148 856949 881134 910316 944738 984577 1030287 1082227 1140261 1203961 1272713 1345003
59155 1345003 1417693 1486314 1546012 1592261 1621430 1631658 1623514 1599629 1563596 1519241 1470590
59144 1470590 1421820 1376597 1337225 1304367 1277634 1256427 1240341 1229046 1222201 1219635 1221461 1227927
59132 1227927 1239298 1255876 1277687 1303927 1333016 1363456 1394445 1425438 1455523 1483622 1508964
59121 1508964 1530883 1548419 1560665 1567410 1568990 1565667 1557685 1545798 1531207 1514877 1497169 1477955
59109 1477955 1456699 1432713 1405986 1377716 1349509 1322190 1295958 1271520 1250153 1232431 1217538
59098 1217538 1204142 1191400 1178809 1165591 1150750 1133657 1114372 1093480 1071688 1049549 1027651
59087 1027651 1007078 989219 974661 962536 951532 941428 933099 927224 923645 921911 921624 922106 922427
59074 922427 922087 921266 920216 918826 916900 914437 911455 907854 903517 898148 891131 882169 872174 862932 855667
59059 855667 850356 846545 844265 843945 845895 850181 856652 864889 874397 884820 895527 904983 911155 912801
59045 912801 910000 903403 893526 880952 866629 851618 836886 823502 812466 804026 797539 792299 788192
59032 788192 785356 783626 782671 782361 782673 783441 784360 785135 785496 785294 784620 783650 782386 780822 779271 778205 777877
59015 777877 778484 780557 784688 790885 798686 807819 818231 829563 841264 853268 865945 879331 893004
59002 893004 906743 920628 934483 947928 961143 974907 989809 1006179 1024772 1046537 1071439
58991 1071439 1098604 1128180 1162146 1202569 1249865 1303589 1364326 1433843 1513575 1603614 1702934
58980 1702934 1809789 1921608 2034592 2143277 2240594 2319102 2372962 2399058 2396796 2367737 2315582
58969 2315582 2245422 2162090 2069417 1971180 1871838 1775483 1684529 1600079 1523100 1454439 1394000
58958 1394000 1340864 1294372 1254528 1221296 1193973 1171358 1152218 1135562 1120751 1107454 1095427
58947 1095427 1084386 1074087 1064333 1054874 1045589 1036852 1029442 1023949 1020552 1019327 1020324 1023254 1027626 1033364
58933 1033364 1040818 1050018 1060490 1072058 1085249 1100643 1118421 1138877 1162767 1190653 1222475 1258346
58921 1258346 1299307 1346723 1401186 1462394 1529526 1600899 1673267 1741849 1800943 1844553 1867473
58910 1867473 1867157 1845009 1805625 1754775 1698034 1640484 1586442 1538909 1499449 1468687 1446826 1433808
58898 1433808 1429349 1432875 1443327 1459104 1478461 1500235 1524399 1551989 1584223 1621361 1662535 1706831
58886 1706831 1754078 1803871 1853891 1899767 1936499 1959582 1965367 1951919 1920235 1873995 1817747
58875 1817747 1755678 1691775 1629754 1572032 1519432 1472311 1431234 1396175 1366046 1339728 1316952
58864 1316952 1297615 1280984 1266253 1253140 1241212 1229188 1215661 1200035 1182190 1161930 1139513
58853 1139513 1116093 1092743 1069514 1046173 1023245 1001447 980615 960223 940610 922594 906098
58842 906098 890152 874228 858651 843741 829377 815545 802547 790518 779309 768974 759915 752468
58830 752468 746772 743065 741713 742915 746649 752869 761561 772740 786558 803185 822450 843966 867761
58817 867761 894211 922937 952192 979677 1003475 1021798 1032615 1034381 1027005 1011631 989799 963228
58805 963228 933893 903620 873741 845501 820314 799080 781666 767551 756627 748909 743955 741098
58793 741098 739813 739427 739056 738411 738122 738647 739446 739854 740200 741405 744044 748444 754988 763459 772654 781452
58777 781452 789682 797152 802552 804377 802467 797767 791206 783773 776884 771299 766152 760354 754548 750370
58763 750370 748180 747026 746538 747258 749145 751404 754027 758026 763617 769394 773805 776472 777743 777996 777862
58748 777862 778199 779395 781351 784441 789637 797361 806865 817006 827060 836746 846246 856355 867747
58735 867747 879830 891091 900814 909771 919044 929010 939785 951985 966718 985459 1010106 1042434
58723 1042434 1083139 1131960 1188826 1254089 1327057 1404556 1480957 1549239 1602229 1634064 1641546
58712 1641546 1624540 1585458 1528770 1460357 1386034 1310043 1235165 1163997 1099210 1042437 993663
58701 993663 952064 917015 888239 865660 849416 839621 835946 837762 844768 857204 875547 900212
58689 900212 931093 966651 1003507 1037338 1064043 1079885 1081471 1066927 1037175 995542 946315 894030
58677 894030 843125 796681 755418 718872 687348 661840 642364 627737 616999 609948 606144 604465
58665 604465 603764 603065 601102 596686 589620 580501 569811 558217 547355 538844 532427 526358 519734 513187
58651 513187 507300 501865 497031 493627 491772 490402 488796 487409 486658 486036 485131 484545 485037 486539 488543
58636 488543 490730 492809 494564 496454 499345 503285 507381 511102 514669 517806 519253 518160 515098 511206
58622 511206 507107 503009 498981 494683 489727 484665 480727 478269 476472 474877 474034 474180 474483 474273 473959
58607 473959 473989 473859 472838 470857 468067 464411 460234 456407 453344 450736 448766 448506 450541 454273 459255
58592 459255 466037 474895 484814 494719 504741 515326 525991 536047 545773 555782 565737 574636 581902
58579 581902 587565 592016 596291 601863 609277 617606 625982 634986 645790 658630 672961 688426 704669
58566 704669 720715 735426 748159 758322 764921 767489 767023 765166 762726 759598 755686 751160 746153
58553 746153 740822 735337 729289 721525 711072 697905 682541 665516 647627 629938 612999 596674
58541 596674 581198 567595 556569 547680 540196 533966 528899 524403 520024 515869 511829 507223 501866
58528 501866 496600 492041 487670 482948 478501 475334 473601 473014 473697 475820 479126 483602 489870 498014 506916
58513 506916 515747 525331 536841 549758 562240 573046 582026 589219 594661 598905 602740 606516 610513
58500 610513 615750 623647 635036 649991 668267 689344 712412 736917 762792 789682 816280 840814
58488 840814 861806 878172 889330 895617 897943 896609 891047 880897 866470 848004 825638 800491
58476 800491 774514 748713 722775 697097 673753 654546 639404 627764 620273 617872 620215 626257
58464 626257 635620 648298 663881 682057 702841 725080 745490 760345 767545 766419 756846 739890
58452 739890 718303 694935 671118 647424 624952 604685 586580 570510 557190 546976 538760 531325
58440 531325 524917 520296 517299 515578 515588 517336 519310 520246 520980 522907 525668 528166 530825 534704 539019
58425 539019 541697 542113 541420 540448 539013 537147 535388 533884 532577 531975 532447 533150 533031 532538 533010 534868
58409 534868 537733 541689 546875 552364 557091 561582 567252 574271 581583 588652 595709 602593 608740 614187
58395 614187 619299 623916 627870 631891 636773 642227 647780 654043 661673 669804 677043 683417 689884 696558
58381 696558 702873 708800 714368 718727 721261 722875 724565 725576 724775 723070 722502 723514 725050 726824 729533
58366 729533 733168 736861 740125 742751 744035 743791 743471 744564 746525 747996 749365 752264 757135 763140 769875
58351 769875 777444 785442 793563 802450 812404 822190 830904 839829 850523 862259 873381 883890 894466
58338 894466 904346 912662 920546 929192 937104 942213 945597 950026 955819 961329 966638 973472 982154 991961
58324 991961 1003894 1019578 1037879 1056052 1074051 1094342 1117628 1142146 1167053 1193111 1220000
58313 1220000 1246274 1272125 1299092 1327028 1354380 1381209 1408589 1435113 1457374 1473926 1485592
58302 1485592 1492264 1493127 1490012 1486819 1485311 1484764 1485550 1489352 1495924 1503543 1512828 1526342 1544294 1564513
58288 1564513 1586754 1612898 1642669 1673234 1703376 1733994 1764313 1792029 1817630 1844268 1872846
58277 1872846 1901584 1930833 1963651 2000916 2040433 2081622 2126429 2174784 2223859 2272764 2323345
58266 2323345 2375448 2426146 2474568 2522669 2570373 2615005 2656506 2698072 2740549 2781435 2820512
58255 2820512 2861203 2905202 2951231 3000230 3056026 3119397 3187058 3257855 3334284 3416849 3503124
58244 3503124 3593679 3692492 3800014 3912336 4028650 4152680 4285339 4423307 4566635 4720198
58234 4720198 4885709 5060063 5243551 5441468 5655427 5881654 6120348 6377791 6656583
58225 6656583 6953104 7267582 7607056 7975380 8370561 8795333 9259651 9768935 10320685
58216 10320685 10916159 11563585 12266559 13023160 13841901 14745695 15756063 16888575 18168965
58207 18168965 19637675 21333672 23292966 25571198 28251124 31425975 35203141 39735599
58199 39735599 45226702 51900714 60007289 69864839 81834046 96177792 112950419 132086460
58191 132086460 153691367 178381400 207398068 242072488 282386292 325251826 364071395
58184 364071395 390725617 399171479 388181256 361347637 324771475 284419289 244669518
58177 244669518 208123530 175992923 148562547 125587134 106575715 90943422 78091819
58170 78091819 67481807 58678515 51337320 45172198 39952867 35508899 31708758 28437234
58162 28437234 25599718 23130600 20979300 19094682 17431952 15962694 14665449 13514145
58154 13514145 12484958 11565412 10746674 10013878 9352021 8753782 8213546 7720707 7266340
58145 7266340 6849856 6471963 6127150 5809306 5518271 5254327 5012159 4786501 4578089
58136 4578089 4388056 4211931 4044989 3888321 3743872 3608440 3478289 3355099 3241841
58127 3241841 3136877 3037164 2943151 2855499 2770879 2685983 2602304 2522590 2445948 2370561 2297639
58116 2297639 2228643 2162057 2096831 2035522 1980196 1928632 1878324 1830729 1787791 1747769 1708447
58105 1708447 1671258 1638262 1608096 1578743 1551457 1528248 1508241 1489985 1474434 1462069 1449965
58094 1449965 1435410 1419832 1405631 1391882 1376844 1362062 1350098 1340351 1330682 1321021 1311902 1301673
58082 1301673 1288792 1275030 1262979 1252185 1240860 1229409 1218925 1208087 1194998 1180472 1166285
58071 1166285 1151711 1134956 1116565 1098377 1080474 1062001 1043475 1025459 1006494 985233 963144
58060 963144 942257 921783 899793 876691 854062 831691 808845 787088 768500 752135 735419
58049 735419 718166 702308 688464 675741 664193 654637 646573 638843 631744 626123 621156 615469 609654
58036 609654 605290 602342 599873 598318 598399 598624 596575 592148 587070 581912 576129 570396 566167 563223 560169
58021 560169 557071 555241 554693 554144 553302 552998 553288 553605 554501 557130 561219 565548 570140 575985 582977 590249
58005 590249 598231 608265 620454 633928 648904 666381 685987 706280 726945 748522 770051 789301
57993 789301 805565 820306 834977 850253 867572 889288 916677 949402 987363 1031659 1083414
57982 1083414 1143117 1211436 1289378 1377282 1474592 1580473 1693464 1810496 1927179 2038654
57972 2038654 2138961 2220210 2274150 2294976 2280162 2229825 2147194 2039310 1915314 1783589
57962 1783589 1651033 1523761 1406255 1300001 1204649 1120296 1047243 984231 929098 881083
57952 881083 840659 807340 779570 756606 738480 724112 711534 700214 691278 685163 680890 677857
57940 677857 676428 676350 676391 676062 676017 676303 675934 674779 674148 674804 675837 676340 676886 678609 682015 687462 695795
57923 695795 707796 723815 744501 771099 804604 845242 892932 947300 1006914 1069124 1130568
57912 1130568 1187035 1233068 1263117 1273700 1264259 1236518 1194073 1142026 1085291 1026852 968337
57901 968337 911665 858684 809622 763664 720997 682654 648453 616917 587492 561085 538136
57890 538136 517884 499893 484550 471569 459751 448848 439998 433616 428459 423573 419593 417200 415705
57877 415705 414209 412952 412538 412912 414046 416582 420854 426257 432419 440013 449502 459960 470096 479703
57863 479703 489281 498882 508063 516373 523250 528095 530935 532364 532469 530658 526940 522256 517020 510453
57849 510453 502171 493408 485736 479408 473853 468981 464996 461534 458056 454737 452214 450764 450293 450725 451839
57834 451839 453236 454954 457601 461303 465045 467700 469359 471223 474508 479751 486548 493563 499286 503162
57820 503162 505597 506826 506641 505479 504715 505303 506884 508869 511615 515872 521792 529230 538471 549985 563926
57805 563926 580469 600199 623693 651241 683378 721096 764988 814800 870214 931115 996086
57794 996086 1060857 1118886 1163349 1188816 1192437 1174865 1139890 1092468 1037020 977467 917706 860934
57782 860934 808669 760959 717323 677286 640662 607844 579327 554614 532251 511370 492436
57771 492436 475985 461496 448293 436733 427513 420294 413977 407973 402408 397413 393061 389726 387723
57758 387723 386723 386144 385891 386136 386765 387704 389508 392848 397495 402457 406987 410946 414364 417258 419792
57743 419792 422131 424268 426353 428929 432421 436638 441252 446434 452519 459326 466428 473922 482384 492139
57729 492139 503032 514747 526887 538716 549080 556474 559175 555938 547074 534505 520292 505372
57717 505372 490055 475116 461620 449958 439843 431142 424044 418405 413614 409254 405483 402614 400665
57704 400665 399421 398678 398297 398214 398494 399355 401074 403763 407143 410660 414026 417414 420846 423676 425296 426169
57688 426169 427446 429585 432123 434867 438352 442845 447826 453016 459204 467532 478566 492546 509927
57675 509927 531141 556374 586193 622075 666053 720346 787148 866803 954192 1036905 1098665
57664 1098665 1126384 1115777 1072131 1006644 931136 854408 782030 717864 664271 620961 585436
57653 585436 555560 530882 511006 494142 478510 464208 452364 443087 435467 429016 423796 419449
57641 419449 415308 411294 407658 404104 400126 396033 392667 390275 388539 387461 387260 387627 388056 388714 390068
57626 390068 391785 392914 392975 392050 390121 387336 384710 383419 383403 383641 383662 383790 384077 384168 384261 385063 386683 388616
57608 388616 390875 393974 397639 400782 403144 405816 409566 413620 416704 418547 419802 421130 422879 425122
57594 425122 427564 429783 431835 434149 436721 438980 440590 441681 442101 441228 438922 436044 433595 431830 430522
57579 430522 429523 428697 427782 426780 426184 426551 428121 430930 434836 439239 443152 445811 447021 446968 446140 445336
57563 445336 445143 445368 445520 445801 446995 449334 452192 455022 457852 460704 463342 465915 469182 473653 478998
57548 478998 484669 490610 497124 504469 512768 521723 530175 536535 539963 540786 539671 537072 533575 530032
57534 530032 526903 524058 521471 519499 518216 517270 516783 517547 519783 522503 524877 527519 531478 536437 540981
57519 540981 544532 548024 552552 558146 564136 570122 576124 582153 588037 593615 598773 603238 606618 608922
57505 608922 610987 614003 618414 623527 628420 632925 637350 641588 645088 647578 649271 650390 651013 651374 651784
57490 651784 652266 652745 653548 655138 657380 659681 661838 664176 666904 670061 673990 679023 684542 689260 692678
57475 692678 695450 698086 700201 701447 702324 703512 705146 707278 710375 714695 719725 724781 729729 734675
57461 734675 739526 744391 749837 756183 762977 769764 776826 784578 792651 800201 806853 812813 818415 824085
57447 824085 830434 837851 846190 855163 864658 874350 883541 891876 899803 907799 915580 922566 928679 934175
57433 934175 939196 944056 949470 955782 962326 968244 973642 979277 985458 991875 998234 1004426 1010393 1016503
57419 1016503 1023684 1032416 1041865 1050862 1059498 1068797 1078910 1088637 1096958 1104194 1111334 1118822 1126412 1133798
57405 1133798 1141046 1148586 1156906 1166130 1175910 1185861 1195917 1206042 1215898 1225239 1234402 1244002 1254222
57392 1254222 1264852 1275828 1287299 1299237 1311397 1323627 1335916 1348384 1361451 1375666 1390944
57381 1390944 1406317 1420995 1435286 1449885 1464666 1478982 1492869 1507002 1521472 1535555 1548903
57370 1548903 1562149 1576076 1590803 1606051 1621651 1637388 1652781 1667407 1681346 1695156 1709552
57359 1709552 1724962 1741078 1756941 1771845 1786057 1800305 1814793 1829233 1843612 1858242 1873086
57348 1873086 1887778 1902404 1917566 1933511 1949813 1966103 1982506 1999132 2015739 2032206 2048769
57337 2048769 2065444 2081774 2097587 2113509 2130252 2147694 2165135 2182213 2199095 2216014 2233116
57326 2233116 2250726 2269262 2288744 2308630 2328299 2347555 2366620 2385818 2405398 2425599 2446603
57315 2446603 2468262 2490039 2511534 2533027 2555154 2577961 2600713 2622863 2644750 2666920 2689186
57304 2689186 2710933 2732159 2753586 2775735 2798478 2821517 2844752 2868052 2891191 2914236 2937662
57293 2937662 2961793 2986368 3010853 3035024 3059176 3083860 3109430 3135717 3162195 3188590 3215151
57282 3215151 3242133 3269246 3296014 3322484 3349092 3375867 3402289 3428036 3453451 3479123 3505292
57271 3505292 3531815 3558472 3585189 3612073 3639308 3666974 3695064 3723692 3752956 3782444 3811273
57260 3811273 3839048 3866462 3894486 3923271 3952347 3981543 4010935 4040090 4068257 4095427 4122451
57249 4122451 4149890 4177362 4204249 4230405 4255841 4280229 4303175 4324794 4345770 4367023 4389324
57238 4389324 4412912 4437346 4461988 4486649 4511540 4536713 4561969 4587309 4612990 4639106 4665500
57227 4665500 4692160 4719276 4746848 4774583 4802129 4829034 4854612 4878455 4901016 4923093 4944626
57216 4944626 4964593 4982161 4997377 5010685 5022451 5033153 5043381 5053260 5062348 5070383 5077803 5085357
57204 5085357 5093615 5102919 5113248 5124001 5134423 5144437 5154640 5165429 5176739 5188733 5201910 5216246
57192 5216246 5230846 5244907 5258482 5271956 5285338 5298474 5311409 5324077 5336047 5347009 5357149
57181 5357149 5366655 5375273 5382666 5388876 5394059 5398123 5400915 5402377 5402325 5400502 5397163 5393031 5388267 5381915
57167 5381915 5372789 5360585 5345763 5328726 5309544 5288233 5264993 5240356 5215207 5190270 5165446
57156 5165446 5140144 5114423 5089266 5065533 5043274 5022382 5003261 4986370 4971643 4958855 4948095
57145 4948095 4939422 4932412 4926421 4920928 4915340 4908940 4901301 4892211 4880922 4866098 4846936 4823785 4797405
57132 4797405 4768263 4737016 4704962 4673489 4643646 4616583 4593706 4575921 4563437 4556645 4556297 4562289
57120 4562289 4573267 4588105 4606728 4628681 4652026 4675021 4698377 4724982 4758134 4801029 4857149
57109 4857149 4929765 5021410 5134676 5273043 5440144 5639314 5875357 6156554 6494424 6902927
57099 6902927 7399651 8007410 8753663 9669351 10789395 12152434 13797051 15757400 18062126
57090 18062126 20734169 23787789 27225534 31037736 35198376 39652431 44306131 49035268
57082 49035268 53703353 58163700 62241121 65724419 68397022 70090416 70720026 70285154
57074 70285154 68848438 66515111 63416978 59699926 55517818 51032316 46409779 41809009
57066 41809009 37365582 33182376 29327990 25838984 22724321 19972750 17561053 15459675
57058 15459675 13635651 12055318 10687162 9502991 8477377 7587319 6812915 6137702
57050 6137702 5547882 5031306 4577183 4176443 3822088 3509154 3234196 2994630 2788312
57041 2788312 2613368 2468020 2350662 2260419 2196907 2157585 2133943 2111050 2073041 2010854 1925591
57030 1925591 1825222 1718805 1613152 1512684 1420069 1336360 1261317 1194253 1134599 1081702
57020 1081702 1034530 991865 952590 915722 880591 847261 816429 788368 762149 736337 710466
57009 710466 685376 662135 641105 622135 605082 589757 575780 562972 551705 542451 535058 528877
56997 528877 523567 519372 516484 514492 512801 511460 511265 512972 516653 521944 528860 538160 550848 567222
56983 567222 586092 604541 618484 624108 619521 605388 584132 558623 531445 504754 480157 458588
56971 458588 440424 425610 413624 403678 395423 389396 386482 387066 391026 398381 409556 425208 446245
56958 446245 473593 506743 541985 572677 592121 596626 586429 564701 536066 505181 475508 448860
56946 448860 426017 407421 393135 382619 375222 370891 370037 372829 378974 388221 400761 417117 438066
56933 438066 464810 498609 539315 583568 624468 653718 665142 657131 632545 596806 555880 514929
56921 514929 477436 444888 417280 394041 374531 358032 343881 331661 320989 311151 301435 291846
56909 291846 282997 275158 267916 260873 254149 247924 242119 236905 232997 230852 229930 229395 229384 230972 234962
56894 234962 241276 249555 259814 272265 286930 303839 323508 346814 373959 403228 430691 451494
56882 451494 461975 461051 450111 431986 409887 386614 364144 343875 327066 314590 306202 300793
56870 300793 297965 298927 305146 316399 331045 348289 369473 396973 432541 476960 530032 589228
56858 589228 647947 696207 724531 728244 708936 672657 626973 578837 533471 493907 461185 435294
56846 435294 416138 403813 398344 399586 407427 421938 443425 472592 510654 559231 620261 695844
56834 695844 786823 889558 993154 1080821 1135926 1148827 1119951 1058084 976081 886520 798846
56823 798846 718693 648937 590967 545017 510138 484831 468074 459561 459071 466077 480154 501566
56811 501566 531365 571206 623051 688112 764501 844782 916072 964092 979189 960203 913711
56800 913711 850042 779285 709160 644457 587383 538477 497730 465195 440832 424073 413643
56789 413643 407954 405992 408015 415123 427976 446360 470316 500879 538408 579895 618588 646659
56777 646659 658397 651750 628484 593494 553007 512189 473943 439449 408985 382162 358412 337880
56765 337880 321296 308535 298075 288499 279918 273211 268354 264308 260208 255876 251317 246412 241082
56752 241082 235250 228788 221888 215148 208836 202416 195460 188578 182696 177703 172790 167943 164022 161243
56738 161243 158653 155582 152694 151013 150488 150162 149358 148127 146821 145813 145487 145944 146704 147122 147179 147537 148690
56721 148690 150354 151848 152858 153514 153883 153846 153620 153957 155368 157339 158855 159710 160755 162614 164699 165928
56705 165928 166069 165878 166118 166965 168292 169974 171754 173225 174249 175265 176984 179803 183562 187810 192283
56690 192283 197108 202646 209195 216936 226059 236742 249022 262844 278227 295177 313365 332034
56678 332034 350207 366849 380958 391879 399637 404765 407792 409141 409359 409070 408759 408997 410687 414361
56664 414361 419219 423628 426838 429539 432470 435296 437371 438855 440341 441855 443024 443852 444616 445129 444832
56649 444832 443575 441701 439281 435698 430150 422417 413133 403417 394116 385332 376858 368918 361973 355848
56635 355848 349790 343625 338118 333752 329885 325624 320887 315983 310875 305676 301275 298555 297377 297208
56621 297208 298377 301764 307431 314441 321794 328627 333741 336086 335914 334552 332840 330525 327373 324038
56607 324038 321403 319590 317989 315966 313302 310184 306892 303411 299433 294904 290347 286346 282998 280233
56593 280233 278362 277828 278709 280875 284302 288750 293588 298522 304041 310411 316640 321344 324347 326569 328646
56578 328646 330673 333029 336273 340082 343387 345861 348421 352004 356580 361601 366736 371927 377344 383514
56564 383514 390970 399608 408693 417357 424617 429237 430498 429025 426101 422258 417348 411823 406838 402993
56550 402993 399953 397388 395260 393033 389704 385006 379622 373836 366943 358408 348751 338685 328178 316899
56536 316899 304982 292810 280586 268579 257253 246805 237011 227791 219421 212014 205384 199587 194935
56523 194935 191343 188327 185825 184184 183162 181800 179595 176985 174435 171977 169933 168974 168841 168036 165581
56508 165581 162300 159647 157976 156796 156025 156057 156945 158307 159823 161231 162157 162464 162524 162732 163077 163460 163947
56491 163947 164334 164021 162756 161069 159594 158470 157693 157429 157542 157524 157352 157747 159014 160358 161027 161372 161959
56474 161959 162316 161590 160080 159001 158869 159035 158862 158544 158573 159004 159532 159954 160367 160971 161724 162216 162122 161781 161910
56455 161910 162633 163268 163263 162938 163013 163826 165261 167011 168616 169609 169940 169969 169963 170018 170469 171762 173718 175596 177061
56436 177061 178426 179753 180582 180890 181435 182590 183599 183662 183131 182968 183526 184481 185448 186051 185843 184810 183631
56419 183631 182961 182721 182484 182104 181595 180864 180002 179410 179239 179157 179026 179219 179887 180461 180351 179682 178951 178467 178402
56400 178402 178818 179347 179467 179315 179507 179950 179818 179043 178711 179397 180183 180126 179696 179864 180659 181595 182738 184259
56382 184259 185550 185895 185641 185795 186829 188610 191060 194011 196793 198737 199855 200525 200913 201138 201413 201486
56366 201486 200637 198765 196852 195794 195547 195958 197384 199733 201890 203034 203654 204388 204850 204688 204745 205909
56350 205909 207630 208909 209952 211462 212998 213572 213455 213904 215379 217264 219077 220722 221939 222714 223936
56335 223936 226417 229594 232372 234808 237660 240646 242648 243487 244127 245114 246140 247133 248547 250410 252102
56320 252102 253254 254063 254714 255289 256097 257287 258414 259155 260064 261811 264153 266627 269689 274017 279103 283759
56304 283759 287699 291542 295631 299976 304883 310410 315689 320089 324592 330642 337975 344985 350858 355875
56290 355875 360033 363035 365428 368120 370883 372853 374376 376647 379579 381775 382864 384208 386981 390995
56276 390995 395731 401168 407287 413997 421816 431466 442717 454834 468104 483548 501219 520290 540930
56263 540930 564465 591523 621576 654648 691875 733939 780349 830705 885366 944409 1007219
56252 1007219 1073438 1143059 1215255 1288342 1361168 1433263 1503335 1569028 1628496 1680871 1724896
56241 1724896 1758585 1780787 1791808 1792036 1781274 1759915 1729497 1691561 1647076 1597343 1544188 1488876
56229 1488876 1431934 1374329 1317478 1261779 1206575 1152011 1099550 1050117 1003078 957669 914225
56218 914225 873437 835521 800557 768468 738265 708592 679534 652696 629089 608140 589133
56207 589133 572212 557454 544330 532706 523157 515705 509414 503669 498690 494398 490081 485685 482068
56194 482068 479509 477190 474599 472117 469794 467066 464223 462652 462877 463766 464437 465691 468691 473378 478909
56179 478909 484657 490153 495103 500013 505855 512757 520015 527527 535966 545365 554972 564772 575670 587837
56165 587837 600375 612930 626056 639682 652914 665730 679233 693822 708883 724794 743365
56154 743365 765756 791770 821737 857295 899717 949464 1008066 1078368 1161872 1257358 1362423
56143 1362423 1474022 1586586 1692105 1783888 1859285 1918590 1963857 1999832 2033110 2067725 2102192
56132 2102192 2131699 2151697 2158967 2152099 2133226 2107967 2081830 2057114 2033182 2007337 1974275 1927312
56120 1927312 1862529 1781105 1687122 1585074 1480327 1379324 1287006 1205175 1134303 1075047 1026772
56109 1026772 986844 953162 925775 904688 888054 874098 862872 854540 847895 842317 839203 839566
56097 839566 841861 844038 846174 849443 854027 859629 866447 874154 881559 888669 897341 908505 920561 931785
56083 931785 942321 952595 962088 971220 982069 995520 1009903 1023924 1038405 1053530 1067194 1078221
56071 1078221 1088511 1099760 1110603 1119346 1126982 1135088 1143277 1151240 1160749 1172906 1185820 1197770
56059 1197770 1210358 1225684 1242666 1259059 1275013 1291822 1309244 1326850 1345895 1367117 1388791
56048 1388791 1409640 1431416 1455852 1481451 1506153 1530776 1556852 1583509 1609602 1636522 1665767
56037 1665767 1696111 1726217 1757548 1791574 1826748 1861470 1897319 1935916 1975398 2013540 2051656
56026 2051656 2091847 2133213 2174518 2217663 2264627 2313832 2363384 2414873 2470034 2526939 2583724
56015 2583724 2642746 2706611 2773512 2841189 2911992 2988981 3070436 3153486 3239789 3332259 3429508
56004 3429508 3529130 3633095 3744153 3860257 3978416 4100758 4230885 4367805 4509543 4658992
55994 4658992 4819807 4990379 5168437 5357510 5561971 5779994 6008713 6251825 6514402
55985 6514402 6794962 7090975 7407388 7750904 8120741 8514313 8937137 9397430 9896024
55976 9896024 10431851 11012307 11647851 12342192 13099035 13932825 14861586 15895947 17047502
55967 17047502 18341055 19807072 21472435 23374254 25574952 28152260 31191216 34806779
55959 34806779 39161004 44437923 50818379 58501961 67733354 78787820 91977879 107740986
55951 107740986 126733803 149860078 178279611 213278532 255506717 303370741 351592833
55944 351592833 391731048 415271243 417502242 399395406 366371289 325346445 282260217
55937 282260217 241098948 204029250 171901581 144747011 122166984 103576535 88328078
55930 88328078 75797303 65453649 56875938 49721202 43706236 38613661 34282377 30578774
55922 30578774 27386664 24618409 22212234 20113284 18269577 16643803 15211776 13947370
55914 13947370 12821418 11814412 10916642 10115327 9393408 8740580 8153668 7625837 7146008
55905 7146008 6708672 6313812 5957024 5629387 5327050 5051601 4800916 4568622 4352690
55896 4352690 4155993 3978007 3813744 3660749 3519220 3385231 3251827 3117612 2987378
55887 2987378 2863862 2745499 2632347 2527334 2430954 2340762 2256430 2179498 2108047 2037455
55877 2037455 1966749 1898878 1834884 1773183 1714405 1661312 1613863 1569534 1528186 1491201 1456056
55866 1456056 1417414 1373881 1328560 1283005 1236077 1188922 1145415 1106775 1070677 1036439 1006246
55855 1006246 980412 956083 931721 908742 887911 868033 848813 831163 814215 795848 776492
55844 776492 758601 742165 724824 706626 690474 677269 664731 651715 639764 629593 619868 610290
55832 610290 602306 595897 589141 581770 575831 572186 569653 568089 568701 570595 570555 567321 562967 559251 555770
55817 555770 552459 550650 550659 551259 552254 554622 557466 557979 555274 551225 546785 540616 532185 523077 514193 504694
55801 504694 494782 486524 480649 475273 468953 462380 456098 449440 443031 439584 440553 444063 447267 448656
55787 448656 447292 442464 435438 429377 426283 425855 428006 434112 445054 460439 480314 504617 529665
55774 529665 548174 554822 550077 537657 520857 502765 487218 476957 472229 472745 479449 493064 512715
55761 512715 537497 567692 602968 640891 678420 713179 742078 760775 766404 759530 742122 715299
55749 715299 680580 641531 601870 562820 523960 485821 450061 417800 389252 364456 343165
55738 343165 324534 307882 293282 280784 269849 260174 252177 245961 240686 235575 230665 226019 221250
55725 221250 216361 211989 208187 204070 199272 194683 191114 188345 186153 185126 185629 186830 187395 186528 184145
55710 184145 180967 178576 178170 179103 179894 180649 182829 186441 189378 190101 189130 187209 183992 179617 175759 173721
55694 173721 172841 171988 171408 171979 173838 176825 181057 185945 189824 191774 192851 194453 196496 198224 199736
55679 199736 201594 203850 206546 210262 215016 219439 222178 223577 225103 227773 231957 237879 245308 253273
55665 253273 260939 268369 275867 283094 289201 293172 293802 290330 283534 275257 266521 257169 247609 239360
55651 239360 233178 228115 223490 220647 221652 227137 236306 248215 262197 277970 296169 318063 344104
55638 344104 373672 406715 444370 487029 532733 578167 620184 655718 681713 696456 700391 694966
55626 694966 681745 663167 642662 622823 604556 588877 578069 573750 575086 580264 588700 600400
55614 600400 614215 628190 640655 649437 650988 642157 622551 593948 558163 516939 473157 430137
55602 430137 389703 352215 318156 288313 262563 240001 220309 203820 190208 178295 167362
55591 167362 157679 149584 142780 136684 130863 125171 119886 115563 112332 109587 106776 104054 101737 99631
55577 99631 97493 95611 94339 93527 92924 92531 92098 91055 89564 88773 89224 89855 89508 88604 88282 88596 88782
55560 88782 88826 89507 91048 92686 93500 93060 91605 90209 90257 92100 94614 96690 98459 100463 102496 104183
55544 104183 105852 107795 109397 110092 110522 111551 112729 112966 112269 111572 111193 110631 109557 107910 105357 101820
55528 101820 98250 95782 94379 93301 92559 92775 93937 95419 96960 98544 99690 100072 100484 101915 103916
55513 103916 105276 106114 107774 110676 113833 116790 120524 125888 132429 139466 147365 157046 168941 183050
55499 183050 199458 218296 239549 263200 289212 317237 346742 377409 408846 439784 468055
55488 468055 491394 507872 515699 513434 500746 478711 449361 415223 378999 342991 308625 276732
55476 276732 248035 222916 200991 181543 164279 149278 136429 125454 116225 108535 101778 95403
55464 95403 89483 84400 80259 77082 75036 73789 72168 69332 66011 63719 62950 62931 62869 62554 61933 60989
55448 60989 60020 59297 58527 57344 56085 55329 54880 54071 52934 52183 52144 52552 53299 54502 55812 56494 56278 55438
55430 55438 54131 52411 50802 49937 49612 48993 47884 46911 46404 45908 45075 44332 44298 44975 45685 45583 44346 42647
55412 42647 41680 41785 41962 41295 40287 40004 40423 40688 40607 40723 41103 41311 41499 42302 43524 44161 43939 43642 43659
55393 43659 43355 42364 41415 41262 41686 42167 42775 43725 44672 45118 45082 44838 44380 43561 42469 41282 40072 39019
55375 39019 38502 38675 39257 39899 40508 41067 41428 41455 41103 40323 39150 37942 37242 37300 37915 38696 39318 39681 39999
55356 39999 40516 40970 40745 39786 38873 38607 38718 38830 39222 40088 40734 40473 39792 39585 39696 39365 38741 38679 39180
55337 39180 39307 38668 37778 36947 36015 35280 35408 36121 36209 35251 34305 34394 35284 36219 36955 37497 37630 37267 36697 36098
55317 36098 35327 34449 33860 33646 33534 33636 34439 35825 36843 36823 36006 34877 33612 32473 31868 31630 30975 29592
55299 29592 28123 27255 27052 27409 28376 29605 30271 30085 29747 29994 30847 32115 33785 35388 35789 34404 32173
55282 32173 30611 30226 30398 30516 30663 31295 32589 34088 34942 34740 34013 33574 33524 33444 33370 33768 34586 35178 35322
55263 35322 35510 36091 36903 37796 38600 38494 36597 33555 31453 31505 32741 33564 33690 33840 34305 34726 34802 34516
55245 34516 33993 33575 33665 34130 34327 34001 33598 33452 33325 33057 32922 32993 32912 32659 32781 33423 33925 33892 33806 34102 34436
55224 34436 34445 34450 34803 35329 35925 36819 37675 37452 35986 34724 34972 36238 37311 38069 39024 39843 39760 39074 38888
55205 38888 39498 40140 40305 40223 40066 39610 38821 38058 37587 37460 37794 38646 39667 40365 40596 40490 40257 40414 41612
55186 41612 43638 45125 44982 43716 42656 42402 42773 43627 44649 44845 43557 41835 41579 43221 45311 46473
55170 46473 46712 46597 46182 45308 44246 43509 43327 43512 43587 43060 41975 41091 41012 41267 40910 39934 39322 39619 40282
55151 40282 40685 41022 41713 42485 42634 41980 41094 40608 40572 40564 40306 40044 40209 40783 41305 41587 42015 42886 43834 44365
55131 44365 44642 45223 46150 46867 47011 46819 46667 46564 46246 45532 44531 43612 43111 43020 43099 43230 43378 43196 42264
55112 42264 40958 40459 41436 43169 44477 45061 45360 45576 45628 45755 46299 46947 46940 46171 45425 45415 46007 46595 46812
55093 46812 46745 46673 46726 46756 46653 46798 47811 49630 51327 52243 52810 53687 54508 54252 52736 50923 49791 49473
55075 49473 49632 50093 50887 52023 53361 54587 55341 55560 55454 54979 53703 51566 49415 48242 48142 48505 48916
55058 48916 49258 49215 48531 47746 47906 49295 50980 51845 51726 51365 51542 52358 53206 53364 52732 51921 51555 51719 52175
55039 52175 52765 53347 53717 53920 54286 54885 55333 55456 55593 55827 55508 54221 52704 52051 52333 52759 52830 52604 52094
55020 52094 51285 50566 50313 50200 49671 48973 48898 49622 50540 51233 51783 52220 52433 52609 53011 53359 53224 52966 53412
55001 53412 54596 55712 56392 57090 58038 58767 58956 58916 58843 58369 57299 56107 55288 54764 54311 54060 54165 54474
54983 54474 54828 55302 55940 56685 57742 59458 61604 63272 63770 63256 62365 61718 61883 63139 64973 66317 66586
54966 66586 66101 65396 64627 63851 63225 62634 61671 60347 59294 58980 59190 59554 60073 60787 61492 62178 63236 64775
54948 64775 66180 66836 66996 67474 68729 70596 72704 74898 77448 81021 86178 92728 99937 107451 115528
54933 115528 124129 132313 138873 143118 144779 143721 140261 135347 129803 123633 116473 108557 100795 94068
54919 94068 88792 84919 81971 79225 76264 73292 70689 68476 66486 64906 64213 64583 65631 66737 67476
54904 67476 67758 67752 67742 68043 69025 71002 73920 77299 80824 84885 90189 96962 104934 113957 123871 133671
54888 133671 141558 146285 147993 147421 144831 140157 133781 126555 119194 112080 105529 99842 95131 91296
54874 91296 88085 85125 82146 79342 77201 75801 74629 73298 72079 71386 71053 70549 69661 68564 67395
54859 67395 66213 65290 64951 65019 64770 63658 61970 60621 60311 60910 61655 61879 61426 60399 58828 56918 55379
54842 55379 54936 55414 55711 54945 53422 52252 52203 53009 53717 53601 52837 52269 52441 53061 53582 54023 54800 55879
54824 55879 56694 56852 56485 55895 55341 55200 55810 57037 58413 59739 61045 61995 61991 61083 60175 60071 60799 62063
54806 62063 63758 65687 67297 68088 68043 67434 66579 65903 65749 65927 65911 65688 65869 66788 68063 69388 71128 73699
54788 73699 76853 80036 83074 86217 89910 94752 101155 108686 116298 123467 130420 136921 141748 144026
54774 144026 144318 143533 141498 137581 132195 126451 120589 113948 106566 99703 94446 90630 87479 84684 82422
54759 82422 80800 79689 78876 78139 77317 76434 75660 75154 75087 75694 77062 78996 81263 83794 86397 88582 90140
54742 90140 91744 94492 98850 104426 110709 117574 124950 132337 138795 143303 145214 144609 142158 138464 133672
54727 133672 127843 121423 115020 108905 103130 97934 93600 89991 86654 83413 80514 78199 76441 75094
54713 75094 73974 72767 71188 69279 67370 65722 64421 63526 63076 63002 63173 63513 63889 64063 63983 63950 64218 64546
54695 64546 64476 63994 63589 63647 64085 64567 64878 65016 65079 65064 64749 63913 62750 61892 61780 62145 62317 61934 61197 60545
54675 60545 60279 60395 60640 60776 60806 60803 60592 59951 59177 58986 59705 60952 62274 63589 64710 65018 64151 62633
54657 62633 61307 60442 59855 59534 59534 59526 59115 58523 58357 58771 59373 59890 60411 60951 61316 61490 61764 62320 62957 63298
54637 63298 63140 62677 62467 62979 63981 64681 64703 64557 64798 65212 65367 65500 66145 67153 67862 68107 68243 68221 67460
54618 67460 65793 63800 62053 60644 59715 59730 60828 62412 63801 64979 66327 67902 69324 70231 70581 70625
54602 70625 70742 71213 72022 72859 73348 73224 72455 71306 70157 69120 68019 66930 66381 66686 67380 67824 68139
54585 68139 68897 70031 70702 70339 69218 67888 66565 65301 64301 63790 63798 64228 64896 65505 65887 66269 66888 67405
54567 67405 67207 66387 65825 66040 66462 66251 65475 65003 65376 66217 66801 66934 67069 67672 68660 69669 70700 72084
54549 72084 73717 74779 74613 73553 72441 71590 70727 69666 68443 66943 65108 63536 63159 64125 65592 66776
54533 66776 67683 68625 69627 70601 71561 72280 72169 70939 69131 67678 67161 67704 69197 71204 72936 73811 74007
54516 74007 74218 74887 75911 76992 77961 78754 79296 79545 79542 79346 78992 78585 78387 78667 79332 79914 80127 80306 80979
54497 80979 82020 82756 82956 83121 83588 84021 84206 84639 85618 86379 86101 85362 85556 86972 88569 89775 91375
54480 91375 94251 98127 102143 105942 109560 112721 114841 115601 115133 113799 111940 109613 106520 102529 98275
54465 98275 94781 92308 90139 87684 85330 83895 83637 84064 84384 84005 82943 81936 81717 82066 82047 81304 80512
54448 80512 80308 80470 80582 80854 81677 82813 83685 84206 84755 85467 86045 86169 85633 84218 81849 78875 75934
54431 75934 73560 72087 71738 72489 73947 75621 77257 78730 79738 79870 78966 77330 75621 74528 74370 75005
54415 75005 76201 77968 80181 82065 82615 81670 80152 79075 78730 78928 79502 80295 81085 81825 82624 83322 83518
54398 83518 83278 83268 83847 84480 84453 83793 83078 82719 82862 83663 85058 86403 86877 86340 85527 85372 86217 87551 88441
54379 88441 88411 87931 87870 88540 89691 91301 93714 96893 100266 103537 106922 110230 112541 113356 113437 113764 114200
54362 114200 113834 112233 109637 106347 102671 99224 96496 94320 92375 90956 90570 90932 91161 90873 90428 90145
54346 90145 89936 89722 89587 89447 89074 88478 87839 87136 86342 85843 86175 87350 88939 90666 92366 93551 93713
54329 93713 93082 92412 91987 91460 90704 90104 89823 89395 88376 86909 85441 84297 83688 83606 83497 82520 80468 78104
54311 78104 76385 75641 75653 76089 76630 77003 77173 77276 77303 77114 76860 76952 77480 78044 78382 78725 79334 80053 80641 81199
54291 81199 81938 82759 83356 83587 83458 82913 81898 80558 79230 78290 77999 78307 78838 79442 80733 83583 87789
54274 87789 91807 94245 95230 95818 96405 96427 95568 94493 94120 94626 95474 96131 96408 96366 96243 96391 96950 97589 97838
54255 97838 97710 97706 98112 98557 98482 97825 96929 95941 94705 93199 91697 90359 89050 87748 86804 86510 86615 86594
54237 86594 86275 85922 85772 85745 85639 85392 85109 84900 84666 84092 82998 81712 80838 80563 80486 80246 79973 79914 80008 80141
54217 80141 80466 81031 81422 81313 81112 81439 82063 82072 81132 79955 79349 79357 79545 79675 79747 79779 79908 80472 81650 83152
54197 83152 84535 85774 87371 89966 93865 98740 103735 108045 111557 114785 118011 120612 121487 120137 117237
54182 117237 114031 111188 108342 104857 100930 97551 95310 93704 91963 90171 88969 88397 87754 86685 85691
54167 85691 85252 85016 84328 83262 82638 83069 84263 85268 85264 84184 82696 81548 80869 80187 79148 78003 77354
54150 77354 77534 78294 78944 78807 77753 76350 75287 74621 73844 72725 71714 71354 71640 72294 73358 75112 77442
54133 77442 79703 81364 82515 83578 84622 85221 85028 84329 83824 83911 84372 84814 85125 85273 84954 83872 82328
54116 82328 81092 80583 80524 80562 80873 81811 83188 84311 84734 84639 84453 84348 84326 84597 85520 87127 88939 90461
54098 90461 91699 92959 94189 94863 94618 93783 93123 93192 94058 95443 97015 98650 100573 103061 105986 108895
54082 108895 111634 114499 117555 120226 121929 122728 122898 122201 120231 117320 114409 111989 109775 107465 105270
54067 105270 103532 102339 101720 101715 102015 101997 101414 100688 100252 99994 99746 99985 101476 104259 107398 109886 111605
54050 111605 113284 115569 118307 120836 122911 125040 127796 131068 134339 137497 140930 144876 149155 153532
54036 153532 157889 161881 164895 166588 167249 167534 168074 169319 171282 173319 174573 174846 174723 174711 174702 174420 173854
54019 173854 172927 171191 168345 164749 161023 157350 153573 149713 145968 142349 138792 135541 133043 131437
54005 131437 130438 129685 128951 128101 127110 126087 125046 123702 121769 119454 117405 116141 115644 115490 115272 114934
53989 114934 114770 114994 115283 114972 113855 112506 111558 110914 110035 108796 107582 106600 105622 104540 103740 103612 103976
53972 103976 104274 104224 104029 104054 104555 105682 107418 109332 110678 111091 111114 111734 113223 114772 115444 115273 115130 115714
53954 115714 117010 118601 120086 121191 122004 123148 125328 128455 131551 133797 135385 137192 139812 143160
53940 143160 146804 150480 154399 159094 164654 170085 173887 175602 176421 177945 180662 183969 187211 190106
53926 190106 192453 194232 196045 198787 202612 206707 210276 213378 216613 220372 224623 229083 233291 236730
53912 236730 239256 241256 243104 244541 244942 244178 242892 241785 240864 239607 237663 235139 232250 229020 225483
53897 225483 221922 218611 215368 211649 207179 202264 197349 192488 187470 182316 177375 172866 168669 164695
53883 164695 161240 158670 156792 154880 152434 149693 147203 145048 142874 140533 138299 136352 134482 132564
53869 132564 130994 130215 129965 129425 128077 126121 124038 122071 120230 118560 117242 116501 116440 116874 117401 117747
53853 117747 118003 118373 118830 119141 119071 118358 116726 114304 111879 110340 109938 110352 111302 112610 113853 114582 114939
53836 114939 115456 116161 116461 116176 116064 116926 118569 120046 120712 120748 120817 121426 122557 123771 124758 125670 126717 127712
53818 127712 128459 129402 131233 133922 136803 139642 142789 146196 149287 152151 155898 161138 166908 171849 175789
53803 175789 179329 182510 184904 186654 188391 190191 191505 192102 192330 192361 191862 190529 188458 185918 183269
53788 183269 181027 179533 178512 177361 175761 173630 170752 167137 163600 161236 160135 159210 157404 154611
53774 154611 151376 148279 145725 143801 142115 140134 137758 135300 133022 131137 130088 130121 130554 130243 128919
53759 128919 127445 126599 126320 126337 126699 127241 127289 126536 125723 125781 126663 127621 128286 128801 129130 128942 128222 127410 126810
53740 126810 126311 125846 125745 126380 127586 128602 128676 127762 126632 126133 126315 126528 126455 126646 127725 129449 131082
53723 131082 132535 134500 137366 140517 143006 144565 145597 146495 147403 148534 150247 152637 155372 158130 160951
53708 160951 163934 166710 168610 169377 169447 169443 169562 169602 169403 169088 168958 169268 170075 171209 172454 173784 175266 176731
53690 176731 177733 178016 177862 177800 178073 178571 179174 179910 180775 181562 182012 182169 182545 183749 185765 187707 188634 188578
53672 188578 188416 188772 189515 190414 191586 192962 193977 194353 194704 195637 196637 196660 195754 195210 195999 197679 199053
53655 199053 199407 198901 198230 198130 198830 199796 200269 200188 200249 200976 202125 203147 203834 204228 204225 203602 202428 201198 200517
53636 200517 200622 201155 201515 201550 201732 202502 203657 204689 205482 206252 206971 207372 207529 207962 209099 210955 213291
53619 213291 215688 217634 219005 220376 222302 224379 225670 226047 226379 227271 228369 229217 230052 231382 233352
53604 233352 235925 239161 242845 246315 249117 251474 253734 255817 257595 259365 261368 263161 264004 263738 262877
53589 262877 262050 261651 261785 262193 262408 262252 261887 261246 259873 257647 255145 252829 250400 247589 245049 243722
53573 243722 243592 243833 243974 244127 244163 243556 242203 240710 239626 238900 238272 237714 237301 237020 236905 236999 237121 237004
53555 237004 236714 236560 236545 236301 235637 234783 234047 233694 234205 236056 238916 241551 242954 243355 243807 245004 246783
53538 246783 248608 250195 251743 253739 256524 259963 263621 267294 271131 275207 279264 283087 286886 291074
53524 291074 295888 301480 308069 315621 323506 330900 337580 344000 350603 357349 364036 370762 377921 385898
53510 385898 394914 404973 415815 427097 438761 451088 464216 477794 491362 504876 518551 532288
53498 532288 545697 558758 572012 585856 599973 613726 626842 639395 651416 662992 674615
53487 674615 686869 699694 712367 724394 736097 748125 760677 773383 785696 797149 807452
53476 807452 816717 825569 834802 844766 855079 864925 873595 880842 886841 891873 896075 899447 901842 902888
53462 902888 902078 899196 894528 888457 881063 872425 863097 853755 844452 834784 824801 815146 806032 796728
53448 796728 786396 775060 763330 751587 739878 728339 717182 706414 695971 686096 677254 669659
53436 669659 663065 656956 650957 645326 641110 639314 639629 640428 640386 639729 639476 639991 640916 642167 644077 646664
53420 646664 649580 652867 657004 662036 667365 672776 679064 687200 697236 708411 720072 732132 744823
53407 744823 758381 772892 788216 804133 820703 838349 857464 878048 899861 922755 946723
53396 946723 971831 998252 1026221 1055748 1086448 1117855 1149824 1182446 1215633 1248982 1282169
53385 1282169 1315323 1348864 1382923 1417002 1450281 1482234 1512817 1542086 1569826 1595738 1619797
53374 1619797 1642238 1663183 1682463 1699759 1714804 1727454 1737696 1745526 1750715 1752715 1750975 1745283
53362 1745283 1735687 1722110 1704228 1681794 1655039 1624859 1592659 1559845 1527260 1495095 1463303
53351 1463303 1431877 1400646 1369245 1337730 1307022 1278313 1251967 1227306 1203404 1179781 1156389
53340 1156389 1133269 1110274 1086959 1062934 1038657 1015651 995299 977390 960399 943284 926458
53329 926458 910829 896530 883096 870447 859108 849524 841518 834366 827161 819175 810094 799977 789060
53316 789060 777761 766800 756806 747688 738792 729972 722052 715824 710960 706479 702117 698635 696805 696585
53302 696585 697397 698755 700445 702472 705092 708745 713767 720249 728122 737166 747005 757419 768707 781366
53288 781366 795338 809967 824853 840224 856124 871775 886369 900114 913738 927094 939141
53277 939141 949411 958562 967039 974084 978785 981483 983148 983753 982352 978697 973712 968102 961428 953056
53263 953056 943167 932262 920273 906861 892145 876517 860116 843109 826128 809625 793077 775637
53251 775637 757515 739909 723513 707875 692348 676931 661881 647214 632962 619332 606171
53240 606171 592749 578562 564047 550022 536708 523691 510666 497762 485282 473444 462331
53229 462331 451862 441904 432558 424122 416621 409703 403255 397757 393550 389967 385745 380294 374106 367894
53215 367894 361746 355217 347882 339611 330566 321134 311757 302678 293922 285509 277523 270030 263122 257091
53201 257091 252202 248106 243786 238456 232470 226984 222643 218896 214786 210136 205547 201362 197194 192695
53187 192695 188269 184540 181360 177993 174254 170831 168269 166174 163846 161294 159153 157794 157058 156768 156969
53172 156969 157548 158029 157951 157239 156066 154547 152722 150652 148393 146063 144073 143124 143658 145235 146627 146715
53156 146715 145358 143453 142191 142187 143154 144261 144734 144282 143120 141743 140610 139949 139757 139885 140092 140107 139819
53139 139819 139482 139581 140386 141676 142934 143791 144238 144531 145022 145970 147416 149232 151237 153165 154511 154786 154154
53122 154154 153581 153934 155006 155843 156031 156154 156761 157440 157397 156598 155769 155341 155002 154374 153592 152920 152264 151422 150537
53103 150537 149909 149555 149343 149375 149746 150047 149613 148393 147099 146289 145722 144889 143839 143075 142816 142708 142264 141355
53085 141355 140274 139435 138963 138493 137546 136184 135098 134863 135304 135782 135910 135710 135255 134528 133578 132495 131214
53068 131214 129665 128135 127229 127366 128401 129749 130769 131119 130883 130363 129729 129015 128460 128457 128953 129306 129167 129134
53050 129134 129960 131408 132597 133292 134016 134818 134917 133958 132868 132791 133669 134481 134586 134213 133842 133734 134059 134957
53032 134957 136288 137614 138565 139118 139493 139875 140232 140326 139967 139264 138535 137990 137702 137819 138456 139285 139693 139516
53014 139516 139302 139580 140261 141049 142005 143225 144336 144934 145375 146490 148463 150504 151753 152110 152084 152218 152822
52997 152822 153927 155281 156547 157679 158967 160736 163138 166167 169550 172612 174600 175332 175313 175066 174555
52982 174555 173359 171240 168423 165502 163225 162128 162147 162622 162852 162640 162253 162001 162005 162273 162772 163322 163588 163322
52964 163322 162680 162150 161990 161799 160905 159318 157999 157859 158602 158938 157969 156036 154148 152932 152360 152172 152231
52947 152231 152489 152885 153305 153534 153301 152504 151316 149971 148543 147103 146000 145671 146097 146739 147113 147303 147688
52930 147688 148312 148816 148964 148972 149167 149555 149905 150106 150148 149832 148923 147754 147298 148180 149729 150421 149441 147493 145906
52911 145906 145198 144850 144331 143930 144334 145658 147092 147546 146564 144702 143150 142884 143968 145582 146784 147282
52895 147282 147455 147773 148307 148758 148782 148261 147454 146868 146828 147142 147385 147540 148065 149209 150610 151807 152884 154306
52877 154306 156233 158396 160560 162737 164940 167037 168944 170693 172183 173013 172656 170765 167423 163269 159300
52862 159300 156218 153931 151803 149399 146798 144329 142320 141008 140388 140150 140024 140133 140663 141309 141546 141384
52846 141384 141324 141499 141512 141271 141292 141801 142154 141732 140904 140413 140153 139320 137674 135972 135049 135022 135524 136297 137322
52827 137322 138624 140121 141536 142453 142609 142085 141058 139558 137788 136449 136148 136408 135808 133467 130131 127456
52811 127456 126402 126624 127274 127962 128795 129813 130755 131445 132100 133051 134205 135047 135233 134997 134895 135257 135980 136739
52793 136739 137348 137941 138792 139843 140526 140316 139455 138742 138552 138391 137618 136248 134772 133472 132233 130853 129319
52776 129319 127949 127408 128182 129765 130709 129969 127976 126061 125090 125099 125938 127551 129631 131625 133261 134703
52760 134703 136118 137486 138863 140433 142198 143955 145643 147350 148911 149858 149934 149410 148809 148541 148772 149305
52744 149305 149605 149351 148993 149341 150547 151966 153140 154330 155812 157218 158051 158437 158836 159239 159203 158556 157546
52727 157546 156338 154862 153320 152312 152183 152470 152384 151751 151225 151556 152860 154659 156391 157708 158406 158377 157721
52710 157721 156751 155812 155177 155074 155536 156157 156279 155635 154646 153929 153691 153777 153996 154091 153628 152347 150587 149002
52692 149002 147862 146951 146027 145040 143964 142837 141977 141727 141926 142028 141872 141873 142290 142679 142394 141391 140226 139409
52674 139409 138984 138674 138234 137654 137095 136636 136157 135593 135231 135550 136751 138592 140588 142193 142948 142833 142473
52657 142473 142646 143518 144586 145349 145666 145539 144993 144304 143935 144024 144245 144276 144104 143827 143584 143800 144955 146844
52639 146844 148554 149504 150079 150815 151398 151095 149978 149037 148975 149457 149680 149342 148778 148331 147877 147005 145527 143752
52621 143752 142243 141427 141407 141981 142668 142884 142415 141674 141229 141110 140888 140367 139817 139503 139431 139567 139851 139915 139320
52602 139320 138344 137945 138646 139917 141008 141867 142784 143625 144135 144629 145648 147056 148114 148430 148245 147767 146861
52585 146861 145542 144304 143684 143805 144434 145139 145313 144451 142690 140878 139899 140084 141336 143476 146198 148838
52569 148838 150557 150895 150109 148995 148444 149068 151019 153927 156972 159303 160654 161531 162570 163708 164271 163853
52553 163853 162706 161137 159090 156682 154724 154063 154502 154898 154388 153110 151768 150951 150960 151810 153111 154259
52537 154259 155038 155858 157162 158752 159993 160582 160837 161189 161655 162026 162385 163125 164383 165744 166696 167130 167136 166543
52519 166543 165195 163610 162748 162927 163452 163581 163329 162984 162430 161546 160795 160598 160343 158926 156318 153813 152500
52502 152500 152158 151992 151750 151615 151432 150765 149566 148329 147542 147276 147276 147250 147107 147122 147740 148962 150057 150234 149636
52483 149636 149327 150167 151960 153878 155488 157067 158999 161247 163496 165533 167289 168650 169555 170197 170933
52468 170933 171987 173479 175709 179056 183440 188109 192173 195268 197575 199392 200878 202062 202823 202874 201912
52453 201912 199760 196416 192134 187599 183711 180890 178664 176168 172987 169435 166234 164114 163442 163849 164369
52438 164369 164384 164378 165376 167683 170576 173240 175498 177526 179395 181197 183247 185682 188012 189413 189436 188253
52422 188253 186318 184091 182030 180499 179542 178850 178104 177288 176642 176313 176199 176206 176571 177723 179669 181680 182798
52405 182798 182693 181848 180912 180053 179032 177755 176536 175822 175736 175924 175822 175135 174112 173341 173186 173443 173608 173544
52387 173544 173708 174540 175774 176718 177244 178025 179544 181309 182605 183713 185654 188752 192167 195019 197213
52372 197213 198861 199675 199489 198851 198495 198641 199417 201420 204932 208910 211807 213479 215327 218339 221857 224636
52356 224636 226288 227171 227479 227189 226564 226002 225488 224652 223359 221867 220565 219877 220278 221933 224346 226784
52340 226784 229103 231813 235278 239267 243419 247760 252440 257296 262064 266902 272250 278192 284406 290869
52326 290869 298093 306345 314970 323019 330401 337943 346392 355860 366245 377531 389472 401537 413615
52313 413615 426335 440229 454886 469430 483530 497422 511079 524044 536081 547489 558556
52302 558556 569076 578539 586590 593193 598566 603011 606717 609698 611966 613557 614231 613499 611286 608296
52288 608296 605301 602299 598933 595486 592739 590792 588825 586315 583847 582310 581746 581471 581030 580581 580484 580927
52272 580927 581968 583681 586219 589813 594751 601255 609339 618704 628768 638986 649263 659894 671013
52259 671013 682322 693570 704925 716470 727635 737670 746461 754321 761089 766143 769264 770863 771269
52246 771269 770457 768599 766198 763389 759702 754752 748714 741909 734545 727105 720369 714618 709335 704034
52232 704034 698851 693972 689092 683939 678797 673970 669249 664470 660225 657302 655672 654613 653603 652597
52218 652597 651712 651244 651783 653607 656077 658255 660148 662763 666865 672134 677635 682747 687529 692417 697642
52203 697642 702789 707020 709822 711301 711671 710923 709311 707632 706422 705295 703735 702154 701310 700841 699428
52188 699428 696545 693189 690515 688444 686085 682987 679508 676289 673813 672231 671242 670248 668855 667129 665268
52173 665268 663261 661098 659070 657571 656606 655697 654326 652442 650573 649416 649238 649664 650060 650061 649686 649159 648803
52156 648803 648897 649336 649504 648757 647016 644742 642426 640274 638252 636147 633788 631469 629973 629807 630542 631281
52140 631281 631656 631903 632230 632661 633459 635034 637307 639721 642017 644538 647656 651462 656201 662406 670246
52125 670246 679175 688598 698562 709518 721737 735225 749826 765072 780250 794975 809380 823495
52113 823495 836794 848768 859607 869871 879720 888850 896904 903547 908482 911986 915169 918935 922753
52100 922753 925126 925362 924174 922414 919996 916489 912123 907484 902539 896637 889470 881539 873628 866214
52086 866214 859517 853732 848967 845037 841528 838093 834769 832117 830922 831492 833257 835332 837548 840593
52072 840593 845013 850486 856413 862857 870345 878856 887637 896155 904644 913399 921911 929223 935005 939845
52058 939845 944508 949175 953418 956677 958689 959655 960010 959917 959005 956740 953061 948522 943744 938764 932942
52043 932942 925519 916338 906059 895538 885031 874164 862678 850808 838763 826283 813172 800029
52031 800029 787895 777143 767160 757197 747188 737615 728943 721285 714332 707459 700216 692868 686162
52018 686162 680342 674658 668105 660486 652442 644593 636973 629269 621219 612638 603343 593268 582553 571330
52004 571330 559495 546876 533563 519790 505500 490350 474334 458150 442598 427824 413466
51993 413466 399382 385822 372999 361051 350382 341384 333648 326128 318511 311869 307501 305534 305095
51980 305095 305317 305605 305387 304411 303073 301744 299984 297116 293367 289637 286314 283201 280557 279213 279394
51965 279394 280402 281806 284132 287993 293346 300151 308963 320187 333395 348239 365654 387312 413935
51952 413935 444624 477424 509704 537971 558212 567096 563176 547413 522933 493910 463879 434732
51940 434732 407295 382481 361347 344133 329884 317292 305747 295477 286890 279898 273816 267921
51928 267921 262069 256662 252021 248067 244699 242085 240316 239067 237941 236866 235853 234643 232969 230879
51914 230879 228378 225049 220650 215885 211917 209050 206492 203523 200348 197606 195530 193915 192524 191225
51900 191225 189992 189097 189152 190667 193542 197119 200693 203959 207098 210475 214178 217875 221209 224291 227582
51885 227582 231270 234963 238065 240303 241848 243079 244331 245751 247258 248620 249554 249847 249531 248954 248479
51870 248479 248003 246950 244910 242051 238711 234860 230310 225272 220248 215392 210380 204972 199364 193888
51856 193888 188715 183955 179872 176803 174909 173971 173400 172631 171695 171261 171788 172795 173330 173073 172606 172634 173364
51839 173364 174619 176132 177576 178688 179473 180056 180319 180044 179376 178738 178228 177560 176651 175807 175213 174802 174746 175447
51821 175447 176746 177742 177836 177497 177537 178086 178791 179586 180611 181709 182678 183771 185255 186604 186926 186191 185287
51804 185287 184751 184166 183103 181974 181428 181401 181287 180843 180380 180248 180555 181429 183083 185459 188031 190173 191711
51787 191711 193070 194914 197645 201107 204703 207758 209857 210961 211276 210976 210035 208343 206008 203472 201247
51772 201247 199530 198137 196794 195476 194500 194268 194786 195462 195609 195200 194878 195011 195002 193892 191494 188624 186235
51755 186235 184649 183625 182834 182156 181749 181862 182377 182590 181806 180236 178961 178895 180090 182155 184842 187811
51739 187811 190282 191513 191628 191542 192017 193162 194864 197245 200378 203809 206678 208318 208577 207646 205799 203425
51723 203425 201114 199462 198673 198451 198354 198185 197925 197403 196279 194462 192317 190337 188673 187096 185377 183649
51707 183649 182418 182146 182725 183397 183399 182643 181502 180034 177914 175217 172720 171003 169672 167976 165898 164073
51691 164073 162871 162213 162172 162971 164289 165299 165703 166187 167490 169564 171950 174390 176575 177852 177948 177751
51675 177751 178677 181277 185009 189246 193817 198541 202895 206410 208901 210148 209928 208752 208080 209303 212681
51660 212681 217598 223506 230082 236689 242372 246555 249280 250592 250095 247378 242583 236215 228643 220195
51646 220195 211593 203788 197220 191596 186550 182244 179041 176880 175348 174193 173409 172841 172165 171296 170436
51631 170436 169647 168754 167790 167056 166477 165399 163425 161127 159420 158473 157762 156965 156231 155700 155439 155830 157313
51614 157313 159587 161706 163228 164640 166349 167943 168971 169903 171575 174013 176513 178714 180829 182788
51600 182788 183865 183429 181615 179065 176338 173775 171615 170018 169151 169296 170564 172418 173949 174862 175876
51585 175876 177781 180408 182943 184980 186713 188117 188636 188002 186886 186255 186296 186490 186714 187650 189834 192779
51569 192779 195611 198393 202183 207648 214162 220638 226947 234064 242970 253876 266511 280620 295878
51556 295878 311515 326353 339135 348733 354145 354649 350123 341278 329535 316573 303751 291743 280618
51543 280618 270198 260300 250774 241566 232901 225304 219225 214647 211111 208093 205285 202566 199868 197183
51529 197183 194664 192566 191012 189816 188578 187031 185275 183689 182654 182399 182997 184373 186270 188268 189918
51514 189918 190860 190954 190463 190078 190499 191831 193480 194768 195547 196114 196691 197215 197553 197678 197614 197426 197266 197169 196770
51495 196770 195485 193183 190451 187988 185895 183838 181730 179903 178624 177767 177057 176357 175572 174496 172977
51480 172977 171148 169377 168031 167322 167243 167527 167814 167951 168073 168371 168917 169762 170977 172436 173778 174791 175706
51463 175706 176939 178689 181023 184150 188249 193118 198345 203912 210272 217610 225195 231646 235844 237526
51449 237526 237104 235018 231375 226282 220352 214490 209078 203669 197755 191525 185594 180289 175613 171691
51435 171691 168700 166526 165012 164457 165196 166653 167500 166976 165493 163748 161901 160013 158665 158479 159376 160827
51419 160827 162629 164935 167651 170280 172345 173690 174457 175013 175766 176805 177838 178647 179345 180027 180545 180895
51403 180895 181461 182459 183515 184262 185040 186432 188306 189908 190760 190958 190747 190362 190239 190808 192051 193678 195621
51386 195621 197884 200143 202133 204323 207443 211297 214724 216816 217482 216840 214970 212535 210738 210132 210054
51371 210054 209659 208833 207670 205792 202925 199579 196463 193676 191112 189151 188107 187381 186131 184624 183949
51356 183949 184316 184550 183494 181190 178346 175287 171900 168201 164511 161231 158682 156962 155845 154998 154366
51341 154366 154096 154024 153646 152739 151656 150836 150294 149821 149351 148908 148489 148280 148717 150020 151852 153792 155886
51324 155886 158394 161157 163672 165748 167649 169535 171166 172284 172962 173419 173737 173952 174147 174215 173738 172358
51308 172358 170264 168109 166534 165866 166123 167028 168097 168968 169711 170618 171722 172702 173275 173398 173081 172356 171594
51291 171594 171517 172562 174412 176424 178401 180510 182502 183487 182770 180666 178255 176413 175264 174469 173795 173309
51275 173309 173233 173754 174985 176890 179098 180888 181623 181323 180674 180335 180288 180012 179208 178203 177690 178183 179603
51258 179603 181255 182282 182331 181794 181252 180790 180064 178879 177375 175653 173690 171705 170199 169352 168699 167723
51242 167723 166596 166007 166341 167318 168376 169102 169312 168961 168104 166821 165181 163385 161903 161300 161799 163112
51226 163112 164699 166166 167491 168991 171009 173476 175845 177643 179087 180848 183137 185263 186370 186413 186095
51211 186095 185956 185897 185680 185448 185485 185692 185737 185603 185648 186122 186940 187981 189229 190485 191281 191302 190671 189619 188169
51192 188169 186360 184461 182622 180583 178191 175960 174591 174023 173538 172827 172313 172302 172432 172280 171988 171850 171734
51175 171734 171420 171222 171641 172471 172894 172535 171994 172090 172914 173928 174788 175697 176947 178462 179959 181350 182681
51158 182681 183734 184104 183796 183386 183257 183006 182040 180583 179469 178995 178577 177770 176975 176751 176878 176645 175810 174726
51140 174726 173579 172059 169921 167548 165749 165090 165499 166452 167473 168413 169218 169623 169364 168693 168326 168715 169679
51123 169679 170871 172315 174177 176281 178188 179576 180271 180092 179098 177855 177098 177089 177535 178139 178909 179923 181030
51106 181030 181933 182519 183038 183881 185100 186197 186644 186590 186705 187227 187670 187716 187925 189048 190949 192762 193956
51089 193956 194678 195180 195468 195569 195638 195708 195682 195667 195957 196670 197688 199028 200939 203609 207079 211396 216538 222199
51071 222199 228025 234043 240438 246909 252748 257648 261965 266067 269899 273408 276792 279879 281600 280672
51057 280672 276832 271132 265071 259618 255005 251168 248228 246459 245795 245497 244536 242349 239153 235654 232720
51042 232720 231122 231063 231874 232528 232649 232676 232982 233237 232846 231707 230354 229640 230438 233201 237468 242024 245890
51025 245890 249032 251961 254915 257742 260376 263064 266130 269641 273213 276087 277662 278141 278434 279279 280681
51010 280681 282311 284110 286242 288817 292005 296146 301357 307142 312732 317712 322159 326367 330689 335362
50996 335362 340233 344911 349473 354614 360731 367229 373279 378897 384633 390505 396121 401783 408547 417021
50982 417021 426942 438333 452237 469676 490433 513516 538512 565875 596063 629045 664668 702974
50970 702974 743942 787206 832171 878199 924623 970698 1015646 1058673 1098964 1135774 1168532
50959 1168532 1196812 1220269 1238726 1252292 1261328 1266338 1268020 1267364 1265558 1263749 1262855 1263446 1265557 1268616
50945 1268616 1271713 1274098 1275413 1275536 1274240 1270972 1264865 1254993 1240789 1222263 1199717 1173242 1142589
50932 1142589 1107634 1068865 1027315 984045 939806 895152 850762 807534 766339 727698 691674
50921 691674 658085 626876 598315 572800 550434 530790 513142 496932 482033 468660 457110
50910 457110 447516 439639 432783 426149 419470 413265 408261 404555 401501 398502 395725 393922 393686 395005
50896 395005 397397 400249 403040 405533 407895 410603 414100 418565 423914 429819 435653 440706 444755 448433
50882 448433 452793 458428 465174 472710 481192 491095 502526 514957 527716 540648 554205 568956 585159
50869 585159 602848 622250 643908 668344 695730 726067 759662 797276 839820 888013 942271
50858 942271 1002729 1069286 1141861 1220601 1305602 1396299 1491393 1589553 1689961 1791875 1893767
50847 1893767 1993189 2087339 2173537 2249388 2313044 2363614 2401126 2426081 2439323 2442376 2437541 2427364
50835 2427364 2414121 2399903 2386940 2377481 2373291 2375387 2384156 2399447 2420295 2444457 2468357 2487786
50823 2487786 2499059 2499687 2488088 2462967 2423338 2369104 2301249 2221266 2130617 2030934 1924486
50812 1924486 1814095 1702584 1592448 1485970 1385294 1292099 1207142 1130284 1061131 999670
50802 999670 946146 900346 861273 827810 799573 776794 759363 746245 735900 727116 719444 713050
50790 713050 708171 704510 701118 697036 692039 686497 680634 674317 667610 661026 654927 649015 642678 635629
50776 635629 628037 620271 612735 605636 598651 591043 582479 573509 564968 557109 549693 542750 536841 532665
50762 532665 530735 531348 534430 539376 545445 552463 560908 571247 583442 597093 611820 627323 643319
50749 643319 659620 676293 693771 712834 734440 759421 788288 821322 858647 900082 945038
50738 945038 992802 1042912 1095088 1148867 1203452 1257843 1311019 1362101 1410523 1455831 1497070
50727 1497070 1532473 1560026 1578335 1586886 1585892 1576417 1560603 1541177 1520492 1500256 1482157 1468177
50715 1468177 1459917 1457799 1461188 1469150 1480852 1495312 1511045 1526100 1538462 1546376 1548282 1542563 1527647
50702 1527647 1502536 1467187 1422359 1369323 1309906 1246450 1181334 1116587 1054083 995770 943149
50691 943149 896614 855776 820369 790442 765795 745912 730575 719886 713519 710558 710490 713846 721374
50678 721374 732904 747388 763698 780898 798014 814180 828986 842293 853732 862763 869265 873748
50666 873748 877027 879922 883183 887299 892294 897986 904470 912044 920565 929256 937477 945594 954845 966319
50652 966319 980189 995917 1013088 1031909 1052941 1076433 1102034 1129082 1157013 1185409 1213706
50641 1213706 1240981 1266073 1288002 1306354 1321232 1332736 1340592 1344434 1344448 1341459 1336263 1328966 1319001
50628 1319001 1305660 1288710 1268838 1247741 1227555 1209899 1195376 1183912 1175347 1169673 1166945 1167175
50616 1167175 1170228 1175731 1183238 1192557 1203639 1216037 1228684 1240326 1249830 1255868 1256658 1250466 1236317
50603 1236317 1214033 1183966 1147149 1105499 1061220 1015803 969906 924199 879843 838021 799329
50592 799329 763898 731831 703284 678256 656516 637725 621564 607785 596217 586685 578967 572943
50580 572943 568773 566749 566958 569223 573338 579146 586365 594591 603577 613313 623680 634189 644296 653991
50566 653991 663957 675117 688025 702636 718587 735667 753919 773281 793250 813018 831896 849547
50554 849547 865909 881096 895327 908793 921651 934305 947619 962594 979856 999681 1022424
50543 1022424 1048493 1077861 1110021 1144708 1182378 1223862 1269867 1321143 1378688 1443113 1513733
50532 1513733 1588720 1666315 1745624 1826191 1907172 1987196 2064755 2138281 2205891 2265463 2315181
50521 2315181 2353804 2380225 2392980 2390609 2372651 2340056 2294445 2237226 2169800 2094511 2014893
50510 2014893 1934661 1856583 1782437 1713813 1652565 1600432 1558381 1526406 1503889 1490153 1484791
50499 1484791 1487579 1498224 1516274 1541122 1571802 1606595 1643012 1678235 1709358 1733026 1745298
50488 1745298 1742600 1723239 1687865 1638531 1577656 1507943 1432673 1355275 1278434 1203779 1132406
50477 1132406 1065357 1003489 947211 896597 851670 812384 778424 749243 724338 703417 686371
50466 686371 673224 664033 658588 656135 655574 656089 657550 660256 664410 669852 676196 683109 690533 698860
50452 698860 708837 721187 736208 753581 772207 790033 804281 812444 813441 807942 797727 784884
50440 784884 771430 759148 749302 742425 738424 736861 737246 739340 743356 749706 758447 769152 781440
50427 781440 795446 811493 829477 848933 869772 892721 918910 949035 982938 1019831 1058915
50416 1058915 1099797 1142348 1186151 1230274 1273662 1315573 1355495 1392791 1426665 1456292 1480648
50405 1480648 1498379 1508286 1510034 1503922 1489873 1467137 1435243 1394849 1347402 1294417 1237582 1179168
50393 1179168 1121560 1066318 1014158 965896 922863 886224 856302 832807 815392 803792 797751
50382 797751 797150 802066 812398 827547 846543 868241 891175 913477 933252 948908 958904 961579
50370 961579 955897 942425 923115 899928 873919 845621 815742 785082 754078 722870 691786 661498
50358 661498 632707 605879 581252 558908 538865 521187 506004 493294 482786 474282 467941 463952
50346 463952 461899 460789 459850 459057 458652 458417 457778 456636 455667 455605 456457 457687 459090 461140 464369 468635
50330 468635 473306 478085 483411 489951 497874 506779 516211 526093 536630 547971 559975 572269 584525
50317 584525 596796 609645 623946 640516 659923 682508 708449 737842 770972 808659 852174
50306 852174 902729 961432 1030201 1112260 1209824 1318968 1425850 1509273 1549798 1539208 1483318
50295 1483318 1396958 1296311 1194128 1098854 1015231 944766 886531 838694 799814 768984 745359
50284 745359 728047 716321 709540 706820 707088 709555 713928 720061 727676 736641 747408 760828 777316
50271 777316 796213 816046 835442 853688 870401 884904 896349 904600 910656 915850 920661 924537
50259 924537 926718 926769 924266 918496 908840 895282 878285 858427 836466 813567 791007 769620 749843
50246 749843 732218 717361 705165 694455 683846 672965 662635 653833 646575 639858 632686 625142
50234 625142 618281 612798 607982 602386 595524 588363 581930 575921 569190 561265 552761 544352 536010 527401
50220 527401 518531 509683 501068 492831 485179 478186 471617 465237 459170 453709 448816 444134 439541 435462
50206 435462 432494 430784 429868 429075 428055 426961 426142 425746 425676 425947 426850 428638 431145 433872 436388 438490
50190 438490 440050 440964 441240 440896 439714 437377 434018 430354 427059 424090 420936 417476 414264 411898 410392
50175 410392 409322 408419 407817 407790 408485 409897 411987 414807 418642 424026 431435 440931 452210 465096 479874
50160 479874 497076 517128 540324 567016 597496 631629 668711 707659 747214 785965 822573
50149 822573 856248 887013 915412 942066 967562 992442 1016809 1039778 1059508 1073891 1081140 1079937
50137 1079937 1069542 1050159 1023048 989956 952437 911793 869395 826654 784702 744515 707346
50126 707346 674552 646661 622879 601840 582766 565746 551182 539302 530085 523250 518223 514420
50114 514420 511617 509838 508816 507789 505966 503046 499241 494861 490013 484637 478838 473128 468174 464182
50100 464182 460758 457642 455313 454465 454973 455961 456921 458230 460423 463516 467340 471974 477319 482657 487280
50085 487280 491403 495943 501481 507963 515256 523368 531980 540323 547873 554855 561796 568777 575379 581224
50071 581224 586308 590747 594340 596513 596865 595774 594227 592867 591308 588632 584422 579105 573456 568194
50057 568194 563948 561113 559529 558575 557801 557385 557939 560040 563878 569142 575244 581916 589611 599091 610660
50042 610660 624103 639332 656706 676639 699146 723813 749857 776265 802317 828003 853420
50031 853420 877664 898905 915868 928781 938592 945859 950905 954485 957443 959648 959798 956258 947792
50018 947792 933691 913805 888635 859078 826022 790392 753522 717095 682558 650723 621879
50007 621879 596053 573200 553373 536760 523414 513008 505121 499696 496990 497018 499135 502117 504475
49994 504475 504871 502550 497464 489902 480154 468729 456668 445169 434768 425131 415771 406803 398973
49981 398973 393014 388903 385614 381732 376582 370714 365111 360131 355497 351061 347053 343637 340763 338560
49967 338560 337362 337114 337182 337073 337028 337565 338692 339941 341082 342420 344343 346845 349594 352329 355025 357605
49951 357605 359498 359698 357516 353335 348442 344003 340255 336670 332753 328643 325105 322965 322387 322643 322785
49936 322785 322551 322411 322718 323186 323413 323508 323836 324343 324595 324474 324411 324846 325756 326875 328082 329354 330571 331707
49918 331707 333142 335405 338401 341153 342498 342014 340109 337456 334623 332129 330341 329030 327405 324910
49904 324910 321854 318954 316412 313845 311071 308486 306540 305130 303752 302041 300005 297842 295754 293943
49890 293943 292657 292157 292549 293578 294713 295587 296318 297239 298436 299811 301558 304131 307575 311168 313982
49875 313982 315636 316401 316760 317100 317641 318395 319204 319993 320892 321994 323131 324103 325014 326070 327097 327570 327257
49858 327257 326603 326370 326984 328337 329988 331407 332177 332258 332079 332166 332583 332903 332838 332723 333192 334419 335880 336890
49840 336890 337288 337582 338529 340481 342989 345035 345870 345622 344913 343994 342638 340926 339631 339470 340309 341462
49824 341462 342503 343340 343763 343486 342672 341878 341367 340902 340328 339935 339973 340184 340089 339609 339091 338788 338550 338024 337035
49805 337035 335719 334329 332908 331271 329361 327480 325968 324836 323952 323434 323477 323853 324054 324008 324149 324645 325086
49788 325086 325245 325680 327083 329301 331504 333195 334504 335533 335995 335772 335426 335733 336735 337562 337328 336054
49772 336054 334567 333587 333140 332949 333033 333603 334518 335258 335486 335315 334929 334263 333204 331870 330549 329578 329324 329970
49754 329970 331202 332404 333346 334349 335628 336827 337527 337819 337995 337955 337411 336588 336235 336938 338722 341239 343955
49737 343955 346155 347246 347231 346697 346282 346316 346899 347997 349456 351211 353605 357146 361806 366725 370735 373068
49721 373068 373566 372565 370770 369004 367758 367009 366547 366371 366625 367397 368807 371244 375201 380755 387345 394123
49705 394123 400503 406419 412224 418330 424765 430891 435650 438314 439075 438881 438666 438740 438821 438499 437707 436904 436909
49688 436909 438408 441528 446003 451741 459003 467796 477207 485581 491375 493790 492862 489317 484364 479335
49674 479335 475319 473098 473278 476284 482236 490872 501301 511623 519103 521386 517768 509174 497152 483270
49660 483270 469236 456708 446495 438257 431234 425100 420041 416433 414657 414942 417151 420915 425939 431818
49646 431818 437558 441811 443821 443679 441587 437553 432086 426473 421736 417770 414097 410970 409042 408256 407829
49631 407829 407216 406472 405790 405282 405148 405484 405914 405929 405594 405475 405863 406532 407216 407878 408496 408991 409412 409867 410316
49612 410316 410761 411497 412701 413990 414886 415537 416342 416966 416538 414929 413119 412138 412232 413226 414933 416838 418099
49595 418099 418408 418420 418920 419961 421219 422655 424250 425440 425592 425024 424897 425898 427362 427915 426904 425095
49579 425095 424018 424588 426373 428256 429720 431262 433587 436714 440039 442993 445481 447832 450455 453451
49565 453451 456557 459580 462714 466090 469122 470857 471109 470714 470434 470090 469107 467487 465787 464370 463152
49550 463152 461977 460880 459989 459354 458788 457840 456247 454532 453763 454347 455481 456247 457012 459188 463646 469938
49534 469938 477148 485059 494236 505254 518033 531765 545336 557807 568595 577277 583406 586765 587757
49521 587757 587424 587048 587751 590254 594680 600333 605802 609487 610314 608171 603791 598176 592088 585965 580092
49506 580092 574658 569698 565094 560618 555952 550954 546081 542174 539441 536930 533609 529755 526557 524387
49492 524387 522343 519713 517040 515272 514598 514697 515522 517148 519262 521493 523887 526367 528070 528078 526702 525297
49476 525297 524785 525034 525679 526789 528531 530830 533700 537397 541892 546515 550416 553188 554814 555310 554648
49461 554648 552980 550732 548470 546590 545041 543415 541466 539374 537364 535373 533489 532449 533097 535392
49447 535392 538507 541962 546037 550970 556359 561641 566648 571334 575393 578640 581518 584802 588922 593887
49433 593887 599681 606321 613406 619833 624080 624966 622412 617621 612379 608012 605012 603414 603140 603944 605455
49418 605455 607501 610116 613146 616305 619759 624156 629759 636008 642374 649183 656996 665552 674077 682489
49404 682489 691470 701288 711275 720783 729987 739338 748694 757503 765579 773163 780301 786614 791748 795719
49390 795719 798695 800634 801262 800320 797774 793877 789120 784107 779374 775168 771315 767359 763010 758491 754367
49375 754367 751003 748318 746109 744359 743101 742146 741182 740111 739050 737979 736565 734438 731551 728193 724700
49360 724700 721148 717253 712573 706880 700369 693492 686667 680189 674315 669216 664838 661005 657684 655035
49346 655035 653176 652160 652353 654558 659422 666562 674346 680593 683625 682976 679357 673937 667526 660422 652949
49331 652949 645803 639597 634187 628803 622884 616623 610688 605585 601290 597302 593033 588241 583144 578080
49317 578080 573204 568690 564998 562621 561567 561418 561826 562614 563418 563722 563403 562908 562715 562900 563314 563717 563526
49300 563526 561931 558772 555017 551888 549660 547700 545552 543433 541784 540819 540657 541428 543030 545058 547168
49285 547168 549361 551828 554775 558492 563299 569131 575340 581198 586613 592155 598297 604838 611201 617185
49271 617185 623098 629055 634403 638179 640061 640550 640254 639356 637921 636264 634640 632780 630126 626428 621855
49256 621855 616643 610983 605256 600077 596019 593290 591517 589781 587187 583782 580690 578958 578477 578507 579021
49241 579021 580734 583740 586917 589115 590487 592173 595102 599550 605625 613451 622720 632461 641543 649452
49227 649452 656634 664107 672606 681882 690846 698463 704451 709197 713355 717669 722837 729108 736071 743187
49213 743187 750479 758442 767374 777176 787781 799332 811709 824237 836172 847273 857694 867535
49201 867535 876805 885692 894504 903339 912045 920525 928826 936939 944800 952582 960665 969173 977727 985822
49187 985822 993320 1000482 1007807 1016018 1025869 1037610 1050719 1064455 1078429 1092363 1105580 1117334
49175 1117334 1127602 1136992 1145815 1153771 1160624 1166581 1171792 1176076 1179532 1182891 1186778 1191025 1195237 1199744
49161 1199744 1205411 1212733 1221546 1231452 1242017 1252706 1263270 1274131 1285815 1297999 1309671 1320395
49149 1320395 1330912 1342286 1354809 1367974 1381181 1394264 1407547 1421529 1436392 1451796 1467349
49138 1467349 1483193 1499737 1516917 1534215 1551468 1569141 1587617 1606772 1626665 1648152 1672266
49127 1672266 1699167 1728293 1759584 1794167 1833731 1879563 1932538 1994219 2068062 2159583 2274642
49116 2274642 2415807 2577993 2746805 2903649 3037357 3154084 3273991 3412857 3562691
49107 3562691 3690204 3757236 3746618 3672042 3565481 3454573 3347888 3236665 3108068 2957855
49097 2957855 2793642 2629141 2476502 2342722 2230189 2138284 2064569 2005961 1959687 1923262
49087 1923262 1894068 1869810 1849469 1833168 1820863 1811537 1803763 1796605 1789848 1783818 1779170 1776398 1775192
49074 1775192 1774506 1773408 1771700 1769611 1767341 1765070 1762944 1760655 1757396 1752766 1747483 1742730 1738877 1735345
49060 1735345 1731695 1728225 1725298 1722618 1719554 1715882 1711837 1707622 1703248 1698758 1694226 1689595 1684858 1680445
49046 1680445 1677010 1674724 1673110 1671766 1670944 1671178 1672579 1674854 1677849 1681664 1686284 1691408 1696699 1701993
49032 1701993 1707235 1712423 1717549 1722405 1726534 1729662 1732124 1734497 1736767 1738244 1738548 1738305 1738618 1739960 1741856
49017 1741856 1743571 1744938 1746502 1748951 1752469 1756701 1761354 1766594 1772642 1779148 1785412 1791226 1797024 1803066
49003 1803066 1808890 1813857 1817924 1821584 1825283 1829131 1832988 1836493 1839123 1840517 1840696 1839817 1837928 1835157
48989 1835157 1831936 1828688 1825375 1821597 1817076 1811773 1805646 1798661 1791057 1783351 1775987 1769153 1762964 1757606
48975 1757606 1753209 1749710 1746987 1745031 1743946 1743801 1744628 1746578 1749939 1754865 1760998 1767608 1774176 1780685
48961 1780685 1787193 1793357 1798784 1803701 1808790 1814334 1820013 1825621 1831484 1837943 1844888 1852096 1859701 1868042
48947 1868042 1877363 1887932 1900062 1913690 1928299 1943595 1959968 1977974 1997794 2019586 2043881
48936 2043881 2070987 2100344 2131143 2163371 2197550 2233594 2270704 2308395 2346900 2386456 2426813
48925 2426813 2467672 2509020 2550816 2592796 2634775 2676675 2718121 2758488 2797542 2835561 2872631
48914 2872631 2908280 2942069 2974046 3004300 3032562 3058679 3083087 3106378 3128659 3149772 3169880
48903 3169880 3189394 3208455 3226940 3244838 3262215 3278860 3294404 3308799 3322346 3335221 3347241
48892 3347241 3358133 3367672 3375481 3381016 3383978 3384615 3383440 3380762 3376618 3370993 3363821 3354761 3343227 3328821
48878 3328821 3311653 3292102 3270367 3246479 3220674 3193457 3165204 3135926 3105501 3073798 3040467
48867 3040467 3005035 2967642 2929369 2891351 2853680 2815681 2777170 2738904 2701734 2665875 2631116
48856 2631116 2597303 2564453 2532852 2503229 2476393 2452460 2430833 2411121 2393547 2378164 2364312
48845 2364312 2351419 2339937 2330747 2323872 2318490 2314154 2311267 2310170 2310394 2311160 2312269 2314138 2317181 2321415
48831 2321415 2326572 2332341 2338518 2345069 2352051 2359391 2366804 2374022 2381049 2388049 2394986 2401558 2407680 2413960
48817 2413960 2421330 2429990 2438953 2446998 2453996 2460930 2468684 2477315 2486592 2496645 2507584 2518908 2529885
48804 2529885 2540449 2551220 2562679 2574666 2586662 2598186 2608977 2619242 2629775 2641422 2654210
48793 2654210 2667298 2679866 2691700 2702779 2712775 2721366 2728785 2735614 2742124 2748163 2753635 2758716 2763541
48780 2763541 2767969 2771762 2774728 2776501 2776473 2774196 2769771 2763593 2755740 2745855 2733610 2718993 2702065 2682747
48766 2682747 2661134 2637797 2613469 2588473 2562737 2536298 2509398 2482043 2453923 2424971 2395703
48755 2395703 2366698 2338037 2309585 2281643 2254876 2229629 2205683 2182769 2160996 2140676 2122011
48744 2122011 2105128 2090212 2077413 2066752 2058237 2051992 2048162 2046760 2047600 2050282 2054218 2058904 2064233
48731 2064233 2070394 2077377 2084876 2092725 2101069 2109772 2118056 2125277 2131955 2139368 2147945 2156550 2163626 2168640
48717 2168640 2172095 2174635 2176703 2178847 2181543 2184542 2186967 2188364 2189330 2190762 2192799 2194872 2196619 2198324
48703 2198324 2200459 2203164 2206282 2209677 2213336 2217283 2221494 2225929 2230654 2235969 2242362 2250266 2259909 2271468
48689 2271468 2285278 2301856 2321899 2346492 2377267 2416133 2464917 2525517 2600449 2693030 2806958
48678 2806958 2945687 3111679 3305073 3521725 3751665 3979086 4184123 4345918 4446300
48669 4446300 4473323 4423751 4303753 4127560 3914252 3683574 3452355 3232843 3032818 2856265
48659 2856265 2703954 2574342 2464867 2372793 2295214 2229065 2171800 2121999 2078894 2041418 2008102
48648 2008102 1977858 1950317 1925227 1901889 1879465 1857577 1836336 1815871 1796090 1776827 1757969
48637 1757969 1739388 1720918 1702555 1684590 1667463 1651430 1636428 1622289 1609077 1597115 1586598
48626 1586598 1577209 1568215 1558975 1549329 1539484 1529652 1519907 1510345 1501191 1492595 1484469 1476666 1469353 1462980
48612 1462980 1457838 1453760 1450312 1447120 1443883 1440274 1436060 1431258 1425980 1420259 1414274 1408661 1404231 1401262
48598 1401262 1399310 1397734 1396153 1394327 1391962 1388819 1384690 1379106 1371462 1361736 1350773 1339533 1328319
48585 1328319 1317166 1306631 1297547 1290059 1283593 1277852 1273287 1270295 1268463 1266972 1265367 1263534 1261180
48572 1261180 1257821 1253174 1247195 1239817 1230996 1221006 1210370 1199493 1188627 1178246 1169069 1161538 1155391
48559 1155391 1149936 1144635 1139393 1134394 1129793 1125512 1121317 1117100 1112984 1109028 1104969 1100591 1096253 1092600
48545 1092600 1089551 1086096 1081483 1076274 1071769 1068563 1066133 1063718 1061027 1058089 1055035 1052280 1050445 1049688
48531 1049688 1049384 1048790 1047872 1047253 1047507 1048662 1050200 1051248 1051006 1049292 1046611 1043604 1040617 1037938 1035938
48516 1035938 1034538 1032837 1029868 1025734 1021544 1018213 1015710 1013471 1011093 1008564 1006241 1004712 1004333 1004756
48502 1004756 1005139 1004886 1003895 1002167 999621 996362 992712 988904 985113 981758 979151 976753 973492 969163 964927
48487 964927 961998 960388 959365 958472 957410 955544 952556 949342 947191 946048 944476 941531 937838 934594
$$ [...]
##END NTUPLES=NMR SPECTRUM
##END=
