##TITLE=NES1071_159122.0002_001_9705654_qWYHiq8yM4
##JCAMPDX= 6.0         $$ Bruker NMR JCAMP-DX V2.0
##DATA TYPE= NMR SPECTRUM
##DATA CLASS= NTUPLES
##ORIGIN= BRUKER
##OWNER= Administrator
$$ 1.72 TOPSPIN		Version 2.1
$$ 2016-04-30 19:03:29.411 -0700  Administrator@X
$$ Compression mode = diff/dup
##.OBSERVE FREQUENCY= 400.02188249412
##.OBSERVE NUCLEUS= ^1H
##.ACQUISITION MODE= SIMULTANEOUS (DQD)
##.ACQUISITION SCHEME= undefined
##.AVERAGES= 8
##.DIGITISER RES= 22
##SPECTROMETER/DATA SYSTEM= spect
##.PULSE SEQUENCE= zg30
##.SOLVENT NAME= COFFEE_meoh
##.SHIFT REFERENCE= INTERNAL, COFFEE_meoh, 1, 14.98509
##AUDIT TRAIL= $$ (NUMBER, WHEN, WHO, WHERE, PROCESS, VERSION, WHAT)
$$ ##TITLE= Audit trail, TOPSPIN		Version 2.1
$$ ##JCAMPDX= 5.01
$$ ##ORIGIN= Bruker BioSpin GmbH
$$ ##OWNER= Administrator
$$ $$ E:\/data/COFFEE/nmr/NES1071_159122.0002_001_9705654_qWYHiq8yM4/10/pdata/1/auditp.txt
$$ ##AUDIT TRAIL=  $$ (NUMBER, WHEN, WHO, WHERE, PROCESS, VERSION, WHAT)
(   1,<2016-04-30 19:03:22.239 -0700>,<Administrator>,<X>,<go>,<TOPSPIN 2.1>,
      <created by zg
	started at 2016-04-30 19:02:16.317 -0700,
	POWCHK enabled, PULCHK disabled,
       configuration hash MD5:
       21 0F 79 D6 B3 7B B4 F6 88 20 88 DB 03 48 BD 9F
       data hash MD5: 64K
       EF B3 B9 7F 58 56 86 21 C5 1E E0 4C ED 71 86 9F>)
(   2,<2016-04-30 19:03:25.349 -0700>,<Administrator>,<X>,<proc1d>,<TOPSPIN 2.1>,
      <Start of raw data processing
       efp LB = 0 FT_mod = 6 PKNL = 1 PHC0 = 0 PHC1 = 0 SI = 32K 
       data hash MD5: 32K
       99 64 8D AA 67 41 32 14 D3 7B 9E 16 25 90 F2 D2>)
(   3,<2016-04-30 19:03:25.630 -0700>,<Administrator>,<X>,<proc1d>,<TOPSPIN 2.1>,
      <pk PHC0 = 93.64197 PHC1 = 0 
       data hash MD5: 32K
       EB DF 0D 16 9A 6F DC 76 95 1A 8A 04 7D 1F 6A 09>)
(   4,<2016-04-30 19:03:25.755 -0700>,<Administrator>,<X>,<proc1d>,<TOPSPIN 2.1>,
      <abs ABSG = 1 
       data hash MD5: 32K
       BA 89 66 8A D1 29 CD 5F 68 C3 01 D3 C2 3B E7 DF>)
(   5,<2016-04-30 19:03:25.817 -0700>,<Administrator>,<X>,<proc1d>,<TOPSPIN 2.1>,
      <abs ABSG = 2 
       data hash MD5: 32K
       2A D6 BD E0 2B 96 3C 86 27 67 9A DF 3A 0A D6 8E>)
(   6,<2016-04-30 19:03:25.880 -0700>,<Administrator>,<X>,<proc1d>,<TOPSPIN 2.1>,
      <abs ABSG = 3 
       data hash MD5: 32K
       8A 2A A6 58 5A F4 03 EC E6 6D 34 B2 97 79 9B EB>)
(   7,<2016-04-30 19:03:25.942 -0700>,<Administrator>,<X>,<proc1d>,<TOPSPIN 2.1>,
      <abs ABSG = 4 
       data hash MD5: 32K
       E4 51 DD 19 24 26 41 A5 C6 46 4A AF 78 1D CB 67>)
(   8,<2016-04-30 19:03:26.005 -0700>,<Administrator>,<X>,<proc1d>,<TOPSPIN 2.1>,
      <abs ABSG = 5 
       data hash MD5: 32K
       53 52 31 87 1A 20 C2 93 7F 5F D5 93 16 34 66 A8>)
$$ ##END=
$$ 
$$ $$ hash MD5
$$ $$ 92 C9 C3 BE 02 16 43 CD AF 15 04 4F 95 70 9E E3
##$RELAX= 
##$RELAX= 
##$RELAX= 
##$RELAX= 
##$RELAX= 
##$RELAX= 
##$RELAX= 
$$ Bruker specific parameters
$$ --------------------------
##$DU= <E:\>
##$EXPNO= 10
$$ [...]
150 150 150 150 150 150 150 150
##$TP07= 0
##$TPNAME0= <>
##$TPNAME1= <>
##$TPNAME2= <>
##$TPNAME3= <>
##$TPNAME4= <>
##$TPNAME5= <>
##$TPNAME6= <>
##$TPNAME7= <>
##$TPOAL= (0..7)
0.5 0.5 0.5 0.5 0.5 0.5 0.5 0.5
##$TPOFFS= (0..7)
0 0 0 0 0 0 0 0
##$TUNHIN= 0
##$TUNHOUT= 0
##$TUNXOUT= 0
##$USERA1= <user>
##$USERA2= <user>
##$USERA3= <user>
##$USERA4= <user>
##$USERA5= <user>
##$V9= 5
##$VALIST= <valist>
##$VCLIST= <CCCCCCCCCCCCCCC>
##$VD= 0
##$VDLIST= <DDDDDDDDDDDDDDD>
##$VPLIST= <PPPPPPPPPPPPPPP>
##$VTLIST= <TTTTTTTTTTTTTTT>
##$WBST= 2048
##$WBSW= 25
##$XGAIN= (0..3)
0 0 0 0
##$XL= 0
##$YL= 0
##$YMAX_a= 564777
##$YMIN_a= -477333
##$ZGOPTNS= <>
##$ZL1= 120
##$ZL2= 120
##$ZL3= 120
##$ZL4= 120
##$ABSF1= 14.98509
##$ABSF2= -5.573092
##$ABSG= 5
##$ABSL= 3
##$ALPHA= 0
##$AQORDER= 0
##$ASSFAC= 0
##$ASSFACI= 0
##$ASSFACX= 0
##$ASSWID= 0
##$AUNMP= <proc_prof1d_extract_pilot.lims>
##$AXLEFT= 0
##$AXNAME= <>
##$AXNUC= <1H>
##$AXRIGHT= 0
##$AXTYPE= 0
##$AXUNIT= <>
##$AZFE= 0.1
##$AZFW= 0.1
##$BCFW= 0
##$BC_mod= 0
##$BYTORDP= 0
##$COROFFS= 0
##$CY= 15
##$DATMOD= 1
##$DC= 0
##$DFILT= <>
##$DTYPP= 0
##$F1P= 0
##$F2P= 0
##$FCOR= 0.5
##$FTSIZE= 32768
##$FT_mod= 6
##$GAMMA= 0
##$GB= 0
##$INTBC= 1
##$INTSCL= 1
##$ISEN= 128
##$LB= 0
##$LEV0= 0
##$LPBIN= 0
##$MAXI= 10000
##$MC2= 0
##$MEAN= 0
##$ME_mod= 0
##$MI= 0
##$NCOEF= 0
##$NC_proc= -8
##$NLEV= 6
##$NOISF1= 0
##$NOISF2= 0
##$NSP= 0
##$NTH_PI= 0
##$NZP= 0
##$OFFSET= 14.98509
##$PC= 1
##$PHC0= 93.64197
##$PHC1= 0
##$PH_mod= 1
##$PKNL= yes
##$PPARMOD= 0
##$PPDIAG= 0
##$PPIPTYP= 0
##$PPMPNUM= 2147483647
##$PPRESOL= 1
##$PSCAL= 4
##$PSIGN= 0
##$PYNMP= <proc.py>
##$REVERSE= no
##$SF= 400.02
##$SI= 32768
##$SIGF1= 0
##$SIGF2= 0
##$SINO= 400
##$SIOLD= 32768
##$SPECTYP= <>
##$SREGLST= <1H.CDCl3>
##$SSB= 0
##$STSI= 32768
##$STSR= 0
##$SW_p= 8223.68421052631
##$SYMM= 0
##$S_DEV= 0
##$TDeff= 65536
##$TDoff= 0
##$TI= <>
##$TILT= no
##$TM1= 0
##$TM2= 0
##$TOPLEV= 0
##$USERP1= <user>
##$USERP2= <user>
##$USERP3= <user>
##$USERP4= <user>
##$USERP5= <user>
##$WDW= 1
##$XDIM= 32768
##$YMAX_p= 422608186
##$YMIN_p= -609067
##$CURPLOT= <Network HP LaserJet P1505>
##$CURPRIN= <$Network HP LaserJet P1505>
##$DFORMAT= <normdp>
##$LAYOUT= <+/1D_H.xwp>
##$LFORMAT= <normlp>
##$PFORMAT= <normpl>
##$SURQMSG= 1
$$ End of Bruker specific parameters
$$ ---------------------------------
##NTUPLES= NMR SPECTRUM
##VAR_NAME=  FREQUENCY,     SPECTRUM/REAL,   SPECTRUM/IMAG
##SYMBOL=    X,             R,               I
##VAR_TYPE=  INDEPENDENT,   DEPENDENT,       DEPENDENT
##VAR_FORM=  AFFN,          ASDF,            ASDF
##VAR_DIM=   32768,         32768,           32768
##UNITS=     HZ,            ARBITRARY UNITS, ARBITRARY UNITS
##FACTOR=    0.250966925370066, 1,           1
##FIRST=     8223.43324360094, -246698,      13558
##LAST=      0,             -102493,         -144218
##MIN=       0,             -609067,         0
##MAX=       8223.43324360094, 422608186,    0
$$ Real data points
##PAGE= N=1
##DATA TABLE= (X++(R..R)), XYDATA
$$ [...]
19528A3310L78236a09125r1419J589c9851j531p287A9257d36602A92081M2464
$$ 13310 391546 -109125 -200544 -198955 -39851 -41382 -48669 19257 -436602 192081 234545
19517B34545J39466a88233b6211j9446B9932a66674B58322r8337b49511A76028
$$ 234545 374011 -188233 -26211 -45657 29932 -166674 258322 159985 -249511 176028
19506b35512j04549a33594B99887A24452M5454k3218E215b60026O6308I4454b68413
$$ -235512 -340061 -133594 299887 124452 169906 146688 5215 -260026 -193718 94454 -268413
19494B12893b37722Q6889N4779j57901J16660k47470A9730a69757a8808l455r368
$$ 212893 -237722 -150833 -96054 -253955 -137295 -384765 19730 -169757 -18808 -22263 -31631
19483c1631j11943d9154r3269g0769j46835a05577K0762B08142L9042a10174p2287
$$ -31631 -143574 -49154 -142423 -70769 -217604 -105577 -84815 208142 247184 -110174 -182461
19472a82461g8190I2675a9217F8614R6482J6564a89253A48991a7050j2209F1459
$$ -182461 -78190 92675 -19217 68614 165096 181660 -189253 148991 -17050 -29259 61459
19460A34496C8308R5341a23004b9529C03328b12921C67872B729c73040i0684a4063
$$ 134496 38308 133649 -123004 -29529 303328 -212921 367872 2729 -373040 -90684 -14063
19448D27013g5026A8771a02993C95701A6119g2610r233E5953i1956k73373a8060
$$ 427013 -75026 18771 -102993 395701 16119 -72610 -81843 55953 -91956 -365329 -18060
19436b79735A69422a13663D97588b80158Q1934M2647j72280a03862r6632R7475
$$ -279735 169422 -113663 497588 -280158 -198224 -155577 -327857 -103862 -200494 -103019
19426a03019q7013P1574j31392O8967A9929a48432l137j65889E3758a78027j40722
$$ -103019 -190032 -118458 -249850 -180883 19929 -148432 -151569 -317458 53758 -178027 -318749
19415c18749B32605a53322c4543l3415j40248B6543c9214p3531k6128A86087o3923
$$ -318749 232605 -153322 -34543 -67958 -208206 26543 -39214 -112745 -138873 186087 122164
19404A22164C3501L0994d0537k09093H9743l8784a43429A12474a97341d2914A66668
$$ 122164 33501 64495 -40537 -249630 89743 50959 -143429 112474 -197341 -42914 166668
19392A6010N7435R4626a10433A33712j2692c68601a59748F4374c30243a14570
$$ 16010 73445 168071 -110433 133712 121020 -368601 -159748 64374 -330243 -114570
19381D47844a57860H6448f066A06166k3525a20357a7937m8420I1777Q7528j054
$$ 447844 -157860 86448 -6066 106166 82641 -120357 -17937 -66357 91777 179305 178251
19370A78251f1431B33761a89372A50621a50153A37176l3784b2715p4309I6089
$$ 178251 -61431 233761 -189372 150621 -150153 137176 103392 -22715 -97024 96089
19359c16210B35255a61135F9078f0043k20913J15581j13404e9567k83544a15323
$$ -316210 235255 -161135 69078 -60043 -280956 -165375 -278779 -59567 -343111 -115323
19348A42266B8453P1749a02565A79647b43572Q9894K2743o2138A94070g1834E0335
$$ 142266 28453 100202 -102565 179647 -243572 -153678 -130935 -193073 194070 -71834 50335
19336a70096Q4626K667j9912j17123b7292A54048b32281J02660N3745B16603a27583
$$ -170096 -85470 -82803 -102715 -219838 -27292 154048 -232281 -129621 -75876 216603 -127583
19324B97022a17657A47137a01794L5749A15613a77845c660k58565e4917j49355
$$ 297022 -117657 147137 -101794 -66045 115613 -177845 -3660 -262225 -54917 -204272
19314b04272e6815k97872J74442N906n4877D1942d71346a04357p265M3873H5377
$$ -204272 -56815 -354687 -180245 -174339 -229216 41942 -471346 -104357 -111622 -67749 85377
19302c31562a31990M9158K2299n8987A90186K33869b20017R9209A162g6931D9064
$$ -331562 -131990 -82832 -60533 -119520 190186 424055 -220017 -120808 1162 -76931 49064
19290a21141C8022a48445J0496B06850a2453p123p5355b3761C98829a03550H3788
$$ -121141 38022 -148445 -137949 206850 -12453 -19576 -94931 -23761 398829 -103550 83788
19278a74820A26065b26125l4078a19773B91877A8271Q4803j7833a1202q9741d267
$$ -174820 126065 -226125 -260203 -119773 291877 18271 103074 85241 -11202 -100943 -4267
19266c63505e5028o6117b8797k035j7312B0117c27286a9064E5272a69266N2271
$$ -363505 -55028 -121145 -28797 -30832 -48144 20117 -327286 -19064 55272 -169266 -116995
19255a16995B17102a89150L7605D2275a85684G1662N7087N133a03582M5969K5678
$$ -116995 217102 -189150 -151545 42275 -185684 71662 128749 133882 -103582 -57613 -31935
19244c1935A90474b03439b1323k42319h4088B14572d3038H1536b84560Q9448a4335
$$ -31935 190474 -203439 -21323 -263642 -84088 214572 -43038 81536 -284560 -195112 -14335
19232D5842j2585J67216i7201k18491a2236l47593D6015h6482l01084I0649b8094
$$ 45842 33257 200473 -97201 -315692 -12236 -359829 46015 -86482 -387566 90649 -28094
19220a92349J9481I2456e6085j88712O7778j36139J20692B25698H6215i4586C275
$$ -192349 -172868 92456 -56085 -244797 -177019 -313158 -192466 225698 86215 -94586 3275
19208e8893l8634f668B2883L91306c41237f3876k88670a8010A56667c89341A21429
$$ -58893 -97527 -6668 22883 414189 -341237 -63876 -352546 -18010 156667 -389341 121429
19196b97958h7523C4626O4771B6923d8197j95239e4711E50040b12767B8008K13
$$ -297958 -87523 34626 99397 26923 -48197 -243436 -54711 550040 -212767 28008 28221
19185B8221d8354D6461c26635P5258a07704C4301b06413h5658b0843C5429a22085
$$ 28221 -48354 46461 -326635 -251377 -107704 34301 -206413 -85658 -20843 35429 -122085
19173A7368g0977c0113q7445M7109A70463D8571J13511j6471i7841o5228A44362
$$ 17368 -70977 -30113 -117558 -70449 170463 48571 162082 145611 -97841 -163069 144362
19161b95973J46210B0968e5421q4999A4677b35213e2427F2009a19769L1097j02882
$$ -295973 -149763 20968 -55421 -140420 14677 -235213 -52427 62009 -119769 -88672 -191554
19150a91554A33571N6455d8881A73878F174L53346c58577P2570j2543B17326j0434
$$ -191554 133571 190026 -48881 173878 6174 359520 -358577 -286007 -298550 217326 206892
19139B06892R2048A47035h5482B55705I334a00001A8026M2036K1511L356h4139
$$ 206892 298940 147035 -85482 255705 9334 -100001 18026 60062 81573 84929 -84139
19127c9529B66564h7733l327E3670a51428A00570K14797b41166I9336a64792b7485
$$ -39529 266564 -87733 -91060 53670 -151428 100570 315367 -241166 99336 -164792 -27485
19115a06065J2801B45415b40463D861a24473K6881A69777c96203c9243A45881
$$ -106065 -93264 245415 -240463 4861 -124473 -97592 169777 -396203 -39243 145881
19104A30619b92151B89006c4475k31328E67c20709I2829L3020b97827J03774j64016
$$ 130619 -292151 289006 -34475 -265803 567 -320709 92829 125849 -297827 -194053 -358069
19093c58069P3350C0453b83926B63559r2705c7300E33972b4643j90726A17433
$$ -358069 -284719 30453 -283926 263559 170854 -37300 533972 -24643 -215369 117433
19082a33911A0078f3281p4905G3389e7951q8018K87d7486m0947L0725A76614D2427
$$ -133911 10078 -63281 -138186 73389 -57951 -145969 -145682 -47486 -88433 -57708 176614 42427
19069e7591k40483B00671L125e7156H3823c41137H9866a80703j52088l5824A60000
$$ -57591 -298074 200671 203796 -57156 83823 -341137 89866 -180703 -332791 -368615 160000
19057e3973A01706f394n998p0373B03677m7158d6564j70997a04366r1678R6229
$$ -53973 101706 -6394 -12392 -82765 203677 156519 -46564 -217561 -104366 -196044 -99815
19046i9815B6861a25690N3612f893q7498B5665b69486J25202f2505A91096q3452
$$ -99815 26861 -125690 -72078 -6893 -94391 25665 -269486 -144284 -62505 191096 107644
19035A07644j0684Q6919b1560F8655J93146A0220L5276a38481A14490C779a83327
$$ 107644 96960 183879 -21560 68655 261801 10220 45496 -138481 114490 3779 -183327
19023b09731A11627J14628a42089B97531h502j85988f4240K2056p4554A25580
$$ -209731 111627 226255 -142089 297531 -8502 -194490 -64240 -42184 -116738 125580
19012i4546K3758d681E8596a25523B13389G7886a26676q0720K502p8977a24146
$$ -94546 -70788 -4681 58596 -125523 213389 77886 -126676 -207396 -204894 -283871 -124146
19000d1291J3330q0716E4777K47161C6177c2691I3147j7974A3820a81836J3654
$$ -41291 -27961 -108677 54777 301938 36177 -32691 93147 75173 13820 -181836 -168182
18989a68182A13707E5078a91323l46874B95034a42428c8876r3226D1624Q8081
$$ -168182 113707 55078 -191323 -538197 295034 -142428 -38876 -132102 41624 129705
18979A29705b15800E207a85716L005A01821h7359B21542I0279J27879i9224A312
$$ 129705 -215800 5207 -185716 -182711 101821 -87359 221542 90279 218158 -99224 1312
18967b62470B74097a93416c2870H0698a63486q3418a02149M4068j8441D9882c35271
$$ -262470 274097 -193416 -32870 80698 -163486 -246904 -102149 -58081 -76522 49882 -335271
18955d2775A28812E7262i0353A23973n7251c19830a13124n861C051K6933N5045
$$ -42775 128812 57262 -90353 123973 66722 -319830 -113124 -118985 3051 29984 85029
18944H5029a24487j72594B42122i8117D3352J03016a37545o4559I8757J7592A9235
$$ 85029 -124487 -297081 242122 -98117 43352 146368 -137545 -202104 98757 116349 19235
18932a18455J1300k9426M3236C3282a69137P7263e073m8679H6357a79424P9774
$$ -118455 -107155 -136581 -93345 33282 -169137 -91874 -5073 -53752 86357 -179424 -99650
18921i9650B13246E9065a58035F8135c42533B08277a86284A33962J17328J3590
$$ -99650 213246 59065 -158035 68135 -342533 208277 -186284 133962 251290 264880
18911B64880B3457J02204i7042B23965d165C55143a14410B1668K4367Q6175N392
$$ 264880 23457 125661 -97042 223965 -4165 355143 -114410 21668 46035 132210 137602
18900A37602b88940d6411G6167f9942k7000H480J44157E1809K2410e6708k86825
$$ 137602 -288940 -46411 76167 -69942 -96942 8480 152637 51809 74219 -56708 -343533
18889c43533D4362b80160B01556b25709H5863K8068O4425a77549E1613J71629
$$ -343533 44362 -280160 201556 -225709 85863 113931 178356 -177549 51613 223242
18879B23242q1335G199i1733E8616a59481o0525R1519o4992q8327g1726A45319
$$ 223242 141907 7199 -91733 58616 -159481 -220006 -128487 -193479 -281806 -71726 145319
18867b19597A97889b59507A04788b18626A43826b10438g1955p7356B4215a04216
$$ -219597 197889 -259507 104788 -218626 143826 -210438 -71955 -149311 24215 -104216
18856b59605a15473b2724I8927a53046k54621C18003E013K5714J67655a10662
$$ -259605 -115473 -22724 98927 -153046 -407667 318003 5013 30727 198382 -110662
18845c3163j78270j42684J71277B76211j24114a49344B22663B0041b5146j52404
$$ -33163 -211433 -354117 -182840 276211 152097 -149344 222663 20041 -25146 -177550
18835a77550H895c9249A25599a90094A7470a52624k8622A62898a66082K3683D2709
$$ -177550 8895 -39249 125599 -190094 17470 -152624 -181246 162898 -166082 -142399 42709
18823A48613f7878b9297j47898e9702A28821n4210f1j75030j22329b9103A20012
$$ 148613 -67878 -29297 -177195 -59702 128821 74611 -61 -175091 -297420 -29103 120012
18811C51060l9401j24348J3711b44622A43880a50441l60822a41394M1227C59154
$$ 351060 311659 187311 201022 -244622 143880 -150441 -511263 -141394 -100167 359154
18800c79793E5579L7011J54168c3604I1687m1979f6130K0765j41254a9131A19481
$$ -379793 55579 92590 246758 -33604 91687 49708 -66130 -45365 -186619 -19131 119481
18788d00878A01193c3684D2002a082G4331h2334n9500m7901L8238D1707a0989
$$ -400878 101193 -33684 42002 -1082 74331 -82334 -141834 -189735 -151497 41707 -10989
18776a86859C9249b15022r6165H4440A2529P1220N9032a31602j08362I9066b49596
$$ -186859 39249 -215022 -311187 84440 12529 83749 142781 -131602 -239964 99066 -249596
18764d4805H5915b68588A5300c4595j16820A15841d889j5787j52958G3927L2686
$$ -44805 85915 -268588 15300 -34595 -151415 115841 -4889 -20676 -173634 73927 106613
18753A06613k7314j4753a05069o7594J559H874b4850m3831B44949I5772P9415
$$ 106613 79299 64546 -105069 -172663 -171104 8874 -24850 -68681 244949 95772 175187
18742A75187a58756H4362A3150h1694H1588a15325l7098O8582b3407j89697b6843
$$ 175187 -158756 84362 13150 -81694 81588 -115325 -152423 -83841 -23407 -213104 -26843
18730c66001J54271C588J14654f6513q6562n2625A56458b27393o5130A77845b27918
$$ -366001 -211730 3588 118242 -66513 -153075 -205700 156458 -227393 -292523 177845 -227918
18718a79251A60379n5997b59233k1665A25689a73492n6861O3411F930a08098G2629
$$ -179251 160379 104382 -259233 -280898 125689 -173492 -230353 -166942 6930 -108098 72629
18706C66009a24635B15776d3843j29910q9613e6771c10n3329B38117H8857a77651
$$ 366009 -124635 215776 -43843 -173753 -263366 -56771 -310 -53639 238117 88857 -177651
18694A10014e3053C0860e802j09393N6986l6992j79636g4883A14272i9431j69626
$$ 110014 -53053 30860 -5802 -115195 -58209 -95201 -274837 -74883 114272 -99431 -269057
18683b69057A52070b63418J459C17728M69c5740B605f1277l767j29733e6105A6382
$$ -269057 152070 -263418 -261959 317728 318197 -35740 2605 -61277 -65044 -194777 -56105 16382
18670A04438b44693C3244a72887n4144A31205E2024p437J09439n0098f1064E1656
$$ 104438 -244693 33244 -172887 -227031 131205 52024 44587 154026 103928 -61064 51656
18658H5738i0457j21393c6315k667j70820h0114R662j869G9007J1138c5412M616
$$ 85738 -90457 -211850 -36315 -38982 -209802 -80114 -70452 -72321 79007 90145 -35412 -30796
18646c0796o8833E6199a44952B59750c2870A71681a59013d7672j82781M8778O5535
$$ -30796 -99629 56199 -144952 259750 -32870 171681 -159013 -47672 -230453 -181675 -116140
18635a16140D5592b4320e900j09230p7459B01573H1441b35200J03949I6067c31514
$$ -116140 45592 -24320 -5900 -115130 -192589 201573 81441 -235200 -131251 96067 -331514
18623a61258K2483a4908B06969B5292a5329A94196r2239R7103A5732c75842C7558
$$ -161258 -138775 -14908 206969 25292 -15329 194196 101957 199060 15732 -375842 37558
18611e6502A0318K07378a02655l774A7877J32603Q030a07837G8745L3858p98J57605
$$ -56502 10318 217696 -102655 -106429 17877 150480 158510 -107837 78745 112603 111805 269410
18599B69410A15017d8823k3499j9062J0025B74064C8918l643q992g6217r8652
$$ 269410 115017 -48823 -72322 -91384 -81359 274064 38918 35275 26283 -76217 -174869
18588a74869a4132j61430A50375a80118P8256q8808D7610R2283b17793I7787k2581
$$ -174869 -14132 -175562 150375 -180118 -101862 -190670 47610 139893 -217793 97787 75206
18577G5206i1503E9616c39423q5160A9912b7791A0664a67393C9994r006b98737
$$ 75206 -91503 59616 -339423 -424583 19912 -27791 10664 -167393 39994 30988 -298737
18565i7646B57102b07560f6762j06014C61177f4763r6774M6784A1524A458J19676
$$ -97646 257102 -207560 -66762 -172776 361177 -64763 -161537 -114753 11524 1458 121134
18554A21134J23720R482a3335F964b2595n7610J4434F0631k6706a13853A86828
$$ 121134 244854 254336 -13335 6964 -22595 -80205 -65771 60631 33925 -113853 186828
18542a60521l8718I6205A0616P2370b49769a24819a9802G7584L0705f9543A13968
$$ -160521 -199239 96205 10616 82986 -249769 -124819 -19802 77584 108289 -69543 113968
18530a16612q0051I324J84183a68502i466F6382e55109a08276C63511B2685b37612
$$ -116612 -196663 9324 193507 -168502 -9466 66382 -555109 -108276 363511 22685 -237612
18518a9666F857b07528L1414k07253A09112d9740j80594Q8776j54529J4451F0594
$$ -19666 6857 -207528 -176114 -383367 109112 -49740 -230334 -141558 -296087 -281636 60594
18506h8670n508k06842A03988c08761a01903B0323a09624q3200f7933j38531L8562
$$ -88670 -94178 -301020 103988 -308761 -101903 20323 -109624 -192824 -67933 -206464 -167902
18495a67902B6678h3568F993b68975n9149g8450J6607j23374A03436b943m6395
$$ -167902 26678 -83568 6993 -268975 -328124 -78450 -61843 -185217 103436 -2943 -49338
18484d9338c995C9830b69552f3116a8468l6204A17122f6635j44616B38940a25879
$$ -49338 -3995 39830 -269552 -63116 -18468 -54672 117122 -66635 -211251 238940 -125879
18472B02703L6723a24379k31123J56881A61142c4338j07602m7145b5445L88q2817
$$ 202703 239426 -124379 -355502 -198621 161142 -34338 -141940 -189085 -25445 -25057 -107874
18461a07874L0765A9736J06355m8164J65486a51599o2652B35939f3970k07057
$$ -107874 -77109 19736 126091 77927 243413 -151599 -214251 235939 -63970 -271027
18451b71027f8646a0346q9107j53445A77234o2818a40551k05355F7336J14303
$$ -271027 -68646 -10346 -99453 -252898 177234 114416 -140551 -345906 67336 181639
18441A81639D1454e8414k0505m498J2805E2807a91347h5242A28519E511a6754
$$ 181639 41454 -58414 -78919 -83417 -70612 52807 -191347 -85242 128519 5511 -16754
18429b2655j04682H2992Q6563m8869m7656b59720A38676D0645f2884C5924h7369
$$ -22655 -127337 82992 169555 120686 73030 -259720 138676 40645 -62884 35924 -87369
18417b620j56144j22687A01600L5318a42188A74660d38130C06554a43465B86106
$$ -2620 -158764 -281451 101600 136918 -142188 174660 -438130 306554 -143465 286106
18406a6443I2482a25276l23905A78453F9843a27426j55807a4861B49206q1712
$$ -16443 92482 -125276 -449181 178453 69843 -127426 -283233 -14861 249206 167494
18396A67494C1545L1496O0460b24151B23457p4732b31854d9269p6669j54753c2066
$$ 167494 31545 63041 123501 -224151 223457 148725 -231854 -49269 -125938 -280691 -32066
18384c02114b4346j19454G5970a45113o9307A37043b25113A16124i2580o1077
$$ -302114 -24346 -143800 75970 -145113 -214420 137043 -225113 116124 -92580 -153657
18374a53657j3817D1271i5300H6845g8282a7903k95951J48494A56499b2111A35179
$$ -153657 -167474 41271 -95300 86845 -78282 -17903 -313854 -165360 156499 -22111 135179
18362a17372H7189a73044K5349B33420o5026c4109j85218G9383a19157o3530E9211
$$ -117372 87189 -173044 -147695 233420 168394 -34109 -219327 79383 -119157 -182687 59211
18350g40k18661C2567d0718j67727B73884l5515I7625m8002b91675B63612e2314
$$ -740 -219401 32567 -40718 -208445 273884 238369 97625 49623 -291675 263612 -52314
18338A92818C5926R9189a31889b7593j0142l9078N85b3849a1167A59672F6179
$$ 192818 35926 135115 -131889 -27593 -37735 -76813 -76228 -23849 -11167 159672 66179
18326g5613A53497d0270j43715d8790B06395k4963a07796q5305g8710m3398m0126
$$ -75613 153497 -40270 -183985 -48790 206395 181432 -107796 -193101 -78710 -122108 -162234
18315a62234A03878F671N6582a83427A5887b04370h6086A58279a3055D4269a19454
$$ -162234 103878 6671 63253 -183427 15887 -204370 -86086 158279 -13055 44269 -119454
18303C29325k6635a55934c0810k21103J0958g0218D6071c50418B20426i2771m5487
$$ 329325 302690 -155934 -30810 -251913 -240955 -70218 46071 -350418 220426 -92771 -138258
18292a38258c7900I0524N3481l028a35536j40389a20675j07141c0558H3215b86130
$$ -138258 -37900 90524 144005 140977 -135536 -275925 -120675 -227816 -30558 83215 -286130
18280A5480P3508l5477c99400i8118B22994A4268M2332a7758A68264a06929j36963
$$ 15480 88988 53511 -399400 -98118 222994 14268 56600 -17758 168264 -106929 -243892
18269b43892A97355j3429e916j9529j3893B53810c09607e1257A12005E5017L9052
$$ -243892 197355 183926 -5916 -25445 -39338 253810 -309607 -51257 112005 55017 94069
18258I4069e4151l57224d0918l4311k33424A04590a29279A31542A4566e9482G0959
$$ 94069 -54151 -411375 -40918 -75229 -308653 104590 -129279 131542 14566 -59482 70959
18246D11154e3241k52195a04341K2104c6293B72040A09916I23d1261j19885M6935
$$ 411154 -53241 -305436 -104341 -82237 -36293 272040 109916 923 -41261 -161146 -114211
18235a14211G6584b56133G8681J2660N7101i534K266A47098b00051C21347G4937
$$ -114211 76584 -256133 78681 91341 148442 -9534 -7268 147098 -200051 321347 74937
18223B20770a79744P8729B25957a26972J4555f745k5365j30528C43541a62159
$$ 220770 -179744 -101015 225957 -126972 -112417 -6745 -32110 -162638 343541 -162159
18212I050a5568n4429l018j08339A26378c5666l4357j87984F758a93697d4724
$$ 9050 -15568 -69997 -73015 -181354 126378 -35666 -70023 -258007 6758 -193697 -44724
18200e3558k35068m6338h8297E9946h973q4384E5901N6037M7266c03252a30564
$$ -53558 -288626 -334964 -88297 59946 -8973 -93357 55901 111938 159204 -303252 -130564
18188A33290J12117H0878a89993h287j62564j02831C461N3484b10707D7548a57918
$$ 133290 245407 80878 -189993 -8287 -170851 -273682 3461 56945 -210707 47548 -157918
18176b22193J04991d6646k39870P4577d1359A4875a34193B93448A067b52661f5141
$$ -222193 -117202 -46646 -286516 -211939 -41359 14875 -134193 293448 1067 -252661 -65141
18164e015E8004B2370a9824r9353l042I0789c28536L7084B8653L4051a69699j90156
$$ -5015 58004 22370 -19824 -119177 -122219 90789 -328536 -291452 28653 62704 -169699 -359855
18152c59855J19301O6695J385j09443J06359a6535p3495q1074A26194b29269h6875
$$ -359855 -240554 -173859 -172474 -281917 -175558 -16535 -90030 -171104 126194 -229269 -86875
18140a48414A542b83374h8460B8729a74694A65996c83399A84703a679k7288C1261
$$ -148414 1542 -283374 -88460 28729 -174694 165996 -383399 184703 -1679 -28967 31261
18128b48930b356A01902L48151C0194K53592b59455B7380c55379a639E002b35759
$$ -248930 -2356 101902 450053 30194 283786 -259455 27380 -355379 -1639 5002 -235759
18116I0070N9213J41134a90017R0404g47k59124g3293B9539J70003A1821a34639
$$ 90070 149283 290417 -190017 -99613 -747 -259871 -73293 29539 199542 11821 -134639
18104A16755l5600b35725B11705G7713b74895J00885f0212b1703i820j97304A66337
$$ 116755 81155 -235725 211705 77713 -274895 -174010 -60212 -21703 -9820 -207124 166337
18092B60284b77709J25879K4671B4414a90481h4965L9015J3552A73678b01510
$$ 260284 -277709 -151830 -127159 24414 -190481 -84965 -45950 -32398 173678 -201510
18081i7728o2884A98880a90964i5210m0673F222a39078j0375o1875j16689E7588
$$ -97728 -160612 198880 -190964 -95210 -135883 6222 -139078 -149453 -211328 -328017 57588
18069I0804K4170n3724O7628P1082b02019M2723M1511J0030F4677k0866K4624
$$ 90804 114974 61250 128878 199960 -202019 -159296 -117785 -107755 64677 43811 68435
18058F8435K06072H0772J95953I2671b19944f2837A01609b55416A95956b58194
$$ 68435 274507 80772 276725 92671 -219944 -62837 101609 -255416 195956 -258194
18047B65919j30703d7723q4924m4895j00545E2013o217J17656b2096j46444A16761
$$ 265919 135216 -47723 -132647 -177542 -278087 52013 45796 163452 -22096 -168540 116761
18035a29939A45452a5192k74659a31072K8055F3180L8654N0783j7803M0256E014
$$ -129939 145452 -15192 -289851 -131072 -103017 63180 101834 152617 134814 175070 5014
18023e014A48835F6969b51689I4995J16352B2378d3209A22079b28291D2847J73550
$$ -5014 148835 66969 -251689 94995 211347 22378 -43209 122079 -228291 42847 216397
18012B16397f3440j17411c6773k46691C23946e9305G4504a4666l30419a57218
$$ 216397 -63440 -180851 -36773 -283464 323946 -59305 74504 -14666 -345085 -157218
18001a24791k76557c5269A10316B1172P9204K7107b1923p4532l11401E8154J21458
$$ -124791 -401348 -35269 110316 21172 100376 127483 -21923 -96455 -407856 58154 179612
17990A79612H7341d0511B46667r5018N0388h8894b3050E2708a9747j30869K058
$$ 179612 87341 -40511 246667 151649 202037 -88894 -23050 52708 -19747 -150616 -148558
17979a48558e6864A0451b75251O1562f6125j33277j53756a55051k9345m0282L9160
$$ -148558 -56864 10451 -275251 -213689 -66125 -199402 -353158 -155051 -184396 -224678 -185518
17968a85518c7901B79912a17736C39536B8786A3829c1847B57495r8926D0507H388
$$ -185518 -37901 279912 -117736 339536 28786 13829 -31847 257495 158569 40507 8388
17956A87279D617b19178c6020k30749B9590Q3621m3433b51929A53975J43242a98806
$$ 187279 4617 -219178 -36020 -266769 29590 113211 69778 -251929 153975 297217 -198806
17944b5191k84085B66301G6073a67438j04877N2249A43648c7047A46733J66078
$$ -25191 -309276 266301 76073 -167438 -272315 -220066 143648 -37047 146733 312811
17934C12811b26386F6214L07149h4829p4797K2006C4206O2698a27067j09476J14950
$$ 312811 -226386 66214 373363 -84829 -159626 -137620 34206 96904 -127067 -236543 -121593
17923a21593e099A11574m1121J13720C4969J99770g2293I9624R1499a03039J4664
$$ -121593 -5099 111574 70453 184173 34969 234739 -72293 99624 191123 -103039 -88375
17912h8375B48040r9389f9815r9262E9766a26799A32069f3376A89100i6125D4298
$$ -88375 248040 148651 -69815 -169077 59766 -126799 132069 -63376 189100 -96125 44298
17900G576a24947G0051Q1149C6877K80036b22367j3571J02397A24510e7376j02238
$$ 7576 -124947 70051 151200 36877 316913 -222367 -235938 -133541 124510 -57376 -159614
17889a59614e3671h353r2381o8139p105j47924A43533G241a6256o342B27132G9321
$$ -159614 -53671 -8353 -100734 -168873 -175978 -323902 143533 7241 -16256 -22598 227132 79321
17876a45356j38885L3441D6602N1892b76802a17695r7659d9581A8698a27560l5322
$$ -145356 -284241 -250800 46602 98494 -276802 -117695 -215354 -49581 18698 -127560 -162882
17865a62882A51872m0409b83722a9439A31895B876L04372h5758B03057a39751
$$ -162882 151872 111463 -283722 -19439 131895 2876 307248 -85758 203057 -139751
17854a48854F7596a3189B08100l282f1250B16881k0002o0255O671l5723b23603
$$ -148854 67596 -13189 208100 204818 -61250 216881 196879 136624 143295 107572 -223603
17842b68046J31081l53281a77718A46683f6536K2766m1960A09577J25598b12003
$$ -268046 -136965 -490246 -177718 146683 -66536 -43770 -85730 109577 235175 -212003
17831i3706B5099N3692h6033B55012H6751f8356j88381J20267j58530I2522J1406
$$ -93706 25099 78791 -86033 255012 86751 -68356 -256737 -136470 -295000 92522 103928
17820A03928J80549A1924a73748A30462c5454l6760L0773l12839A46295P7586
$$ 103928 284477 11924 -173748 130462 -35454 -72214 -41441 -354280 146295 223881
17810B23881a28667A53640c00933J29130d2779q4733B93861a43243b7273p5206
$$ 223881 -128667 153640 -300933 -171803 -42779 -127512 293861 -143243 -27273 -102479
17800a02479A07380J4526d6459C02538D2016a22909r8084c2823C08459a06477
$$ -102479 107380 121906 -46459 302538 42016 -122909 -220993 -32823 308459 -106477
17789A99100C5237P7254a6275C4865O640R7529g4623D26055H0381J0733b2809
$$ 199100 35237 112491 -16275 34865 41505 139034 -74623 426055 80381 91114 -22809
17777A31482K5250F2246J25561b7251D44664A17854d89273a33669C49809C7483
$$ 131482 156732 62246 187807 -27251 444664 117854 -489273 -133669 349809 37483
17766B9050c4560C33908i1823j3523d8198p3672j4988A8273J94381a1788C33972
$$ 29050 -34560 333908 -91823 -105346 -48198 -121870 -136858 18273 212654 -11788 333972
17754a09489a0752k13453D7368O6390d3206j89780O8888r5489g2236B82883G6610
$$ -109489 -10752 -224205 47368 113758 -43206 -232986 -164098 -259587 -72236 282883 76610
17742I2968d4934q5779A83942J70179D7208K51865b1317A95137a89198G1733J4594
$$ 92968 -44934 -130713 183942 354121 47208 299073 -21317 195137 -189198 71733 86327
17731H6327d8751O338A05477f603B5408A1753c91606a05004A1836R916a38552
$$ 86327 -48751 -42413 105477 -6603 25408 11753 -391606 -105004 11836 21752 -138552
17719b50793i4062A1729h1612F2858L36635A75401E9866a43080B97878H4070a13719
$$ -250793 -94062 11729 -81612 62858 399493 175401 59866 -143080 297878 84070 -113719
17707A30319O7486a55761A12424d2665F8115J42477c3236E7322a78785A35367
$$ 130319 197805 -155761 112424 -42665 68115 210592 -33236 57322 -178785 135367
17696C0772a48346A92998p8610c14888B71774c5856C36117G7622J85208a36689
$$ 30772 -148346 192998 114388 -314888 271774 -35856 336117 77622 262830 -136689
17685a38956c0937j88136I6474a29676j7716O1952K3320C02624A13149J99503
$$ -138956 -30937 -219073 96474 -129676 -147392 -85440 -62120 302624 113149 312652
17675C12652A33283C9812g0420j18538C83745J43234h10A83843A0394g5183j47023
$$ 312652 133283 39812 -70420 -188958 383745 526979 -810 183843 10394 -75183 -222206
17664b22206e7185b6044l71947B66184C3484d4875j8076C8910M3370g7169F5030
$$ -222206 -57185 -26044 -397991 266184 33484 -44875 -62951 38910 82280 -77169 65030
17652B0529J37735k4332o0262a0220D0614K24249a7618D0731J15884M0413b096
$$ 20529 158264 133932 73670 -10220 40614 264863 -17618 40731 156615 197028 -2096
17640b6007O106P265G6347b7370B48715h7644A81906a43006A22344B4660K0837
$$ -26007 -19901 -12636 76347 -27370 248715 -87644 181906 -143006 122344 24660 45497
17629D5497N7525c68588D1022Q2304E7031a12605h415A43582j2482G184P156Q1006
$$ 45497 103022 -368588 41022 123326 57031 -112605 -8415 143582 131100 7184 14340 95346
17617I5346E799P2472h5438A02553d2177o8711B25570l762b54093F7340a15651
$$ 95346 5799 78271 -85438 102553 -42177 -110888 225570 221808 -254093 67340 -115651
17605B35392J07235G9756a16074B15212b10467J7185A19305g6917A28251f8937
$$ 235392 342627 79756 -116074 215212 -210467 -193282 119305 -76917 128251 -68937
17594b14357P4905g768H165K2010b4428I8984c3085I1R3973M4492D71L3546J0718
$$ -214357 -139452 -7768 8165 30175 -24428 98984 -33085 91 94064 138556 471 34017 44735
17581D4735a21438O0657a3355B02046l823o57B3321M2016m430Q2695a12119A49568
$$ 44735 -121438 -60781 -13355 202046 198223 197566 23321 65337 60907 143602 -112119 149568
17568f7295C40635B7909K22756A8761K49482o1425b7401A90233p2211J67515j39564
$$ -67295 340635 27909 250665 18761 268243 206818 -27401 190233 118022 285537 145973
17557A45973J35831a3319A36995j6369m7874a01126a4316B05699d0023A97532
$$ 145973 281804 -13319 136995 120626 72752 -101126 -14316 205699 -40023 197532
17546c9C56107d8927Q518B76358E6835d217n7531F533J37042O8787g3190B60506
$$ -39 356107 -48927 -40409 276358 56835 -4217 -61748 6533 143575 212362 -73190 260506
17533c4503A94126G3852K03055b0165B32313i9114H367J70176R3641A07856M1499
$$ -34503 194126 73852 276907 -20165 232313 -99114 8367 178543 272184 107856 149355
17522A49355j76a08197C91266R7332j71302Q2410L1505n6270a46595O3759R582
$$ 149355 149179 -108197 391266 488598 317296 399706 431211 374941 -146595 -82836 -73254
17511g3254j51283a4881B67882C0957K5734L76744l264J63799j43943A00065j5579
$$ -73254 -224537 -14881 267882 30957 56691 433435 430171 593970 450027 100065 84486
17500H4486B0327K6945O8407L212N7531l4720h9259c3600A59711d2425B43054
$$ 84486 20327 47272 115679 118891 176422 141702 -89259 -33600 159711 -42425 243054
17488B53276Q7876B8399J7390K18578b03398B52357j20068J48410a33041a6798
$$ 253276 341152 28399 45789 264367 -203398 252357 132289 280699 -133041 -16798
17477d5511m5341A12432a10360H8043L3221L74183A09526J83977H6727b11476
$$ -45511 -90852 112432 -110360 88043 121264 495447 109526 293503 86727 -211476
17466B34981l5349d2036c434B62041I6119i6355D5380a03942G7699O6694D4202
$$ 234981 199632 -42036 -3434 262041 96119 -96355 45380 -103942 77699 144393 44202
17454A88244h6095B5692K58886b43544A50688L7152Q6944P5358A28682K42738
$$ 188244 -86095 25692 284578 -243544 150688 187840 274784 350142 128682 371420
17444C71420A43480J05127a19365C29052A11604i8396C37746g012k0963C03325
$$ 371420 143480 248607 -119365 329052 111604 -98396 337746 -7012 -27975 303325
17433B25851N3666q8383g8236D70924j52363C2099L10883h8862A3854M28395c782
$$ 225851 279517 191134 -78236 470924 318561 32099 342982 -88862 13854 442249 -3782
17421d1581B37150J16387j7359j40781m2179a7526A83958o3451E9038a85921C52487
$$ -41581 237150 353537 336178 195397 153218 -17526 183958 120507 59038 -185921 352487
17409E47540k66038b82239O5656G4675J10135E2070K8864K1104B4869J95817J61247
$$ 547540 281502 -282239 -216583 74675 184810 52070 80934 102038 24869 220686 381933
17398C81933I1517K9937E1042c2580A81753J06633A16875K832j5248B3591L06084
$$ 381933 91517 121454 51042 -32580 181753 288386 116875 119707 104459 23591 329675
17387C29675j112a08599j28918C74185j69415G8654j8286J14814B1606q843K15308
$$ 329675 328563 -108599 -237517 374185 204770 78654 60368 175182 21606 12763 228071
17376B28071o1777G139a02621D7361f8936j0820A87574j4728D7449K1553L46085
$$ 228071 166294 7139 -102621 47361 -68936 -79756 187574 172846 47449 69002 415087
17365D15087I3650A631a76752g167j9629J3222A34024f0968C15163a0055A44156
$$ 415087 93650 1631 -176752 -7167 -26796 -13574 134024 -60968 315163 -10055 144156
17353B4775L91275A34418a26838C48194j64977R2694k6362a65987C40725j58228
$$ 24775 416050 134418 -126838 348194 183217 275911 249549 -165987 340725 182497
17343A82497n8576J36095L4805j39047o8730R0945l4190l8697a27961A81495J65152
$$ 182497 123921 260016 294821 155774 87044 177989 143799 105102 -127961 181495 346647
17332C46647A55371a22647C5900K55603G1510J06417J39347b0007G162N17512
$$ 346647 155371 -122647 35900 291503 71510 177927 317274 -20007 7162 524674
17322E24674A13406Q7193A5891L15884h3363I3437K02519h0362H0311k4884J29526
$$ 524674 113406 200599 15891 331775 -83363 93437 295956 -80362 80311 55427 184953
17311A84953L3633a68664E4559J72182K9124h0985B61080E6721J25416q1856a00336
$$ 184953 218586 -168664 54559 226741 255865 -80985 261080 56721 182137 100281 -100336
17299a42448D23703A4515K04213J4645j7841J13970R9312b6007D2091J30965a11740
$$ -142448 423703 14515 218728 233373 215532 329502 428814 -26007 42091 173056 -111740
17287a12399j09668e3176C07291b58488A54326J20587D0946L15220j77900a33363
$$ -112399 -222067 -53176 307291 -258488 154326 274913 40946 356166 178266 -133363
17276g3455A89838A8704J35878K814a36502C25792E1356K1507a13525B81881G1873
$$ -73455 189838 18704 154582 157396 -136502 325792 51356 72863 -113525 281881 71873
17264A88467G7917Q3877J02436M8188I9230J4913B3352a4606A68513L33302B11699
$$ 188467 77917 161794 264230 312418 99230 114143 23352 -14606 168513 501815 211699
17252b9438p488A1116E108J36128O3649F8735J07567i5640M5002D81008B10232
$$ -29438 -36926 11116 5108 141236 204885 68735 176302 -95640 -50638 481008 210232
17240A19184a7158F73206A70406K15327A21775b69816C06344q0943I5896D7283
$$ 119184 -17158 673206 170406 385733 121775 -269816 306344 225401 95896 47283
17229A04265b0741A61724L96646g6210B50918j0004q1618F1954d339C16533j34515
$$ 104265 -20741 161724 558370 -76210 250918 240914 159296 61954 -4339 316533 182018
17218A82018K04184A82883J2240J12958J4070D8845L88359G7768b1776a0208E1680
$$ 182018 386202 182883 195123 308081 322151 48845 437204 77768 -21776 -10208 51680
17206A39636M8409F8298M4645R284J01270J87867A13194J0767J64554q4815M06339
$$ 139636 188045 68298 112943 122227 223497 411364 113194 123961 288515 203700 610039
17195F10039A44216D6786A45K06492I6168J37221Q5852j22822N3045J68291A98521
$$ 610039 144216 46786 145 206637 96168 233389 319241 196419 249464 417755 198521
17183b06860A6986O778Q0562J13618K39759J41491G5605K41225A10617M18418
$$ -206860 16986 23764 104326 217944 457703 599194 75605 316830 110617 529035
17173E29035B34392b51497D41291K3772m5868B9902j787N5862M07674A66716J9628
$$ 529035 234392 -251497 441291 465063 419195 29902 28115 83977 491651 166716 186344
17162A86344Q657e7221C31203j33664C4968K83829F4419K73014B8392K01056L37021
$$ 186344 195001 -57221 331203 197539 34968 318797 64419 337433 28392 229448 566469
17151E66469J63661C10885a7312B84730m2231K06532j35706I5078L31337j38371
$$ 566469 730130 310885 -17312 284730 242499 449031 313325 95078 426415 288044
17141B88044E2962P3881K1343K74091A36412J82214k7807J18932I0758K87807
$$ 288044 52962 126843 148186 422277 136412 318626 290819 409751 90758 378565
17131C78565j72901J25338K06622k52434J20680r0990J16960i0507D66288j98412
$$ 378565 205664 331002 537624 285190 405870 314880 431840 -90507 466288 267876
17121B67876N1983J20627N7330j07258A79682K74679j31606A55665K77254R3105
$$ 267876 319859 440486 497816 390558 179682 454361 322755 155665 432919 526024
17111E26024B42112N4601L21503k63991O4217B5480M99022j77361J99870k31317
$$ 526024 242112 296713 618216 354225 418442 25480 524502 347141 547011 315694
17101C15694K01165j43822A11078K86611j63251J97684j88459K61981A24624K88362
$$ 315694 516859 373037 111078 397689 234438 432122 243663 505644 124624 412986
17091D12986J34366j07106O1359k00863K24651A09660N8963M67107B97586r6517
$$ 412986 547352 440246 501605 300742 525393 109660 168623 635730 297586 201069
17081B01069J5264J80022G5818L39567j12667j12948J5925M77649j87895k20232
$$ 201069 216333 396355 75818 415385 302718 189770 205695 683344 495449 275217
17071B75217K20975j36743j54989J32560Q2554P7249J24730q4932K24549C1956
$$ 275217 496192 359449 204460 337020 419574 496823 621553 536621 761170 31956
17060E76929J55586B53833K64486J15620k91809L17075k41695j62240M27045I3081
$$ 576929 732515 253833 518319 633939 342130 659205 417510 255270 682315 93081
17049C51969P4531M7710k08522K86046P054J89552l40226M68537C59689J4585
$$ 351969 426500 474210 265688 551734 558788 748340 408114 876651 359689 374274
17039C74274j53542N37212j82903j48739k9481J15962m5025k8305r403J45999
$$ 374274 220732 757944 575041 426302 396821 512783 467758 439453 430050 576049
17029E76049J40812B79537K62742k6823K93985j70164j58337O0512A11839M65476
$$ 576049 716861 279537 542279 515456 809441 639277 480940 541452 111839 577315
17019E77315J56309k92427P1349J07460J52361k5211k66423K57672l20816m4266
$$ 577315 733624 441197 512546 620006 772367 747156 480733 738405 417589 373323
17009C73323K70441k1440Q9433j49965j15064N0498L50755D11223J62948m749
$$ 373323 643764 622324 711757 561792 446728 497226 847981 411223 574171 569422
16999E69422J5492K37532j60397M4076J00590k4647m112J11600C29024L98287
$$ 569422 584914 822446 662049 706125 806715 782068 777956 889556 329024 727311
16989G27311J47141l1739J7386k12871J17691j32332O5935L13269k87908j03434
$$ 727311 874452 842713 860099 647228 764919 632587 698522 1011791 723883 620449
16979F20449K10778k24382M01190l53727p4475K99474P4654k61490o0856L20849
$$ 620449 831227 606845 1008035 654308 579833 879307 953961 692471 631615 952464
16969I52464l59502J13716P8645o1596J76973J31955J62364l70106L22640r8434
$$ 952464 592962 706678 785323 723727 900700 1032655 1195019 824913 1147553 1049119
16959A049119j19405l03242L57487j77297o5889M31307m35737L20747j38712K44315
$$ 1049119 929714 626472 983959 806662 740773 1172080 736343 1057090 918378 1162693
16949A162693m9568q6826K9420K23137m6526l05468N4177K72629o0463J24191
$$ 1162693 1113125 1026299 1055719 1278856 1232330 926862 981039 1253668 1193205 1317396
16939A317396L7145k50286o5839L18650j83615J82935m06558J33429K17715Q4711
$$ 1317396 1354541 1104255 1038416 1357066 1173451 1356386 949828 1083257 1300972 1385683
16929A385683K1775j27386j03168K07196R035j52642K65893j84285K34071k16764
$$ 1385683 1407458 1280072 1176904 1384100 1393135 1240493 1506386 1322101 1556172 1339408
16919A339408O3701J8111m76298L52546Q7629K07104l1482J60858J67347m76120
$$ 1339408 1403109 1421220 944922 1297468 1385097 1592201 1560719 1721577 1888924 1412804
16909A412804L3700o5301M79975j81461N3703L736p9534l9058L36637j47119l09072
$$ 1412804 1446504 1381203 1861178 1679717 1733420 1737156 1657622 1618564 1955201 1808082 1499010
16898A499010N90370m37546J47578K93855m7747p7310J47605o0846j81347J15645
$$ 1499010 2089380 1651834 1799412 2093267 2045520 1968210 2115815 2054969 1873622 1989267
16888A989267M389M4073K37319l45480L72331k47992L03849K2302q7421R7827
$$ 1989267 1993656 2037729 2275048 1929568 2301899 2053907 2357756 2380058 2292637 2390464
16878B390464l02457M14386K52188n02770K70199N5050J26862L9749J99629k81477
$$ 2390464 2088007 2502393 2754581 2251811 2522010 2577060 2703922 2743671 2943300 2661823
16868B661823o9474J98251l3768K54449Q9083J17316l51483L16885J08439r1350
$$ 2661823 2592349 2790600 2756832 3011281 3100364 3217680 2866197 3183082 3291521 3200171
16858C200171J27423n6580L6295O1194j20536M22011k14492L44668J66887k75647
$$ 3200171 3327594 3271014 3307309 3368503 3247967 3669978 3455486 3800154 3967041 3691394
16848C691394K3118K78674K32859j21923L44881j54422l44965L38335J07151J75939
$$ 3691394 3714512 3993186 4226045 4104122 4449003 4294581 3949616 4287951 4395102 4571041
16838D571041J13700n7704L99656o2822J2593J81416N30730n95418J29883M65697
$$ 4571041 4684741 4627037 5026693 4963871 4976464 5157880 5688610 5093192 5223075 5688772
16828E688772K49825j16581J79760l53L70424P0669J14383J96253P0868K4760
$$ 5688772 5938597 5822016 6001776 6001423 6371847 6442516 6556899 6753152 6824020 6848780
16818F848780K36162L89233m2841L89037P5593J84644N5762L54602L32300R250
$$ 6848780 7084942 7474175 7431334 7820371 7895964 8080608 8136370 8490972 8823272 8832522
16808H832522N99809j15423J49098P36196o3034J09673N16272J41886L10809M09890
$$ 8832522 9432331 9316908 9466006 10202202 10139168 10248841 10765113 10906999 11217808 11627698
16798A1627698L26599K44769L72017N29986N59636J84357L37285N11217O65707
$$ 11627698 11954297 12199066 12571083 13101069 13660705 13845062 14182347 14693564 15359271
16789A5359271L63938m5865Q27478N05172R46528M15638P34886R2809J331692
$$ 15359271 15723209 15677344 16504822 17009994 17956522 18372160 19107046 19199855 20531547
16780B0531547N80484P01700Q71085P04674Q28156J238203N19725R50688J362440
$$ 20531547 21112031 21813731 22684816 23389490 24217646 25455849 25975574 26926262 28288702
16771B8288702Q97215J311669J071292J330111J598763R43600J968504J180863
$$ 28288702 29185917 30497586 31568878 32898989 34497752 35441352 37409856 38590719
16763C8590719K088033J697225J762896J463089K024773K214599K316680K239051
$$ 38590719 40678752 42375977 44138873 45601962 47626735 49841334 52158014 54397065
16755E4397065K626686K498078K521108K722713K877452L235877L068257K921259
$$ 54397065 57023751 59521829 62042937 64765650 67643102 70878979 73947236 76868495
16747G6868495L444312L085681L749116L268420L297974L419154L300995L223520
$$ 76868495 80312807 83398488 87147604 90416024 93713998 97133152 100434147 103657667
16739A03657667L341123K769420K880544K758195J970676K142196J470102J331590
$$ 103657667 106998790 109768210 112648754 115406949 117377625 119519821 120989923 122321513
16731A22321513P03057J11966J38593n20730l72993j636425j561116j717717k314295
$$ 122321513 123024570 123136536 123275129 122754399 122381406 120744981 119183865 117466148 115151853
16722A15151853k719980k502449k755552l326650k874748l585503k736652l311402
$$ 115151853 112431873 109929424 107173872 103847222 100972474 97386971 94650319 91338917
16714I1338917l788517k904149k710248l618382k883688l076972k573698k880356
$$ 91338917 87550400 84646251 81936003 78317621 75433933 72356961 69783263 66902907
16706F6902907k730702k364214k815765k323160k262061j754934k042953k215496
$$ 66902907 64172205 61807991 58992226 56669066 54407005 52652071 50609118 48393622
16698D8393622k070291j540047k244662q76902k002478j152600j525704j114983
$$ 48393622 46323331 44783284 42538622 41661720 39659242 38506642 36980938 35865955
16690C5865955j494758j229816j390924q73731r20461q46428j395820p69186o06953
$$ 35865955 34371197 33141381 31750457 30876726 29956265 29109837 27714017 26944831 26337878
16681B6337878j373463l15228j056145p87008p95645p15288m82682o12315o15512
$$ 26337878 24964415 24649187 23593042 22806034 22010389 21295101 20812419 20200104 19584592
16672A9584592n72306n23491n23989l74344p34898m83879J6429p20141m42824
$$ 19584592 19012286 18488795 17964806 17590462 16855564 16371685 16388114 15667973 15225149
16663A5225149n58927n39635j69958n36573J16895m58418l21705l76662n32056
$$ 15225149 14666222 14126587 13956629 13420056 13536951 13078533 12756828 12380166 11848110
16654A1848110n2255l07022q1702l67377k24350m42686k67052m26636J77918l74850
$$ 11848110 11795855 11488833 11407131 11039754 10815404 10372718 10105666 9679030 9856948 9482098
16644I482098j03182n8453l39758l90957R6076m54434l02876j37706k91027J8121
$$ 9482098 9378916 9320463 8980705 8589748 8685824 8231390 7928514 7790808 7499781 7517902
16634G517902k59633M0440p2926m3561p3262l90139j70786k1288j7035j97314
$$ 7517902 7258269 7298709 7225783 7182222 7108960 6718821 6548035 6526747 6509712 6312398
16624F312398k11189l13975J09237K03227k86708k90758j12549M11661o03829
$$ 6312398 6101209 5787234 5896471 6099698 5812990 5522232 5409683 5821344 5217515
16615E217515P1786j73639l2180k01101O4955Q5841k03704J288q4356j48405L3561
$$ 5217515 5289301 5115662 5083482 4882381 4947336 5033177 4829473 4830761 4746405 4598000 4631561
16604D631561j26782l72488J72596q0959k68720N63999o65021l194r0199J7685
$$ 4631561 4504779 4132291 4304887 4223928 3955208 4519207 3854186 3850992 3760793 3778478
16594C778478J65403m25748K41935M6437l40609J06772j80517K6932R3727l90331
$$ 3778478 3943881 3518133 3760068 3806505 3465896 3572668 3392151 3419083 3512810 3122479
16584C122479J29319k3917j76989P3124l5627L2126j99670K55300Q0794l25323
$$ 3122479 3251798 3227881 3050892 3124016 3088389 3120515 2920845 3176145 3256939 2931616
16574B931616q4886Q8734M0127l96854N93219n55958J17616j93291j4993L10677
$$ 2931616 2846730 2935464 2975591 2578737 3171956 2615998 2733614 2540323 2525330 2836007
16564B836007m09106J14408j44716J44940r5507k19898K83302n28148M07478j9747
$$ 2836007 2426901 2541309 2396593 2541533 2446026 2226128 2509430 1981282 2388760 2369013
16554B369013J12497r8528k0189m03858O8037j85428L92479k18550J51760J08736
$$ 2369013 2481510 2382982 2362793 1958935 2026972 1841544 2234023 2015473 2167233 2275969
16544B275969m0418j37225j26350R2099Q6728j67917r1035p1575L3554m3785K93318
$$ 2275969 2235551 2098326 1971976 2064075 2150803 1982886 1891851 1820276 1853830 1810045 2103363
16533B103363l4585l11255m5435J75320k22631J71659k24776K51124p5593J38315
$$ 2103363 2068778 1757523 1712088 1887408 1664777 1836436 1611660 1862784 1787191 1925506
16523A925506j76732N2347P312k27463N7878N2669j49175J25125n7720J0281j00719
$$ 1925506 1748774 1801121 1808433 1580970 1638848 1691517 1542342 1667467 1609747 1620028 1519309
16512A519309m015J1457K91602m51553K16035K98158K4522o52666L30393j37420
$$ 1519309 1515294 1526751 1818353 1366800 1582835 1880993 1905515 1252849 1583242 1445822
16502A445822j84397K37889l7328o5568k34006J05171J24964P9717j72985J62750
$$ 1445822 1261425 1499314 1461986 1396418 1162412 1267583 1392547 1472264 1299279 1462029
16492A462029j97684K31019j2558K94110k89414k3302r3855r9993J63458j3388
$$ 1462029 1264345 1495364 1482806 1776916 1487502 1464200 1370345 1270352 1433810 1420422
16482A420422R1964q2023l74085L81933n09176M20212k4043J27654M0846m26690
$$ 1420422 1512386 1430363 1056278 1438211 929035 1349247 1325204 1452858 1493704 1067014
16472A067014K8505K36377q2235k21171M14718j10156j99894J63859J42237j46727
$$ 1067014 1095519 1331896 1249661 1028490 1443208 1333052 1133158 1297017 1439254 1292527
16462A292527k77109J54002K06662k75177K03001j84719N23277o85270M28576
$$ 1292527 1015418 1169420 1376082 1100905 1303906 1119187 1642464 957194 1385770
16453A385770j89513J5649M02447l21068K24917n9930m23090K37888j20594K78249
$$ 1385770 1196257 1211906 1614353 1293285 1518202 1458272 1035182 1273070 1152476 1430725
16443A430725j09128k06018J3039K8177L4460K52337l81628L58291j15743j82636
$$ 1430725 1321597 1115579 1128618 1156795 1191255 1443592 1061964 1420255 1304512 1121876
16433A121876K47451j25807J451j58582J45457k29000l3125L66710K5143l11859
$$ 1121876 1369327 1243520 1244971 1086389 1231846 1002846 969721 1336431 1361574 1049715
16423A049715L344K01692j08548O285L2159k74044R7345k6779k2777J67967K1485
$$ 1049715 1053059 1254751 1146203 1152488 1184647 910603 1007948 981169 958392 1126359 1147844
16412A147844j35215R7869J88002l6176k24450j60983K86002l2762m2964Q4100
$$ 1147844 1012629 1110498 1298500 1262324 1037874 876891 1162893 1130131 1087167 1171267
16402A171267j1058M8316J25023Q1615l58722j29966L2496K80229m25218L75601
$$ 1171267 1160209 1208525 1333548 1415163 1056441 926475 958971 1239200 813982 1189583
16392A189583K68002l59514O6039m6032K65497l18328j19977j09965J69577K32089
$$ 1189583 1457585 1098071 1164110 1118078 1383575 1065247 945270 835305 1004882 1236971
16382A236971m73415L05772L3477o6237o1854O1325K62858j41520l67294N07699
$$ 1236971 763556 1069328 1102805 1036568 974714 1036039 1298897 1157377 790083 1297782
16372A297782k49101K62988k04615q0781K95382k60791R7404L372J09416l8483
$$ 1297782 1048681 1311669 1107054 1026273 1321655 1060864 1158268 1161640 1271056 1232573
16362A232573m5530M4547j12749l29370M10424m124k8151j40285L98605J12082
$$ 1232573 1187043 1231590 1118841 789471 1199895 1195771 1167620 1027335 1425940 1538022
16352A538022n83108k39442L22289k5896k47309L58621k4709Q0831l44188L51535
$$ 1538022 954914 715472 1037761 1011865 764556 1123177 1098468 1179299 835111 1186646
16342A186646j85882K7678K94620k76034j34641L21123q8074K5151J44478J3251
$$ 1186646 1000764 1028442 1323062 1047028 912387 1233510 1145436 1170587 1315065 1328316
16332A328316j5573k16758L1940K07245m76125L48635k35841j21719M56733k83370
$$ 1328316 1312743 1095985 1127925 1335170 859045 1207680 971839 850120 1306853 1023483
16322A023483L3155q8498M1439K23849k30108J93758O0103k18185L08185j43935
$$ 1023483 1056638 968140 1009579 1233428 1003320 1197078 1257181 1038996 1347181 1203246
16312A203246j30756o3314J21995M9348J6338p1219J24137J2149k58305J34102
$$ 1203246 1072490 1009176 1131171 1180519 1196857 1125638 1249775 1261924 1003619 1137721
16302A137721q5682l5019N4492O1837J7343N5147q0164L73102l85657J54129k07810
$$ 1137721 1052039 1017020 1071512 1133349 1150692 1205839 1125675 1498777 1113120 1267249 1059439
16291A059439K39170j39412Q9156l81903J68359Q4671j18268J44696k09935P9822
$$ 1059439 1298609 1159197 1248353 866450 1034809 1119480 1001212 1145908 935973 1015795
16281A015795L12321m18833o8379K71425k05150J47831J81800E87919N75406K9929
$$ 1015795 1328116 909283 840904 1112329 907179 1055010 1236810 587919 1163325 1193254
16271A193254m0438k12276L07270j99122O7034j279k59303J95113j6906J17812
$$ 1193254 1152816 940540 1247810 1048688 1115722 1114443 855140 1050253 1033347 1151159
16261A151159j7494k0758l08144L9525M49930j59080l11020K93513k24068p7646
$$ 1151159 1133665 1112907 804763 844288 1294218 1135138 824118 1117631 893563 815917
16251H15917N99692m82549J33506m11786N5215J58549k94224J88015R3736K39645
$$ 815917 1415609 933060 1066566 654780 709995 868544 574320 762335 856071 1095716
16241A095716k26050R3016j05755K65948D74994N94021k10535K7452N07750n82101
$$ 1095716 869666 962682 856927 1122875 474994 1069015 858480 885932 1393682 811581
16231H11581J21738m01434K65241M2155k19172M68663p3879m4124p9770j21907
$$ 811581 933319 531885 797126 839281 620109 1088772 1014893 970769 890999 769092
16221G69092k4582j18206L42055J52923l38288K63370l78713K11726j30763J41277
$$ 769092 744510 626304 968359 1121282 782994 1046364 667651 879377 748614 889891
16211H89891m5413j99353L72957m03341M09805k60856j24078J73073m6374n4982
$$ 889891 844478 645125 1018082 614741 1024546 763690 639612 812685 766311 711329
16201G11329J08546q6343j48909L14863l17167J69451L23053j93826j02851q5780
$$ 711329 819875 733532 584623 899486 582319 751770 1074823 880997 778146 692366
16191F92366j46539K92703m15479N9790L61917J55117m36269A95171M86451M4668
$$ 692366 545827 838530 423051 482841 844758 999875 563606 195171 681622 726290
16181G26290j72060K08784k13684M24965m61434J6315Q4384k47187j68917K30148
$$ 726290 554230 763014 549330 974295 512861 529176 613560 366373 197456 427604
16171D27604N18898D42001J9004K36670R7818j76333k35455J79971j82920K21150
$$ 427604 946502 442001 461005 697675 795493 619160 383705 563676 380756 601906
16161F01906K64101B49885K16227J27188K3413K3684j15185J09014j12959R7079
$$ 601906 866007 249885 466112 593300 616713 640397 525212 634226 521267 618346
16151F18346o4016j199N1426P964k04187A89919K28491j5048L93253k73289J4289
$$ 618346 554330 553131 604557 612521 408334 189919 418410 403362 796615 523326 537615
16140E37615j94915j7469O1607J99112k49932J83212l6578n0151g9742D75732
$$ 537615 342700 325231 386838 585950 336018 519230 482652 432501 -79742 475732
16129D52612A19668J59693J99392p0807Q1819A09176K95905A37419K32612P6770
$$ 452612 119668 279361 478753 407946 489765 109176 405081 137419 370031 446801
16119D46801A78232Q5571M1854A11328J61680J35074l1861K02439B30193J78035
$$ 446801 178232 263803 305657 111328 273008 408082 376221 578660 230193 408228
16109D08228j91360M04139n3186K5044A62707J97003I1007J49635p0218b4173
$$ 408228 216868 621007 567821 592865 162707 359710 91007 240642 170424 -24173
16098A98687l8266J33255o1911K30563j12560K889R571I9504J42587F3568K70912
$$ 198687 160421 293676 231765 462328 349768 352657 362228 99504 242091 63568 334480
16087C34480j641A52252M3053Q479N4786l3466F8862K76009A1064b8461A69052
$$ 334480 332839 152252 195305 203784 258570 225104 68862 344871 11064 -28461 169052
16075C45766A52309R1103O0070c5686C34356A47889J35035O3915q5609G655f0765
$$ 345766 152309 243412 303482 -35686 334356 147889 282924 346839 261230 7655 -60765
16063E30524m5994A42183M12618a88769A72712K9279j4347L55970I4621L52937
$$ 530524 484530 142183 554801 -188769 172712 201991 187644 543614 94621 447558
16053D47558E5603K57242k8518G4479C7003L10056p5434a03991d4334A9340J31966
$$ 447558 55603 312845 284327 74479 37003 347059 271625 -103991 -44334 19340 151306
16042A51306a10482A27064a4257m87C24555q5888g3200D3198L31054A00163J53533
$$ 151306 -110482 127064 -14257 -14744 324555 238667 -73200 43198 374252 100163 253696
16031B53696D1962Q9625a18456B00650j6195d955j02005j4144K6856C17246r5530
$$ 253696 41962 131587 -118456 200650 184455 -4955 -106960 -121104 -94248 317246 221716
16020B21716C5527R5728L5106p0406B6111f0062l12075b8831k56848J27591G7358
$$ 221716 35527 131255 166361 95955 26111 -60062 -372137 -28831 -285679 -158088 77358
16008B459K55126I8224g2646A03267N4291G3692J85681j11727a37073A16942B2058
$$ 2459 257585 98224 -72646 103267 157558 73692 259373 147646 -137073 116942 22058
15996C6432a59925G9581i1506n9443C52457c8030p1091C38510k7560b5327D70388
$$ 36432 -159925 79581 -91506 -150949 352457 -38030 -109121 338510 310950 -25327 470388
15984D44855m2587k6102J18166k15236p8674n2772G3403J60330k636E0406h2088
$$ 444855 402268 376166 494332 279096 200422 147650 73403 233733 231097 50406 -82088
15972B47632K50461a08871p1950F3497f5493B38244l9005c14891J57237B85305
$$ 247632 498093 -108871 -180821 63497 -65493 238244 199239 -314891 -157654 285305
15961b08854i158G6216a59705A03546J52478i9166n4978A71771a73606E3314a33383
$$ -208854 -9158 76216 -159705 103546 256024 -99166 -154144 171771 -173606 53314 -133383
15949C1246K44170a27665l3268g7060A6947L91239e6468r1195G6864C957K67481
$$ 31246 275416 -127665 -160933 -77060 16947 408186 -56468 -147663 76864 3957 271438
15938B71438j24728m1852c5827j11774c6160A64965a0299j42908C39751j01530
$$ 271438 146710 104858 -35827 -147601 -36160 164965 -10299 -153207 339751 238221
15928B38221A07682n0440a6095B10525I3327a38975A26882k133M6208J43728b00254
$$ 238221 107682 57242 -16095 210525 93327 -138975 126882 124749 170957 314685 -200254
15916a90071D3858M806N8667a1271C07053I1920a43398j08049A26796E1535M0665
$$ -190071 43858 48664 107331 -11271 307053 91920 -143398 -251447 126796 51535 92200
15905I2200C9323c09761N0614B82655b12628E0235a76998j1001A41385a7343k05208
$$ 92200 39323 -309761 -259147 282655 -212628 50235 -176998 -187999 141385 -17343 -222551
15894b22551a03767l1577N2589o5042O6653A98636d32628c6070A54094g6039C60521
$$ -222551 -103767 -135344 -82755 -147797 -81144 198636 -432628 -36070 154094 -76039 360521
15882a41733A62399e773l3599F0582a65946I7557L341b50386B118O7118b0935
$$ -141733 162399 -5773 -39372 60582 -165946 97557 100898 -250386 2118 69236 -20935
15870b16893H2260J92128F2248a49576n1121h2741R91b9927j444m8404C71611
$$ -216893 82260 274388 62248 -149576 -200697 -82741 -81750 -29927 -31371 -79775 371611
15858a79683H4595a19030A38297g1053k35116j2251A37666F1870J76692a35094
$$ -179683 84595 -119030 138297 -71053 -306169 -318420 137666 61870 238562 -135094
15847I1593i7896B33734a6276A84322m2886c46364J57521A45166D6134R5766A773
$$ 91593 -97896 233734 -16276 184322 141436 -346364 -188843 145166 46134 141900 1773
15835C7230d13156E2278a60474m71G2523N5420a50413k03884h5800A41669B9531
$$ 37230 -413156 52278 -160474 -160945 72523 127943 -150413 -354297 -85800 141669 29531
15823C1171h2626I855c22233F8965J71724H3598a76521o0737j31995J72574j7691
$$ 31171 -82626 9855 -322233 68965 240689 83598 -176521 -237258 -369253 -196679 -214370
15812b14370K7965H9429d1666q8468E7587c1676A41253j2732a11422J5137j21675
$$ -214370 -186405 89429 -41666 -130134 57587 -31676 141253 128521 -111422 -96285 -217960
15801b17960i027A05554a1762l31276B18277a04293M8869I9461b80267i0989r9962
$$ -217960 -9027 105554 -11762 -343038 218277 -104293 -55424 99461 -280267 -90989 -190951
15790a90951e6513A03316a11921B27022a74243l5395h3509A09290d6937K2914
$$ -190951 -56513 103316 -111921 227022 -174243 -209638 -83509 109290 -46937 -24023
15780b4023D4769d2818j98789M6058j10848B15498d2106A40705P3999i1412B03172
$$ -24023 44769 -42818 -241607 -195549 -306397 215498 -42106 140705 214704 -91412 203172
15768g4947n4014A62287A9577c33274C381a05479A30123c00202A8700d2852D8774
$$ -74947 -128961 162287 19577 -333274 3381 -105479 130123 -300202 18700 -42852 48774
15756G5496P288j7659J36148g7561A7147a72278l9259h3426A25371a48084D24815
$$ 75496 82784 65125 201273 -77561 17147 -172278 -211537 -83426 125371 -148084 424815
15744i8522J86L1130A0336a18510j92045d1415j5278A15933a81315j43616q2564
$$ -98522 -98336 -67206 10336 -118510 -310555 -41415 -56693 115933 -181315 -324931 -407495
15733d07495N5958f27G6309k5926K4312a04171b0592k12442h9800r8303A0803
$$ -407495 -351537 -627 76309 50383 74695 -104171 -20592 -233034 -89800 -188103 10803
15721H4764a61400B85538G869J42887d4384J0664k39963M7647E1859b4406j81722
$$ 84764 -161400 285538 7869 150756 -44384 -33720 -273683 -226036 51859 -24406 -206128
15710b06128A6930J65510a0592m4141B16431e8984E417c0354O615j96906B83625
$$ -206128 16930 182440 -10592 -54733 216431 -58984 5417 -30354 -23739 -220645 283625
15698A54804J0835a41384c788k19732A28610a19467J2841A7242b85587B14195
$$ 154804 165639 -141384 -3788 -223520 128610 -119467 -106626 17242 -285587 214195
15687A24401o944l4573J05463G9536f5742C09289g4876H5920a46955F1358b49889
$$ 124401 117457 82884 188347 79536 -65742 309289 -74876 85920 -146955 61358 -249889
15675a38335B18535j05683b07478A04514B6450i2361j35598i4684A18342g1671
$$ -138335 218535 112852 -207478 104514 26450 -92361 -227959 -94684 118342 -71671
15664e0843d271A88398b11827A9464R8107B610a55600p098j4523k75226C0901
$$ -50843 -4271 188398 -211827 19464 117571 2610 -155600 -162698 -177221 -452447 30901
15652B54674g1286G198J13156C8276L9105L04930a25561d3772k37517A88076c44752
$$ 254674 -71286 7198 120354 38276 77381 382311 -125561 -43772 -281289 188076 -344752
15640f6896b9466o2668l7059b2228q1573M3497n2141j06809A33771b00306I0506
$$ -66896 -29466 -92134 -129193 -22228 -103801 -60304 -112445 -219254 133771 -200306 90506
15628B5113n596J00870N9154c9314k7300a5417o2945A3976c80527D42a08351M0662
$$ 25113 19517 120387 179541 -39314 -66614 -15417 -78362 13976 -380527 442 -108351 -67689
15616f7689j61240b092j98778d853A4543c99494C28991G5012d1190j20141C36514
$$ -67689 -228929 -2092 -200870 -4853 14543 -399494 328991 75012 -41190 -161331 336514
15604G6268B3148a90127D17456a5722j21739j23166C1172g6444F9749K69918d1403
$$ 76268 23148 -190127 417456 -15722 -137461 -260627 31172 -76444 69749 339667 -41403
15592C51630m4225j33268a59759j1296N3401A68277K11755p6483q352F8022P7349
$$ 351630 307405 174137 -159759 -171055 -117654 168277 380032 303549 295197 68022 145371
15581A45371b22340C2508J2054b48148o9516R2425k1417A49272E4939a14610K5959
$$ 145371 -222340 32508 44562 -248148 -317664 -225239 -246656 149272 54939 -114610 -88651
15570h8651J4129m8417F9925k8473d1562C56365i9563A66174f654o8400A4025
$$ -88651 -74522 -122939 69925 41452 -41562 356365 -99563 166174 -6654 -75054 14025
15558c9628H2311b92336J27690b3327A39956D4472K79466A41613a11788M3567
$$ -39628 82311 -292336 -164646 -23327 139956 44472 323938 141613 -111788 -68221
15548f8221J0876A159L88653B5973a11738F3276a19827H7868c02222G5706k5526
$$ -68221 -57345 1159 389812 25973 -111738 63276 -119827 87868 -302222 75706 50180
15537E0180a83248C01201b77455l592E4577a82931g7589L8287C6985N821a26664
$$ 50180 -183248 301201 -277455 -281047 54577 -182931 -77589 -39302 36985 42806 -126664
15525F1442h3612A00808A4745h26k24765F3925L298i7707l2548B1264Q6798c7055
$$ 61442 -83612 100808 14745 -826 -225591 63925 67223 -97707 -130255 21264 108062 -37055
15512F8853b00428E734O4174a07463p6710D1435a06299M4303j89502B70443r9421
$$ 68853 -200428 5734 69908 -107463 -184173 41435 -106299 -61996 -251498 270443 171022
15501A71022b17966n1182c0853A37257a07442F3019e1738A16390b53211A74634
$$ 171022 -217966 -269148 -30853 137257 -107442 63019 -51738 116390 -253211 174634
15490a2332n7698c4402j71756H3500a36780L5563A09998h8318A42698D3108J08124
$$ -12332 -70030 -34402 -206158 83500 -136780 -101217 109998 -88318 142698 43108 151232
15479A51232a43080A93248a00648D5d82126B52762R1158a80755c9841o1112B52904
$$ 151232 -143080 193248 -100648 45 -482126 252762 343920 -180755 -39841 -100953 252904
15467c5041J6625B7756J63406a15999r792l2981F3393a96272g6491A46057a00839
$$ -35041 -18416 27756 191162 -115999 -125791 -158772 63393 -196272 -76491 146057 -100839
15455a76837G3354h5738d082C0393J54312a63426P4297l7123D53579F7453N3844
$$ -176837 73354 -85738 -4082 30393 184705 -163426 -89129 -126252 453579 67453 121297
15444A21297j9913J87834A40934L1594b44641g4985A34050D8721J59391l7193
$$ 121297 101384 289218 140934 172528 -244641 -74985 134050 48721 208112 170919
15434A70919b668B2862J57343l4789k2862a43178B51384a07136a2042p5742I5837
$$ 170919 -2668 22862 180205 145416 122554 -143178 251384 -107136 -12042 -87784 95837
15422A41800e091m9697j21049B69679p8149b42900A36359J73192F7862P8056d3075
$$ 141800 -5091 -54788 -175837 269679 191530 -242900 136359 309551 67862 145918 -43075
15410B88649D7574a45075A74020f8852E8431a02946j63411l160e9532A06923J41541
$$ 288649 47574 -145075 174020 -68852 58431 -102946 -266357 -269517 -59532 106923 248464
15399B48464g639A60699b58600f9597A30387J12689b43985O1592d430A96437o1688
$$ 248464 -7639 160699 -258600 -69597 130387 243076 -243985 -182393 -4430 196437 134749
15388A34749f357G2471r816b74006H5774b40353a954A9149a82649F3981P1432
$$ 134749 -6357 72471 62655 -274006 85774 -240353 -1954 19149 -182649 63981 135413
15377A35413J69704G3834P4871B3707J44996l5403M3166k5748n6071D5563J73
$$ 135413 305117 73834 148705 23707 168703 133300 176466 150718 94647 45563 45736
15366D5736j2375P9046e7469k30460A24492d4843G0465L4238L35556j21032C6101
$$ 45736 33361 112407 -57469 -287929 124492 -44843 70465 104703 440259 319227 36101
15354B33796q7051b01620E3660c18395h4360A01298D1932J18933k2923K82894
$$ 233796 146745 -201620 53660 -318395 -84360 101298 41932 160865 137942 420836
15344D20836d403A6454J90342E1943R9215b2996B17671O6572j16396p9945a00699
$$ 420836 -4403 16454 206796 51943 151158 -22996 217671 284243 167847 87902 -100699
15332c5416J1629B73589b89767g6561j15307F9233J20098e8597m7466H2095C9661
$$ -35416 -23787 273589 -289767 -76561 -191868 69233 189331 -58597 -106063 82095 39661
15320E35P142a19841A95176a17993A02715b20780d2497j23895C51533A65251b5463
$$ 535 7677 -119841 195176 -117993 102715 -220780 -42497 -166392 351533 165251 -25463
15308c6775o7707E070d6940k71002I1175b75947P7429K3853A8347b3765A88767
$$ -36775 -104482 5070 -46940 -317942 91175 -275947 -198518 -174665 18347 -23765 188767
15296C11047j42125a7739A19675e5574A05191n481a85045B84924A3660J07190
$$ 311047 168922 -17739 119675 -55574 105191 99710 -185045 284924 13660 120850
15286A20850c0698j10085A33280i5121F1401a12406B1562d4108B19969g4739B2104
$$ 120850 -30698 -140783 133280 -95121 61401 -112406 21562 -44108 219969 -74739 22104
15274B75583f1747I1117a26087A29227J3247K8264i9582I0938g7513C40916A12043
$$ 275583 -61747 91117 -126087 129227 142474 170738 -99582 90938 -77513 340916 112043
15262b97861A27829N8905B5808b14059c8705j6825A74862E5166J58654f7370A99816
$$ -297861 127829 186734 25808 -214059 -38705 -55530 174862 55166 213820 -67370 199816
15250F32029L46063k59836K29490j7916C87107E9143c59388B96229b96682g9559
$$ 632029 978092 718256 947746 929830 387107 59143 -359388 296229 -296682 -79559
15239e987j58880L63A71744L86435b18109G0834c07214c5916C46629A34928h1831
$$ -5987 -164867 -164504 171744 558179 -218109 70834 -307214 -35916 346629 134928 -81831
15227d35926m3461a26896G6807a34153e6105l126B35968b97350J30559B31256
$$ -435926 -479387 -126896 76807 -134153 -56105 -59231 235968 -297350 -166791 231256
15216A83444C1854N9882m1291b7403n9431C17930j52620k6409o8859c4299k9262
$$ 183444 31854 91736 50445 -27403 -86834 317930 165310 138901 70042 -34299 -63561
15205f3561p627B322L1203M6543J34054B9133O6821b49751F8799e4928j35327
$$ -63561 -71188 2322 33525 80068 214122 29133 95954 -249751 68799 -54928 -190255
15194a90255a4233k24071d1345B03593K02657c3487A28530f439B7551N8521P7792
$$ -190255 -14233 -238304 -41345 203593 406250 -33487 128530 -6439 27551 86072 163864
15183A63864n1235a27238B32285q8521j5069e7151B15852d8918B95930a012A03504
$$ 163864 112629 -127238 232285 143764 128695 -57151 215852 -48918 295930 -1012 103504
15171B4158b1073q1116B90643a32877p8744A8938b35492F4391g9490A7617K05181
$$ 24158 -21073 -102189 290643 -132877 -211621 18938 -235492 64391 -79490 17617 222798
15160B22798a05056m388G7438e3158G1698a00979B54480c7571k16679A73361D8553
$$ 222798 -105056 -109444 77438 -53158 71698 -100979 254480 -37571 -254250 173361 48553
15148a01399e0162K1216l9957j00159A50133d9097j07000B26917r777D6479P4910
$$ -101399 -50162 -28946 -68903 -169062 150133 -49097 -156097 226917 217140 46479 121389
15137A21389K49516J9736b2958q2731A61972m0825a01101A44839a24819J8701
$$ 121389 370905 390641 -22958 -105689 161972 121147 -101101 144839 -124819 -106118
15127a06118A68216K33156E1155i119j96209A6903J84532h7111F5488J20313J24648
$$ -106118 168216 401372 51155 -9119 -205328 16903 201435 -87111 65488 185801 310449
15116C10449q2720Q6929A9043c6037B68999l1358i1388A02705i2996I897g2100
$$ 310449 227729 314658 19043 -36037 268999 237641 -91388 102705 -92996 9897 -72100
15104B78462a49561C14237A35559k8156a8637C8660J05646L95353C9536J04579
$$ 278462 -149561 314237 135559 107403 -18637 38660 144306 539659 39536 144115
15094A44115o3925j575M2894f8667C12117A14332j9940K31504a49139B39327d1591
$$ 144115 80190 78615 121509 -68667 312117 114332 94392 325896 -149139 239327 -41591
15082A36412L8116M6439m4922k1986b99849B43645a56974I6208j768i7426F7387
$$ 136412 174528 220967 176045 154059 -299849 243645 -156974 96208 94440 -97426 67387
15070C13696J4990a74698I1730g429B27217G8834a34394B28724A0892b4174A25710
$$ 313696 328686 -174698 91730 -7429 227217 78834 -134394 228724 10892 -24174 125710
15058C48691d4062j49313B27948k0093G4707J02345a48843A08136L7500f7758
$$ 348691 -44062 -193375 227948 207855 74707 177052 -148843 108136 145636 -67758
15047B19528n9635C1636J54317R2484k707L05677F9207K51229b14725A3733M3671
$$ 219528 159893 31636 185953 278437 275730 581407 69207 320436 -214725 13733 57404
15036E7404P6402c2993k6653A18581K09483A62921a64018C90235A79340J41416
$$ 57404 133806 -32993 -59646 118581 328064 162921 -164018 390235 179340 320756
15026C20756m4430R3824I0984K41700A30634J27390I9777L16513A43257J1975
$$ 320756 276326 370150 90984 332684 130634 258024 99777 416290 143257 155232
15016A55232K1622j4961J41093a21427F4031J83630f9056D02814b928q3114B96449
$$ 155232 176854 161893 302986 -121427 64031 247661 -69056 402814 -2928 -86042 296449
15004D4187N3497o940J81662j26378k6097d7695B78084q0850d0050C57025q4837
$$ 44187 97684 90744 272406 146028 119931 -47695 278084 197234 -40050 357025 272188
14993B72188P572n8335e006A67955M6125E3416J53229B8026J73242K603G0574
$$ 272188 279760 221425 -5006 167955 214080 53416 206645 28026 201268 203871 70574
14981B61245j5040A16885J10548q4616C0879J16095K07394J36792A08090K80941
$$ 261245 246205 116885 227433 142817 30879 146974 354368 491160 108090 389031
14971C89031r9081j9505M660k8530E7868O2131o40K91140r700d8640D05014A38323
$$ 389031 289950 270445 275105 246575 57868 119999 119359 410499 400799 -48640 405014 138323
14958D71446A42307J4572C7512L36112j76756K46496I9842J48515r1186J13212
$$ 471446 142307 156879 37512 373624 196868 443364 99842 248357 157171 270383
14948B70383L01849k45667L10321G1287K09755O1431J39415j41321J43335A33308
$$ 270383 572232 326565 636886 71287 281042 342473 481888 340567 483902 133308
14937C28930D0072L08308q7894R1283a02157D01683A32201N4878L20786l7450
$$ 328930 40072 348380 260486 351769 -102157 401683 132201 187079 507865 470415
14927D70415J3758j40817O06885m42450Q0424N8783k66197K91799k55787J31252
$$ 470415 484173 343356 950241 507791 588215 646998 380801 672600 416813 548065
14917E48065k57351M06200j44027M58872m32947m2363k06837L39519j18523J01997
$$ 548065 290714 696914 552887 1011759 578812 536449 329612 669131 550608 652605
14907F52605k20288j3109o383O21j14734a7453C46594J7862l9664a05277A48499
$$ 652605 432317 419208 412825 413446 298712 -17453 346594 364456 324792 -105277 148499
14895E57271i3373B29550l7599q3944J16674Q959J30410P6413B07347K02851j05624
$$ 557271 -93373 229550 191951 108007 224681 233640 364050 440463 207347 410198 304574
14884C04574o4260K19508J2035j28312G2747M88145l7520j36708n195r7620B4070
$$ 304574 240314 459822 471857 343545 72747 560892 523372 386664 381469 283849 24070
14872F35502B48295R3906P8849A33981J42328l199K53428j64857J00160A95229
$$ 635502 248295 342201 421050 133981 276309 273110 526538 361681 461841 195229
14861B39020D4080M96968j98470Q7679l2914j25131N7776k5843R8586K18372B98342
$$ 239020 44080 541048 342578 430257 397343 272212 329988 304145 402731 621103 298342
14849D36772j07679j01892J98818j67086K22206N4248k08598P3464M9331k11679
$$ 436772 329093 227201 426019 258933 481139 535387 326789 400253 449584 237905
14839B37905K19228J52071M2898k25858n0183M25429Q35k78457B60945J07594
$$ 237905 457133 609204 652102 426244 376061 801490 802325 523868 260945 368539
14829C68539R2702N7637j78109N4689M204A92653J46583r7322P4097M23546B46217
$$ 368539 461241 518878 340769 395458 399662 192653 339236 241914 316011 739557 246217
14817D92606A25034J35522K95636q506j93908K36837k02839L2199Q5066M658M0858
$$ 492606 125034 260556 556192 547686 353778 590615 387776 419975 505041 509699 550557
14806E50557j42819j52143p6491L04599r7199J90870o5180j36069K8672l1970
$$ 550557 407738 255595 179104 483703 386504 577374 512194 376125 404797 372827
14796C72827J78149r0841M3869o1880A10510n641K44475J08609j0913A86127N88435
$$ 372827 550976 460135 504004 442124 110510 104869 349344 457953 447040 186127 774562
14785G74562B82073K69982q4086n4348P8495j83601r8054K21907J27836F8698
$$ 774562 282073 552055 467969 413621 492116 308515 210461 432368 560204 68698
14774D49041j56043R5788K26010j11690Q0203q8107j5201K30024k81764n1714
$$ 449041 292998 388786 614796 503106 583309 495202 480001 710025 428261 376547
14764C76547j25751N13812k56229n4902A04022M57262P4640j39958j68515J58370
$$ 376547 250796 764608 508379 453477 104022 561284 635924 495966 327451 485821
14754D85821N467A77591N45359p606l290B09703M74949r4312j7614p5336n6621
$$ 485821 491288 177591 722950 715344 712054 209703 684652 590340 572726 497390 440769
14743D40769K84170l59629j02850K98308J63867p8080k09303J0658J4343q5205
$$ 440769 724939 365310 262460 560768 724635 646555 437252 447910 462253 377048
14733C77048P1003r0044J18175O2070J76547j40133Q1231k31244L33963k20345
$$ 377048 448051 358007 476182 538252 714799 574666 655897 424653 758616 538271
14723E38271L01992q5022m4237J99871D31524K03398P0628J7879C34429M03510
$$ 538271 840263 755241 711004 910875 431524 634922 705550 723429 334429 737939
14713G37939K38175C20612K59659J07659J40552l6459k2259l09803L38507r4961
$$ 737939 976114 320612 580271 687930 828482 792023 769764 459961 798468 703507
14703G03507K33183l44641k39277J31794L80331k00185k6728L88865J0977p0179
$$ 703507 936690 592049 352772 484566 864897 664712 637984 1026849 1037826 967647
14693I67647q6238J14454k79051L69751j86251K10001m14363j01457J29740r8627
$$ 967647 881409 995863 716812 1086563 900312 1110313 695950 594493 724233 625606
14683F25606q5496J72769J21372q4366K39255k52768k08491J64801k37901N45995
$$ 625606 540110 712879 834251 749885 989140 736372 527881 692682 454781 1000776
14673A000776m78986k31400M52546j32940J72041R3017j37978L65149j72306K42335
$$ 1000776 521790 290390 742936 609996 782037 875054 737076 1102225 929919 1172254
14663A172254l04559l88397J23392R621N37774n19042O9950P1725J25439k0484
$$ 1172254 867695 479298 602690 612311 1150085 631043 700993 772718 898157 877673
14653H77673m38447N21936j98742J2663K3679L88612l07834M6909J47831k7346
$$ 877673 439226 961162 762420 775083 798762 1187374 879540 926449 1074280 1046934
14643A046934C79804Q76968l53110L3046j99899J73554n7888N39526l30275j24455
$$ 1046934 379804 1256772 903662 936708 736809 910363 852475 1392001 1061726 937271
14633I37271j40253N67452l21259m28061J60688K81613o4985k5091k18002L25916
$$ 937271 797018 1364470 1043211 615150 775838 1057451 992466 967375 749373 1075289
14623A075289J82038k5014l19321L6893L92339k78842J79344l9080k1536L1099
$$ 1075289 1257327 1232313 912992 949885 1342224 1063382 1242726 1203646 1182110 1213209
14613A213209n73497K75100N03664m31583K59895o7445k04310J80076K13297o30437
$$ 1213209 639712 914812 1418476 986893 1246788 1179343 975033 1155109 1368406 737969
14603G37969N52712K28660j88356l3980r7440K47414m4858j30521j33519J51276
$$ 737969 1290681 1519341 1330985 1297005 1199565 1446979 1402121 1271600 1138081 1289357
14593A289357j11834q5615K2901J73010L90240l41736J55679J2607k7939Q3848
$$ 1289357 1177523 1091908 1114809 1287819 1678059 1336323 1492002 1504609 1476670 1560518
14583A560518p7531J38868J33128r7274l86373J13904j11432K89067R0733k25480
$$ 1560518 1482987 1621855 1754983 1657709 1271336 1385240 1273808 1562875 1653608 1428128
14573A428128j9710L33550j39789o8334R9749M4259K32218n4417m6836O7848L95152
$$ 1428128 1408418 1741968 1602179 1533845 1633594 1677853 1910071 1855654 1808818 1876666 2271818
14562B271818l58302K21220P5969l62446L3106N59358R0567K62767L74906J6164
$$ 2271818 1913516 2134736 2210705 1848259 1881365 2440723 2531290 2794057 3168963 3185127
14552C185127O03267M81423J255659K197470M346562O499905O916306P08711p624488
$$ 3185127 3788394 4269817 5525476 7722946 12069508 18569413 25485719 26194430 18569942
14543A8569942p806691m541595j957241j044871n45337l52311n02319q170j56533
$$ 18569942 10763251 6221656 4264415 3219544 2674207 2321896 1819577 1811407 1654874
14534A654874K11185J45337j27923l3761j68497L53144q246l58509K7166K79194
$$ 1654874 1866059 2011396 1883473 1849712 1681215 2034359 2026113 1667604 1694770 1973964
14524A973964r284m1064K08433l28398L12884J9073k92432m94M10896j78282L3780
$$ 1973964 1964680 1923616 2132049 1803651 2116535 2135608 1843176 1842682 2253578 2075296 2109076
14513B109076n8793K77709N1701l61918K08267m3844N4449J84909K41756r7599
$$ 2109076 2050283 2327992 2379693 2017775 2226042 2182198 2236647 2421556 2663312 2565713
14503B565713n15846L66245l2503Q1074J71719J47152l06372J37645K31285j84002
$$ 2565713 2049867 2416112 2383609 2464683 2636402 2783554 2477182 2614827 2846112 2662110
14493B662110k85946K79774l78256P06690m65847K54291K09845j93450k09010
$$ 2662110 2376164 2655938 2277682 2984372 2518525 2772816 2982661 2789211 2580201
14484B580201K44583R1593P7693k84596M86539K5870J82868m60353K39265N4022
$$ 2580201 2824784 2916377 2994070 2709474 3196013 3221883 3404751 2944398 3183663 3237685
14474C237685P758k52274P16952j31587J23673k61238J15113j38586q0557O4731
$$ 3237685 3245443 2993169 3710121 3578534 3702207 3440969 3556082 3417496 3336939 3401670
14464C401670L47686k82929K69969o1426K24509p1433M5773J24297K48797l33458
$$ 3401670 3749356 3466427 3736396 3674970 3899479 3828046 3873819 3998116 4246913 3913455
14454C913455j36422P00053m81156N92233k96088O1212M2065J18194k68306N79265
$$ 3913455 3777033 4477086 3995930 4588163 4292075 4353287 4395352 4513546 4245240 4824505
14444D824505n4003r8003j25150L06452R8021M3281m2114O9716J34856j9212L10600
$$ 4824505 4770502 4672499 4547349 4853801 4951822 4995103 4952989 5022705 5157561 5138349 5448949
14433E448949j198R4044n5090R3597k1037R173O9958J88341k9116N38733J46837
$$ 5448949 5447751 5541795 5486705 5580302 5559265 5568438 5638396 5826737 5797621 6336354 6483191
14422F483191j70172j75798J02961K62200J11804Q970M24914J03891J1218k09540
$$ 6483191 6313019 6137221 6240182 6502382 6614186 6623156 7048070 7151961 7163179 6953639
14412F953639L52293N2357Q6805j541J55565j37710M55887r1437n8897M14244
$$ 6953639 7305932 7358289 7445094 7443553 7599118 7461408 7917295 7825858 7766961 8181205
14402H181205K80746k42115j70247N31251L53025j13261L29105O14722n34518
$$ 8181205 8461951 8219836 8049589 8580840 8933865 8820604 9149709 9764431 9229913
14393I229913K50500L51701j75588M72077m3482K92733R5767K74540J15224K63720
$$ 9229913 9480413 9832114 9656526 10128603 10085121 10377854 10473621 10748161 10863385 11127105
14383A1127105K66086J43340K24802j47040K67716O23301L26639J42491L29201
$$ 11127105 11393191 11536531 11761333 11614293 11882009 12505310 12831949 12974440 13303641
14374A3303641J24723L84340L04201r6506M47180M18325K20398L15903M40284
$$ 13303641 13428364 13812704 14116905 14020399 14467579 14885904 15106302 15422205 15862489
14365A5862489K64557N53993J36368K55633Q38509m4322Q79041k7729P03269M29038
$$ 15862489 16127046 16681039 16817407 17073040 17911549 17867227 18746268 18718539 19421808 19850846
14355A9850846J88734N35077N74424O40087N39583P70407J62985O09943O22711
$$ 19850846 20039580 20574657 21149081 21789168 22328751 23099158 23262143 23872086 24494797
14346B4494797N34493Q40917L49455Q26295P50817J052413M05131Q52786P43690
$$ 24494797 25029290 25870207 26219662 27045957 27796774 28849187 29254318 30107104 30850794
14337C0850794J239626P20836N85957J527159R77268J348232Q79635J474578R51145
$$ 30850794 32090420 32811256 33397213 34924372 35901640 37249872 38129507 39604085 40555230
14328D0555230J294183J478574J355160J553715J480604J534033J837486J657383
$$ 40555230 41849413 43327987 44683147 46236862 47717466 49251499 51088985 52746368
14320E2746368J976672K126026K170597K033489K367781K547694K678079K706264
$$ 52746368 54723040 56849066 59019663 61053152 63420933 65968627 68646706 71352970
14312G1352970K976966K629173L435768L554138L616891L752504M396158M079329
$$ 71352970 74329936 76959109 80394877 83949015 87565906 91318410 95714568 99793897
14304I9793897M819892M805916N500763N217915O022859O122258O856998O915348
$$ 99793897 104613789 109419705 114920468 120138383 126161242 132283500 139140498 146055846
14296A46055846P650977Q324459Q143366Q989206R652938J0343328J0882367J0774511
$$ 146055846 153706823 162031282 170174648 179163854 188816792 199160120 210042487 220816998
14288B20816998J2106727J2388649J3074239J3610836J3636852J4530615J4120727
$$ 220816998 232923725 245312374 258386613 271997449 285634301 300164916 314285643
14281C14285643J4523035J4435781J4399735J3435139J2845952J1536647J0487293
$$ 314285643 328808678 343244459 357644194 371079333 383925285 395461932 405949225
14274D05949225Q210963N732523K379323L36152o00926k307478l367233l956702
$$ 405949225 414160188 419892711 422272034 422608186 422007260 419699782 416332549 412375847
14266D12375847n399950p641810j0441445j1723321j3356703j3804237j4533562
$$ 412375847 406975897 399334087 388892642 377169321 363812618 350008381 335474819
14259C35474819j4656261j4403430j4330091j3825956j3960321j3314128j2460789
$$ 335474819 320818558 306415128 292085037 278259081 264298760 250984632 238523843
14252B38523843j2332935j1717896j0717758j0122424j0350597r147350q576073
$$ 238523843 226190908 214473012 203755254 193632830 183282233 174134883 165558810
14245A65558810q070751p615958p195113o939445o452357o163870n366557n468551
$$ 165558810 157488059 149872101 142676988 135737543 129285186 123121316 117754759 112286208
14237A12286208m800001m999238m096001m936402l614479l552514l314584l551875
$$ 112286208 107486207 102486969 98390968 93454566 89840087 86287573 82972989 79421114
14229G9421114l080208l161859k892120k630331k772748k450689j949155k017028
$$ 79421114 76340906 73179047 70286927 67656596 64883848 62433159 60484004 58466976
14221E8466976k280271j748629k127842j963169j489995j476845j701859j312110
$$ 58466976 56186705 54438076 52310234 50347065 48857070 47380225 45678366 44366256
14213D4366256j573208j387080q87926j380039j279707j135926p34817j032440
$$ 44366256 42793048 41405968 40518042 39138003 37858296 36722370 35987553 34955113
14205C4955113j271281q41553r83076q44913q12901m11026r85189j177895o08620
$$ 34955113 33683832 32842279 31859203 31014290 30201389 29790363 28805174 27627279 27018659
14196B7018659q34799m76369n66131n74374n28473r35953k01770n16922q76571
$$ 27018659 26183860 25707491 25141360 24566986 24038513 23102560 22900790 22383868 21507297
14187B1507297n67389l14101j80657q62552n53692j26446n71618m74724m52920
$$ 21507297 20939908 20625807 20445150 19582598 19028906 18902460 18330842 17856118 17403198
14178A7403198q725o12178l25275j12323l82098k50489k88618o96809j0713k38591
$$ 17403198 17394473 16782295 16457020 16344697 15962599 15712110 15423492 14726683 14715970 14477379
14168A4477379l07931l2818r9120o98535j96806m42833k67354O3448l23196j59292
$$ 14477379 14169448 14136630 14037510 13338975 13142169 12699336 12431982 12495430 12172234 12012942
14158A2012942m08407J418k57628j50336k35304p6732k01424M0677l68178m88637
$$ 12012942 11604535 11605953 11348325 11197989 10962685 10885953 10684529 10725206 10357028 9868391
14148I868391J34996j77897j07872l68118j03889n3368K8760j88108o98690J54464
$$ 9868391 10003387 9825490 9717618 9349500 9245611 9192243 9221003 9032895 8334205 8488669
14138H488669o3243l13647R4379j1477l3787l19807k24055R2960m35887K51907
$$ 8488669 8425426 8111779 8206158 8194681 8160894 7841087 7617032 7709992 7274105 7526012
14128G526012k49910o5034l18208K10610m92189J12865j16842j47453k64744J77463
$$ 7526012 7276102 7211068 6892860 7103470 6611281 6724146 6607304 6459851 6195107 6372570
14118F372570k89048L18469k24535m6459k4928l15709J43287J55580l68884j43146
$$ 6372570 6083522 6401991 6177456 6130997 6106069 5790360 5933647 6089227 5720343 5577197
14108E577197l555l82783K64343j43566N9671j23074m3521r6344j08518M148r3435
$$ 5577197 5573642 5190859 5455202 5311636 5371307 5248233 5204712 5108368 4999850 5003998 4910563
14097D910563j25095J24674l07141J25297k9920k75226J14419j42706J22255l01468
$$ 4910563 4785468 4910142 4603001 4728298 4698378 4423152 4537571 4394865 4517120 4215652
14087D215652K79887J1316j91125j0390M7617j91457m46588J83487L01795l33097
$$ 4215652 4495539 4506855 4315730 4305340 4352957 4161500 3714912 3898399 4200194 3867097
14077C867097J29938l47804l59921N48132k80395K11848K0146l82911J52622q4245
$$ 3867097 3997035 3649231 3289310 3837442 3557047 3768895 3789041 3406130 3558752 3474507
14067C474507J83236k36473K43806l89457L44631M7668l52003R9422j77048L5841
$$ 3474507 3657743 3421270 3665076 3275619 3620250 3667918 3315915 3415337 3238289 3274130
14057C274130l11644K31651N379j42239L9289K5701L0702j24112l73969M81044
$$ 3274130 2962486 3194137 3199516 3057277 3096566 3122267 3152969 3028857 2654888 3135932
14047C135932j93836j38528N3699p7543Q5505L117L2636j21012l76929J92971
$$ 3135932 2942096 2803568 2857267 2779724 2865229 2868346 2900982 2779970 2403041 2596012
14037B596012r0179K90425j64217k1621K49038j45333r4145m208l8810o9721q6542
$$ 2596012 2505833 2796258 2632041 2610420 2859458 2714125 2619980 2615772 2576962 2507241 2420699
14026B420699J68439j90367N4744l00671J63902p191m8965M0645k17191K54058
$$ 2420699 2589138 2398771 2453515 2152844 2316746 2309555 2260590 2301235 2084044 2338102
14016B338102n66188K34970K14011N6295l89308J11867J3847j90098J52832o1774
$$ 2338102 1771914 2006884 2220895 2277190 1887882 1999749 2013596 1823498 1976330 1914556
14006A914556L39429j97972j07767N3583p6809K78057m42325J35073L09084j63242
$$ 1914556 2253985 2056013 1948246 2001829 1925020 2203077 1760752 1895825 2204909 2041667
13996B041667l7558K12538k12351R7668L00894K86106M49651J432376K711323
$$ 2041667 2004109 2216647 2004296 2101964 2402858 2688964 3138615 4570991 7282314
13987G282314N443096Q043629N221039l984763p486891m863574k849800j784939
$$ 7282314 12725410 20769039 25990078 22005315 14518424 9654850 6805050 5020111
13979E020111o81559n56155m40286m73398k08965O0694o3915l19279L74109l82305
$$ 5020111 4338552 3782397 3342111 2868713 2659748 2720442 2656527 2337248 2711357 2329052
13969B329052m8093J75151m82913q257J31292m7723l58492P8337p3813J33784
$$ 2329052 2280959 2456110 1973197 1964940 2096232 2048509 1690017 1768354 1694541 1828325
13959A828325K26256o35306L66129N0122l8228k48439M23617j98373N9241k95188
$$ 1828325 2054581 1419275 1785404 1835526 1797298 1548859 1972476 1774103 1833344 1538156
13949A538156j9417P5007l232k17074K89316j85227k35673M26462k77313J10085
$$ 1538156 1518739 1593746 1590514 1373440 1662756 1477529 1241856 1668318 1391005 1501090
13939A501090m5352o3081M25591n62886J79204J3203r3824p8274J87653k43189
$$ 1501090 1455738 1392657 1818248 1255362 1434566 1447769 1353945 1275671 1463324 1220135
13929A220135k0401O2776J54012J07376K53752n54999l18067K21295M16309l30885
$$ 1220135 1199734 1262510 1416522 1523898 1777650 1222651 904584 1125879 1542188 1211303
13919A211303j19617Q1560J53564j17443K65068k82776P2944L80690q8620k24164
$$ 1211303 1091686 1173246 1326810 1209367 1474435 1191659 1264603 1645293 1556673 1332509
13909A332509J07211n04502K55140J92270m43681K26224M26430n63048n1823P897
$$ 1332509 1439720 935218 1190358 1382628 938947 1165171 1591601 1028553 976730 984627
13899I84627J97693j09754L36769k34473k78467J0904K2886j3673l3732M12254
$$ 984627 1182320 1072566 1409335 1174862 896395 907299 930185 916512 882780 1295034
13889A295034j11506M52905o31593K02382K7704m1448J7872l33164L19348l04506
$$ 1295034 1183528 1636433 1004840 1207222 1234926 1193478 1211350 878186 1197534 893028
13879H93028K75413j46560l36139J57435N22434k39439j63103J5109m6410j51816
$$ 893028 1168441 1021881 685742 843177 1365611 1126172 963069 978178 931768 779952
13869G79952R0788J43946J08334K14809l56802K6043j50633j73899M20855J60925
$$ 779952 870740 1014686 1123020 1337829 981027 1007070 856437 682538 1103393 1264318
13859A264318k51975j34722j8550K62584j23643j64333l552j03460O1685m9417
$$ 1264318 1012343 877621 859071 1121655 998012 833679 830127 726667 788352 738935
13849G38935J16663J90868j13408l77233m3523K46448K25966k60236K64663k45849
$$ 738935 855598 1046466 933058 555825 512302 758750 984716 724480 989143 743294
13839G43294J40447j13106J99641J82500E71956K32904j46676K76586J43883m74367
$$ 743294 883741 770635 970276 1152776 571956 804860 658184 934770 1078653 604286
13829F04286K88398l28753J79949l6836K38478k47240n3814j16613K35854j0202
$$ 604286 892684 563931 743880 707044 945522 698282 644468 527855 763709 753507
13819G53507L4900j87770N9140o5383r474n0272j16068J8836N60758l63023j15033
$$ 753507 788407 600637 659777 594394 584920 534648 418580 437416 998174 635151 520118
13808E20118J45480k18652K05796l01358M62438j97304P2833J00189j72437K56715
$$ 520118 665598 446946 652742 351384 813822 616518 689351 789540 617103 873818
13798H73818j09868j66104R7567j66795K67132j07758J83254k10032L9044J99415
$$ 873818 763950 597846 695413 528618 795750 687992 871246 661214 700258 899673
13788H99673C62658J26837J77506j49367Q0168j14663n0579K47380J64075J38970
$$ 899673 362658 489495 667001 517634 597802 483139 432560 679940 844015 982985
13778I82985k16300j35763p0834J68675j05307l03814L33754j38316j25984M49948
$$ 982985 766685 630922 560088 728763 623456 319642 653396 515080 389096 839044
13768H39044J53074m53765J56519m3163j31016O4757Q9340B81617M19740J39506
$$ 839044 992118 538353 694872 651709 520693 585450 674790 281617 701357 840863
13758H40863m03221J22682K09437o8447j60364J62833j09967J31021N193L4899
$$ 840863 437642 560324 769761 701314 540950 703783 593816 724837 730030 764929
13748G64929k43287L65454k68356K8429k29901J3705M705j025j23783N54424k88044
$$ 764929 521642 887096 618740 647169 417268 430973 435678 434653 310870 865294 577250
13737E77250A41786N69335l48854J73782J17006p8135K4307l338p1630Q9573R8101
$$ 577250 141786 711121 362267 536049 653055 574920 599227 595889 524259 613832 711933
13726G11933k90370M4530J94655k04211Q4530k69471J34657P2252J32629l04657
$$ 711933 421563 466093 660748 456537 541067 271596 406253 478505 611134 306477
13716C06477J5170K61114k10079P0152m8965J00493M78099k90000l8715k76576
$$ 306477 321647 582761 372682 442834 393869 494362 972461 682461 643746 367170
13706C67170n5213K24300k10417j8219L33286j52411l1365o9811J59090j00295
$$ 367170 311957 536257 325840 307621 640907 488496 457131 387320 546410 446115
13696D46115j42228N8004P9091L9406j38110J01413Q1744j72081J82364k34101
$$ 446115 303887 361891 440982 480388 342278 443691 525435 353354 535718 301617
13686C01617r598J82417j18014j36090R4365J20781j75348o2777J39322j10312
$$ 301617 292019 474436 356422 220332 314697 435478 260130 197353 336675 226363
13676B26363J40340K35373k43010J19145j65091N2653m8058k3765K06968j66325
$$ 226363 366703 602076 359066 478211 313120 365773 317715 293950 500918 334593
13666C34593N6230Q6013K18455j06224A37919M64518J5489B61959J67641j61074
$$ 334593 390823 476836 695291 589067 137919 602437 617926 261959 429600 268526
13656B68526n6826J66694J96518B72315J06800n080B6532O30584B20923J14667
$$ 268526 211700 378394 574912 272315 379115 374035 26532 657116 220923 335590
13646C35590l0987A13272J86383H5210J75820L66973N720k29045j92197J82523
$$ 335590 304603 113272 299655 85210 261030 628003 633723 404678 212481 395004
13636C95004J19301m3676j05713K57999j44340k18972k0763n9526J43903J23078
$$ 395004 514305 470629 364916 622915 478575 259603 238840 179314 323217 446295
13626D46295p5390N200l077m9575j12747j8535L42610k28157J66477o6814n7048
$$ 446295 370905 376105 373028 323453 210706 192171 534781 306624 473101 406287 349239
13615C49239l7044Q9162A80514J17371j11540j6180A5335O30910d3978H1531J42457
$$ 349239 312195 401357 180514 297885 186345 170165 15335 646245 -43978 81531 223988
13604B23988a14623A15283M29106B54598i2207D77333n5521j40747l3126p2089
$$ 223988 -114623 115283 544389 254598 -92207 477333 421812 281065 247939 175850
13594A75850J61008J15268j07755J0235j73074J18653Q6179j77664L05482B03074
$$ 175850 336858 452126 344371 354606 181532 300185 386364 208700 514182 203074
13583D79222k9433A30243J74962J15688q0862A66521K16363A52856q927R0538
$$ 479222 449789 130243 305205 420893 340031 166521 382884 152856 143929 234467
13573B34467K81391L0471q890B07274m5374P1123I4903l3380L44377o1237m7337
$$ 234467 515858 546329 537439 207274 161900 233023 94903 61523 405900 344663 297326
13562B97326K10256k06339K26662k18248j27151J45728M7757H0167O6421E9005
$$ 297326 507582 301243 527905 309657 182506 328234 375991 80167 146588 59005
13551D17127P2450A85588k236L7919F7932J23529p6660K0572L20242R8587F0583
$$ 417127 489577 185588 183352 221271 67932 191461 114801 135373 455615 554202 60583
13539B50043I2136J42110R2375q9846d494C34849K78849l01431f2354E2828Q5426
$$ 250043 92136 234246 326621 236775 -4494 334849 613698 312267 -62354 52828 138254
13528A38254L17852q4015n1307J09843e4549A55473N9892K60453j79880J81292
$$ 138254 456106 372091 320784 430627 -54549 155473 215365 475818 295938 477230
13518D77230A55002D2651M18368J02600B73086K3549M6682N4937j23813O6525
$$ 477230 155002 42651 461019 563619 273086 296635 343317 398254 274441 340966
13508C40966l6679J14974j31906p3996G6152K20251R9380L0304j98791D3527Q0053
$$ 340966 304287 419261 287355 213359 76152 296403 395783 426087 227296 43527 123580
13497A23580P5652b20507A87332P5234o6051A0204K69871H2625J15525G8735B7218
$$ 123580 199232 -220507 187332 262566 196515 10204 280075 82625 198150 78735 27218
13485D2786a8040A42921L92696k50877N9782A09578K36896F7152L9362h6527E08206
$$ 42786 -18040 142921 535617 284740 344522 109578 346474 67152 106514 -86527 508206
13473B28416L5678j26638J32423o786G281M63965A65953q903Q0436K3139M128
$$ 228416 264094 137456 269879 263093 7281 471246 165953 157050 237486 260625 264753
13462B64753K60108B8528K98722p1088J82454b9769A87361J88702P1041A93967
$$ 264753 524861 28528 327250 256162 438616 -29769 187361 376063 447104 193967
13451e0918A60644K39190r8081Q1630A41544A5499K16732r5167c4169B56579C6162
$$ -50918 160644 399834 301753 383383 141544 15499 232231 137064 -34169 256579 36162
13439D49061j15840C7164L30289q8924a92116C99909A03386e3080C26913D5070
$$ 449061 333221 37164 367453 278529 -192116 399909 103386 -53080 326913 45070
13428A97154c1638A20354J21752J29947j3237G7883a8184B16206d1297B29999
$$ 197154 -31638 120354 242106 372053 358816 77883 -18184 216206 -41297 229999
13417e7194j05467C7462M40833j98459J75671B3661K04119P6995A8294J44906
$$ -57194 -162661 37462 478295 279836 455507 23661 227780 304775 18294 163200
13407A63200K38682j93872j4296h0491m6585B06476f9317D13475F8350J09704
$$ 163200 401882 208010 193714 -80491 -127076 206476 -69317 413475 68350 178054
13397A78054l0405J39204J15832j03775N0687j28727b638H5153b9157A44124i7272
$$ 178054 147649 286853 402685 298910 349597 220870 -2638 85153 -29157 144124 -97272
13385C42462C958a0002j93370A09468i4614D16303C9113J16509g2043B32611A8605
$$ 342462 3958 -10002 -203372 109468 -94614 416303 39113 155622 -72043 232611 18605
13373A15917a85053D73132b3148F15373e6816p6923B66265l7801l487J4977k3837
$$ 115917 -185053 473132 -23148 615373 -56816 -133739 266265 228464 224977 239954 216117
13362B16117p386q2137f5037a0259B18049d8764C00116i7889D98489k13780e211
$$ 216117 208731 126594 -65037 -10259 218049 -48764 300116 -97889 498489 284709 -5211
13350A78932E9467A0990M9517J02255n2144L67891A1290M11894j20056A08544
$$ 178932 59467 10990 60507 162762 110618 478509 11290 423184 303128 108544
13339A60107J57715A17552n5996M21082B18913a99799B09690j7378D2435M50374
$$ 160107 317822 117552 61556 482638 218913 -199799 209690 192312 42435 492809
13329D92809r8050j44406k4026g0166A39057F3848L38827I0545J07093m4757M5338
$$ 492809 394759 250353 226327 -70166 139057 63848 402675 90545 197638 152881 198219
13318A98219K7197a4565C09243A25757J01228K82385k17600i023A68702K13727
$$ 198219 225416 -14565 309243 125757 226985 509370 291770 -9023 168702 382429
13308C82429b374q9990B3229K43428r8044d5563o2459A73592E1462f5910B21601
$$ 382429 -2374 -92364 23229 266657 168613 -45563 -108022 173592 51462 -65910 221601
13296A36367a7903b221B9356a1941l0981A48502M5241b26756D85690k28164e754
$$ 136367 -17903 -2221 29356 -11941 -42922 148502 193743 -226756 485690 257526 -5754
13284a54735b347A07196M5743J12698H8370K4425K40898C8931L68487j43113c8938
$$ -154735 -2347 107196 152939 265637 88370 112795 353693 38931 407418 264305 -38938
13272A48161J74155F2423a4117B00646p2916l5321K69460p2916p5562G9412B5148
$$ 148161 322316 62423 -14117 200646 127730 92409 361869 288953 213391 79412 25148
13260A28147J30490O1159A42141E701J04898J56849N2980D1106b886A29948A5605
$$ 128147 258637 319796 142141 5701 110599 267448 320428 41106 -2886 129948 15605
13248a650j9288C31639C4211J88973k2589i9664B13361d5263A96587a20324C27698
$$ -1650 -20938 331639 34211 223184 200595 -99664 213361 -45263 196587 -120324 327698
13236A80094G6368J07307B6627b30854Q2662a3924B13530p7700O7640q1247k9336
$$ 180094 76368 183675 26627 -230854 -148192 -13924 213530 135830 203470 122223 92887
13225I2887a5401A92111f9728j9804D6203b31880J9627R8155M3720n266A09257
$$ 92887 -15401 192111 -69728 -89532 46203 -231880 -212253 -114098 -70378 -75644 109257
13213b20686G1727P3986F1986P4201J07927g3293B36670a31911A91864D516L08206
$$ -220686 71727 145713 61986 136187 244114 -73293 236670 -131911 191864 4516 312722
13202C12722j31229N26207I0487K8242b0346A22808O5626k8942k4320e7831p3820
$$ 312722 181493 707700 90487 118729 -20346 122808 188434 159492 135172 -57831 -131651
13191a31651D5838K22676b1602B22089d7864p5444A50365b3228A19176N9346m8376
$$ -131651 45838 268514 -21602 222089 -47864 -123308 150365 -23228 119176 178522 130146
13180A30146c9143B14617p3044l5504M1407J07067r8247o9622O2959a23073L0207
$$ 130146 -39143 214617 141573 106069 147476 254543 156296 86674 149633 -123073 -92866
13169i2866o6642B38162a4741B58218p4429J58309B1477K80005F825J73912a8700
$$ -92866 -159508 238162 -14741 258218 183789 342098 21477 301482 6825 180737 -18700
13157A06058J22411A00695j7574A2331h6179A3227L35605E1718K75367c5347A99027
$$ 106058 228469 100695 83121 12331 -86179 13227 348832 51718 327085 -35347 199027
13145d7351A30192d690D19099J5232A42291J0573K13626a54280c3237Q518G7780
$$ -47351 130192 -4690 419099 434331 142291 152864 366490 -154280 -33237 -24719 77780
13133A22339E7377J49141e1108A25675c17614h1292G863a62227B78515j03916
$$ 122339 57377 206518 -51108 125675 -317614 -81292 7863 -162227 278515 174599
13123A74599B0636J28328j0098D3034O2416J04163d9104B40942c39407i4598D3131
$$ 174599 20636 148964 138866 43034 105450 209613 -49104 240942 -339407 -94598 43131
13111D9037c6758l88p1378H0674b15866f1628D04960a02269A25217K07086g4389
$$ 49037 -36758 -37146 -108524 80674 -215866 -61628 404960 -102269 125217 332303 -74389
13099a04979I216a09030C71522a0585F7770N3058L98833k42518g0713B72943h5452
$$ -104979 9216 -109030 371522 -10585 67770 120828 519661 277143 -70713 272943 -85452
13087D27161j93094c5812A61709e0819B31135b500j44813A54692G0393B3553J05142
$$ 427161 234067 -35812 161709 -50819 231135 -2500 -147313 154692 70393 23553 128695
13076A28695a11926A75739J57938A23327a05608K7570F9822R1805c1290A76995
$$ 128695 -111926 175739 333677 123327 -105608 -78038 69822 161627 -31290 176995
13065C94615A82520a05444A02021m0486J6056A653b18178A43370d1509j59226
$$ 394615 182520 -105444 102021 61535 77591 1653 -218178 143370 -41509 -200735
13055b00735A22458K5530J19963f815C88037j75466I1421Q9300Q5898b1477N305
$$ -200735 122458 147988 267951 -6815 388037 212571 91421 180721 266619 -21477 -16172
13044a6172C05297j34427a1048B38884E9460r657J9761L920N9228J39276e6065
$$ -16172 305297 170870 -11048 238884 59460 49803 69564 73484 132712 271988 -56065
13032a9178G7076c3195D06567q2285E0235b27504C55632O178H3885b04540A76621
$$ -19178 77076 -33195 406567 324282 50235 -227504 355632 361810 83885 -204540 176621
13020B12938N9302a54795B01789m3118k4994e5160I9433J32605o0304a4592B57224
$$ 212938 272240 -154795 201789 158671 133677 -55160 99433 232038 171734 -14592 257224
13008H0331i2136D25573j98344J29369f1967C4302J79850l6705H4783a4852D7439
$$ 80331 -92136 425573 227229 356598 -61967 34302 214152 177447 84783 -14852 47439
12996A91636o8674a713I4377J14798c10049N6032D90037a22090C1049b66020F0276
$$ 191636 122962 -1713 94377 209175 -310049 -254017 490037 -122090 31049 -266020 60276
12984B42426k9793a81855a9972k5751F4783J46391A01698K0796l383b59556J22083
$$ 242426 212633 -181855 -19972 -45723 64783 211174 101698 122494 119111 -259556 -137473
12973a37473C10827F6834a02797I7975J3847i4533A7106P7501O3972J64829J6734
$$ -137473 310827 66834 -102797 97975 111822 -94533 17106 94607 158579 323408 340142
12962C40142A11174h4050j16626HQ2479d0299D3823A7873b96033A94660E2139
$$ 340142 111174 -84050 -200676 8 82487 -40299 43823 17873 -296033 194660 52139
12950A36867b4302B09171a5091j55639A97112F7913K4716O5628f8207B05332d42450
$$ 136867 -24302 209171 -15091 -170730 197112 67913 92629 158257 -68207 205332 -442450
12938B9387O7290K3498k0777j4700k8260A7526K23817h7807j13824J0388J9555
$$ 29387 96677 120175 99398 84698 56438 17526 241343 -87807 -201631 -191243 -171688
12927a71688E9020a16244l5773C9123K79257b0180C94005I4557R8017E1026L8664
$$ -171688 59020 -116244 -152017 39123 318380 -20180 394005 94557 192574 51026 89690
12916H9690b17318c2977k18991I2896Q5504e5630a9978A11620P7091G1948K36556
$$ 89690 -217318 -32977 -251968 92896 178400 -55630 -19978 111620 188711 71948 308504
12905C08504j39560E0949d577j76188L6232C37763B1887f2291B57905H4725A9825
$$ 308504 168944 50949 -4577 -180765 -144533 337763 21887 -62291 257905 84725 19825
12893G5548M64182H3842O1665Q0047k5293A5307a17587n1936P7535M0405l0551
$$ 75548 539730 83842 145507 225554 200261 15307 -117587 -169523 -91988 -51583 -82134
12882h2134n469A11482a66278B47897A8003O0597a25638D3554j6217M0645K05999
$$ -82134 -87603 111482 -166278 247897 18003 78600 -125638 43554 27337 67982 273981
12871B73981p5088a40154G7045b64544L964B02586b5116C73980a26130f1981B30757
$$ 273981 198893 -140154 77045 -264544 -260580 202586 -25116 373980 -126130 -61981 230757
12859a20434d8120k3021A79455K3730a36875G6957A2628b1194R058A12753a37350
$$ -120434 -48120 -71141 179455 203185 -136875 76957 12628 -21194 -12136 112753 -137350
12847b6424D2283J75704M0262c5881j34650M3957j37992D9161g348m3677a3243
$$ -26424 42283 217987 258249 -35881 -170531 -126574 -264566 49161 -7348 -51025 -13243
12835B65107F4770c10078B84428b21713j76597a50439f9306A62480F3M5353J53857
$$ 265107 64770 -310078 284428 -221713 -398310 -150439 -69306 162480 63 45416 199273
12824A99273d7897A23626c72024a43911A22761L72853b14111d4597j39319A2298
$$ 199273 -47897 123626 -372024 -143911 122761 495614 -214111 -44597 -183916 12298
12813b17174O4115H0790J71331I1655b6463j13026A34889a18431b2938B16444
$$ -217174 -153059 80790 252121 91655 -26463 -139489 134889 -118431 -22938 216444
12802F0053d12259A1666Q4377H991c59292a61666a0677E2437J09391a00474q2591
$$ 60053 -412259 11666 96043 8991 -359292 -161666 -10677 52437 161828 -100474 -183065
12791a83065d0831A03767m2381b33560B38242r1940e9489B2862c70774A10290
$$ -183065 -40831 103767 61386 -233560 238242 146302 -59489 22862 -370774 110290
12780A06818K46093E4848M1031B6277K6699K81102E3553P6567b40783b0689C50120
$$ 106818 352911 54848 95879 26277 52976 334078 53553 130120 -240783 -20689 350120
12768f6979D6513g9535p4567A4092J25650K00288a34712C56909a37214K412N2204
$$ -66979 46513 -79535 -154102 14092 139742 340030 -134712 356909 -137214 -134802 -82598
12757h2598D23582b05301f1669D6006f3414H8802J39748A8184K94847A50894m9737
$$ -82598 423582 -205301 -61669 46006 -63414 88802 228550 18184 313031 150894 101157
12746A01157k7962J59351a3592C12832L908a7247B55802J8723K23100j86189I8159
$$ 101157 73195 232546 -13592 312832 316740 -17247 255802 274525 497625 311436 98159
12734d6599B04585F4845a02269Q454b2507H8552a96279G9092N5766K1651o7681
$$ -46599 204585 64845 -102269 -93815 -22507 88552 -196279 79092 134858 156509 88828
12723H8828k9814c60447i7639E2949A7282L8550G063c4557G3157a35456B28031
$$ 88828 59014 -360447 -97639 52949 17282 55832 7063 -34557 73157 -135456 228031
12711b63166a18681c8731g58A9062N9094a03433B16885K99218k34102a1173K159
$$ -263166 -118681 -38731 -758 19062 78156 -103433 216885 516103 282001 -11173 -9014
12700i014A77310a53115B60995b12217E2122j3845h9998a7991D9023a33886E1332
$$ -9014 177310 -153115 260995 -212217 52122 38277 -89998 -17991 49023 -133886 51332
12688C4888e0355C28712E0345J01797h2200c7552A63763J5180G6106A2280a44955
$$ 34888 -50355 328712 50345 152142 -82200 -37552 163763 178943 76106 12280 -144955
12676I8286k286a008B1346K75648h0398B11331o7426k5249a44069I7835J1511
$$ 98286 96000 -1008 21346 296994 -80398 211331 143905 118656 -144069 97835 109346
12665A09346f2252j9960B2381a06352A01872L8529b9029B29250d6532r9856B30429
$$ 109346 -62252 -82212 22381 -106352 101872 140401 -29029 229250 -46532 -146388 230429
12653C46518a81281G191K10940l1601J13426j09787K42430A56758c24779c2780
$$ 346518 -181281 7191 218131 186530 299956 190169 432599 156758 -324779 -32780
12642A90890b3077B10545f1160j44381C18694E2969g5514G163J91426f5642m0751
$$ 190890 -23077 210545 -61160 -205541 318694 52969 -75514 7163 198589 -65642 -106393
12631a06393B6930J66080K71916j91446a7102A82817G3443i5956J2492D9216J68407
$$ -106393 26930 193010 464926 273480 -17102 182817 73443 -95956 -83464 49216 217623
12620B17623r4990a53422p8903F52J16238g148j75998p1373B86797B6495M6808
$$ 217623 122633 -153422 -232325 652 116890 -7148 -183146 -254519 286797 26495 73303
12609G3303N3759b6578r2636A57375n548p3204a84968A31677a7136C68003A59053
$$ 73303 127062 -26578 -119214 157375 151827 78623 -184968 131677 -17136 368003 159053
12597a24255k10619a5895B28199a93665C9224J44860e0553B26616a2648k82038
$$ -124255 -334874 -15895 228199 -193665 39224 184084 -50553 226616 -12648 -294686
12587b94686L6071A2403g7139n1207A62657G1372J09728c2192A37917J6021E8064
$$ -294686 -258615 12403 -77139 -128346 162657 71372 181100 -32192 137917 153938 58064
12575A3635f4349b5941j37262b7532l10944A83162G9268b04509B16611E3870P1989
$$ 13635 -64349 -25941 -163203 -27532 -338476 183162 79268 -204509 216611 53870 125859
12564A25859k4206D6280R7139J10671G5647c39212P9592L1874A5481f3833o4434
$$ 125859 101653 46280 143419 254090 75647 -339212 -259620 -227746 15481 -63833 -128267
12553a28267B9451c4589A76371K1867F2689Q3330c5627I0271L22511h8944p2022
$$ -128267 29451 -34589 176371 198238 62689 146019 -35627 90271 412782 -88944 -160966
12542a60966e5273j92349J19425G9347c5770j9507k20633J16938P9112B56207
$$ -160966 -55273 -247622 -128197 79347 -35770 -55277 -275910 -158972 -79860 256207
12531A85701a05901M1694h478B51894i8205D7936J91709f8378E9647a76474D038
$$ 185701 -105901 -64207 -8478 251894 -98205 47936 239645 -68378 59647 -176474 4038
12519A06306b53952B27071a70694A10456c05385D70666B2859b07385L322B33380
$$ 106306 -253952 227071 -170694 110456 -305385 470666 22859 -207385 -204063 233380
12508A35873Q2397L3520D6820g0378A8215N5910J17173b11198L3139C53264G6341
$$ 135873 218270 251790 46820 -70378 18215 74125 191298 -211198 -178059 353264 76341
12496b59600C17110f6781B82616r5529c7523p956r2242D6617D264K626N625L21211
$$ -259600 317110 -66781 282616 187087 -37523 -45479 -137721 46617 4264 6890 12515 333726
12484C33726c1344A42844a64522B09604a5069k44732f4502F06332c00634d4634
$$ 333726 -31344 142844 -164522 209604 -15069 -259801 -64502 606332 -300634 -44634
12473I5088a55915B41274F3437a34639c3177l03762A82268L35450e4447o4809
$$ 95088 -155915 241274 63437 -134639 -33177 -336939 182268 517718 -54447 -119256
12463a19256k45686i1090j46751i2411A9666a15826d8721B9431h1567m5967j32403
$$ -119256 -364942 -91090 -237841 -92411 19666 -115826 -48721 29431 -81567 -127534 -259937
12452b59937H5898J22126b1333I4889J46703b9728j71101B64179b06050f2328
$$ -259937 85898 208024 -21333 94889 241592 -29728 -200829 264179 -206050 -62328
12441a14691G9294A6314a02598d4247k47646e2051b576l42785A09218J12741g706
$$ -114691 79294 16314 -102598 -44247 -291893 -52051 -2576 -345361 109218 221959 -7706
12429B82645b33260j88169B77800o1047R446A02616E310f212j91679l1629l0711
$$ 282645 -233260 -421429 277800 216753 226199 102616 5310 -6212 -197891 -229520 -260231
12418b60231Q9154a4545C1503b09830Q3580m993b1756k13968D2875a6641o5877
$$ -260231 -171077 -14545 31503 -209830 -126250 -131243 -21756 -235724 42875 -16641 -82518
12407h2518C8037N6226O0984J71090c50082a37501K1333M6620H4320b54701A66626
$$ -82518 38037 94263 155247 326337 -350082 -137501 -116168 -69548 84320 -254701 166626
12395B80188a16572A12102K17484b13629B10130b17915f213n794F7806a46568
$$ 280188 -116572 112102 329586 -213629 210130 -217915 -6213 -12007 67806 -146568
12384B08582h1962A18074J11479a1349A85549C5480a50841j5761p7703B52066
$$ 208582 -81962 118074 229553 -11349 185549 35480 -150841 -166602 -244305 252066
12373d6072A28954e8451B81327j4675I9871J64361F2452b68050K9036g2901Q775
$$ -46072 128954 -58451 281327 266652 99871 264232 62452 -268050 -239014 -72901 -64126
12362f4126A31906e6540D77599A84343B7223b09136N8530B08810P2833H5090b30354
$$ -64126 131906 -56540 477599 184343 27223 -209136 -150606 208810 281643 85090 -230354
12350A4789d6142b1509B39498c3676A87422b10017C8779J1300b0881j69285B0813
$$ 14789 -46142 -21509 239498 -33676 187422 -210017 38779 50079 -20881 -190166 20813
12338b9465F5119b46162a1696o0054B2024b2127k42919B37559a21196c8445B42072
$$ -29465 65119 -246162 -11696 -71750 22024 -22127 -265046 237559 -121196 -38445 242072
12326b0170j26871b6510A45290K4820p8312B3798L54154j41934p6551b6404A33754
$$ -20170 -147041 -26510 145290 170110 91798 23798 377952 236018 159467 -26404 133754
12314A61828J02325G2270P2401i8428B33381g0390H8963J76513K227a16589b401
$$ 161828 264153 72270 144671 -98428 233381 -70390 88963 265476 267703 -116589 -2401
12302B4791a88064M2800A97366h2809A34406d05197B11072g7677b5762r6931A20401
$$ 24791 -188064 -145264 197366 -82809 134406 -405197 211072 -77677 -25762 -122693 120401
12290h089D27202b29510B13297m2138j8073b36474C03782E1719a83773B3838i191
$$ -8089 427202 -229510 213297 171159 153086 -236474 303782 51719 -183773 23838 -9191
12278I8810b83021E6542N743b46440a12438B584J08310a22013B12899G4033d7492
$$ 98810 -283021 56542 62285 -246440 -112438 2584 110894 -122013 212899 74033 -47492
12266c356m376A28029K6084M8740q8365D0357G845O4488a23490N1029j38998D0536
$$ -3356 -7732 128029 154113 202853 114488 40357 7845 72333 -123490 -72461 -211459 40536
12253B85002F1640j9243K66149a22998D8479E758P3844H002a23777B9762M6258
$$ 285002 61640 42397 308546 -122998 48479 5758 79602 8002 -123777 29762 76020
12242G6020b74076a18544A38501L7091l7795J06723G3499J6718J94529G5125b9812
$$ 76020 -274076 -118544 138501 175592 137797 244520 73499 90217 284746 75125 -29812
12230a31528j07612M8798B1651J98532o5766a03888B91930a04470C41994n6432
$$ -131528 -239140 -190342 21651 220183 154417 -103888 291930 -104470 341994 285562
12220B85562o6170I0729J31199p6482M4603d9702A11116C4660a08950A04459L5338
$$ 285562 219392 90729 221928 145446 190049 -49702 111116 34660 -108950 104459 139797
12209A39797F2511K6800a02874I9762j0891b2465C7341h1537C49615A1589K39977
$$ 139797 62511 89311 -102874 99762 88871 -22465 37341 -81537 349615 11589 251566
12198B51566j2117A09320K36951I6409J82089J1721a76785B43494b8792j6840
$$ 251566 239449 109320 346271 96409 278498 290219 -176785 243494 -28792 -45632
12188d5632E3960k156q933a16537A4847J36406j7935h5133g50m4580A8493L57773
$$ -45632 53960 51804 42871 -116537 14847 151253 133318 -85133 -750 -45330 18493 376266
12176C76266A74673p2263N7892l4192Q506a62285A00700D7576J52755G9426B6903
$$ 376266 174673 102410 160302 126110 134616 -162285 100700 47576 200331 79426 26903
12164b5480B12191D48N3450K71560D6353N1506c8264k9361B9875a03180j8357
$$ -25480 212191 448 53898 325458 46353 97859 -38264 -67625 29875 -103180 -121537
12153a21537A52072a80709F6805O5409J47233d0518H033R1307O5015b21641d3629
$$ -121537 152072 -180709 66805 132214 279447 -40518 8033 99340 164355 -221641 -43629
12141A77755F3494P7701J29954b13233A27641a4503k35891R4619O2271n124k3036
$$ 177755 63494 141195 271149 -213233 127641 -14503 -250394 -155775 -93504 -98628 -121664
12130a21664A89757C7700R30J11418c85059a17142A58234a71259D01478I3738
$$ -121664 189757 37700 38630 150048 -385059 -117142 158234 -171259 401478 93738
12119d12522B40052j02887j3520R531b4225q6715k6895B50118M8945a17638F0458
$$ -412522 240052 137165 123645 133176 -24225 -110940 -137835 250118 299063 -117638 60458
12107A2021K52529m97A23822b30608H9831d8829n7989B13053h274n1741j36691
$$ 12021 264550 264053 123822 -230608 89831 -48829 -106818 213053 -8274 -60015 -196706
12096a96706c1466k9732E3702f4748K3356q5112A23337a63828A2540N81833a42105
$$ -196706 -31466 -61198 53702 -64748 -41392 -126504 123337 -163828 12540 594373 -142105
12084C51597J2706A49836D6355b54796k11929A29502C7683P1345a97095c1072
$$ 351597 364303 149836 46355 -254796 -466725 129502 37683 109028 -197095 -31072
12073C66416j62604G9280J31511a04931b7900l745r8474C14349r9999a67012d620
$$ 366416 203812 79280 210791 -104931 -27900 -31645 -130119 314349 214350 -167012 -4620
12061B9250G722a85411I2792g630a897r7658A23571e7598J2997J5219H3881f220
$$ 29250 7722 -185411 92792 -7630 -1897 -99555 123571 -57598 -44601 -29382 83881 -6220
12048A48838m9079J91246c5476A09040b7014A81809E5752b22346I604J17709b5321
$$ 148838 99759 291005 -35476 109040 -27014 181809 55752 -222346 9604 127313 -25321
12036c73916B04213d8669B17931a26709D3649d9822G3833c2865A26661C4586f3950
$$ -373916 204213 -48669 217931 -126709 43649 -49822 73833 -32865 126661 34586 -63950
12024I1973a53095C66975A11134J387Q141a81091m081r5814a17618A10329B8100
$$ 91973 -153095 366975 111134 112521 120662 -181091 -185172 -280986 -117618 110329 28100
12012a44494f8426j28103C90377E9667J09939j0559b3402o276D2873a01729j77439
$$ -144494 -68426 -196529 390377 59667 169606 159047 -23402 -29678 42873 -101729 -279168
12001b79168J25469B61432E5787k7581d1226A49111a05307a1291l05878d062A68796
$$ -279168 -153699 261432 55787 28206 -41226 149111 -105307 -11291 -317169 -4062 168796
11989c26910d2884J7235j13697j946B16218a41481J0993L6058j08076j7434B1941
$$ -326910 -42884 -25649 -139346 -141292 216218 -141481 -130488 -94430 -202506 -219940 21941
11977g8114Q644l115p3836m8480a6871I3088f2261J8160k2508m2118J9258l0919
$$ -78114 -69470 -72585 -146421 -194901 -16871 93088 -62261 -44101 -66609 -108727 -89469 -120388
11965a20388j0526A44136m7563a89685A87583B1508b23682B07482b28243d6745
$$ -120388 -130914 144136 96573 -189685 187583 21508 -223682 207482 -228243 -46745
11954a31105j8444B7650J18637a20206n4932C6286J87535M826b5573A08457f03381
$$ -131105 -149549 27650 146287 -120206 -175138 36286 223821 228647 -25573 108457 -603381
11942b04077J01326C8017K1009h5495D665a92355M3631f500j46227E5378b5669
$$ -204077 -102751 38017 59026 -85495 4665 -192355 -148724 -6500 -152727 55378 -25669
11930g1260J0606j52819A29891K9846a59392A9290M7432R336g749A11219L7025
$$ -71260 -60654 -213473 129891 159737 -159392 19290 66722 76058 -7749 111219 148244
11919A48244m9400b45627c7064j69104A1782E709d5798C682K0849K1908f3912
$$ 148244 98844 -245627 -37064 -206168 11782 5709 -45798 3682 24531 46439 -63912
11907B47184a83343A54700C0246b70693P3250Q3849L6521C8180K64207B9084d37709
$$ 247184 -183343 154700 30246 -270693 -197443 -113594 -77073 38180 302387 29084 -437709
11895B226N6995b14874a5357C84897a75592h5991j04341M5331I4634f1802m2028
$$ 2226 59221 -214874 -15357 384897 -175592 -85991 -190332 -145001 94634 -61802 -103830
11884a03830k25350g8147b564C13803c7592j12151l8030B5044J28541b40570j6336
$$ -103830 -329180 -78147 -2564 313803 -37592 -149743 -187773 25044 153585 -240570 -256906
11873b56906A65109d81496h5343j94404j4082A07676g1380D4028J99018A6440
$$ -256906 165109 -481496 -85343 -279747 -293829 107676 -71380 44028 243046 16440
11862a8019B13423m1508p1006f7304A46092o1944a67882B72354I6799b5817B38692
$$ -18019 213423 171915 100909 -67304 146092 84148 -167882 272354 96799 -25817 238692
11850I4961a88642F9100a07901B11174a60688C06587h7206k74415c5849o5681
$$ 94961 -188642 69100 -107901 211174 -160688 306587 -87206 -361621 -35849 -101530
11840a01530p2150B00012H872J99544a225B20995C0105a67114B14298l6284c1085
$$ -101530 -173680 200012 8872 208416 -1225 220995 30105 -167114 214298 178014 -31085
11828c73477H0321b64489P6861H0275d41539D5976d01673F3838C1130J40513b48390
$$ -373477 80321 -264489 -187628 80275 -441539 45976 -401673 63838 31130 171643 -248390
11816i78F4509J42904B835b7235o2221b3016H9797D327K29432A7755b00833N8652
$$ -978 64509 207413 2835 -27235 -89456 -23016 89797 4327 233759 17755 -200833 -142181
11804a42181k79024a24112I0425J31739J24318G8070P5641l5387b32882I746L4274
$$ -142181 -421205 -124112 90425 222164 346482 78070 153711 118324 -232882 9746 44020
11793D4020B624J92908J26761e38777A28915c27020F036K8752h8447h834n429
$$ 44020 2624 195532 322293 -538777 128915 -327020 6036 34788 -88447 -8834 -14263
11782a4263n3323I1087P4154j7501a89576g5678C8255a18985c4672B17564Q4273
$$ -14263 -67586 91087 165241 147740 -189576 -75678 38255 -118985 -34672 217564 301837
11771C01837c3156C42427j46688I2653Q4778k6378E3579d1005p7043m963d6445
$$ 301837 -33156 342427 195739 92653 177431 151053 53579 -41005 -118048 -123011 -46445
11759b38266C7266b34226g4424A6869a09697o7653F7547a37434f6275j12670i831
$$ -238266 37266 -234226 -74424 16869 -109697 -177350 67547 -137434 -66275 -178945 -9831
11747f7935G0143a04982o9248F4558b43112G601b73125c6089l07436a20316K0433
$$ -67935 70143 -104982 -174230 64558 -243112 7601 -273125 -36089 -343525 -120316 -99883
11736i9883j30728a04635C03634d02231B8464J88915N17F7883L9116a1419H3169
$$ -99883 -230611 -104635 303634 -402231 28464 217379 217896 67883 106999 -11419 83169
11724d24726C1168d61443d4280k56415A831K30554J6480B9319J64931J19639h0350
$$ -424726 31168 -461443 -44280 -300695 1831 232385 248865 29319 194250 313889 -80350
11712g1116J2204C06294a07148A71224C5362h3482A89167r925b14504K7583F3687
$$ -71116 -58912 306294 -107148 171224 35362 -83482 189167 179242 -214504 -186921 63687
11700b45689c5546j02006j0840K2398A15371f4590F5005b89277A80520j1402F2829
$$ -245689 -35546 -137552 -148392 -125994 115371 -64590 65005 -289277 180520 169118 62829
11688E680a77155O6375e0590f235B56532A14062l898j9941M1432K51102F9280
$$ 5680 -177155 -110780 -50590 -6235 256532 114062 110164 90223 131655 382757 69280
11676D84433h0754k12334B80604c3966B81056E7975a09582j9058a5775n9420A66067
$$ 484433 -80754 -293088 280604 -33966 281056 57975 -109582 -128640 -15775 -75195 166067
11664d5808k12472a08402l5113I8845b0420B11628a74821G5485B5719a08503p0855
$$ -45808 -258280 -108402 -143515 98845 -20420 211628 -174821 75485 25719 -108503 -179358
11653a79358H2361J22227b93273B10376b9335B16454q5174N447a71303d8672l51488
$$ -179358 82361 204588 -293273 210376 -29335 216454 131280 136727 -171303 -48672 -400160
11642d00160e8781j98987o797B3307a24338d0178m9356A69981b42228M2183L3467
$$ -400160 -58781 -257768 -264565 23307 -124338 -40178 -89534 169981 -242228 -200045 -166578
11631a66578D06587j02899A3536e8567A17906f5966b5004B3608M1269J61420R5193
$$ -166578 406587 303688 13536 -58567 117906 -65966 -25004 23608 64877 226297 321490
11620C21490B5137M8451h703k31915Q186A84246c2214A53727b46739J03838j0869
$$ 321490 25137 73588 -8703 -240618 -232432 184246 -32214 153727 -246739 -142901 -153770
11609a53770k10084B17071M1634E6430d7178C02079l2136j20138R1764G3130a6162
$$ -153770 -363854 217071 258705 56430 -47178 302079 269943 149805 241569 73130 -16162
11597h8672j36257B8199h0208F7095K78801E3167a60303B07975i4353F6262K00834
$$ -88672 -224929 28199 -80208 67095 345896 53167 -160303 207975 -94353 66262 267096
11586B67096q9518b14135A91372a37929c351B62333b21983e9337A08426a34538
$$ 267096 177578 -214135 191372 -137929 -3351 262333 -221983 -59337 108426 -134538
11575B49288B594f5550J4402A49900m440i8207l3522A866a08017m918A35917a88339
$$ 249288 2594 -65550 -51148 149900 145460 -98207 -131729 1866 -108017 -112935 135917 -188339
11562g6316C05669B3297p257d4203k6732A72631k1177b21458B36049A11938b38758
$$ -76316 305669 23297 16040 -44203 -70935 172631 151454 -221458 236049 111938 -238758
11550D9829Q4510E4765J14644h3520K8659H4653M718L818O1919a52334H7002d66758
$$ 49829 134339 54765 169409 -83520 -54861 84653 89371 93189 155108 -152334 87002 -466758
11537c5379C07948j36023R7813g1662C2877a97615K9715A04464E877d78645A11582
$$ -35379 307948 171925 269738 -71662 32877 -197615 -167900 104464 5877 -478645 111582
11525A47526o2172a37193K1847E8727a09327j97658A95274p5268n0001a3987B05836
$$ 147526 85354 -137193 -115346 58727 -109327 -306985 195274 120006 70005 -13987 205836
11513B0202J78845b0234E9411J79959p5844N825B2443a9495j12511F1462J08849
$$ 20202 199047 -20234 59411 239370 163526 169351 22443 -19495 -132006 61462 170311
11502A70311Q5954j27456b02399F769c4745A7077a25556A04928f4210b6960B64850
$$ 170311 256265 128809 -202399 6769 -34745 17077 -125556 104928 -64210 -26960 264850
11490b22180A22024L1564K2419a11520A80576K5281f2986J0478G8555i3080D4276
$$ -222180 122024 153588 176007 -111520 180576 205857 -62986 -52508 78555 -93080 44276
11478C21306N7180J40386e4607D7177a3987B40504o1724e2931A06809R0405J27632
$$ 321306 378486 518872 -54607 47177 -13987 240504 178780 -52931 106809 197214 324846
11467C24846m4456A7479Q3152f6090A83644L8888C7983b67240E7993A9780D862
$$ 324846 280390 17479 100631 -66090 183644 222532 37983 -267240 57993 19780 4862
11455b26794A50288M6028m6609d7128C07548C2696J87266H776b36314C8678b04937
$$ -226794 150288 196316 149707 -47128 307548 32696 219962 8776 -236314 38678 -204937
11443I0715h4448k03135A18269E0426d531C63105B1521i7529A53713h3743L9531
$$ 90715 -84448 -287583 118269 50426 -4531 363105 21521 -97529 153713 -83743 -44212
11432d4212A14764a26402N3141A46984b34020Q8268B29961c7809r4551a3982b562
$$ -44212 114764 -126402 -73261 146984 -234020 -145752 229961 -37809 -132360 -13982 -2562
11420b05556B10867i3596A70759c00865F4314P5992f2758A49126a60629O9900
$$ -205556 210867 -93596 170759 -300865 64314 140306 -62758 149126 -160629 -90729
11410i0729B3223k773f5495b9837C52839I8361D6896h2425A83440n7297J15442
$$ -90729 23223 20450 -65495 -29837 352839 98361 46896 -82425 183440 126143 241585
11399B41585J9986j7301i7781e358A27430P9383I855a34933D3567a09896j784
$$ 241585 261571 244270 -97781 -5358 127430 206813 9855 -134933 43567 -109896 -111680
11388a11680A13759a70387r4479A17738K84837j67886a55038P7369C4881K44949
$$ -111680 113759 -170387 -264866 117738 402575 234689 -155038 -77669 34881 279830
11378B79830a5535A0649b2127A36585h0904A1953J44505a3943B22341A4706d2355
$$ 279830 -15535 10649 -22127 136585 -80904 11953 156458 -13943 222341 14706 -42355
11366b40965M2912P7233A4550f1895k77568J55773c7078C0642a28501n8722j01475
$$ -240965 -198053 -120820 14550 -61895 -339463 -183690 -37078 30642 -128501 -187223 -288698
11355b88698a17363B0598K6861g6951K6653C49512c4306j59232A05602K56134
$$ -288698 -117363 20598 47459 -76951 -50298 349512 -34306 -193538 105602 361736
11345C61736N3954f4946k9008H7689d7203j45057A65956m1889F0500b91113A94232
$$ 361736 415690 -64946 -93954 87689 -47203 -192260 165956 124067 60500 -291113 194232
11333a45480A33971e5906C30857d764A2645J23927F2190b76980b5830H4938K6807
$$ -145480 133971 -55906 330857 -4764 12645 136572 62190 -276980 -25830 84938 111745
11322A11745j1928c00995I7903J22087i7616m1978d9308A58028a18179F5151a3786
$$ 111745 99817 -300995 97903 219990 -97616 -139594 -49308 158028 -118179 65151 -13786
11310b49041E7198b8691j18500K8134H0679o255L8369c65805a16698L2514d0432
$$ -249041 57198 -28691 -147191 -119057 80679 74424 112793 -365805 -116698 -84184 -40432
11298a01731a1589k91477g9549j07875L2883F9194b69634A87205l5881R7667c00031
$$ -101731 -11589 -303066 -79549 -187424 -154541 69194 -269634 187205 151324 248991 -300031
11286c8743C37699b37986g8686B6022a664C42905a64277F2158B673b25673j31307
$$ -38743 337699 -237986 -78686 26022 -1664 342905 -164277 62158 2673 -225673 -356980
11275c56980a08778G8248C2090R2947e5616Q804r721A17942b45315H4159c81074
$$ -356980 -108778 78248 32090 125037 -55616 -46812 -56533 117942 -245315 84159 -381074
11263b63299i510j96877L492R5429c2943j80812E7176f5492k0854j47815B46708
$$ -263299 -9510 -206387 -202895 -107466 -32943 -213755 57176 -65492 -86346 -234161 246708
11251B67870f0309j03433J3714b3990j8200E5958K09359h8653l30323i7864G3772
$$ 267870 -60309 -163742 -150028 -23990 -42190 55958 265317 -88653 -418976 -97864 73772
11239f8543o0125A91031q0785L4318p0190g3822l9089c7511m9589E1133f4594
$$ -68543 -128668 191031 110246 144564 74374 -73822 -112911 -37511 -87100 51133 -64594
11227A46394f9119F8594a3664F2113J97391C7791c12230e3809j34074p9512e7809
$$ 146394 -69119 68594 -13664 62113 259504 37791 -312230 -53809 -187883 -267395 -57809
11215g9625m5627A5272a70246D0002j8406a21993E2497A2270h4948J9056a9705
$$ -79625 -125252 15272 -170246 40002 21596 -121993 52497 12270 -84948 -65892 -19705
11203b16709Q4111m1535I6019a02831K6259n9589N4003A8651c62836a18239E7062
$$ -216709 -132598 -174133 96019 -102831 -76572 -136161 -82158 18651 -362836 -118239 57062
11191c6272l00859A68763L3578a04298o4750a0373q1940L6449D00908G6042f9265
$$ -36272 -337131 168763 202341 -104298 -169048 -10373 -92313 -55864 400908 76042 -69265
11179b83572A78065f4913l12436J17796D1439C705g9286A91874e09481a66453
$$ -283572 178065 -64913 -377349 -259553 41439 3705 -79286 191874 -509481 -166453
11168B09508p760a71196p4585c0402A72795e3688k00159B55189b29449J12500
$$ 209508 201748 -171196 -245781 -30402 172795 -53688 -253847 255189 -229449 -116949
11158a16949J0329B23658a54588j06094L2127A22706K40974A19641b21816i441
$$ -116949 -106620 223658 -154588 -260682 -228555 122706 363680 119641 -221816 -9441
11147a51385e735o6300b7473C579L45895A44546h4172n0512M7767J9934m7190
$$ -151385 -5735 -72035 -27473 3579 349474 144546 -84172 -134684 -86917 -66983 -114173
11136a14173c4257N760H3949l1645J48250b18280b7477E3323a23025k42283J8598
$$ -114173 -34257 -28497 83949 52304 200554 -218280 -27477 53323 -123025 -365308 -346710
11125c46710b1082j36231l0547h9286C3308a33106B41133E7606J21098b15973
$$ -346710 -21082 -157313 -187860 -89286 33308 -133106 241133 57606 178704 -215973
11114D6176i6917j46498A01891O7977b60557N181B72018a90263F1539h0849C91944
$$ 46176 -96917 -243415 101891 169868 -260557 -255376 272018 -190263 61539 -80849 391944
11102B42313j00272K24407D7287J42616o1878J1129C1249M3949E418g3267q5656
$$ 242313 142041 366448 47287 189903 128025 139154 31249 75198 5418 -73267 -158923
11091a58923B6573K53709A31093J35346a0185n5153A79370f987k32797B49516
$$ -158923 26573 280282 131093 266439 -10185 -65338 179370 -6987 -239784 249516
11080C33010C2987K46364H1226M5323h902D42337j97892j19308k5295m4657k1122
$$ 333010 32987 279351 81226 126549 -8902 442337 244445 125137 99842 55185 34063
11069C4063J83979E3009J58394P7013r4483R8016l6074o3578l1047J44755H6820
$$ 34063 218042 53009 211403 288416 193933 291949 255875 192297 161250 306005 86820
11057C60806D4884L33749A72551L34169j61490A11243K23772k8754J49974L2020
$$ 360806 44884 378633 172551 506720 345230 111243 335015 306261 456235 488255
11047D88255N7570j37224j46796L99183j09061l940k19582O5131J92022j63869
$$ 488255 545825 408601 261805 660988 551927 547987 328405 393536 585558 421689
11037D21689k3228L78843j71970k04277o6856M74911l53466j65766L4228p7454
$$ 421689 398461 777304 605334 401057 334201 809112 455646 289880 324108 246654
11027B46654K29110k29027J32780j79754L61718N1879c2709B18931p3427K79024
$$ 246654 475764 246737 379517 199763 561481 613360 -32709 218931 145504 424528
11017D24528K11062B57218L67093E0398N11724n3964Q7614G6406J47671J99666
$$ 424528 635590 257218 624311 50398 562122 508158 595772 76406 224077 423743
11007D23743k8085K7508j32525J28942j83051J04787K95480J36686C47453L44889
$$ 423743 395658 423166 290641 419583 236532 341319 636799 773485 347453 692342
10997F92342C28514J5694J90731k12828L9155M6032A29813J43169J20136M5069
$$ 692342 328514 344208 534939 322111 361266 407298 129813 272982 393118 438187
10987D38187K7790J84115j34272l5955j31030J72424M70899k65349K6220J13008
$$ 438187 465977 650092 515820 479865 348835 521259 992158 726809 753029 866037
10977H66037J02647j69976L76040K67818l41453N68496m6368k1732M0669O2501
$$ 866037 968684 798708 1174748 1442566 1101113 1669609 1623241 1601509 1642178 1704679
10967A704679n4710j9335k78474k887k32453k02317j18931J67141k2874K3183
$$ 1704679 1649969 1630634 1352160 1349273 1116820 914503 795572 962713 939839 963022
10957I63022M78117m77387K50802j60761L7943j93650L9103J77397E14306P9479
$$ 963022 1441139 963752 1214554 1053793 1091736 898086 937189 1114586 514306 593785
10947E93785K42377A86876L0953A00472P8331A6108K58313R1210I1165a39652
$$ 593785 836162 186876 217829 100472 178803 16108 274421 365631 91165 -139652
10936A63995J03237C9270J9041O4187c2515j11325i333G8378J73491j19861J10581
$$ 163995 267232 39270 58311 122498 -32515 -143840 -9333 78378 251869 132008 242589
10925B42589L0977A006K04157c9672j13297H3444J36703M3877l6297j6642F400
$$ 242589 273566 1006 205163 -39672 -152969 83444 220147 264024 227727 211085 6400
10913A69974m568a18104D4880a2439k5707j295r7504A16793K6325c8070L399l04749
$$ 169974 165406 -118104 44880 -12439 -38146 -39441 -136945 116793 143118 -38070 -34671 -339420
10901c39420J56638J5682I069J20407c30425A9520K32684a11131O92q6306g582
$$ -339420 -182782 -167100 9069 129476 -330425 19520 252204 -111131 -110439 -196745 -7582
10889a56976k03815C29974b45520B7289b4462C86564I0439e3984A93697e7659
$$ -156976 -360791 329974 -245520 27289 -24462 386564 90439 -53984 193697 -57659
10878H2514l2931a02207d2312a4049G3905Q0241b46660J01054n2687g384A35633
$$ 82514 49583 -102207 -42312 -14049 73905 154146 -246660 -145606 -198293 -7384 135633
10866a00240J5444C12245r5936a89545B11011f0483Q125A17229E0276A4044M1747
$$ -100240 -84796 312245 216309 -189545 211011 -60483 -52358 117229 50276 14044 55791
10855E5791e9540j16873B41100r2319K00766G1343I849f4673k9020j36653O9641
$$ 55791 -59540 -176413 241100 148781 349547 71343 9849 -64673 -93693 -230346 -160705
10844a60705c7397B68598B3296a55885M2662K2461b8349A6162i3153J5637L2379
$$ -160705 -37397 268598 23296 -155885 -113223 -90762 -28349 16162 -93153 -77516 -45137
10833d5137j92499G8979a18318M2045l62682J17637C07262d24437a61777g4874
$$ -45137 -237636 78979 -118318 -76273 -438955 -321318 307262 -424437 -161777 -74874
10822b73496A5871J05483a0405j55553B69800J03904b20874A81110f6081D9858
$$ -273496 15871 121354 -10405 -165958 269800 373704 -220874 181110 -66081 49858
10811b25319H5102O6237n1836c8609G719J90684A1163b7646j22647A30778f5193
$$ -225319 85102 151339 99503 -38609 7719 198403 11163 -27646 -150293 130778 -65193
10799d31181g1532p0491A92104F5019O5630B6823N3795c17696J42874M7496l0872
$$ -431181 -71532 -142023 192104 65019 130649 26823 80618 -317696 -174822 -127326 -158198
10788a58198j2881j07294A79202a75291j91191C0366d6542A0082h9891F6290a87260
$$ -158198 -171079 -278373 179202 -175291 -366482 30366 -46542 10082 -89891 66290 -187260
10776e3361F9913B3926L0761b08187f5557K4094k22674J02524O0142A8862i1001
$$ -53361 69913 23926 54687 -208187 -65557 -41463 -264137 -161613 -101471 18862 -91001
10764D6749K06544a05147o7272m122F0409b4326r5461L0632A24348l9220l8301
$$ 46749 253293 -105147 -172419 -176541 60409 -24326 -119787 -89155 124348 85128 46827
10753D6827d710l25773I4237N6300l440e452j8492o2820l5160A99682E7069b13489
$$ 46827 -4710 -330483 94237 150537 147097 -5452 -23944 -86764 -121924 199682 57069 -213489
10740b69894A32289h9331D8062a68590D1401a67279A30926b01776E5838b01591
$$ -269894 132289 -89331 48062 -168590 41401 -167279 130926 -201776 55838 -201591
10729A7870J30127c26118A62041b9438G265d1357E802h3774p1617A02601D8902
$$ 17870 147997 -326118 162041 -29438 7265 -41357 5802 -83774 -155391 102601 48902
10717c6371o1818A45035L9843q8225A4446f5484j21707M1488I6694h5711A70212
$$ -36371 -98189 145035 184878 96653 14446 -65484 -187191 -145703 96694 -85711 170212
10705B99045E5054b90405i0904l66095I6267b6773h200A58100b0290k2150j4262
$$ 299045 55054 -290405 -90904 -456999 96267 -26773 -8200 158100 -20290 -42440 -56702
10694e6702j16234K5401a0928A62950a25791B850e7364k41822h2610k56122A15129
$$ -56702 -172936 -147535 -10928 162950 -125791 2850 -57364 -299186 -82610 -338732 115129
10682a83444q6362Q7293j25982J45354A78570d0075D3665J84287b13199B5863
$$ -183444 -269806 -182513 -308495 -163141 178570 -40075 43665 227952 -213199 25863
10671A14849i4954j27358Q8061c8957k59453a21800C1638c6750d51k70226j35764
$$ 114849 -94954 -222312 -134251 -38957 -298410 -121800 31638 -36750 -451 -270677 -406441
10660d06441A27322c26875h0568B69138g0845m0647I7384b39250A10651d31500
$$ -406441 127322 -326875 -80568 269138 -70845 -111492 97384 -239250 110651 -431500
10649B16774d9111l8041A6049a44218A36335a9870k98480A2618e3226b2154k49097
$$ 216774 -49111 -87152 16049 -144218 136335 -19870 -318350 12618 -53226 -22154 -271251
10638b71251B3741R4923h5715k13726g4023j97812b0029H9644b00279J9712J2940
$$ -271251 23741 118664 -85715 -299441 -74023 -271835 -20029 89644 -200279 -180567 -167627
10627a67627b2618k12845B98895A49404k3421O44a5586k8807k62871c4984F7630
$$ -167627 -22618 -235463 298895 149404 125983 126627 -15586 -44393 -307264 -34984 67630
10615G9939K04490c88896h1160B8110L21938Q8039a47364N6951n5323I9497j4993
$$ 79939 284429 -388896 -81160 28110 350048 438087 -147364 -90413 -145736 99497 84504
10604H4504D0311b48459a06386A95550L5296i6564A30662m8307b96961a8644A72067
$$ 84504 40311 -248459 -106386 195550 230846 -96564 130662 82355 -296961 -18644 172067
10592b21061A75368L570q7615j1484M3437L8827d2899j82173P7217k51741i1938
$$ -221061 175368 178938 91323 79839 123276 162103 -42899 -225072 -147855 -399596 -91938
10580G0232g658A63107B3618k456a16129A5665b18694f0123A53176d19670E5032
$$ 70232 -7658 163107 23618 21162 -116129 15665 -218694 -60123 153176 -419670 55032
10568b30515E1894a23361E8617M9091B4655e942C1532c54269I8726b82944E4568
$$ -230515 51894 -123361 58617 107708 24655 -5942 31532 -354269 98726 -282944 54568
10556b75221a27350q5448j26559h4666I6172c4269A69703A5746c59217J46803
$$ -275221 -127350 -212798 -339357 -84666 96172 -34269 169703 15746 -359217 -212414
10546b12414B778a12846A00232d2660p346p0475e7023F68g6659B36434F7027a06477
$$ -212414 2778 -112846 100232 -42660 -50006 -120481 -57023 668 -76659 236434 67027 -106477
10533B49495d2672H9988d5905F3783K6217b04881e0952A55760B9252d16192a69865
$$ 249495 -42672 89988 -45905 63783 90000 -204881 -50952 155760 29252 -416192 -169865
10521c44353g1525A97006h4222i7A15905e0877k9288h981q9694k6864a9672j4195
$$ -344353 -71525 197006 -84222 -97 115905 -50877 -80165 -8981 -98675 -125539 -19672 -33867
10509c3867a604j53479B85966i9382k56296b934k6749A53204a21460J9575q9759
$$ -33867 -1604 -155083 285966 -99382 -355678 -2934 -29683 153204 -121460 -101885 -191644
10498a91644j8615R0266M4868A8752L9857A857J98007b31928o3823A98786a91114
$$ -191644 -210259 -119993 -75125 18752 58609 1857 199864 -231928 -295751 198786 -191114
10486d23991A11210b64731R3959C93016B9061K65919j31827K91087M1628k38062
$$ -423991 111210 -264731 -170772 393016 29061 294980 163153 454240 495868 257806
10476B57806i4693E3345a71123E9212J75962j06211E2031b28130P0234A95372
$$ 257806 -94693 53345 -171123 59212 235174 128963 52031 -228130 -157896 195372
10465F3751a72480f9193p9608A39780i6325A12162d17275H0938a02099c402r5226
$$ 63751 -172480 -69193 -148801 139780 -96325 112162 -417275 80938 -102099 -3402 -98628
10454i8628j59694j71609P2263l2161B2480c29849J48768A67752c9170m7605a2539
$$ -98628 -258322 -429931 -357668 -389829 22480 -329849 -181081 167752 -39170 -86775 -12539
10442b03044A7037K25995a15367j79252J05908I8195b21111k2890J14264G239
$$ -203044 17037 243032 -115367 -294619 -188711 98195 -221111 -244001 -129737 7239
10431a55665N9980C60554l8132I5068O6077a80213A795L2691J8667K46919a67932
$$ -155665 -95685 360554 322422 95068 161145 -180213 1795 34486 53153 300072 -167932
10419A23858e2617n3771m27294b28460A79681e02912A4407d3834j03073b4015
$$ 123858 -52617 -106388 -533682 -228460 179681 -502912 14407 -43834 -146907 -24015
10408A00481l84b70331A097R8300C5341a81372M9560k31066J74469m583k0139
$$ 100481 100097 -270331 1097 99397 35341 -181372 -131812 -362878 -188409 -192992 -213131
10397b13131g6437b3517j01788A78416J0054J5329g1590A4215J59877B7200i500
$$ -213131 -76437 -23517 -125305 178416 188470 203799 -71590 14215 174092 27200 -9500
10385c51280E1410i8763J1953H0868P0466G0550O7127a61261A53265o7637j6907
$$ -351280 51410 -98763 -86810 80868 151334 70550 137677 -161261 153265 85628 68721
10374F8721O9477R9044p1398J44233o4570K31263k11891G7611K69691H0060J00417
$$ 68721 138198 237242 165844 310077 245507 476770 264879 77611 347302 80060 180477
10363A80477H5236g5867H7801J31243g5029A40271d8078F6272b81728C25367a09637
$$ 180477 85236 -75867 87801 219044 -75029 140271 -48078 66272 -281728 325367 -109637
10351A83394L08780j03311A45700O8883P5267l4969a36212C48248B4319R6463
$$ 183394 492174 388863 145700 214583 289850 254881 -136212 348248 24319 120782
10341A20782R4765o2583j6636a57733C40177l3570A28315K14352i996A74501a31186
$$ 120782 215547 152964 136328 -157733 340177 306607 128315 342667 -9996 174501 -131186
10329f7991G2258f7785k5504B7635L8556k3127N8005R2673c4911B10830A02905
$$ -67991 72258 -67785 -93289 27635 66191 43064 101069 193742 -34911 210830 102905
10317B62416n0142J2560q1582A4422J22312L13195C4036J23521m4032a77686r6395
$$ 262416 212274 224834 143252 14422 136734 449929 34036 157557 113525 -177686 -274081
10306b74081i9365k33122f5566i006k76398F5496a91900B0746L0226b00119F0453
$$ -274081 -99365 -332487 -65566 -9006 -285404 65496 -191900 20746 50972 -200119 60453
10294a71911A07184a62967j89549j55518A80286D1222J62788b26405F5592a37742
$$ -171911 107184 -162967 -352516 -508034 180286 41222 204010 -226405 65592 -137742
10283a22158A49499a24113A57463A3035J36643o2267c88258B0738D473b77730
$$ -122158 149499 -124113 157463 13035 149678 87411 -388258 20738 4473 -277730
10272i3432A51966J03839b68523h2034l5195H2707C0354J84651a29628B70620
$$ -93432 151966 255805 -268523 -82034 -117229 82707 30354 215005 -129628 270620
10261B83616A6135M07580a25797D98172B29288R8115j51575O2743G9206j4205
$$ 283616 16135 423715 -125797 498172 229288 327403 175828 238571 79206 65001
10251F5001B7480A2327i9110H4766e2181n4026F5347b94095A89996E4139b1299
$$ 65001 27480 12327 -99110 84766 -52181 -106207 65347 -294095 189996 54139 -21299
10239A31438B0182c83183d7926G161K53894a4463k09816h001m5543A34090H795
$$ 131438 20182 -383183 -47926 7161 261055 -14463 -224279 -8001 -53544 134090 8795
10227A71559d84427C0250a22309e5283A14403E1420g8337A49288a23792e9593
$$ 171559 -484427 30250 -122309 -55283 114403 51420 -78337 149288 -123792 -59593
10216A7123b77324C2203b38210A50221h6623A83026a2585m4008A55696c08041
$$ 17123 -277324 32203 -238210 150221 -86623 183026 -12585 -56593 155696 -308041
10205a49580D887K42988b88328B4007b0582G8740a08172o0044p6857g6187A04290
$$ -149580 4887 247875 -288328 24007 -20582 78740 -108172 -168216 -245073 -76187 104290
10193g3791k26787B86547d5139j0750j10902P3590F1926K84947r2948j11341D9772
$$ -73791 -300578 286547 -45139 -55889 -166791 -93201 61926 346873 253925 142584 49772
10181B58812e039j42468K0468j03651i924A36326h6261l41638a26634K2403A00490
$$ 258812 -5039 -147507 -127039 -230690 -9924 136326 -86261 -427899 -126634 -104231 100490
10169A28534e4016E0368J19737J10002a92930j9701g483D7155a4698B11260a97161
$$ 128534 -54016 50368 170105 280107 -192930 -212631 -7483 47155 -14698 211260 -197161
10157B24844B9428c185j53275J802G1452g0336l43500a48263l1051B64688i8562
$$ 224844 29428 -3185 -156460 -154658 71452 -70336 -413836 -148263 -179314 264688 -98562
10145c19168D1701f4170E9445A5006a01046K9579l1239L1459m5194A49653g2626
$$ -319168 41701 -64170 59445 15006 -101046 -71467 -102706 -71247 -116441 149653 -72626
10133A15206J11812a3616j0911B1224b50601J24567B6833b27577o4085B0521a70718
$$ 115206 227018 -13616 -24527 21224 -250601 -126034 26833 -227577 -291662 20521 -170718
10121a87560A3430a36334A23423P4201a29147e9730j97518A39511b83871G751
$$ -187560 13430 -136334 123423 197624 -129147 -59730 -257248 139511 -283871 7751
10110g5883l91093J25413b9982r2939A80714e0022n6275k96351b4369j06899o2808
$$ -75883 -466976 -341563 -29982 -122921 180714 -50022 -106297 -402648 -24369 -131268 -194076
10099a94076C8084a80064f0414q5657N8356A56568k2766J08456A10317m1221g9626
$$ -194076 38084 -180064 -60414 -146071 -87715 156568 133802 242258 110317 69096 -79626
10087c03894a15435b051k19341A66808e1384B51668p6620a95072h6046i600k12508
$$ -303894 -115435 -2051 -221392 166808 -51384 251668 175048 -195072 -86046 -9600 -222108
10076b22108A14343b99600A0451a93934h0581j33482A04738J02663d8737k82523
$$ -222108 114343 -299600 10451 -193934 -80581 -214063 104738 207401 -48737 -331260
10066c31260A96533B2267b44419a541B6091J7814P0732M7154A3083a54497j30598
$$ -331260 196533 22267 -244419 -1541 26091 43905 114637 161791 13083 -154497 -285095
10055b85095R7089p753e9448j56857a223l44234J18651R4495B47664a19437g984
$$ -285095 -188006 -195759 -59448 -216305 -1223 -345457 -226806 -132311 247664 -119437 -7984
10043b12289P6306B70473Q5746A03016c3208E7368R7248a11125d1484A05027h3822
$$ -212289 -135983 270473 356219 103016 -33208 57368 154616 -111125 -41484 105027 -83822
10031b29021C20026a2663A20271r21i1227A01611Q3333c43926N5500Q7407L1638
$$ -229021 320026 -12663 120271 119350 -91227 101611 184944 -343926 -288426 -201019 -169381
10020a69381A724h2076o99B21798d94955A4104L15629j06399c30113a16070e0213
$$ -169381 1724 -82076 -82775 221798 -494955 14104 329733 223334 -330113 -116070 -50213
10008a94165h6715L9820o8482b0995l13972O3887q310C5143c15342a08504L8646
$$ -194165 -86715 -46895 -115377 -20995 -334967 -271080 -279390 35143 -315342 -108504 -69858
9997f9858j38754A61827c8147j89482b1793B02064e9240m31807C4459c21062d1773
$$ -69858 -208612 161827 -38147 -227629 -21793 202064 -59240 -491047 34459 -321062 -41773
9985d0141r1630j10372L3482A22516a04430D1657J32859b13702B23990d42929
$$ -40141 -131771 -242143 -208661 122516 -104430 41657 174516 -213702 223990 -442929
9974a47029d7095k20430A29118b97303P2457A0004J2186c06844J41155B35085
$$ -147029 -47095 -267525 129118 -297303 -224846 10004 22190 -306844 -165689 235085
9963b33556C7176b96013C018M4453L0043f8281j61655c5306C026a49581m0140
$$ -233556 37176 -296013 3018 47471 77514 -68281 -229936 -35306 3026 -149581 -189721
9952a89721a839r1614Q519D239J35501A9770g803j01045D5711a82990p505P5473
$$ -189721 -1839 -93453 -84934 4239 139740 19770 -7803 -108848 45711 -182990 -190495 -115022
9940a15022G1421f4661c0699j60194A82776b12158E9191K44559d8822r5573B10967
$$ -115022 71421 -64661 -30699 -190893 182776 -212158 59191 303750 -48822 -144395 210967
9928c78108G3176a08236J400L0984k05682N6952F04M5698b34937K2574I0808R5230
$$ -378108 73176 -108236 -106836 -75852 -281534 -224582 604 46302 -234937 -212363 90808 186038
9916A86038a54726O8616L0773o3337r446g139E0738b02616B1462J08788b4692
$$ 186038 -154726 -86110 -55337 -118674 -128120 -7139 50738 -202616 21462 130250 -24692
9904c708r1190C9666N1971h2154B4655P2032a60272K0205r0441B07885c82448
$$ -3708 -94898 39666 91637 -82154 24655 96687 -160272 -140067 -230508 207885 -382448
9892a66419c8518j16340A99621c2361p9420J3118D3050P0785a43650F2301a563
$$ -166419 -38518 -154858 199621 -32361 -111781 -98663 43050 113835 -143650 62301 -1563
9880B7184q722K3520e0472I4501a03365A23347b10815C66567e6995j40532M017
$$ 27184 18462 41982 -50472 94501 -103365 123347 -210815 366567 -56995 -197527 -193510
9869a93510A01388b58335H2226c33057O5399A39724J83706H9509c0414A22020
$$ -193510 101388 -258335 82226 -333057 -267658 139724 323430 89509 -30414 122020
9858a11183k0733f4108C4939N8235Q6875D6744i8194F0981J46077k7279a42323
$$ -111183 -131916 -64108 34939 93174 180049 46744 -98194 60981 207058 179779 -142323
9846a19790A45088D8605m573K4529J80995b35206D8500L2752J2578L1221a98025
$$ -119790 145088 48605 44032 68561 249556 -235206 48500 81252 93830 125051 -198025
9834b32797F1630J56138b2674e956B314i628o6056E528i774o4327q36j34244B40907
$$ -232797 61630 217768 -22674 -5956 2314 -9628 -75684 5528 -9774 -74101 -74937 -209181 240907
9820E2401c19986e260A32129J5660n4299Q937c2565o9768k33973H4182a99407
$$ 52401 -319986 -5260 132129 147789 93490 102427 -32565 -102333 -336306 84182 -199407
9808B67310j21207a16305A23540g0212j17500L5795J819j75490B60657C1192j5316
$$ 267310 146103 -116305 123540 -70212 -187712 -151917 -150098 -325588 260657 31192 15876
9797A5876K23531h7647k2323j4920K4661B3282a42437C51775f2490a0591l8249
$$ 15876 239407 -87647 -109970 -124890 -100229 23282 -142437 351775 -62490 -10591 -48840
9786d8840k42037R5518D6485m509j8075N2156b12222C6573E518i673k10304k17019
$$ -48840 -290877 -195359 46485 41976 23901 76057 -212222 36573 5518 -9673 -219977 -436996
9774d36996K06480f9763O899A35728a54359j68131J49455A04906a97088F6791
$$ -436996 -230516 -69763 -62864 135728 -154359 -322490 -173035 104906 -197088 66791
9763i6869N667D0979h7764q1604l9906D8206c74392a42927A57542i7417j73558
$$ -96869 -91202 40979 -87764 -169368 -209274 48206 -374392 -142927 157542 -97417 -270975
9752b70975J00760K344G6225e6923K7491n5531j7804b5091p0145E1038K9454R069
$$ -270975 -170215 -167871 76225 -56923 -29432 -84963 -102767 -25091 -95236 51038 80492 89561
9740H9561d06233J89370l7853P7808J4830p6110D8390a13149L2181j27635j79889
$$ 89561 -406233 -216863 -254716 -176908 -162078 -238188 48390 -113149 -80968 -208603 -388492
9729c88492a60831D4574K4105e4975A76389a54439f1360o0210K3123J9221n0697
$$ -388492 -160831 44574 68679 -54975 176389 -154439 -61360 -121570 -98447 -79226 -129923
9718a29923A12605K9915b29274A38695C5203a2093K062A0198b13048C26990a31850
$$ -129923 112605 142520 -229274 138695 35203 -12093 -10031 10198 -213048 326990 -131850
9706H6823L7707i2017j19131j9203a2025n9224l3325b2523l4412A0625b57361
$$ 86823 124530 -92017 -211148 -230351 -12025 -71249 -104574 -22523 -56935 10625 -257361
9694B60805H7292i1213j02778M6358n2479f6624r1391k492F9366N1472c2357j56522
$$ 260805 87292 -91213 -193991 -147633 -200112 -66624 -158015 -160507 69366 120838 -32357 -188879
9682a88879j7086I1573L95905b10815A55262g9706r02m78432K64763c1296A0543
$$ -188879 -205965 91573 487478 -210815 155262 -79706 -80608 -559040 -294277 -31296 10543
9670a09272j11076o8632D7712a21569b516j73815A8918K84415F1433a64246A21870
$$ -109272 -220348 -288980 47712 -121569 -2516 -176331 18918 303333 61433 -164246 121870
9658a59185B19075f8306j96106D8382e5226I8345N2758c2104G4986a17650m1316
$$ -159185 219075 -68306 -264412 48382 -55226 98345 151103 -32104 74986 -117650 -158966
9647a58966A99918p6643c17699a33939j26539b3229j66056D320i9694j26386O7974
$$ -158966 199918 123275 -317699 -133939 -260478 -23229 -189285 4320 -99694 -226080 -158106
9636a58106j94907J47891G2000a0531o6867l5490A21499a56186p632l5768c1782
$$ -158106 -353013 -205122 72000 -10531 -77398 -112888 121499 -156186 -163818 -199586 -31782
9624c25011m2238A0635J31439a07582l13211a30859K6780k7896j99390G2722a1683
$$ -325011 -367249 10635 142074 -107582 -420793 -130859 -104079 -131975 -331365 72722 -11683
9612b07920a7212D9852N3286j3288c11175B1354N2406a19650e589D38081a07879
$$ -207920 -17212 49852 103138 89850 -311175 21354 73760 -119650 -5589 438081 -107879
9600I77d9915r1777j23069g0799A77118f4217l19292l7168f8191p3558C72559
$$ 977 -49915 -141692 -264761 -70799 177118 -64217 -383509 -420677 -68191 -141749 372559
9588g91j59139E6154a84376A79119G7745A682O5551a07804B7566c33051B02576
$$ -791 -159930 56154 -184376 179119 77745 1682 67233 -107804 27566 -333051 202576
9576a40041E3271O6658A0696b51569G0884J1558c08869a39309A5419b36166h0354
$$ -140041 53271 119929 10696 -251569 70884 82442 -308869 -139309 15419 -236166 -80354
9564B20851Q2814h3716l8039a8390O783C6254K64508d4134o8944D7340b78458
$$ 220851 303665 -83716 -121755 -18390 -11607 36254 300762 -44134 -113078 47340 -278458
9552A33258e06l24579B2458f3668D6537a6764k2781j22007f1080q9099E832O4766
$$ 133258 -506 -325085 22458 -63668 46537 -16764 -39545 -161552 -61080 -150179 5832 70598
9540G0598a75176j5042j78420J03475c8989e688I0206b55806j89303a44117A19575
$$ 70598 -175176 -190218 -368638 -265163 -38989 -5688 90206 -255806 -445109 -144117 119575
9528G2992c27270b4416B01738g1421n7651B1439N0044c60789k1285E963a06389
$$ 72992 -327270 -24416 201738 -71421 -129072 21439 71483 -360789 -382074 5963 -106389
9516c04712J24620e8601G2188c38685e7627A29079n4329h048k58511B50747a74587
$$ -304712 -180092 -58601 72188 -338685 -57627 129079 74750 -8048 -266559 250747 -174587
9504B9622b38560C4520M1201P9303c58903i9472M5646q8037k200g0154J4002j3625
$$ 29622 -238560 34520 75721 155024 -358903 -99472 -53826 -141863 -144063 -70154 -56152 -69777
9492f9777l1432B09808C1991M0071J21134a06855o7366L3012D675a25189J9580
$$ -69777 -101209 209808 31991 72062 193196 -106855 -174221 -141209 4675 -125189 -105609
9481a05609D7009b95947a09290J6493n0437j22244L4266b763p0343B21293c6521
$$ -105609 47009 -295947 -109290 -92797 -143234 -265478 -231212 -2763 -73106 221293 -36521
9469G0140m966J72584q8209c89572a15474A7141H146h0803F5137g2433A09754
$$ 70140 65174 237758 149549 -389572 -115474 17141 8146 -80803 65137 -72433 109754
9457h7210p5809P0238o6996p7951j86762a31591k09217N2891A6145K5443a55470
$$ -87210 -163019 -92781 -159777 -237728 -424490 -131591 -340808 -287917 16145 41588 -155470
9445A53510a36350B5924a90672n4062B8613M2808d4176j4598p96k65480c5630
$$ 153510 -136350 25924 -190672 -244734 28613 71421 -44176 -58774 -59570 -325050 -35630
9433a68990A03880J45762n9499B2519e0686A68275h7225j94909n9504a11538E4947
$$ -168990 103880 249642 190143 22519 -50686 168275 -87225 -282134 -341638 -111538 54947
9421B08916b10991F2292J46938h7311F0828K85648b8919A07586d8926B4968c02231
$$ 208916 -210991 62292 209230 -87311 60828 346476 -28919 107586 -48926 24968 -302231
9409E4401h6935H8484b94742G1415i5575I2767C2204P9149n3200b80610a22226
$$ 54401 -86935 88484 -294742 71415 -95575 92767 32204 111353 58153 -280610 -122226
9397B69500A716b80553L7092F136a88992l6632I4028g853B64649b63138A17109
$$ 269500 1716 -280553 -243461 6136 -188992 -225624 94028 -7853 264649 -263138 117109
9385A91218f6913l24B3399K27158r8186C102a15510o782D4975K53987a29796c2652
$$ 191218 -66913 -67237 23399 250557 152371 3102 -115510 -122292 44975 298962 -129796 -32652
9372H8037b3892m8848n2259I6778c04669n681q4909J06897R5920h9979c0081j7235
$$ 88037 -23892 -72740 -124999 96778 -304669 -310350 -395259 -288362 -192442 -89979 -30081 -47316
9360d7316H4895d482l575H9380R0848a23018B51941k2761c81238D14846A04643
$$ -47316 84895 -4482 -8057 89380 180228 -123018 251941 229180 -381238 414846 104643
9348a29596j37548D4772L5818b74725J13094a9349A55924A4236N9238j0673L41498
$$ -129596 -267144 44772 80590 -274725 -161631 -19349 155924 14236 73474 62801 404299
9337D04299C9814b48228A14401C8144R6447F0048L05178d4027E5033d4921k17002
$$ 404299 39814 -248228 114401 38144 134591 60048 365226 -44027 55033 -44921 -261923
9326b61923A988L0087a34702a8802B72316c38157J61919A84955o7901K45062A2946
$$ -261923 1988 32075 -134702 -18802 272316 -338157 -176238 184955 117054 362116 12946
9314b64727J23879K7294C2489d05275c8813B10000f7064k4645l4182A18433E1767
$$ -264727 -140848 -113554 32489 -405275 -38813 210000 -67064 -91709 -125891 118433 51767
9302A23427K832b98031E045J10299j0394c26409G8121h5416F9472C3035c09897
$$ 123427 126259 -298031 5045 115344 104950 -326409 78121 -85416 69472 33035 -309897
9290I8503h8700A47222a91937F3252a08742c0942j32968k3207A47684K3146J01220
$$ 98503 -88700 147222 -191937 63252 -108742 -30942 -163910 -187117 147684 170830 272050
9279B72050a07412p5062c7657I5933b67980C7374K71859a7554l48262J42309O8831
$$ 272050 -107412 -182474 -37657 95933 -267980 37374 309233 -17554 -365816 -223507 -154676
9268a54676h015F9199a87050P3862m460b7415j01644A52042C5135p558g3862A04117
$$ -154676 -8015 69199 -187050 -113188 -117648 -27415 -129059 152042 35135 27577 -73862 104117
9255b0041j20757r0801e0894q7547C7974f153H0409c41648h8522L4442A47829
$$ -20041 -140798 -231599 -50894 -138441 37974 -6153 80409 -341648 -88522 -54080 147829
9243c8930I9171c6756j70160K3887D3306N6618c05300l5944k05652G370J34249
$$ -38930 99171 -36756 -206916 -183029 43306 99924 -305300 -341244 -546896 7370 141619
9232A41619G0204O721c21884A49101a53365d0427o0758A00797b27657c8091A69746
$$ 141619 70204 76925 -321884 149101 -153365 -40427 -101185 100797 -227657 -38091 169746
9220c33078a4169k00336C74793b24466B88863G4443A1887a82059g758C1585L19600
$$ -333078 -14169 -214505 374793 -224466 288863 74443 11887 -182059 -7758 31585 351185
9209C51185c6630B45798o2843c69078I2249a35905c7985I4884a41889A58480a32229
$$ 351185 -36630 245798 182955 -369078 92249 -135905 -37985 94884 -141889 158480 -132229
9197A03231d1812k87036J41154a4077j6424A9872b03645A03089b7061l22905J41456
$$ 103231 -41812 -328848 -187694 -14077 -30501 19872 -203645 103089 -27061 -349966 -208510
9186b08510i8408C3477J15390e4519l8170A58191b8982j88412D9229i4237j17552
$$ -208510 -98408 33477 148867 -54519 -92689 158191 -28982 -217394 49229 -94237 -211789
9175b11789R877A9394r276O3430c8714j58958I913h3610j40569B21683a77557
$$ -211789 -201912 19394 10118 73548 -38714 -197672 9913 -83610 -224179 221683 -177557
9163B43876F2569k8922a02759A37650h7126k62558A93306b0855A43030C8636J52929
$$ 243876 62569 33647 -102759 137650 -87126 -349684 193306 -20855 143030 38636 191565
9152A91565a08309F490N1147O6033a14305F5965b96488J36526a5114j5108k9017
$$ 191565 -108309 6490 57637 123670 -114305 65965 -296488 -159962 -15114 -30222 -59239
9141e9239C0925M1917b43674A6908J08974P2016h3603r366k43060c5193m83567
$$ -59239 30925 72842 -243674 16908 125882 197898 -83603 -92969 -336029 -35193 -518760
9130e18760E3940a079j00067A3824a54410j22324C03356a82387k1907O0793K8543
$$ -518760 53940 -1079 -101146 13824 -154410 -276734 303356 -182387 -204294 -143501 -114958
9119a14958a3865C0327c32672O1503B4258J50603G4541a4032l53926d7503k74305
$$ -114958 -13865 30327 -332672 -271169 24258 174861 74541 -14032 -367958 -47503 -321808
9108c21808B8186b18102B4583K33557a20590L8231n6603b1382j33174E331b28848
$$ -321808 28186 -218102 24583 258140 -120590 -82359 -138962 -21382 -154556 5331 -228848
9096H2446J64465c8077k04270A00124a28066K0254I5167b17814k27374E7913g0700
$$ 82446 246911 -38077 -242347 100124 -128066 -107812 95167 -217814 -445188 57913 -70700
9084C20394D3832a18417H8705i7519m995g708C08932d9975E2924C694R5413b06207
$$ 320394 43832 -118417 88705 -97519 -102514 -7708 308932 -49975 52924 3694 99107 -206207
9071A88250a71901g5009B17415p3131C7797J8991c7630J3310A0984Q9628E657
$$ 188250 -171901 -75009 217415 144284 37797 56788 -37630 -24320 10984 100612 5657
9059c3328B11962G5952i2917D9165h1744A86699g0529G7504b2934j99971G9414
$$ -33328 211962 75952 -92917 49165 -81744 186699 -70529 77504 -22934 -222905 79414
9047b01644d8572j14551j21447B20066e6319D0009K51910a49492g0010C9925K31955
$$ -201644 -48572 -163123 -284570 220066 -56319 40009 291919 -149492 -70010 39925 271880
9036B71880C9769K29507a51686e2573B5054b13930n6675B5236e011j16698B54751
$$ 271880 39769 269276 -151686 -52573 25054 -213930 -270605 25236 -5011 -121709 254751
9024a42726E8793j1838a9372j4565k54133M4908D9786b3303p561B37713b40798
$$ -142726 58793 46955 -19372 -33937 -288070 -243162 49786 -23303 -30864 237713 -240798
9012b81235B68083g1357b6063A23936L9628b88168J15765j12644g9763n700c356
$$ -281235 268083 -71357 -26063 123936 163564 -288168 -172403 -285047 -79763 -85463 -3356
9000i5956O657b4386k10428B32221B556c12700G8211h9129K6563m5779j39358
$$ -95956 -89299 -24386 -234814 232221 2556 -312700 78211 -89129 -62566 -108345 -247703
8989b47703g8879h162A12137f9139k10810B0386a3972r233A34690b38251a00410
$$ -247703 -78879 -8162 112137 -69139 -279949 20386 -13972 -23205 134690 -238251 -100410
8977c2958C88912b67725j09066A36579i5866k86514a43477A68761a28542M5345
$$ -32958 388912 -267725 -376791 136579 -95866 -382380 -143477 168761 -128542 -83197
8967h3197J5337B45769b10739b3089A7348P4623N4451o0688l5432J55864n9957
$$ -83197 -67860 245769 -210739 -23089 17348 91971 146422 85734 50302 206166 146209
8956A46209a39263k92980G3757c5972k4885j65227M421B34950n1723a71297l477
$$ 146209 -139263 -432243 73757 -35972 -60857 -226084 -221663 234950 183227 -171297 -174774
8945a74774E7748e6614q5873A74154c9017A31924l3521J02898B1950N7855i7930
$$ -174774 57748 -56614 -142487 174154 -39017 131924 98403 201301 21950 79805 -97930
8933C01124I8640O3605Q6879A13568K08529b24638P5427O0239B61139M7474Q9013
$$ 301124 98640 162245 249124 113568 322097 -224638 -149211 -88972 261139 308613 397626
8922C97626J542602M465978O851780o464422B113785D78798M2748k41241G4156
$$ 397626 1940228 6406206 13257986 6793564 2113785 478798 521546 280305 74156
8912h2891A4207g4433B8432a37469D1869N5282K84899j16803G1479b93239J00215
$$ -82891 14207 -74433 28432 -137469 41869 97151 382050 265247 71479 -293239 -193024
8901a93024b3905A64554b86087A0520e0120J9389j10153b4123l4376H8380a08854
$$ -193024 -23905 164554 -286087 10520 -50120 -30731 -140884 -24123 -58499 88380 -108854
8889B1942h3965j82884A36965i7899f390o4174A02108l7624k1866j7008J66303
$$ 21942 -83965 -266849 136965 -97899 -6390 -70564 102108 64484 42618 25610 191913
8878A91913A6511a26584I4099a57575A7413O0098b49925C91155b9539k78969a15450
$$ 191913 16511 -126584 94099 -157575 17413 77511 -249925 391155 -29539 -308508 -115450
8866A86642h5515k32786a39964j2276b4436C11621c04921J19246C59033A15524
$$ 186642 -85515 -318301 -139964 -152240 -24436 311621 -304921 -185675 359033 115524
8855g976n4471q9476j37932A29653k1802a62934e8906I1898f6775J8817A47291
$$ -7976 -62447 -151923 -289855 129653 107851 -162934 -58906 91898 -66775 -47958 147291
8843d2853F9547d90316i086A79649b82932q2018a18730I5050c945k70707A57296
$$ -42853 69547 -490316 -9086 179649 -282932 -364950 -118730 95050 -3945 -274652 157296
8831A83284a23736j3984p996A75532a51075j03018d9469D9028R6449b05020B50256
$$ 183284 -123736 -137720 -145716 175532 -151075 -254093 -49469 49028 145477 -205020 250256
$$ [...]
##END NTUPLES=NMR SPECTRUM
##END=
