##TITLE=NES1071_159122.0002_001_9705654_qWYHiq8yM4
##JCAMPDX= 6.0         $$ Bruker NMR JCAMP-DX V2.0
##DATA TYPE= NMR SPECTRUM
##DATA CLASS= NTUPLES
##ORIGIN= BRUKER
##OWNER= Administrator
$$ 1.72 TOPSPIN		Version 2.1
$$ 2016-05-01 13:29:08.208 -0700  Administrator@X
$$ Compression mode = diff/dup
##.OBSERVE FREQUENCY= 400.02188249412
##.OBSERVE NUCLEUS= ^1H
##.ACQUISITION MODE= SIMULTANEOUS (DQD)
##.ACQUISITION SCHEME= undefined
##.AVERAGES= 8
##.DIGITISER RES= 22
##SPECTROMETER/DATA SYSTEM= spect
##.PULSE SEQUENCE= zg30
##.SOLVENT NAME= COFFEE_meoh
##.SHIFT REFERENCE= INTERNAL, COFFEE_meoh, 1, 14.98509
##AUDIT TRAIL= $$ (NUMBER, WHEN, WHO, WHERE, PROCESS, VERSION, WHAT)
$$ ##TITLE= Audit trail, TOPSPIN		Version 2.1
$$ ##JCAMPDX= 5.01
$$ ##ORIGIN= Bruker BioSpin GmbH
$$ ##OWNER= Administrator
$$ $$ E:\/data/COFFEE/nmr/NES1071_159122.0002_001_9705654_qWYHiq8yM4/10/pdata/1/auditp.txt
$$ ##AUDIT TRAIL=  $$ (NUMBER, WHEN, WHO, WHERE, PROCESS, VERSION, WHAT)
(   1,<2016-05-01 13:29:00.833 -0700>,<Administrator>,<X>,<go>,<TOPSPIN 2.1>,
      <created by zg
	started at 2016-05-01 13:27:54.661 -0700,
	POWCHK enabled, PULCHK disabled,
       configuration hash MD5:
       21 0F 79 D6 B3 7B B4 F6 88 20 88 DB 03 48 BD 9F
       data hash MD5: 64K
       25 69 90 A0 47 6B 79 D0 28 83 98 E3 60 60 A0 64>)
(   2,<2016-05-01 13:29:04.239 -0700>,<Administrator>,<X>,<proc1d>,<TOPSPIN 2.1>,
      <Start of raw data processing
       efp LB = 0 FT_mod = 6 PKNL = 1 PHC0 = 0 PHC1 = 0 SI = 32K 
       data hash MD5: 32K
       70 90 4C 5C B6 02 04 C2 AB 38 D2 4C 26 C3 05 6C>)
(   3,<2016-05-01 13:29:04.521 -0700>,<Administrator>,<X>,<proc1d>,<TOPSPIN 2.1>,
      <pk PHC0 = 96.08643 PHC1 = 0 
       data hash MD5: 32K
       D6 E7 3B 16 F9 9C 1D 9E 7A 34 D5 7E 0B C1 9A 79>)
(   4,<2016-05-01 13:29:04.630 -0700>,<Administrator>,<X>,<proc1d>,<TOPSPIN 2.1>,
      <abs ABSG = 1 
       data hash MD5: 32K
       AE 84 A6 86 06 86 E1 EF F3 25 B3 BA DE 7C 53 FC>)
(   5,<2016-05-01 13:29:04.692 -0700>,<Administrator>,<X>,<proc1d>,<TOPSPIN 2.1>,
      <abs ABSG = 2 
       data hash MD5: 32K
       27 6B 56 D7 E5 F5 93 EC 86 6C 96 9C 30 5F 44 11>)
(   6,<2016-05-01 13:29:04.755 -0700>,<Administrator>,<X>,<proc1d>,<TOPSPIN 2.1>,
      <abs ABSG = 3 
       data hash MD5: 32K
       9B AC 71 FA 07 F1 A9 14 B3 75 9F 06 42 57 A9 B5>)
(   7,<2016-05-01 13:29:04.817 -0700>,<Administrator>,<X>,<proc1d>,<TOPSPIN 2.1>,
      <abs ABSG = 4 
       data hash MD5: 32K
       88 06 A5 C6 EC 46 3C AC 5B D7 7D 5F 0C 60 3F 63>)
(   8,<2016-05-01 13:29:04.880 -0700>,<Administrator>,<X>,<proc1d>,<TOPSPIN 2.1>,
      <abs ABSG = 5 
       data hash MD5: 32K
       14 C6 DB 98 85 D0 2C 98 D3 03 8A 67 EE AD A8 88>)
$$ ##END=
$$ 
$$ $$ hash MD5
$$ $$ 57 90 48 E7 5D 92 D6 76 29 77 77 0E 23 B6 44 60
##$RELAX= 
##$RELAX= 
##$RELAX= 
##$RELAX= 
##$RELAX= 
##$RELAX= 
##$RELAX= 
$$ Bruker specific parameters
$$ --------------------------
##$DU= <E:\>
##$EXPNO= 10
$$ [...]
##$TP= (0..7)
150 150 150 150 150 150 150 150
##$TP07= 0
##$TPNAME0= <>
##$TPNAME1= <>
##$TPNAME2= <>
##$TPNAME3= <>
##$TPNAME4= <>
##$TPNAME5= <>
##$TPNAME6= <>
##$TPNAME7= <>
##$TPOAL= (0..7)
0.5 0.5 0.5 0.5 0.5 0.5 0.5 0.5
##$TPOFFS= (0..7)
0 0 0 0 0 0 0 0
##$TUNHIN= 0
##$TUNHOUT= 0
##$TUNXOUT= 0
##$USERA1= <user>
##$USERA2= <user>
##$USERA3= <user>
##$USERA4= <user>
##$USERA5= <user>
##$V9= 5
##$VALIST= <valist>
##$VCLIST= <CCCCCCCCCCCCCCC>
##$VD= 0
##$VDLIST= <DDDDDDDDDDDDDDD>
##$VPLIST= <PPPPPPPPPPPPPPP>
##$VTLIST= <TTTTTTTTTTTTTTT>
##$WBST= 2048
##$WBSW= 25
##$XGAIN= (0..3)
0 0 0 0
##$XL= 0
##$YL= 0
##$YMAX_a= 543084
##$YMIN_a= -460296
##$ZGOPTNS= <>
##$ZL1= 120
##$ZL2= 120
##$ZL3= 120
##$ZL4= 120
##$ABSF1= 14.98509
##$ABSF2= -5.573092
##$ABSG= 5
##$ABSL= 3
##$ALPHA= 0
##$AQORDER= 0
##$ASSFAC= 0
##$ASSFACI= 0
##$ASSFACX= 0
##$ASSWID= 0
##$AUNMP= <proc_prof1d_extract_pilot.lims>
##$AXLEFT= 0
##$AXNAME= <>
##$AXNUC= <1H>
##$AXRIGHT= 0
##$AXTYPE= 0
##$AXUNIT= <>
##$AZFE= 0.1
##$AZFW= 0.1
##$BCFW= 0
##$BC_mod= 0
##$BYTORDP= 0
##$COROFFS= 0
##$CY= 15
##$DATMOD= 1
##$DC= 0
##$DFILT= <>
##$DTYPP= 0
##$F1P= 0
##$F2P= 0
##$FCOR= 0.5
##$FTSIZE= 32768
##$FT_mod= 6
##$GAMMA= 0
##$GB= 0
##$INTBC= 1
##$INTSCL= 1
##$ISEN= 128
##$LB= 0
##$LEV0= 0
##$LPBIN= 0
##$MAXI= 10000
##$MC2= 0
##$MEAN= 0
##$ME_mod= 0
##$MI= 0
##$NCOEF= 0
##$NC_proc= -8
##$NLEV= 6
##$NOISF1= 0
##$NOISF2= 0
##$NSP= 0
##$NTH_PI= 0
##$NZP= 0
##$OFFSET= 14.98509
##$PC= 1
##$PHC0= 96.08643
##$PHC1= 0
##$PH_mod= 1
##$PKNL= yes
##$PPARMOD= 0
##$PPDIAG= 0
##$PPIPTYP= 0
##$PPMPNUM= 2147483647
##$PPRESOL= 1
##$PSCAL= 4
##$PSIGN= 0
##$PYNMP= <proc.py>
##$REVERSE= no
##$SF= 400.02
##$SI= 32768
##$SIGF1= 0
##$SIGF2= 0
##$SINO= 400
##$SIOLD= 32768
##$SPECTYP= <>
##$SREGLST= <1H.CDCl3>
##$SSB= 0
##$STSI= 32768
##$STSR= 0
##$SW_p= 8223.68421052631
##$SYMM= 0
##$S_DEV= 0
##$TDeff= 65536
##$TDoff= 0
##$TI= <>
##$TILT= no
##$TM1= 0
##$TM2= 0
##$TOPLEV= 0
##$USERP1= <user>
##$USERP2= <user>
##$USERP3= <user>
##$USERP4= <user>
##$USERP5= <user>
##$WDW= 1
##$XDIM= 32768
##$YMAX_p= 395293458
##$YMIN_p= -651555
##$CURPLOT= <Network HP LaserJet P1505>
##$CURPRIN= <$Network HP LaserJet P1505>
##$DFORMAT= <normdp>
##$LAYOUT= <+/1D_H.xwp>
##$LFORMAT= <normlp>
##$PFORMAT= <normpl>
##$SURQMSG= 1
$$ End of Bruker specific parameters
$$ ---------------------------------
##NTUPLES= NMR SPECTRUM
##VAR_NAME=  FREQUENCY,     SPECTRUM/REAL,   SPECTRUM/IMAG
##SYMBOL=    X,             R,               I
##VAR_TYPE=  INDEPENDENT,   DEPENDENT,       DEPENDENT
##VAR_FORM=  AFFN,          ASDF,            ASDF
##VAR_DIM=   32768,         32768,           32768
##UNITS=     HZ,            ARBITRARY UNITS, ARBITRARY UNITS
##FACTOR=    0.250966925370066, 1,           1
##FIRST=     8223.43324360094, 207354,       -44972
##LAST=      0,             -288825,         98713
##MIN=       0,             -651555,         0
##MAX=       8223.43324360094, 395293458,    0
$$ Real data points
##PAGE= N=1
##DATA TABLE= (X++(R..R)), XYDATA
$$ [...]
$$ plain form
19528 -424208 181810 -211146 -16066 -119469 9058 84959 -95964 176242 81727 7461 148776
19517 148776 189759 -282723 -215905 285918 -94997 37012 -86529 -177079 -167197 -123475 15556
19505 -212018 -44013 -208667 -61723 -81834 65790 -134258 -273134 -149771 58225 30011 -257840
19493 -105973 -98908 -31020 -86268 -194212 153951 -84454 303575 46287 -184314 -199595 179451
19481 -72256 -44564 18756 21789 -78981 99559 -53540 134609 -37289 -48155 189968 26708
19469 66937 -50227 168118 -10133 19974 -274709 147662 -109005 3199 22432 372134 209176
19458 209176 208507 -54526 -95157 -443068 -148200 31348 -28117 223307 26463 -128864 -38289
19446 42299 149404 158782 -78088 -155847 -269836 -152076 -124907 -54213 41615 -212113 -210237
$$ packed form
19528d24208A81810b11146a6066j03403I058P5901i5964A76242H1727G461J41315
19517A48776M0983b82723O6818B85918i4997C7012h6529r0550R882M3722A5556
19505b12018d4013j64654f1723k0111F5790a34258j38876J23363E8225k8214b57840
19493a05973P065c1020n5248j07944A53951h4454C03575D6287a84314j5281A79451
19481g2256K7692A8756L033g8981I9559e3540A34609c7289j0866A89968B6708
19469F6937e0227A68118a0133A9974b74709A47662a09005C199J9233L49702j62958
19458B09176o69e4526m0631l47911a48200C1348b8117B23307B6463a28864c8289
19446D2299J07105R378g8088p7759j13989J17760K7169e4213D1615b12113J876
$$ plain form
19435 -210237 -262650 -312901 -178852 38212 -171597 -89978 -119490 -79617 -123929 -215635 83042
19423 204741 215671 21793 197995 -309137 -142036 338862 -23798 -5270 225358 142914 -114157
19411 -164477 -145639 -126058 -127465 1556 165855 109940 93011 -98554 -30899 1860 -47336 168445
19398 711 -97206 -156890 28155 63362 -272311 -159206 -51915 134125 -61565 30181 48544
19387 48544 -332259 -30042 -177505 -96950 -100409 -97033 -119606 -97564 52807 -30720 27576 -231894
19374 -36308 -231971 142849 229174 94384 -46162 24016 18987 248642 -94423 29597 22431
19363 22431 111154 -102773 -110753 -259070 -163587 34180 -46672 183748 -490269 -35715 -104997
19352 -104997 54918 45950 -80104 36380 143253 -61241 -169576 -53722 239983 82816 -52610
$$ packed form
19435b10237n2413n0251J34049C8212a71597Q1619k9512L9873m4312r1706H3042
19423B04741J0930B1793J76202c09137a42036C38862b3798e270B25358q2444a14157
19411a64477J8838J9581j407A556J64299n5915j6929i8554c0899A860d7336A68445
19398G11i7206n9684B8155L5207b72311J13105e1915A34125f1565C0181J8363
19387D8544c32259c0042j47463Q0555l459L376k2573K2042E2807c0720B7576b31894
19374c6308j95663A42849Q6325I4384d6162B4016n029K29655i4423B9597p166
19363B2431Q8723a02773p980j48317R5483C4180d6672A83748d90269c5715o9282
19352a04997E4918q968h0104C6380J06873f1241j08335e3722B39983H2816e2610
$$ plain form
19340 -70119 118649 18763 -176724 -109256 111027 -191472 -178020 -411175 -5404 -40565 52593
19328 -406570 185709 -114395 9745 -121968 -229665 -172470 133554 190279 -9637 -224656 59338
19316 -27243 -315196 -224004 -111702 -168089 -176737 35000 -494075 -152283 60472 -366699 -86185
19304 -123519 -61008 -201582 -247216 -11859 229896 -57147 -209289 -96463 53664 241591 -29123
19292 -303514 133899 -180925 49857 88538 235724 -468994 119254 46642 41638 207364
19282 207364 7765 -140078 103742 85270 108788 76076 -158418 85257 -72140 -272197 56847
19270 -19131 -86008 192110 -134337 -97403 7274 30023 -18476 -106002 -21091 -242127 -149379
19259 -149379 -363211 -8087 11873 -116132 100814 -24207 -151995 141569 -173146 -505856
$$ packed form
19340g0119A18649A8763a76724O7468A11027a91472J3452k33155e404l5161E2593
19328d06570A85709a14395I745a21968j07697N7195A33554N6725i637k15019E9338
19316b7243k87953R1192a11702n6387q648C5000d94075a52283F0472c66699h6185
19304a23519f1008j40574m5634a1859B29896e7147j52142i6463E3664J87927b9123
19292c03514A33899a80925D9857L8681J47186d68994A19254D6642n004J65726
19282B07364G765a40078A03742j8472K3518l2712a58418H5257g2140k00057E6847
19270a9131o6877A92110a34337L6934G274K2749a8476q7526b1091k21036R2748
19259a49379k13832h087A1873a16132A00814b4207j27788A41569a73146l32710
$$ plain form
19249 -505856 -57628 72424 121599 -204633 -145974 137391 22541 99096 163634 161493 -344400
19237 199101 -130213 201891 25514 13140 -54218 -115417 284022 -350403 53707 -98889 172434
19225 58243 197019 -97189 -21757 -11324 -89668 69156 -37857 44786 127248 -318430 23875
19213 135716 -155466 141080 -168313 -99789 313160 -399128 -67319 -37283 -230782 -212269
19203 -212269 23337 8695 -97915 59767 59054 -100324 9638 19583 -97635 -93269 162961 19522
19190 -21708 -13428 -25355 -97500 -115965 -242225 -258306 -185940 537169 358057 65078 244600
19179 244600 53092 168563 -76641 -135353 -28796 -176847 -196412 262082 -89750 36501 185864
19168 185864 -276440 -24632 -305283 -2797 -177304 -203000 -210175 -192240 -33002 36198 -175200
$$ packed form
19249e05856e7628G2424M9175b04633N8659A37391B2541P6555O4538k141c44400
19237A99101a30213B01891B5514j2374e4218o1199B84022c50403E3707i8889A72434
19225E8243J38776i7189b1757J0433p8344F9156c7857D4786Q2462c18430B3875
19213A35716a55466A41080a68313O8524C13160c99128f7319L0036j93499J8513
19203b12269B3337H695i7915E9767p13a00324I638R945i7635M366A62961A9522
19190b1708Q280j1927p2145j8465j26260j6081P2366E37169j79112F5078J79522
19179B44600E3092J15471g6641n8712b8796j48051j9565B62082h9750C6501J49363
19168A85864b76440b4632k80651b797j74507k5696p175J7935c3002C6198a75200
$$ plain form
19156 -210844 -206772 61574 -85967 -161250 361395 -124634 -68215 30935 -205873 63764 -190154
19144 116943 322421 85693 7048 -399038 -246765 -216323 -126841 -226265 -84243 -124995 551502
19132 24461 245121 -141543 -224681 -13159 120175 36914 -116322 -182225 4631 -156911 -146541
19121 -146541 -22686 -16833 15337 155324 30368 126961 -102623 -64692 39458 -202946 -181510
19110 -181510 -68026 32895 -39465 -187894 44990 -131060 -306847 -421167 -70823 39664 -22150
19098 -193069 256155 -129913 249285 -211467 27693 175904 63225 -149616 17218 -28414
19087 -78777 69361 -205687 -28046 269652 100482 -235374 183100 -147708 67737 -99353
19076 -105141 8767 426922 117151 -186747 159830 104926 -208304 16014 17525 68415 56371
$$ packed form
19156b10844M072F1574h5967p5283C61395a24634N6419C0935b05873F3764a90154
19144A16943K05478H5693G048c99038J52273L0442Q9482r9424h4243m0752E51502
19132B4461K20660a41543q3138a3159A20175C6914a16322o5903D631a56911J0370
19121a46541b2686N853A5337J39987C0368R6593a02623L7931C9458b02946K1436
19110a81510f8026C2895c9465j48429D4990a31060j75787j14320g0823C9664b2150
19098a93069B56155a29913B49285b11467B7693J48211F3225a49616A7218b8414
19087g8777F9361b05687b8046B69652A00482b35374A83100a47708F7737i9353
19076a05141H767M18155A17151a86747A59830n4904b08304A6014J511N0890j2044
$$ plain form
19065 56371 -321936 -72685 -163021 -227103 250087 -379046 17526 -23620 -205995 -228230 -223469
19054 -223469 175496 -126253 -129680 140235 105670 -53583 12850 194336 -63253 -168451 -217198
19043 -217198 137768 -73576 -174642 104832 41300 -312198 -277521 22366 -117453 -165251
19033 -165251 -53476 110814 -114094 192195 23696 -66824 -151054 -32310 127942 -206645
19022 -10715 77798 92438 -43113 -44394 255458 -258850 118938 34979 -23321 -393740 157756
19010 -219074 72781 -203603 246784 -272172 -138312 90439 -275565 -93111 -214287 -123404
19000 -123404 -34765 -43216 90731 -36574 83423 197432 82007 639 -279096 130701 393485
18989 393485 -55736 -29293 -65503 81561 -405809 -142309 -270723 -29504 -67130 -84786 181700
$$ packed form
19065E6371c21936g2685r0336o4082B50087c79046A7526b3620j82375k2235M761
19054b23469A75496a26253l427A40235l4565e3583A2850J81486f3253j05198m8747
19043b17198A37768g3576j01066A04832D1300c12198L4677B2366a17453m7798
19033a65251e3476A10814a14094A92195B3696f6824q4230c2310A27942b06645
19022a0715G7798J4640d3113j281B55458b58850A18938C4979b3321l70419A57756
19010b19074G2781b03603B46784b72172J33860I0439b75565i3111j21176R0883
19000a23404c4765q451I0731c6574H3423J14009H2007F39b79096A30701K62784
18989C93485e5736K6443l6210H1561d05809a42309j28414b9504l7626j7656A81700
$$ plain form
18977 -250369 164641 -19419 -93169 -98414 -167300 22617 20582 -58224 -48281 -245949 -51187 21561
18964 85176 37231 216332 -165985 -458746 -122231 -199284 -490444 -48479 45533 276092
18954 276092 114479 190894 -84184 -151438 172582 -151374 -220545 -168537 252445 144174
18944 144174 -68036 -97928 -17546 -145966 144642 121647 45574 -162107 -223399 -299694 -157609
18933 -157609 24908 289772 40814 135507 557265 -17140 -39367 85781 -473204 44835 -48320
18921 54099 -3723 189391 -49606 -41249 -103138 -338377 179010 95683 135065 -8168 148 92838
18909 92838 9867 173688 -119913 119678 81668 335580 186253 -179690 54722 -132993
18898 56327 -41044 -152295 5462 -82997 64196 221232 29592 -60772 -149581 -37768 -532421
$$ packed form
18977b50369A64641a9419p3750n245o8886B2617k035e8224R943j97668e1187B1561
18964H5176C7231J79101a65985k92761a22231p7053k91160d8479D5533K30559
18954B76092A14479P6415h4184o7254A72582a51374o9171N2008B52445j08271
18944A44174f8036k9892a7546j28420A44642k2995D5574a62107o1292p6295J42085
18933a57609B4908K64864D0814R4693M21758a7140k2227H5781d73204D4835d8320
18921E4099c723A89391d9606Q357o1889k35239A79010q3327L9382h168A48R2690
18909I2838I867J63821a19913A19678l8010K53912j49327a79690E4722a32993
18898E6327d1044j11251E462h2997F4196J57036B9592f0772q8809c7768m94653
$$ plain form
18887 -532421 66314 59644 222312 -31450 -236677 -71704 -34965 67154 -138999 -99456 212151
18875 -3050 328991 -103644 -578643 222681 217278 241447 -355782 -235231 -256000 96813 39247
18863 159223 -122346 -63453 -160084 -124003 19405 -180168 319973 -55197 65735 -61413 186574
18851 -387887 38048 4643 26978 -31408 19164 64755 -29023 -84569 -148651 -189382 -224153 -66700
18838 -64351 -329299 -362876 -105788 -234867 -28694 -82532 -347544 -136541 -263784 -189826
18828 -189826 -44932 -46804 147989 141526 -159169 -39807 393430 71496 270569 -125716 112162
18816 319497 63848 61759 -85001 -128958 -61094 -68117 332024 360077 -14835 -13357 -111690 192890
18803 -174818 9169 -222641 -232848 45597 -90101 151883 -5194 179442 -208380 79652 -352401
$$ packed form
18887e32421F6314o670J62668c1450k05227g1704c4965F7154a38999L9543B12151
18875c050C28991a03644m74999B22681n403K4169c55782J20551k0769I6813C9247
18863A59223a22346N8893r6631L6081A9405a80168C19973e5197F5735f1413A86574
18851c87887C8048D643K2335c1408A9164M5591b9023n5546o4082m0731l4771f6700
18838f4351k64948l3577a05788j29079b8694n3838k65012a36541j27243P3958
18828a89826d4932j872A47989o463a59169c9807C93430G1496J99073a25716A12162
18816C19497F3848k089h5001m3957f1094p023C32024K8053a4835J478r8333A92890
18803a74818I169b22641j0207D5597i0101A51883e194A79442b08380G9652c52401
$$ plain form
18791 -235317 -53132 315287 21571 201660 -80801 -72106 124114 -139727 -224098 61056 -156139
18779 -79742 -19064 -36063 71054 29070 -457015 -28915 -3548 74330 -62975 154615 -67275
18767 -86462 -211717 -226750 36594 93378 -57051 -75969 47171 -183477 -194286 -83936 -268808
18756 -268808 -370430 -140378 38493 -134478 144860 -281985 216557 -181607 -51666 -17530
18745 -46470 277504 61631 35960 -411835 24987 317930 200717 -219604 -207527 101570
18734 -24681 -217202 -256430 -30123 -34520 47544 -284242 -17947 134556 -97943 -90530 164169
18722 79631 -399234 -191957 -215255 -18322 -117925 -85577 245725 69697 -320389 -272640 -38078
18710 -122327 -85364 39190 -147172 -9582 37230 -144541 -86617 -9177 -208262 74309 36249
$$ packed form
18791b35317e3132C15287B1571J80089h0801Q695A24114a39727q4371F1056a56139
18779g9742a9064j6999G1054B9070d57015b8915c548G4330f2975A54615f7275
18767h6462j25255j5033C6594N6784e7051j8918D7171a83477j0809h3936j84872
18756b68808j01622a40378C8493a34478A44860b81985B16557a81607e1666a7530
18745d6470B77504F1631k5671d11835B4987K92943j17213b19604J2077A01570
18734b4681j92521l9228c0123m397D7544b84242a7947A34556i7943P413A64169
18722G9631c99234a91957k3298a8322r9603L2348B45725F9697c20389M7749c8078
18710a22327L6963C9190a47172i582C7230a44541N7924i177j99085G4309C6249
$$ plain form
18698 194323 5813 -17346 191943 -239816 -206418 225902 129308 -81483 -60368 -249481 210038
18686 -299142 -118531 12699 26274 -214554 30023 76043 -236581 -15110 252193 -244874
18675 -117537 -62864 -76444 -344485 -172102 73708 -350 217542 -17647 -240417 -77231 -271600
18664 -271600 134095 -293607 -353375 263764 -157170 -144010 -154540 -76152 130813 -189435
18653 70364 -38456 241781 -1963 -92974 -50868 93455 -39378 253933 -75717 104532 -23914
18641 24034 -19445 247699 -154323 95842 68358 -193449 -101939 -305459 -203801 -299021 -28812
18629 -200427 -154820 129581 -130463 -265996 -255379 -393219 133332 94983 -264355 131533
18618 64528 -33012 -222240 -78663 64865 -269072 -74553 -26233 131646 61208 20732 213649
$$ packed form
18698A94323E813a7346A91943b39816L3398B25902r6594h1483K1115j89113B10038
18686b99142a18531A2699J3575b14554C0023M6020b36581a5110B52193b44874
18675a17537N4673j3580k68041a72102G3708c50B17542a7647k22770g7231j94369
18664b71600A34095b93607n9768B63764a57170J3160j0530g6152A30813a89435
18653G0364c8456B41781a963r1011M2106I3455c9378B53933g5717A04532b3914
18641B4034a9445B47699a54323I5842k7484a93449R1510k03520J01658r5220b8812
18629b00427M5607A29581a30463j35533J0617j37840A33332l8349b64355A31533
18618F4528c3012j89228g8663F4865b69072g4553b6233A31646F1208B0732J92917
$$ plain form
18607 213649 -68016 -65923 213197 58946 472676 -70837 84803 -50323 -401319 58526 -388475
18595 -172275 47945 -261233 84526 204006 126524 -20818 -122267 -67650 -41425 377794 -400909
18583 -18590 154867 1675 -309175 -348476 -315299 -78787 129902 46059 11985 -18178 124564
18571 -5148 -1098 -279657 41149 549 -474531 -33310 -23358 -158121 60710 -43225 -121970 -306614
18559 -306614 -18707 -84078 -49041 -474656 -174200 -496271 -100227 49109 -214445 -124431
18549 -124431 -55645 -220149 40455 177768 88814 -121371 152445 -220767 -247608 109794
18538 -258637 -343637 -123101 -297383 47709 286642 226129 66675 245631 65427 -97169 137502
18526 270220 -6894 -295209 -472738 99499 -554711 159000 -8765 -111116 -33941 -105500 -1640
$$ packed form
18607B13649f8016K093B13197E8946M13730g0837H4803e0323l50996E8526c88475
18595a72275D7945b61233H4526J19480p7482b0818j01449N4617K6225C77794d00909
18583a8590A54867A675c09175l9301L3177g8787A29902D6059A1985a8178A24564
18571e148a098k78559D1149E49d74531c3310R952j34763F0710d3225p8745j84644
18559c06614a8707o5371L5037m25615a74200l22071a00227D9109b14445R0014
18549a24431e5645j64504D0455J37313H8814a21371A52445b20767k6841A09794
18538b58637q5000a23101j74282D7709K38933o0513F6675J78956F5427i7169A37502
18526B70220f894k88315j77529I9499e54711A59000h765j02351c3941p1559a640
$$ plain form
18514 34562 121581 -179418 -338046 98705 16387 -324833 -14806 -28788 27637 -102661 298098
18502 -208453 190309 -228391 167304 -105151 -209312 188428 -118866 -136117 116019 -49136
18491 -83852 -271732 -1680 -569 -54780 -152902 -10565 -162960 -101196 -91983 -32892 93155 -372911
18478 284634 33887 118235 249875 -200178 -170206 -176860 232581 -145346 -58815 -189796 -114327
18467 -114327 -129007 -119401 186426 13141 206920 -11369 -27407 -356456 -71661 -181217 197813
18455 213155 -25725 -157521 83109 -137905 29799 185326 -109315 165962 45770 271731
18445 271731 -187808 272550 -15577 239827 -54220 -69950 -85084 -56016 -182818 1704 311951
18434 311951 -128575 170213 216202 -149430 71208 -220322 170280 117206 160202 74399
$$ packed form
18514C4562Q7019a79418j58628I8705A6387c24833a4806j3982B7637a02661B98098
18502b08453A90309b28391A67304a05151j04161A88428a18866j7251A16019d9136
18491h3852j87880a680e69n4211r8122a0565j52395O1764R213c2892I3155c72911
18478B84634C3887Q4348J31640b00178K9972o654B32581a45346e8815j30981P5469
18467a14327j4680R606A86426A3141J93779a1369j6038l29049g1661j09556A97813
18455B13155b5725j31796H3109a37905B9799J55527a09315A65962D5770K25961
18445B71731a87808B72550a5577B39827e4220j5730j5134K9068j26802A704L10247
18434C11951a28575A70213M5989a49430G1208b20322A70280n3074M2996G4399
$$ plain form
18423 -33429 120700 48376 5759 -129401 -91075 -67292 112190 237774 -101347 -35138 272364
18411 282092 153632 -172472 -284759 -251610 -26241 22563 43286 -118122 -99050 229869
18400 -187301 -35076 -314533 -248124 -120196 -205065 31483 -137430 129514 -122660 -182164
18390 -182164 39972 -101741 288849 61524 -143757 -139197 -208490 137455 -225969 15133 237765
18379 237765 40085 162810 131702 80042 -33366 -28679 -67682 -26911 -268568 14119 154618
18368 154618 61782 14406 -35925 59446 -69204 -174323 -131312 -80594 30882 166785 7723
18356 148803 150295 -167511 -134493 -73244 232468 -113489 -16602 -10842 42438 4278 -223855
18344 -16713 -124186 147847 -204332 -184771 -34749 122917 139432 195475 -322196 74442 192794
$$ packed form
18423c3429A20700D8376E759a29401L8326K3783A12190J25584a01347c5138B72364
18411B82092j28460a72472j12287L3149b6241B2563K0723a18122J9072B29869
18400a87301c5076k79457O6409a20196q4869C1483a37430A29514a22660n9504
18390a82164C9972a01741B88849F1524a43757M560o9293A37455b25969A5133K22632
18379B37765D0085J22725l1108n1660c3366M687l9003b6911k41657A4119J40499
18368A54618F1782A4406c5925E9446f9204j05119M3011N0718C0882J35903G723
18356A48803J492a67511L3018O1249B32468a13489a6602N760D2438D278b23855
18344a6713j07473A47847b04332J9561c4749A22917J6515N6043c22196G4442J18352
$$ plain form
18333 192794 -25866 -176006 -93327 283730 174796 49313 140185 -281457 -302369 199104
18322 -279179 -44436 13437 -104079 -2003 52338 206445 160969 72364 213458 -209372 -27769
18310 -144019 -197950 -42174 -95139 47633 -266194 -145052 -258903 953 -123857 72288 -252417
18298 -266064 4539 -289295 75325 -258209 270879 -10271 59621 59939 -131960 267195 -84590
18286 -36114 21207 -23933 -62581 -5825 1306 29381 89728 134286 -1588 163142 -39308 -8716
18273 -1544 34726 -255317 103044 -166602 -145440 -330247 51242 -214373 10319 -4642 116178
18261 255168 -177274 23720 35798 172 87074 321022 40230 218932 -66525 252961 -108044
18249 -267633 15722 -120382 -83539 188773 -68695 -158166 -34273 -228304 -515842 199413
$$ packed form
18333A92794b5866j50140Q2679B83730j08934D9313R0872b81457k0912A99104
18322b79179d4436A3437a04079b003E2338J54107m5476G2364J41094b09372b7769
18310a44019n3931d2174n2965D7633b66194J21142j13851I53a23857G2288b52417
18298b66064D539b89295G5325b58209B70879a0271E9621L18a31960B67195h4590
18286c6114B1207b3933l8648e825A306K8075O0347M4558a588A63142c9308h716
18273a544C4726b55317A03044a66602K1162j84807E1242b14373A0319d642A16178
18261B55168a77274B3720J2078A72Q6902K33948D0230J78702f6525B52961a08044
18249b67633A5722a20382L6843A88773f8695q9471c4273j94031k87538A99413
$$ plain form
18238 -246861 19465 143333 -230575 296589 135905 12207 316308 -111447 -101437 9066
18227 55802 -169213 257016 -83089 27445 65677 40266 26979 177365 -84327 286454 -163186
18215 -199844 3306 -63816 1620 153229 29076 289327 -286484 -45962 37926 -146524 221985
18203 147311 50992 -199247 -106033 -70006 -266158 -403138 160032 -67860 -128574 -77802 -86349
18192 -86349 -233561 80850 -111264 279612 -490981 -228854 -216206 -163108 212393 -122869
18181 -5751 -95534 196798 85105 12118 8451 205429 -77416 -199041 187940 4480 -2948 46207
18168 159005 60199 70232 165392 -158640 262069 27972 339676 -150297 -168232 36308 31257
18157 31257 -17925 34644 -61717 -21104 -231071 112573 -316453 -198651 -69759 -132298 86033
$$ packed form
18238b46861A9465J23868b30575B96589A35905A2207L04101a11447J0010I066
18227E5802a69213B57016h3089B7445L8232k5411j3287J50386h4327B86454a63186
18215a99844C306f3816A620J51609B9076K60251b86484d5962C7926a46524B21985
18203A47311E0992a99247R3214L6027j96152j36980A60032f7860o0714N0772q547
18192h6349j47212H0850a11264B79612d90981b28854J2648N3098B12393a22869
18181e751q9783A96798H5105A2118l667J96978g7416j21625A87940D480b948D6207
18168A59005F0199J0033R5160a58640B62069B7972L11704a50297j7935C6308n051
18157C1257a7925C4644f1717b1104k09967A12573c16453J17802f9759o2539H6033
$$ plain form
18145 95628 115062 65829 -242263 -108730 11357 -151915 464862 -44233 -111612 133417 87022
18134 87022 -162407 144150 113368 -364155 -134589 -39996 -156925 -139997 3781 -159356 -162124
18123 -162124 83225 75667 157479 -160295 -214840 69303 -73669 175979 -77313 -458285 -185008
18111 -216307 -108039 -428868 -54132 -40610 -235221 -4657 13914 -115255 75976 4487 200543
18100 200543 -6025 116618 -46886 -116766 160123 121478 -46996 -231145 -460309 137571 40871
18088 -152277 30150 371052 99513 -201081 -90768 266939 -45428 80105 -110966 -230905
18078 -230905 -96063 -12715 -315999 -379928 -661 -237779 165996 2994 288727 70028 334044
18067 334044 -15504 -282883 137247 161959 42760 -62897 37583 2672 61577 -240723 187419
$$ packed form
18145I5628J9434m9233b42263a08730A1357a51915D64862d4233o7379A33417m6395
18134H7022a62407A44150l0782c64155a34589c9996j16929J6928C781a59356k768
18123a62124H3225p558Q1812a60295n4545F9303g3669A75979g7313l80972a85008
18111b16307a08039l20829e4132J3522j94611d657A3914a15255G5976D487J96056
18100B00543f025A16618d6886o9880A60123l8645d6996j84149k29164A37571D0871
18088a52277C0150L40902I9513b01081i0768B66939d5428H0105a10966j19939
18078b30905i6063a2715l03284o3929f61k37118A65996B994K85733G0028K64016
18067C34044a5504k67379A37247K4712D2760f2897C7583B672N8905b40723A87419
$$ plain form
18055 -110061 -83777 -50551 96775 -132364 -298878 108792 -78826 -283419 -105918 -477055
18045 -477055 58968 -144382 -175985 -196677 -274692 -120603 43200 -139786 2247 171904 120299
18034 120299 303779 160539 16573 -106646 -72301 24314 218315 -107031 1626 -74100 77100
18022 149395 18694 -78892 233527 -82349 51223 -277130 -108730 50016 280471 -235303
18011 -90319 95332 18687 -128046 128307 -183543 -87799 115207 245691 293894 135575
18000 106498 -59389 -144513 -31345 -98608 -110282 -203848 -204154 -278452 45499 91916 226979 202361
17988 202361 -241371 148305 124729 92719 5999 -74556 -127605 -139308 -223895 216588 130180
17977 130180 300476 -189169 -266447 15947 95437 104715 -191853 72184 -175149 85533 151011
$$ packed form
18055a10061K6284L3226I6775a32364j66514A08792g8826k04593a05918l71137
18045d77055E8968a44382l1603k0692p8015a20603D3200a39786B247J69657n1605
18034A20299J83480j43240A6573a06646L4345B4314J94001a07031A626g4100G7100
18022A49395A8694g8892B33527h2349E1223b77130a08730E0016K30455b35303
18011i0319I5332A8687a28046A28307a83543h7799A15207J30484M8203A35575
18000A06498e9389q5124c1345o7263j1674r3566l06p4298D5499M6417J35063k4618
17988B02361b41371A48305k3576l2010E999g4556n3049j1703q4587B16588q6408
17977A30180J70296a89169p7278A5947P9490R278a91853G2184a75149H5533O5478
$$ plain form
17966 151011 -116375 -328641 13381 253722 -229278 300855 -135684 129572 126240 -49243
17955 130864 -94266 -58865 -309177 -222655 -331900 -274439 261015 -144504 60145 73008 -209918
17943 -238695 -212073 67694 15570 308518 -212792 -97085 108974 2193 -157994 -129748 -135090
17932 -135090 304178 122145 -225389 -57576 -280161 -92602 -9385 -131396 -136541 -3751 -31066
17921 -31066 301971 -74045 -166873 -85817 162851 -76531 -69826 37896 278668 110927 127536
17910 127536 -109850 -136450 15182 -143839 -49268 97516 92156 -168487 59922 293952 -85482
17898 69767 49110 -129746 189671 -233665 -158346 65762 -180234 37789 110713 -222708 129526
17886 -132796 245093 18113 28324 -144374 -200115 215266 19609 57368 -199171 82482 10763
$$ packed form
17966A51011a16375k12266A3381K40341b29278C00855a35684A29572l332d9243
17955A30864i4266L5401k50312Q6522j09245N7461B61015a44504F0145J2863b09918
17943b38695K6622F7694A5570K92948b12792i7085A08974B193a57994K8246n342
17932a35090C04178A22145b25389e7576k22585i2602i385j22011n145c751k7315
17921c1066C01971g4045r2828Q1056A62851g6531O705C7896K40772A10927J6609
17910A27536a09850k6600A5182a43839d9268I7516n360a68487E9922K34030h5482
17898F9767k0657a29746A89671b33665P5319F5762a80234C7789P2924b22708A29526
17886a32796B45093A8113J0211a44374n5741B15266A9609L7759a99171H2482A0763
$$ plain form
17874 91535 102676 -134810 -148618 159842 205887 255695 -199954 -192280 -158471 67738 15671
17862 -145254 -70066 -120880 -22566 39329 -13502 -56820 141822 38792 -223562 -6139 39221
17850 218802 -129681 -440263 70917 165658 76835 201365 73757 148756 -26441 27012 -206792
17838 191953 211432 -3934 -58900 256831 72021 61008 -159296 19621 -306786 -144726 97816
17826 23325 194140 -243294 4367 175441 -154379 12618 -132368 182502 -265812 157055
17815 -88979 -62988 117915 315023 101094 -111773 124618 389466 286982 -70277 249463
17804 56223 -95734 155428 197729 -278026 -50739 153311 -33899 -113258 -214933 -184232 91284
17792 217481 -115939 -133380 -100027 245803 -24035 174565 212971 155345 68697 -141953 -38151
$$ packed form
17874I1535J1141a34810j3808A59842M6045M9808a99954P674L3809F7738A5671
17862a45254g0066n0814b2566C9329a3502m3318A41822C8792b23562f139C9221
17850B18802a29681l10582G0917R4741G6835J24530G3757P4999b6441B7012b06792
17838A91953J9479c934n4966B56831G2021j1013a59296A9621c06786a44726I7816
17826B3325J70815b43294D367J71074a54379A2618a32368A82502b65812A57055
17815h8979K5991A17915J97108A01094a11773A24618K64848j02484g0277B49463
17804E6223i5734A55428M2301b78026e0739A53311c3899p9359j01675L0701I1284
17792B17481a15939j7441L3353B45803b4035A74565L8406n7626F8697a41953c8151
$$ plain form
17780 132090 -154302 -22566 7984 -80945 -86138 -39767 -71074 -71648 104539 34063 239944 -25178
17767 155888 -115786 -142745 268666 -90832 10552 74437 -171092 -165484 -221424 -208781 -177708
17756 -177708 -5709 305583 90021 -288789 155369 46343 -1890 145384 8431 162651 -203354
17744 114794 100710 -137552 73121 -192 -154356 -306223 133490 246974 88539 -62744 -85858
17733 -85858 96029 286947 146893 46915 83901 -88196 -240290 -214141 580319 -113023 -14422
17721 62179 -267176 261336 77385 119386 98058 -101800 -34222 -188617 219010 11576 -102719
17709 -7685 30437 -21628 -66884 -179750 -95866 -288806 54574 -146777 168113 -84321 -117395
17698 -117395 -25301 379730 -188887 374859 -7245 -210253 259167 134901 -105806 -146509
$$ packed form
17780A32090a54302b2566G984h0945n193c9767l1307n74A04539C4063K05881b5178
17767A55888a15786k6959B68666i0832A0552O3885a71092N608n5940J2643L1073
17756a77708e709C05583I0021b88789A55369D6343a890A45384H431J54220b03354
17744A14794j4084a37552G3121a92j54164j51867A33490J13484H8539f2744k3114
17733h5858I6029J90918j40054D6915L6986h8196j52094K6149E80319a13023a4422
17721F2179b67176B61336G7385M2001k1328a01800c4222j54395B19010A1576a02719
17709g685C0437b1628m5256j12866Q3884j92940E4574a46777A68113h4321l3074
17698a17395b5301C79730a88887C74859g245k03008B59167j24266a05806m0703
$$ plain form
17688 -146509 125173 155147 30237 -283861 57841 70867 37860 144722 4081 35069 -114354
17676 -70449 87807 -199242 -194890 70741 -220912 380919 180207 104141 299172 128235 -402495
17664 32681 -228717 -2343 58764 220978 26329 269076 377453 -290053 68882 45774 75948
17653 75948 -80717 39637 92130 -10838 265628 -22546 230470 -231019 -135028 134457 -76151
17641 52386 -35893 69914 109930 -379037 -26736 76388 236313 263657 418263 113991 46410
17629 -139001 -26063 86866 -290358 -25656 -181670 224471 84009 351540 163098 20227
17618 184406 -194233 -242919 146588 -257598 -40433 126762 139568 25655 56094 -110716
17607 -15270 -17149 151462 204609 -209146 270508 338815 204971 -16915 101985 -100832 -237543
$$ packed form
17688a46509A25173K9974C0237b83861E7841J3026l3007J06862D081L0988a14354
17676g0449H7807a99242M352G0741b20912C80919A80207p6066J95031A28235d02495
17664C2681b28717b343E8764J62214B6329K42747J08377b90053F8882k3108L0174
17653G5948h0717C9637N2493a0838B65628b2546B30470b31019R5991A34457g6151
17641E2386c5893F9914M0016c79037b6736G6388J59925K7344J54606A13991D6410
17629a39001b6063H6866b90358b5656j56014B24471H4009K67531A63098B0227
17618A84406a94233m8686A46588b57598d0433A26762J2806B5655L0439a10716
17607a5270j879A51462N3147b09146B70508O8307j33844a6915A01985a00832j36711
$$ plain form
17596 -237543 -49842 -109306 31159 144278 2330 116687 -325166 -14540 86529 -3085 -18 99298
17583 -770 -50606 18485 199886 253295 248949 -177334 -296270 141002 153678 -67550 -27029
17571 -808 -146370 22121 -176677 -140830 40238 23122 -39554 232032 301628 -84073 105619
17559 -220099 30275 109787 8342 -1919 224678 35578 -25501 101957 316712 59567 -215397
17547 100927 -151319 25297 -12231 -8539 329174 88092 167948 145396 -8023 -114650 78658
17535 187106 204302 -23034 353657 -11397 172088 161008 145499 -273971 -196898 400287 27823
17523 258601 148156 296993 393424 370916 194097 280965 213197 -37040 361678 94037 -70642
17511 266349 247133 243339 -95527 458135 -102947 -66599 403521 86738 28136 336073 511844
$$ packed form
17596b37543d9842n9464C1159J13119B330J14357c25166a4540H6529c085a8I9298
17583g70m9836A8485J81401N3409m346a77334j18936A41002J2676f7550b7029
17571h08j45562B2121a76677L5847D0238j7116c9554B32032O9596h4073A05619
17559b20099C0275P9512H342a919B24678C5578b5501A01957K14755E9567b15397
17547A00927a51319B5297a2231L692C29174H8092P9856k2552h023j06627G8658
17535A87106J7196b3034C53657a1397A72088j1080j5509b73971P7073D00287B7823
17523B58601j10445J48837R6431k2508j76819Q6868o7768c7040C61678I4037g0642
17511B66349j9216l794i5527D58135a02947L6348D03521H6738B8136L07937J75771
$$ plain form
17500 511844 153286 -48950 293558 189165 346189 84293 130013 61412 -33389 333819
17489 229271 -7577 -30901 272596 41482 79796 27093 219318 -19357 207489 -117038 237116
17477 362545 225587 -200091 40130 256772 176636 -67341 158904 221001 -58826 -77624 114906
17465 123595 -134990 29856 149239 248367 106469 383901 -454773 213683 113213 183670
17455 183670 83572 63104 100387 -14260 298018 145616 466177 42949 132144 593975 -34532
17443 247642 247991 64240 367706 -44842 186667 148118 146637 65112 -8576 225592 59782 122221
17431 122221 181801 276392 254262 172930 341525 -139234 123423 117396 125892 187212 263066
17420 263066 252686 139577 165000 80443 475975 46867 11843 -35788 -136004 184139 19410
$$ packed form
17500E11844A53286d8950B93558j04393J57024H4293M5720F1412c3389C33819
17489B29271g577k3324B72596D1482L8314B7093J92225a9357B07489a17038B37116
17477C62545j36958b00091D0130K16642q0136f7341A58904O2097e8826j8798A14906
17465A23595a34990B9856J19383R9128A06469K77432d54773B13683j00470P0457
17455A83670H3572k0468L7283a4260B98018A45616L20561D2949Q9195M61831c4532
17443B47642L49F4240L03466d4842A86667l8549j481F5112h576B25592E9782O2439
17431A22221N9580R4591k2130q1332J68595a39234A23423o027Q496O1320P5854
17420B63066j0380j13109K5423H0443L95532D6867A1843c5788j00216A84139A9410
$$ plain form
17408 195190 42935 258440 -141761 73551 -62955 -36345 147795 310915 98788 242902
17398 242902 161162 -21608 145950 292326 -100986 -97472 149220 70403 -99217 236770 -130932
17386 475139 25853 37813 311849 -27882 7040 156731 -2462 164279 59860 -20556 58926
17374 309917 381411 459119 139586 -81319 196639 419322 7471 17113 270082 -73169 -93619
17363 -93619 246575 -36916 162420 207552 -62170 152051 202558 34508 172556 266703 213488
17352 213488 175624 163688 -154924 -195444 75032 68065 207180 77449 231016 342778 120349
17340 74367 234516 259824 96688 138700 -13912 245096 -9961 275794 164644 92034 -205083
17328 220219 10469 389510 45985 130116 -86518 -148959 130434 296973 79756 -58123 71717
$$ packed form
17408A95190D2935K15505a41761G3551f2955K6610A47795J63120I8788J44114
17398B42902q1740b1608A45950J46376a00986L514A49220G0403i9217B36770a30932
17386D75139B5853J1960K74036b7882G040J49691b462A64279E9860b0556E8926
17374C09917P1494P7708A39586h1319A96639K22683G471R642K52969g3169k0450
17363i3619B46575c6916A62420M5132f2170A52051N0507C4508J38048R4147n3215
17352B13488l7864j1936a54924m0520G5032o967J39115G7449J53567J11762A20349
17340G4367J60149K5308I6688M2012a3912B45096i961B75794j11150p2610b05083
17328B20219A0469L79041D5985Q4131h6518o2441A30434J66539G9756e8123G1717
$$ plain form
17316 73408 144985 -93146 379169 -85723 376529 -35489 138547 -71660 138531 175730 -7909
17304 -73037 197074 213643 8652 265761 303692 54684 279406 190487 137616 297792 195776
17293 195776 240651 104982 140194 209343 129250 257091 -209190 294246 314162 44100 115394
17282 115394 85973 180200 182075 243194 6498 -76765 -37792 223315 204982 411762 298054
17271 298054 167407 93079 261438 -5368 219407 354869 130950 231846 -300333 322551
17260 104207 51665 68476 -2887 -61862 8568 82142 95681 33139 -198521 -210728 284495
17248 30111 150613 137705 -90007 302314 166312 -118393 11591 96397 263698 73442 89018
17237 89018 336381 -135529 372677 210540 178474 219109 113755 57611 9587 96153 215656
$$ packed form
17316G3408P1577i3146C79169h5723C76529c5489A38547g1660A38531L7199g909
17304g3037A97074J6569H652K57109L7931E4684K24722q8919n2871J60176j02016
17293A95776M4875A04982L5212O9149q0093J27841b09190B94246J9916D4100P1294
17282A15394k9421R4227J875O1119F498g6765c7792B23315j8333K06780j13708
17271B98054j30647p4328J68359e368B19407J35462A30950J00896c00333C22551
17260A04207E1665J6811b887n8975H568P3574J3539C3139a98521j2207B84495
17248C0111J20502j2908i0007C02314j36002a18393A1591Q4806J67301G3442J5576
17237H9018K47363a35529C72677j62137l2066M0635j05354n6144I587Q6566J19503
$$ plain form
17226 215656 1949 249983 4247 199923 -57807 -10253 199724 20127 117134 301310 60060
17214 44497 149584 142288 492318 -24852 274406 323797 397083 60686 375644 255323 225947
17203 225947 166143 -120547 361596 -193372 11242 77266 240602 479761 270935 374399
17193 374399 401287 94654 138653 79192 87644 469770 96807 23568 -279310 -69011 475973
17181 -30125 315413 154650 138425 345125 382534 442323 283724 418097 161343 37670
17170 280364 347098 375019 -62416 391791 145255 -20952 86956 457230 209644 267164 192116
17159 192116 445924 130054 318418 156277 271325 165068 22890 476163 402500 -124397
17148 316820 -26072 204826 187360 561487 233460 399875 106181 194411 306342 124014
$$ packed form
17226B15656A949K48034D247J95676e7807a0253A99724B0127R7007J84176F0060
17214D4497J05087p296L50030b4852B74406M9391P3286F0686L14958j20321k9376
17203B25947n9804a20547C61596a93372A1242O6024J63336K39159k08826J03464
17193C74399K6888I4654M3999n9461Q452L82126I6807B3568b79310f9011D75973
17181c0125C15413A54650j6225K06700L7409N9789j58599J34373A61343C7670
17170B80364O6734K7921f2416C91791A45255b0952H6956L70274B09644N7520p5048
17159A92116K53808A30054J88364A56277J15048j06257B2890M53273p3663a24397
17148C16820b6072B04826j7466L74127B33460J66415A06181Q8230J11931A24014
$$ plain form
17137 202396 522730 32391 75367 198401 83494 172450 503732 91643 220525 405069
17127 405069 288657 6933 188124 66265 123652 474631 162750 246898 353114 179077
17117 179077 33158 227035 277082 374998 131473 135630 92924 312988 580710 219765 268946
17106 268946 116472 62767 161446 333313 345150 245027 233809 223387 699876 552970
17096 552970 470396 410680 197165 427630 455166 401523 448600 301420 114672 451409
17086 451409 433630 614776 270722 193781 463125 417207 444206 245213 346404 309743
17076 309743 114992 324789 110899 501868 568795 293592 452789 240818 311977 259015
17066 259015 166471 500642 502159 298181 282503 416266 426670 389010 534947 219886 -76661
$$ packed form
17137B02396L20334C2391M2976J23034H3494Q8956L31282I1643J28882J84544
17127D05069j16412F933J81191F6265N7387L50979A62750Q4148J06216j74037
17117A79077C3158J93877N0047R7916A31473M157m2706K20064K67722B19765M9181
17106B68946A16472n3705R8679J71867J1837j00123j1218j0422M76489j46906
17096E52970q2574n9716A97165K30465K7536n3643M7077j47180A14672L36737
17086D51409j7779J81146B70722p6941K69344m5918K6999j98993J01191l6661
17076C09743A14992K09797A10899L90969O6927k75203J59197k11971P1159n2962
17066B59015r2544L34171J517k03978j5678J33763J0404l7660J45937B19886g6661
$$ plain form
17054 255696 390840 751306 593961 429967 742791 629745 476364 344382 794081 565068
17044 565068 694032 393562 764963 484120 417582 286704 619966 421467 199984 524372
17034 524372 569233 670038 536686 317865 408210 789328 456047 413315 566633 434342
17024 434342 451536 419464 508651 646239 762674 835455 643711 364214 490012 570900
17014 570900 798176 345620 839360 364133 521858 526922 348853 342414 109579 459538
17004 459538 756439 392415 192584 458883 610798 585888 470594 757396 814579 660048
16994 660048 675155 1000268 835858 536837 778566 867994 628156 756827 591571 598861
16984 598861 852457 539803 515803 531128 630179 472203 560420 838570 506131 485007
$$ packed form
17054B55696J35144L60466j57345j63994L12824j13046j53381j31982M49699k29013
17044E65068J28964l00470L71401k80843o6538j30878L33262j98499A99984L24388
17034E24372M4861J00805j33352k18821R0345L81118l33281m2732J53318j32291
17024D34342J7194l2072Q9187J37588J16435P2781j91744k79497J25798Q0888
17014E70900K27276C45620M93740C64133J57725N064j78069o439A09579L49959
17004D59538K96901l64024A92584K66299J51915k4910j15294K86802N7183j54531
16994F60048J5107L25113j64410k99021K41729Q9428k39838J28671j65256P290
16984E98861K53596l12654k4000J5325R9051j57976Q8217K78150l32439k1124
$$ plain form
16974 485007 655538 769710 368235 678899 589817 859499 995196 914164 724037 460872
16964 460872 613847 788069 1131658 830308 928211 718142 666910 1140680 915307 719420
16954 719420 743783 952929 798952 942149 922597 740520 1256047 961859 880969 995668
16944 995668 1089207 962708 1170234 1077129 762233 1378228 1040715 1153001 842241 1004147
16934 1004147 1250521 1224392 909571 743963 1108123 1081514 1292399 886100 1007015 1247747
16924 1247747 1056723 894208 1148206 1265685 1159467 1260012 1344742 1182552 1236556 1430703
16914 1430703 1543588 1192476 1229578 1490678 1479495 1877884 1627619 1253861 1455936 1679720
16904 1679720 1131414 1392675 1534816 1342339 1449712 1284321 1393156 1840629 1753436 1806334
$$ packed form
16974D85007J70531J14172C68235L10664q9082K69682J35697q1032j90127k63165
16964D60872J52975J74222L43589l01350R7903k10069n1232M73770k25373j95887
16954G19420K4363K09146j53977J43197j9552j82077N15527k94188q0890J14699
16944I95668R3539j26499K07526r3105l14896O15995l37513J12286l10760J61906
16934A004147K46374k6129l14821j65608L64160k6609K10885m06299J20915K40732
16924A247747j91024j62515K53998J17479j06218J00545Q4730j62190N4004J94147
16914A430703J12885l51112L7102K61100j1183L98389k50265l73758K02075K23784
16904A679720n48306K61261J42141j92477J07373j65391J08835M47473q7193N2898
$$ plain form
16894 1806334 1665809 1467261 1764933 2152079 1652711 1725598 1695596 1901493 1863436 1872574
16884 1872574 1567918 2267903 1979450 1971723 1916785 1887146 2105194 2491193 2029880 2180084
16874 2180084 2352118 2264233 2282832 2348845 2342282 2387153 2256444 2316672 2332771 2768309 2872892
16863 2872892 2590164 2712715 2770514 2957499 2710536 2470178 2842334 2998058 2775808 3345131
16853 3345131 3200747 3148131 3169283 3231750 3402438 3664504 3313513 3380609 3280552 3551120
16843 3551120 3701209 3616502 3878712 3940834 4089390 4027418 4239067 4275202 4521944 4514810
16833 4514810 4476129 4725157 4724318 4769933 4930605 4974477 5107935 5171800 4869015 5591738 5283829
16822 5283829 5339589 5834136 5768526 5868040 6293024 6482796 6602649 6382684 6583470 6918597
$$ packed form
16894A806334j40525j98548K97672L87146m99368P2887l0002K05897l8057R138
16884A872574l04656O99985k88453p727n4938k9639K18048L85999m61313J50204
16874B180084J72034q7885J8599O6013o563M4871j30709O0228J6099M35538J04583
16863B872892k82728J22551N7799J86985k46963k40358L72156J55724k22250N69323
16853C345131j44384n2616K1152O2467J70688K62066l50991O7096j00057K70568
16843C551120J50089q4707K62210O2122J48556o1972K11649L6135K46742p134
16833D514810l8681K49028q39M5615J60672M3872J33458O3865l02785P22723l07909
16822E283829N5760M94547o5610R9514M24984J89772J19853k19965K00786L35127
$$ plain form
16812 6918597 7004985 7699142 7562480 7799868 7639296 8200379 8205856 8423933 8742592 8977723
16802 8977723 9243108 9260602 9394618 10166522 10289059 10621543 10906679 11304664 11894377 11896061
16792 11896061 12471188 12637247 13119010 13561625 14074839 14334867 14629538 15143291 15730952
16783 15730952 16356443 16956535 17474437 18055011 18793438 19152769 20268645 20723818 21559046
16774 21559046 22395116 23563434 24364102 25490604 26169682 27530365 28787441 29539284 30817981
16765 30817981 32434881 33771638 35467957 36339517 38494587 40316543 41631527 43829157
16757 43829157 45599453 47672697 50016205 52118318 54749422 57134824 59627649 62826175
16749 62826175 65521642 68534411 71951506 74982229 78352254 81670876 85228068 88628072
$$ packed form
16812F918597Q6388O94157j36662K37388j60572N61083N477K18077L18659K35131
16802H977723K65385J7494J34016P71904J22537L32484K85136L97985N89713J684
16792A1896061N75127J66059M81763M42615N13214K60028K94671N13753N87661
16783A5730952O25491O00092N17902N80574P38427L59331J115876M55173Q35228
16774B1559046Q36070J168318Q00668J126502O79078J360683J257076P51843J278697
16765C0817981J616900J336757J696319Q71560K155070J821956J314984K197630
16757D3829157J770296K073244K343508K102113K631104K385402K492825L198526
16749F2826175K695467L012769L417095L030723L370025L318622L557192L400004
$$ plain form
16741 88628072 92366995 95615884 99224222 102564034 105742981 109190197 112117069 114423786
16733 114423786 116935015 118952033 120725441 121914853 122581289 123130279 123265720 122365302
16725 122365302 121422449 120110978 118349138 116330428 113982114 111326395 108230248 105025262
16717 105025262 102016040 98697596 95097858 92075005 88798027 85379923 82044554 78893908
16709 78893908 75521112 72503794 69467156 66428590 64161434 60987502 58685297 56249187
16701 56249187 54289615 51788586 49738901 47773077 45782435 44320226 42594489 40550134
16693 40550134 39002404 37611097 36116823 34907969 33614073 32140527 31445394 30268227
16685 30268227 28773772 27928988 27075496 25975593 25171875 24116228 23366023 22596783 21857867
$$ packed form
16741H8628072L738923L248889L608338L339812L178947L447216K926872K306717
16733A14423786K511229K017018J773408J189412O66436N48990J35441r00418
16725A22365302r42853j311471j761840k018710k348314k655719l096147l204986
16717A05025262l009222l318444l599738l022853l276978l418104l335369l150646
16709G8893908l372796l017318l036638l038566k267156l173932k302205k436110
16701E6249187j959572k501029k049685j965824j990642j462209j725737k044355
16693D0550134j547730j391307j494274j208854j293896j473546o95133j177167
16685C0268227j494455q44784q53492j099903q03718j055647p50205p69240p38916
$$ plain form
16676 21857867 21296533 20727416 20297401 19363484 18650081 18462673 17507241 16900356 16794807
16667 16794807 16099014 15767245 15002460 14539288 14299041 13889686 13475901 13206523 12968506
16658 12968506 12575596 12167667 11776592 11479211 11274629 10928985 10985215 10594987 10080893
16649 10080893 9738159 9933931 9636128 9323879 9245914 8897936 8547200 8638748 8126438 8132387
16639 8132387 7993019 7933294 7287139 7246937 7182335 7013003 7148032 6834190 6600126 6457778
16629 6457778 6446528 6210499 5902883 5909694 5930994 5440928 5514943 5277814 5190951 5073150
16619 5073150 4943410 4874556 4960075 4807746 4707211 4673497 4641315 4437966 4450645 4114495
16609 4114495 4370207 4181041 4410440 4088183 3703512 3590175 3662465 3596329 3355277 3608557
$$ packed form
16676B1857867n61334n69117m30015r33917p13403j87408r55432o06885j05549
16667A6794807o95793l31769p64785m63172k40247m09355m13785k69378k38017
16658A2968506l92910m07929l91075k97381k04582l45644N6230l90228n14094
16649A0080893l42734J95772k97803l12249p7965l47978l50736R1548n12310N949
16639H132387j39368n9725o46155m0202o4602j69332J35029l13842k34064j42348
16629F457778j1250k36029l07616O811K1300m90066P4015k37129q6863j17801
16619E073150j29740o8854Q5519j52329j00535l3714l2182k03349J2679l36150
16609D114495K55712j89166K29399l22257l84671j13337P2290o6136k41052K53280
$$ plain form
16599 3608557 3407232 3878633 3401564 3543729 3500166 3123121 3126596 2964170 3431590 2837268
16589 2837268 2933191 2948809 3172029 2903840 2763133 2828847 2771555 2535557 2541080 2233359
16579 2233359 2406219 2593880 2464762 2446082 2512889 2507409 2352904 2489285 2362578 2032078
16569 2032078 2299483 2406922 1972563 2160351 2443062 2425029 1818481 1945682 1791207 2200198
16559 2200198 1903960 2202915 1712664 1887901 2219356 1855889 1884242 1674870 1751591 1743419
16549 1743419 1810941 1973931 1813896 1837704 1648048 1967382 1767662 1990189 1584194 1501250
16539 1501250 1506610 1672276 1513633 1358147 1607032 1667618 1588823 1714210 1377716 1274275
16529 1274275 1531493 1677222 1435252 1504209 1596554 1528170 1732902 1431166 1258708 1203030
$$ packed form
16599C608557k01325M71401m77069J42165m3563l77045L475j62426M67420n94322
16589B837268R5923J5618K23220k68189j40707O5714n7292k35998N523l07721
16579B233359J72860J87661j29118j8680O6807n480j54505J36381j26707l30500
16569B032078K67405J07439m34359J87788K82711j8033o06548J27201j54475M08991
16559B200198k96238K98955m90251J75237L31455l63467K8353k09372P6721q172
16549A743419O7522J62990j60035K3808j89656L19334j99720K22527m05995q2944
16539A501250N360J65666j58643j55486K48885O0586p8795J25387l36494j03441
16529A274275K57218J45729k41970O8957R2345o8384K04732l01736j72458n5678
$$ plain form
16519 1203030 1284105 1430693 1452099 1375476 1509244 1113769 1343570 1371649 1489307 1163848
16509 1163848 1229160 1497871 1252047 1209288 1047020 1169888 1502283 1192810 1154499 1225204
16499 1225204 866526 1049285 1229034 1197753 1234830 1057987 875195 1136071 1010574 942187
16489 942187 1216273 1095970 1381547 835742 1196753 1007853 1135337 848964 1157875 1021251
16479 1021251 881642 1148678 1012320 1105993 943693 1372232 933842 1283329 900552 1014287
16469 1014287 1190460 1349809 1033415 843519 850359 893542 1008949 1145855 670363 1017282
16459 1017282 837270 1143136 1023128 866920 1149412 591967 1421777 1055782 1001757 1022832
16449 1022832 886230 795496 1035176 1086025 837760 1004578 961753 863639 968014 673897
$$ packed form
16519A203030Q1075J46588K1406p6623J33768l95475K29801K8079J17658l25459
16509A163848O5312K68711k45824m2759j62268J22868L32395l09473l8311P0705
16499A225204l58678J82759J79749l1281L7077j76843j82792K60876j25497o8387
16489I42187K74086j20303K85577n45805L61011j88900J27484k86373L08911j36624
16479A021251j39609K67036j36358R3673j62300M28539m38390L49487l82777J13735
16469A014287J76173J59349l16394j89896O840M3183J15407J36906m75492L46919
16459A017282j80012L05866j20008j56208K82492n57445Q29810l65995n4025K1075
16449A022832j36602r0734K39680N0849k48265J66818m2825r8114J04375k94117
$$ plain form
16439 673897 1070865 1002375 1102981 1040241 1059763 819497 914908 1101831 785458 945578
16429 945578 739255 915152 1214470 838679 996077 1102582 1014991 766534 1149749 1083782
16419 1083782 1066490 1098900 1205028 789195 1009030 923925 930736 1082389 861125 1102792
16409 1102792 870164 1076200 1039987 844576 892964 892274 974600 1152270 912001 1286052
16399 1286052 1054954 1190277 633125 943834 772925 1113472 963784 806159 863742 1067180
16389 1067180 781274 852432 1002159 891074 689232 1310913 768111 886228 1060387 1065544
16379 1065544 947518 1062245 759418 720522 1113159 1009929 1013284 1188654 995044 813794
16369 813794 1040839 1220594 996629 1055757 1099699 669277 832897 1137024 867608 968552
$$ packed form
16439F73897L96968o8490J00606o2740J9522k40266R5411J86923l16373J60120
16429I45578k06323J75897K99318l75791J57398J06505q7591k48457L83215o5967
16419A083782j7292L2410J06128m15833K19835q5105O811J51653k21264K41667
16409A102792k32628K06036l6213j95411M8388o90Q2326J77670k40269L74051
16399A286052k31098J35323n57152L10709j70909L40547j49688j57625N7583K03438
16389A067180k85906P1158J49727j11085k01842O21681n42802J18117J74159N157
16379A065544j18026J14727l02827l8896L92637j03230L355J75370j93610j81250
16369H13794K27045J79755k23965N9128M3942m30422J63620L04127k69416J00944
$$ plain form
16359 968552 891470 1032751 962230 1180604 900349 1129079 1074784 1307764 892772 637769
16349 637769 880657 854584 1059184 734944 1312873 899247 1153745 942685 508268 1259278
16339 1259278 998848 1207610 1158327 1031504 1270637 813434 1040660 1108866 793642 854480
16329 854480 812859 1066939 804940 950193 837236 972745 803066 1336698 1030226 875437
16319 875437 910666 769260 1321905 873527 1016449 1127286 1124248 1148333 1089855 997049 1047213
16308 1047213 968766 919475 1230880 1030876 1014371 1269730 876493 798743 747034 872927
16298 872927 706601 868277 1095092 850205 1247502 1026829 835078 1070995 1222554 1008654
16288 1008654 927763 1124554 1268433 1179944 968689 1059808 1238504 1026493 846156 800963
$$ packed form
16359I68552p7082J41281p0521K18374k80255K28730n4295K32980m14992k55003
16349F37769K42888k6073K04600l24240N77929m13626K54498k11060m34417P51010
16339A259278k60430K08762m9283j26823K39133m57203K27226O8206l15224O0838
16329H54480m1621K54080k61999J45253j12957J35509j69679N33632l06472j54789
16319H75437L5229j41406N52645m48378J42922J10837l038K4085n8478r2806N0164
16308A047213p8447m9291L11405k00004j6505K55359l93237p7750n1709J25893
16298H72927j66326J61676K26815k44887L97297k20673j91751K35917J51559k13900
16288A008654q0891J96791J43879q8489k11255R1119J78696k12011j80337m5193
$$ plain form
16278 800963 672985 822721 994831 1188590 1178434 1371165 768848 1261677 1095156 657485
16268 657485 831064 1037697 1001875 766439 872228 929522 1043449 1086515 991910 1242012
16258 1242012 1022206 1196796 893076 1083175 961996 741946 1143688 1296154 1120600
16249 1120600 695193 795444 1138557 1170802 1236274 904601 1150537 1027147 1002124 967804
16239 967804 1080798 836250 851458 868798 1241924 993769 928051 842639 1153598 1013860
16229 1013860 883639 1016527 702102 939476 1048774 957169 651720 829141 1039038 847406
16219 847406 894922 823181 920589 527538 906750 842580 1061486 571499 631427 723171 798961
16208 798961 806759 954694 747496 594927 1006290 863328 788073 453683 627146 636616
$$ packed form
16278H00963j27978J49736J72110J93759j0156J92731o02317M92829j66521m37671
16268F57485J73579K06633l5822k35436J05789N7294J13927M3066r4605K50102
16258A242012k19806J74590l03720J90099j21179k20050M01742J52466j75554
16249A120600m25407J00251L43113L2245O5472l31673K45936j23390k5023l4320
16239I67804J12994k44548J5208J7340L73126k48155o5718q5412L10959j39738
16229A013860j30221J32888l14425K37374J09298r1605l05449J77421K09897j91632
16219H47406M7516p1741R7408l93051L79212o4170K18906m89987N9928R1744P5790
16208G98961P798J47935k07198j52569M11363j42962p5255l34390J73463R470
$$ plain form
16198 636616 907645 984412 592165 724172 760677 765086 427667 939904 868787 318499
16187 585928 797468 496726 1087507 715577 503874 516097 605806 494565 698968 734934
16177 734934 610583 680071 763987 728598 294259 521780 604763 485995 641870 676425
16167 676425 722344 360758 552568 358510 628115 766923 522366 275702 399183 324960
16157 324960 538467 346301 384978 558681 458135 439651 849552 305453 862657 305058
16146 125646 354567 305097 586069 476446 371437 357739 246651 478439 222289 317060
16136 317060 497127 713082 560446 197386 99301 9535 226977 121132 558651 384391
16126 384391 358934 545375 521492 285803 260044 68958 603576 192421 170213 282624
$$ packed form
16198F36616K71029P6767l92247J32007L6505M409l37419N12237p1117C18499
16187E85928K11540l00742N90781l71930k11703J2223Q9709j11241K04403L5966
16177G34934j24351O9488Q3916l5389B94259K27521Q2983j18768J55875L4555
16167F76425M5919C60758J91810j94058K69605J38808k44557k46664J23481p4223
16157C24960K13507j92166L8677J73703j00546j8484M09901C05453N57204C05058
16146A25646K28921m9470K80972j09623j05009j3698j11088K31788B22289R4771
16136C17060J80067K15955j52636A97386r8085I535K17442j05845M37519j74260
16126C84391k5457J86441k3883k35689k5759F8958N34618A92421k2208J12411
$$ plain form
16116 282624 433270 141089 -11063 338854 98312 -12175 -78290 204885 169216 502385
16106 502385 330103 521185 303546 192402 334142 214183 430449 219248 345586 83935
16095 10615 116734 252654 233814 -10868 182497 201324 32471 173325 301508 408363
16085 408363 216077 365853 71783 80190 346450 257988 292955 -26014 117174 151966 263184
16074 263184 113946 265392 24903 68657 348779 267384 169570 -103914 76122 422811
16064 422811 87258 -32108 35591 326874 -91355 108726 434116 211005 120202 81743 29214
16052 -17955 168125 193604 -180744 219213 310270 80535 284028 199040 251455 -180850 76014
16040 -5097 69528 16951 75281 -183771 -75069 2521 31688 -47195 -233657 162806 299465
$$ packed form
16116B82624J50646A41089a1063C38854I8312a2175o6115B04885l5669L33169
16106E02385j72282J91082k17639j11144J41740j19959K16266k11201J26338H3935
16095A0615J06119J35920j8840a0868A82497J8827C2471J40854J28183J06855
16085D08363j92286J49776G1783Q407K66260q8462L4967b6014A17174L4792J11218
16074B63184A13946J51446B4903M3754K80122q1395r7814a03914G6122L46689
16064D22811H7258c2108C5591K91283i1355A08726L25390B11005r0803l8459B9214
16052a7955A68125K5479a80744B19213R1057H0535K03493q4988N2415a80850G6014
16040e097F9528A6951N8330a83771g5069B521K9167d7195j86462A62806J36659
$$ plain form
16029 299465 -88692 421993 -180807 205084 315492 43552 -92344 131475 -38613 -65799
16019 -65799 249934 -101283 180994 166206 261108 83655 -89423 154708 -11475 98591 38265
16007 25043 171101 -46105 148466 -15931 -45538 -83046 49300 122692 264109 -103888 220896
15995 -97683 -157459 226908 -283674 -105316 35636 -105760 -21582 112688 190278 352922
15985 352922 462668 451096 114750 135718 -3396 428609 265338 108567 -11812 -231891
15975 -231891 -122561 -51244 5380 -20479 -108574 -147489 153180 -199334 -178763 146494 -182387
15963 234416 -65073 -194896 -81126 13420 52840 28587 102726 -36359 99691 -343745 109427
15951 -282909 -83360 231749 -60327 -142697 -84087 -89949 -124564 -174550 120137 36047 13813
$$ packed form
16029B99465h8692D21993a80807B05084J10408D3552i2344A31475c8613k7186
16019f5799B49934a01283A80994j4788R4902H3655h9423A54708a1475I8591C8265
16007B5043J46058d6105A48466a5931k9607l7508D9300P3392J41417a03888B20896
15995i7683n9776B26908b83674a05316C5636a05760b1582A12688P7590J62644
15985C52922J09746j1572A14750K0968c396D28609j63271A08567a1812k20079
15975b31891J09330e1244E380b0479q8095l8915A53180a99334K0571A46494a82387
15963B34416f5073j29823h1126A3420L9420k4253P4139c6359I9691c43745A09427
15951b82909h3360B31749f0327q2370N8610n862l4615m9986A20137C6047A3813
$$ plain form
15939 -8093 320582 18567 -132846 211320 -150075 -19566 -45806 59483 105664 143667 206872
15928 206872 -231295 102607 68379 -212854 -11225 17722 339861 69406 311060 -257389
15917 15134 -298597 -117316 62915 -242994 -296894 -221057 122668 109260 -47548 -2907 70936
15905 123552 -86391 -307065 -81921 -62120 168200 -12322 9567 186075 -48453 -345061 107547
15893 -243579 -435218 277381 -66870 -117893 296566 -289928 65092 -177469 241876 -168169
15882 -189862 -166036 -325886 108051 -329769 156584 92072 37902 -170219 153750 -64891
15871 -196375 234122 73089 -127807 323591 -59767 -194064 -170478 -246539 412011 10846
15860 -193889 32680 -247431 140745 139641 -173849 -98086 -26686 13743 -14210 42621 -233815
$$ packed form
15939h093C20582A8567a32846B11320a50075a9566k6240E9483M6181L8003O3205
15928B06872b31295A02607l4228b12854a1225A7722L22139F9406K41654b57389
15917A5134b98597a17316F2915b42994n3900P5837A22668j3408d7548b907G0936
15905A23552h6391k20674h1921J9801A68200a2322I567J76508d8453k96608A07547
15893b43579j91639B77381f6870n1023B96566b89928F5092a77469B41876a68169
15882a89862K3826j59850A08051c29769A56584o4512C7902a70219A53750f4891
15871a96375B34122G3089a27807C23591e9767j34297K3586p6061D12011A0846
15860a93889C2680b47431A40745j104a73849P5763b6686A3743a4210D2621b33815
$$ plain form
15848 -30659 -202883 19877 67849 -255546 81029 -464559 -123031 243791 -87433 -195209
15838 -195209 -1878 -230693 -175873 -111695 30664 264891 -221617 -94375 90850 91552 6197 -36949
15825 -162759 -196358 239797 -75271 -79286 -9136 -223946 -29591 -195288 55468 114403 160229
15814 160229 118642 -7865 -141710 -121982 -19619 -175311 -45627 40970 -8274 199522 169808
15803 169808 -60156 -10205 -71673 -304056 -308553 -205624 -137407 -230977 204878 300539 -85456
15791 -325560 -27019 -377177 110211 -95873 -357400 -94264 22394 28940 -208294 252005 -6631
15779 -71210 286680 92145 13969 -177802 108310 -83993 -144112 43513 260507 19063 -186364
15767 234288 125563 58622 230322 -135368 39524 -261332 -14958 227951 110092 -120539
$$ packed form
15848c0659j72224A9877M7972b55546H1029d64559a23031B43791h7433j07776
15838a95209a878k28815N4820O4178C0664K34227b21617i4375I0850P02F197c6949
15825a62759l3599B39797g5271m015i136k14810b9591j65697E5468N8935M5826
15814A60229m1587g865j33845J9728a9619j55692d5627D0970h274A99522k9714
15803A69808f0156a0205o1468k32383m497J02929O8217r3570B04878R5661h5456
15791c25560b7019l50158A10211i5873k61527i4264B2394O546b08294B52005f631
15779g1210B86680I2145A3969a77802A08310h3993o0119D3513K16994A9063a86364
15767B34288j08725E8622J71700a35368C9524b61332a4958B27951A10092a20539
$$ plain form
15756 89781 16554 4532 -137459 180865 -120503 -119102 27301 339537 116326 5152 -176715
15744 191604 43235 242327 -54858 -57007 -112601 -25496 -47155 76184 -266547 -120067 -167562
15733 -167562 71139 42446 -207249 -196278 -215135 -182582 13979 281249 -80570 166252 44525
15721 -206351 228732 -134108 -55403 -224808 83500 -101478 265677 140038 -121375 193713
15710 -51972 -158047 -128684 202640 -76484 -258623 199634 -25114 -32886 -210568 -257458 -120699
15698 -303835 163927 125664 -279968 -86669 -80095 34212 225625 75394 9730 -206927 -143243
15687 -143243 -259310 154277 -113546 -195165 31269 -277804 -21958 -174201 -307594 120709
15676 14746 64476 100433 75098 11202 -59085 -164600 228557 -89510 -329195 -36486 -412210
$$ packed form
15756H9781A6554D532a37459A80865a20503J401B7301L12236A16326E152a76715
15744A91604D3235J99092e4858k149n5594b5496k1659G6184b66547a20067m7495
15733a67562G1139k8693b07249J0971j8857L2553A3979K67270h0570A66252D4525
15721b06351B28732a34108e5403j69405H3500a01478B65677j25639a21375A93713
15710e1972j06075K9363B02640g6484j82139A99634b5114p772j77682m6890a20699
15698c03835A63927l8263b79968h6669O574C4212J91413G5394I730b06927O3684
15687a43243j16067A54277a13546q1619C1269b77804b1958j52243j33393A20709
15676A4746M9730L5957k5335A1202e9085j05515B28557h9510k39685c6486l75724
$$ plain form
15665 -412210 7382 69705 86381 76596 1758 -255589 -201278 395286 -8236 -141660 -109497 73527
15652 339000 -292687 139877 48401 131968 -43348 153767 31398 150829 -159300 299136
15641 -16646 -109191 147029 -268512 -308106 194447 -198636 36014 2870 85809 76490 -83824
15629 -168166 195175 -232032 -55374 37759 -100255 -7195 -207138 314655 -321940 -218039
15619 -218039 289945 95570 68242 -61188 -225637 -255218 -154281 55647 84019 -188815 104626
15607 73124 -21597 -256715 10207 80571 -132664 -91288 -148846 -66442 -46067 394953 7497
15595 -134585 2483 29648 -18795 -192646 -67473 -152379 -70554 73751 -20385 -19976 -264687 -1553
15582 219833 109301 -216622 -1574 -4478 169618 10827 -161352 -130966 -98988 207289 -73535
$$ packed form
15665d12210G382O2323J6676r785A758b55589N4311C95286h236j33424L2163G3527
15652C39000b92687A39877D8401Q3567d3348A53767C1398J19431a59300B99136
15641a6646r2545A47029b68512l9594A94447a98636C6014B870Q2939r319h3824
15629a68166A95175b32032e5374C7759a00255g195j99943C14655c21940J03901
15619b18039B89945I5570k7328f1188j64449k9581J00937E5647K8372a88815A04626
15607G3124b1597k35118A0207P0364a32664M1376n7558f6442K0375C94953G497
15595a34585B483K7165a8795j73851f7473q4906g0554G3751b0385M09k44711a553
15582B19833A09301b16622a574k904A69618A0827a61352L0386L1978B07289g3535
$$ plain form
15570 -217295 102011 15135 233476 106143 240881 -504374 -327862 -33602 47335 232150
15560 232150 22059 -103158 -165518 100081 -248396 2810 44104 51163 327846 56995 104703
15549 104703 86722 75107 -333485 357458 197890 242247 -141388 -88896 -39690 -58155 30241
15537 50802 114678 501 131258 -101977 -203409 37909 28726 -64841 100122 284723 223967
15526 223967 13609 268133 -251261 24411 -101105 37283 -14261 150087 132597 237984
15516 237984 163132 846 -121998 32173 170403 -98925 -80419 193873 63470 7187 307506
15505 307506 258114 -292111 -140571 299006 -13298 -84688 -289223 -27753 -173540 -207612
15495 -207612 -521465 55874 -153123 215607 149262 -429590 -11765 -78793 96336 -61695 61383
$$ packed form
15570b17295A02011A5135K18341A06143J34738e04374J76512c3602D7335J84815
15560B32150B2059a03158o2360A00081b48396B810M1294P059K76683E6995M7708
15549A04703j7981j1615c33485C57458j59568M4357a41388N2492c9690j8465C0241
15537E0802O3876E01J30757a01977j01432C7909r183f4841A00122J84601o0756
15526B23967A3609K54524b51261B4411a01105C7283a4261A50087j7490J05387
15516B37984p4852H46a21998C2173J38230i8925J8506A93873F3470G187L00319
15505C07506m9392b92111a40571B99006a3298p1390k04535b7753j45787l4072
15495b07612l13853E5874a53123B15607o6345d29590a1765o7028I6336f1695F1383
$$ plain form
15483 85446 -270705 234987 1429 -207165 126300 -266168 -176262 -17291 275818 30335 -79071
15471 131751 33319 -36491 193866 155377 -205751 -77092 -317996 127763 -167717 95375
15460 -161113 9086 -371516 166453 124258 -353899 64862 134638 17242 -120352 -141400 -346532
15449 -346532 77414 226477 -156560 54981 23125 37655 -43426 -76210 221716 278773 -4116
15437 133654 309088 390500 137392 209161 185331 199484 -15569 -159471 128472 -433002
15426 110821 -27844 -6017 121971 -2193 -379935 -129571 76102 -33330 441893 73945 190499
15415 190499 17527 48424 -56603 -74100 176902 -128413 -129767 -142368 -153751 -289931 187984
15403 11 -223480 -10173 -149130 33320 -214725 -268314 279579 -188143 -198692 108981 213095
$$ packed form
15483H5446b70705B34987A429b07165A26300b66168Q9906a7291B75818C0335g9071
15471A31751C3319c6491A93866l8489b05751g7092k40904A27763a67717I5375
15460a61113I086c71516A66453m2195c53899F4862O9776A7242a20352k1048k05132
15449c46532G7414J49063a56560E4981B3125J4530d3426l2784B21716N7057d116
15437A33654J75434Q1412A37392P1769k3830J4153a5569j43902A28472d33002
15426A10821b7844f017A21971b193l77742a29571G6102c3330D41893G3945J16554
15415A90499A7527L0897e6603j7497A76902a28413j354j2601j1383j36180A87984
15403A1b23480a0173j38957C3320b14725n3589B79579a88143j0549A08981J04114
$$ plain form
15392 213095 71577 -112523 32172 53632 27313 -90979 -19447 -282311 69440 9296 -109250
15380 -12777 179335 219983 -212220 230733 -261681 239255 -44084 28304 71804 328618
15370 328618 69831 -128903 -47660 -2916 125050 6030 -5497 101130 30614 27271 -132305
15358 78818 48173 -22380 -60206 116494 220799 -190906 193944 238178 6260 -34831 -69287
15347 -69287 169034 44160 326509 55607 294313 89598 301400 -25414 -219157 -357076
15337 -357076 29071 292828 -51641 264209 -244549 194325 80199 102096 24056 -133507
15326 306589 -6349 281434 13354 -63350 2612 -251993 73618 175810 -124969 70716 235053
15315 235053 10296 263966 146327 6754 -176083 -92980 -46075 -61192 -279351 -10621 121203
$$ packed form
15392B13095G1577a12523C2172K1460k6319i0979a9447k62864F9440I296a09250
15380a2777A79335M0648b12220B30733b61681B39255d4084B8304M3500K56814
15370C28618F9831a28903d7660b916A25050F030e497A01130C0614l343a32305
15358G8818l0645b2380l7826A16494J04305a90906A93944M4234F260c4831l4456
15347f9287A69034D4160K82349E5607K38706H9598K11802b5414j93743j37919
15337c57076B9071K63757e1641B64209b44549A94325H0199K1897B4056a33507
15326C06589f349B81434A3354f3350B612b51993G3618J02192a24969G0716J64337
15315B35053A0296K53670j17639F754a76083Q3103d6075j5117k18159a0621A21203
$$ plain form
15303 219136 -6788 90393 53562 -192800 -137806 -90051 111529 233049 303377 -40844 383032
15291 80958 -134668 319161 100107 161253 203469 42288 -43431 552 229503 -116776 161363
15279 -152516 300119 -79435 -26978 -328405 -80593 126579 162544 60823 -283151 158964
15268 -25787 55847 139994 122462 -170843 -61557 90956 57537 176504 336658 62351 302376
15257 302376 -195164 349584 -233034 -175337 296309 77261 697286 764982 697399 862874
15247 862874 259025 306522 107967 -153644 -18503 371622 25613 281300 16463 124588
15237 124588 -54635 154526 92489 -164909 234121 -131497 -256215 109161 -156128 -66082
15226 26294 31685 -299172 109279 75203 -240158 17167 -276543 105577 148693 -342592 -46981
$$ packed form
15303B19136f788I0393l6831a92800N4994M7755A11529J21520P0328d0844C83032
15291H0958a34668C19161A00107O1146M2216D2288d3431E52K28951a16776A61363
15279a52516C00119g9435b6978l01427h0593A26579L5965F0823b83151A58964
15268b5787E5847Q4147j7532a70843f1557I0956l3419J18967J60154F2351K40025
15257C02376a95164C49584b33034N7697B96309G7261O20025O7696o7583J65475
15247H62874B59025M7497A07967a53644a8503C71622B5613K55687A6463J08125
15237A24588e4635A54526o2037a64909B34121a31497j24718A09161a56128f6082
15226B6294N391b99172A09279l4076b40158A7167b76543A05577M3116c42592d6981
$$ plain form
15214 -888 -192099 50844 244749 70177 114978 21901 95040 -190486 43782 230 -193590 -70449
15201 114435 -408699 -53087 56985 -36096 248683 238227 72744 127824 137769 6664 -15102
15189 107933 69080 -196410 116544 43753 -78798 157062 -186912 -9946 -342682 182486
15178 5976 123651 134616 -80545 -173414 166792 -1196 118697 222767 125218 448909 22796
15166 48265 2958 89349 -179101 105082 219445 46700 294728 59084 133901 -355451 63679
15154 48672 82376 14891 103831 -91503 67608 99321 -92 144708 -287792 136740 362835
15143 362835 110309 57891 -131774 293359 31785 64190 49887 189097 -71234 10486 146251
15132 146251 160413 242749 -169399 146154 212582 -12985 137335 24667 -78253 -419662 -21320
$$ packed form
15214h88j91211E0844J93905G0177M4801B1901P3139a90486D3782B30a93590g0449
15201A14435d08699e3087E6985c6096B48683j0456G2744N5080R945F664a5102
15189A07933l8853a96410A16544D3753g8798A57062a86912i946l32736A82486
15178E976J17675J0965h0545r2869A66792a196A18697J04070r7549L23691B2796
15166D8265B958Q6391a79101A05082J14363D6700K48028E9084P4817c55451F3679
15154D8672L3704A4891Q8940i1503F7608L1713i2A44708b87792A36740K26095
15143C62835A10309n2418a31774B93359C1785L2405j4303J39210g1234A0486J35765
15132A46251J4162Q2336a69399A46154O6428a2985A37335B4667g8253l41409b1320
$$ plain form
15120 353947 43572 48217 -27607 197421 325151 -4937 22996 133646 247336 -39956 71352
15108 17397 -35062 30696 -63394 -41732 244826 199068 97407 117347 294014 32353 -225373
15096 94030 73016 86177 141216 129141 237078 253311 -235265 -457976 444112 8394 -37538
15084 21692 29897 314931 150060 222508 144448 177957 -100000 421034 -104876 -64178 47772
15072 185339 103360 53867 -18260 182270 3844 293505 -69747 -15530 -66354 92861 167532
15061 167532 223173 10072 -24464 109229 52820 207416 -13369 26834 318455 59866 154238
15050 154238 323541 210607 259236 328161 117306 373474 76797 568022 125741 54873
15039 -75502 233454 14455 174334 365891 262190 193417 406987 -43903 261120 370363
$$ packed form
15120C53947D3572M645b7607A97421J27730d937B2996J10650J13690c9956G1352
15108A7397c5062C0696f3394K1662B44826m5758I7407J9940J76667C2353b25373
15096I4030k1014J3161N5039j2075J07937J6233b35265k22711D44112H394c7538
15084B1692Q205K85034A50060P2448p8060L3509a00000D21034a04876M0698D7772
15072A85339q1979m9493a8260A82270C844K89661f9747a5530n0824I2861P4671
15061A67532N5641A0072b4464A09229E2820J54596a3369B6834K91621E9866R4372
15050A54238J69303j12934M8629O8925A17306K56168G6797M91225A25741E4873
15039g5502B33454A4455J59879J91557j03701o8773K13570d3903B61120J09243
$$ plain form
15029 370363 187782 346080 346106 171973 299010 153261 395703 105012 232398 120506
15019 120506 -66330 386104 18843 328923 478494 528941 50137 74644 268908 496288
15009 496288 -109556 181729 165641 67343 -55184 24167 -175643 -31374 255256 231016 189559
14998 189559 -74858 -23686 254963 334330 143201 414500 160428 132160 205029 -95928 258482
14986 398208 447752 310394 573353 357379 422681 53189 353969 544863 129476 336003
14976 336003 414666 136927 313617 139915 300738 236191 358857 172403 430780 403935
14966 403935 328384 314228 157339 282141 205164 263245 365723 278325 271156 352135 239400
14955 239400 121049 434184 -65641 378163 -5767 83176 -141818 91687 307700 151336
$$ packed form
15029C70363j82581J58298K6A71973J27037j45749K42442A05012J27386j11892
15019A20506f6330C86104A8843L10080J49571N0447E0137K4507J94264K27380
15009D96288a09556A81729j6088F7343e5184B4167a75643c1374B55256k4240m1457
14998A89559g4858b3686B54963P9367A43201K71299A60428k8268P2869i5928B58482
14986C98208M9544j37358K62959k15974O5302E3189L00780J90894A29476K06527
14976C36003P8663A36927J76690A39915J60823o4547J22666A72403K58377k6845
14966D03935p5551j4156j56889J24802p6977N8081J02478q7398p169Q0979j12735
14955B39400j18351L13135f5641C78163e767H3176a41818I1687K16013A51336
$$ plain form
14944 482288 -145603 13190 333327 291134 136938 480061 462304 182557 172736 347394
14934 347394 557858 130864 457425 232098 164606 294654 -109976 261505 561364 344587
14924 344587 350481 360074 554072 545551 484237 469569 400350 471855 714056 707068 473874 685789
14912 685789 585192 433294 608333 253874 538062 249439 428982 123116 498521 296730
14902 296730 374109 217752 299403 213512 310781 455822 283402 331804 300476 86189 326175
14891 326175 301648 247831 491019 211436 740468 61908 374371 457361 271249 413797
14881 413797 515881 260025 371473 69761 46588 450542 264589 239194 108903 279463
14871 279463 134558 315787 175169 347700 372682 632918 575455 348133 521728 316655
$$ packed form
14944D82288a45603A3190L20137m2193A36938L43123j7757A82557r821J74658
14934C47394K10464A30864L26561k25327o7492J30048a09976B61505K99859k16777
14924C44587N894R593J93998q521o1314j4668o9219P1505K42201o988k33194K11915
14912F85789j00597j51898J75039B53874K84188B49439J79543A23116L75405k01791
14902B96730P7379j56357Q1651q5891R7269J45041j72420M8402l1328H6189K39986
14891C26175k4527n3817K43188B11436N29032F1908L12463Q2990j86112J42548
14881D13797J02084k55856J11448F9761k3173M03954j85953k5395A08903J70560
14871B79463A34558J81229j40618J72531K4982K60236n7463k27322J73595k05073
$$ plain form
14861 316655 252625 655562 388336 515344 199164 514829 424045 160367 22430 496376
14851 496376 586188 464793 349700 467873 41422 367378 171691 342601 351207 221659
14841 221659 235740 408585 268328 691158 20775 486058 151335 635889 581201 728020
14831 728020 636256 322426 602629 458244 511559 410486 574877 403903 484331 310304
14821 310304 474898 256310 422855 573613 443470 658818 259393 588680 244413 528646
14811 528646 324676 603594 577775 132955 205367 504017 296299 538755 310039 154637
14800 589331 593461 230274 647753 395720 598843 326921 600082 142632 214091 133887
14790 133887 326170 -5441 343444 381012 207417 391828 190193 259893 144348 454723
$$ packed form
14861C16655o4030M02937k67226J27008A99164L15665r0784A60367B2430M73946
14851D96376Q9812j21395j15093J18173D1422L25956A71691J70910Q606j29548
14841B21659J4081J72845j40257M22830B0775M65283A51335M84554n4688J46819
14831G28020r1764l13830K80203j44385N3315j01073J64391j70974Q0428j74027
14821C10304J64594k18588J66545J50758j30143K15348B59393L29287B44413K84233
14811E28646k03970K78918k5819A32955P2412K98650k07718K42456k28716A54637
14800E89331M130B30274M17479k52033K03123k71922K73161A42632P1459q0204
14790A33887J92283e441C43444L7568j73595J84411A90193O9700j15545L10375
$$ plain form
14780 454723 583299 323828 357248 569056 257376 437144 522728 434789 344941 427554
14770 427554 469621 374759 585810 613497 473367 489856 730740 319983 446420 637909
14760 637909 530297 394188 388701 438448 389743 483421 241566 256935 525807 634995 438640
14749 438640 487971 185016 386319 443556 626454 604170 475220 394594 392688 421071 517894
14738 517894 231714 545857 961790 576466 721265 584306 546233 833424 455521 481725
14728 481725 565847 440547 553056 434603 307769 666925 706922 892618 842858 822711
14718 822711 955063 915642 880922 954441 680191 560783 798393 751674 644532 614650
14708 614650 693022 670185 692412 604454 725087 599180 577864 163324 657845 875670
$$ packed form
14780D54723J28576k59471L3420K11808B57376J79768Q5584q7939q9848Q2613
14770D27554M2067r4862K11051K7687j40130J6489K40884C19983J26437J91489
14760F37909j07612j36109n487M9747m8705R3678B41566J5369K68872J09188j96355
14749D38640M9331A85016K01303N7237J82898k2284j28950q0626j906K8383R6823
14738E17894B31714L14143M15933l85324J44799j36959l8073K87191l77903K6204
14728D81725Q4122j25300J12509j18453j26834L59156L9997J85696m9760k0147
14718H22711J32352l9421l4720P3519k74250j19408K37610m6719j07142k9882
14708F14650P8372k2837K2227q7958J20633j25907k1316A63324M94521K17825
$$ plain form
14698 875670 577949 868950 688825 871660 714270 892500 940344 742792 965081 1001948
14688 1001948 514455 1130893 735032 540877 822649 890144 542410 841926 1024006 753397
14678 753397 754619 514740 918812 722696 831074 571536 875657 1042004 796961 738275
14668 738275 1064418 735964 846165 572667 900732 784926 674624 953397 653146 841572
14658 841572 675306 858543 1027420 969911 759608 932322 1034647 908463 1228456 914981
14648 914981 1003391 1061124 877069 920225 981627 996107 1047365 858192 978884 755672 969972
14637 969972 878538 899944 1255109 908280 919261 1005467 833858 917797 1028308 869879
14627 869879 1103559 1130534 930567 1120188 986593 836551 760383 1042550 1214200 1372131
$$ packed form
14698H75670k97721K91001j80125J82835j57390J78230M7844j97552K22289L6867
14688A001948m87493O16438l95861j94155K81772O7495l47734K99516J82080k70609
14678G53397J222k39879M04072j96116J08378k59538L04121J66347k45043n8686
14668G38275L26143l28454J10201k73498L28065j15806j10302K78773l00251J88426
14658H41572j66266J83237J68877n7509k10303J72714J02325j26184L19993l13475
14648I14981Q8410N7733j84055M3156O1402J4480N1258j89173J20692k23212K14300
14637I69972r1434K1406L55165l46829J0981Q6206j71609Q3939J10511j58429
14627H69879K33680K6975j99967J89621j33595j50042p6168K82167J71650J57931
$$ plain form
14617 1372131 1076912 998143 898262 1002272 1164358 981799 1051982 1084494 1337332 1224067
14607 1224067 802393 966663 753278 988078 1309422 1423818 1436197 1288083 1053876 1286949
14597 1286949 1451182 1156072 1288517 1506472 1135332 1431515 986563 1594025 1520038 1503374
14587 1503374 1384983 1497745 1572581 1422594 1616932 1469482 1521764 1162610 1457619 1481812
14577 1481812 1532028 1826030 1893789 1687912 1545421 1816876 1728278 1870667 2006187 1909298
14567 1909298 1763234 1900647 1894556 1980381 1896967 2211115 2076144 2294901 2189570 2294423
14557 2294423 2424390 2965387 2805153 3134357 3597850 4219493 4634231 6044634 8384141
14548 8384141 12491498 16995091 22440251 23225080 16250083 9768522 6167197 4400449
$$ packed form
14617A372131k95219p8769r9881J04010J62086j82559P0183L2512K52838j13265
14607A224067m21674J64270k13385K34800L21344J14396J2379j48114k34207K33073
14597A286949J64233k95110J32445K17955l71140K96183m44952O07462p3987j6664
14587A503374j18391J12762P4836j49987J94338j47450N2282l59154K95009K4193
14577A481812N0216K94002O7759k05877j42491K71455q8598J42389J35520r6889
14567A909298j46064J37413o091Q5825q3414L14148j34971K18757j05331J04853
14557B294423J29967N40997j60234L29204M63493O21643M14738J410403K339507
14548H384141M107357M503593N445160P84829o974997o481561l601325j766748
$$ plain form
14540 4400449 3212799 2751870 2596197 2099895 2166024 1858212 2174866 1829743 2029249
14531 2029249 1748752 1991608 1754162 1908015 1856319 1921044 2077293 1642675 1860429 1849972
14521 1849972 1953485 2149431 2055081 2198151 2068778 1870667 2108769 2319202 2246939 2037863
14511 2037863 2344822 2402169 2142258 2594217 2610590 2245525 2305780 2126141 2442023 2608095
14501 2608095 2713555 2775539 2526210 2455174 2561520 2889379 2612703 2727815 2211347 2417648
14491 2417648 2505717 2896881 2701603 2592812 2797197 2640931 2586293 2950551 3048163 2829632
14481 2829632 3190085 3179208 3037776 3379920 3376267 3205896 3279959 3225972 3263877 3326598 3409412
14470 3409412 3445986 3266530 3368206 3065155 3316888 3465017 3568954 3952100 3584425 3735661
$$ packed form
14540D400449j187650m60929j55673m96302O6129l07812L16654l45123J99506
14531B029249k80497K42856k37446J53853n1696O4725J56249m34618K17754j0457
14521A849972J03513J95946r4350J43070j29373j98111K38102K10433p2263k09076
14511B037863L06959N7347k59911M51959J6373l65065O0255j79639L15882J66072
14501B608095J05460O1984k49329p1036J06346L27859k76676J15112n16468K06301
14491B417648Q8069L91164j95278j08791K04385j56266n4638L64258R7612k18531
14481B829632L60453j0877j41432L42144l653j70371P4063n3987L7905O2721Q2814
14470C409412L6574j79456J01676l03051K51733J48129J03937L83146l67675J51236
$$ plain form
14460 3735661 3612498 3777490 3947493 3847613 3777075 4024238 4016385 4143202 4435620 3903519
14450 3903519 4189845 4312989 4546432 4325297 4468395 4843335 4698592 4538892 5059512
14441 5059512 4962920 4840913 4861168 5192517 4778966 5140965 5028817 5317384 5501876 5364999
14431 5364999 5602233 5343434 5439190 5583089 5754475 5688675 6174874 5965000 5879315 5903322
14421 5903322 6332434 6355217 6418577 6456502 6630168 6778689 7006758 6776729 7214997 7021802
14411 7021802 7298114 7262901 7270807 7698510 7343532 7554348 7900875 8248243 7972911 8159206
14401 8159206 8506705 8540978 8916803 8815571 8829479 8828480 9300480 9351587 9622337 9743571
14391 9743571 9621960 10102304 10035696 10602751 10626879 10644516 10757225 10988527 11054020 11444742
$$ packed form
14460C735661j23163J64992J70003r9880p0538K47163p853J26817K92418n32101
14450C903519K86326J23144K33443k21135J43098L74940j44743j59700N20620
14441E059512r6592j22007K0255L31349m13551L61999j12148K88567J84492j36877
14431E364999K37234k58799R5756J43899J71386o5800M86199k09874q5685K4007
14421E903322M29112K2783O3360L7925J73666J48521K28069k30029M38268j93195
14411G021802K76312l5213P906M27703l54978K10816L46527L47368k75332J86295
14401H159206L47499L4273L75825j01232J3908r99M72000N1107K70750J21234
14391I743571j21611M80344o6608N67055K4128J7637J12709K31302O5493L90722
$$ plain form
14381 11444742 11534446 11611011 11969491 12165942 12379153 12643367 12969442 13338190 13782325 13717748
14371 13717748 14073302 14483896 14537257 15169596 15316403 15452490 15927143 16199214 16404114
14362 16404114 16540974 17238045 17488851 17841414 18664769 18764155 19330864 19764687 20279219
14353 20279219 20466784 20974842 21655173 21969102 22311198 22969770 23668717 24273867 24681279
14344 24681279 25401955 26168227 26777988 27634877 28458804 29067298 30180532 30920917 31670626
14335 31670626 32774124 33579059 34540955 35820868 37023674 38155570 39465381 40534547
14327 40534547 41934707 43257226 44842260 46365844 48030096 49794481 51304160 52922430
14319 52922430 54901256 57167627 59221885 61699560 64112596 66241108 69132023 72107648
$$ packed form
14381A1444742Q9704P6565L58480J96451K13211K64214L26075L68748M44135o4577
14371A3717748L55554M10594N3361O32339J46807J36087M74653K72071K04900
14362A6404114J36860O97071K50806L52563Q23355R9386N66709M33823N14532
14353B0279219J87565N08058O80331L13929L42096O58572O98947O05150M07412
14344B4681279P20676P66272O09761Q56889Q23927O08494J113234P40385P49709
14335C1670626J103498Q04935R61896J279913J202806J131896J309811J069166
14327D0534547J400160J322519J585034J523584J664252J764385J509679J618270
14319E2922430J978826K266371K054258K477675K413036K128512K890915K975625
$$ plain form
14311 72107648 74844878 78070203 81008259 84668772 88234228 92395829 96036942 100681798
14303 100681798 105303168 110266553 115483419 121029260 126979342 133173268 139734587 146754176
14295 146754176 154103692 162235218 170317911 179390238 188767173 198437798 208852346 219613828
14287 219613828 231228580 243009072 255312577 267930700 280647465 294016586 307295355
14280 307295355 320177981 333065743 345152322 356822598 367547380 376782254 384269066
14273 384269066 389123417 392288690 394385485 395151941 395293458 393289552 389323847 384324754
14265 384324754 377392237 368754386 359003072 347590243 335180929 322212307 309080293
14258 309080293 295812907 282483566 269182221 256314468 243898504 231583125 220022913
$$ packed form
14311G2107648K737230L225325K938056L660513L565456M161601L641113M644856
14303A00681798M621370M963385N216866N545841N950082O193926O561319P019589
14295A46754176P349516Q131526Q082693R072327R376935R670625J0414548J0761482
14287B19613828J1614752J1780492J2303505J2618123J2716765J3369121J3278769
14280C07295355J2882626J2887762J2086579J1670276J0724782R234874P486812
14273C84269066M854351L165273K096795P66456J41517k003906l965705m999093
14265C84324754o932517q637851r751314j1412829j2409314j2968622j3132014
14258C09080293j3267386j3329341j3301345j2867753j2415964j2315379j1560212
$$ plain form
14251 220022913 209032795 198724991 188416790 179193150 170260784 161777860 153739425
14244 153739425 146408786 139241800 132751999 126628901 120518957 115068044 109895698 105108279
14236 105108279 100326610 95965870 92075758 88076632 84245430 81116187 77612086 74942539
14228 74942539 71779641 68865710 66171259 63664455 61452174 58977389 57155699 54973422
14220 54973422 53017188 51385774 49774519 47611151 46174694 44993893 43312669 41891096
14212 41891096 40874845 39377138 38370534 36976105 36169470 34903745 33989102 33132544
14204 33132544 31981161 31046222 30347058 29574164 28872810 27685380 27305466 26327988 25733343
14195 25733343 25139960 24401041 24000284 23485535 22357175 21904864 21562837 21056312 20508135
$$ packed form
14251B20022913j0990118j0307804j0308201r223640q932366q482924q038435
14244A53739425p330639p166986o489801o123098o109944n450913n172346m787419
14236A05108279m781669m360740l890112l999126l831202l129243l504101k669547
14228G4942539l162898k913931k694451k506804k212281k474785j821690k182277
14220E4973422j956234j631414j611255k163368j436457j180801j681224j421573
14212D1891096j016251j497707j006604j394429q06635j265725r14643q56558
14204C3132544j151383r34939o99164p72894p01354j187430l79914r77478n94645
14195B5733343n93383p38919m00757n14749j128360m52311l42027n06525n48177
$$ plain form
14186 20508135 20145191 19353390 18846722 18891621 18303452 18021533 17360086 17121336 16520954
14177 16520954 16460709 16197161 15629072 15038871 15281116 14419582 14434589 14167861 13631777 13611611
14167 13611611 13352413 13061354 12975870 12341143 12329719 12090682 12095742 11505374 11279845 11180264
14157 11180264 10683308 10760467 10248438 10732514 10349057 10100079 10321168 9449847 9667587
14148 9667587 9469027 9152775 8936758 8785142 8796327 8928054 8747424 8301369 8229362 8082743
14138 8082743 7959997 7851362 7964885 7585426 7651805 7536639 7442756 7074561 6918083 7133476
14128 7133476 7031263 6741761 6440701 6601736 6423252 6548084 6270271 6313559 6194708 6135296
14118 6135296 5809176 6073843 6233553 5883000 5577141 5630592 5443918 5704193 5358386 5091011
$$ packed form
14186B0508135l62944p91801n06668M4899n88169k81919o61447k38750o00382
14177A6520954o0245k63548n68089n90201K42245q61534J5007k66728n36084k0166
14167A3611611k59198k91059q5484o34727j1424k39037N060n90368k25529r9581
14157A1180264m96956P7159n12029M84076l83457k48978K21089q71321K17740
14148I667587j98560l16252k16017j51616J1185J31727j80630m46055p2007j46619
14138H082743j22746j08635J13523l79459O6379j15166r3883l68195j56478K15393
14128G133476j02213k89502l01060J61035j78484J24832k77813M3288j18851n9412
14118F135296l26120K64667J59710l50553l05859N3451j86674K60275l45807k67375
$$ plain form
14108 5091011 5305727 5216040 5258499 4943874 4964561 5045775 5193529 4797285 4632847 4733822
14098 4733822 4594638 5076011 4457394 4476914 4309262 4631106 4359061 4371327 4129268 4215447
14088 4215447 4093716 4096885 4105834 3714374 3830150 4009761 3880385 3513274 3872300 3881661
14078 3881661 3835847 3889340 3664817 3815858 3802541 3549048 3356136 3596476 3270287 3496475
14068 3496475 3491332 3280927 3332934 3090958 3129235 3407403 3278713 3264727 3459093 3013622
14058 3013622 2943910 3203372 2877535 2792826 3017289 3085367 2743134 2811813 2857632 2706888
14048 2706888 2836494 2708486 2647529 2571686 2635618 2407929 2560427 2427723 2724131 2529884
14038 2529884 2294370 2212534 2493598 2522964 2405377 2584443 2631290 2470922 2322538 2340362
$$ packed form
14108E091011K14716q9687M2459l14625K0687Q1214J47754l96244j64438J00975
14098D733822j39184M81373o18617J9520j67652L21844k72045J2266k42059Q6179
14088D215447j21731L169Q949l91460J15776J79611j29376l67111L59026R361
14078C881661m5814N3493k24523J51041j3317k53493j92912K40340l26189K26188
14068C496475n143k10405N2007k41976L8277K78168j28690j3986J94366m45471
14058C013622o9712K59462l25837q4709K24463O8078l42233O8679M5819j50744
14048B706888J29606j28008o0957p5843O3932k27689J52498j32704K96408j94247
14038B529884k35514q1836K81064K9366j17587J79066M6847j60368j48384J7824
$$ plain form
14028 2340362 2185583 2190920 2089356 2358188 2229766 2104355 2216957 2361400 1932895 1935967
14018 1935967 2241622 2290649 1831646 2277720 1980516 1941390 1748485 2136271 1903071 1874190
14008 1874190 2150870 1826456 2083462 1854290 1400913 2050684 1647828 1798549 1713970 1701180
13998 1701180 1803215 2055343 2011828 1957687 1934387 2027804 2563315 2691782 3867421 5239013
13988 5239013 7928741 12700216 19713686 23969600 19650956 13010603 8905252 6410160
13980 6410160 4981317 4231146 3697541 3368086 3139429 2601894 2591299 2369899 2646209
13971 2646209 2004690 2132708 1779292 1934290 1677490 1788411 1843480 1861018 1559956 1840059
13961 1840059 1792471 1629927 1761877 1770964 1394879 1860322 1629526 1797525 1580541 1351952
$$ packed form
14028B340362j54779N337j01564K68832j28422j25411J12602J44443m28505L072
14018A935967L05655M9027m59003M46074k97204l9126j92905L87786k33200k8881
14008A874190K76680l24414K57006k29172m53377O49771m02856J50721q4579j2790
13998A701180J02035K52128m3515n4141k3300R3417N35511J28467J175639J371592
13988E239013K689728M771475P013470M255914m318644o640353m105351k495092
13980F410160j428843p50171n33605l29455k28657n37535j0595k21400K76310
13971B646209o41519J28018l53416J54998k56800J10921N5069J7538l01062K80103
13961A840059m7588j62544J31950R087l76085M65443k30796J67999k16984k28589
$$ plain form
13951 1351952 1745303 1546422 1439011 1272786 1205074 1285163 1471552 1447269 1621200 1452513
13941 1452513 1391508 1244919 1613376 1456053 1358342 1521508 1435200 1167515 1218509 1525568
13931 1525568 1479770 1325045 1131738 1299331 1221379 1354631 1268145 1071928 1150856 1305757
13921 1305757 1268478 1007646 1108028 874563 1121739 1344470 1151549 1169092 1139654 612823
13911 612823 1216162 1006089 1338850 935806 1309723 1118940 1320615 1156666 1207636 1139207
13901 1139207 633767 1080490 1276891 935946 1321103 1003086 1243631 1167370 858156 822413
13891 822413 1091630 1082207 1008554 938552 1117094 1224799 871654 905266 956713 892247 792502
13880 792502 856335 1006663 952181 838898 561989 865040 739171 891730 1003950 842599
$$ packed form
13951A351952L93351j98881j07411j66225o7712Q0089J86389k4283J73931j68687
13941A452513o1005j46589L68457j57323r7711J63166q6308k67685N0994L07059
13931A525568m5798j54725j93307J67593p7952J33252q6486j96217P8928J54901
13921A305757l7279k60832J00382k33465K47176K22731j92921J7543k9438n26831
13911F12823O03339k10073L32761m03044L73917j90783K01675j63949N0970o8429
13901A139207n05440M46723J96401l40945L85157l18017K40545p6261l09214l5743
13891H22413K69217r423p3653p0002J78542J07705l53145L3612N1447o4466r9745
13880G92502O3833J50328n4482j13283k76909L03051j25869J52559J12220j61351
$$ plain form
13870 842599 823170 1017899 916789 848487 992736 1199111 615523 907020 991676 897072
13860 897072 860096 1107308 972919 927194 902601 739515 726718 984178 767595 526226
13850 526226 980216 755914 988738 734709 607533 971519 854872 663207 871510 991064
13840 991064 790900 564957 708772 967686 1092388 968913 535019 392202 781200 995489
13830 995489 352012 524222 579824 438090 869375 982451 1053489 859205 700089 602468
13820 602468 694092 764782 712474 613578 951023 729206 773771 1008058 452565 638134
13810 638134 695842 931001 621710 397963 49202 662561 628548 684529 601844 533245 718553
13799 718553 791298 733670 547617 526875 741678 525606 448169 441973 469129 366152 836929
$$ packed form
13870H42599j9429J94729j01110o8302J44249K06375n83588K91497Q4656r4604
13860H97072l6976K47212j34389m5725k4593j63086j2797K57460k16583k41369
13850E26226M53990k24302K32824k54029j27176L63986j16647j91665K08303J19554
13840I91064k00164k25943J43815K58914J24702j23475m33894j42817L88998K14289
13830I95489C52012J72210N5602j41734M31285J13076P1038j94284j59116r7621
13820F02468R1624P0690n2308r8896L37445k21817M4565K34287D52565J85569
13810F38134N7708K35159l09291k23747D9202O13359l4013N5981q2685o8599J85308
13799G18553P2745n7628j86053k0742K14803k16072p7437o196K7156j02977M70777
$$ plain form
13788 836929 795086 754143 662215 477555 850827 551423 459431 291908 556595 557423 413633
13777 413633 415360 577842 790670 601961 504473 962717 344329 466741 509719 422057
13767 422057 430345 385705 481404 876195 331300 361340 364007 623180 356679 494192 580183
13756 580183 975151 484265 553542 535542 509723 399760 594057 648903 551066 275581
13746 275581 -2813 520644 399996 615227 447757 322880 634956 463486 504051 78847
13735 307317 418808 263095 378425 368878 239708 362878 575516 534580 392049 276990
13725 276990 590960 466648 212715 307760 446752 306983 372708 517710 390216 562394
13715 562394 757788 187583 312491 355060 157747 566029 399317 146889 246237 367476
$$ packed form
13788H36929m1843m0943r1928j84660L73272k99404r1992j67523K64687Q28j43790
13777D13633J727J62482K12828j88709r7488M58244C44329J22412M2978q7662
13767D22057Q288m4640R5699L94791C31300L0040K667K59173k66501J37513Q5991
13756E80183L94968D84265O9277j8000k5819j09963J94297N4846r7837k75485
13746B75581b813E20644j20648K15231j67470j24877L12076j71470M0565G8847
13735C07317J11491j55713J15330r547j29170J23170K12638m0936j42531j15059
13725B76990L13970j24312B12715R5045J38992j39769O5725J45002j27494J72178
13715E62394J95394A87583J24908M2569A57747M08282j66712A46889R9348J21239
$$ plain form
13705 367476 359215 276822 483484 231835 623322 335354 272491 628363 339083 519987
13695 519987 639214 558092 726766 619962 231882 321430 567974 465189 246066 185522
13685 185522 152917 417432 472520 380097 757740 55325 357107 597937 531092 355009
13675 355009 164132 409967 484191 771853 529742 821550 201396 496431 364061 310329
13665 310329 242249 480686 694502 352595 149620 558768 214442 507152 429836 49267
13654 589500 316229 560249 373732 387892 437349 159510 330565 46760 196209 439003
13644 439003 249739 549180 382921 211547 333051 317143 579756 644168 285618 532984
13634 532984 181381 257123 179824 294119 311816 387368 146777 468189 311286 454201
$$ packed form
13705C67476q261q2393K06662B31835L91487k87968o2863L55872k89280J80904
13695E19987J19227q1122J68674j06804B31882Q9548K46544j02785k19123o0544
13685A85522l2605K64515N5088r2423L77643E5325L01782K40830o6845j76083
13675C55009A64132K45835P4224K87662k42111K91808B01396K95035j32370n3732
13665C10329o8080K38437K13816l41907A49620M09148B14442K92710p7316D9267
13654E89500k73271K44020j86517J4160M9457A59510J71055D6760J49449K42794
13644D39003j89264K99441j66259j71374J21504j5908K62613O4412B85618K47366
13634E32984A81381P5742p7299J14295J7697P5552A46777L21412j56903J42915
$$ plain form
13624 454201 213200 453037 -64497 310068 250794 222516 488524 242674 267606 662126
13614 662126 195772 196695 13193 133263 323876 188710 389942 105751 433949 218572
13604 218572 310570 294830 462154 206866 222139 73362 157469 504176 303316 214176 306804
13593 306804 229875 -310928 32365 424611 108524 100626 243326 345644 358554 210329
13583 210329 362473 -72344 117618 203817 266299 182276 205121 316201 225121 394211 86143
13571 -48375 393459 125099 392465 19356 602590 72645 218537 161598 386728 315895
13561 315895 417699 275670 316622 229906 307083 31036 485398 104035 290079 127957
13550 365074 399339 26636 244688 270276 280423 221434 330384 168366 199108 100175 529658
$$ packed form
13624D54201B13200K39837f4497C10068n9274k8278K66008B42674K4932L94520
13614F62126A95772R23A3193J20070J90613j35166K01232A05751L28198k15377
13604B18572R1998j5740J67324B06866J5273G3362Q4107L46707k00860q9140R2628
13593C06804p6929c10928C2365L92246A08524p898J42700J02318J2910j48225
13583B10329J52144g2344A17618Q6199O2482q4023K2845J11080r1080J69090H6143
13571d8375C93459A25099K67366A9356N83234G2645J45892n6939K25130p0833
13561C15895J01804j42029M0952q6716P7177C1036M54362A04035J86044A27957
13550C65074L4265B6636K18052K5588J0147n8989J08950j62018L0742r8933M29483
$$ plain form
13539 529658 115804 430200 128880 201255 404572 145042 17561 430919 327210 33398
13528 47326 350169 399786 186369 368304 165217 557778 363942 162475 316071 104553
13517 -20515 142367 185095 150411 67591 -59706 161998 120009 210175 106953 236002 419526
13506 419526 120147 370210 232117 355597 -111294 255278 -49028 -152373 138243 -177711
13495 256596 211262 199634 -258336 119809 176132 36505 -18541 301487 70800 207013 618770
13484 618770 241759 160250 -31570 171045 55880 42213 151999 232415 309370 313204 349760
13473 349760 173518 283401 -21108 423669 311193 82129 -4025 117892 90237 446319
13463 446319 314582 248335 177355 51498 382445 128088 105526 167649 230797 -113609 161331
$$ packed form
13539E29658A15804L14396A28880P2375K03317A45042A7561M13358j03709C3398
13528D7326L02843M9617A86369J81935A65217L92561j93836A62475J53596A04553
13517b0515A42367M2728l4684F7591e9706A61998m1989R0166j03222J29049J83524
13506D19526A20147K50063j38093J23480a11294B55278d9028j03345A38243a77711
13495B56596m5334j1628b58336A19809N6323C6505a8541C01487G0800J36213M11757
13484F18770B41759q1509c1570A71045E5880j3667J09786Q0416P6955L834L6556
13473C49760A73518J09883b1108D23669j12476H2129d025A17892k7655L56082
13463D46319j31737o6247p0980E1498L30947A28088k2562O2123O3148a13609A61331
$$ plain form
13451 34987 392786 25903 114612 83012 59799 361758 106370 255258 245694 251068 -15826
13439 38355 -172001 275295 3306 -122248 -11898 143422 59293 318651 96051 207108 144711
13428 144711 228060 164575 -59004 106319 446583 111792 8330 252021 -76762 247380 196153
13417 196153 -164041 -205412 198976 -160637 253230 -126366 50220 91624 326586 68377
13406 232956 68857 415351 283394 151190 531620 216401 98155 229593 32110 -72371
13395 165012 -46375 232997 311444 -29200 350191 280861 -63189 262405 92405 -81171 179045
13383 441723 53700 232527 -150664 -135483 22274 46119 30801 338829 310998 35341 306022
13372 306022 293316 112458 432037 218708 335405 83968 26117 210460 252127 265390
$$ packed form
13451C4987L57799B5903Q8709l1600k3213L01959A06370J48888r564N374a5826
13439C8355a72001B75295C306a22248a1898A43422E9293K59358I6051J11057o2397
13428A44711Q3349o3485e9004A06319L40264A11792H330K43691g6762B47380n1227
13417A96153a64041m1371A98976a60637B53230a26366E0220M1404K34962F8377
13406B32956F8857L46494j31957j32204L80430B16401I8155J31438C2110g2371
13395A65012d6375B32997P8447b9200C50191o9330f3189B62405I2405h1171A79045
13383D41723E3700J78827a50664J5181B2274K3845j5318L08028k7831C5341K70681
13372C06022j2706A12458L19579k13329J16697H3968B6117J84343M1667J3263
$$ plain form
13362 265390 368278 45991 152101 372280 62297 87004 -201784 160397 269242 129808
13351 -29036 236246 416232 -36283 402704 13009 588081 398639 331207 179220 334657
13341 334657 232557 17496 69367 172327 150813 11240 135724 191331 87774 69867 5386
13329 217918 24581 -46823 268302 315929 145359 55736 160845 205479 145777 248618 -1919
13317 83903 311934 58687 174469 63701 224463 216030 458404 138413 163548 72908 267918
13306 267918 -203347 275463 -194685 37923 491566 -104106 86607 137487 -67743 296091
13295 279624 149999 369721 104402 406538 236545 -72453 237535 122432 241415 304749
13285 304749 545127 -85943 11784 -145551 31775 165960 24124 -96525 212507 -51252 66395
$$ packed form
13362B65390J02888D5991J06110K20179F2297K4707b01784A60397J08845A29808
13351b9036B36246J79986c6283D02704A3009N75072j89442o7432j51987J55437
13341C34657j02100A7496N1871J02960k1514A1240J24484N5607H7774j7907E386
13329B17918B4581d6823B68302M7627A45359E5736J05109M4634n9702J02841a919
13317H3903K28031E8687J15782F3701J60762q433K42374A38413K5135G2908J95010
13306B67918b03347B75463a94685C7923M53643a04106H6607N0880f7743B96091
13295B79624j29625K19722A04402L02136j69993g2453B37535j15103J18983O3334
13285C04749K40378h5943A1784a45551C1775J34185B4124i6525B12507e1252F6395
$$ plain form
13273 165492 311537 64947 -81183 60438 204752 251444 265387 222925 289396 27642 -29199
13261 -21300 50223 108304 -169462 19977 186501 -3540 146346 119849 -37081 154420 514351
13250 514351 -144855 -124365 -139655 152504 45377 -11599 -56976 23689 -48871 97635 -33581
13238 11038 238814 115945 -223933 153867 259342 16352 -170388 -286821 213059 50732
13227 195689 -101024 415164 -93079 -96405 -6249 -91867 107511 106637 231570 137699 329220
13216 329220 -42548 -132153 272231 140363 -215755 144451 144526 44950 -135399 -158043 347987
13204 -74409 -623216 263671 282585 36993 316104 -118557 -28790 145432 -179030 -81895
13193 -232657 122369 55022 -246270 149234 -40708 -35810 43258 70908 280532 43413 3981
$$ packed form
13273A65492J46045F4947h1183F0438J44314M6692J3943m2462O6471B7642b9199
13261b1300E0223N8081a69462A9977J66524c540A46346k6497c7081A54420L59931
13250E14351a44855K0490j5290A52504D5377a1599m5377B3689d8871I7635c3581
13238A1038K27776A15945b23933A53867J05475A6352a70388j16433B13059E0732
13227A95689a01024D15164i3079l326f249q5618A07511q74J24933r3871J91521
13216C29220d2548q9605B72231j31868b15755A44451P5D4950a35399k2644C47987
13204g4409n48807B63671J8914C6993K79111a18557b8790A45432a79030h1895
13193b32657A22369E5022b46270A49234d0708M898D3258K7650K09624D3413C981
$$ plain form
13181 -4266 21661 9727 -305754 221197 -30445 45440 135263 111570 281518 311537 -116400
13169 -3983 71537 -137682 -196104 -287232 -424367 42342 150846 353051 99799 54702 47740
13158 47740 298923 -61851 -48042 54879 94733 64477 -24726 -180332 98998 227977 -23270
13146 -52819 -115646 -96995 185094 146053 -64109 -231405 261865 189524 -71671 15750 305230
13135 305230 136487 194145 293487 264389 50488 -267333 -64285 309714 -50056 34354 43291
13124 43291 -33091 348872 -108086 -78083 64318 -36765 116725 131448 155135 178451 203994
13113 203994 58143 -34034 185228 60048 37204 -58788 -78447 177735 4819 348431 201078
13102 201078 118129 195671 1124 198352 210063 100794 143508 326231 208294 276075 -126420
$$ packed form
13181d266B1661I727c05754B21197c0445D5440Q9823k3693J69948L0019a16400
13169c983G1537a37682n8422r1128j37135D2342J08504K02205I9799m5097o962
13158D7740K51183f1851J3809E4879L9854l0256b4726j55606I8998J28979b3270
13146e2819o2827J8651A85094l9041f4109j67296B61865p2341g1671A5750K89480
13135C05230A36487N7658R9342k9098E0488b67333f4285C09714e0056C4354Q937
13124D3291c3091C48872a08086L0003F4318c6765A16725J4723K3687K3316K5543
13113B03994E8143c4034A85228F0048k2844e8788j9659A77735D819L43612j47353
13102B01078q2949P7542A124J97228J1711A00794M2714J82723j17937O7781a26420
$$ plain form
13090 -188003 44524 146487 216503 9946 -349965 307165 -175507 5462 86907 15722 164754
13079 164754 184152 51869 -30 -29978 -138311 113817 7643 257845 311487 59369 -262382
13067 27209 -31172 255429 70944 56627 179319 5986 -87733 101973 185920 -925 -64203 336012
13054 219941 -122128 61940 165814 318 125849 32679 235303 390709 55296 22630 -83277
13042 69530 201676 -56930 130024 85377 134584 -100398 163411 129378 -109576 114320
13031 47692 247066 114411 -27710 -52761 13084 -62415 -7040 -73246 53830 22526 102471
13020 102471 150805 -27120 -172449 -108043 109401 155611 83492 210604 4296 65919 -392033
13008 -126012 95768 19635 -42987 44797 -133872 235488 244526 139876 -3856 96829 50792
$$ packed form
13090a88003D4524J01963P0016I946c49965C07165a75507E462Q1445A5722J49032
13079A64754J9398E1869c0k9948j08333A13817G643K50202N3642E9369b62382
13067B7209c1172B55429G0944j4317J22692E986h7733A01973Q3947i25o3278C36012
13054B19941a22128F1940J03874C18J25531C2679K02624J55406E5296B2630h3277
13042F9530J32146e6930A30024m4647M9207a00398A63411l4033a09576A14320
13031D7692J99374A14411b7710k5051A3084f2415g040o6206E3830B2526P9945
13020A02471M8334b7120j45329O4406A09401M6210p2119J27112D296O1623c92033
13008a26012I5768A9635d2987D4797a33872B35488R038j04650c856I6829m6037
$$ plain form
12997 50792 135192 111171 61797 50528 201584 -223813 81785 -85289 -142131 17627 235503
12986 235503 74587 -22511 -50879 -10283 251732 206611 -99123 -89622 117882 -78552 -62302
12975 -62302 -351803 74021 -98393 115741 18621 72031 -292230 1022 -281461 26869 -238715
12963 10014 49978 -82629 66408 -16203 -24325 -31609 66019 218153 -87978 -201105 -46266 130922
12950 -37920 212288 -371793 330097 122433 24856 -105584 66386 -25660 -70920 -110234 -79041
12939 -79041 -126921 -50191 -28286 123850 -177141 170593 -117457 38881 -104181 -31005 150665
12927 300646 128971 -206097 -127100 328023 -1871 273468 172307 17271 207165 -84840
12916 46257 -258107 270475 162885 38349 -21102 -157122 -1783 242816 222587 98341 230439
$$ packed form
12997E0792Q4400k4021m9374j1269J51056b23813H1785h5289n6842A7627K17876
12986B35503G4587b2511k8368a0283B51732m5121i9123R501A17882g8552J6250
12975f2302k89501G4021i8393A15741A8621N3410b92230A022b81461B6869b38715
12963A0014L9964h2629F6408a6203q122p284F6019J52134h7978j13127d6266A30922
12950c7920B12288c71793C30097A22433B4856a05584F6386b5660m5260l9314L1193
12939g9041m7880e0191K1905A23850a77141A70593a17457C8881a04181c1005A50665
12927C00646A28971b06097P8997C28023a871B73468j01161A7271J89894h4840
12916D6257b58107B70475j07590C8349b1102j36020a783B42816k0229I8341J32098
$$ plain form
12905 230439 193680 -86185 159891 59571 -26353 252398 -392177 243751 180205 -67707 197363
12893 47113 -85653 -119885 134641 -207895 87014 100125 -360073 85594 -54078 -143339 -62874
12881 -296936 340965 -100914 -271562 -158136 -5960 442119 165430 58953 173124 -142017
12870 -26517 -22709 -212 119273 -46048 -12366 -205017 -187903 249896 -121061 472290 -249090
12858 62052 301854 412468 52196 -211704 -124966 -4106 20731 1626 252655 42113 93022
12847 93022 65784 -184459 6186 86272 24431 139934 224917 131393 332977 -354565 -55412
12835 -45429 -128287 -203052 -292117 162890 -311719 -105341 159098 289063 -34868 4449 121044
12824 121044 -38357 -25597 118418 -95220 -82679 -163642 -248970 104549 -228579 69686 -56328
$$ packed form
12905B30439l6759h6185A59891E9571b6353B52398c92177B43751o3546f7707A97363
12893D7113h5653l4232A34641b07895H7014J3111c60073H5594e4078q9261f2874
12881b96936C40965a00914j70648J13426e960D42119A65430E8953J14171a42017
12870b6517L808b12A19273d6048a2366j92651J7114B49896a21061D72290b49090
12858F2052K39802J10614E2196b11704Q6738d106B0731A626K51029D2113N0909
12847I3022k7238a84459F186Q0086B4431J15503Q4983r3524K01584c54565e5412
12835d5429q2858p4765q9065A62890c11719a05341A59098J29965c4868D449J16595
12824A21044c8357J2760A18418i5220J2541q0963q5328A04549b28579F9686e6328
$$ plain form
12812 -261092 49354 -122488 -63239 -127037 -8683 -104620 -63932 310688 -181121 185471 78265
12800 -14643 -68166 -317828 -139449 298555 -60126 -118993 -288155 17590 -8471 -9222 115944
12788 56759 -37644 39883 -291426 -131226 -122051 150023 -169502 8890 37475 102027 15318
12776 -41460 137877 -240060 -292974 120076 -145818 155283 -81007 14965 -147144 -22713
12765 -14814 220097 161671 -260604 -164211 209477 16744 38580 10272 48810 82596 30460
12753 -91319 2361 -159054 -34144 -45948 230899 -29899 43993 281610 19737 -64510 213911
12741 234383 -92438 76366 -22700 116121 141915 -34595 -84077 53825 17835 242335 -38372
12729 150085 35676 -17764 -1021 -483831 61490 187495 226130 40603 -112137 51792 189075
$$ packed form
12812b61092D9354a22488N9249o3798h683r5937M0688C10688a81121A85471G8265
12800a4643n3523k49662a39449B98555f0126n8867j69162A7590h471p51A15944
12788E6759c7644C9883b91426a31226R175A50023a69502H890K8585O4552A5318
12776d1460A37877b40060n2914A20076a45818A55283h1007A4965a47144b2713
12765a4814B20097n8426b60604R6393B09477A6744K1836A0272L8538L3786C0460
12753i1319B361a59054c4144j1804B30899b9899D3993K37617A9737f4510B13911
12741B34383i2438G6366b2700A16121K5794c4595m9482E3825A7835K24500c8372
12729A50085C5676a7764a021m82810F1490J26005L8635D0603a12137E1792J37283
$$ plain form
12718 189075 225278 205303 -1122 62602 -84373 -86806 146902 311600 358010 105661 -191405
12706 35662 70652 249128 -16607 273707 -227570 67958 112892 -123462 291112 -11801 -125932
12695 -125932 -21639 322095 185745 -160271 -11033 -293275 168074 53545 20358 -105100
12684 -167892 -4315 52255 57242 9391 -703 20102 -100150 11774 41295 1706 -2127 -30494 -130883
12671 -130883 16607 331577 -205454 -7402 358852 -39262 90420 -78659 -311271 127022 148222
12660 148222 -25413 149207 -254842 -52006 166029 462704 -56188 260982 153696 214852
12650 214852 192717 -38389 61566 182140 23796 158699 130099 272030 51114 56184 546
12638 19175 -80399 345516 29342 -276986 102170 106883 -54769 169608 232917 -216122 197213
$$ packed form
12718A89075L6203j9975a122F2602h4373k433A46902J64698M6410A05661a91405
12706C5662L4990J78476a6607B73707b27570F7958M4934a23462B91112a1801j14131
12695a25932b1639C22095j36350a60271a1033k82242A68074E3545B0358a05100
12684a67892d315E2255M987I391g03B0102a00150A1774K9521A706b127k8367j00389
12671a30883A6607L14970b05454g402C58852c9262I0420g8659k32612A27022K1200
12660A48222b5413A49207b54842e2006A66029K96675e6188B60982j07286O1156
12650B14852k2135c8389F1566J20574B3796J34903k8600J41931E1114N070E46
12638A9175h0399C45516B9342b76986A02170M713e4769A69608O3309b16122A97213
$$ plain form
12626 -178484 -165350 226884 4998 -233206 239533 439132 202086 298744 -28502 -292098
12616 -292098 -273946 -95532 -40987 139611 219529 138055 153349 -10538 178089 12944 199532
12605 199532 -62549 45618 -145948 -114239 197296 -90398 -54225 -385158 -125204 212138
12594 -47548 -321567 490 241250 144794 113929 -29147 -341725 164989 17987 -108017 -85432
12583 -85432 48733 92377 -108381 144608 -201984 -142024 453266 21747 -3025 115201 -10793
12571 199363 -124060 230839 9395 112890 -214945 -153813 -21688 103189 35792 -110545
12560 -83073 -75080 -98459 -420349 34875 25631 180634 -79985 86070 -116545 257004 -85950
12548 116295 -71716 -230277 -25905 -16376 -219383 -150211 -318521 -203801 -217921 -47256 175142
$$ packed form
12626a78484J3134B26884D998b33206B39533J99599B02086R6658b8502k63596
12616b92098J8152i5532d0987A39611P9918q1474J5294a0538A78089A2944J86588
12605A99532f2549D5618a45948L1709A97296i0398L6173l30933a25204B12138
12594d7548k74019D90K40760r6456l0865b9147l12578A64989A7987a08017K2585
12583h5432D8733M3644a08381A44608b01984N9960D53266B1747c025A15201a0793
12571A99363a24060B30839I395J03495b14945O1132b1688A03189C5792a10545
12560h3073P993k3379l21890C4875r244J55003g9985H6070a16545B57004h5950
12548A16295g1716j58561b5905R529k03007O9172j68310J14720j4120d7256A75142
$$ plain form
12536 148598 170243 296398 114899 53719 65397 208142 19230 77290 -130596 -79145 -60325
12525 -60325 -230924 -332914 -58981 -118622 -8273 -400304 197193 158014 -301236 16095 129662
12514 129662 29658 -199105 -228183 -177394 -48638 -208274 -290867 100952 6035 -345224 32286
12502 198718 -58290 90814 -35739 -37280 48787 183938 -397956 63757 20209 73288 -593 262956
12489 -152847 -129744 -205625 104083 -131893 -211659 -174384 16142 101702 -202957 -71785 145310
12477 -102879 248030 -23068 -37360 -155750 -28124 -85387 157296 -33456 -252161 31790 -23486
12465 206997 231712 -122673 82444 -216666 58053 -93329 -112687 20964 54441 -127935 209476
12453 -15153 -172029 -31560 -31685 172690 48349 43426 -77700 119820 -309751 33111 81236
$$ packed form
12536A48598K1645J26155A14899E3719J1678J42745A9230N8060a30596N1451J8820
12525f0325j70599j01990e8981n9641h273l92031A97193l9179c01236A6095J13567
12514A29662B9658a99105k9078N0789d8638j59636q2593A00952F035c45224C2286
12502A98718e8290I0814c5739j541D8787J35151c97956F3757B0209N3079e93B62956
12489a52847K3103p5881A04083a31893p9766L7275A6142Q5560b02957g1785A45310
12477a02879B48030b3068j4292j18390b8124n7263A57296c3456k18705C1790b3486
12465B06997K4715a22673H2444b16666E8053i3329j9358B0964L3477a27935B09476
12453a5153j56876c1560j25A72690D8349m923g7700A19820c09751C3111M8125
$$ plain form
12442 81236 157248 -201639 -88867 -142986 -157334 -91315 150618 -343705 -43466 -325443 -173410
12431 -173410 129057 -147489 -9174 13603 -171702 -290546 65487 88512 116924 164631 28324
12419 48859 -24449 -139770 -187577 -340581 -18859 -62475 -430017 -95565 -145211 103549 -294554
12407 -393957 65573 -150078 202935 49023 69988 223074 -48205 -70515 88148 -34350 -122774
12396 -122774 106012 70415 -142315 -55112 -103168 -35773 -78534 82618 -107787 -44814 45133
12384 349422 -24614 199474 347341 114320 -32563 -58954 54327 -134023 258756 -73342
12373 160040 345200 -8806 -16224 -271585 52002 -361447 34352 -199970 110693 162998 -63603
12361 -128366 -166442 -65859 -121320 316436 78410 109718 -151017 88190 -268277 8884 -37971
$$ packed form
12442H1236P6012b01639h8867n4119j4348O6019A50618c43705d3466k81977J52033
12431a73410A29057a47489i174A3603a71702j18844F5487K3025K8412M7707B8324
12419D8859b4449j15321m7807j53004a8859m3616l67542i5565m9646A03549b94554
12407c93957F5573a50078B02935D9023K0965J53086d8205k2310H8148c4350q8424
12396a22774A06012l5597a42315e5112m8056c5773m2761H2618a07787d4814D5133
12384C49422b4614A99474J47867A14320c2563k6391E4327a34023B58756g3342
12373A60040J85160h806p418k55361E2002c61447C4352a99970A10693N2305f3603
12361a28366l8076f5859n5461C16436G8410L1308a51017H8190b68277H884c7971
$$ plain form
12349 -307540 178995 -263925 273726 16238 10105 133940 -7278 25482 128964 -77742 -204317
12338 -204317 -38916 229996 114137 162199 64894 131470 -61162 58120 -228179 224018 157754
12327 157754 -58486 -88114 -143889 194277 -18062 -8048 -55193 205981 -174917 -198697 25083
12315 -205959 103673 -32956 81566 149081 -6060 63167 254820 127551 -114229 100723 -115963
12303 4001 62927 96971 86052 -74823 -207223 119017 -48063 -32560 -69664 130107 76887
12292 76887 148666 -131832 215425 375567 380829 -119434 -36414 -123521 228710 -45761 54274
12280 236214 -178284 72509 -57576 18028 -71632 141292 180803 -24944 286623 -7320 -6203
12269 -6203 145932 221347 -111299 247469 88705 13246 -270291 -71348 75253 165102 211080
$$ packed form
12349c07540A78995b63925B73726A6238o133J23835g278B5482J03482g7742j26575
12338b04317c8916B29996A14137M8062F4894O6576f1162E8120b28179B24018o6264
12327A57754e8486k9628n5775A94277a8062h048m7145B05981a74917k3780B5083
12315b05959A03673c2956H1566O7515f060F3167J91653j27269a14229A00723a15963
12303D001N8926L4044j0919g4823j32400A19017d8063J5503l7104A30107n3220
12292G6887P1779a31832B15425J60142N262a19434c6414q7107B28710d5761E4274
12280B36214a78284G2509e7576A8028g1632A41292L9511b4944B86623g320J117
12269f203A45932P5415a11299B47469H8705A3246b70291g1348G5253Q9849M5978
$$ plain form
12258 211080 133581 -110240 -138565 33761 286262 -297698 75319 240205 132917 -85254
12247 -30751 -359577 -287521 218019 125841 111817 -99002 120242 -85598 -77428 -97189 140715
12235 -33268 -248931 -227752 -129965 173100 217790 110150 -159005 257521 -10856 213757
12224 -22926 230171 21383 217920 454 106020 -135350 152760 285483 90339 256 -25482
12212 52817 -64773 -36556 -64088 236352 144649 27331 252772 129877 200475 -101243 74721
12200 354867 507151 -25342 103669 13474 472327 -55583 296720 -127386 -191692 193033
12189 168347 -46305 -228941 275056 33207 291936 345698 272253 124966 37937 14031 217721
12178 217721 103674 -104816 320311 323927 22693 111211 63310 198636 -47445 132898 63682
$$ packed form
12258B11080p7499a10240k8325C3761K52501b97698G5319J64886j07288h5254
12247c0751l28826P2056B18019r2178j4024i9002A20242h5598Q170j9761A40715
12235c3268k15663K1179R7787A73100M4690j07640a59005B57521a0856B13757
12224b2926B30171B1383J96537D54J05566a35350A52760J32723I0339B56b5482
12212E2817f4773K8217k7532B36352r1703B7331K25441j22895P0598a01243G4721
12200C54867J52284b5342A03669A3474M58853e5583B96720a27386o4306A93033
12189A68347d6305j82636B75056C3207K58729N3762p3445A24966C7937A4031K03690
12178B17721A03674a04816C20311L616B2693Q8518m7901J35326d7445A32898F3682
$$ plain form
12166 -74054 -205664 21763 -162285 121741 120861 291180 -117246 -77293 126299 -141287 29607
12154 181667 -474244 329169 -192004 135821 -321956 102224 -44268 119940 -90776 130320
12143 -52236 134010 239088 253652 -22827 -119788 41181 463432 -161926 -236297 -155078 -46765
12131 193929 -200478 84217 385 79128 -91155 -123375 174651 155730 80455 -186001 -20760
12119 -170389 -34812 260702 -33348 4591 -48176 210789 -21643 43700 352602 166808 -200265
12107 -86654 92073 -21002 -307340 1196 359186 -16180 155864 -195850 -74021 -119111 275254
12095 62536 202974 -134197 121865 298957 186165 -239959 184026 -257245 -49257 -139791
12085 -139791 319707 87652 176851 -145257 129304 -384013 162571 63188 26644 122677
$$ packed form
12166g4054j31610B1763a62285A21741q80J70319a17246L9953A26299a41287B9607
12154A81667d74244C29169a92004A35821c21956A02224d4268A19940i0776A30320
12143e2236A34010J05078J4564b2827r6961D1181M22251a61926p4371Q1219d6765
12131A93929b00478H4217C85P8743i1155l2220A74651j8921p5275a86001b0760
12119a70389c4812B60702c3348D591d8176B10789b1643D3700L08902A66808b00265
12107h6654I2073b1002k86338A196L57990a6180A55864a95850g4021m5090B75254
12095F2536J40438a34197A21865J77092j12792b39959A84026b57245d9257r0534
12085a39791C19707H7652Q9199a45257A29304c84013A62571F3188B6644R6033
$$ plain form
12075 122677 62989 209429 94986 131430 48610 -337602 -180779 -15727 -106992 144601 27135
12063 17568 74317 -114356 84709 -13501 -292691 -144191 -3155 -290325 244575 135442 -186987
12051 -11114 160724 -153298 266268 -152357 -170353 -21162 97966 -101301 -252856 -43755
12040 26308 -184917 -348958 -33462 305279 -28421 628 180032 -240183 6518 -46442 -170041
12029 -170041 360339 -100666 -291175 30395 153033 -192290 -42622 -42167 45511 -199352 130952
12017 -132538 -3703 128881 -18331 -158853 107274 -216846 68125 -524044 -148534 -88914
12007 -88914 -9398 -7609 -113260 -48899 -107234 217641 -149171 -255985 184612 -144266 -293238
11996 -293238 7712 -250698 -394294 61794 -245160 116213 311 106603 223849 -51963 -218907
$$ packed form
12075A22677n9688J46440I4986L6444D8610c37602J56823a5727r1265A44601B7135
12063A7568N6749a14356H4709a3501k79190a44191c155k87170B44575j09133a86987
12051a1114A60724a53298B66268a52357j7996b1162I7966a01301j51555d3755
12040B6308a84917j64041c3462C05279b8421F28J79404b40183F518d6442j23599
12029a70041C60339a00666j90509C0395J22638a92290d2622M55D5511a99352A30952
12017a32538c703A28881a8331j40522A07274b16846F8125e24044a48534N9620
12007h8914i398J789j05651d8899n8335B17641a49171j06814A84612a44266j48972
11996b93238G712b50698j43596F1794b45160A16213C11J06292J17246e1963j66944
$$ plain form
11985 -218907 -274304 -68704 10470 167630 66610 86957 11161 -220391 66206 -141900 100716
11973 -7649 113814 210273 -40216 -83028 -192320 -234119 126874 -6594 -96291 144338 -176799
11961 175874 27527 -65441 -171957 -14640 64421 -140820 -201562 97475 -59677 25812 82844
11950 82844 248195 -118142 -274250 46032 146764 108775 -108550 -155498 -232655 -130028
11940 -130028 -180053 13863 -354552 -154217 -316418 -131783 -68380 -73390 -35090 -92255 13776
11928 99538 36564 214872 45949 99796 66749 -304104 -975 -91135 -203494 47062 151393
11917 151393 -291139 -161992 379809 96405 109756 -41964 -125953 33288 -257731 -231146 -61943
11905 -285815 -174345 -66783 93332 -150267 192384 193386 108831 -78878 -297469 203059 -40046
$$ packed form
11985b18907n5397f8704A0470J57160F6610K0347A1161b20391F6206a41900A00716
11973g649A13814R6459d0216m2812j09292m1799A26874f594q9697A44338a76799
11961A75874B7527f5441j06516a4640F4421a40820o0742I7475e9677B5812N7032
11950H2844J65351a18142j56108D6032J00732l7989a08550m6948p7157J02627
11940a30028n0025A3863c54552a54217j62201a31783O3403n010c5090n7165A3776
11928I9538C6564J78308D5949N3847l3047c04104i75r0160j12359D7062J04331
11917A51393b91139J29147C79809I6405J3351d1964q3989C3288b57731K6585f1943
11905b85815J11470f6783I3332a50267A92384J002q4555g8878k18591B03059d0046
$$ plain form
11893 -188005 -277069 279230 68495 -169831 -178505 43250 40853 -27619 222751 66741 -98444
11881 50508 35121 104819 -133091 -69022 -164748 -68992 71909 -27064 -170085 -121479 -289308
11870 -289308 323880 2214 -286171 -30084 -200017 -93006 -53908 -139651 -95470 -48398 -132514
11859 -132514 -141425 78938 -42369 -183660 -4677 -166590 105824 -279164 -152161 225820 113254
11848 113254 58852 15682 212954 48880 70017 123785 -81483 -142287 158178 -97706 -112275
11837 -112275 -217460 107344 263885 -181368 21096 219459 -101680 -432413 73419 -40587
11826 -149520 203604 -71742 -195496 103615 118706 -84858 164592 -158358 -189841 143687
11815 163464 435247 -54286 77523 -63999 159570 6906 -176820 157311 99277 -163673 117613
$$ packed form
11893a88005q9064B79230F8495a69831q674D3250k397b7619B22751F6741i8444
11881E0508j5387O9698a33091O4069r5726f8992G1909b7064j43021M8606j67829
11870b89308C23880B214b86171c0084j69933i3006L9098q5743M4181M7072q4116
11859a32514q911G8938d2369j41291d677j61913A05824b79164J27003B25820j12566
11848A13254n4402A5682J97272D8880K1137N3768h1483o0804A58178i7706j4569
11837a12275j05185A07344J56541a81368B1096J98363a01680l30733G3419d0587
11826a49520B03604g1742j23754A03615J5091h4858A64592a58358l1483A43687
11815A63464K71783e4286G7523f3999A59570F906a76820A57311n8034a63673A17613
$$ plain form
11803 -355273 -173142 -112509 95891 87670 315138 6093 -156453 -138461 -121441 82102 13111
11791 -132306 -24928 -134798 -245640 8186 -3329 75698 101824 -142407 -211402 -158189 -90051
11780 -90051 -384272 -102675 87509 -9917 20022 8546 184491 -262687 -429776 -21623 -246245
11769 -246245 -206999 -187010 -202545 -41643 41317 -234964 -140359 -34450 -81848 -98627 -20935
11757 99322 448746 355109 -34335 -115035 74364 -432215 -24698 52221 -383808 -135726 -146088
11746 -146088 35966 15495 26660 -140259 349935 47117 -195051 109234 120550 105271 100678
11735 100678 20728 -206014 -5014 131711 -92493 380495 243925 13720 -102391 -405148
11725 -405148 26522 12509 -2307 -270957 -118069 -36701 -255358 -299361 -291442 154524 -84756
$$ packed form
11803c55273a73142O0633I5891q221K27468F093a56453J7992J7020H2102A3111
11791a32306b4928j09870j10842H186c329G5698K6126a42407o8995N3213O8138
11780i0051k94221a02675H7509i917B0022H546J75945b62687j67089b1623k24622
11769b46245L9246J9989j5535d1643D1317b34964R4605c4450m7398j6779b0935
11757I9322L49424r3637c4335q0700G4364d32215b4698E2221c83808a35726j0362
11746a46088C5966A5495J1165a40259C49935D7117a95051A09234J1316j5279m593
11735A00678B0728b06014e014A31711i2493C80495j36570A3720a02391l02757
11725d05148B6522A2509b307k68650a18069c6701k18657m4003P919A54524h4756
$$ plain form
11713 80269 54166 -109276 -8140 -366421 -138426 86438 23949 -156949 213273 -130199 9351
11701 -32844 39941 -89586 88370 -409095 19905 -151649 -203751 -24776 169910 -115348 -130389
11690 -130389 -291804 -8193 18032 -122471 -136850 -6998 -229496 -12573 -170817 114155 -108402
11678 38880 117636 185091 -28595 181422 21197 -109646 63726 186857 102218 -31705 -20261
11667 -20261 -147644 162416 287745 -271669 93432 226197 -345567 174722 150046 -85084
11656 -99777 -144261 -102960 83611 -304481 -39265 -91324 94480 -105797 -55945 102093 106356
11645 106356 11178 71066 167523 132 150008 -118368 53909 87178 -52259 188244 58603
11633 128779 21768 113016 578920 -136631 51980 86457 -14866 -56953 209376 254747 -9744
$$ packed form
11713H0269k6103a09276h140l58281a38426H6438B3949a56949B13273a30199I351
11701c2844C9941h9586H8370d09095A9905a51649n2102b4776A69910a15348j5041
11690a30389j61415h193A8032a22471j4379f998k22498a2573j58244A14155a08402
11678C8880P8756O7455b8595A81422B1197a09646F3726J23131q4639c1705J1444
11667b0261j27383A62416J25329b71669I3432J32765c45567A74722k4676h5084
11656i9777m4484M1301H3611c04481c9265n2059I4480a05797M9852A02093M263
11645A06356A1178N9888R6457A32J49876a18368E3909L3269e2259A88244E8603
11633A28779B1768R1248M65904a36631E1980L4477a4866m2087B09376M5371i744
$$ plain form
11621 127805 -142347 187032 111170 59574 -191657 -299119 -2329 -294167 -98505 -116226 -59139
11610 -59139 20405 108057 144021 95454 7739 19202 -117576 -66225 -353739 -209039 -49946
11598 -93732 378935 129427 83991 -135417 7715 -35920 -6593 111038 47143 155196 106752
11587 106752 452997 -41180 -331151 -149452 262747 101540 -244395 64672 -142632 186511
11576 -68429 -281163 -64886 157326 5493 -38450 -150107 -113927 -8518 -139348 -32191 33174
11564 -103460 175785 38221 253828 142228 -63070 1310 -17151 -157671 108064 -18885 62199
11552 19154 183910 -13024 -442836 -57796 -214964 238631 24779 128482 -216832 -29458
11541 66904 8920 77669 12116 78482 249118 -145361 51248 -221823 -45923 205867 -2441
$$ packed form
11621A27805a42347A87032p5862n1596a91657j07462b329k91838i8505j7721N7087
11610e9139B0405Q7652L5964m8567G739J1463a17576N1351k87514J44700d9946
11598i3732C78935A29427m5436a35417G715c5920f593A11038D7143J08053m8444
11587A06752L46245d1180k89971a49452B62747A01540b44395F4672a42632A86511
11576f8429k12734f4886A57326E493c8450j11657L6180h518j30830c2191C3174
11564a03460A75785C8221K15607j11600f3070A310a7151j40520A08064a8885F2199
11552A9154J64756a3024m29812e7796j57168B38631B4779J03703b16832b9458
11541F6904H920O8749A2116O6366J70636a45361E1248b21823d5923B05867b441
$$ plain form
11529 -114629 439148 -103645 -54477 7383 -63143 290687 55553 155324 64776 -29089 86636
11517 89051 -9175 468491 -209266 428332 54516 37801 -354196 18566 -22694 -83669 202472
11505 32244 -61622 105474 -138816 244218 -126809 -53076 -76140 45824 213174 135047 170727
11494 170727 122191 193270 -367763 131597 191802 160629 120177 82312 55579 111610 269360
11483 269360 253516 -157803 -73718 -185063 -41079 -226910 105161 -26073 148750 341654
11473 341654 64199 3490 248170 24602 172122 -4119 14989 15186 9136 471271 -98582 -30172
11460 36890 238058 154470 309043 -425854 26116 83132 113164 152616 -156314 162911 -78117
11448 159282 14294 208688 -445452 -18103 -375062 -76803 -54216 334014 9536 71728 -216030
$$ packed form
11529a14629D39148a03645M9168G383f3143B90687E5553R9771F4776b9089H6636
11517H9051i175D68491b09266D28332E4516j6715c54196A8566b2694o0975B02472
11505C2244f1622A05474a38816B44218a26809e3076k3064D5824J67350p8127L5680
11494A70727m8536P1079c67763A31597O0205l1173m0452l7865k6733N6031J57750
11483B69360j5844a57803g3718j11345d1079j85831A05161b6073A48750J92904
11473C41654F4199C490K44680B4602J47520d119A4989J97o050M62135i8582c0172
11460C6890K01168q3588J54573d25854B6116N7016L0032L9452a56314A62911g8117
11448A59282A4294J94394d45452a8103l56959g6803K2587C34014I536O2192b16030
$$ plain form
11436 100515 469024 -50173 -260608 183883 -51664 182792 27781 101266 1527 69599 229106
11425 229106 186545 -132382 86367 -136772 30064 184189 -180474 94948 -89257 -167153 183097
11413 88301 169558 -335363 85829 -330924 -90962 -61876 -160735 78468 117693 69572 -198394
11401 -17889 -66793 18162 -364524 24357 29780 32412 131382 -334399 61930 -133213 -223443
11390 -223443 -212326 42692 93194 -191803 -71679 -36249 -23770 11419 -23064 -54872 36598
11378 -165666 -150596 51005 -96192 -157735 188231 -51629 87861 -286693 -15746 -129507 19550
11366 -73374 -455674 -245759 4562 118650 11379 240671 79388 162104 -113067 -211033 -279906
11355 -279906 -109523 -344291 191286 -13853 -10056 -30866 333474 -107353 -158351 269407
$$ packed form
11436A00515L68509e0173k10435A83883e1664A82792B7781P3485A527O8072J59507
11425B29106m2561a32382H6367a36772C0064J54125a80474I4948h9257p7896A83097
11413H8301Q1257c35363H5829c30924i0962K9086r8859G8468L9225m8121a98394
11401a7889m8904A8162c64524B4357N423K632R8970c34399F1930a33213r0230
11390b23443J1117D2692N0502a91803g1679L5430J2479A1419b3064l1808C6598
11378a65666J5070E1005i6192o1543A88231e1629H7861b86693a5746j13761A9550
11366g3374l82300K09915D562J14088A1379K29292G9388Q2716a13067r7966o8873
11355b79906a09523k34768A91286a3853L797k0810C33474a07353n0998B69407
$$ plain form
11344 -272045 -38028 -114307 163994 139406 144688 6239 66946 -51315 -282963 -96874 -191303
11333 -191303 150672 223352 54237 23859 -287712 -45075 -217739 70772 -347233 -113657
11322 -133583 173430 107829 -266719 93711 -264464 -63921 -44402 -73669 -20877 -190338 -30039
11310 7146 -192065 -15360 -316619 -287817 -125662 15144 -22324 -114047 -356657 -445394 77227
11298 -125212 67445 -140539 -124600 -68724 41931 158497 -164604 181243 -153153 220205
11287 154655 299848 -128373 117393 18202 -360170 -72978 56086 -388060 143737 62209
11276 31199 154882 139204 334524 -246971 235964 34520 -9442 -151587 -36291 87453 77062
11265 77062 -120624 -352146 -113816 -100653 -97191 -136875 296027 108736 181393 170122 -229614
$$ packed form
11344b72045c8028p6279A63994k4588N282F239O0707e1315k31648i6874r4429
11333a91303A50672P2680E4237B3859b87712d5075j72664G0772c47233a13657
11322a33583A73430o5601b66719I3711b64464f3921J9519k9267b0877j69461c0039
11310G146a92065a5360l01259K8802a25662A5144b2324r1723k42610q8737G7227
11298a25212F7445a40539J5939N5876D1931J16566a64604A81243a53153B20205
11287A54655J45193a28373A17393A8202c60170g2978E6086c88060A43737F2209
11276C1199J23683j5678J95320b46971B35964C4520i442j42145c6291H7453j0391
11265G7062a20624k31522a13816J3163L462l9684B96027A08736P2657j1271b29614
$$ plain form
11253 26311 156440 -100491 32511 21881 -142189 251052 150880 -289108 33407 134312
11243 134312 -177567 -101587 -57383 124083 35023 -73583 -53730 -82999 -128386 24492 143048
11232 143048 88917 -96161 -68152 -67202 209738 -68162 68841 93117 -115910 127297 -117678
11220 -504402 -32475 72905 -118353 -58149 -97789 85924 -26309 -316402 35937 -80883 -5613
11208 27192 11411 -270209 -105377 169593 -112530 77555 -75797 -211098 180169 -128006
11197 -306476 -343782 132758 46366 -109333 28540 136379 54399 96924 225549 -69210 -159820
11186 -159820 240699 151859 -26073 -120819 -185219 63288 -22675 12641 -39813 -131600 -399939
11175 -399939 104640 139301 -56336 -245334 -376579 280552 -46919 -112946 23693 120723 -177381
$$ packed form
11253B6311J30129a00491C2511j0630a42189B51052j00172b89108C3407J00905
11243A34312a77567P5980M4204A24083C5023g3583J9853k9269m5387B4492J18556
11232A43048n4131i6161K8009R50B09738f8162F8841K4276a15910A27297a17678
11220e04402c2475G2905a18353e8149l9640H5924b6309k90093C5937h0883e613
11208B7192A1411b70209a05377A69593a12530G7555g5797j35301A80169a28006
11197c06476l7306A32758D6366a09333B8540J07839E4399M2525J28625f9210r0610
11186a59820B40699q8840b6073r4746o4400F3288b2675A2641c9813r1787k68339
11175c99939A04640L4661e6336j88998j31245B80552d6919o6027B3693R7030a77381
$$ plain form
11163 -177334 -126457 19599 -253555 -97710 59181 -191612 64646 32836 -75630 -163966 48439
11151 -95382 169222 155977 -64248 382762 51070 -226784 236592 -247112 4092 -129586 -32063
11139 -313819 2998 64324 276041 -18557 -150739 134701 -248569 358871 17881 -234255
11128 -283590 -161252 -185216 166533 -164509 -498305 77574 281208 -471881 -69149 351361
11117 -285436 -300068 91742 328928 273603 95859 171806 102707 -1153 13719 -119408 174004
11105 208422 85364 -25736 255242 219285 11187 -126820 84357 103883 16575 302810 227085
11094 227085 60513 344875 44360 66065 286793 58674 9314 114541 -84895 251321 325877
11083 325877 118105 50873 158728 60253 11715 91819 268016 305658 60887 119109 154224
$$ packed form
11163a77334N0877A9599b53555i7710E9181a91612F4646l1810g5630q8336D8439
11151i5382A69222j3245f4248C82762E1070b26784B36592b47112D092a29586c2063
11139c13819B998O1326K11717a8557j32182A34701b48569C58871A7881b34255
11128b83590J22338k3964A66533a64509l33796G7574K03634d71881f9149C51361
11117b85436j4632I1742K37186n5325I5859P5947o9099a153A3719a19408A74004
11105B08422H5364b5736B55242l5957A1187a26820H4357J9526A6575K86235p5725
11094B27085F0513K84362D4360K1705K20728E8674I314J05227h4895B51321P4556
11083C25877A18105E0873J07855F0253A1715Q0104J76197L7642F0887N8222L5115
$$ plain form
11072 154224 147838 135546 101769 66645 357134 52805 59594 129314 141892 -2424 204675 434971
11060 434971 338566 135689 414823 373280 287320 248511 360169 111148 584425 422646
11050 422646 551235 208595 525274 654849 240012 445948 343042 501727 432229 689904
11040 689904 411754 184421 7774 460394 348021 597876 360296 667244 351951 235186
11030 235186 522343 416375 534396 348710 495205 394350 346432 524403 299688 387755
11020 387755 246594 480072 334610 341669 667524 112150 421836 245001 133982 439580
11010 439580 224131 154494 84616 299654 86710 282047 418839 179666 134877 23476
10999 349448 185357 240517 367133 535047 206209 414781 216707 555014 75122 435978
$$ packed form
11072A54224o386j2292l3777l5124K90489E2805O789O9720J2578b424B04675K30296
11060D34971r6405A35689K79134m1543q5960l8809J11658A11148M73277j61779
11050D22646J28589B08595L16679J29575B40012K05936j02906J58685o9498K57675
11040F89904k78150A84421G774M52620j12373K49855k37580L06948l15293j16765
11030B35186K87157j05968J18021j85686J46495j00855m7918J77971k24715Q8067
11020C87755j41161K33478j45462P059L25855A12150L09686j76835j11019L05598
11010D39580k15449o9637o9878K15038H6710J95337J36792A79666m4789B3476
10999C49448j64091N5160J26616J67914B06209K08572j98074L38307G5122L60856
$$ plain form
10989 435978 705101 520025 152328 337728 370352 733189 785603 406055 677425 918130
10979 918130 489020 721551 888720 1063148 1215237 1074212 1321315 1403333 1563104 1279224
10969 1279224 1356553 1837630 1312962 1377935 1104423 1082150 924735 1033583 765032 887385
10959 887385 911164 1161684 1245411 1028722 841228 1023578 765837 593325 664875 379796
10949 379796 331923 468002 217866 -139181 294890 -36112 145058 100433 205113 350140
10939 350140 166537 186099 -168941 -29356 -130723 301649 -108437 660 -178494 324938
10928 273841 -27867 -134250 -184091 -103369 -157127 -8447 57901 36735 243475 -145899 31168
10916 196596 -159663 -167465 98418 -120433 114099 234901 -305433 343909 35915 -152427
$$ packed form
10989D35978K69123j85076A52328J85400L2624L62837N2414l79548K71370K40705
10979I18130m29110K32531J67169J74428J52089j41025K47103Q2018J59771k83880
10969A279224P7329M81077n24668O4973k73512k2273j57415J08848k68551J22353
10959H87385K3779K50520Q3727k16689j87494J82350k57741j72512P1550k85079
10949C79796m7873J36079B17866a39181B94890c6112A45058m4625J04680J45027
10939C50140A66537J9562a68941b9356j01367C01649a08437F60a78494C24938
10928B73841b7867j06383m9841Q0722n3758h447E7901k1166K06740a45899C1168
10916A96596a59663p802I8418a20433A14099J20802c05433C43909C5915a52427
$$ plain form
10905 4749 -73253 38306 84246 72835 35585 -286739 159915 61749 177624 -202156 -93625
10893 84620 70968 213293 73112 -54601 185287 -17919 -23174 85089 -183866 -561724 115358
10881 -32620 -232116 -175972 158882 -71143 274283 -199275 -22135 104469 179522 133441 -136090
10869 41847 -198826 -11982 -61627 -119346 -163162 127984 -259869 -219014 120175 216115 -65385
10857 -77726 -162601 -52293 75848 46071 -120124 -10064 -106558 -193308 -37456 127685 -152662
10845 85842 -300649 90077 -352697 -15020 -159 35065 -34479 -164918 -134724 -37867 -311441
10834 -311441 126565 -91240 95194 -30672 -244255 -45871 138898 258383 -162106 56212
10823 376169 10176 55050 -86624 -337070 54729 8637 -47123 122729 150185 -329443 -250360
$$ packed form
10905D749g3253C8306M5940j1411C5585b86739A59915F1749J15875b02156i3625
10893H4620j3652J42325G3112e4601A85287a7919n255H5089a83866l77858A15358
10881c2620j99496N6144A58882g1143B74283a99275b2135A04469P5053m6081a36090
10869D1847a98826a1982m9645n7719m3816A27984b59869M0855A20175R5940f5385
10857g7726q4875e2293G5848k9777a20124a0064r6494q6750c7456A27685a52662
10845H5842c00649I0077c52697a5020a59C5065c4479j30439L0194c7867k73574
10834c11441A26565i1240I5194c0672k13583d5871A38898J19485a62106E6212
10823C76169A0176M4874h6624k50446E4729H637d7123A22729K7456c29443P9083
$$ plain form
10812 -250360 205350 -179208 -257537 68019 -514746 -303403 -120217 74148 -225171 -37799
10801 -341093 -249677 -274828 162035 -84857 -109255 199939 83505 -79660 110332 -38012 188094
10789 15815 83859 -61852 33493 -149887 -5465 -248448 98850 -274036 -219217 22065 -200280
10777 -415844 34389 148601 56972 -153648 57994 -90222 35455 -62868 -120282 -1642 240259
10765 -71041 -225385 39502 -375470 56636 -110050 -105641 -242585 -56222 -7596 238091 -33437
10753 398655 59088 50357 -61285 -289055 -68073 -46060 -428656 215847 140436 -210020 -225976
10742 -225976 88790 -38578 130579 53967 -340113 203857 111792 114643 -125131 -149890 24060
10730 128350 161470 -231106 109991 -57443 132254 -180112 69681 130659 -102215 -288980
$$ packed form
10812b50360B05350a79208p8329F8019e14746K11343a20217G4148b25171c7799
10801c41093R1416k5151A62035h4857k4398A99939H3505g9660A10332c8012A88094
10789A5815O8044f1852C3493a49887e465k42983I8850b74036N4819B2065b00280
10777d15844C4389J14212E6972a53648E7994i0222C5455f2868n7414a642B40259
10765g1041j54344C9502c75470E6636a10050M409j36944e6222g596B38091c3437
10753C98655E9088q731f1285k27770f8073K2013l82596B15847p5411b10020j5956
10742b25976H8790c8578A30579E3967c40113B03857r2065K851a25131k4759B4060
10730A28350L3120b31106A09991e7443A32254a80112F9681O0978a02215j86765
$$ plain form
10720 -288980 -35232 -237570 -25176 79492 51117 -357899 35398 -82033 -376795 101815 -141401
10708 -137331 349354 -70969 -131296 102706 32087 9625 219749 -330306 -21102 -525407 79659
10696 257033 -133932 -242988 -157506 -147226 238323 -198424 29990 -291336 108174 253454
10686 253454 306253 -198270 -148794 109190 20397 -291802 -82182 -5497 90296 16437 -45923
10674 -257494 27870 -8690 80429 -207583 -312732 -233905 -307503 -236950 69707 58159 -185179
10662 163412 220024 -181104 223573 69842 -63809 -145072 -197711 71370 -67732 -195802 -17079
10650 -25023 19675 3111 -43204 205876 -406463 -215140 153443 -192871 -91345 -146813 158359
10638 -126750 415663 -44887 -119115 152368 -144857 -80336 -61984 269792 -79615 -191524
$$ packed form
10720b88980c5232k02338b5176G9492k8375c57899C5398h2033k94762A01815a41401
10708a37331C49354g0969o0327A02706C2087I625K10124c30306b1102n04305G9659
10696B57033a33932j09056Q5482J0280B38323a98424B9990b91336A08174J45280
10686B53454N2799a98270M9476A09190B0397b91802h2182e497I0296A6437d5923
10674b57494B7870h690H0429b07583j05149P8827p3598P0553F9707j1548a85179
10662A63412N6612a81104B23573F9842f3809q1263n2639G1370f7732j28070a7079
10650b5023A9675C111d3204B05876d06463J91323A53443a92871i1345n5468A58359
10638a26750D15663d4887p4228A52368a44857O4521J8352B69792g9615j11909
$$ plain form
10628 -191524 -95954 52683 156979 -108860 274509 10080 -328643 -141991 -123671 30624
10617 78780 153751 89464 64812 -352172 -50662 -205156 -48059 65995 -45822 -99667 -91039
10606 -91039 -362037 -494874 -22608 -203791 7696 -276052 -86717 -464108 108568 60891 8373
10594 57731 230189 126835 -87707 125101 -292253 50161 -217452 -96023 64048 -303701
10583 16408 85978 109521 -253281 133716 18389 134445 -120342 178639 -223232 169435
10572 -120046 159638 -109170 157028 -235142 281534 13183 -64853 -153671 -298124 -10492
10561 163437 183785 70307 -479123 182454 32544 316795 172760 55058 6184 -120965 -144519
10550 -144519 137006 -162247 290384 -6342 -85432 115290 -158431 -193057 -503076 -278985
$$ packed form
10628a91524R5570E2683J04296a08860B74509A0080c28643a41991J8320C0624
10617G8780P4971o4287k4652c52172e0662j54494d8059F5995d5822n3845Q628
10606i1039k70998j32837b2608j81183G696b76052h6717l77391A08568m7677H373
10594E7731J72458j03354h7707A25101b92253E0161b17452i6023F4048c03701
10583A6408O9570K3543b53281A33716A8389J16056a20342A78639b23232A69435
10572a20046A59638a09170A57028b35142B81534A3183f4853q8818j44453a0492
10561A63437K0348G0307d79123A82454C2544K84251j44035E5058F184a20965k3554
10550a44519A37006a62247B90384f342p9090A15290a58431l4626l10019K24091
$$ plain form
10540 -278985 107496 -63284 275123 159893 -4960 -258563 -146643 -37669 234142 -105679
10529 -207798 -234924 311190 -148493 94294 -69202 309792 287072 -366269 95420 -197342
10518 78601 -52485 10012 -203935 -277972 -206691 -213568 -64569 -69959 -116999 89642 -254544 -50465
10505 143997 -145074 132832 -323793 -85522 -46944 283325 106405 66670 58832 53794 123837
10494 123837 126847 -145605 -186029 43034 -83290 3203 131231 -25475 106404 80814 -192700
10482 65976 55332 324763 37407 79005 -235239 26563 5277 -69474 -180957 -114540 -255996
10471 -255996 -173041 13684 79257 153680 -126287 52634 234517 -24161 137636 -49274 -8754
10459 -192212 3840 -65215 56953 34219 71340 -321031 123562 96661 -58313 175457 -4423
$$ packed form
10540b78985A07496f3284B75123j15230d960k53603J11920c7669B34142a05679
10529b07798k7126C11190a48493I4294f9202C09792k2720c66269I5420a97342
10518G8601e2485A0012b03935p4037P1281o877f4569n390m7040H9642b54544e0465
10505A43997a45074A32832c23793h5522L8578B83325A06405l9735p838n038P0043
10494A23837L010a45605m0424D3034h3290C203J28028b5475A06404k5590a92700
10482F5976j0644K69431C7407M1598b35239B6563E277f9474j11483O6417j41456
10471b55996Q2955A3684O5573P4423a26287E2634J81883b4161A37636d9274h754
10459a92212C840f5215E6953k2734L7121c21031A23562k6901e8313A75457d423
$$ plain form
10447 -120828 -275601 -7534 51401 -148228 51815 -178371 196207 47832 -165432 78266 -321671
10435 5662 87604 73876 -209911 -268966 -61547 -23743 -70076 98038 -389392 -75348 -268080
10424 -268080 -239595 -66177 -283965 172470 -32742 144028 -137564 -71609 -52275 -134498 -7411
10412 -144057 21015 371934 -48025 -137160 136264 -519886 -86598 22133 -171304 -101771 -45362
10400 257703 -257397 -188756 -128087 -37402 81368 153555 25550 513786 122115 -109933 225531
10388 153733 -81146 -150349 64407 -44723 264298 272038 -228890 35156 1777 87564 433023
10377 433023 -256118 -161607 112757 395540 -187902 -146209 219055 -89175 186603 199372
10367 199372 87550 586764 231964 -6746 291954 209284 10406 104469 317570 356670 -237237
$$ packed form
10447a20828j54773g534E1401a48228E1815a78371A96207D7832a65432G8266c21671
10435E662Q1942j3728b09911n9055f1547b3743m6333I8038c89392g5348j92732
10424b68080K8485f6177k17788A72470c2742A44028a37564O5955J9334q2223g411
10412a44057B1015L50919d8025q9135A36264e19886h6598B2133a71304O9533d5362
10400B57703b57397O8641O0669c7402H1368P2187B5550M88236A22115a09933B25531
10388A53733h1146o9203F4407d4723B64298P740b28890C5156A777Q5787L45459
10377D33023b56118R4511A12757K82783a87902M1693B19055h9175A86603J2769
10367A99372H7550M99214B31964f746B91954q2670A0406R4063K13101L9100b37237
$$ plain form
10355 130549 -69016 -147685 185445 184561 348836 397203 -40138 292676 176986 236921 297034
10344 297034 395409 185028 240685 350518 117153 251641 54109 197895 145309 13320
10333 265703 102194 200755 151112 43346 104144 207044 -41040 186507 173804 22598 411589
10322 411589 137697 -130247 276702 -44254 134413 220786 322748 -209027 -84635 -55005
10312 -55005 137948 93623 -145008 -271699 10920 -20085 180596 -259593 200439 120372
10302 120372 31210 -257693 -74619 34652 -222602 -128730 -16570 163000 171561 -141421 -2352
10290 -2168 -29268 -144491 -83516 -25775 -216628 92981 -157086 -206000 -296679 100252 41547
10278 -17953 -130030 90340 -275923 113092 87750 -1568 -193330 -138074 -191239 -104423 75953
$$ packed form
10355A30549f9016p8669A85445q84J64275M8367d0138B92676j15690N9935O0113
10344B97034R8375A85028N5657J09833A17153J34488E4109J43786n2586A3320
10333B65703A02194R8561m9643D3346O0798J02900d1040A86507j2703B2598L88991
10322D11589A37697a30247B76702d4254A34413Q6373J01962b09027h4635K9630
10312e5005A37948m4325a45008j26691A0920b0085A80596b59593B00439q0067
10302A20372C1210b57693g4619C4652b22602R3872a6570A63000Q561a41421b352
10290b168k7100j15223O0975b5775j90853I2981a57086m8914r0679A00252D1547
10278a7953j12077I0340b75923A13092k5342a568j91762N5256n3165Q6816G5953
$$ plain form
10266 326112 43521 118196 259262 -277954 254440 79279 219449 160149 257041 13045 -14685
10254 508827 -18874 -140550 115082 -210066 193362 -9157 -98711 131226 69726 92108 -74070
10242 -42124 302336 -114763 18594 -165548 -211579 114689 201120 89631 -38389 -285882 166521
10230 113163 -193130 -237568 -116939 138971 -337135 -243254 -31214 -273141 177273 -158507
10219 148149 -88937 -223954 -71588 499742 16121 -48413 72443 11426 204560 -149264 -6666
10207 -348432 77672 -300119 59679 -35913 113744 -124881 -208598 963 -175489 -94419 -127830
10196 -127830 -19119 153859 -26106 -106438 -65630 -77432 -157888 -77733 -246503 -29558 -218130
10185 -218130 5004 -35304 -94915 4534 164882 64930 5249 -121067 -162619 58749 -244708
$$ packed form
10266C26112D3521P4675J41066b77954B54440G9279J40170n9300R6892A3045a4685
10254E08827a8874j21676A15082b10066A93362i157q9554A31226o1500K2382g4070
10242d2124C02336a14763A8594a65548m6031A14689Q6431H9631c8389k47493A66521
10230A13163a93130m4438a16939A38971c37135R3881c1214k41927A77273a58507
10219A48149h8937j35017g1588D99742A6121d8413G2443A1426J93134a49264f666
10207c48432G7672c00119E9679c5913A13744a24881q3717I63a75489Q1070l3411
10196a27830a9119A53859b6106q0332M0808j1802q0456g7733j68770b9558j88572
10185b18130E004c5304n9611D534J60348F4930E249a21067m1552E8749b44708
$$ plain form
10173 187912 146650 -174345 -332208 -149460 124922 181765 101258 -189662 -43084 23086
10162 97717 -147166 285844 79640 -6448 -563242 201609 -22993 -221664 -40152 -174764 -38182
10150 -277027 -160660 -184328 42883 -244713 -55670 251412 -219269 24348 348733 -178394
10139 4097 301739 -103426 33148 -19394 -192690 -162189 123916 30607 -364084 -140046 46770
10127 -44011 -139471 90580 13500 -51144 -182987 -324119 74948 -2272 -76720 -357831 -49146
10115 -283343 26666 36617 -447437 -367310 -197854 -210337 97591 152905 -213379 123708 -529430
10103 -109825 -165147 -19661 7698 -100401 -124777 67629 -34726 -56437 -8700 -5358 -164401 -420
10090 -78451 94275 190936 -224384 169096 -51220 -298395 66956 644 -229295 46206 153566
$$ packed form
10173A87912m1262a74345j57863a49460A24922N6843q0507a89662d3084B3086
10162I7717a47166B85844G9640f448n56794B01609b2993j98671d0152j34612c8182
10150b77027J16367k3668D2883b44713e5670B51412b19269B4348L24385a78394
10139D097K97642a03426C3148a9394j73296L0501A23916C0607c64084a40046D6770
10127d4011r5460I0580A3500e1144j31843j41132G4948b272p4448k81111d9146
10115b83343B6666R951d47437Q0127J69456j2483I7591N5314b13379A23708e29430
10103a09825n5322a9661G698a00401k4376F7629c4726k1711h700L342j59043d20
10090g8451I4275R6661b24384A69096e1220k47175F6956F44b29295D6206J07360
$$ plain form
10079 153566 183076 320876 -35427 -129480 69341 -37430 -185677 -283582 -161068 37987 84050
10068 84050 -125794 116751 -281040 -341874 -20462 208323 -19191 -2392 -165653 2575 141448
10057 141448 -325023 -229720 -309005 -168659 19948 -101469 -185264 318262 96702 -77992 34671
10045 -103031 -31233 -5786 -273704 -358798 -41740 -86974 92263 132428 -33149 -283587 135947
10033 -6330 -105926 60376 37582 1631 -378029 338 21982 -20261 133824 -17611 -399006 219349
10020 4202 302768 80781 -158230 57555 -448950 -188417 173496 499 -47744 -27262 54213
10008 -321589 -10266 -18641 106954 27323 -291747 269693 -254026 -239262 -67250 36827 -11823
9996 277969 53751 4990 -275781 -50078 217047 -16161 -296176 -138955 283760 -61824 -188794
$$ packed form
10079A53566K9510J37800c5427r4053F9341c7430j48247r7905J22514C7987M6063
10068H4050a25794A16751b81040o0834b0462B08323a9191b392j63261B575J38873
10057A41448c25023R5303p9285J40346A9948a01469q3795C18262I6702g7992C4671
10045a03031c1233e786k67918q5094d1740m5234I2263M0165c3149k50438A35947
10033f330r9596F0376k2794A631c78029C38K1644b0261A33824a7611l81395B19349
10020D202K98566H0781a58230E7555d48950a88417A73496D99d7744K0482E4213
10008c21589a0266q375A06954B7323b91747B69693b54026J4764f7250C6827a1823
9996B77969E3751D990b75781e0078B17047a6161k80015a38955B83760f1824j26970
$$ plain form
9985 -188794 -77345 169394 -121046 134961 0 183702 109246 171730 99706 2583 16983 46531
9973 46531 134683 235514 -43755 97032 130099 -191866 17035 -148912 -6966 30708 -173557
9961 -203661 -97773 65705 -299296 -282529 -242433 85190 7841 36705 -30639 54590 -124231
9949 48561 178556 -241287 9178 64081 115604 -64322 -119220 -224769 -161185 183739 -119698
9937 -88488 -113486 150555 -338240 47885 -25476 -72592 -78228 -94597 -87318 -130449 -217209 109252
9924 -172839 38392 30345 -510243 206187 -400339 -55235 138513 -277893 -509466 -136804
9913 141485 -89793 131497 -198327 15862 226923 27363 247041 105157 106702 171892 62936
9901 -98371 120979 -4468 -231411 -42486 187203 -117687 -214645 -137669 24672 -78670 -119654
$$ packed form
9985a88794g7345A69394a21046A34961@A83702p4456O2484p2024B583J4400K9548
9973D6531Q8152J00831d3755I7032L3067a91866A7035a48912f966C0708a73557
9961b03661i7773F5705b99296J6767M0096H5190G841K8864c0639E4590a24231
9949D8561J29995b41287I178N4903N1523f4322n4898j05549O3584A83739a19698
9937h8488k4998A50555c38240D7885b5476m7116n636j6369P279m3131q6760A09252
9924a72839C8392q047e10243B06187d00339e5235A38513b77893k31573a36804
9913A41485h9793A31497a98327A5862K11061B7363K19678A05157J545O5190F2936
9901i8371A20979d468k26943d2486A87203a17687r6958P6976B4672g8670m0984
$$ plain form
9890 -119654 10451 -252072 -143378 -173160 -348193 220128 156607 41921 26514 179214 -250849
9878 -223986 -108572 176315 -312098 -155349 -456786 -155814 -404984 37618 -287122 50373
9867 -421156 127912 -176513 -4769 -21495 -188674 -53379 -228027 49655 88252 -245642 -1079
9855 -215526 -11432 -295762 50590 71708 -103760 111809 136272 -141796 65262 162731 -59822
9843 137951 -69508 -236603 286181 -137095 202543 -76178 -91820 114893 -47398 -148955
9833 -148955 60018 -341562 81197 -77728 -343586 69768 49008 -284677 -62340 -358899 -19318
9821 -80758 45258 93926 263924 -211291 -225593 -281636 -175819 19707 -75746 228231 -159359
9809 10795 -247628 -45668 152923 73560 89988 3230 -299470 13668 -119529 -207423 -95738
$$ packed form
9890a19654A0451b52072J08694k9782j75033B20128o3521D1921j5407J52700b50849
9878b23986a08572A76315c12098a55349l01437a55814k49170C7618b87122E0373
9867d21156A27912a76513d769j6726j67179e3379j74648D9655L8597b45642a079
9855b15526a1432k84330E0590K1118a03760A11809K4463a41796F5262R7469e9822
9843A37951f9508j67095B86181a37095B02543g6178j5642A14893d7398j01557
9833a48955F0018c41562H1197g7728k65858F9768k0760b84677f2340k96559a9318
9821h0758D5258M8668J69998b11291j4302n6043J05817A9707g5746B28231a59359
9809A0795b47628d5668A52923G3560J6428C230b99470A3668a19529q7894i5738
$$ plain form
9797 -36310 49340 -75349 -110348 -207107 102005 51846 78732 255966 -165451 -127155 -277189
9786 -277189 73476 35477 -13625 -27448 -150501 -141939 148805 -173634 16436 150008 -176443
9774 -88118 -129264 -162822 -501298 41921 61489 16716 -37659 167843 70070 -9057 -232294
9763 -232294 2911 -88347 -475477 38378 -133699 -235035 195475 -24851 -64578 -21915 -214176
9752 -214176 39198 106346 -77761 -289001 -170209 -58421 290561 -252779 96485 186961 26165
9740 77933 -68247 -168920 18555 54031 -96865 220010 148381 -169835 -209619 36056 -274525
9728 18456 163313 -380797 74313 -132334 265131 21737 -124681 -198988 -326245 -105126
9717 -177070 -242455 -202668 -297900 48401 166873 53417 153032 48561 26533 124088 -23339
$$ packed form
9797c6310D9340g5349l4999r6759A02005n0159K6886J77234a65451L8296j50034
9786b77189G3476C5477a3625j3823j23053Q562A48805a73634A6436J33572a76443
9774h8118m1146l3558l38476D1921J9568A6716c7659A67843G0070i057k23237
9763b32294B911h8347l87130C8378a33699j01336A95475b4851l9727b1915j92261
9752b14176C9198O7148g7761k11240J18792e8421B90561b52779I6485R0476B6165
9740G7933f8247j00673A8555L5476i6865B20010p1629a69835l9784C6056b74525
9728A8456J44857c80797G4313a32334B65131B1737a24681p4307j27257a05126
9717a77070o5385L9787r5232D8401J18472E3417R9615D8561k2028R7555b3339
$$ plain form
9705 153790 -162807 -21635 190755 -135858 -157038 193632 232244 -196631 -39184 -25249 80373
9693 -376722 96200 -53077 -150622 -80084 -118140 -63607 296074 -330181 92544 -116844 -211157
9682 -211157 -28979 -69838 -314613 -238047 106091 167438 -160383 -268285 77 -324318 -32699
9670 -31892 -55979 -234477 -13340 31288 -324052 -110634 -243533 -72664 -89627 -143941 101624
9658 -25135 -183579 9272 -178983 -232409 -33720 23973 70636 -168113 -123202 -131239 -79039 13105
9645 -26652 -89786 -36135 -174792 -243674 12231 108586 -139498 153157 -243541 -155737 83714
9633 -273733 -264891 18211 -26990 2430 -66015 234563 -516063 -114237 -89252 99891 -44315
9621 -314577 -145254 -25987 -168907 104607 -93085 172520 -237551 -6842 -186850 -126897 -338994
$$ packed form
9705A53790a62807b1635A90755a35858k1180A93632L8612a96631c9184J3935H0373
9693c76722I6200e3077r7545P0538l8056N4533B96074c30181I2544a16844r4313
9682b11157b8979m0859k44775P6566A06091O1347a60383j07902G7c24318c2699
9670c1892k4087j78498a3340C1288c24052a10634j32899g2664j6963n4314A01624
9658b5135j58444I272a78983n3426c3720B3973M6663a68113M4911q037N2200A3105
9645b6652o3134c6135j38657o8882A2231R6355a39498A53157b43541Q7804H3714
9633b73733Q842A8211b6990B430f6015B34563e16063a14237K4985I9891d4315
9621c14577a45254b5987j42920A04607i3085A72520b37551f842j80008N9953k12097
$$ plain form
9610 -338994 -180349 -61789 48602 -148446 -308314 131136 10730 -66187 -299437 33491 16137
9598 66392 46901 -14508 -278358 -43685 -253274 -118109 9900 78011 -57205 -89223 -90306 73953
9585 -103438 -144308 -27763 -4469 77856 -49118 -264840 426230 616 -98115 23069 137583 73834
9573 73834 -137676 170855 -144727 -208187 8481 191508 -128642 155940 88815 -189618 -88120
9561 -239471 -91860 -51321 -73965 86102 93188 -195285 -104732 -128913 -301451 -66351 381271
9549 -45004 106900 81273 -221214 45425 -253582 -38506 -215244 -90894 -230033 66780 -300206
9537 25917 131487 -142344 7547 33817 55581 -28615 -7746 294015 -27858 -121405 -82762 -198739
9525 -198739 -24438 -212 -239052 47936 -63002 -9035 90495 155230 146403 8465 209446 -67182
$$ packed form
9610c38994J58645f1789D8602a48446j59868A31136A0730f6187k33250C3491A6137
9598F6392j9491a4508k63850d3685k09589a18109I900O8111e7205l2018j083G3953
9585a03438m0870b7763d469G7856d9118k15722D26230F16i8115B3069J14514o3749
9573G3834a37676A70855a44727o3460H481J83027a28642A55940o7125a89618h8120
9561b39471i1860M0539k2644H6102P086a95285R0553k4181j72538f6351C81271
9549d5004A06900k5627b21214D5425b53582c8506j76738i0894j39139F6780c00206
9537B5917J05570a42344G547K6270K1764b8615g746B94015b7858r3547L8643j15977
9525a98739b4438b12k38840D7936f3002i035I0495O4735q827H465K00981f7182
$$ plain form
9512 -7247 -170616 -54857 -27799 -249521 -79437 104623 -43435 -297422 40915 -123184 299447
9500 -317179 226013 186196 -139684 130180 6634 184275 -220422 -139176 29532 -94206 25467
9488 164288 -178052 -54565 -258566 -494382 -303780 -190651 -110924 -343088 -285829 83169
9477 -16019 -205749 230747 -175278 -181325 -79098 -227702 -366102 -251402 -7849 -4859 11203
9465 265 -87955 124540 -20183 16796 23151 -50820 -87561 -132985 -48216 194436 16161 -189528
9452 34609 129897 43103 38854 37579 26137 -81523 -114852 -46781 154556 -2750 15368 -24460
9439 -126681 -395962 -357868 242669 128851 48152 -26277 -207110 162121 109226 88107 -104802
9427 145464 179883 -116988 -56572 -48560 148970 -94168 -234933 -46636 254443 11713 212340
$$ packed form
9512g247j63369e4857K7058k21722g9437A04623d3435k53987D0915a23184B99447
9500c17179B26013l9817a39684A30180F634J77641b20422Q1246B9532i4206B5467
9488A64288a78052e4565k04001k35816J90602J13129P9727k32164N7259H3169
9477a6019j89730B30747a75278o047g9098j48604j38400J14700g849K990A1203
9465B65h7955A24540b0183A6796O355e0820l6741m5424d8216A94436A6161a89528
9452C4609R5288D3103m249j275j1442h1523l3329d6781A54556b750A5368b4460
9439a26681k69281L8094B42669j13818D8152b6277j80833A62121n2895k1119a04802
9427A45464L4419a16988e6572Q012A48970i4168j40765d6636B54443A1713K00627
$$ plain form
9416 212340 46331 215516 -203087 10269 127846 -11166 -58747 20577 186463 -236162 -348886
9405 -348886 -132559 -194731 -28384 255587 -242831 55108 -142260 172493 209112 -15695 383828
9393 -270275 -37759 -79530 -224395 -299295 102346 16521 -162138 177749 2455 61165 -29922
9381 -12481 -73708 101073 184426 -148117 20361 -53821 -118277 -146303 -382388 -129791 -29457
9369 -50856 297699 49462 44914 17715 73841 -55996 -180526 -165904 240837 -139293 -237378
9358 -237378 -141149 -172138 111964 -187680 -108343 -210369 -208906 36244 -51131 160501 -24935
9346 -145164 20358 -262947 278454 51811 -361200 10365 180344 -10558 41266 -100726 -177224
9335 -177224 170629 -249347 -94195 -55577 -93949 19982 -100177 27505 -399524 -71361 147382
$$ packed form
9416B12340D6331J69185b03087A0269J17577a1166m7581B0577J65886b36162j12724
9405c48886a32559o2172b8384B55587b42831E5108a42260A72493L6619a5695C83828
9393b70275c7759m1771j44865p4900A02346A6521a62138A77749B455N8710b9922
9381a2481o1227A01073Q3353a48117B0361e3821o4456k8026k36085a29791b9457
9369e0856B97699D9462m548A7715N6126e5996j24530J4622B40837a39293r8085
9358b37378R6229l0989A11964a87680P9337j02026J463C6244e1131A60501b4935
9346a45164B0358b62947B78454E1811c61200A0365J69979a0558D1266a00726p6498
9335a77224A70629b49347i4195L8618l8372A9982a00177B7505c99524g1361A47382
$$ plain form
9323 81369 252856 -23514 -44688 -320809 -190516 177959 -72178 33922 187285 -91898 74591
9311 -153995 -225265 -233775 -105389 -282594 -132592 -25959 241284 -90580 155221 122745 99841
9300 99841 -176390 -48083 -380204 -70975 150747 270216 -141557 -76772 225718 -228264
9289 113620 -248994 -240543 174549 -151136 77702 30309 -110127 -71643 -144542 -103551 -66192
9278 -66192 61553 -224289 -241047 -4062 54612 -311695 -161142 -254640 43293 -143874 105293
9266 -210572 -54291 -228673 -171526 -255008 53457 -2949 108435 19261 -14951 273603 -144919
9254 -16494 138715 -201309 -5412 13136 224614 -32043 57878 48681 -77406 -167226 -313031
9243 -313031 132822 -178211 -230400 37635 -4009 -166562 37708 133209 -39602 83934 155065
$$ packed form
9323H1369J71487b3514k1174k76121J30293A77959g2178C3922J53363i1898G4591
9311a53995p1270q510a05389j77205a32592b5959B41284i0580A55221l2476k2904
9300I9841a76390d8083l32121g0975A50747J19469a41557O4785B25718b28264
9289A13620b48994Q451A74549a51136G7702C0309a10127L8484p2899M0991L7359
9278f6192F1553b24289j6758d062E4612c11695J50553r3498D3293a43874A05293
9266b10572e4291j74382N7147q3482E3457b949A08435A9261a4951B73603a44919
9254a6494A38715b01309e412A3136K11478c2043E7878r197g7406q9820j45805
9243c13031A32822a78211n2189C7635d009j62553C7708R5501c9602H3934P1131
$$ plain form
9232 155065 -82420 -3064 79808 -94048 -46752 -55787 22791 -651555 162816 -89809 -126993 -167603
9220 -167603 122323 113018 78631 -247834 -37117 403648 -125051 179247 -125006 -42782 -85384
9209 -85384 -219492 76587 -169968 -154074 34623 -103802 -47434 -158500 -63630 205516 -381657
9197 -239531 -403010 41169 24021 62471 30715 55233 -112371 27072 -93766 -134437 -97436
9186 -97436 389502 36196 -80241 145905 -132295 -272660 257993 44507 -194750 -122162 76541
9174 211313 36880 92276 -102100 -241379 -255934 -86655 -96790 -109630 111016 -169824 -76329
9162 -31660 -52995 -134195 163014 -74020 -48835 243661 -113438 -302139 64076 44867 -330691
9150 62667 3567 227187 -45888 179980 46256 170735 -63572 -150894 103526 -142130 177899
$$ packed form
9232A55065h2420c064G9808i4048d6752r035B2791f51555A62816h9809l7184m0610
9220a67603A22323r305l4387b47834c7117D03648a25051A79247a25006d2782m2602
9209h5384j34108G6587a69968J5894C4623a03802d7434j11066f3630B05516c81657
9197b39531j63479D1169j7148L8450C0715K4518a12371B7072i3766m0671L7001
9186i7436C89502C6196h0241A45905a32295j40365B57993D4507a94750P2588G6541
9174B11313C6880N5396a02100j39279j4555h6655j0135j2840A11016a69824g6329
9162c1660k1335q1200A63014g4020K5185B43661a13438j88701F4076j9209c30691
9150F2667C567K23620d5888A79980D6256J24479f3572q7322A03526a42130A77899
$$ plain form
9138 120858 -31354 -23279 -86312 -53250 -206218 11172 -57152 -106442 35542 -259253 58172
9126 -260324 -47646 -248790 -116466 51525 -67765 -78674 -3444 286149 -30892 160419 65945
9114 -25938 -104071 -130290 -2863 -20850 -16666 187473 -91070 106149 -56263 -139246 128892 -104072
9101 2847 -271905 -302814 -95214 -116329 158482 -52157 -125841 -168504 -132700 29496 111890 -153912
9088 -74212 -275728 -248978 143121 -289673 437667 105398 -96235 -69461 24649 -200777 -251153
9077 -251153 124280 191273 -5314 231629 62070 -285833 -298239 -196650 -213057 -19506 -33603
9066 -33603 97021 184665 -215965 96372 59711 -322691 -115250 -31371 -133943 40792 84794
9055 84794 -171214 17211 -388236 -385966 39051 1605 -19551 -445444 -361499 -110447 -94346
$$ packed form
9138A20858c1354Q075o3033L3062j52968A1172e7152m9290C5542b59253E8172
9126b60324d7646k01144a16466E1525f7765j0909c444B86149c0892A60419F5945
9114b5938p8133k6219b863j7987M184A87473i1070A06149e6263q2983A28892a04072
9101B847b71905l0909i5214k1115A58482e2157p3684m2663L5804B9496Q2394a53912
9088g4212k01516K6750A43121b89673D37667A05398i6235K6774B4649b00777n0376
9077b51153A24280O6993e314B31629F2070b85833j2406J01589j6407a9506j4097
9066c3603I7021Q7644b15965I6372l6661c22691a15250c1371j02572D0792M4002
9055H4794a71214A7211c88236K270C9051A605a9551m25893Q3945a10447J6101
$$ plain form
9044 -94346 176835 281263 -195681 -59927 -333229 59729 -86740 -43575 -131603 33198 -327901
9032 -316821 -91270 -385397 71110 -190117 70448 -270856 -171133 56532 -213945 -200280 -5808
9020 163706 126202 -38237 88866 161416 -92235 -19246 171386 -27982 217400 -121348 139081
9008 -92242 -34573 -13588 -173496 -128641 -188445 -192556 12336 32725 -312141 136846 22502
8996 81264 122019 -150062 -128568 213264 41921 -58184 -258054 77688 -173945 -106022 -110210
8985 -110210 7241 -70381 24846 88473 2181 -18154 52345 -31272 -314343 226357 -34752 14780
8972 110 52882 -185951 106918 -257341 -13252 -647 181778 -327152 37954 -218015 257714
8960 -174842 -206269 -95256 -155229 -138275 -42694 139764 -53181 236454 -95599 -131195 -172038
$$ packed form
9044i4346A76835J04428a95681e9927k73302E9729h6740M3165q8028C3198c27901
9032c16821i1270k94127G1110a90117G0448b70856R9723E6532b13945J3665e808
9020A63706l7504c8237H8866P2550i2235a9246A71386b7982B17400a21348A39081
9008i2242c4573a3588j59908M4855n9804m111A2336K0389c12141A36846B2502
8996H1264M0755a50062K1494B13264D1921e8184j99870G7688a73945O7923m188
8985a10210G241g0381B4846O3627B181a8154E2345c1272k83071B26357c4752A4780
8972A10N2772a85951A06918b57341a3252f47A81778c27152C7954b18015B57714
8960a74842l1427i5256n9973J6954d2694A39764e3181B36454i5599l5596m0843
$$ plain form
8949 -172038 226971 -179886 -221001 -152974 -157954 -131216 55642 86835 -103857 -111788 -199449
8938 -199449 -183001 -303881 -120451 125543 247295 268219 39013 33034 -101365 -210812 -129144
8927 -129144 -43709 152643 -151612 308856 975910 2252963 7985624 12487396 3185981
8917 743373 446835 560213 268492 139514 16277 93737 295667 109649 -133698 231811
8906 354941 -214457 75876 -286502 -257736 114275 57592 -54352 45817 -226942 -49832 -32252
8895 -32252 169080 179802 -420102 -360743 -67070 -90960 -116387 -154544 138744 232291 3581
8883 -227389 131348 -19801 -39116 -213777 -64917 196201 77576 -28456 -112644 -51975 -176787
8872 -176787 91339 -491 9649 127965 126027 71304 7286 242399 -81150 -317160 -248352 7472
$$ packed form
8949a72038B26971a79886m1115O8027m980K6738E5642L1193a03857p931q7661
8938a99449J6448j20880a20451A25543J21752K0924C9013n979a01365j09447Q1668
8927a29144d3709A52643a51612C08856O67054J277053N732661M501772C185981
8917G43373k96538J13378B68492j28978A6277P7460K01930A09649a33698B31811
8906C54941b14457G5876b86502K8766A14275n6683e4352D5817b26942d9832J7580
8895c2252A69080J0722d20102N9359f7070k3890k5427l8157A38744R3547C581
8883b27389A31348a9801j9315j74661f4917A96201G7576b8456q4188e1975j24812
8872a76787I1339d91I649J18316j938n4723G286K35113h1150k36010O8808G472
$$ plain form
8859 -52138 105247 9793 282899 -73830 59309 -280291 35043 -4609 53405 -275273 178115
8847 30806 86551 -4543 -5613 -142332 152831 -244447 155227 8445 -100697 -53008 3914 419629
8835 419629 -180548 -231418 67974 -123072 -251304 31285 238578 -13231 -204018 -46595 178756
8823 166 -39315 -324302 -152392 211973 45163 173095 138639 99235 -47626 -171864 92341
8811 197979 -61300 149862 -105415 111097 -106563 148328 -187154 7142 450265 -18239
8800 293352 69788 -427189 -200411 -169834 -60767 -28520 104982 297185 -79818 -106662 119729
$$ packed form
8859e2138A05247I793K73106g3830E9309b80291C5043d609E3405b75273A78115
8847C0806N5745d543j070j36719A52831b44447A55227H445a00697M7689C914M15715
8835D19629a80548n0870F7974a23072j28232C1285K07293a3231j90787d6595A78756
8823A66c9315k84987a52392B11973D5163J27932l4456l9404d7626j24238I2341
8811A97979f1300A49862a05415A11097a06563A48328a87154G142M43123a8239
8800B93352F9788d27189b00411L0577f0767b8520A04982J92203g9818k6844A19729
$$ [...]
##END NTUPLES=NMR SPECTRUM
##END=
