##TITLE=NES1071_159122.0002_001_9705654_qWYHiq8yM4
##JCAMPDX= 6.0         $$ Bruker NMR JCAMP-DX V2.0
##DATA TYPE= NMR SPECTRUM
##DATA CLASS= NTUPLES
##ORIGIN= BRUKER
##OWNER= Administrator
$$ 1.72 TOPSPIN		Version 2.1
$$ 2016-05-01 13:42:11.286 -0700  Administrator@X
$$ Compression mode = diff/dup
##.OBSERVE FREQUENCY= 400.02188249412
##.OBSERVE NUCLEUS= ^1H
##.ACQUISITION MODE= SIMULTANEOUS (DQD)
##.ACQUISITION SCHEME= undefined
##.AVERAGES= 64
##.DIGITISER RES= 22
##SPECTROMETER/DATA SYSTEM= spect
##.PULSE SEQUENCE= noesygpps1d.comp
##.SOLVENT NAME= COFFEE_meoh
##.SHIFT REFERENCE= INTERNAL, COFFEE_meoh, 1, 14.96157
##AUDIT TRAIL= $$ (NUMBER, WHEN, WHO, WHERE, PROCESS, VERSION, WHAT)
$$ ##TITLE= Audit trail, TOPSPIN		Version 2.1
$$ ##JCAMPDX= 5.01
$$ ##ORIGIN= Bruker BioSpin GmbH
$$ ##OWNER= Administrator
$$ $$ E:\/data/COFFEE/nmr/NES1071_159122.0002_001_9705654_qWYHiq8yM4/12/pdata/1/auditp.txt
$$ ##AUDIT TRAIL=  $$ (NUMBER, WHEN, WHO, WHERE, PROCESS, VERSION, WHAT)
(   1,<2016-05-01 13:42:06.067 -0700>,<Administrator>,<X>,<go>,<TOPSPIN 2.1>,
      <created by zg
	started at 2016-05-01 13:30:36.317 -0700,
	POWCHK enabled, PULCHK disabled,
       configuration hash MD5:
       21 0F 79 D6 B3 7B B4 F6 88 20 88 DB 03 48 BD 9F
       data hash MD5: 64K
       FC AD 75 20 9C C8 ED 27 47 45 2D 50 96 13 E7 E2>)
(   2,<2016-05-01 13:42:09.239 -0700>,<Administrator>,<X>,<proc1d>,<TOPSPIN 2.1>,
      <Start of raw data processing
       efp LB = 0.3 FT_mod = 6 PKNL = 1 PHC0 = 0 PHC1 = 0 SI = 128K 
       data hash MD5: 128K
       0B E3 27 B8 D1 5F B5 FC 2D 71 30 04 9B 35 12 06>)
(   3,<2016-05-01 13:42:10.114 -0700>,<Administrator>,<X>,<proc1d>,<TOPSPIN 2.1>,
      <pk PHC0 = -81.61743 PHC1 = 0 
       data hash MD5: 128K
       51 41 FE A7 D9 F6 EE 0B 7E EC C0 D2 B2 A8 6E 46>)
(   4,<2016-05-01 13:42:10.521 -0700>,<Administrator>,<X>,<proc1d>,<TOPSPIN 2.1>,
      <abs ABSG = 1 
       data hash MD5: 128K
       0A C0 11 97 F8 84 4E 81 CD C2 26 C3 18 AD 4D 4B>)
(   5,<2016-05-01 13:42:10.630 -0700>,<Administrator>,<X>,<proc1d>,<TOPSPIN 2.1>,
      <abs ABSG = 2 
       data hash MD5: 128K
       62 B6 69 C8 61 A0 D7 84 A3 C7 F7 D2 86 A5 98 B5>)
(   6,<2016-05-01 13:42:10.708 -0700>,<Administrator>,<X>,<proc1d>,<TOPSPIN 2.1>,
      <abs ABSG = 3 
       data hash MD5: 128K
       51 C3 A8 E4 49 76 31 B3 58 DA F4 09 3A 7C 31 5D>)
(   7,<2016-05-01 13:42:10.849 -0700>,<Administrator>,<X>,<proc1d>,<TOPSPIN 2.1>,
      <abs ABSG = 4 
       data hash MD5: 128K
       5A E8 A4 43 76 82 C3 E7 45 97 7E 9C 50 06 31 B3>)
(   8,<2016-05-01 13:42:11.130 -0700>,<Administrator>,<X>,<proc1d>,<TOPSPIN 2.1>,
      <abs ABSG = 5 
       data hash MD5: 128K
       39 A3 1D 5A 3A 73 7A FD 30 DA 4D DD B3 87 F7 24>)
$$ ##END=
$$ 
$$ $$ hash MD5
$$ $$ 26 95 79 8C 16 86 47 FD D5 70 29 4E 98 65 B4 AC
##$RELAX= 
##$RELAX= 
##$RELAX= 
##$RELAX= 
##$RELAX= 
##$RELAX= 
##$RELAX= 
##$RELAX= 
$$ Bruker specific parameters
$$ --------------------------
##$DU= <E:\>
##$EXPNO= 12
$$ [...]
##$TP07= 0
##$TPNAME0= <>
##$TPNAME1= <>
##$TPNAME2= <>
##$TPNAME3= <>
##$TPNAME4= <>
##$TPNAME5= <>
##$TPNAME6= <>
##$TPNAME7= <>
##$TPOAL= (0..7)
0.5 0.5 0.5 0.5 0.5 0.5 0.5 0.5
##$TPOFFS= (0..7)
0 0 0 0 0 0 0 0
##$TUNHIN= 0
##$TUNHOUT= 0
##$TUNXOUT= 0
##$USERA1= <user>
##$USERA2= <user>
##$USERA3= <user>
##$USERA4= <user>
##$USERA5= <user>
##$V9= 5
##$VALIST= <valist>
##$VCLIST= <CCCCCCCCCCCCCCC>
##$VD= 0
##$VDLIST= <DDDDDDDDDDDDDDD>
##$VPLIST= <PPPPPPPPPPPPPPP>
##$VTLIST= <TTTTTTTTTTTTTTT>
##$WBST= 2048
##$WBSW= 25
##$XGAIN= (0..3)
0 0 0 0
##$XL= 0
##$YL= 0
##$YMAX_a= 5166872
##$YMIN_a= -9882855
##$ZGOPTNS= <>
##$ZL1= 120
##$ZL2= 120
##$ZL3= 120
##$ZL4= 120
##$ABSF1= 14.96157
##$ABSF2= -5.596612
##$ABSG= 5
##$ABSL= 3
##$ALPHA= 0
##$AQORDER= 0
##$ASSFAC= 0
##$ASSFACI= 0
##$ASSFACX= 0
##$ASSWID= 0
##$AUNMP= <proc_prof1d_extract.lims>
##$AXLEFT= 0
##$AXNAME= <>
##$AXNUC= <1H>
##$AXRIGHT= 0
##$AXTYPE= 0
##$AXUNIT= <>
##$AZFE= 0.1
##$AZFW= 0.1
##$BCFW= 0
##$BC_mod= 0
##$BYTORDP= 0
##$COROFFS= 0
##$CY= 15
##$DATMOD= 1
##$DC= 0
##$DFILT= <>
##$DTYPP= 0
##$F1P= 0
##$F2P= 0
##$FCOR= 0.5
##$FTSIZE= 131072
##$FT_mod= 6
##$GAMMA= 0
##$GB= 0
##$INTBC= 1
##$INTSCL= 1
##$ISEN= 128
##$LB= 0.3
##$LEV0= 0
##$LPBIN= 0
##$MAXI= 10000
##$MC2= 0
##$MEAN= 0
##$ME_mod= 0
##$MI= 0
##$NCOEF= 0
##$NC_proc= -2
##$NLEV= 6
##$NOISF1= 0
##$NOISF2= 0
##$NSP= 0
##$NTH_PI= 0
##$NZP= 0
##$OFFSET= 14.96157
##$PC= 1
##$PHC0= -81.61743
##$PHC1= 0
##$PH_mod= 1
##$PKNL= yes
##$PPARMOD= 0
##$PPDIAG= 0
##$PPIPTYP= 0
##$PPMPNUM= 2147483647
##$PPRESOL= 1
##$PSCAL= 4
##$PSIGN= 0
##$PYNMP= <proc.py>
##$REVERSE= no
##$SF= 400.020009410766
##$SI= 131072
##$SIGF1= 0
##$SIGF2= 0
##$SINO= 400
##$SIOLD= 131072
##$SPECTYP= <>
##$SREGLST= <1H.CDCl3>
##$SSB= 0
##$STSI= 131072
##$STSR= 0
##$SW_p= 8223.68421052631
##$SYMM= 0
##$S_DEV= 0
##$TDeff= 65536
##$TDoff= 0
##$TI= <>
##$TILT= no
##$TM1= 0
##$TM2= 0
##$TOPLEV= 0
##$USERP1= <user>
##$USERP2= <user>
##$USERP3= <user>
##$USERP4= <user>
##$USERP5= <user>
##$WDW= 1
##$XDIM= 131072
##$YMAX_p= 279801803
##$YMIN_p= -13823
##$CURPLOT= <Network HP LaserJet P1505>
##$CURPRIN= <$Network HP LaserJet P1505>
##$DFORMAT= <normdp>
##$LAYOUT= <+/1D_H.xwp>
##$LFORMAT= <normlp>
##$PFORMAT= <normpl>
##$SURQMSG= 1
$$ End of Bruker specific parameters
$$ ---------------------------------
##NTUPLES= NMR SPECTRUM
##VAR_NAME=  FREQUENCY,     SPECTRUM/REAL,   SPECTRUM/IMAG
##SYMBOL=    X,             R,               I
##VAR_TYPE=  INDEPENDENT,   DEPENDENT,       DEPENDENT
##VAR_FORM=  AFFN,          ASDF,            ASDF
##VAR_DIM=   131072,        131072,          131072
##UNITS=     HZ,            ARBITRARY UNITS, ARBITRARY UNITS
##FACTOR=    0.0627417313425164, 1,          1
##FIRST=     8223.62146879497, -836,         -46565
##LAST=      0,             1506,            -46961
##MIN=       0,             -13823,          0
##MAX=       8223.62146879497, 279801803,    0
$$ Real data points
##PAGE= N=1
##DATA TABLE= (X++(R..R)), XYDATA
$$ [...]
63691A05696K335K090J530J003N09k48r90q25M12J508J317L82K36J369K843L785
63675A22952M312M752M859M340L615L281L119K223K77j797k752k474k104k601
63661A42002l614m121l910l784m222m635m224l072j888j123p55o27n04j26L78
63646A05775M82J04M4R51K243K791K417J965K069K598L288M063M702M901M836
63631A43229N080N822O666P302P851Q539R494J0863J2602J4185J5168J5929J7223
63618B79953J9018K0515K1230K1301K0652J8840J5889J2362Q473M028m72l746
63606D38043n247n772o059n748m467k979k328k573l318m811p471j0771j3596j5466
63592C47437j6606j7050j6611j5467j4038j2428j0694r323q639q052o791n143
$$ plain form
63691 105696 108031 110121 111651 112654 113163 112915 111925 111100 111512 113020 114337 114719 114955 116324 119167 122952
63675 122952 127264 132016 136875 141215 144830 148111 151230 153453 153730 151933 149181 146707 144603 142002
63661 142002 138388 134267 130357 126573 122351 117716 113492 110420 108532 107409 106654 106027 105523 105397 105775
63646 105775 106257 106361 106405 107356 109599 112390 114807 116772 118841 121439 124727 128790 133492 138393 143229
63631 143229 148309 154131 160797 168099 175950 184489 193983 204846 217448 231633 246801 262730 279953
63618 279953 298971 319486 340716 362017 382669 401509 417398 429760 438233 442261 441789 438043
63606 438043 432796 427024 420965 415217 410750 407771 405443 402870 399552 394741 387270 376499 362903 347437
63592 347437 330831 313781 297170 281703 267665 255237 244543 235220 226581 218529 211738 206595
63580B06595l956l197k101o05N26J164K081L452M345M333M535O114Q522J0193
63566B42001J0527J0263J0188J0377J0762J1540J2754J3964J4771J5376J6310
63555C78833J7611J8541J8244J6537J3870J0606O713K363j633m422n874o315n732
63542D59342l887j212J142K369K562J999M94k148n476q720j1564j4094j6181j7451
63528C87175j7922j8199j8768j9277j8869j7261j5237j3841j3211j2550j1295
63517B10745r820q753q064p283o315n419m608l712k932k672k802k732k331k060
63503A41242k111k098j779j405j036l21O74J165P74K38L23O56N28L34J152L024
63487A41360M700N228N020M990N378N741N708N285M643L832K742J294k36j310
$$ plain form
63580 206595 202639 199442 197341 196736 197262 198426 200507 203959 208304 212637 217172 223286 231808 242001
63566 242001 252528 262791 272979 283356 294118 305658 318412 332376 347147 362523 378833
63555 378833 396444 414985 433229 449766 463636 474242 480955 483318 481685 477263 471389 465074 459342
63542 459342 455455 454243 455385 457754 460316 462315 462809 460661 455185 446465 434901 420807 404626 387175
63528 387175 369253 351054 332286 313009 294140 276879 261642 247801 234590 222040 210745
63517 210745 200925 192172 184108 176825 170510 165091 160483 156771 153839 151167 148365 145633 143302 141242
63503 141242 139131 137033 135254 133849 132813 132492 133166 134331 135105 135343 135666 136322 136850 137184 138336 141360
63487 141360 146060 151288 156308 161298 166676 172417 178125 183410 188053 191885 194627 195921 195685 194375
63473A94375j786k289l481n090o145o201n717n176m418l225k037j555j739j757
63459A43759r91K19J013J019O72O21J074J819K639L419L960M094M075M464N468
63444A77324O665P536P991Q161Q092P940Q147R007J0278J1619J3126J5012J7034
63431C07932J8790K0401K2321K4535K6528K7993K8986K9285K8265K5607K1638
63420E82281J6870J1580O130J189k635n195o683p366p477p090o179n102m864o313
63406E59146r100j2076j4738j7504k0449k2688k3482k3126k2182k0602j8275j5868
63394C39056j4228j3280j2277j0847r153p321n449l977l219k672j554N8J423K365
63380B58925L416M704N720O435P700R946J2326J3801J4501J5268J6330J7256J7994
$$ plain form
63473 194375 192589 190300 186819 181729 175584 169383 163666 158490 154072 150847 148810 147255 145516 143759
63459 143759 142768 142987 144000 145019 145691 146312 147386 149205 151844 155263 159223 163317 167392 171856 177324
63444 177324 183989 191525 199516 207677 215769 223709 231856 240863 251141 262760 275886 290898 307932
63431 307932 326722 347123 369444 393979 420507 448500 477486 506771 535036 560643 582281
63420 582281 599151 610731 616861 618050 615415 610220 603537 596171 588694 581604 575425 570323 565459 559146
63406 559146 550046 537970 523232 505728 485279 462591 439109 415983 393801 373199 354924 339056
63394 339056 324828 311548 299271 288424 279271 271950 266501 262524 259305 256633 255079 255137 256560 258925
63380 258925 262341 267045 272765 279200 286900 296846 309172 322973 337474 352742 369072 386328 404322
63367D04322J9091K0810K2584K3619K3546K2368K0112J6809J2664Q007L178j442
63355E95668n314p862q786q328p198o138n506n254n308n860p215r515j2619j6149
63341D84616j9472k1803k2638k2159k1076j9984j8943j7741j6364j4989j3611
63330B75836j1949r900p905o638o307o485o593o405n977n372m638l943l503l333
63316A86888l161k671j822r69n80p40r99q98n55m50o61o92k66K13K26j10k80q8
63298A72385K38M58M57J24m23o78k74L62M11k88j098j495j613j752j923k073k267
63281A60551k335j805n37Q57J560J325N21k63m77K13J532K573K553J560M20l9
63265A68209M19J351J957J801J378J598K603L482L481K939K635K689K727K760
$$ plain form
63367 404322 423413 444223 466807 490426 513972 536340 556452 573261 585925 593932 597110 595668
63355 595668 590354 582492 573706 565378 558180 552042 546536 541282 535974 530114 522899 513384 500765 484616
63341 484616 465144 443341 420703 398544 377468 357484 338541 320800 304436 289447 275836
63330 275836 263887 253987 246082 239444 233137 226652 220059 213654 207677 202305 197667 193724 190221 186888
63316 186888 183727 181056 179234 178265 177685 176945 175946 175048 174493 174043 173382 172690 172424 172637 172863 172753 172473 172385
63298 172385 172623 173081 173538 173662 173239 172561 172287 172649 173060 172772 171674 170179 168566 166814 164891 162818 160551
63281 160551 158216 156411 155874 156731 158291 159616 160137 159874 159397 159610 161142 163715 166268 167828 168248 168209
63265 168209 168628 169979 171936 173737 175115 176713 179316 182798 186279 189218 191853 194542 197269 200029
63251B00029L130L771M239M511M987N686O109O111O250O948P888Q621R368J0637
63237B88285J2340J3758J4414J4579J4882J5614J6451J6768J6273J5320J4507
63226D53191J3962J3307J2436J1953J2531J3939J5145J5373J4824J4204J3785
63215F04650J3066J1322Q328M583Q47k467n481q508j1625j4589j7053j8762j9603
63202E44708j9614j9028j8119j6975j5426j3337j0882q453o249m100j723R28L605
63189D15335N917P494Q304Q892J0050J1940J3797J4843J5247J5696J6221J6208
63177E59944J5606J5222J5433J5530J4926J4330J4681J5350J4533J1487P412L853
63165G18307J070j630m697q075j1694j5506j9162k2115k4046k4994k5145k4771
$$ plain form
63251 200029 203159 206930 211169 215680 220667 226353 232462 238573 244823 251771 259659 268280 277648 288285
63237 288285 300625 314383 328797 343376 358258 373872 390323 407091 423364 438684 453191
63226 453191 467153 480460 492896 504849 517380 531319 546464 561837 576661 590865 604650
63215 604650 617716 629038 637366 641949 642796 640329 634848 626340 614715 600126 583073 564311 544708
63202 544708 525094 506066 487947 470972 455546 442209 431327 422874 416625 412525 410802 411730 415335
63189 415335 421252 428746 437050 445942 455992 467932 481729 496572 511819 527515 543736 559944
63177 559944 575550 590772 606205 621735 636661 650991 665672 681022 695555 707042 714454 718307
63165 718307 719377 717747 713050 704975 693281 677775 658613 636498 612452 587458 562313 537542
63153E37542k4206k3643k2929k1750j9977j7760j5394j3212j1432r990q592p116
63141C41541n843n091m723m225l312k313j871k229k915l184k784k173j850j695
63127B97333j155n9J050J478J063K49m19q01j154j612j776j133Q4Q74O61M4r8
63110B94629J74K31J13M20J093J324R31P53J201J480R15J83L46J264J930J984
63094C08971J893J995K264K830L777M463M071K942K416L112M212M679M465M092
63080C56182L768L472L396L716M248M740N208N697N956N779N456N474N952O680
63066D25724P595Q845J0430J2031J3270J4121J5022J6519J8632K0704K2125K3118
63054F08136K4432K6264K8000K9097K9719L0282L0845L1279L1611L1861L1797
$$ plain form
63153 537542 513336 489693 466764 445014 425037 407277 391883 378671 367239 357249 348657 341541
63141 341541 335698 330607 325884 321659 318347 316034 314163 311934 309019 305835 303051 300878 299028 297333
63127 297333 296178 296119 297169 298647 299710 299959 299540 298739 297585 295973 294197 293064 293148 294022 294683 294727 294629
63110 294629 294803 295034 295147 295567 296660 297984 298915 299668 300869 302349 303264 303447 303793 305057 306987 308971
63094 308971 310864 312859 315123 317953 321730 326193 330264 333206 335622 338734 342946 347625 352090 356182
63080 356182 359950 363422 366818 370534 374782 379522 384730 390427 396383 402162 407618 413092 419044 425724
63066 425724 433319 442164 452594 464625 477895 492016 507038 523557 542189 562893 585018 608136
63054 608136 632568 658832 686832 715929 745648 775930 806775 838054 869665 901526 933323
63043I33323L1268L0507K9879K9525K9505K9895L0518L0890L0714L0085K8923
63032A265032K6637K2823J7814J2083N505k150j0362j8232k5410l1929l7343m0918
63020A183550m2676m3375m3312m1979l9161l5490l1534k7073k1855j6507j1981
63009H28607q362m830o57M121Q923J3162J6610J9479K2103K4476K6286K7460K8299
62996A005677K8953K9133K8657K7918K7435K7191K6732K5781K4409K2726K0673
62985A295285J7945J4049Q630J972n185j2450k0061k8018l5515m1697m6576n0620
62973A097759n3710n5241n5098n3821n1866m9329m6385m3361m0303l7015l3601
62962E78029l0406k7431k4439k1683j9811j8868j8033j6714j5198j3946j2898
$$ plain form
63043 933323 964591 995098 1024977 1054502 1084007 1113902 1144420 1175310 1206024 1236109 1265032
63032 1265032 1291669 1314492 1332306 1344389 1349894 1347744 1337382 1319150 1293740 1261811 1224468 1183550
63020 1183550 1140874 1097499 1054187 1012208 973047 937557 906023 878950 857095 840588 828607
63009 828607 820245 815415 814758 818879 827802 840964 857574 877053 899156 923632 949918 977378 1005677
62996 1005677 1034630 1063763 1092420 1120338 1147773 1174964 1201696 1227477 1251886 1274612 1295285
62985 1295285 1313230 1327279 1335909 1337881 1332696 1320246 1300185 1272167 1236652 1194955 1148379 1097759
62973 1097759 1044049 988808 933710 879889 828023 778694 732309 688948 648645 611630 578029
62962 578029 547623 520192 495753 474070 454259 435391 417358 400644 385446 371500 358602
62951C58602j1908j1199j0765r940q323o677o129o638p023o408n085l933l562
62938B61012l971m539m377l221j974j774k526k960k237q97J5J69l5k21l52n45
62922B31567r46j600k257k497k305k163k326k400j982j439j403j744j641q21q5
62907B05958k79j160j712j373n31J26L27J86j43n61r34j125j133j058r93j058
62891A94537j388j827j801q53O45J676J656J062O99O52L94k53p60o68k96l58j058
62874A92059j791j815j055j95J1n19j196j464j338j208j283j435j477j319r49
62859A75026m51m1J17J39K50L78J94m04j023j183p65o1N30P30N03M7l62n59n34
62840A72531l31k1K65M13M50M52M85O79J174J756J785R20k07n91q0N14O20O39
$$ plain form
62951 358602 346694 335495 324730 314790 306467 299790 293661 287023 280000 273592 268507 264574 261012
62938 261012 257041 252502 248125 244904 242930 241156 238630 235670 233433 232536 232551 232720 232685 232464 232112 231567
62922 231567 230621 229021 226764 224267 221962 219799 217473 215073 213091 211652 210249 208505 206864 206043 205958
62907 205958 205679 204519 202807 201434 200903 201029 201356 201542 201399 200838 199904 198779 197646 196588 195595 194537
62891 194537 193149 191322 189521 188668 189313 190989 192645 193707 194406 195058 195452 195199 194439 193771 193475 193117 192059
62874 192059 190268 188453 187398 187203 187214 186695 185499 184035 182697 181489 180206 178771 177294 175975 175026
62859 175026 174575 174534 174651 174790 175040 175418 175612 175208 174185 173002 172237 172176 172706 173436 173939 173986 173624 173065 172531
62840 172531 172200 172179 172444 172857 173307 173759 174244 174923 176097 177853 179638 180558 180351 179760 179680 180194 180814 181453
62822A81453J219K273L085L088K312J367J139K067L439L966L377K914L637M829
62808B20165M931L749K741L103M482N814O645P137P431P592P957Q946J0619J2632
62794C13944J4580J6245J7645J9114K1143K3906K6991K9768L2062L4291L7071
62783E86760M0699M4939M9187N2904N5902N8219N9677N9829N8352N5279N0718
62772A172465M4574L6740K7478J7382P010l289j3278k2687l1246l8711m4866m9542
62760A102030n2722n4571n5342n5210n4195n2324m9837m7095m4183m0787l6775
62749E58989l2730k9522k7312k5357k2982k0374j8135j6382j4735j2985j1266
62738C27209r627p930o368n530n631o004n754m745l521k393j149K40J244J443
$$ plain form
62822 181453 182672 184945 188030 191118 193430 194797 195936 198003 201442 205408 208785 211699 215336 220165
62808 220165 225096 228845 231586 234689 239171 244985 251630 258767 266198 273790 281747 290693 301312 313944
62794 313944 328524 344769 362414 381528 402671 426577 453568 483336 515398 549689 586760
62783 586760 627459 672398 721585 774489 830391 888610 948287 1008116 1066468 1121747 1172465
62772 1172465 1217039 1253779 1281257 1298639 1305649 1302360 1289082 1266395 1235149 1196438 1151572 1102030
62760 1102030 1049308 994737 939395 884185 829990 777666 727829 680734 636551 595764 558989
62749 558989 526259 496737 469425 444068 421086 400712 382577 366195 351460 338475 327209
62738 327209 317582 309652 303284 297754 292123 286119 280365 275620 272099 269706 268557 268797 270041 271484
62724B71484J241J415K178L110L971M994O297P558Q528R516J0932J2709J4487
62711C58420J6254J8285K0606K2962K5332K8096L1521L5409L9341M3049M6426
62700F85701M9459N2286N5049N7526N9124N9346N8080N5302N0837M4646L7153
62689A264509K8785J9375Q421l904j6319k7257l6062m3204m9393n4636n8291n9909
62677I72115n9847n8836n7154n4479n0700m6442m2527l9087l5626l1944k8547
62666D66926k5958k3952k1805j9234j6740j4940j3844j2867j1527r946q683q171
62654B79259q325q626q581q075p358o737o337o085n789n213m243l124k384k296
62640A96086k498k386j852j341j106q28j74N76Q26M49j48o43j094j543j731j426
$$ plain form
62724 271484 272725 274140 276318 279428 283399 288393 294690 302248 310776 320292 331224 343933 358420
62711 358420 374674 392959 413565 436527 461859 489955 521476 556885 596226 639275 685701
62700 685701 735160 787446 842495 900021 959145 1018491 1076571 1131873 1182710 1227356 1264509
62689 1264509 1293294 1312669 1321090 1317186 1300867 1273610 1237548 1194344 1144951 1090315 1032024 972115
62677 972115 912268 853432 796278 741799 691099 644657 602130 563043 527417 495473 466926
62666 466926 440968 417016 395211 375977 359237 344297 330453 317586 306059 296113 287430 279259
62654 279259 270934 262308 253727 245652 238294 231557 225220 219135 213346 208133 203890 200766 198382 196086
62640 196086 193588 191202 189350 188009 186903 186075 185901 186477 187303 187752 187604 186961 185867 184324 182593 181167
62624A81167p95j93K84P95J378J786J788J545J563K206L227L910L771L159L020
62609B08611M019N943P952R432J0523J1792J3406J4911J5982J7204J9521K2900
62597C62196K6085K8020K8963K9769L0462L0279K8919K6869K4443K1258J6965
62586F54228J1899O582J117m537j0000j4726j8586k1814k4461k6245k6931k6688
62574D99838k6078k5653k5364k4507k2555k0071j8151j6971j5560j3334j1076
62563B80518r810r331q658p479o308n452m702m012l589l324k841k198j854j831
62549B09129j648j221j063j330j447j086p60j017j528j634j293r06n84j39M49
62534A93922J080J817K684L470M193N428P551R927J1598J2583J3748J5390J6862
$$ plain form
62624 181167 180372 180179 180463 181258 182636 184422 186210 187755 189318 191524 194751 198661 202432 205591 208611
62609 208611 212630 218573 226525 235957 246480 258272 271678 286589 302571 319775 339296 362196
62597 362196 388281 416301 445264 475033 505495 535774 564693 591562 616005 637263 654228
62586 654228 666127 672709 673826 669289 659289 644563 625977 604163 579702 553457 526526 499838
62574 499838 473760 448107 422743 398236 375681 355610 337459 320488 304928 291594 280518
62563 280518 270708 261377 252719 245240 238932 233480 228778 224766 221177 217853 215012 212814 210960 209129
62549 209129 207481 206260 205197 203867 202420 201334 200574 199557 198029 196395 195102 194196 193612 193473 193922
62534 193922 195002 196819 199503 202973 207166 212594 220145 230072 241670 254253 268001 283391 300253
62521C00253J7778J8778K0577K2903K4941K6457K7857K9302L0388L0701L0216
62510E80151K9006K6895K3654J9390J4575R622M545r53o990j3131j8565k2634
62498F45565k5227k6680k7461k7891k8045k7814k7104k5886k4064k1467j8329
62487C65597j5536j3959j3368j2484j0469q012o555o605p279p439o802n832n004
62474B46253m462m168l967l586k878k147j977k559l335l516k905k018j422j209
62460B06104j188j289j483j509j071k37O90J648K720L553L479K482J536J559K374
62445B19368L200L792M424N014N068M479L677K841J662J52j066j683k331l599
62431B44998m988n561n298n037n124n038m457l913l933m113l682k648j797j582
$$ plain form
62521 300253 318031 336809 357386 380289 405230 431687 459544 488846 519234 549935 580151
62510 580151 609157 636052 659706 679096 693671 703293 707838 706885 699895 686764 668199 645565
62498 645565 620338 593658 566197 538306 510261 482447 455343 429457 405393 383926 365597
62487 365597 350061 336102 322734 310250 299781 291769 285214 278609 271330 263891 257089 251257 246253
62474 246253 241791 237623 233656 230070 227192 225045 223068 220509 217174 213658 210753 208735 207313 206104
62460 206104 204916 203627 202144 200635 199564 199327 200017 201665 204385 207938 211417 213899 215435 216994 219368
62445 219368 222568 226360 230784 235798 240866 245345 249022 251863 253525 253677 252611 250928 248597 244998
62431 244998 240010 234449 229151 224114 218990 213952 209495 205582 201649 197536 193854 191206 189409 187827
62417A87827j577j217o70n74j110j690j715j282r17q06o27j12O31J385K117K795
62401A82458L223L284L112K850K442J957J839K443L501M338M548M154L324K364
62387B25837J815K049K725L089K866K460K323K557L162M092N000N448N622O239
62373B75284P560R055J0382J2003J4252J6476J7888J8952K0925K4148K7637L0486
62361D85048L2832L5107L7080L8181L8237L7361L5333L1654K6185J9370J1973
62350H28361M915q55m924p902j0886j4292j7629k0521k3335k6354k8910l0061
62338F47607k9900k9358k8736k7338k4835k2072j9917j8058j5800j3507j2196
62327D05890j1887j1501j0461r437r171r453r730r974j0343j0556j0175r177p786
$$ plain form
62417 187827 186250 185033 184363 183789 182679 180989 179274 177992 177075 176269 175642 175530 176161 177546 179663 182458
62401 182458 185681 188965 192077 194927 197369 199326 201165 203608 207109 211447 215995 220149 223473 225837
62387 225837 227652 229701 232426 235515 238381 240841 243164 245721 248883 252975 257975 263423 269045 275284
62373 275284 282844 291899 302281 314284 328536 345012 362900 381852 402777 426925 454562 485048
62361 485048 517880 552987 590067 628248 666485 703846 739179 770833 797018 816388 828361
62350 828361 833276 832421 827497 819595 808709 794417 776788 756267 732932 706578 677668 647607
62338 647607 617707 588349 559613 532275 507440 485368 465451 447393 431593 418086 405890
62327 405890 394003 382502 372041 362604 353433 343980 334250 324276 313933 303377 293202 284025 276239
62314B76239o138m506l388k894k472j745j177j249j534j283o17k49l08k72L0K85
62298B48722N70J391K666L499L311K507J764J329J333K066L387M441M540L970
62284B85496L510L473L675L967M315M526M412M085L826L770M017M805O235Q055
62270C48167R929J1789J3613J5263J6864J9014K2060K5417K8170L0274L2540L5395
62258F08495L8154L9709L9528L7790L4841L0840K5791J9763J3087O382K42n120
62246H89502r879j4264j8352k2138k5647k8930l1947l4459l6003l6128l4787l2409
62234E64559k9523k6427k3313k0455j8025j5886j3826j1905j0338r101p965o836
62222C70959n811m919m058l192k404j766j311j114j194j371j391j124m56P53K305
$$ plain form
62314 276239 270101 265595 262207 259313 256841 255096 253919 252670 251136 249853 249236 248987 248679 248407 248437 248722
62298 248722 249292 250683 253349 256848 260159 262666 264430 265759 267092 269158 272545 276986 281526 285496
62284 285496 289006 292479 296154 300121 304436 308962 313374 317459 321285 325055 329072 333877 340112 348167
62270 348167 358096 369885 383498 398761 415625 434639 456699 482116 510286 540560 573100 608495
62258 608495 646649 686358 725886 763676 798517 829357 855148 874911 887998 894380 894622 889502
62246 889502 879623 865359 847007 824869 799222 770292 738345 703886 667883 631755 596968 564559
62234 564559 535036 508609 485296 464841 446816 430930 417104 405199 394861 385760 377795 370959
62222 370959 365148 360229 356171 352979 350575 348809 347498 346384 345190 343819 342428 341304 340848 341601 343906
62207C43906L478L718L483L780M852N801N809N197M968N623O850Q053Q787Q882
62193D23187Q600Q620R517J1203J2993J4218J4630J4360J3733J3039J2306J1279
62181E67685R772P947O165M758M067M410N747P594R571J1860J4753J8004K1077
62168F93410K3839K6411K8340K8650K6940K3839K0054J5550J0112M325o65m215
62156H96590o586q408j0185j2248j4759j7577k0369k2755k4310k4588k3558k1816
62144F89431j9950j7871j5248j2483j0512r500q432o392l734j517k26L88N75M26
62130E84955L81J126K652L963M070L156K303K223K543K497K005J765K340L416
62116F19395M186M232L701K780J411k57j539j687o53Q79K117K731K861K826K862
$$ plain form
62207 343906 347384 351102 354585 358365 363217 369018 374827 380024 384992 390615 397465 405518 414305 423187
62193 423187 431787 440407 449924 461127 474120 488338 502968 517328 531061 544100 556406 567685
62181 567685 577457 585404 591569 596327 600394 604804 610551 618145 627716 639576 654329 672333 693410
62168 693410 717249 743660 772000 800650 827590 851429 871483 887033 897145 901470 900805 896590
62156 896590 890004 881596 871411 859163 844404 826827 806458 783703 759393 734805 711247 689431
62144 689431 669481 651610 636362 623879 613367 603867 595435 589043 585309 583792 583566 583954 584529 584955
62130 584955 585336 586462 589114 593077 597147 600303 602606 604829 607372 609869 611874 613639 615979 619395
62116 619395 623581 627813 631514 634294 635705 635448 633909 632222 631569 632448 634565 637296 640157 642983 645845
62101F45845L062L478M148M953N593N947O398P401Q721R574R603R313R282R480
62087G42798R680J0122J1165J2619J3966J5031J5984J6847J7509J8099J8790J9459
62075I22069J9971K0591K1455K1911K1209J9789J8987J9351K0065K0238J9804
62064A145440J8835J6897J3755J0034O511L196k97l915p291j0345j3173j5752
62052A163895j8191k0864k3684k5729k6343k6196k6378k6760k6241k4486k2351
62041H96672k0452j8426j5996j3843j2746j2370j1650j0103q220o760o098o060
62029G53948o068n516m351l224k850l200l604l558l213l036l191l388l289k935
62015G02525k675k665k635k272j683j193p44R8J435K634K981K558K218K609L433
$$ plain form
62101 645845 648907 652385 656533 661486 667079 673026 679424 686825 695546 705120 714723 724036 733318 742798
62087 742798 752478 762600 773765 786384 800350 815381 831365 848212 865721 883820 902610 922069
62075 922069 942040 962631 984086 1005997 1027206 1046995 1065982 1085333 1105398 1125636 1145440
62064 1145440 1164275 1181172 1194927 1204961 1211472 1214668 1214371 1210456 1203165 1192820 1179647 1163895
62052 1163895 1145704 1124840 1101156 1075427 1049084 1022888 996510 969750 943509 919023 896672
62041 896672 876220 857794 841798 827955 815209 802839 791189 781086 772866 766106 760008 753948
62029 753948 747880 742364 738013 734789 731939 728739 725135 721577 718364 715328 712137 708749 705460 702525
62015 702525 699850 697185 694550 692278 690595 689402 688658 688756 690191 692825 695806 698364 700582 703191 706624
62000G06624L793L207K160J538J617J830J552Q09n9j147k916n384p808r374r902
61985F86540r721r165q485p997p906q064q137p971p615p013n976m587l402l027
61971E87474l512m330m890m943m507l633k440j348r16j341k200k836k947k681
61957E44950k258j696r37j10M63N77M33N77J390K593L468L666L689M351N771P144
61941E74071P607P227P010P856R643J1366J2180J2115J1736J1378J0986J0540
61929F93715J0224J0176J0399J0875J1484J1806J1607J1495J2534J4839J7233
61918H26387J8682J9575K1047K3487K6435K9543L2813L6041L8876M1455M4252
61907A158593M7269N0013N2403N4933N7731O0194O1835O2914O3869O4664O5191
$$ plain form
62000 706624 710417 713624 715784 717322 718939 720769 722321 723130 723071 721924 719008 713624 705816 696442 686540
61985 686540 676819 667654 659169 651172 643266 635202 627065 619094 611479 604466 598490 593903 590501 587474
61971 587474 583962 579632 574742 569799 565292 561659 559219 557871 556955 555614 553414 550578 547631 544950
61957 544950 542692 540996 540059 539949 540412 540989 541422 541999 543389 545982 549450 553116 556805 561156 566927 574071
61941 574071 581678 588905 595915 603771 613414 624780 636960 649075 660811 672189 683175 693715
61929 693715 703939 714115 724514 735389 746873 758679 770286 781781 794315 809154 826387
61918 826387 845069 864644 885691 909178 935613 965156 997969 1034010 1072886 1114341 1158593
61907 1158593 1205862 1255875 1308278 1363211 1420942 1481136 1542971 1605885 1669754 1734418 1799609
61896A799609O5686O6195O5978O4011N9963N4211M7097L8698K9195J8930Q082
61885B317655l391j5323k7129l8162m8121n7015o4760p0962p5102p7028p7176
61874A763486p6233p4603p2303o9267o5629o1739n8092n5022n2223m8835m4438
61863A085102l9780l5943l2928k9786k6229k3177k1323j9968j7952j5199j2588
61852H10229j0649r100p539n910m350l121k659l134l985m390m276m350n051n901
61838G35814o147n699n119m841m692m120k836j125M48J593K461L286M142N009
61824G18174N823O254N844M580L050J788P63k16j047j703k626m090n362n275l621
61809G22336j386M74J953L571N584P787R751J1096J1866J2706J4290J6520J8705
$$ plain form
61896 1799609 1865295 1931490 1997468 2061479 2121442 2175653 2222750 2261448 2290643 2309573 2317655
61885 2317655 2314264 2298941 2271812 2233650 2185529 2128514 2063754 1992792 1917690 1840662 1763486
61874 1763486 1687253 1612650 1540347 1471080 1405451 1343712 1285620 1230598 1178375 1129540 1085102
61863 1085102 1045322 1009379 976451 946665 920436 897259 875936 855968 838016 822817 810229
61852 810229 799580 790480 782941 777031 772681 769560 766901 763767 759782 755392 751116 746766 741715 735814
61838 735814 729667 723968 718849 714008 709316 705196 702360 701235 701683 703276 705737 709023 713165 718174
61824 718174 723997 730251 736095 740675 743725 745513 746276 746060 745013 743310 740684 736594 731232 725957 722336
61809 722336 720950 721424 723377 726948 732532 740319 750070 761166 773032 785738 800028 816548 835253
61796H35253K0572K2472K4553K6321K7411K8251K9553L1548L4104L7172M0607
61785A157817M3870M6503M8819N1591N5183N9372O3916O8766P3692P8272Q2568
61774A830369Q7402R3540J00709J07641J13152J17044J19976J22552J24605J25353
61764B942343J24101J20602J14771J06394R5406Q2161O7090N0154L1144J0548
61754C744714j0279l0116m8706o6254q2384r6147j07047j15521j22123j26643
61744B939494j28437j27500j24777j21413j17941j14256j10038j05071r9345r3111
61734A797605q6798q0779p5214p0139o5567o1440n7610n3961n0510m7282m4147
61723A104158m0856l7304l3758l0801k8821k7454k5776k3324k0808j9378j9255
$$ plain form
61796 835253 855825 878297 902850 929171 956582 984833 1014386 1045934 1080038 1117210 1157817
61785 1157817 1201687 1248190 1297009 1348600 1403783 1463155 1527071 1595837 1669529 1747801 1830369
61774 1830369 1917771 2011311 2112020 2219661 2332813 2449857 2569833 2692385 2816990 2942343
61764 2942343 3066444 3187046 3301817 3408211 3503617 3585778 3652868 3703022 3734166 3744714
61754 3744714 3734435 3704319 3655613 3589359 3506975 3410828 3303781 3188260 3066137 2939494
61744 2939494 2811057 2683557 2558780 2437367 2319426 2205170 2095132 1990061 1890716 1797605
61734 1797605 1710807 1630028 1554814 1484675 1419108 1357668 1300058 1246097 1195587 1148305 1104158
61723 1104158 1063302 1025998 992240 961439 932618 905164 879388 856064 835256 815878 796623
61712G96623j9515j9293j8652j8056j7565j6932j6111j5207j4220j3229j2603
61701F15240j2585j2825j2717j2056j0986r714q611q258q697q955q106o698o214
61688D88818p088q164q378p990p689p296o261m906m218m500n016n069m819m739
61674D02685m760m359l398k513k470l237l952l883l257k869l044l350l355l167
61660C55071l047k876k392j701j227j185j350j373j140q34o66n35o0Q98J861K233
61644C41677K060J919J954J624N92o25j341j599j912k375k608k445k176k052k010
61629C30683j989k073k224k102j388k16R05J537J665J594J521J342R55O23P30
61614C31563J139J207N76m54j520k759m347n787o210n434m239l564l671m171m530
$$ plain form
61712 796623 777108 757815 739163 721107 703542 686610 670499 655292 641072 627843 615240
61701 615240 602655 589830 577113 565057 554071 544357 535746 527488 518791 509836 501730 495032 488818
61688 488818 481730 473566 465188 457198 449509 442213 435952 431046 426828 422328 417312 412243 407424 402685
61674 402685 397925 393566 390168 387655 385185 381948 377996 374113 370856 367987 364943 361593 358238 355071
61660 355071 352024 349148 346756 345055 343828 342643 341293 339920 338780 337946 337280 336745 336685 337583 339444 341677
61644 341677 343737 345656 347610 349234 349826 349201 347860 346261 344349 341974 339366 336921 334745 332693 330683
61629 330683 328694 326621 324397 322295 320907 320691 321596 323133 324798 326392 327913 329255 330210 330833 331563
61614 331563 332702 333909 334485 334031 332511 329752 325405 319618 313408 307974 303735 300171 296500 292329 287799
61599B87799m457l960l249k530j917j436r97l86M60J131J081M05j04O2N53Q68
61583B73323J111J535J779J383P97J058K349L666M124L892L682L867M419N172
61569C12157N789N992O081O746Q020Q936Q711P871P612Q339R432J0216J0470J0097
61555D26469R040P736O946O816O593N659M485M026M401M720M278L349K602K181
61541D99301J758J261J006J117J260J155R40Q27P15M10Jl32o66j097j327r39m4
61524E05346P59J161J438J966K802L903N277O735P803Q265Q552R328J0818J2744
61510E86897J4759J6639J8225J9454K0519K1787K3540K5832K8510L1265L3782
61499H41209L5955L7931L9842M1569M2830M3436M3360M2669M1397L9406L6421
$$ plain form
61599 287799 283342 279382 276133 273603 271686 270250 269253 268867 269327 270458 271539 271944 271840 271902 272455 273323
61583 273323 274434 275969 277748 279131 279928 280986 283335 287001 291125 295017 298699 302566 306985 312157
61569 312157 317946 323938 330019 336765 344785 353721 362432 370303 377915 386254 395686 405902 416372 426469
61555 426469 435509 443245 450191 457007 463600 469259 473744 477770 482171 486891 491169 494518 497120 499301
61541 499301 501059 502320 503326 504443 505703 506858 507798 508625 509340 509750 509751 509419 508753 507656 506329 505390 505346
61524 505346 506105 507266 508704 510670 513472 517375 522652 529387 537190 545455 554007 563335 574153 586897
61510 586897 601656 618295 636520 655974 676493 698280 721820 747652 776162 807427 841209
61499 841209 877164 915095 954937 996506 1039336 1082772 1126132 1168801 1210198 1249604 1286025
61488A286025L2310K7332K1853J5887R277K355l954q920j2623j5560j7991j9920
61476A316071k1415k2486k2876k2339k1077j9519j7826j5967j4209j3073j2713
61465A112571j2696j2462j1782j0715r434q188p196o430n659m729l571k076k01
61452A017432J776L415M628N764P104Q562R986J1425J2944J4460J5915J7395J8765
61439A149571J9445J8834J6917J4237J1383Q627O004L524J313l51j232j403j190
61426A245679p70l6J079K321L371M116M503M388L846L285K793J618j047m789q207
61411A262150j0587j2562j4798j6692j7124j6078j4702j3875j3366j2591j1501
61400A108274j0477r676q853p698o243m978m461m582m319k647K80L330N802Q031
$$ plain form
61488 1286025 1318335 1345667 1367520 1383407 1392684 1395039 1391085 1382165 1369542 1353982 1335991 1316071
61476 1316071 1294656 1272170 1249294 1226955 1205878 1186359 1168533 1152566 1138357 1125284 1112571
61465 1112571 1099875 1087413 1075631 1064916 1055482 1047294 1040098 1033668 1028009 1023280 1019709 1017633 1017432
61452 1017432 1019208 1022623 1027251 1033015 1040119 1048681 1058667 1070092 1083036 1097496 1113411 1130806 1149571
61439 1149571 1169016 1187850 1204767 1219004 1230387 1239014 1245018 1248542 1249855 1249504 1248272 1246869 1245679
61426 1245679 1244909 1244873 1245952 1248273 1251644 1255760 1260263 1264651 1268497 1271782 1274575 1276193 1275146 1270357 1262150
61411 1262150 1251563 1239001 1224203 1207511 1190387 1174309 1159607 1145732 1132366 1119775 1108274
61400 1108274 1097797 1088121 1079268 1071570 1065327 1060349 1055888 1051306 1046987 1044340 1044620 1047950 1053752 1061783
61386A061783J0447J2762J4572J6237J8426K1107K3708K6093K8668L1555L4287
61375A299645L6493L8230L9508M0110M0086L9854L9449L8148L5301L1200K6657
61364A704681K1982J6812J0905M610j445o921j1964j6929k1905k6551l0495l3941
61352A608839l7452m1051m3923m5269m5112m4042m2538m0930l9548l8388l6834
61341A153752l4387l1494k9061k7229k5297k2864k0347j8150j5979j3421j0657
61330I04866q233o368m958l937l212k378r80R51K912M517N822P057Q311R531J0631
61315I24532J1481J1921J1914J1664J1425J1222J0743R600P715N473L493K230
61303A033413J659J296N83n45j445j521j164j558l200n076n888n778o068p348
$$ plain form
61386 1061783 1072230 1084992 1099564 1115801 1134227 1155334 1179042 1205135 1233803 1265358 1299645
61375 1299645 1336138 1374368 1413876 1453986 1494072 1533926 1573375 1611523 1646824 1678024 1704681
61364 1704681 1726663 1743475 1754380 1758990 1757545 1750624 1738660 1721731 1699826 1673275 1642780 1608839
61352 1608839 1571387 1530336 1486413 1441144 1396032 1351990 1309452 1268522 1228974 1190586 1153752
61341 1153752 1119365 1087871 1058810 1031581 1006284 983420 963073 944923 928944 915523 904866
61330 904866 896633 890265 885307 881370 878158 875780 874800 875751 878663 883180 889002 896059 904370 913901 924532
61315 924532 936013 947934 959848 971512 982937 994159 1004902 1014502 1022217 1027690 1031183 1033413
61303 1033413 1035072 1036368 1036951 1036406 1034961 1033440 1032276 1030718 1027518 1022442 1016554 1010776 1004708 997360
61289I97360q723r225r172r467j0197j0639j0384r702q927q178p697p774q156
61276H79119q092p255o203n597n342m846l901k901k298k239k631l248l722l756
61262H17088l453l210l153k924k100o82R93K660M258N872P749J0219J3272J6273
61248H62862J8541K0262K2365K5290K8275L0136L0481K9638K7777K4653K0239
61237A140519J5058R768M766K69l597o941r990j2663j4617j5780j6537j7211j7684
61224A055360j7709j7184j5918j3680j0906q955r072j1197j4179j6978j9169k0539
61212H79874k0896k0360j9314j7883j5860j3327j0923r245q228p316o069m529
61200G25924l196k703l279m441n420n902o143o365o518o667p053p564p622p008
$$ plain form
61289 997360 988637 979412 970240 960773 950576 939937 929553 919851 910924 902746 895049 887275 879119
61276 879119 871027 863772 857569 851972 846630 841784 837883 834982 832684 830445 827814 824566 820844 817088
61262 817088 813635 810425 807272 804348 802248 801566 802559 805219 809477 815349 823098 833317 846589 862862
61248 862862 881403 901665 924030 949320 977595 1007731 1038212 1067850 1095627 1120280 1140519
61237 1140519 1155577 1165345 1170111 1170380 1166783 1159842 1149852 1137189 1122572 1106792 1090255 1073044 1055360
61224 1055360 1037651 1020467 1004549 990869 979963 971008 961936 950739 936560 919582 900413 879874
61212 879874 858978 838618 819304 801421 785561 772234 761311 752066 743838 736522 730453 725924
61200 725924 722728 720025 716746 712305 706885 700983 694840 688475 681957 675290 668237 660673 653051 646043
61186F46043o369o474p250q104q903r927j0961j1237j0507r564r267r451r221
61173E28808q140o710n751n606n880n880n271m449m066m163l995l006j630p95
61159D63466p42q56o00j60m6m59j228k132l038l895m750n587o144o124n589m859
61143D17257l990k823j616j004j039r17j94L74n2r54j154o30n05j158j570r24
61127C99101J34M54j04p93j040p21J75J441K511L022L299L797M358M576M511M477
61111D29198M359L915L424L293L094J915k94k530m073n225o383p137o851n735
61097D10970m730m506m973n654o193o497o595o437n898n012m102l446k940k379
61083C41608j917j853k010j865j301p12l04J84Q71J460J817K255K908L364L321
$$ plain form
61186 646043 639674 633200 625950 617846 608943 599016 588055 576818 566311 556747 547480 538029 528808
61173 528808 520668 513958 508207 502601 496721 490841 485570 481121 477055 472892 468897 465891 464261 463466
61159 463466 462724 461868 461268 461108 461062 460603 459375 457243 454205 450310 445560 439973 433829 427705 422116 417257
61143 417257 413267 410444 408828 407824 406785 405868 405674 406048 405996 405042 403888 403258 402753 401595 400025 399101
61127 399101 399235 399689 399585 398792 397752 397031 397206 398647 401158 404180 407479 411276 415634 420210 424721 429198
61111 429198 433557 437472 440896 444189 447283 449198 448904 446374 442301 437076 430693 423556 416705 410970
61097 410970 406240 401734 396761 391107 384914 378417 371822 365385 359487 354475 350373 346927 343987 341608
61083 341608 339691 337838 335828 333963 332662 331950 331646 331830 332701 334161 335978 338233 341141 344505 347826
61068C47826L115L130L185L061L191M056N239N851N793N757O026O118N783N532
61054D13663N821O384O903P681R035J0445J1158J1389J2090J3467J4628J5023
61042E37687J5436J6897J9161K1011K1902K2390K3003K3519K3705K4090K5495
61031G74296K8256L2247L7331M3283M9648N6146O3027P0731P9723R1199J07328
61020A433215J29844J58575J92157K29998K72919L22549L81682M54998N47625
61011D123562O62650Q01279R63121J137923J289617J352466J258754R87130N91282
61002A3167784J79279j40924l05362l02481j61820N1717K41234L02428J71812
60993A3203667j35383n32195r07141j174468j297847j286878j180406j026409
$$ plain form
61068 347826 350941 354071 357256 360317 363508 367564 372803 378654 384447 390204 396230 402348 408131 413663
61054 413663 419484 425868 432771 440452 449487 459932 471090 482479 494569 508036 522664 537687
61042 537687 553123 570020 589181 610192 632094 654484 677487 701006 724711 748801 774296
61031 774296 802552 834799 872130 915413 965061 1021207 1084234 1154965 1234688 1325887 1433215
61020 1433215 1563059 1721634 1913791 2143789 2416708 2739257 3120939 3575937 4123562
61011 4123562 4786212 5587491 6550612 7688535 8978152 10330618 11589372 12576502 13167784
61002 13167784 13347063 13206139 12900777 12598296 12436476 12488193 12729427 13031855 13203667
60993 13203667 13068284 12536089 11628948 10454480 9156633 7869755 6689349 5662940
60985E662940q64048p14852n85822m77669l89270l17844k59691k12223j74213
60976A667308j44371j21104j03488r0779q1142p2385o4056n7202n1880m6577m0432
60965G93892l4415k9576k5557k1769j8806j7478j7299j7073j6519j6338j6889
60954E62173j7649j7910j7433j6388j5037j3537j1918j0375r422r336r548r229
60942D04391q561q584r547j0320r874q655p800p604p519p196o783o395n937n361
60928B94255m656l748k743k027j738j520j147r79j297j667j519j057q33p06j02
60913B68516Q18J050P2j410k281k136j290j64R26J608J534P21l47j073j227j071
60897B64246r59q44l39O78J669J843R12n97j721j803j009j61Q8j03j81n8j32n30
$$ plain form
60985 5662940 4798892 4084040 3498218 3020549 2631279 2313435 2053744 1841521 1667308
60976 1667308 1522937 1401833 1298345 1207566 1126424 1054039 989983 932781 880901 834324 793892
60965 793892 759477 729901 704344 682575 663769 646291 628992 611919 595400 579062 562173
60954 562173 544524 526614 509181 492793 477756 464219 452301 441926 432504 423168 413620 404391
60942 404391 395830 387246 377699 367379 357505 348850 341050 333446 325927 318731 311948 305553 299616 294255
60928 294255 289599 285851 283108 281081 279343 277823 276676 275697 274400 272733 271214 270157 269324 268618 268516
60913 268516 269334 270384 270456 269046 266765 264629 263339 263175 264101 265709 267243 267964 267617 266544 265317 264246
60897 264246 263287 262443 262104 262782 264451 266294 267206 266609 264888 263085 262076 261915 262003 261900 261719 261661 261529 260999
60879B60999q31p38n12n24p56r94j096q62q0R98J729J903K009K319K267J276k59
60862B66848j462k018k170j966j335o76o10j130j582j563j229p73j65N25J054
60847B51748J431K005K881L661L884L512K852K199J659J187P34M00L55N65P39
60832B79812O54K71m26j288j643p14J187K504K100O19m30n10l02m48r60j672k475
60815B76279l115l427l655l972l884k937j763j424j846j976j541j440k085k551
60801B40663k004j019o90j101j540j615j483j239q43m06n7L45R83J711K213K344
60785B36262K058J344M78o0j46j38j41L41J546K779L104K467J606J100R50R38
60769B54488R35R50J151J715K480L046L352L734M127L854K704J636J691K545K926
$$ plain form
60879 260999 260168 259430 258918 258394 257638 256644 255548 254686 254606 255604 257333 259236 261245 263564 265831 267107 266848
60862 266848 265386 263368 261198 259232 257897 257221 256611 255481 253899 252336 251107 250334 250169 250694 251748
60847 251748 253179 255184 258065 261726 265610 269122 271974 274173 275832 277019 277753 278153 278508 279073 279812
60832 279812 280466 280737 280311 279023 277380 276666 277853 280357 282457 283076 282646 282136 281834 281386 280426 278754 276279
60815 276279 273164 269737 266082 262110 258226 255289 253526 252102 250256 248280 246739 245299 243214 240663
60801 240663 238659 237640 236950 235849 234309 232694 231211 229972 229129 228723 228666 229011 229994 231705 233918 236262
60785 236262 238320 239664 240142 240082 239936 239798 239657 239998 241544 244323 247427 249894 251500 252600 253550 254488
60769 254488 255423 256373 257524 259239 261719 264765 268117 271851 275978 279832 282536 284172 285863 288408 291334
60754B91334K326J469J158J395J724J769J281K22r52j543j356q87o88q81j381
60739B94990k139k992l608l828l808l685l394k929k588k695l192l690l831l564
60725B49047l077k520j807p67M20J161J039L23l79q00j055j087o37J87P87P80
60709B41615N00N36R17J107P30K9m30m03j43NQ0L97R42J149N34n99j416j501j255
60690B42794j215j377j405j304j485k107k713k755k294j921j950k077j963j797
60676B16431j905k039j634p39j32k31m74j15P17J273J224R44Q40Q93Q97P82O60
60659B17392P66J344K341L210L412L063K812L061L604M042M182L958L286K264
60645B58737J244N31J52O1L43R23J305J013K87j2O15J622K035J701J485K156L356
$$ plain form
60754 291334 293660 295129 296287 297682 299406 301175 302456 302678 301726 300183 298827 297940 297252 296371 294990
60739 294990 292851 289859 286251 282423 278615 274930 271536 268607 266019 263324 260132 256442 252611 249047
60725 249047 245970 243450 241643 240876 241296 242457 243496 243819 243440 242640 241585 240498 239861 240048 240835 241615
60709 241615 242115 242651 243568 244675 245405 245434 245004 244601 244458 244463 244543 244940 245882 247031 247565 246966 245550 244049 242794
60690 242794 241579 240202 238797 237493 236008 233901 231188 228433 226139 224218 222268 220191 218228 216431
60676 216431 214526 212487 210853 210114 209982 209751 209277 209162 209879 211152 212376 213320 214160 215053 215950 216732 217392
60659 217392 218158 219502 221843 225053 228465 231528 234340 237401 241005 245047 249229 253187 256473 258737
60645 258737 259981 260512 260664 260725 261068 261991 263296 264309 264596 264584 265199 266821 268856 270557 272042 274198 277554
60628B77554M076L862L112K308J594J166J376K102K551K184J453J069R24L99n09
60613C05221j122j123r96j278j993k931l973m806m948m359l701l572l705l367
60599B63347k339j181n58o10j001j323j358j125p92o25q47j373j669j188n9Q46
60583B48145Q28J32m20l62K08J059J965K543K486K031J697J550J244P73N63P05
60567B65147P31M54L18O35R93R65Q03R50J284J500J836K691L857M813N595O637
60551B99209P853Q698R237J0291J2237J4367J5949J7327J9341K2003K4374K5569
60539D86455K5339K3534J9728J3715O123j829r161j5397k0110k2706k3012k1854
60527D60825k0498j9422j7973j5445j2154r197p300o233n262l875k092l51R32
$$ plain form
60628 277554 281630 285492 288604 290912 292506 293672 295048 297150 299701 301885 303338 304407 305331 305730 305221
60613 305221 304099 302976 301980 300702 298709 295778 291805 286999 282051 277692 273991 270419 266714 263347
60599 263347 261008 259827 259269 258659 257658 256335 254977 253852 253060 252435 251588 250215 248546 247358 247299 248145
60583 248145 248973 249105 248685 248323 248531 249590 251555 254098 256584 258615 260312 261862 263106 263879 264442 265147
60567 265147 265878 266332 266650 267285 268278 269243 270046 270996 272280 273780 275616 278307 282164 286977 292572 299209
60551 299209 307062 315760 324997 335288 347525 361892 377841 395168 414509 436512 460886 486455
60539 486455 511794 535328 555056 568771 574894 573065 563904 548507 528397 505691 482679 460825
60527 460825 440327 420905 402932 387487 375333 366136 358836 352603 347341 343466 341374 341023 341955
60514C41955J748K548L760N437P451R805J2454J5035J7219J9226K1531K3976K5692
60501E07837K5977K4858K2628J9332J5043J0292N946K835J726L167O938J1965
60489F58544J7395K3567L1378M0758N0396N8938O5728P0134P0840O6440N6457
60478A210575M1431K2398Q18k1176m1264n7845p0254p8156q1272p9899p5176o8511
60466G01669o0906n3024m5606l9327l4269k9910k5738k1663j7887j4632j2162
60455C46545j0800j0550j0721j0289q835p048n975n786n635m809l698l247l631
60442B55521l991l573k664k118k182k280j823r55k95j44j73Q1O06R91J078J149
60426B39228J298J037P7q44o39N47J276O82l72n67J33P98J130J588K089J746L14
$$ plain form
60514 341955 343703 346251 350011 355448 362899 372704 385158 400193 417412 436638 458169 482145 507837
60501 507837 533814 558672 581300 600632 615675 625967 631913 634748 636474 639641 646579 658544
60489 658544 675939 699506 730884 771642 822038 880976 946704 1016838 1087678 1154118 1210575
60478 1210575 1252006 1274404 1275222 1254046 1212782 1154937 1084683 1006527 925255 845356 770180 701669
60466 701669 640763 587739 542133 502806 468537 438627 412889 391226 373339 358707 346545
60455 346545 335745 325195 314474 304185 295350 288302 282327 276541 270906 266097 262399 259152 255521
60442 255521 251530 247957 245293 243175 240993 238713 236890 235935 235640 235496 235323 235404 236010 237001 238079 239228
60426 239228 240526 241563 241640 240796 240157 240704 241980 242662 242290 241723 241856 242654 243784 245372 247461 249207 249521
60409B49521j002q67N59J910K252J905J777K304L197L863M033L937L953M117M168
60394B85627M041L911L774L344K586J978J939K232K264J830J282J102J541K488
60380C19939L417L585K727J482Q11R75J307J097M01j17N3P88J535J811J532R37
60364C42280L05k45o55q15n90j4N97P18L6j088j721j238k1R50J196J036Q62O35
60346C42228L03J59L86N77K25m90q92p53n53q31j571k262k402j925j307j194j763
60329C27935k550l024l126l052k881k739l000l761m354m001k900k019j754j519
60315B87255q24o2K07K01N48J319J949K038J773J554J569J737J887J899J736J325
60299C06111M06j250l377n227o194o255n698m697l385k105j228q19p18p72p78
$$ plain form
60409 249521 248519 247652 248211 250121 252373 254278 256055 258359 261556 265419 269452 273389 277342 281459 285627
60394 285627 289668 293579 297353 300697 303283 305261 307200 309432 311696 313526 314808 315910 317451 319939
60380 319939 323356 326941 329668 331150 331961 332936 334243 335340 335741 335624 335677 336465 338000 339811 341343 342280
60364 342280 342585 342340 341685 340870 340280 340266 340863 341581 341617 340529 338808 337570 337549 338499 339695 340731 341593 342228
60346 342228 342531 342690 343076 343653 343878 343388 342496 341743 341190 340359 338788 336526 334124 332199 330892 329698 327935
60329 327935 325385 322361 319235 316183 313302 310563 307563 303802 299448 295447 292547 290528 288774 287255
60315 287255 286431 286369 286576 286777 287325 288644 290593 292631 294404 295958 297527 299264 301151 303050 304786 306111
60299 306111 306517 305267 301890 296663 290469 284214 278516 273819 270434 268329 267101 266282 265564 264792 264014
60284B64014m10M55J415J962K068K078K059J730J074N77O22R44R52M30k85o83
60268B79002m64K93J124J510J392J353K010L254M282M480M065L715L719L798L671
60253C17204L432L149K499J276R2n6R16J911J985J533J574K351L302M170N258
60238C50596O488P185P233P624R146J1092J2154J2263J2627J4004J5841J7403
60226D83656J8842K0676K2794K4730K6551K8808L1637L4480L6674L7963L8370
60215H05181L8073L7486L7046L6595L5283L2382K8108K3344J8745J4365J0040
60204A116648N745J490k804p061j0770j3263j4261j4144j3567j2935j2176j0873
60192A012029q641n419j609K207N800R511J3843J8777K3740K8279L2515L6738
$$ plain form
60284 264014 263604 264059 265474 267436 269504 271582 273641 275371 276445 277022 277644 278588 279540 279970 279685 279002
60268 279002 278538 278831 279955 281465 282857 284210 286220 289474 293756 298236 302301 306016 309735 313533 317204
60253 317204 320636 323785 326284 327560 327652 327596 328512 330423 332408 333941 335515 337866 341168 345338 350596
60238 350596 357084 364269 371502 379126 388272 399364 411518 423781 436408 450412 466253 483656
60226 483656 502498 523174 545968 570698 597249 626057 657694 692174 728848 766811 805181
60215 805181 843254 880740 917786 954381 989664 1022046 1050154 1073498 1092243 1106608 1116648
60204 1116648 1122393 1123883 1121079 1114018 1103248 1089985 1075724 1061580 1048013 1035078 1022902 1012029
60192 1012029 1003388 997969 996360 998567 1004367 1013878 1027721 1046498 1070238 1098517 1131032 1167770
60180A167770M0749M3942M5896M6555M5795M3321L9225L4298K9348K4318J8457
60169A579674J1389L632l943j0864j7097k2725k7788l2234l5746l7799l8247l7659
60157A330593l6713l5221l2223k7247k1121j5261j0340n920j239L978R365J4238
60145A172889J8000K0479K1925K2515K2013K0103J7122J3938J1000P854L934m54
60133A351318m370p280r408j1040j1925j1615j0040p484m127K1M750R577J4203
60120A302580J8943K4447L0871L7560M3704M9319N5235O2075O9432P6297Q2082
60109A852545Q6936R1129R4491R6580R7090R5868R2657Q7208P9598P0320N9833
60098B804255M8129L4907K0270N115r390k2783l5487m7946n9726o9743p7197q2006
$$ plain form
60180 1167770 1208519 1252461 1298357 1344912 1390707 1434028 1473253 1507551 1536899 1561217 1579674
60169 1579674 1591063 1594695 1590752 1579888 1562791 1540066 1512278 1480044 1444298 1406499 1368252 1330593
60157 1330593 1293880 1258659 1226436 1199189 1178068 1162807 1152467 1146547 1145308 1149286 1158651 1172889
60145 1172889 1190889 1211368 1233293 1255808 1277821 1297924 1315046 1328984 1339984 1347838 1351772 1351318
60133 1351318 1346948 1339668 1330260 1319220 1307295 1295680 1285640 1278156 1274029 1274050 1278800 1288377 1302580
60120 1302580 1321523 1345970 1376841 1414401 1458105 1507424 1562659 1624734 1694166 1770463 1852545
60109 1852545 1939481 2030610 2125101 2221681 2318771 2414639 2507296 2594504 2674102 2744422 2804255
60098 2804255 2852384 2887291 2907561 2912676 2903286 2880503 2845016 2797070 2737344 2667601 2590404 2508398
60086B508398q4471q4935q3772q1268p7412p2106o5753n9245n3139m7179m0941
60075A758177l4574k8478k2625j6788j1287o799l292J52M113P956J0639J2026
60063A669220J2781J3166J2715J1187R230P561N856L030j338o275j0428j3524
60051A713181j6554k0434k4811k8484l0844l2517l4339l6093l6732l5766l3810
60040A382797l1613k9067k5575k1079j6167j1338o683k226K047O516J1733J7674
60028A277019K3637K9123L4329L9366M3602M6328M7788M8790M9363M8455M5095
60017A732895L9309L1767K3044J3620M226m400j2193j9866k8016l6198m3092m7749
60005A653347n0457n2077n2711n1586m8293m3605l8634l3737k8678k3412j8091
$$ plain form
60086 2508398 2423927 2338992 2255220 2173952 2096540 2024434 1958681 1899436 1846297 1799118 1758177
60075 1758177 1723603 1695125 1672500 1655712 1644425 1637626 1634334 1634486 1638599 1646555 1657194 1669220
60063 1669220 1682001 1695167 1707882 1719069 1728299 1735860 1741716 1744746 1743408 1737133 1726705 1713181
60051 1713181 1696627 1676193 1651382 1622898 1592054 1559537 1525198 1489105 1452373 1416607 1382797
60040 1382797 1351184 1322117 1296542 1275463 1259296 1247958 1241275 1239049 1241096 1247612 1259345 1277019
60028 1277019 1300656 1329779 1364108 1403474 1447076 1493404 1541192 1589982 1639345 1687800 1732895
60017 1732895 1772204 1803971 1827015 1840635 1844861 1840461 1828268 1808402 1780386 1744188 1701096 1653347
60005 1653347 1602890 1550813 1498102 1446516 1398223 1354618 1315984 1282247 1253569 1230157 1212066
59994A212066j2622o914j346L773R026J5298K2412K9253L5366M1473M7993N4029
59982A449807N8439O1221O3041O3804O2531N8610N2492M5135L7108K8363J8724
59971A999275Q549j230r954j8041k6383l4913m2356m7620n0741n2169n1852m9648
59959A622917m6026m1583l6229k9639k2286j5289r235l719J992Q252J4877K1258
59947A465290K6726L1225L5291L9071M1790M2807M2698M2492M2127M0583L7413
59936A887513L3256K8859K4463K0215J6330J2651Q932N704M033M115M936N768
59924B056775P205J0254J4987K0669K6684L2736L8538M3855M8692N3007N6552
59913B409954N9155O0749O0884N8713N3947M7344L9750L1115K0954R491k347j3819
$$ plain form
59994 1212066 1199444 1192530 1191184 1194957 1203983 1219281 1241693 1270946 1306312 1347785 1395778 1449807
59982 1449807 1508246 1569467 1632508 1696312 1758843 1817453 1869945 1915080 1952188 1980551 1999275
59971 1999275 2007824 2006594 1996640 1978599 1952216 1917303 1874947 1827327 1776586 1724417 1672565 1622917
59959 1622917 1576891 1535308 1499079 1469440 1447154 1431865 1422630 1418911 1420903 1429155 1444032 1465290
59947 1465290 1492016 1523241 1558532 1597603 1639393 1682200 1724898 1767390 1809517 1850100 1887513
59936 1887513 1920769 1949628 1974091 1994306 2010636 2023287 2032219 2037923 2041956 2046071 2051007 2056775
59924 2056775 2063980 2074234 2089221 2109890 2136574 2169310 2207848 2251703 2300395 2353402 2409954
59913 2409954 2469109 2529858 2590742 2649455 2703402 2750746 2790496 2821611 2842565 2852056 2849709 2835890
59901B835890k4627l4421m2700m9271n4323n7970o0001o0243n8872n6345n3135
59890B283982m9499m5354m0493l4982k9212k3388j7422j1426n972j412K748P309
59878B034879J2281J6815K0096K1959K2688K2617K1944K0611J8390J5204J1221
59867B238705O478P31n924j2619j8435k3308k7672l1479l4331l6436l8527m0769
59855A976414m2579m3751m4776m5667m5416m3331m0190l7187l4316l0937k7477
59844A540787k5333k4937k5096k4692k4007k3825k3973k3652k2696k1638k0658
59833A280280j9329j7419j5337j3564j2072j0469q465o131l907k340j500p74L59
59820A169332J491J780J245Q59J178J579J216J16j092j998k384j993r66j31q2
$$ plain form
59901 2835890 2811263 2776842 2734142 2684871 2630548 2572578 2512577 2452334 2393462 2337117 2283982
59890 2283982 2234483 2189129 2148636 2113654 2084442 2061054 2043632 2032206 2026234 2024822 2027570 2034879
59878 2034879 2047160 2063975 2084071 2106030 2128718 2151335 2173279 2193890 2212280 2227484 2238705
59867 2238705 2245183 2245914 2239990 2227371 2208936 2185628 2157956 2126477 2092146 2055710 2017183 1976414
59855 1976414 1933835 1890084 1845308 1799641 1754225 1710894 1670704 1633517 1599201 1568264 1540787
59844 1540787 1515454 1490517 1465421 1440729 1416722 1392897 1368924 1345272 1322576 1300938 1280280
59833 1280280 1260951 1243532 1228195 1214631 1202559 1192090 1183625 1177494 1173587 1171247 1169747 1168973 1169332
59820 1169332 1170823 1172603 1173848 1174707 1175885 1177464 1178680 1178796 1177704 1175706 1173322 1171329 1170363 1170232 1170150
59805A170150k44L94J841L175L897M314M601M430L776L278L421L971M484M843
59791A216331M957M585L780K997K382J533L52m69l22M93J414K601M562P178R827
59776A262201J2346J5155J8498K2201K6173L0608L5609M1139M7394N4688O2883
59765A628895P1380P9867Q8576R7479J05511J10905J12086J07915R7280P9089
59755B578983N3245K1705j1691m2641o7867q5597r5325r7738r4578q7835p8716
59744A991945o7747n5889m4860l5852k8470k1535j4673q477l289J497O683J2382
59732A731715J8073K3299K8013L2436L6768M1105M5610N0660N6572O3130O9722
59721B197103P6157Q3033R0981R9769J08648J17444J26782J37106J47895J58121
$$ plain form
59805 1170150 1169906 1170300 1172141 1175316 1179213 1183527 1188128 1192558 1196334 1199612 1203033 1207004 1211488 1216331
59791 1216331 1221288 1225873 1229653 1232650 1235032 1236565 1236917 1236448 1236126 1236619 1238033 1240634 1245196 1252374 1262201
59776 1262201 1274547 1289702 1308200 1330401 1356574 1387182 1422791 1463930 1511324 1566012 1628895
59765 1628895 1700275 1780142 1868718 1966197 2071708 2182613 2294699 2402614 2499894 2578983
59755 2578983 2632228 2653933 2642242 2599601 2531734 2446137 2350812 2253074 2158496 2070661 1991945
59744 1991945 1924198 1868309 1823449 1787597 1759127 1737592 1722919 1714442 1711153 1712650 1719333 1731715
59732 1731715 1749788 1773087 1801100 1833536 1870304 1911409 1957019 2007679 2064251 2127381 2197103
59721 2197103 2273260 2356293 2447274 2547043 2655691 2773135 2899917 3037023 3184918 3343039
59711C343039J67197J75236J82395J88189J91517J91360J87384J79837J69053
59702D975207J55257J38969J21268J03499Q6729P1592N8424M7480L8986L2957
59692E830368K8950K6085K3665K1638K0089J8482J6021J2758R723P653O222M828
59680F026482L521K795K976M366P455J2367J8486K5123L2258M0204M8964N8375
59668F283372O8363P8560Q8173R6811J04938J12706J19018J22628J23609J22600
59658G320778J18943J10907R7677P9988N8767L4321P046k2227n2823q4109j14472
59647G554796j41449j63405j80210j92057j98550j99509j95609j87572j75603
59638E920832j60414j44169j29640j18968j13787j15760j25826j42990j64437
$$ plain form
59711 3343039 3510236 3685472 3867867 4056056 4247573 4438933 4626317 4806154 4975207
59702 4975207 5130464 5269433 5390701 5494200 5580929 5652521 5710945 5758425 5797411 5830368
59692 5830368 5859318 5885403 5909068 5930706 5950795 5969277 5985298 5998056 6007779 6015432 6021654 6026482
59680 6026482 6030003 6032798 6035774 6040140 6047595 6059962 6078448 6103571 6135829 6176033 6224997 6283372
59668 6283372 6351735 6430295 6518468 6615279 6720217 6832923 6951941 7074569 7198178 7320778
59658 7320778 7439721 7550628 7648305 7728293 7787060 7821381 7828427 7806200 7753377 7669268 7554796
59647 7554796 7413347 7249942 7069732 6877675 6679125 6479616 6284007 6096435 5920832
59638 5920832 5760418 5616249 5486609 5367641 5253854 5138094 5012268 4869278 4704841
59629D704841j86621k05944k19149k24228k21244k11924j98477j82852j66543
59620B887859j50440j34969j20602j07887r6738q6387p6547o8029o1557n6382
59610A928321n1006m5042l9549l5563l2991l1071k9249k7400k5534k3628k1672
59599A565616j9787j8286j7362j6736j5967j5114j4718j4962j5419j5802j6314
59588A385149j6902j6846j5721j4183j3174j2783j2525j2234j1954j1446j0499
59577A236882r383q249o649m443k612k079k176j531j59P25R10J632L485N382O203
59562A217938O438P326R264J1784J4390J6681J8229J9069J9961K1505K3408K5085
59550A411078K6626K8586L1112L3785L6165L8205M0349M3383M7697N2296N4937
$$ plain form
59629 4704841 4518220 4312276 4093127 3868899 3647655 3435731 3237254 3054402 2887859
59620 2887859 2737419 2602450 2481848 2373961 2277223 2190836 2114289 2046260 1984703 1928321
59610 1928321 1877315 1832273 1792724 1757161 1724170 1693099 1663850 1636450 1610916 1587288 1565616
59599 1565616 1545829 1527543 1510181 1493445 1477478 1462364 1447646 1432684 1417265 1401463 1385149
59588 1385149 1368247 1351401 1335680 1321497 1308323 1295540 1283015 1270781 1258827 1247381 1236882
59577 1236882 1227499 1219250 1212601 1208158 1205546 1203467 1201291 1199760 1199601 1200326 1201236 1202868 1206353 1211735 1217938
59562 1217938 1224376 1231702 1240966 1252750 1267140 1283821 1302050 1321119 1341080 1362585 1385993 1411078
59550 1411078 1437704 1466290 1497402 1531187 1567352 1605557 1645906 1689289 1736986 1789282 1844219
59539A844219N3750M8581M0808L2384K5247K0751J8828J8042J6997J5440J3678
59528B148725J1555Q657N057J154k931p121j0892j3845j6487j9674k3320k6414
59516B054464k8219k8849k8669k7923k6883k5697k4023k1478j8399j5388j2090
59505A796846p407j181N205J0466J4955K0017K6343L3556M0930M7907N4095N9370
59493B101102O3914O7778P0606P1999P1901P0224O6384N9716N0286L8908K6453
59482B759271J3477L95j2387k4554l5809m5689n3673n9488o3071o4388o3534o0915
59470B289635n7090n2401m6954m0821l4151k7206k0550j4973j0861p789n079k700
59458A969060j147n98o98j229k527m985q526j2723j7180k1551k5563k9156l2518
$$ plain form
59539 1844219 1897969 1946550 1987358 2019742 2044989 2065740 2084568 2102610 2119607 2135047 2148725
59528 2148725 2160280 2168937 2173994 2175148 2172217 2165096 2154204 2140359 2123872 2104198 2080878 2054464
59516 2054464 2026245 1997396 1968727 1940804 1913921 1888224 1864201 1842723 1824324 1808936 1796846
59505 1796846 1789439 1788258 1793463 1803929 1818884 1838901 1865244 1898800 1939730 1987637 2041732 2101102
59493 2101102 2165016 2232794 2303400 2375399 2447300 2517524 2583908 2643624 2693910 2732818 2759271
59482 2759271 2772748 2773143 2760756 2736202 2700393 2654704 2601031 2541543 2478472 2414084 2350550 2289635
59470 2289635 2232545 2180144 2133190 2092369 2058218 2031012 2010462 1995489 1984628 1976839 1971760 1969060
59458 1969060 1967913 1967315 1966617 1965388 1962861 1957876 1949350 1936627 1919447 1897896 1872333 1843177 1810659
59445A810659l5771l8789m1363m3317m4471m4800m4713m4785m5047m4886m3837
59434A338880m2154m0357l8550l6537l4291l1922k9351k6513k3745k1564j9890
59423I94006j7926j4934j1053p166l933j018K518O833J0434J1147Q121K586l340
59410I76275q116j0907j1178r003n369j406K683P126J1125J2692J0299M217l804
59397I74634j1643j7435j9984j9329j6684j3422j0144o881l784j137J129L370
59385H58690N740Q048J0155J2106J3913J5453J6746J8096J9766K1636K3399K5060
59373A048808K7048K9674L2650L5299L7235L8675M0084M1749M3781M6295M9383
59362A470681N3043N7294O2223O7814P3929Q0600Q8046R6222J04622J12871J21189
$$ plain form
59445 1810659 1774888 1736099 1694736 1651419 1606948 1562148 1517435 1472650 1427603 1382717 1338880
59434 1338880 1296726 1256369 1217819 1181282 1146991 1115069 1085718 1059205 1035460 1013896 994006
59423 994006 976080 961146 950093 942927 938994 937976 940494 947327 957761 968908 977029 979615 976275
59410 976275 968159 957252 946074 937071 931702 930296 932979 940105 951230 963922 974221 978438 974634
59397 974634 962991 945556 925572 906243 889559 876137 865993 859112 855328 854191 855320 858690
59385 858690 864430 872478 882633 894739 908652 924105 940851 958947 978713 1000349 1023748 1048808
59373 1048808 1075856 1105530 1138180 1173479 1210714 1249389 1289473 1331222 1375003 1421298 1470681
59362 1470681 1523724 1581018 1643241 1711055 1784984 1865584 1953630 2049852 2154474 2267345 2388534
59351B388534J29802J38193J45474J51345J56036J59337J60352J58329J53270
59342C740672J45563J35561J23661J10299R5698Q0052O4005M8380L3296J8128
59332D595315K619j2627k7089m1180n5652p0624q5554r9779j12648j23560j32311
59321C836910j39098j43853j46010j45328j42473j38256j32713j25509j16851
59312B606819j07453r8047q9557q3262p9790p8060p6063p2649o7999o2637n6930
59301A734372n1469m6848m2792l8407l3573k9298k6235k3642k0421j6635j3319
59290A391733j1117r748q617p397o057m738l627k642j322P20L227N427O851P829
59276A360522R121J1075J3261J4962J5980J6769J7710J8518J8623J7905J6726
$$ plain form
59351 2388534 2518336 2656529 2802003 2953348 3109384 3268721 3429073 3587402 3740672
59342 3740672 3886235 4021796 4145457 4255756 4351454 4431506 4495511 4543891 4577187 4595315
59332 4595315 4597934 4585307 4558218 4517038 4461386 4390762 4305208 4205429 4092781 3969221 3836910
59321 3836910 3697812 3553959 3407949 3262621 3120148 2981892 2849179 2723670 2606819
59312 2606819 2499366 2401319 2311762 2228500 2148710 2070650 1994587 1921938 1853939 1791302 1734372
59301 1734372 1682903 1636055 1593263 1554856 1521283 1491985 1465750 1442108 1421687 1405052 1391733
59290 1391733 1380616 1370868 1362251 1354854 1348797 1344059 1340432 1337790 1336468 1337188 1340415 1345842 1352693 1360522
59276 1360522 1369643 1380718 1393979 1408941 1424921 1441690 1459400 1477918 1496541 1514446 1531172
59265A531172J5278J3378J0965Q334N700K843n95m630q911j3023j6638j9587k1985
59252A502301k4153k6257k8098k9458l0416l1160l1585l1423l0721k9936k9283
59241A179811k8335k6590k4418k2846k2209k1525j9721j7117j4981j3714j2454
59230I55901j0622q844p819p107n876m237k955k140j186K46J990L990O234Q172
59216I25747R129R460J0347J2310J4644J6653J8592K1077K4263K8011L2244L6744
59204A159221M1159M5544N0451N6124O2128O8054P3991Q0001Q5784R1135R6060
59193A909652R9967J01634J00552R7536R3197Q6506P5937O1567M5056K7837J0378
59182B709819p061k4054m0457n6170p0206q0951q7775r1664r3891r4656r3431
$$ plain form
59265 1531172 1546450 1559828 1570793 1579127 1584827 1587670 1587075 1582445 1573534 1560511 1543873 1524286 1502301
59252 1502301 1478148 1451891 1423793 1394335 1363919 1332759 1301174 1269751 1239030 1209094 1179811
59241 1179811 1151476 1124886 1100468 1077622 1055413 1033888 1014167 997050 982069 968355 955901
59230 955901 945279 936435 928616 921509 915633 911396 908441 906301 905115 905361 907351 911341 917575 925747
59216 925747 934876 944336 954683 966993 981637 998290 1016882 1037959 1062222 1090233 1122477 1159221
59204 1159221 1200380 1245924 1296375 1352499 1414627 1482681 1556672 1636673 1722457 1813592 1909652
59193 1909652 2009619 2111253 2211805 2309341 2402538 2489044 2564981 2626548 2671604 2699441 2709819
59182 2709819 2702758 2678704 2638247 2582077 2511871 2430920 2343145 2251481 2157590 2062934 1969503
59171A969503r0051q4936p8597p1472o4152n7304n1340m6194m1415l6565l1685
59160A315792k7319k3777k0605j7247j4121j2266j1793j1416j0092q480q108r356
59148A141212j1073j2055j2201j2018j1664j0961j0046r443r464r806r841r176
59136A013464p947o612n581m898m250l266j820q9J587K880L672M305N413P235
59122A004093R070R846R399Q783Q986R736J0020R534Q953Q862R093R260R346R412
59108A134393R211Q500P427O271N082L855K769J919J057Or42j368j355j309j314
59093A174202j113o60l25m04o88o40L1J068J834K022K088K727L847M541M305L807
59077A196642L935M488M495L585K384J527R50K77o62j942l748o100q572j0543
$$ plain form
59171 1969503 1879452 1794516 1715919 1644447 1580295 1522991 1471651 1425457 1384042 1347477 1315792
59160 1315792 1288473 1264696 1244091 1226844 1212723 1200457 1188664 1177248 1167156 1158676 1150568 1141212
59148 1141212 1130139 1118084 1105883 1093865 1082201 1071240 1061194 1051751 1042287 1032481 1022640 1013464
59136 1013464 1005517 998905 993324 988426 984176 980910 979090 979001 980588 983468 987140 991445 996858 1004093
59122 1004093 1013163 1023009 1032408 1041191 1050177 1059913 1069933 1079467 1088420 1097282 1106375 1115635 1124981 1134393
59108 1134393 1143604 1152104 1159531 1165802 1170884 1174739 1177508 1179427 1180484 1180490 1179548 1178180 1176825 1175516 1174202
59093 1174202 1173089 1172429 1172104 1171700 1171012 1170372 1170403 1171471 1173305 1175327 1177415 1180142 1183989 1188530 1192835 1196642
59077 1196642 1200577 1205065 1209560 1213145 1215529 1217056 1218006 1218283 1217621 1215679 1211931 1205831 1197259 1186716
59063A186716j1705j2314j3060j4500j6467j8152j8975j9156j9155j8959j8453
59052A005820j8097j8447j9174j9362j8818j8221j7831j7079j5781j4790j4776
59041H13444j5088j4658j3500j2473j1892j1268j0286r279q556p926o987n592
59029F85939l940k541j908j937j751o72P89J474J041K54k31o08j218j796j941
59014F70954j822j871k018j857j424j273j696k293k499k296k111k150k127j718
59000F43799j101p73q73r70p42n38q89j571j738j047j20L90P22J517K798L988
58984F42852M770N406O123O814P428Q227R454J0958J2290J2943J2512J0981R002
58971G59760P435O474N575M347L068J975O70j172k922l624l353l203l824m657
$$ plain form
59063 1186716 1175011 1162697 1149637 1135137 1118670 1100518 1081543 1062387 1043232 1024273 1005820
59052 1005820 987723 969276 950102 930740 911922 893701 875870 858791 843010 828220 813444
59041 813444 798356 783698 770198 757725 745833 734565 724279 715000 706444 698518 691531 685939
59029 685939 681999 679458 677550 675613 673862 673190 673979 675453 676494 676748 676517 675909 674691 672895 670954
59014 670954 669132 667261 665243 663386 661962 660689 658993 656700 654201 651905 649794 647644 645517 643799
59000 643799 642698 641925 641052 640082 639340 638802 637913 636342 634604 633557 633437 633827 634549 636066 638864 642852
58984 642852 647622 653028 659151 665965 673393 681620 691074 702032 714322 727265 739777 750758 759760
58971 759760 767195 773669 779244 783591 786659 788634 789304 788132 785210 781586 778233 775030 771206 766549
58957G66549m845m349l800l686l996m422m588m273l597k803j781k16J676L029
58943G28898L346L211L545M464N434O266P276Q484R347R554R600J0197J1407J2651
58929H33680J3439J3809J4099J4539J5163J5993J7138J8635K0250K1639K2798
58918A021182K4118K5934K8117L0296L2301L4180L5927L7481L8866M0068M0878
58907A389348M1045M0642L9935L9115L8397L8270L9180M0980M3063M5108M7299
58896A842382M9823N2590N5523N8685O1937O4975O7797P0699P3519P5541P6501
58885B549972P7140P8157P9033P8673P6931P4656P2226O8840O3523N6299M8039
58874C323489L9607L1448K3649J6044Q411Q23o434j3375k0425k7783l5030m1731
$$ plain form
58957 766549 761704 757355 753555 749869 745873 741451 736863 732590 728993 726190 724409 724193 725869 728898
58943 728898 732244 735455 739000 743464 748898 755164 762440 770924 780271 789825 799425 809622 821029 833680
58929 833680 847119 860928 875027 889566 904729 920722 937860 956495 976745 998384 1021182
58918 1021182 1045300 1071234 1099351 1129647 1161948 1196128 1232055 1269536 1308402 1348470 1389348
58907 1389348 1430393 1471035 1510970 1550085 1588482 1626752 1665932 1706912 1749975 1795083 1842382
58896 1842382 1892205 1944795 2000318 2059003 2120940 2185915 2253712 2324411 2397930 2473471 2549972
58885 2549972 2627112 2705269 2784302 2862975 2939906 3014562 3086788 3155628 3219151 3275450 3323489
58874 3323489 3363096 3394544 3418193 3434237 3442648 3443471 3437037 3423662 3403237 3375454 3340424 3298693
58862C298693m8018n4119n9583o3643o6325o8531p0842p2811p3735p3664p3196
58851B574226p2594p1642p0204o8438o6390o3931o1197n8695n6708n4853n2491
58840A877083m9408m5864m2213l8722l5635l3037l0636k7975k4939k1853j8989
58829A507812j6312j3784j1613r920q398o675m858l305j941k81J729L398M174
58816A440026M515N404P236R569J1904J4116J6072J7453J8245J9037K0403K2294
58804A606274K4379K6676K9408L2374L5051L7293L9566M2300M5436M8666N1839
58793B019262N4986N8186O1533O5040O8508P1643P4357P6696P8466P9264P9038
58782B786979P8216P7121P5489P2820O8930O3890N7617M9916M0868L0890K0383
$$ plain form
58862 3298693 3250675 3196556 3136973 3073330 3007005 2938474 2867632 2794821 2721086 2647422 2574226
58851 2574226 2501632 2429990 2359786 2291348 2224958 2161027 2099830 2041135 1984427 1929574 1877083
58840 1877083 1827675 1781811 1739598 1700876 1665241 1632204 1601568 1573593 1548654 1526801 1507812
58829 1507812 1491500 1477716 1466103 1456183 1447785 1441110 1436252 1432947 1431006 1430725 1432454 1435852 1440026
58816 1440026 1444541 1449945 1457181 1466750 1478654 1492770 1508842 1526295 1544540 1563577 1583980 1606274
58804 1606274 1630653 1657329 1686737 1719111 1754162 1791455 1831021 1873321 1918757 1967423 2019262
58793 2019262 2074248 2132434 2193967 2259007 2327515 2399158 2473515 2550211 2628677 2707941 2786979
58782 2786979 2865195 2942316 3017805 3090625 3159555 3223445 3281062 3330978 3371846 3402736 3423119
58771C423119R430k079j4053k5871l6534m5359n2646n9334o5904p1893p6618q0052
58759B902206q2662q4649q5828q6089q5588q4477q2753q0413p7592p4483p1285
58748B006387o8174o5211o2342n9597n7036n4413n1235m7484m3977m1515l9864
58737A415539l8098l5836l3591l1868l0549k9325k8160k7059k5851k4466k3081
58726A087655k1635j9688j7114j4606j2931j1886j0617q820p041n665m297k587
58714I50768j183j258l115n859q565j1286j4598j8458k2011k4439k5569k5635
58702G88792k4849k3404k1622j9801j8051j6440j5052j3801j2388j0736r208q135
58690E95305p301o179m620k896j273J23J035J112L64p64j830k784l818n087o595
$$ plain form
58771 3423119 3432549 3430470 3416417 3390546 3354012 3308653 3256007 3196673 3130769 3058876 2982258 2902206
58759 2902206 2819544 2734895 2649067 2562978 2477390 2392913 2310160 2229747 2152155 2077672 2006387
58748 2006387 1938213 1873002 1810660 1751063 1694027 1639614 1588379 1540895 1496918 1455403 1415539
58737 1415539 1377441 1341605 1308014 1276146 1245597 1216272 1188112 1161053 1135202 1110736 1087655
58726 1087655 1066020 1046332 1029218 1014612 1001681 989795 979178 970358 963317 957652 953355 950768
58714 950768 949585 948327 945212 939353 930788 919502 904904 886446 864435 839996 814427 788792
58702 788792 763943 740539 718917 699116 681065 664625 649573 635772 623384 612648 603440 595305
58690 595305 588004 581825 577205 574309 573036 573159 574194 575306 575670 574906 573076 570292 566474 561387 554792
58675E54792q114r131r116q031o374m671l097j621l18O36J135J176Q76M32j7n93
58659E07964j578k982m361n243n669o173p139q216q522p598o058n011m828m789
58645D29797m177l194k472k047j415m21N67J317K000K656L039L135L282L579L696
58630D39342L594L837M724N626N761N303N041N108M816L744K421J650J683K236
58616D94886K905L310L252L034L312M250N145N340N273N966P607R300J0328J0952
58602E74860J1651J2271J2587J3002J4033J5350J6261J6871J7868J9263K0375
58591G44392K1161K2374K4031K4928K4357K3367K3246K3590K2991K1147J9020
58580I94604J7169J5105J2364R147N764K314r15l513n607p726r882j1562j2722
$$ plain form
58675 554792 546678 537547 528431 520400 514026 509355 506258 504637 504319 504955 506090 507266 508142 508574 508557 507964
58659 507964 506386 503404 499043 493800 488131 481958 474819 466603 458081 450483 444425 439414 434586 429797
58645 429797 425620 422426 419954 417907 416492 416071 416638 417955 419955 422611 425650 428785 432067 435646 439342
58630 439342 442936 446773 451497 457123 462884 468187 473228 478336 483152 486896 489317 490967 492650 494886
58616 494886 497791 501101 504353 507387 510699 514949 520094 525434 530707 536673 544280 553580 563908 574860
58602 574860 586511 598782 611369 624371 638404 653754 670015 686886 704754 724017 744392
58591 744392 765553 787927 811958 836886 861243 884610 907856 931446 954437 975584 994604
58580 994604 1011773 1026878 1039242 1048389 1054153 1056467 1055552 1052039 1046432 1038706 1028824 1017262 1004540
58567A004540j3933j5269j6023j5878j5519j5566j5640j5144j4300j3742j3527
58556H39999j3218j2683j2202j2017j2197j2770j3546j4048j4007j3716j3645
58545F95950j3864j4151j4360j4413j4193j3651j2822j1596r898q209p370p535
58533E53888p860p589o849n985m787l141j819j673k295k421j634q26q42j447j908
58518E02812k005j970j873j465o30L19Q37O87K09o6j29n61j739l230m212m374
58502D82610m094l844l697l369k548j259KO42O20N57R90J791K435K654K536K250
58486D78276J950J761J603J247P03L48L77M43J46l36m77o5O23J180J310R37L63
58469D90389J03L36O79P79Q67J360K214L003L427L407K937K208J633J346R52J57
$$ plain form
58567 1004540 990607 975338 959315 943437 927918 912352 896712 881568 867268 853526 839999
58556 839999 826781 814098 801896 789879 777682 764912 751366 737318 723311 709595 695950
58545 695950 682086 667935 653575 639162 624969 611318 598496 586900 577002 568793 561423 553888
58533 553888 546028 538439 531590 525605 520818 517677 515858 514185 511890 509469 507835 507009 506167 504720 502812
58518 502812 500807 498837 496964 495499 494869 495188 496025 496712 496921 496855 496726 496165 494426 491196 486984 482610
58502 482610 478516 474672 470975 467606 465058 463799 463801 464443 465063 465620 466610 468401 470836 473490 476026 478276
58486 478276 480226 481987 483590 484837 485540 485888 486265 486708 486854 486518 486041 485976 486599 487779 489089 490026 490389
58469 490389 490492 490828 491507 492286 493153 494513 496727 499730 503157 506564 509501 511709 513342 514688 515640 515797
58453E15797o09p08k29J41K2l78p96j165j360j205p40j50N85J524K310K401J820
58436E17260J312J586K646L906M730M835M387L826L453L274L256L487L850L935
58422E65743L603L450M149N481O365N996M589L088K351K580L249L651L636L731
58408F21662M387N377O152O558O827P142P487P750P727P269O664O519O938P197
58394G15656O651N610M810M380L944L439L115K885K366J606J168J463K380L591
58380G63064M764N480N446M869M331M257M691N456O257O777O933O916O859O707
58366H42807O565O695O961O840O337O236O940P733P825P515P568Q035Q504R001
58352I45562R687J0196J0237J0425J1401J2502J2574J1852J1739J2705J3697J3807
$$ plain form
58453 515797 515188 514480 514251 514392 514414 514036 513240 512075 510715 509510 508770 508620 509205 510729 513039 515440 517260
58436 517260 518572 520158 522804 526710 531440 536275 540662 544488 547941 551215 554471 557958 561808 565743
58422 565743 569346 572796 576945 582426 588791 594787 599376 602464 604815 607395 610644 614295 617931 621662
58408 621662 626049 631426 637578 644136 650963 658105 665592 673342 681069 688338 695002 701521 708459 715656
58394 715656 722307 727917 732727 737107 741051 744490 747605 750490 752856 754462 755630 757093 759473 763064
58380 763064 767828 773308 778754 783623 787954 792211 796902 802358 808615 815392 822325 829241 836100 842807
58366 842807 849372 856067 863028 869868 876205 882441 889381 897114 904939 912454 920022 928057 936561 945562
58352 945562 955249 965445 975682 986107 997508 1010010 1022584 1034436 1046175 1058880 1072577 1086384
58340A086384J3359J3034J2940J2937J3011J3047J2911J2929J3502J4268J4432
58329A232754J4001J3694J3671J3400J2985J3392J4983J6779J7780J8050J8115
58318A399604J8084J8034J8445J9601K1061K2215K2954K3503K3999K4533K5134
58307A637167K5529K5436K5161K5286K5855K6462K7156K8333K9726L0446L0258
58296A936815K9919L0017L0379L0876L1795L3052L3995L4422L4982L6101L7332
58285B299685L8232L9138M0537M2306M4023M5482M6589M7347M8183M9696N1877
58274B793095N4174N6359N8619O0841O2750O4785O7743P1402P4567P6755P8832
58263C519922Q1678Q5226Q9025R2746R5910R8213J00335J03414J07561J11980
$$ plain form
58340 1086384 1099743 1112777 1125717 1138654 1151665 1164712 1177623 1190552 1204054 1218322 1232754
58329 1232754 1246755 1260449 1274120 1287520 1300505 1313897 1328880 1345659 1363439 1381489 1399604
58318 1399604 1417688 1435722 1454167 1473768 1494829 1517044 1539998 1563501 1587500 1612033 1637167
58307 1637167 1662696 1688132 1713293 1738579 1764434 1790896 1818052 1846385 1876111 1906557 1936815
58296 1936815 1966734 1996751 2027130 2058006 2089801 2122853 2156848 2191270 2226252 2262353 2299685
58285 2299685 2337917 2377055 2417592 2459898 2503921 2549403 2595992 2643339 2691522 2741218 2793095
58274 2793095 2847269 2903628 2962247 3023088 3085838 3150623 3218366 3289768 3364335 3441090 3519922
58263 3519922 3601600 3686826 3775851 3868597 3964507 4062720 4163055 4266469 4374030 4486010
58253D486010J16437J21370J26555J31281J35936J41817J49084J56667J64410
58244E729567J73371J83606J93757K03484K14215K26649K39588K52207K65530
58235G681974K80490K96567L13473L32265L53506L76238M00020M26054M55061
58226A0915648M86144N19090N55683N97256O43086O92784P47969Q09895Q77688
58217A6845243R50671J030173J117469J212853J318798J441349J586290J756807
58209B7259653J956595K191435K465211K778844L136522L548819M026812M579021
58201E1942912N218330N964407O832587P827217Q950462J0197636J1516033J2772295
58193A21221879J3798792J4504787J4943512J5258607J5556360J5808490J5834355
$$ plain form
58253 4486010 4602447 4723817 4850372 4981653 5117589 5259406 5408490 5565157 5729567
58244 5729567 5902938 6086544 6280301 6483785 6698000 6924649 7164237 7416444 7681974
58235 7681974 7962464 8259031 8572504 8904769 9258275 9634513 10034533 10460587 10915648
58226 10915648 11401792 11920882 12476565 13073821 13716907 14409691 15157660 15967555 16845243
58217 16845243 17795914 18826087 19943556 21156409 22475207 23916556 25502846 27259653
58209 27259653 29216248 31407683 33872894 36651738 39788260 43337079 47363891 51942912
58201 51942912 57161242 63125649 69958236 77785453 86735915 96933551 108449584 121221879
58193 121221879 135020671 149525458 164468970 179727577 195283937 211092427 226926782
58186B26926782J5344207J4021303J1633254Q139149L737108j173567o090128
58179B72538108j0521077j4086878j6583310j7989472j8425584j8090751j7208599
58172A59632437j5988437j4600756j3168876j1774807j0469077r277576q208057
58165G6144851p258422o422181n688942n045302m479124l982084l547128l165902
58157C6555766k830491k535667k277380k050461j849695j671938j515469j378108
58149B0446557j257360j151341j058094r74704q98527q28664p65193p07566o54812
58140A2150296o06629n63119n23847m88058m55447m25889l98808l73620l50384
58131G964495l29335l10114k92106k75201k59625k45283k31864k19299k07705
$$ plain form
58186 226926782 242270989 256292292 267925546 276064695 279801803 278628236 272538108
58179 272538108 262017031 247930153 231346843 213357371 194931787 176841036 159632437
58172 159632437 143644000 129043244 115874368 104099561 93630484 84352908 76144851
58165 76144851 68886429 62464248 56775306 51730004 47250880 43268796 39721668 36555766
58157 36555766 33725275 31189608 28912228 26861767 25012072 23340134 21824665 20446557
58149 20446557 19189197 18037856 16979762 16005058 15106531 14277867 13512674 12805108 12150296
58140 12150296 11543667 10980548 10456701 9968643 9513196 9087307 8688499 8314879 7964495
58131 7964495 7635160 7325046 7032940 6757739 6498114 6252831 6020967 5801668 5593963
58122E593963j97018j87103j78017j69831j62352j55242j48262j41343j34623
58113D120172j28429j22840j17393j11634j05871j00825r6642r2892q9409q6308
58103C067929q3204p9427p5225p1767o9564o7741o5348o2580o0074n7772n5280
58092B319947n2789n0907m9715m8674m7333m5680m3929m2343m1109m0145l9131
58081A818192l7944l6903l6376l6284l6136l5447l4079l2373l0918l0019k9437
58070A442276k8852k8327k7951k7306k5891k3926k2072k0538j9178j8373j8789
58059A181073k0076k0811k0224j9141j8678j8765j8596j7959j7350j7052j6820
58048I75601j6360j5654j4854j4153j3673j3324j2917j2498j2246j1970j1269
$$ plain form
58122 5593963 5396945 5209842 5031825 4861994 4699642 4544400 4396138 4254795 4120172
58113 4120172 3991743 3868903 3751510 3639876 3534005 3433180 3336538 3243646 3154237 3067929
58103 3067929 2984725 2905298 2830073 2758306 2688742 2621001 2555653 2493073 2432999 2375227 2319947
58092 2319947 2267158 2216251 2166536 2117862 2070529 2024849 1980920 1938577 1897468 1857323 1818192
58081 1818192 1780248 1743345 1706969 1670685 1634549 1599102 1565023 1532650 1501732 1471713 1442276
58070 1442276 1413424 1385097 1357146 1329840 1303949 1280023 1257951 1237413 1218235 1199862 1181073
58059 1181073 1160997 1140186 1119962 1100821 1082143 1063378 1044782 1026823 1009473 992421 975601
58048 975601 959241 943587 928733 914580 900907 887583 874666 862168 849922 837952 826683
58037H26683j0273r666r657r541q769p895p816q464q944q807q489q533q947r434
58023G01448r807j0008r993r762r379q872q266p649p159o849o636o335n818n232
58009E89683m976n158n210m460l171k467k985l940m021k931j634j105j309j510
57995E44806j283r25q57r94q89n03l78q01j227r49j17M73N42O62J302K173K773
57978E43808L106L486L996M536N156N927O641O901O514N608M376K838Q59j555
57964F02197l949n606o308o740p735r276j0679j1637j2423j3069j3067j2238j1190
57951D78280j0477r807q592o940n528m686m136l553k980k597k390k101j544q62
57937D12087m95p35j355j959k498l117l648l821l966m782o168p031o620n453m498
$$ plain form
58037 826683 816410 806744 797087 787546 778777 770882 763066 754602 745658 736851 728362 719829 710882 701448
58023 701448 691641 681633 671640 661878 652499 643627 635361 627712 620553 613704 607068 600733 594915 589683
58009 589683 584707 579549 574339 569879 566708 564241 561256 557316 553295 550364 548730 547625 546316 544806
57995 544806 543523 542598 541741 540747 539858 539355 538977 538176 536949 536000 535883 536356 536898 537560 538862 541035 543808
57978 543808 546914 550400 554396 558932 564088 570015 576656 583557 590071 595679 600055 602893 603752 602197
57964 602197 598248 592642 586334 579594 571859 562583 551904 540267 527844 514775 501708 489470 478280
57951 478280 467803 457996 449404 442464 436936 432250 428114 424561 421581 418984 416594 414493 412949 412087
57937 412087 411592 410857 409502 407543 405045 401928 398280 394459 390493 385711 379543 372512 365892 360439 355941
57922C55941m022l781l728l789l382k005j27J275J997K642L455L832L274K137
57908C53719J171O63L59n4o43j277j795k182k654l388m237m849n064m986m689
57893C20094m162l567l323l706m522n251n533n425n201m927m351l283k016j164
57879B63663j084j613k392l136l551l362k630j793j202q40o43o64o98j65J096
57864B40986K310K583K065J674J784J908J744J732K170K416J601j27j691k404
57850B58751k625k990l479l607l239k759k482k291j953j499j082p24m32l53m79
57835B28757m33J30R92J643J963K213K391K159J564J312J961L080L477K201o97
57820B52713m123o630p499p227o772o416n850n144m819m800m236k761j209m83
$$ plain form
57922 355941 351919 348138 344410 340621 337239 335234 335107 336382 338379 341021 344476 348308 351582 353719
57908 353719 354890 355553 355912 355858 355215 353938 352143 349961 347307 343919 339682 334833 329769 324783 320094
57893 320094 315932 312365 309042 305336 300814 295563 290030 284605 279404 274477 270126 266843 264827 263663
57879 263663 262579 260966 258574 255438 251887 248525 245895 244102 242900 242060 241417 240753 240055 239890 240986
57864 240986 243296 245879 247944 249618 251402 253310 255054 256786 258956 261372 262973 262846 261155 258751
57850 258751 256126 253136 249657 246050 242811 240052 237570 235279 233326 231827 230745 230021 229589 229236 228757
57835 228757 228324 228454 229446 231089 233052 235265 237656 239815 241379 242691 244652 247732 251209 253410 252713
57820 252713 248590 241960 234461 227234 220462 214046 208196 203052 198233 193433 189197 186436 185227 184744
57806A84744l45n0M76Q62J217J877K547K740K804L560M892N724N631N422N788
57791B27889O227N885M786L585K616J784J061M90k12j378k754l598l519k946k677
57776B37239l115m022m899n503o000o617p222p389o848n832m864m258l902l482
57762A63286k911k447k319k330k067j538j178j104p33L89J709K182J594P80M82
57747A53795N53M97K79K40M94Q21J028J124J181J198J101Q13M05J82M21R92J436
57730A66560J560J756K497L619M337L980K657J173L79N46J275J941K213K199K132
57715A98824K042J718R80Lp15q55p14q86j460j875j671j105o91m55k5P36J613
57698A95464K405L024L259K980K507K371K602K762K714K923L812N188O557P634
$$ plain form
57806 184744 184399 184349 184825 185687 186904 188781 191328 194068 196872 200432 205324 211048 216679 222101 227889
57791 227889 234116 240001 244787 248372 250988 252772 253833 254323 254111 252733 249979 246381 242862 239916 237239
57776 237239 234124 230102 225203 219700 213700 207083 199861 192472 185624 179792 174928 170670 166768 163286
57762 163286 160375 157928 155609 153279 151212 149674 148496 147392 146659 147048 148757 150939 152533 153313 153795
57747 153795 154348 154845 155124 155364 155858 156679 157707 158831 160012 161210 162311 163124 163529 163711 164132 165124 166560
57730 166560 168120 169876 172373 175992 180329 184309 186966 188139 188518 189064 190339 192280 194493 196692 198824
57715 198824 200866 202584 203564 203567 202852 201997 201283 200397 198937 197062 195391 194286 193595 193140 193115 193851 195464
57698 195464 197869 200893 204152 207132 209639 212010 214612 217374 220088 223011 226823 232011 238568 246202
57684B46202Q353Q701Q891R439J0808J3008J5686J8465K1128K3703K6551L0117
57672D41052L4528L9625M5472N2465O0563O8427P3446P2681O4150M8005K6915
57661A027329N130j3338k5965l1862l1594k7094k0916j4776q924l256J407L860
57649H60001L990K908J502l31k850n600p922r848j1919j4254j6348j7763j8542
57636G63024j8902j8885j8547j8144j7869j7588j7055j6368j5837j5471j4897
57625E73461j3874j2570j1202r769q361p356o885o290m737k327j54R71J349J835
57611D94091K809M031N199O265P374Q694J0275J1841J2898J3278J3474J4153J5431
57598F19813J6781J7618J7817J7641J7358J6949J6178J4959J3543J2156J0531
$$ plain form
57684 246202 254555 263256 272147 281586 292394 305402 321088 339553 360681 384384 410935 441052
57672 441052 475580 515205 560677 613142 673705 742132 815578 888259 952409 1000414 1027329
57661 1027329 1032459 1019121 993156 961294 929700 902606 881690 866914 857990 854734 856141 860001
57649 860001 863991 866899 868401 868070 865220 859620 851698 841850 829931 815677 799329 781566 763024
57636 763024 744122 725237 706690 688546 670677 653089 636034 619666 603829 588358 573461
57625 573461 559587 547017 535815 526046 517685 510329 503444 497154 492417 490090 489936 490907 492256 494091
57611 494091 496900 500931 506130 512395 519769 528463 538738 550579 563477 576755 590229 604382 619813
57598 619813 636594 654212 672029 689670 707028 723977 740155 755114 768657 780813 791344
57587G91344Q125M884J433j664m544p677j1127j4516j7491j9852k1492k2496k3238
57574F61689k3983k4510k4443k3796k2859k1689k0182j8579j7376j6691j6148
57563D31433j5499j4893j4389j3683j2601j1467j0677j0142r477q558p554o593
57551B95900n655m772m076l651l475l464l426l110k469j804j428j310j175q98
57537B55187n54j29M67J085J309R67M59M25J151K421L815M874N131M388L225K875
57521B87096M130O373Q095Q470Q110Q118Q766R483R828R999J0417J1211J2176
57508D02272J2949J3219J3093J3151J3794J4606J4886J4753J5064J5999J6503
57497E60289J5628J3755J1864J0063P744M919K369M13j587m204p127r702j1729
$$ plain form
57587 791344 799469 804353 805786 804122 799578 791901 780774 766258 748767 728915 707423 684927 661689
57574 661689 637706 613196 588753 564957 542098 520409 500227 481648 464272 447581 431433
57563 431433 415934 401041 386652 372969 360368 348901 338224 328082 318605 310047 302493 295900
57551 295900 290245 285473 281397 277746 274271 270807 267381 264271 261802 259998 258570 257260 256085 255187
57537 255187 254633 254504 254971 256056 257365 258332 258791 259216 260367 262788 266603 271477 276608 280996 284221 287096
57521 287096 291226 297599 305694 314164 322274 330392 339158 348641 358469 368468 378885 390096 402272
57508 402272 415221 428440 441533 454684 468478 483084 497970 512723 527787 543786 560289
57497 560289 575917 589672 601536 611599 619343 624262 626631 627044 625457 621253 614126 604424 592695
57484E92695j3331j4516j5327j5990j6506j6420j5536j4544j4334j4800j4906
57473D26485j3976j2463j1248j0590r986q882p305n806m851m317l696k780j914
57460C28671j382q70J99J870L578M780N341N418N337N586O508P897R167J0076
57446C92176J0914J1953J3052J3980J4723J5237J5176J4294J2953J1867J1357
57435E37682J1022J0219Q620O389L933J537q03l178n480p544r554j2020j5075
57422E25748j7927j9390j9051j7782j6930j7093j7738j8008j7673j7098j6484
57411C30574j5538j4135j2795j2092j1780j1084r814q623q068p942p791p533p262
57398A96117o818o048n203m689m519m367m044l656l432l600m213m897m960m118
$$ plain form
57484 592695 579364 564848 549521 533531 517025 500605 485069 470525 456191 441391 426485
57473 426485 412509 400046 388798 378208 368222 359340 352035 346229 341378 337061 333365 330585 328671
57460 328671 327289 326419 326618 328488 332066 336846 342187 347605 352942 358528 365036 372933 382100 392176
57446 392176 403090 415043 428095 442075 456798 472035 487211 501505 514458 526325 537682
57435 537682 548704 558923 567543 573932 577865 579402 578599 575421 569941 562397 552843 540823 525748
57422 525748 507821 488431 469380 451598 434668 417575 399837 381829 364156 347058 330574
57411 330574 315036 300901 288106 276014 264234 253150 243336 234713 226645 218703 210912 203379 196117
57398 196117 189299 183251 178048 173359 168840 164473 160429 156773 153341 149741 145528 140631 135671 131553
57384A31553k864j870j218o64l64p89j955l201l860l791l270k662k243k058j862
57369I8882j461j038q65p88m06K15M47j25j071j571j293o63k94k89j66M51J208
57352I1173J330O20j71j97N44J362J676J359N89j90m27m7K87o6q81j472j662j736
57334I2091j676j236o63n03o58m64J63N13K89N6J87J73l07n52J97J432J941J375
57316I2358M35k19n25n45j67N48J249J663J834J948K153K518K913L071K868K486
57300A14588K115J751J441J420J712J952J962K172K958L913M346M273M360M859
57286A53822N271N165M809M754N168N716N950N696N194M872M859M851M539L976
57272B24642L311K485J494O57J59m08j513k905l945m563n223o028o565o755p039
$$ plain form
57384 131553 128689 126819 125601 124937 124573 123784 121829 118628 114768 110977 107707 105045 102802 100744 98882
57369 98882 97421 96383 95518 94730 94324 94539 94986 94861 93790 92219 90926 90263 89969 89680 89514 89965 91173
57352 91173 92503 93123 92952 92755 93299 94661 96337 97696 98285 98095 97668 97621 97908 97842 96961 95489 93827 92091
57334 92091 90415 89179 88516 88013 87355 86891 87054 87567 87856 87912 88099 88272 87965 87413 87610 89042 90983 92358
57316 92358 92793 92574 92049 91504 91337 91885 93134 94797 96631 98579 100732 103250 106163 109234 112102 114588
57300 114588 116703 118454 119895 121315 123027 124979 126941 129113 132071 135984 140330 144603 148963 153822
57286 153822 159093 164258 169067 173821 178989 184705 190655 196351 201545 206417 211276 216127 220666 224642
57272 224642 227953 230438 231932 232589 232748 232340 230827 227922 223977 219414 214191 208163 201598 194843 187804
57257A87804p480p399o335m833l752l232k798k266j962k117k473k613k391k023
57243A36130j797j761j715j504j245j109r74o09n6M85J095J950K666K462J257
57228A35275K8l66k57n01j089j103p8J242J776J327O88P00J352J873J618Q57N06
57211A43848J041J937K419K496K751L286L431K721J659J140J412J955K276K375
57197A74747K444K503K511K584K879L336L704L825L739L558L327L087K983L263
57183B18490M093N287O258O387N668M846M719N351O098O399O280O110O161O480
57169B98627O963P372P500P484P770Q619R796J0897J1744J2273J2328J1938J1623
57156D24934J2016J3113J4243J4830J4972J5140J5584J6191J6780J7355J7978
$$ plain form
57257 187804 180324 172925 166590 161757 158005 154773 151975 149709 147747 145630 143157 140544 138153 136130
57243 136130 134333 132572 130857 129353 128108 126999 126025 125416 125360 125845 126940 128890 131556 134018 135275
57228 135275 135303 134937 134680 134179 133090 131987 131909 133151 134927 136254 136942 137642 138994 140867 142485 143342 143848
57211 143848 144889 146826 149245 151741 154492 157778 161209 163930 165589 166729 168141 170096 172372 174747
57197 174747 177191 179694 182205 184789 187668 191004 194708 198533 202272 205830 209157 212244 215227 218490
57183 218490 222583 227870 234128 240515 246183 251029 255748 261099 267197 273596 279876 285986 292147 298627
57169 298627 305590 312962 320462 327946 335716 344335 354131 365028 376772 389045 401373 413311 424934
57156 424934 436950 450063 464306 479136 494108 509248 524832 541023 557803 575158 593136
57145E93136J8499J8611J8295J8130J8785K0207K1640K2557K3204K4019K4966
57134H22049K5857K6861K8221K9725L1108L2712L5027L7641L9463M0165M0658
57123A189487M1844M3520M5015M6377M8320N1286N5027N9094O3266O7525P1948
57112A782709P6650Q1755Q7485R4292J02751J13119J25143J38515J53371J70345
57102B926135J90250K13736K41014K71755L05495L42207L82175M25027M69265
57093E767059N13009N54987N94496O30621O61971O87028P04334P12171P08478
57084A1534154O91214O58772O10078N44692M63108L66936K58623J41029J7374
57075A5285980j08335k31155l45886m48347n36066o07849o63039p01383p23351
$$ plain form
57145 593136 611635 630246 648541 666671 685456 705663 727303 749860 773064 797083 822049
57134 822049 847906 874767 902988 932713 963821 996533 1031560 1069201 1108664 1148829 1189487
57123 1189487 1231331 1274851 1319866 1366243 1414563 1465849 1520876 1579970 1643236 1710761 1782709
57112 1782709 1859359 1941114 2028599 2122891 2225642 2338761 2463904 2602419 2755790 2926135
57102 2926135 3116385 3330121 3571135 3842890 4148385 4490592 4872767 5297794 5767059
57093 5767059 6280068 6835055 7429551 8060172 8722143 9409171 10113505 10825676 11534154
57084 11534154 12225368 12884140 13494218 14038910 14502018 14868954 15127577 15268606 15285980
57075 15285980 15177645 14946490 14600604 14152257 13616191 13008342 12345303 11643920 10920569
57066A0920569p29997p22717p03533o75460o41707o04244n63745n21205m78819
57057E279142m38698m01238l65584l31409k99537k70849k45304k22131k00575
57048B503817j80303j61494j44606j29744j16270j03256r0216p7166o4099n1085
57038A385578l9014k9789k5454k7110l4307m4897n5468o2738o5220o3629n9674
57027H78278n4727m9530m4529l9962l5835l2157k9090k6686k4678k2718k0724
57016D97642j8810j7116j5813j5070j4771j4440j3696j2664j1709j0940j0233
57005C42380r511q735p767o575n477m797m405l922l262k591j773n00R53J703J356
56990B87077P03Q06J687K501K738K711K745K586J830N27r78k481l893m981n552
$$ plain form
57066 10920569 10190572 9467855 8764322 8088862 7447155 6842911 6279166 5757961 5279142
57057 5279142 4840444 4439206 4073622 3742213 3442676 3171827 2926523 2704392 2503817
57048 2503817 2323514 2162020 2017414 1887670 1771400 1668144 1577928 1500762 1436663 1385578
57038 1385578 1346564 1316775 1291321 1264211 1229904 1185007 1129539 1066801 1001581 937952 878278
57027 878278 823551 774021 729492 689530 653695 621538 592448 565762 541084 518366 497642
57016 497642 478832 461716 445903 430833 416062 401622 387926 375262 363553 352613 342380
57005 342380 332869 324134 316367 309792 304315 299518 295113 291191 287929 285338 283565 283065 284018 285721 287077
56990 287077 287780 288586 290273 292774 295512 298223 300968 303554 305384 305911 304933 302452 298559 293578 288026
56975B88026n816o190o682o779o055m741l556l011k956k797k156j238m38L07J464
56960B37382L035M213M258L496K943K995L010K205N53j370l019m106m581m657
56946B46357m622m436l813k822k057j855j760j122l0R08J527K385L946N924P524
56931B46054Q136P711O639N285L593J241j702m505o491p748q775r535r463q412
56917B22028p052o137n799n802n971o111n812m873l701k886k494k113j576j207
56903A60494j290j626j780j541r96l30K74O53Q10J033J630K536L326L748M028
56888A70969M517N121N397N156M683M244L686K765J667Q10K27m73j439k237k368
56873B02725j879j236o49J03J212K468L536M481N802P827J0198J2088J2899J2682
$$ plain form
56975 288026 282210 276020 269338 262559 256504 251763 248207 245196 242240 239443 237287 236049 235611 235918 237382
56960 237382 240417 244630 248888 252384 255327 258322 261332 263537 264090 262720 259701 255595 251014 246357
56946 246357 241735 237299 233486 230664 228607 226752 224992 223870 223840 224748 226275 228660 232606 238530 246054
56931 246054 254190 261901 268540 273825 277418 278659 276957 272452 265961 258213 249438 239903 230440 222028
56917 222028 214976 208839 203040 197238 191267 185156 179344 174471 170770 167884 165390 163277 161701 160494
56903 160494 159204 157578 155798 154257 153261 152931 153205 153858 154668 155701 157331 159867 163193 166941 170969
56888 170969 175486 180607 186004 191160 195843 200087 203773 206538 208205 209015 209242 208769 207330 205093 202725
56873 202725 200846 199610 198961 199064 200276 202744 206280 210761 216563 224390 234588 246676 259575 272257
56859B72257J1913J0946R765Q146O006L570J217q40k671m345n586n919n160l650
56845B95649j907k14J428L079M738O403Q210J0358J2852J5253J6937J7761J8194
56832D08741J8366J7381J4237R329M196k90m586r003j2636j4542j5181j5585j5666
56819C84761j4505j2124r648p656n512k719J07K226L914N933Q344J0557J2094
56806C75772J2757J2282J0441P386L563o18m779q471j1373j3454j4737j5160j4874
56793C38735j4287j3471j1953r522o940n253m584m093l084j611j7J565L043M084
56779B72612M310L589K029j83k754n275p397r027j0249j1074j1325j0867r943
56766B04446r132q799q661q110o910n412m119l303k982k947k781k280j844k017
$$ plain form
56859 272257 284170 295116 304881 313027 319033 322603 323820 322980 320309 315964 310378 304459 299299 295649
56845 295649 293742 293528 294956 298035 302773 309176 317386 327744 340596 355849 372786 390547 408741
56832 408741 427107 444488 458725 468054 472250 471960 467374 458371 445735 431193 416012 400427 384761
56819 384761 370256 358132 348484 340828 335316 332597 332704 334930 338844 344777 353121 363678 375772
56806 375772 388529 400811 411252 418638 422201 421583 416804 408333 396960 383506 368769 353609 338735
56793 338735 324448 310977 299024 289502 282562 277309 272725 268632 265548 263937 263920 265485 268528 272612
56779 272612 276922 280511 282540 282357 279603 274328 266931 257904 247655 236581 225256 214389 204446
56766 204446 195314 186515 177854 169744 162834 157422 153303 150000 147018 144071 141290 139010 137166 135149
56752A35149k619k820k265j532j257j406j720k217k760k755k004j293j340j617
56738A07544j085J28Q31M72k65p11j039j518j729j117J32J292J802J557Q22J58
56722A07274P0N07R46J093J075R20L90l97q04n23m1J38K57P25J219J059K45n49
56704A13604r23j073j180j103q07n46m10j21N01J158J483J534J559J472R66J05
56688A16219n35n31j30J24J64L97R53J359J270J087J396J987K064J408P11N77
56672A28520P94R17R96J241J394J025K28n09r73j240j176n61L72J036J229J285
56656A34578J378J253P87L72L81O54P71N75J52l58o71m33K85P95N20l16j020j302
56638A38401j354j282j007o94o68q16o35j00M0p37j809k079j364n82m78p09m84
$$ plain form
56752 135149 132530 129710 127445 125913 124656 123250 121530 119313 116553 113798 111794 110501 109161 107544
56738 107544 106459 106587 107418 107890 107625 106914 105875 104357 102628 101511 101643 102935 104737 106294 107116 107274
56722 107274 107344 107851 108797 109890 110965 111885 112275 111878 111074 110551 110510 110648 110905 111630 112849 113908 114153 113604
56704 113604 112681 111608 110428 109325 108518 107972 107562 107441 107942 109100 110583 112117 113676 115148 116114 116219
56688 116219 115684 115153 115023 115147 115311 115708 116661 118020 119290 120377 121773 123760 125824 127232 127943 128520
56672 128520 129314 130231 131227 132468 133862 134887 135115 134606 133633 132393 131217 130656 131028 132064 133293 134578
56656 134578 135956 137209 137996 138368 138749 139403 140174 140749 140901 140543 139872 139439 139724 140519 141039 140723 139703 138401
56638 138401 137047 135765 134758 134064 133396 132580 131945 131845 131885 131148 129339 127260 125896 125314 124836 124127 123643
56621A23643K51O99K53o87j143o96J23N75N89N90O82N12L8j81J99O25L36n56j259
56602A24593j447j488j560j285n24K09M72N43Q19J074Q27J17o52j363k013k227
56586A16095j578l92N02Q17J073J699K455K853K652J878P75o5q1N91J235J455
56570A31964J509J583J425R53O54R33J404J386Q04K50L08J077K118K686K308J368
56554A52730P94R26J178R94O36O30R63J363J827K266K121J090q8m66k26m02j339
56537A64997k268k465k066j664j720k432l516m074l385j939r68q78q68l16L23
56522A36761L59j68q55j587k306k598k142j222l73J59L19N8l72m32l2K23m8l51
56504A25393j69J40K5j82K18J022J354J028P21P02M28l27q57n37K06N26K77r4
$$ plain form
56621 123643 123894 124593 124846 124159 123016 122320 122443 123018 123607 124197 124879 125391 125429 125248 125447 126072 126408 125852 124593
56602 124593 123146 121658 120098 118813 118289 118498 118970 119513 120332 121406 122233 122350 121698 120335 118322 116095
56586 116095 114517 114125 114627 115444 116517 118216 120671 123524 126176 128054 128829 128764 128683 129274 130509 131964
56570 131964 133473 135056 136481 137434 138088 139021 140425 141811 142615 142865 143173 144250 146368 149054 151362 152730
56554 152730 153524 154450 155628 156622 157258 157888 158851 160214 162041 164307 166428 167518 167430 166964 166738 166336 164997
56537 164997 162729 160264 158198 156534 154814 152382 148866 144792 141407 139468 138500 137622 136754 136438 136761
56522 136761 137120 136952 136097 134510 132204 129606 127464 126242 125869 126028 126347 126405 126033 125601 125569 125792 125744 125393
56504 125393 125224 125364 125389 125207 125425 126447 127801 128829 129550 130252 130680 130353 129496 128959 129165 129691 129968 129874
56486A29874l66p09j100j165o77J42Q13R93O14j31q34j039n38M29J276J552J369
56469A30503J269J555J905J807J271Q70J057J683K191K190J782J433J438J566
56455A52520J352P63L20L47M83K91p0k12k81o43r57m23R24J954J817R41K11k19
56437A59118p30j266j373j015o83p33j005j260j461j586j514j257r99p63l35L37
56421A43475R23J065Q03M29R2k34m49k77L88J215J617J238K61o90j012n36L04
56404A48612Q19O50J02k19r8N9j87o66p44p2J000J840K087J825J345Q95O31O35
56386A58514R10J311J566J491J267J227J334J106L17m41m19L20J004J281J546
56371A72334J999K052J182o6o19k67J29j08n37k33R24J971J909Q27j96k72M48
$$ plain form
56486 129874 129508 128799 127699 126534 125857 125999 126812 127805 128419 128288 127454 126415 125877 126306 127582 129134 130503
56469 130503 131772 133327 135232 137039 138310 139180 140237 141920 144111 146301 148083 149516 150954 152520
56455 152520 153872 154635 154955 155302 155785 156076 156006 155794 155513 154870 153913 153490 154414 156368 158185 159126 159337 159118
56437 159118 158388 157122 155749 154734 154051 153318 152313 151053 149592 148006 146492 145235 144236 143473 143138 143475
56421 143475 144398 145463 146266 146695 146787 146553 146104 145827 146215 147430 149047 150285 150546 149856 148844 148308 148612
56404 148612 149431 150081 150183 149964 149866 149925 149738 149072 148328 148256 149256 151096 153183 155008 156353 157248 157879 158514
56386 158514 159424 160735 162301 163792 165059 166286 167620 168726 169043 168602 168183 168503 169507 170788 172334
56371 172334 174333 176385 177567 177501 176882 176615 176744 176636 176099 175866 176790 178761 180670 181497 181301 181029 181477
56354A81477J141J350J275J222J154R64P53O02L78M7o4L72J244K143K740K849
56338A99647K392J639J154J164J203Q52N32R74K021K665K359J653J284J164O88
56323B21391k22q57m78Q42K196K615J986J162J029J548J898J541Q11L74N45J237
56307B37618K285L445M257M228L345K252J839K443L471L987L746L463L839M604
56293B84822M916M506L933L754L982M388M839N094M876M352M165M655N376N715
56279C49373N666N631N780N961O055O083O129O386P125Q313R510J0425J1344J2681
56265D56462J4362J6064J7811J9852K2090K4215K6424K9411L3458L7955M2116
56254G40220M5967N0247N5411O0961O5787O9109P0929P1561P0936O8699O4918
$$ plain form
56354 181477 182618 183968 185243 186465 187619 188583 189336 189938 190316 190363 190299 190671 191915 194058 196798 199647
56338 199647 202039 203678 204832 205996 207199 208051 208583 209557 211578 214243 216602 218255 219539 220703 221391
56323 221391 221169 220312 219834 220676 222872 225487 227473 228635 229664 231212 233110 234651 235462 235836 236381 237618
56307 237618 239903 243348 247605 251833 255178 257430 259269 261712 265183 269170 272916 276379 280218 284822
56293 284822 289738 294244 298177 301931 305913 310301 315140 320234 325110 329462 333627 338282 343658 349373
56279 349373 355039 360670 366450 372411 378466 384549 390678 397064 404189 412502 422012 432437 443781 456462
56265 456462 470824 486888 504699 524551 546641 570856 597280 626691 660149 698104 740220
56254 740220 786187 836434 891845 952806 1018593 1087702 1158631 1230192 1301128 1369827 1434745
56243A434745O0249N5101M9014M1205L1573K0826R852o06r902j7711k4359l0443
56231A619544l6001m0446m3455m5465m7103m8439m9149m9140m8725m8212m7612
56220A115797m6752m5568m4190m2769m1269l9579l7727l5855l3913l1630k8918
56209F87627k6086k3466k1104j8994j7203j5500j3294j0509q142p161p124o702
56197E12342n491m352l846l436k623j865j641j384k98J251K134K067J838K039
56183D96735K355K377K298K447K628K427K022K172L260M580M929M010K965L164
56169E38369M596N973O427O427O749P349P824Q427R657J1204J2182J2381J2502
56156F50067J3153J4348J6067J8521K1577K4712K7855L1661L6583M2243M8209
$$ plain form
56243 1434745 1494994 1550095 1599109 1640314 1671887 1692713 1702565 1701959 1692057 1674346 1649987 1619544
56231 1619544 1583543 1543097 1499642 1454177 1407074 1358635 1309486 1260346 1211621 1163409 1115797
56220 1115797 1069045 1023477 979287 936518 895249 855670 817943 782088 748175 716545 687627
56209 687627 661541 638075 616971 597977 580774 565274 551980 541471 533329 526168 519044 512342
56197 512342 506851 502499 498653 495217 492594 490729 489088 487704 487406 488657 490791 492858 494696 496735
56183 496735 499090 501467 503765 506212 508840 511267 513289 515461 518721 523301 528230 532240 535205 538369
56169 538369 542965 548938 555365 561792 568541 575890 583714 592141 601798 613002 625184 637565 650067
56156 650067 663220 677568 693635 712156 733733 758445 786300 817961 854544 896787 944996
56145I44996N4784O2375P0332P6990Q0681Q0450P6118O8303N8359M7969L8700
56134A660057L1849K8113K6839K5945K3259J7966J0636K292n834j2087j5143j5507
56122A778385j5637j8101k3815l2097m1706n1349n9566o4981o6901o5466o1237
56111A277529n4838m7040l8856l1301k4998j9962j5757j1918q242m814j871L10
56099A018242J650K510L505M853O064O613O732P146Q087R090R776J0298J0828
56086A105394J1157J1181J1338J2136J3512J4948J6042J6607J6621J6435J6725
56075A262096J7761J8941J9580J9853K0313K0793K0595J9739J9142J9340J9801
56064A477954J9941K0020K0501K1184K1593K1846K2450K3428K4335K5007K5747
$$ plain form
56145 944996 999780 1062155 1132487 1209477 1290158 1370608 1446726 1515029 1573388 1621357 1660057
56134 1660057 1691906 1720019 1746858 1772803 1796062 1814028 1824664 1826956 1821122 1809035 1793892 1778385
56122 1778385 1762748 1744647 1720832 1688735 1647029 1595680 1536114 1471133 1404232 1338766 1277529
56111 1277529 1222691 1175651 1136795 1105494 1080496 1060534 1044777 1032859 1024617 1019803 1017932 1018242
56099 1018242 1019892 1022402 1025907 1030760 1036824 1043437 1050169 1057315 1065402 1074492 1084268 1094566 1105394
56086 1105394 1116551 1127732 1139070 1151206 1164718 1179666 1195708 1212315 1228936 1245371 1262096
56075 1262096 1279857 1298798 1318378 1338231 1358544 1379337 1399932 1419671 1438813 1458153 1477954
56064 1477954 1497895 1517915 1538416 1559600 1581193 1603039 1625489 1648917 1673252 1698259 1724006
56053A724006K6770K7978K9219L0356L1068L1165L1109L1734L3269L5036L6360
56042B068070L7388L8695M0399M2027M3155M3876M4611M5682M7154M8982N1183
56031B551222N3756N6499N9085O1406O3657O6027O8463P0927P3548P6266P8658
56020C279514Q0635Q3031Q6772R1466R5609R8401J00694J03823J08105J13020
56010D241070J18238J23800J29560J35304J41324J48225J56062J64175J72097
56001E529855J80175J89144J99315K10402K21895K33531K45565K58633K73232
55992G541747K89326L06597L24977L44708L66072L89421M15373M44407M76197
55983A0898825N09905N45529N84445O28235O77327P31334P90511Q56243R30100
$$ plain form
56053 1724006 1750776 1778754 1807973 1838329 1869397 1900562 1931671 1963405 1996674 2031710 2068070
56042 2068070 2105458 2144153 2184552 2226579 2269734 2313610 2358221 2403903 2451057 2500039 2551222
56031 2551222 2604978 2661477 2720562 2781968 2845625 2911652 2980115 3051042 3124590 3200856 3279514
56020 3279514 3360149 3443180 3529952 3621418 3717027 3815428 3916122 4019945 4128050 4241070
56010 4241070 4359308 4483108 4612668 4747972 4889296 5037521 5193583 5357758 5529855
56001 5529855 5710030 5899174 6098489 6308891 6530786 6764317 7009882 7268515 7541747
55992 7541747 7831073 8137670 8462647 8807355 9173427 9562848 9978221 10422628 10898825
55983 10898825 11408730 11954259 12538704 13166939 13844266 14575600 15366111 16222354 17152454
55974A7152454J013002J105678J209520J326644J459356J610057J781696J978024
55966B8636431K203494K463241K763246L110186L510903L972175M501005N104500
55958E6265181N788832O558406P416308Q364995R405100J0532133J1732469J2978382
55950A29041806J4219827J5372623J6307295J6845275J6768930J5852138J3915476
55943B38323370J0897222O912349K264759k603500p209779j1136764j4110184
55936B23337473j6028742j6946682j7024560j6471170j5496039j4280375j2964207
55929A14125698j1644862j0383245r213884q153728p207326o370356n633821m987957
55921E0530519m423535l931084l500677l123248k791786k501053k246390k023011
$$ plain form
55974 17152454 18165456 19271134 20480654 21807298 23266654 24876711 26658407 28636431
55966 28636431 30839925 33303166 36066412 39176598 42687501 46659676 51160681 56265181
55958 56265181 62054013 68612419 76028727 84393722 93798822 104330955 116063424 129041806
55950 129041806 143261633 158634256 174941551 191786826 208555756 224407894 238323370
55943 238323370 249220592 256132941 258397700 255794200 248584421 237447657 223337473
55936 223337473 207308731 190362049 173337489 156866319 141370280 127089905 114125698
55929 114125698 102480836 92097591 82883707 74729979 67522653 61152297 55518476 50530519
55921 50530519 46106984 42175900 38675223 35551975 32760189 30259136 28012746 25989735
55913B5989735j826087j651386j495896j357893j236027j128266j031957r45026
55905A5317197q66585p96203p32996o75874o24315n78155n36704m98636m63002
55896I544727m29847l99683l72747l49006l28467l10968k95846k82044k68633
55887F507486k55076k41198k27216k13650k00982j89369j78760j69078j60201
55878D671956j52002j44661j38659j34139j30406j26461j21920j17040j12042
55869C494626j06823j01366r5954r0938q6570q3030q0251p7687p4747p1511o8599
55858B557150o6258o4115o1923n9960n8379n6770n4721n2491n0587m9052m7567
55847A935327m5985m4348m2608m0824l9409l8636l8019l6752l4774l2882l1733
$$ plain form
55913 25989735 24163648 22512262 21016366 19658473 18422446 17294180 16262223 15317197
55905 15317197 14450612 13654409 12921413 12245539 11621224 11043069 10506365 10007729 9544727
55896 9544727 9114880 8715197 8342450 7993444 7664977 7354009 7058163 6776119 6507486
55887 6507486 6252410 6011212 5783996 5570346 5369364 5179995 5001235 4832157 4671956
55878 4671956 4519954 4375293 4236634 4102495 3972089 3845628 3723708 3606668 3494626
55869 3494626 3387803 3286437 3190483 3099545 3012975 2929945 2849694 2772007 2697260 2625749 2557150
55858 2557150 2490892 2426777 2364854 2304894 2246515 2189745 2135024 2082533 2031946 1982894 1935327
55847 1935327 1889342 1844994 1802386 1761562 1722153 1683517 1645498 1608746 1573972 1541090 1509357
55836A509357l1128l0420k9238k7686k6136k5024k4541k4362k3859k2792k1592
55825A222579k0791k0332j9710j8753j7980j7969j8526j8700j7831j6339j5274
55814A020374j5100j5246j4902j3916j2705j1568j0496r504q835q707r024r435
55802H80936r608r494r315r255r227r069q885q903r038q943q513p893o965n511
55788G60317m127m305o857j0708j3873j5454j6045j6422j6609j6165j4790j2522
55776F12440r809p402n799m848m304m501n851p827r228r506r079q356p295o069
55762E12566n263m957m459l439k672k920l739m087l829l792m538n709o608o838
55748D49716o408n676n271n688o798p966q664q819q657q403q139p781p259o711
$$ plain form
55836 1509357 1478229 1447809 1418571 1390885 1364749 1339725 1315184 1290822 1266963 1244171 1222579
55825 1222579 1201788 1181456 1161746 1142993 1125013 1107044 1088518 1069818 1051987 1035648 1020374
55814 1020374 1005274 990028 975126 961210 948505 936937 926441 916937 908102 899395 890371 880936
55802 880936 871328 861834 852519 843264 834037 824968 816083 807180 798142 789199 780686 772793 765828 760317
55788 760317 756190 751885 745028 734320 720447 704993 688948 672526 655917 639752 624962 612440
55776 612440 602631 595229 589430 584582 580278 575777 569926 562099 552871 543365 534286 525930 518635 512566
55762 512566 507303 502346 497887 494448 491776 488856 485117 481030 477201 473409 468871 463162 456554 449716
55748 449716 443308 437632 432361 426673 419875 411909 403245 394426 385769 377366 369227 361446 354187 347476
55734C47476o387o249n938n270m551m205m280m514m660m547m070l416l099l503
55720B82787m446n306n534m943l817k820k516k772k855k379j800j739k106k277
55706B37477j960j480j252j283j283j101r90j373k259l040l128k670k231j905
55692B11522j394q97j043j731j907j072j68l20j265j895j806j474j251j056q94
55677A93349q49o94j79L45K54n31j562k445k778k019k85J071Q07l93n78Q94K638
55660A87045L261K898K352J808J154O10K64l60j479k376k271j515j099j362j892
55645A87038k447l127l677l433k229q72l13n70p43p3J204K190K431K367K548K797
55629A83091K576J907J391J324J411J339J074N25m79j701k528k719k565k265j713
$$ plain form
55734 347476 341089 334840 328902 323632 319081 314876 310596 306082 301422 296875 292805 289389 286290 282787
55720 282787 278341 273035 267501 262558 258741 255921 253405 250633 247778 245399 243599 241860 239754 237477
55706 237477 235517 234037 232785 231502 230219 229118 228128 226755 224496 221456 218328 215658 213427 211522
55692 211522 210128 209231 208188 206457 204550 203478 203310 202990 201725 199830 198024 196550 195299 194243 193349
55677 193349 192500 191806 191627 191972 192226 191695 190133 187688 184910 182891 182606 183677 184484 184091 183513 184407 187045
55660 187045 190306 193204 195556 197364 198518 199128 199392 199032 197553 195177 192906 191391 190292 188930 187038
55645 187038 184591 181464 177787 174354 172125 171253 170940 170370 169627 169554 170758 172948 175379 177746 180294 183091
55629 183091 185667 187574 188965 190289 191700 193039 194113 194638 194159 192458 189930 187211 184646 182381 180668
55614A80668j105j008j511j957j908j716j738j693j384j387k281l651m636n056
55600A49637n259n211m585l621l115l442m161m621m558m084l482k997k565j924
55586I6012j187r63j544k344k640k497k413k392k082j545j149q69m42r5l07r07
55570G2636j162q68o27q06j032r22p12p39q27o10j29J75m1p12j364j431r02n12
55552E9415q57j428j111K85J611J699N76q77j834j872r49M06J306J326R31P63
55536E9390Q23P59N49M59M81L38ok38j80m7j70o20j146j413j255q74o77q95j337
55517E3941j576j331o62P2M04R8n36q24l76M71R82P83K76K01Q29J585J615P63
55499E6715j26q3R48K086K482K066J381R76J025J376J802K206K593K858K740K096
$$ plain form
55614 180668 179563 178555 177044 175087 173179 171463 169725 168032 166648 165261 162980 159329 154693 149637
55600 149637 144378 139167 134582 130961 127846 124404 120243 115622 111064 106980 103498 100501 97936 96012
55586 96012 94825 93862 92318 89974 87334 84837 82424 80032 77950 76405 75256 74387 73945 73850 73543 72636
55570 72636 71474 70606 69979 69173 68141 67219 66507 65768 64941 64331 64202 64377 64336 63624 62260 60829 59927 59415
55552 59415 58558 57130 56019 56304 57915 59614 60190 59313 57479 55607 54658 55064 56370 57696 58627 59390
55536 59390 60213 60972 61521 61980 62461 62799 62793 62555 62375 62328 62158 61538 60392 58979 57724 56850 56173 55278 53941
55517 53941 52365 51034 50372 50444 50848 50946 50410 49586 49210 49681 50663 51446 51722 51923 52752 54337 55952 56715
55499 56715 56589 56506 57454 59540 62022 64088 65469 66445 67470 68846 70648 72854 75447 78305 81045 83141
55483H3141J071k4r08j331j207r36j207k118k849k635j850j565k185l086l546
55468E8765l454l066k594k172j862j587j343j415j911k287j915j085p53j240j905
55453C0176k183k142j816r42J82N19l09j176q98P7L85k03o00j74L72K15m25p90
55435B0268p38o42n67j88M63P19O9j024j452o37P42J415P45p52j992k214j451
55418A2764l71L48O28Q97J337J484R27P7k88r4P0n7j04J25K79J16j54m20q85j385
55398A5294j244k90N65M83j86n17k85J10N05R90J291J022M00K9M2J35K54N39O23
55379A9760j38j567k533k208r21M33J271J425R45J64l80m65l99n53r05j220j355
55362A1354j233p45N1Q38J275J237P91J38l77m48j48J10K4k66m00j79K81O57O38
$$ plain form
55483 83141 84212 84188 83280 81949 80742 79806 78599 76481 73632 70997 69147 67582 65397 62311 58765
55468 58765 55311 52245 49651 47479 45617 44030 42687 41272 39361 37074 35159 34074 33321 32081 30176
55453 30176 27993 25851 24035 23093 23275 23794 23485 22309 21411 21488 21873 21670 21070 20896 21268 21483 21058 20268
55435 20268 19530 18888 18321 18133 18596 19315 19384 18360 16908 16271 17013 18428 19173 18421 16429 14215 12764
55418 12764 12393 12741 13369 14266 15603 17087 18014 18091 17803 17709 17779 17722 17618 17743 18022 18138 17984 17564 16679 15294
55398 15294 14050 13760 14325 14808 14622 14105 13820 13930 14435 15425 16716 17738 18138 18167 18209 18344 18598 19137 19760
55379 19760 19622 18055 15522 13314 12393 12826 14097 15522 16467 16631 16251 15786 15387 14834 13929 12709 11354
55362 11354 10121 9376 9427 10265 11540 12777 13568 13706 13329 12881 12733 12843 12867 12601 12201 12022 12303 12960 13598
55343A3598J78m30q16q31n76k88k80p29j289j227k59R56J510J286Q50N13J03l90
55325A1879n15J7Q18J213Q91Q5p40j223j307j141p73j28N65P19J12n70n13O7K12
55306I668l54q58o51r0J10r3j56K82J064J743J888J387O38K34K86L19o8o89j089
55287A3571j076p43k57K27N46O52N45J66m55r23p79j82K01J3m25p40r41j083r52
55268G365n15k13l62n52p8J121K263K438J436qp76m40K25J87m89q13m48k27p42
55249I372j305r71J1O30N60L12K31J43o3k66n27r22j074n07M42Q80O31N00R41
55230I018J257O37n31j082n62L38P64O10K82L9j61k89j03N10J230J501J039M5
55212A4542r92j546j288m07K73K0q25j062j08J173J570J007L69J59P0j54k46k
$$ plain form
55343 13598 13776 13346 12530 11699 11123 10835 10555 9826 8537 7310 7051 8007 9517 10803 11653 12166 12269 11879
55325 11879 11364 11381 12199 13412 14303 14388 13648 12425 11118 9977 9204 9076 9641 10360 10472 9902 9389 9456 9668
55306 9668 9314 8456 7805 7715 7825 7732 7576 7858 8922 10665 12553 13940 14578 14812 15098 15417 15349 14660 13571
55287 13571 12495 11752 11495 11722 12268 12920 13465 13631 13176 12253 11474 11292 11493 11506 11081 10341 9400 8317 7365
55268 7365 6850 6637 6275 5723 5645 6766 9029 11467 12903 12895 12119 11679 11904 12091 11602 10789 10341 10114 9372
55249 9372 8067 7096 7107 7737 8297 8609 8840 8983 8920 8654 8127 7205 6131 5624 6066 6946 7577 8077 9018
55230 9018 10275 10912 10381 9299 8737 9075 9839 10449 10731 10770 10609 10320 10217 10727 11957 13458 14497 14542
55212 14542 13550 12004 10716 10309 10582 10602 9777 8715 8607 9780 11350 12357 12726 12885 12955 12801 12555 12553
55194A2553K75K65J28J54K68K22Q2J41M29O19M31k3l37k50R1K71J12j81m02o66
55174A4182j132j579j568r84j60M98P99P79O79P86R79P11k03r77o64N15J332J083
55156A5076K59m40r61j359j251m64L08K99k34m24n2L17M31P02J310J664J168R4
55138A6443p30q74o05l83l99n63p37q36p70m32J48O22N71J6m82m04J87Q74J353
55119A2999J434Q84j90j049j041o01p27j407j391PJ687K120J383Q22J049J279
55103A7258Q09J01n7L20O59P40P32P28P85J164J926K484K199J292N96L96J42n34
55085C1740j176j204p94n73p92j143j262j018m85Q8L58J86j88m27m22j62L74R52
55067B4052J020L35n18q15p10r65j643j832r57L66J179J379J451J427R10M3m43
$$ plain form
55194 12553 12828 13093 13221 13375 13643 13865 13947 14088 14517 15136 15567 15544 15207 14957 15048 15319 15431 15250 14848 14182
55174 14182 13050 11471 9903 8919 8759 9257 10056 10835 11514 12300 13279 13990 13787 12810 12146 12661 13993 15076
55156 15076 15335 14895 13934 12575 11324 10860 11168 11467 11233 10809 10757 11074 11505 12207 13517 15181 16349 16443
55138 16443 15713 14839 14234 13851 13452 12889 12152 11316 10546 10114 10262 10884 11455 11471 10989 10585 10772 11646 12999
55119 12999 14433 15317 15127 14078 13037 12436 11709 10302 8911 8918 10605 12725 14108 14930 15979 17258
55103 17258 18067 18168 18111 18431 19090 19830 20562 21290 22075 23239 25165 27649 29848 31140 31736 32132 32274 31740
55085 31740 30564 29360 28566 27993 27201 26058 24796 23778 23293 23381 23739 23925 23737 23310 22888 22726 23100 24052
55067 24052 25072 25407 24889 24074 23364 22399 20756 18924 17967 18333 19512 20891 22342 23769 24679 24722 24279
55050B4279l41l83j135j982j859p63J94J91l58n54j64L14M49K55r0m60o21k91
55032A6681M69J135J264R57O34M70L07M3j68j42M4J39J7j56m2M80J096J300R31
55013B5459L46J7L6J53J35o3m01p65r42p63l13J91O59J115J378J116L55k74j37
54994B7302N98J030N46m02p61j36P32Q81K89k33j43K67N11N90P15P87N64J64r7
54975C3204k85p43j430j792j469p13MM50N59K32m88j260j685j684j435j113p65
54958A9587l37K51R30J349J205O88L50L67L06j72p38q39m18J50N83P96O76K91
54940B5025J49P47J793K408K240J861J931K386K806L191L887M923N873O367O402
54925G1989O068N288L974K260L97j473l283m792n643n646m999m114l319k778k589
$$ plain form
55050 24279 23938 23555 22420 20438 18579 17816 18010 18201 17843 17289 17125 17439 17888 18143 18053 17593 16972 16681
55032 16681 17150 18285 19549 20506 21140 21610 21917 21960 21792 21650 21694 21833 21850 21694 21652 22132 23228 24528 25459
55013 25459 25805 25822 25858 26011 26146 26083 25682 24917 23975 23212 22899 23090 23749 24864 26242 27358 27713 27439 27302
54994 27302 27900 28930 29476 29074 28313 28177 28909 29790 30079 29846 29703 29970 30481 31071 31786 32573 33137 33301 33204
54975 33204 32919 32176 30746 28954 27485 26772 26776 27226 27785 28017 27529 26269 24584 22900 21465 20352 19587
54958 19587 19250 19501 20431 21780 22985 23673 24023 24390 24696 24524 23786 22947 22529 22679 23262 24058 24734 25025
54940 25025 25174 25921 27714 30122 32362 34223 36154 38540 41346 44537 48424 53347 59220 65587 71989
54925 71989 78057 83345 87319 89579 89976 88503 85220 80428 74785 69139 64140 60026 56707 53929 51340
54910E1340k760l030k952k365j683j442j599j565j029l93j97l80m72l75m14o11
54894C0073m36M39J535K189K508L144M211M995M959M547M510M819M717L769K389
54879G8368J217L70m97j640k969m228n171n662n657n202m422l551k904k653k589
54864C2810k303j654r53n57m36l32j68j30k72l81k83j42k62o24q52o53j42L16
54846B2982M92L61o8o91j110q11J49R18O88k72q52m48L25M96q7p42r49q54q14
54827A8713q51p19l04K74Q10J131J162R96Q32P22M63j09p71j014n98J08N00L87
54809B1732J32J39L89N93O24O09N85L87jk76j73J57L63L60L74N59Q57J209J545
54790C0164J564R15k58j203j260n05N20J454K167K487K346K157K540L630M962
$$ plain form
54910 51340 48580 45550 42598 40233 38550 37108 35509 33944 32915 32522 32325 31945 31473 31098 30684 30073
54894 30073 29637 30076 31611 33800 36308 39452 43663 48658 53617 58164 62674 67493 72210 75979 78368
54879 78368 79585 79955 79458 77818 74849 70621 65450 59788 54131 48929 44507 40956 38052 35399 32810
54864 32810 30507 28853 27900 27343 26907 26575 26407 26277 26005 25624 25341 25199 24937 24313 23461 22808 22666 22982
54846 22982 23474 23835 23767 23076 21966 21155 21304 22222 22910 22638 21786 21338 21663 22159 22072 21330 20381 19527 18713
54827 18713 17862 17143 16839 17113 17923 19054 20216 21212 22044 22766 23229 23120 22349 21335 20737 20845 21345 21732
54809 21732 21864 22003 22392 22985 23609 24218 24803 25190 25189 24913 24740 24897 25260 25620 25994 26553 27410 28619 30164
54790 30164 31728 32643 32385 31182 29922 29417 29937 31391 33558 36045 38391 40548 43088 46718 51680
54775E1680O047O623O392N140L355K048J609J253J82j314k416l040l630m048l744
54760F6137k963k703l182l370k542j395r00q55m52K57M37j79r25j183r95o98n00
54743D3989m66m12R7J130K028K216K244L134M818O094O260N817N372M881M366
54728I1568M357M876M822L299R13j109k627m373o354p607p587o849o134n521m767
54713E6907l916l205k710k350k083j946k084k512k799k244q38L66M15k61m65K6
54697C0301L04q9m74k47J63J46m6J45N37N05j6n12o64n45j99L44P97Q40O14M94
54677C2398N08L85J49J70N90J149J481J380Q28J50l8N19J182J098K97m39p16q67
54659D0224j121j189r51q06r71j032o44j58l4m9K86Q66J134R32O40N63O63P91
$$ plain form
54775 51680 57727 64350 70742 75882 79237 81285 82894 84147 84329 83015 80599 77559 73929 69881 66137
54760 66137 63174 60471 57289 53919 51377 49982 49082 48227 47775 48032 48469 48290 47365 46182 45187 44489 43989
54743 43989 43523 43111 43208 44338 46366 48582 50826 53960 58778 64872 71132 76949 82321 87202 91568
54728 91568 95925 100801 105623 108922 109835 108726 106099 101726 95372 87765 80178 73329 67195 61674 56907
54713 56907 52991 49786 47076 44726 42643 40697 38613 36101 33302 31058 30220 30586 31001 30740 30275 30301
54697 30301 30605 30516 30042 29795 29958 30104 30058 30203 30740 31245 31229 30717 30053 29508 29309 29653 30450 31290 31904 32398
54677 32398 32906 33291 33440 33610 34200 35349 36830 38210 39038 39188 39150 39669 40851 41949 42246 41807 41091 40224
54659 40224 39103 37914 36963 36157 35186 34154 33510 33352 33318 33269 33555 34421 35555 36487 37127 37690 38353 39144
54641C9144P95M74j40n66l89J36M43N07P88J380J867K077K346K865L313L493L717
54624F2250M258M853N167N353N638N709N006L485J627j86j858l218l971m126m110
54609H5877m333m793n126m900l966k622j507j026j029j131j214j389j696k119
54595D9026k696l262l247k301r59j92k60n55o20o56q69r38n74r1J31L09P95J235
54577C4276Q71l02j341j449p84jN39Q13P91M64O6j11j27k92o71r12p20k86q1k67
54557C0476n52n76k81J25M38O24P91J063J379J412Q51j80j091j352r33k09L82
54540C2367M96Np37r95m60K39K86j67k27L76Q57O15J57L24J002J361J072O48N57
54521C7776O60O59O23Q05J270J860K335K458K124J581J295J480J854J914J398
$$ plain form
54641 39144 39939 40413 40273 39707 39318 39454 39897 40404 41192 42572 44439 46516 48862 51727 55040 58533 62250
54624 62250 66508 71361 76528 81881 87519 93228 98234 101719 103346 103160 101302 98084 94113 89987 85877
54609 85877 81544 76751 71625 66725 62759 60137 58630 57604 56575 55444 54230 52841 51145 49026
54595 49026 46330 43068 39821 37520 36561 36369 36109 35554 34934 34278 33409 32471 31897 31806 31937 32246 33041 34276
54577 34276 35147 34845 33504 32055 31271 31270 31809 32622 33413 33877 33943 33832 33705 33413 32742 31830 31110 30824 30743 30476
54557 30476 29924 29348 29067 29192 29630 30254 31045 32108 33487 34899 35750 35570 34479 33127 32194 31985 32367
54540 32367 32863 32868 32131 31136 30676 30915 31201 31034 30807 31183 32040 32655 32812 33136 34138 35499 36571 37219 37776
54521 37776 38436 39095 39718 40523 41793 43653 45988 48446 50570 52151 53446 54926 56780 58694 60092
54506F0092M45n45j196j425j489j628j756j667j442j358j373j124n43j40m15j141
54490D3295j577j270m38L07M75j5p24r84m69L98Q31N19p9l10n1K67K23j67n74
54471C9657p42o37l23J98Q66J421J551J240Q14N56M05J88j4M3L01L55J2l75l44
54452D5172j9m3p56j679k038j654j105r39r41m25P33J713J648P32L4J65N81M99
54434D1678K5j35J63L25N1j62J31N21L44k50m61L2P01R24O51J82k45m83l90n0
54414D3552K11J81M2O0K28M06O55J150J771K091J834J231P95Q01J017R76M62l52
54396E7111j170j815k116j819q65K79R09P44J51l37m94l73j01J08Lm18p25m63
54378D8609K59P62N19j99n96l21P2r1n74n22J88N89l3j004j224p05l46l88j77
$$ plain form
54506 60092 60537 59992 58796 57371 55882 54254 52498 50831 49389 48031 46658 45534 44991 44851 44436 43295
54490 43295 41718 40448 40010 40317 40792 40777 40053 39069 38600 38998 39829 40348 40269 39959 39908 40175 40398 40231 39657
54471 39657 38915 38278 37955 38153 39019 40440 41991 43231 44045 44601 45006 45194 45180 45223 45524 45879 45891 45516 45172
54452 45172 45153 45110 44354 42675 40637 38983 37878 36939 35998 35573 36306 38019 39667 40399 40433 40598 41179 41678
54434 41678 41703 41568 41731 42056 42107 41945 42076 42597 42941 42691 42230 42262 42963 43887 44538 44720 44475 43992 43602 43552
54414 43552 43763 43944 43986 44046 44274 44680 45335 46485 48256 50347 52181 53412 54207 55008 56025 57001 57463 57111
54396 57111 55941 54126 52010 50191 49326 49605 50514 51258 51409 51072 50578 50205 50104 50212 50215 49797 49072 48609
54378 48609 48868 49630 50149 49950 49354 49033 49105 49014 48440 47918 48106 48695 48662 47658 46434 45729 45383 44995 44818
54359D4818N32J039Q48M62M96P67P88N70L97K45J11L37J035J525J093L8o45n44
54341E3912j51q2l58n13m6R97J768J289k75j627j971j994k542l123k712j473m96
54324D0603j38J26L34r7r57j093j25Q29P22p8o29p42p69p72o53o11p92r45q71
54305C3342p84p78m84J78N49J77k79N3R13J327J101R59J207J163K18j131j757
54288C5974j114K12J118J048M70K72O81J019N88n24j641k139j722n58N93Q34J63
54271C5274m37k36L68O73P11P97O43j52j049j048j65N39M78J98K92N32M31L6k40
54252C7645j88J08L91L26j56n70l73K11M41J40j12PJ13m9r6K25M14J8n96q35p79
54231C6285p72n74K05J124J219L42o15r34q32q02q25o29k68m1k3l5O1K32L53L24
$$ plain form
54359 44818 45350 46389 47237 47699 48195 48962 49750 50320 50717 50962 51073 51410 52445 53970 55063 55101 54456 53912
54341 53912 53761 53679 53321 52808 52762 53759 55527 56816 56541 54914 52943 50949 48407 45284 42572 41099 40603
54324 40603 40465 40591 40925 40828 39871 38778 38653 39482 40204 40126 39497 38755 37986 37214 36561 35950 35158 34213 33342
54305 33342 32558 31780 31296 31474 32023 32200 31921 31974 32887 34214 35315 36274 37481 38644 38862 37731 35974
54288 35974 34860 35072 36190 37238 37708 37980 38661 39680 40268 39744 38103 35964 34242 33684 34277 35111 35274
54271 35274 34837 34601 34969 35642 36353 37150 37793 37641 36592 35544 35379 35918 36396 36594 36886 37418 37849 37885 37645
54252 37645 37457 37565 37956 38282 38126 37556 37183 37394 37835 37975 37863 37870 37983 37934 37838 38063 38477 38495 37899 37064 36285
54231 36285 35513 34939 35144 36268 37487 37829 37214 36280 35448 34646 33821 33192 32924 32883 32860 32825 32886 33118 33471 33795
54211C3795J54L1R4J79n0n75q92n53K70R52J115R52Q67R37P92O5j059j896j892
54192C3286j200m54r9q2j50j63q2J52M72O46M79Q4k09j63J98N58N73J73k54k61
54172C3504N8J67j31l55l6N29O88L63O6R8K25K23K34M07O14O85N95K23o29j743
54152C5785k399k084j034J35R87J190N24n97j089l87O80R45N12L49N55J86r88
54135C3270j757j114K77J036Q57M86L49K05l8oM23P69N83J6m39n09k78L3K79M59
54115C4901O34P52O67L73P8r4k23l09j15L74O38J93o63j116q29k29J75L69O15
54096C6191J009J355J347Q15mn33l75K35P12P17K78m20r46o20P98K391K788J768
54078D7506N57K53N77N84R9k24m2J70j51q47j157n25P89J844J839R10Jj33L65
$$ plain form
54211 33795 33949 33980 34074 34253 34203 33628 32736 32183 32453 33405 34520 35472 36339 37276 38068 38133 37074 35178 33286
54192 33286 32086 31632 31533 31451 31301 31138 31056 31208 31680 32326 32805 32889 32680 32517 32715 33273 33846 34019 33765 33504
54172 33504 33562 33729 33598 33243 33207 33736 34424 34787 34853 34951 35176 35399 35633 36040 36654 37339 37934 38157 37528 35785
54152 35785 33386 31302 30268 30403 31390 32580 33104 32507 31418 31031 31711 32656 33168 33517 34072 34258 33270
54135 33270 31513 30399 30676 31712 32569 33055 33404 33609 33571 33565 33988 34757 35340 35356 34917 34408 34130 34163 34442 34901
54115 34901 35535 36287 36954 37327 37405 37311 37088 36779 36664 37038 37676 37869 37206 36090 35261 35032 35207 35576 36191
54096 36191 37200 38555 39902 40717 40713 40180 39805 40040 40752 41469 41747 41327 40381 39761 40559 42950 45738 47506
54078 47506 48063 48316 48893 49477 49576 49352 49310 49480 49329 48482 47325 46800 47589 49433 51272 52182 52183 52050 52415
54059E2415Q04P78M52K03K87P56J420J885J858J477J224J461K130K780K932K510
54043G5372K013K043K628L202L396L533M004M475M234L244K330K195K648K971
54029A18288K698J834P12j35k21L46P90M57l79r17r46j116j994l272m201m492
54013A07452m421m202l715k913k114j725j786j988k016j775j320p98l97k96n12
53998G7474r14j314j645j992k445k837k716j799m69M22M42N7n3K8l56j274j809
53981E8800j164J52Q51M36l12m95k20j37l54l96r1J64P9j15j48j16j58j62q4k16
53961E6314o34q02k17P50J295J245J077R78P12M55Q75J994K755K313J230P03R99
53944G2042J360J231R62J155J928K915L692M046M061M007M103M364M733N167N558
$$ plain form
54059 52415 53219 53997 54449 54652 54939 55695 57115 59000 60858 62335 63559 65020 67150 69930 72862 75372
54043 75372 77385 79428 82056 85258 88654 92187 96191 100666 104900 108144 110474 112669 115317 118288
54029 118288 120986 122820 123532 123397 123176 123522 124312 124769 124390 123473 122527 121411 119417 116145 111944 107452
54013 107452 103031 98829 95114 92201 90087 88362 86576 84588 82572 80797 79477 78679 78282 77986 77474
53998 77474 76560 75246 73601 71609 69164 66327 63611 61812 61343 61765 62207 62264 62211 62239 61883 60609 58800
53981 58800 57636 57788 58639 59075 58763 58268 58048 57911 57557 57161 57070 57234 57313 57198 57050 56934 56776 56614 56530 56314
53961 56314 55680 54878 54661 55411 56706 57951 59028 60006 60718 61173 62048 64042 66797 69110 70340 71043 72042
53944 72042 73402 74633 75595 76750 78678 81593 85285 89331 93392 97399 101502 105866 110599 115766 121324
53929A21324N789N940O143O106N298L887K973L316M272M585L976L232K974L077
53915A82892L313L641L775L174J826N09j23k71n19j045j620k062k364k524k513
53900A86089k407k353k472k817l339l892m392m817m971m572l797l435l928m605
53886A34292m510l760l307l502l755l671l545l508l182k568k440l151l837l486
53872H6070k251j094o19q37j546k257k272j539r88j263j701j333m07J47K93P18
53856F9121J301J147K60j90K95O89L3j123j692j605j460j310p91j04J43n3j20
53839F4541Q3J05j52j28M78J140J262R93Q35Q20N81O6l60m56l48j91N6L71N74
53820G0270O43Q41J289J656J537J065Q15J128J800K418K716K668K434K338K652
$$ plain form
53929 121324 127113 133053 139196 145302 150600 154487 157460 160776 165048 169633 173609 176841 179815 182892
53915 182892 186205 189846 193621 196795 198621 199130 199007 198736 198217 197172 195552 193490 191126 188602 186089
53900 186089 183682 181329 178857 176040 172701 168809 164417 159600 154629 150057 146260 142825 138897 134292
53886 134292 129782 126022 122715 119213 115458 111787 108242 104734 101552 98984 96544 93393 89556 86070
53872 86070 83819 82725 82106 81269 79723 77466 75194 73655 72667 71404 69703 68370 67963 68110 68403 69121
53856 69121 70422 71569 71829 71639 71934 72623 72656 71533 69841 68236 66776 65466 64675 64571 64714 64661 64541
53839 64541 64624 64729 64577 64449 64927 66067 67329 68322 69157 69977 70558 70624 70264 69808 69460 69269 69325 69696 70270
53820 70270 70913 71754 73043 74699 76236 77301 78116 79244 81044 83462 86178 88846 91280 93618 96270
53805I6270L285L881M207M267M020L336K317J351O89L02K48O78J278J210J96p95
53789A26740o43L62Q05kj282k102k571l265m080m374m017l501l125k682k106j819
53773I2338k137k688k798k293j640j347j499j800j845j376m94L03M83k5p70j258
53757G1154j353j207j017r28r74j049r96q28o47l61K16R01J116O55Q7M8L25J47
53739F5289p34j749k197j865r74K5N88N00K31M28J056J455J298R49P86P35O81
53722F6502P53R36Q67M54K03N03J030J227J049Q34P36P14Q12J050J257J365J512
53705H1804J693J603J204R95J265J590J499J190J003P89M80O85J751K688K249
53690A02488Q44J41P28J448J337R44J068J303P58m02j115q05J45J072J523J261
$$ plain form
53805 96270 99555 103436 107643 111910 115930 119266 121583 122934 123623 123925 124173 124851 126129 127339 127535 126740
53789 126740 126097 126459 127264 127262 125980 123878 121307 118042 113962 109588 105571 102070 98945 96263 94157 92338
53773 92338 90201 87513 84715 82422 80782 79435 77936 76136 74291 72915 72421 72724 73207 73182 72412 71154
53757 71154 69801 68594 67577 66649 65675 64626 63630 62802 62155 61794 62010 62911 64027 64682 64769 64817 65142 65289
53739 65289 64555 62806 60609 58744 57770 57795 58383 58883 59114 59542 60598 62053 63351 64300 65086 65821 66502
53722 66502 67255 68191 69058 69512 69715 70218 71248 72475 73524 74358 75094 75808 76620 77670 78927 80292 81804
53705 81804 83497 85100 86304 87299 88564 90154 91653 92843 93846 94635 95115 95800 97551 100239 102488
53690 102488 103332 103473 104201 105649 106986 107930 108998 110301 111059 110657 109542 108737 108882 109954 111477 112738
53674A12738L82n44r10p06m52m98o86o68l57J7J55j5l09n90r34j347j429q07J65
53655A03205O27L06j05O1N66P43N13L65N05N38O1p60j333j255o69o3L42Q38J714
53636A06199K605K741J899P04j64o20p79m51M77J448J686J147N79N01P00Q08R72
53619A20452J538K355K745K331J504J005J147J696K373L043L435L153K303J718
53605A50798K056K883L224K859K485K585K855K873K669K331J714R33N48P58R02
53590A82473L52n04q40o02m64p32j047j121j135j290j534j799k060k040j361j90
53574A66106O91P16J30m67q14j035j207j208r16l79K00N74N97L38n3m88q92j064
53556A60829q25l09R9J62l0k71m21l83j54R8K17L45P22J225J419J195R85J152
$$ plain form
53674 112738 113120 112576 111666 110960 110508 110010 109324 108656 108299 108316 108471 108456 108147 107557 106623 105276 103847 103040 103205
53655 103205 103832 104138 104033 104094 104660 105403 105916 106281 106786 107324 107385 106625 105292 104037 103368 103305 103647 104485 106199
53636 106199 108804 111545 113444 114148 113984 113364 112585 112134 112611 114059 115745 116892 117471 117972 118672 119480 120452
53619 120452 121990 124345 127090 129421 130925 131930 133077 134773 137146 140189 143624 146777 149080 150798
53605 150798 152854 155737 158961 161820 164305 166890 169745 172618 175287 177618 179332 180265 180813 181571 182473
53590 182473 182825 182321 181481 180879 180415 179683 178636 177515 176380 175090 173556 171757 169697 167657 166296 166106
53574 166106 166797 167513 167643 167176 166362 165327 164120 162912 161996 161617 161817 162391 162988 163326 163273 162785 161893 160829
53556 160829 160004 159695 159794 159956 159926 159655 159234 158851 158697 158795 159012 159357 160079 161304 162723 163918 164903 166055
53538A66055J513J737J910K333K932L336L452L550L731L746L510L443M034N225
53524B10507O520P556Q363R019R437R487R277R145R420J0169J1074J1606J1511
53511C33091J1154J1215J1954J2911J3506J3751J4152J4963J5902J6602J7085
53500D86286J7558J7891J7688J6823J5756J5074J4853J4688J4309J3986J4104
53489F59016J4624J5117J5329J5315J5087J4527J3801J3466J3795J4255J4060
53478H18392J3186J2375J2221J2514J2647J2237J1300J0031Q617P170N688M143
53466I40521K579J060m29j952l558n281p057q516r248r399r713j0599j1477j1548
53452H55383j0960j0585j0844j1435j2183j3267j4512j5209j5026j4446j3965
$$ plain form
53538 166055 167568 169305 171215 173548 176480 179816 183268 186818 190549 194295 197805 201248 205282 210507
53524 210507 217027 224583 232946 241965 251402 260889 270166 279311 288731 298900 309974 321580 333091
53511 333091 344245 355460 367414 380325 393831 407582 421734 436697 452599 469201 486286
53500 486286 503844 521735 539423 556246 572002 587076 601929 616617 630926 644912 659016
53489 659016 673640 688757 704086 719401 734488 749015 762816 776282 790077 804332 818392
53478 818392 831578 843953 856174 868688 881335 893572 904872 914903 923520 930690 936378 940521
53466 940521 943100 944160 943731 941779 938221 932940 925883 917367 908119 898720 889007 878408 866931 855383
53452 855383 844423 833838 822994 811559 799376 786109 771597 756388 741362 726916 712951
53441G12951j3452j2669j1803j1024j0114r018q271q165q017o930n060l345k213
53428F02870j213Q3J438K321K493K211K105K741M056N353O172O893Q083R601J0835
53413F66042J1664J2498J3587J4812J6104J7444J8506J8936J9007J9470K0635
53402H48705K2094K3365K4372K5253K6225K7620K9573L1624L3172L4235L5288
53391A161526L6383L7133L7531L7986L8489L8526L8124L8034L8493L8637L7721
53380A578583L6254L5141L4225L2596L0007K7101K4349K1438J7962J4091J0390
53369A862137P260M703K435J05k422n064p794j0797j4290j8278k2676k7320l1757
53356A736242l5327l7698l9079l9760l9749l9135l8411l7983l7598l6682l5068
$$ plain form
53441 712951 699499 686830 675027 664003 653889 644871 636600 628435 620418 613488 608428 605083 602870
53428 602870 601657 601740 603178 605499 607992 610203 612308 615049 619105 624458 630630 637523 645606 655207 666042
53413 666042 677706 690204 703791 718603 734707 752151 770657 789593 808600 828070 848705
53402 848705 870799 894164 918536 943789 970014 997634 1027207 1058831 1092003 1126238 1161526
53391 1161526 1197909 1235042 1272573 1310559 1349048 1387574 1425698 1463732 1502225 1540862 1578583
53380 1578583 1614837 1649978 1684203 1716799 1746806 1773907 1798256 1819694 1837656 1851747 1862137
53369 1862137 1869397 1874100 1876535 1876640 1874218 1869154 1861360 1850563 1836273 1817995 1795319 1767999 1736242
53356 1736242 1700915 1663217 1624138 1584378 1544629 1505494 1467083 1429100 1391502 1354820 1319752
53345A319752l3030l0909k9149k8417k9005l0158l0637l0068k9230k8872k8759
53334I91518k8064k6350k3866k1197j8899j7266j6214j5370j4405j3187j1755
53323G84945j0333r370r165r450r586r308q959q927r020q708p773o581n686n320
53309F66759n153m618l508k174r87J86J612K945L514L414L677M944O594P722Q511
53294F93438R867J1936J3908J5289J6497J7871J8885J8973J8555J8485J8850J9000
53282H91554J8663J8209J7719J6582J4392J1691R381P752O538N559M736L705K039
53269A028520j09k087l621n140p090r315j1371j3089j4481j5421j5832j6057j6656
53256H98251j7728j8816j9515j9973k0592k1379k1832k1536k0792k0398k0662
$$ plain form
53345 1319752 1286722 1255813 1226664 1198247 1169242 1139084 1108447 1078379 1049149 1020277 991518
53334 991518 963454 937104 913238 892041 873142 855876 839662 824292 809887 796700 784945
53323 784945 774612 765242 756077 746627 737041 727733 718774 709847 700827 692119 684346 677765 672079 666759
53309 666759 661606 656988 653480 651306 650319 650505 652117 655062 658576 661990 665667 670611 677205 684927 693438
53294 693438 703305 715241 729149 744438 760935 778806 797691 816664 835219 853704 872554 891554
53282 891554 910217 928426 946145 962727 977119 988810 998191 1005943 1012481 1018040 1022776 1026481 1028520
53269 1028520 1028411 1026324 1022703 1017563 1010473 1001158 989787 976698 962217 946796 930964 914907 898251
53256 898251 880523 861707 842192 822219 801627 780248 758416 736880 716088 695690 675028
53245F75028k0814j9671j7044j4231j2897j3520j5064j6049j5802j4856j4254
53234E00826j4507j5103j5087j4141j2902j2093j1662j1002r881q655p675o836
53222C61282n892m899m162l889m093m747n815p126q282q852q773q494q515q792
53208B68951q783q190p338o651o085n481n083n189n465n276m712m546n029n419
53194A85704n062m308l874l813l703l471l357l302l014k558k296k254k168k069
53180A40455k220k362j803m79O82Q54K99j29j04O1Q5Kj14k44k62k8L69P33J048
53161A36843J383J611J547J299J139J020O12j74r63j379j412j244r63n94k01K01
53145A38725O44J032J136R49P42O10K53m18p77j10J234J943J209k64j134r87n58
$$ plain form
53245 675028 654214 634543 617499 603268 590371 576851 561787 545738 529936 515080 500826
53234 500826 486319 471216 456129 441988 429086 416993 405331 394329 384448 375793 368118 361282
53222 361282 355390 350491 346329 342440 338347 333600 327785 320659 312377 303525 294752 286258 277743 268951
53208 268951 260168 251978 244640 237989 231904 226423 221340 216151 210686 205410 200698 196152 191123 185704
53194 185704 180642 176334 172460 168647 164944 161473 158116 154814 151800 149242 146946 144692 142524 140455
53180 140455 138235 135873 134070 133591 134273 135127 135426 135297 135193 135254 135339 135341 135227 134983 134721 134693 135062 135795 136843
53161 136843 138226 139837 141384 142683 143822 144842 145454 145280 144317 142938 141526 140282 139319 138725 138524 138725
53145 138725 139369 140401 141537 142486 143228 143838 144091 143673 142896 142786 144020 145963 147172 146908 145774 144787 144229
53128A44229n57q31r14q11q37r90r75q32r79j515j946j797j276j009j240j652
53112A26068j837j720j505j375j317j207r90q10q31r66r80q42p95r74j165j128
53096A07626q94o01l01j07k43o89j045j083j131j514j907j723j007m19l59o41
53080I3962r08r60p08l40m63j464k704l011k076p46J46N87P56M57l28r36o94J73
53062H0743Q50Q45L12l51p79q03n86m32l20pL27J15p08j500j868k139k411k031
53044F9257o84O93J029N77L86O80Q60P11N80N02K03n5K49Q27Q08J53k06J21M10
53025G7101Q6m08n03l85m23m57l01k51n16o70k97K97N53M51L20K50J99K74N10
53006G5830O82P15Q49J084J026P06Q11J553J955J186j6k29O32J322J162Q06R67
$$ plain form
53128 144229 143672 142841 141927 141116 140279 139289 138314 137482 136503 134988 133042 131245 129969 128960 127720 126068
53112 126068 124231 122511 121006 119631 118314 117107 116117 115307 114476 113510 112530 111688 110893 109919 108754 107626
53096 107626 106732 106131 105830 105723 105480 104791 103746 102663 101532 100018 98111 96388 95381 94962 94603 93962
53080 93962 93054 92094 91386 91046 90583 89119 86415 83404 81328 80582 80728 81315 82071 82528 82200 81264 80570 80743
53062 80743 81593 82438 82750 82399 81620 80817 80231 79799 79479 79472 79799 79914 79206 77706 75838 73699 71288 69257
53044 69257 68573 69266 70295 70872 71258 71938 72798 73509 74089 74591 74794 74739 74988 75815 76623 76776 76570 76691 77101
53025 77101 77187 76779 76276 75891 75468 75011 74710 74459 73943 73273 72976 73273 73826 74277 74597 74847 75046 75320 75830
53006 75830 76512 77227 78076 79160 80186 80892 81703 83256 85211 86397 86381 86152 86784 88106 89268 90074 91041
52989I1041J396J574J532J505J373R77N55L43J16m57j126j295q63l71k97n01n52
52972I4950l97m18q88j526j750j279l56N72J162J233P52l3o53q15o16l36j46j02
52954H9354k65n89q31p22k07N18J085J161Q00N61Q89J400J253M17j16L09J027
52937I6044J014K88l04m16m95r03j505k102k587k554j579m9R07O88o8m18k53r2
52919H5616j10O7O34J188J139L79n61j058j011q72q97p17N7J022J337Q56L29K65
52901H7663K46k57q85q51r8O12P12L65o5n74j226j647j299k17Q09J051O71M49
52883H5459P04Q63L01p08j336j309j098j052q88l01M38R18J181J446J551J241
52867H7410P75O68R35J137J151J252J339P62o56k079k600k367k163k179j897j131
$$ plain form
52989 91041 92437 94011 95543 97048 98421 99398 99953 100296 100412 99955 98829 97534 96671 96300 96003 95502 94950
52972 94950 94553 94135 93247 91721 89971 88692 88336 88908 90070 91303 92055 92022 91369 90554 89938 89602 89456 89354
52954 89354 89089 88500 87669 86947 86740 87258 88343 89504 90304 90865 91754 93154 94407 94824 94708 95017 96044
52937 96044 97058 97346 97042 96626 96131 95228 93723 91621 89034 86480 84901 84852 85759 86447 86379 85961 85708 85616
52919 85616 85506 85573 86207 87395 88534 88913 88352 87294 86283 85411 84514 83797 83854 84876 86213 87069 87398 87663
52901 87663 87909 87652 86767 85916 85818 86430 87142 87507 87442 86868 85642 83995 82696 82479 83288 84339 85010 85459
52883 85459 86163 87026 87327 86619 85283 83974 82876 81824 80936 80635 81073 81991 83172 84618 86169 87410
52867 87410 88185 88853 89788 90925 92076 93328 94667 95429 94773 92694 90094 87727 85564 83385 81488 80357
52851H0357m44l23n47o45n14k49K11Q13J064N51k93n25J22Q81R04K18n26q70q15
52832G9370n18j21J27l9n72j000q67k04M40N37P5n26r06j090j201j164r06o66
52814G0769p67j099j247j167j292j778k093j708q82k82q5R2M10N11J61l25n38
52797E8680n64p43r90q10m1P75R84O21K93L95O82P60N98L64J5n58j073j043m38
52778E7907J41J80j43k80n5J87Q8k81n14l39R2L94M29M53O79R07Q08L91j14o53
52758F0277j169j212l64Q90J469J076O55R91J576J460P11K45M40P08M56j56o00
52741F7453o30m14k67l80n92n04lM85M67k0n31p87q07o24k62J25M07O17O85L28
52721F4746l51n18M65J983K783K512J897J383N80o04j321r01N5M58K00L2K70M40
$$ plain form
52851 80357 79913 79590 79043 78398 77884 77635 77846 78659 79723 80274 79981 79456 79578 80459 81363 81581 81055 80185 79370
52832 79370 78852 78731 78858 78819 78247 77247 76380 76176 76616 77153 77228 76702 75796 74706 73505 72341 71435 70769
52814 70769 70002 68903 67656 66489 65197 63419 61326 59618 58736 58454 58369 58461 58871 59382 59543 59218 58680
52797 58680 58116 57373 56383 55573 55532 56307 57291 57912 58205 58600 59282 60042 60640 61004 61019 60461 59388 58345 57907
52778 57907 58048 58228 58085 57805 57750 57937 58025 57744 57230 56891 56983 57377 57806 58259 58938 59845 60653 61044 60930 60277
52758 60277 59108 57896 57532 58422 59891 60967 61622 62613 64189 65649 66360 66605 67045 67753 68209 68053 67453
52741 67453 66823 66409 66142 65762 65170 64666 64663 65148 65615 65595 65064 64277 63470 62846 62584 62709 63116 63733 64418 64746
52721 64746 64395 63877 64342 66325 69108 71620 73517 74900 75480 74876 73555 72654 72709 73167 73367 73399 73669 74109
52703G4109K20k2Q8L39L62K72M24P59Q35N25K37K55K76r6n74m21N09J410J406
52684H0913M78o46j281j199n98K1J34k92o71m95L1L27K83L77R53J708J935J222
52666H3200n1q86o14K23L92m28j151p78K13O12J73m00p02r28j012n87J15L00j70
52647G7521n07k54P4n0l39l71l47n78q04o34k12N2O9j8j30j07K18M59j36j455
52627G2451k123j098Q10J852J408L72k65l84l21k59j96p2J86M50L90o2m52m60
52609G2227m19o89q97m71L83R80J268J723K296K333J667Q67K91k29n40k6J180
52592H1944J822J014m76j231r33l36J03N91J189J513J373J024P07L72Q8J27N79
52575H9470J207J799K287K420J830O88k13l40n3j4l12n55n46m41l82m55p90j322
$$ plain form
52703 74109 74329 74307 74395 74734 75096 75368 75792 76551 77386 77911 78148 78403 78679 78583 78009 77588 78097 79507 80913
52684 80913 81391 80745 79464 78265 77667 77688 77822 77530 76859 76364 76395 76722 77005 77382 78335 80043 81978 83200
52666 83200 83149 82263 81649 81872 82264 81836 80685 79907 80120 80732 80905 80505 79803 78875 77863 77276 77391 77691 77521
52647 77521 77014 76760 76834 76784 76445 76074 75727 75149 74345 73711 73499 73551 73620 73602 73472 73365 73583 74042 73906 72451
52627 72451 70328 69230 70040 71892 73300 73672 73407 73023 72702 72443 72247 72175 72361 72811 73201 73139 72687 72227
52609 72227 71808 71119 70222 69751 70134 71114 72382 74105 76401 78734 80401 81268 81559 81330 80790 80764 81944
52592 81944 83766 84780 84304 83073 82140 81804 81907 82498 83687 85200 86573 87597 88304 88676 88764 88891 89470
52575 89470 90677 92476 94763 97183 99013 99701 99488 99148 99095 99081 98769 98214 97668 97227 96845 96390 95600 94278
52557I4278j576j170m69j89l94n03k76j11k46l36k52n52j552k519k495j629q88
52540G9121o72m77Q2O26O45J99k69m96n47n87o66o13j82N05R16P09K58J37L25
52521G9014L39M2k48m19o81j084j382j470j475j342r24m93n35r59j086o38j31
52504F6528j6j03m4J41L58O76R56Q04K49q9O2J69k38p35o25M0P01J040R99M24
52484G1297o18j521j718j404j085p58j23O42J051J023Q57N77K2n47n78l8M89N84
52466F8152L85J64mo1O7K52K00j47m93n30j79M26R64J060O64J72l2J1J41L86O51
52445G2249N11j78p53m90L56Q91P68L87N9k55l74O0Q19J086N28k10m26k16p6j39
52425G4597j92j70j50j07K4K09M39Q41J390J676J257K48o55q29l41J99L45L06
$$ plain form
52557 94278 92702 91532 91063 90874 90480 89977 89701 89590 89344 89008 88756 88204 86652 84133 81638 80009 79121
52540 79121 78449 77972 78054 78680 79325 79524 79255 78759 78212 77625 76959 76346 76164 76669 77585 78294 78552 78689 79014
52521 79014 79353 79395 79147 78728 78047 76963 75581 74111 72636 71294 70370 69877 69342 68383 67297 66659 66528
52504 66528 66512 66409 66365 66506 66864 67540 68496 69300 69549 69460 69522 69691 69453 68718 68093 68133 68834 69874 70873 71297
52484 71297 70679 69158 67440 66036 64951 64193 64070 64712 65763 66786 67643 68220 68242 67695 67117 67079 67568 68152
52466 68152 68537 68701 68697 68636 68703 68955 69155 69008 68515 67985 67806 68232 69196 70256 70920 71092 71060 71071 71212 71598 72249
52445 72249 72760 72582 71829 71339 71695 72586 73354 73741 73800 73545 73171 73231 74050 75136 75664 75454 75028 74812 74736 74597
52425 74597 74405 74235 74085 73978 74002 74211 74650 75491 76881 78557 79814 80062 79407 78578 78237 78436 78781 79087
52407G9087N15R52J193J121J079J152R00J96k63J49R71J225P47J98l2q9R1Q88
52389I0080K124K892K628J802J181R01O28K60J2K0J67K75K84L35O20J065J271
52372A06545J027P25Q83J401J707J560J229R03N09J46J02M03P36R67J215J436
52356A21494J425J290J355J555J541J403J579J959J929J476J340J757K016J839
52342A43958K154L599N092N083L742K754L109M235N281O152O966P462P425P150
52328B14162P061P356Q230R843J1748J2895J2817J2346J2568J3358J3677J3167
52316C49228J2674J3010J3900J4436J4158J3209J1916J0618R692R204Q639P471
52304D88155N984N012M878M983M505L136J114r72k381k736k546k680l304l822
$$ plain form
52407 79087 79602 80554 81747 82868 83947 85099 85999 86195 85932 86081 87052 88277 89024 89222 89190 89101 89192 90080
52389 90080 92204 95096 97724 99526 100707 101608 102236 102496 102508 102528 102695 102970 103254 103589 104209 105274 106545
52372 106545 107572 108297 109180 110581 112288 113848 115077 115980 116489 116635 116737 117140 117876 118843 120058 121494
52356 121494 122919 124209 125564 127119 128660 130063 131642 133601 135530 137006 138346 140103 142119 143958
52342 143958 146112 149711 154803 159886 163628 166382 169491 173726 179007 185159 192125 199587 207012 214162
52328 214162 221223 228579 236809 246652 258400 271295 284112 296458 309026 322384 336061 349228
52316 349228 361902 374912 388812 403248 417406 430615 442531 453149 462841 472045 480684 488155
52304 488155 494139 499151 504029 509012 513517 516653 517767 516795 514414 511678 509132 506452 503148 499326
52290D99326l976m219m751n023m628l929l307k538j553r41q82l92J254L145L956
52275D71542M060M950O828Q341Q733Q809R365J0055J0320J0364J0507J0515J0133
52262E84522R592R088Q394P490O819O559O218N394M292L139J768J91j022j489
52248F50955j522j625k070l168n182p467q671q336p607p679q263q311p533o378
52234E67143n111l888l275l704m574m820m260l613l232k619j380L4Q42Q87P83
52219E29213J163J946K484K450K330K740L467L737L326K801K672K984L617M320
52205E69250M472L674K580K197K325J948J172J223K120K108L42j481j492k80L45
52190E90503N7j81j74n21j124j397j612k452l464l545k848k613l135l473l232
$$ plain form
52290 499326 495350 491131 486380 481357 476729 472800 469493 466955 465402 464461 463579 463187 464441 467586 471542
52275 471542 475602 480552 487380 495721 504454 513263 522628 532683 543003 553367 563874 574389 584522
52262 584522 594114 603202 611596 619086 625905 632464 638682 644076 648368 651507 653275 653466 652444 650955
52248 650955 649433 647808 645738 642570 637388 629921 621250 612914 605307 597628 589365 581054 573521 567143
52234 567143 562032 558144 554869 551165 546591 541771 537511 533898 530666 528047 526667 526701 527543 528430 529213
52219 529213 530376 532322 534806 537256 539586 542326 545793 549530 552856 555657 558329 561313 564930 569250
52205 569250 573722 577396 579976 582173 584498 586446 587618 588841 590961 593069 593411 591930 590438 590158 590503
52190 590503 590560 590379 590205 589684 588560 587163 585551 583099 579635 576090 573242 570629 567494 564021 560789
52175E60789l077l230l032k367k068k375k373j607r81j315k083k374k221k111
52161E29575k003j666j425j717k332k713k693k385j777r48l32k65n44p78q92r18
52145E06187o79o1O14Q71O21K14J10N30J249J741J834K101L173M769O019O748
52129E36041P671R123J0342J0520J0006R880J0675J1935J2884J3128J2823J2441
52117F67469J2359J2520J2521J2041J1152J0288J0001J0425J0854J0207Q231N810
52105G93878L757J906j1j321j324p71j172k697m112m750n265o157o907p104p209
52090G50741p531p469o591n513m897m372l300j961j067n65J85J388K763M175N629
52075G21615O821P441P724Q193Q956R724J0337J0820J1109J1138J0951J0458R365
$$ plain form
52175 560789 557712 554482 551450 549083 547015 544640 542267 540660 539679 538364 536281 533907 531686 529575
52161 529575 527572 525906 524481 522764 520432 517719 515026 512641 510864 509916 509584 509319 508775 507997 507105 506187
52145 506187 505508 505447 506061 506932 507553 507767 507877 508407 509656 511397 513231 515332 518505 523274 529293 536041
52129 536041 543712 552835 563177 573697 583703 593583 604258 616193 629077 642205 655028 667469
52117 667469 679828 692348 704869 716910 728062 738350 748351 758776 769630 779837 788068 793878
52105 793878 797635 799541 799530 798209 796885 796114 794942 792245 788133 783383 778118 771961 765054 757950 750741
52090 750741 743210 735741 729150 723637 718740 714368 711068 709107 708040 707475 707660 709048 711811 715986 721615
52075 721615 728436 735877 743601 751794 760750 770474 780811 791631 802740 813878 824829 835287 844652
52062H44652P707O077M969M228L494K716J814L54j811m007n430o176p000q311
52048H43276r962j1660j3048j3645j3407j3153j3772j5064j5966j5869j5160j4485
52036F78085j4047j3659j3128j2454j1882j1654j1540j0917r657q516q148q127
52024E44356p623o726o235o286o194n795n979p316q919r393q618p861q221r480
52010D39710j0642j1115j1132j1181j1410j1632j1661j1440j0965j0345r878r866
51998C08443j0273j0726j0845j0534r982r548r484r542r098p996p049p090p736
51985A88540p746o670n347m605m262l818l336l023k576j648o64m31j094k004k483
51970A38833k336j770j226j093j307j429j359j547k225k886k967k640k383k203
$$ plain form
52062 844652 852359 858436 863405 867633 871127 873843 875657 876011 874200 870193 864763 858587 851587 843276
52048 843276 833314 821654 808606 794961 781554 768401 754629 739565 723599 707730 692570 678085
52036 678085 664038 650379 637251 624797 612915 601261 589721 578804 569147 560631 552483 544356
52024 544356 536733 530007 523772 517486 511292 505497 499518 492202 483283 473890 465272 457411 449190 439710
52010 439710 429068 417953 406821 395640 384230 372598 360937 349497 338532 328187 318309 308443
51998 308443 298170 287444 276599 266065 256083 246535 237051 227509 218411 210415 203366 196276 188540
51985 188540 180794 174124 168777 164172 159910 156092 152756 149733 147157 145509 144845 144414 143320 141316 138833
51970 138833 136497 134727 133501 132408 131101 129672 128313 126766 124541 121655 118688 116048 113665 111462
51956A11462j869j540j459j319o55K76O34J07p44j106o11M35J165P89l77r78l27
51939A03883N15Q6j394k363k131j553j473j628j489j100o32P1Q72J063L49m53
51923I2623l96L46Q34O02n4p58j335j558j279q33q08j283j768j903j797j564j019
51906G8050j60M81L77k55p28p80p67q96q60m22R3K90K69L10K56j86q09j117j042
51887G2104q31l98M35J146R15r8p64n96l41n63o62j0P93P27k05j175j632j425
51869F7420m36J012J833J371M81M32J056J094J78p15p92k82L16P75Q23L09j46
51852G4729K95J285J479M98m48l74J54J53j83L1Q57J506J521J271J301J700K116
51835H7891K065J363L89j88j46J44L48O07J140J815K324K570K628K597K619K781
$$ plain form
51956 111462 109593 108053 106594 105275 104620 104896 105530 105637 104893 103787 103176 103611 104776 105565 105188 104210 103883
51939 103883 104398 104484 103090 100727 98596 97043 95570 93942 92453 91353 90721 90792 91664 92727 93076 92623
51923 92623 92227 92573 93407 94009 93955 93197 91862 90304 89025 88192 87384 86101 84333 82430 80633 79069 78050
51906 78050 77890 78371 78748 78493 77765 76985 76218 75322 74462 74040 74133 74423 74692 75002 75258 75072 74263 73146 72104
51887 72104 71273 70875 71310 72456 73371 73273 72509 71913 71572 71009 70347 70337 71130 71857 71652 70477 68845 67420
51869 67420 66984 67996 69829 71200 71681 72113 73169 74263 74441 73726 72934 72652 72968 73743 74566 74875 74729
51852 74729 75024 76309 77788 78286 77838 77464 77618 77771 77588 77619 78476 79982 81503 82774 84075 85775 87891
51835 87891 89956 91319 91708 91520 91374 91518 91866 92473 93613 95428 97752 100322 102950 105547 108166 110947
51819A10947L030L417M315N799O927O407M166J567k42j481k942m625n798n961
51805A25526n308m396l735l415l002k115j123p85j083j139n40k7l57j192j690
51790I5619j643j392j067o26k75k21k35j9K22P4l52n80m39j23K70P31J043R41
$$ plain form
51819 110947 113977 117394 121709 127508 134435 140842 145008 146575 146333 144852 141910 137285 131487 125526
51805 125526 120218 115822 112087 108672 105670 103555 102432 101647 100564 99425 98885 98858 98501 97309 95619
51790 95619 93976 92584 91517 90891 90616 90395 90160 90141 90363 90437 90085 89505 89066 88943 89213 89944 90987 91928
$$ [...]
##END NTUPLES=NMR SPECTRUM
##END=
