##TITLE=NES1072_159122.0001_001_9705742_Jn1s7h4oia
##JCAMPDX= 6.0         $$ Bruker NMR JCAMP-DX V2.0
##DATA TYPE= NMR SPECTRUM
##DATA CLASS= NTUPLES
##ORIGIN= BRUKER
##OWNER= Administrator
$$ 1.72 TOPSPIN		Version 2.1
$$ 2016-04-30 20:21:12.474 -0700  Administrator@X
$$ Compression mode = diff/dup
##.OBSERVE FREQUENCY= 400.02188249412
##.OBSERVE NUCLEUS= ^1H
##.ACQUISITION MODE= SIMULTANEOUS (DQD)
##.ACQUISITION SCHEME= undefined
##.AVERAGES= 64
##.DIGITISER RES= 22
##SPECTROMETER/DATA SYSTEM= spect
##.PULSE SEQUENCE= noesygpps1d.comp
##.SOLVENT NAME= COFFEE_meoh
##.SHIFT REFERENCE= INTERNAL, COFFEE_meoh, 1, 14.96253
##AUDIT TRAIL= $$ (NUMBER, WHEN, WHO, WHERE, PROCESS, VERSION, WHAT)
$$ ##TITLE= Audit trail, TOPSPIN		Version 2.1
$$ ##JCAMPDX= 5.01
$$ ##ORIGIN= Bruker BioSpin GmbH
$$ ##OWNER= Administrator
$$ $$ E:\/data/COFFEE/nmr/NES1072_159122.0001_001_9705742_Jn1s7h4oia/12/pdata/1/auditp.txt
$$ ##AUDIT TRAIL=  $$ (NUMBER, WHEN, WHO, WHERE, PROCESS, VERSION, WHAT)
(   1,<2016-04-30 20:21:07.083 -0700>,<Administrator>,<X>,<go>,<TOPSPIN 2.1>,
      <created by zg
	started at 2016-04-30 20:09:37.677 -0700,
	POWCHK enabled, PULCHK disabled,
       configuration hash MD5:
       21 0F 79 D6 B3 7B B4 F6 88 20 88 DB 03 48 BD 9F
       data hash MD5: 64K
       8A 33 DD 40 35 8D B0 5D A9 8A 5A 51 37 66 7C 28>)
(   2,<2016-04-30 20:21:10.427 -0700>,<Administrator>,<X>,<proc1d>,<TOPSPIN 2.1>,
      <Start of raw data processing
       efp LB = 0.3 FT_mod = 6 PKNL = 1 PHC0 = 0 PHC1 = 0 SI = 128K 
       data hash MD5: 128K
       C1 55 D6 A7 B8 B2 66 68 A6 14 BA DF C5 9A DE EC>)
(   3,<2016-04-30 20:21:11.302 -0700>,<Administrator>,<X>,<proc1d>,<TOPSPIN 2.1>,
      <pk PHC0 = -85.979 PHC1 = 0 
       data hash MD5: 128K
       2C 95 52 12 9D C1 FC 44 6D 68 A5 89 B1 4E 88 CD>)
(   4,<2016-04-30 20:21:11.692 -0700>,<Administrator>,<X>,<proc1d>,<TOPSPIN 2.1>,
      <abs ABSG = 1 
       data hash MD5: 128K
       7C 34 7C AE EA 10 D2 06 43 7A 4F CB D6 2D FA ED>)
(   5,<2016-04-30 20:21:11.802 -0700>,<Administrator>,<X>,<proc1d>,<TOPSPIN 2.1>,
      <abs ABSG = 2 
       data hash MD5: 128K
       BC CF DB 29 FA 99 CB 49 9A DB 4C F2 9F 0F A7 10>)
(   6,<2016-04-30 20:21:11.880 -0700>,<Administrator>,<X>,<proc1d>,<TOPSPIN 2.1>,
      <abs ABSG = 3 
       data hash MD5: 128K
       FB 69 F8 7D DF 22 96 0F C7 D1 D8 CE 53 8B 9A 8A>)
(   7,<2016-04-30 20:21:11.974 -0700>,<Administrator>,<X>,<proc1d>,<TOPSPIN 2.1>,
      <abs ABSG = 4 
       data hash MD5: 128K
       52 DD D6 6B 20 30 67 8B 40 0E 46 D6 22 63 DA 00>)
(   8,<2016-04-30 20:21:12.083 -0700>,<Administrator>,<X>,<proc1d>,<TOPSPIN 2.1>,
      <abs ABSG = 5 
       data hash MD5: 128K
       71 D0 06 94 FA 0E B2 91 45 3E 0F 44 99 AC 78 5D>)
$$ ##END=
$$ 
$$ $$ hash MD5
$$ $$ 37 B0 BB 06 1A EE BD A1 D8 13 09 D8 30 0A D6 B6
##$RELAX= 
##$RELAX= 
##$RELAX= 
##$RELAX= 
##$RELAX= 
##$RELAX= 
##$RELAX= 
##$RELAX= 
$$ Bruker specific parameters
$$ --------------------------
##$DU= <E:\>
##$EXPNO= 12
$$ [...]
150 150 150 150 150 150 150 150
##$TP07= 0
##$TPNAME0= <>
##$TPNAME1= <>
##$TPNAME2= <>
##$TPNAME3= <>
##$TPNAME4= <>
##$TPNAME5= <>
##$TPNAME6= <>
##$TPNAME7= <>
##$TPOAL= (0..7)
0.5 0.5 0.5 0.5 0.5 0.5 0.5 0.5
##$TPOFFS= (0..7)
0 0 0 0 0 0 0 0
##$TUNHIN= 0
##$TUNHOUT= 0
##$TUNXOUT= 0
##$USERA1= <user>
##$USERA2= <user>
##$USERA3= <user>
##$USERA4= <user>
##$USERA5= <user>
##$V9= 5
##$VALIST= <valist>
##$VCLIST= <CCCCCCCCCCCCCCC>
##$VD= 0
##$VDLIST= <DDDDDDDDDDDDDDD>
##$VPLIST= <PPPPPPPPPPPPPPP>
##$VTLIST= <TTTTTTTTTTTTTTT>
##$WBST= 2048
##$WBSW= 25
##$XGAIN= (0..3)
0 0 0 0
##$XL= 0
##$YL= 0
##$YMAX_a= 6165504
##$YMIN_a= -13067727
##$ZGOPTNS= <>
##$ZL1= 120
##$ZL2= 120
##$ZL3= 120
##$ZL4= 120
##$ABSF1= 14.96253
##$ABSF2= -5.595652
##$ABSG= 5
##$ABSL= 3
##$ALPHA= 0
##$AQORDER= 0
##$ASSFAC= 0
##$ASSFACI= 0
##$ASSFACX= 0
##$ASSWID= 0
##$AUNMP= <proc_prof1d_extract.lims>
##$AXLEFT= 0
##$AXNAME= <>
##$AXNUC= <1H>
##$AXRIGHT= 0
##$AXTYPE= 0
##$AXUNIT= <>
##$AZFE= 0.1
##$AZFW= 0.1
##$BCFW= 0
##$BC_mod= 0
##$BYTORDP= 0
##$COROFFS= 0
##$CY= 15
##$DATMOD= 1
##$DC= 0
##$DFILT= <>
##$DTYPP= 0
##$F1P= 0
##$F2P= 0
##$FCOR= 0.5
##$FTSIZE= 131072
##$FT_mod= 6
##$GAMMA= 0
##$GB= 0
##$INTBC= 1
##$INTSCL= 1
##$ISEN= 128
##$LB= 0.3
##$LEV0= 0
##$LPBIN= 0
##$MAXI= 10000
##$MC2= 0
##$MEAN= 0
##$ME_mod= 0
##$MI= 0
##$NCOEF= 0
##$NC_proc= -2
##$NLEV= 6
##$NOISF1= 0
##$NOISF2= 0
##$NSP= 0
##$NTH_PI= 0
##$NZP= 0
##$OFFSET= 14.96253
##$PC= 1
##$PHC0= -85.979
##$PHC1= 0
##$PH_mod= 1
##$PKNL= yes
##$PPARMOD= 0
##$PPDIAG= 0
##$PPIPTYP= 0
##$PPMPNUM= 2147483647
##$PPRESOL= 1
##$PSCAL= 4
##$PSIGN= 0
##$PYNMP= <proc.py>
##$REVERSE= no
##$SF= 400.020009023532
##$SI= 131072
##$SIGF1= 0
##$SIGF2= 0
##$SINO= 400
##$SIOLD= 131072
##$SPECTYP= <>
##$SREGLST= <1H.CDCl3>
##$SSB= 0
##$STSI= 131072
##$STSR= 0
##$SW_p= 8223.68421052631
##$SYMM= 0
##$S_DEV= 0
##$TDeff= 65536
##$TDoff= 0
##$TI= <>
##$TILT= no
##$TM1= 0
##$TM2= 0
##$TOPLEV= 0
##$USERP1= <user>
##$USERP2= <user>
##$USERP3= <user>
##$USERP4= <user>
##$USERP5= <user>
##$WDW= 1
##$XDIM= 131072
##$YMAX_p= 382994194
##$YMIN_p= -12143
##$CURPLOT= <Network HP LaserJet P1505>
##$CURPRIN= <$Network HP LaserJet P1505>
##$DFORMAT= <normdp>
##$LAYOUT= <+/1D_H.xwp>
##$LFORMAT= <normlp>
##$PFORMAT= <normpl>
##$SURQMSG= 1
$$ End of Bruker specific parameters
$$ ---------------------------------
##NTUPLES= NMR SPECTRUM
##VAR_NAME=  FREQUENCY,     SPECTRUM/REAL,   SPECTRUM/IMAG
##SYMBOL=    X,             R,               I
##VAR_TYPE=  INDEPENDENT,   DEPENDENT,       DEPENDENT
##VAR_FORM=  AFFN,          ASDF,            ASDF
##VAR_DIM=   131072,        131072,          131072
##UNITS=     HZ,            ARBITRARY UNITS, ARBITRARY UNITS
##FACTOR=    0.0627417313425164, 1,          1
##FIRST=     8223.62146879497, -2571,        -51206
##LAST=      0,             -236,            -51788
##MIN=       0,             -12143,          0
##MAX=       8223.62146879497, 382994194,    0
$$ Real data points
##PAGE= N=1
##DATA TABLE= (X++(R..R)), XYDATA
$$ [...]
61110F45388p91l188n663p551q274q345q641r064q944q379q064q139q188q171
61096E43986q361q561q280p550o767n995n155m605m702n143n411n497n453m779
61082D57727l188j521q95j245j575j331p07M4P78J217J335J620K290K755K526
61067D59830K116K258K782L094L188L356L465L271K949K662K249J904K265L198
61053D98587L608L195L133M126N147N269N298O170P114P033O503O724P554Q268
61039E77729R135J0514J1542J1570J1719J3135J4832J5357J5370J6307J7639J7971
61027G42820J7855J8866K0638K1514K1496K1957K3079K4178K5989K9772L4577
61016A002741L8099L9831M0871M1444M1535M3070M8165N5861O3914P2998Q5325
$$ plain form
61110 645388 644597 641409 635746 628195 619921 611576 602935 593871 584927 576548 568484 560345 552157 543986
61096 543986 535625 527064 518784 511234 504467 498472 493317 488712 484010 478867 473456 467959 462506 457727
61082 457727 454539 453018 452123 450878 449303 447972 447265 447309 448087 449304 450639 452259 454549 457304 459830
61067 459830 461946 464204 466986 470080 473268 476624 480089 483360 486309 488971 491220 493124 495389 498587
61053 498587 502195 505390 508523 512649 517796 523065 528363 534533 541647 548680 555183 561907 569461 577729
61039 577729 586864 597378 608920 620490 632209 645344 660176 675533 690903 707210 724849 742820
61027 742820 760675 779541 800179 821693 843189 865146 888225 912403 938392 968164 1002741
61016 1002741 1040840 1080671 1121542 1162986 1204521 1247591 1295756 1351617 1415531 1488529 1573854
61005A573854R9938J13749J26923J42841J63041J87022K16798K56120L04836L59772
60995C544894M21622M94764N80428O78380P96817R50938J149838J396666J700674
60986A1715021K056777K382438K494069K208474J513228O29354j24884n43917
60978B2330560o14210m23349n6550L85937P18287P08642K45833n40467j354239
60969B1400444j936249k200086k206265k057069j831953j584245j349223j141224
60961G094130r57772p95320o56348n41887m46949l66917l02105k53106k16568
60952B557158j88245j66159j48747j33519j19488j07799r8407q9048p8718o9069
60942A357959o1057n3308m5389l9747l8369l9758m1061m1286m0796l9452l7047
$$ plain form
61005 1573854 1673792 1787541 1914464 2057305 2220346 2407368 2624166 2880286 3185122 3544894
60995 3544894 3966516 4461280 5041708 5720088 6516905 7467843 8617681 10014347 11715021
60986 11715021 13771798 16154236 18648305 20856779 22370007 22999361 22874477 22330560
60978 22330560 21716350 21293001 21236451 21622388 22340675 23049317 23295150 22754683 21400444
60969 21400444 19464195 17264109 15057844 13000775 11168822 9584577 8235354 7094130
60961 7094130 6136358 5341038 4684690 4142803 3695854 3328937 3026832 2773726 2557158
60952 2557158 2368913 2202754 2054007 1920488 1801000 1693201 1594794 1505746 1427028 1357959
60942 1357959 1296902 1243594 1198205 1158458 1120089 1080331 1039270 997984 957188 917736 880689
60931H80689l4276l1852k9650k7576k6091k5078k3591k1452j9858j9563j9748
60920F01954j9332j8242j6757j4842j2757j1181j0210r188p899o780n854m737
60908D64175l806l902m672m686l532k236j388m40P03J157O90L10N81Q12O34P88
60892D45188J657K460K681K957L756M477M651M805N303N553N101M392L643K192
60878D98816j36k197k963k923l129l809m645n545o286o193n037l639k869k713
60864D46732k730k750k581j830n43P22J818L254N199P133Q799J0476J1922J2258
60850D97879J1423J0555J0291R813Q425P003O838P870R038R701R754Q929O980
60837F14499M403K206J044Q98J231J288O77j19k57L36Q93Q97M65l05j431k420
$$ plain form
60931 880689 846413 814561 784911 757335 731244 706166 682575 661123 641265 621702 601954
60920 601954 582622 564380 547623 532781 520024 508843 498633 489445 481546 474766 468912 464175
60908 464175 460369 456467 451795 447109 443577 441341 439953 439513 440216 441373 442063 442373 442954 443766 444400 445188
60892 445188 446845 449305 451986 454943 458699 463176 467827 472632 477935 483488 488589 492981 496624 498816
60878 498816 498680 496483 493520 490597 487468 483659 479014 473469 467183 460990 455953 452314 449445 446732
60864 446732 444002 441252 438671 436841 436298 437020 438838 442092 447291 454424 463223 473699 485621 497879
60850 497879 509302 519857 530148 539961 548386 555389 562227 570097 579135 588836 598590 607519 614499
60837 614499 618902 621108 622152 623050 624281 625569 626246 626127 625870 626206 627099 627996 628461 628156 626725 624305
60821F24305k544j953j555j649j740j868k820m650o259o980p409q127q766q968
60807E59017r032q952q043o300m966m841n081m616l661k849j886l05J299J961
60793E01745J743J441J432J659K207L029L608L723L949M630N075M569L546K920
60779E45276K771K616K358K112J750J415J934L667N579O392O259O258O742P216
60765F02345P494P844Q164P991P339O698O293N978N702N434M849L782K762K377
60751F85052K385K063J334Q01P36O49j27j804l950n692o318n998n582n475n287
60736F52787m851m742n224n461m698l577l365m267n429o256o787p016o805o418
60722E77891o311o375o131n564n160n142n275n430n640n619m852l260j405P0R10
$$ plain form
60821 624305 621761 619808 618253 616604 614864 612996 610176 605526 599267 592287 584878 576751 567985 559017
60807 559017 549985 541033 532990 526690 521724 516883 511802 507186 503525 500676 498790 498485 499784 501745
60793 501745 503488 504929 506361 508020 510227 513256 516864 520587 524536 529166 534241 538810 542356 545276
60779 545276 548047 550663 553021 555133 556883 558298 560232 563899 569478 575870 582129 588387 595129 602345
60765 602345 609839 617683 625847 633838 641177 647875 654168 660146 665848 671282 676131 679913 682675 685052
60751 685052 687437 689500 690834 691635 692371 693020 692893 691089 687139 681447 675129 669131 663549 658074 652787
60736 652787 647936 643194 637970 632509 627811 624234 620869 616602 611173 604917 598130 591114 584309 577891
60722 577891 571580 565205 559074 553510 548350 543208 537933 532503 526863 521244 516392 513132 511727 511797 512707
60707E12707J237J369J616J982K177K059J835J709J670J725J844J529J76j799
60693E31836l011k849k477l307n113o562p080p239p550p882q065q135p945p220
60679D47401o128n214m718m429m176l951l609k865j701m09P03J417J623J597J985
60664D17526L066M216M565M085L559L602M138M749N170N384N523N652N585N094
60650D81914M359L885L824L753L321K756K426K411K667L269M188N212O198P047
60636E37230P394P044O753P611R343J0225R293P581O520O089N511M829M532M286
60622F34241L315J743M33l34j016j846k678l560m575n305n255m683m158l644k901
60607E99777k445l002m197m914m954n185n981o649o637o264n903n400m649l984
$$ plain form
60707 512707 513944 515313 516929 518911 521088 523147 524982 526691 528361 530086 531930 533459 533635 531836
60693 531836 528825 525976 523499 520192 515079 508517 501437 494198 486648 478766 470701 462566 454621 447401
60679 447401 441273 436059 431341 426912 422736 418785 415176 412311 410610 410201 410904 412321 413944 415541 417526
60664 417526 420592 424808 429373 433458 437017 440619 444757 449506 454676 460060 465583 471235 476820 481914
60650 481914 486273 490158 493982 497735 501056 503812 506238 508649 511316 514585 518773 523985 530183 537230
60636 537230 544624 551668 558421 566032 575375 585600 594893 602474 608994 615083 620594 625423 629955 634241
60622 634241 637556 639299 639732 639398 638382 636536 633858 630298 625723 620418 615163 610480 606322 602678 599777
60607 599777 597332 594330 590133 585219 580265 575080 569099 562450 555813 549549 543646 538246 533597 529613
60593E29613l533k869j688k45J151K470L498L738L175K622K812L490L884L695
60579E51813L206K627J831P47l16r21r94j029j606k696l618l832l564l479l915
60564E34254m734n612o215o230n578m521l378k333j635j516j645j156L34K098
60550D92133L294M121N393P220Q910J0119J1380J3427J6458K0072K3618K6599
60538F42744K8958L0750L1354K9527K4744J7907J0159J590p843j6618k2272k3961
60526G47039k3301k2284k1207j9153j5673j1305o851k838L90K620L884M441M567
60513F40329M399M042L801M187N503P437R351J1052J2996J5681J9245K3795K9545
60500G91363L6290M3217M9802N6393O3408P0312P6098Q0539Q4390Q8606R4019
$$ plain form
60593 529613 526080 523211 521523 521278 522429 524899 528397 532135 535310 537932 540744 544234 548118 551813
60579 551813 555019 557646 559477 560224 559908 558987 557993 556964 555358 552662 549044 545212 541648 538169 534254
60564 534254 529520 523908 517693 511463 505885 501364 497986 495653 494018 492502 490857 489701 490035 492133
60550 492133 495427 499548 504941 512161 521071 531190 542570 555997 572455 592527 616145 642744
60538 642744 671702 702452 733806 763333 788077 805984 816143 817733 809890 793272 771000 747039
60526 747039 723738 701454 680247 661094 645421 634116 627265 624427 624817 627437 631321 635762 640329
60513 640329 644728 648770 652571 656758 662261 669698 679049 690101 703097 718778 738023 761818 791363
60500 791363 827653 870870 920672 977065 1040473 1110785 1186883 1267422 1351812 1440418 1534437
60489A534437J01643J12529J27221J45633J67193J90352K11639K25668K26532
60480C042847K09810J74106J21504N6729j4354q5450j49769k00668k33764k48569
60470B672422k47936k36142k17496j95768j73665j52557j32987j15302r9711q6264
60460A014594p5091o6164n8647n1225m3645l7108l2545k9247k5951k2493j9480
60449E52998j6978j4594j2342j0416q551o606n297n278n911o037n614n414n473
60436D44487n163m546m367m712m884m651m447m253l542k417j698j641j649j426
60422C95091j393j653j624j023l31R2N25J208J969K720L585M306M302L594K926
60407D14294K808L029L238L311L088K554K284K890L976M525M376M305M578M536
$$ plain form
60489 1534437 1636080 1748609 1875830 2021463 2188656 2379008 2590647 2816315 3042847
60480 3042847 3252657 3426763 3548267 3604996 3590642 3505192 3355423 3154755 2920991 2672422
60470 2672422 2424486 2188344 1970848 1775080 1601415 1448858 1315871 1200569 1100858 1014594
60460 1014594 939503 873339 814692 763467 719822 682714 650169 620922 594971 572478 552998
60449 552998 536020 521426 509084 498668 490117 483511 478214 472936 467025 460988 455374 449960 444487
60436 444487 439324 434778 430411 425699 420815 416164 411717 407464 403922 401505 399807 398166 396517 395091
60422 395091 393698 392045 390421 389398 389067 389159 389684 390892 392861 395581 399166 403472 407774 411368 414294
60407 414294 417102 420131 423369 426680 429768 432322 434606 437496 441472 445997 450373 454678 459256 463792
60393D63792L872L289L381L762L812L481L030K582K287K281K220J578N93J31L95
60378E00486N61k9j040j853k334k650k942l388l941l972k914j337m42m05j71Q61
60362D74490K020K569K737L070L652M360N121N539N138M363M381N436O326N989
60348E35191M791L614K634J573N19k86r30j566k071k322k387k204j684j165j063
60333E32644r34J37K039L556M007L872L447K198Q2j699k161j764j399j088n41
60318E42396j23k82p36j010j219j537j639j393j356j836k191j883j410j361j353
60303E23067q71l65m35o33k39K62k02j563k695l062l122l215l036k368j489p13
60287D99321r7M01R07J717K918M107M895N398N827N876N068L438J537L2l72O99
$$ plain form
60393 463792 467664 470953 474334 478096 481908 485389 488419 491001 493288 495569 497789 499367 499960 500091 500486
60378 500486 501047 501018 499978 498125 495791 493141 490199 486811 482870 478898 475984 474647 474205 473800 473629 474490
60362 474490 476510 479079 481816 484886 488538 492898 498019 503558 508696 513059 517440 522876 529202 535191
60348 535191 539982 543596 546230 547803 548322 548036 547106 545540 543469 541147 538760 536556 534872 533707 532644
60333 532644 531710 531847 533886 537442 541449 545321 548768 550966 551048 549349 547188 545424 544025 542937 542396
60318 542396 542273 541991 541255 540245 539026 537489 535850 534457 533101 531265 529074 527191 525781 524420 523067
60303 523067 522196 521831 521396 520763 520524 520786 520584 519021 516326 513264 510142 506927 503891 501523 500034 499321
60287 499321 499224 499625 500532 502249 505167 509274 514169 519567 525394 531270 536338 539776 541313 541345 540973 541672
60271E41672K588L896L993L676L841M253M328M288M675N388O178P421R270J0696
60257F16163J0682R972J0275J1924J3701J4900J6189J8106K0108K1604K2986K5023
60245H11633K7834L1038L4282L7382M0321M3531M7665N2826N8371O3774O9178
60234A317835P4795Q0097Q4079Q6279Q7213Q7682Q7730Q6385Q2555P6099O7832
60223B218581N8554M8495L7738K6730J6031N858l816j2975k1515k9203l5396l9213
60211B269869m0288l9164l6677l3252k8888k3389j6453q027J266J0527J9647K9307
60199B104478L9653M9806N9105O7962P6794Q4883R1123R5288R7569R7370R3707
60188B957738Q6589P7077O6023N3535L9639K4701R098o814k2303l6368m8448n8640
$$ plain form
60271 541672 544260 548156 552149 555825 559666 563919 568247 572535 577210 582598 588776 596197 605467 616163
60257 616163 626845 636817 647092 659016 672717 687617 703806 721912 742020 763624 786610 811633
60245 811633 839467 870505 904787 942169 982490 1026021 1073686 1126512 1184883 1248657 1317835
60234 1317835 1392630 1472727 1556806 1643085 1730298 1817980 1905710 1992095 2074650 2150749 2218581
60223 2218581 2277135 2325630 2363368 2390098 2406129 2411987 2408171 2395196 2373681 2344478 2309082 2269869
60211 2269869 2229581 2190417 2153740 2120488 2091600 2068211 2051758 2043731 2044997 2055524 2075171 2104478
60199 2104478 2144131 2193937 2253042 2321004 2397798 2482681 2573804 2669092 2766661 2864031 2957738
60188 2957738 3044327 3121404 3187427 3240962 3280601 3305302 3314400 3307586 3285283 3248915 3200467 3141827
60176C141827o7099p3443p6870p6808p3614o8522o2504n5175m5453l3382k0544
60165B488413q378L081J4261K4872L4396M2910N0470N6307N9584O0447N9280N5510
60153B941153M8446L8880K8614J8413P764l280j3305k0982k6375l0218l2618l2976
60141B923516l0697k5649j8188r092R35J1842K4147L8186N3593O9541Q5323J00771
60129C224228J16276J32329J48940J65776J82807K00396K18466K36062K51982
60120D877262K65416K75663K81826K83186K79433K70216K55118K34518K09663
60111G232301J81215J48522J11104P0136K7527j5826n9685j02835j43050j78624
60101G270785k08819k32855k49570k58353k59668k54477k43672k28102k08576
$$ plain form
60176 3141827 3074728 3001285 2924415 2847607 2773993 2705471 2642967 2587792 2542339 2508957 2488413
60165 2488413 2480035 2483116 2497377 2522249 2556645 2599555 2650025 2706332 2765916 2826363 2885643 2941153
60153 2941153 2989599 3028479 3057093 3075506 3083270 3079990 3066685 3045703 3019328 2989110 2956492 2923516
60141 2923516 2892819 2867170 2848982 2839890 2840825 2852667 2876814 2915000 2968593 3038134 3123457 3224228
60129 3224228 3340504 3472833 3621773 3787549 3970356 4170752 4389218 4625280 4877262
60120 4877262 5142678 5418341 5700167 5983353 6262786 6533002 6788120 7022638 7232301
60111 7232301 7413516 7562038 7673142 7743278 7770805 7754979 7695294 7592459 7449409 7270785
60101 7270785 7061966 6829111 6579541 6321188 6061520 5807043 5563371 5335269 5126693
60092E126693j85827j60853j35145j09999q5812o2449m0035j8825J265K0301L7677
60081D386991N2483O4240P2735P7487P8036P4436O6930N5591M1006K4751Q340
60070E003026p934k4223l9863n3863o6339p8229q9795j00389j09450j16755j21906
60059D194280j24595j25186j24077j20806j14847j06873r8035q8229p6562o3350
60049C151720n0174l7760k5282j2046J386J4266K6640L8815N0816O2813P5049
60038C296243Q6863R6571J02807J05312J04217R9390R0820P8892O3993M6517K7416
60027D199041Q000j1093l0052m8884o6949q3504r7863j08957j15680j17920j16567
60016C409572j12365j05594r6807q6851p5986o3893n0800l7639k4893j2192P60
$$ plain form
60092 5126693 4940866 4780013 4644868 4534869 4449057 4386608 4346573 4327748 4329013 4349314 4386991
60081 4386991 4439474 4503714 4576449 4653936 4731972 4806408 4873338 4928929 4969935 4994686 5003026
60070 5003026 4995092 4970869 4931006 4877143 4810804 4732575 4642780 4542391 4432941 4316186 4194280
60059 4194280 4069685 3944499 3820422 3699616 3584769 3477896 3379861 3291632 3215070 3151720
60049 3151720 3101546 3063786 3038504 3026458 3027844 3042110 3068750 3107565 3158381 3221194 3296243
60038 3296243 3383106 3479677 3582484 3687796 3792013 3891403 3982223 4061115 4125108 4171625 4199041
60027 4199041 4207041 4195948 4165896 4117012 4050063 3966559 3868696 3759739 3644059 3526139 3409572
60016 3409572 3297207 3191613 3094806 3007955 2931969 2868076 2817276 2779637 2754744 2742552 2743312
60005B743312J3708K6512L9442N2626O6049Q0055R4869J09584J22691J33672J42762
59994C625282J49117J50642J46097J36118J21774J03560Q2277N9535L6500J3303
59984D624205r778l1829n2671p3211r3335j10722j22923j29643j31828j29643
59974C738622j22823j12242r9572q5710p0695n4927l9282k4246r790M058J7302
59963C140695L0338M3364N5686O6347P5240Q2856Q9228R3744R5839R5257R1916
59952C960510Q6120P8626O9910N9777M8194L6128K4814J4626N401k371p475r080
59940D365180p303k684M632J5226L0053M9351P1754R5158J18825J43910J71315
59929E055417J99842K27236K52240K74611K93546L07284L14019L12201L00046
$$ plain form
60005 2743312 2757020 2783532 2822974 2875600 2941649 3021704 3116573 3226157 3348848 3482520 3625282
59994 3625282 3774399 3925041 4071138 4207256 4329030 4432590 4514867 4574402 4610902 4624205
59984 4624205 4614427 4582598 4529927 4456716 4363381 4252659 4129736 4000093 3868265 3738622
59974 3738622 3615799 3503557 3403985 3318275 3247580 3192653 3153371 3129125 3119335 3123393 3140695
59963 3140695 3171033 3214397 3270083 3336430 3411670 3494526 3583754 3677498 3773337 3868594 3960510
59952 3960510 4046630 4125256 4195166 4254943 4303137 4339265 4364079 4378705 4384106 4381735 4374260 4365180
59940 4365180 4357877 4355193 4359825 4375051 4405104 4454455 4526209 4621367 4740192 4884102 5055417
59929 5055417 5255259 5482495 5734735 6009346 6302892 6610176 6924195 7236396 7536442
59920G536442K75904K39335J91256J33227O7434k607p2296j37276j94201k40496
59910G796722k74476k96023l06439l07203k99356k84240k64024k40856k15809
59901E308296j89193j61635j34269j07943q2664n8008l3805j0279J2305L3929
59891D576734N4762P4815R3612J10125J23200J32233J37231J37942J33025J20707
59881E694386J00435P3463M1587N935l2493p1642j08585j40848j67005j86330
59871E208903j98634k04442k04648j99907j90830j78543j64441j49472j34381
59862C583605j20421j08911j00031r2989q7406q3563q1128p8623p4733o9392o3216
59851B623192n6531m9361m1743l3729k5622j8421j3335j0636r661j0032j1960
$$ plain form
59920 7536442 7812346 8051681 8242937 8376164 8443598 8440991 8368695 8231419 8037218 7796722
59910 7796722 7522246 7226223 6919784 6612581 6313225 6028985 5764961 5524105 5308296
59901 5308296 5119103 4957468 4823199 4715256 4632592 4574584 4540779 4530500 4542805 4576734
59891 4576734 4631496 4706311 4799923 4910048 5033248 5165481 5302712 5440654 5573679 5694386
59881 5694386 5794821 5868284 5909871 5915806 5883313 5811671 5703086 5562238 5395233 5208903
59871 5208903 5010269 4805827 4601179 4401272 4210442 4031899 3867458 3717986 3583605
59862 3583605 3463184 3354273 3254242 3161253 3073847 2990284 2909156 2830533 2755800 2686408 2623192
59851 2623192 2566661 2517300 2475557 2441828 2416206 2397785 2384450 2373814 2364153 2354121 2342161
59840B342161j5125j8319k0733k2715k4712k6441k7756k9362l1710l3857l4369
59829B057062l2838k9737k5295j9583j3447q402n411m115l268j637J300N253R821
59816A929703J5263K1949K9096L4983L8851M1699M4501M6444M5824M2181L6649
59805B327143L0471K4053J7419J0846M924L05k501l302k113J106O302J3006K0682
59792B448341K9470L9921N1891O4505P7437R1459J07362J25153J44732J66519
59782C346790J90765K16868K43827K70524K94608L11339L14048K95822K51659
59773E736250J81154R0640p843j00922j78076k33019k63759k72841k66271k50212
59763D435101k28409k02916j75985j49919j25695j03211q2575o4201m7966l3366
$$ plain form
59840 2342161 2327036 2308717 2287984 2265269 2240557 2214116 2186360 2156998 2125288 2091431 2057062
59829 2057062 2024224 1994487 1969192 1949609 1936162 1927760 1922349 1918234 1914966 1913329 1914629 1919882 1929703
59816 1929703 1944966 1966915 1996011 2030994 2069845 2111544 2156045 2202489 2248313 2290494 2327143
59805 2327143 2357614 2381667 2399086 2409932 2414856 2415161 2412660 2409358 2407245 2408351 2414653 2427659 2448341
59792 2448341 2477811 2517732 2569623 2634128 2711565 2803024 2910386 3035539 3180271 3346790
59782 3346790 3537555 3754423 3998250 4268774 4563382 4874721 5188769 5484591 5736250
59773 5736250 5917404 6008044 6000201 5899279 5721203 5488184 5224425 4951584 4685313 4435101
59763 4435101 4206692 4003776 3827791 3677872 3552177 3448966 3366391 3302190 3254224 3220858
59753C220858k0318q865J607J1981K2503L3022M3804N5244O7145P9122R1387J04310
59741C701800J17612J30978J45028J60724J78073J96426K15878K37267K60820
59732E344606K85773L11370L37499L64305L91777M19502M46106M69092M85927
59723H855957M95061M95385M85394M64187M33278L96540L58397L22711K93015
59714A2599925K72337K62267K62621K72152K88992L10560L33738L55290L71851
59705A5329733L79869L76461L60393L31873K91746K41437J83349J20607N6592
59696A7672060m947o0001j05435j39691j61804j70469j65050j46849j18106q0121
59686A6519587l3554J9929P7924J39215K04009K72019L41520M10547M77767N41672
$$ plain form
59753 3220858 3200540 3191675 3193282 3205263 3227766 3260788 3304592 3359836 3426981 3506103 3597490 3701800
59741 3701800 3819412 3950390 4095418 4256142 4434215 4630641 4846519 5083786 5344606
59732 5344606 5630379 5941749 6279248 6643553 7035330 7454832 7900938 8370030 8855957
59723 8855957 9351018 9846403 10331797 10795984 11229262 11625802 11984199 12306910 12599925
59714 12599925 12872262 13134529 13397150 13669302 13958294 14268854 14602592 14957882 15329733
59705 15329733 15709602 16086063 16446456 16778329 17070075 17311512 17494861 17615468 17672060
59696 17672060 17667113 17607112 17501677 17361986 17200182 17029713 16864663 16717814 16599708 16519587
59686 16519587 16486033 16505962 16583886 16723101 16927110 17199129 17540649 17951196 18428963 18970635
59676A8970635N99907O49683O87955P10624P12275O87227O30741N39772M14133
59667B4602952K57856P9153j11096l00660m76704o27406p44475q24388q67379
59658B0987853q76100q55279q11486p52184o85008o18209n61162n23488n12438
59649A4792499n29632n69025o18158o62874o92616p02795o93867o69286o33760
59640I020486n91746n46532n00502m55708m13598l74437l37781l03537k72049
59631E224596k43473k17734j94881j74749j56533j39506j23835j09899r7152q4677
59621C682157p2606o1812n2394m3755l6143l0686k7699k6242k5759k6919l0246
59610C247896l5083m0584m6701n3382n9543o3840o6053o6944o7042o6183o4095
$$ plain form
59676 18970635 19570542 20220225 20908180 21618804 22331079 23018306 23649047 24188819 24602952
59667 24602952 24860808 24939961 24828865 24528205 24051501 23424095 22679620 21855232 20987853
59658 20987853 20111753 19256474 18444988 17692804 17007796 16389587 15828425 15304937 14792499
59649 14792499 14262867 13693842 13075684 12412810 11720194 11017399 10323532 9654246 9020486
59640 9020486 8428740 7882208 7381706 6925998 6512400 6137963 5800182 5496645 5224596
59631 5224596 4981123 4763389 4568508 4393759 4237226 4097720 3973885 3863986 3766834 3682157
59621 3682157 3609551 3547739 3495345 3451590 3415447 3384761 3357062 3330820 3305061 3278142 3247896
59610 3247896 3212813 3172229 3125528 3072146 3012603 2948763 2882710 2815766 2748724 2682541 2618446
59599B618446o0889n7022n2926m8576m3482l7383l0946k5247k0524j5956j0832
59588B214663n458o07L480P207J0956J4579J7518J9368K0316K0805K0834K0049
59576B363710J8696J7831J8134J9138K0312K2185K5492K9785L4023L8254M3501
59565B651061N0081N7260O4593P2435Q1008Q9997R9406J09747J21007J32333J43135
59554C672063J53789J64805J75841J85847J93722J98706K00655J99984J96854
59545E342266J90734J81464J70316J58574J44946J25940R9678O8559L7604J0771
59535F530852j0777k7895m2070n4407o5016p3109p7794p8661p5589o8347n6664
59524E900523m0445j9949M093L0679N9117Q9095J19677J48589J73025J90972K01159
$$ plain form
59599 2618446 2557557 2500535 2447609 2399033 2355551 2318168 2287222 2261975 2241451 2225495 2214663
59588 2214663 2209205 2208598 2212078 2219285 2230241 2244820 2262338 2281706 2302022 2322827 2343661 2363710
59576 2363710 2382406 2400237 2418371 2437509 2457821 2480006 2505498 2535283 2569306 2607560 2651061
59565 2651061 2701142 2758402 2822995 2895430 2976438 3066435 3165841 3275588 3396595 3528928 3672063
59554 3672063 3825852 3990657 4166498 4352345 4546067 4744773 4945428 5145412 5342266
59545 5342266 5533000 5714464 5884780 6043354 6188300 6314240 6413918 6482477 6520081 6530852
59535 6530852 6520075 6492180 6450110 6395703 6330687 6257578 6179784 6101123 6025534 5957187 5900523
59524 5900523 5860078 5840129 5844222 5874901 5934018 6023113 6142790 6291379 6464404 6655376 6856535
59513F856535K02111J92213J70701J38059R5588M5250j0309o8280j26101j80864
59503G314903k28930k67194k94508l11162l17505l14107l02730k85688k64464
59494D728615k40045k14279j89304j65692j42597j19760r7989p7657n8287l9799
59484C383206k2646o451J0016K7067M3674N9158P3974Q8477J02314J15498J28571
59473D002858J41217J51996J60021J65462J67903J65665J57506J43583J24107
59464E380318R8605O7414L2511m205m2089q0166j15729j45906j69803j87951k00629
59453D632370k07881k10446k09366k05173j98196j89105j78437j66350j53574
59444B913842j41566j30885j20407j09072r7547q7176p8184p0025o2607n6012
$$ plain form
59513 6856535 7058646 7250859 7421560 7559619 7655207 7700457 7690148 7621868 7495767 7314903
59503 7314903 7085973 6818779 6524271 6213109 5895604 5581497 5278767 4993079 4728615
59494 4728615 4488570 4274291 4084987 3919295 3776698 3656938 3558949 3481292 3423005 3383206
59484 3383206 3360560 3354109 3364125 3391192 3434866 3494024 3567998 3656475 3758789 3874287 4002858
59473 4002858 4144075 4296071 4456092 4621554 4789457 4955122 5112628 5256211 5380318
59464 5380318 5478923 5546337 5578848 5574643 5532554 5452388 5336659 5190753 5020950 4832999 4632370
59453 4632370 4424489 4214043 4004677 3799504 3601308 3412203 3233766 3067416 2913842
59444 2913842 2772276 2641391 2520984 2411912 2314365 2227189 2149005 2078980 2016373 1960361
59434A960361m9676m3043l6547l0929k6098k1517j7087j2850q557m387j178R93
59422A709485L451O972J0393J2714J5333J9918K4555K4591J7891P577j058m968
59410A846854m329q08M029R526J6393K5879L7555M8070N2911M9881M0837L0135
59398B156933K1598J6887J6223J9668K7096L7362M8598N9661P0712Q2257R4347
59387B651342J07040J20828J36001J52218J69221J87540K07894K30428K55000
59378D217512K81727L10651L41129L72108M02546M31025M55296M72724M81089
59369G765807M78959M65944M43175M13184L78797L42339L05853K71344K40166
59360A1105568K12543J87976J65553J43594J19629R1448N7799J7865k9299q4119
$$ plain form
59434 1960361 1910685 1867642 1831095 1800166 1774068 1752551 1735464 1722614 1714057 1709670 1708492 1709485
59422 1709485 1712936 1719908 1730301 1743015 1758348 1778266 1802821 1827412 1845303 1852880 1851822 1846854
59410 1846854 1842525 1841717 1845746 1855272 1871665 1897544 1935099 1983169 2036080 2085961 2126798 2156933
59398 2156933 2178531 2195418 2211641 2231309 2258405 2295767 2344365 2404026 2474738 2556995 2651342
59387 2651342 2758382 2879210 3015211 3167429 3336650 3524190 3732084 3962512 4217512
59378 4217512 4499239 4809890 5151019 5523127 5925673 6356698 6811994 7284718 7765807
59369 7765807 8244766 8710710 9153885 9567069 9945866 10288205 10594058 10865402 11105568
59360 11105568 11318111 11506087 11671640 11815234 11934863 12026311 12084110 12101975 12072676 11988557
59350A1988557j45564k11104k77244l39942l95229m40080m72709m92291m99170
59341H715224m95231m83079m64467m40190m11447l80275l48414l16773k86198
59332E089150k57536k30625k04547j79447j56819j37396j19999j03268q7275p2542
59322C539696n8819m5897l4541k5340j7561j0268l734J341N115P994R572R364
59310C376922P935O051L428n50n432j0216j4741j9327k3480k6206k7274k7253
59298C239857k6440k4633k1666j7459j1913n278J888R619J8646K9115M0184N1337
59286C283257O2726P3272Q0132Q1789Q0631Q0668Q3342Q7110R0297R2333R2592
59275D188149R0045Q4377P6027O5109N1415L5480J8509J371j5313l0445m3057
$$ plain form
59350 11988557 11842993 11631889 11354645 11014703 10619474 10179394 9706685 9214394 8715224
59341 8715224 8219993 7736914 7272447 6832257 6420810 6040535 5692121 5375348 5089150
59332 5089150 4831614 4600989 4396442 4216995 4060176 3922780 3802781 3699513 3612238 3539696
59322 3539696 3480877 3434980 3400439 3375099 3357538 3347270 3343536 3344877 3349992 3357986 3367558 3376922
59310 3376922 3384857 3390908 3394336 3393786 3388354 3378138 3363397 3344070 3320590 3294384 3267110 3239857
59298 3239857 3213417 3188784 3167118 3149659 3137746 3132468 3134356 3143975 3162621 3191736 3231920 3283257
59286 3283257 3345983 3419255 3499387 3581176 3661807 3742475 3825817 3912927 4003224 4095557 4188149
59275 4188149 4278194 4362571 4438598 4503707 4555122 4590602 4609111 4610482 4595169 4564724 4521667
59264D521667n3442o2497p0112p5482p8775q1190q3328q4809q5547q6159q6836
59253C673490q6883q5740q3727q1541p9509p7448p4812p1102o6451o1521n6495
59242B848261n0799m4176l7236l0287k2607j3692m297M871J4588K5981L8782N1991
59230B781380O5598Q0276R6021J12522J30391J50566J72840J96270K20546K45512
59220D251922K69838K91563L09584L23051L29779L26775L12234K85687K46823
59211F947256J95909J35140O7931k962p5178j45051k08126k61388l03504l33134
59201F016893l49156l52630l46529l33123l13308k88717k62394k36584k11538
59192C322914j87261j64916j45504j28610j13388r9789q7941p7290o7297n8232
$$ plain form
59264 4521667 4468225 4405728 4335616 4260134 4181359 4100169 4016841 3932032 3846485 3760326 3673490
59253 3673490 3586607 3500867 3417140 3335599 3256090 3178642 3103830 3032728 2966277 2904756 2848261
59242 2848261 2797462 2753286 2716050 2685763 2663156 2649464 2645167 2650038 2664626 2690607 2729389 2781380
59230 2781380 2846978 2927254 3023275 3135797 3266188 3416754 3589594 3785864 4006410 4251922
59220 4251922 4521760 4813323 5122907 5445958 5775737 6102512 6414746 6700433 6947256
59211 6947256 7143165 7278305 7346236 7343274 7268096 7123045 6914919 6653531 6350027 6016893
59201 6016893 5667737 5315107 4968578 4635455 4322147 4033430 3771036 3534452 3322914
59192 3322914 3135653 2970737 2825233 2696623 2583235 2483446 2395505 2318215 2250918 2192686
59182B192686n0491m3680l7078l0627k4909k0314j6512j2632q058l208Q11L641
59170A949629O240R530J3227J6776K0496K4697K8450L0768L2359L4665L7560L9556
59158B243953L9972L9313L7761L5048L1672K8482K4999J9912J3346O890J273m314
59146B518307j0234j5638k0118k4380k8566l1467l2231l1534l0358k8764k6507
59135B238510k3705k0269j5757j0404n288r16L432Q525J4231K0103K6058L2137
59123B266657L8374M5088N2476N9946O6732P3073P9674Q6226R1738R6149J00199
59112C056332J03805J06149J07409J08655J09896J09964J08687J07411J06963
59103D025271J06809J06729J07470J09016J09832J08641J05283R9084Q8025P0830
$$ plain form
59182 2192686 2142195 2098515 2061437 2030810 2005901 1985587 1969075 1956443 1948385 1945177 1945988 1949629
59170 1949629 1955869 1965399 1978626 1995402 2015898 2040595 2069045 2099813 2132172 2166837 2204397 2243953
59158 2243953 2283925 2323238 2360999 2396047 2427719 2456201 2481200 2501112 2514458 2521348 2522621 2518307
59146 2518307 2508073 2492435 2472317 2447937 2419371 2387904 2355673 2324139 2293781 2265017 2238510
59135 2238510 2214805 2194536 2178779 2168375 2163087 2162171 2165603 2174128 2188359 2208462 2234520 2266657
59123 2266657 2305031 2350119 2402595 2462541 2529273 2602346 2682020 2768246 2859984 2956133 3056332
59112 3056332 3160137 3266286 3373695 3482350 3592246 3702210 3810897 3918308 4025271
59103 4025271 4132080 4238809 4346279 4455295 4565127 4673768 4779051 4878135 4966160 5036990
59093E036990M8506K2711o105l7869p1202j03786j33649j59257j79295j93338
59083D223706k02120k06472k06565k02635j95585j86316j75337j63415j51670
59074B533591j40557j29618j18676j08299r8781q9738q1125p3567o7215o1353
59064A564662n5577n0267m5575m1146l7202l4587l3144l1392k8453k5148k2536
59053A159635k0552j8670j6769j4721j2237r742q264p916p556o488n258m357l429
59040A023676k372j847k002j897q90O27K407M883P935J0470J2050J3514J5272
59027A081826J6320J5765J3983J1487Q149M445J922J250J163M78j08N37K075L520
59013A162812M896O647Q386R459J0023J0368R935Q047M963J285k863p238j0945
$$ plain form
59093 5036990 5085496 5108207 5102102 5064233 4993031 4889245 4755596 4596339 4417044 4223706
59083 4223706 4021586 3815114 3608549 3405914 3210329 3024013 2848676 2685261 2533591
59074 2533591 2393034 2263416 2144740 2036441 1937660 1847922 1766797 1693230 1626015 1564662
59064 1564662 1509085 1458818 1413243 1372097 1334895 1300308 1267164 1235772 1207319 1182171 1159635
59053 1159635 1139083 1120413 1103644 1088923 1076686 1066944 1058680 1050764 1043208 1036720 1031462 1027105 1023676
59040 1023676 1021304 1019457 1017455 1015558 1014668 1015295 1017702 1022585 1030520 1040990 1053040 1066554 1081826
59027 1081826 1098146 1113911 1127894 1139381 1147530 1151975 1153897 1155147 1156310 1156788 1156680 1157217 1159292 1162812
59013 1162812 1167708 1174355 1182741 1192200 1202223 1212591 1222526 1230573 1235536 1236821 1233958 1226720 1215775
59000A215775j3438j5247j6917j8066j8316j8180j8086j7494j5898j3851j2072
58989A038210j0379q439o662n476m483l202j869p50M93J992L188L881M778O257
58975A017539P530P868P754P987Q577R283J0254J1455J2336J2773J3399J4453
58963A141208J5383J6022J6901J7904J8045J7269J6904J7587J8290J8270J8301
58952A332084J8964J9436J9276J9726K1824K4626K6783K8541L0687L2839L4345
58941A609131L5794L8059M0907M3905M7595N2314N6994O0669O4149O8699P4021
58930B192237P9145Q4322R0495R7611J05090J13222J22751J33603J45265J57780
58920C321521J71264J85288J99870K16112K34751K54932K75532K96693L18930
$$ plain form
59000 1215775 1202337 1187090 1170173 1152107 1133791 1115611 1097525 1080031 1064133 1050282 1038210
58989 1038210 1027831 1019392 1012730 1007254 1002771 999569 997700 996950 997443 999435 1002623 1006504 1011282 1017539
58975 1017539 1025069 1032937 1040691 1048678 1057255 1066538 1076792 1088247 1100583 1113356 1126755 1141208
58963 1141208 1156591 1172613 1189514 1207418 1225463 1242732 1259636 1277223 1295513 1313783 1332084
58952 1332084 1351048 1370484 1389760 1409486 1431310 1455936 1482719 1511260 1541947 1574786 1609131
58941 1609131 1644925 1682984 1723891 1767796 1815391 1867705 1924699 1985368 2049517 2118216 2192237
58930 2192237 2271382 2355704 2446199 2543810 2648900 2762122 2884873 3018476 3163741 3321521
58920 3321521 3492785 3678073 3877943 4094055 4328806 4583738 4859270 5155963 5474893
58911E474893L41866L65011L88707M13006M36652M58262M77237M92310N00589
58902I348533M99537M88585M67316M33577L85299L23108K49445J66335P5959j7658
58892A2420036j09616j96296k75064l42932l97481m38412m66667m82752m87383
58883I223433m82738m71283m54173m32289m07787l82864l57987l33018l08996
58874E592298k87055k66728k47180k29097k13344j98926j84366j70134j57543
58865C637925j46217j34938j24060j14695j06309r7519q8691q1258p4931o8100
58855B601207o0659n4027m8471m2781l6581l0809k5771k0695j5357j0358n806
58844B249892j244L217P235J1334J6062K0617K4007K7048L1260L6455M1316M5848
$$ plain form
58911 5474893 5816759 6181770 6570477 6983483 7420135 7878397 8355634 8847944 9348533
58902 9348533 9848070 10336655 10803971 11237548 11622847 11945955 12195400 12361735 12437694 12420036
58892 12420036 12310420 12114124 11839060 11496128 11098647 10660235 10193568 9710816 9223433
58883 9223433 8740695 8269412 7815239 7382950 6975163 6592299 6234312 5901294 5592298
58874 5592298 5305243 5038515 4791335 4562238 4348894 4149968 3965602 3795468 3637925
58865 3637925 3491708 3356770 3232710 3118015 3011706 2914187 2825496 2744238 2669307 2601207
58855 2601207 2540548 2486521 2438050 2395269 2358688 2327879 2302108 2281413 2266056 2255698 2249892
58844 2249892 2248648 2251865 2259100 2270434 2286496 2307113 2331120 2358168 2389428 2425883 2467199 2513047
58832B513047N1106N6980O2486O7933P4619Q2556R0552R8446J07162J16749J26443
58821C448079J36597J48496J62319J77171J93044K10706K29874K49545K69988
58812E225819K92356L16416L40737L65032L90073M15238M38227M57456M72578
58803H713932M82478M84634M76798M57625M25572L79056L18079K44282J59628
58794A2142084O6756k9736j24284k12868k92970l61754m16466m56606m83574m98273
58784I332309n01089m94021m80350m61957m38985m12412l84804l58211l33168
58775E467312l10019k89332k70786k53363k36785k21275k06198j90850j76224
58766C312480j63838j53039j41755j29777j18891j09821j01495r3496q6657q0881
$$ plain form
58832 2513047 2564153 2621133 2683619 2751552 2826171 2908727 2999279 3097725 3204887 3321636 3448079
58821 3448079 3584676 3733172 3895491 4072662 4265706 4476412 4706286 4955831 5225819
58812 5225819 5518175 5834591 6175328 6540360 6930433 7345671 7783898 8241354 8713932
58803 8713932 9196410 9681044 10157842 10615467 11041039 11420095 11738174 11982456 12142084
58794 12142084 12208840 12179104 12054820 11841952 11548982 11187228 10770762 10314156 9830582 9332309
58784 9332309 8831220 8337199 7856849 7394892 6955907 6543495 6158691 5800480 5467312
58775 5467312 5157293 4867961 4597175 4343812 4107027 3885752 3679554 3488704 3312480
58766 3312480 3148642 2995603 2853848 2724071 2605180 2495359 2393864 2300368 2213711 2132830
58756B132830p4810o8132o1981n6628n1047m5183m0371l6993l3872l0562k8023
58745A605228k6448k4602k2034j9915j8952j8408j7768j7568j7951j8213j8318
58734A385051j9049k0242k0669k0124j9842k0324k0637k0198j9601j9322j9271
58723A165772j9718k0929k1929k1561k0656k1023k2403k2779k1693k0695k0340
58712I32046j9427j7665j6429j6169j5531j3837j2215j1408j0698r695r213r598
58700G70161j0143j0572j1336j2057j1779j0911j0785j1198j0676r250q394q124
58688F44936o932m855l679l624k811o58J188K002L095M950O231O616P670R697
58674F63826J0669R468P518O012M335K415J751K677L355K816K284K147O02l087
$$ plain form
58756 2132830 2058020 1989888 1927907 1871279 1820232 1775049 1734678 1697685 1663813 1633251 1605228
58745 1605228 1578780 1554178 1532144 1512229 1493277 1474869 1457101 1439533 1421582 1403369 1385051
58734 1385051 1366002 1345760 1325091 1304967 1285125 1264801 1244164 1223966 1204365 1185043 1165772
58723 1165772 1146054 1125125 1103196 1081635 1060979 1039956 1017553 994774 973081 952386 932046
58712 932046 912619 894954 878525 862356 846825 832988 820773 809365 798667 788972 779759 770161
58700 770161 760018 749446 738110 726053 714274 703363 692578 681380 670704 661454 653060 644936
58688 644936 638004 633149 629470 625846 623035 622377 623565 625567 628662 633612 639843 646459 654129 663826
58674 663826 674495 683963 691481 697493 701828 704243 705994 708671 712026 714842 717126 719273 719875 716788
58660G16788o773q654r648j0802j1097r799q421q243q101o631m600l100j503Q47
58646F20263K911L743M165N037N793O137P147R099J0416J0342J0517J2194J4132
58633G21896J5035J5913J8061K0707K2615K4215K6327K8554L0592L3396L7417
58622I94728M1492M5041M9377N5400O1965O8043P4441Q1824Q9186R5919J03280
58611A760696J12020J20725J28131J34921J41396J45604J45678J41962J34891
58602B966024J22789J03951P9202N0629J9560j2553m3157p0292r3653j12740j26032
58591B883728j33357j36732j37431j34616j28305j20887j13891j06050r6505q7037
58581A688917p8957p0655o0878n1638m5155m0305l5043l0028k6917k5050k2823
$$ plain form
58660 716788 710015 701361 691713 680911 669814 660015 651594 643351 635250 628619 624019 620919 619416 620263
58646 620263 623174 626917 631082 636119 641912 648049 655196 664295 674711 685053 695570 707764 721896
58633 721896 736931 752844 770905 791612 814227 838442 864769 893323 923915 957311 994728
58622 994728 1036220 1081261 1130638 1186038 1248003 1316046 1390487 1472311 1561497 1657416 1760696
58611 1760696 1872716 1993441 2121572 2256493 2397889 2543493 2689171 2831133 2966024
58602 2966024 3088813 3192764 3271966 3322595 3342155 3329602 3286445 3216153 3122500 3009760 2883728
58591 2883728 2750371 2613639 2476208 2341592 2213287 2092400 1978509 1872459 1775954 1688917
58581 1688917 1609960 1539305 1478427 1426789 1381634 1341329 1306286 1276258 1249341 1224291 1201468
58570A201468k0522j9074j7663j5272j2927j1866j1155r588q275q805j0515j2048
58558A043758j3876j6871j9952k1608k2211k2648k2350k0840j9441j9133j8673
58547H26155j6912j4996j4047j2924j0715r097r510j0176q851o448n074m463l411
58534F99531k760l833n511n949n758o562p889q271p963p972p901p294p390q935
58520F05543j0063r027p170o511o358n181l805l631l580k059j96P7m48J51J378
58505E49120J560J182J843L116L449K955K625K162J181R76K465M074M222L995
58491E84925M748N194L847K114J928K393J930J574K802M197L751K495K474L037
58477F27409K531J656J763J860O29p75j226k437n687q456q196o889p574r100q765
$$ plain form
58570 1201468 1180946 1161872 1144209 1128937 1116010 1104144 1092989 1083401 1075126 1066321 1055806 1043758
58558 1043758 1029882 1013011 993059 971451 949240 926592 904242 883402 863961 844828 826155
58547 826155 809243 794247 780200 767276 756561 747464 737954 727778 718927 712479 707405 702942 699531
58534 699531 696771 692938 687427 681478 675720 669158 661269 652998 645035 637063 629162 621868 614478 605543
58520 605543 595480 586453 579283 572772 566414 561233 557428 553797 550217 548158 547962 548039 547591 547742 549120
58505 549120 550680 551862 553705 556821 560270 563225 565850 568012 569193 570169 572634 576708 580930 584925
58491 584925 589673 594867 598714 600828 602756 605149 607079 608653 611455 615652 619403 621898 624372 627409
58477 627409 629940 631596 633359 635219 635848 635073 633847 631410 625723 617267 609071 602182 594608 585508 576743
58462E76743p620q200r255p877n030l795l787k414k03K86l81M27K284K632J875
58447E35685K556M362M817M179M836O529O930O245O640P810P686O743O960P411
58433F19389N576K262M60P0j443l870m606l557k953k842j435O87J386J311K767
58418F13202N018N506M907O048Q532R416Q645Q773R903R853Q857Q938R255P145
58404G23998L399J368J139k88l387n624o279o908p364o203m440m205m471k967
58390F77768j137j928l875l090o4J381R47J510K807J909m12k38K639M527M454
58375F87198M908O120N825M616N433P675P918O350O372Q054Q239P005P505R441
58361G82659R328P207O645P953Q018O811P345R258R270P915Q762J1065J0477P151
$$ plain form
58462 576743 569123 560923 551668 543791 538761 534966 531179 528765 528562 528848 528467 528894 531178 533810 535685
58447 535685 538241 542603 547420 551599 556435 562964 569894 576139 582779 590589 598275 605018 611978 619389
58433 619389 624965 627227 627687 627757 626314 622444 617838 614281 611328 608486 607051 607738 609124 610435 613202
58418 613202 618220 623726 628633 634681 643213 652629 661274 670047 679950 689803 698660 707598 716853 723998
58404 723998 727397 728765 729904 729616 726229 720605 714326 707418 700054 693851 689411 685206 680735 677768
58390 677768 676631 674703 670828 667738 667674 669055 670002 671512 674319 676228 675816 675578 678217 682744 687198
58375 687198 692106 698226 704051 708667 714100 721775 729693 736043 742415 750469 758708 765713 773218 782659
58361 782659 791987 799194 805839 813792 821810 828621 835966 845224 854494 862409 871171 882236 892713 899864
58347H99864N603O285N067J515j08J073J266l32k29K045K928K091L113O110P271
58332I43562O476P627J0676J1414R924J0825J4290J5395J3465J3300J5830J6464
58320A089248J4258J3722J5780J5975J3533J3116J5504J5619J2023R411R474Q355
58308A246018N321M707P063P629N754O340R872J0911Q770R384J4061J6787J5593
58295A368210J5895J9451K0803J8217J7371K0374K1854J9818J9668K3404K5607
58284A590672K4217K4465K8104K9749K8096K9403L5461L9548L8838L9280M3494
58273A951327M5694M3451M2570M5244M5482M1361L9451M1955M2168L8013L6999
58262B413715M2046M5730M4552M5373N1525N6266N6492N8963O6333P1158P0539
$$ plain form
58347 899864 905467 911752 916819 918334 918226 919299 920565 920233 920004 922049 924977 927068 930181 936291 943562
58332 943562 950038 957665 968341 979755 989679 1000504 1014794 1030189 1043654 1056954 1072784 1089248
58320 1089248 1103506 1117228 1133008 1148983 1162516 1175632 1191136 1206755 1218778 1228189 1237663 1246018
58308 1246018 1251339 1256046 1263109 1270738 1276492 1282832 1292704 1303615 1312385 1321769 1335830 1352617 1368210
58295 1368210 1384105 1403556 1424359 1442576 1459947 1480321 1502175 1521993 1541661 1565065 1590672
58284 1590672 1614889 1639354 1667458 1697207 1725303 1754706 1790167 1829715 1868553 1907833 1951327
58273 1951327 1997021 2040472 2083042 2128286 2173768 2215129 2254580 2296535 2338703 2376716 2413715
58262 2413715 2455761 2501491 2546043 2591416 2642941 2699207 2755699 2814662 2880995 2952153 3022692
58251C022692P2250P9528Q4671Q4646Q7603R6681J03349J04239J08137J18528
58241C962324J26342J28082J33332J45767J55252J57750J63966J78734J91726
58232E343275J98536K10244K31439K50257K61603K77970L05164L30413L47459
58223G756360L69418M03240M36420M63338M98657N49449O01320O48077P06414
58214A2432693P84483Q66624R47370J048055J180551J329356J490509J691179
58206B1770820J948943K252471K606485L050188L602489M236826M941268N751841
58198E0161331O694046P752471Q939889J0335203J2014629J4022171J6452166
58191A26371906J9463361K3143758K7430312L2097513L6446885L8752267L6430832
$$ plain form
58251 3022692 3094942 3174470 3259141 3343787 3431390 3528071 3631420 3735659 3843796 3962324
58241 3962324 4088666 4216748 4350080 4495847 4651099 4808849 4972815 5151549 5343275
58232 5343275 5541811 5752055 5983494 6233751 6495354 6773324 7078488 7408901 7756360
58223 7756360 8125778 8529018 8965438 9428776 9927433 10476882 11078202 11726279 12432693
58214 12432693 13217176 14083800 15031170 16079225 17259776 18589132 20079641 21770820
58206 21770820 23719763 25972234 28578719 31628907 35231396 39468222 44409490 50161331
58198 50161331 56855377 64607848 73547737 83882940 95897569 109919740 126371906
58191 126371906 145835267 168979025 196409337 228506850 264953735 303706002 340136834
58184C40136834K7615801J3041099l788844j8603944k8712121l3728528l4702949
58177B61257348l3011408k9835536k6037408k2124808j8322543j4724369j1382262
58170A05819014q374276n948636m538437m415251n284162o380346p037284p080582
58162E6760040o688671o064139n332428m603806l961181l406663k906159k465433
58154B1331560k108431j818918j562861j340759j167838j028769q97687p80164
58146A0626133o94105o29813n66210n07102m67010m39036m08163l79052l61447
58137F174195l44843l15531k82815k62024k46872k23723j98144j82631j71908
58128C945704j54452j35850j28079j27219j23004j18852j22059j25459j18845
$$ plain form
58184 340136834 367752635 380793734 377004890 358400946 329688825 295960297 261257348
58177 261257348 228245940 198410404 172372996 150248188 131925645 117201276 105819014
58170 105819014 97444738 91496102 86957665 82542414 77258252 70877906 63840622 56760040
58162 56760040 50071369 44007230 38674802 34070996 30109815 26703152 23796993 21331560
58154 21331560 19223129 17404211 15841350 14500591 13332753 12303984 11406297 10626133
58146 10626133 9932028 9302215 8736005 8228903 7761893 7322857 6914694 6535642 6174195
58137 6174195 5829352 5513821 5231006 4968982 4722110 4498387 4300243 4117612 3945704
58128 3945704 3791252 3655402 3527323 3400104 3277100 3158248 3036189 2910730 2791885
58119B791885j08043j03711j01594r2486q1378p8122p8554p2987o4633o2273o2888
58108A885216n8497n2264n1604n2808m8300m1844m1291m3195l9575l3194l1596
58097A391048l2523k9346k4726k5050k7307k4885k0621k1115k3851k2628j9970
58086A119026k1650k4619k2884j9789k2003k6642k6582k3522k3631k5145k2446
58075H60113j7819j7236j8677j6263j1939j1596j3530j1985q490q548j0621r311
58063G04098o159o513q802p509l908l535n673n479l812n108p999p742n531o009
58049F20319q016p108m674n274p373o004k408j797l718l599j838k322l909k301
58035E59978J306K146P17J157K649J054k465l136j532k380n525o412m648m022
$$ plain form
58119 2791885 2683842 2580131 2478537 2386051 2304673 2226551 2147997 2075010 2010377 1948104 1885216
58108 1885216 1826719 1774455 1722851 1670043 1621743 1579899 1538608 1495413 1455838 1422644 1391048
58097 1391048 1358525 1329179 1304453 1279403 1252096 1227211 1206590 1185475 1161624 1138996 1119026
58086 1119026 1097376 1072757 1049873 1030084 1008081 981439 954857 931335 907704 882559 860113
58075 860113 842294 825058 806381 790118 778179 766583 753053 741068 732578 724030 713409 704098
58063 704098 697939 691426 682624 675115 671207 667672 661999 656520 652708 647600 639601 631859 626328 620319
58049 620319 612303 605195 600521 595247 587874 581870 579462 577665 573947 570348 568510 566188 562279 559978
58035 559978 561284 563430 564147 565304 567953 569007 566542 563406 561874 559494 553969 547557 542909 538887
58021E38887m824l974k066k665n289o274n752o622p855o116k875k508m380m184
58007D73503k075j952l549k857P9J260L28P75K805L015J158M07R22j92k607k988
57991D68032j416j246k664k682j295j417k822k412m13j13j539j498K02N98m15
57976D48900l0J631J626J19K21J865J817m6m06J273J962Q01J5j13j690m359n414
57959D48172m954n586p046o520m239l282l761k855o16M0p45K79L179M321K827
57944D19214J858K657K762J163rM6m91j954k492k108k874m606m987m188m681o382
57928C92928o871o398p516r675r609p314o152o615n657k845j434k288k343l69
57914C17842J120J011J490L364M483M197M598O090O448N370N215O075N120J983
$$ plain form
58021 538887 534063 530089 528023 525358 520069 513795 508043 501421 493566 487450 484575 482067 477687 473503
58007 473503 471428 469476 465927 463070 463149 464409 464737 465512 468317 471332 472490 472897 473819 473627 471020 468032
57991 468032 466616 465370 462706 460024 458729 457312 454490 452078 451665 451552 450013 448515 448717 449315 448900
57976 448900 448870 450501 452127 452246 452467 454332 456149 456103 455697 456970 458932 459733 459748 459635 457945 453586 448172
57959 448172 443218 437632 430586 424066 419827 416545 412784 409929 409313 409353 408608 408887 412066 416387 419214
57944 419214 421072 423729 426491 427654 427645 427691 427200 425246 422754 420646 417772 413166 408179 403991 399310 392928
57928 392928 386057 379659 372143 362468 352859 345545 339393 332778 327121 324276 322842 320554 318211 317842
57914 317842 318962 319973 321463 324827 329310 333507 338105 344195 350643 356013 361228 367303 372423 374406
57900C74406j65j20l02j685k154j261j484l200l533j912j679m165o234n756m789
57885C35967n036m946l586k896l625l398j228L77O9K66K568M712M743M327N311
57870C33625O571O843P207Q350Q636P217N876N697N129L252J625J057j0k030k884
57855C96161j860j464l226n161n554n704o739p221o193n210n109m198j883n91
57841C36048j637k606j429J63l0j066j259j323k389l561l936m551o024o862o304
57826B93234o100p359q337p612o595o648o576n327m284m444m117k006J61O44P03
57811B25337K014L629M240M978P068Q891Q138N178J822j282l815m423k634l23
57797B58818Q43J645L126M374M580N030O873Q850R432R154Q818P563M822K131
$$ plain form
57900 374406 374241 374121 373819 372134 369980 368719 367235 364035 360502 358590 356911 352746 346512 340756 335967
57885 335967 330931 325985 322399 319503 315878 312480 311252 311629 311698 311964 314532 319244 323987 328314 333625
57870 333625 340196 347039 354246 362596 371232 378449 384325 390022 395151 398403 400028 401085 401075 399045 396161
57855 396161 394301 392837 389611 384450 378896 373192 366453 359232 353039 347829 342720 338522 336639 336048
57841 336048 334411 331805 330376 330539 330509 329443 328184 326861 324472 320911 316975 312424 306400 299538 293234
57826 293234 287134 279775 271438 263826 257231 250583 244007 238680 234396 229952 225835 223829 223990 224634 225337
57811 225337 227351 230980 235220 240198 247266 256157 264295 269473 271295 270013 266198 261775 259141 258818
57797 258818 259661 261306 264432 268806 273386 278416 285289 294139 303571 312725 321543 329106 333928 336059
57783C36059P48m85k843n384o938q234j0000j1041j0387r275q920q409o909n657
57769B42325n596n300l540j666j125q83K61J046J31j029m30J195J946J886K124
57754B31345K374K002J855K780L802L930M061N026N671N081M600N343N776M338
57740B87984K458K195K857K711K192K513K894K111J258J931L119K937K125K732
57726C22017M488N505N681O423P747Q398Q310Q397Q583Q364Q482R742J1014J0817
57712D33968J0000J0515J2320J3882J4957J6469J8312J9599K0598K2349K4802
57701F17771K7194K9496L1835L3405L3837L4609L7295M1508M6357N2480O0588
57690A046375O9359P7179Q4791R3949J04449J14851J25031J35610J45765J53893
$$ plain form
57783 336059 336807 336322 333479 328095 321157 312923 302923 291882 281495 272220 263300 254891 247982 242325
57769 242325 236729 231429 227889 226223 225098 224215 224476 225522 225653 224624 224194 225389 227335 229221 231345
57754 231345 233719 235721 237576 240356 244158 248088 252149 257175 262846 267927 272527 277870 283646 287984
57740 287984 290442 292637 295494 298205 300397 302910 305804 307915 309173 311104 314223 317160 319285 322017
57726 322017 326505 332010 337691 344114 351861 360259 368569 376966 385549 393913 402395 412137 423151 433968
57712 433968 443968 454483 466803 480685 495642 512111 530423 550022 570620 592969 617771
57701 617771 644965 674461 706296 739701 773538 808147 845442 886950 933307 985787 1046375
57690 1046375 1115734 1192913 1277704 1371653 1476102 1590953 1715984 1851594 1997359 2151252
57680B151252J59605J62743J61442J53448J38736J18940R5256O9138M3847K2974
57670C277381Q053r74n233r609k3600n4587r9536j46044j81752k01177k04945
57659B357977j96563j80730j61851j42386j23272j05559r0251p7150o5465n5188
57649A159562m6445l8400l0437k3484j8463j4439j0077n740k146J681O886J2441
57637I90939J6791K0699K5874L1805L6740M0987M6457N3425O0444O7082P4238
57626A465481Q2049Q9886R7980J06766J15044J21004J24453J25783J23580J15758
57616B567784J02350Q4600O2152L4110K361k9111n7982q3851j05303j19964j27724
57605B329422j31050j31695j29551j24852j18854j12012j03883r5107q7207q0335
$$ plain form
57680 2151252 2310857 2473600 2635042 2788490 2927226 3046166 3141422 3210560 3254407 3277381
57670 3277381 3285434 3284460 3279227 3269618 3246018 3191431 3091895 2945851 2764099 2562922 2357977
57659 2357977 2161414 1980684 1818833 1676447 1553175 1447616 1357365 1280215 1214750 1159562
57649 1159562 1113117 1074717 1044280 1020796 1002333 987894 977817 972077 969931 971612 978498 990939
57637 990939 1007730 1028429 1054303 1086108 1122848 1163835 1210292 1263717 1324161 1391243 1465481
57626 1465481 1547530 1637416 1735396 1842162 1957206 2078210 2202663 2328446 2452026 2567784
57616 2567784 2670134 2754734 2816886 2850996 2853357 2824246 2766264 2682413 2577110 2457146 2329422
57605 2329422 2198372 2066677 1937126 1812274 1693420 1581408 1477525 1382418 1295211 1214876
57595A214876p3387o6415o0631n5987n1110m5757m1055l7263l3512k9821k7085
57584F92853k5041k2498j9613j7718j6830j5665j4019j2852j2076j0665q909q110
57572E08857q053p291n876n259n381m639k915j847j833j435k01O47Q31J581L019
57557D70205L645L238L585N465P410Q433R538J1517J3588J5172J6928J8955K0120
57544F07799K0283K1165K3920K7602L0969L4104L7403M0712M4294M9046N4952
57533I92249O0837O6222P1843P7943Q3720Q8848R3773R8158J00744J00841R8187
57522A933365R1418P9013O1881M2533K1526k460k8600n2862p2026q6178r6224
57511A891386j01741j02666j00749r7593r3124q7193q0807p4577o7847o0491n3749
$$ plain form
57595 1214876 1141489 1075074 1014443 958456 907346 861589 820534 783271 749759 719938 692853
57584 692853 667812 645314 625701 607983 591153 575488 561469 548617 536541 525876 516967 508857
57572 508857 500804 493513 487637 482378 476997 472358 469443 467596 465763 464328 464127 464774 465605 467186 470205
57557 470205 473850 477088 480673 486138 493548 501981 511519 523036 536624 551796 568724 587679 607799
57544 607799 628082 649247 673167 700769 731738 765842 803245 843957 888251 937297 992249
57533 992249 1053086 1119308 1191151 1269094 1352814 1441662 1535435 1633593 1734337 1835178 1933365
57522 1933365 2024783 2103796 2165677 2208210 2229736 2227276 2198676 2145814 2073788 1987610 1891386
57511 1891386 1789645 1686979 1586230 1488637 1395513 1308320 1227513 1152936 1085089 1024598 970849
57500I70849m8187m2803l7142l2279k8637k4889k0343j6289j3618j1162p791m354
57488F83355j923Q7K573N180P537J0455J4339J8000K0502K2800K6102L0046L3907
57475H72960L8247M3826N0027N5825O1243O6700P2042P7249Q2925Q8916R3604
57464A603564R5519R4528R0587Q2752P0376N3954L3927J0213j6028m1677o3851
57453B013864q1677r5157j03948j08278j09445j08209j04136r7498r0169q3468
57443A031879p6777o9423o2370n6655n1735m6692m1723l7239l2969k9032k6379
57432E00885k5002k3349k0691j8363j7355j6546j4821j3063j2351j1871j0529
57421C16944r048q523q276p124n638n143n476n521n046m449l582k479k190l324
$$ plain form
57500 970849 922662 879859 842717 810438 781801 756912 736569 720280 706662 695500 687709 683355
57488 683355 681432 681519 684092 689272 696809 707264 721603 739603 760105 782905 809007 839053 872960
57475 872960 911207 955033 1005060 1060885 1122128 1188828 1260870 1338119 1421044 1509960 1603564
57464 1603564 1699083 1793611 1884198 1966950 2037326 2091280 2125207 2135420 2119392 2077715 2013864
57453 2013864 1932187 1837030 1733082 1624804 1515359 1407150 1303014 1205516 1115347 1031879
57443 1031879 955102 885679 823309 766654 714919 668227 626504 589265 556296 527264 500885
57432 500885 475883 452534 431843 413480 396125 379579 364758 351695 339344 327473 316944
57421 316944 307896 299373 291097 283973 278335 273192 267716 262195 257149 252700 249118 246639 244449 241125
57407B41125m628m573l452k536k134j874j815j899j344K6R84O99P2l7l41j392
57391B16881j908p73P37Q43M6n2M05J71n96p72n06q59j688j935j541j239r60k41
57373B06013L69J33k98O7O07K5j292j806j260o55k59L83Q91M03o70j067o48l29
57355B00607k79M5L41k53j489k253k348k398k208r75R02J971J823J510J740K057
57339A98793J978J683J417J260J514K271K840K510J688J274J326J419J713K444
57325B24130K940K526J899K224L252L769L522L261L262L229L381M203N326N923
57311B72847N939N798N452M921N133O713Q589R338R339R962J1228J2082J2481
57298C79822J3297J4415J4911J4945J5610J6871J7553J7411J7430J7896J7820
$$ plain form
57407 241125 236497 231924 228472 225936 223802 221928 220113 218214 216870 216896 217880 218579 218651 218614 218273 216881
57391 216881 214973 214200 214937 215780 215826 215774 216179 216350 215754 214982 214476 213617 211929 209994 208453 207214 206254 206013
57373 206013 206382 206515 206217 206284 206891 206916 205624 203818 202558 201903 201644 202027 202918 203321 202651 201584 200936 200607
57355 200607 200328 200373 200714 200461 198972 196719 194371 191973 189765 188790 189692 191663 193486 194996 196736 198793
57339 198793 200771 202454 203871 205131 206645 208916 211756 214266 215954 217228 218554 219973 221686 224130
57325 224130 227070 229596 231495 233719 236971 240740 244262 247523 250785 254014 257395 261598 266924 272847
57311 272847 278786 284584 290036 294957 300090 306803 315392 324730 334069 344031 355259 367341 379822
57298 379822 393119 407534 422445 437390 453000 469871 487424 504835 522265 540161 557981
57287E57981J6557J4474J1877Q667N186J994j286n463j0162j4079j6868j9305
57275E49573k1585k2997k3337k3235k2904k1965k0593j9416j8291j6483j4092
57264C24675j1963j0272q531o899n973n470m645l845l978m568m143k643j563j568
57250B48614j748j561j613k092k182j703j637k353k821k314j541j313j299q72
57236B23565j37N06R20R62N08N1L35J199J770J830J940K169J950J341J180J772
57220B41861K523L018L282L027J916O61N11J504K459K844L265M037M643M846N000
57205B85397N110M799M326M339M627M481M179M622N555N779N179M834N031M958
57191C53216M472M421M916N125N000N355N975N592M142L160L383L968M478N552
$$ plain form
57287 557981 574538 589012 600889 609556 614742 616736 615450 609987 599825 585746 568878 549573
57275 549573 527988 504991 481654 458419 435515 413550 392957 373541 355250 338767 324675
57264 324675 312712 302440 293909 287010 281037 275567 270922 267077 263099 258531 254388 251745 250182 248614
57250 248614 246866 245305 243692 241600 239418 237715 236078 233725 230904 228590 227049 225736 224437 223565
57236 223565 223428 223934 224854 225816 226324 226375 226710 227909 229679 231509 233449 235618 237568 238909 240089 241861
57220 241861 244384 247402 250684 253711 255627 256288 256799 258303 260762 263606 266871 270908 275551 280397 285397
57205 285397 290507 295306 299632 303971 308598 313079 317258 321880 327435 333214 338393 343227 348258 353216
57191 353216 357688 362109 367025 372150 377150 382505 388480 394072 398214 401374 404757 408725 413203 418755
57177D18755O998P360O386N884P059Q855R944J0602J1471J2239J2696J3555J5031
57164E46835J6081J6147J6173J6935J7889J8596J9637K1115K1937K1767K1963
57153G55075K3295K4499K4463K4143K4796K5890K6430K6938K8346L0217L1753
57142A045845L3415L5812L8132L9432M0511M2744M5907M8837N1426N4262N7019
57131A533342N8961O0479O2475O4658O5959O6360O6921O8230O9976P1751P3290
57120B262402P4266P4750P5486P7019P9147Q1918Q6171R2278R9442J07215J16702
57109C226796J29190J44699J63066J85430K13361K47681K89560L41729M07208
57100E348720M87843N85487P03508Q45365J012475J204798J422245J663611J925121
$$ plain form
57177 418755 425753 433113 439499 445383 452442 461297 471241 481843 493314 505553 518249 531804 546835
57164 546835 562916 579063 595236 612171 630060 648656 668293 689408 711345 733112 755075
57153 755075 778370 802869 827332 851475 876271 902161 928591 955529 983875 1014092 1045845
57142 1045845 1079260 1115072 1153204 1192636 1233147 1275891 1321798 1370635 1422061 1476323 1533342
57131 1533342 1592303 1652782 1715257 1779915 1845874 1912234 1979155 2047385 2117361 2189112 2262402
57120 2262402 2336668 2411418 2486904 2563923 2643070 2724988 2811159 2903437 3002879 3110094 3226796
57109 3226796 3355986 3500685 3663751 3849181 4062542 4310223 4599783 4941512 5348720
57100 5348720 5836563 6422050 7125558 7970923 8983398 10188196 11610441 13274052 15199173
57091A5199173K201964K490048K783407L069557L328456L535197L663143L688358
57083C9959303L596592L386385L061495K619997K056234J378028O21320j54683
57075E6524671q88201j534304k072114k500932k831338l075735l241728l330572
57067C7049747l340511l272177l132606k935599k698767k439935k175121j917760
57059A5137271j677650j460194j267206j098804r54396q32477p30444o44974n72481
57050E898645n09685m54390m05519l62171l23116k87526k55435k26965k01793
57041B872045j79807j61295j45748j31647j18341j06986r8420r1272q3664p5706
57031A679159o8606o2271n5717m9117m3392l8210l2373k5852j9471j3044n816
$$ plain form
57091 15199173 17401137 19891185 22674592 25744149 29072605 32607802 36270945 39959303
57083 39959303 43555895 46942280 50003775 52623772 54680006 56058034 56679354 56524671
57075 56524671 55636470 54102166 52030052 49529120 46697782 43622047 40380319 37049747
57067 37049747 33709236 30437059 27304453 24368854 21670087 19230152 17055031 15137271
57059 15137271 13459621 11999427 10732221 9633417 8679021 7846544 7116100 6471126 5898645
57050 5898645 5388960 4934570 4529051 4166880 3843764 3556238 3300803 3073838 2872045
57041 2872045 2692238 2530943 2385195 2253548 2135207 2028221 1929801 1838529 1754865 1679159
57031 1679159 1610553 1548282 1492565 1443448 1400056 1361846 1329473 1303621 1284150 1271106 1265290
57020A265290J815R377J8529L1369M7248O4826Q6638J15249J42076J45742J08827
57009B036986L6580m4654j07865j42317j52765j48553j36558j21044j05058r0394
56999A024358p7550o6441n6958m8987m2413l7068l2458k7878k3151j8958j5866
56988E76630j3324j0215o386k826j76J999L916M325J695l545q998j2668j4428
56975E15999j4999j4551j2950j0582q073n647l329j371J29J565L254M888O202
56962D60535P679R972J3024J6386J9932K3282K4826K2418J5306M979n841j4684
56950E97814k0213k2505k2629k1590j9682j6971j3860j0749p667m709k354o73
56938D34212J208M070P527J0758J3870J7678K2337K6928K9888K9209K2975J1128
$$ plain form
57020 1265290 1267105 1276482 1295011 1326380 1373628 1438454 1525092 1640341 1782417 1928159 2036986
57009 2036986 2073566 2028912 1921047 1778730 1625965 1477412 1340854 1219810 1114752 1024358
56999 1024358 946808 880367 823409 774422 732009 694941 662483 634605 611454 592496 576630
56988 576630 563306 553091 546705 543879 543703 545702 549618 553943 555638 552093 543095 530427 515999
56975 515999 501000 486449 473499 462917 454844 449197 445868 444497 444626 446191 449445 454333 460535
56962 460535 468214 478186 491210 507596 527528 550810 575636 598054 613360 618339 612498 597814
56950 597814 577601 555096 532467 510877 491195 474224 460364 449615 441948 437239 434885 434212
56938 434212 435420 439490 447017 457775 471645 489323 511660 538588 568476 597685 620660 631788
56926F31788l445j6668k6136l1663l3690l2604k9467k5929k2902k0172j7420j4763
56914C56929j2272r928q117p276o956o162m776l675l265k833j750m87M5l87j194
56899B87896j582j089J00J300K079K727L688M840N894P112Q942J1226J3488J5551
56885C62172J7028J6684J3449P947K023l104p280j0274j1548j1164r800p761n035
56872C53337k304o18K13J670M598Q289J1814J5223J8909K2798K6792L1214L5960
56859E27895L9537L9481L3746K2007O330r428k1710k9189l2439l2274k9231k4426
56847D90299j9452j5005j0456n147O25O090J0863J5131J9649K5529L3357M2493
56835E93976N1849O0762O7930O9794O1931M2962J6411j1556l5476n2017o0153
$$ plain form
56926 631788 628343 611675 585539 553876 520186 487582 458115 432186 409284 389112 371692 356929
56914 356929 344657 334729 326612 319336 312380 306218 301442 297767 294502 291669 289919 289432 289477 289090 287896
56899 287896 286314 285225 285325 286625 288704 291431 295119 299959 305853 312965 321907 333133 346621 362172
56885 362172 379200 395884 409333 417280 419303 416199 408919 398645 387097 375933 366133 358372 353337
56872 353337 351033 350415 350628 352298 356896 365185 376999 392222 411131 433929 460721 491935 527895
56859 527895 567432 606913 640659 662666 668996 659568 637858 608669 576230 543956 514725 490299
56847 490299 470847 455842 445386 440239 440864 446954 457817 472948 492597 518126 551483 593976
56835 593976 645825 706587 774517 844311 906242 949204 965615 954059 918583 866566 806413
56824H06413o1151n7650n1836m4686l6867k9389k2845j6892j1026n248L74O150
56812D75347J2407J9159K6362L3929M1255M7033M9362M5684L3572J3253j0654
56801G86709l1476m5137n1804n3363n1063m5888l9379l2798k6394k0198j4646
56790C74563r941n670j645J850N048Q809J3295J7631K1379K4981K7902K7615K1768
56777E27585J0740k700j5476k5268l0653l1643k9823k7108k4450k2001j9836j7831
56765B91536j5552j2938j0673r251q210o859n260l951l101k538k174j975j775
56752B07279j431r30k96K54K33l84p51k35L87J8q82r37k61l52j467j977j039K2
56734A97251j11q22j007r08j203j521j194o04m96p42q97j178j838k319k019j305
$$ plain form
56824 806413 745262 687612 635776 591090 554223 524834 501989 485097 474071 468823 469197 475347
56812 475347 487754 506913 533275 567204 608459 655492 704854 750538 784110 797363 786709
56801 786709 755233 710096 658292 604929 553866 507978 468599 435801 409407 389209 374563
56790 374563 364622 358952 357307 359157 364205 373014 386309 403940 425319 450300 478202 505817 527585
56777 527585 538325 535625 520149 494881 464228 432585 402762 375654 351204 329203 309367 291536
56765 291536 275984 263046 252373 243122 234912 228053 222793 218842 215741 213203 211029 209054 207279
56752 207279 205848 204918 204622 204876 205109 204725 203974 203739 204126 204144 203262 202325 202064 201712 200245 198268 197229 197251
56734 197251 197140 196318 195311 194403 193200 191679 190485 189881 189385 188643 187746 186568 184730 182411 180392 179087
56718A79087q68p52p38r48j302j226n90j49k75k87L37J024J197J182J199O43o12
56701A76922j419r62j04L9j92Q5O44P19L55J7l27o53l72N17Q10p7q68k59J006
56682A75881J417J033Q75R42N81J06K19M31j73j056q51M03J365J443J195Q71J08
56665A84790r32j554j602j480j240p44l76n24o87k85J86k4m93l72J2k54r45j079
56647A72397o64n40p41n69j34l41j338k296k615k300j376q7O87M04j60m0L55J86
56629A60828q6M85J376J262K25m88o21r40j377j091k88o4l68l5J008J457Q07P4
56611A62164%J73K30M09N83K65k07kN81M35l06l48M45O64k04r03n51Rj44n93o13
56590A62087k86J19O57J033P00N4K41J275J859J490J225J690K001J494R57J160
$$ plain form
56718 179087 178219 177467 176729 175781 174479 173253 172663 172514 172239 171952 172289 173313 174510 175692 176891 177534 176922
56701 176922 175503 174541 174437 174476 174284 174369 175013 175732 176087 176104 175777 175124 174752 175269 176079 176002 175134 174875 175881
56682 175881 177298 178331 179206 180148 180729 180835 181054 181485 181312 180256 179405 179808 181173 182616 183811 184682 184790
56665 184790 183858 182304 180702 179222 177982 177238 176862 176338 175651 175366 175552 175528 175035 174663 174675 174421 173476 172397
56647 172397 171733 171193 170452 169883 169749 169408 168070 165774 163159 160859 159483 159396 160083 160487 160327 160287 160642 160828
56629 160828 160742 161227 162603 163865 164090 163602 162981 162041 160664 159573 159285 159221 158853 158818 159826 161283 162090 162164
56611 162164 162164 162337 162567 162976 163559 163824 163617 163615 164196 164631 164325 163977 164422 165086 164882 163979 163428 163437 163293 162700 162087
56590 162087 161801 161920 162577 163610 164310 164364 164605 165880 167739 169229 170454 172144 174145 175639 176596 177756
56574A77756J538J437J405K086K899K996K672K739L252L784M294M878N197M966
56560B21899M504M203L917L390K729K137J704J701K385L285L485K821J973J205
56546B61338L9j561k780l125l040l005k952k903l206l713l782l376l200l367l084
56531B18283k047j069q21j023j330j881k466k295j297n82r15j669j939j819j852
56516A95278k073k284k538k702k299j383q40j163j626j324n02k20r22j898k049
56501A71455j074P6K14m73m62R08K168J681L8r21p25k43L94J773L270L317J869
56484A83265O80O78R28P24P59J542K244K099J536J219J170J414K144K886K751
56469B06039J941J587J895K019J997K865M467N064L918K391J778J751J733J862
$$ plain form
56574 177756 179294 180731 182136 184222 187121 190117 192789 195528 198780 202564 206858 211736 216933 221899
56560 221899 226403 230606 234523 237913 240642 242779 244483 246184 248569 251854 255339 258160 260133 261338
56546 261338 261377 259816 257036 253911 250871 247866 244914 242011 238805 235092 231310 227934 224734 221367 218283
56531 218283 216236 215167 214346 213323 211993 210112 207646 205351 204054 203472 202557 200888 198949 197130 195278
56516 195278 193205 190921 188383 185681 183382 181999 181159 179996 178370 177046 176544 176324 175402 173504 171455
56501 171455 170381 170457 170671 170198 169736 170644 172812 174493 174531 173610 172885 172642 173036 174809 178079 181396 183265
56484 183265 183945 184623 185551 186275 187034 188576 190820 192919 194455 195674 196844 198258 200402 203288 206039
56469 206039 207980 209567 211462 213481 215478 218343 222810 227874 231792 234183 235961 237712 239445 241307
56455B41307J848P23j306k594k534k378k730k402r26j7r04k200k151j360j374
56440B21002k073k314k030j923j992j857j737j807j544p51j83k09j16L41K60n41
56424B02526o70N23J506R96J08L23R68O94O6N14J657J850P32n74j304j507j183
56407B07225m54l2l91r59j129j187j369j061jQ61Q14N67Q87J293J225J168J433
56390B08890J284M59O9O28Q83O9m28N60J679J176j52l33O79J479J747K118K396
56373B23203J908J067P82R76J171J625K431K555J398K46M66J408J705J481J527
56358B43949J575J168R78J476J622P21Q3R08K019J854J180J434J935J301L14N68
56342B63085J453J289N15Q64K100K444J725J406J944K567L256M479N520N359M699
$$ plain form
56455 241307 243155 243878 242572 239978 237444 235066 232336 229934 229008 228991 228087 225887 223736 222376 221002
56440 221002 218929 216615 214585 212662 210670 208813 207076 205269 203725 202974 202791 202582 202466 202807 203067 202526
56424 202526 201856 202379 203885 204881 204989 205312 206280 206974 207040 207554 209211 211061 211793 211219 209915 208408 207225
56407 207225 206771 206739 206348 205389 204260 203073 201704 200643 200642 201503 202317 202884 203771 205064 206289 207457 208890
56390 208890 210174 210633 210702 211330 212213 212282 211854 212414 214093 215269 215117 214784 215463 216942 218689 220807 223203
56373 223203 225111 226178 226960 227936 229107 230732 233163 235718 237116 237362 237828 239236 240941 242422 243949
56358 243949 245524 246692 247670 249146 250768 251489 251572 252480 254499 256353 257533 258967 260902 262203 262517 263085
56342 263085 264538 265827 266342 267206 269306 271750 273475 274881 276825 279392 282648 287127 292647 298006 302705
56327C02705M793N037M134K871L081M521N379N334N425N467M438K988K812L711
56313C62696L884K927K056J613Q67Jj44rn62j123l85Q91Q16m65j184r76q74q21
56295C69208%Q93N98%R22K681L093K434L077N276O792O789O804P590Q176Q439
56279D32772R522J1324J2490J3156J4750J6898J7715J7407J8430K1604K5158K8077
56267F39303L1313L5108L8321M1096M5231N1059N6799O1614O6561P1911P6385
56256A214701P9703Q3094Q6607Q8637Q8576Q7284Q4609P9298P1710O3642N5246
56245B083107M5148L3902K3950J5747P356j492q501j2789j6293k0280k3777k6502
56233B099576k9985l4650l8959m2672m7714n4664o1362o6157o9609p2048p2554
$$ plain form
56327 302705 307498 312535 316669 319540 322621 327142 332521 337855 343280 348747 353185 356173 358985 362696
56313 362696 366580 369507 371563 373176 374043 374044 373900 373891 373329 372206 371821 372712 373528 373063 371879 370903 370029 369208
56295 369208 369208 370101 370699 370699 371621 374302 377395 379829 382906 388182 394974 401763 408567 416157 424333 432772
56279 432772 442294 453618 466108 479264 494014 510912 528627 546034 564464 586068 611226 639303
56267 639303 670616 705724 744045 785141 830372 881431 938230 999844 1066405 1138316 1214701
56256 1214701 1294404 1377498 1464105 1552742 1641318 1728602 1813211 1892509 1964219 2027861 2083107
56245 2083107 2128255 2162157 2186107 2201854 2209210 2207718 2199217 2186428 2170135 2149855 2126078 2099576
56233 2099576 2069591 2034941 1995982 1953310 1905596 1850932 1789570 1723413 1653804 1581756 1509202
56222A509202p1359p0196o9355o7355o4222o1765n9923n6501n1341m6958m4051
56211H46176m0290l4904l0380k8026k5738k2051j8603j6688j4923j2420j0724
56200E91429j0521r819p534n598n470n684m831l850l428k408o02O5q83j097N67
56185E30336K061K104K460M242N527N026M611N756O914O803O971Q569R926R791
56171F11097R782J1116J2151J1627J1068J1486J1129Q975P192P431Q042P468P030
56158G35594P750P978P014P528J1337J6159J9407K2013K5594K9316L2580L7398
56146I59668M5004N3437O1486P1544Q5408J00850J15439J29977J44528J54648
56136A921989J55594J47387J32589J12790R0947P3309O4324O1983O1399N9884
$$ plain form
56222 1509202 1437843 1367647 1298292 1230937 1166715 1104950 1045027 988526 937185 890227 846176
56211 846176 805886 770982 740602 712576 686838 664787 646184 629496 614573 602153 591429
56200 591429 580908 571089 563555 557957 552487 546803 541972 538122 534694 532286 531684 531749 530866 529769 530336
56185 530336 532397 534501 536961 541203 546730 551756 556367 562123 569037 575840 582811 591380 601306 611097
56171 611097 620879 631995 644146 655773 666841 678327 689456 698431 705623 713054 721096 728564 735594
56158 735594 743344 751322 758336 765864 777201 793360 812767 834780 860374 889690 922270 959668
56146 959668 1004672 1058109 1119595 1191139 1276547 1377397 1492836 1622813 1767341 1921989
56136 1921989 2077583 2224970 2357559 2470349 2561296 2634605 2698929 2760912 2822311 2882195
56126B882195N5279M3740K4141J800j6611k9565l8788m4589m7647n2401o3565
56115B713989q0887j00736j20343j37047j46587j46603j39705j29641j16964j01517
56105A493959q5843p2324o0034m7876l7614l0423k4121j7453j3082j2544j2497
56094A080148j0184q214r342j0903r610p537p918q901p246m474l716l776k000
56081I86327K12L54J6J704L750L759L725O211Q893Q596P314Q483J0675J0799J0119
56066A070937J1303J2861J2348J1592J3055J4678J3967J3294J5265J7181J6153
56055A222634J5121J7363J9796J8578J6562J7862J9946J8743J6881J8743K1933
56044A424162K1970K0945K3050K5905K5239K3801K6599L1357L2860L2682L5360
$$ plain form
56126 2882195 2937474 2981214 3005355 3007155 2990544 2960979 2922191 2877602 2829955 2777554 2713989
56115 2713989 2633102 2532366 2412023 2274976 2128389 1981786 1842081 1712440 1595476 1493959
56105 1493959 1408116 1335792 1275758 1227882 1190268 1159845 1135724 1118271 1105189 1092645 1080148
56094 1080148 1069964 1061750 1052408 1041505 1031895 1024358 1016440 1007539 1000293 995819 992103 988327 986327
56081 986327 986539 986893 986909 988613 992363 996122 999847 1006058 1014951 1023547 1030861 1039344 1050019 1060818 1070937
56066 1070937 1082240 1095101 1107449 1119041 1132096 1146774 1160741 1174035 1189300 1206481 1222634
56055 1222634 1237755 1255118 1274914 1293492 1310054 1327916 1347862 1366605 1383486 1402229 1424162
56044 1424162 1446132 1467077 1490127 1516032 1541271 1565072 1591671 1623028 1655888 1688570 1723930
56033A723930L9063L9425L8576M0869M3889M3353M2335M5646M9760M8849M6076
56022B201771M7914N2036N2318N1125N4591O0213O1511O0730O4316P0021P1431
56011B847977P1038P5523Q2317Q4468Q4621R0097R8401J02074J03649J10800J21051
56000C872016J26641J30104J39080J50312J55491J58207J67799J81293J89602
55991E270545J96450K11901K32185K46351K57906K78523L05082L25554L42971
55982G667468L70024M04338M33753M61762N01958N51685N98212O46411P11745
55973A2347356P90792Q69286R54363J066290J203789J352749J523713J742901
55965B1851239K012815K323972K698616L174714L751334M401563N134909N990814
$$ plain form
56033 1723930 1762993 1802418 1840994 1881863 1925752 1969105 2011440 2057086 2106846 2155695 2201771
56022 2201771 2249685 2301721 2354039 2405164 2459755 2519968 2581479 2642209 2706525 2776546 2847977
56011 2847977 2919015 2994538 3076855 3161323 3245944 3336041 3434442 3536516 3640165 3750965 3872016
56000 3872016 3998657 4128761 4267841 4418153 4573644 4731851 4899650 5080943 5270545
55991 5270545 5466995 5678896 5911081 6157432 6415338 6693861 6998943 7324497 7667468
55982 7667468 8037492 8441830 8875583 9337345 9839303 10390988 10989200 11635611 12347356
55973 12347356 13138148 14007434 14961797 16028087 17231876 18584625 20108338 21851239
55965 21851239 23864054 26188026 28886642 32061356 35812690 40214253 45349162 51339976
55957E1339976O976842Q079799R336824J0827773J2607028J4727139J7318245
55950A31213626K0537077K4431858K8918569L3704186L7816087L9131269L4991808
55943C50744480K4107930Q141784q841823k2765733l1588573l5479827l5697002
55936B48621236l3595624l0293018k6600733k2971015j9575695j6499871j3824191
55929H5261089j1565551r666155q074558o773636n725871m862129m138161l547692
55921C0907336l072634k671400k322977k035516j803967j601004j415393j259683
55913A4724762j133818j017567r04584q09535p35633o66856n97749n40746m98440
55904G819834m57045m12737l77565l53996l29117k99286k75971k61995k45572
$$ plain form
55957 51339976 58316818 66396617 75733441 86561214 99168242 113895381 131213626
55950 131213626 151750703 176182561 205101130 238805316 276621403 315752672 350744480
55943 350744480 374852410 382994194 374152371 351386638 319798065 284318238 248621236
55936 248621236 215025612 184732594 158131861 135160846 115585151 99085280 85261089
55929 85261089 73695538 64029383 55954825 49181189 43455318 38593189 34455028 30907336
55921 30907336 27834702 25163302 22840325 20804809 19000842 17399838 15984445 14724762
55913 14724762 13590944 12573377 11668793 10859258 10123625 9456769 8859020 8318274 7819834
55904 7819834 7362789 6950052 6572487 6218491 5889374 5590088 5314117 5052122 4806550
55895D806550k23269k06241j98066j87931j71538j58287j51908j43583j30135
55886C235592j20314j17122j11686j00548r2106r0068q6673p8047p0863o8247
55876B299918o3937n5854n1190n2544n2434m6762m1065l9031l7365l5993m0516
55865A783227n0191n5948n4583n2963n4462n3452m7393m2144m0749l8402l2996
55854A259944k9441k9294k7111k1415j8348k0265k1377j8939j8058k0994k2282
55843A012420j9155j6594j7287j6566j2199r480j1516j3679j2655j2112j4555
55832H56622j6244j5039j4801j7350j8294j5492j3437j4746j5452j3310j2493
55821F89964j5329j7342j5509j3688j4889j5675j3223j0757j0947j0867q336o457
$$ plain form
55895 4806550 4583281 4377040 4178974 3991043 3819505 3661218 3509310 3365727 3235592
55886 3235592 3115278 2998156 2886470 2785922 2693816 2603748 2517075 2439028 2368165 2299918
55876 2299918 2235981 2180127 2128937 2076393 2023959 1977197 1936132 1897101 1859736 1823743 1783227
55865 1783227 1733036 1677088 1622505 1569542 1515080 1461628 1414235 1372091 1331342 1292940 1259944
55854 1259944 1230503 1201209 1174098 1152683 1134335 1114070 1092693 1073754 1055696 1034702 1012420
55843 1012420 993265 976671 959384 942818 930619 921139 909623 895944 883289 871177 856622
55832 856622 840378 825339 810538 793188 774894 759402 745965 731219 715767 702457 689964
55821 689964 674635 657293 641784 628096 613207 597532 584309 573552 562605 551738 543402 536945
55809E36945p141o852l477p37j142j251J442L543K442J327K621K936l05l547l633
55794E23171l534o290q982q255o318o158n879l071j0N44K7j02k260p684j2316
55779D52883j2693j1325j1541j1693r323o438n488m477j235J503L44l187o057
55766C71273q871j2916j5775j4961j2536j1493j0725q065n036m115m267l500k940
55753B56073m187n625n280m565n314o102n232m281n015n801m769l457l699m016
55739A88730k767j595k146k593j191N1r56k296j578k89o79j465p06J42q64k139
55723A67659j625q68j956l246k426j045j648k960k386q46p53j343l83J369J693
55708A49236J047J232J667Q61j94K12J071O17j27N89J575P67q26r05N9J14m25
$$ plain form
55809 536945 529804 522952 519475 518738 517596 516345 517787 521330 523772 525099 527720 530656 530351 526804 523171
55794 523171 519637 513347 504365 496110 489792 483634 477755 474684 474674 475218 475245 475143 472883 465199 452883
55779 452883 440190 428865 417324 405631 396308 389870 384382 379905 378670 380173 380517 377330 371273
55766 371273 362402 349486 333711 318750 306214 294721 283996 275931 270895 266780 262513 259013 256073
55753 256073 251886 246261 240981 236416 231102 225000 219768 215487 210472 204671 199902 196445 192746 188730
55739 188730 185963 184368 182222 179629 178438 178489 177533 175237 173659 173370 172691 171226 170520 170662 169798 167659
55723 167659 166034 165166 163210 159964 157538 156493 154845 151885 149499 148653 147900 146557 146174 147543 149236
55708 149236 150283 151515 153182 154043 153849 154061 155132 155749 155622 156211 157786 158553 157727 156822 156881 156995 156570
55691A56570kJ006J436J967L428M251K881Q94M65P38j34j291r90q4k13n02N02
55674A70922J464M85j189j268m04m90p96M02K032J895O72M94R43J66j283j433
55658A72612n73l77n19M68J950K261J898K457L449L253K100J194J70j588k751
55643A86004k193j662l108n095n271m532n108o312o007m745m514m807l921k755
55629A25974l312m636m374l246l705n196n033l298k559l147k917j468o13p74o34
55614H1062k24p77j718j377l65o61j707j150Q02J552N81q7J01m81k035k634j596
55597F9286m21P3N50Q71O1j269j395m35p2m00r0N99J40j058j045J43N46j9K98
55578F6363J839K950L283M309O132P055O820P151Q493R218Q630P788O788M220
$$ plain form
55691 156570 156568 157574 159010 160977 164405 168656 171537 172431 172896 173634 173500 172209 171219 171135 170922 170420 170922
55674 170922 172386 172871 171682 170414 170010 169520 168724 169126 171158 173053 173725 174219 175162 175328 174045 172612
55658 172612 172039 171662 171143 171611 173561 175822 177720 180177 183626 186879 188979 190173 190343 188755 186004
55643 186004 183811 182149 179041 173946 168675 164143 159035 152723 146716 141971 137457 132650 128729 125974
55629 125974 122662 118026 113652 110406 106701 101505 96472 93174 90615 87468 84551 83083 82470 81696 81062
55614 81062 80838 80061 78343 76966 76601 75940 74233 73083 73885 75437 76018 75931 76032 75551 73516 70882 69286
55597 69286 68865 68938 69488 70359 70420 69151 67756 67321 67249 66849 66759 67358 67498 66440 65395 65538 66084 66065 66363
55578 66363 68202 71152 74435 78744 84876 91931 98751 105902 114395 123613 132243 140031 146819 151039
55564A51039J02l479n444o815q171q563p716o866o675o524o238o320o240m862
55550F7228k775j751j856j478l66J23j84NO74L56r01j202l6R72J018J233K158
55533F3218K753K595K594K878K336R16L9K37N26N35Q90J281O35m83k34J338K103
55516H4157J277M09L74J00r99j911k138k536l308l471l003l129l893l833k719
55501E5377k122k624k878k253j892k336k430j594r37j221j724j863j978j869p45
55486B6911Q43J215K41m09j10pm90m63K71L97m34r37o30n25q01l82N96O56j11
55467B5831J17J324J097j238l077k590j327j047q56M14J553J079q0k26L89N23
55451B1886J70j0j93p07r62m28L83Q94J208J185K28j231j654o79K35J55n8L28
$$ plain form
55564 151039 151141 147662 142218 135403 127232 118669 110953 104087 97412 90888 84650 78330 72090 67228
55550 67228 64453 62702 60846 59368 59002 59125 58941 58946 59620 59976 59075 57873 57837 58809 59827 61060 63218
55533 63218 65971 68566 71160 74038 76374 77290 77329 77566 78092 78627 79517 80798 81433 80950 80716 82054 84157
55516 84157 85434 85843 86217 86317 85318 83407 81269 78733 75425 71954 68951 65822 61929 58096 55377
55501 55377 53255 50631 47753 45500 43608 41272 38842 37248 36311 35090 33366 31503 29525 27656 26911
55486 26911 27754 28969 29210 28801 28691 28684 28194 27731 28002 28399 27965 27028 26398 25873 25072 24690 25286 25942 25831
55467 25831 25948 27272 28369 27131 24054 21464 20137 19090 18234 18648 20201 21280 21200 20974 21363 21886
55451 21886 22056 22046 21853 21146 20184 19756 20139 21033 22241 23426 23654 22423 20769 20090 20325 20480 20422 20750
55433B0750O66M89M70Q80R03M21N61J535J886R53R5L52Q33N51P3R4J14k89n11
55414C0826k12J1R3Q09J885J792L23p70o04m59j165j584r29l73q61j395r83l80
55396B6024m11n16k81m78j226j153J65J033L69m41j2P90P83N75R47J027j8j171
55378B6006j319j173j628j880r87J90M44J01o7l16p56m48P47J195L8j100p54q9
55360A8204p18j886j966j168n49J20J310J987J218J87M15J171Q79o2j85L66L77
55343A9700j12j77Pl44q01l98M96P77M74L75M30R2m56p68j060j371r45K22O17
55324A6758n16j556r71J87J86m21n8R35J133P66J138J946J685L10p28q41o80m75
55306A8798P6N67L55j2L76J035Q20K4r8M84O04p5p22q04n39r2L82L05m91j076
$$ plain form
55433 20750 21416 21905 22375 23255 24158 24579 25140 26675 28561 29514 29609 29961 30794 31345 31418 31512 31626 31337 30826
55414 30826 30614 30625 30718 31527 33412 35204 35527 34757 34153 33694 32529 30945 30016 29643 28782 27387 26404 26024
55396 26024 25613 25097 24816 24338 23112 21959 22124 23157 23526 23085 23073 23863 24646 25221 26168 27195 27177 26006
55378 26006 24687 23514 21886 20006 19019 19209 19653 19754 19687 19371 18615 18167 18914 20109 20147 19047 18293 18204
55360 18204 17486 15600 13634 12466 11917 12037 13347 15334 16552 16739 17154 18325 19204 19142 18957 19323 19700
55343 19700 19588 19411 19418 19074 18273 17875 18371 19148 19622 19997 20427 20519 20063 19295 18235 16864 15919 16141 16758
55324 16758 16242 14686 13715 13902 14088 13667 13609 14544 15677 16443 17581 19527 21212 21522 20794 19953 19273 18798
55306 18798 18874 19441 19796 19784 20160 21195 22015 22039 21941 22425 23029 22954 22232 21428 20889 20797 21179 21484 20993 19917
55286A9917p02n3j5r1N16J246J163P16Q42J118N17o37j207j084r94j052r95j087
55268A8118j391j010M04J450R45l9R3Q04N96k32k97J92j55j274j756j240o29k03
55250A4376M53R39N33j43J02Q67P34l75j262j578j833j674l06J535K073J040q9
55233A5392l81j91J87P75J007L19n49n06L2l2l04L73J504J534N76K04O59O17j47
55214B1069l06M86R16L75r4J89M81K15n5J05L12L49M01J72p66j622j119L60J101
55195B2569O63L51Q63J367J213Q04L30n70j486j366m00l0o89j176p77k34j13K9
55177B1348L36J77l56k23O53R37P4p77p90p48j346j770j140n3M92O39J048J631
55159B0132J847J539P66m56j657j941j157k49ok07l98o22r11r17m86rK26L20L09
$$ plain form
55286 19917 19215 19162 19147 19056 19572 20818 21981 22697 23539 24657 25174 24537 23330 22246 21252 20200 19205 18118
55268 18118 16727 15717 16121 17571 18516 18477 18570 19374 19970 19738 19441 19633 19478 18204 16448 15208 14579 14376
55250 14376 14829 15768 16301 16158 16260 17127 17861 17486 16224 14646 12813 11139 10833 12368 14441 15481 15392
55233 15392 15011 14820 15007 15782 16789 17108 16559 16053 16085 16053 15749 16122 17626 19160 19736 19940 20599 21216 21069
55214 21069 20763 21249 22165 22540 22446 22635 23116 23331 23276 23381 23693 24042 24443 24615 23849 22227 21108 21468 22569
55195 22569 23232 23583 24446 25813 27026 27830 28160 27590 26104 24738 24338 24308 23619 22443 21666 21432 21319 21348
55177 21348 21684 21861 21505 21282 21935 22872 22946 22169 21379 20631 19285 17515 16375 16322 16814 17453 18501 20132
55159 20132 21979 23518 24284 23828 22171 20230 19073 18824 18818 18611 18213 17591 16680 15763 15277 15268 15494 15814 16123
55140A6123J00l3K97P22M56m32j024q95m86r4M70J118J426J498J935K723L089
55123B6993K621J699P83J56K26J111J994J950J248Q40P88M17k28m41k61l90p53
55106C8753n69P3J38o37j298j182o15j3N72Q73N85J59K75N56J17q05j122o71k50
55087C4939k1N21J074P45j61l44L24N82j4m58j57K24L30P65J653K124J819J429
55069D5374J239O26m65j055p07k66m31q75j185j389j225k81Q29Q85k6m99m2L15
55051D0822q2n76o40o17n82p0O75P70M22Q05J827J959Q41M0M63R97P34N38J242
55032D9568K009J848J215Q42M34l36p81l89J32P4j51RK56K67L26M02j08j030j223
55013E3364m63om78q14k13M80L76k6j09l54j114j693j707j933k638k647j335j2
$$ plain form
55140 16123 16223 16190 16487 17209 17665 17233 16209 15314 14828 14734 15204 16322 17748 19246 21181 23904 26993
55123 26993 29614 31313 32096 32252 32478 33589 35583 37533 38781 39621 40409 40826 40598 40157 39896 39506 38753
55106 38753 38184 38257 38395 37758 36460 35278 34663 34650 35222 36095 36680 36839 37114 37670 37787 36982 35860 35189 34939
55087 34939 34918 35439 36513 37258 37097 36753 37077 37659 37645 37187 37030 37254 37584 38349 40002 42126 43945 45374
55069 45374 46613 47239 46774 45719 45012 44746 44315 43440 42255 40866 39641 39360 40189 41074 41048 40549 40507 40822
55051 40822 40740 40164 39524 38907 38325 38255 38930 39700 40122 40927 42754 44713 45554 45594 46057 47054 47788 48326 49568
55032 49568 51577 53425 54640 55482 55916 55580 54799 54410 54542 54616 54465 54474 54730 54997 55323 55725 55617 54587 53364
55013 53364 52901 52895 52417 51603 51390 51870 52246 52220 52111 51757 50643 48950 47243 45310 42672 40025 38690 38678
54995C8678K9n82o85m94o04n59J33P15M99K06N85Q78K82k87L94J729K239J793
54977D4949J246P77J28k33J97P65O04J33K64Q18J056J080J368J679J727K130L340
54960F2028M439M439M067M673O068P017P381Q145R607J0986J1648J1530J0537
54947A62565Q596O045L126l97m355p587r254j0021j0926j1782j1760j0832r487
54934I3931p797n897m648m596m879m399l342k439j557k95P34O71o0l00K68J209
54918E6604K370L597M173L758L307L826M855N481O070P501R341J0310J0106R327
54904A40626Q028N775K804k31l251o307q627r454r382r507r755r350q422p682
54890G5265o968n611l948k943k577k019j133n50m06l35m45j005j440r00L23J192
$$ plain form
54995 38678 38707 38125 37440 36946 36342 35783 35916 36631 37130 37336 37921 38799 39081 38794 39188 40917 43156 44949
54977 44949 46195 46972 47100 46867 47064 47829 48433 48566 48830 49648 50704 51784 53152 54831 56558 58688 62028
54960 62028 66467 70906 74973 79646 85714 92731 100112 108257 117864 128850 140498 152028 162565
54947 162565 171161 177206 180332 179935 175580 167993 158739 148718 137792 126010 114250 103418 93931
54934 93931 86134 80237 75589 70993 66114 61715 58373 55934 54377 54082 54816 55487 55427 55127 55395 56604
54918 56604 58974 62571 66744 70502 73809 77635 82490 87971 94041 101542 110883 121193 131299 140626
54904 140626 148654 154429 157233 157002 153751 147444 138817 129363 119981 110474 100719 91369 82947 75265
54890 75265 68297 62686 58738 55795 53218 51199 50066 49516 49110 48775 48330 47325 45885 44985 45308 46500
54874D6500J334R72nj532k469j764k43L16l38q00k48P18J357J533J226N66K55
54857D7378P64J288P39n07j187j195j514k350k828k549j983j352m66L33M11K2
54841C5004%L20K50j92k72P3K38K09M83Q82Q17N92R56J518J214K34j30L82P57
54822D3335O73Q92J465J401N75K04P73J145N09k73j51N60R98J063J141J418K072
54805E7800L311M707N395N360N604O665P943Q849R591J0309J0515R968R091P950
54791A63058N731K012k193n388p037p630p779p771p598p110o400n985o112o128
54777I3670n238l740k625k122j635r88o03m07K22J193J590J143P12R67J606K222
54761H5967K907L631M049M347N274O898Q301Q896R176R584R668Q909P508N803
$$ plain form
54874 46500 47834 48806 48801 47269 44800 43036 42793 43109 42771 41971 41723 42441 43798 45331 46557 47123 47378
54857 47378 48142 49430 50169 49662 48475 47280 45766 43416 40588 38039 36056 34704 34238 34571 34982 35004
54841 35004 35004 35324 35574 35382 35110 35183 35421 35630 36113 36995 37812 38404 39360 40878 42092 42326 42196 42578 43335
54822 43335 44008 44900 46365 47766 48341 48545 49318 50463 50972 50699 50548 51108 52106 53169 54310 55728 57800
54805 57800 61111 65818 71213 76573 82177 88842 96785 105634 115225 125534 136049 146017 155108 163058
54791 163058 168789 170801 168608 163220 156183 148553 140774 133003 125405 118295 111895 105910 99798 93670
54777 93670 88432 84692 82067 79945 78310 77322 76719 76312 76534 77727 79317 80460 81172 82139 83745 85967
54761 85967 88874 92505 96554 100901 106175 113073 121374 130270 139446 149030 158698 167607 175115 180918
54747A80918L626R27j644l417m450n187n767o131o343o500o636o868p221p365
54733A17942o999o445o205o101n589m747m123l637k730j548r56j188j600j873
54719F4201k375l007k885j640r1Q13R17M60k92p00q5J126J575P62k55m43r9M2
54701E8024P8M49R64J137J004R05Q23N28Q4k45l56k91j32r8l72p29p31l54O6M65
54681F1219R95J435J355R09O88P35N89L20N69J359J937K066K435L361M006L574
54665H7552K416J345M96l89j094j106m59J59J19n27j060p67J70P12K68l73o4J066
54647H8464J856J844J692J920K246K436K796L521M294M869N407O010O565P119
54633A41039P733P927P050N232L207J189j151l563n155n652n801o168o489o452
$$ plain form
54747 180918 184544 185471 183827 180410 175960 170773 165006 158875 152532 146032 139396 132528 125307 117942
54733 117942 110943 104498 98293 92192 86603 81856 77733 74096 71366 69818 68862 67674 66074 64201
54719 64201 61826 58819 55934 54294 54203 55016 55933 56393 56101 55401 55316 56442 58017 58779 58524 58081 57982 58024
54701 58024 58102 58551 59515 60652 61656 62561 63384 63912 63996 63751 63395 63104 62972 62874 62502 61773 61042 60688 60754 61219
54681 61219 62214 63649 65004 65913 66601 67336 67925 68245 68814 70173 72110 74176 76611 79972 83978 87552
54665 87552 89968 91313 91809 91420 90326 89220 88761 88920 89039 88512 87452 86685 86855 87567 87835 87462 87398 88464
54647 88464 90320 92164 93856 95776 98022 100458 103254 106775 111069 115938 121345 127355 133920 141039
54633 141039 148772 156699 163749 168981 172188 173377 172226 168663 163508 157856 152055 145887 139398 132946
54619A32946o240n975n339m150k720j493q64j229k433l328k834j346k49j21m77
54604I4148r97j752k342k185j790k267l457l993l435k803k634k157r92p7j54o43
54588F2470q56j042j408j374o53l2j82o73r53j233j651j556n46O65J239J296J224
54571E4735Q52L8p17j006j097j202r67k94K13K51L32P56J039R27R45J221R31k87
54553E6670j469j730j501j473j344p13j74l70p17k71P87J615K047K403K508J968
54537E8236J100O09O85J063J628K268K568K362K129K371K950L573M242M818M729
54522I5331L700K210Q17l73j266j667j890k620l710m156l614k855k337j625p39
54507G5206o02j346j662q76k41r07j975j973j125o34o22m06p0k47q04j085j054
$$ plain form
54619 132946 126706 120731 115392 111242 108522 107029 106165 104936 102503 99175 96341 94995 94746 94625 94148
54604 94148 93151 91399 89057 86872 85082 82815 79358 75365 71930 69127 66493 64336 63344 63267 63113 62470
54588 62470 61614 60572 59164 57790 57137 57105 56923 56250 55297 54064 52413 50857 50311 50976 52215 53511 54735
54571 54735 55587 55625 54908 53902 52805 51603 50636 50342 50555 50806 51138 51894 52933 53860 54805 56026 56957 56670
54553 56670 55201 53471 51970 50497 49153 48440 48266 47896 47179 46908 47695 49310 51357 53760 56268 58236
54537 58236 59336 59945 60630 61693 63321 65589 68157 70519 72648 75019 77969 81542 85784 90602 95331
54522 95331 99031 101241 102058 101685 100419 98752 96862 94242 90532 86376 82762 79907 77570 75945 75206
54507 75206 74604 73258 71596 70720 70479 69572 67597 65624 64499 63865 63243 62837 62767 62520 61716 60631 59577
54490E9577r97o32L20J197J222P48N73N82K70l9K81Q97J079J041J421J861J445
54473G0846L29m15m44m31o93o96r7O18P04p6j293k044j654m85L60M55M21O07L94
54454F6406n36j312j201p62p32p39k38K11j36p75p35j09L77O49R32Q40O6o56n66
54435F0984j19k2J00P72J220M73p82j088m37Q0K58O81J079O39k64l97L50R53J102
54416F5582J385J746J504R29J081J861J942R47J70N76J534K051K097K149K356
54401H7910K597K643K169J297R38J647K476K092P52k02n11j112k144k597k207
54386I5748j990k449k645j806o19j46m80j060j542j786j687j417j286j215r44
54371G4676p17r77j493j606j309j086q35m7J015J491J260J031J000O94J94J68
$$ plain form
54490 59577 58580 57948 58268 59465 60687 61435 62008 62590 62860 62821 63102 63999 65078 66119 67540 69401 70846
54473 70846 71175 70760 70316 69885 69192 68496 68399 69017 69721 69645 68352 66308 64654 64169 64529 64984 65405 66012 66406
54454 66406 65870 64558 63357 62595 61863 61124 60886 61097 60961 60186 59451 59342 59719 60368 61300 62140 62206 61550 60984
54435 60984 60865 60843 60943 61715 62935 63408 62626 61538 61101 61181 61439 62120 63199 63838 63574 63177 63527 64480 65582
54416 65582 66967 68713 70217 71146 72227 74088 76030 76977 77147 77723 79257 81308 83405 85554 87910
54401 87910 90507 93150 95319 96616 97554 99201 101677 103769 104521 104319 103808 102696 100552 97955 95748
54386 95748 93758 91309 88664 86858 86239 86093 85613 84553 83011 81225 79538 78121 76835 75620 74676
54371 74676 73959 72982 71489 69883 68574 67488 66653 66606 67621 69112 70372 71403 72403 73097 73291 73459
54355G3459N82O37L13N43J526K184J867J381J633K335K729K686K434J935J164
54340I7408M20r3m43n45k05K39J65l53o76q16j510k752l427k919k059j888k264
54323G8282k361j957j559j656k246k841k803k009j138r04j106j087q55r27j264
54308E3569j334j142j170j362j191p60o74p91l21O48R94K98m82n05j19N6R7K36
54290D6047K08k29p78j036q78k56P43J454J181K78j68J15L33L9k24n4J82J64J03
54271D7224nn65j401j556n97P11J540J873J865J340M13j76J8N72R46J034P70j3
54253E3993r05r74lJ144J718J794J549P65m17j174j045n42k53n0L26O29N63K99
54235E7417P9p7j62j61l59r07j192n88K50K2j168j794j128j44K41L53O12N81L8
$$ plain form
54355 73459 74041 74678 74991 75534 77060 79244 81111 82492 84125 86460 89189 91875 94309 96244 97408
54340 97408 97828 97735 97292 96747 96542 96781 96946 96593 95917 95101 93591 90839 87412 84493 82434 80546 78282
54323 78282 75921 73964 72405 70749 68503 65662 62859 60850 59712 58808 57702 56615 55760 54833 53569
54308 53569 52235 51093 49923 48561 47370 46610 45936 45145 44824 45472 46466 46764 46282 45777 45658 45714 45811 46047
54290 46047 46255 46026 45248 44212 43334 43078 43821 45275 46456 46734 46566 46681 47014 47053 46829 46775 46957 47121 47224
54271 47224 47219 46654 45253 43697 43100 43811 45351 47224 49089 50429 50842 50666 50684 51256 52202 53236 54006 53993
54253 53993 53088 52114 52111 53255 54973 56767 58316 59081 58664 57490 56445 55903 55650 55600 55926 56555 57118 57417
54235 57417 57496 57419 57257 57096 56737 55830 54638 54050 54300 54322 53154 51360 50232 50088 50329 50682 51294 51875 51913
54216E1913k70J73P22O67K85j0m83j268j688j288o37k85J46R82J526J057Q0m48
54198E1174m45m11m55m66o22r31r21m64j85l48j69R00J999J998J119M46L34L10
54180E2863J10j54m67p48o06K0L41l21j474k039j671q78j37M23P58Q86R24Q33
54162D8663M33j01l13k39m22r35j109o33q6lk12m19o20n39K56J315J455M87l91
54143D6587m67m39p89p42J44P77K92l02K15J136J004Q3j80L82N84j4o24p23o70
54124D6254p29p47p99j094j229o38L05P08N13M37N84K47p82j672j603o66M48J139
54106D0676J277J244J478J733J274J37n21oQ19Q62M28M33O71K47o58r28k22O37
54088D9581J009J007O98p8r41j085l89L94P52R09J126J259J189R93O16K7l30L7
$$ plain form
54216 51913 51643 51816 52538 53205 53490 53480 52997 51729 50041 48753 48116 47831 47977 48959 50485 51542 51622 51174
54198 51174 50729 50318 49863 49397 48775 47844 46923 46459 46274 45926 45757 46657 48656 50654 51773 52219 52553 52863
54180 52863 52973 52819 52352 51604 50998 51018 51359 51038 49564 47525 45854 44976 44839 45262 46020 46906 47830 48663
54162 48663 49096 48995 48682 48443 48021 47086 45977 45344 45258 45255 45043 44624 44004 43465 43721 45036 46491 46978 46587
54143 46587 46120 45681 44892 44150 44294 45071 45363 45061 45276 46412 47416 47499 47319 47701 48285 48271 47647 46924 46254
54124 46254 45525 44778 43979 42885 41656 41018 41323 42031 42544 42981 43565 43812 43030 41358 39755 39089 39537 40676
54106 40676 41953 43197 44675 46408 47682 47819 47298 47292 48111 48973 49401 49834 50505 50752 50094 49166 48944 49581
54088 49581 50590 51597 52295 52217 51276 50191 49802 50196 50948 51857 52983 54242 55431 56424 57040 57067 56737 56774
54070E6774P30P37j97j172j317p83k66r8l2L33J119J991K415K192J619J075P16
54053F5836O85J088J553J448R07R80K158L423L555K795K357K656L016K900K549
54038I7906K401K583L025L570L971M153M281M370M176L755L544L544L056J816
54024A46151O81M62P56O91L04K44N77Q08P48N50J48n73j349j935k556l370l942
54007A38395l892l508l108k423j437j031j793k901l185k784k593k659k325j585
53993A03171r92o02j43O1m33j128j129n65k80l86l34j67m35r63j011n50j44K17
53975I4187R43J589J180j26j117j344j548k054k121j341m68k25l28j91J45K93
53959H7474R9m19j093j432r91o4N86O95O08N46M88O10J045J404J314J185J576
$$ plain form
54070 56774 57504 58241 58044 56872 55555 54772 54506 54408 54376 54709 55828 57819 60234 62426 64045 65120 65836
54053 65836 66521 67609 69162 70610 71517 72497 74655 78078 81633 84428 86785 89441 92457 95357 97906
54038 97906 100307 102890 105915 109485 113456 117609 121890 126260 130436 134191 137735 141279 144335 146151
54024 146151 146832 147294 148050 148741 149045 149289 149866 150674 151422 151972 152120 151547 150198 148263 145707 142337 138395
54007 138395 134503 130995 127887 125464 124027 122996 121203 118302 115117 112333 109740 107081 104756 103171
53993 103171 102179 101577 101434 101495 101062 99934 98805 98240 97960 97574 97240 97073 96638 95675 94664 94114 93970 94187
53975 94187 95130 96719 97899 97773 96656 95312 93764 91710 89589 88248 87780 87555 87227 87036 87181 87474
53959 87474 87573 87154 86061 84629 83638 83574 84160 84855 85463 86009 86497 87107 88152 89556 90870 92055 93631
53942I3631K045J825J308J660K976M095M347M233M194L994L582L418L575L533
53928A38416L182L037L162K956K266J746J776J935J942K113K591L019L301L761
53914A75203M288M322L973M133N007N572N031L883K981K358J663J005O21K57n40
53899B19757j748k880l405l088k332k071k767l614l564k998l325m845o148o055
53885A70917n109m563m718m933m687m023l284k829k757k782k591k281k038j764
53871A22558j459j618k457l178k982k464k813l871m282l507k381j619j124q50
53857H7953j030j321j070n78p38j235p64O52J266K21j108j276p14m89n07j74K10
53840G9298N7m11o84q50j015p17J39O17N1p24n25M44J086J013O36J88k91m19R1
$$ plain form
53942 93631 95676 97501 98809 100469 103445 107540 111887 116120 120314 124308 127890 131308 134883 138416
53928 138416 141598 144635 147797 150753 153019 154765 156541 158476 160418 162531 165122 168141 171442 175203
53914 175203 179491 183813 187786 191919 196926 202498 207529 211412 214393 216751 218414 219419 220040 220297 219757
53899 219757 218009 215129 211724 208636 206304 204233 201466 197852 194288 191290 187965 183120 176972 170917
53885 170917 165808 161245 156527 151594 146907 142884 139600 136771 134014 131232 128641 126360 124322 122558
53871 122558 121099 119481 117024 113846 110864 108400 105587 101716 97434 93927 91546 89927 88803 87953
53857 87953 86923 85602 84532 83954 83216 81981 81217 81869 83135 83356 82248 80972 80258 79769 79262 79088 79298
53840 79298 79355 78944 78260 77410 76395 75678 75817 76434 76485 75761 75236 75680 76766 77779 78415 78603 78312 77893 77984
53821G7984Q00J133J289J770K387K529K112J550J115R37J223J854K185J958J919
53806A02745K748L836M026L290K740L096L984M767N256N447N175M324L137K120
53792A56691J635J616J647J477J358J622K082K243J961J425N78p53k181k981l082
53777A65338l071l199l124k842k864l262l386k921k367k134j966j667j563j784
53763A29188j909j770j796k180k440k244j914j774j695j627j720j749j321r03
53749A04146j432k613k921j828o22l70m61j10J57l02q08n23Oj66o61m80K26N38
53731I1776L76M14P18P29L83J31Q8J17M53J284K038J990J357Q81O94M25N8j04
53713A03808j30k64l80l04k37k56Q2Q53J225O72j3J05O06N60K21N44J468K051
$$ plain form
53821 77984 78784 79917 81206 82976 85363 87892 90004 91554 92669 93606 94829 96683 98868 100826 102745
53806 102745 105493 109329 113355 116645 119385 122481 126465 131232 136488 141935 147110 151434 154571 156691
53792 156691 158326 159942 161589 163066 164424 166046 168128 170371 172332 173757 174335 173582 171401 168420 165338
53777 165338 162267 159068 155944 153102 150238 146976 143590 140669 138302 136168 134202 132535 130972 129188
53763 129188 127279 125509 123713 121533 119093 116849 114935 113161 111466 109839 108119 106370 105049 104146
53749 104146 102714 100101 97180 95352 94730 94360 93899 93789 93946 93644 92836 92313 92319 92153 91492 91012 91238 91776
53731 91776 92152 92566 93284 94013 94396 94527 94615 94732 95185 96469 98507 100497 101854 102735 103429 103854 103912 103808
53713 103808 103678 103414 103034 102730 102493 102237 102319 103172 104397 105069 105056 105161 105767 106327 106548 107092 108560 110611
53695A10611K050K110K443K624K566K621K655K129J146M56L88O09Q49J128J303
53680A35688J258J363J950K622K778K541K306J833Q47O4L60J188J260N88M01R45
53664A57992R76j83j500j801j289p49k31N71J346J399O31k85o00j00P71J232Q67
53647A59047K6o71j061j308j303q36k06k3l77p73q75p35l65K72Q00O44j11o30
53629A51515k88O54J442J564J109O60P51J226J335P51J60L68J231J988K313K412
53613A69191K385K187K015K126K392K531K607K783K915K858K851L017L007K665
53599B05530K546K982L291K791K020J918K282K290K134K733L998M800M718M437
53585B48470M295L761K741K047K108K266J933J506J547J816J774J372Q64L30j44
$$ plain form
53695 110611 112661 114771 117214 119838 122404 125025 127680 129809 130955 131411 131799 132408 133257 134385 135688
53680 135688 136946 138309 140259 142881 145659 148200 150506 152339 153186 153250 153610 154798 156058 156646 157047 157992
53664 157992 158968 158785 157285 155484 154195 153446 153215 153786 155132 156531 157162 156877 156277 156177 156948 158180 159047
53647 159047 159073 158402 157341 156033 154730 153894 153688 153665 153288 152515 151640 150905 150540 150812 151612 152256 152145 151515
53629 151515 151227 151881 153323 154887 155996 156656 157407 158633 159968 160719 160879 161247 162478 164466 166779 169191
53613 169191 171576 173763 175778 177904 180296 182827 185434 188217 191132 193990 196841 199858 202865 205530
53599 205530 208076 211058 214349 217140 219160 221078 223360 225650 227784 230517 234515 239315 244033 248470
53585 248470 252765 256526 259267 261314 263422 265688 267621 269127 270674 272490 274264 275636 276500 276830 276686
53570B76686l18j13K23M91O78O75L28j58l87l83m63n73l42J50L79K08q1n07j376
53551B75117k414k732j967p80K7K63J07j87j97L34Q91O30m03j187j089n48j94
53534B65671l1J59L39N56J120K011K714K985L216L675M010L928L818M112M526
53519C02809M546M362M732N933P338Q093Q067P951Q497R695J0890J1720J2448
53506D07081J3229J3644J3482J3463J4363J5738J6528J6703J7258J8571J9685
53495E79745J9667J8850J8369J8985K0562K2275K3144K2901K2345K2421K3011
53484H12275K3241K2802K2189K1776K1516K1650K2642K4220K5348K5446K4850
53473A067955K3923K2605K1127K0171J9827J9351J8373J7455J6898J5981J4190
$$ plain form
53570 276686 276368 276255 276478 276969 277647 278322 278650 278492 278105 277722 277259 276686 276344 276494 276873 277081 277000 276493 275117
53551 275117 272703 269971 268004 267224 267251 267514 267621 267434 267237 267571 268462 269092 268689 267502 266413 265865 265671
53534 265671 265640 265799 266138 266694 267814 269825 272539 275524 278740 282415 286425 290353 294171 298283 302809
53519 302809 307355 311717 316449 322382 329720 337813 345880 353831 362328 372023 382913 394633 407081
53506 407081 420310 433954 447436 460899 475262 491000 507528 524231 541489 560060 579745
53495 579745 599412 618262 636631 655616 676178 698453 721597 744498 766843 789264 812275
53484 812275 835516 858318 880507 902283 923799 945449 968091 992311 1017659 1043105 1067955
53473 1067955 1091878 1114483 1135610 1155781 1175608 1194959 1213332 1230787 1247685 1263666 1277856
53462A277856J2368J1660J1860J1790J0966R892Q890P542N477K950M68j777l810
53449A366132n585o988q101r205j0547j2113j3689j5151j6518j7730j8568j8954
53437A212983j9131j9320j9502j9700k0135k0798k1271k1343k1378k1585k1422
53426I87398k0352j8776j7391j6120j4488j2737j1515j0690r560q107o985o245
53414H34432n230l801k484j249O40L200N317O273O722P550Q818J0341J2419J5143
53400H98091J7707J9206J9704J9908K0267K0886K1884K3272K4773K6175K7579
53389A139452K9088L0695L2579L4956L7418L9122L9967M0914M2696M4860M6553
53378A558300M7631M8444M9021M9134M8887M8743M9024M9608M9990M9539M7995
$$ plain form
53462 1277856 1290224 1301884 1313744 1325534 1336500 1346392 1355282 1362824 1368301 1371251 1371719 1369942 1366132
53449 1366132 1360547 1353559 1345458 1336253 1325706 1313593 1299904 1284753 1268235 1250505 1231937 1212983
53437 1212983 1193852 1174532 1155030 1135330 1115195 1094397 1073126 1051783 1030405 1008820 987398
53426 987398 967046 948270 930879 914759 900271 887534 876019 865329 855769 847662 840677 834432
53414 834432 829202 825401 822917 821668 822308 825508 830825 837098 843820 851370 860188 870529 882948 898091
53400 898091 915798 935004 954708 974616 994883 1015769 1037653 1060925 1085698 1111873 1139452
53389 1139452 1168540 1199235 1231814 1266770 1304188 1343310 1383277 1424191 1466887 1511747 1558300
53378 1558300 1605931 1654375 1703396 1752530 1801417 1850160 1899184 1948792 1998782 2048321 2096316
53367B096316M5754M3303M0526L7069L3204K9587K6262K2783J9386J6926J5347
53356B426463J3318R941N929K391o92m057p809j1430j4826j8581k3235k8786l4810
53343B313816m0634m5577m9210n1480n2519n2531n1779n0465m8723m6941m5721
53332A778236m5054m4070m2333m0896m1071m2481m3498m3352m2578m1517l9887
53321A311499l7943l6487l5344l3301l0038k6774k4367k2202j9726j7595j6365
53310A011357j5313j3717j2206j1675j1675j1041r412p285n215l767l466l939
53298I02646l886k689j216k11Q97K624M052M231L991M818O586Q042Q946J0150
53284I48981J1795J3113J3992J5267J7244J9141K0306K1012K1776K2655K3404
$$ plain form
53367 2096316 2142070 2185373 2225899 2262968 2296172 2325759 2352021 2374804 2394190 2411116 2426463
53356 2426463 2439781 2449722 2455651 2458042 2457350 2453293 2445484 2434054 2419228 2400647 2377412 2348626 2313816
53343 2313816 2273182 2227605 2178395 2126915 2074396 2021865 1970086 1919621 1870898 1823957 1778236
53332 1778236 1733182 1689112 1646779 1605883 1564812 1522331 1478833 1435481 1392903 1351386 1311499
53321 1311499 1273556 1237069 1201725 1168424 1138386 1111612 1087245 1065043 1045317 1027722 1011357
53310 1011357 996044 982327 970121 958446 946771 935730 926318 919033 913818 910051 906585 902646
53298 902646 898760 896071 894855 894644 895541 898165 902217 906448 910439 915257 921843 929885 938831 948981
53284 948981 960776 973889 987881 1003148 1020392 1039533 1059839 1080851 1102627 1125282 1148686
53273A148686K3687K3205K2180K1517K1773K2137K1301J9135J6700J4752J3059
53262A368132J1204R168P104N205L851L184K580J172j061l356n219o894q792j1040
53248A375238j3531j5916j7667j8729j9876k1818k4142k5851k6728k7437k8302
53237A135241k8886k8815k8300k7560k6354k4508k2491k1107k0692k0812k0734
53226H64982k0173j9476j9047j8769j8342j8000j8223j8777j8745j7767j6432
53215F61231j5148j3495j1203r022p847p567p478p336p290p259p119p122p461
53202E45884p765p667p495p733q205q368q121p703p178o580o181o097n989n664
53188D45138n478n667n852n792n969o777p718q023p614o878o110n684n970o479
$$ plain form
53273 1148686 1172373 1195578 1217758 1239275 1261048 1283185 1304486 1323621 1340321 1355073 1368132
53262 1368132 1379336 1388504 1395608 1400813 1404664 1407848 1410428 1411600 1410539 1407183 1401964 1395070 1386278 1375238
53248 1375238 1361707 1345791 1328124 1309395 1289519 1267701 1243559 1217708 1190980 1163543 1135241
53237 1135241 1106355 1077540 1049240 1021680 995326 970818 948327 927220 906528 885716 864982
53226 864982 844809 825333 806286 787517 769175 751175 732952 714175 695430 677663 661231
53215 661231 646083 632588 621385 612363 604516 596949 589471 582135 574845 567586 560467 553345 545884
53202 545884 538119 530452 522957 515224 507019 498651 490530 482827 475649 469069 462888 456791 450802 445138
53188 445138 439660 433993 428141 422349 416380 409603 401885 393862 386248 379370 373260 367576 361606 355127
53174C55127o062m650l729m175m821m388l627l955m961n179m605m480m881m608
53160B91006l498k907l489m182l977l282k927k945k959k921k955l066l315l705
53146B44878l864l409k563j818j242q24j036k017k774k367j579j961l419m277
53132B11728l730k701k105j768j412j300j393j164o83p22j415j944j962k064k444
53117A84921k382j637j063j129j108n47k75r76j821j700r66p70j198j323p68j66
53101A67092j09n06r85j319j308p82K04J275J888J629O19l49m52K78J046J269
53085A69490J050P39N17M91O43O84L38j98n98j073k012l087l492l088k501k087
53069A55816j651j268j391j901k092j879k097l110m040l952l053k165j604j213
$$ plain form
53174 355127 349065 344415 340686 336511 331690 327302 323675 319720 314759 309580 304975 300495 295614 291006
53160 291006 287508 284601 281112 276930 272953 269671 266744 263799 260840 257919 254964 251898 248583 244878
53146 244878 241014 237605 235042 233224 231982 231158 230122 228105 225331 222964 221385 219424 216005 211728
53132 211728 207998 205297 203192 201424 200012 198712 197319 196155 195472 194750 193335 191391 189429 187365 184921
53117 184921 182539 180902 179839 178710 177602 177055 176780 175804 173983 172283 171317 170547 169349 168026 167258 167092
53101 167092 166983 166477 165492 164173 162865 162083 162287 163562 165450 167079 167698 167349 166897 167175 168221 169490
53085 169490 170540 171279 171796 172287 172930 173614 173952 173754 173156 172083 170071 166984 163492 160404 157903 155816
53069 155816 154165 152897 151506 149605 147513 145634 143537 140427 136387 132435 129382 127217 125613 124400
53055A24400r58q51o95m45m84j096j923k244j721o71J06j22j231k071j687o24
53039A07683l36j260k320k419j624o51nN7m82j083r72j49N74P30O80O78L41n41
53021I8901j419j684j347n97M82J389J189l00j938k533k105j366n67M18J343J727
53005I1593J553J243J003O42j2q03j288j067l01K00j20p34o18K81R79Q81M94M05
52987I4331L81p2r19j796k444k580j928p71J07L91O23J276J979K085J522O98L8
52970I2921r6M70J353J784J492R73O97O02N27N55O10L74j12l13K4N02P29Q60J176
52951A05128J654K121K395K259J810J716K342K845K150P98M93J678K916L091K818
52936A36214L007L385L333L058K887K392J196r9p61r90j197j104m73k9n47j605
$$ plain form
53055 124400 123442 122591 121896 121451 120967 119871 117948 115704 113983 113312 113418 113296 112065 109994 108307 107683
53039 107683 107347 106087 103767 101348 99724 99073 99068 99125 98643 97560 96588 96439 97013 97743 98423 99101 99442 98901
53021 98901 97482 95798 94451 93854 94336 95725 96914 96614 94676 92143 90038 88672 88105 88523 89866 91593
53005 91593 93146 94389 95392 96034 96022 95219 93931 92864 92563 92763 92643 91909 91291 91572 92551 93432 93926 94331
52987 94331 94712 94640 93721 91925 89481 86901 84973 84202 84309 84700 85323 86599 88578 90663 92185 92883 92921
52970 92921 92825 93295 94648 96432 97924 98897 99594 100196 100723 101278 101888 102262 102150 101837 101861 102363 103092 103952 105128
52951 105128 106782 108903 111298 113557 115367 117083 119425 122270 124420 125218 125711 127389 130305 133396 136214
52936 136214 139221 142606 145939 148997 151884 154276 155472 155373 154612 153622 152425 151321 150848 150819 150272 148667
52920A48667k263k411k492k430j904j273j183j526j701j611j547j375p92j06R2
52905A26145j07r0L11P19R30J039J037Q53O37M34m7q23j189n77N40J237J343J306
52887A33698J204O89j96q74r20m16K54O43M92J30K14Q00J138P67J93QRk21m99
52868A37113n62o76j006j001l07L26K9q15j142p50k17K47Q04J157Q31J46j33O5
52850A34109L13P58J893L275L710K881J734J050N92l1n91q06r25j300j774j942
52834A42946j690j213p59m45j96J76O33Q31N33l7n32q43r08n36J93P33P69O73
52816A40328Q58J081R32N86M67N31M90L00n2p94j770k167j619r91j219j885j928
52799A33148j353j037j215j282j060j026j233j102n57l96j182k464l361l439k847
$$ plain form
52920 148667 146404 143993 141501 139071 137167 135894 134711 133185 131484 129873 128326 126951 126159 126053 126145
52905 126145 126038 125948 126259 126978 127908 128947 129984 130837 131474 131908 131861 131038 129849 129272 129812 131049 132392 133698
52887 133698 134902 135591 135395 134521 133601 133185 133439 134082 134574 134704 134918 135718 136856 137623 137816 137824 137833 137612 137113
52868 137113 136551 135875 134869 133868 133561 133887 133916 133101 131959 131209 130992 131239 132043 133200 134031 134177 134044 134109
52850 134109 134422 135180 137073 140348 144058 146939 148673 149723 150315 150284 149693 148887 147962 146662 144888 142946
52834 142946 141256 140043 139284 138839 138643 138819 139452 140283 140816 140779 140247 139404 138496 137960 138153 138886 139655 140328
52816 140328 141186 142267 143199 143785 144252 144783 145273 145573 145521 144727 142957 140790 139171 138180 136961 135076 133148
52799 133148 131795 130758 129543 128261 127201 126175 124942 123840 123283 122887 121705 119241 115880 112441 109594
52784A09594k035j475j268j069o80m14n25o76n43m47p26r92q19o96j234j902j656
52767I2437o22J8k30o85p30m78j80K6k63j348k591k920k277j596j293q83j75K25
52749G6435qm23o87j089j715j965j389l50N15R20Q32L47j60l12k74m08n11j80
52731F9578K26l6q05j172j015j094j478j212J6J075J003K85k15n41j044j383j130
52714F1058p00p51j112j131o58l1N29R04Q88O11O40J148J411Q74Q4j64o7l43q81
52695F2309r28m17r0k42k87J61O10N75M70R90J923K279J616P04N86J279J842J580
52677G4960P83J50n1J5K42O15R29R64Q82J063J526J844J707J263R07Q74R73O65
52659I0311l86j668k099j286j44J93l07q48j042j166j416j687j999k418k619k147
$$ plain form
52784 109594 107559 106084 104816 103747 103067 102653 102128 101452 100909 100462 99736 98744 97925 97229 95995 94093 92437
52767 92437 91815 91833 91603 90918 90188 89710 89530 89556 89293 87945 85354 82434 80157 78561 77268 76385 76210 76435
52749 76435 76427 76004 75317 74228 72513 70548 69159 68809 69324 70244 71076 71423 71263 70951 70677 70269 69758 69578
52731 69578 69804 69768 68963 67791 66776 65682 64204 62992 63008 64083 65086 65371 65156 64615 63571 62188 61058
52714 61058 60358 59607 58495 57364 56706 56675 57204 58108 58996 59607 60247 61395 62806 63680 63764 63600 63533 63190 62309
52695 62309 61381 60964 60874 60632 60345 60506 61116 61691 62161 63151 65074 67353 68969 69673 70259 71538 73380 74960
52677 74960 75743 75893 75842 75857 76099 76714 77643 78607 79489 80552 82078 83922 85629 86892 87799 88673 89646 90311
52659 90311 89925 88257 86158 84872 84728 84921 84614 83766 82724 81558 80142 78455 76456 74038 71419 69272
52643F9272j193n04m35n93m08K76J138J489P40p27j511p25P41J222L26r19j622
52626F6567j762j491q18j33l1m45p46p34o56l79M42J343J426Q18N39P54M88n45
52608F4637j223p63Q5M09M45O99P97L14j07L25J215J558J207P74M85J28j56MM68
52589G1301P78R36J242J512J198L31l46l13J54M61M03K43L38P51J215J452J499
52572H3155J515J416J034N31K67K92M00O59J272J941K075J693J457J628J710J377
52556A02422R77Q15O40K11k37n16p72r32m56P74J976K331J927J417J164J067Q34
52539A13642K15o56j052m25O04Q18J08l82K4O84Q94Q39P81M06l07o07j47K93J14
52520A15846j00K36M36l22j475j835j349q47o37n12o52j259j689j149j8O76P98
$$ plain form
52643 69272 68079 67575 67140 66547 66139 66415 67553 69042 69782 69055 67544 66819 67560 68782 69108 68189 66567
52626 66567 64805 63314 62496 62363 62332 61887 61141 60407 59751 59372 59814 61157 62583 63401 63940 64694 65182 64637
52608 64637 63414 62651 62736 63145 63590 64289 65086 65400 65293 65618 66833 68391 69598 70372 70857 70985 70829 70833 71301
52589 71301 72079 73015 74257 75769 76967 77298 76952 76639 76793 77254 77657 77900 78238 78989 80204 81656 83155
52572 83155 84670 86086 87120 87651 87918 88210 88610 89269 90541 92482 94557 96250 97707 99335 101045 102422
52556 102422 103399 104214 104854 105065 104828 104312 103540 102608 102152 102926 104902 107233 109160 110577 111741 112808 113642
52539 113642 113857 113201 112149 111724 112328 113146 113254 112872 112896 113580 114474 115313 116094 116500 116193 115586 115439 115732 115846
52520 115846 115746 115982 116418 116096 114621 112786 111437 110590 109953 109441 108789 107530 105841 104692 104674 105350 106148
52503A06148R44J059N94j69k98K41M85J49R4Q20J618J729J301P20j10j210j965
52486A12150j799r26O9R69J788K289K120J291K91k60k9O34Q41R4r65j263o88k11
52468A16395m38p83m30M65J053R44N39L57M85O79P31N92L31R2P8M27R97J293Q22
52449A24629l33j414j621q83O7L81j35q45r54m22n8m98j293j486r02k93j67j94
52431A13579J8K32J60R4M76J125J442J152N20L7P3N60Q48L35o28j017m59L33P17
52412A19597R00J138J004K13n73n77L0O22J157J779J979J277L03J37O90Q90L75
52395A30941j26j25m7k45l78j34K03L24L69M50L05j21k53M50J657K409K140J232
52377A39051O16Q77J679K097J631P76L65N96J009J217J214J106R85J031J345J677
$$ plain form
52503 106148 107092 108151 108745 108576 108278 108519 109004 109153 109247 110067 111685 113414 114715 115435 115325 114115 112150
52486 112150 110351 109425 109494 110463 112251 114540 116660 117951 118242 117982 117953 118587 119428 119522 118557 117294 116606 116395
52468 116395 115957 115174 114744 115209 116262 117206 117745 118102 118587 119266 119997 120589 120920 121012 121090 121517 122514 123807 124629
52449 124629 124296 122882 121261 120378 120445 120826 120691 119846 118892 118470 118412 117914 116621 115135 114233 113940 113773 113579
52431 113579 113597 113829 113989 114083 114559 115684 117126 118278 118798 118835 118908 119468 120316 120651 120023 119006 118547 118880 119597
52412 119597 120497 121635 122639 122852 122279 121702 121732 122354 123511 125290 127269 128546 128849 128986 129676 130566 130941
52395 130941 130815 130690 130643 130398 130020 129886 130089 130413 130782 131232 131537 131416 131163 131613 133270 135679 137819 139051
52377 139051 139667 140544 142223 144320 145951 146727 147092 147688 148697 149914 151128 152234 153219 154250 155595 157272
52361A57272J681J380J102J059J258J668K156K386K176J791J615J673J796J987
52347A81000K241K322K117J874J659J042n1o98qJ457K312K185J925K015J900J179
52331B04471M84N65J216J670J598J268J061J177J544J765J467R27R81K052L571
52316B25817M569M611L997L381L422M411N932P095P370P072O873P077P563Q187
52302C07377Q938R740J0398J0769J0835J0611J0166R750R790J0548J1721J2588
52290D33231J2709J2374J2161J2211J2185J1887J1487J1092J0539R727Q787P843
52278E66233O949O280N927N421M157K496J669K126K729K148N45q51j296r98l98
52263F03137J64L71J98M9J14n8o71q82J41J712K268J513Q22J295K436L232L653
$$ plain form
52361 157272 158953 160333 161435 162494 163752 165420 167576 169962 172138 173929 175544 177217 179013 181000
52347 181000 183241 185563 187680 189554 191213 192255 192204 191506 191498 192955 195267 197452 199377 201392 203292 204471
52331 204471 204955 205520 206736 208406 210004 211272 212333 213510 215054 216819 218286 219213 220194 222246 225817
52316 225817 230386 234997 238994 242375 245797 250208 256140 263235 270605 277677 284550 291627 299190 307377
52302 307377 316315 326055 336453 347222 358057 368668 378834 388584 398374 408922 420643 433231
52290 433231 445940 458314 470475 482686 494871 506758 518245 529337 539876 549603 558390 566233
52278 566233 573182 579462 585389 590810 594967 597463 599132 601258 603987 606135 606680 605829 604533 603535 603137
52263 603137 603301 603672 603870 603919 604033 603975 603304 602422 602563 604275 606543 608056 608878 610173 612609 615841 619494
52246F19494M393N580O509O565N987N598N985P026Q133Q843R022Q703Q045P480
52232G17363P399P569P281O295N140M305L713L232L014K891K171O73o95j113j086
52217G68152j661k943m139m712m681m201l653l782m844o002o326o064n954n850
52203G03340n112l985l371l389l381l192l224l267k594j329n51p43j202j252j045
52188F65703q62o23l70l28k88K24Q70O40o25j827k067j578r25k11L94L03o69j787
52170F55974k288k230k038j810j519j412j683k227k843l389l549l112k465k257
52156F23152k401k213j528r80r84j316j772k422l006l061k835l148m000m401l907
52141E85178l282l184l159k629j902j521j382j195j107j258j429j643k350l401
$$ plain form
52246 619494 623887 629467 635976 642541 648528 654126 660111 667137 675270 684113 693135 701838 709883 717363
52232 717363 724762 732331 739612 745907 751047 755352 759065 762297 765311 768202 770373 771046 770351 769238 768152
52217 768152 766491 763548 759409 754697 750016 745815 742162 738380 733536 727534 721208 715144 709190 703340
52203 703340 698228 694243 690872 687483 684102 680910 677686 674419 671825 670496 669945 669202 668000 666748 665703
52188 665703 664841 664218 663848 663520 663232 663456 664326 664966 664341 662514 660447 658869 657944 657733 658127 658430 657761 655974
52170 655974 653686 651456 649418 647608 646089 644677 642994 640767 637924 634535 630986 627874 625409 623152
52156 623152 620751 618538 617010 616030 615046 613730 611958 609536 606530 603469 600634 597486 593486 589085 585178
52141 585178 581896 578712 575553 572924 571022 569501 568119 566924 565817 564559 563130 561487 559137 555736
52127E55736l769k982k038k031k640k842k511k250k208j948j377q59n80l61K0
52112E27360P54J910L113L777M005M659O047P334P778P902Q589R750J0753J1602
52098F15333J2703J3780J4138J3854J3832J4592J5682J6332J6154J5320J4442
52087G76162J4106J4128J3564J1944J0042Q890Q409P720O480N127M000K971J945
52074H85488R91mj252k641l802m610n181n494n430n133m923m927n051n173n087
52059H27771m544l689l154l277l541l253k519j972j697j127K3J273J974K077K141
52044H06486K735L873M950N317M955M383L954L615L349L370L649L775L518L051
52030H60980K430J424J72o90r95j494k787m325n169n250n194n321n575o106p142
$$ plain form
52127 555736 551967 548985 546947 544916 542276 539434 536923 534673 532465 530517 529140 528281 527701 527340 527360
52112 527360 528114 530024 533137 536914 540919 545578 551625 558959 566737 574639 583228 592978 603731 615333
52098 615333 628036 641816 655954 669808 683640 698232 713914 730246 746400 761720 776162
52087 776162 790268 804396 817960 829904 839946 848836 857245 864965 871445 876572 880572 883543 885488
52074 885488 886479 886475 885223 882582 878780 874170 868989 863495 858065 852932 848009 843082 838031 832858 827771
52059 827771 823227 819538 816384 813107 809566 806313 803794 801822 800125 798998 799021 800294 802268 804345 806486
52044 806486 809221 813094 818044 823361 828316 832699 836653 840268 843617 846987 850636 854411 857929 860980
52030 860980 863410 864834 865006 864316 863321 861827 859040 854715 849546 844296 839102 833781 828206 822100 814958
52015H14958q356r131r390r623j0183j1003j1916j2801j3427j3594j3451j3345
52003F78738j3468j3834j4360j4780j4791j4603j4883j5813j6596j6416j5503
51992E13691j4715j4397j4276j4177j4219j4300j4022j3108j1688j0225r375r599
51980C59590j0579j1314j1075j0097r065q334p850p447o893o053n319n306n848
51967B54410n948n153m273m131m340m072l394k967k895k782k591k612k797k874
51953B03581k864k856k622k120j916k301k546j934j083j125j971k603k729k921
51939A71990l140k609j377o78j239k249k619k356k153k212k203j917j455j030
51925A44753q49r77j201j219j033q31o01k59Np0k97k86r5j16l90o14p28r16j095
$$ plain form
52015 814958 806602 797471 788081 778458 768275 757272 745356 732555 719128 705534 692083 678738
52003 678738 665270 651436 637076 622296 607505 592902 578019 562206 545610 529194 513691
51992 513691 498976 484579 470303 456126 441907 427607 413585 400477 388789 378564 369189 359590
51980 359590 349011 337697 326622 316525 307460 299126 291276 283829 276936 270883 265564 260258 254410
51967 254410 248462 243309 239036 234905 230565 226493 223099 220132 217237 214455 211864 209252 206455 203581
51953 203581 200717 197861 195239 193119 191203 188902 186356 184422 183339 182214 180243 177640 174911 171990
51939 171990 168850 166241 164864 164186 162947 160698 158079 155723 153570 151358 149155 147238 145783 144753
51925 144753 143904 142927 141726 140507 139474 138643 138042 137783 137788 137718 137421 137135 137040 136924 136534 135920 135192 134276 133181
51906A33181j065j046j317j445p38N05J145P26k4m81r48j729k304k079j355q67
51890A20159p38n52j38K64M15K26l05r65j303j093p06o55r05r50m87K19P45J007
51872A14238J251J576J607Q56m74j359q98O14J983K391K124J915J973J941J598
51857A31336J238J211J338J084L48k86k93L8N3l11n88o90r85j409j270l50O10
51840A31074R07Q36J003J309J241Q15N16N63P79R54R23N89K18L29Q61J053N69
51823A44539J04K53M78j2r50j494j471j222o83L17J220J260O03J4l22o82q47l41
51805A40764N05R01P87O11K40o29j188k45J644K437J389J32L26J529K233J923
51789A53359J185N04j7k43m1M31R22J261J239Q21N78J208K425L018K400J405J211
$$ plain form
51906 133181 132116 131070 129753 128308 127570 128075 129220 129946 129922 129441 128493 126764 124460 122381 121026 120159
51890 120159 119421 118869 118731 118995 119410 119636 119331 118366 117063 115970 115264 114609 113704 112754 112267 112486 113231 114238
51872 114238 115489 117065 118672 119528 119054 117695 116797 117411 119394 121785 123909 125824 127797 129738 131336
51857 131336 132574 133785 135123 136207 136555 136269 135976 136014 136067 135756 135168 134478 133493 132084 130814 130464 131074
51840 131074 131981 132817 133820 135129 136370 137185 137701 138264 139043 139997 140920 141509 141727 142056 142917 143970 144539
51823 144539 144643 144896 145374 145362 144412 142918 141447 140225 139542 139859 141079 142339 142942 142956 142634 141952 141105 140764
51805 140764 141269 142170 142957 143568 143808 143179 141991 141746 143390 145827 147216 147348 147674 149203 151436 153359
51789 153359 154544 155048 155031 154788 154747 155178 156100 157361 158600 159421 159999 161207 163632 166650 169050 170455 171666
51772A71666J978K945L362L064K587K819M029N199M992L395J664N77k21j049j451
51757B05556j109n53l91n97r76j608k230k084r22M81J283J501J435J060M69K64
51741B01579P87J524J834J715J417Q92K14j06J45M05J91j65j71rr9l03l30l81
51723B09139p75j315j587j573j494j425j469j764j986j449j80Q21Q80M96K51j59
51707A96411j073j853j795j303j159j140n85K20M04k4k79j51r8j46J55P34J055
51690A89373J136J462J873J747J336J678K921L894L798L153K588J792M10r86j690
51675B14485j909k190k381k058j483j292j485j606j643k018k730l335l630l705
51661A83020l397k463j312p64r55j214j221j452k105k506k160j652j715j959j533
$$ plain form
51772 171666 173644 176589 179951 183015 185602 188421 192450 197649 202641 206036 207700 208277 208056 207007 205556
51757 205556 204447 203894 203503 202906 201930 200322 198092 196008 195086 195567 196850 198351 199786 200846 201315 201579
51741 201579 202366 203890 205724 207439 208856 209748 209962 209856 210001 210406 210597 210432 210261 210252 210153 209850 209520 209139
51723 209139 208364 207049 205462 203889 202395 200970 199501 197737 195751 194302 194122 194943 195823 196319 196570 196411
51707 196411 195338 193485 191690 190387 189228 188088 187503 187723 188127 188103 187824 187673 187575 187429 187584 188318 189373
51690 189373 190509 191971 193844 195591 196927 198605 201526 205420 209218 212371 214959 216751 217161 216175 214485
51675 214485 212576 210386 208005 205947 204464 203172 201687 200081 198438 196420 193690 190355 186725 183020
51661 183020 179623 177160 175848 175084 174129 172915 171694 170242 168137 165631 163471 161819 160104 158145 156612
51646A56612o02j04k52l68k33m41j152j604j374j165j645k370k552k213j767j146
51630A37624k23M42L05j55n7N04P23L95M6j05k44j80M18J104J027L47J10N86R06
51611A43573N90K35K73J92m01r05o94j17J75K37M62Q34J195J654K206K464K346
51594A54319K414K942L303K933K309K180K396K339K044K005K152J938J269N65
51580A85108K1n35j083j424j717k331l104l325k534j033M61J349J424J022Q58
51565A73157J378K290K962L124K977K788K689K734K764K411J539N76J04J82L51
51550B02026K29j14k68R9Q34J264Q63L3j89O33J785K330K049J216l1j533k668
51533B08558k742j797n90J48J93l00j015j656k071k255k159j728j217j109j519
$$ plain form
51646 156612 156010 155906 155654 155286 155053 154612 153460 151856 150482 149317 147672 145302 142750 140537 138770 137624
51630 137624 137401 137843 138148 137993 137936 138440 139163 139558 139604 139499 139255 139075 139493 140597 141624 141971 142081 142667 143573
51611 143573 144163 144398 144671 144863 144462 143557 142863 142746 142921 143158 143620 144454 145649 147303 149509 151973 154319
51594 154319 156733 159675 162978 165911 168220 170400 172796 175135 177179 179184 181336 183274 184543 185108
51580 185108 185129 184594 183511 182087 180370 178039 174935 171610 169076 168043 168504 169853 171277 172299 173157
51565 173157 174535 176825 179787 182911 185888 188676 191365 194099 196863 199274 200813 201389 201493 201675 202026
51550 202026 202255 202141 201873 201972 202806 204070 204933 204966 204777 205410 207195 209525 211574 212790 212759 211226 208558
51533 208558 205816 204019 203429 203577 203770 203470 202455 200799 198728 196473 194314 192586 191369 190260 188741
51518A88741j984k010j646j280j177j335j596j689j410q41k06M23J005J252J009
51503A77256O89P83R92O65K3m3N24P38J85k45R2M76J34k91K68J499K067J522P59
51484A88093O93J276J968K365K386K262K420L030L756M173M228M071L729L317
51470B27767L135L253L293K984K555K263K027J807J786J844J441N21j50p1J62
51455B54617j95r17j338j439j607j758j565j243j283j664j980k192k550l000l289
51440B28597l420l557l674l747l878l840l096j779r63j304k025k068j613j476
51426A92157j633j455r55o67n68k19K26K64J06M50J241J694J579J441J490J241
51410A96392M30n32j258j772k121k286k552l302m322m908m761m220l641l115k752
$$ plain form
51518 188741 186757 184747 183101 181821 180644 179309 177713 176024 174614 173773 173567 173990 174995 176247 177256
51503 177256 177945 178728 179720 180385 180408 180365 180889 181627 181812 181567 181659 182135 182269 181978 182246 183745 185812 187334 188093
51484 188093 188786 190062 192030 194395 196781 199043 201463 204493 208249 212422 216650 220721 224450 227767
51470 227767 230902 234155 237448 240432 242987 245250 247277 249084 250870 252714 254155 254676 254526 254455 254617
51455 254617 254422 253505 252167 250728 249121 247363 245798 244555 243272 241608 239628 237436 234886 231886 228597
51440 228597 225177 221620 217946 214199 210321 206481 203385 201606 200643 199339 197314 195246 193633 192157
51426 192157 190524 189069 188114 187447 186879 186660 186886 187150 187256 187706 188947 190641 192220 193661 195151 196392
51410 196392 196822 196290 195032 193260 191139 188853 186301 182999 178677 173769 169008 164788 161147 158032 155280
51395A55280k626k500k118j641j367j176q50o49r07j365j592j757k215k652k501
51380A29364j935j542j290p57j74j81p26j194j495j912k081j326q8L24m00j122
51364A13465j022o11n81p01m99j51l0j3J67L58K94M2j53j36J67O91J068J023Q21
51345A14199Q42Q82N42J59M70J365J900J662J205J020R83J055J600K588L331L354
51329A37157K939K470J931J341R47O35j62j558k816l244l000k659k475k420k513
51314A26573k708k821k736k514k204j876j730j826j842j516j147j100j123p83
51300A00647l64n02j117j494j374j118q83n07j49j41l07k28n1j55k33K90J098
51283I3412J398J244J246J120J06j280j484l13O35L33l97n78m44l28K85J559K399
$$ plain form
51395 155280 152654 150154 148036 146395 145028 143852 143002 142353 141446 140081 138489 136732 134517 131865 129364
51380 129364 127429 125887 124597 123840 123666 123485 122759 121565 120070 118158 116077 114751 114663 114987 114587 113465
51364 113465 112443 111832 111251 110550 110051 109900 109870 109857 110024 110382 110676 110718 110565 110429 110596 111287 112355 113378 114199
51345 114199 115041 115923 116465 116624 117094 118459 120359 122021 123226 124246 125229 126284 127884 130472 133803 137157
51329 137157 140096 142566 144497 145838 146785 147420 147258 145700 142884 139640 136640 133981 131506 129086 126573
51314 126573 123865 121044 118308 115794 113590 111714 109984 108158 106316 104800 103653 102553 101430 100647
51300 100647 100283 99781 98664 97170 95796 94678 93795 93288 93139 92998 92691 92463 92412 92257 92024 92314 93412
51283 93412 94810 96054 97300 98420 98526 97246 95762 95449 96084 96417 96020 95442 94998 94670 94955 96514 98913
51266I8913J914Q38L77N12M46l8o88j553k617l197k672j443m50n7LJ3J30M23O73
51247I1527N66L30N30J051J171Q93J095J951K315J399n7r66j245j176n80M07P79
51230I9990K8p57k90J099K081K081J413L66p23j106n12J37k6m01J06J176J541
51213A06203J023O99J057J251N19o79j321j058m35j96m70o09kR21J132N09O3K82
51195A08889K78o69j759j870j230p56m85P7O37N29J02K52P74N49o55j809k165
51178A00689j988j617r52j28K60Km41p54j153j681j840j281k63P25J344J260K81
51161I2463j095j804j308k09M48L33M2K58R32J355J081N52M85Q00P90L50K41Q36
51143I6550J426J255N58l8m76r94j432j500j255p70O5Q37N17j087k547k421j101
$$ plain form
51266 98913 100827 101665 102042 102554 103000 102962 102274 100721 98104 94907 92235 90792 90342 90285 90288 90301 90431 90854 91527
51247 91527 92093 92423 92953 94004 95175 96068 97163 99114 101429 102828 102771 101805 100560 99384 98804 99211 99990
51230 99990 100018 99261 98971 100070 102151 104232 105645 106011 105288 104182 103670 103807 103781 103380 103486 104662 106203
51213 106203 107226 107925 108982 110233 110752 110073 108752 107694 107259 107063 106593 105984 105982 106903 108035 108544 108607 108889
51195 108889 109167 108498 106739 104869 103639 102883 102398 102475 103112 103641 103743 103995 104769 105318 104663 102854 100689
51178 100689 98701 97084 96132 96004 96264 96266 95825 95071 93918 92237 90397 89116 88853 89578 90922 92182 92463
51161 92463 91368 89564 88256 88047 88495 88828 88870 89128 90060 91415 92496 93048 93533 94333 95123 95473 95714 96550
51143 96550 97976 99231 99789 99751 99275 98281 96849 95349 94094 93324 93389 94226 94743 93656 91109 88688 87587
51126H7587kL77M98M57%m79l24J69J60k01N0J010J663J478J024Q09O26L97N04
51107I5803R26J034O55L92N22N32K26K68R73J447Q15l19o23P7O33K43m53l18P62
51088A03595J751J749R76K60m3j79k18Q4N38M62k45o53o3R17J234Q77O32Q32J116
51069A13622J211J125Q03L18J28M76P89N07J40N50J436J598O32o12j264j182n11
51052A19766N02J137O81m87j121o89K0J36k35m21n1P78J641J927J358L96l05p68
51034A24265j332j715j277k41L72J46k25q0M32R41J360J582J426J113J132J358
51018A29257J144M50O8M14R39J139J293J701J993J807J547J820K590L376L916
51003A53454M165M074L708L375L286L398L697M213M665M684M548N070O434P768
$$ plain form
51126 87587 87585 87962 88460 88917 88917 88438 88114 88283 88443 88242 88292 89302 90965 92443 93467 94276 94902 95299 95803
51107 95803 96729 97763 98418 98810 99332 99864 100090 100358 101331 102778 103593 103274 102651 102728 103361 103604 103151 102833 103595
51088 103595 105346 107095 108071 108331 108288 108109 107891 107975 108513 108975 108730 108077 108014 108931 110165 111042 111674 112506 113622
51069 113622 114833 115958 116761 117079 117207 117683 118472 118979 119119 119669 121105 122703 123335 122723 121459 120277 119766
51052 119766 120268 121405 122086 121599 120478 119789 119809 119945 119710 119289 119238 120016 121657 123584 124942 125338 125033 124265
51034 124265 122933 121218 119941 119700 120072 120218 119993 119913 120345 121286 122646 124228 125654 126767 127899 129257
51018 129257 130401 130851 130919 131333 132272 133411 134704 136405 138398 140205 141752 143572 146162 149538 153454
51003 153454 157619 161693 165401 168776 172062 175460 179157 183370 188035 192719 197267 202337 208771 216539
50989B16539Q264Q221Q478R341J0532J1853J3360J5065J6886J8723K0426K1856
50977C79544K3167K4775K6908K9381L1949L4566L7178L9557M1450M2687M3218
50966G54380M3237M3144M2958M1943L9325L5374L1136K7226K3457J9631J5921
50955A117732J2333Q572M730J461q00k224k945k674j357L49J637K289K480K192
50941A143775J083j158m501q460j2308j5678j8865k2229k5601k8711l1824l5246
50929I40277l8461m0619m1744m2484m2756m1714l9227l6323l3812l1439k8767
50918E22931k5944k3156k0167j7033j4445j2827j1629j0146q393o717n104l431
50906C63939j895p36P9N62O35N84R53J593J604O93j83r0O21J024R49R15J190J631
$$ plain form
50989 216539 224803 233024 241502 250843 261375 273228 286588 301653 318539 337262 357688 379544
50977 379544 402711 427486 454394 483775 515724 550290 587468 627025 668475 711162 754380
50966 754380 797617 840761 883719 925662 964987 1000361 1031497 1058723 1082180 1101811 1117732
50955 1117732 1130065 1138637 1143367 1144828 1144028 1141804 1138859 1136185 1134828 1135177 1136814 1139103 1141583 1143775
50941 1143775 1144858 1143700 1139199 1130739 1118431 1102753 1083888 1061659 1036058 1007347 975523 940277
50929 940277 901816 861197 819453 776969 734213 692499 653272 616949 583137 551698 522931
50918 522931 496987 473831 453664 436631 422186 409359 397730 387584 379191 372474 367370 363939
50906 363939 362044 361308 361387 361949 362584 363168 364121 365714 367318 368011 367828 367738 368359 369383 370332 371247 372437 374068
50888C74068K069K238J748P29J24P21K149L446M276M960N641O125O462P047Q143
50873D29946R688J1517J3448J5272J6970J8770K0797K2881K5019K7693L1393L6056
50861F79450M1230M6582N1991N7371O2679O7943P3198P8481Q3918Q9354R4101
50850A426298R7489R9624J00869J00647R7665R1474Q2946P2846O1069M7746L4194
50839B312867K1874J1114J694o076j1697j5366j7456j7544j4928r941l831K467
50827B253177Q583J3757J6588J6021J2002N038m380j5698k8035m0394n2128o3110
50815B121421p3459q2955r0836r6367r9522j00693r9821r6428r0645q3525p6098
50804A131072o8631o1144n3860m6798l9624l2478k6267k1509j7427j2893p768
$$ plain form
50888 374068 376137 378375 380123 380852 380976 381697 383846 387292 391568 396528 402169 408294 414756 421803 429946
50873 429946 439634 451151 464599 479871 496841 515611 536408 559289 584308 612001 643394 679450
50861 679450 720680 767262 819253 876624 939303 1007246 1080444 1158925 1242843 1332197 1426298
50850 1426298 1523787 1623411 1724280 1824927 1922592 2014066 2097012 2169858 2230927 2278673 2312867
50839 2312867 2334741 2345855 2347549 2341473 2329776 2314410 2296954 2279410 2264482 2254541 2250710 2253177
50827 2253177 2261760 2275517 2292105 2308126 2320128 2325166 2320786 2305088 2277053 2236659 2184531 2121421
50815 2121421 2047962 1965007 1874171 1777804 1678282 1577589 1477768 1381340 1290695 1207170 1131072
50804 1131072 1062441 1001297 947437 900639 861015 828537 802270 780761 763334 750441 742673
50793G42673k737J722N437Q074R465J0073J0390J0107Q684O467M460L022J593
50780H19430l01k470m532o390q061r547j0944j2425j3984j5430j6543j7067j6772
50767F84964j5805j4671j3619j2348j0617q794p304n945m189j925N34K962N270
50754E98513P342R192J1074J3046J4821J6350J8200K0846K4012K7123L0079L3179
50742H23777L6669M0873M6096N1910N7089O0934O4094O7302O9871P0431O8667
50731A457713O5250O0391N3701M5360L6254K6782J6574N561n488j5741k4738l1884
50719A689735l6360l7944l7218l4702l0431k4658j8293j2236o732j769K306M962
50707A456660N897N031K337k120q282j6257k5942l6304m5566n2393n6658n8874
$$ plain form
50793 742673 739936 741658 747095 755169 764634 774707 785097 795204 803888 810355 814815 817837 819430
50780 819430 819129 816659 812127 805737 797676 788129 777185 764760 750776 735346 718803 701736 684964
50767 684964 669159 654488 640869 628521 617904 609110 601806 595861 591672 589747 590281 593243 598513
50754 598513 605855 615047 626121 639167 653988 670338 688538 709384 733396 760519 790598 823777
50742 823777 860446 901319 947415 999325 1056414 1117348 1181442 1248744 1318615 1389046 1457713
50731 1457713 1522963 1583354 1637055 1682415 1718669 1745451 1762025 1767586 1762098 1746357 1721619 1689735
50719 1689735 1653375 1615431 1578213 1543511 1513080 1488422 1470129 1457893 1451161 1449392 1451698 1456660
50707 1456660 1462557 1467588 1469925 1467805 1459523 1443266 1417324 1381020 1335454 1283061 1226403 1167529
50695A167529n9296n7914n4996n1179m7005m2542l7561l1997k6249k0927j6309
50684G21554j2144q050l892L87M892R503J3713J7207K0283K3323K6056K7915K8897
50671H69644K9510K9841K9329K7622K5131K2520K0017J7442J4701J1987R642P813
50659A115199O269M625K839J365N96M26N59R82J835L039M496O444R130J2223J4988
50644A185015J7006J8486J9839K1311K2852K4010K4053K2644K0336J8044J6086
50633A409682J4054J1484Q363N028K039J9p34m98L00J696L999P145J0639J4062
50619A487278J7189J9602K0624J9788J7059J2651P007R54m548r075j2929j6571
50607A559029k0029k2966k5241k7259k9750l3142l7183m1236m4862m7872n0026
$$ plain form
50695 1167529 1108233 1050319 995323 944144 897139 854597 817036 785039 758790 737863 721554
50684 721554 709410 701360 697468 697855 702747 712250 725963 743170 763453 786776 812832 840747 869644
50671 869644 899154 928995 958324 985946 1011077 1033597 1053614 1071056 1085757 1097744 1107386 1115199
50659 1115199 1121468 1126093 1128932 1130297 1130893 1131319 1131878 1132860 1134695 1137734 1142230 1148674 1157804 1170027 1185015
50644 1185015 1202021 1220507 1240346 1261657 1284509 1308519 1332572 1355216 1375552 1393596 1409682
50633 1409682 1423736 1435220 1443583 1448611 1450650 1450669 1449935 1449437 1449737 1451433 1455432 1462577 1473216 1487278
50619 1487278 1504467 1524069 1544693 1564481 1581540 1594191 1601198 1602152 1597604 1588529 1575600 1559029
50607 1559029 1539000 1516034 1490793 1463534 1433784 1400642 1363459 1322223 1277361 1229489 1179463
50596A179463n1024n0925n0116m8810m6941m4606m2073l9264l5860l2090k8741
50585G09013k6005k3151j9770j6639j4604j3260j1588r404p283n433l514j476
50573E56886L54J938L596N353O873Q056R164J0372J1634J2968J4503J6255J8228
50560F76180K0553K3165K5621K7594K9321L1138L2804L3783L3893L3344L2456
50549I99852L1613L1128L0796L0213K9777L0621L2932L5330L6732L7868L9869
50538A366731M2204M3486M3788M4531M6407M8832N1414N4391N7498N9811O1043
50527A920136O1786O2177O1520N9542N6796N3358M8231M0745L1601K1939J2116
50516B429947J927q632j9340k9947l9954m8721n6024o1957o6177o7959o7226o4675
$$ plain form
50596 1179463 1128439 1077514 1027398 978588 931647 887041 844968 805704 769844 737754 709013
50585 709013 683008 659857 640087 623448 608844 595584 583996 574592 567309 561876 558362 556886
50573 556886 557240 559178 562774 568127 575000 583056 592220 602592 614226 627194 641697 657952 676180
50560 676180 696733 719898 745519 773113 802434 833572 866376 900159 934052 967396 999852
50549 999852 1031465 1062593 1093389 1123602 1153379 1184000 1216932 1252262 1288994 1326862 1366731
50538 1366731 1408935 1452421 1496209 1540740 1587147 1635979 1687393 1741784 1799282 1859093 1920136
50527 1920136 1981922 2044099 2105619 2165161 2221957 2275315 2323546 2364291 2395892 2417831 2429947
50516 2429947 2431874 2423242 2403902 2373955 2334001 2285280 2229256 2167299 2101122 2033163 1965937 1901262
50504A901262o0627n4598m6414l7019k7651j8902j1033m520L40L929O894R541
50492A661202J1951J4145J5762J6013J4337J0691M885l711j5270k8625m1845n3511
50480A606024o3100p0399p5050p6780p5883p3292p0001o6365o2087n7057n1775
50469H64235m6716m1744l6653l1857k7861k4449k1120j8006j5437j2981r949o717
50457E70745m437l357k487j019Q86K862M817O468P378P796Q515R680J0644J1234
50443F29725J2119J3579J4941J5703J6239J6916J7465J7801J8554K0067K1730
50432H14839K2891K3780K4939K6408K8027K9829L1637L2952L3721L4583L5905
50421A139511L7264L8403L9811M1839M3976M5619M6800M7428M6719M4197M0601
$$ plain form
50504 1901262 1840635 1786037 1739623 1702604 1674953 1656051 1645018 1640498 1640838 1644767 1651661 1661202
50492 1661202 1673153 1687298 1703060 1719073 1733410 1744101 1748986 1745275 1730005 1701380 1659535 1606024
50480 1606024 1542924 1472525 1397475 1320695 1244812 1171520 1101519 1035154 973067 916010 864235
50469 864235 817519 775775 739122 707265 679404 654955 633835 615829 600392 587411 577462 570745
50457 570745 566308 562951 560464 559445 560331 563193 568010 574478 581856 589652 598167 607847 618491 629725
50443 629725 641844 655423 670364 686067 702306 719222 736687 754488 773042 793109 814839
50432 814839 837730 861510 886449 912857 940884 970713 1002350 1035302 1069023 1103606 1139511
50421 1139511 1176775 1215178 1254989 1296828 1340804 1386423 1433223 1480651 1527370 1571567 1612168
50410A612168L6965L3243K8699K3147J7074J0839M466k058q830j6046k3455l0309
50398A685903l6263m1924m7952n4029n9244o3010o5090o5313o3830o1277n8108
50387A069863n4174m9298m3790l7936l1600k4855j8413j2784p631k424K710P333
50375G97001J1322J4579J6744J7705J7788J6882J4086Q950K361m469j1207j7756
50363H83986k3246k6683k8238k8849k8971k8587k7993k7516k6695k4787k1996
50352E90425j9403j7705j6692j5771j4467j2626j0653r228q340p148n387m092
50340D48913m058m367l626k002p23P1J345L218M546M840N115O302P905Q850Q904
50325D85233Q596Q352Q356Q785R697J0880J2083J3197J4078J4581J4798J4987
$$ plain form
50410 1612168 1649133 1682376 1711075 1734222 1751296 1762135 1766601 1764543 1755713 1739667 1716212 1685903
50398 1685903 1649640 1607716 1559764 1505735 1446491 1383481 1318391 1253078 1189248 1127971 1069863
50387 1069863 1015689 966391 922601 884665 853065 828210 809797 797013 789382 786958 789668 797001
50375 797001 808323 822902 839646 857351 875139 892021 906107 915057 917418 912949 901742 883986
50363 883986 860740 834057 805819 776970 747999 719412 691419 663903 637208 612421 590425
50352 590425 571022 553317 536625 520854 506387 493761 483108 473880 465540 458392 453005 448913
50340 448913 444855 440488 436862 434860 434137 434208 435553 438771 443317 448157 453272 459574 467479 476329 485233
50325 485233 493829 502181 510537 519322 529019 539899 551982 565179 579257 593838 608636 623623
50313F23623J5185J5230J5167J5321J5851J6618J7439J8181J8568J8265J7211
50302H06659J5663J3942J2246J0660R128P534N887M171K021j003m660q081j0836
50289H63331j3419j6267j9019k1173k2832k4065k4279k3100k1372k0334k0076
50278F37395j9791j9166j8490j7628j6002j3617j1201r244p701o645o230n875
50266D85805m540k171j05M57k26r21p45L94K062L592M388M342L874L416K988K348
50250E04958J403M63P6M85J182J331P56P3l50r04j814k458k364k275l157m573
50234D92832n168m652m131m306m525l966k868k041j748j615j267o35J51R31J660
50219D58652K441L208L589L423L214L508L956L594K117L59o20n22J31N22J09r42
$$ plain form
50313 623623 638808 654038 669205 684526 700377 716995 734434 752615 771183 789448 806659
50302 806659 822322 836264 848510 859170 868298 875832 881719 885890 887911 886908 882248 874167 863331
50289 863331 849912 833645 814626 793453 770621 746556 722277 699177 677805 657471 637395
50278 637395 617604 598438 579948 562320 546318 532701 521500 512256 504555 497910 491680 485805
50266 485805 481265 479094 478989 479446 479220 478299 477554 477948 480010 483602 487990 492332 496206 499622 502610 504958
50250 504958 506361 506824 506900 507385 508567 509898 510654 510727 510377 509473 507659 505201 502837 500562 497405 492832
50234 492832 487664 483012 478881 474575 470050 466084 463216 461175 459427 457812 456545 455910 456061 456992 458652
50219 458652 461093 464301 467890 471313 474527 478035 481991 485585 487702 488061 487441 486919 487050 487572 487681 486739
50203D86739j899k337k674l468m458m962m992n206n770o057n673n117n099n628
50189D23399o152o230n906n571n571n801n754n112m143l307k744k406k351k435
50175C59916k113j133j51l0p20j431j735j853k088k574l420m450m938m328l097
50160C25855k241k062k093k059k068k027j757j573j902k308j893o76K53J92m60
50145C03181j064j467j567j085j35O43R04R86J182J257J003P10P14J010J502K196
50129C09970K923L350L504L828M514N158N252M674L758L192L648M949N815N208
50115C69743L735K929L210L564L263K724K427K084J451J048J411K274L008L322
50101D06193L195K741K534L259M652N505N284M977N701P134Q066Q009P506P204
$$ plain form
50203 486739 484840 482503 479829 476361 471903 466941 461949 456743 450973 444916 439243 434126 429027 423399
50189 423399 417247 411017 405111 399540 393969 388168 382414 377302 373159 369852 367108 364702 362351 359916
50175 359916 357803 356670 356519 356489 355769 354338 352603 350750 348662 346088 342668 338218 333280 328952 325855
50160 325855 323614 321552 319459 317400 315332 313305 311548 309975 308073 305765 303872 303196 303449 303641 303181
50145 303181 302117 300650 299083 297998 297863 298506 299410 300396 301578 302835 303838 304548 305262 306272 307774 309970
50129 309970 312893 316243 319747 323575 328089 333247 338499 343173 346931 350123 353771 358720 364535 369743
50115 369743 373478 376407 379617 383181 386444 389168 391595 393679 395130 396178 397589 399863 402871 406193
50101 406193 409388 412129 414663 417922 422574 428079 433363 438340 444041 451175 459241 467250 474756 481960
50087D81960P354P962Q870R734J0401J1158J2244J3444J4498J5646J7264J9155
50075F29690K0751K1904K3155K5209K8318L2186L6226M0075M3945M8345N3477
50064A003281N8979O4194O8326P0343O9192O4499N6863M7511L7810K9044K2112
50053A592154J7321J4551J3619J4095J4971J5008J3461J0000M086m888j6630k9704
50041A658044m2379n3465o2295o8520p2053p2899p1050o6935o1750n6685n1879
50030I78134m6825m1610l6942l2962k9018k4865k1132j8255j5784j3187j0645
50019F86909q528o791n274m103l298k519j589q74p06q86j052j165j315j503j826
50004F45480k524l572m585n326n904o396o703o844p003p176p214p156p062o705
$$ plain form
50087 481960 489314 497276 506146 515880 526281 537439 549683 563127 577625 593271 610535 629690
50075 629690 650441 672345 695500 720709 749027 781213 817439 857514 901459 949804 1003281
50064 1003281 1062260 1126454 1194780 1265123 1334315 1398814 1455677 1503188 1540998 1570042 1592154
50053 1592154 1609475 1624026 1637645 1651740 1666711 1681719 1695180 1705180 1709266 1704378 1687748 1658044
50041 1658044 1615665 1562200 1499905 1431385 1359332 1286433 1215383 1148448 1086698 1030013 978134
50030 978134 931309 889699 852757 819795 790777 765912 744780 726525 710741 697554 686909
50019 686909 678381 671590 666316 662213 658915 656396 654807 653933 653227 652341 651289 650124 648809 647306 645480
50004 645480 642956 639384 634799 629473 623569 617173 610470 603626 596623 589447 582233 575077 568015 561310
49990E61310o021n558n718n857n089l768k984k763k105q38R1M17J047K280L112
49975E27556L045L076L996N147N863O772Q365R633R565R052R675J1329J2641J3237
49961F38952J4024J5520J7393J9601K2626K6487L0623L4932L9914M5726N1987
49950I57785N8586O5843P3678Q1257Q7555R1653R2526Q9338Q2369P3224O3898
49939A817712N5684M8947M3641L9872L7926L7607L7835L7385L5753L2552K6246
49928B251160J4927j223j9380l6670n2247o6082p7144q4212q7801q9703r0957
49917A660668r1300r0337q8080q4550p9893p4834p0177o5932o1603n7019n2186
49906H44757m6885m1231l6152l2389k9481k6618k3931k1840j9787j6971j3945
$$ plain form
49990 561310 555289 549731 544013 538156 533067 529299 526315 523552 521447 520609 520700 521117 522164 524444 527556
49975 527556 530601 533677 537673 542820 548683 555455 563820 573453 583018 592070 601745 613074 625715 638952
49961 638952 652976 668496 685889 705490 728116 754603 785226 820158 860072 905798 957785
49950 957785 1016371 1082214 1155892 1237149 1324704 1416357 1508883 1598221 1680590 1753814 1817712
49939 1817712 1873396 1922343 1965984 2005856 2043782 2081389 2119224 2156609 2192362 2224914 2251160
49928 2251160 2266087 2264864 2245484 2208814 2156567 2090485 2013341 1929129 1841328 1751625 1660668
49917 1660668 1569368 1479031 1390951 1306401 1226508 1151674 1081497 1015565 953962 896943 844757
49906 844757 797872 756641 720489 688100 658619 632001 608070 586230 566443 549472 535527
49895E35527j1993j1217j0625r989r995j0588j0746j0171r748r901r886r216q507
49882D02945q275q077p508o987o759o154m695l103k327k206j965j487j211j178
49868C41013j081r87j226j562j253k6J462K382K582K526K596K662K417J973J844
49853C55322K276K791K737K147J736K105L182M410N252N581N784O316P092P616
49839D14347P971R119J1733J5127J8034K0176K2378K5325K8941L2966L7361M2089
49827F85567M7050N2323N7879O3011O6467O7273O5026N9657N1579M2012L2496
49816A290340K3964J6744J1398Q773R038J1292J4207J6563J7085J4462P907k588
49804A439185j6427l2279m7903o0913p0113p5696p8145p7617p4485o9673o3973
$$ plain form
49895 535527 523534 512317 501692 491703 481708 471120 460374 450203 440455 430554 420668 411452 402945
49882 402945 394670 386593 379085 372098 365339 359185 354490 351387 349060 346854 344889 343402 342191 341013
49868 341013 339932 338945 337719 336157 334904 334878 336340 338722 341304 343830 346426 349088 351505 353478 355322
49853 355322 357598 360389 363126 365273 367009 369114 372296 376706 381958 387539 393323 399639 406731 414347
49839 414347 422318 431437 443170 458297 476331 496507 518885 544210 573151 606117 643478 685567
49827 685567 732617 784940 842819 905830 972297 1039570 1104596 1164253 1215832 1257844 1290340
49816 1290340 1314304 1331048 1342446 1351219 1360257 1371549 1385756 1402319 1419404 1433866 1441773 1439185
49804 1439185 1422758 1390479 1342576 1281663 1211550 1135854 1057709 980092 905607 835934 771961
49793G71961n7587n0730m4169l8718l4435l0727k7077k3438k0104j7353j5170
49782D12453j3318j1709j0510r621q425o630n016m587n064n119m169l085k736
49769C22464k731k224j321q64j136j431j009K1R29J222J051Q21O07J74m59q64
49753C15250p59l91q6K13O02P75M61M8J41O39Q73O56N53J021J799K288K204J694
49735C27981J143Q49P77O75O25R82J607J707J027M70P83J216N66q07j389p36M
49718C37480j2k73j03K48L40L67N62O38M45M45Q78J161Q42N19R54J746J797Q94
49700C48928Oq0L88P51Q53J010J332J534J427J269J389J580J286M39l44o00o15
49683C60553p54q15n49l23n44p68l34M80Q32O79P40J119J125N58Q8J22K63K44
$$ plain form
49793 771961 714374 663644 619475 580757 546322 515595 488518 465080 444976 427623 412453
49782 412453 399135 387426 376916 367295 358870 352240 347224 342637 337573 332454 328285 325200 322464
49769 322464 319733 317509 316188 315324 314188 312757 311748 311769 312698 313920 314971 315792 316399 316573 316114 315250
49753 315250 314491 314100 314014 314227 314829 315604 316065 316113 316254 316893 317766 318422 318975 319996 321795 324083 326287 327981
49735 327981 329124 329973 330750 331425 332050 333032 334639 336346 337373 337843 338626 339842 340408 339601 338212 337476 337480
49718 337480 337468 337195 337092 337340 337680 338047 338609 339247 339692 340137 341015 342176 343018 343537 344491 346237 348034 348928
49700 348928 348934 348854 349242 349993 350846 351856 353188 354722 356149 357418 358807 360387 361673 362112 361768 361168 360553
49683 360553 359799 358984 358435 358112 357568 356800 356466 356946 357778 358457 359197 360316 361441 361999 362087 362209 362472 362716
49665C62716L22M25p8j132j583p60M18P33L60L23P95J036P46M83O77J003R66O01
49647C68051K73N7l39j022j508j161r6P66P61K32j69l71n28k73O73J558J387M74
49629C68765K6K75L09q9pQ43J440J247J229K100K865K357J212Q85J470J962K150
49612C89039K756L814M402M115L669L777M260M598M646M575M621N066N992O979
49598D52309P482P573P904Q797R735R891R038P855P392Q085R324J0210J0703J1480
49584E77778J2725J3724J4037J4299J5256J6636J7590J7884J7956J8248J9039
49573G55172K0605K2775K4645K5456K5545K5741K6204K6549K6895K7760K8971
49562A036318K9652K9486K9172K9321K9637K9586K9282K9137K9003K8195K6310
$$ plain form
49665 362716 363038 363463 363385 362253 360670 359910 360328 361061 361421 361744 362539 363575 364321 364804 365481 366484 367450 368051
49647 368051 368324 368381 368042 367020 365512 364351 364255 365021 365782 366014 365845 365474 364946 364673 365346 366904 368291 368765
49629 368765 368791 369066 369375 369286 369279 370122 371562 372809 374038 376138 379003 381360 382572 383457 384927 386889 389039
49612 389039 391795 395609 400011 404126 407795 411572 415832 420430 425076 429651 434272 439338 445330 452309
49598 452309 459791 467364 475268 484065 493800 503691 512729 520584 527976 536061 545385 555595 566298 577778
49584 577778 590503 604227 618264 632563 647819 664455 682045 699929 717885 736133 755172
49573 755172 775777 798552 823197 848653 874198 899939 926143 952692 979587 1007347 1036318
49562 1036318 1065970 1095456 1124628 1153949 1183586 1213172 1242454 1271591 1300594 1328789 1355099
49551A355099K3757K1338J9422J7591J5133J1909Q523N575L033N67j778l719n319
49538A471131o950q611r744r924r475r145r275r478r123q015o517n079l823k588
49524A363384j170O43K978N529P628R062J0476J2446J4444J5521J5835J6443J7556
49511A490775J8160J7666J6823J6341J5699J4152J1990R784P137L447n69l468
49499A617937n107o870r772j3402j6958k0326k3646k6597k8729l0129l1268l2455
49487A372678l3699l4937l6037l6732l6731l5981l4736l3366l2034l0551k8750
$$ plain form
49551 1355099 1378856 1400194 1419616 1437207 1452340 1464249 1472772 1478347 1481380 1481947 1480169 1476450 1471131
49538 1471131 1464181 1455570 1445826 1435902 1426427 1417282 1408007 1398529 1389406 1381391 1374874 1369795 1365972 1363384
49524 1363384 1362214 1362857 1365835 1371364 1378992 1388054 1398530 1410976 1425420 1440941 1456776 1473219 1490775
49511 1490775 1508935 1526601 1543424 1559765 1575464 1589616 1601606 1611390 1618527 1621974 1621405 1617937
49499 1617937 1612830 1605960 1596188 1582786 1565828 1545502 1521856 1495259 1466530 1436401 1405133 1372678
49487 1372678 1338979 1304042 1268005 1231273 1194542 1158561 1123825 1090459 1058425 1027874 999124
$$ [...]
##END NTUPLES=NMR SPECTRUM
##END=
