##TITLE=NES1072_159122.0001_001_9705742_Jn1s7h4oia
##JCAMPDX= 6.0         $$ Bruker NMR JCAMP-DX V2.0
##DATA TYPE= NMR SPECTRUM
##DATA CLASS= NTUPLES
##ORIGIN= BRUKER
##OWNER= Administrator
$$ 1.72 TOPSPIN		Version 2.1
$$ 2016-05-01 14:34:06.942 -0700  Administrator@X
$$ Compression mode = diff/dup
##.OBSERVE FREQUENCY= 400.02188249412
##.OBSERVE NUCLEUS= ^1H
##.ACQUISITION MODE= SIMULTANEOUS (DQD)
##.ACQUISITION SCHEME= undefined
##.AVERAGES= 8
##.DIGITISER RES= 22
##SPECTROMETER/DATA SYSTEM= spect
##.PULSE SEQUENCE= zg30
##.SOLVENT NAME= COFFEE_meoh
##.SHIFT REFERENCE= INTERNAL, COFFEE_meoh, 1, 14.98509
##AUDIT TRAIL= $$ (NUMBER, WHEN, WHO, WHERE, PROCESS, VERSION, WHAT)
$$ ##TITLE= Audit trail, TOPSPIN		Version 2.1
$$ ##JCAMPDX= 5.01
$$ ##ORIGIN= Bruker BioSpin GmbH
$$ ##OWNER= Administrator
$$ $$ E:\/data/COFFEE/nmr/NES1072_159122.0001_001_9705742_Jn1s7h4oia/10/pdata/1/auditp.txt
$$ ##AUDIT TRAIL=  $$ (NUMBER, WHEN, WHO, WHERE, PROCESS, VERSION, WHAT)
(   1,<2016-05-01 14:33:59.927 -0700>,<Administrator>,<X>,<go>,<TOPSPIN 2.1>,
      <created by zg
	started at 2016-05-01 14:32:53.692 -0700,
	POWCHK enabled, PULCHK disabled,
       configuration hash MD5:
       21 0F 79 D6 B3 7B B4 F6 88 20 88 DB 03 48 BD 9F
       data hash MD5: 64K
       30 8C FB 9D D7 BD 71 56 38 40 BE 08 06 C3 FB CD>)
(   2,<2016-05-01 14:34:03.021 -0700>,<Administrator>,<X>,<proc1d>,<TOPSPIN 2.1>,
      <Start of raw data processing
       efp LB = 0 FT_mod = 6 PKNL = 1 PHC0 = 0 PHC1 = 0 SI = 32K 
       data hash MD5: 32K
       BE 4C 4D D6 99 42 FE 9C B0 41 DC 70 10 EA BC 70>)
(   3,<2016-05-01 14:34:03.286 -0700>,<Administrator>,<X>,<proc1d>,<TOPSPIN 2.1>,
      <pk PHC0 = 95.48218 PHC1 = 0 
       data hash MD5: 32K
       2E 22 A9 0B A9 C6 3E DF F1 95 28 71 C3 FF B0 CA>)
(   4,<2016-05-01 14:34:03.396 -0700>,<Administrator>,<X>,<proc1d>,<TOPSPIN 2.1>,
      <abs ABSG = 1 
       data hash MD5: 32K
       DC 09 71 BD 1C 93 DC F7 65 7F 2B 56 DF 5A BC 4D>)
(   5,<2016-05-01 14:34:03.442 -0700>,<Administrator>,<X>,<proc1d>,<TOPSPIN 2.1>,
      <abs ABSG = 2 
       data hash MD5: 32K
       1E 4C 1B 62 39 35 77 C3 7F 7C 5B 36 CF 55 F8 AC>)
(   6,<2016-05-01 14:34:03.521 -0700>,<Administrator>,<X>,<proc1d>,<TOPSPIN 2.1>,
      <abs ABSG = 3 
       data hash MD5: 32K
       C2 3C 36 D1 82 AA 6F 43 A4 93 36 46 A1 6B E9 B6>)
(   7,<2016-05-01 14:34:03.567 -0700>,<Administrator>,<X>,<proc1d>,<TOPSPIN 2.1>,
      <abs ABSG = 4 
       data hash MD5: 32K
       0A F6 D7 F2 94 08 F2 BE 7A 14 02 93 18 62 0C E7>)
(   8,<2016-05-01 14:34:03.630 -0700>,<Administrator>,<X>,<proc1d>,<TOPSPIN 2.1>,
      <abs ABSG = 5 
       data hash MD5: 32K
       F3 9D 1A DD 51 0D 08 84 B1 31 58 78 64 49 15 A4>)
$$ ##END=
$$ 
$$ $$ hash MD5
$$ $$ 14 64 91 8B 2C E4 1D 20 32 32 32 58 60 AF B3 21
##$RELAX= 
##$RELAX= 
##$RELAX= 
##$RELAX= 
##$RELAX= 
##$RELAX= 
##$RELAX= 
$$ Bruker specific parameters
$$ --------------------------
##$DU= <E:\>
##$EXPNO= 10
$$ [...]
##$TP= (0..7)
150 150 150 150 150 150 150 150
##$TP07= 0
##$TPNAME0= <>
##$TPNAME1= <>
##$TPNAME2= <>
##$TPNAME3= <>
##$TPNAME4= <>
##$TPNAME5= <>
##$TPNAME6= <>
##$TPNAME7= <>
##$TPOAL= (0..7)
0.5 0.5 0.5 0.5 0.5 0.5 0.5 0.5
##$TPOFFS= (0..7)
0 0 0 0 0 0 0 0
##$TUNHIN= 0
##$TUNHOUT= 0
##$TUNXOUT= 0
##$USERA1= <user>
##$USERA2= <user>
##$USERA3= <user>
##$USERA4= <user>
##$USERA5= <user>
##$V9= 5
##$VALIST= <valist>
##$VCLIST= <CCCCCCCCCCCCCCC>
##$VD= 0
##$VDLIST= <DDDDDDDDDDDDDDD>
##$VPLIST= <PPPPPPPPPPPPPPP>
##$VTLIST= <TTTTTTTTTTTTTTT>
##$WBST= 2048
##$WBSW= 25
##$XGAIN= (0..3)
0 0 0 0
##$XL= 0
##$YL= 0
##$YMAX_a= 575764
##$YMIN_a= -485084
##$ZGOPTNS= <>
##$ZL1= 120
##$ZL2= 120
##$ZL3= 120
##$ZL4= 120
##$ABSF1= 14.98509
##$ABSF2= -5.573092
##$ABSG= 5
##$ABSL= 3
##$ALPHA= 0
##$AQORDER= 0
##$ASSFAC= 0
##$ASSFACI= 0
##$ASSFACX= 0
##$ASSWID= 0
##$AUNMP= <proc_prof1d_extract_pilot.lims>
##$AXLEFT= 0
##$AXNAME= <>
##$AXNUC= <1H>
##$AXRIGHT= 0
##$AXTYPE= 0
##$AXUNIT= <>
##$AZFE= 0.1
##$AZFW= 0.1
##$BCFW= 0
##$BC_mod= 0
##$BYTORDP= 0
##$COROFFS= 0
##$CY= 15
##$DATMOD= 1
##$DC= 0
##$DFILT= <>
##$DTYPP= 0
##$F1P= 0
##$F2P= 0
##$FCOR= 0.5
##$FTSIZE= 32768
##$FT_mod= 6
##$GAMMA= 0
##$GB= 0
##$INTBC= 1
##$INTSCL= 1
##$ISEN= 128
##$LB= 0
##$LEV0= 0
##$LPBIN= 0
##$MAXI= 10000
##$MC2= 0
##$MEAN= 0
##$ME_mod= 0
##$MI= 0
##$NCOEF= 0
##$NC_proc= -8
##$NLEV= 6
##$NOISF1= 0
##$NOISF2= 0
##$NSP= 0
##$NTH_PI= 0
##$NZP= 0
##$OFFSET= 14.98509
##$PC= 1
##$PHC0= 95.48218
##$PHC1= 0
##$PH_mod= 1
##$PKNL= yes
##$PPARMOD= 0
##$PPDIAG= 0
##$PPIPTYP= 0
##$PPMPNUM= 2147483647
##$PPRESOL= 1
##$PSCAL= 4
##$PSIGN= 0
##$PYNMP= <proc.py>
##$REVERSE= no
##$SF= 400.02
##$SI= 32768
##$SIGF1= 0
##$SIGF2= 0
##$SINO= 400
##$SIOLD= 32768
##$SPECTYP= <>
##$SREGLST= <1H.CDCl3>
##$SSB= 0
##$STSI= 32768
##$STSR= 0
##$SW_p= 8223.68421052631
##$SYMM= 0
##$S_DEV= 0
##$TDeff= 65536
##$TDoff= 0
##$TI= <>
##$TILT= no
##$TM1= 0
##$TM2= 0
##$TOPLEV= 0
##$USERP1= <user>
##$USERP2= <user>
##$USERP3= <user>
##$USERP4= <user>
##$USERP5= <user>
##$WDW= 1
##$XDIM= 32768
##$YMAX_p= 436012302
##$YMIN_p= -662116
##$CURPLOT= <Network HP LaserJet P1505>
##$CURPRIN= <$Network HP LaserJet P1505>
##$DFORMAT= <normdp>
##$LAYOUT= <+/1D_H.xwp>
##$LFORMAT= <normlp>
##$PFORMAT= <normpl>
##$SURQMSG= 1
$$ End of Bruker specific parameters
$$ ---------------------------------
##NTUPLES= NMR SPECTRUM
##VAR_NAME=  FREQUENCY,     SPECTRUM/REAL,   SPECTRUM/IMAG
##SYMBOL=    X,             R,               I
##VAR_TYPE=  INDEPENDENT,   DEPENDENT,       DEPENDENT
##VAR_FORM=  AFFN,          ASDF,            ASDF
##VAR_DIM=   32768,         32768,           32768
##UNITS=     HZ,            ARBITRARY UNITS, ARBITRARY UNITS
##FACTOR=    0.250966925370066, 1,           1
##FIRST=     8223.43324360094, -152866,      36818
##LAST=      0,             110002,          166698
##MIN=       0,             -662116,         0
##MAX=       8223.43324360094, 436012302,    0
$$ Real data points
##PAGE= N=1
##DATA TABLE= (X++(R..R)), XYDATA
$$ [...]
$$ plain form
19510 418507 182721 -145473 -101625 -18747 61084 -175023 279341 -195547 99761 92731 -109401
19498 -212388 -212107 9941 96415 60030 -4183 -86777 -134816 -45311 59394 93413 76220 -176503
19485 -252561 10395 136903 -89796 -167454 -196938 -87934 -410972 -237768 139026 151197 162529
19474 162529 146697 -63871 -231181 -44778 -149396 -183667 83100 79268 -52358 22252 -25298
19462 -168859 -100142 19906 -322177 -196462 -162931 -349749 107294 101686 -375088 -359401 83629
19450 73468 -61791 -69256 -63027 17777 142928 -114445 339863 -2534 22227 -198604 52510
19438 87385 -147143 169519 143307 108083 351233 -228204 232207 -221028 224668 -180214
19427 -130167 5208 31895 -424024 -173850 227718 -123699 40860 134209 -147383 -201657 -70807
$$ packed form
19510D18507A82721a45473M3848a8747F1084a75023B79341a95547I9761p030a09401
19498b12388K81I941Q6474l6385d183q2594m8039d5311E9394L4019j7193a76503
19485b52561A0395J26508h9796p7658k9484h7934l23038J73204A39026J2171J1332
19474A62529j5832f3871j67310d4778j04618l4271H3100l832e2358B2252b5298
19462a68859O8717A9906c22177J25715L3531j86818A07294n608c75088J5687H3629
19450G3468f1791p465O229A7777J25151a14445C39863b534B2227a98604E2510
19438H7385a47143A69519k6212l5224K43150b28204B32207b21028B24668a80214
19427a30167E208K6687d24024a73850B27718a23699D0860R3349a47383n4274g0807
$$ plain form
19415 -81777 -281425 73156 -71494 -123746 144205 -289651 -93234 -63358 -182105 117840 45143
19403 -62532 85541 173449 -129473 59316 132945 -74284 -129529 87656 35538 -300947 -420871
19392 -420871 224448 -223013 165356 -8161 50494 55463 -69142 -96061 -38323 154109 -205123
19380 77847 87114 -66289 -175744 -122643 -416044 143500 -55403 22727 368655 -17471 329802
19368 -476773 -210078 305733 -200565 -282334 -336280 -127050 -229862 -168464 -93500 114990
19357 -60320 72761 4646 -29341 -233708 141848 -122242 -143057 79204 -347054 -244433 -156542
19346 -156542 -306456 -208944 -49907 -38960 -334470 -263492 200554 285611 -357284 -303698 122722
19334 14010 3451 -139837 -179471 74844 -393683 -322689 22439 -28140 -74413 -173313 -93864
$$ packed form
19415h1777j99648G3156g1494n2252A44205b89651i3234K9876j18747A17840D5143
19403f2532H5541Q7908a29473E9316P3629g4284n5245H7656C5538c00947j19924
19392d20871B24448b23013A65356h161E0494M969f9142k6919c8323A54109b05123
19380G7847R267f6289j09455N3101k93401A43500e5403B2727L45928a7471C29802
19368d76773b10078C05733b00565q1769n3946a27050j02812O1398P4964A14990
19357f0320G2761D646b9341k04367A41848a22242k0815G9204c47054J02621Q7891
19346a56542j49914R7512d9907J0947k95510P0978B00554Q5057c57284N3586A22722
19334A4010C451a39837l9634G4844c93683P0994B2439b8140m6273r8900P9449
$$ plain form
19323 -93864 -197754 -19248 -298948 -183544 -58852 -160341 172604 116311 -236297 129900
19312 -67397 -269435 14378 -82962 89829 3675 -209999 118331 99143 -123299 -113906 -85023
19301 -85023 -140614 -136989 -10213 10988 -148230 136508 -67551 -215109 -51008 -302434 -141772
19289 -196210 289436 25204 -61834 126753 -15454 -247719 34415 -177673 -192260 -16525 -215425
19278 -215425 -132455 23566 -170924 -150177 -62565 -226183 -161403 -731 -99684 237616 -329466
19266 -78978 182909 -360610 -121513 -288348 -93626 -107892 158170 397812 96858 -371231
19255 -147779 -146637 142946 -114189 -175202 -184634 71914 -20243 -314729 15318 -74212 -408105
19244 -408105 157259 -81666 -158660 -131931 51386 268702 -101837 25670 -201283 -420179
$$ packed form
19323i3864j03890a9248k79700J15404e8852j01489A72604n6293b36297A29900
19312f7397k02038A4378h2962H9829C675b09999A18331j9188a23299R393K8883
19301h5023n5591L625a0213A0988a48230A36508f7551j47558e1008k51426a41772
19289a96210B89436B5204f1834A26753a5454k32265C4415a77673j4587a6525j98900
19278b15425Q2970B3566a70924K0747f2565j63618O4780g31r8953B37616c29466
19266g8978A82909c60610a21513j66835i3626j4266A58170K39642I6858c71231
19255a47779J142A42946a14189o1013r432G1914b0243k94486A5318g4212l33893
19244d08105A57259h1666p6994K6729E1386K17316a01837B5670b01283k18896
$$ plain form
19234 -420179 -77538 74242 -488800 -194220 -34774 -92545 -329524 96979 -148192 248096
19223 -106108 -314768 -138004 -208050 5639 61837 -44254 -168517 50855 15224 -317115 -75704
19211 -55246 13780 -139052 96430 -79668 -98295 179840 -271080 -20430 -51954 168521 -67351
19199 146161 186009 -121379 135092 184394 -306365 -256244 -55438 -153805 -210280 -262131 -139876
19188 -139876 -269025 135737 19825 -34436 -199161 -23781 -60279 -200587 45694 -146256
19177 131274 141814 -69886 35060 84406 64212 -34437 -178351 -330339 -108121 -185368 -82515
19165 62516 -107057 -43505 -87050 71511 -140758 -110923 76413 -221215 15623 -263216 -5081
19153 -238241 317651 -119589 338165 -211772 -159180 -219480 -219425 154189 195419 -46283 50333
$$ packed form
19234d20179g7538G4242d88800a94220c4774n7771k36979I6979a48192B48096
19223a06108k08660a38004p0046E639N6198d4254j24263E0855A5224c17115g5704
19211e5246A3780a39052I6430g9668j8627A79840b71080b0430l1524A68521f7351
19199A46161L9848a21379A35092M9302c06365N0121e5438r8367n6475n1851J22255
19188a39876j29149A35737A9825c4436j64725b3781l6498j40308D5694a46256
19177A31274J0540f9886C5060M9346k0194c4437j43914j51988a08121p7247h2515
19165F2516a07057d3505m3545G1511a40758K9835G6413b21215A5623b63216e081
19153b38241C17651a19589C38165b11772N2592o0300N5A54189M1230d6283E0333
$$ plain form
19141 -99795 -222952 71892 -145552 192401 67662 180796 -244546 -69488 46136 -192440
19130 -166533 -188232 -104163 287260 -125458 -279265 -111481 38687 17476 187430 6054 -50872
19118 -91014 233164 205316 -70108 149964 198995 -5627 28092 -72391 -58742 -13223 35269
19106 -37450 -127341 -37215 195146 -303478 -213799 -9111 168673 -87875 -124500 -153737 55824
19094 -268387 257903 -82751 -138358 150270 -282592 -437479 -174653 -46257 -155502 23674
19083 -198782 25955 28264 71267 -226227 -116294 -308893 -338439 44853 -57038 160624 91298
19072 91298 -165392 91606 -147590 -117769 75493 -114698 -66068 -349061 145981 -410123
19061 12205 -51057 -190316 -283782 -220171 61850 -99504 -158213 25231 45883 -99209 -269299
$$ packed form
19141i9795j23157G1892a45552A92401F7662J13134b44546f9488D6136a92440
19130a66533k1699Q4069B87260a25458j53807a11481C8687A7476J69954F054e0872
19118i1014B33164k7848g0108A49964M9031e627B8092g2391J3649a3223C5269
19106c7450q9891c7215A95146c03478Q9679i111A68673h7875l6625k9237E5824
19094b68387B57903h2751n5607A50270b82592j54887a74653d6257j09245B3674
19083a98782B5955K309M3003b26227J09933j92599k9546D4853e7038A60624o9326
19072I1298a65392I1606a47590K9821G5493a14698M8630k82993A45981d10123
19061A2205e1057j39259r3466O3611F1850i9504n8709B5231K0652i9209j70090
$$ plain form
19050 -269299 71501 35662 -116592 -184226 -80757 -179487 200211 -266833 -162825 -281258
19040 -281258 -35347 -20607 -108014 45173 -273433 251682 111440 234144 -67090 -140644 -239466
19029 -239466 32304 -384495 -155760 94006 -137391 20657 81331 -189480 -157395 132202
19018 77514 276239 -183643 -168221 -68167 -301044 -93651 49536 106605 -314415 37305 83254
19007 83254 -140067 -301988 78132 116994 -150370 -58437 -395201 21642 24158 -276698 64465
18995 46541 19008 187609 -227063 -17650 173957 225327 -14057 275945 -126377 -107558 260066
18983 -152964 -40552 -38290 36526 -215313 -180752 -96935 -90700 120956 -27258 256168 177024
18972 177024 183893 228025 63298 -50763 -224506 -112848 69004 24372 -264492 -25866 221460
$$ packed form
19050b69299G1501C5662a16592o7634h0757r8730B00211b66833J04008j18433
19040b81258c5347J4740q7407D5173b73433B51682A11440J22704f7090p3554r8822
19029b39466C2304c84495a55760I4006a37391B0657O0674a89480L2085A32202
19018G7514J98725a83643J5422f8167k32877i3651D9536N7069c14415C7305M5949
19007H3254a40067j61921G8132L8862a50370e8437l36764B1642K516b76698F4465
18995D6541A9008J68601b27063a7650A73957N1370a4057B75945a26377J8819B60066
18983a52964d0552K262C6526b15313L4561Q3817O235A20956b7258B56168p9144
18972A77024O869M4132F3298e0763j73743J11658F9004B4372b64492b5866B21460
$$ plain form
18960 -65616 114850 -185094 -14968 -107550 -104747 156070 -154042 -75391 -190931 -328109 -32519
18948 -71583 -61035 14468 43560 -46508 -57602 -255892 84928 1578 179175 296829 -76910
18936 -326788 89722 -27010 116836 26074 16232 -211611 14917 -39803 -127404 -100921 85792
18924 -340925 -14346 78644 -81937 -318389 -31360 -243426 -205400 -73777 82874 111509 -97911
18912 90894 29834 -218851 422786 248006 128528 -51258 -145541 -174445 -122120 -126914 -117177
18901 -117177 -46916 -99374 -296008 -3408 -118438 -105607 -87134 -175428 -93806 -185447 -255906
18890 -255906 7684 -82819 -102977 -318790 27192 41432 -45423 1712 -184387 237073 216544
18879 216544 159697 -114164 -93866 239269 -272423 -113906 -169991 -227301 -109857 -174224
$$ packed form
18960f5616A14850a85094a4968r2582K803A56070a54042g5391j15540j37178c2519
18948g1583J0548A4468K9092d6508j1094j98290H4928A578J77597J17654g6910
18936c26788H9722b7010A16836B6074r842b11611A4917c9803q7601K6483H5792
18924c40925a4346G8644h1937k36452c1360k12066L8026g3777H2874K8635i7911
18912I0894B9834b18851D22786j74780j19478e1258r4283k8904N2325m794R737
18901a17177d6916n2458j96634c408j15030J2831J8473q8294Q1622r1641p0459
18890b55906G684h2819k0158k15813B7192J4240d5423A712a84387B37073k0529
18879B16544n6847a14164K0298B39269b72423a13906n6085n7310a09857o4367
$$ plain form
18869 -174224 -100890 99024 157978 -227645 -155869 -110097 30751 41927 162306 -69761 72243
18857 -177090 606 106756 -79823 -340513 -90345 -63678 258962 -215252 -95885 -35732 53729
18845 -371569 167857 -171519 -3061 73406 64289 60626 -86186 -5026 -119129 -40491 25305 -95250
18832 -1412 -289465 -47348 -63736 230808 -182454 -43434 -178063 -135610 2424 -97690 86709
18820 -97590 100198 -115347 -41406 354583 113326 146147 45906 124002 23589 205248 62885
18808 -135073 225462 -9438 -72451 -274304 223894 106899 -173552 -66918 -92668 22416 143045
18797 143045 -79893 96207 -125495 -145955 -96702 205086 -195366 -83499 -63894 -23446 -94380
18786 -94380 -132667 258070 135661 -284801 177100 35708 -235717 57734 -75358 -19730 -128874
$$ packed form
18869a74224P3334I9024N8954b27645P1776M5772C0751J1176J20379f9761G2243
18857a77090F06J06150g9823k60690i0345K6667B58962b15252i5885c5732E3729
18845c71569A67857a71519c061G3406r117l663h6186e026j14103d0491B5305i5250
18832a412k88053d7348j6388B30808a82454d3434j34629M2453B424i7690H6709
18820i7590A00198a15347d1406C54583A13326L2821D5906P8096B3589J81659F2885
18808a35073B25462i438o3013k01853B23894A06899a73552f6918k5750B2416J20629
18797A43045g9893I6207a25495k0460M9253B05086a95366h3499J9605b3446p0934
18786i4380l8287B58070j22409b84801A77100C5708b35717E7734g5358a9730j09144
$$ plain form
18775 -128874 180650 -241755 352912 -243920 1879 32943 -132912 -179806 -151740 86259 -32051
18763 -130161 221556 156983 289265 -284535 -62408 -74269 -98816 77030 -171964 -248342 32456
18751 -149108 -364866 -340196 -60227 -190524 -58577 40662 -43490 130200 150563 -39952 84099
18739 36427 -182782 -154322 -393283 7325 -84570 -363283 -44536 48224 -22990 -255403 -117828
18727 -207610 -94813 51200 -52515 -312269 127510 -23737 39010 184219 34565 105555 75562
18716 75562 -54365 29 3897 240069 -43524 -83946 -366599 -200421 -53975 54014 -257989 -224998
18704 -224998 -370280 -22627 29389 5434 -313407 21252 -46714 -79616 -177399 -263154 -67248
18692 -5362 -35593 -276651 10004 5705 113592 47302 -108493 -123701 -187079 -150489 -228403
$$ packed form
18775a28874A80650b41755C52912b43920A879L1064a32912m6894K8066H6259c2051
18763a30161B21556o4573J32282b84535f2408j1861k4547G7030a71964p6378C2456
18751a49108k15758K4670f0227j30297e8577D0662d3490A30200K0363c9952H4099
18739C6427a82782K8460k38961G325h4570k78713d4536D8224b2990k32413a17828
18727b07610i4813E1200e2515k59754A27510b3737C9010J45209C4565P0990k9993
18716G5562e4365B9L868K36172d3524m0422k82653J66178e3975E4014b57989L2991
18704b24998j45282b2627B9389E434c13407B1252d6714l2902r7783q5755f7248
18692e362l0231k41058A0004m299J07887D7302a08493j5208o3378L6590p7914
$$ plain form
18681 -228403 31452 -28034 -85796 -134162 -245094 -7401 -50578 -210617 75008 -265497 -96874
18669 48519 -306807 -238688 -78501 370250 -99300 -24398 123034 -6971 -110647 -217227 -156056
18658 -156056 36941 81411 -121720 253974 38702 -61319 -30080 -169365 -132227 137024 -68863
18646 -163135 20805 -197983 68295 23064 -153263 52803 -173579 99087 -40440 -191414 -48094
18634 -219974 -267459 108314 32797 72617 -97111 -88758 -220631 -60553 -108900 -408374 3336
18622 51704 -113216 156625 -100625 -5076 -193176 30776 -314913 -13800 -246103 -194722 -42368
18610 -257526 -36296 -491971 -83153 -157611 -117936 -100401 222022 -58456 116735 88663 14996
18598 106629 323072 -306274 -223550 236994 -151797 -234577 -260420 -278686 -218145 -185068 -6510
$$ packed form
18681b28403C1452b8034n7762m8366j10932g401m3177j60039G5008b65497i6874
18669D8519c06807O8119g8501C70250i9300b4398A23034f971j03676j06580O1171
18658a56056C6941M4470a21720B53974C8702f1319c0080j39285L7138A37024f8863
18646a63135B0805a97983F8295B3064a53263E2803a73579I9087d0440j50974d8094
18634b19974m7485A08314C2797L9820i7111Q353j31873f0553m8347k99474C336
18622E1704a13216A56625a00625e076j88100C0776c14913a3800k32303N1381d2368
18610b57526c6296m55675h3153p4458L9675J7535B22022e8456A16735k8072A4996
18598A06629K16443c06274Q2724B36994a51797q2780k5843j8266O0541L3077f510
$$ plain form
18586 -148393 -53163 131636 61718 19977 -152256 98814 95157 13861 -80119 -251877 50816
18574 -9979 40763 130256 -218054 115494 -304012 199588 -142550 -175876 -268655 -160338 -78579
18562 -456709 26013 -194349 85461 -49348 -52986 -8082 -26241 -70134 -84774 100801 -175660
18550 -152967 -46783 28113 -126247 -321080 -390797 -258900 71225 -162090 -153647 -71341 -183132
18539 -183132 91445 -29300 -224570 -147079 -49748 228595 -144994 151127 159284 -160979 331360
18527 10391 -283718 -98290 87528 -256945 93152 -237893 -81550 -224118 49667 69013 -2672
18515 290194 -9834 9965 -408241 -100367 -199843 -59726 13945 -76348 147583 -84627 114281
18503 -314721 -191440 220666 -55686 42940 1328 -308318 -100551 94677 -171965 -227482 40077
$$ packed form
18586a48393e3163A31636F1718A9977a52256I8814l657A3861h0119j71758E0816
18574i979D0763Q9493b18054A15494c04012A99588a42550l3326r2779J08317g8579
18562d56709B6013a94349H5461d9348l638h082j8159m3893j4640A00801a75660
18550a52967d6783B8113a26247j94833o9717J31897G1225a62090Q443g1341j11791
18539a83132I1445b9300j95270P7491d9748B28595a44994A51127Q157a60979C31360
18527A0391b83718i8290H7528b56945I3152b37893h1550j42568D9667J9346b672
18515B90194i834I965d08241a00367r9476e9726A3945g6348A47583h4627A14281
18503c14721J23281B20666e5686D2940A328c08318a00551I4677a71965n5517D0077
$$ plain form
18491 48632 2085 -112887 42403 -29931 4807 90071 -37956 140233 -99239 25108 -91072 17728
18478 -255069 96636 114125 20661 -42326 -150329 -142989 -309344 112658 94603 46917 82202
18467 82202 -57004 -278780 18376 -78490 57334 39974 -355590 -286962 -437155 -428151 -49552
18455 39770 -116772 -182893 71358 14805 -11272 -317059 -135570 -245035 -144329 22805 35364
18444 35364 254937 -161430 160051 3589 4290 -124236 -27207 -85713 -152687 -152369 114096 198947
18432 198947 47550 -14634 -337660 -214859 37484 -49411 -269176 82397 -52819 -310726 4306
18420 -116252 137590 188261 21001 -132917 259654 30043 186478 -174441 -56630 -227754
18410 -227754 -10347 84685 -135468 281770 -87659 77690 -40917 -13935 67099 -211363 -196319
$$ packed form
18491D8632B085a12887D2403b9931D807Q5264c7956A40233i9239B5108i1072A7728
18478b55069I6636J7489B0661d2326j08003P340j66355A12658j8055D6917L5285
18467H2202e7004k21776A8376g8490E7334j7360c55590O8628j50193R004d9552
18455C9770a16772o6121G1358A4805a1272l05787a35570j09465J00706B2805J2559
18444C5364K19573a61430A60051C589P01a24236b7207n8506o6974L18A14096Q4851
18432A98947D7550a4634l23026J22801C7484d9411k19765H2397e2819k57907D306
18420a16252A37590N0671B1001a32917B59654C0043J56435a74441e6630j71124
18410b27754a0347H4685a35468B81770h7659G7690d0917a3935F7099b11363J5044
$$ plain form
18399 -196319 -93519 -17554 102409 -61386 -235745 9490 80433 -32424 -202481 -76991 76058
18387 -51669 219511 -164808 -232356 -112764 99171 -90444 191054 -143320 56710 122467 -138256
18375 193134 -99356 -118397 80347 -16019 -1314 17997 -83792 131187 47939 -204596 -5519
18363 -165778 108317 -12475 -228575 -144951 217641 -105892 140337 -215563 7206 69475
18353 69475 122865 22308 1951 245070 -313862 174769 -112402 -59518 -318236 -91675 173023
18341 -72465 132218 -195742 -69872 -331724 28130 96415 -182769 627 147178 52819 -17123
18329 -147249 16237 -235025 60220 4932 80078 129506 -212556 96640 28994 65123 -230220
18317 -208702 -23448 225463 117231 233023 192159 -142832 54646 -25121 -75907 319153
$$ packed form
18399a96319i3519a7554A02409f1386j74359I490P0943c2424j70057g6991G6058
18387e1669B19511a64808o7548a12764I9171i0444A91054a43320E6710O5757a38256
18375A93134i9356j9041H0347a6019a314A7997h3792A31187D7939b04596e519
18363a65778A08317a2475k16100Q3624B17641a05892A40337b15563G206O2269
18353F9475N3390B2308A951K43119c13862A74769a12402N2884k58718i1675A73023
18341g2465A32218a95742f9872k61852B8130O8285a82769F27J46551E2819a7123
18329a47249A6237b35025F0220D932P5146M9428b12556I6640B8994L6129b30220
18317b08702b3448B25463j08232J15792m0864a42832E4646b5121n0786C19153
$$ plain form
18306 3930 -280566 -177474 -4680 -352853 -305697 -149939 -210913 -35812 -106274 -182122 -27663
18294 49966 176066 73834 -31210 -195089 -241711 118197 97055 132986 -25096 -369438 -293238
18283 -293238 -29940 -140962 -75767 114566 -32763 -155951 27376 33635 46101 -53532 117605
18271 69488 85069 -70764 -23386 -82157 77053 49262 -70068 -165237 -162003 -99049 -123144 118130
18258 102258 82857 -11213 -101003 -53278 -4938 82765 142756 -280129 33325 -46314 -8548 -116412
18246 -116412 -156486 -137360 -136852 168286 241746 40431 -201028 -203892 -313624 -45655 -37845 -169295
18234 -169295 72304 -240770 -129067 72186 -177356 -153271 189249 -41684 -38495 -43724 105618
18222 27787 -94848 -27188 -237863 -34133 -208464 -1353 22675 -127496 85407 40171 219053
$$ packed form
18306C930b80566J03092d680l48173M7156a49939o0974c5812p0462p5848b7663
18294D9966J26100G3834c1210j63879m6622A18197k1142L5931b5096l44342P6200
18283b93238b9940j11022O5195A14566c2763j23188B7376O259J2466e3532A17605
18271F9488J5581g0764b3386n8771G7053k7791g0068r5169L234O2954k4095A18130
18258A02258j9401a1213q9790M7725d938H2765N9991b80129C3325d6314h548j07864
18246a16412m0074J9126N08A68286P3460D0431b01028k864j09732d5655P810j31450
18234a69295G2304b40770J11703G2186a77356K4085A89249d1684L189n229A05618
18222B7787i4848b7188k10675c4133j74331a353B2675a27496H5407D0171J78882
$$ plain form
18211 219053 9200 -33242 -105054 89852 -18156 159833 -23105 -61459 -2661 48548 130235 -56793
18198 35090 10836 -88381 54757 -161600 -77683 -158327 -81631 -133598 -47415 133999 -18070
18186 -47701 -58471 -35598 84639 -79636 174621 59360 35633 -121199 93221 30038 522933
18175 522933 133602 34151 138561 9240 160796 124044 -65197 166734 -140300 165914
18164 -81307 371329 140905 42679 -157615 82551 -181308 370761 -270351 -30427 66043
18153 32547 102590 217198 -52524 -170645 -31857 -10428 -303639 -22037 72776 63996 90502
18142 90502 -52062 23870 33475 39131 139910 -23380 96819 -128262 -175957 10765 -241919
18130 49324 99709 -222358 -44311 64223 143620 48293 -115412 126798 144314 64406 -56405
$$ packed form
18211B19053I200c3242p1812H9852a8156A59833b3105l8354b661D8548Q1687e6793
18198C5090A0836h8381E4757a61600g7683q0644P6696n1967d7415A33999a8070
18186d7701j0770K2873H4639g9636A74621E9360k3727a21199I3221C0038M92895
18175E22933A33602C4151J04410I240J51556l6752f5197A66734a40300A65914
18164h1307C71329A40905D2679a57615H2551a81308C70761b70351c0427F6043
18153C2547P0043J14608e2524j18121c1857a0428k93211b2037G2776q780K6506
18142I0502e2062B3870R605N656J00779b3380I6819a28262m7695A0765b41919
18130D9324N0385b22358d4311F4223P9397D8293a15412A26798J7516F4406e6405
$$ plain form
18118 -106816 -107636 -4437 145348 11686 -77892 242028 -112242 -21661 -224003 178211 -107452
18106 -107407 -414731 -118111 -13800 -173447 -136528 18273 -319741 -140405 -275629 -181436
18096 -181436 -10925 191915 119492 80880 -38555 23 -44743 165036 -175759 243197 -6469
18084 -454169 41822 56027 -441983 -109859 154313 -41818 -106524 -337370 -233070 -37065
18073 105350 -251282 353620 -24415 -228538 188531 -244215 -26058 -29593 -9587 148001 94714
18062 94714 -28470 -132799 -148996 4979 61263 -75121 69348 272771 -89855 -394079 -142507
18050 73187 93932 125381 221106 122343 164624 41624 -145807 -107555 -59453 -221791 231643
18038 -214540 -57129 23309 35348 79139 -137221 -312093 -305736 133245 -400602 42646 -60760
$$ packed form
18118a06816q20d437A45348A1686g7892B42028a12242b1661k02342A78211a07452
18106a07407l07324a18111a3800j59647L6919A8273c19741a40405j35224R4193
18096a81436a0925A91915p2423l8612c8555B3d4743A65036a75759B43197f469
18084d54169D1822J4205d41983a09859A54313d1818o4706k30846J04300c7065
18073A05350b51282C53620b4415k04123A88531b44215b6058l535i587A48001n3287
18062I4714b8470j04329j6197D979N6284g5121F9348K03423h9855l04224a42507
18050G3187K0745L1449R5725r8763M2281D1624a45807L8252M8102j62338B31643
18038b14540e7129B3309J2039M3791a37221j74872O357A33245d00602D2646f0760
$$ plain form
18026 172413 -253939 12795 236996 361338 -24918 2026 50724 150142 -95582 213939 -1521
18014 -130016 -341626 -23973 91992 -27048 250901 -88435 38782 -47714 95560 200132 -158168
18002 7066 82401 90170 6334 231019 72700 -236996 94948 -67172 160262 -200258 -71288
17990 156992 202916 26421 -153792 39151 13128 243289 -18029 -26116 -118376 -94660 -102168
17979 -102168 -42239 195936 69409 31170 210724 372387 -64246 44380 -20749 177324 -158474
17967 -29392 239556 21495 -135097 99885 19620 124205 150029 -42529 -238627 -36218 -199166
17956 -199166 -95653 -340942 207211 -119558 -99879 118948 221263 -198581 -96840 34746
17945 204903 -55179 179024 -374616 -117920 165617 -201336 234661 -117368 52500 -148637
$$ packed form
18026A72413b53939A2795K24201J24342b4918B026M8698R9418i5582B13939a521
18014a30016k11610b3973I1992b7048B50901h8435C8782d7714I5560J04572a58168
18002G066P5335P769F334K24685G2700b36996I4948f7172A60262b00258g1288
17990A56992M5924B6421a53792C9151A3128K30161a8029q087r2260K3716p508
17979a02168d2239A95936F9409C1170J79554J61663f4246D4380b0749A77324a58474
17967b9392B39556B1495a35097I9885A9620J04585K5824d2529j96098c6218j62948
17956a99166i5653k45289B07211a19558J9679A18948J02315a98581i6840C4746
17945B04903e5179A79024c74616a17920A65617b01336B34661a17368E2500a48637
$$ plain form
17934 198248 -213233 -109710 217991 130914 -260335 115272 -351242 19883 -107908 -70715
17924 -70715 -118240 7106 132076 238935 -17078 42784 247097 102325 -141819 -340053 -86304
17912 -271536 154265 -83336 228587 -10751 -265421 -177891 223003 -68787 157976 -202863
17901 -116947 122404 -167668 322346 -44887 57128 -36327 -86033 -246590 61930 -279047
17890 114863 -241568 98494 87318 148090 184881 357532 -103151 173016 -54382 -124292 94261
17878 103222 -58796 -130772 165077 96126 351734 -42986 -255950 88249 74790 60123 99719
17867 99719 69882 116070 139953 -59685 -30963 12389 62261 -209640 -85805 -28667 141996
17855 -123897 170130 764 -267630 -29526 -302522 -53329 -94672 281698 44290 211474 -106426
$$ packed form
17934A98248b13233J03523B17991q7077b60335A15272c51242A9883a07908L7193
17924g0715m7525G106J24970J06859a7078D2784K04313A02325a41819j98234h6304
17912b71536A54265h3336B28587a0751k54670Q7530B23003f8787A57976b02863
17901a16947A22404a67668C22346d4887E7128c6327m9706j60557F1930b79047
17890A14863b41568I8494j1176O0772L6791J72651a03151A73016e4382o9910I4261
17878A03222e8796p1976A65077o8951K55608d2986k12964H8249j3459j4667L9596
17867I9719k9837M6188K3883e9685K8722A2389M9872b09640h5805b8667A41996
17855a23897A70130G64b67630b9526k72996e3329m1343B81698D4290J67184a06426
$$ plain form
17843 74211 -155439 -331623 199140 395209 36287 329446 83491 -331400 145246 -198325
17832 -110490 -245007 -197435 76460 -31278 -95462 186114 198931 -267794 144897 -18092 -104800
17821 -104800 321535 88363 -123329 -175665 259283 147848 80009 222754 138841 -280118
17810 -56851 -125327 147330 36505 30616 171074 -279772 -96117 101352 128503 -65028 4407
17798 274220 224552 280511 11447 103391 55334 38429 -285109 -157625 63453 371922 -515866
17786 -20168 -33608 -244684 -170612 -54476 -87214 -32234 17849 -90697 340067 -172583 55059
17774 -203451 -195659 -128647 -66185 143801 151267 301373 -87031 341734 193220 -76026 -44493
17763 -44493 -77604 104295 40462 -13348 77183 191886 -19010 -130852 42989 263327 44332
$$ packed form
17843G4211a55439j76184A99140J96069C6287K93159H3491c31400A45246a98325
17832a10490j34517M7572G6460c1278o4184A86114J2817b67794A44897a8092q6708
17821a04800C21535H8363a23329n2336B59283j11435o7839J42745q3913b80118
17810e6851o8476A47330C6505n889J40458b79772i6117A01352K7151f5028D407
17798B74220m9668N5959A1447R1944m8057j6905b85109J27484F3453L08469e15866
17786b0168j3440k11076P4072e4476l2738c2234A7849i0697C40067a72583E5059
17774b03451P792O7012O2462A43801P466J50106h7031C41734j48514g6026L1533
17763d4493l3111A04295D0462a3348G7183J14703a9010j11842D2989K20338D4332
$$ plain form
17751 207253 -109992 -108729 124370 253724 224120 402979 128864 156179 64716 -59802 -23504
17739 260140 -9795 -77084 -116109 79446 110027 -321685 106665 85432 68679 -170680 60927
17727 28694 -211673 273894 328482 -30593 -66771 212214 7305 96417 210353 25518 9736
17715 203856 194954 103756 -109358 186567 213772 -4572 -80807 18367 67625 137717 236665
17704 236665 5917 150852 106487 271533 -40281 261922 -85982 -2182 -55894 150395 -194058
17692 77187 76173 259740 -304466 -13431 -90135 237985 226159 -54807 262159 -131433 15224
17680 -144350 48325 -43243 -122229 -100758 -111561 114520 135654 106882 -30411 -125152 48989
17668 198904 208686 178869 162844 -59937 -37111 -64482 116181 53938 -24001 40110 120069
$$ packed form
17751B07253a09992J263A24370J29354k9604J78859A28864K7315F4716e9802b3504
17739B60140i795o7289l9025G9446L0581c21685A06665k1233j6753a70680F0927
17727B8694b11673B73894N4588c0593l6178B12214G305Q9112J13936B5518I736
17715B03856q902r1198a09358A86567K7205d572p6235A8367M9258P0092R8948
17704B36665E917J44935m4365J65046d0281B61922h5982b182n3712A50395a94058
17692G7187j014J83567c04466a3431p6704B37985j1826e4807B62159a31433A5224
17680a44350D8325d3243p8986K1471j0803A14520K1134k8772c0411r4741D8989
17668A98904R782k9817j6025e9937K2826k7371A16181E3938b4001D0110P9959
$$ plain form
17657 120069 47381 150176 615949 296393 -463362 -63860 53632 -175077 -125387 -63835
17647 -63835 94885 33651 -40387 364472 -102817 53801 176879 17946 -85957 159609 263961
17636 263961 -137803 24463 -53734 563 198863 261342 172570 289241 70356 263521 259251
17625 259251 125036 -151602 115917 53149 -213772 -6742 267623 111911 -1245 -82803 -67010
17614 -67010 82756 113908 387764 59774 -81028 -26925 147019 244915 108500 258637 -178072
17602 20052 109676 -103654 318468 34948 32592 313875 278675 230534 75716 -133882 204576
17590 -22414 28611 184209 50733 41887 34571 -64825 240398 178883 -46624 -128708 -178491 -242535
17578 -242535 25112 -40172 165628 -180518 286482 -70390 187438 259389 79476 231459
$$ packed form
17657A20069D7381J02795M65773B96393d63362f3860E3632a75077M9690O1552
17647f3835I4885C3651d0387C64472a02817E3801J23078A7946h5957A59609J04352
17636B63961a37803B4463e3734E63J98300O2479q8772J16671G0356J93165m270
17625B59251A25036a51602A15917E3149b13772f742B67623A11911a245q1558J5793
17614f7010H2756L1152K73856E9774h1028b6925A47019R7896A08500J50137a78072
17602B0052Q9624a03654C18468C4948k356K81283l5200m8141G5716a33882B04576
17590b2414B8611J55598E0733q846p316f4825B40398o1515d6624q2084m9783o4044
17578b42535B5112d0172A65628a80518B86482g0390A87438P1951G9476J51983
$$ plain form
17568 231459 209340 391383 -10819 225828 80646 286269 118587 -44761 117773 192196
17558 192196 -46281 -26248 206140 111102 187436 11154 -182770 302166 -9741 266181 122705
17546 37090 176538 211970 74255 358373 217332 -49310 277511 -70036 82946 316119 351103
17535 351103 227349 48613 125345 63666 -30714 194817 402417 -42878 14007 212044 364438
17524 364438 643755 473127 596708 695274 498043 697881 248495 35726 213516 187731
17514 187731 522655 472741 281814 473966 250013 501794 423215 261555 449532 797140
17504 797140 651770 309134 435234 -13251 46200 103124 130893 589922 213452 565404
17494 565404 62132 289664 47885 204990 -13622 -13173 215592 215820 379491 158176 189577
$$ packed form
17568B31459k2119J82043a0819B25828H0646K05623A18587d4761A17773P4423
17558A92196d6281K0033B06140r5038P6334A1154a82770C02166i741B66181A22705
17546C7090J39448L5432G4255K84118j41041d9310B77511g0036H2946K33173L4984
17535C51103j23754D8613P6732o1679c0714A94817K07600d2878A4007J98037J52394
17524C64438K79317j70628J23581R8566j97231J99838B48495C5726J77790k5785
17514A87731L34924m9914j90927J92152k23953K51781p8579j61660J87977L47608
17504G97140j45370C09134J26100a3251D6200N6924K7769M59029B13452L51952
17494E65404F2132K27532D7885J57105a3622M49B15592K28J63671A58176L1401
$$ plain form
17483 189577 429950 284231 83099 170339 171087 278152 27313 -100126 298785 -74103 116757
17471 12768 251351 336671 228046 151911 -92551 520779 -40113 25680 368609 410470 168727
17459 314757 116027 350011 131172 12277 185824 92737 166745 177189 -109545 72149
17448 239631 77914 288120 287318 252973 492928 24824 160201 238736 121877 -23239 151478
17436 217544 155292 156590 336910 108869 204635 242287 242714 27225 290761 184781 282867
17425 282867 330716 184043 314583 518876 146717 368191 298302 407835 117759 -53073
17414 -73223 310194 185897 385909 133090 327989 -21213 428786 282916 338558 300549
17404 300549 355858 433759 90809 150345 251884 317686 166177 205665 334468 333402 214337
$$ packed form
17483A89577K40373j45719H3099Q7240P48J07065B7313a00126B98785g4103A16757
17471A2768K38583Q5320j08625p6135i2551E20779d0113B5680L42929M1861A68727
17459C14757A16027K33984A31172A2277J73547I2737P4008J0444a09545G2149
17448B39631G7914K10206q02l4345K39955B4824J35377P8535j16859b3239A51478
17436B17544o2252J298J80320A08869R5766L7652M27B7225K63536j05980R8086
17425B82867M7849j46673J30540K04293A46717K21474o9889J09533A17759e3073
17414g3223C10194j24297K00012A33090J94899b1213D28786j45870N5642l8009
17404C00549N5309P7901I0809N9536J01539O5802j51509L9488J28803j066j19065
$$ plain form
17393 214337 -29593 -14027 220882 28956 80801 -81045 -39611 249060 142873 296380 113778
17381 95472 234047 452164 188962 -59252 436091 277315 141982 -161378 273516 256936
17371 256936 488251 443354 205302 154715 229469 436031 469869 214712 243093 17265 107283
17360 107283 192564 -134161 236416 171554 73793 324341 328267 285737 47436 202652 78430
17348 316090 84273 85306 329554 71400 164851 -71676 80284 -31019 -13109 88276 57430
17337 57430 452339 152047 51993 297331 -268518 346198 -9080 406924 -14921 159168
17326 63047 277060 -96757 -83060 67993 346950 229233 -112378 136330 326367 101951
17315 114530 249403 283684 -83440 350897 -50436 334297 488938 47145 476880 265964
$$ packed form
17393B14337b9593a4027B20882B8956N1845h1045c9611B49060j06187J53507A13778
17381I5472J38575K18117A88962e9252D36091j58776j35333a61378B73516j6580
17371B56936K31315m4897B05302n0587P4754K06562L3838B14712K8381A7265R0018
17360A07283Q5281a34161B36416o4862G3793K50548L926m2530D7436J55216G8430
17348C16090H4273J033K44248G1400R3451g1676H0284c1019a3109H8276l0846
17337E7430L94909A52047E1993K45338b68518C46198i080D06924a4921A59168
17326F3047K14013i6757J3697F7993K78957j17717a12378A36330J90037A01951
17315A14530J34873L4281h3440C50897e0436C34297J54641D7145M29735k10916
$$ plain form
17305 265964 224954 226394 525161 162675 222256 -69326 237238 332745 28214 318041 341589
17294 341589 240809 563590 201583 -148288 295274 254388 327748 435990 123214 101019
17284 101019 153006 158351 216121 27882 -41872 75508 290983 314818 4754 416926 80184
17272 171477 456284 167576 161220 211149 248902 293692 139724 492444 335385 110496
17261 529047 282476 321502 176018 131042 -27007 282435 323542 201301 526786 46785
17250 -22352 206661 204436 607180 227851 317386 194136 153039 291988 150099 313992
17240 313992 105305 318064 331130 229481 440145 350963 171958 267948 228670 579116
17230 579116 215492 520997 467091 309061 552308 332000 184573 139864 424675 686022
$$ packed form
17305B65964m1010J440K98767A62675N9581f9326B37238R5507B8214K89827K3548
17294C41589j00780L22781B01583a48288B95274m0886P3360J08242A23214k2195
17284A01019N1987N345N7770B7882d1872G5508K15475K3835D754M12172H0184
17272A71477K84807A67576o356M9929L7753M4790A39724L52720j57059A10496
17261E29047k46571L9026j45484m4976b7007B82435M1107j22241L25485D6785
17250b2352B06661k225M02744B27851Q9535j23250m1097J38949j41889J63893
17240C13992A05305K12759J3066j01649K10664q9182A71958R5990l9278L50446
17230E79116B15492L05505n3906j58030K43247k20308j47427m4709K84811K61347
$$ plain form
17220 686022 29225 165204 467324 219588 492230 111908 275380 239106 145302 278178
17210 278178 290122 302380 149234 169941 69157 256900 26378 179277 549878 -20232 364925
17198 420199 234215 275638 321062 128959 481255 237398 337500 595882 180446 355107
17188 355107 88523 505388 431048 529054 347255 339611 66497 209585 370610 216625 468682
17177 468682 526957 296107 442112 440429 243565 258478 293863 154147 123150 254110 445678
17166 445678 410768 201650 266278 114926 292335 407628 49200 187477 391781 448588
17156 448588 302120 362952 254245 272600 754693 285108 628065 215301 496682 373529
17146 373529 42023 172057 403657 293083 386847 438685 261956 417249 329186 456444
$$ packed form
17220F86022B9225J35979L02120B19588K72642A11908J63472l6274r3804J32876
17210B78178J1944J2258A49234K0707F9157J87743B6378J52899L70601b0232C64925
17198D20199j85984M1423M5424A28959L52296B37398J00102K58382A80446J74661
17188C55107H8523M16865p4340R8006j81799p644F6497J43088J61025j53985K52057
17177D68682N8275k30850J46005j683j96864J4913L5385j39716l0997J30960J91568
17166D45678l4910B01650O4628A14926J77409J15293D9200J38277K04304N6807
17156D48588j46468O0832j08707J8355M82093B85108L42957B15301K81381j23153
17146C73529D2023J30034K31600j10574R3764N1838j76729J55293q8063J27258
$$ plain form
17136 456444 283689 399235 470799 421712 517809 546496 307296 334709 313129 540069 331019
17125 331019 586006 342239 268309 493466 213126 492512 147946 498375 354571 698899
17115 698899 602742 537618 663315 391828 385222 622002 540166 172953 455145 538879 18287
17103 417255 402144 596472 815090 651402 486069 543391 236686 425005 556779 645097
17093 645097 649463 516212 532027 716247 164535 439415 472558 682336 259072 528372
17083 528372 321924 610509 705108 470791 486151 352629 614575 624399 617800 879364 625876
17072 625876 588449 602979 362002 311104 525067 865705 325080 679069 422162 758041
17062 758041 477190 455149 747679 668300 674366 912130 870201 838094 711570 460058 411802
$$ packed form
17136D56444j72755J15546P1564m9087R6097K8687k39200K7413k1580K26940k09050
17125C31019K54987k43767p3930K25157B13126K79386A47946L50429j43804L44328
17115F98899r6157o5124J25697k71487o606K36780q1836A72953K82192Q3734A8287
17103D17255j5111J94328K18618j63688j65333N7322B36686J88319J31774Q8318
17093F45097M366j33251J5815J84220A64535K74880L3143K09778B59072K69300
17083E28372k06448K88585R4599k34317J5360j33522K61946R824o599K61564k53488
17072F25876l7427J4530k40977n0898K13963L40638C25080L53989k56907L35879
17062G58041k80851k2041K92530p9379O066K37764m1929l2107j26524k51512m8256
$$ plain form
17051 411802 444157 644363 451238 558531 811272 695881 259239 683150 692053 674838
17041 674838 701339 785425 735684 736753 616009 481245 895579 676657 866322 682009
17031 682009 842131 624264 1131109 718261 771799 755203 506841 753008 624564 924267
17021 924267 920227 566314 617864 1040842 889621 662712 545013 816086 611363 848637
17011 848637 512730 1162108 1292952 1219216 798676 885829 652023 987844 1060825 816074
17001 816074 896095 842799 793574 1188717 960679 958179 1200551 919638 627183 1128150
16991 1128150 985539 888524 1040013 945739 1292181 1147364 1044663 1034147 918989 832327
16981 832327 955613 1131413 909123 957725 1075540 916284 957381 1162905 1076985 1157641
$$ packed form
17051D11802L2355K00206j93125J07293K52741j15391B59239M23911Q903j7215
17041F74838K6501Q4086m9741J069j20744j34764M14334k18922J89665j84313
17031F82009J60122k17867N06845m12848N3538j6596k48362K46167j28444K99703
17021I24267m040l53913N1550M22978j51221k26909j17699K71073k04723K37274
17011H48637l35907O49378J30844p3736m20540Q7153k33806L35821P2981k44751
17001H16074Q0021n3296m9225L95143k28038k500K42372k80913k92455N00967
16991A128150j42611r7015J51489r4274L46442j44817j02701j0516j15158q6662
16981H32327J23286J75800k22290M8602J17815j59256M1097K05524q5920Q0656
$$ plain form
16971 1157641 1138203 1284109 1581846 1341414 1308913 1306057 1275600 1560340 1359148 1377972
16961 1377972 1345443 1462655 1248495 1133541 1402295 1197615 1453558 1338907 1372005 1450702
16951 1450702 1384280 1331407 1426495 1561799 1645265 1330317 1313994 1396909 1537064 1456532 1689294
16940 1689294 1360144 1854316 1654191 1824182 1674143 1836580 1624841 1656054 1588740 1527564
16930 1527564 2064774 2145167 1521058 1757459 1927243 1841939 1755215 1584953 2032731 2014360
16920 2014360 1936540 1945476 2033176 1603788 2004371 2289800 1954184 2108825 2266332 2175002
16910 2175002 2383258 1912349 2064019 2148430 2087852 2121862 2356625 2357811 2772743 2195416
16900 2195416 2595639 2240696 2191995 2583388 2972477 2401172 2596972 2498572 2575160 2744199
$$ packed form
16971A157641j9438J45906K97737k40432l2501k856l0457K84740k01192J8824
16961A377972l2529J17212k14160j14954K68754k04680K55943j14651L3098P8697
16951A450702o6422n2873R5088J35304Q3466l14948j6323Q2915J40155q0532K32762
16940A689294l29150M94172k00125J69991j50039J62437k11739L1213o7314o1176
16930A527564N37210Q0393o24109K36401J69784q5304q6724j70262M47778j8371
16920B014360p7820Q936Q7700m29388M00583K85429l35616J54641J57507r1330
16910B175002K08256m70909J51670Q4411o0578L4010K34763J186M14932n77327
16900B195416M00223l54943m8701L91393L89089n71305J95800r8400P6588J69039
$$ plain form
16890 2744199 2907810 2876927 2450986 2883253 2831224 2924301 2968603 3054496 2918174 2943496
16880 2943496 2679741 2893446 3355374 3477878 3142790 2975178 3257831 3246209 3619399 3591034
16870 3591034 3154970 3569896 3360594 3768793 3553775 3570979 3817157 3874038 4145355 4148285
16860 4148285 3841790 4349107 4238791 4107247 3967656 4114124 4185674 4453862 5181486 4686837
16850 4686837 4606640 4587384 5073196 4798191 4926323 5202691 5501070 5146520 5365808 5183342
16840 5183342 6039499 5749752 5409334 5989378 6004441 6095526 6106434 5885039 6241986 6436559
16830 6436559 6260330 6718727 6541982 6918762 6936814 7162235 7382679 7683349 7845780 8101367
16820 8101367 8055758 8144921 8479174 8855745 8855863 8923370 8926934 9103292 9301464 9768586 10235062
$$ packed form
16890B744199J63611l0883m25941M32267n2029R3077M4302Q5893j36322K5322
16880B943496k63755K13705M61928J22504l35088j67612K82653j1622L73190k8365
16870C591034m36064M14926k09302M08199k15018J7204K46178N6881K71317K930
16860D148285l06495N07317j10316j31544j39591J46468P1550K68188P27624m94649
16850D686837q0197j9256M85812k75005J28132K76368K98379l54550K19288j82466
16840E183342Q56157k89747l40418N80044J5063R1085J0908k21395L56947J94573
16830F436559j76229M58397j76745L76780J8052K25421K20444L00670J62431K55587
16820H101367m5609Q9163L34253L76571J18O7507L564J76358J98172M67122M66476
$$ plain form
16809 10235062 10007777 10252050 10566587 11062872 11071589 11445269 11680439 11725609 12246401 12468043
16799 12468043 12815454 13194989 13263695 13816159 13822180 14401241 14812464 15429751 15582361 16204419
16789 16204419 16479752 17120197 17360915 17950158 18305875 19153887 19718432 19985130 20771723
16780 20771723 21510052 22026812 22472358 23592359 24504016 24874817 25604306 26524017 27528759
16771 27528759 28220440 29028239 30160461 31562155 32568325 33420561 34870691 35983574
16763 35983574 37352378 38779264 39951679 41388452 43008637 44334587 46380406 47817097
16755 47817097 49715540 51458124 53394046 55402104 57543209 59904050 61930345 64443583
16747 64443583 66584685 68638728 71182451 73657385 76384114 78839539 81342984 84075813
$$ packed form
16809A0235062k27285K44273L14537M96285Q717L73680K35170M5170N20792K21642
16799A2468043L47411L79535O8706N52464O021N79061M11223O17287J52610O22058
16789A6204419K75333O40445K40718N89243L55717Q48012N64545K66698P86593
16780B0771723P38329N16760M45546J120001R11657L70801P29489R19711J004742
16771B7528759O91681Q07799J132222J401694J006170Q52236J450130J112883
16763C5983574J368804J426886J172415J436773J620185J325950K045819J436691
16755D7817097J898443J742584J935922K008058K141105K360841K026295K513238
16747F4443583K141102K054043K543723K474934K726729K455425K503445K732829
$$ plain form
16739 84075813 86259184 88720288 91251981 93386161 95518525 97649599 99739518 101436194
16731 101436194 103125734 104123902 105132295 106106725 106622616 106960390 107023188 106639285 106092308
16722 106092308 105089908 104474176 103150944 101534539 100085158 98062000 96157863 93573380
16714 93573380 91480858 89346179 86633402 84250148 82199501 79438059 77176013 74285108
16706 74285108 72148481 69865718 67249611 64914446 62997498 60643429 58781668 56517572
16698 56517572 54501250 52835093 51053031 48899602 47426362 45625910 44064153 42569285
16690 42569285 41520472 40102386 38381523 37376778 35551173 34926730 33765244 32762790
16682 32762790 31661261 30720201 29533672 28588161 27793055 27121477 26408243 25689216 24613202
$$ packed form
16739H4075813K183371K461104K531693K134180K132364K131074K089919J696676
16731A01436194J689540R98168J008393R74430N15891L37774O2798l83903n46977
16722A06092308j002400o15732j323232j616405j449381k023158j904137k584483
16714I3573380k092522k134679k712777k383254k050647k761442k262046k890905
16706G4285108k136627k282763k616107k335165j916948k354069j861761k264096
16698E6517572k016322j666157j782062k153429j473240j800452j561757j494868
16690D2569285j048813j418086j720863j004745j825605o24443j161486j002454
16682C2762790j101529r41060j186529r45511p95106o71578p13234p19027j076014
$$ plain form
16673 24613202 23851764 23585927 22635193 21983501 21355662 21012906 19969733 19817273 19082870
16664 19082870 18766464 17948343 17673298 17049560 16786430 16782203 15772282 15791507 15347769 15005903
16654 15005903 14562019 14351599 13690771 13754735 13084886 13063945 12632945 12365235 12336378 11672481
16644 11672481 11410985 11570011 11200090 11079514 10862365 10458886 10379983 10186009 10372123
16635 10372123 9855307 9566909 9378679 9299300 8966089 8878760 9146113 8608756 8346277 8614736
16625 8614736 8129945 7746156 7708331 7988026 7269381 7441014 7170099 7391277 6981534 6995005
16615 6995005 6834661 6706605 6714129 6745399 6598921 6067604 6101608 6113872 6461307 6065431
16605 6065431 6176153 5613871 5677426 5859187 5634219 5202371 5230906 5426547 5337350 5112543
$$ packed form
16673B4613202p61438k65837r50734o51692o27839l42756j043173j52460p34403
16664A9082870l16406q18121k75045o23738k63130m227j009921J9225m43738l41866
16654A5005903m43884k10420o60828O3964o69849k0941m31000k67710k8857o63897
16644A1672481k61496J59026l69921j20576k17149m03479p8903j93974J86114
16635A0372123n16816k88398j88230p9379l33211q7329K67353n37357k62479K68459
16625H614736m84791l83789l7825K79695p18645J71633k70915K21178m09743J3471
16615F995005j60344j28056P524L1270j46478n31317L4004J2264L47435l95876
16605F065431J10722n62282O3555J81761k24968m31848K8535J95641q9197k24807
$$ plain form
16595 5112543 5197922 5189232 4808252 4667271 4767444 5060150 4566537 4653104 4659437 4514978
16585 4514978 4086591 4541505 4527506 4517674 4262165 3892672 4207957 4010106 3994680 4093036
16575 4093036 3970188 4058189 3928023 3912135 3944377 3669010 3845211 3858363 3459226 3290642
16565 3290642 3527952 3350144 3563929 3558410 3552066 3219407 3511901 3359302 2954149 3294613
16555 3294613 3262766 3320415 3093860 3065628 3144969 3133293 3155165 2760895 3193174 2729675
16545 2729675 2980919 2871075 2814814 2766577 2830228 2737592 2789482 2779815 2638172 2524262 2832660
16534 2832660 2621813 2381033 2499728 2468049 2610186 2445740 2358121 2626482 2335136 2029641
16524 2029641 2344686 2492794 2526827 2365772 2129556 2028342 1961624 2195413 2009545 1779476
$$ packed form
16595E112543Q5379q690l80980j40981J00173K92706m93613Q6567O333j44459
16585D514978m28387M54914j3999r832k55509l69493L15285j97851j5426R8356
16575D093036j22848Q8001j30166j5888L2242k75367J76201J3152l99137j68584
16565C290642K37310j77808K13785n519o344l32659K92494j52599m05153L40464
16555C294613l1847N7649k26555k8232P9341j1676K1872l94270M32279m63499
16545B729675K51244j09844n6261m8237O3651r2636N1890r667j41643j13910L08398
16534B832660k10847k40780J18695l1679J42137j64446q7619K68361k91346l05495
16524B029641L15045J48108L4033j61055k36216j01214o6718K33789j85868k30069
$$ plain form
16514 1779476 1859388 2079801 2316891 2148985 2281078 2054697 1935575 1932309 2220624 2212627
16504 2212627 1752500 1866525 2227774 2051462 1965133 2027409 2128061 2004585 1998606 1655387
16494 1655387 1912835 1985773 1885778 1822790 1963348 1896660 1856102 1929683 1842600 1970932 1728007
16483 1728007 1874771 1948149 1687935 1711404 1758691 1882178 1429287 1660165 2175223 1585345
16473 1585345 1762370 1782994 1893216 1650253 1349786 1722934 1434329 1468016 1389263 1555297
16463 1555297 1391226 1419765 1543697 1661416 1298209 1458704 1367932 1052213 1566704 1376060
16453 1376060 1556427 1419328 1541267 1459699 1463882 1352751 1149610 1315300 1463326 1461736
16443 1461736 1352412 1332948 1661755 1498376 1378729 1349506 1353379 1009065 1332235 1509457
$$ packed form
16514A779476P9912K20413K37090j67906J32093k26381j19122l266K88315p997
16504B212627m60127J14025L61249j76312q6329O2276J00652j23476n979l43219
16494A655387K57448P2938r9995o2988J40558o6688m0558P3581q7083J28332k42925
16483A728007J46764P3378k60214K3469M7287J23487m52891K30878N15058n89878
16473A585345J77025K0624J10222k42963l00467L73148k88605L3687p8753J66034
16463A555297j64071K8539J23932J17719l63207J60495r0772l15719N14491j90644
16453A376060J80367j37099J21939q1568M183j11131k03141J65690J48026j590
16443A461736j09324j9464L28807j63379j19647k9223L873l44314L23170J77222
$$ plain form
16433 1509457 1383074 1170978 1260160 1327133 1450021 1389609 1500811 1321416 1295887 1263020
16423 1263020 1382024 1393945 1274364 1261436 1621707 1111015 1407931 1276593 1323878 1323444
16413 1323444 1136428 940882 1280082 789331 1488943 1353404 1675443 917160 1090819
16404 1090819 1070547 1497859 1248934 1291914 960551 1244260 1224949 1232478 1365832 1016471
16394 1016471 797170 984733 945833 1006601 1123274 1122353 854176 992120 1064076 1152163 871910
16383 871910 691897 1216070 992010 1064650 920972 1103090 718918 776235 1097195 951948
16373 951948 1125703 1060276 1166267 1186035 867654 718409 958328 1035317 1086548 1221629
16363 1221629 704347 866877 1352686 1159653 987003 935240 614026 1122954 1245630 961564
$$ packed form
16433A509457j26383k12096Q9182O6973J22888o0412J11202j79395k5529l2867
16423A263020J19004J1921j19581j2928L60271n10692K96916j31338M7285m34
16413A323444j87016j95546L39200m90751O99612j35539L22039p58283J73659
16404A090819k0272M27312k48925M2980l31363K83709j9311P529J33354l49361
16394A016471k19301J87563l8900O0768J16673r21k68177J37944P1956Q8087k80253
16383H71910j80013N24173k24060P2640j43678J82118l84172N7317L20960j45247
16373I51948J73755o5427J05991J9768l18381j49245K39919P6989N1231J35081
16363A221629n17282J62530M85809j93033j72650n1763l21214N08928J22676k84066
$$ plain form
16353 961564 828239 892728 1084374 1014696 703558 1002643 1068303 1024235 906319 854392
16343 854392 1041816 822336 891879 802443 796536 812057 1122341 875052 712142 773145 612325
16332 612325 930364 1016581 1073023 778486 1045318 990067 814261 688047 791748 728464
16322 728464 726543 824224 770070 616354 637397 1002431 968486 519583 863342 510626 691926
16311 691926 521706 637545 860705 669461 902017 783001 881434 727779 427432 674070
16301 674070 983066 546718 843781 707355 823055 914507 852364 618146 755292 516986
16291 516986 624352 1215642 500317 585186 838361 413614 178014 833427 949974 910095
16281 910095 768963 694209 995780 869405 658715 544118 423374 684607 596242 629001
$$ packed form
16353I61564j33325O4489J91646o9678l11138K99085O5660m4068j17916n1927
16343H54392J87424k19480O9543q9436n907J5521L10284k47289j62910O1003j60820
16332F12325L18039Q6217N6442k94537K66832n5251j75806j26214J03701o3284
16322G28464j921R7681n4154j53716K1043L65034l3945m48903L43759l52716J81300
16311F91926j70220J15839K23160j91244K32556j19016R8433j53655l00347K46638
16301F74070L08996m36348K97063j36426J15700R1452o2143k34218J37146k38306
16291E16986J07366N91290E00317Q4869K53175D13614A78014O55413J16547l9879
16281I10095j41132p4754L01571j26375k10690j14597j20744K61233q8365L2759
$$ plain form
16271 629001 883147 911777 413115 757309 470998 575328 754030 669385 911351 840484
16261 840484 255236 871907 733569 479959 986636 693132 476977 544598 632285 465558
16251 465558 494582 806846 768376 542759 776672 730649 848220 605002 1026229 765842
16241 765842 745358 816700 631415 308009 97065 481959 774253 659865 339022 270820
16231 270820 656273 555251 652307 256952 441370 216193 560225 494874 302179 569660
16221 569660 439571 402829 504399 484157 337907 314928 725705 482153 512073 323585
16211 323585 474089 215659 678945 694820 378873 536909 219395 157289 170760 460904
16201 460904 459038 168198 201973 226975 229447 602302 270528 460625 249306 356091 644734
$$ packed form
16271F29001K54146K8630D13115L44194k86311J04330J78702q4645K41966p0867
16261H40484B55236O16671j38338k53610N06677k93504k16155O7621Q7687j66727
16251D65558K9024L12264l8470k25617K33913m6023J17571k43218M21227k60387
16241G65842k0484P1342j85285C08009I7065L84894K92294j14388l20843o8202
16231B70820L85453j01022R7056B56952J84418B16193L44032o5351j92695K67481
16221E69660j30089l6742J01570k0242j46250k2979M10777k43552K9920j88488
16211C23585J50504B15659M63286J5875l15947J58036B19395o2106J3471K90144
16201D60904j866A68198L3775K5002K472L72855B70528J90097k11319J06785K88643
$$ plain form
16190 644734 117459 565700 620064 414723 337786 469119 309006 90550 360626 337233
16180 337233 548693 585634 351035 381836 570267 -150480 238957 429781 164568 632027
16170 632027 383224 368701 560246 340485 337214 516896 14707 415006 536068 287750
16160 287750 175696 140001 405100 239304 351868 117235 301252 213794 537039 602034
16150 602034 172290 292664 508157 311091 143590 349080 360945 519496 236638 296305
16140 296305 358894 718136 20905 248101 487489 267379 205573 254070 961663 292096
16129 486147 389180 304641 272351 678602 323636 39966 480938 2032 269669 537687 360153
16118 360153 31304 268402 397265 146279 181487 354534 118111 461527 225445 203870
$$ packed form
16190F44734A17459M48241N4364k05341p6937J31333j60113I0550K70076k3393
16180C37233K11460L6941k34599L0801J88431a50480B38957J90824A64568M67459
16170F32027k48803j4523J91545k19761l271J79682A4707M00299J21062k48318
16160B87750j12054l5695K65099j65796J12564A17235J84017q7458L23245O4995
16150F02034A72290J20374K15493j97066A43590K05490J1865J58551B36638N9667
16140B96305O2589L59242B0905K27196K39388k20110o1806M8497P07593B92096
16129D86147r6967q4539l2290M06251C23636C9966M40972B032K67637K68018j77534
16118C60153C1304K37098J28863A46279L5208J73047A18111L43416B25445k1575
$$ plain form
16108 203870 298985 237987 83790 238365 118624 150836 59052 731185 33660 388477 448662
16097 448662 359922 273075 232585 195327 63169 339148 209694 118160 297519 48625 299310
16086 299310 336833 217160 300635 170033 340283 339266 280228 276750 170473 161034 157066
16075 157066 -43459 127587 609798 -318406 -29381 287705 53008 246784 302181 -47518
16064 155883 309754 -67424 -76360 245926 306900 180530 306503 171953 206071 73192 -33992
16052 241369 439534 237034 310170 378813 387239 372757 206246 198714 436436 227149 204840
16041 204840 140557 -62875 298382 127351 -71754 20591 147344 279920 307988 163855
16031 163855 103382 155404 279838 3923 261933 368577 373564 62301 301421 87168 -76503
$$ packed form
16108B03870R5115o0998H3790J54575A18624L2212E9052O72133C3660L54817O0185
16097D48662q8740q6847m0490l7258F3169K75979j29454r1534J79359D8625K50685
16086B99310L7523j19673Q3475j30602J70250j017n9038l478j06277r439l968
16075A57066d3459A27587M82211c18406b9381B87705E3008J93776N5397d7518
16064A55883J53871f7424q936B45926O0974j26370J25973j34550L4118G3192c3992
16052B41369J98165k02500P3136O8643Q426j4482j66511p532K37722k09287k2309
16041B04840o4283f2875B98382A27351g1754B0591J26753J32576K8068j44133
16031A63855o0473N2022J24434C923K58010J06644M987F2301K39120H7168g6503
$$ plain form
16019 435933 147166 152704 47235 144120 -28750 17785 68211 20350 284482 -60404 130482
16007 10841 90959 37447 105251 255306 -57007 35604 -100539 -5808 195827 62357 20834
15995 -86925 297372 -71287 -38287 266992 -382905 249223 599542 476630 446805 862460
15985 862460 562205 529564 1006910 647015 477678 73030 318632 259263 26022 129114
15975 129114 45878 395429 -5033 -58980 63878 -19942 110074 -75828 -57225 59081 -5085
15963 115206 258908 126721 320826 67310 -309868 -57269 17778 172035 171030 -41601 126436
15951 -198861 -42018 -494204 80517 -175308 184137 -160236 -144505 157948 -98393 47919
15940 -40703 -187901 231047 -208845 -245267 -41867 -231780 -187222 -22947 -133675 -102672 39620
$$ packed form
16019D35933A47166N538D7235R6885b8750A7785N0426B0350K64132f0404A30482
16007A0841Q0118C7447O7804J50055e7007C5604a00539e808A95827F2357B0834
15995h6925B97372g1287L3000B66992c82905B49223L50319j22912k9825M15655
15985H62460l00255l2641M77346l59895j69337G3030K45602n9369B6022J03092
15975A29114D5878L49551e033n3947F3878a9942A10074g5828J8603E9081e085
15963A15206J43702A26721J94105F7310c09868e7269A7778J54257j005d1601A26436
15951a98861d2018m52186H0517a75308A84137a60236J5731A57948i8393D7919
15940d0703j47198B31047b08845l6422d1867j89913M4558b2947j10728L1003C9620
$$ plain form
15928 -167592 -108684 -293761 -91537 -170216 165519 197701 -14753 238665 122478 -176696
15917 125708 172546 -30242 -1523 204047 -62866 -189249 -243501 115850 7953 -165856 -69900
15905 2337 43992 -54186 76356 77576 6973 80854 -316948 189735 207002 16289 112389 190220
15893 190220 173323 130288 -53447 102557 72058 59417 117333 -1622 -18500 2341 -246032
15881 -3901 11567 -22268 -4761 -214024 -123469 234041 111903 -5733 209747 120729 52795
15869 -51832 78125 -132127 -52513 90959 -146359 -110599 -80890 69179 -159541 -13290 173768
15857 118629 221208 -98778 202159 -38443 -419715 267134 -127517 -2110 244756 -156222
15846 -5939 -215929 29963 56403 181359 6079 226494 -111797 70111 125296 -39151 78263
$$ packed form
15928a67592N8908j85077i1537p8679A65519L2182a4753B38665j16187a76696
15917A25708M6838c0242a523B04047f2866j26383n4252A15850G953a65856f9900
15905B337M1655e4186G6356J220F973P3881c16948A89735J7267A6289R6100P7831
15893A90220j6897m3035e3447A02557l0499j2641N7916a622j6878B341b46032
15881c901A1567b2268d761k09263R0555B34041A11903e733B09747q9018E2795
15869e1832G8125a32127e2513I0959a46359L5760K9709F9179a59541a3290A73768
15857A18629J02579i8778B02159c8443l81272B67134a27517b110B44756a56222
15846e939k09990B9963K6440J24956F079K20415a11797G0111N5185c9151G8263
$$ plain form
15834 -3170 116304 57181 88455 152070 20621 5854 192717 -310812 -24796 -143227 44314
15822 -119807 -287439 -52223 -370427 6180 -487456 -126028 173665 -108563 -123982 -76770
15812 -76770 111247 -211080 16583 147102 -116522 -24683 27685 198339 182894 -17911 246485
15800 98076 243993 -26834 132201 288617 -126140 358367 -181604 401557 163347 -248314
15789 17714 366967 -115245 -55456 293617 -209374 202324 -258833 -100288 40046 -37753
15778 -130659 170574 -252853 -119985 212579 62850 -36014 -45657 138645 -174560 222387
15767 115081 -71893 -288046 97869 -18693 32023 97118 -130383 -120324 -32086 173294 -125800
15755 -99748 57059 -272441 -176905 189253 -187477 373364 -224424 -369781 9461 37645 203059
$$ packed form
15834c170A16304E7181L1274O3615B0621E854J86863c10812b4796j18431D4314
15822a19807j67632e2223l18204F180d87456a26028A73665a08563j5419M7212
15812g6770A11247b11080A6583J30519a16522b4683B7685J70654j5445a7911B46485
15800I8076J45917b6834A32201J56416a26140C58367a81604D01557A63347b48314
15789A7714L49253a15245e5456B93617b09374B02324b58833a00288D0046c7753
15778a30659A70574b52853a19985B12579F2850c6014r643A38645a74560B22387
15767A15081g1893k16153I7869a8693C2023O5095a30383J0059c2086A73294a25800
15755i9748E7059b72441R5536A89253a87477C73364b24424j45357I461K8184J65414
$$ plain form
15744 203059 301125 -9860 230274 -45266 -15422 -188823 -101661 -40282 -59201 -82315 -132220
15733 -132220 285212 -164122 120343 174296 144131 -481580 -256200 134239 -17393 -165666
15723 -165666 166701 17741 -74573 -49467 -129402 -167139 -302313 -61009 127261 -146730 -294906
15712 -294906 -18431 -156811 -243798 -233007 -347202 81826 -73114 -187162 -264672 204441 -201591
15700 177857 80708 159855 201087 -126861 161316 -416420 -101525 -280768 -32856 -333947
15690 -333947 -15525 57609 274210 175184 -40344 72119 -18270 -38346 240911 98345 -7465
15678 7758 -53924 -107007 327402 210977 -85458 -102981 11170 -41962 -68508 67786 -6542 -26214
15666 -26214 -78215 103196 -61301 121510 150373 -158186 -30260 -120299 -262106 -35290 -181255
$$ packed form
15744B03059R8066i860B30274d5266a5422j73401Q7162d0282j8919k3114m9905
15733a32220B85212a64122A20343N3953l0165d81580K25380A34239a7393j48273
15723a65666A66701A7741g4573K5106p9935l7737j35174f1009A27261a46730j48176
15712b94906a8431j38380q6987J0791j14195H1826g3114j14048p7510B04441b01591
15700A77857H0708P9147M1232a26861A61316d16420a01525j79243c2856l01091
15690c33947a5525E7609K16601r9026d0344G2119a8270k0076B40911I8345g465
15678G758e3924n3083C27402j16425h5458j7523A1170d1962k6546F7786f542j9672
15666b6214n2001A03196f1301A21510K8863a58186c0260r0039j41807c5290j45965
$$ plain form
15655 -181255 -168536 -118811 -218114 -43101 146418 -162126 -309203 143514 120009 -17406 126269
15643 278364 -86825 -293245 -43958 32369 -228854 439013 109400 -203413 -200046 -144167 158239
15631 204203 255709 -73791 49056 -101623 -1124 -292001 -109434 -143919 136307 -124309 -291581
15620 -291581 -316319 -187791 -142470 -172903 5831 93001 -234611 -53804 -23887 -161505 -263681
15609 -263681 -62390 198055 82384 -149915 -125656 -132137 10974 7027 -1795 21983 110841 -74564
15596 149750 104262 132147 168048 -51054 57579 -37243 -206375 -33118 -153391 96558 67334
15585 67334 253590 180702 -143861 -68343 90498 11995 -55867 -82174 -272245 -288342 280264
15573 -54858 -123159 5834 -131456 -159137 135674 -112420 -51310 -118719 -73052 -177135 -242481
$$ packed form
15655a81255J2719M9725r9303d3101A46418a62126j47077A43514k3505a7406A26269
15643B78364h6825k06420d3958C2369b28854D39013A09400b03413L367N5879A58239
15631B04203N1506g3791D9056a01623a124k90877a09434l4485A36307a24309j67272
15620b91581k4738J28528M5321l0433E831Q7170b34611e3804b3887j37618j02176
15609b63681f2390A98055H2384a49915K4259o481A0974l947a795B1983Q8858g4564
15596A49750m5488K7885L5901e1054E7579c7243j69132c3118j20273I6558k9224
15585F7334J86256p2888a43861f8343I0498A1995e5867k6307j90071j6097B80264
15573e4858o8301E834a31456k7681A35674a12420e1310o7409M5667j04083o5346
$$ plain form
15562 -242481 351734 -55866 22101 -60526 30571 -237648 -22623 72621 217645 11891 -163854
15550 -106215 -108210 209842 -24402 -491639 29612 34601 -193290 12507 -47592 -164900 -288421
15539 -288421 53796 -84098 -113861 126984 64692 108003 40686 -231514 -27854 -194513 146334
15527 71403 -143427 -4413 254197 72655 -173755 76464 163209 186640 -8376 79383 311570
15516 311570 197965 243476 98216 61831 -162079 94173 -166400 -152504 -351211 72588 299685
15505 299685 -11075 -328795 35021 -56330 189656 -219876 191477 -142206 81491 91567
15495 91567 177068 150425 -30748 228759 -380617 285339 -44558 192211 61524 251220 -173292
15483 169859 -99873 -205394 206174 222336 -244677 -31058 -168658 436737 172826 309279
$$ packed form
15562b42481C51734e5866B2101f0526C0571b37648b2623G2621J45024A1891a63854
15550a06215j995B09842b4402m67237B9612M989a93290A2507d7592j17308j23521
15539b88421E3796h4098k9763A26984o2292M3311D0686b31514b7854j66659A46334
15527G1403a43427d413B54197G2655a73755G6464Q6745K3431h376G9383K32187
15516C11570j13605M5511I8216l6385a62079I4173a66400J3896j98707G2588K27097
15505B99685a1075l17720C5021e6330A89656b19876A91477a42206H1491J0076
15495I1567Q5501k6643c0748B28759c80617B85339d4558A92211F1524J89696a73292
15483A69859i9873j05521B06174J6162b44677c1058j37600D36737A72826J36453
$$ plain form
15473 309279 406419 239897 272175 160430 -69252 172358 -92859 -213131 30762 238785
15463 238785 86829 -23088 63464 -54723 208085 -157009 107896 2979 276660 -57525 167646
15451 -107607 51816 221104 168666 193297 -199598 41704 100470 338225 44175 765469 454846
15440 454846 532525 465479 772029 330081 227711 -218549 234557 189186 -312472 264435
15429 -166592 -413665 -432718 170949 -100101 13057 88026 -80202 -153139 150329 -456775
15418 73938 -205813 205480 92432 181726 225908 -127094 -645 -320927 -151797 187236 149276
15407 149276 43016 -243164 91621 69515 -23956 -93072 51265 72155 -25500 87471 -171773
15395 172678 -293604 -32157 -40973 345325 177079 -90207 142947 126809 129118 -155999 145907
$$ packed form
15473C09279R7140j66522L2278j11745f9252A72358i2859j20272C0762K08023
15463B38785H6829b3088F3464e4723B08085a57009A07896B979K73681e7525A67646
15451a07607E1816J69288n2438K4631a99598D1704N8766K37755D4175P21294l10623
15440D54846P7679o7046L06550C30081j02370b18549B34557m5371c12472B64435
15429a66592k47073j9053A70949a00101A3057P4969h0202p2937A50329d56775
15418G3938b05813B05480I2432Q9294M4182a27094f45l20282a51797A87236l7960
15407A49276D3016b43164I1621k2106b3956o9116E1265K0890b5500H7471a71773
15395A72678b93604c2157q816C45325j68246i0207A42947j6138K309a55999A45907
$$ plain form
15383 212706 75195 -80868 243086 148945 -135353 -212918 -76125 -31844 211540 463147 101818
15371 158365 255275 -1358 305742 13493 -49848 -279213 218640 -22268 148798 15775 215429
15360 215429 -275008 43103 -27602 -230756 304995 497890 187704 106291 111411 354574
15350 354574 111980 8964 -8416 51237 191326 -91514 129518 32294 80089 279317 -163
15338 255211 32810 67476 43961 -114399 -97291 -184231 13732 -224260 205442 210123 174186
15327 174186 196192 47927 87392 247236 90412 104022 -208871 126280 -103716 105827
15316 185943 132605 -29048 -29201 -613 122156 330952 159570 76328 141873 494019 12745
15304 -12971 320865 9091 88066 150145 55555 48248 41804 -207558 -198177 142452 54742 41526
$$ packed form
15383B12706G5195h0868B43086r4141a35353p7565g6125c1844B11540K51607A01818
15371A58365R6910a358C05742A3493d9848k29365B18640b2268A48798A5775J99654
15360B15429b75008D3103b7602k03154C04995J92895A87704q1413N120K43163
15350C54574A11980H964h416E1237J40089i1514A29518C2294M7795J99228a63
15338B55211C2810L4666k3515a14399J7108q6940A3732b24260B05442M681l5937
15327A74186K2006D7927L9465J59844I0412J3610b08871A26280a03716A05827
15316A85943n3338b9048j53f13A22156K08796A59570G6328O5545L52146A2745
15304a2971C20865I091P8975O2079E5555p307o444b07558R381A42452E4742j3216
$$ plain form
15292 41526 -166956 -46272 351922 171510 -72281 -229907 -103394 -79279 17251 10674 -8731
15280 108193 26060 170039 109224 -85504 203786 211192 46853 357783 121449 65345 -398838
15268 -14483 384771 -125761 159048 58847 191534 239945 -98915 270123 -218632 79558
15257 89547 150408 845 -5775 232592 -42641 184662 14137 508769 162920 235522 307118
15246 307118 1297590 1284610 1130502 1144277 396640 433620 -101429 29774 65547 -92281 228378
15234 -175335 -134157 -121149 -237355 109803 -5302 -15417 -109244 128344 86952 -35278 -16314
15222 -406276 79106 276709 161734 -109939 169172 100201 -207380 25555 -83169 56137
15211 -82578 157790 198186 57672 99330 35629 212040 97018 60525 -13793 81873 -152430
$$ packed form
15292D1526a66956d6272C51922A71510g2281j57626a03394K4115A7251o577h731
15280A08193B6060J43979o0815h5504B03786P406D6853L10930A21449n6104c98838
15268a4483C84771a25761A59048E8847J32687M8411i8915B70123b18632G9558
15257H9547O0861H45e775B32592d2641A84662A4137M94632A62920P2602P1596
15246C07118R90472j2980j54108J3775C96640L6980a01429B9774L5773i2281B28378
15234a75335M1178J3008j16206A09803e302j0115r3827A28344m1392c5278a6314
15222d06276G9106J97603j14975a09939A69172o8971b07380B5555h3169E6137
15211h2578A57790M0396E7672M1658C5629J76411I7018l6493a3793H1873a52430
$$ plain form
15199 -136438 213109 -155429 48375 -125076 23808 63571 -29909 132101 169198 -83981 159496
15187 126854 25352 57414 277925 111471 109445 170423 150962 103873 178600 -15253 -73415
15176 -73415 74949 242484 73234 180475 44922 -30103 -101390 -14383 238107 140056 166457
15165 166457 52485 -162232 268822 152710 -95623 2170 151628 -130822 17047 -47972 1829
15153 103183 30915 193762 -47012 144287 -16647 97269 40264 316239 -329818 75720 -20052
15141 -244404 321337 -65306 128339 -59393 -99543 109835 10771 18282 236922 -125400 -238157
15130 -238157 108223 -3273 121251 10782 129929 -90541 13737 176458 10537 188865 595604
15119 595604 61073 311105 85712 -20936 -161114 -108593 -184885 265229 4358 -120175 28378
$$ packed form
15199a36438B13109a55429D8375a25076B3808L9763b9909A32101L7097h3981A59496
15187A26854B5352L2062K20511A11471k026O0978j9461m7089P4727a5253n8162
15176g3415G4949J67535G3234J07241D4922c0103p1287a4383B38107r8051K6401
15165A66457E2485a62232B68822j16112i5623B170J49458a30822A7047d7972A829
15153A03183C0915J62847d7012A44287a6647I7269D0264K75975c29818G5720b0052
15141b44404C21337f5306A28339e9393m0150A09835A0771P511K18640a25400j12757
15130b38157A08223c273A21251A0782J19147i0541A3737J62721A0537J78328M06739
15119E95604F1073K50032H5712b0936j40178N2521p6292B65229D358a20175B8378
$$ plain form
15107 -102235 -174895 2956 -9825 -89390 -74101 225057 5279 152098 2087 133530 333855
15096 333855 96668 -175690 -92070 222366 -13013 11671 211701 201953 238787 97392 59232
15085 59232 -33902 -73658 183195 152853 125005 130415 12394 -71174 85872 47386 145603 300753
15073 300753 318105 179908 -193726 384379 257003 -56889 18668 -113587 127274 347088
15063 347088 332216 246110 67703 48242 -57559 335901 335699 311577 274516 408096 268831
15052 268831 367766 363249 260336 125194 260771 198002 4299 329350 447991 34246 321330
15041 321330 334962 164228 184914 435555 40768 320866 252480 194155 246218 85146 -11274
15029 131030 306966 268404 633170 800400 207844 563659 314802 377436 335310 97413
$$ packed form
15107a02235p2660B956i825p9565J5289B25057E279J46819B087J31443K00325
15096C33855I6668a75690Q3620B22366a3013A1671K00030r748L6834I7392l8160
15085E9232c3902l9756A83195l0342k7848N410A2394g1174H5872l8486R8217J55150
15073C00753J7352j38197a93726C84379j27376e6889A8668a13587A27274K19814
15063C47088j4872q6106F7703j9461e7559C35901k02k4122l7061J33580j39265
15052B68831R8935m517j02913A25194J35577o2769D299L25051J18641C4246K87084
15041C21330J3632A64228K0686K50641D0768K80098o8386n8325N2063H5146a1274
15029A31030J75936l8562L64766J67230B07844L55815k48857O2634m2126I7413
$$ plain form
15018 359102 239966 224676 172049 304721 296273 130958 116857 343742 193021 579975
15008 579975 101352 144758 344532 380258 307866 439078 207062 37676 191412 133031
14998 133031 316603 275885 583249 280478 387814 385428 405459 117278 471509 291733
14988 291733 437941 34684 206447 452361 68950 265015 581738 233230 648333 475789
14978 475789 839849 564066 191313 313249 223566 370795 256285 428812 206468 852965
14968 852965 248062 298525 181421 391834 612712 372483 149181 125265 377871 211876
14958 211876 246939 31141 -2433 188763 72979 107398 278990 529660 44106 250409 -19114
14946 458882 419676 191634 541354 322255 478037 492787 452936 172003 188354 421240
$$ packed form
15018C59102j19136j5290n2627J32672q448A30958j4101K26885j50721L86954
15008E79975A01352M3406J99774L5726p2392J31212B07062C7676J53736n8381
14998A33031J83572m0718L07364B80478J07336k386K0031A17278L54231j79776
14988B91733J46208C4684J71763K45914F8950J96065L16723B33230M15103j72544
14978D75789L64060k75783A91313J21936q9683J47229j14510J72527B06468O46497
14968H52965B48062N0463j17104K10413K20878k40229A49181k3916K52606j65995
14958B11876L5063C1141b433A88763G2979L4419J71592K50670D4106K06303a9114
14946D58882l9206A91634L49720k19099J55782J4750l9851A72003J6351K32886
$$ plain form
14936 421240 380965 474188 238080 227396 438178 528186 617131 1025385 878087 901451 1003876
14925 1003876 1045061 801233 992221 736445 941328 1011009 1256641 1069285 1308615 1610254
14915 1610254 1340951 1155017 969038 924753 729928 798510 325678 337530 457402 449442
14905 449442 335113 319418 554243 257973 631754 247917 466085 420830 609162 345379
14895 345379 546112 179235 533492 395762 273779 227404 502916 401965 424447 526308
14885 526308 775127 364221 631872 507642 215901 711123 506219 599257 760055 657565
14875 657565 172039 678336 458146 358746 439285 75544 429070 514966 453576 245710
14865 245710 185819 732776 515802 543870 256677 401750 168506 511053 431282 141027
$$ packed form
14936D21240m0275R3223k36108j0684K10782R0008Q8945M08254j47298K3364J02425
14925A003876M1185k43828J90988k55776K04883O9681K45632j87356K39330L01639
14915A610254k69303j85934j85979m4285j94825O8582C25678J1852J19872p960
14905D49442j14329j5695K34825B57973L73781B47917K18168m5255J88332k63783
14895C45379K00733A79235L54257j37730j21983m6375K75512j00951K2482J01861
14885E26308K48819C64221K67651j24230B15901M95222k04904R3038J60798j02490
14875F57565A72039N06297k20190r9400Q0539G5544L53526Q5896o1390k07866
14865B45710n9891N46957k16974K8068B56677J45073A68506L42547p9771A41027
$$ plain form
14854 87645 157003 442533 -24384 36146 1391 772622 479709 166957 333516 568164 378796
14843 378796 591146 485127 351248 879105 840356 699690 864152 1046420 674958 575581
14833 575581 831245 541344 391331 377148 230361 595467 605904 403137 414564 512407
14823 512407 750678 475514 608428 471963 686823 687056 72163 220721 499573 317016
14813 317016 43015 478522 472212 971968 643503 290071 177677 386189 581945 210395
14802 636811 725087 785800 545770 338868 571030 351570 317421 455650 242039 590094
14792 590094 273442 573081 139665 582238 443336 475082 661795 390793 564175 635010
14782 635010 290130 318203 421396 647922 516730 783343 296573 554183 603189 416938
$$ packed form
14854H7645O9358K85530b4384C6146A391P71231k92913A66957J66559K34648j89368
14843C78796K12350j06019j33879N27857l8749j40666J64462J82268l71462r9377
14833E75581K55664k89901j50013j4183j46787L65106J0437k02767J1427R7843
14823E12407K38271k75164J32914j36465K14860K33G2163J48558K78852j82557
14813C17016D3015M35507o310M99756l28465B90071j12394K08512J95756B10395
14802F36811Q8276O0713k40030k06902K32162k19460l4149J38229k13611L48055
14792E90094B73442K99639A39665M42573j38902L1746J86713k71002J73382P0835
14782F35010B90130K8073J03193K26526j31192K66613B96573K57610M9006j86251
$$ plain form
14772 416938 622132 629141 671777 888897 507666 646638 558626 612944 578780 463299 407038
14761 407038 362689 307587 556182 192913 294325 621850 785709 675737 500851 229710
14750 639697 640292 393824 558145 874031 538673 352519 534224 680576 598626 686183
14740 686183 504028 538051 628619 600102 472931 540941 739536 660469 721934 734382 553190
14729 553190 585130 711342 882060 899414 1109621 1145384 1005688 1183213 1450583 1108077
14719 1108077 953841 749100 1136767 730023 684211 701868 588210 720089 732518 714321
14709 714321 1012028 647691 673968 549495 894834 686228 930148 813943 1110475 927485
14699 927485 1226055 1273109 1053727 1253796 1110589 794554 742909 698911 626257 457466
$$ packed form
14772D16938K05194P009M2636K17120l81231J38972q8012N4318l4164j15481n6261
14761D07038m4349n5102K48595A92913J01412L27525J63859j09972j74886B29710
14750F39697N95k46468J64321L15886l35358j86154J81705J46352q1950Q7557
14740F86183j82155L4023R0568k8517j27171O8010J98595p9067O1465J2448j81192
14729E53190L1940J26212J70718J7354K10207L5763j39696J77525K67370l42506
14719A108077j54236k04741L87667m06744m5812J7657j13658J31879J2429j8197
14709G14321K97707l64337K6277j24473L45339k08606K43920j16205K96532j82990
14699I27485K98570M7054k19382K00069j43207l16035n1645m3998p2654j68791
$$ plain form
14689 457466 583946 789052 834987 547958 863963 538556 675671 769798 845321 830187
14679 830187 663802 698596 579096 525626 785905 850335 921711 770922 812179 822868 600415
14668 600415 553430 1001401 907491 1214480 883893 878624 924504 608774 1184933 881084
14658 881084 982730 686658 810242 1079246 895610 656274 781807 771261 822943 953004
14648 953004 1039077 1009815 897257 1421797 894468 898896 865534 669226 1127660 946300
14638 946300 862651 1121969 1172885 868327 455594 1079662 930846 1083094 1220635 1359746
14628 1359746 794891 1166524 1146831 1060935 1106085 1246820 1519015 1008799 1275245 1188993
14618 1188993 1238204 1338695 907865 1090681 758812 1327754 1219231 1128992 999963 1416330
$$ packed form
14689D57466J26480K05106M5935k87029L16005l25407J37115R4127P5523j5134
14679H30187j66385L4794j19500n3470K60279O4430P1376j50789M1257J0689k22453
14668F00415m6985M47971r3910L06989l30587n269M5880l15730N76159l03849
14658H81084J01646k96072J23584K69004j83636k39336J25533j0546N1682J30061
14648I53004Q6073k9262j12558N24540n27329M428l3362j96308M58434j81360
14638I46300q3649K59318N0916l04558m12733O24068j48816J52248J37541J39111
14628A359746n64855L71633j9693q5896M5150J40735K72195n10216K66446q6252
14618A188993M9211J00491m30830J82816l31869N68942j08523r0239j29029M16367
$$ plain form
14608 1416330 947213 1162101 1307669 1257867 1038097 1219681 1352078 1138889 1325831 1333484
14598 1333484 1425932 1228925 1401226 1070661 1336250 1780378 1550172 1622397 1617270 1315067
14588 1315067 1478935 1317206 1538880 1223081 1678234 1387702 1451416 1565622 1669384 1451782
14578 1451782 1492140 1345304 1775771 1468495 1380123 1674235 2005378 1789037 1770183 1799350
14568 1799350 1649909 1739801 2075704 2208823 1783002 2055158 2275369 2062569 2139758 2287092
14558 2287092 2345257 1926850 2808789 2649866 2936905 3332911 3276987 3907659 4816881 5881664
14548 5881664 9804445 18729239 33373058 37342463 19736775 8767655 5988016 3318944
14540 3318944 2386572 1872632 1765754 1588118 1769622 1799544 1596278 1453077 1663925 1698981
$$ packed form
14608A416330m69117K14888J45568m9802k19770J81584J32397k13189J86942P653
14598A333484R2448j97007J72301l30565K65589M44128k30206P2225n127l02203
14588A315067J63868j61729K21674l15799M55153k90532O3714J14206J03762k17602
14578A451782M0358j46836M30467l07276q8372K94112L31143k16341j8854K9167
14568A799350j49441Q9892L35903J33119m25821K72156K20211k12800P7189J47334
14558B287092N8165m18407Q81939j58923K87039L96006n5924O30672R09222J064783
14548E881664L922781Q924794J4643819L969405j7605688H767655k779639k669072
14540C318944r32372n13940j06878j77636J81504K9922k03266j43201K10848L5056
$$ plain form
14530 1698981 2054100 1471954 1706637 1747512 1882252 1751488 2038823 1948965 2162534 1787425
14520 1787425 1855544 2208302 2238248 2425107 2083206 2263746 2039439 1913581 2329261 2250604
14510 2250604 1958518 2336896 2281487 2412497 2175739 2441996 2374334 2534465 2333326 2414907
14500 2414907 2692184 2397471 2628370 2607490 2705121 2862271 2477623 2846544 2729702 2758719
14490 2758719 2938877 2870917 2923416 2915617 3088042 2801161 2959720 2707021 3249633 3247435
14480 3247435 3118478 3218643 3295327 3286543 3125080 3059986 3444197 3515370 3341935 3331816
14470 3331816 3630805 3413218 3340864 3806058 3605852 3790186 3922779 3602133 3592323 3928475
14460 3928475 3755908 3801534 4038200 3857660 3884964 4307667 4227078 4061657 4062010 4298140
$$ packed form
14530A698981L55119n82146K34683M0875J34740j30764K87335q9858K13569l75109
14520A787425O8119L52758K9946J86859l41901J80540k24307j25858M15680p8657
14510B250604k92086L78378n5409J31010k36758K66257o7662J60131k01139Q1581
14500B414907K77277k94713K30899k0880R7631J57150l84648L68921j16842K9017
14490B758719J80158o7960N2499p799J72425k86881J58559k52699N42612k198
14480C247435j28957J00165P6684q784j61463o5094L84211P1173j73435j0119
14470C331816K98989k17587p2354M65194k00206J84334J32593l20646r810L36152
14460C928475j72567M5626K36666j80540K7304M22703q0589j65421L53K36130
$$ plain form
14450 4298140 4166634 4285095 4153459 4375153 4085482 4555807 4740217 4920749 4774720
14441 4774720 5168387 4608802 4767900 4908884 5086776 5353382 5267741 5098532 5556549 5626608
14431 5626608 5352406 5574635 5481357 5819737 5671414 5968901 6002006 6049276 6255291 6384192
14421 6384192 6241750 6264929 6785706 6872281 7068733 6906446 7127936 6977530 7000790 7104052
14411 7104052 7147103 7352728 7496366 7849949 7605908 7892195 8282687 8473109 8285784 8319253
14401 8319253 8669018 8831048 8924578 8783267 8872699 8900814 9066913 9466591 9330687 9591039
14391 9591039 9774468 10091858 10199300 10012592 10626730 10754847 11017163 11124267 11308152
14382 11308152 11806365 11811105 11771310 12340319 12727376 12750977 12886490 13083626 13444731 13752707
$$ packed form
14450D298140j31506J18461j31636K21694k89671M70325J84410J80532j46029
14441D774720L93667n59585J59098J40984J77892K66606q5641j69209M58017P0059
14431E626608k74202K22229r3278L38380j48323K97487L3105M7270K06015J28901
14421F384192j42442K3179N20777Q6575J96452j62287K21490j50406K3260J03262
14411G104052M3051K05625J43638L53583k44041K86287L90492J90422j87325L3469
14401H319253L49765J62030R3530j41311Q9432K8115J66099L99678j35904K60352
14391I591039J83429L17390J07442j86708O14138J28117K62316J07104J83885
14382A1308152M98213M740l9795N69009L87057K3601J35513J97136L61105L07976
$$ plain form
14372 13752707 13915347 14086882 14758488 14764168 15053309 15574817 15725856 15998443 16299305 16935066
14362 16935066 17288124 17210652 17904564 18336522 18482341 18801644 19381890 19712305 20283095
14353 20283095 20870196 21318635 21358651 22435887 23002779 23531014 24158049 24769809 25160937
14344 25160937 26062759 26589121 27179744 27967396 28722344 29461109 30707641 30958829 32367189
14335 32367189 33024786 34211844 35076669 36179724 37374024 38302621 39967904 40743091 42300297
14326 42300297 43593578 45156127 46357400 48387006 50213018 51772920 53855785 55758231
14318 55758231 57503860 59791944 61897308 63911019 66826589 69293367 72228330 75606568
14310 75606568 78180125 81353664 85471075 89030755 93335579 97174020 101862087 106549574
$$ packed form
14372A3752707J62640J71535O71606N680K89141N21508J51039K72587L00862O35761
14362A6935066L53058p7472O93912M31958J45819L19303N80246L30415N70790
14353B0283095N87101M48439M0016J077236N66892N28235O27035O11760L91128
14344B5160937R01822N26362N90623P87652P54948P38765J246532K51188J408360
14335C2367189O57597J187058Q64825J103055J194300R28597J665283P75187J557206
14326D2300297J293281J562549J201273K029606J826012J559902K082865J902446
14318E5758231J745629K288084K105364K013711K915570K466778K934963L378238
14310G5606568K573557L173539M117411L559680M304824L838441M688067M687487
$$ plain form
14302 106549574 111721442 116983142 122998961 128991510 135616895 142732662 150258401 158056179
14294 158056179 166830235 176151811 185396840 195634027 206497022 218163140 230218953
14287 230218953 242878071 256221849 269911498 284430857 298999034 314395111 330018862
14280 330018862 345186437 360510711 375428517 389250237 402297847 413978061 423739680
14273 423739680 431608462 436012302 435925513 434566685 432369619 432183299 429900257 423970429
14265 423970429 414955441 403343390 390109428 375956848 361107117 345422712 329815947
14258 329815947 314332094 299048011 283809494 269153811 255252710 242168912 230071029
14251 230071029 218114817 206327268 195503776 185424350 175459003 166946167 158517407
$$ packed form
14302A06549574N171868N261700O015819N992549O625385P115767P525739P797778
14294A58056179Q774056R321576R245029J0237187J0862995J1666118J2055813
14287B30218953J2659118J3343778J3689649J4519359J4568177J5396077J5623751
14280C30018862J5167575J5324274J4917806J3821720J3047610J1680214R761619
14273D23739680P868782M403840q6789j358828k197066j86320k283042n929828
14265D23970429r014988j1612051j3233962j4152580j4849731j5684405j5606765
14258C29815947j5483853j5284083j5238517j4655683j3901101j3083798j2097883
14251B30071029j1956212j1787549j0823492j0079426r965347q512836q428760
$$ plain form
14244 158517407 150601437 143128248 136384737 129340976 123235774 117579489 112496918 107515605
14236 107515605 102425943 97992810 93471335 89583479 86202250 82753891 79239552 75795754
14228 75795754 72867410 70126982 67339624 64560164 62510774 59987218 57845100 55980729
14220 55980729 53873339 52304446 50120717 48396643 46946949 45432015 44099574 43008928
14212 43008928 41760887 39922615 38991402 37677905 36925478 35593350 35067485 33653632
14204 33653632 32577307 31389736 31105549 30631649 29465090 28834452 27855837 26915353 26314091
14195 26314091 25536643 25380324 24156237 24201591 23141014 22845381 22160116 21525989 20836940
14186 20836940 20807556 20104191 19666212 19278567 18748593 18685179 18253447 17461306 17484726 16838021
$$ packed form
14244A58517407p915970p473189o743511p043761o105202n656285n082571m981313
14236A07515605n089662m433133m521475l887856l381229l448359l514339l443798
14228G5795754k928344k740428k787358k779460k049390k523556k142118j864371
14220E5980729k107390j568893k183729j724074j449694j514934j332441j090646
14212D3008928j248041j838272r31213j313497p52427j332128n25865j413853
14204C3653632j076325j187571k84187m73900j166559o30638r78615r40484o01262
14195B6314091p77448j56319j224087M5354j060577k95633o85265o34127o89049
14186B0836940k9384p03365m37979l87645n29974o3414m31732p92141K3420o46705
$$ plain form
14176 16838021 16822260 16133662 15999071 15904148 15236231 15252789 14660397 14560148 14350853 13877314
14166 13877314 13709637 13630892 12907863 12963368 12501076 12585114 12295960 12127762 11768779 11565859
14156 11565859 11312850 11217883 11123063 10577376 10574981 10345322 10587413 10133623 10083459 9846137
14146 9846137 9597825 9571913 9461303 9116624 9074363 8902259 8659628 8707390 8551514 8630145
14136 8630145 8485463 7946443 8086376 7753829 7681983 7683346 7646307 7241164 7157021 7144063
14126 7144063 7237520 6819116 6827877 7025648 7168682 6666852 6555699 6343609 6694933 6336583
14116 6336583 6249916 6111387 5965299 6083347 5878408 5988496 5904814 5953707 5594033 5573367
14106 5573367 5341508 5318617 5544890 5187214 5283917 5491414 4955054 5228986 4841202 4923218
$$ packed form
14176A6838021j5761o88598j34591r4923o67917J6558n92392j00249k09295m73539
14166A3877314j67677p8745p23029N5505m62292Q4038k89154j68198l58983k02920
14156A1565859k53009r4967r4820n45687k395k29659K42091m53790n0164k37322
14146I846137k48312k5912j10610l44679m2261j72104k42631M7762j55876P8631
14136H630145j44682n39020J39933l32547p1846J363l7039m05143q4143j2958
14126G144063R3457m18404Q761J97771J43034n01830j11153k12090L51324l58350
14116F336583q6667j38529j46088J18048k04939J10088q3682M8893l59674k0666
14106E573367k31859k2891K26273l57676R6703K07497n36360K73932l87784Q2016
$$ plain form
14096 4923218 5121331 5282507 4795732 4732087 4491748 4764235 4462727 4628248 4441601 4334393
14086 4334393 4302065 4264041 4346676 4147047 3773977 4130935 4233836 3840155 3986109 4143950
14076 4143950 3905688 3814105 3862251 3469665 4013344 3854402 3719296 3291819 3765447 3391300
14066 3391300 3187372 3796578 3569288 2993517 3385465 3430409 3396962 3282669 3261756 3078276
14056 3078276 3355366 3368546 3079349 3003595 3266177 3168148 2776726 2751502 2702767 3039797
14046 3039797 2722095 2722490 2691896 2656760 2658623 2811607 2466414 2643312 2563259 2515938 2596484
14035 2596484 2699093 2510135 2694786 2655547 2740007 2797796 2882610 2740913 2461568 2563604
14025 2563604 2112809 2375957 2237762 2273118 2506178 2429806 2216804 2501102 2099927 2182773
$$ packed form
14096D923218J98113J61176m86775o3645k40339K72487l01508J65521j86647j07208
14086D334393l2328l8024Q2635j99629l73070L56958J02901l93681J45954J57841
14076D143950k38262r1583M8146l92586N43679j58942j35106m27477M73628l74147
14066C391300k03928O09206k27290n75771L91948M4944l3447j14293k0913j83480
14056C078276K77090J3180k89197p5754K62582r8029l91422k5224m8735L37030
14046C039797l17702L95l0594l5136J863J52984l45193J76898q0053m7321Q0546
14035B596484J02609j88958J84651l9239Q4460N7789Q4814j41697k79345J02036
14025B563604m50795K63148j38195L5356K33060p6372k13002K84298m01175Q2846
$$ plain form
14015 2182773 2094351 2190756 2310872 2312366 1827190 2347237 1895278 1838989 1925392 2229302
14005 2229302 1672880 2043835 1947963 1620244 1680162 1732777 1962303 1609695 2126397 1637775
13995 1637775 1287856 1864610 2043720 1600272 1629904 2292500 2949935 4837066 11749882
13986 11749882 26754366 38653083 26532154 12766853 6986545 5317492 4272057
13979 4272057 3532174 3052265 2701928 2503110 2401313 2491318 2335748 2301622 2392443 2408461
13969 2408461 2030246 2163794 2040973 1976688 1910347 1956800 2013323 1888649 1868494 1756586
13959 1756586 1939332 1360374 1709748 1778488 1597935 1682300 1598661 1477991 1413689 1565814
13949 1565814 1556573 1418899 1546092 1441983 1201461 1688146 1556969 1621805 1746999 1603670
$$ packed form
14015B182773q8422R6405J20116J494m85176N20047m51959n6289Q6403L03910
14005B229302n56422L70955r5872l27719N9918N2615K29526l52608N16702m88622
13995A637775l49919N76754J79110m43448K9632O62596O57435J887131O912816
13986A1749882J5004484J1898717j2120929A2766853n780308j669053j045435
13979D272057p39883m79909l50337j98818j01797R0005j55570l4126R0821J6018
13969B408461l78215J33548j22821o4285o6341M6453N6523j24674k0155j11908
13959A756586J82746n78958L49374O8740j80553Q4365q3639j20670o4302J52125
13949A565814r241j37674J27193j04109k40522M86685j31177O4836J25194j43329
$$ plain form
13939 1603670 1373821 1386155 1370885 1343404 1106674 1131565 1538066 1540088 1371890 1361839 1233824
13928 1233824 1460625 1411787 1404470 1259375 1758662 1484589 1359824 1022197 1034072 1252557
13918 1252557 1463433 1386960 1062326 1412834 1630737 935217 1286280 1126067 1025556 868467
13908 868467 1343715 1063790 1274568 860230 1211908 1206777 1124409 1195481 1222914 993482
13898 993482 859546 1018540 1087194 1212978 1005770 1337472 925404 1217510 1107813 1186584
13888 1186584 1018929 888006 1423591 1001431 1034799 1276261 863274 1033970 786932 1333926
13878 1333926 1224216 792272 854701 1066704 989177 925507 730014 944449 1199917 892721
13868 892721 893028 837392 874350 658844 991489 834207 1093988 810533 1057694 800370
$$ packed form
13939A603670k29849J2334j5270k7481k36730K4891M06501K022j68198j0051j28015
13928A233824K26801m8838p317j45095M99287k74073j24765l37627J1875K18485
13918A252557K10876p6473l24634L50508K17903o95520L51063j60213j00511j57089
13908H68467M75248k79925K10778m14338L51678n131q2368P1072K7433k29432
13898I93482j33936J58994O8654J25784k07208L31702m12068K92106j09697P8771
13888A186584j67655j30923N35585m22160L3368K41462m12987J70696k47038N46994
13878A333926j09710m31944O2429K12003p7527o3670j95493K14435K55468l07196
13868H92721L07n5636L6958k15506L32645j57282K59781k83455K47161k57324
$$ plain form
13858 800370 863031 1129726 1233354 717273 870513 901564 851190 1035953 1176612 760757
13848 760757 769354 1111053 596274 749603 700248 1142622 932108 900016 1088663 858998
13838 858998 715292 893998 705184 815792 770054 947477 1146013 655067 1107199 753420
13828 753420 626544 741496 784473 764436 622538 950775 550364 806938 905300 705454
13818 705454 517923 621056 673974 647701 1018475 675381 1187538 493525 659230 887810
13808 887810 791814 700842 533089 657105 902607 484351 715029 638733 422580 718106
13798 718106 968183 711904 466551 815748 364083 688435 346149 453121 729814 355569
13787 1084960 263733 322771 669432 547265 687002 553407 488433 476465 859774 806579
$$ packed form
13858H00370O2661K66695J03628n16081J53240L1051n0374J84763J40659m15855
13848G60757Q597L41699n14779J53329m9355M42374k10514l2092J88647k29665
13838H58998j43706J78706j88814J10608m5738J77423J98536m90946M52132l53779
13828G53420j26876J14952M2977k0037j41898L28237m00411K56574R8362j99846
13818G05454j87531J03133N2918k6273L70774l43094N12157D93525J65705K28580
13808H87810r5996r0972j67753J24016K45502m18256K30678p6296k16153K95526
13798G18106K50077k56279k45353L49197C64083L24352l42286J06972K76693C55569
13787A084960B63733N9038L46661j22167J39737j33595o4974j1968L83309n3195
$$ plain form
13777 806579 595462 331420 662202 559297 657516 471567 642243 567207 899798 707484
13767 707484 634321 382054 540923 739919 524008 566334 729329 221443 375915 864717
13757 864717 697625 530344 608776 739346 693633 352446 558732 293006 314836 943402
13747 943402 331779 231025 227587 324942 457218 362736 714073 432003 385664 442745 359211
13736 359211 475740 519339 453254 317697 563381 478136 647628 291506 407845 553556
13726 553556 644690 583022 647674 855236 565164 308317 266798 535175 544153 587300 239590
13714 336593 239171 387560 508802 452431 598007 285202 470586 407483 629701 428251
13704 428251 205424 150335 443526 464249 898278 263841 645214 304030 325722 65736
$$ packed form
13777H06579k11117k64042L30782j02905R8219j85949J70676p5036L32591j92314
13767G07484p3163k52267J58869J98996k15911M2326J62995B21443J54472M88802
13757H64717j67092j67281P8432J30570m5713l41187K06286k65726K1830O28566
13747I43402C31779j00754l438R7355J32276r4482L51337k82070m6339N7081q3534
13736C59211J16529M3599o6085j35557K45684q5245J69492B91506J16339J45711
13726E53556R1134o1668O4652K07562k90072k56847m1519K68377Q978M3147B39590
13714C36593r7422J48389J21242n6371J45576B85202J85384o3103K22218k01450
13704D28251B05424n5089K93191K0723M34029B63841L81373C04030K1692F5736
$$ plain form
13693 297150 463386 284378 597145 497217 378256 79159 408833 260994 747470 510825
13683 510825 375250 213117 356812 557441 238950 217587 424941 384920 378135 124640
13672 326149 325830 192213 303707 635191 485656 244807 497785 139207 459457 122260
13661 460102 223499 683095 254253 604354 -27669 230080 621515 231985 346484 37186
13650 342588 449015 386770 518424 594477 452741 171350 859054 255877 31759 357218
13640 357218 250466 186508 297208 438136 297234 855805 530483 197697 225375 79976
13629 687681 508609 554767 413237 310634 428916 254750 195016 99236 276688 249981
13619 249981 344951 409874 275957 70388 344181 281530 353831 364312 269076 449655 255250
$$ packed form
13693B97150J66236j79008L12767r9928j18961G9159L29674j47839M86476k36645
13683E10825j35575j62133J43695K00629B38950k1363K07354m0021o785A24640
13672C26149l19j33617J11494L31484j49535k40849K52978A39207L20250A22260
13661D60102B23499M59596B54253L50101b7669B30080L91435B31985J14499C7186
13650C42588J06427o2245J31654P6053j41736A71350O87704B55877C1759L25459
13640C57218j06752o3958J10700J40928j40902N58571l25322A97697K7678G9976
13629F87681j79072M6158j41530j02603J18282j74166n9734r5780J77452k6707
13619B49981R4970O4923j33917G0388K73793o2651P2301J0481r5236J80579j94405
$$ plain form
13608 255250 267290 354190 783975 304641 301192 211544 332528 592276 340234 64480 432614
13597 432614 282676 182789 362863 129529 236843 3583 459928 472862 485188 496531 211154
13585 78461 142405 25453 224976 38876 126573 339147 535594 148701 196416 -1459 158060
13573 445265 452757 286848 416114 408665 336327 283370 266053 122320 -54522 -73479 257876
13561 428933 307777 143615 579571 236415 218431 332015 238186 254996 285777 170868
13551 170868 320669 102600 205233 -59088 446050 -8344 514264 340451 581938 145885
13540 317605 188686 733154 235030 376558 129267 323796 -19094 412940 21304 132244
13530 132244 270059 160874 356055 -91052 166320 42224 212072 286637 -167683 385906
$$ packed form
13608B55250J2040Q6900M29785C04641l449q9648J20984K59748k52042F4480L68134
13597D32614j49938r9887J80074A29529J07314C583M56345J2934J2326J1343B11154
13585G8461O3944B5453J99523C8876Q7697K12574J96447A48701M7715a459A58060
13573D45265P492j65909J29266p449p2338n2957j7317A22320e4522j8957B57876
13561D28933j21156A43615M35956B36415j7984J13584r3829J6810L0781j14909
13551A70868J49801A02600J02633e9088D46050h344E14264j73813K41487A45885
13540C17605j28919N44468B35030J41528A29267J94529a9094D12940B1304J10940
13530A32244J37815j09185J95181i1052A66320D2224J69848P4565a67683C85906
$$ plain form
13519 168356 356826 168133 974 92753 293135 462274 -148228 27256 122291 382256 134111
13507 321031 247890 58503 266940 176715 -78983 389068 236255 341868 239261 183475
13497 183475 223035 -92018 373499 502125 381300 264447 335679 267403 238041 432143
13487 432143 223376 9021 175504 607881 -171964 66246 119842 331665 351383 227863
13477 227863 158308 46684 4796 140293 155949 253140 70490 313891 68513 283654 6010
13465 269828 470772 386762 -1436 577334 438069 398028 16360 348686 294556 209563 357637
13454 357637 225564 30184 359640 -73838 150702 119495 315400 68521 150818 33405 47367
13443 47367 279456 144367 405980 -47888 131269 -5621 -192819 226364 -41551 437311
$$ packed form
13519A68356J88470A68133I74R1779K00382J69139a48228B7256R5035K59965A34111
13507C21031p3141E8503K08437r0225g8983C89068j52813J05613j02607n5786
13497A83475L9560i2018C73499J28626j20825j16853P1232o8276k9362J94102
13487D32143k08767I021J66483M32377a71964F6246N3596K11823J9718j23520
13477B27863o9555D6684D796J35497J5656R7191G0490K43401F8513K15141F010
13465B69828K00944q4010a436E77334j39265m0041A6360L32326n4130q4993J48074
13454C57637j32073C0184L29456g3838A50702l1207J95905F8521Q2297C3405J3962
13443D7367K32089j35089K61613d7888A31269e621j87198B26364d1551D37311
$$ plain form
13432 418982 165580 107131 121529 246765 377980 50118 56118 -11334 493853 161060 69012
13420 69654 297550 192929 443947 181559 -2155 249539 294762 28881 147870 -12022 50527
13408 250224 -196147 -4384 178542 143687 555945 50910 206874 42653 -200208 69864 4327
13396 141490 253505 93995 383874 236786 59435 176821 186523 -142981 338296 -254735
13385 97284 -23198 -73186 2078 198609 199703 163307 -205811 317398 91536 145839 272370
13374 272370 182174 -263296 50626 144283 133874 118501 216209 58632 35651 389307 141398
13362 356945 451032 504765 -71767 302682 185409 124802 -5375 325234 252846 269627 184667
13351 184667 173258 122219 535224 -45054 131651 -32487 187754 213585 519105 324714
$$ packed form
13432D18982A65580n8449J4398J25236J31215E0118O000a1334D93853A61060F9012
13420F9654K27896j04621K51018A81559b155B49539M5223B8881J18989a2022E0527
13408B50224a96147d384A78542l4855M12258E0910J55964D2653b00208F9864D327
13396A41490J12015I3995K89879j47088E9435J17386R702a42981C38296b54735
13385I7284b3198m9988B078J96531J094l6396b05811C17398I1536N4303J26531
13374B72370r0196b63296E0626R3657j0409j5373R7708E8632k2981L53656A41398
13362C56945R4087N3733g1767C02682j17273o0607e375C25234p2388J6781q4960
13351A84667j1409n1039M13005d5054A31651c2487A87754K5831L05520j94391
$$ plain form
13341 324714 206075 185608 504075 184297 456289 338825 111412 337454 335605 461134
13331 461134 210029 186456 208463 276495 330576 189086 254265 -57521 -32132 17028 -209479
13319 251916 33408 124214 360152 -32660 161841 -6705 69482 269385 74510 -18398 139737
13307 33721 92051 214763 -26459 93634 56747 254360 94937 100530 78334 212546 261120
13296 261120 -34104 57071 -49750 26767 241602 -45272 47874 381380 207371 76609 413564
13285 413564 -54229 36724 53734 112524 186058 297317 -2150 249979 92842 -21762 196298
13273 270225 145768 -145760 104877 359094 164878 166423 171915 230799 17876 56139 209553
13262 209553 -45611 32807 167223 264774 57163 -55319 -219948 217235 31199 -84163 250057
$$ packed form
13341C24714j18639k0467L18467A84297K71992j17464A11412K26042j849J25529
13331D61134B10029k3573K2007O8032N4081j41490O5179e7521K5389A7028b09479
13319B51916C3408R0806K35938c2660A61841f705F9482J99903G4510a8398A39737
13307C3721N8330J22712b6459I3634l6887J97613I4937N593k2196J34212M8574
13296B61120c4104E7071d9750B6767K14835d5272D7874L33506j74009G6609L36955
13285D13564e4229C6724J7010N8790P3534J11259b150B49979I2842b1762A96298
13273B70225j24457a45760A04877K54217A64878J545N492N8884A7876L8263J53414
13262B09553d5611C2807J34416R7551E7163e5319j64629B17235C1199h4163B50057
$$ plain form
13250 118931 342518 -31100 -6716 127027 141723 288551 -23418 103089 157549 -84 384987
13238 122598 153677 158015 81616 -258412 -11247 89103 269683 329827 -160128 24039 79423
13227 79423 89071 -28632 -85493 -91236 172234 21728 -87049 -251149 110851 31456 245346
13216 245346 -113362 85608 235628 199840 93499 291015 131451 314516 37666 -9720 123336
13204 33376 420315 -166234 -69810 15656 521478 54123 249114 282704 194624 217897 98646
13192 -13509 92688 144727 199117 151236 -141987 7997 -68290 -36333 193871 -98689 -243737
13181 -243737 5348 -54726 22857 -198865 -17970 412792 78444 101200 -56968 211707 142905
13170 142905 233079 -160112 -376737 -205079 57850 36028 229345 106083 -24105 186299
$$ packed form
13250A18931K23587c1100f716A27027J4696J46828b3418A03089N4460h4C84987
13238A22598L1079M338p6399b58412a1247H9103J80580O0144a60128B4039N5384
13227G9423R648b8632n6861n743A72234B1728h7049j64100A10851C1456K13890
13216B45346a13362H5608J50020l5788I3499J97516A31451J83065C7666i720A23336
13204C3376L86939a66234f9810A5656N05822E4123J94991L3590q8080K3273I8646
13192a3509I2688N2039N4390m7881a41987G997f8290L1957A93871i8689j45048
13181b43737E348e4726B2857a98865a7970D12792G8444K2756e6968B11707o8802
13170A42905R0174a60112k16625J71658E7850k1822J93317A06083b4105A86299
$$ plain form
13159 -186899 300591 61123 -2584 104428 -271680 -119273 143527 -36848 40513 -77413 34999
13147 282921 -107601 156186 -225198 -139001 352863 150583 -159689 76973 71599 84901
13137 84901 265863 280721 264499 -52562 -205347 -40938 37293 -139153 -36775 24830 445027
13126 445027 127185 -163719 149779 -152374 38582 200950 73010 133950 -126076 85860
13115 -109947 -398573 267817 294926 -2713 160582 84055 -23328 140669 17768 382071 -71573
13103 83032 -55336 181323 132531 147510 196718 -5738 165911 225975 99065 139625 100055
13092 100055 182949 -29610 -161544 140022 239509 -86812 -2605 418987 -55912 -62238 109001
13080 86009 -121831 38261 374564 243117 7811 -31829 -278042 165928 -42771 339922 -136866
$$ packed form
13159a86899C00591F1123b584A04428b71680a19273A43527c6848D0513g7413C4999
13147B82921a07601A56186b25198Q6197C52863A50583a59689G6973n374J3302
13137H4901J80962J4858j6222e2562j52785d0938C7293a39153c6775B4830M20197
13126D45027A27185a63719A49779a52374C8582J62368G3010O0940a26076H5860
13115a09947k88626B67817K7109b713A60582p6527b3328A40669A7768L64303g1573
13103H3032e5336A81323m8792J4979M9208e738A65911O0064I9065M0560l9570
13092A00055Q2894b9610j31934A40022R9487h6812b605D18987e5912o326A09001
13080H6009a21831C8261L36303j31447G811c1829k46213A65928d2771C39922a36866
$$ plain form
13068 -2632 -24540 -109552 312296 232878 -233228 -109376 -190896 -252237 14339 -38285 379185
13056 -353979 89330 16667 -3883 -67890 -60658 91086 152003 202835 193073 205121 -19204 273659
13043 234952 186127 -90504 230350 175205 -8066 274331 15401 72252 159770 18568 119520
13032 119520 -50062 240162 -1211 194860 104582 -69740 -240372 -44756 3559 -25657 -34025
13021 -34025 -454 84296 107738 142482 -54144 241954 85827 14696 97887 18790 2887 71153
13009 71153 30225 169670 36982 16577 -104337 311872 151439 -43124 153280 89378 15588
12997 44464 123719 59169 -40388 14438 83810 -392635 -106493 107438 -72258 -51083 94233
12985 -255613 23743 66278 -101650 -193889 -98199 -262292 56104 14563 -24133 63881 -124207
$$ packed form
13068b632k1908q5012C12296p9418b33228a09376q1520o1341A4339c8285C79185
13056c53979H9330A6667c883o4007P232I1086O0917N0832r762J2048a9204B73659
13043B34952m8825i0504B30350n5145h066B74331A5401N6851Q7518A8568J00952
13032A19520e0062B40162a211A94860r0278f9740j70632d4756C559b5657q368
13021c4025d54H4296K3442L4744e4144B41954H5827A4696Q3191A8790B887O8266
13009G1153C0225J39445C6982A6577a04337C11872A51439d3124A53280o3902A5588
12997D4464P9255E9169d0388A4438O9372c92635a06493A07438g2258K1175I4233
12985b55613B3743M2535a01650r2239R5690j64093E6104A4563b4133F3881a24207
$$ plain form
12973 -136271 188631 429771 21342 -116225 85343 117310 114241 -1079 -214386 -126805 -130218
12962 -130218 -310027 -107011 32049 -237683 236055 -87195 -26658 177794 288784 316 -59818
12950 78510 253166 22452 -298010 -101676 19480 176753 -214204 210924 183551 -135508
12939 -40659 -46272 155555 -64028 79058 -252074 225278 -216755 -169731 103151 103006 285645
12928 285645 209667 -142726 -3050 41119 243625 -39185 122424 7591 70927 149251 162056
12917 162056 -56493 -102147 -103096 -53126 -239994 -185702 -106703 365166 97290 -174923 186204
12905 81344 -120719 -128340 -49193 -9057 -258080 25297 -17300 -209586 -70875 -130315 -137591 153401
12892 191327 3486 -53288 -125832 479392 64938 -264139 90038 -36105 -122886 194487 30172
$$ packed form
12973a36271A88631K41140B1342a16225H5343L1967l069a079k13307Q7581l413
12962a30218j79809a07011C2049b37683B36055h7195b6658A77794J10990C16e9818
12950G8510J74656B2452b98010a01676A9480J57273b14204B10924k7373a35508
12939d0659n613A55555f4028G9058b52074B25278b16755M7024A03151j45J82639
12928B85645p5978a42726c050D1119K02506c9185A22424G591O3336P8324J2805
12917A62056e6493m5654r49M9970j86868N4292P8999C65166I7290a74923A86204
12905H1344a20719p621d9193i057k49023B5297a7300j92286g0875n9440p276A53401
12892A91327C486e3288p2544D79392F4938b64139I0038c6105q6781A94487C0172
$$ plain form
12880 315946 -80608 -54797 -95119 304576 -32858 -298427 4360 -98123 -195660 -156140 72988
12868 -25763 -84417 -34612 10398 -269539 -107602 -16729 144149 -276624 -208373 110874 5367
12856 71463 5463 397698 48241 105667 106899 -76976 -22499 -49475 -42357 -159010 125934 151449
12844 151449 -58527 -111886 -89008 36334 -36802 -15805 -15289 -131784 -105693 8450 -3387 11801
12831 45015 -195153 22538 177930 217883 -41549 68457 278727 -297554 -5214 -153105 -118498
12820 -118498 52100 -356720 -11040 -73323 38426 -6767 188511 -128710 -75987 -236469 157530
12808 28909 -471 -142443 -31533 -87079 24968 98171 266846 -13258 -54614 94242 -272678
12796 203625 69177 34716 367000 132572 -82741 -204176 -295463 -73674 33635 131342 96466
$$ packed form
12880C15946h0608K5811m0322C04576c2858k65569D360i8123r7537L9520G2988
12868b5763n8654c4612A0398b69539a07602a6729A44149b76624O8251A10874E367
12856G1463E463L92235D8241N7426J232g6976b2499k6976P118j16653A25934K5515
12844A51449e8527n3359K2878C6334c6802a5805N16j16495K6091H450c387A1801
12831D5015a95153B2538J55392L9953d1549F8457K10270b97554e214j47891L4607
12820a18498E2100c56720a1040o2283C8426f767A88511a28710N2723j60482A57530
12808B8909d71j41972c1533n5546B4968P3203J68675a3258m1356I4242b72678
12796B03625F9177l4461L32284A32572h2741j21435r1287g3674C3635R7707l4876
$$ plain form
12785 96466 171996 -40532 -316525 26365 -84335 -190155 -16949 -31817 137110 -54931 -103556
12774 -103556 -46466 -43163 -111181 -95528 278525 104622 26195 218009 228084 -291780 142822
12762 -91733 48366 -100768 327989 122812 282005 -161962 -25299 -221851 43787 -17122
12751 100600 153272 -266143 181177 69045 -59877 -58411 -181067 -101358 -159487 42302 -84058
12739 160397 200538 -120511 -276858 241348 130164 -62794 -22327 54277 -107564 17606
12728 245832 -3087 -83305 -230630 -291790 399425 195636 -98001 -27611 -125246 152760 -21686
12716 -417907 77249 159427 -129800 176396 4453 138887 -29569 -62706 29443 280219 326883
12705 326883 -21180 31631 33408 -234791 -88684 147782 193175 -310019 -130521 -106479 -115053
$$ packed form
12785I6466P5530d0532k75993B6365h4335j05820a6949j4868A37110e4931m8625
12774a03556d6466L303o8018J5653B78525A04622B6195J91814J0075b91780A42822
12762i1733D8366a00768C27989A22812J59193a61962b5299j96552D3787a7122
12751A00600N2672b66143A81177F9045e9877J466j22656P9709n8129D2302h4058
12739A60397M0141a20511j56347B41348j11184f2794b2327E4277a07564A7606
12728B45832c087q0218j47325o1160C99425A95636i8001b7611r7635A52760b1686
12716d17907G7249Q2178a29800A76396D453J34434b9569l3137B9443K50776M6664
12705C26883b1180C1631J777b34791h8684A47782M5393c10019a30521K4042q574
$$ plain form
12694 -115053 12842 -212155 18601 263217 258340 -175644 -178897 168904 293944 108679 -134868
12682 310359 -9668 190611 56764 -49610 53192 -240523 -205044 445228 299283 -1423 -8336
12671 -8336 -399491 -163102 -7077 333916 286974 751 -75196 -12956 120824 -9502 -109135 -222097
12659 -222097 103922 -9765 -17660 53241 -18278 -276986 -137740 125549 -17695 174846 537243
12648 537243 -138307 12277 -71021 181282 -19370 51059 282015 -264473 -92555 1707 94302
12637 94302 70809 -242884 -86276 -113336 243824 21662 -145316 73821 221007 74934 117432
12626 117432 -31112 -58212 374456 85606 -64016 -175843 201824 -55271 1121 -173029 207906
12614 -327908 -92053 -395 -1859 121402 113370 -116830 113698 -242157 113406 -152525 181523
$$ packed form
12694a15053A2842b12155A8601K44616m877a75644l253A68904J25040A08679a34868
12682C10359i668A90611E6764d9610E3192b40523L5479D45228j45945a423o913
12671h336l91155a63102g077C33916m6942G51g5196a2956A20824i502r9633j12962
12659b22097A03922i765p895E3241a8278k58708a37740A25549a7695A74846L62397
12648E37243a38307A2277g1021A81282a9370E1059K30956b64473i2555A707R2595
12637I4302k3493b42884h6276k7060B43824B1662a45316G3821J47186G4934M2498
12626A17432c1112k7100C74456H5606f4016j11827B01824e5271A121a73029B07906
12614c27908i2053c95j464A21402q032a16830A13698b42157A13406a52525A81523
$$ plain form
12602 -420090 -69393 111144 317904 -46758 578369 -106751 165893 -35086 -106658 -16025
12591 183856 -2349 307421 -5951 -45473 -225926 -126578 -154221 -163047 314590 -235701 65031
12579 -206420 235827 -343353 102243 90794 33192 249740 111278 494715 102020 -93443
12568 44162 154496 -64786 -24311 -25130 7146 51210 -20622 34942 71462 -217163 -9760 -75936
12556 -75936 47533 -10104 -241367 13502 -157725 92916 -3651 -7212 -88415 146956 127884
12545 127884 -75448 -37126 -5415 8738 63665 142630 -121740 -30167 75932 -115704 -43517
12533 83542 -229885 -30264 35957 -59653 254175 122126 -57791 85438 19113 -284556 204470
12521 92847 714 182349 -50228 -416140 -47459 -53167 426825 277317 150333 39007 47360
$$ packed form
12602d20090f9393A11144K06760d6758E78369a06751A65893c5086p1572a6025
12591A83856b349C07421e951l9522j80453R9348k7643q826C14590b35701F5031
12579b06420B35827c43353A02243j1449C3192K16548A11278L83437A02020i3443
12568D4162J10334f4786b4311q19G146M4064b0622C4942L6520b17163i760o6176
12556g5936D7533a0104k31263A3502a57725I2916c651l561q1203A46956j9072
12545A27884g5448c7126e415H738N4927P8965a21740c0167G5932a15704d3517
12533H3542b29885c0264C5957e9653B54175A22126e7791H5438A9113b84556B04470
12521I2847G14J81635e0228l65912d7459n708D26825j49508j26984C9007Q353
$$ plain form
12510 47360 -155649 37071 -4930 24420 -15286 99261 -126853 -23285 -34201 -224541 208684
12498 196844 153655 57847 -13271 -115044 10075 -234970 -264277 -49088 156927 -47301 -241426
12487 -241426 98568 86149 6972 68542 70029 356637 51991 -214782 -59509 -12209 659 -472811
12474 10247 -267431 8524 215806 74823 326971 -306250 794 119985 -435039 54013 232243
12463 232243 -57902 -252183 -95263 60916 -144614 -112587 -46050 95951 319179 -147549 193957
12451 219273 32310 -98960 -25607 -13818 35234 -471417 65563 -97100 -199174 88459 97863
12440 97863 -95239 94075 -213370 52658 80949 228521 -339244 10695 27246 -9402 -266776
12429 -266776 -299826 120667 197848 45865 15792 45309 -266746 17473 -183439 -85785 -226944
$$ packed form
12510D7360a55649C7071d930B4420a5286I9261a26853b3285j0916j90340B08684
12498A96844m3189E7847a3271j01773A0075b34970k9307d9088A56927d7301j94125
12487b41426I8568j2419F972O1570J487K86608E1991b14782e9509a2209F59d72811
12474A0247b67431H524K07282G4823K52148c06250G94J19191d35039E4013J78230
12463B32243e7902j94281i5263F0916a44614L2027d6050I5951K23228a47549A93957
12451B19273C2310i8960b5607J1789C5234d71417F5563i7100j02074H8459R404
12440I7863i5239I4075b13370E2658K8291J47572c39244A0695J6551i402k57374
12429b66776l3050A20667P7181D5865A5792K9517b66746A7473a83439h5785j41159
$$ plain form
12418 -226944 138817 -71296 45610 -185250 56717 256228 -53300 -423131 -196605 30189
12407 -238627 93018 10939 172404 -202103 -32301 -236874 153335 -284154 -21595 -79245
12397 -79245 -298904 38274 218386 4875 376190 165905 -117486 -30375 309006 189202
12387 189202 36196 9522 -102809 31891 50590 -123341 -4399 -136143 -28278 -51401 291719
12375 94601 133918 113336 198372 153996 34335 43438 229673 55433 237851 102463 -33208
12363 96833 352860 -121622 -146029 -209784 56126 -101280 117138 101706 92000 -33888 -31456
12352 -31456 207925 161510 -29021 -310432 -296187 -55552 -142584 292347 240007 -78290 64069
12340 -55862 -82930 -55092 -87798 361409 -123828 -38804 219651 51795 160087 168310 5258
$$ packed form
12418b26944A38817g1296D5610a85250E6717J99511e3300l69831a96605C0189
12407b38627I3018A0939J61465b02103c2301k04573A53335b84154b1595n7650
12397g9245k19659C8274J80112D875L71315A65905a17486c0375C09006j19804
12387A89202C6196I522a02809C1891J8699a23341d399j31744b8278k3123B91719
12375I4601L9317k0582Q5036m4376C4335R103J86235E5433J82418A02463c3208
12363I6833K56027a21622k4407o3755E6126a01280A17138j5432r706c3888K432
12352c1456B07925m6415b9021k81411J4245e5552q7032B92347n2340g8290F4069
12340e5862k7068K7838l2706C61409a23828c8804B19651E1795J08292Q223E258
$$ plain form
12328 80305 247708 -112404 288928 169067 71683 19514 32617 103797 208839 188025 250547
12317 250547 214196 104738 27822 187588 -31883 346351 164349 -89623 -38255 12645 -129078
12305 254623 90961 -6093 93179 75563 -152942 251647 -372896 -133319 -191805 59729 111683
12294 111683 -35613 201618 123074 -92618 252288 128148 13189 187341 -74723 53884 230880
12283 230880 341013 417498 -177076 -166497 -30918 186865 233642 52597 71284 225214 61097
12271 -47553 -58421 100011 81301 172577 99966 115529 127075 179460 138229 165932 -307585
12259 -73317 -131174 -346070 77501 188463 58669 -117239 296995 -84980 41387 -57660 29945
12247 -271464 66377 -51345 298196 106198 277652 216518 -56668 6931 211668 192034 -300781
$$ packed form
12328H0305J67403a12404B88928j19861G1683A9514J3103P1180J05042k0814O2522
12317B50547l6351A04738B7822J59766c1883C46351A64349h9623c8255A2645a29078
12305B54623I0961f093I3179j7616a52942B51647c72896a33319n8486E9729N1954
12294A11683c5613B01618p8544i2618B52288j24140A3189J74152g4723E3884J76996
12283B30880J10133P6485a77076J0579c0918A86865M6777E2597J8687J53930F1097
12271d7553j0868A00011j8710R1276p2611J5563J1546N2385m1231K7703c07585
12259g3317n7857k14896G7501J10962E8669a17239B96995h4980D1387e7660B9945
12247b71464F6377e1345B98196A06198J71454o1134e6668F931K04737j9634c00781
$$ plain form
12235 282840 -38827 3026 37101 184737 347095 190793 16148 35730 35380 -127342 -111427
12224 -111427 -35745 237899 -110198 292876 78334 -45781 95664 281702 193797 159680 285421
12213 285421 162004 223594 -21342 -78038 208334 15114 320098 -326284 8774 13379 -68773
12201 -114966 38284 -134775 -52175 46165 289854 427865 30345 288754 434489 6728 157322
12190 157322 21336 153812 292061 -31456 -55246 75606 245271 93771 72036 -77336 -49748
12179 -49748 159574 15732 67391 54893 101600 -90780 231461 -35800 -240891 190321 315593
12168 315593 141445 151374 204317 375094 360337 122015 167587 7379 108928 162148 -51134
12156 -174381 -150595 214796 601747 182817 172422 -133767 118283 -71785 -101295 194002
$$ packed form
12235B82840c8827C026L4075J47636J62358j56302A6148J9582l50a27342J5915
12224a11427c5745B37899a10198B92876G8334d5781I5664J86038q7905l4117J25741
12213B85421j23417O1590b1342n6696B08334A5114L04984c26284H774M605f8773
12201a14966C8284a34775e2175D6165K43689J38011C0345K58409J45735F728J50594
12190A57322B1336J32476J38249c1456k3790G5606J69665I3771k1735g7336K7588
12179d9748A59574A5732N1659j2498M6707i0780B31461c5800k05091A90321J25272
12168C15593A41445R929N2943J70777j4757A22015M5572G379J01549N3220e1134
12156a74381K3786B14796L86951A82817j0395a33767A18283g1785k9510A94002
$$ plain form
12145 -5540 -149295 -252669 -188409 386650 50226 100306 156275 132364 110640 140368 66172
12133 84995 -155657 197327 130404 20403 173912 167274 88568 277161 -37073 157887 82642
12122 82642 -240555 84071 94238 46202 44179 37685 246427 36526 -87152 110243 -286714
12110 -83229 117213 12336 -27196 -37081 -63257 178542 93145 -36229 -109947 -134092 -118341
12099 -118341 58525 274629 137914 -338414 -127763 -6236 72497 -272935 -23934 279491
12088 195570 221985 -206225 84100 3652 64125 225926 -246558 -42140 214612 -17163 180484
12076 219000 -337497 -475981 13221 260409 205547 -50226 -122717 142200 -19725 332927
12065 -149353 312588 -102096 -47940 36334 -1462 -25133 157087 -294028 158131 -575758
$$ packed form
12145e540j43755j03374O4260C86650E0226N0080N5969k3911k1724K9728F6172
12133H4995a55657A97327o6923B0403J53509o638p8706J88593c7073A57887p5245
12122H2642b40555H4071J0167D6202k023o494K08742C6526h7152A10243b86714
12110h3229A17213A2336b7196r885k6176A78542q5397c6229p3718k4145J5751
12099a18341E8525K16104j36715c38414a27763f236G2497b72935b3934B79491
12088A95570K6415b06225H4100C652O0473J61801b46558d2140B14612a7163A80484
12076B19000c37497j38484A3221K47188n4862e0226p2491A42200a9725C32927
12065a49353C12588a02096d7940C6334a462k3671A57087b94028A58131e75758
$$ plain form
12054 138521 76920 -199252 55284 190944 -51505 88570 -30884 -202170 176155 144603 38235
12042 -7124 -132993 -173719 -43740 -41336 -137726 124170 -121210 245556 36844 82292 -129279
12030 416951 167345 96728 -20766 60542 9626 85080 -69892 94481 113953 -62480 25017
12018 -4898 -105509 227989 250181 -13792 -162534 127059 86593 43135 -179755 -59603 -153007
12007 -153007 -170419 31210 270383 -45746 -2342 -208766 -4489 -99020 -307819 -128340 -76273
11996 -76273 -394705 219464 190023 -61890 177309 -214150 -61194 -48917 -108386 271077 160533
11985 160533 -194422 195781 22689 -63281 -418611 38190 193244 119929 414211 -65848
11974 191483 25493 174099 -406778 205479 -194322 -42527 167229 98376 -140510 -27981
$$ packed form
12054A38521o1601a99252E5284J35660e1505H8570c0884j71286A76155l1552C8235
12042g124j25869m0726d3740K404r6390A24170a21210B45556C6844M5448a29279
12030D16951A67345p0617b0766F0542I626P5454f9892I4481J9472f2480B5017
12018d898j00611B27989K2192a3792j48742A27059m0466D3135a79755e9603r3404
12007a53007j7412C1210K39173d5746b342k06424d489r4531k08799a28340N2067
11996g6273l18432B19464k9441f1890A77309b14150f1194J2277n9469B71077j10544
11985A60533a94422A95781B2689f3281l55330C8190J55054p3315K94282f5848
11974A91483B5493J48606d06778B05479a94322d2527A67229o8853a40510b7981
$$ plain form
11963 4118 277218 29617 91617 -48171 44249 -92854 -80060 -23405 -22700 -52979 -110409 195134
11950 174241 225672 -140178 -59576 -257411 298144 -376416 536730 -160347 10064 -42543
11939 208672 -244709 130342 103467 -53214 -67809 -86688 197137 -281056 262571 -137563
11928 -164300 -425194 -13922 -240956 166476 4719 5573 -126320 -141885 -117723 -229659 -76004
11916 16483 326937 -222524 -127180 -3046 -281247 30475 -148016 51108 25270 -49344 -37042
11905 -37042 -134160 215549 -233178 -427391 -175560 -325064 207762 152095 -87369 133727
11894 27848 78499 48472 -128871 169743 -115340 -42066 74623 18727 263709 50790 210348
11883 210348 -175607 91297 16032 85203 84788 59017 -47314 86162 61997 -114396 -235969
$$ packed form
11963D118K73100B9617O2000d8171D4249i2854J2794b3405P05l0279n7430A95134
11950A74241N1431a40178e9576j97835B98144c76416E36730a60347A0064d2543
11939B08672b44709A30342k6875e3214j4595j8879A97137b81056B62571a37563
11928a64300k60894a3922k27034A66476D719Q54a26320j5565K4162j11936g6004
11916A6483L10454b22524R5344c046k78201C0475a48016E1108B5270d9344J2302
11905c7042r7118B15549b33178j94213a75560j49504B07762n5667h7369A33727
11894B7848N0651l0027a28871A69743a15340d2066G4623A8727K44982E0790J59558
11883B10348a75607I1297A6032O9171m15k5771d7314H6162k4165a14396j21573
$$ plain form
11872 -235969 -122567 58552 120844 -59853 18556 -135022 -161206 -97843 93433 -270215 155711
11860 91690 152060 -29079 -171976 -41724 -84189 214468 184026 170862 266191 -91954 -222213
11849 -222213 -116645 -140890 -334336 -447639 -151370 -218706 -340243 -266924 75108 -186624
11838 177617 -75212 -123010 -98107 233684 152 -132143 89445 129515 -15157 -45426 95202
11826 -156259 -319258 -119255 -272587 -252248 -242517 -140300 -384522 -159808 -28668 -14951
11816 -14951 181204 189960 66035 -5136 184438 172546 -282133 154383 -71877 116092 29312
11804 95261 -95464 93372 -271910 -44268 -163780 88369 -266822 364002 397510 -73039 382181
11792 175427 -64809 -124779 -200511 -21784 -173894 -108660 -26468 -18707 267271 -189641 91444
$$ packed form
11872b35969J13402E8552O2292e9853A8556a35022k6184O3363I3433b70215A55711
11860I1690O0370b9079j42897d1724m2465B14468l0442j3164R5329i1954j30259
11849b22213J05568k4245j93446j13303a51370o7336j21537P3319G5108a86624
11838A77617g5212m7798K4903B33684A52a32143H9445M0070a5157l0269I5202
11826a56259j62999a19255j53332K0339R731J02217k44222a59808b8668J3717
11816a4951A81204Q756F6035e136A84438j1892b82133A54383g1877A16092B9312
11804I5261i5464I3372b71910d4268j19512H8369b66822C64002L3508g3039C82181
11792A75427f4809n9970p5732b1784j52110O5234b6468P761B67271a89641I1444
$$ plain form
11780 121641 -97470 -135684 104228 -88322 98206 18795 -209714 53279 -89531 59054 4358
11768 -132488 -104715 -90207 -127743 -256999 12668 117725 -62621 -113458 -174528 -311171 174830
11756 -72924 -283466 -188574 59213 361089 -116814 -250925 -191957 -51034 -67599 81223 -273541
11744 -98760 -97267 107539 -49446 -66845 129890 -339490 -96149 67306 -63390 208427 7705
11732 -250758 245229 147192 122883 -292426 253859 231494 120733 155378 -77919 -50345 -234707
11721 -234707 -77577 9248 32383 -66347 8781 -160508 -203284 -49721 -432991 -207169 -323977
11710 -323977 54262 -193852 101316 -87052 44363 23332 -1739 -136311 108105 -4679 -291470
11699 -291470 -142861 -10692 220599 293579 69566 217104 -110094 98310 -15995 -53745 327388
$$ packed form
11780A21641i7470l8214A04228h8322I8206A8795b09714E3279h9531E9054D358
11768a32488K7773J4508l7536j29256A2668J05057f2621n0837o1070j36643A74830
11756g2924k10542R4892E9213L01876a16814j34111N8968e1034j6565H1223b73541
11744i8760J493A07539d9446j7399A29890c39490i6149F7306f3390B08427G705
11732b50758B45229r8037k4309b92426B53859k2365j10761L4645g7919K7574j84362
11721b34707g7577I248K3135f6347H781a60508m2776d9721l83270b07169j16808
11710c23977E4262a93852A01316h7052D4363k1031a739j34572A08105d679k86791
11699b91470a42861a0692B20599P2980F9566J47538a10094I8310a5995l7750C27388
$$ plain form
11687 -36698 -26696 -205889 36654 360296 -165526 186229 28891 75439 194302 -100832
11676 -45368 -36058 57640 -163805 -158000 183252 -176309 89734 -157048 60781 130678 167479
11665 167479 116489 44172 -33611 -191626 130899 -152071 -26760 250081 132666 33360
11654 -34991 9360 239976 -43137 17625 63280 148624 -86830 133051 119393 161703 170263 -343590
11641 20374 -147552 -307692 -23716 -158984 -129358 -94823 134101 -3089 -163884 186271 -117501
11629 36946 223468 -14738 -49320 -39761 115790 19596 338772 202913 105653 131383 43082
11617 116701 -153265 10988 -2834 -172900 261631 260484 -41672 -74153 89641 179430 205601
11606 205601 44138 -88269 -232192 -166019 -132132 99023 92398 43552 -371093 15146 94056
$$ packed form
11687c6698J0002j79193C6654L23642a65526A86229B8891M6548J18863a00832
11676d5368R310E7640a63805N805A83252a76309H9734a57048F0781O9897L6801
11665A67479n0990D4172c3611j58015A30899a52071b6760B50081j17415C3360
11654c4991I360K30616d3137A7625M5655Q5344h6830A33051j3658M2310Q560c43590
11641B0374a47552j60140b3716j35268K9626L4535A34101c089j60795A86271a17501
11629C6946J86522a4738l4582R559A15790A9596L19176j35859r7260K5730D3082
11617A16701a53265A0988b834j70066B61631j147d1672l2481H9641Q9789K6171
11606B05601D4138h8269j43923O6173L3887I9023o625D3552c71093A5146P8910
$$ plain form
11595 94056 220858 335933 -28204 69440 -20931 -76513 -80939 231050 -117318 -233646 269244
11583 -102132 81652 230087 341764 -9815 -1780 172910 -105558 -16404 -3221 132846 -46992
11571 -218844 -432694 -238587 -442268 34847 157328 -96702 -56389 -36613 -45440 221519 42984
11559 102324 -229558 -27461 -86070 -109536 71074 43763 -96781 338902 200036 297849 -87950
11547 270917 -13484 101771 184647 16005 47197 180481 -125461 133017 -77915 208096
11536 47932 174995 -191334 95834 -203225 122112 -60150 116863 -271439 -174126 96621
11525 -26249 97455 9671 81485 261248 11588 62660 -66939 73108 388063 132796 233098
11514 233098 209180 -28819 -48977 -50430 -417487 114880 -186104 190636 102605 65345 385456
$$ packed form
11595I4056J26802J15075b8204F9440b0931n5582m426B31050a17318j16328B69244
11583a02132H1652J48435J11677i815a780A72910a05558a6404c221A32846d6992
11571b18844k13850J94107k03681C4847J22481i6702M0313J9776q827B21519D2984
11559A02324b29558b7461n8609k3466G1074k7311i6781C38902j38866R7813h7950
11547B70917a3484A01771Q2876A6005L1192J33284a25461A33017g7915B08096
11536D7932J27063a91334I5834b03225A22112f0150A16863b71439R7313I6621
11525b6249I7455I671P1814J79763A1588N1072f6939G3108L14955A32796J00302
11514B33098k3918b8819k0158j453l67057A14880a86104A90636q8031l7260L20111
$$ plain form
11503 385456 167309 226262 286686 -141158 -166450 -150742 105395 -73039 96801 373000 94311
11491 -88363 -29000 -44962 322053 78834 -284705 109015 173268 279918 208003 105103 -12210
11479 -188568 -60872 158874 168066 -138949 -147312 14787 -1150 306495 -17486 227268 69165
11467 -41145 -8805 -142552 -123858 57261 38368 72622 -59797 -23444 55209 124297 69732 82302
11455 82302 64323 -61326 26255 -48854 16206 219535 43697 -34693 10371 210703 199492
11444 199492 100995 -187926 362470 265532 -5235 145422 162671 -214516 -11881 -133103 -45299
11432 -270051 106136 72529 72589 -126299 3722 36737 104114 -311532 15186 -153759 -136671
11421 -136671 319866 219099 114084 289196 84359 -115621 218059 26116 118726 97238
$$ packed form
11503C85456A67309N8953O0424a41158k5292J5708A05395g3039I6801K76199I4311
11491h8363b9000j5962C22053G8834b84705A09015O4253J06650p1915j02900a2210
11479a88568f0872A58874R192a38949q363A4787a150C06495a7486B27268F9165
11467d1145h805j33747J8694E7261j8893L4254e9797b3444E5209O9088n4565J2570
11455H2302j7979f1326B6255d8854A6206K03329D3697c4693A0371K00332j1211
11444A99492r8497a87926C62470r6938e235A45422J7249b14516a1881j21222d5299
11432b70051A06136l3607O0a26299C722L3015O7377c11532A5186a53759J7088
11421a36671C19866j00767j05015J75112H4359a15621B18059B6116R2610k1488
$$ plain form
11411 97238 -76968 -221281 -57828 -250561 248037 106532 -168707 -276970 -79928 172003
11400 -17544 265307 -31180 -124100 19616 30864 232942 267176 -136902 268405 -28135 -27962
11389 -27962 332778 -25053 -69785 -216885 -18937 -99443 -350661 307367 -261963 -29964 222432
11377 198859 -69793 201923 63293 -360993 30815 80401 -51618 -100994 67235 -128813 -134852
11366 -134852 -17553 -72303 -186284 142173 25748 207431 -58718 -25653 135000 -36535 -383440
11355 -383440 -40517 -13233 121311 -289485 -188746 -114717 23139 -74296 -41480 71758 48851
11344 48851 -419804 -165552 -77466 -72743 37073 119563 49570 52519 18538 -89213 -344999
11333 -344999 -85258 -103102 -42090 16859 63988 -13857 56403 -126101 -154170 -66344 -100087
$$ packed form
11411I7238g6968j44313e7828j92733B48037A06532a68707j08263g9928A72003
11400a7544B65307c1180r2920A9616J1248K02078L4234a36902B68405b8135J73
11389b7962C32778b5053m4732j47100a8937q0506k51218C07367b61963b9964B22432
11377A98859f9793B01923F3293c60993C0815M9586e1618m9376F7235a28813o039
11366a34852a7553n4750j13981A42173B5748J81683e8718b5653A35000c6535l46905
11355c83440d0517a3233A21311b89485J00739P4029B3139g4296L2816G1758k2907
11344D8851d19804a65552g7466M723C7073Q2490D9570K949A8538h9213k55786
11333c44999h5258j7844d2090A6859M7129a3857E6403a26101k8069f6344l3743
$$ plain form
11322 -100087 201863 134997 154937 -35152 37332 6882 -154004 -246516 56161 3820 48378
11311 48378 -147306 -145528 -353244 174813 -6490 -403512 -270767 83940 -73879 -263015 -201565
11300 -201565 62814 -55125 59679 -120974 -84761 -71531 21322 44802 -84510 177254 145540
11289 145540 2338 235861 -301444 -81312 28096 -127502 -70470 -222301 -172465 -12217 -73547
11278 -73547 -308561 -366318 -167780 -285393 31212 -72110 236113 -58589 -206080 -220192 -204782
11267 -204782 174792 -151713 -138059 87519 57996 -57450 -51514 -57937 7965 -38306 75181 -286300
11254 -316787 -184049 -265505 120997 146244 301068 -100102 30537 -263157 -323407 -331979 -85550
11242 -268137 91756 -224229 -254517 146597 72624 21556 -37678 48973 -139807 -280282 -64967
$$ packed form
11322a00087B01863o6866J9940c5152C7332F882a54004r2512E6161C820M4558
11311D8378a47306J778k07716A74813f490l97022J32745H3940g3879j89136O1450
11300b01565F2814e5125E9679a20974L6213J3230B1322K3480h4510A77254l1714
11289A45540B338K33523c01444h1312B8096a27502N7032j51831M9836a2217o1330
11278g3547k35014n7757a67780j17613C1212g2110B36113e8589j47491j4112J5410
11267b04782A74792a51713J3654H7519k9523e7450N936o423G965c8306G5181b86300
11254c16787J32738q1456A20997K5247J54824a00102C0537b63157o0250q572h5550
11242b68137I1756b24229l0288A46597G2624B1556c7678D8973a39807j40475f4967
$$ plain form
11230 196045 -93274 -170226 -221662 46565 -46073 -284904 -36565 4467 -93644 -103234 23742 47260
11218 47260 60413 6863 262665 55952 197316 128322 -1684 -93720 -398839 -57459 -186963
11207 -186963 -139509 115290 -181787 151290 51505 -100040 -102297 -331657 51215 4517 -13467
11195 -158427 55063 -163762 -84028 75626 -270952 -51112 -41537 116039 106433 85334 -16706
11183 -317115 -307961 -13578 107499 -188667 -37625 143200 34395 238838 -47242 -259935 -165728
11172 -165728 85566 -179637 -34623 -82970 -300570 369299 71133 -205547 43248 -27311 63681
11160 -175886 -29218 -87773 -79304 -33356 -57161 -235537 143897 570737 -133214 -37999 96438
11148 62474 173839 -142810 -24556 -102660 125686 -98773 443943 -110284 283564 -13059
$$ packed form
11230A96045i3274p6952n1436D6565d6073k38831c6565D467i3644r590B3742K3518
11218D7260J3153F863K55802E5952J41364o8994a684r2036l05119e7459j29504
11207a86963M7454A15290a81787A51290E1505a00040k257k29360E1215D517a3467
11195a58427E5063a63762P9734G5626b70952e1112R575A16039r606k1099a6706
11183c17115R154a3578A07499a88667c7625A43200C4395K04443d7242k12693R4207
11172a65728H5566a79637c4623m8347k17600C69299G1133b05547D3248b7311F3681
11160a75886b9218n8555Q469c3356k3805j78376A43897M26840a33214c7999I6438
11148F2474J11365a42810b4556p8104A25686i8773D43943a10284B83564a3059
$$ plain form
11137 10896 230052 235538 138011 -169384 109759 -175890 -126123 210616 107454 349697
11127 349697 151820 124233 -173490 -234458 15673 -43104 -61897 257225 202376 249462 -385830
11115 854 -83935 -138250 60976 -78462 -42135 -23146 234782 2610 49635 -151728 -42679 -56002
11103 -56002 -2821 116516 171234 -180419 42348 103769 23383 -115241 319358 217054 320635
11092 320635 351750 128150 235708 403784 268642 220876 326884 428559 -25105 -190226
11082 -190226 54061 26701 -238696 345956 98265 135524 343024 276161 57898 -59478 212337
11070 191337 17722 16244 226560 218586 215709 357207 249090 325154 114298 -30436 162432
11058 375665 515198 517407 399032 278393 368139 640369 375722 736752 677214 230567
$$ packed form
11137A0896K19156N486r7527a69384A09759a75890M9767B10616j03162K42243
11127C49697A51820k7587a73490o0968A5673d3104j8793B57225n4849M7086c85830
11115H54h3935n4315F0976g8462L6327J8989B34782B610M7025a51728d2679j3323
11103e6002b821A16516N4718a80419D2348O1421B3383a15241C19358j02304J03581
11092C20635L1115A28150J07558J68076j35142m7766J06008J01675b5105j65121
11082a90226E4061B6701b38696C45956I8265L7259K07500o6863E7898e9478B12337
11070A91337A7722j478K10316p974k877J41498j08117P6064A14298c0436A62432
11058C75665J39533K209j18375j20639Q9746K72230k64647L61030n9538B30567
$$ plain form
11047 505304 507983 575380 520614 473143 725036 538058 599345 524642 446363 486543 510573
11036 510573 582299 552102 819311 512542 417434 580463 501107 989287 487451 659190
11026 659190 443216 425823 424047 551786 521056 299243 639239 679454 286677 277245 516657
11015 516657 725558 543692 237176 323715 498169 357830 354942 245112 374355 542131
11005 542131 396634 360181 664761 374368 107774 173026 880660 590212 514515 431923
10995 431923 476416 564102 505255 253817 550470 332455 751345 661903 326340 622750
10985 622750 462403 682876 309453 390042 703669 575089 629602 983472 743686 1143560
10975 1143560 1028932 1193587 1150213 1211783 1626934 1644964 1453218 2022338 2033675 1957442
$$ packed form
11047E05304K679O7397n4766m7471K51893j86978O1287p4703p8279M0180K4030
11036E10573P1726l0197K67209l06769r5108J63029p9356M88180D87451J71739
11026F59190k15974j7393j776J27739l0730k21813L39996M0215B86677r432K39412
11015E16657K08901j81866B37176Q6539J74454j40339k888j09830J29243J67776
11005E42131j45497l6453L04580k90393A07774O5252P07634k90448p5697q2592
10995D31923M4493Q7686n8847k51438K96653k18015M18890q9442C26340K96410
10985F22750j60347K20473C09453Q0589L13627j28580N4513L53870k39786L99874
10975A143560j14628J64655m3374O1570M15151J8030j91746N69120J1337p6233
$$ plain form
10965 1957442 1990377 1895025 1502501 1701970 1292792 1223820 1096665 1105583 1250073 1500571
10955 1500571 1190899 1108405 1173349 1048897 1163649 905668 941247 777363 539362 243716
10944 141628 371965 319337 302543 280199 133517 51954 86879 753 57560 266514 127849
10932 2620 223309 -111016 344447 -85715 171294 84380 272773 25253 -97893 55792 -141843
10920 -179543 -115064 -234100 178285 117208 -130675 113687 1196 -160917 -131498 169734
10909 231572 -107196 -274332 -104939 55612 -181787 -167824 -140455 -403839 117564 46753
10898 -62796 108451 81316 56964 157573 -348926 117326 373361 -74138 -312496 -36794
10887 -101323 66406 133284 -27097 381404 -184215 141957 199793 22014 62172 -40036 87553
$$ packed form
10965A957442L2935r5352l92524J99469m09178o8972j27155Q918J44490K50498
10955A500571l09672q2494O4944j24452J14752k57981L5579j63884k38001B43716
10944A41628K30337n2628j6794k2344A33517E1954L4925G53N6807K08954A27849
10932B620K20689a11016C44447h5715A71294H4380J88393B5253i7893E5792a41843
10920a79543O4479j19036A78285o1077a30675A13687A196a60917K9419A69734
10909B31572a07196j67136a04939E5612a81787J3963K7369k63384A17564D6753
10898f2796A08451k7135k4352J00609c48926A17326K56035g4138k38358c6794
10887a01323F6406O6878b7097C81404a84215A41957N7836B2014M0158d0036H7553
$$ plain form
10875 -48128 29049 71133 -31134 -97791 -66805 -370087 59226 317923 77392 256853 -152102
10863 118555 -116240 14254 -363069 121075 -14971 -90424 221371 -143274 -332234 -265780
10853 -265780 116433 -70356 53414 -148225 -286604 -33932 32170 185282 -361437 -51554
10842 -60328 27007 35730 -95329 80059 298318 47733 134244 219448 -186809 -175624 -8724 -67772
10830 -67772 62880 31024 -178535 -14503 -27405 -519733 118736 29319 -112855 -187601 221824
10818 -248974 124221 115172 7342 -129752 256197 -36398 63302 -17707 120189 64016 -101399
10806 113284 -277260 148745 -14115 -50985 -208137 304168 -89674 -300213 -163814 -175019
10796 -175019 -20328 45137 250394 163953 150671 -4427 133243 -242855 27932 -29350 -22937
$$ packed form
10875d8128B9049M2084c1134o6657L0986l03282E9226K58697G7392J79461a52102
10863A18555a16240A4254c63069A21075a4971p5453B21371a43274j88960O6454
10853b65780A16433g0356E3414a48225j38379c3932C2170J53112c61437e1554
10842f0328B7007Q723i5329H0059K18259D7733Q6511Q5204a86809J1185h724n9048
10830f7772F2880C1024a78535a4503j2902m92328A18736B9319a12855p4746B21824
10818b48974A24221r049G342a29752B56197c6398F3302a7707A20189n6173a01399
10806A13284b77260A48745a4115l6870j57152C04168h9674k10539J36399j1205
10796a75019b0328D5137K05257q6441j3282d427A33243b42855B7932b9350O413
$$ plain form
10785 -22937 56121 -113379 80604 -111305 168846 433582 -258170 -73884 162511 55609
10774 31912 -29722 146132 -73761 -128733 135737 221739 199106 259277 43599 80194 -314457
10762 240879 77359 52245 -137026 -326566 -66207 -37667 44017 -295625 160982 219841 -145937
10750 -77721 -114769 60832 89920 -272733 -210203 -223211 149451 69122 -72549 -194528 -97068
10738 -72419 6205 189957 -76494 -16398 85937 154971 -286868 43066 -8164 -210327 -88030
10726 138304 -414463 -397653 -46383 -194195 39378 -91754 156643 -26110 -141733 -368648
10716 -368648 -88971 127779 -60068 -25651 85391 -82617 -294164 24854 -177599 -74229 134604
10704 -99059 -3455 -111529 190239 -3129 -401686 -139299 -194190 -64563 -232837 49489 -46035
$$ packed form
10785b2937E6121a13379H0604a11305A68846K64736b58170g3884A62511E5609
10774C1912b9722A46132g3761n4972A35737Q6002k2633O0171D3599L6595c14457
10762B40879G7359k5114a37026j89540f6207K8540D4017b95625A60982N8859a45937
10750g7721l7048F0832K9088b72733O2530j3008A49451F9122g2549j21979i7068
10738g2419F205J83752g6494a6398H5937O9034b86868D3066h164k02163h8030
10726A38304d14463J6810d6383j47812C9378i1754A56643b6110j15623k26915
10716c68648h8971A27779f0068b5651H5391h2617k11547B4854a77599g4229A34604
10704i9059c455j08074A90239c129l98557a39299n4891f4563j68274D9489d6035
$$ plain form
10692 201266 -212170 -120501 -172621 31220 -187238 73167 -73761 -161627 74672 -62571 -123730
10681 -123730 -22607 -42475 163735 65221 158811 -277086 164441 -189396 -225718 -216332 -104634
10669 4421 -127589 12179 331315 -18963 115540 113436 -218436 -248482 -189629 -65601 293625
10657 83557 -182074 -246693 -149136 -161768 23679 -9825 -167453 -174434 -162787 -168051 -70001 -44150
10645 -44150 -11221 170205 -197620 67650 5028 -88280 -193382 -99720 -68688 -307137 -26133
10633 -91379 452753 124616 75100 -311110 238186 -79584 108930 -16534 110824 403684
10623 403684 79361 160814 -166045 -13239 -174170 -114502 -271118 73635 346822 81821 -299666
10611 62389 102612 -69836 298528 -216158 -107751 299234 -78163 -165941 5477 90051 152451
$$ packed form
10692B01266b12170R1669n2120C1220a87238G3167g3761q7866G4672f2571o1159
10681a23730b2607j9868A63735F5221R3590b77086A64441a89396l6322R386a04634
10669D421a27589A2179L19136a8963A15540k104b18436l0046N8853f5601B93625
10657H3557a82074o4619R7557j2632B3679i825j57628o981J1647n264g0001K5851
10645d4150a1221A70205a97620F7650E028h8280j05102R3662L1032k38449b6133
10633i1379D52753A24616m9516c11110B38186g9584A08930a6534A10824K92860
10623D03684G9361Q1453a66045a3239j60931N9668j56616G3635K73187H1821b99666
10611F2389M0223f9836B98528b16158a07751B99234g8163q7778E477Q4574O2400
$$ plain form
10600 152451 2146 -315994 87586 2779 289248 -532344 121867 -38827 -46517 -94007 26403
10588 -86675 231763 -76254 -128602 -222034 -128440 -177625 -202159 115320 -270668 -113816 226408
10576 -124427 150840 -102054 89262 -44426 -513009 -40482 155059 47917 -123802 23789
10565 -172384 -147208 -52874 -194552 -144493 -24542 -193872 -283638 133525 -27342 -194372 -190588
10554 -190588 7847 -5108 212374 445202 -71596 -492841 -155486 33483 168590 -188410 -75899
10542 -65107 120273 30306 14942 217888 -174040 -78505 -22151 54707 52723 190077 -207965
10530 -112545 -163833 -216263 149772 -341148 -58056 -337911 -118405 -448274 -392346 -147880
10519 -107405 -68381 57083 -40125 170007 -74846 92197 77338 18859 -89520 74163 -106898
$$ packed form
10600A52451B146c15994H7586B779K86469e32344A21867c8827p690m7490B6403
10588h6675B31763g6254n2348r3432R3594m9185k4534A15320b70668a13816B26408
10576a24427A50840a02054H9262d4426m68583d0482A55059D7917a23802B3789
10565a72384K5176e2874j41678N0059b4542j69330q9766A33525b7342j67030L784
10554a90588G847e108B12374K32828g1596m21245a55486C3483J35107a88410g5899
10542f5107A20273C0306A4942K02946a74040g8505b2151E4707j984J37354b07965
10530a12545n1288n2430A49772c41148e8056k79855a18405l29869N5928a47880
10519a07405L9024E7083d0125A70007g4846I2197j4859A8859h9520G4163a06898
$$ plain form
10507 80702 -115736 47020 -173796 -275215 -355346 -91646 248210 -289507 362967 -26946
10496 -334708 -129975 139984 106974 14992 -133880 -201809 -145783 -121067 36634 -203443 -265987
10485 -265987 19432 -206204 13689 -170947 163379 79394 -44941 158664 163463 209907 387134
10474 387134 427158 -54947 350291 143349 -273136 85586 225153 182624 111724 97818 28090
10462 28578 31960 54456 -179402 258186 -281092 -152071 -125814 -22361 -168942 -147131 -90030
10451 -90030 79108 -132969 -22599 7028 -78447 -4409 -139028 117154 -216841 -207937 -71504
10439 -47089 25076 -375433 108822 -77889 -229543 126774 -110882 -148623 -181897 56277 105012
10428 105012 -84470 -56847 -36726 87742 -39829 -34490 170851 -89032 84920 129668 99004
$$ packed form
10507H0702a15736D7020a73796j01419q0131i1646B48210b89507C62967b6946
10496c34708a29975A39984l3010A4992a33880o7929N6026K4716C6634b03443o2544
10485b65987A9432b06204A3689a70947A63379G9394d4941A58664M799M6444J77227
10474C87134M0024e4947C50291A43349b73136H5586J39567m2529p0900j3906B8090
10462B8578L382K2496a79402B58186b81092J29021K6257b2361j46581K1811N7101
10451i0030G9108a32969b2599G028g8447d409j34619A17154b16841Q904g1504
10439d7089B5076c75433A08822g7889j51654A26774a10882l7741l3274E6277M8735
10428A05012h4470K7623K0121H7742c9829N339A70851h9032H4920M4748l0664
$$ plain form
10417 99004 -195393 -177310 -126727 -160466 -97983 -91754 202415 -72793 -60753 -40426 31599
10405 -7366 -142142 -110902 384702 -193002 -61489 -189338 -120505 190375 89904 61909 -175328
10393 -280856 -325467 -15575 28278 121477 111478 167547 127097 192478 -357788 33850 384793
10382 384793 -43017 185691 -107572 -108563 -81232 286424 153369 9874 117373 211003 -56881
10370 139693 -122800 454269 210202 179797 342438 384038 247816 524599 407388 408740
10360 408740 278917 186900 259214 372406 48454 226622 150070 37397 123644 260199 529010
10349 529010 43807 628659 418313 227090 139378 -155486 413024 22833 49498 62161
10339 62161 326020 85853 243776 -308805 444434 41987 176568 212919 48677 -161927
$$ packed form
10417I9004a95393J8083N0583l3739O2483O229B02415g2793J2040K0327C1599
10405g366j34776L1240C84702a93002f1489j27849O8833A90375H9904k7995a75328
10393b80856m4611a5575B8278R3199r999N6069m0450O5381c57788C3850L50943
10382C84793d3017A85691a07572r91K7331B86424j33055I874J07499R3630e6881
10370A39693a22800D54269B10202l0405J62641M1600j36222K76783j17211J352
10360D08740j29823r2017P2314J13192D8454J78168p6552C7397Q6247J36555K68811
10349E29010D3807N84852k10346j91223q7712a55486D13024B2833K6665J2663
10339F2161K63859H5853J57923c08805D44434D1987J34581L6351D8677a61927
$$ plain form
10328 175591 68491 -172289 252504 98877 4771 298099 -18824 6072 123182 72118 12542
10316 25337 121492 9922 -123038 179886 -4416 51815 -154938 116325 -262123 45953 -91700
10304 -386109 -67791 128313 21115 21710 151887 51609 4794 99402 -143858 -33931 -133521
10293 -133521 -372960 6216 -278906 73254 -323139 -226721 91375 -46690 144557 185418 -95565
10281 191160 -180557 -340169 108699 -72046 24903 -60585 -30685 -110228 -223551 41556 -32205
10269 143306 -59462 260484 348789 33826 115095 -78587 193810 205488 -61589 -231706 15101
10257 132772 199444 312190 113693 352947 16032 347068 53448 133875 -31264 172613
10246 -131862 111642 -109725 108036 66758 194774 148834 75200 -147329 -226339 -62400
$$ packed form
10328A75591F8491a72289B52504I8877D771K93328a8824F072J17110n1064A2542
10316B5337R6155I922a23038A79886d416E1815a54938A16325b62123D5953i1700
10304c86109f7791A28313B1115N95J30177E1609D794R4608a43858c3931r9590
10293a33521k39439F216b78906G3254c23139R6418I1375d6690A44557M0861i5565
10281A91160a80557j59612A08699g2046B4903f0585K9900p9543j13323D1556c2205
10269A43306e9462B60484Q8305C3826Q1269g8587A93810J1678f1589j70117A5101
10257A32772O6672J12746A13693K39254A6032L31036E3448Q0427c1264A72613
10246a31862A11642a09725A08036m1278J28016m5940p3634a47329p9010f2400
$$ plain form
10235 -306455 -78812 -191472 21051 131844 46232 88298 -322823 -245996 71802 -131113 -200925
10224 -200925 54237 44975 -45344 -146530 72370 -232742 18708 206004 -10344 -388315 -55324
10212 89459 216863 -238665 -63366 80491 -39328 291346 -292634 -141175 -61691 -272954
10202 -272954 42713 19472 -163543 61818 -261660 -43544 39019 -201084 -37791 51404 -118649
10190 -282895 -80537 87015 -122026 -82546 6463 -55491 -70836 -189249 218188 -110803 -57869
10179 -57869 146214 -445682 -208695 -5321 -101394 -134724 -123745 -37290 -191631 -2932 52062
10167 27623 -194044 -173889 -303679 -373935 -15398 68685 -6214 -72392 -83854 -178065 -78826
10155 -190922 -60556 -37433 82413 -360879 62807 78033 -295335 132790 13605 137281 -124336
$$ packed form
10235c06455g8812j12660B1051J10793D6232M2066c22823P6827G1802a31113o9812
10224b00925E4237r262d5344j01186G2370b32742A8708J87296a0344l77971e5324
10212H9459J27404b38665f3366H0491c9328B91346b92634a41175f1691k11263
10202b72954D2713A9472a63543F1818b61660d3544C9019b01084c7791E1404a18649
10190b82895h0537H7015a22026L9480F463e5491j5345j18413B18188a10803N2934
10179e7869A46214d45682b08695e321r6073l3330J0979c7290j54341b932E2062
10167B7623a94044K0155j29790p0256a5398F8685f214o6178j1462r4211g8826
10155a90922f0556K3123H2413c60879F2807J5226b95335A32790A3605J23676a24336
$$ plain form
10143 -199790 49945 -113033 -138019 -195863 -32005 -7301 -321685 85451 76698 -59987 156791
10131 -38044 290649 3 -204237 -220451 85679 27388 -149045 -282680 -48654 118240 -260527
10119 -12376 -94503 -166567 32999 36233 -99985 -102637 -16018 -248744 -460227 -260580 -93875
10107 -326166 -189727 -141997 106848 -161388 108959 -63790 -90983 -214948 38706 146939
10097 146939 216932 -170296 -87033 -71475 236470 80738 -103938 -187911 -21577 61892 -141543
10085 -23301 -160989 30417 -46567 295347 76223 -6469 154820 -125790 18217 -13935 -80771
10074 -80771 238663 -79406 -275984 14255 -9758 -416439 -9869 -566227 -166556 -118131 150942
10062 -1612 -114107 -250874 -160530 116339 194340 -208252 -226047 -16525 290916 -40429 -178524
$$ packed form
10143a99790D9945a13033k4986n7844c2005g301l14384H5451q753e9987A56791
10131c8044B90649Cb04237j6214H5679B7388a49045j33635d8654A18240b60527
10119a2376q2127p2064C2999L234i9985k652a6018k32726k11483J99647i3875
10107c26166J36439M7730A06848a61388A08959f3790k7193j23965C8706J08233
10097A46939O9993a70296Q3263J5558B36470H0738a03938q3973b1577F1892a41543
10085b3301j37688C0417d6567B95347G6223f469A54820a25790A8217a3935o6836
10074h0771B38663g9406j96578A4255i758m06681i869n56358a66556M8425A50942
10062a612j12495j36767R0344A16339P8001b08252j7795a6525B90916d0429j38095
$$ plain form
10051 -178524 -123421 -152957 -234601 -225356 -111165 74630 101463 32010 -161140 -41974 -25682
10040 -25682 258098 29423 -217805 -123770 -51656 -175827 185915 47292 43818 -296119 -164757
10029 -164757 193142 -230630 -52795 151649 -197353 27956 -100729 -73689 5210 103694 -196024
10017 -94049 -49786 177297 -195436 -166313 -163537 152138 18155 -324691 -458608 -37444 196307
10005 -26012 78023 361077 -59413 -5664 -76597 249207 47418 209791 -111277 -205736 -193724
9994 -193724 25227 -154868 64939 -61142 -14116 62633 -248714 -406313 -143364 75631 -235694
9982 -231701 208308 12011 -127886 -65801 -39479 -152837 145328 -89446 162244 -183703
9971 82310 -22687 -178702 -185258 -229978 -308457 -311248 123266 -124810 78657 -41789 199278
$$ packed form
10051a78524N5103k9536q1644R245a11165G4630K6833C2010a61140d1974J6292
10040b5682B58098B9423b17805R4035e1656j24171A85915D7292l474b96119J31362
10029a64757A93142b30630e2795A51649a97353B7956a00729K7040E210R8484a96024
10017i4049M4263A77297a95436K9123K776A52138A8155c24691j33917c7444A96307
10005b6012G8023K83054e9413e664p0933B49207D7418J62373a11277r4459J2012
9994a93724B5227a54868F4939f1142a4116F2633b48714j57599a43364G5631b35694
9982b31701B08308A2011a27886O2085K6322j13358A45328h9446A62244a83703
9971H2310b2687j56015o556m4720p8479k791A23266a24810G8657d1789A99278
$$ plain form
9959 -126503 -179747 224650 272253 -14646 -37862 -20762 -300031 121996 -186504 -16673 63860
9947 -225876 7477 -322018 -90384 147507 39880 -221122 79598 202841 199681 -187547 -111269
9936 -111269 -8380 -141587 -276027 36905 -43450 -48302 216891 -337552 -38686 16202 -118348
9924 -129350 96601 29889 -178487 12843 -54364 -82212 -278973 -374637 -173440 -100632 -10509
9912 52522 -84006 94987 21893 57908 -89295 134795 -189656 -29110 185109 8340 -169767
9900 -34159 221462 -134405 -320564 -178037 35774 -334605 -121437 69197 -170079 54435
9889 -137414 -152366 218116 -167083 -5600 99978 -132904 -240646 -57191 -91662 -90030 203060
9877 14214 -132316 -141429 -44406 -115477 -138644 -238756 -187016 75901 -12316 -59545 68127 -78751
$$ packed form
9959a26503n3244B24650M7603a4646k3216J7100k79269A21996a86504a6673F3860
9947b25876G477c22018i0384A47507C9880b21122G9598J23243l160a87547P6278
9936a11269h380j33207j34440C6905d3450m852B16891c37552c8686A6202a18348
9924a29350I6601B9889a78487A2843e4364k7848j96761r5664a73440P2808a0509
9912E2522h4006I4987B1893L6015h9295A34795a89656b9110A85109H340a69767
9900c4159B21462a34405j86159J42527C5774c34605a21437F9197a70079E4435
9889a37414j4952B18116a67083e600I9978a32904j07742e7191l4471J632B03060
9877A4214a32316r113d4406p1071k3167j00112N1740G5901a2316m7229F8127g8751
$$ plain form
9864 187205 148674 -323210 -128993 220274 234705 -48499 18781 85023 29460 146283 298427
9853 298427 -78648 -407810 101158 -215871 4369 131440 110140 -417426 -299705 -424773
9843 -424773 -231961 228983 -192802 61884 -159587 -158114 -94458 -390240 -97327 -117483 -6650
9831 228837 -379177 43554 -6052 192820 -149382 -31940 -156260 68570 -134475 82125 -223503
9819 302238 41937 193885 -194878 -355154 54531 -79464 62552 149383 -26968 217478 318538
9808 318538 -96354 102202 -303255 -28342 -11736 -336288 -374887 -63607 -377071 -385557 -251409
9797 -251409 -108188 -4531 110737 13679 -959 -172980 -75105 -18009 202191 14493 63152
9786 63152 -263430 -228499 132793 -179981 -202638 190240 -482836 -48383 176615 -182354
$$ packed form
9864A87205l8531c23210a28993B20274J4431d8499A8781O6242B9460J16823J52144
9853B98427g8648l29162A01158b15871D369J27071k1300d17426J17721j25068
9843d24773J92812B28983a92802F1884a59587J473O3656k95782i7327k0156f650
9831B28837c79177D3554f052A92820a49382c1940j24320F8570a34475H2125b23503
9819C02238D1937J51948a94878j60276E4531g9464F2552Q6831b6968B17478J01060
9808C18538i6354A02202c03255b8342a1736l24552l8599f3607l13464q486J34148
9797b51409a08188d531A10737A3679i59j72021g5105a8009B02191A4493M8659
9786F3152b63430L4931A32793a79981k2657A90240d82836d8383A76615a82354
$$ plain form
9775 -31119 173865 -13328 120463 -42463 33415 -108441 -263945 -112224 -253730 135483
9764 -82271 6333 -164526 83409 -146888 292885 -507182 99125 20203 244688 -53340 -98766
9753 -98766 -350574 145507 -33622 -181237 197343 78222 -148199 -39301 98027 -80128 351664
9741 48471 -416692 -275113 -218997 -28644 -41790 -168947 -154287 -80560 -167079 -94679 210216
9729 -292336 -184196 -196917 100348 -204955 -71074 -69303 -24667 304325 134900 -43027 -97734
9718 -97734 -55912 -22522 22558 -120751 -265703 -180129 -161697 35422 257152 144244 -381546
9706 175842 -153473 -344724 33798 -180107 -63006 -96018 -379188 -319932 -85312 -278268 -188022
9695 -188022 -103638 -186512 -409474 -134197 -64942 -223552 217241 26374 -264265 204497
$$ packed form
9775c1119A73865a3328A20463d2463C3415a08441j55504a12224j41506A35483
9764h2271F333a64526H3409a46888B92885e07182I9125B0203K24485e3340m5426
9753i8766k51808A45507c3622j47615A97343G8222a48199c9301I8027h0128C51664
9741D8471d16692J41579N6116b8644j3146j27157J4660P3727q6519P2400B10216
9729b92336J08140j2721A00348b04955g1074J771b4667C04325A34900d3027n4707
9718i7734M1822b2522B2558a20751j44952Q5574J8432C5422K21730j12908c81546
9706A75842a53473j91251C3798a80107f3006l3012k83170N9256h5312j92956R0246
9695a88022Q4384q2874k22962a34197f4942j58610B17241B6374b64265B04497
$$ plain form
9684 156208 38599 -18663 -387098 55581 -16828 77988 -110843 -217181 -177904 40950 -24529
9672 -395625 -99429 64369 191289 -103037 -91381 -260095 74857 -294456 -6304 354967 -77927
9660 -265463 239871 -33289 20375 161897 -165576 -291760 42649 28065 -55344 -241842 -127520
9649 -127520 -300804 -76916 -266616 176869 363744 -196943 -130146 -96251 36827 -161313
9638 -78156 -9473 -25395 -146261 -20242 53496 127750 -314052 -133795 -364 -172752 72191 136138
9626 136138 -84044 -91144 78734 -223187 -83395 -136477 -83959 219493 -95520 191924 97833
9615 97833 -71774 126313 141881 40666 -240120 -17687 98424 -136366 -311185 -40253 -107881
9604 -107881 -165618 -114155 -205732 181602 -158378 -337377 -254767 2275 104017 -122929 -22722
$$ packed form
9684A56208C8599a8663l68435E5581a6828G7988a10843j06338L9277D0950b4529
9672c95625i9429F4369J26920a03037J1656j68714G4857b94456f304C54967g7927
9660b65463B39871c3289B0375J41522a65576j26184D2649j4584e5344j86498J14322
9649a27520j73284g6916j89700A76869J86875a96943O6797L3895C6827a61313
9638g8156i473j5922j20866b0242E3496P4254c14052a33795c64j72388G2191O3947
9626A36138h4044p100G8734b23187h3395n3082N2518B19493i5520A91924r4091
9615I7833g1774A26313J5568D0666b40120a7687I8424a36366j74819d0253o7628
9604a07881n7737N1463r1577A81602a58378j78999Q2610B275J01742a22929b2722
$$ plain form
9592 -42386 -335058 -280130 21531 46565 -146157 -240895 -212326 -152872 207392 204013 -207281
9580 -120178 106790 52573 58270 -109210 198341 -94294 -239487 226995 47324 -248452 127121
9568 142634 -231024 52582 -248604 -226367 239435 123557 -96805 -58691 57984 -148009 35006
9556 135899 -36253 -157439 -34146 -96337 163596 22474 -131763 -14932 -148419 -27544 -76249
9545 -76249 -294419 -455903 -285687 -76758 -174997 118434 -211225 324 -93679 73410 -10755
9533 -128765 151560 19325 -31962 -233146 -446092 -28277 -363366 148946 199408 96333 -184216
9521 -130800 336781 64009 94539 -422529 91009 9058 -224463 -324249 -32126 69198 -32844
9509 -154282 -339371 -264460 -240128 112881 65583 -230271 -149074 -149019 -112186 36852 74467 -154097
$$ packed form
9592d2386k92672N4928B1531K5034a46157r4738K8569N9454B07392l379b07281
9580a20178A06790E2573N697a09210A98341i4294j45193B26995D7324b48452A27121
9568A42634b31024E2582b48604K2237B39435j15878i6805L8114E7984a48009C5006
9556A35899c6253j21186c4146o2191A63596B2474a31763a4932j33487b7544m8705
9545g6249k18170j61484J70216g6758r8239A18434b11225C24i3679G3410a0755
9533a28765A51560A9325c1962k01184k12946b8277l35089A48946N0462I6333a84216
9521a30800C36781F4009L0530d22529I1009I058b24463r9786c2126F9198c2844
9509a54282j85089P4911K4332A12881m7298b30271Q1197N5L6833C6852L7615a54097
$$ plain form
9496 1832 -293166 30655 139179 -30577 23517 25669 193250 202623 -87957 -355337 -282893 -118220
9483 237447 292432 -160371 126011 280011 123786 139411 -123527 -108985 84218 -290601
9472 136976 45153 -287953 -6337 -239914 -192613 3543 -251912 -235661 -65648 174987 241947
9461 241947 192476 -72864 104880 40884 -73783 50106 154942 -200735 -396922 -186820 205140
9449 -88455 -14777 -153787 -23627 -117411 47128 -97920 47389 -171759 -113371 62958 -210709
9437 -87200 228517 -179169 -236126 212449 -209430 -120387 -9474 -25901 -74942 266966 -47134
9425 -23439 37281 -62175 155697 -259480 -75045 -79833 -237207 192357 -200085 -23619 -54515
9414 -54515 46275 -6228 -277425 -129740 -185823 -145640 -300962 87805 -49692 -275964 56595
$$ packed form
9496A832b93166C0655J08524c0577B3517K152J67581R373h7957k67380P2444a18220
9483B37447N4985a60371A26011J54000A23786J5625a23527J4542H4218b90601
9472A36976D5153b87953f337k33577M7301C543b51912J6251f5648A74987O6960
9461B41947m9471g2864A04880D0884g3783E0106J04836b00735j96187a86820B05140
9449h8455a4777j39010b3627r3784D7128i7920D7389a71759N8388F2958b10709
9437h7200B28517a79169n6957B12449b09430Q9043i474j6427m9041B66966d7134
9425b3439C7281f2175A55697b59480g5045m788j57374A92357b00085b3619l0896
9414e4515D6275f228k71197a29740n6083M0183j55322H7805d9692k26272E6595
$$ plain form
9402 -178530 -25787 -288780 59073 -27715 122119 120392 791 8400 238316 -390103 -16999 -56946
9390 -56946 37203 -81628 -13191 319083 160997 -93184 75686 -2269 -193471 140010 -259011
9378 191134 179994 319961 113571 -81541 -150051 48674 -139511 284746 25519 65519 -103196
9366 -88737 -230384 -37097 -64487 40581 -372713 14048 86165 70165 -151270 -175660 -80986
9354 -153676 52970 -110969 -371138 -391095 -191676 -195524 90933 -83564 57000 -63741 -117668
9343 -117668 -305188 -7022 -124906 14075 97647 62303 -142592 -16036 -95555 -108858 -75872
9332 -75872 83371 -60024 -177111 -453749 5251 -75100 124358 -207735 -79049 -117603 -72305
9321 -72305 184487 -406700 -243287 -238792 -76575 -274856 -118325 -119101 -296094 -46677 -19873
$$ packed form
9402a78530b5787k62993E9073b7715A22119j727G91P609K29916c90103a6999l9947
9390e6946C7203h1628a3191C19083j58086i3184G5686b269j91202A40010b59011
9378A91134j1140J39967A13571h1541o8510D8674a39511B84746B5519M0000a03196
9366h8737j41647c7097k7390D0581c72713A4048P2117j6000a51270k4390h0986
9354a53676E2970a10969k60169j9957a91676l848I0933h3564E7000f3741n3927
9343a17668j87520g022j17884A4075Q3572l5344a42592a6036p9519j3303L2986
9332g5872H3371f0024j17087k76638E251g5100A24358b07735g9049l8554M5298
9321g2305A84487d06700J63413M495g6575j98281a18325p76j76993d6677a9873
$$ plain form
9309 -37057 -41428 155053 -220005 -388006 -102696 166723 -101031 -184953 -176280 -147852 -149122
9298 -149122 171665 -77949 -33709 56539 147215 -48419 90189 60301 120836 -12289 -196179
9287 -196179 141644 14241 -219695 -45043 152202 53778 -184509 -182095 -42192 128362 -6513
9275 -196877 3180 -271316 15102 -158110 -111921 106001 -45669 12373 161191 -141746 41499
9263 -1243 -32208 95907 -87130 196110 -79288 -26376 -32329 -2098 124438 -179127 19050 15594
9251 15594 -70411 -104494 -102499 169571 -138075 73505 -159147 -327906 155084 -194001 -178210
9240 -178210 -1271 144792 -182021 -183428 90289 -125497 -37002 53872 -220918 -280318 142051
9228 -180484 199194 -40777 -21217 -234282 251144 -241997 -107001 -57750 -166892 -69506
$$ packed form
9309c7057m371A55053b20005j68001a02696A66723a01031q3922Q673K8428j270
9298a49122A71665g7949c3709E6539R0676d8419I0189k9888O0535a2289j83890
9287a96179A41644A4241b19695d5043A52202E3778a84509K414d2192A28362f513
9275a96877C180b71316A5102a58110M6189A06001d5669A2373J48818a41746D1499
9263a243l0965I5907h7130A96110g9288b6376n953b098A24438a79127A9050l456
9251A5594g0411l4083J995A69571a38075G3505a59147j68759A55084a94001J5791
9240a78210a271A44792a82021j407I0289a25497c7002E3872b20918n9400A42051
9228a80484A99194d0777J9560k13065B51144b41997a07001M9251j09142f9506
$$ plain form
9217 -128957 -32385 -280611 -184369 -74484 126122 17835 -285191 -431539 -158594 -17243 -50644
9206 -50644 156140 -327441 35694 286659 -20776 -142870 114557 -143912 -159750 23775 -59315
9194 27587 -408357 -13627 245506 -48002 -140704 1174 140578 106296 31597 55556 -159102
9182 13503 289652 -93943 -164189 -247309 321742 -188016 147684 104902 142164 -36055 -83172
9171 -83172 44600 -273073 -37703 116544 -60478 156813 -189642 -75440 57270 244448 -11334
9159 40606 -195120 -23345 -394361 149004 257096 22845 18390 -287396 -302439 279603 1783
9147 104310 -363801 16658 -53031 -217317 -57940 -111477 242116 35048 176821 -52900 -20453
9135 -17327 251878 -332295 195602 -98973 -220293 -91293 -13234 -156280 -40956 -91956 17718
$$ packed form
9217a28957c2385k48226R6242g4484A26122A7835b85191j46348a58594a7243l3401
9206e0644A56140c27441C5694K50965b0776j22094A14557a43912j5838B3775e9315
9194B7587d08357a3627B45506d8002r2702A174J39404l4282C1597K3959a59102
9182A3503K76149i3943p0246q3120C21742a88016A47684m2782L7262c6055m7117
9171h3172D4600b73073c7703A16544f0478A56813a89642g5440E7270J87178a1334
9159D0606a95120b3345l71016A49004J08092B2845m455b87396j5043B79603A783
9147A04310c63801A6658e3031j64286e7940n3537B42116C5048J41773e2900b0453
9135a7327B51878c32295A95602i8973j21320i1293a3234j43046d0956n1000A7718
$$ plain form
9123 21509 -146108 -38448 -116014 -313893 199814 -12756 -313198 60939 -58778 -51277 128023
9111 307739 -91461 15011 -298053 122848 -140682 -403397 -185684 -120961 -34358 -78972 12980
9099 64413 -70712 -34688 63652 93813 -241759 63972 -244643 -68194 -278649 -139349 -262585
9088 -262585 -257688 -70204 98287 -140320 -74087 -276397 146685 -16359 -139339 96328 208398
9077 208398 -425099 -203790 14718 32275 -172500 195676 -207033 26575 72686 186224
9067 186224 -122645 -506222 -2874 112722 -42551 -151480 -391100 -18511 -9024 -7106 50569
9055 -73361 -264408 -206651 -25735 -222244 -33557 -26276 -84057 108085 24182 -81369 206805
9043 164376 -178162 -227740 -395351 -270934 -18094 182886 -107130 -44486 44991 112493 14640
$$ packed form
9123B1509a46108c8448p7566j97879A99814a2756l00442F0939e8778P501A28023
9111C07739i1461A5011b98053A22848a40682k62715a85684O4723c4358m4614A2980
9099F4413g0712c4688F3652L0161b41759F3972b44643f8194k10455J39300j23236
9088b62585M897g0204I8287a40320O6233k02310A46685a6359j22980I6328J12070
9077B08398d25099b03790A4718J7557a72500A95676b07033B6575M6111J13538
9067A86224a22645l83577b874A12722d2551j08929k39620a8511i024J918E0569
9055g3361j91047N7757b5735j96509c3557P281n7781A08085B4182h1369B06805
9043A64376a78162m9578j67611J24417a8094A82886a07130d4486D4991O7502A4640
$$ plain form
9031 54756 -16234 72177 -135387 201156 -41172 -25897 -168549 -451572 -33867 -112644 -381541
9020 -381541 -208641 262027 160658 85667 -119360 -307381 -52641 -20239 -36386 173951
9009 -191519 213199 -166864 749 -386430 -235001 -48618 205159 -355130 -136312 -21223 8732
8997 -61971 55562 -182897 -23306 103172 112366 16044 77896 4775 70709 10067 -196134 102020
8984 125489 -130639 -83690 238893 66224 306750 -232931 24295 -122115 -324390 -28014
8973 -121312 -49379 -58354 -53498 123534 135395 -129923 -175611 -86675 -8231 -86321 -145704 -176708
8961 -176708 -230423 271371 -203775 -104166 -22170 148396 86424 -268514 99495 242191 253452
8950 253452 211776 -171435 254474 -249343 -208225 42786 -8922 -197666 -257063 -273937 -40257
$$ packed form
9031E4756a6234G2177a35387B01156d1172J5275j42652k83023c3867p8777k68897
9020c81541J72900B62027j01369p4991a19360j88021e2641b0239j6147A73951
9009a91519B13199a66864G49c86430J51429d8618B05159c55130a36312b1223H732
8997f1971E5562a82897b3306A03172R194A6044O1852D775O5934A0067a96134A02020
8984A25489a30639M6949B38893F6224K40526b32931B4295a22115k02275b8014
8973a21312d9379q975M856A23534J1861a29923m5688h6675h231p8090n9383l1004
8961a76708n3715B71371b03775R9609b2170A48396o1972b68514I9495J42696J1261
8950B53452m1676a71435B54474b49343M1118D2786h922j88744n9397j6874d0257
$$ plain form
8938 -140848 -59588 -55974 46600 165953 -110459 -57105 140731 127068 -114714 320699 41576
8926 165060 40169 -56665 143856 342420 474414 1257553 6057143 12716064 7147693 1602001
8915 593577 249705 286760 242169 -112993 -121641 25149 55990 -211367 169089 417366 337077
8904 337077 -319652 -249009 59668 -29869 -278110 -90891 -92562 278402 -78496 -362000 172866
8892 -14627 -263966 93639 -62615 73917 -116935 73767 -65533 19768 -59423 -365826 44437
8880 -201033 94328 10624 115174 21584 73581 -131442 97326 -92680 -222070 -145265 -62809
8868 13298 -17632 -289261 67427 226463 -227830 -316214 4108 -194408 -291494 272742 -24782
8856 58036 -5687 -165693 445323 183434 -192682 -92139 -266493 34480 -53943 9122 -98778
$$ packed form
8938a40848e9588L614D6600J19353a10459N3354A40731j3663a14714C20699D1576
8926A65060D0169e6665A43856J98564J31994P83139M799590O658921n568371A602001
8915E93577B49705L7055m4591a12993q648B5149L0841b11367A69089K48277q0289
8904C37077c19652P0643E9668b9869k48241i0891j671B78402g8496k83504A72866
8892a4627k49339I3639f2615G3917a16935G3767f5533A9768e9423l06403D4437
8880b01033I4328A0624J04550B1584N1997a31442I7326i2680j29390P6805f2809
8868A3298a7632k71629F7427J59036b27830q8384D108a94408r7086B72742b4782
8856E8036e687j60006D45323A83434a92682i2139j74354C4480e3943I122i8778
$$ plain form
8844 24055 -731 195443 310296 -2540 87235 -399191 189345 -336824 -257087 153082 -228407
8832 30192 -18711 -95975 -162394 -127913 -54218 -287655 -190857 38383 -140187 153427 33630
8820 -132010 82580 -50583 -182617 30273 -151186 -73837 -8324 -295552 -114617 -129293 -503162
8809 -503162 62698 180695 -135320 254553 -44067 -10068 -296887 -257229 -83769 -304488 -243372
$$ packed form
8844B4055g31A95443J14853b540H7235c99191A89345c36824P9737A53082b28407
8832C0192a8711p7264o6419L4481e4218k33437R6798C8383a40187A53427C3630
8820a32010H2580e0583j32034C0273a51186g3837h324k87228a14617j4676l73869
8809e03162F2698J17997a35320B54553d4067a0068k86819L9658h3769k20719O1116
$$ [...]
##END NTUPLES=NMR SPECTRUM
##END=
