##TITLE=NES1072_159122.0001_001_9705742_Jn1s7h4oia
##JCAMPDX= 6.0         $$ Bruker NMR JCAMP-DX V2.0
##DATA TYPE= NMR SPECTRUM
##DATA CLASS= NTUPLES
##ORIGIN= BRUKER
##OWNER= Administrator
$$ 1.72 TOPSPIN		Version 2.1
$$ 2016-05-01 14:47:09.942 -0700  Administrator@X
$$ Compression mode = diff/dup
##.OBSERVE FREQUENCY= 400.02188249412
##.OBSERVE NUCLEUS= ^1H
##.ACQUISITION MODE= SIMULTANEOUS (DQD)
##.ACQUISITION SCHEME= undefined
##.AVERAGES= 64
##.DIGITISER RES= 22
##SPECTROMETER/DATA SYSTEM= spect
##.PULSE SEQUENCE= noesygpps1d.comp
##.SOLVENT NAME= COFFEE_meoh
##.SHIFT REFERENCE= INTERNAL, COFFEE_meoh, 1, 14.96249
##AUDIT TRAIL= $$ (NUMBER, WHEN, WHO, WHERE, PROCESS, VERSION, WHAT)
$$ ##TITLE= Audit trail, TOPSPIN		Version 2.1
$$ ##JCAMPDX= 5.01
$$ ##ORIGIN= Bruker BioSpin GmbH
$$ ##OWNER= Administrator
$$ $$ E:\/data/COFFEE/nmr/NES1072_159122.0001_001_9705742_Jn1s7h4oia/12/pdata/1/auditp.txt
$$ ##AUDIT TRAIL=  $$ (NUMBER, WHEN, WHO, WHERE, PROCESS, VERSION, WHAT)
(   1,<2016-05-01 14:47:05.083 -0700>,<Administrator>,<X>,<go>,<TOPSPIN 2.1>,
      <created by zg
	started at 2016-05-01 14:35:35.489 -0700,
	POWCHK enabled, PULCHK disabled,
       configuration hash MD5:
       21 0F 79 D6 B3 7B B4 F6 88 20 88 DB 03 48 BD 9F
       data hash MD5: 64K
       1D 0D A4 AE 49 11 60 B5 27 31 87 9D F8 C9 F1 9A>)
(   2,<2016-05-01 14:47:08.177 -0700>,<Administrator>,<X>,<proc1d>,<TOPSPIN 2.1>,
      <Start of raw data processing
       efp LB = 0.3 FT_mod = 6 PKNL = 1 PHC0 = 0 PHC1 = 0 SI = 128K 
       data hash MD5: 128K
       74 49 71 3A E5 26 74 AC 82 30 A6 34 F8 9E 64 31>)
(   3,<2016-05-01 14:47:09.036 -0700>,<Administrator>,<X>,<proc1d>,<TOPSPIN 2.1>,
      <pk PHC0 = -82.43042 PHC1 = 0 
       data hash MD5: 128K
       96 41 77 CE B3 91 0C DC 40 5A B2 F8 F7 DE 07 7F>)
(   4,<2016-05-01 14:47:09.427 -0700>,<Administrator>,<X>,<proc1d>,<TOPSPIN 2.1>,
      <abs ABSG = 1 
       data hash MD5: 128K
       F0 61 CA 76 50 70 C1 FA 77 73 B1 FD 62 49 95 8C>)
(   5,<2016-05-01 14:47:09.536 -0700>,<Administrator>,<X>,<proc1d>,<TOPSPIN 2.1>,
      <abs ABSG = 2 
       data hash MD5: 128K
       39 26 CD 34 F3 84 B8 47 E9 CF 36 9B 93 53 96 B0>)
(   6,<2016-05-01 14:47:09.614 -0700>,<Administrator>,<X>,<proc1d>,<TOPSPIN 2.1>,
      <abs ABSG = 3 
       data hash MD5: 128K
       35 0A 2F 62 D4 41 27 AB DA E1 B9 5A 6B 18 90 5C>)
(   7,<2016-05-01 14:47:09.692 -0700>,<Administrator>,<X>,<proc1d>,<TOPSPIN 2.1>,
      <abs ABSG = 4 
       data hash MD5: 128K
       7E D1 B6 94 18 3A F7 1B F8 54 B7 FA 3E D3 69 0C>)
(   8,<2016-05-01 14:47:09.786 -0700>,<Administrator>,<X>,<proc1d>,<TOPSPIN 2.1>,
      <abs ABSG = 5 
       data hash MD5: 128K
       5E 81 E8 19 62 B2 B0 0C D1 D9 3E AE FA 0B 82 8A>)
$$ ##END=
$$ 
$$ $$ hash MD5
$$ $$ AC 5C 46 FE 9E C6 D0 E1 40 4D 8A 84 CF DA 65 EE
##$RELAX= 
##$RELAX= 
##$RELAX= 
##$RELAX= 
##$RELAX= 
##$RELAX= 
##$RELAX= 
##$RELAX= 
$$ Bruker specific parameters
$$ --------------------------
##$DU= <E:\>
##$EXPNO= 12
$$ [...]
##$TP07= 0
##$TPNAME0= <>
##$TPNAME1= <>
##$TPNAME2= <>
##$TPNAME3= <>
##$TPNAME4= <>
##$TPNAME5= <>
##$TPNAME6= <>
##$TPNAME7= <>
##$TPOAL= (0..7)
0.5 0.5 0.5 0.5 0.5 0.5 0.5 0.5
##$TPOFFS= (0..7)
0 0 0 0 0 0 0 0
##$TUNHIN= 0
##$TUNHOUT= 0
##$TUNXOUT= 0
##$USERA1= <user>
##$USERA2= <user>
##$USERA3= <user>
##$USERA4= <user>
##$USERA5= <user>
##$V9= 5
##$VALIST= <valist>
##$VCLIST= <CCCCCCCCCCCCCCC>
##$VD= 0
##$VDLIST= <DDDDDDDDDDDDDDD>
##$VPLIST= <PPPPPPPPPPPPPPP>
##$VTLIST= <TTTTTTTTTTTTTTT>
##$WBST= 2048
##$WBSW= 25
##$XGAIN= (0..3)
0 0 0 0
##$XL= 0
##$YL= 0
##$YMAX_a= 6094534
##$YMIN_a= -12781664
##$ZGOPTNS= <>
##$ZL1= 120
##$ZL2= 120
##$ZL3= 120
##$ZL4= 120
##$ABSF1= 14.96249
##$ABSF2= -5.595692
##$ABSG= 5
##$ABSL= 3
##$ALPHA= 0
##$AQORDER= 0
##$ASSFAC= 0
##$ASSFACI= 0
##$ASSFACX= 0
##$ASSWID= 0
##$AUNMP= <proc_prof1d_extract.lims>
##$AXLEFT= 0
##$AXNAME= <>
##$AXNUC= <1H>
##$AXRIGHT= 0
##$AXTYPE= 0
##$AXUNIT= <>
##$AZFE= 0.1
##$AZFW= 0.1
##$BCFW= 0
##$BC_mod= 0
##$BYTORDP= 0
##$COROFFS= 0
##$CY= 15
##$DATMOD= 1
##$DC= 0
##$DFILT= <>
##$DTYPP= 0
##$F1P= 0
##$F2P= 0
##$FCOR= 0.5
##$FTSIZE= 131072
##$FT_mod= 6
##$GAMMA= 0
##$GB= 0
##$INTBC= 1
##$INTSCL= 1
##$ISEN= 128
##$LB= 0.3
##$LEV0= 0
##$LPBIN= 0
##$MAXI= 10000
##$MC2= 0
##$MEAN= 0
##$ME_mod= 0
##$MI= 0
##$NCOEF= 0
##$NC_proc= -2
##$NLEV= 6
##$NOISF1= 0
##$NOISF2= 0
##$NSP= 0
##$NTH_PI= 0
##$NZP= 0
##$OFFSET= 14.96249
##$PC= 1
##$PHC0= -82.43042
##$PHC1= 0
##$PH_mod= 1
##$PKNL= yes
##$PPARMOD= 0
##$PPDIAG= 0
##$PPIPTYP= 0
##$PPMPNUM= 2147483647
##$PPRESOL= 1
##$PSCAL= 4
##$PSIGN= 0
##$PYNMP= <proc.py>
##$REVERSE= no
##$SF= 400.020009041178
##$SI= 131072
##$SIGF1= 0
##$SIGF2= 0
##$SINO= 400
##$SIOLD= 131072
##$SPECTYP= <>
##$SREGLST= <1H.CDCl3>
##$SSB= 0
##$STSI= 131072
##$STSR= 0
##$SW_p= 8223.68421052631
##$SYMM= 0
##$S_DEV= 0
##$TDeff= 65536
##$TDoff= 0
##$TI= <>
##$TILT= no
##$TM1= 0
##$TM2= 0
##$TOPLEV= 0
##$USERP1= <user>
##$USERP2= <user>
##$USERP3= <user>
##$USERP4= <user>
##$USERP5= <user>
##$WDW= 1
##$XDIM= 131072
##$YMAX_p= 374224398
##$YMIN_p= -12447
##$CURPLOT= <Network HP LaserJet P1505>
##$CURPRIN= <$Network HP LaserJet P1505>
##$DFORMAT= <normdp>
##$LAYOUT= <+/1D_H.xwp>
##$LFORMAT= <normlp>
##$PFORMAT= <normpl>
##$SURQMSG= 1
$$ End of Bruker specific parameters
$$ ---------------------------------
##NTUPLES= NMR SPECTRUM
##VAR_NAME=  FREQUENCY,     SPECTRUM/REAL,   SPECTRUM/IMAG
##SYMBOL=    X,             R,               I
##VAR_TYPE=  INDEPENDENT,   DEPENDENT,       DEPENDENT
##VAR_FORM=  AFFN,          ASDF,            ASDF
##VAR_DIM=   131072,        131072,          131072
##UNITS=     HZ,            ARBITRARY UNITS, ARBITRARY UNITS
##FACTOR=    0.0627417313425164, 1,          1
##FIRST=     8223.62146879497, -857,         -49065
##LAST=      0,             547,             -48786
##MIN=       0,             -12447,          0
##MAX=       8223.62146879497, 374224398,    0
$$ Real data points
##PAGE= N=1
##DATA TABLE= (X++(R..R)), XYDATA
$$ [...]
$$ plain form
61153 702143 689354 673539 655715 636781 617250 597530 578147 559666 542445 526530 511901
61142 511901 498832 487831 479082 472111 466177 460903 456396 452932 450695 449688 449701 450503 452192 455174
61128 455174 459596 465011 470834 476944 483536 490633 498133 506227 515294 525352 535963 546677 557238
61115 557238 567324 576486 584466 591259 596777 600707 602734 602651 600179 595104 587787 579269 570643 562470
61101 562470 554861 547832 541308 535043 528838 522795 517172 512051 507278 502601 497694 492210 486051 479580
61087 479580 473322 467480 461966 456899 452689 449390 446225 442254 437536 433234 430350 428699 427485 426581
61073 426581 426615 427845 429609 431157 432516 434107 435956 437809 439855 442768 446978 452289 458198 464228 469922
61058 469922 474829 478665 481391 483187 484515 486035 488128 490527 492732 494745 497113 500280 504268 508970
$$ packed form
61153G02143j2789j5815j7824j8934j9531j9720j9383j8481j7221j5915j4629
61142E11901j3069j1001q749o971n934n274m507l464k237j007J3Q02J689K982
61128D55174M422N415N823O110O592P097P500Q094R067J0058J0611J0714J0561
61115E57238J0086R162P980O793N518L930K027q3k472n075p317q518q626q173
61101E62470p609p029o524o265o205o043n623n121m773m677m907n484o159o471
61087D79580o258n842n514n067m210l299l165l971m718m302k884j651j214r04
61073D26581L4J230J764J548J359J591J849J853K046K913M210N311N909O030N694
61058D69922M907L836K726J796J328J520K093K399K205K013K368L167L988M702
$$ plain form
61044 508970 514354 520230 526208 532129 538397 545672 554258 563852 573809 583725 593901 605188 618223
61031 618223 632861 648575 665289 683563 703974 726603 751162 777406 805389 835486 868181
61020 868181 903674 941604 981110 1021039 1060253 1098345 1136355 1176370 1220092 1268193 1321410
61009 1321410 1381586 1450792 1529724 1617759 1714445 1820543 1938390 2072710 2231237 2423813
60999 2423813 2661311 2956815 3327948 3796905 4388490 5129556 6049300 7175715 8528411
60990 8528411 10113846 11921570 13908420 15967424 17909715 19500291 20550344 21010085
60982 21010085 20993054 20717187 20413095 20257069 20338557 20637659 21009552 21209854 20982462 20171977
60972 20171977 18787490 16979850 14962284 12933596 11037821 9356797 7919773 6720103
$$ packed form
61044E08970N384N876N978N921O268P275Q586R594R957R916J0176J1287J3035
61031F18223J4638J5714J6714J8274K0411K2629K4559K6244K7983L0097L2695
61020H68181L5493L7930L9506L9929L9214L8092L8010M0015M3722M8101N3217
61009A321410O0176O9206P8932Q8035R6686J06098J17847J34320J58527J92576
60999B423813K37498K95504L71133M68957N91585P41066R19744J126415J352696
60990H528411J585435J807724J986850K059004J942291J590576J050053M59741
60982B1010085j7031k75867l04092j56026Q1488K99102L71893K00302k27392q10485
60972B0171977j384487j807640k017566k028688j895775j681024j437024j199670
$$ plain form
60964 6720103 5732892 4927588 4273703 3743177 3312195 2961668 2675818 2440904 2245323
60955 2245323 2079806 1936876 1810599 1697087 1594467 1501742 1417843 1341683 1272503 1209915
60945 1209915 1153974 1104999 1062668 1025198 990058 955535 921153 886813 852449 818590 786318
60934 786318 756338 728720 703633 681473 662003 644138 627009 610600 595092 580333 566313
60923 566313 553395 541533 529885 517723 505217 492878 480771 468815 457340 446776 437182 428527
60911 428527 421003 414510 408300 401740 395093 389019 383619 378593 374026 370342 367604 365459 363730 362513
60897 362513 361724 361082 360644 360924 362334 364704 367391 369731 371552 373405 376134 380057 384744 389793 395387
60882 395387 401741 408310 414128 418806 422791 426700 430706 434456 437196 438164 437301 435450 433419 430949 427168
$$ packed form
60964F720103r87211q05304o53885n30526m30982l50527k85850k34914j95581
60955B245323j65517j42930j26277j13512j02620r2725q3899p6160o9180o2588
60945A209915n5941m8975m2331l7470l5140l4523l4382l4340l4364l3859l2272
60934G86318k9980k7618k5087k2160j9470j7865j7129j6409j5508j4759j4020
60923E66313j2918j1862j1648j2162j2506j2339j2107j1956j1475j0564r594q655
60911D28527p524o493o210o560o647o074n400n026m567l684k738k145j729j217
60897C62513p89o42m38K80J410K370K687K340J821J853K729L923M687N049N594
60882C95387O354O569N818M678L985L909M006L750K740R68q63j851k031k470l781
$$ plain form
60867 427168 421961 416332 411279 406935 403049 399754 397441 396142 395565 395666 396861 399637 404111 410008 416808
60852 416808 423815 430254 435694 440551 445958 452775 460730 468812 476430 483787 490995 497430 502410 506113
60838 506113 509270 512129 514349 515930 517698 520664 525192 530816 536596 541591 545433 548653 552172 556297
60824 556297 560417 563727 565951 567237 567734 567605 567185 566737 566065 564666 562280 559128 555606 551921 547984
60809 547984 543451 537860 530918 522743 513750 504322 494726 485325 476630 468995 462377 456516 451257 446678
60795 446678 443072 440876 440365 441170 442340 443278 444467 446795 450247 453855 456997 460037 463391 466740 469780
60780 469780 473066 477183 481428 484466 486284 488432 491992 496267 500023 503231 506826 511241 516028 520754
60766 520754 525592 530989 537217 544309 552080 560164 568225 576101 583648 590632 596932 602602 607586 611674
$$ packed form
60867D27168n207n629n053m344l886l295k313j299n77J01J195K776M474N897O800
60852D16808P007O439N440M857N407O817P955Q082P618P357P208O435M980L703
60838E06113L157K859K220J581J768K966M528N624N780M995L842L220L519M125
60824E56297M120L310K224J286M97j29m20m48o72j399k386l152l522l685l937
60809E47984m533n591o942q175q993r428r596r401q695p635o618n861n259m579
60795D46678l606k196n11Q05J170R38J189K328L452L608L142L040L354L349L040
60780D69780L286M117M245L038J818K148L560M275L756L208L595M415M787M726
60766E20754M838N397O228P092P771Q084Q061P876P547O984O300N670M984M088
$$ plain form
60752 611674 614996 618161 621569 624903 627687 629959 631908 633207 633388 632641 631550 630145 627908 624692 620896
60737 620896 616651 611636 605912 600260 595274 590670 585897 580944 576089 571273 566244 561047 555848 550466
60723 550466 544555 538203 531972 526331 521314 516673 512104 507360 502415 497488 492702 487780 482384 476739
60709 476739 471639 467758 465169 463577 462830 463023 464228 466254 468650 470942 472934 474834 477066 479900 483276
60694 483276 486943 490630 494040 496712 498062 497647 495400 491599 486619 480739 474141 466928 459120 450773
60680 450773 442178 433838 426096 418874 411931 405296 399243 393898 389136 384898 381338 378530 376222 374070
60666 374070 372012 370329 369484 370008 372329 376415 381593 386928 391928 396788 401958 407547 413192 418425 423133
60651 423133 427642 432355 437244 441702 445033 447187 448933 451152 453947 456648 458728 460478 462576 465239
$$ packed form
60752F11674L322L165L408L334K784K272J949J299J81p47j091j405k237l216l796
60737F20896m245n015n724n652m986m604m773m953m855m816n029n197n199n382
60723E50466n911o352o231n641n017m641m569m744m945m927m786m922n396n645
60709D76739n100l881k589j592p47J93J205K026K396K292J992J900K232K834L376
60694D83276L667L687L410K672J350m15k247l801m980n880o598p213p808q347
60680D50773q595q340p742p222o943o635o053n345m762m238l560k808k308k152
60666C74070k058j683q45N24K321M086N178N335N000M860N170N589N645N233M708
60651D23133M509M713M889M458L331K154J746K219K795K701K080J750K098K663
$$ plain form
60637 465239 468208 471518 475674 480837 486312 491354 496266 502177 509720 518374 527114 535310 542921 550221
60623 550221 557549 565024 572250 578591 583929 588829 593688 597998 600875 602130 602359 602011 600892 598667 595372
60608 595372 591200 586152 580302 574087 567876 561317 553604 544426 534291 523800 513100 502340 492265
60595 492265 483783 477085 471666 467275 464282 462962 462860 463219 463736 464574 465865 467632 470067 473455 477766
60580 477766 482600 487529 492223 496214 498964 500361 500981 501671 502971 504918 507187 509243 510516 510651 509677
60565 509677 507908 505726 503400 501029 498662 496524 494995 494107 493183 491339 488473 485472 483273 482013 481326
60550 481326 481213 482212 484773 488863 494348 501545 511243 524192 540677 560514 583369 608913 636568
60537 636568 665069 692413 716319 734826 746522 750508 746514 735152 717927 696796 673673 650290
$$ packed form
60637D65239K969L310M156N163N475N042M912N911P543Q654Q740Q196P611P300
60623E50221P328P475P226O341N338M900M859M310K877J255K29l48j119k225l295
60608E95372m172n048n850o215o211o559p713r178j0135j0491j0700j0760j0075
60595D92265q482o698n419m391k993j320j02L59N17Q38J291J767K435L388M311
60580D77766M834M929M694L991K750J397O20O90J300J947K269K056J273J35r74
60565E09677j769k182k326k371k367k138j529q88r24j844k866l001k199j260o87
60550D81326j13R99K561M090N485P197R698J2949J6485J9837K2855K5544K7655
60537F36568K8501K7344K3906J8507J1696L986l994j1362j7225k1131k3123k3383
$$ plain form
60525 650290 628299 609143 593646 581830 573348 568058 565981 566705 569114 571912 574354 576385 578254
60512 578254 580203 582478 585451 589646 595613 603609 613444 624962 638906 656980 680699 710327 745295
60499 745295 785406 831097 882583 939395 1000932 1067068 1138111 1214847 1299106 1393969 1502933
60488 1502933 1628888 1773934 1939506 2125715 2329964 2545883 2763107 2967834 3144209
60479 3144209 3276630 3352349 3363428 3307794 3189631 3018975 2810168 2579318 2341632 2109396
60469 2109396 1891127 1691960 1514626 1360030 1227220 1113632 1016155 932217 859941 797725
60459 797725 744150 698131 658733 624818 595263 569419 546896 526930 508481 491175 475693
60448 475693 462871 452635 444065 436292 429029 422365 416376 410974 405974 401296 397181 394089 392123 390593
$$ packed form
60525F50290k1991j9156j5497j1816q482n290k077P24K409K798K442K031J869
60512E78254J949K275K973M195N967P996R835J1518J3944J8074K3719K9628L4968
60499G45295M0111M5691N1486N6812O1537O6136P1043P6736Q4259R4863J08964
60488A502933J25955J45046J65572J86209K04249K15919K17224K04727J76375
60479C144209J32421P5719J1079n5634j18163j70656k08807k30850k37686k32236
60469B109396k18269j99167j77334j54596j32810j13588r7477q3938p2276o2216
60459G97725n3575m6019l9398l3915k9555k5844k2523j9966j8449j7306j5482
60448D75693j2822j0236q570p773p263o664n989n402n000m678m115l092j966j530
$$ plain form
60434 390593 388419 385159 381513 378611 376816 375360 373173 369911 366072 362310 358858 355595 352416 349481
60420 349481 347204 346008 345856 346082 346012 345865 346685 349209 353091 357412 361593 365421 368579 370760 372194 373573
60404 373573 375411 377843 380901 384526 388336 391926 395468 399494 404002 408361 412319 416456 421213 426053
60390 426053 430168 433646 437185 440772 443402 444322 444109 444170 445332 447112 448331 448318 447515 446940 447180 447979 448732
60373 448732 449029 448646 447367 445116 442160 438972 435983 433613 432248 431980 432541 433705 435514 437888 440297
60358 440297 442230 443816 445639 448133 451605 456536 463211 471022 478676 485219 490488 494597 497582 499630
60344 499630 501066 501836 501422 499530 496461 492637 488281 483869 480324 478257 477330 476844 476697 477287 478760 480848
60328 480848 483294 485896 488193 489625 490061 489818 489138 488021 486595 485257 484316 483711 483155 482351 481117 479497
$$ packed form
60434C90593k174l260l646k902j795j456k187l262l839l762l452l263l179k935
60420C49481k277j196j52K26p0j47Q20K524L882M321M181L828L158K181J434J379
60404C73573J838K432L058L625L810L590L542M026M508M359L958M137M757M840
60390D26053M115L478L539L587K630R20k13O1J162J780J219j3q03n75K40P99P53
60373D48732K97l83j279k251k956l188k989k370j365k68N61J164J809K374K409
60358D40297J933J586J823K494L472M931O675P811P654O543N269M109K985K048
60344D99630J436P70m14j892l069l824m356m412l545k067r27m86j47N90J473K088
60328D80848K446K602K297J432M36k43o80j117j426j338r41o05n56q04j234j620
$$ plain form
60312 479497 477796 476306 475055 473962 473164 472940 473376 474282 475300 475914 475662 474640 473549 472773 471721 469577
60296 469577 466514 463457 460765 457939 454682 451406 448438 445535 442586 440139 438744 438324 438649 439879 442120
60281 442120 445005 448368 452798 458761 465501 471591 476390 480248 483542 486364 489067 492215 495783 499182
60267 499182 502223 505381 508891 512327 515492 519017 523487 528450 532968 536916 541164 546533 553068 560386
60253 560386 568319 577067 586925 598019 610280 623628 638168 654157 671777 691084 712258 735753
60241 735753 762111 791698 824682 861195 901490 945984 995194 1049590 1109541 1175354 1247106
60230 1247106 1324206 1405318 1489030 1574446 1660738 1746246 1828563 1905631 1976293 2039636 2094389
60219 2094389 2139331 2173907 2198039 2211599 2214481 2207086 2190407 2165761 2134648 2098715 2059575 2018786
$$ packed form
60312D79497j701j490j251j093p98k24M36R06J018O14k52j022j091p76j052k144
60296D69577l063l057k692k826l257l276k968k903k949k447j395m20L25J230K241
60281D42120K885L363M430N963O740O090M799L858L294K822K703L148L568L399
60267D99182L041L158L510L436L165L525M470M963M518L948M248N369O535P318
60253E60386P933Q748R858J1094J2261J3348J4540J5989J7620J9307K1174K3495
60241G35753K6358K9587L2984L6513M0295M4494M9210N4396N9951O5813P1752
60230A247106P7100Q1112Q3712Q5416Q6292Q5508Q2317P7068P0662O3343N4753
60219B094389M4942L4576K4132J3560K882p395j6679k4646l1113l5933l9140m0789
$$ plain form
60207 2018786 1978248 1940348 1907298 1880289 1859537 1845035 1837071 1836261 1843570 1860315 1887663 1925842
60195 1925842 1974062 2031363 2097361 2171987 2254607 2343583 2436660 2531510 2625698 2716297 2800073
60184 2800073 2874424 2937919 2989567 3027825 3050995 3058643 3051872 3031891 2998965 2953313 2896512 2831309
60172 2831309 2760330 2685747 2610081 2536462 2467741 2405698 2351253 2305163 2268409 2242184 2227513
60161 2227513 2224623 2232788 2251126 2279455 2317906 2365750 2421039 2481224 2543524 2604745 2661682 2712117
60149 2712117 2754867 2788597 2811326 2821764 2820674 2810213 2792153 2767384 2737000 2703155 2668748
60138 2668748 2636739 2609830 2590271 2579627 2578823 2588554 2609530 2642359 2687513 2745551 2817296 2903680
60126 2903680 3005569 3123849 3259624 3414107 3588140 3781680 3993729 4222731 4466906
$$ packed form
60207B018786m0538l7900l3050k7009k0752j4502p964q10P309J6745K7348L8179
60195A925842M8220N7301O5998P4626Q2620Q8976R3077R4850R4188R0599Q3776
60184B800073P4351O3495N1648L8258K3170P648o771j9981l2926m5652n6801o5203
60172B831309p0979p4583p5666p3619o8721o2043n4445m6090l6754k6225j4671
60161B227513k890Q165J8338K8329L8451M7844N5289O0185O2300O1221N6937N0435
60149B712117M2750L3730K2729J0438j090j0461j8060k4769l0384l3845l4407
60138B668748l2009k6909j9559j0644q04R731K0976L2829M5154N8038P1745Q6384
60126B903680J01889J18280J35775J54483J74033J93540K12049K29002K44175
$$ plain form
60117 4466906 4724059 4991124 5264076 5538166 5808054 6067812 6311374 6533303 6729047
60108 6729047 6894451 7025482 7118743 7171974 7183793 7153253 7080221 6966184 6814490 6629927
60098 6629927 6418420 6186917 5942915 5693653 5445707 5205120 4977413 4767086 4577160
60089 4577160 4409253 4264046 4141710 4042159 3965161 3910410 3877560 3866075 3874818 3901730 3944150
60078 3944150 3999426 4064881 4137037 4211401 4283532 4350060 4408361 4455638 4489108 4507121 4509546
60067 4509546 4496982 4470064 4429528 4376375 4311673 4236518 4152252 4060292 3961686 3857313 3748681
60056 3748681 3638008 3527297 3417874 3311124 3209079 3113686 3025870 2945929 2874677 2813649
60046 2813649 2764177 2726715 2701197 2687803 2687349 2700967 2729292 2771811 2827148 2894071 2971928 3059935
$$ packed form
60117D466906K57153K67065K72952K74090K69888K59758K43562K21929J95744
60108F729047J65404J31031R3261N3231J1819l0540p3032j14037j51694j84563
60098F629927k11507k31503k44002k49262k47946k40587k27707k10327j89926
60089D577160j67907j45207j22336r9551p6998n4751l2850j1485Q743K6912M2420
60078C944150N5276O5455P2156P4364P2131O6528N8301M7277L3470J8013K425
60067D509546j2564k6918m0536n3153o4702p5155q4266r1960r8606j04373j08632
60056C748681j10673j10711j09423j06750j02045r5393q7816p9941p1252o1028
60046B813649m9472l7462k5518j3394m54J3618K8325M2519N5337O6923P7857Q8007
$$ plain form
60034 3059935 3156340 3258492 3363238 3466895 3565330 3654787 3732571 3796515 3844078 3872710 3881072
60023 3881072 3869348 3838408 3789196 3722981 3641570 3547165 3442454 3330915 3216464 3102524
60013 3102524 2991736 2886447 2788968 2701271 2624978 2561671 2512501 2477281 2454668 2443681 2444603
60002 2444603 2458247 2485028 2525186 2579207 2647372 2729299 2824426 2932449 3052634 3182959 3320455
59991 3320455 3461912 3603602 3740772 3868378 3982389 4079881 4158227 4215116 4249351 4260849
59981 4260849 4249785 4216375 4161497 4086807 3994248 3886334 3767041 3641557 3514775 3390670
59971 3390670 3273207 3166609 3073871 2995675 2931558 2881660 2846584 2826117 2819191 2825015 2843438
59960 2843438 2874198 2916603 2970057 3034147 3107940 3189640 3277149 3368441 3461226 3552814 3640743
$$ packed form
60034C059935R6405J02152J04746J03657R8435Q9457P7784O3944M7563K8632Q362
60023C881072j1724l0940m9212o6215q1411r4405j04711j11539j14451j13940
60013C102524j10788j05289r7479q7697p6293o3307m9170l5220k2613j0987R22
60002B444603J3644K6781M0158N4021O8165Q1927R5127J08023J20185J30325J37496
59991C320455J41457J41690J37170J27606J14011R7492P8346N6889L4235J1498
59981D260849j1064l3410n4878p4690r2559j07914j19293j25484j26782j24105
59971C390670j17463j06598r2738p8196o4117m9898l5076k0467o926N824J8423
59960B843438L0760M2405N3454O4090P3793Q1700Q7509R1292R2785R1588Q7929
$$ plain form
59949 3640743 3723235 3798714 3865249 3920941 3964774 3996765 4017491 4027896 4029552 4024621 4015393 4004110
59937 4004110 3993413 3986720 3987950 4000936 4029213 4076046 4144230 4235808 4352305 4495321 4666488
59926 4666488 4866460 5093902 5345609 5617400 5904528 6201118 6499411 6789659 7060774
59917 7060774 7301277 7500165 7647592 7735572 7759006 7716852 7612546 7453082 7247456 7005638
59907 7005638 6738177 6455664 6167901 5883386 5609366 5351744 5114698 4900622 4710772
59898 4710772 4545918 4406438 4292207 4202711 4137195 4094715 4074452 4076184 4100054 4145630 4211442
59887 4211442 4295648 4396571 4512065 4638590 4771440 4905580 5035699 5155677 5258869 5339183
59877 5339183 5391618 5412014 5397307 5346513 5261104 5144194 4999873 4833533 4651951 4462051
$$ packed form
59949C640743Q2492P5479O6535N5692M3833L1991K0726J0405J656m931r228j1283
59937D004110j0697o693J230J2986K8277M6833O8184R1578J16497J43016J71167
59926D666488J99972K27442K51707K71791K87128K96590K98293K90248K71115
59917G060774K40503J98888J47427Q7980K3434m2154j04306j59464k05626k41818
59907G005638k67461k82513k87763k84515k74020k57622k37046k14076j89850
59898D710772j64854j39480j14231q9496o5516m2480k0263J732K3870M5576O5812
59887D211442Q4206J00923J15494J26525J32850J34140J30119J19978J03192Q0314
59877E339183N2435K0396j4707n0794q5409j16910j44321j66340j81582j89900
$$ plain form
59867 4462051 4269467 4078598 3893663 3718839 3557209 3410109 3277741 3159944 3055978
59858 3055978 2963967 2881266 2805666 2736052 2671797 2611799 2554538 2499142 2446171 2397075 2352956
59847 2352956 2314034 2280177 2251556 2228515 2210950 2198092 2188801 2181776 2175386 2167627 2156618 2141268
59835 2141268 2121355 2096946 2067980 2034645 1998176 1960998 1925779 1894105 1865922 1840048 1815130
59824 1815130 1790341 1765611 1741591 1719401 1700180 1684715 1673493 1667078 1666255 1671619 1683133 1700381
59812 1700381 1723190 1751658 1785361 1822939 1862924 1904800 1948729 1994140 2038995 2080586 2116739
59801 2116739 2146221 2168602 2184138 2193551 2197591 2197006 2193177 2188329 2184621 2183250 2184896 2190801 2202820
59788 2202820 2222533 2251028 2289602 2340061 2404114 2483121 2578783 2693652 2830617 2992222 3180621
$$ packed form
59867D462051j92584j90869j84935j74824j61630j47100j32368j17797j03966
59858C055978r2011q2701p5600o9614o4255n9998n7261n5396n2971m9096m4119
59847B352956l8922l3857k8621k3041j7565j2858r291p025o390p759j1009j5350
59835B141268j9913k4409k8966l3335l6469l7178l5219l1674k8183k5874k4918
59824A815130k4789k4730k4020k2190j9221j5465j1222o415q23N364J1514J7248
59812A700381K2809K8468L3703L7578L9985M1876M3929M5411M4855M1591L6153
59801B116739K9482K2381J5536R413M040n85l829m848l708j371J646N905J2019
59788B202820J9713K8495L8574N0459O4053P9007R5662J14869J36965J61605J88399
$$ plain form
59777 3180621 3397443 3642735 3913747 4204592 4506244 4805910 5086354 5326899 5506591
59768 5506591 5608394 5623014 5551228 5403704 5198040 4954552 4692950 4430382 4180032 3950212
59758 3950212 3744912 3565684 3413095 3286644 3184251 3102733 3039014 2990769 2956314 2934370
59748 2934370 2924015 2924471 2934920 2954728 2983885 3022910 3072250 3131943 3201917 3282392 3373895 3477078
59736 3477078 3592656 3721502 3864800 4024191 4201665 4399018 4617443 4857964 5122344
59727 5122344 5413156 5732644 6081639 6459674 6865587 7297267 7750677 8219446 8695549
59718 8695549 9170191 9634211 10078487 10494943 10878007 11225773 11540434 11827829 12096207
59709 12096207 12354637 12611712 12874823 13149700 13439855 13745869 14064777 14389939 14711767
$$ packed form
59777C180621K16822K45292K71012K90845L01652K99666K80444K40545J79692
59768E506591J01803J4620p1786j47524k05664k43488k61602k62568k50350k29820
59758C950212k05300j79228j52589j26451j02393q1518o3719m8245l4455k1944
59748B934370j0355M56J0449J9808K9157L9025M9340N9693O9974Q0475R1503J03183
59736C477078J15578J28846J43298J59391J77474J97353K18425K40521K64380
59727E122344K90812L19488L48995L78035M05913M31680M53410M68769M76103
59718H695549M74642M64020M44276M16456L83064L47766L14661K87395K68378
59709A2096207K58430K57075K63111K74877K90155L06014L18908L25162L21828
$$ plain form
59700 14711767 15019303 15301871 15549914 15755048 15910229 16010568 16054310 16043157 15981856 15877534
59690 15877534 15739278 15577857 15405184 15233295 15073315 14935167 14828001 14760464 14740258 14773572
59680 14773572 14865136 15018603 15236642 15520954 15872537 16291608 16776536 17322591 17921624
59671 17921624 18562240 19229168 19902326 20557209 21166547 21701504 22132369 22430801 22574035
59662 22574035 22548461 22350669 21987312 21475237 20840623 20115559 19333702 18527595 17727341
59653 17727341 16958550 16239708 15581101 14985584 14449293 13961572 13505541 13060360 12604530
59644 12604530 12119628 11594234 11026789 10425460 9804926 9182347 8574269 7994401 7452096
59635 7452096 6952225 6496393 6084178 5713567 5381339 5083916 4818070 4580869 4369438
$$ packed form
59700A4711767L07536K82568K48043K05134J55181J00339M3742j1153o1301j04322
59690A5877534j38256j61421j72673j71889j59980j38148j07166o7537k0206L3314
59680A4773572R1564J53467K18039K84312L51583M19071M84928N46055N99033
59671A7921624O40616O66928O73158O54883O09338N34957M30865K98432J43234
59662B2574035k5574j97792l63357n12075o34614p25064p81857q06107q00254
59653A7727341p68791p18842o58607n95517n36291m87721m56031m45181m55830
59644A2604530m84902n25394n67445o01329o20534o22579o08078n79868n42305
59635G452096m99871m55832m12215l70611l32228k97423k65846k37201k11431
$$ plain form
59626 4369438 4181072 4013306 3863741 3730165 3611093 3505877 3413960 3334278 3265530 3206715
59616 3206715 3157049 3115581 3081161 3052582 3028441 3006917 2985901 2963343 2937531 2907257 2871920
59605 2871920 2831349 2785472 2734368 2678686 2619781 2559252 2498391 2438110 2379184 2322517 2269243
59594 2269243 2220472 2176730 2137760 2103125 2072873 2047357 2026646 2010556 1999114 1992384 1989937 1991135
59582 1991135 1995890 2004460 2016379 2030380 2045561 2061920 2079469 2097645 2115966 2134548 2153470 2172308
59570 2172308 2190890 2209875 2229979 2251303 2274193 2300217 2331368 2368542 2411541 2460226 2514872
59559 2514872 2575716 2643172 2718479 2803286 2898425 3003783 3119385 3245824 3383428 3531652
59549 3531652 3689607 3856629 4031921 4213865 4399903 4586965 4772072 4952730 5126591
$$ packed form
59626D369438j88366j67766j49565j33576j19072j05216r1917p9682o8748n8815
59616C206715m9666m1468l4420k8579k4141k1524k1016k2558k5812l0274l5337
59605B871920m0571m5877n1104n5682n8905o0529o0861o0281n8926n6667n3274
59594B269243m8771m3742l8970l4635l0252k5516k0711j6090j1442o730k447J198
59582A991135M755Q570J1919J4001J5181J6359J7549J8176J8321J8582J8922J8838
59570B172308J8582J8985K0104K1324K2890K6024L1151L7174M2999M8685N4646
59559B514872O0844O7456P5307Q4807R5139J05358J15602J26439J37604J48224
59549C531652J57955J67022J75292J81944J86038J87062J85107J80658J73861
$$ plain form
59540 5126591 5290311 5438851 5566518 5669062 5744895 5794782 5820992 5826491 5813953 5785026 5740691
59529 5740691 5682355 5612253 5532915 5446831 5356780 5266080 5178437 5097963 5029234 4976754 4944181
59518 4944181 4934528 4951010 4996844 5073876 5181930 5319673 5485191 5675009 5882968 6100611
59508 6100611 6318341 6525751 6711470 6864017 6973507 7032795 7037558 6986090 6879305 6720667
59498 6720667 6516012 6273438 6002972 5715570 5421730 5130615 4849821 4585310 4341237
59489 4341237 4120047 3922874 3749942 3600797 3474555 3370198 3286644 3222639 3176899 3148567
59479 3148567 3137455 3143609 3166643 3205724 3260290 3330500 3416643 3518235 3633978 3762427 3902098
59468 3902098 4050701 4204759 4360277 4513324 4659493 4793175 4908075 4998603 5060621 5091311
$$ packed form
59540E126591J63720J48540J27667J02544P5833M9887K6210N499j2538k8927m4335
59529E740691n8336p0102p9338q6084r0051r0700q7643q0474o8729n2480l2573
59518D944181r653J6482M5834P7032J08054J37743J65518J89818K07959K17643
59508F100611K17730K07410J85719J52547J09490N9288M763n1468j06785j58638
59498F720667k04655k42574k70466k87402k93840k91115k80794k64511k44073
59489D341237k21190j97173j72932j49145j26242j04357q3554o4005m5740k8332
59479C148567j1112O154K3034L9081N4566P0210Q6143J01592J15743J28449J39671
59468C902098J48603J54058J55518J53047J46169J33682J14900R0528O2018L0690
$$ plain form
59458 5091311 5089008 5053161 4984095 4883134 4753539 4600913 4431566 4250293 4060414 3865821
59448 3865821 3671642 3482371 3300279 3126303 2961562 2807193 2663478 2530300 2408132
59439 2408132 2297590 2198155 2108260 2026658 1952947 1886835 1827740 1775271 1729319 1689424 1654670
59428 1654670 1624489 1599016 1578374 1562157 1549959 1541871 1538032 1538053 1541437 1548249 1558893 1573311 1590714
59415 1590714 1609801 1628606 1644212 1653446 1654659 1648965 1639729 1630803 1625123 1624439 1629782 1641731 1660115
59402 1660115 1683488 1709062 1733447 1753813 1768788 1778653 1785001 1790156 1796658 1806885 1822823 1845868
59390 1845868 1876665 1915160 1961077 2014498 2075978 2145997 2224541 2311517 2407639 2514572 2634069
59379 2634069 2767292 2915307 3080088 3264552 3471554 3703220 3961390 4248232 4565872
$$ packed form
59458E091311k303l5847o9066j00961j29595j52626j69347j81273j89879j94593
59448C865821j94179j89271j82092j73976j64741j54369j43715j33178j22168
59439B408132j10542r9435q9895q1602p3711o6112n9095n2469m5952l9895l4754
59428A654670l0181k5473k0642j6217j2198q088l839K1L384O812J0644J4418J7403
59415A590714J9087J8805J5606R234J213n694r236q926n680o84N343J1949J8384
59402A660115K3373K5574K4385K0366J4975R865O348N155O502J0227J5938K3045
59390A845868L0797L8495M5917N3421O1480P0019P8544Q6976R6122J06933J19497
59379B634069J33223J48015J64781J84464K07002K31666K58170K86842L17640
$$ plain form
59370 4565872 4915305 5295636 5703964 6135445 6583352 7039501 7495095 7941483 8370597
59361 8370597 8775403 9150694 9493838 9804859 10085624 10338612 10565909 10768831 10947910
59352 10947910 11102663 11230858 11327904 11387077 11400590 11360636 11260042 11093157 10857400 10554602
59342 10554602 10190915 9775454 9319128 8834343 8334664 7833482 7342273 6869760 6422192
59333 6422192 6003862 5617406 5264125 4944329 4657386 4401593 4174559 3973960 3797803
59324 3797803 3643964 3509967 3393515 3293023 3207369 3135374 3075850 3027941 2991020 2964250
59314 2964250 2946469 2936410 2932808 2934418 2940256 2949749 2962346 2977084 2992866 3009047 3025264 3040661
59302 3040661 3053726 3063186 3068745 3070790 3069645 3065441 3058610 3050240 3041865 3034976 3030651 3029495 3031790 3037514
$$ packed form
59370D565872L49433L80331M08328M31481M47907M56149M55594M46388M29114
59361H370597M04806L75291L43144L11021K80765K52988K27297K02922J79079
59352A0947910J54753J28195R7046N9173J3513l9954j00594j66885k35757l02798
59342A0554602l63687m15461m56326m84785m99679n01182m91209m72513m47568
59333F422192m18330l86456l53281l19796k86943k55793k27034k00599j76157
59324C797803j53839j33997j16452j00492q5654p1995n9524m7909l6921k6770
59314B964250j7781j0059l602J610N838R493J2597J4738J5782J6181J6217J5397
59302C040661J3065R460N559K045j145m204o831q370q375o889m325j156K295N724
$$ plain form
59288 3037514 3046129 3056594 3067940 3080055 3093958 3111507 3134945 3166447 3207537 3258676 3319454
59277 3319454 3389028 3466161 3548974 3635032 3721696 3806089 3884826 3954345 4011781 4055326 4083817
59266 4083817 4096542 4093738 4076780 4047400 4006855 3956192 3897180 3832523 3765070 3696903 3629131
59255 3629131 3562280 3496829 3433331 3372077 3312763 3254692 3197334 3140456 3083776 3026854 2969501
59244 2969501 2912046 2855050 2799005 2744484 2692285 2643174 2597591 2555816 2518220 2485222 2457198
59233 2457198 2434674 2418444 2409303 2407847 2414687 2430665 2456637 2493335 2541804 2603833 2681582 2776835
59221 2776835 2890864 3024977 3180816 3360083 3564139 3793715 4048510 4326650 4624456
59212 4624456 4936488 5255481 5572181 5875635 6154159 6396413 6592012 6731852 6808716 6818233
$$ packed form
59288C037514Q615J0465J1346J2115J3903J7549K3438L1502M1090N1139O0778
59277C319454O9574P7133Q2813Q6058Q6664Q4393P8737O9519N7436M3545K8491
59266D083817J2725k804j6958k9380m0545n0663n9012o4657o7453o8167o7772
59255C629131o6851o5451o3498o1254n9314n8071n7358n6878n6680n6922n7353
59244B969501n7455n6996n6045n4521n2199m9111m5583m1775l7596l2998k8024
59233B457198k2524j6230r141j456O840J5978K5972L6698M8469O2029P7749R5253
59221B776835J14029J34113J55839J79267K04056K29576K54795K78140K97806
59212D624456L12032L18993L16700L03454K78524K42254J95599J39840P6864R517
$$ plain form
59202 6818233 6759606 6635542 6451575 6215550 5937563 5629610 5304223 4972776 4644760 4328162
59192 4328162 4029536 3753198 3500746 3271972 3066335 2883304 2721579 2578787 2452415
59183 2452415 2340892 2243502 2159308 2086452 2022703 1966648 1918092 1877137 1843054 1814330 1789820
59172 1789820 1769439 1753563 1742061 1734195 1729289 1727189 1728074 1732046 1739008 1748903 1762027 1779008 1800207
59159 1800207 1825137 1852661 1881824 1912316 1944161 1977399 2012184 2048718 2086589 2124413 2160447
59148 2160447 2193457 2222778 2247888 2268369 2284102 2294987 2300574 2300407 2294706 2284279 2269782 2251539
59136 2251539 2230153 2206774 2182592 2158444 2135103 2113443 2093934 2076342 2060502 2047337 2038646
59125 2038646 2035762 2038793 2047310 2061469 2082056 2109577 2143743 2183993 2230165 2282352 2340311 2403402
$$ packed form
59202F818233n8627j24064j83967k36025k77987l07953l25387l31447l28016l16598
59192D328162k98626k76338k52452k28774k05637j83031j61725j42792j26372
59183B452415j11523r7390q4194p2856o3749n6055m8556m0955l4083k8724k4510
59172A789820k0381j5876j1502p866m906k100Q85L972O962R895J3124J6981K1199
59159A800207K4930K7524K9163L0492L1845L3238L4785L6534L7871L7824L6034
59148B160447L3010K9321K5110K0481J5733J0885N587j67n701j0427j4497j8243
59136B251539k1386k3379k4182k4148k3341k1660j9509j7592j5840j3165q691
59125B038646k884L031Q517J4159K0587K7521L4166M0250M6172N2187N7959O3091
$$ plain form
59113 2403402 2471018 2542640 2617380 2693986 2771643 2850482 2930977 3013056 3096192 3180229 3265802
59102 3265802 3353953 3445696 3541889 3643128 3749466 3860325 3974666 4091035 4207244 4320047
59092 4320047 4425293 4518529 4595602 4652836 4686798 4694267 4672801 4621449 4540778 4432345 4298608
59081 4298608 4143470 3972306 3790828 3603896 3415502 3229390 3048940 2876373 2712562
59072 2712562 2557854 2412827 2278218 2154376 2040977 1937218 1842310 1755940 1678174 1608731
59062 1608731 1546475 1489924 1438140 1390788 1347471 1307544 1270687 1237081 1206698 1178830 1152745
59051 1152745 1128521 1106797 1087808 1071080 1056076 1042704 1031096 1021200 1012801 1005722 999725 994360
59039 994360 989245 984547 980885 978659 977697 977742 979070 982291 987636 994786 1003426 1013606 1025379 1038310
$$ packed form
59113B403402O7616P1622P4740P6606P7657P8839Q0495Q2079Q3136Q4037Q5573
59102C265802Q8151R1743R6193J01239J06338J10859J14341J16369J16209J12803
59092D320047J05246R3236P7073N7234L3962P469k1466n1352q0671j08433j33737
59081D298608j55138j71164j81478j86932j88394j86112j80450j72567j63811
59072B712562j54708j45027j34609j23842j13399j03759r4908q6370p7766o9443
59062A608731o2256n6551n1784m7352m3317l9927l6857l3606l0383k7868k6085
59051A152745k4224k1724j8989j6728j5004j3372j1608r896q399p079n997n365
59039I94360n115m698l662k226r62M5J328L221N345P150Q640J0180J1773J2931
$$ plain form
59025 1038310 1051526 1064005 1074690 1082633 1087454 1089633 1090086 1089450 1087925 1085790 1083788 1082913 1083914 1087032
59011 1087032 1092097 1098786 1106811 1115917 1125805 1136050 1146042 1154911 1161636 1165452 1166097 1163511 1157346 1147104
58997 1147104 1132812 1115256 1095480 1074358 1052768 1031801 1012412 995035 979719 966493 955348
58986 955348 946080 938421 932241 927404 923617 920629 918536 917697 918356 920438 923586 927333 931470 936331 942463
58971 942463 949865 957827 965695 973494 981577 989960 998406 1006956 1016052 1026221 1037804 1050774 1064573
58958 1064573 1078370 1091799 1105221 1119031 1132990 1146642 1160128 1174098 1189010 1204892 1221645
58947 1221645 1239119 1257030 1275337 1294731 1316269 1340385 1366537 1393895 1422134 1451624 1483106
58936 1483106 1517228 1554147 1593574 1635307 1679660 1727276 1778763 1834619 1895161 1960222 2029271
$$ packed form
59025A038310J3216J2479J0685P943M821K179M53o36j525k135k002q75J001L118
59011A087032N065O689Q025R106R888J0245R992Q869O725L816O45k586o165j0242
58997A147104j4292j7556j9776k1122k1590k0967j9389j7377j5316j3226j1145
58986I55348r268p659o180m837l787k988k093q39O59K082L148L747M137M861O132
58971I42463P402P962P868P799Q083Q383Q446Q550R096J0169J1583J2970J3799
58958A064573J3797J3429J3422J3810J3959J3652J3486J3970J4912J5882J6753
58947A221645J7474J7911J8307J9394K1538K4116K6152K7358K8239K9490L1482
58936A483106L4122L6919L9427M1733M4353M7616N1487N5856O0542O5061O9049
$$ plain form
58925 2029271 2102287 2180301 2264744 2356404 2455381 2561776 2676057 2799091 2932398 3078081
58915 3078081 3237891 3412363 3601388 3805539 4026369 4265613 4524707 4805016 5107889
58906 5107889 5434314 5784817 6159478 6557364 6975939 7411438 7859687 8315833 8773267
58897 8773267 9223335 9656080 10060555 10424522 10735054 10980571 11152634 11246086 11258256 11188652
58887 11188652 11039509 10816515 10528845 10187973 9805795 9393601 8962444 8523404 8086442
58878 8086442 7658998 7246092 6851322 6477090 6124377 5793452 5484749 5198261 4932382
58869 4932382 4684613 4453475 4238729 4039677 3854523 3681668 3520536 3370766 3231713
58860 3231713 3103169 2985393 2877833 2778823 2687228 2603394 2527718 2459277 2396702 2339576 2288049
$$ packed form
58925B029271P3016P8014Q4443R1660R8977J06395J14281J23034J33307J45683
58915C078081J59810J74472J89025K04151K20830K39244K59094K80309L02873
58906E107889L26425L50503L74661L97886M18575M35499M48249M56146M57434
58897H773267M50068M32745M04475L63967L10532K45517J72063R3452J2170o9604
58887A1188652j49143k22994k87670l40872l82178m12194m31157m39040m36962
58878H086442m27444m12906l94770l74232l52713l30925l08703k86488k65879
58869D932382k47769k31138k14746j99052j85154j72855j61132j49770j39053
58860C231713j28544j17776j07560r9010r1595q3834p5676o8441o2575n7126n1527
$$ plain form
58849 2288049 2241913 2201018 2165847 2136560 2112077 2091320 2074872 2064183 2059338 2058810 2061357 2067027
58837 2067027 2076219 2088852 2104743 2123976 2146524 2172138 2200919 2233517 2270615 2312577 2359638
58826 2359638 2411943 2469406 2532133 2601040 2677447 2761877 2853901 2953441 3061684 3180327 3310385
58815 3310385 3452309 3606990 3775972 3960609 4161550 4379422 4615799 4873023 5152988
58806 5152988 5456419 5783462 6134510 6509872 6908608 7328020 7764026 8211284 8662600
58797 8662600 9108612 9538277 9939454 10299142 10604146 10842537 11004922 11084772 11078552 10986374
58787 10986374 10812519 10564936 10254083 9891861 9490618 9062175 8617429 8166603 7719135
58778 7719135 7282716 6862575 6461826 6082153 5723957 5386540 5068949 4770674 4491378
$$ packed form
58849B288049m6136m0895l5171k9287k4483k0757j6448j0689m845n28K547N670
58837B067027R192J2633J5891J9233K2548K5614K8781L2598L7098M1962M7061
58826B359638N2305N7463O2727O8907P6407Q4430R2024R9540J08243J18643J30058
58815C310385J41924J54681J68982J84637K00941K17872K36377K57224K79965
58806E152988L03431L27043L51048L75362L98736M19412M36006M47258M51316
58797H662600M46012M29665M01177L59688L05004K38391J62385P9850o220r2178
58787A0986374j73855k47583l10853l62222m01243m28443m44746m50826m47468
58778G719135m36419m20141m00749l79673l58196l37417l17591k98275k79296
$$ plain form
58769 4491378 4230459 3987366 3761943 3553928 3362386 3186169 3024626 2877194 2742454
58760 2742454 2618305 2503065 2395923 2296339 2203588 2117047 2036529 1962140 1894023 1832228 1776559
58749 1776559 1726496 1681418 1640816 1604165 1570777 1540051 1511812 1486123 1462887 1441781 1422417
58738 1422417 1404308 1386816 1369364 1351678 1333740 1315669 1297705 1280079 1262752 1245473 1228139
58727 1228139 1210776 1193213 1175233 1157107 1139343 1121697 1103077 1082769 1061185 1039034 1016453
58716 1016453 993495 970796 948946 927616 906043 884121 862402 841355 821372 803261 787911
58705 787911 775382 764868 755501 746737 738150 729501 721059 713317 706253 699117 690982 681329 670335
58692 670335 658791 647572 636960 626699 616754 607540 599218 591468 584315 578480 574378 571478 569282
$$ packed form
58769D491378k60919k43093k25423k08015j91542j76217j61543j47432j34740
58760B742454j24149j15240j07142r9584r2751q6541q0518p4389o8117o1795n5669
58749A776559n0063m5078m0602l6651l3388l0726k8239k5689k3236k1106j9364
58738A422417j8109j7492j7452j7686j7938j8071j7964j7626j7327j7279j7334
58727A228139j7363j7563j7980j8126j7764j7646j8620k0308k1584k2151k2581
58716A016453k2958k2699k1850k1330k1573k1922k1719k1047j9983j8111j5350
58705G87911j2529j0514r367q764q587q649q442p742p064p136q135r653j0994
58692F70335j1544j1219j0612j0261r945r214q322p750p153n835m102k900k196
$$ plain form
58679 569282 568265 569016 571115 573784 577140 581727 587288 593150 599650 608012 618775 631240 644359 657276
58665 657276 669087 679112 687466 694392 699009 699654 695554 687317 675768 661476 645600 630032 616099
58652 616099 603830 592880 583440 575851 570063 565961 563668 563157 564001 565813 568465 571711 575219 579223
58638 579223 584523 591488 599508 607698 615704 623669 631972 641250 652116 664575 678143 692723 708885
58625 708885 727140 747524 770086 795178 822968 853254 886073 921998 961507 1004648 1051710
58614 1051710 1103746 1161967 1226894 1298481 1376824 1462408 1555870 1657693 1767818 1885365 2008892
58603 2008892 2137007 2268314 2400610 2530415 2653403 2765003 2860589 2935717 2986700 3011095
58593 3011095 3007833 2977338 2921640 2844123 2748997 2640920 2524604 2404101 2282402 2161992
$$ packed form
58679E69282j017P51K099K669L356M587N561N862O500Q362J0763J2465J3119J2917
58665F57276J1811J0025Q354O926M617O45m100q237j1549j4292j5876j5568j3933
58652F16099j2269j0950r440p589n788m102k293n11Q44J812K652L246L508M004
58638E79223N300O965Q020Q190Q006P965Q303R278J0866J2459J3568J4580J6162
58625G08885J8255K0384K2562K5092K7790L0286L2819L5925L9509M3141M7062
58614A051710N2036N8221O4927P1587P8343Q5584R3462J01823J10125J17547J23527
58603B008892J28115J31307J32296J29805J22988J11600R5586P5128N0983K4395
58593C011095l262l0495n5698p7517r5126j08077j16316j20503j21699j20410
$$ plain form
58583 2161992 2045487 1935205 1832395 1737550 1651260 1574007 1505240 1443581 1388165 1339080 1296350
58572 1296350 1259155 1226263 1196649 1169586 1144708 1122123 1101993 1083934 1067306 1051864 1037474
58561 1037474 1023448 1009128 995009 982128 970173 957378 942695 927000 911719 897182 882970
58550 882970 868916 854935 840470 824891 808190 790830 773298 756082 739592 723800 708466
58539 708466 694025 681602 671769 663823 656585 649403 642169 635142 629112 624952 622452 620229 617272 613982
58525 613982 611223 609004 606645 603624 599627 594299 587623 580236 572849 565666 558708 552234 546393 540916
58511 540916 535635 530883 526995 523789 520977 518667 517111 516295 516068 516244 516414 516188 515899 516449 518159 520400
58495 520400 522621 524982 527599 530032 532099 534468 537770 541716 545662 549445 553055 556129 558482 560577
$$ packed form
58583B161992j16505j10282j02810r4845q6290p7253o8767o1659n5416m9085m2730
58572A296350l7195l2892k9614k7063k4878k2585k0130j8059j6628j5442j4390
58561A037474j4026j4320j4119j2881j1955j2795j4683j5695j5281j4537j4212
58550H82970j4054j3981j4465j5579j6701j7360j7532j7216j6490j5792j5334
58539G08466j4441j2423r833p946p238p182p234p027o030m160k500k223k957l290
58525F13982k759k219k359l021l997n328o676p387p387p183o958o474n841n477
58511E40916n281m752l888l206k812k310j556q16k27J76J70k26k89N50J710K241
58495E20400K221K361K617K433K067K369L302L946L946L783L610L074K353K095
$$ plain form
58481 560577 562747 564390 564614 563254 560698 557145 552711 547786 542658 537176 531392 526176 522547 520747
58467 520747 520509 521769 524553 528538 533339 538833 544652 549780 553314 555252 555946 555230 552743 548770 544052
58452 544052 539042 533974 529394 525956 523809 522672 522339 522707 523597 525025 527431 531205 536212 542087 548710
58437 548710 556064 563931 572041 580186 588002 595043 601163 606315 609858 610854 609311 606332 602699 598196
58423 598196 592763 587374 583116 580146 578199 577357 577708 579015 581375 585409 591142 597598 604276 612138 622219
58408 622219 634072 646513 659107 671846 684113 695147 704988 713798 720711 724477 724940 722913 719049
58395 719049 713750 707739 701637 695298 688551 682193 677203 673322 669499 665537 662331 660608 660291 660923 661939
58380 661939 662760 663353 664414 666413 668866 671185 673610 676559 679793 683192 687590 693658 700535 706829 712575
$$ packed form
58481E60577K170J643K24j360k556l553m434m925n128n482n784n216l629j800
58467E20747k38J260K784L985M801N494N819N128L534J938O94p16k487l973m718
58452E44052n010n068m580l438k147j137l33L68Q90J428K406L774N007N875O623
58437E48710P354P867Q110Q145P816P041O120N152L543R96j543k979l633m503
58423E98196n433n389m258k970j947q42L51J307K360M034N733O456O678P862J0081
58408F22219J1853J2441J2594J2739J2267J1034R841Q810O913L766M63k027l864
58395G19049n299o011o102o339o747o358m990l881l823l962l206j723l17O32J016
58380F61939Q21N93J061J999K453K319K425K949L234L399M398O068O877O294N746
$$ plain form
58365 712575 718965 726473 734502 742668 751204 760155 769221 778375 787752 797032 805821 814436 823540 833204
58351 833204 843112 853292 863816 874129 883460 891492 897956 902272 904482 905801 907188 908139 908039 907851
58337 907851 909015 911300 913351 914918 917014 920186 924229 929417 936439 945092 954397 964065 974695 986594
58323 986594 999564 1013682 1029159 1045586 1062443 1080075 1098964 1118367 1136926 1154383 1171437
58312 1171437 1188241 1204284 1219402 1233505 1245620 1254719 1261408 1267499 1274056 1281059 1288594 1297002 1306142
58299 1306142 1315917 1327179 1340695 1355606 1370472 1385465 1401865 1419712 1437743 1455537 1473993
58288 1473993 1493678 1514315 1535932 1558981 1583307 1608383 1634546 1662673 1692847 1724659 1758490
58277 1758490 1795000 1833744 1873822 1915484 1959478 2005235 2051258 2096800 2141496 2184120 2223683
$$ packed form
58365G12575O390P508Q029Q166Q536Q951R066R154R377R280Q789Q615R104R664
58351H33204R908J0180J0524J0313R331Q032O464M316K210J319J387R51j00j88
58337I07851J164K285K051J567K096L172M043N188P022Q653R305R668J0630J1899
58323I86594J2970J4118J5477J6427J6857J7632J8889J9403J8559J7457J7054
58312A171437J6804J6043J5118J4103J2115R099O689O091O557P003P535Q408R140
58299A306142R775J1262J3516J4911J4866J4993J6400J7847J8031J7794J8456
58288A473993J9685K0637K1617K3049K4326K5076K6163K8127L0174L1812L3831
58277A758490L6510L8744M0078M1662M3994M5757M6023M5542M4696M2624L9563
$$ plain form
58266 2223683 2261242 2298614 2335953 2372667 2410017 2450296 2493802 2539020 2585581 2634682 2686890
58255 2686890 2741900 2800248 2862905 2929390 2998563 3070900 3147654 3228356 3311721 3398421 3490175
58244 3490175 3586672 3686423 3790182 3900345 4017369 4140069 4269151 4407044 4554355 4709862
58234 4709862 4873903 5048379 5233677 5429205 5636753 5859597 6098491 6352471 6623313
58225 6623313 6915027 7229119 7564811 7923844 8310426 8726566 9172494 9651904 10171715
58216 10171715 10736503 11348743 12015093 12746898 13553938 14443592 15427177 16521533 17743940
58207 17743940 19112079 20650431 22391428 24371071 26631942 29233185 32253320 35787374
58199 35787374 39955272 44920710 50901676 58171494 67066587 77995003 91420156 107819488
$$ packed form
58266B223683L7559L7372L7339L6714L7350M0279M3506M5218M6561M9101N2208
58255B686890N5010N8348O2657O6485O9173P2337P6754Q0702Q3365Q6700R1754
58244C490175R6497R9751J03759J10163J17024J22700J29082J37893J47311J55507
58234D709862J64041J74476J85298J95528K07548K22844K38894K53980K70842
58225F623313K91714L14092L35692L59033L86582M16140M45928M79410N19811
58216A0171715N64788O12240O66350P31805Q07040Q89654R83585J094356J222407
58207A7743940J368139J538352J740997J979643K260871K601243L020135L534054
58199C5787374M167898M965438N980966P269818Q895093J0928416J3425153J6399332
$$ plain form
58191 107819488 127637724 151222526 178709425 209864771 243916768 279353909 313698693
58184 313698693 343478550 364749782 374224398 370468633 354427674 328987389 297944361
58177 297944361 264987120 233044793 204041452 178946392 157965957 140733353 126463661
58170 126463661 114162347 102927930 92217862 81907372 72142079 63142458 55083021
58163 55083021 48046836 42018351 36907518 32595098 28964585 25906089 23315412 21104022
58155 21104022 19204920 17564564 16136008 14882701 13780049 12807278 11942185 11165918
58147 11165918 10466219 9832346 9251943 8715578 8219148 7759091 7329922 6928759 6557312
58138 6557312 6216527 5903246 5614192 5349007 5106962 4884585 4678948 4489754 4315777
$$ packed form
58191A07819488J9818236K3584802K7486899L1155346L4051997L5437141L4344784
58184C13698693K9779857K1271232R474616l755765j6040959k5440285l1043028
58177B97944361l2957241l1942327k9003341k5095060k0980435j7232604j4269692
58170A26463661j2301314j1234417j0710068j0310490r765293q999621q059437
58163E5083021p036185o028485n110833m312420l630513l058496k590677k211390
58155B1104022j899102j640356j428556j253307j102652r72771q65093p76267
58147A1165918o99699o33873n80403n36365m96430m60057m29169m01163l71447
58138F557312l40785l13281k89054k65185k42045k22377k05637j89194j73977
$$ plain form
58129 4315777 4152386 3994790 3841071 3690409 3541427 3394263 3251668 3116193 2988326
58120 2988326 2868353 2757331 2654857 2558515 2466925 2381013 2301137 2225530 2152929 2084331 2020637
58109 2020637 1960679 1902910 1847197 1793828 1742589 1693737 1647998 1604780 1562326 1520383 1480710
58098 1480710 1444273 1410091 1377577 1347751 1321106 1296418 1272627 1249904 1227948 1205340 1181644
58087 1181644 1158123 1135342 1112129 1087947 1064185 1041761 1019422 995842 971692 948181 925120
58076 925120 901919 879141 857674 837507 818506 801250 786007 771997 758672 746596 736154
58065 736154 726556 717077 708198 700584 693967 687844 682209 676825 670869 664073 657156 650416 643035 634538
58051 634538 625738 617491 609642 602056 595501 590529 586424 582144 577517 572870 568416 564654 562410 561749
$$ packed form
58129D315777j63391j57596j53719j50662j48982j47164j42595j35475j27867
58120B988326j19973j11022j02474r6342r1590q5912p9876p5607p2601o8598o3694
58109B020637n9958n7769n5713n3369n1239m8852m5739m3218m2454m1943l9673
58098A480710l6437l4182l2514k9826k6645k4688k3791k2723k1956k2608k3696
58087A181644k3521k2781k3213k4182k3762k2424k2339k3580k4150k3511k3061
58076I25120k3201k2778k1467k0167j9001j7256j5243j4010j3325j2076j0442
58065G36154r598r479q879p614o617o123n635n384n956o796o917o740p381q497
58051F34538q800q247p849p586o555m972m105m280m627m647m454l762k244o61
$$ plain form
58037 561749 561677 561427 561154 560999 560580 559957 559839 560208 559838 557853 554655 550754 545905 540138 534366 529089 523586
58020 523586 517341 511236 506373 502543 498744 494458 489671 484396 478888 473627 468591 463304 457957 453439
58006 453439 449901 446474 442946 440361 439263 438660 437630 436691 436599 436993 437340 438100 439706 441332 441913 441680
57990 441680 441528 441542 441252 440748 440482 440411 440240 440025 439789 439164 438128 437423 437450 437446 436602 435207 433852 432283 430141
57971 430141 428217 427800 429095 431177 433133 434509 435031 434707 433847 432375 429540 424934 419223 413292 407290
57956 407290 401188 395574 391043 387362 383995 381027 378906 377795 377807 379233 381900 384958 387939 391278 395147
57941 395147 398649 401039 402841 404720 406037 405692 403790 401321 398615 395251 391057 386139 380240 373138
57927 373138 365506 358433 352193 346172 339764 332749 325196 317719 311356 306585 302888 299825 297775 296928
$$ packed form
58037E61749p2k50k73j55m19o23j18L69l70j985l198l901m849n767n772n277n503
58020E23586o245o105m863l830l799m286m787n275n508n261n036n287n347m518
58006D53439l538l427l528k585j098o03j030r39r2L94L47P60J606J626N81k33
57990D41680j52J4k90n04k66p1j71k15k36o25j036p05K7mq44j395j355j569k142
57971D30141j924m17J295K082J956J376N22l24q60j472k835m606n711n931o002
57956D07290o102n614m531l681l367k968k121j111J2J426K667L058K981L339L869
57941C95147L502K390J802J879J317l45j902k469k706l364m194m918n899p102
57927C73138p632p073o240o021o408p015p553p477o363m771l697l063k050q47
$$ plain form
57913 296928 296466 295741 295479 296748 299473 303144 308220 315415 324176 333274 342489 352249 361952 370156 376277
57898 376277 380689 383269 383325 380976 377206 372448 366432 359587 353204 347905 343067 338028 332758 327116 320738
57883 320738 314059 308316 304029 300390 296620 293012 290150 288029 286569 286283 287772 290977 295365 300546
57869 300546 306439 313192 320998 329565 337828 344774 350498 355789 360822 365061 368372 371142 373175 373553
57855 373553 371947 369109 365658 361292 355738 349655 343883 338442 332878 327093 321248 315323 309355 303783
57841 303783 299091 295416 292861 291779 292279 293711 295098 295908 296181 296100 295676 294651 292547 289047 284368 278949
57825 278949 272842 265852 258340 251216 244904 238912 232752 226736 221440 216896 212956 210114 209357 211255
57811 211255 215548 221513 228294 234885 240138 243016 242934 240034 235276 230068 225572 222288 220277 219585 220337
$$ packed form
57913B96928m62p25k62J269K725L671N076P195Q761R098R215R760R703Q204O121
57898C76277M412K580N6k349l770m758o016o845o383n299m838n039n270n642o378
57883C20738o679n743m287l639l770l608k862k121j460k86J489L205M388N181
57869C00546N893O753P806Q567Q263O946N724N291N033M239L311K770K033L78
57855C73553j606k838l451m366n554o083n772n441n564n785n845n925n968n572
57841C03783m692l675k555j082N00J432J387Q10K73q1m24j025k104l500m679n419
57825B78949o107o990p512p124o312n992o160o016n296m544l940k842p57J898
57811B11255M293N965O781O591N253K878q2k900m758n208m496l284k011o92P52
$$ plain form
57796 220337 222500 225729 229529 233699 238636 245030 253109 262290 271665 280599 288666 295366 300307 303504
57782 303504 305107 304957 302758 298545 292608 285148 276432 267099 257843 248853 240059 231791 224663 218867
57768 218867 214089 210096 206849 204102 201530 199324 198080 197959 198493 199295 200357 201507 202215 202273 202246 202898
57752 202898 204427 206456 208471 210163 211702 213779 217048 221386 225984 230186 233924 237393 240797 244407
57738 244407 248319 252013 254711 256301 257431 258578 259577 260288 261105 262508 264563 267193 270455 274200 277870
57723 277870 281044 283938 287050 290608 294592 298955 303472 307670 311291 314696 318593 323422 329154 335498
57709 335498 342206 349327 357204 366057 375604 385475 395952 407857 421653 437047 453491 470615 488126
57696 488126 505914 524517 545015 568211 594277 623414 656351 693858 736273 783865 837339
$$ packed form
57796B20337K163L229L800M170M937O394Q079R181R375Q934Q067O700M941L197
57782C03504J603j50k199m213n937p460q716r333r256q990q794q268p128n796
57768B18867m778l993l247k747k572k206j244j21N34Q02J062J150P08N8k7O52
57752B02898J529K029K015J692J539K077L269M338M598M202L738L469L404L610
57738B44407L912L694K698J590J130J147R99P11Q17J403K055K630L262L745L670
57723B77870L174K894L112L558L984M363M517M198L621L405L897M829N732O344
57709C35498O708P121P877Q853R547R871J0477J1905J3796J5394J6444J7124J7511
57696D88126J7788J8603K0498K3196K6066K9137L2937L7507M2415M7592N3474
$$ plain form
57685 837339 897641 965549 1041757 1127104 1222402 1328224 1444966 1572878 1711805 1861098
57675 1861098 2019700 2185856 2356647 2528261 2696810 2858392 3008249 3140402 3248103
57666 3248103 3323829 3358831 3344389 3275560 3154540 2990617 2797246 2588829 2378392 2176016
57656 2176016 1988323 1819129 1670065 1540485 1427882 1329704 1244868 1173006 1112657 1061148
57646 1061148 1016295 977421 944622 917619 895560 877502 862964 852200 845798 843689 844808 848245
57634 848245 854380 864180 877625 893796 912646 935615 964014 997558 1035191 1076838 1123658 1176882
57622 1176882 1237157 1304948 1380807 1465020 1557371 1657404 1764452 1877035 1992417 2106913
57612 2106913 2216384 2316171 2401061 2466192 2508334 2526036 2518627 2485810 2428663 2350393 2255448
$$ packed form
57685H37339O0302O7908P6208Q5347R5298J05822J16742J27912J38927J49293
57675A861098J58602J66156J70791J71614J68549J61582J49857J32153J07701
57666C248103P5726L5002j4442o8829j21020j63923j93371k08417k10437k02376
57656B176016j87693j69194j49064j29580j12603r8178q4836p1862o0349n1509
57646A061148m4853l8874l2799k7003k2059j8058j4538j0764o402k109J119L437
57634H48245O135R800J3445J6171J8850K2969K8399L3544L7633M1647M6820N3224
57622A176882O0275O7791P5859Q4213R2351J00033J07048J12583J15382J14496
57612B106913J09471R9787Q4890O5131M2142J7702p409l2817n7147p8270r4945
$$ plain form
57601 2255448 2148076 2032332 1912883 1794497 1680249 1570963 1466781 1368687 1278021 1195106
57591 1195106 1119128 1049223 985202 927264 875384 829051 787397 749581 715118 683767 655176
57580 655176 628986 605326 584743 567343 552283 538362 524863 511666 498900 486813 475730
57569 475730 465894 457408 450325 444432 438983 433261 427628 423315 420802 419028 416731 414018 411947 411069
57555 411069 411161 412076 414049 417215 421431 426477 431971 437387 442844 449581 458812 470174 482160 494125
57541 494125 507012 521962 539068 557875 578391 601066 626232 654092 685002 719330 757166
57530 757166 798428 843215 892006 945677 1005290 1071520 1144195 1222606 1306261 1394828 1487143
57519 1487143 1580588 1671636 1756683 1832159 1894346 1939682 1965517 1970533 1954670 1918964 1865493
$$ packed form
57601B255448j07372j15744j19449j18386j14248j09286j04182r8094r0666q2915
57591A195106p5978o9905o4021n7938n1880m6333m1654l7816l4463l1351k8591
57580F55176k6190k3660k0583j7400j5060j3921j3499j3197j2766j2087j1083
57569D75730r836q486p083n893n449n722n633m313k513j774k297k713k071q78
57555D11069R2R15J973L166M216N046N494N416N457O737R231J1362J1986J1965
57541D94125J2887J4950J7106J8807K0516K2675K5166K7860L0910L4328L7836
57530G57166M1262M4787M8791N3671N9613O6230P2675P8411Q3655Q8567R2315
57519A487143R3445R1048Q5047P5476O2187M5336K5835N016j5863l5706n3471
$$ plain form
57508 1865493 1797324 1718169 1631762 1541283 1449376 1358646 1271755 1190720 1116306 1048477 987238
57497 987238 932596 883831 839494 798443 760583 726480 696631 671236 650358 633889 621435
57486 621435 612369 605953 601498 598674 597678 598875 602234 607371 614188 623153 634889 649734 667810 689233
57472 689233 714126 742621 774983 811580 852747 898856 950441 1007928 1071267 1140215 1214885
57461 1214885 1295429 1380918 1468955 1556583 1641078 1719523 1788075 1842393 1878851 1895202 1890419
57450 1890419 1864524 1818786 1755786 1679051 1592433 1499570 1403600 1307247 1213009 1123011 1038619
57439 1038619 960392 888506 822985 763482 709300 659913 615242 575132 538906 505891 476179
57428 476179 450269 427920 407843 388748 370336 353149 337759 324430 313201 303763 295265 286728
$$ packed form
57508A865493o8169p9155q6407r0479r1907r0730q6891q1035p4414o7829o1239
57497I87238n4642m8765m4337m1051l7860l4103k9849k5395k0878j6469j2454
57486F21435r066o416m455k824r96J197L359N137O817Q965J1736J4845J8076K1423
57472F89233K4893K8495L2362L6597M1167M6109N1585N7487O3339O8948P4670
57461A214885Q0544Q5489Q8037Q7628Q4495P8445O8552N4318L6458J6351m783
57450A890419k5895m5738o3000p6735q6618r2863r5970r6353r4238q9998q4392
57439A038619p8227p1886o5521n9503n4182m9387m4671m0110l6226l3015k9712
57428D76179k5910k2349k0077j9095j8412j7187j5390j3329j1229r438q498q537
$$ plain form
57416 286728 277959 269755 262935 257343 252209 247306 243159 239897 236572 232168 226938 222071 218148 214667
57402 214667 211216 208307 206521 205359 203587 200679 197377 194785 193242 192180 190851 189092 187455 186644
57388 186644 186791 187335 187612 187403 186825 185931 184761 183622 182949 182780 182621 181993 180931 179856 179042 178384 177622
57371 177622 176654 175591 174592 173691 172772 171697 170488 169348 168502 167971 167574 167211 167076 167517 168650 170190 171696
57354 171696 172863 173610 174071 174642 175806 177654 179617 180929 181377 181446 181732 182432 183373 184288 184911 184997 184494 183686
57336 183686 183073 183053 183623 184317 184498 183915 182974 182377 182524 183396 184884 186933 189333 191732 193998 196354 198980
57319 198980 201704 204306 206990 210286 214482 219329 224310 229074 233646 238313 243347 248776 254436 260298
57305 260298 266643 273802 281653 289492 296581 302932 309522 317608 327761 339582 352290 365399 378759
$$ packed form
57416B86728q769q204o820n592n134m903m147l262l325m404n230m867l923l481
57402B14667l451k909j786j162j772k908l302k592j543j062j329j759j637q11
57388A86644J47N44K77k09n78q94j170j139o73j69j59o28j062j075q14o58p62
57371A77622r68j063r99r01r19j075j209j140q46n31l97l63j35M41J133J540J506
57354A71696J167P47M61N71J164J848J963J312M48O9K86P00R41R15O23Q6n03q08
57336A83686o13k0N70O94J81n83r41n97J47Q72J488K049K400K399K266K356K626
57319A98980K724K602K684L296M196M847M981M764M572M667N034N429N660N862
57305B60298O345P159P851P839P089O351O590Q086J0153J1821J2708J3109J3360
$$ plain form
57292 378759 392227 405667 419254 433548 449092 465937 483474 500692 516690 531042 543643
57281 543643 554163 561900 566256 567113 564497 558187 548020 534369 517847 498732 477239 454308 431497
57268 431497 409881 389545 370312 352453 336392 322183 309703 298998 290081 282618 276148 270454
57256 270454 265445 260901 256614 252640 249134 246145 243778 242267 241554 240991 239872 238128 236176 234247 232291
57241 232291 230429 229044 228354 228246 228603 229469 230824 232371 233698 234586 235258 236466 239099 243357 248307 252553
57225 252553 255361 256939 257800 258316 258864 259902 261613 263737 265939 268098 270154 271994 273759 275968 278974
57210 278974 282476 285896 289202 293016 297819 303322 308774 313726 318399 323393 329160 335769 343005 350566
57196 350566 358128 365392 372297 379258 386928 395503 404370 412708 420434 428209 436463 444852 452944 461036
$$ packed form
57292C78759J3468J3440J3587J4294J5544J6845J7537J7218J5998J4352J2601
57281E43643J0520P737M356Q57k616o310j0167j3651j6522j9115k1493k2931k2811
57268D31497k1616k0336j9233j7859j6061j4209j2480j0705q917p463o470n694
57256B70454n009m544m287l974l506k989k367j511p13n63j119j744j952j929j956
57241B32291j862j385o90j08L57Q66J355J547J327Q88O72J208K633M258M950M246
57225B52553K808J578Q61N16N48J038J711K124K202K159K056J840J765K209L006
57210B78974L502L420L306L814M803N503N452M952M673M994N767O609P236P561
57196C50566P562P264O905O961P670Q575Q867Q338P726P775Q254Q389Q092Q092
$$ plain form
57182 461036 469772 479125 488437 497497 506966 517478 528878 540714 553000 565985 579601 593752
57170 593752 608858 625338 642646 659556 675533 691217 707404 724204 741399 759038 777277
57159 777277 796046 815305 835359 856550 878848 901948 925563 949492 973696 998463 1024168
57148 1024168 1050764 1077962 1106003 1135599 1166806 1198641 1230334 1262365 1295574 1329799 1364248
57137 1364248 1398857 1434372 1471221 1509228 1548499 1589738 1633442 1679428 1727373 1777323 1829468
57126 1829468 1883890 1940694 1999978 2061541 2125127 2191042 2260042 2332441 2407892 2486342 2568854
57115 2568854 2657240 2753294 2858606 2974660 3102724 3243805 3399039 3570110 3759401 3970198
57105 3970198 4206959 4475108 4780639 5130490 5533736 6002342 6551033 7197428 7963014
$$ packed form
57182D61036Q736R353R312R060R469J0512J1400J1836J2286J2985J3616J4151
57170E93752J5106J6480J7308J6910J5977J5684J6187J6800J7195J7639J8239
57159G77277J8769J9259K0054K1191K2298K3100K3615K3929K4204K4767K5705
57148A024168K6596K7198K8041K9596L1207L1835L1693L2031L3209L4225L4449
57137A364248L4609L5515L6849L8007L9271M1239M3704M5986M7945M9950N2145
57126A829468N4422N6804N9284O1563O3586O5915O9000P2399P5451P8450Q2512
57115B568854Q8386R6054J05312J16054J28064J41081J55234J71071J89291K10797
57105C970198K36761K68149L05531L49851M03246M68606N48691O46395P65586
$$ plain form
57096 7963014 8873997 9961079 11258493 12802478 14628493 16767157 19240322 22058010
57088 22058010 25215854 28693623 32456746 36460674 40654952 44985336 49395396 53826039
57080 53826039 58205509 62426719 66325204 69680649 72251617 73827728 74272328 73540595
57072 73540595 71676347 68797671 65077492 60721370 55945356 50957388 45943857 41060865
57064 41060865 36429352 32133814 28224457 24722253 21625758 18917919 16571211 14551202
57056 14551202 12819917 11339700 10076174 8998728 8079401 7292473 6615600 6030814 5523859
57047 5523859 5082704 4696877 4357704 4058218 3792498 3555349 3342660 3151481 2979339
57038 2979339 2823591 2681690 2551814 2432869 2323952 2224012 2131980 2046992 1968424 1895891
$$ packed form
57096G963014R10983J087082J297414J543985J826015K138664K473165K817688
57088B2058010L157844L477769L763123M003928M194278M330384M410060M430643
57080E3826039M379470M221210L898485L355445K570968J576111M44600p31733
57072G3540595j864248k878676l720179m356122m776014m987968n013531m882992
57064D1060865m631513m295538l909357l502204l096495k707839k346708k020009
57056A4551202j731285j480217j263526j077446r19327p86928o76873n84786n06955
57047E523859m41155l85827l39173k99486k65720k37149k12689j91179j72142
57038B979339j55748j41901j29876j18945j08917r9940r2032q4988p8568p2533
$$ plain form
57028 1895891 1829304 1768985 1715768 1670912 1635704 1611154 1598279 1598666 1614392 1647279 1698316 1767144
57016 1767144 1850245 1938023 2014026 2059232 2059551 2011282 1921217 1802740 1670987 1538933 1415152
57005 1415152 1303768 1206057 1121978 1050613 990284 939125 895542 857923 824441 793747 765663
56994 765663 740582 718263 697731 678266 659846 642526 626102 610706 597201 586470 578545 572795
56982 572795 568648 565488 561939 555934 545943 531988 515270 497083 478451 460651 445418 434063
56970 434063 426469 421349 417598 415146 414487 415923 419682 426349 436439 449583 464805 481841 501459
56957 501459 523946 547612 569259 585938 595888 598218 592581 579469 560439 537728 513670 490290
56945 490290 468976 450358 434693 422346 413657 408360 405637 404925 406410 410684 418376 430262 447201
$$ packed form
57028A895891o6587o0319n3217m4856l5208k4550j2875L87J5726L2887N1037O8828
57016A767144Q3101Q7778P6003M5206L19m8269r0065j18477j31753j32054j23781
57005A415152j11384r7711q4079p1365o0329n1159m3583l7619l3482l0694k8084
56994G65663k5081k2319k0532j9465j8420j7320j6424j5396j3505j0731p925n750
56982E72795m147l160l549o005r991j3955j6718j8187j8632j7800j5233j1355
56970D34063p594n120l751k452o59J436L759O667J0090J3144J5222J7036J9618
56957E01459K2487K3666K1647J6679R950K330n637j3112j9030k2711k4058k3380
56945D90290k1314j8618j5665j2347q689n297k723p12J485M274P692J1886J6939
$$ plain form
56932 447201 469361 495559 523575 550874 574757 592123 599857 595936 580351 555210 524020 490479
56920 490479 457346 426138 397706 372773 351779 334525 320392 308770 299028 290409 282483 275612
56908 275612 270417 266764 263745 260736 257992 256011 254755 253783 252807 251879 251276 251454 252892 255684 259442
56893 259442 263845 269158 276000 284688 295040 306725 319560 333464 348196 363037 376551 386822
56881 386822 392235 392220 387279 378523 367344 355291 343723 333350 324320 316969 312251 311127 313577 318646
56867 318646 325667 335172 348341 365795 387408 413181 443604 478702 516976 555505 590682 618561
56855 618561 635234 638114 627386 605917 577599 545918 513744 483457 456723 434480 417449 406331
56843 406331 401298 401882 407889 420146 439856 467406 502290 544025 592492 647231 706574 767261
$$ packed form
56932D47201K2160K6198K8016K7299K3883J7366P734l921j5585k5141l1190l3541
56920D90479l3133l1208k8432k4933k0994j7254j4133j1622r742q619p926o871
56908B75612n195l653l019l009k744j981j256r72r76r28o03J78J438K792L758
56893B59442M403N313O842Q688J0352J1685J2835J3904J4732J4841J3514J0271
56881C86822N413j5m941q756j1179j2053j1568j0373r030p351m718j124K450N069
56867C18646P021R505J3169J7454K1613K5773L0423L5098L8274L8529L5177K7879
56855F18561J6673K880j0728k1469k8318l1681l2174l0287k6734k2243j7031j1118
56843D06331n033N84O007J2257J9710K7550L4884M1735M8467N4739N9343O0687
$$ plain form
56831 767261 824213 870691 899666 906265 889710 853339 802973 744990 685024 627379 574924 529235
56819 529235 490877 459804 435852 419124 409998 408802 415452 429404 449995 476929 510365 550329
56807 550329 595746 643830 690126 729093 755142 764102 754586 728331 689324 642473 592555 543483
56795 543483 497850 457027 421736 392410 368976 350748 336934 327211 321715 320724 324594 333755 348352
56782 348352 367827 390904 415720 439718 459763 472935 477406 472543 458625 436985 410204 381355
56770 381355 352714 325442 300428 278768 261104 246973 235314 225416 217097 210176 204258 199037
56758 199037 194428 190284 186303 182425 179162 177243 176830 177202 177267 176342 174486 172304 170611 170055 170634 171536
56742 171536 171818 171346 170799 170654 170590 170107 169313 168669 168278 167867 167271 166434 165140 163301 161439 160273 159791 159271
$$ packed form
56831G67261N6952M6478K8975O599j6555l6371n0366n7983n9966n7645n2455m5689
56819E29235l8358l1073k3952j6728r126j196O650J3952K0591K6934L3436L9964
56807E50329M5417M8084M6296L8967K6049Q960r516k6255l9007m6851m9918m9072
56795E43483m5633m0823l5291k9326k3434j8228j3814r723n496r91L870R161J4597
56782C48352J9475K3077K4816K3998K0045J3172M471m863j3918k1640k6781k8849
56770C81355k8641k7272k5014k1660j7664j4131j1659r898q319o921n918n221
56758A99037m609m144l981l878l263j919m13L72O5r25j856k182j693n56N79R02
56742A71536K82m72n47j45o4m83p94o44l91m11n96q37j294j839j862j166m82n20
$$ plain form
56724 159271 158334 157461 157219 157427 157389 156679 155472 154388 154140 154993 156389 157357 157478 157154 156807 156277 155324 154280
56706 154280 153679 153473 153081 152163 150908 149562 148092 146451 144897 143841 143406 143239 142815 141949 141032 140638 140917
56689 140917 141568 142400 143636 145446 147417 148785 149141 148712 148041 147614 147736 148466 149573 150675 151533 152176 152812
56672 152812 153652 154756 155925 156834 157324 157507 157521 157347 157072 157172 158250 160370 162797 164464 164708 163662 162093
56655 162093 160833 160202 159872 159347 158543 157862 157677 157883 157989 157558 156498 154977 153215 151388 149646 148106
56639 148106 146838 145917 145464 145481 145651 145509 144891 144104 143599 143664 144416 145767 147157 147699 147021 145769 144911 144701
56621 144701 144748 144817 144991 145066 144562 143492 142481 141875 141337 140699 140558 141406 142615 142996 142239 141188 140690 140709 140680
56602 140680 140317 139832 139553 139564 139758 140190 141163 142716 144182 144744 144511 144515 145339 146329 146675 146738 147567 149352 151182
$$ packed form
56724A59271r37q73k42K08l8p10j207j084k48Q53J396R68J21l24l47n30r53j044
56706A54280o01k06l92r18j255j346j470j641j554j056m35j67m24q66r17l94K79
56689A40917O51Q32J236J810J971J368L56m29o71m27J22P30J107J102Q58O43O36
56672A52812Q40J104J169R09M90J83J4j74k75J00J078K120K427J667K44j046j569
56655A62093j260o31l30n25q04o81j85K06J06m31j060j521j762j827j742j540
56639A48106j268r21m53J7J70j42o18p87n05O5P52J351J390N42o78j252q58k10
56621A44701M7O9J74P5n04j070j011o06n38o38j41Q48J209L81p57j051m98J9k9
56602A40680l63m85k79J1J94M32R73J553J466N62k33MQ24R90L46O3Q29J785J830
$$ plain form
56583 151182 152342 153076 153891 154745 155288 155472 155572 155879 156581 157710 158985 159988 160726 161807 163808 166548
56567 166548 169201 171063 172180 173323 175439 178986 183703 189026 194656 200534 206398 211734 216257 220118
56553 220118 223494 226262 228301 229849 231271 232597 233552 233938 233677 232541 230205 226728 222778 219135 215991
56538 215991 212918 209534 206048 203039 200839 199284 197999 196664 194969 192647 189790 186930 184548 182619
56524 182619 180883 179392 178440 177971 177511 176798 176125 175873 175940 175867 175316 174209 172580 170586 168630 167192 166490
56507 166490 166358 166445 166391 165897 164921 163879 163398 163696 164298 164569 164409 164207 164201 164231 164204 164380 164912 165397 165348 164984 165008
56486 165008 165578 166014 165775 165245 165158 165606 166135 166678 167810 169981 172903 175926 178721 181350 183787 185769
56470 185769 187261 188848 191293 194643 198040 200727 202994 205682 208902 211843 214000 215945 218526 221766
$$ packed form
56583A51182J160P34Q15Q54N43J84J00L07P02J129J275J003P38J081K001K740
56567A66548K653J862J117J143K116L547M717N323N630N878N864N336M523L861
56553B20118L376K768K039J548J422J326R55L86k61j136k336l477l950l643l144
56538B15991l073l384l486l009k200j555j285j335j695k322k857k860k382j929
56524A82619j736j491r52m69m60p13o73k52O7p3n51j107j629j994j956j438p02
56507A66490j32Q7n4m94r76j042m81K98O02K71j60k02oL0k7J76N32M85m9l64K4
56486A65008N70M36k39n30q7M48N29N43J132K171K922L023K795K629K437J982
56470A85769J492J587K445L350L397K687K267K688L220K941K157J945K581L240
$$ plain form
56456 221766 225030 227842 229976 231101 230994 229983 228550 226600 223779 220482 217789 216185 215010 213456
56442 213456 211580 209912 208541 207087 205350 203528 201861 200400 199074 197742 196268 194725 193465 192776
56428 192776 192505 192202 191620 190935 190423 190020 189270 187778 185760 184043 183417 183941 184966 185815 186345 186917 187983
56411 187983 189623 191339 192362 192365 191842 191659 192329 193892 196151 198570 200085 199741 197730 195353 193702 192770
56395 192770 192050 191535 191653 192504 193684 194760 195539 195959 196052 196085 196372 196905 197417 197875 198599 199799 201223 202508
56377 202508 203703 205116 206636 207596 207526 206882 206684 207476 208924 210439 211849 213287 214747 216066 217222 218362
56361 218362 219576 220834 222089 223309 224470 225660 227051 228659 230302 231922 233673 235498 236945 237746
56347 237746 238337 239402 241120 243181 245228 246836 247393 246773 245978 246418 248446 251195 253800 256136 258338
$$ packed form
56456B21766L264K812K134J125j07j011j433j950k821l297k693j604j175j554
56442B13456j876j668j371j454j737j822j667j461j326j332j474j543j260o89
56428A92776k71l03n82o85n12m03p50j492k018j717o26N24J025Q49N30N72J066
56411A87983J640J716J023Ln23j83O70J563K259K419J515l44k011k377j651r32
56395A92770p20n15J18Q51J180J076P79M20R3L3K87N33N12M58P24J200J424J285
56377B02508J195J413J520R60p0o44j98P92J448J515J410J438J460J319J156J140
56361B18362J214J258J255J220J161J190J391J608J643J620J751J825J447Q01
56347B37746N91J065J718K061K047J608N57o20p95M40K028K749K605K336K202
$$ plain form
56332 258338 260460 262814 265863 269396 272471 274647 276696 279604 283392 287454 291606 296082 300733 304967
56318 304967 308508 311753 315328 319558 324359 329378 334239 338824 343249 347465 351066 353642 355251 356327
56304 356327 357269 358215 359100 359812 360374 361013 361903 362881 363663 364237 364760 365126 365095 364905 365185 366132 367322 368560
56286 368560 370376 373273 376970 380832 384739 389099 394296 400567 408157 417142 427124 437456 447757 458209
56272 458209 469567 482927 499023 517515 537424 558515 581797 608317 638064 670644 706594
56261 706594 747241 793385 844756 900755 961212 1026391 1096591 1171751 1251066 1333012 1415995
56250 1415995 1498893 1580707 1659868 1734382 1802667 1863954 1917816 1963523 1999955 2026152 2042097
56239 2042097 2049011 2048641 2042118 2029721 2011780 1989289 1963304 1934088 1901268 1864568 1824068 1779975
$$ packed form
56332B58338K122K354L049L533L075K176K049K908L788M062M152M476M651M234
56318C04967L541L245L575M230M801N019M861M585M425M216L601K576J609J076
56304C56327R42R46Q85P12N62O39Q90R78P82N74N23L66l1j90K80R47J190J238
56286C68560J816K897L697L862L907M360N197O271P590Q985R982J0332J0301J0452
56272D58209J1358J3360J6096J8492J9909K1091K3282K6520K9747L2580L5950
56261G06594M0647M6144N1371N5999O0457O5179P0200P5160P9315Q1946Q2983
56250A415995Q2898Q1814P9161P4514O8285O1287N3862M5707L6432K6197J5945
56239B042097O914l70o523j2397j7941k2491k5985k9216l2820l6700m0500m4093
$$ plain form
56227 1779975 1732538 1682060 1628731 1572680 1514466 1455265 1396212 1337670 1279334 1220889 1162407
56216 1162407 1104502 1048264 994755 944332 896798 852319 811654 775243 742696 713547 687881
56205 687881 665673 646167 628567 612917 599578 588192 577866 568125 559110 551110 544377 539069
56193 539069 534818 530762 526569 522949 520523 518727 516685 514626 513479 513410 513867 514795 516652 519254 521821
56178 521821 524385 528096 533725 540647 547642 554049 559905 565684 572257 580519 590647 602013 613993
56165 613993 626451 639430 652869 666740 680936 694893 707791 719327 729957 740321 750807
56154 750807 761660 773135 785468 799072 814725 833307 855499 882185 914926 955598 1005735
56143 1005735 1066630 1139748 1226343 1326767 1440502 1566325 1701473 1840774 1977462 2105104
$$ packed form
56227A779975m7437n0478n3329n6051n8214n9201n9053n8542n8336n8445n8482
56216A162407n7905n6238n3509n0423m7534m4479m0665l6411l2547k9149k5666
56205F87881k2208j9506j7600j5650j3339j1386j0326r741r015q000o733n308
56193E39069m251m056m193l620k426j796k042k059j147o9M57R28J857K602K567
56178E21821K564L711N629O922O995O407N856N779O573Q262J0128J1366J1980
56165F13993J2458J2979J3439J3871J4196J3957J2898J1536J0630J0364J0486
56154G50807J0853J1475J2333J3604J5653J8582K2192K6686L2741M0672N0137
56143A005735O0895P3118Q6595J00424J13735J25823J35148J39301J36688J27642
$$ plain form
56133 2105104 2218739 2315280 2394352 2458900 2513751 2562876 2607892 2648290 2681812 2704883 2714397
56122 2714397 2709992 2694161 2670062 2639788 2604245 2563058 2513897 2452863 2376434 2283084 2173520
56111 2173520 2050607 1919463 1786641 1658415 1539746 1434299 1344111 1268941 1206890 1156146
56101 1156146 1115629 1084050 1059618 1041111 1028244 1020465 1016231 1014014 1013292 1013918 1015167 1016034 1016068 1015393
56087 1015393 1014211 1012593 1010511 1007974 1005370 1003577 1003192 1003809 1004593 1005405 1006718 1008733 1011461 1015424 1021207
56072 1021207 1028413 1036097 1044166 1053260 1063334 1073654 1084235 1095967 1109150 1123114 1137494 1152511
56060 1152511 1167773 1182279 1196049 1210425 1226260 1243126 1260677 1279325 1298917 1318226 1336578
56049 1336578 1354747 1373457 1392294 1410982 1430441 1451540 1473786 1496294 1519225 1543408 1569311
$$ packed form
56133B105104J13635R6541P9072O4548N4851M9125M5016M0398L3522K3071R514
56122B714397m405j5831k4099l0274l5543m1187m9161o1034p6429r3350j09564
56111B173520j22913j31144j32822j28226j18669j05447r0188p5170o2051n0744
56101A156146m0517l1579k4432j8507j2867p779m234k217p22O26J249Q67L4o75
56087A015393j182j618k082k537k604j793l85O17P84Q12J313K015K728L963N783
56072A021207P206P684Q069R094J0074J0320J0581J1732J3183J3964J4380J5017
56060A152511J5262J4506J3770J4376J5835J6866J7551J8648J9592J9309J8352
56049A336578J8169J8710J8837J8688J9459K1099K2246K2508K2931K4183K5903
$$ plain form
56038 1569311 1597151 1627170 1659060 1691821 1724823 1758306 1792458 1826951 1861806 1897722 1934997
56027 1934997 1973077 2011565 2050782 2091125 2133002 2177565 2226047 2278057 2331951 2387197 2444834
56016 2444834 2505364 2568065 2632827 2700647 2771616 2844433 2918729 2995822 3076244 3158720 3242791
56005 3242791 3330342 3423036 3520167 3620539 3724741 3834150 3949337 4070875 4199983 4337072
55995 4337072 4481353 4633114 4794558 4967243 5150788 5345350 5553080 5775689 6012993
55986 6012993 6265481 6535975 6827076 7139408 7474143 7834631 8223698 8642017 9091160
55977 9091160 9575567 10099674 10666320 11280346 11950722 12686884 13496527 14389605 15380965
55968 15380965 16486584 17721738 19106578 20669916 22445035 24467744 26784408 29459618
$$ packed form
56038A569311K7840L0019L1890L2761L3002L3483L4152L4493L4855L5916L7275
56027A934997L8080L8488L9217M0343M1877M4563M8482N2010N3894N5246N7637
56016B444834O0530O2701O4762O7820P0969P2817P4296P7093Q0422Q2476Q4071
56005C242791Q7551R2694R7131J00372J04202J09409J15187J21538J29108J37089
55995D337072J44281J51761J61444J72685J83545J94562K07730K22609K37304
55986F012993K52488K70494K91101L12332L34735L60488L89067M18319M49143
55977I091160M84407N24107N66646O14026O70376P36162Q09643Q93078R91360
55968A5380965J105619J235154J384840J563338J775119K022709K316664K675210
$$ plain form
55960 29459618 32575288 36232331 40564495 45753129 52032684 59696912 69110960 80709966
55952 80709966 94970391 112368434 133330992 158151445 186856569 219050791 253738109
55945 253738109 289084093 322206086 349313442 366490771 370943938 362024133 341397264
55938 341397264 312331147 278619706 243691512 210123578 179516434 152615761 129560393
55931 129560393 110133041 93937625 80508515 69385526 60159631 52483695 46066001
55924 46066001 40668028 36102515 32221159 28900995 26041843 23567392 21418185 19542529
55916 19542529 17896008 16444369 15160229 14017966 12995028 12075281 11246772 10497836
55908 10497836 9818233 9201327 8641435 8130856 7662459 7232916 6840141 6479465 6145319
$$ packed form
55960B9459618L115670L657043M332164N188634O279555P664228R414048J1599006
55952H0709966J4260425J7398043K0962558K4820453K8705124L2194222L4687318
55945B53738109L5345984L3121993K7107356J7177329M453167q919805k0626869
55938C41397264k9066117l3711441l4928194l3567934l0607144k6900673k3055368
55931A29560393j9427352j6195416j3429110j1122989r225895p675936o417694
55924D6066001n397973m565513l881356l320164k859152k474451k149207j875656
55916A9542529j646521j451639j284140j142263j022938r19747q28509p48936
55908A0497836o79603o16906n59892n10579m68397m29543l92775l60676l34146
$$ plain form
55899 6145319 5834881 5547024 5279302 5028829 4794615 4576320 4371947 4179243 3998033
55890 3998033 3828771 3670050 3519811 3377669 3243793 3116877 2995590 2880903 2774567
55881 2774567 2676337 2584897 2500513 2424385 2356100 2293921 2237015 2185302 2137450 2090746 2042712
55870 2042712 1991534 1935675 1874726 1810215 1744381 1678733 1614700 1554336 1498720 1446670 1396701
55859 1396701 1349393 1306289 1267395 1231597 1198787 1169688 1144091 1120984 1100031 1081223 1063405
55848 1063405 1044761 1024653 1003711 982428 960986 940132 920829 903085 886207 869925 854403
55837 854403 839603 825717 813605 803753 795348 787505 780640 775325 770520 764537 757248 749764 742167
55824 742167 733178 721951 708799 694166 678209 661409 644413 627242 609635 592003 574986 558425
$$ packed form
55899F145319l10438k87857k67722k50473k34214k18295k04373j92704j81210
55890C998033j69262j58721j50239j42142j33876j26916j21287j14687j06336
55881B774567r8230r1440q4384p6128o8285o2179n6906n1713m7852m6704m8034
55870B042712n1178n5859o0949o4511o5834o5648o4033o0364n5616n2050m9969
55859A396701m7308m3104l8894l5798l2810k9099k5597k3107k0953j8808j7818
55848A063405j8644k0108k0942k1283k1442k0854j9303j7744j6878j6282j5522
55837H54403j4800j3886j2112r852q405p843o865n315m805n983p289p484p597
55824G42167q989j1227j3152j4633j5957j6800j6996j7171j7607j7632j7017j6561
$$ plain form
55812 558425 542051 526851 514344 504592 496315 488920 482944 478387 474216 469982 466628 465137 465445 467203
55798 467203 470465 474872 479030 481544 482235 481839 480892 479357 477000 473741 469890 466284 463938 463340 464013
55783 464013 464600 463210 458123 448748 435956 421282 406095 391700 379455 369902 362120 354822 347949
55770 347949 342395 338314 334528 329615 322820 314004 303604 292827 283092 274893 267662 260824 254478 248930
55756 248930 244185 240114 236668 233708 230921 228025 224789 220918 216232 210922 205282 199326 193043 186935
55742 186935 181779 177857 174806 172170 169717 167216 164337 160913 157210 154000 152348 152862 154872 156774
55728 156774 157572 157635 157530 156719 154231 150266 146238 143223 141016 138730 135736 132048 128290 125285 123288
55713 123288 121794 120421 119618 119953 121053 121961 122338 122628 123240 124266 125828 127880 129714 130452 130096 129388
$$ packed form
55812E58425j6374j5200j2507r752q277p395n976m557m171m234l354j491L08J758
55798D67203L262M407M158K514O91l96r47j535k357l259l851l606k346n98O73
55783D64013N87j390n087r375j2792j4674j5187j4395j2245r553p782p298o873
55770C47949n554m081l786m913o795q816j0400j0777r735q199p231o838o346n548
55756B48930m745m071l446k960k787k896l236l871m686n310n640n956o283o108
55742A86935n156l922l051k636k453k501k879l424l703l210j652N14K010J902
55728A56774P98O3j05q11k488l965m028l015k207k286k994l688l758l005j997
55713A23288j494j373q03L35J100R08L77K90O12J026J562K052J834P38l56p08
$$ plain form
55697 129388 128639 127447 125651 123819 122483 121556 120760 120184 120131 120754 122083 124132 126859 130209 134135 138358
55681 138358 142242 145252 147384 148854 149641 149699 149266 148364 146320 142485 137320 132082 127582 123911 121241
55666 121241 120049 120506 122371 125636 130610 137249 144944 153069 161169 168552 174336 178098 180055 180593 180118
55651 180118 179282 178682 178288 177733 177157 177076 177395 177353 176565 175364 173858 171443 167674 162970 158067 153270 148629
55634 148629 144324 140404 136544 132472 128390 124627 121094 117381 113238 108790 104432 100579 97357 94518
55620 94518 91821 89357 87213 85094 82746 80503 78732 76946 74345 71278 69173 68694 68799 68169 66840
55605 66840 65826 65660 66000 66372 66626 66708 66414 65443 63579 60981 58372 56541 55440 54107 51804 48957
55589 48957 46638 45296 44378 43137 41508 40123 39578 39805 40217 40428 40561 40722 40473 39301 37421 35610
$$ packed form
55697A29388p49j192j796j832j336r27p96n76n3O23J329K049K727L350L926M223
55681A38358L884L010K132J470P87N8m33r02k044l835n165n238m500l671k670
55666A21241j192M57J865L265M974O639P695Q125Q100P383N784L762J957N38m75
55651A80118q36o00l94n55n76q1L19m2p88j201j506k415l769m704m903m797m641
55634A48629m305l920l860m072m082l763l533l713m143m448m358l853l222k839
55620I4518k697k464k144k119k348k243j771j786k601l067k105m79J05o30j329
55605F6840j014j66L40L72K54Q2k94r71j864k598k609j831j101j333k303k847
55589D8957k319j342r18j241j629j385n45K27M12K11J33J61k49j172j880j811
$$ plain form
55573 35610 34235 32914 31249 29488 28299 28150 28933 29962 30356 29741 28555 27429 26435 25294 24092 23273
55557 23273 23036 23269 23934 24946 25809 26099 26291 27320 29260 31159 32342 33060 33666 33944 33722 33405 33411 33598
55539 33598 33726 33947 34349 34483 33910 32954 32379 32560 33328 34447 35834 37419 39144 41100 43551 46802 50957
55522 50957 55626 59969 63360 65925 68094 69839 70862 71361 71856 72260 71956 70970 70225 70315 70705 70546 69584
55505 69584 67862 65188 61510 57396 53625 50553 48184 46412 44901 43140 40949 38546 35950 32895
55491 32895 29587 26870 25265 24365 23608 22965 22478 21791 20752 19861 19512 19312 18754 17947 17079 15792 13927
55474 13927 12334 11987 12637 13235 13365 13379 13395 13178 12956 13368 14461 15516 15989 15948 15468 14357 12722 11215
55456 11215 10411 10275 10390 10349 9916 9210 8763 8953 9357 9128 8113 7138 7045 7746 8394 8280 7467 6743 6952
$$ packed form
55573C5610j375j321j665j761j189j49P83J029L94o15j186j126r94j141j202q19
55557B3273k37K33O65J012Q63K90J92J029J940J899J183P18O06K78k22l17OJ87
55539C3598J28K21M02J34n73r56n75J81P68J119J387J585J725J956K451L251M155
55522E0957M669M343L391K565K169J745J023M99M95M04l04r86p45R0L90j59r62
55505F9584j722k674l678m114l771l072k369j772j511j761k191k403k596l055
55491C2895l308k717j605r00p57o43m87o87j039q91l49k00n58q07q68j287j865
55474A3927j593l47O50N98J30J4J6k17k22M12J093J055M73m1m80j111j635j507
55456A1215q04j36J15m1m33p06m47J90M04k29j015r75r3P01O48j14q13p24K09
$$ plain form
55437 6952 8193 9728 10830 11473 11941 12125 11752 11088 10787 10992 11170 10903 10371 9925 9638 9490 9596 10062
55419 10062 10874 12072 13759 15809 17781 19271 20187 20638 20747 20667 20527 20336 20082 19916 20031 20230 19885 18469
55401 18469 16137 13687 11901 10901 10176 9308 8532 8326 8547 8424 7558 6451 5810 5681 5627 5424 5184 5098
55383 5098 5433 6469 7981 9058 8980 8079 7271 6950 6919 7115 7674 8313 8399 7817 7209 7177 7727 8616 9677
55364 9677 10600 10855 10185 8925 7633 6668 6211 6333 6857 7425 7873 8335 8866 9267 9397 9381 9384 9420 9460 9458 9167
55343 9167 8330 7218 6590 6798 7206 6908 5862 4915 4751 5204 5731 6168 6714 7299 7389 6578 5144 3778
55325 3778 2895 2501 2660 3618 5320 7172 8546 9275 9413 8895 7869 7041 7103 7816 8145 7425 6004 4684
55307 4684 3926 3739 3969 4379 4650 4628 4487 4495 4656 4747 4643 4455 4297 4100 3808 3712 4336 5844 7682 9001
$$ packed form
55437F952J241J535J102O43M68J84l73o64l01K05J78k67n32m46k87j48J06M66
55419A0062Q12J198J687K050J972J490R16M51J09q0j40j91k54j66J15J99l45j416
55401A8469k332k450j786j000p25q68p76k06K21j23q66j107o41j29n4k03k40q6
55383E098L35J036J512J077p8r01q08l21l1J96N59O39Q6n82o08l2N50Q89J061
55364I677R23K55o70j260j292r65m57J22N24N68M48M62N31M01J30j6LL6M0kk91
55343I167q37j112o28K08M08k98j046r47j64M53N27M37N46N85R0q11j434j366
55325C778q83l94J59R58J702J852J374P29J38n18j026q28O2P13L29p20j421j320
55307D684p58j87K30M10K71k2j41QJ61R1j04j88j58j97k92r6O24J508J838J319
$$ plain form
55287 9001 9360 8894 7967 7043 6724 7391 8607 9301 8809 7409 5720 4023 2459 1468 1501 2475 3853 5124
55269 5124 5958 6178 5976 5961 6608 7760 8898 9746 10348 10792 11152 11461 11539 11127 10449 10262 10936 11909 12483
55250 12483 12749 13129 13392 12892 11590 10075 8693 7371 6323 6141 6990 8300 9450 10295 10859 11008 10629
55233 10629 9849 8968 8389 8474 9090 9440 8866 7749 7079 7146 7247 6730 5748 4888 4623 5261 6863 8956 10802
55214 10802 12126 13173 13987 14211 13857 13636 14191 15378 16640 17606 18031 17590 16252 14625 13501 13132 13258
55197 13258 13655 14331 15210 15918 16008 15355 14264 13179 12303 11620 11242 11364 11770 11821 11318 10954 11414 12293 12630
55178 12630 12263 11926 12050 12268 12176 11834 11328 10534 9591 8980 8800 8573 8116 8058 9045 10797 12340 12971 12758
55159 12758 12372 12578 13584 14746 15181 14705 13810 12829 11718 10670 10243 10634 11449 12395 13545 14685 15093
$$ packed form
55287I001L59m66r27r24l19O67J216O94m92j400j689j697j564r91L3R74J378J271
55269E124Q34K20k02j5O47J152J138Q48O02M44L60L09P8m12o78j87O74R73N74
55250A2483K66L80K63n00j302j515j382j322j048j82Q49J310J150Q45N64J49l79
55233A0629p80q81n79Q5O16L50n74j117o70O7J01n17r82q60k65O38J602K093J846
55214A0802J324J047Q14K24l54k21N55J187J262R66M25m41j338j627j124l69J26
55197A3258L97O76Q79P08R0o53j091j085q76o83l78J22M06N1n03l64M60Q79L37
55178A2630l67l37J24K18r2l42n06p94r43o11j80k27m57n8R87J752J543O31k13
55159A2758l86K06J006J162M35m76q95r81j111j048m27L91Q15R46J150J140M08
$$ plain form
55142 15093 14379 12961 11396 9828 8504 8061 8748 9900 10793 11520 12469 13462 14073 14406 14813 15180 15188 15085
55124 15085 15479 16423 17330 17760 17884 18171 18977 20351 21970 23373 24522 25873 27692 29692 31625 33707
55108 33707 35965 37700 38314 38279 38462 38690 37851 35474 32443 29954 28330 27072 25602 23769 21980 21014
55092 21014 21413 22885 24494 25515 25944 26203 26596 27066 27320 27159 26697 26153 25449 24426 23567 23893 25603
55075 25603 27299 27334 25813 24494 24666 25809 26576 26454 26006 25868 26095 26459 26983 27917 29273 30616 31402
55058 31402 31448 30927 29989 28661 27119 25767 24944 24742 25164 26138 27370 28511 29587 30905 32412 33586
55042 33586 34075 34033 33652 32917 32012 31362 30966 30317 29396 29082 30019 31664 33056 33943 34449 34296 33339 32407 32554
55023 32554 33635 34624 35198 35998 37340 38749 39938 41270 42912 44370 45291 45978 46701 47122 46897 46299 45733
$$ packed form
55142A5093p14j418j565j568j324m43O87J152Q93P27R49R93O11L33M07L67Qj03
55124A5085L94R44R07M30J24K87Q06J374J619J403J149J351J819K000J933K082
55108C3707K258J735O14l5J83K28q39k377l031k489j624j258j470j833j789r66
55092B1014L99J472J609J021M29K59L93M70K54j61m62n44p04j023q59L26J710
55075B5603J696L5j521j319J72J143P67j22m48j38K27L64N24R34J356J343P86
55058C1402M6n21r38j328j542j352q23k02M22R74J232J141J076J318J507J174
55042C3586M89m2l81p35r05o50l96o49r21l14R37J645J392Q87N06j53r57r32J47
55023C2554J081R89N74Q00J342J409J189J332J642J458R21O87P23M21k25n98n66
$$ plain form
55006 45733 45021 43717 41932 40346 39369 38605 37318 35390 33666 33148 33784 34426 34125 33050 31820 30559
54990 30559 29200 28272 28447 29507 30581 31328 32098 33018 33828 34546 35332 35614 34501 32338 30749 30662 31298
54973 31298 31717 32283 33704 35483 36463 36492 36502 37169 38328 39600 40764 41574 41923 42289 43410 45439 47870
54956 47870 50342 53092 56585 61061 66504 72780 79788 87688 96822 107150 117887 128063 137247 145340
54942 145340 151859 156006 157400 156228 152614 146414 137888 128105 118320 109141 100576 92581 85225 78445
54928 78445 72043 66059 60929 57078 54408 52348 50440 48806 47871 47705 47897 48139 48688 49950 51742 53304
54912 53304 54143 54618 55569 57541 60584 64635 69880 76623 84950 94575 104921 115270 124883 133088 139289
54897 139289 142916 143517 141041 135938 128855 120301 110732 100808 91190 82111 73470 65434 58541 53145
$$ packed form
55006D5733p12j304j785j586r77p64j287j928j724n18O36O42l01j075j230j261
54990C0559j359r28J75J060J074P47P70R20Q10P18P86K82j113k163j589q7O36
54973C1298M19N66J421J779R80K9J0O67J159J272J164Q10L49L66J121K029K431
54956D7870K472K750L493M476N443O276P008P900R134J0328J0737J0176R184Q093
54942A45340O519M147J394j172l614o200q526r783r785r179q565p995p356o780
54928G8445o402n984n130l851k670k060j908j634r35j66J92K42N49J262J792J562
54912E3304Q39M75R51J972L043M051N245O743Q327R625J0346J0349R613Q205O201
54897A39289L627O01k476n103p083q554r569r924r618r079q641q036o893n396
$$ plain form
54883 53145 49119 46255 44476 43385 42146 40272 38199 36571 35331 34103 33140 33076 33806 34428 34350 33836
54867 33836 33300 32805 32481 32769 33829 35137 36010 36203 35763 34807 33766 33352 33728 34051 33332 31586 29703
54850 29703 28339 27386 26512 25786 25610 26252 27499 28693 29118 28448 26841 24694 22427 20467 19122 18382
54834 18382 18043 18075 18621 19617 20748 21852 23037 24257 25136 25421 25289 25043 24820 24793 25246 26185 27183 27967
54816 27967 28775 29796 30549 30342 29209 27998 27667 28760 31350 34968 38642 41478 43351 44758 46048
54801 46048 47160 48191 49803 52824 57500 63367 69889 77147 85747 95896 106709 116747 125249 132458
54787 132458 138670 143436 146019 146223 144288 140262 134071 126172 117613 109325 101654 94674 88582 83611
54773 83611 79738 76634 73854 71124 68524 66353 64707 63356 62197 61647 62219 63773 65533 66948 68255
$$ packed form
54883E3145m026k864j779j091j239j874k073j628j240j228r63o4P30O22p8n14
54867C3836n36m95l24K88J060J308Q73J93m40r56j041m14L76L23p19j746j883
54850B9703j364r53q74p26j76O42J247J194M25o70j607k147k267j960j345p40
54834A8382l39L2N46R96J131J104J185J220Q79K85j32k46k23k7M53R39R98P84
54816B7967Q08J021P53k07j133j211l31J093K590L618L674K836J873J407J290
54801D6048J112J031J612L021M676N867O522P258Q600J0149J0813J0038Q502P209
54787A32458O212M766K583K04j935m026o191p899q559q288p671o980o092m971
54773H3611l873l104k780k730k600k171j646j351j159n50N72J554J760J415J307
$$ plain form
54758 68255 70048 72519 75389 78461 81981 86376 91761 97914 104712 112360 121045 130545 140392 150237
54744 150237 159634 167525 172508 173923 172405 169152 164911 159877 154191 148052 141442 134085 125778 116673
54730 116673 107356 98774 91797 86622 82629 78951 75073 70946 66892 63554 61462 60314 59122 57451
54716 57451 56087 55940 56670 57056 56568 55808 55376 55054 54366 53353 52393 51631 50976 50477 50347 50665 51171 51377
54698 51377 50919 49949 49112 48974 49482 50175 50790 51347 51769 51844 51667 51658 51908 51876 51104 50043 49744 50700 52265 53417
54678 53417 53880 54300 55397 57260 59613 62439 65851 69440 72306 73965 74839 75573 76236 76540 76517 76499 76582
54661 76582 76570 76393 76163 75875 75428 74988 74966 75602 76784 78261 79744 80853 81289 81077 80424 79441 78286 77472
54643 77472 77603 78824 80865 83555 86893 90679 94588 98694 103435 108942 114862 120967 127508 134689 142142
$$ packed form
54758F8255J793K471K870L072L520M395N385O153O798P648Q685R500R847R845
54744A50237R397P891M983J415j518l253m241n034n686o139o610p357q307r105
54730A16673r317q582o977n175l993l678l878m127m054l338k092j148j192j671
54716E7451j364j47P30L86m88p60m32l22o88j013r60p62o55m99j30L18N06K06
54698E1377m58r70q37j38N08O93O15N57M22P5j77rK50l2p72j061k99R56J565J152
54678E3417M63M20J097J863K353K826L412L589K866J659Q74P34O63L04k3j8Q3
54661G6582j2j77k30k88m47m40k2O36J182J477J483J109M36k12o53r83j155q14
54643G7472J31J221K041K690L338L786L909M106M741N507N920O105O541P181P453
$$ plain form
54628 142142 149097 154788 158555 160016 159443 157638 155125 151681 146866 140720 133667 126126 118704 112478
54614 112478 108438 106472 105293 103567 100922 97788 94588 91414 88429 86061 84499 83174 81191 78373
54600 78373 75469 73192 71418 69651 67837 66188 64465 62155 59385 57033 55724 55243 55124 55242 55539
54585 55539 55644 55271 54689 54346 54186 53759 52916 52014 51423 51087 50682 50047 49391 49070 49205 49562 49855 50008 49951
54566 49951 49385 48124 46583 45481 44997 44660 44142 43678 43515 43459 43303 43272 43613 44067 44213 44177 44543 45581 46888
54547 46888 47815 47975 47366 46230 44899 43721 43023 42953 43184 43025 42242 41634 42245 43956 45522 46181 46523 47463
54529 47463 49090 51062 53452 56417 59525 62291 65035 68404 72264 75932 79318 82855 86314 88715
54515 88715 89664 89785 89487 88189 85431 82085 79645 78566 77918 76501 73874 70438 66939 63934 61455
$$ packed form
54628A42142O955N691L767J461n73j805k513l444m815o146p053p541p422o226
54614A12478m040j966j179j726k645l134l200l174k985k368j562j325j983k818
54600G8373k904k277j774j767j814j649j723k310k770k352j309m81j19J18K97
54585E5539J05l73n82l43j60m27q43r02n91l36m05o35o56l21J35L57K93J53n7
54566D9951n66j261j541j102m84l37n18m64j63n6j56l1L41M54J46l6L66J038J307
54547D6888R27J60o09j136j331j178o98p0K31j59p83o08O11J711J566O59L42R40
54529D7463J627J972K390K965L108K766K744L369L860L668L386L537L459K401
54515H8715R49J21k98j298k758l346k440j079o48j417k627l436l499l005k479
$$ plain form
54500 61455 59227 57148 55385 53979 52805 52046 52186 53149 53923 53553 52284 51219 51046 51553 52255 52936 53613
54483 53613 54400 55459 56742 57803 58237 58221 58270 58489 58544 58343 58204 58298 58490 58907 60035 61933 63827 64952
54465 64952 65407 65749 66125 66338 66424 66543 66450 65792 64891 64554 64955 65310 64867 63663 62101 60317 58386 56661
54447 56661 55410 54406 53363 52547 52525 53468 55096 57051 58821 59541 58595 56465 54421 53178 52390 51591
54431 51591 51045 51311 52393 53754 54839 55260 54739 53391 51936 51211 51404 52062 52784 53588 54601 55710 56688
54414 56688 57440 58029 58566 59193 60054 61179 62429 63662 64921 66371 68049 69782 71503 73524 76198 79200
54398 79200 81512 82554 83096 84522 87133 89748 91162 91465 91494 91497 90945 89493 87411 85014 82237 79074
54382 79074 76063 73977 73074 72843 72472 71512 70106 68676 67457 66405 65473 64745 64201 63599 62799 62017 61505
$$ packed form
54500F1455k228k079j763j406j174p59J40R63P74l70j269j065j73N07P02O81O77
54483E3613P87J059J283J061M34j6M9K19N5k01j39R4J92M17J128J898J894J125
54465F4952M55L42L76K13Q6J19r3o58r01l37M01L55m43j204j562j784j931j725
54447E6661j251j004j043q16k2R43J628J955J770P20r46k130k044j243p88p99
54431E1591n46K66J082J361J085M21n21j348j455p25J93O58P22Q04J013J109R78
54414E6688P52N89N37O27Q61J125J250J233J259J450J678J733J721K021K674L002
54398G9200K312J042N42J426K611K615J414L03K9Ln52j452k082k397k777l163
54382G9074l011k086r03k31l71r60j406j430j219j052r32p28n44o02q00p82n12
$$ plain form
54365 61505 61115 60484 59595 58910 58937 59861 61495 63350 64844 65755 66410 67168 67845 68056 68094 68920 71109 74179
54347 74179 77181 79610 81528 83178 84813 86661 88735 90725 92319 93388 93716 92859 90705 88020 85935
54332 85935 84808 83946 82506 80347 77870 75351 72720 69941 67341 65439 64453 64018 63477 62512 61422 60651
54316 60651 60184 59611 58765 57952 57415 56808 55530 53504 51321 49543 48080 46482 44712 43366 43009 43450
54300 43450 43847 43540 42662 41890 41694 41953 42284 42582 43051 43713 44147 43865 42903 41773 40877 40234 39842 39941 40568
54281 40568 41089 40724 39582 38793 39311 40834 42117 42249 41398 40400 39874 39768 39586 38922 37848 36861 36526 37195
54263 37195 38922 41409 43972 45759 46258 45634 44528 43586 43174 43353 43912 44498 44890 45170 45523 45928 46203
54246 46203 46322 46472 46789 47217 47699 48324 49143 50011 50784 51620 52789 54169 55132 55139 54368 53513 52932 52256 51044
$$ packed form
54365F1505l90o31q89o85K7R24J634J855J494R11O55P58O77K11L8Q26K189L070
54347G4179L002K429J918J650J635J848K074J990J594J069L28q57k154k685k085
54332H5935j127q62j440k159k477k519k631k779k600j902r86m35n41r65j090p71
54316F0651m67n73q46q13n37o07j278k026k183j778j463j598j770j346l57M41
54300D3450L97l07q78p72j96K59L31K98M69O62M34k82r62j130q96o43l92R9O27
54281D0568N21l65j142p89N18J523J283J32q51r98n26j06j82o64j074r87l35O69
54263C7195J727K487K563J787M99o24j106r42m12J79N59N86L92K80L53M05K75
54246D6203J19J50L17M28M82O25Q19Q68P73Q36J169J380R63Pp71q55n81o76j212
$$ plain form
54227 51044 49696 49301 50429 52358 53755 54017 53670 53442 53319 52730 51467 50032 48985 48186 47008 45319
54211 45319 43868 43468 44000 44613 44801 44773 44695 44252 43427 43145 44323 46440 47899 47945 47472 47610 48249 48547 48337
54192 48337 48203 48351 48205 47235 45664 44167 43274 43200 43869 44888 45780 46400 46896 47182 46852 45771 44431 43353
54174 43353 42429 41211 39630 38028 36599 35294 34319 34220 35204 36647 37635 37907 37992 38403 38966 39101 38580 37747
54156 37747 37005 36374 35724 35214 35174 35586 36007 36080 35878 35627 35383 35168 35150 35403 35674 35682 35551 35621 35890 35980 35745
54135 35745 35616 36174 37532 39261 40804 41861 42424 42545 42092 40787 38610 36139 34311 33715 34163 35011
54119 35011 35862 36837 38169 39689 40860 41380 41548 41796 41987 41510 40127 38341 36722 35272 33824 32726
54103 32726 32542 33185 33928 34356 34788 35578 36465 36979 37184 37636 38698 40160 41529 42517 43237 43994 44860 45516
$$ packed form
54227E1044j348l95J128J929J397K62l47k28j23n89j263j435j047p99j178j689
54211D5319j451m00N32O13J88k8p8m43q25k82J178K117J459M6m73J38O39K98k10
54192D8337j34J48j46r70j571j497q93p4O69J019Q92O20M96K86l30j081j340j078
54174D3353r24j218j581j602j429j305r75r9R84J443R88K72Q5M11N63J35n21q33
54156C7747p42o31o50n10m0M12M21P3k02k51k44k15j8K53K71Qj31P0K69R0k35
54135C5745j29N58J358J729J543J057N63J21m53j305k177k471j828n96M48Q48
54119C5011Q51R75J332J520J171N20J68K48J91m77j383j786j619j450j448j098
54103C2726j84O43P43M28M32P90Q87N14K05M52J062J462J369R88P20P57Q66O56
$$ plain form
54085 45516 45621 45312 45136 45517 46451 47647 48688 49113 48687 47711 46751 46038 45473 45185 45549 46436 47053 46891
54067 46891 46470 46676 47687 49006 50282 51606 53119 54802 56540 58060 58926 59004 58826 59135 60170 61729
54051 61729 63659 65829 67842 69350 70653 72423 74873 77706 80771 84070 87030 88633 88633 88158 88661 90703
54035 90703 93973 97946 102083 105852 109162 112531 116411 120557 124387 127692 130488 132520 133485 133643 133635 133730
54019 133730 133747 133678 133838 134299 134675 134630 134167 133248 131599 129197 126562 124150 121725 118743 115261 112006 109531
54002 109531 107679 106028 104514 103377 102621 101846 100606 98788 96617 94442 92527 90870 89178 87231 85375
53987 85375 84384 84556 85163 85159 84366 83472 82852 81988 80300 78123 76348 75377 74866 74389 73869 73393 72985 72629 72215
53968 72215 71504 70498 69765 69952 70812 71183 70195 68211 66372 65567 66079 67841 70485 73208 75081 75683 75291
$$ packed form
54085D5516J05l09j76L81R34J196J041M25m26r76r60p13n65k88L64Q87O17j62
54067D6891m21K06J011J319J276J324J513J683J738J520Q66P8j78L09J035J559
54051F1729J930K170K013J508J303J770K450K833L065L299K960J603%m75N03K042
54035I0703L270L973M137L769L310L369L880M146L830L305K796K032R65J58qR5
54019A33730J7o9J60M61L76m5m63r19j649k402k635k412k425k982l482l255k475
54002A09531j852j651j514j137p56p75j240j818k171k175j915j657j692j947j856
53987H5375r91J72O07mp93q94o20q64j688k177j775r71n11m77n20m76m08l56m14
53968G2215p11j006p33J87Q60L71r88j984j839q05N12J762K644K723J873O02l92
$$ plain form
53951 75291 74513 73909 73857 74450 75450 76570 77863 79604 81762 83885 85628 87224 89203 91776 94678 97596
53935 97596 100522 103681 107222 111037 114834 118361 121644 125038 128956 133447 137998 141842 144535 146277
53921 146277 147676 149261 151269 153798 156938 160650 164677 168785 173055 177730 182704 187341 190950 193451
53907 193451 195453 197602 199883 201614 202216 201888 201411 201310 201374 201061 200135 198676 196657 193850 190140 185685
53891 185685 180718 175447 170167 165177 160468 155703 150695 145689 141031 136791 132860 129226 125898 122795
53877 122795 120002 117965 116973 116480 115330 112850 109478 106195 103535 101246 98755 95746 92379 89142 86557
53862 86557 84938 84258 84095 83761 82766 81360 80423 80529 81191 81269 80077 77832 75139 72487 70293 68935 68382
53845 68382 68075 67552 67054 67211 68166 69331 70029 70108 69869 69616 69504 69661 70178 70848 71162 70788 70067 69779 70315
$$ packed form
53951G5291p78o04n2N93J000J120J293J741K158K123J743J596J979K573K902K918
53935I7596K926L159L541L815L797L527L283L394L918M491M551L844K693J742
53921A46277J399J585K008K529L140L712M027M108M270M675M974M637L609K501
53907A93451K002K149K281J731O02l28m77j01O4l13r26j459k019k807l710m455
53891A85685m967n271n280m990m709m765n008n006m658m240l931l634l328l103
53877A22795k793k037r92m93j150k480l372l283k660k289k491l009l367l237k585
53862H6557j619o80j63l34r95j406r37J06O62P8j192k245k693k652k194j358n53
53845F8382l07n23m98J57R55J165O98P9k39k53j12J57N17O70L14l74p21k88N36
$$ plain form
53826 70315 71226 71736 71584 71221 71293 72098 73405 74617 75224 75313 75542 76412 77736 79072 80476 82410 85048
53809 85048 88156 91560 95171 98562 101136 102918 104610 106722 109226 112254 116305 121306 126204 130207
53795 130207 133854 138041 142414 145703 147518 148790 150322 151820 152655 152878 152982 153144 153139 152751 151942 150846
53779 150846 149776 149033 148474 147462 145464 142577 139343 136229 133391 130783 128340 126094 124083 122081 119577
53764 119577 116360 113015 110413 108657 106981 104843 102637 101036 100031 99018 97623 96009 94460 93043
53750 93043 91715 90502 89479 88672 88025 87436 86870 86445 86235 85978 85171 83617 81764 80259 79282 78443 77328
53733 77328 76005 75004 74907 75924 77767 79862 81722 83164 84274 85238 86170 87023 87650 88040 88413 89014 89893
53716 89893 90957 92155 93443 94635 95473 95830 95720 95229 94580 94151 94169 94490 94895 95413 96066 96466 96249 95837
$$ packed form
53826G0315R11N10j52l63P2Q05J307J212O07Q9K29Q70J324J336J404J934K638
53809H5048L108L404L611L391K574J782J692K112K504L028M051N001M898M003
53795A30207L647M187M373L289J815J272J532J498Q35K23J04J62nl88q09j096
53779A50846j070p43n59j012j998k887l234l114k838k608k443k246k011k002k504
53764A19577l217l345k602j756j676k138k206j601j005j013j395j614j549j417
53750I3043j328j213j023q07o47n89n66m25k10k57q07j554j853j505r77q39j115
53733G7328j323j001r7J017J843K095J860J442J110R64R32Q53O27L90L73O01Q79
53716H9893J064J198J288J192Q38L57j10m91o49m29J8L21M05N18O53M00k17m12
$$ plain form
53698 95837 96261 98053 100748 103608 106392 109139 111654 113592 114881 115799 116786 118239 120208 122152 123352
53683 123352 123816 124482 126218 128872 131580 133727 135327 136703 138161 139822 141472 142640 143129 143317 143701
53668 143701 144268 144573 144370 143891 143618 143970 145057 146539 147755 148245 148072 147569 146941 146258 145636 145217 145067 145199
53650 145199 145529 145713 145361 144596 144063 144163 144562 144693 144357 143604 142503 141454 141261 142281 143823 144961 145629
53633 145629 146279 146785 146534 145471 144215 143117 142005 140986 140671 141350 142639 144248 146375 148965 151286
53618 151286 152760 153707 154753 155989 157210 158564 160315 162261 164002 165610 167436 169435 171250 172939
53604 172939 175036 177901 181468 185611 190164 194507 197811 200006 202057 204886 208419 212075 215824 220142
53590 220142 224982 229459 232787 235140 237345 239939 242821 245640 248225 250654 253123 255712 258142 259851
$$ packed form
53698I5837M24J792K695K860K784K747K515J938J289R18R87J453J969J944J200
53683A23352M64O66J736K654K708K147J600J376J458J661J650J168M89J88L84
53668A43701N67L05k03m79k73L52J087J482J216M90j73n03o28o83o22m19j50J32
53650A45199L30J84l52p65n33J00L99J31l36p53j101j049j93J020J542J138O68
53633A45629O50N06k51j063j256j098j112j019l15O79J289J609K127K590K321
53618A51286J474R47J046J236J221J354J751J946J741J608J826J999J815J689
53604A72939K097K865L567M143M553M343L304K195K051K829L533L656L749M318
53590B20142M840M477L328K353K205K594K882K819K585K429K469K589K430J709
$$ plain form
53576 259851 260579 260828 261419 262550 263613 264039 263938 263764 263667 263553 263457 263408 263088 262097 260569 259105 258064 257333
53558 257333 256807 256655 256920 257239 257280 257194 257361 257808 258151 257997 257238 256052 254865 254186 254216 254632 254932 254976 254994 255129
53538 255129 255264 255402 255909 257098 258662 259839 260269 260494 261418 263372 265889 268369 270662 272967 275456 278272
53522 278272 281683 285873 290571 295215 299619 304361 310351 318040 327127 336948 347078 357538 368435
53509 368435 379537 390342 400657 410991 422288 435204 449691 465194 481261 497957 515622
53498 515622 534254 553310 572379 591858 612518 634391 656595 678396 699934 721613 743329
53487 743329 764807 786247 807990 829799 851070 871661 891988 912460 933411 955402 978845
53476 978845 1003279 1027703 1051707 1075586 1099232 1121679 1142143 1160901 1178725 1195951 1212468
$$ packed form
53576B59851P28K49N91J131J063M26j01j74r7j14r6m9l20r91j528j464j041p31
53558B57333n26j52K65L19M1q6J67M47L43j54p59j186j187o79L0M16L00M4J8J35
53538B55129J35J38N07J189J564J177M30K25R24J954K517K480K293K305K489K816
53522B78272L411M190M698M644M404M742N990P689R087R821J0130J0460J0897
53509C68435J1102J0805J0315J0334J1297J2916J4487J5503J6067J6696J7665
53498E15622J8632J9056J9069J9479K0660K1873K2204K1801K1538K1679K1716
53487G43329K1478K1440K1743K1809K1271K0591K0327K0472K0951K1991K3443
53476I78845K4434K4424K4004K3879K3646K2447K0464J8758J7824J7226J6517
$$ plain form
53465 1212468 1228193 1243068 1256984 1270053 1282643 1294793 1305986 1315857 1324630 1332391 1338320 1341315
53453 1341315 1341106 1338188 1332930 1325426 1316117 1305812 1294977 1283512 1271289 1258343 1244369 1228581
53441 1228581 1210493 1190648 1170297 1150479 1131433 1112702 1093591 1073697 1053165 1032492 1012102
53430 1012102 992162 972701 953759 935430 917879 901281 885714 871219 858026 846448 836413
53419 836413 827436 819298 812480 807481 803948 801070 798720 797628 798419 801096 805549 811873 819852 828750
53405 828750 838232 849072 862364 878204 895704 914148 933507 953788 974560 995491 1016993 1039904
53393 1039904 1064706 1091302 1119440 1149030 1180055 1212461 1246238 1281504 1318472 1357409 1398557
53382 1398557 1441937 1487232 1534057 1582293 1631884 1682349 1732874 1783040 1833129 1883438 1933653
$$ packed form
53465A212468J5725J4875J3916J3069J2590J2150J1193R871Q773P761N929K995
53453A341315k09k918n258p504r309j0305j0835j1465j2223j2946j3974j5788
53441A228581j8088j9845k0351j9818j9046j8731j9111j9894k0532k0673k0390
53430A012102j9940j9461j8942j8329j7551j6598j5567j4495j3193j1578j0035
53419H36413q977q138o818m999l533k878k350j092P91K677M453O324P979Q898
53405H28750R482J0840J3292J5840J7500J8444J9359K0281K0772K0931K1502K2911
53393A039904K4802K6596K8138K9590L1025L2406L3777L5266L6968L8937M1148
53382A398557M3380M5295M6825M8236M9591N0465N0525N0166N0089N0309N0215
$$ plain form
53371 1933653 1983210 2031924 2079724 2125947 2169507 2209769 2246689 2280045 2309215 2333947 2354851
53360 2354851 2372815 2388320 2401560 2412667 2421323 2426595 2427683 2424653 2418009 2407819 2393681 2375318
53348 2375318 2352626 2325253 2292686 2254787 2211892 2164529 2113559 2060523 2007229 1954797 1903407
53337 1903407 1852962 1803544 1755249 1708117 1662395 1618356 1575688 1533475 1491082 1448712 1406873
53326 1406873 1365724 1325247 1285748 1247792 1211764 1177781 1145853 1115965 1088170 1062827 1040486
53315 1040486 1021249 1004390 988837 973886 959271 944840 930612 917057 904886 894463 885651
53304 885651 878194 872034 867181 863480 860627 858383 856752 856015 856511 858307 861147 864755 869021 873826 878991
53289 878991 884710 891805 901122 912679 925805 940168 956210 974407 994481 1015675 1037564 1060192
$$ packed form
53371A933653M9557M8714M7800M6223M3560M0262L6920L3356K9170K4732K0904
53360B354851J7964J5505J3240J1107Q656N272J088l030o644j0190j4138j8363
53348B375318k2692k7373l2567l7899m2895m7363n0970n3036n3294n2432n1390
53337A903407n0445m9418m8295m7132m5722m4039m2668m2213m2393m2370m1839
53326A406873m1149m0477l9499l7956l6028l3983l1928k9888k7795k5343k2341
53315A040486j9237j6859j5553j4951j4615j4431j4228j3555j2171j0423q812
53304H85651p457o160m853l701k853k244j631p37M96J796K840L608M266M805N165
53289H78991N719P095R317J1557J3126J4363J6042J8197K0074K1194K1889K2628
$$ plain form
53277 1060192 1083583 1107465 1131521 1155529 1179181 1202020 1223767 1244485 1264280 1282920 1299911
53266 1299911 1314826 1327457 1337827 1346274 1353417 1359800 1365512 1370282 1373803 1375770 1375812 1373750 1369862 1364443
53252 1364443 1357136 1347252 1334872 1320940 1305913 1288913 1268886 1246112 1221851 1196740 1170410 1142628
53240 1142628 1113886 1084642 1054819 1024570 994897 966904 940786 916060 892516 870301 849238
53229 849238 828700 808283 788218 768964 750613 732760 714808 696407 677785 659627 642419
53218 642419 625990 609935 594452 580461 568794 559473 551877 545354 539498 533970 528345 522268 515706
53205 515706 508911 502079 495079 487635 479764 471859 464331 457315 450807 444814 439192 433561 427647 421592
53191 421592 415718 410129 404806 399922 395627 391587 387218 382406 377544 372717 367385 361230 354877 349273
$$ packed form
53277A060192K3391K3882K4056K4008K3652K2839K1747K0718J9795J8640J6991
53266A299911J4915J2631J0370Q447P143O383N712M770L521J967M2k062l888n419
53252A364443p307r884j2380j3932j5027j7000k0027k2774k4261k5111k6330k7782
53240A142628k8742k9244k9823l0249k9673k7993k6118k4726k3544k2215k1063
53229H49238k0538k0417k0065j9254j8351j7853j7952j8401j8622j8158j7208
53218F42419j6429j6055j5483j3991j1667r321p596o523n856n528n625o077o562
53205E15706o795o832p000p444p871p905p528p016o508n993n622n631n914o055
53191D21592n874n589n323m884m295m040m369m812m862m827n332o155o353n604
$$ plain form
53177 349273 344564 340136 335671 331554 328090 324809 320910 316165 311092 306388 302459 299393 296999 294788
53163 294788 292199 289018 285494 281931 278287 274333 270106 266021 262493 259551 256878 254125 251176 248190
53149 248190 245477 243259 241470 239772 237763 235166 231883 228075 224232 220998 218713 217197 216073 215185
53135 215185 214470 213546 211826 209167 206126 203376 201037 198803 196497 194215 192029 189886 187825 185991 184373
53120 184373 182751 180986 179138 177217 175106 172936 171209 170202 169431 168071 165904 163505 161505 160011
53106 160011 158840 157954 157404 157007 156371 155211 153534 151622 149890 148646 147834 147073 146041 144730 143257 141630
53090 141630 139886 138329 137324 136838 136409 135655 134646 133771 133326 133339 133718 134449 135581 137011 138383 139360 139986
53073 139986 140626 141526 142638 143939 145600 147664 149767 151489 152829 153965 154718 154637 153614 152013 150164
$$ packed form
53177C49273m709m428m465m117l464l281l899m745n073m704l929l066k394k211
53163B94788k589l181l524l563l644l954m227m085l528k942k673k753k949k986
53149B48190k713k218j789j698k009k597l283l808l843l234k285j516j124q88
53135B15185p15r24j720k659l041k750k339k234k306k282k186k143k061j834j618
53120A84373j622j765j848j921k111k170j727j007p71j360k167k399k000j494
53106A60011j171q86n50l97o36j160j677j912j732j244q12p61j032j311j473j627
53090A41630j744j557j005m86m29p54j009q75m45J3L79P31J132J430J372R77O26
53073A39986O40R00J112J301J661K064K103J722J340J136P53q1j023j601j849
$$ plain form
53058 150164 148061 145625 142903 139906 136632 133383 130684 128669 126904 125097 123625 122903 122507 121459 119355
53043 119355 116750 114314 112034 109447 106429 103474 101217 99858 99023 98117 96838 95429 94457 94318 94892
53028 94892 95597 95784 95192 94098 93034 92299 91775 91157 90278 89192 88068 87069 86183 85151 83690 81945 80561
53011 80561 80112 80519 81216 81803 82326 82900 83326 83281 82779 82272 82230 82732 83516 84310 84960 85252 84924 84075 83354 83367
52991 83367 83962 84494 84793 85365 86408 87198 86942 85919 85217 85423 86193 87079 88110 89282 90016 89642 88307
52974 88307 86954 86380 86498 86594 86173 85493 85266 85853 86857 87583 87778 87685 87441 86802 85688 84762 85109 87235
52956 87235 90443 93287 94719 94933 95053 95928 97310 98416 99058 99805 100980 102070 102413 102082 101680 101599 101971
52939 101971 103084 105185 107811 109915 110925 111294 111753 112346 112597 112448 112655 114149 117113 120747 123947 126304
$$ packed form
53058A50164k103k436k722k997l274l249k699k015j765j807j472p22l96j048k104
53043A19355k605k436k280k587l018k955k257j359q35r06j279j409r72j39N74
53028I4892P05J87n92j094j064p35n24o18q79j086j124r99q86j032j461j745j384
53011H0561m49M07O97N87N23N74M26m5n02n07m2N02P84P94O50K92l28q49p21J3
52991H3367N95N32K99N72J043P90k56j023p02K06P70Q86J031J172P34l74j335
52974H8307j353n74J18R6m21o80k27N87J004P26J95r3k44o39j114r26L47K126
52956H7235L208K844J432K14J20Q75J382J106O42P47J175J090L43l31m02q1L72
52939A01971J113K101K626K104J010L69M59N93K51j49K07J494K964L634L200K357
$$ plain form
52923 126304 128404 131078 134450 137930 141034 143810 146288 147993 148373 147538 146201 144947 143807 142463 140606
52908 140606 138187 135591 133519 132410 132026 131864 131851 132240 132831 132847 131767 129909 127995 126454 125412 124931
52892 124931 124870 124759 124277 123720 123648 124105 124568 124654 124515 124509 124798 125370 126109 126717 126805 126279 125505 124946 124722 124593 124257
52871 124257 123622 122853 122255 122029 122128 122409 122873 123537 124108 124052 123171 121941 121092 120967 121368 121946 122523 123107 123790
52852 123790 124710 125955 127379 128498 128746 128048 127145 127142 128473 130422 131793 132019 131447 130684 129988 129329 128644
52835 128644 127817 126630 125038 123372 122077 121300 120894 120723 120822 121260 121959 122625 122834 122277 121012 119435 117926
52818 117926 116596 115396 114378 113752 113684 114082 114567 114732 114557 114501 115001 115922 116771 117386 118128 119298 120725 122096
52800 122096 123332 124440 125287 125811 126201 126552 126569 125925 124678 123059 121076 118767 116608 115137 114260 113388
$$ packed form
52923A26304K100K674L372L480L104K776K478J705L80q35j337j254j140j344j857
52908A40606k419k596k072j109l84j62j3L89N91J6j080j858j914j541j042m81
52892A24931o1j11m82n57p2M57M63Q6j39oK89N72P39O08Q8n26p74n59k24j29l36
52871A24257o35p69n98k26R9K81M64O64N71n6q81j230q49j25M01N78N77N84O83
52852A23790R20J245J424J119K48o98r03lJ331J949J371K26n72p63o96o59o85
52835A28644q27j187j592j666j295p77m06j71R9M38O99O66K09n57j265j577j509
52818A17926j330j200j018o26o8L98M85J65j75n6N00R21Q49O15P42J170J427J371
52800A22096J236J108Q47N24L90L51J7o44j247j619j983k309k159j471q77q72
$$ plain form
52784 113388 112254 111003 109473 107050 103625 100230 98212 97886 98298 98200 97053 95215 93383 91928 90676
52769 90676 89325 87932 86812 85989 85058 83666 81856 79805 77512 74968 72430 70247 68547 67291 66505
52754 66505 66190 66054 65626 64746 63816 63458 63869 64486 64372 63086 61154 59500 58426 57472 56345 55553 55758
52737 55758 56757 57605 57666 57081 56231 55252 54318 53975 54739 56381 57934 58448 57716 56324 55147 54772 55236 56154
52719 56154 57071 57705 57932 57686 56945 55758 54230 52533 50968 49874 49357 49178 49010 48756 48516 48376 48459 49048
52701 49048 50334 51953 53188 53775 54178 54829 55475 55667 55504 55332 54935 53835 52429 51969 52987 54435 54891
52684 54891 54144 53045 52264 51956 52246 53168 54118 54218 53469 52920 53434 54804 56283 57432 58179 58499 58494 58466 58611
52665 58611 58819 58998 59295 59800 60363 60941 61835 63309 65272 67511 69874 72010 73476 74455 75817 77961
$$ packed form
52784A13388j134j251j530k423l425l395k018l26M12r8j147j838j832j455j252
52769I0676j351j393j120q23r31j392j810k051k293k544k538k183j700j256p86
52754F6505l15j36m28q80r30l58M11O17j14j286j932j654j074r54j127p92K05
52737E5758R99Q48O1n85q50r79r34l43P64J642J553N14p32j392j177l75M64R18
52719E6154R17O34K27k46p41j187j528j697j565j094n17j79j68k54k40j40Q3N89
52701D9048J286J619J235N87M03O51O46J92j63j72l97j100j406m60J018J448M56
52684E4891p47j099p81l08K90R22R50J00p49n49N14J370J479J149P47L20nk8J45
52665E8611K08J79K97N05N63N78Q94J474J963K239K363K136J466R79J362K144
$$ plain form
52649 77961 80044 80970 80753 80175 79502 78410 77016 76008 75646 75516 75434 75801 76758 77718 78108 77940 77295 75871
52631 75871 73543 70833 68377 66342 64790 64031 64038 64026 63351 62494 62399 63038 63406 62903 61973 61326 61159 61296 61536
52612 61536 61610 61225 60390 59401 58420 57426 56646 56613 57583 59230 61032 62651 63821 64291 64109 63664 63293 63118
52594 63118 63349 64267 65649 66643 66609 65809 64964 64393 64000 63841 64180 65094 66379 67844 69334 70557 71250 71526
52576 71526 71743 72036 72276 72497 73061 74272 76014 77895 79679 81543 83870 86694 89361 91070 91886 92834
52560 92834 94548 96170 96143 94070 91277 89518 89539 90941 92829 94358 95093 95243 95397 95874 96510 97127 97848
52543 97848 98769 99674 100322 100801 101349 101990 102561 102914 102967 102707 102317 102070 102059 102235 102767 103928 105452 106551 106898
52524 106898 107119 107811 108476 108097 106549 104781 103665 103336 103658 104555 105637 106128 105652 104753 104215 104172 104206 104053
$$ packed form
52649G7961K083R26k17n78o73j092j394j008l62j30q2L67R57R60L90j68o45j424
52631G5871k328k710k456k035j552p59Pj2o75q57r5O39L68n03r30o47j67J37K40
52612F1536P4l85q35r89r81r94p80l3R70J647J802J619J170M70j82m45l71j75
52594F3118K31R18J382R94l4q00q45n71l93j59L39R14J285J465J490J223O93K76
52576G1526K17K93K40K21N64J211J742J881J784J864K327K824K667J709Q16R48
52560I2834J714J622k7k073k793j759K1J402J888J529P35J50J54M77O36O17P21
52543I7848R21R05O48M79N48O41N71L53N3k60l90k47j1J76N32J161J524J099L47
52524A06898K21O92O65l79j548j768j116l29L22Q97J082M91m76q99n38m3L4j53
$$ plain form
52506 104053 103735 103118 101874 100022 98221 97229 97162 97404 97242 96515 95654 95217 95454 96257 97320 98274 98880 99294
52488 99294 100032 101455 103337 105113 106497 107596 108471 108928 108902 108778 109054 109746 110336 110373 110035 110024 110837 112176
52470 112176 113188 113316 112818 112365 112351 112705 113160 113362 112926 111790 110540 109981 110276 110828 111113 111264 111654 112231
52452 112231 112525 112151 111072 109610 108380 108025 108667 109712 110392 110481 110290 110088 109831 109402 108888 108521 108430 108486
52434 108486 108369 107871 107134 106457 105860 105094 104199 103682 103807 104026 103573 102548 101876 102135 102927 103544 103814 104001
52416 104001 104259 104629 105338 106599 108090 109054 109048 108395 107824 107902 108852 110614 112833 114968 116676 118057 119377
52399 119377 120682 121899 123158 124673 126267 127371 127649 127367 127012 126828 126912 127433 128371 129177 129178 128377 127546 127401
52381 127401 127927 128603 129015 129175 129414 130081 131188 132260 132799 133032 133873 135865 138304 139847 140006 139734 140404
$$ packed form
52506A04053l18o17j244j852j801r92o7K42j62p27q61m37K37Q03J063R54O06M14
52488I9294P38J423J882J776J384J099Q75M57k6j24K76O92N90L7l38j1Q13J339
52470A12176J012J28m98m53j4L54M55K02m36j136j250n59K95N52K85J51L90N77
52452A12231K94l74j079j462j230l55O42J045O80Q9j91k02k57m29n14l67r1N6
52434A08486j17m98p37o77n97p66q95n17J25K19m53j025o72K59P92O17K70J87
52416A04001K58L70P09J261J491R64oo53n71P8R50J762K219K135J708J381J320
52399A19377J305J217J259J515J594J104K78k82l55j84Q4N21R38Q06Jq01q31j45
52381A27401N26O76M12J60K39O67J107J072N39K33Q41J992K439J543J59k72O70
$$ plain form
52364 140404 142443 145148 147615 149557 151193 152729 154204 155717 157424 159213 160636 161439 162034 163219 165377
52349 165377 168086 170517 172131 173027 173811 175070 176868 178726 180149 181108 181910 182760 183650 184534 185303 185715
52333 185715 185747 186007 187313 189772 192662 195384 198047 200877 203581 205821 207932 210543 213600 216456 218989
52318 218989 221965 225974 230486 234521 237994 241872 246928 252840 258732 264336 270214 276997 284852 293771
52304 293771 303945 315487 328002 340761 353282 365487 377419 389094 400597 412031 423411
52293 423411 434918 447142 460514 474439 487486 498750 508678 518351 528312 538335 547929 556579
52281 556579 563741 569080 572791 575485 577784 580041 582137 583495 583647 583004 582599 582695 582138 579661 575545 571360
52265 571360 568261 566189 564633 563417 562562 561985 561657 561790 562645 564375 567001 570253 573564 576691 580310
$$ packed form
52364A40404K039K705K467J942J636J536J475J513J707J789J423Q03N95J185K158
52349A65377K709K431J614Q96P84J259J798J858J423R59Q02Q50Q90Q84P69M12
52333A85715L2K60J306K459K890K722K663K830K704K240K111K611L057K856K533
52318B18989K976M009M512M035L473L878N056N912N892N604N878O783P855Q919
52304B93771J0174J1542J2515J2759J2521J2205J1932J1675J1503J1434J1380
52293D23411J1507J2224J3372J3925J3047J1264R928R673R961J0023R594Q650
52281E56579P162N339L711K694K299K257K096J358J52o43m05R6n57k477m116m185
52265E71360l099k072j556j216q55n77l28J33Q55J730K626L252L311L127L619
$$ plain form
52250 580310 585366 591824 598638 605197 612110 620180 629184 638219 646927 655749 665168 675201 685571 695926
52236 695926 705847 714977 723210 730537 736761 741621 745229 748094 750637 752782 754062 754013 752488 749745 746247
52221 746247 742335 738106 733617 729052 724528 719845 714616 708692 702329 695994 690097 684843 680154 675655
52207 675655 670869 665582 660056 654881 650595 647372 645042 643333 642045 640980 639884 638724 637944 638192 639678
52192 639678 641949 644384 646693 648808 650500 651405 651375 650659 649721 649018 648811 648972 648974 648269 646787 644984 643372
52175 643372 642103 641040 640072 639219 638402 637294 635542 633186 630711 628551 626560 624195 621265 618282 615843
52160 615843 613855 611650 608855 605769 602802 599881 596755 593536 590488 587388 583721 579671 576299 574276
52146 574276 572878 570848 568016 565304 563222 561175 558574 555847 553737 552083 549962 546863 543179 539648
$$ packed form
52250E80310N056O458O814O559O913Q070R004R035Q708Q822R419J0033J0370J0355
52236F95926R921R130Q233P327O224M860L608K865K543K145J280m9j525k743l498
52221G46247l912m229m489m565m524m683n229n924o363o335n897n254m689m499
52207F75655m786n287n526n175m286l223k330j709j288j065j096j160p80K48J486
52192F39678K271K435K309K115J692R05l0p16r38p03k07J61Kp05j482j803j612
52175F43372j269j063r68q53q17j108j752k356k475k160j991k365k930k983k439
52160F15843j988k205k795l086k967k921l126l219l048l100l667m050l372k023
52146E74276j398k030k832k712k082k047k601k727k110j654k121l099l684l531
$$ plain form
52132 539648 536786 534696 532909 530483 526778 522249 518077 515030 513074 511976 511689 512026 512604 513367 514735
52117 514735 516919 519537 522211 525167 528837 533171 537747 542446 547655 553885 561425 570299 580277 591035
52103 591035 602431 614517 627127 639724 651974 664333 677740 692672 708665 724676 739841
52092 739841 754028 767808 781758 795638 808421 819265 828246 835969 842736 848437 853002 856445 858555
52079 858555 859087 858382 857384 856756 856114 854394 850857 845667 839535 832950 825877 818219 810409 803283 797351
52064 797351 792455 788335 785141 783040 781547 779798 777525 775373 774150 774134 775252 777514 780952 785303 790159
52049 790159 795411 801197 807365 813276 818364 822746 826979 831271 835195 838339 840910 843445 846066 848433
52035 848433 850398 852248 854152 855705 856265 855507 853418 850043 845550 840384 834913 828961 821976 813726 804593
$$ packed form
52132E39648k862k090j787k426l705m529m172l047j956j098k87L37N78P63J368
52117E14735K184K618K674K956L670M334M576M699N209O230P540Q874R978J0758
52103E91035J1396J2086J2610J2597J2250J2359J3407J4932J5993J6011J5165
52092G39841J4187J3780J3950J3880J2783J0844Q981P723O767N701M565L443K110
52079H58555N32p05r98o28o42j720l537n190o132o585p073p658p810p126n932
52064G97351m896m120l194k101j493j749k273k152j223j6J118K262L438M351M856
52049G90159N252N786O168N911N088M382M233M292L924L144K571K535K621K367
52035H48433J965J850J904J553N60p58k089l375m493n166n471n952o985q250r133
$$ plain form
52020 804593 795144 785613 775833 765557 754723 743477 731951 720064 707697 695056 682620 670523
52008 670523 658285 645409 632069 618862 605958 592934 579461 565763 552229 538866 525399
51997 525399 511773 498334 485478 473197 461000 448318 434973 421263 407642 394470 382025
51986 382025 370429 359419 348469 337392 326607 316568 307175 298039 289068 280449 272230 264380 257110
51973 257110 250696 245038 239867 235245 231308 227567 223189 218193 213745 210803 208916 206757 203574 199764
51959 199764 196217 193435 191168 188706 185649 182462 180016 178526 177302 175712 173925 172439 171311 170278
51945 170278 169228 168079 166482 164211 161643 159318 157198 154926 152649 150865 149448 147561 144765 141638
51931 141638 139070 137457 136826 137091 137742 137814 136794 135284 134139 133198 131567 129115 126983 126332 127083 128165
$$ packed form
52020H04593r449r531r780j0276j0834j1246j1526j1887j2367j2641j2436j2097
52008F70523j2238j2876j3340j3207j2904j3024j3473j3698j3534j3363j3467
51997E25399j3626j3439j2856j2281j2197j2682j3345j3710j3621j3172j2445
51986C82025j1596j1010j0950j1077j0785j0039r393r136q971q619q219p850p270
51973B57110o414n658n171m622l937l741m378m996m448k942j887k159l183l810
51959A99764l547k782k267k462l057l187k446j490j224j590j787j486j128j033
51945A70278j050j149j597k271k568k325k120k272k277j784j417j887k796l127
51931A41638k568j613o31K65O51P2j020j510j145r41j631k452k132o51P51J082
$$ plain form
51915 128165 128632 128272 127397 126431 125633 124955 124213 123454 122976 122808 122474 121581 120472 119843 119752 119454 118342 116653
51897 116653 115033 113739 112612 111608 110911 110541 110227 109775 109315 109001 108666 108005 107081 106379 106242 106369 106106
51880 106106 105248 104330 104030 104434 105116 105751 106334 106818 106976 106842 106881 107467 108396 109243 109971 110772 111455 111564 111213
51861 111213 111273 112448 114491 116692 118830 121139 123377 124566 124085 122649 121659 121595 121574 120754 119633 119344 119981
51844 119981 120402 119763 118499 117427 116573 115514 114385 113788 113841 114128 114580 115702 117754 120290 122765 125053
51828 125053 127120 128666 129504 129938 130395 130920 131355 131758 132228 132520 132222 131268 130023 128944 128331 128224 128303 128068
51810 128068 127418 126912 127076 127619 127735 127137 126359 125958 125877 125803 125786 126187 127123 128283 129298 130061 130638 131020 131108
51791 131108 130941 130764 130809 131088 131544 132304 133501 134890 135952 136538 137149 138338 140021 141706 143242 145022
$$ packed form
51915A28165M67l60q75r66p98o78p42p59m78j68l34q93j109o29r1k98j112j689
51897A16653j620j294j127j004o97l70l14m52m60l14l35o61r24p02j37J27k63
51880A06106q58r18l00M04O82O35N83M84J58j34L9N86R29Q47P28Q01O83J09l51
51861A11213O0J175K043K201K138K309K238J189m81j436r90o4k1q20j121k89O37
51844A19981M21o39j264j072q54j059j129n97N3K87M52J122K052K536K475K288
51828A25053K067J546Q38M34M57N25M35M03M70K92k98r54j245j079o13j07P9k35
51810A28068o50n06J64N43J16n98p78m01q1p4j7M01R36J160J015P63N77L82Q8
51791A31108j67j77M5K79M56P60J197J389J062N86O11J189J683J685J536J780
$$ plain form
51775 145022 147414 150269 153049 155299 156953 158367 160116 162658 166093 170187 174504 178463 181517 183563
51761 183563 185017 186219 186865 186358 184689 182561 180581 178737 176852 175184 174217 174085 174494 175129 175842 176520
51745 176520 177134 177945 179354 181375 183449 184996 186024 187031 188304 189567 190385 190716 190856 190930 190724 190055
51729 190055 189106 188268 187819 187853 188336 188975 189224 188741 187813 187073 186803 186780 186798 186970 187403 187910 188305 188633 188847 188520
51709 188520 187358 185819 184726 184229 183669 182618 181565 181192 181325 181184 180570 180207 180719 181711 182222 181859 181108
51692 181108 180611 180526 180700 181134 182107 183975 186990 191135 195911 200403 203826 206073 207563 208567 208905 208366
51676 208366 207162 205744 204337 202870 201303 199695 197903 195515 192274 188389 184299 180292 176567 173458
51662 173458 171180 169386 167341 164721 161971 159759 158305 157459 157151 157381 157857 157986 157325 155891 154038 152181
$$ packed form
51775A45022K392K855K780K250J654J414J749K542L435M094M317L959L054K046
51761A83563J454J202O46n07j669k128j980j844j885j668r67j32M09O35P13O78
51745A76520O14Q11J409K021K074J547J028J007J273J263Q18L31J40P4k06o69
51729A90055r49q38m49L4M83O39K49m83r28p40k70k3J8J72M33N07L95L28K14l27
51709A88520j162j539j093m97n60j051j053l73J33j41o14l63N12R92N11l63p51
51692A81108m97q5J74M34R73J868L015M145M776M492L423K247J490J004L38n39
51676B08366j204j418j407j467j567j608j792k388l241l885m090m007l725l109
51662A73458k278j794k045k620k750k212j454q46l08K30M76J29o61j434j853j857
$$ plain form
51646 152181 150620 149468 148673 148131 147648 146787 145018 142358 139613 137640 136473 135579 134823 134564 134793 134859 134385
51629 134385 133865 133929 134446 134834 134946 135053 135176 135048 134644 134177 133533 132319 130670 129476 129476 130408 131393 131910 132108
51610 132108 132279 132411 132317 132001 131768 132014 132919 134381 136198 138240 140387 142394 144024 145319 146587 148103
51594 148103 149951 152160 154774 157660 160362 162391 163681 164682 165961 167701 169548 170913 171369 170770 169176
51579 169176 166838 164273 162106 160696 159968 159648 159459 159063 158173 157019 156413 156945 158217 159288 159813 160324
51563 160324 161434 163280 165860 169339 173624 177970 181402 183380 183877 183156 181875 181103 181581 182848 183537
51548 183537 182774 181080 179766 179702 180766 182217 183338 183825 183936 184300 185397 187065 188629 189556 189901 190023
51532 190023 189991 189491 188304 186607 184722 182742 180613 178436 176442 174685 172986 171190 169335 167516 165795
$$ packed form
51646A52181j561j152p95n42m83q61j769k660k745j973j167q94p56k59K29O6m74
51629A34385n20O4N17L88J12J07J23j28m04m67o44j214j649j194%R32R85N17J98
51610A32108J71J32r4l16k33K46R05J462J817K042K147K007J630J295J268J516
51594A48103J848K209K614K886K702K029J290J001J279J740J847J365M56n99j594
51579A69176k338k565k167j410p28l20j89l96q90j154o06N32J272J071N25N11
51563A60324J110J846K580L479M285M346L432J978M97p21j281p72M78J267O89
51548A83537p63j694j314o4J064J451J121M87J11L64J097J668J564R27L45J22
51532A90023l2n00j187j697j885j980k129k177j994j757j699j796j855j819j721
$$ plain form
51517 165795 164270 163039 162026 160995 159832 158671 157627 156565 155303 153996 153123 153106 153962 155291 156578
51502 156578 157593 158518 159629 160818 161590 161671 161491 161851 163083 164695 165883 166293 166265 166416 167143 168504 170471
51485 170471 173062 176132 179181 181617 183304 184774 186789 189752 193472 197419 201118 204447 207643 210999
51471 210999 214499 217807 220652 223110 225435 227648 229462 230655 231471 232471 233918 235411 236348 236691 236935
51456 236935 237236 237018 235775 233933 232339 231094 229532 227396 225342 223945 222790 220995 218254 214930 211356
51441 211356 207591 203740 200058 196721 193812 191459 189674 188101 186254 184018 181714 179726 178303 177622
51427 177622 177682 178127 178470 178552 178584 178788 179242 180010 181118 182408 183727 185242 187212 189407 191130 191911 191853 191236
51409 191236 190137 188629 186923 185039 182634 179485 175875 172227 168538 164598 160580 156968 153907 151058
$$ packed form
51517A65795j525j231j013j031j163j161j044j062j262j307q73j7Q56J329J287
51502A56578J015R25J111J189P72Q1j80L60J232J612J188M10k8J51P27J361J967
51485A70471K591L070L049K436J687J470K015K963L720L947L699L329L196L356
51471B10999L500L308K845K458K325K213J814J193Q16J000J447J493R37L43K44
51456B36935L01k18j243j842j594j245j562k136k054j397j155j795k741l324l574
51441B11356l765l851l682l337k909k353j785j573j847k236k304j988j423o81
51427A77622O0M45L43Q2L2K04M54P68J108J290J319J515J970K195J723P81n8o17
51409A91236j099j508j706j884k405l149l610l648l689l940m018l612l061k849
$$ plain form
51395 151058 148257 145935 144548 143744 142481 140059 136852 133848 131640 130066 128732 127488 126237 124732
51381 124732 122918 121283 120364 119970 119341 118176 117037 116536 116546 116474 116020 115317 114549 113806 113194 112795 112542 112278
51363 112278 111876 111210 110204 109087 108384 108409 108911 109405 109630 109424 108467 106591 104276 102422 101607 101798 102659
51346 102659 103822 104928 105824 106707 107738 108607 108867 108683 108791 109710 111398 113666 116358 118981 120768 121452
51330 121452 121624 122079 123184 125007 127471 129963 131389 131257 130434 130181 130570 130390 128542 125064 120876 117012
51314 117012 114073 111946 109937 107522 104953 102833 101270 99974 99036 98811 98911 98093 95639 92383 89872
51299 89872 88829 88843 89166 89257 88752 87562 86109 85057 84695 84790 85047 85443 85988 86444 86505 86218 86123 86847 88434
51280 88434 90118 91010 91088 91234 92086 93150 93404 92570 91359 90518 90138 89982 90003 90256 90589 90769 90758 90606 90171
$$ packed form
51395A51058k801k322j387q04j263k422l207l004k208j574j334j244j251j505
51381A24732j814j635r19l94o29j165j139n01J0p2m54p03p68p43o12l99k53k64
51363A12278m02o66j006j117p03K5N02M94K25k06r57j876k315j854q15J91Q61
51346A02659J163J106Q96Q83J031Q69K60j84J08R19J688K268K692K623J787O84
51330A21452J72M55J105J823K464K492J426j32q23k53L89j80j848l478m188l864
51314A17012k939k127k009k415k569k120j563j296r38k25J00q18k454l256k511
51299H9872j043J4L23R1n05j190j453j052l62R5K57L96N45M56O1k87r5P24J587
51280H8434J684Q92P8J46Q52J064K54q34j211q41l80j56K1K53L33J80j1j52m35
$$ plain form
51261 90171 89240 87892 86533 85489 84724 84053 83487 83188 83134 83039 82709 82346 82336 82800 83539 84309 84871 84847 84004
51242 84004 82908 82775 84229 86467 88156 88971 89668 90769 91896 92574 92983 93462 93772 93379 92278 91038
51226 91038 90140 89694 89719 90284 91244 92170 92743 93129 93828 95182 96976 98555 99375 99500 99422 99436 99370 98976 98290
51207 98290 97506 96840 96770 97963 100515 103439 105454 106195 106230 106038 105572 104869 104360 104278 104270 104002 103764 104018 104582
51188 104582 104715 103953 102530 101035 99937 99384 99149 98777 98000 97001 96075 95068 93444 90955 88074 85645
51172 85645 84187 83577 83329 83135 83126 83569 84379 85118 85513 85737 85961 85922 85253 84120 83122 82567 82195 81718 81288
51153 81288 81330 82068 83391 84977 86503 87861 89215 90677 91939 92496 92234 91547 90771 89846 88680 87511
51137 87511 86671 86248 86208 86578 87213 87626 87399 86653 85786 84898 83856 82772 81983 81593 81435 81519 82084 83098 84121
$$ packed form
51261I0171r31j348j359j044p65o71n66k99n4r5l30l63j0M64P39P70N62k4q43
51242H4004j096j33J454K238J689Q15O97J101J127O78M09M79L10l93j101j240
51226I1038q98m46K5N65R60R26N73L86O99J354J794J579Q20J25p8J4o6l94o86
51207I8290p84o66p0J193K552K924K015P41L5j92m66p03n09q2qk68k38K54N64
51188A04582J33p62j423j495j098n53k35l72p77r99r26j007j624k489k881k429
51172H5645j458o10k48j94rM43Q10P39L95K24K24l9o69j133r98n55l72m77m30
51153H1288M2P38J323J586J526J358J354J462J262N57k62o87p76r25j166j169
51137H7511q40m23m0L70O35M13k27p46q67q88j042j084p89l90j58Q4N65J014J023
$$ plain form
51118 84121 84833 85330 85740 85819 85269 84229 83247 82827 83078 83644 83982 83969 84248 85581 87707 89384 89862 89840 90493
51099 90493 91923 93221 93763 93784 93766 94026 94970 96935 99371 100852 100436 98698 96981 95980 95520 95383 95650
51082 95650 96247 96813 97217 97767 98676 99693 100533 101383 102698 104609 106843 109093 111124 112588 113104 112724 112075
51065 112075 111836 112113 112500 112689 112794 113033 113251 112947 111769 109971 108310 107453 107403 107526 107249 106706 106533 107001
51047 107001 107581 107555 106852 106026 105484 105061 104402 103450 102474 101842 101925 102901 104397 105508 105598 105065 105034 106197 108167
51028 108167 110005 111169 111827 112461 113405 114668 116018 117147 117867 118160 118124 117982 118162 119135 121003 123327 125516
51011 125516 127390 129230 131377 133906 136636 139296 141684 143849 146063 148468 150825 152843 154724 157030
50997 157030 160018 163474 167337 171919 177227 182585 187491 192532 198760 206310 214350 222467 231318 241600
$$ packed form
51118H4121P12M97M10P9n50j040r82m20K51N66L38j3K79J333K126J677M78k2O53
51099I0493J430J298N42K1j8K60R44J965K436J481m16j738j717j001m60j37K67
51082I5650N97N66M04N50R09J017Q40Q50J315J911K234K250K031J464N16l80o49
51065A12075k39K77L87J89J05K39K18l04j178j798j661q57n0J23k77n43j73M68
51047A07001N80k6p03q26n42m23o59r52r76o32Q3R76J496J111R0n33l1J163J970
51028A08167J838J164O58O34R44J263J350J129P20K93l6j42J80R73J868K324K189
51011A25516J874J840K147K529K730K660K388K165K214K405K357K018J881K306
50997A57030K988L456L863M582N308N358M906N041O228P550Q040Q117Q851J0282
$$ plain form
50983 241600 253069 265059 277531 291060 306054 322600 340965 361656 384898 410418 437904
50972 437904 467496 499727 535029 573246 613507 654741 696487 739048 782666 826705 869836
50961 869836 910822 948895 983601 1014677 1041956 1065083 1083486 1097032 1106495 1112871 1116414 1116985
50949 1116985 1115337 1113256 1112177 1112205 1112791 1113794 1115423 1117548 1119573 1120803 1120631 1118574 1114364 1107773 1098105
50934 1098105 1084174 1065144 1041182 1012974 980907 945102 906026 864576 821674 778177 735049
50923 735049 693154 652824 614047 577140 542894 511943 484226 459211 436528 416328 399060
50912 399060 384840 373012 362505 352745 344058 337022 331719 327819 325145 323686 323233 323415 324077 325179
50898 325179 326315 326688 325728 323589 321033 318926 317692 317014 316220 315172 314549 314971 316170 317539 319207 321826
$$ packed form
50983B41600J1469J1990J2472J3529J4994J6546J8365K0691K3242K5520K7486
50972D37904K9592L2231L5302L8217M0261M1234M1746M2561M3618M4039M3131
50961H69836M0986L8073L4706L1076K7279K3127J8403J3546R463O376L543N71
50949A116985j648k081j079K8N86J003J629K125K025J230j72k057m210o591r668
50934A098105j3931j9030k3962k8208l2067l5805l9076m1450m2902m3497m3128
50923G35049m1895m0330l8777l6907l4246l0951k7717k5015k2683k0200j7268
50912C99060j4220j1828j0507r760q687p036n303l900k674j459m53J82O62J102
50898C25179J136L73r60k139k556k107j234o78p94j048o23M22J199J369J668K619
$$ plain form
50882 321826 325392 329051 332283 335587 339758 345078 351531 359190 367982 377509 387588 398641 411186
50869 411186 425264 440741 457809 476709 497275 519345 543532 571058 602836 639114 679985
50858 679985 725827 777184 834556 898371 968887 1045966 1129078 1217507 1310453 1407041 1506427
50847 1506427 1607740 1709622 1809829 1905480 1993766 2072386 2139606 2194359 2236345 2265841 2283407
50836 2283407 2289960 2287075 2276981 2262201 2245258 2228502 2213953 2203347 2198418 2200690 2210438 2225967
50824 2225967 2244396 2263122 2279991 2292246 2296265 2288938 2268878 2235979 2190274 2131786 2061205 1980072
50812 1980072 1890258 1793625 1692172 1588153 1483919 1381849 1284299 1193268 1109959 1034774
50802 1034774 967722 908679 857399 813616 777157 747712 724449 706194 692153 682252 676568 674657
$$ packed form
50882C21826L566L659L232L304M171N320O453P659Q792R527J0079J1053J2545
50869D11186J4078J5477J7068J8900K0566K2070K4187K7526L1778L6278M0871
50858F79985M5842N1357N7372O3815P0516P7079Q3112Q8429R2946R6588R9386
50847A506427J01313J01882J00207R5651Q8286P8620O7220N4753M1986K9496J7566
50836B283407O553k885j0094j4780j6943j6756j4549j0606m929K272R748J5529
50824B225967J8429J8726J6869J2255M019p327k0060l2899m5705n8488p0581q1133
50812A980072q9814r6633j01453j04019j04234j02070r7550r1031q3309p5185
50802A034774o7052n9043n1280m3783l6459k9445k3263j8255j4041r901n684j911
$$ plain form
50790 674657 675635 678769 683652 689870 696797 703823 710542 716568 721298 724083 724591 722899 719235 713729 706397
50775 706397 697210 686111 673135 658679 643562 628530 613660 598478 582837 567541 553804 542137
50763 542137 532020 522748 514337 507457 502627 499747 498397 498415 500139 504216 511221 521303 534069 548761
50749 548761 564622 581240 598813 618203 640555 666596 696304 729422 766234 807526 853790
50738 853790 904838 960316 1020253 1084691 1152954 1223530 1294550 1364129 1430400 1491691 1546725
50727 1546725 1594418 1633579 1663176 1682907 1693063 1693656 1684150 1664421 1635822 1601076 1563319 1525405
50715 1525405 1489835 1458738 1433697 1415586 1404488 1399715 1400120 1404637 1412397 1422077 1431338 1437336 1437903
50702 1437903 1431974 1418918 1397833 1367758 1328368 1280388 1225536 1166258 1105232 1044676 985945
$$ packed form
50790F74657R78L134M883O218O927P026O719O026M730K785N08j692l664n506p332
50775G06397r187j1099j2976j4456j5117j5032j4870j5182j5641j5296j3737j1667
50763E42137j0117r272q411o880m830k880j350J8J724M077P005J0082J2766J4692
50749E48761J5861J6618J7573J9390K2352K6041K9708L3118L6812M1292M6264
50738H53790N1048N5478N9937O4438O8263P0576P1020O9579O6271O1291N5034
50727A546725M7693L9161K9597J9731J0156N93r506j9729k8599l4746l7757l7914
50715A525405l5570l1097k5041j8111j1098m773M05M517P760R680R261N998N67
50702A437903n929j3056k1085l0075l9390m7980n4852n9278o1026o0556n8731
$$ plain form
50691 985945 929858 877397 829908 788489 753253 723390 698026 677030 660938 650246 644917 644480
50679 644480 648319 655804 666472 680397 698179 720202 745853 773680 802289 830908 859155 886624
50667 886624 912799 937053 958624 976900 991929 1004436 1015079 1023887 1030613 1035449 1039013 1041741
50655 1041741 1043667 1044858 1045796 1047211 1049777 1054023 1060349 1068960 1079916 1093345 1109482 1128418 1149940
50642 1149940 1173715 1199518 1227057 1255662 1284317 1312111 1338515 1363165 1385423 1404269 1418774
50631 1418774 1428752 1434923 1438251 1439109 1437323 1433222 1428388 1425037 1424679 1427638 1433807 1443407 1456754 1473574
50617 1473574 1492780 1512777 1531836 1548472 1561852 1571733 1577761 1579025 1574764 1565395 1552315 1536526
50605 1536526 1517831 1495483 1469064 1438397 1403100 1362874 1318153 1269971 1219211 1166384 1112166
$$ packed form
50691I85945n6087n2461m7489m1419l5236k9863k5364k0996j6092j0692n329m37
50679F44480L839P485J0668J3925J7782K2023K5651K7827K8609K8619K8247K7469
50667H86624K6175K4254K1571J8276J5029J2507J0643Q808O726M836L564K728
50655A041741J926J191R38J415K566M246O326Q611J0956J3429J6137J8936K1522
50642A149940K3775K5803K7539K8605K8655K7794K6404K4650K2258J8846J4505
50631A418774R978O171L328Q58j786m101m834l351l58K959O169R600J3347J6820
50617A473574J9206J9997J9059J6636J3380R881O028J264m261r369j3080j5789
50605A536526j8695k2348k6419l0667l5297m0226m4721m8182n0760n2827n4218
$$ plain form
50594 1112166 1057686 1004098 952178 902517 855811 812647 773139 736976 703840 673654 646544
50583 646544 622706 602253 585016 570545 558384 548311 540239 534009 529483 526786 526153 527491 530263
50570 530263 533979 538625 544445 551447 559454 568642 579669 593012 608353 624936 642527 661695 683121
50557 683121 706919 732816 760666 790413 821638 853549 885515 917299 948680 979171 1008446
50546 1008446 1036876 1065334 1094526 1124772 1156411 1190078 1226401 1265581 1307415 1351579 1397796
50535 1397796 1445916 1496089 1548777 1604366 1662807 1723832 1787476 1854083 1923677 1995567 2068579
50524 2068579 2141339 2212193 2279176 2340478 2394790 2440947 2477483 2503002 2516900 2519282 2510085 2488746
50512 2488746 2454880 2408965 2352303 2286776 2214892 2139619 2063686 1989168 1917984 1852444 1794782
$$ packed form
50594A112166n4480n3588n1920m9661m6706m3164l9508l6163l3136l0186k7110
50583F46544k3838k0453j7237j4471j2161j0073q072o230m526k697o33J338K772
50570E30263L716M646N820P002Q007R188J1027J3343J5341J6583J7591J9168K1426
50557F83121K3798K5897K7850K9747L1225L1911L1966L1784L1381L0491K9275
50546A008446K8430K8458K9192L0246L1639L3667L6323L9180M1834M4164M6217
50535A397796M8120N0173N2688N5589N8441O1025O3644O6607O9594P1890P3012
50524B068579P2760P0854O6983O1302N4312M6157L6536K5519J3898K382r197k1339
50512B488746l3866m5915n6662o5527p1884p5273p5933p4518p1184o5540n7662
$$ plain form
50501 1794782 1746219 1706863 1676548 1655370 1643392 1640145 1644562 1655215 1670568 1689304 1710551 1733638
50489 1733638 1757481 1780160 1799018 1811113 1813782 1805084 1783885 1749541 1701786 1641268 1570055 1491276
50477 1491276 1408203 1323780 1240714 1161300 1086834 1017514 953127 893671 839322 790238 746675
50466 746675 708915 676709 649028 624740 603484 585643 571511 560792 552796 546878 542630 539827
50454 539827 538288 537784 538178 539696 542820 547750 554108 561344 569310 578201 588066 598657 609736 621305
50440 621305 633542 646701 661037 676588 693040 710039 727642 746262 766177 787371 809870
50429 809870 833909 859669 887129 916362 947662 981059 1015956 1051623 1088058 1125947 1165823
50418 1165823 1207653 1251408 1297500 1346166 1396616 1447256 1496738 1544376 1589575 1631475 1669397
$$ packed form
50501A794782m8563l9356l0315k1178j1978l247M417J0653J5353J8736K1247K3087
50489A733638K3843K2679J8858J2095K669q698k1199l4344m7755o0518p1213p8779
50477A491276q3073q4423q3066p9414p4466o9320o4387n9456n4349m9084m3563
50466G46675l7760l2206k7681k4288k1256j7841j4132j0719p996n918m248k803
50454E39827j539n04L94J518L124M930O358P236P966Q891R865J0591J1079J1569
50440F21305J2237J3159J4336J5551J6452J6999J7603J8620J9915K1194K2499
50429H09870K4039K5760K7460K9233L1300L3397L4897L5667L6435L7889L9876
50418A165823M1830M3755M6092M8666N0450N0640M9482M7638M5199M1900L7922
$$ plain form
50407 1669397 1703041 1731764 1754080 1768594 1775306 1775331 1769234 1756240 1735246 1706056 1669249 1625327
50395 1625327 1574504 1517228 1454502 1387765 1318685 1248981 1180221 1113830 1051268 993880 942439
50384 942439 897163 858402 826963 803366 787161 777436 773796 776308 784640 797779 814555 833904
50372 833904 854617 875296 894595 911056 922802 928000 925848 916638 900883 879058 852360 822905
50360 822905 792592 762170 731780 701832 672764 644455 616698 590111 565791 544143 524733
50349 524733 507293 492097 479122 467520 456445 445994 436853 429231 422611 416528 411180 407151 404695
50336 404695 403550 403377 404181 406120 409018 412484 416578 421940 428842 436480 443754 450587 457789 465699 473831
50321 473831 482116 491588 503085 515862 528398 540307 552557 565876 579872 594000 608546 624160
$$ packed form
50407A669397L3644K8723K2316J4514O712K5o097j2994k0994k9190l6807m3922
50395A625327n0823n7276o2726o6737o9080o9704o8760o6391o2562n7388n1441
50384I42439m5276l8761l1439k3597j6205r725l640K512Q332J3139J6776J9349
50372H33904K0713K0679J9299J6461J1746N198k152r210j5755k1825k6698k9455
50360H22905l0313l0422l0390k9948k9068k8309k7757k6587k4320k1648j9410
50349E24733j7440j5196j2975j1602j1075j0451r141p622o620o083n348m029k456
50336D04695j145j73Q04J939K898L466M094N362O902P638P274O833P202P910Q132
50321D73831Q285R472J1497J2777J2536J1909J2250J3319J3996J4128J4546J5614
$$ plain form
50309 624160 640893 658314 676229 694732 713646 732450 750764 768569 785845 802273 817305
50298 817305 830413 841240 849730 856130 860690 863295 863421 860327 853240 841580 825335 805159 781952
50285 781952 756484 729730 703328 679061 657703 638689 621003 604023 587480 571233 555550
50274 555550 541279 529199 519244 510681 502985 496343 491337 488370 487285 487365 487824 488459 489659 491571 493564
50259 493564 494862 495499 496254 497728 499794 501818 503055 503022 501947 500735 499987 499180 497373 494633 492005 489992
50243 489992 487882 484876 481111 477112 472940 468552 464397 460927 457823 454512 451257 449025 448311 448680 449343
50228 449343 449639 449132 448002 447355 448363 450896 453638 455730 457633 460079 462888 465295 467000 468343 469750
50213 469750 471404 473189 474550 474722 473462 471277 468589 465073 460316 454773 449341 444205 438792 432838
$$ packed form
50309F24160J6733J7421J7915J8503J8914J8804J8314J7805J7276J6428J5032
50298H17305J3108J0827Q490O400M560K605J26l094p087j1660j6245k0176k3207
50285G81952k5468k6754k6402k4267k1358j9014j7686j6980j6543j6247j5683
50274E55550j4271j2080r955q563p696o642n006k967j085Q0M59O35J200J912J993
50259D93564J298O37P55J474K066K024J237l3j075j212p48q07j807k740k628k013
50243D89992k110l006l765l999m172m388m155l470l104l311l255k232p14L69O63
50228D49343K96n07j130o47J008K533K742K092J903K446K809K407J705J343J407
50213D69750J654J785J361J72j260k185k688l516m757n543n432n136n413n954
$$ plain form
50199 432838 426758 420870 414926 408721 402606 397025 391953 387126 382485 377990 373355 368354 363282 358738
50185 358738 355015 351933 349117 346216 343011 339589 336311 333361 330485 327468 324712 322950 322451 322778 323268
50170 323268 323339 322438 320225 316937 313180 309252 305106 301046 297772 295330 292607 288546 283601 279326 276616
50155 276616 274978 273489 271782 269976 268277 266976 266361 266258 266017 265335 264722 264764 265208 265299 264776 264004 263196
50138 263196 262158 260926 260153 260601 262500 265550 269197 272769 275710 278009 280238 282983 286420 290584 295659
50123 295659 301644 307958 313819 319010 323947 329060 334421 339900 345267 350106 354047 357335 360848 365304
50109 365304 370588 376056 381290 386269 390989 395259 398986 402469 406212 410467 414969 419094 422406 425133
50095 425133 428088 432049 437204 443184 449462 455607 461299 466371 470903 475204 479703 484929 491420 499372
$$ packed form
50199D32838o080n888n944o205o115n581n072m827m641m495m635n001n072m544
50185C58738l723l082k816k901l205l422l278k950k876l017k756j762m99L27M90
50170C23268P1r01k213l288l757l928m146m060l274k442k723m061m945m275k710
50155B76616j638j489j707j806j699j301o15j03k41o82o13M2M44R1n23p72q08
50138B63196j038j232p73M48J899L050L647L572K941K299K229K745L437M164N075
50123B95659N985O314N861N191M937N113N361N479N367M839L941L288L513M456
50109C65304N284N468N234M979M720M270L727L483L743M255M502M125L312K727
50095D25133K955L961N155N980O278O145N692N072M532M301M499N226O491P952
$$ plain form
50081 499372 508444 518190 528759 540883 555114 571387 589561 610060 633631 660670 691173 725317
50069 725317 763676 806786 854849 908009 966545 1030431 1098722 1169480 1240239 1308486 1371921
50058 1371921 1428545 1476744 1515537 1545126 1567182 1584243 1598514 1611298 1623419 1635540 1647569
50047 1647569 1658055 1664666 1665081 1657127 1638526 1607545 1564135 1509964 1447259 1378218 1305592 1232808
50035 1232808 1162683 1096357 1034037 976434 924774 879634 840514 806614 777433 752524 731260
50024 731260 713154 698048 685737 675657 667148 659876 653878 649328 646260 644293 642612 640497 637918
50011 637918 635303 632718 629621 625554 620679 615386 609688 603288 596033 588042 579587 571078 562939 555255
49997 555255 547679 539956 532313 525140 518505 512327 506782 502093 498033 494082 490127 486585 483843 481927
$$ packed form
50081D99372R072R746J0569J2124J4231J6273J8174K0499K3571K7039L0503L4144
50069G25317L8359M3110M8063N3160N8536O3886O8291P0758P0759O8247O3435
50058A371921N6624M8199L8793K9589K2056J7061J4271J2784J2121J2121J2029
50047A647569J0486O611M15p954j8601l0981m3410n4171o2705o9041p2626p2784
50035A232808p0125o6326o2320n7603n1660m5140l9120l3900k9181k4909k1264
50024G31260j8106j5106j2311j0080q509p272n998m550l068j967j681k115k579
50011F37918k615k585l097m067m875n293n698o400p255p991q455q509q139p684
49997E55255p576p723p643p173o635o178n545m689m060l951l955l542k742j916
$$ plain form
49983 481927 480782 480421 480697 481340 482449 484604 488166 492684 497318 501699 506080 510774 515790 521102 526969
49968 526969 533789 541690 550322 559067 567493 575689 584233 593861 605241 619010 635793 656054 680031
49955 680031 707977 740457 778291 822255 873015 931297 997824 1072764 1155181 1243042 1333732
49944 1333732 1424519 1512635 1595239 1669793 1734885 1790878 1839709 1883898 1925565 1966170 2006682
49933 2006682 2047453 2087723 2125465 2157994 2182594 2196467 2196552 2180304 2147114 2098676 2037609 1965949
49921 1965949 1885314 1798078 1707511 1616465 1526396 1437883 1351599 1268400 1188835 1113148 1041700
49910 1041700 975006 913377 856826 805285 758639 716636 679032 645791 616856 591766 569760
49899 569760 550190 532512 516071 500435 486013 473685 463542 454409 444943 434838 424587 414553
$$ packed form
49983D81927j145l61K76O43J109K155L562M518M634M381M381M694N016N312N867
49968E26969O820P901Q632Q745Q426Q196Q544R628J1380J3769J6783K0261K3977
49955F80031K7946L2480L7834M3964N0760N8282O6527P4940Q2417Q7861R0690
49944A333732R0787Q8116Q2604P4554O5092N5993M8831M4189M1667M0605M0512
49933B006682M0771M0270L7742L2529K4600J3873Q5j6248l3190m8438o1067p1660
49921A965949q0635q7236r0567r1046r0069q8513q6284q3199p9565p5687p1448
49910A041700o6694o1629n6551n1541m6646m2003l7604l3241k8935k5090k2006
49899E69760j9570j7678j6441j5636j4422j2328j0143r133r466j0105j0251j0034
$$ plain form
49887 414553 404814 395615 387228 379396 371540 363632 356345 350084 344354 338428 332305 326649 321942 318097
49873 318097 314787 311799 309055 306577 304550 303225 302683 302809 303468 304566 305901 307252 308671 310492 312922
49858 312922 315778 318759 321752 324741 327635 330429 333288 336122 338281 339252 339661 341016 344197 348622 353170
49843 353170 357503 362101 367435 373720 381284 390504 401303 413301 426606 442114 460859 483491 510544
49830 510544 542753 580769 624742 674452 729555 789406 852793 918078 983403 1046554 1104936
49819 1104936 1156214 1199057 1233139 1258770 1277062 1290356 1301769 1313833 1327611 1343060 1359633
49808 1359633 1376038 1389624 1396620 1393327 1377202 1347058 1302833 1245525 1177385 1101883 1023128 944950
49796 944950 870107 800076 735471 676660 624040 577873 538088 504329 476034 452326 431953
$$ packed form
49887D14553r739r199q387p832p856p908p287o261n730n926o123n656m707l845
49873C18097l310k988k744k478k027j325n42J26O59J098J335J351J419J821K430
49858C12922K856K981K993K989K894K794K859K834K159R71M09J355L181M425M548
49843C53170M333M598N334O285P564R220J0799J1998J3305J5508J8745K2632K7053
49830E10544L2209L8016M3973M9710N5103N9851O3387O5285O5325O3151N8382
49819A104936N1278M2843L4082K5631J8292J3294J1413J2064J3778J5449J6573
49808A359633J6405J3586O996l293j6125l0144m4225n7308o8140p5502p8755p8178
49796I44950p4843p0031o4605n8811n2620m6167l9785l3759k8295k3708k0373
$$ plain form
49785 431953 413734 397216 382704 370430 359871 350113 340812 332440 325499 319732 314350 308904 303705
49772 303705 299351 296009 293309 290911 288909 287518 286474 285153 283376 281789 281127 281312 281593 281438 280927
49757 280927 280326 279780 279533 280032 281506 283604 285632 287037 287620 287589 287560 288215 289686 291329 292362 292670 292862
49740 292862 293616 295111 297018 298904 300625 302341 304124 305697 306709 307163 307323 307270 306906 306352 305951 305813
49724 305813 305768 305797 306014 306115 305524 304394 303827 304554 305898 306645 306531 306222 306169 306275 306571 307366 308647 309912
49706 309912 310763 311223 311505 311982 313292 315814 318902 321298 322483 323110 323966 325112 326246 327262 328004 328060
49690 328060 327325 326447 326214 326720 327428 327812 327627 326878 325949 325539 326002 326887 327458 327501 327285 326974 326538 326161 326203
49671 326203 326662 327050 326954 326470 325973 325670 325502 325346 325154 324961 324863 324971 325389 326136 327045 327796 328151 328154 327999 327796
$$ packed form
49785D31953j8219j6518j4512j2274j0559r758r301q372o941n767n382n446n199
49772C03705m354l342k700k398k002j391j044j321j777j587o62J85K81j55n11
49757B80927o01n46k47M99J474K098K028J405N83l1k9O55J471J643J033L08J92
49740B92862P54J495J907J886J721J716J783J573J012M54J60n3l64n54m01j38
49724C05813m5K9K17J01n91j130n67P27J344P47j14l09n3J06K96P95J281J265
49706C09912Q51M60K82M77J310K522L088K396J185O27Q56J146J134J016P42N6
49690C28060p35q78k33N06P08L84j85p49r29m10M63Q85N71M3k16l11m36l77M2
49671C26203M59L88r6m84m97l03j68j56j92j93r8J08M18P47R09P51L55Lj55k03
$$ plain form
49651 327796 327669 327889 328543 329085 328739 327498 326281 325879 326152 326575 327056 327782 328612 329222 329623 329990 330153 329834
49633 329834 329280 329064 329229 329267 329037 329097 329829 330773 331188 330960 330612 330657 331212 332049 332790 333268 333894 335413 338023
49614 338023 340942 343140 344366 345210 346424 348537 351867 356370 361396 366098 370264 374479 379359 384962
49600 384962 391049 397473 404008 410167 415697 421069 427060 433876 441119 448589 456600 465328 474374 483279
49586 483279 492127 501239 510579 519953 529644 540370 552510 565816 579930 594803 610425 626514
49574 626514 642787 659400 676959 696120 717212 739972 763513 786794 809376 831790 855067
49563 855067 879934 906422 933992 961996 990111 1018389 1046857 1075212 1103134 1130726 1158218
49552 1158218 1185321 1211366 1236131 1259883 1282404 1302632 1319686 1333692 1345027 1353320 1357971 1359361
$$ packed form
49651C27796j27K20O54N42l46j241j217m02K73M23M81P26Q30O10M01L67J63l19
49633C29834n54k16J65L8k30O0P32R44M15k28l48M5N55Q37P41M78O26J519K610
49614C38023K919K198J226Q44J214K113L330M503N026M702M166M215M880N603
49600C84962O087O424O535O159N530N372N991O816P243P470Q011Q728R046Q905
49586D83279Q848R112R340R374R691J0726J2140J3306J4114J4873J5622J6089
49574F26514J6273J6613J7559J9161K1092K2760K3541K3281K2582K2414K3277
49563H55067K4867K6488K7570K8004K8115K8278K8468K8355K7922K7592K7492
49552A158218K7103K6045K4765K3752K2521K0228J7054J4006J1335Q293M651J390
$$ plain form
49540 1359361 1358699 1356681 1353001 1347254 1339617 1330516 1320281 1309372 1298431 1287791 1277337 1267115 1257684
49527 1257684 1249647 1243215 1238487 1235717 1234922 1235610 1237360 1240451 1245448 1252319 1260450 1269564 1280197 1293075
49513 1293075 1308251 1324963 1342217 1359379 1376325 1393103 1409513 1425037 1439132 1451494 1462037
49502 1462037 1470747 1477660 1482768 1485741 1485885 1482578 1475790 1466006 1453612 1438488 1420256 1398838 1374657
49489 1374657 1348274 1319940 1289642 1257648 1224809 1192093 1159816 1127571 1094970 1062299 1030325
49478 1030325 999627 970277 942102 915050 889233 864687 841226 818593 796771 776030 756598
49467 756598 738393 721171 704797 689219 674369 660371 647695 636683 626931 617574 608278 599541
$$ packed form
49540A359361o62k018l680n747p637r101j0235j0909j0941j0640j0454j0222r431
49527A257684q037o432m728k770p95O88J750L091M997O871Q131R114J0633J2878
49513A293075J5176J6712J7254J7162J6946J6778J6410J5524J4095J2362J0543
49502A462037Q710O913N108K973J44l307o788r784j2394j5124j8232k1418k4181
49489A374657k6383k8334l0298l1994l2839l2716l2277l2245l2601l2671l1974
49478A030325l0698k9350k8175k7052k5817k4546k3461k2633k1822k0741j9432
49467G56598j8205j7222j6374j5578j4850j3998j2676j1012r752r357r296q737
$$ [...]
##END NTUPLES=NMR SPECTRUM
##END=
