##TITLE=NES1060_RRG_9883143_8TObMUu1Hl
##JCAMPDX= 6.0         $$ Bruker NMR JCAMP-DX V2.0
##DATA TYPE= NMR SPECTRUM
##DATA CLASS= NTUPLES
##ORIGIN= BRUKER
##OWNER= Administrator
$$ 1.72 TOPSPIN		Version 2.1
$$ 2016-08-26 21:17:55.179 -0500  Administrator@X
$$ Compression mode = diff/dup
##.OBSERVE FREQUENCY= 400.02188249412
##.OBSERVE NUCLEUS= ^1H
##.ACQUISITION MODE= SIMULTANEOUS (DQD)
##.ACQUISITION SCHEME= undefined
##.AVERAGES= 8
##.DIGITISER RES= 22
##SPECTROMETER/DATA SYSTEM= spect
##.PULSE SEQUENCE= zg30
##.SOLVENT NAME= COFFEE_meoh
##.SHIFT REFERENCE= INTERNAL, COFFEE_meoh, 1, 14.98509
##AUDIT TRAIL= $$ (NUMBER, WHEN, WHO, WHERE, PROCESS, VERSION, WHAT)
$$ ##TITLE= Audit trail, TOPSPIN		Version 2.1
$$ ##JCAMPDX= 5.01
$$ ##ORIGIN= Bruker BioSpin GmbH
$$ ##OWNER= Administrator
$$ $$ E:\/data/COFFEE/nmr/NES1060_RRG_9883143_8TObMUu1Hl/20/pdata/1/auditp.txt
$$ ##AUDIT TRAIL=  $$ (NUMBER, WHEN, WHO, WHERE, PROCESS, VERSION, WHAT)
(   1,<2016-08-26 21:17:48.023 -0500>,<Administrator>,<X>,<go>,<TOPSPIN 2.1>,
      <created by zg
	started at 2016-08-26 21:16:42.226 -0500,
	POWCHK enabled, PULCHK disabled,
       configuration hash MD5:
       21 0F 79 D6 B3 7B B4 F6 88 20 88 DB 03 48 BD 9F
       data hash MD5: 64K
       79 80 6F 51 15 26 BA 2E 63 74 17 B0 43 73 08 7F>)
(   2,<2016-08-26 21:17:51.148 -0500>,<Administrator>,<X>,<proc1d>,<TOPSPIN 2.1>,
      <Start of raw data processing
       efp LB = 0 FT_mod = 6 PKNL = 1 PHC0 = 0 PHC1 = 0 SI = 32K 
       data hash MD5: 32K
       BE BE 20 50 86 A6 B6 0B 72 60 71 48 F0 11 B4 B4>)
(   3,<2016-08-26 21:17:51.429 -0500>,<Administrator>,<X>,<proc1d>,<TOPSPIN 2.1>,
      <pk PHC0 = 90.50537 PHC1 = 0 
       data hash MD5: 32K
       BC 28 B1 89 09 82 64 88 A7 0E 4E 0A 6E 7D 21 31>)
(   4,<2016-08-26 21:17:51.539 -0500>,<Administrator>,<X>,<proc1d>,<TOPSPIN 2.1>,
      <abs ABSG = 1 
       data hash MD5: 32K
       84 FE 03 D7 B0 F5 A6 67 53 8E 62 54 96 62 4B 13>)
(   5,<2016-08-26 21:17:51.601 -0500>,<Administrator>,<X>,<proc1d>,<TOPSPIN 2.1>,
      <abs ABSG = 2 
       data hash MD5: 32K
       DC 2D 72 28 F9 9A F3 0F C7 AB 0C EE 83 54 F6 A5>)
(   6,<2016-08-26 21:17:51.664 -0500>,<Administrator>,<X>,<proc1d>,<TOPSPIN 2.1>,
      <abs ABSG = 3 
       data hash MD5: 32K
       1B 7C 4A 35 AD 44 49 40 A7 5F 29 1E 67 E4 CE 27>)
(   7,<2016-08-26 21:17:51.711 -0500>,<Administrator>,<X>,<proc1d>,<TOPSPIN 2.1>,
      <abs ABSG = 4 
       data hash MD5: 32K
       94 CE A4 4B DB 50 4A E0 E6 04 B2 A5 9C 80 15 EF>)
(   8,<2016-08-26 21:17:51.773 -0500>,<Administrator>,<X>,<proc1d>,<TOPSPIN 2.1>,
      <abs ABSG = 5 
       data hash MD5: 32K
       69 D2 B9 B5 84 3D 6E 58 CB 42 81 8C 44 92 4F 54>)
$$ ##END=
$$ 
$$ $$ hash MD5
$$ $$ 64 50 78 10 E3 6C 8E 9C AA 38 75 84 1C EE 2C 71
##$RELAX= 
##$RELAX= 
##$RELAX= 
##$RELAX= 
##$RELAX= 
##$RELAX= 
##$RELAX= 
$$ Bruker specific parameters
$$ --------------------------
##$DU= <E:\>
##$EXPNO= 20
##$NAME= <NES1060_RRG_9883143_8TObMUu1Hl>
##$PROCNO= 1
$$ [...]
150 150 150 150 150 150 150 150
##$TP07= 0
##$TPNAME0= <>
##$TPNAME1= <>
##$TPNAME2= <>
##$TPNAME3= <>
##$TPNAME4= <>
##$TPNAME5= <>
##$TPNAME6= <>
##$TPNAME7= <>
##$TPOAL= (0..7)
0.5 0.5 0.5 0.5 0.5 0.5 0.5 0.5
##$TPOFFS= (0..7)
0 0 0 0 0 0 0 0
##$TUNHIN= 0
##$TUNHOUT= 0
##$TUNXOUT= 0
##$USERA1= <user>
##$USERA2= <user>
##$USERA3= <user>
##$USERA4= <user>
##$USERA5= <user>
##$V9= 5
##$VALIST= <valist>
##$VCLIST= <CCCCCCCCCCCCCCC>
##$VD= 0
##$VDLIST= <DDDDDDDDDDDDDDD>
##$VPLIST= <PPPPPPPPPPPPPPP>
##$VTLIST= <TTTTTTTTTTTTTTT>
##$WBST= 2048
##$WBSW= 25
##$XGAIN= (0..3)
0 0 0 0
##$XL= 0
##$YL= 0
##$YMAX_a= 565005
##$YMIN_a= -490946
##$ZGOPTNS= <>
##$ZL1= 120
##$ZL2= 120
##$ZL3= 120
##$ZL4= 120
##$ABSF1= 14.98509
##$ABSF2= -5.573092
##$ABSG= 5
##$ABSL= 3
##$ALPHA= 0
##$AQORDER= 0
##$ASSFAC= 0
##$ASSFACI= 0
##$ASSFACX= 0
##$ASSWID= 0
##$AUNMP= <proc_prof1d_extract_pilot.lims>
##$AXLEFT= 0
##$AXNAME= <>
##$AXNUC= <1H>
##$AXRIGHT= 0
##$AXTYPE= 0
##$AXUNIT= <>
##$AZFE= 0.1
##$AZFW= 0.1
##$BCFW= 0
##$BC_mod= 0
##$BYTORDP= 0
##$COROFFS= 0
##$CY= 15
##$DATMOD= 1
##$DC= 0
##$DFILT= <>
##$DTYPP= 0
##$F1P= 0
##$F2P= 0
##$FCOR= 0.5
##$FTSIZE= 32768
##$FT_mod= 6
##$GAMMA= 0
##$GB= 0
##$INTBC= 1
##$INTSCL= 1
##$ISEN= 128
##$LB= 0
##$LEV0= 0
##$LPBIN= 0
##$MAXI= 10000
##$MC2= 0
##$MEAN= 0
##$ME_mod= 0
##$MI= 0
##$NCOEF= 0
##$NC_proc= -8
##$NLEV= 6
##$NOISF1= 0
##$NOISF2= 0
##$NSP= 0
##$NTH_PI= 0
##$NZP= 0
##$OFFSET= 14.98509
##$PC= 1
##$PHC0= 90.50537
##$PHC1= 0
##$PH_mod= 1
##$PKNL= yes
##$PPARMOD= 0
##$PPDIAG= 0
##$PPIPTYP= 0
##$PPMPNUM= 2147483647
##$PPRESOL= 1
##$PSCAL= 4
##$PSIGN= 0
##$PYNMP= <proc.py>
##$REVERSE= no
##$SF= 400.02
##$SI= 32768
##$SIGF1= 0
##$SIGF2= 0
##$SINO= 400
##$SIOLD= 32768
##$SPECTYP= <>
##$SREGLST= <1H.CDCl3>
##$SSB= 0
##$STSI= 32768
##$STSR= 0
##$SW_p= 8223.68421052631
##$SYMM= 0
##$S_DEV= 0
##$TDeff= 65536
##$TDoff= 0
##$TI= <>
##$TILT= no
##$TM1= 0
##$TM2= 0
##$TOPLEV= 0
##$USERP1= <user>
##$USERP2= <user>
##$USERP3= <user>
##$USERP4= <user>
##$USERP5= <user>
##$WDW= 1
##$XDIM= 32768
##$YMAX_p= 452711268
##$YMIN_p= -736220
##$CURPLOT= <Network HP LaserJet P1505>
##$CURPRIN= <$Network HP LaserJet P1505>
##$DFORMAT= <normdp>
##$LAYOUT= <+/1D_H.xwp>
##$LFORMAT= <normlp>
##$PFORMAT= <normpl>
##$SURQMSG= 1
$$ End of Bruker specific parameters
$$ ---------------------------------
##NTUPLES= NMR SPECTRUM
##VAR_NAME=  FREQUENCY,     SPECTRUM/REAL,   SPECTRUM/IMAG
##SYMBOL=    X,             R,               I
##VAR_TYPE=  INDEPENDENT,   DEPENDENT,       DEPENDENT
##VAR_FORM=  AFFN,          ASDF,            ASDF
##VAR_DIM=   32768,         32768,           32768
##UNITS=     HZ,            ARBITRARY UNITS, ARBITRARY UNITS
##FACTOR=    0.250966925370066, 1,           1
##FIRST=     8223.43324360094, 7500,         -114906
##LAST=      0,             74224,           115242
##MIN=       0,             -736220,         0
##MAX=       8223.43324360094, 452711268,    0
$$ Real data points
##PAGE= N=1
##DATA TABLE= (X++(R..R)), XYDATA
$$ [...]
19577a01176B38091H8909D346J30749H016b67627J32600a0947o6662k65184a30937
19565E5484J20676J27703b33799f6440G7001d4880B12316C4024i3963B2968M9798
19554G2766a23738C3414Q5029J6987d07167a4552A31942K6635a71720K6272j13052
19543b58500i1704j8257q8491A14393b7084j82651B53880f2686B80101j20267
19533A59834k3025a75141A70749b0278D4263j8929i7928k14900L6741O4194j7401
19522b29294A8290a51185k16210Q2093O128B0129a20413A4566b38578m5907a34557
19510F4187b6735j30700A98244b80687J25802c9711j70910d6675q203q1450B42502
19498H2493c7668j07951c427B54783a11150j59500B0216L5768D564h676l39888
$$ y = [-101176, 238091, 88909, 4346, 135095, 8016, -267627, -135027, -10947, -77609, -342793, -130937, 55484, 176160, 303863, -233799, -66440, 77001, -44880, 212316, 34024, -93963, 22968, 72766, -123738, 33414, 118443, 135430, -407167, -14552, 131942, 158577, -171720, -145448, -258500, -91704, -109961, -198452, 114393, -27084, -209735, 253880, -62686, 280101, 159834, 136809, -175141, 170749, -20278, 44263, 25334, -97928, -312828, -276087, -211893, -229294, 18290, -151185, -367395, -285302, -279174, 20129, -120413, 14566, -238578, -284485, -134557, 64187, -26735, -157435, 198244, -280687, -154885, -39711, -210621, -46675, -54878, -136328, 242502, 82493, -37668, -145619, -3427, 254783, -111150, -270650, 20216, 55984, 4564, -8676, -348564]
19487c48564E0797d3864A0036e4485r0500b0029B64947b19791A78266a36791J090
19476a35701A58761g8616a8889n1914A38382E4356a68590A54160J80679c79695
19465a26731M5852e022F1501a88396D0228h0713q1030e4738A25471B77J85555
19454A85832i8947A88545F1566j6261O6981m1166A9110c12875A18159J38799E5893
19442b22414C01988F3963a33352K4490M2562B5998a81956n2797A28189a0043A5698
19430I6367c30487f3517D8349A947a2678B30052g5247E561P3103j3835a47469
19418a83818f7104r6287h0449E50c0782I057R7005a27608p1779G1871c3073j65179
19406a98252P0141E6518c05225H1422l7388c33926J29350C57890a24862j26709
$$ y = [-348564, 50797, -43864, 10036, -54485, -144985, -20029, 264947, -219791, 178266, -136791, -135701, 158761, -78616, -18889, -70803, 138382, 54356, -168590, 154160, 334839, -379695, -126731, -80879, -5022, 61501, -188396, 40228, -80713, -161743, -54738, 125471, 277, 185832, -98947, 188545, 61566, 45305, 112286, 71120, 19110, -312875, 118159, 256958, 55893, -222414, 301988, 63963, -133352, -108862, -66300, 25998, -181956, -234753, 128189, -10043, 15698, 96367, -330487, -63517, 48349, 1947, -12678, 230052, -75247, 5561, 78664, 64829, -147469, -183818, -67104, -163391, -80449, 550, -30782, 9057, 106062, -127608, -199387, 71871, -33073, -198252, -128111, 56518, -305225, 81422, 44034, -333926, -204576, 357890, -124862, -251571]
19396b51571J13583c8130q1807c4282F963M0659J66632a02206l5148K1531j71987
19385b87810J7131E9383b98292f9349j89526G2671a68497f4855G4190O0229C1981
19373I8550O9618c8830J130j64226O9357b2331j53406p4365A42707b24233J05214
19362a19019H8050b26990g3724l5302J3247j52000G9042I106L54543d55654A61496
19350C021d9671j01536n685k61204a61485E5783a72068D100O6057L4188j1039
19339I3306K6836g0120k93975C7527b93392i3136C3143c3409B51938K6492b29068
19327a56969C89095i8820C9642a12038I1926f288q0160j56696A04493m9231R1560
19316A46822a57807a9637j43682c7669B21135f732B57639E983a35940N2021P623
$$ y = [-251571, -137988, -38130, -119937, -34282, 6963, 47622, 214254, -102206, -137354, -115823, -287810, -270679, 59383, -298292, -69349, -258875, 72671, -168497, -64855, 74190, 134419, 31981, 98550, 168168, -38830, -37700, -201926, -132569, -22331, -175737, -250102, 142707, -224233, -119019, 88050, -226990, -73724, -109026, -95779, -247779, 79042, 9106, 363649, -455654, 161496, 3021, -49671, -151207, -156892, -418096, -161485, 55783, -172068, 4100, 70157, 104345, 93306, 120142, -70120, -364095, 37527, -293392, -93136, 33143, -33409, 251938, 278430, -229068, -156969, 389095, -98820, 39642, -112038, 91926, -6288, -86448, -243144, 104493, 55262, 146822, -157807, -19637, -163319, -37669, 221135, -6732, 257639, 5983, -135940, -83919, -76296]
19305g6296o4714J1403B3709h5354A1918k675a56043E9080b11624N0103d8576
19293a28273A78025C9823c08456e2987p4841D22617B949a76711j83548E4951b73696
19281G5353j4804a78857o5109a14084q1217c0832l1312A53980b5623n06123B6182
19269A14193b74001G4906P859k8444f3109A34069g5511l21020a95567i4054J7821
19258g6233B10303g668r5878m4210A7230M0977b20612a4053A06686a7832j68665
19247a86497A00256i9054C1028a07087L6862D4488b19583c9024r5866q7443A25247
19235G0871a06313j75110a19432L9405A65986o0826b72444d9868k0958k86695
19225c57521P8509b3194j59650A55421c1707j95937Q8807O03A12044E1656a21773
$$ y = [-76296, -141010, -129607, 23709, -85354, 11918, 9243, -156043, 59080, -211624, -161521, -48576, -128273, 178025, 39823, -308456, -52987, -127828, 422617, 2949, -176711, -360259, 54951, -273696, 75353, 60549, -178857, -243966, -114084, -195301, -30832, -62144, 153980, -25623, -531746, 26182, 114193, -274001, 74906, 82765, 54321, -63109, 134069, -75511, -396531, -195567, -94054, -76233, 210303, -7668, -103546, -147756, 17230, 58207, -220612, -14053, 106686, -17832, -186497, 100256, -99054, 31028, -107087, -70225, 44488, -219583, -39024, -134890, -222333, 125247, 70871, -106313, -281423, -119432, -80027, 165986, 105160, -272444, -49868, -70826, -357521, -279012, -23194, -182844, 155421, -31707, -227644, -138837, -138234, 112044, 51656, -121773]
19213h542A63249q1082k5757K32733a73753Q4506B43338h1994j22475j13367C0206
19201I3605a4567k06517d5649k4722b7321D8943F230b99187J07865j9877M2374
19190a68825L7038A65262G7896J46178a65841A25452f9841o9666c7405k31658
19180b69063J6709C0630c99049d3908F4844b1728r3816e5836K4772A15735b1333
19168B6978b21158K080L2266n8948A45829b14339f4083j8043A61038a18888L0814
19157h8074B52566k4625a94811F2035a53001B86287b22900o6791J6509B2312b18914
19145G8145J25497b47507J07360A2874J06284b10459r4986a02919j7051d4942
19134A26770l156c74275B69790A01919e0945k08467B28401A04603C5175a0560
$$ y = [-8542, 163249, 82167, 56410, 289143, -173753, -89247, 243338, -81994, -204469, -317836, 30206, 93605, -14567, -221084, -45649, -70371, -27321, 48943, 6230, -299187, -191322, -211199, -168825, -131787, 165262, 77896, 224074, -165841, 125452, -69841, -139507, -37405, -269063, -252354, 30630, -399049, -43908, 64844, -21728, -115544, -55836, -31064, 115735, -21333, 26978, -221158, -219078, -186812, -245760, 145829, -214339, -64083, -82126, 161038, -118888, -88074, 252566, 227941, -194811, 62035, -153001, 286287, -222900, -289691, -273182, 22312, -218914, 78145, 203642, -247507, -140147, 12874, 119158, -210459, -305445, -102919, -119970, -44942, 126770, 123614, -374275, 269790, 101919, -50945, -259412, 228401, 104603, 35175, -10560]
19123A11279k0096a78218g4646A04135h8093l38698d2319I6705b18749l70510
19113e89259g6708l64751A36179J2111a96824e7345k18746A63576b33230A71898
19102A467f505A93505c930p0100A29230L1792k3857n0853a21589d5676j20013
19091a65689A06210a58136o4444A46332m2072a94026C2838a76239A13558c19768
19080C24789b13296A08413e8867A72698n1630e8845b3684j51009r3052G1730N4398
19069A26128b8085A34852d167B93603g676j71389f7733j41810k7735G3028M5814
19058A18842J76684a52598D2861B0210b13544B67599j20933a13195l5643B57739
19047e2176g427j39118A92747a12788j00835c3947j21271C4899J78065i9469B63756
$$ y = [111279, 91183, -178218, -74646, 104135, -88093, -426791, -42319, 96705, -218749, -589259, -76708, -441459, 136179, 148290, -196824, -57345, -276091, 163576, -233230, 171898, 1467, -6505, 193505, -3930, -74030, 129230, 161022, 137165, 86312, -121589, -45676, -165689, 106210, -158136, -222580, 146332, 104260, -194026, 32838, -176239, 113558, -319768, 324789, -213296, 108413, -58867, 172698, 121068, -58845, -23684, -174693, -267745, 71730, 126128, -28085, 134852, -4167, 293603, -7676, -179065, -67733, -209543, -237278, 73028, 118842, 295526, -152598, 42861, 20210, -213544, 267599, 146666, -113195, -148838, 257739, -52176, -7427, -146545, 192747, -112788, -213623, -33947, -155218, 34899, 212964, -99469, 263756]
19035a16275a251D6941a6440I5678b83356A19126a24728H2319a15636A34450o4242
19024G0208L50284A44582b1837j25070A85924q3290e24400a78327B53519e4151
19013b7369j08922j53930e7360j83636i8834E7503b3452j00618B1051a30421j7847
19002a48268N5856C2413c99805J22702i1509f496D4381a8150l87699J56333A38438
18990a46818j60092I870b24755A3629L2504J6726b15871i3110n8046L6602A03423
18978b53568A46742O5764d32810G7810a40223k7825j22943h8292A71349C8303
18967B0331L6663k2519n682K49732i7224A69030a37805B90278C4933a35086f2540
18955I5520i1902H8507a09301q2872j16397A51728j6350e2608A30254e2186K4139
$$ y = [-116275, -1251, 46941, -16440, 95678, -283356, 119126, -124728, 82319, -115636, 134450, 70208, 420492, 144582, -21837, -146907, 185924, 102634, -524400, -178327, 253519, -54151, -27369, -136291, -290221, -57360, -240996, -98834, 57503, -23452, -124070, 21051, -130421, -148268, -92412, 32413, -399805, -277103, -91509, -6496, 44381, -18150, -405849, -249516, 138438, -146818, -306910, 9870, -224755, 13629, 46133, 62859, -215871, -93110, -151156, -114554, 103423, -253568, 146742, 212506, -432810, 77810, -140223, -168048, -290991, -88292, 171349, 38303, 20331, 56994, 34475, 28793, 278525, -97224, 169030, -137805, 290278, 34933, -135086, -62540, 95520, -91902, 88507, -109301, -192173, -308570, 151728, 135378, -52608, 130254, -52186, -28047]
18944b8047A41440a65464A05625J64015a49554B940J92121a10974H6710b08728
18933E3471N4373L7721a75147M1013l2078l3749L6562M6999E8668g7662C0801
18921C7277O459a2417C0673c0330j31699c1148A72767d5148p5128N5465j57881
18910b22692R7219A5903a27018k28778G4153c2798B76097a24036I8593b1714m0665
18899f2379C0977a67861O7254o0570a0198j36952f3816f088n333j67285f8890
18887I1432l8391c82763f5365k2190B09939a0906B863b84945A28353a92713C5810
18875I1025J27952h9224F7034g0307l168j077k68765g2825o7290O2070k43m0672
18863a18960l7720B54259m7380b83453J30063O41j11327E898c45881a35911E1635
$$ y = [-28047, 141440, -165464, 105625, 269640, -149554, 2940, 195061, -110974, 86710, -208728, 53471, 107844, 145565, -175147, -134134, -166212, -199961, -163399, -116400, 58668, -77662, 30801, 37277, 43736, -12417, 30673, -30330, -162029, -31148, 172767, -45148, -120276, -64811, -222692, -125473, 15903, -127018, -355796, 74153, -32798, 276097, -124036, 98593, -21714, -62379, 30977, -167861, -100607, -161177, -10198, -147150, -63816, -6088, -11421, -178706, -68890, 91432, 53041, -382763, -65365, -87555, 209939, -10906, 2863, -284945, 128353, -192713, 35810, 91025, 218977, -89224, 67034, -70307, -73475, -74552, -343317, -72825, -140115, -78045, -78288, -118960, -156680, 254259, 206879, -283453, -153390, -152749, -264076, 5898, -345881, -135911, 51635]
18851a3373m0444m2911k13836H8125J37710a32280B10710A1639d53889B15321
18840f6430L860l78536a13354B41037C2930J22855a5082q2205m1761b7434C9149
18828A94752a36355q9076C2775L1700g9439A080J09198c75837A01276J01735i2027
18816a59886g476A21485c3228A74449o1246J92369o2456e1333D99250h561A467
18804C98373j48372a00770M5248L084l8701b7008l6539F562a17528E289J40732
18793A46021a87472R2747A26946c3508j95488G8014a72161N6637F4816b29665
18782i5845A14990g5201G2192i685B36372a50436B19714r5034k625b811G725f7655
18769c0725j44305k5805A39412a65830P2462k98201d8188j91210B37228A04389
$$ y = [-13373, -53817, -96728, -310564, 88125, 225835, -132280, 210710, 11639, -453889, 215321, -66430, -62570, -441106, -113354, 241037, 32930, 155785, -15082, -97287, -139048, -27434, 39149, 194752, -136355, -225431, 32775, 64475, -79439, 1080, 110278, -375837, 101276, 203011, -92027, -159886, -7476, 121485, -33228, 174449, 113203, 305572, 243116, -51333, 499250, -8561, 1467, 398373, 250001, -100770, -55522, -52438, -91139, -27008, -63547, 6562, -117528, 5289, 146021, -187472, -94725, 126946, -33508, -228996, 78014, -172161, -115524, 64816, -229665, -95845, 114990, -75201, 72192, -9685, 236372, -150436, 219714, 124680, 122055, -2811, 7725, -67655, -30725, -175030, -200835, 139412, -165830, -93368, -391569, -48188, -239398, 237228, 104389]
18758b55470C3651b97876J15302K4947C5411J28319e0083j25791j48375a24992
18747A21359F138K23040d83617B77826f6704k53450i0018A38366J29576f9751
18736h4603a8995k49566m8064a44475F5085L9485P6874b83738D8988e7921k25113
18725b83034B3417J06716b14274j09638B49787k7723a13800e273B11352c90046
18714G5397a28132A83461b33813A95123b95926J24265J3532m5968f1076k40058
18704c01134j14959A9876M5038k6521d62564g2020A07588K931a6324k23051h4535
18692B0639b86751C33505A45668o3112g9009k0478j22262M4199b1041j79829H7587
18680b71356h5180j3546A29995d110j54013p4645Q1701A45701o3684Q435g920
$$ y = [-255470, 33651, -297876, -182574, -157627, 35411, 163730, -50083, -175874, -324249, -124992, 121359, 6138, 229178, -483617, 277826, -66704, -320154, -90018, 138366, 267942, -69751, -84603, -18995, -268561, -316625, -144475, 65085, 104570, 181444, -283738, 48988, -57921, -283034, 23417, 130133, -214274, -323912, 249787, 222064, -113800, -5273, 211352, -390046, 75397, -128132, 183461, -233813, 195123, -295926, -171661, -158129, -204097, -61076, -301134, -416093, 19876, 64914, 38393, -462564, -72020, 107588, 110519, -16324, -239375, -84535, 20639, -286751, 333505, 145668, 82556, -79009, -99487, -221749, -177550, -21041, -200870, 87587, -271356, -85180, -98726, 129995, -4110, -158123, -232768, -151067, 145701, 82017, 90452, -7920]
18668A449a17154m0761b5114F882a81504r9163C3039i0799A89968a54551G7093
18656A5495f0460A73553G1208M7215L06249e9749o0933D1309L0170J67448F202
18644B77176g9290E5016c5105a961B79077B1240M0581d9238l0971B54797a60616
18632c84341F4731a51729f9918G4140a44279A12732e5098E5915j0801a01866E8802
18620H7423i3312M0840j27650d1914A1483h4741E5868J15155R3429i1599j53613
18609b45212E0265b25954M6153F2249a32619A54235a96888B5107c23682d0284
18598a19014j49312B3627R4016l8134f3173j01125j05820B34977A8131d1247D3193
18586A31276C7549i0874o5663O1283H3183j6915b39948a09581n5656B04561F4411
$$ y = [1449, -117154, -157915, -25114, 6882, -181504, -280667, 33039, -90799, 189968, -154551, 77093, 15495, -60460, 173553, 71208, 118423, 424672, -59749, -120682, 41309, 71479, 238927, 6202, 277176, -79290, 55016, -35105, -1961, 279077, 21240, 61821, -49238, -80209, 254797, -160616, -384341, 64731, -151729, -69918, 74140, -144279, 112732, -55098, 55915, 45114, -101866, 58802, 87423, -93312, -52472, -180122, -41914, 11483, -84741, 55868, 171023, 264452, -91599, -245212, 50265, -225954, -179801, 62249, -132619, 154235, -196888, 25107, -323682, -40284, -119014, -268326, 23627, 117643, 79509, -63173, -164298, -270118, 234977, 18131, -41247, 43193, 131276, 37549, -90874, -156537, -95254, 83183, 66268, -239948, -109581, -165237, 204561, 64411]
18574a26514E2066K28515D2870a5328A74527k4223O541A7092b26424A44106m1395
18563A02711g9981J1366a0073A16725a02629g043A8864b46088E0394b94692L5112
18552b59580A21395J5683a13887B63584l8476a71209A30109K7857F5842J0063
18542G5905K75825j26431a03059g086k37753a06419D1597a16065j2983A56312
18531a01097C00048b49831A92464A4547b51995N5842L1416p8194j6546a07118
18520H6808j6477M5742b53977C39225a38544I2184b9463m5706j01738M7879K1767
18509a07261g992o4932A08196O2610a19465B78586d12822h0444k38089a45884
18498a92439o1130N915J13642a6052j99567e6179G4028a25383r8299j8092B56418
$$ y = [-126514, 52066, 280581, 42870, -15328, 174527, 150304, 156845, 17092, -226424, 144106, 102711, -79981, -68615, -10073, 116725, -102629, -7043, 18864, -246088, 50394, -294692, -259580, 121395, 137078, -113887, 263584, 225108, -171209, 130109, 157966, 65842, 75905, 351730, 225299, -103059, -7086, -244839, -106419, 41597, -116065, -129048, 156312, -101097, 300048, -249831, 192464, 14547, -251995, -196153, -164737, -242931, -259477, -107118, 86808, 70331, 116073, -253977, 339225, -138544, 92184, -29463, -75169, -176907, -129028, -107261, -7992, -72924, 108196, 170806, -119465, 278586, -412822, -80444, -318533, -145884, -192439, -253569, -247654, -134012, -16052, -215619, -56179, 74028, -125383, -223682, -241774, 256418]
18486A40788b82135A12632a63941A35532m5309d45970a83811h1962L9166j64250
18476b07046g6395A35896E3811A2914J53304k01J17992o5381a82880A19611k9992
18465H9619O7325a69723L9298B17419o6152o2564l3203c9828q1463l4947B31671
18453i8128j86204C6781O0648a60511A22618a33032j31765d3392r1371A59920
18442C40704c32220J31382A84124a97376N7155B16764a26016A51193d842B24203
18431c30484D7545c9009j39332b2439q9401C1371a65872H0694b4003B18182b75286
18419a96303O6208d1107C0622d9948k1671A85738m7639h6067j76629J16681E6567
18407a46465F2554l214a07811e213B31532j4679P8657a6253n32678a4098B09896
$$ y = [140788, -282135, 112632, -163941, 135532, 90223, -445970, -183811, -81962, -42796, -207046, -76395, 135896, 53811, 12914, 166218, 166017, 284009, 218628, -182880, 119611, 89619, 156944, -169723, -130425, 217419, 151267, 88703, 55500, -39828, -121291, -156238, 231671, -98128, -284332, 36781, 97429, -160511, 122618, -133032, -264797, -43392, -134763, 159920, 340704, -332220, -200838, 184124, -197376, -140221, 216764, -126016, 151193, -4842, 224203, -330484, 47545, -39009, -178341, -22439, -111840, 31371, -165872, 80694, -24003, 218182, -275286, -196303, -130095, -41107, 30622, -49948, -71619, 185738, 138099, -86067, -262696, -146015, 56567, -146465, 62554, 59340, -107811, -5213, 231532, 216853, 295510, -16253, -548931, -14098, 209896]
18395a53969a2566j15665l94421N8434b7851A55534a70665Q1276A69365a20616
18384a68877Q0322m1083A23530a7503l61505a46712k5160j11299D1204c0975A05065
18372c01417a8382G8258j2124b66242A3291c40032I0158P07B5667J04828c39652
18360c8397j8906j34988b8188A14977d6843A81756G8526J54287a38186G7307b37326
18348C105K12385k2445e86482i2625I3220a39027B80300c19249d8817A9771a91589
18336B21120i264C820b13028e9804m690f473A7413a49664A47739a42674c4098
18324a90144A32803a45318L1303n0869M3545F0278a64962r2276l19656b86951
18313d614j31270j55374I995J73766a34011q8522f1327b732j96000A2588J10704
$$ y = [-153969, -12566, -128231, -522652, -464218, -27851, 155534, -170665, -89389, 169365, -120616, -168877, -88555, -129638, 123530, -17503, -379008, -146712, -171872, -283171, 41204, -30975, 105065, -301417, -18382, 78258, 66134, -266242, 13291, -340032, 90158, 90865, 25667, 130495, -339652, -38397, -57303, -192291, -28188, 114977, -46843, 181756, 78526, 232813, -138186, 77307, -237326, 3105, 215490, 193045, -586482, -92625, 93220, -139027, 280300, -319249, -48817, 19771, -191589, 221120, -9264, 3820, -213028, -59804, -64494, -6473, 17413, -149664, 147739, -142674, -34098, -190144, 132803, -145318, -114015, -164884, -121339, 60278, -164962, -257238, -576894, -286951, -4614, -135884, -291258, 9995, 183761, -134011, -222533, -61327, -2732, -198732, 12588, 123292]
18302A23292j2360c28984J36420H0848e3027q6797E0288J4721H356a92859N3651
18291a39208A39925a13345j13680G0023C1870J6676k3565b75577J2828J29839
18281a32910B520f4064j68222B83068a83534K1161r0453C27686j50899a14767
18270b40637E8013b0387B18188B2211f8808k3324F6275a63463f8085C3701N0672
18259H4373C2555J1879h5902c0959A62214a12790F1237K00997E2378k2671a05303
18247a14703k41619h0479k8679B334K67761b72837A38010K917a25876k1484k38184
18236c85544C78299f0623A6332L0736c9769D64339a51538B44576G4813a50743
18225a24448H0029g7666F7485P6335C7902d0257C779b32539F8689K6867a02280
$$ y = [123292, 110932, -328984, -192564, 80848, -53027, -139824, 50288, 65009, 8356, -192859, -139208, 139925, -113345, -227025, 70023, 31870, 48546, 24981, -275577, -262749, -132910, 2520, -64064, -232286, 283068, -183534, -162373, -252826, 327686, 176787, -114767, -240637, 58013, -20387, 218188, 22211, -68808, -92132, 66275, -163463, -68085, 33701, 84373, 32555, 44434, -85902, -30959, 162214, -112790, 61237, 262234, 52378, 29707, -105303, -114703, -356322, -80479, -109158, 2334, 270095, -272837, 138010, 140927, -125876, -147360, -385544, 378299, -60623, 16332, 47068, -39769, 464339, -151538, 244576, 74813, -150743, -124448, 80029, -77666, 67485, 143820, 37902, -40257, 3779, -232539, 68689, 95556, -102280]
18213A06460a51621C4961a20093C5648c9549B219a17161H6913a48358N6198A13280
18201I3673a84292C03029A25980b72599I4212a30823E664K11420E4713a50476
18190G4301Q5524b54274A02151c33609D40146a20569d234A20892e1013B37555
18179F8920d5678p253B98512a71870B00492E7740b16863g0471H035O6244b44005
18167F2478f323A28120m0125e57737c547B0102g6062k5936m3785j34329L9119
18156b40993b9745j76E7428I279a57800a6930H4281L1144a97589A17431J68096
18145B85527A16322m9100B7456K27354a3548j1322j23478M2482c6793I0508D4696
18133A68848h5140B43K12888H0172b02995c9398F3278b09168c5662j43937j90861
$$ y = [106460, -151621, 34961, -120093, 35648, -39549, 2219, -117161, 86913, -148358, -92160, 113280, 93673, -184292, 303029, 125980, -272599, 94212, -130823, 5664, 217084, 54713, -150476, 74301, 159825, -254274, 102151, -333609, 440146, -120569, -4234, 120892, -51013, 237555, 68920, -45678, -52931, 298512, -171870, 200492, 57740, -216863, -70471, 8035, 74279, -244005, 62478, -6323, 128120, 87995, -557737, -3547, 20102, -76062, -101998, -145783, -280112, -240993, -29745, -29921, 57428, 9279, -157800, -16930, 84281, 115425, -197589, 117431, 285527, 116322, 67222, 27456, 254810, -13548, -24870, -148348, -105866, -36793, 90508, 44696, 168848, -85140, 243, 213131, 80172, -202995, -39398, 63278, -209168, -35662, -179599, -370460]
18122c70460e651m6257j23303L7022B47799b3002l25353i9573k35065a35023A1940
18110A7873R2189J1098R8454h6586B43438j10408J95751C4328c09330L7890h5255
18098A50249b83903a19220K602l0778A81623a67180j2024R318j34019A00669b53970
18086c3504E3577K9468h7197B94027a44417A70600j0774b472j09259A77363a03297
18074I1502i8604k47960F1921a41947e1515H206J51154B8813O7013i4831K0387
18063g4444I4694b03104i7291L7215j18834D644K11634j00854b54364a1525C44621
18051b2585p2191A05717a31809K898M7646E6975a43297i718j5860j19575e9390
18039A55007a03019J6471j38016B32015b0151k86536Q6858r0297J47608C2811
$$ y = [-370460, -5651, -51908, -175211, -138189, 247799, -23002, -348355, -99573, -334638, -135023, 11940, 17873, 110062, 121160, 219614, -86586, 243438, 133030, 328781, 34328, -309330, -271440, -85255, 150249, -283903, -119220, -116618, -147396, 181623, -167180, -179204, -169886, -303905, 100669, -253970, -33504, 53577, 83045, -87197, 294027, -144417, 170600, 159826, -2472, -111731, 177363, -103297, 91502, -98604, -346564, 61921, -141947, -51515, 8206, 159360, 28813, 95826, -94831, -74444, 94694, -203104, -97291, -60076, -178910, 4644, 216278, 115424, -254364, -11525, 344621, -22585, -94776, 105717, -131809, -128911, -81265, 56975, -143297, -9718, -25578, -145153, -59390, 155007, -103019, -86548, -224564, 232015, -20151, -306687, -219829, -310126, -162518, 32811]
18028I8393a5532l28448A23462a89133j20265g1300b6997C14563a18473G1295
18017i1791J9920A83608D2228K32496b73417i0100I7520a17843N5821l51713E0240
18005B22089h8665L8695j43294B52154A2875a3041A30822c4723l02998j4190B77851
17993i4474j0238j33664j26525Q9795A55813a28375M7950k7115C7748K64761A15089
17981C9012c9845j98943G2428a55375f6544j65137E0651b28546H8937P8954I062
17969F9599K9098R4413a25594F8710J75903d33908C14959e0353B38282b70321
17958f3322k9994I3897d1902C2378c27150a13292F8210a70298j94654I2920a95563
17946D62200a2622I6461e01242a82499M9233j31127f9339H2070N2097A0967a15821
$$ y = [98393, -15532, -343980, 123462, -189133, -309398, -71300, -26997, 314563, -118473, 71295, -91791, -71871, 183608, 42228, 274724, -273417, -90100, 97520, -117843, -62022, -413735, 50240, 222089, -88665, -49970, -193264, 252154, 12875, -13041, 130822, -34723, -337721, -351911, 277851, -94474, -104712, -238376, -364901, -275106, 155813, -128375, -80425, -107540, 37748, 302509, 115089, 39012, -39845, -238788, 72428, -155375, -66544, -231681, 50651, -228546, 88937, 167891, 9062, 69599, 98697, 193110, -125594, 68710, 244613, -433908, 314959, -50353, 238282, -270321, -63322, -93316, 93897, -41902, 32378, -327150, -113292, 68210, -170298, -364952, 92920, -195563, 462200, -12622, 96461, -501242, -182499, -133266, -264393, -69339, 82070, 134167, 10967, -115821]
17934b37824e6510A52926E811a46685A26724b025q3296j4892a0481j19643A06100
17922E7423b33809a5150j89651B5105M7469a50031e9778k7526I5655L4190J28822
17911B58667f7357n1116g748p9445D65239a52026j08055a9396F8590K22179l600
17900B87169a68209E2287k989a31214G6981Q6426c21839N2728C89867H5809j22
17889H5687k0878k7695a87578d5728B50905E1175M318k173A4422b28902A01577
17877b12026A30946D4845R5507o706a77583o9544D2318b36477i7696p0060h3252
17865D0647a85052E3832J47827b6236p2300j37682B03832a07260B2922J00272
17855A23194H927O892K23442J68163d7684A81701a90620F0664M8038c89773a4955
$$ y = [-237824, -56510, 152926, 5811, -146685, 126724, -2025, -85321, -100213, -10481, -130124, 106100, 57423, -233809, -15150, -204801, 25105, 72574, -150031, -59778, -87304, 95655, 129845, 258667, -67357, -118473, -7748, -87193, 465239, -152026, -260081, -19396, 68590, 290769, 287169, -168209, 52287, 49298, -131214, 76981, 163407, -321839, -269111, 389867, 85809, 85687, 64809, 37114, -187578, -45728, 250905, 51175, 55493, 53320, 14422, -228902, 101577, -212026, 130946, 44845, 140352, 133646, -177583, -247127, 42318, -236477, -97696, -167756, -83252, 40647, -185052, 53832, 201659, -26236, -98536, -236218, 203832, -107260, 22922, 123194, 8927, 15819, 239261, 407424, -47684, 181701, -190620, 60664, 108702, -389773, -14955]
17843a2976l37019a31474G4909o550C2860a71555A44035a661k10461Q9546n8819
17832a81395D496b16663h8110A29259R2332r5914b83003f2952m5625i984A07395
17820c6497B04056C9274a67406N1638d8616n938a9203n4608C890b48461h044k20943
17808b28987b2121i507o1069B9423b94936A91694d4989k77949D54559B7572a3038
17796b67661F4638b61586F699b37243B1852h4286K0248C13671E4814a44096A52611
17784a0561A15981b61147A0657e191j3444B0422d85882a38977e8936i696j56878
17773a66574c2898j63208h0242A79902c40496C0038A2355J61161p2400J94363
17763B95479R590a99053C6576L0004a16829I6334b59762d094m9447B13777A5891
$$ y = [-12976, -349995, -131474, 74909, 68359, 32860, -171555, 144035, -1661, -212122, -122576, -181395, 4496, -216663, -88110, 129259, 221591, 125677, -283003, -62952, -108577, -9984, 107395, -36497, 204056, 39274, -167406, -115768, -48616, -54554, -19203, -73811, 3890, -248461, -8044, -228987, -22121, -9507, -70576, 29423, -294936, 191694, -44989, -322938, 454559, 27572, -13038, -267661, 64638, -261586, 6699, -237243, 21852, -84286, -64038, 313671, 54814, -144096, 152611, -10561, 115981, -261147, 10657, -5191, -18635, 20422, -485882, -138977, -58936, -9696, -166574, -32898, -196106, -80242, 179902, -340496, 30038, 12355, 173516, 101116, 295479, 305069, -199053, 36576, 66580, -116829, 96334, -259762, -4094, -53541, 213777, 15891]
17751a75448I639i5491A35573a47951A33890b49597B9203h277q5573a130j04821
17740a05951E1570b3682F1489R1697B3982k623O4595j2121h9614n6237C6693e5462
17727b9316F7603K91769G8929B830b68329A16377i961A11400J07039b616B9335
17715g5995a1815C35194b43413K5999C6353J14056a73430L1351O2517B7670N2675
17704H0345J92133l263a71046g7028o8526J5863j72442H3903P0793G749a18849
17692a12281n3172j1083A06746a9583j84434A47188c93708B128g7280A14565N1549
17681A66114M2490a00612d5430l42985G1433J65956E5165j6216O9664d48203G5373
17669B00276i4594c2642a1845j61148K6882B26584d2179B67446b4071j29352B00111
$$ y = [-175448, 9639, -95491, 135573, -147951, 133890, -249597, 29203, -8277, -93850, -1130, -105951, 51570, -23682, 61489, 153186, 23982, 21359, 85954, 73833, -89614, -145851, 36693, -55462, -29316, 67603, 359372, 78929, 2830, -268329, 116377, -9961, 111400, 218439, -2616, 29335, -75995, -11815, 335194, -243413, -217414, 36353, 150409, -173430, -142079, -79562, 27670, 80345, 272478, 269215, -171046, -77028, -145554, -129691, -302133, 83903, 154696, 7749, -118849, -112281, -165453, -176536, 106746, -19583, -204017, 147188, -393708, 2128, -77280, 114565, 166114, 208604, -100612, -45430, -388415, 71433, 237389, 55165, 38949, 108613, -448203, 75373, 200276, -94594, -32642, -11845, -172993, -146111, 226584, -42179, 267446, -24071, -153423, 200111]
17657a21294p0091A40444d8764I7144K10024l4759a12255k22914g0223H2363K7118
17646A09481a28370k3718j03779B58272a00381A17527h7942C3624b49455A17656
17635C9490O9323k3218b23900i3496M5203q6477O0659H6546D0328M5587c83430
17623I8231f0190j61905F8606L0024c55686B4561K86941l9601B0606K14116b15171
17611D3628c48724C13570A17683K5736b04493G9136f3431B1308a39275A30746
17600f6405k60060P5983H5500d73962d5587P680A33396D0428c12424B13981H7624
17588a30749k3873A52112f8396b3521B0236Q2316j4204a69540O8216J9255b6085
17576G098h2740C80928a64383g1712C3218L1954c3052B09990b83370d9508C21713
$$ y = [-121294, -191385, 140444, -48764, 97144, 307168, 272409, -112255, -335169, -70223, 82363, 109481, -128370, -152088, -255867, 258272, -100381, 117527, -87942, 33624, -249455, 117656, 39490, 108813, 85595, -223900, -93496, -48293, -134770, -74111, 86546, 40328, 85915, -383430, 98231, -60190, -222095, 68606, 98630, -355686, 24561, 311502, 271901, 20606, 234722, -215171, 43628, -348724, 313570, 117683, 143419, -204493, 79136, -63431, 21308, -139275, 130746, -66405, -326465, -250482, 85500, -473962, -45587, -37907, 133396, 40428, -312424, 213981, 87624, -130749, -154622, 152112, -68396, -23521, 20236, 102552, 88348, -169540, -101324, -82069, -26085, 7098, -82740, 380928, -164383, -71712, 33218, 65172, -33052, 209990, -283370, -49508, 321713]
17564H533N5324Q4389f3965A58622a4704A64883h0949I8010Q8159a14681B8652
17552i8811q0199A9066G132J02403R1857b15802a00753A07232J4052E0303b2907
17540F7450K08620a97490F7552f6710j43593A90148J3278A4317K64622B3260n317
17529A7943J3509J37717G9884N9698k44Q0052g8100C65010a22062d5828c11E0364
17516B02626L20756B53503N768A3636M20518f4945A4422i4538A83371g0807p4136
17505a44943G2599J372J76345D729J6879J79040I4865d9300j4841a6616A75493
17493A87033b8500j8267F4305M58020a49176p3846B88071b61277A64728N0012
17483B14740h8309A0235K20615n2894J37871J61666a77368A47780P1842a73042
$$ y = [8533, 63857, 148246, -63965, 158622, -14704, 164883, -80949, 98010, 186169, -114681, 28652, -98811, -179010, 19066, 7132, 109535, 201392, -215802, -100753, 107232, 121284, 50303, -22907, 67450, 276070, -197490, 67552, -66710, -210303, 190148, 203426, 14317, 278939, 23260, 17943, 31452, 169169, 79884, 139582, 139338, 219390, -78100, 365010, -122062, -45828, -311, 50364, 202626, 523382, 253503, 259271, 13636, 434154, -64945, 14422, -94538, 183371, -70807, -144943, 72599, 73971, 250316, 4729, 21608, 200648, 94865, -49300, -64141, -16616, 175493, 187033, -28500, -46767, 64305, 522325, -149176, -223022, 288071, -261277, 164728, 214740, -88309, 10235, 230850, 177956, 315827, 477493, -177368, 147780, 219622, -173042]
17472b66427J30026B47665c562p1638A88554a25549K7544c0532D8483a15097A44446
17460D981M16197I1492P0355B1214J95241q6406N6335J8159c0921C69014r683
17449C59331j8356A11271L73698l9735C9429K23671J45656j19241a38629C4907
17438A58102K19552H7320A7243i2986D47967P2943I9252a51006C66464p6071N7533
17427C47926j46982N36290A87734n1474J77990b07132E0507a20198c7403G1747
17416B71357g916C65132j61340C9312M9950J936b03103g4392k46097A44232M7748
17405A91980J21626N0879a19974D2931O4758J58849p3222J78585p3318A05177
17394B37946H9903J84586H7052J43964a51552C76606A71971K73512D1149a47850
$$ y = [-266427, -136401, 247665, -3562, -75200, 188554, -125549, -98005, -30532, 48483, -115097, 144446, 4981, 421178, 91492, 161847, 21214, 216455, 130049, 186384, 204543, -30921, 369014, 359331, 340975, 111271, 484969, 445234, 39429, 263100, 408756, 289515, -138629, 34907, 158102, 377654, 87320, 17243, -92986, 447967, 520910, 99252, -151006, 366464, 290393, 347926, 200944, 737234, 187734, 136260, 314250, -207132, 50507, -120198, -37403, 71747, 271357, -7916, 365132, 203792, 39312, 89262, 91198, -203103, -74392, -320489, 144232, 191980, 313606, 364485, -119974, 42931, 107689, 266538, 193316, 371901, 298583, 105177, 237946, 89903, 274489, 87052, 231016, -151552, 376606, 171971, 445483, 41149, -147850]
17383a1254B16543F8648a77037B86206B0608R6329a69756A73251B1321K951D223
17371D31673H6383c09433a6431k1988B08575J50721r3191g7603A37368m5901L22647
17360D14114j33200A24058f5562G81O9899E559O605M3980K71077c52960C04622
17348d8997B07882d095F5744N5725O359A5976J25954a49960E71927A78759a11769
17336d2040I2513R071a52138A51382J86363E437b16362A32097a30772C30076i1751
17324f7257C7711f9547A58662L0694a2027q0098B96118Q8940A52903M2552f8107
17312A02967h2366A67636d1156A62248C8889K96486a00684B74703a58972A16648
17301a96944A4092N3236a9182B06303c9924C04477A38690i99D41040B20148R6792
$$ y = [-11254, 216543, 68648, -177037, 286206, 20608, 116937, -169756, 173251, 21321, 24272, 4223, 431673, 86383, -309433, -16431, -38419, 208575, 359296, 266105, -77603, 137368, 91467, 414114, 280914, 124058, -65562, 781, 70680, 5559, 12164, 56144, 327221, -352960, 304622, -48997, 207882, -4095, 65744, 121469, 127828, 15976, 141930, -149960, 571927, 178759, -111769, -42040, 92513, 101584, -152138, 151382, 337745, 5437, -216362, 132097, -130772, 330076, -91751, -67257, 37711, -69547, 158662, 189356, -12027, -92125, 296118, 385058, 152903, 195455, -68107, 102967, -82366, 167636, -41156, 162248, 38889, 335375, -100684, 274703, -158972, 116648, -196944, 14092, 67328, -19182, 206303, -39924, 304477, 138690, -999, 441040, 220148, 316940]
17290C16940j04087b64494C91810C0850R5896L3696f8208A1632J90258a50687
17279a17562D14949E1122K09148C8708J28756o238C9608M6118J39929A00540a20257
17267A75942A4578a55230B05973Q4846o5190I894L92607e9933A6956b1228A18645
17255b2611P636B08194g9555A44016B7336K52294j31649R9452C7966h9128I5094
17243h676j44621C2291A1185J02292a55553A10675a41767B29824D8382a36708
17232d175n9392D68141h2847m5701o8031A65879L5367B096J89415P5724A3242
17220C70335k5101j06246r2795i7958B42435h7571A86305K40411b26604A19034
17209B78389i3891G334L61277d9674G9646a0035B98554A07781K70167e3529B87386
$$ y = [316940, 212853, -264494, 391810, 30850, 126746, 160442, -68208, 11632, 201890, -150687, -117562, 414949, 51122, 260270, 38708, 167464, 161226, 39608, 85726, 225655, 100540, -120257, 175942, 14578, -155230, 205973, 290819, 225629, 9894, 402501, -59933, 16956, -21228, 118645, -22611, -14975, 208194, -79555, 144016, 27336, 279630, 147981, 247433, 37966, -89128, 95094, -8676, -153297, 32291, 11185, 113477, -155553, 110675, -141767, 229824, 48382, -136708, -4175, -63567, 468141, -82847, -128548, -196579, 165879, 201246, 2096, 191511, 267235, 13242, 370335, 345234, 238988, 146193, -97958, 242435, -87571, 186305, 426716, -226604, 119034, 278389, -93891, 7334, 368611, -49674, 79646, -10035, 298554, 107781, 377948, -53529, 287386]
17197C03119F1800J76501c9113I6201L26353a79889A67445J71915J0117r1606
17187B57871o4291M3839R2129q6156K6625N9419A31101K09217B5879Q6242L05860
17176D17981J32556B48972P5163M01627B03280L02442B8267M14654J26958A29012
17165b5798B40934K3850p9936q0953l4182b2884B13002O283j01022a4075k3722
17154c7797E1739Q5243k0191J96478J08676I1697k307L6574K07618p5561L23609
17143E81630k23249n7366K08843A03969M57165I6835L00592j74663p6702N7061
17133B03123J91808I8343J96361A36122k2896J19538J80954G7878L94741o6383
17123D06236A04489K46322J97402A22795n9509J47039K08115A18413m1868h6358
$$ y = [303119, 61800, 238301, -39113, 96201, 422554, -179889, 167445, 339360, 349477, 257871, 193580, 237419, 329548, 243392, 270017, 329436, 131101, 340318, 25879, 112121, 417981, 550537, 248972, 324135, 725762, 203280, 505722, 28267, 442921, 569879, 129012, -25798, 240934, 264784, 184848, 103895, 69713, -22884, 213002, 219285, 118263, -14075, -37797, 51739, 136982, 116791, 313269, 421945, 91697, 89390, 125964, 333582, 258021, 581630, 358381, 301015, 509858, 103969, 561134, 96835, 397427, 222764, 146062, 203123, 394931, 98343, 294704, 136122, 113226, 232764, 413718, 77878, 472619, 406236, 104489, 350811, 548213, 122795, 63286, 210325, 418440, 118413, 76545, -86358]
17112B52272a9387B26536A04271d913D56354k22642J18194A42156K70293q2883
17102C29566O2049j63648J35373A62274J72140j6022a40154D71054o4202j14964
17092B91888J30384n5764a6730C4204M11776j70357B7501M82244B29778J45210
17082C74988K2881j0182j86146K44907Q2658B50219o6374p4908O18374q9033C10527
17070E21539j34540B3312L68683Q110o5887p5296L79742C02404m313J82160J1212
17059D91463B33830K18317j00469o648j1288K93065A43146J89186Q3360J62796
17049E78488k86259J25110j42403A34209M19195q0442j09810L9353J60594A94666
17038C57322j3759j02270J37789O2755n1595K58737C10975m1472R6488J179J69397
$$ y = [252272, -19387, 226536, 104271, -4913, 456354, 233712, 351906, 142156, 412449, 329566, 391615, 227967, 363340, 162274, 334414, 318392, -140154, 471054, 406852, 291888, 422272, 366508, -16730, 34204, 445980, 275623, 27501, 509745, 229778, 374988, 397869, 387687, 201541, 446448, 529106, 250219, 183845, 108937, 727311, 638278, 310527, 521539, 386999, 23312, 391995, 400105, 334218, 258922, 638664, 302404, 298091, 480251, 491463, 233830, 452147, 351678, 345030, 333742, 626807, 143146, 332332, 415692, 578488, 292229, 417339, 274936, 134209, 553404, 472962, 363152, 402505, 563099, 194666, 357322, 343563, 241293, 379082, 441837, 390242, 648979, 310975, 269503, 365991, 367170, 536567]
17027E36567j97499J42109B29382J92830M201j5456K85498j39415j78340J9739
17017C98439K85241r874j26961k12608O306O7455j6834J20440m7891G5144M23727
17006D98871K54679K7831l28269o1676N7633R1895n8425J77215j29113R2488Q0594
16995G03723l38508J55398L18554j45531k60892L80484k82779l5945j01165K75494
16985F68833j26774J90507L7076k06653L12441l52241J20435j32351J07382j34607
16975D84048J61926O9764j85785K44781j51864J35782l10823L80856J60451m29254
16965E59882A91991N77594j80139j0798l0373k17275N88170j36402k47205n4608
16955D80955J54648L12317Q105k44014K15276k62478k11944K79623Q4622O4492
$$ y = [536567, 339068, 481177, 229382, 422212, 426413, 410957, 696455, 557040, 378700, 398439, 683680, 673806, 546845, 334237, 340543, 407998, 391164, 511604, 463713, 75144, 498871, 753550, 781381, 453112, 391436, 449069, 540964, 482539, 659754, 530641, 623129, 703723, 365215, 520613, 839167, 693636, 432744, 813228, 530449, 494504, 393339, 668833, 542059, 732566, 769642, 562989, 875430, 523189, 643624, 511273, 618655, 484048, 645974, 715738, 529953, 774734, 622870, 758652, 447829, 828685, 989136, 559882, 191991, 769585, 589446, 578648, 548275, 331000, 919170, 782768, 535563, 480955, 635603, 947920, 956025, 712011, 927287, 664809, 452865, 732488, 817110, 881602]
16945H81602l41964K27633n9553K20478q1052j00069n6412J25810J90343k63686
16935G43130K4234L13559j738j49227j39326J13497p2709K82051j00180j95068
16925H18223J11627j9896M38425m00171K31033r5740l98914L13065J59971J01624
16915A259247n74495K40500L92907J04381l91946K90331j23064J4987j05219L05840
16905A413469l0632j57876L86895l24623j95195M27564k30711j06741L0285K61893
16895A474328q0145N6160K84808m56264K76503o4406M60344l38819k35385K25071
16885A602195l40003L81764O5421k34995J89370R2429k20955L40496k5437k06059
16875A644226J50371K77600m66371P89464l87583k90520J42928J16953J88968
$$ y = [881602, 539638, 767271, 707718, 928196, 847144, 747075, 690663, 816473, 1006816, 743130, 767364, 1080923, 1079185, 929958, 790632, 904129, 831420, 1113471, 1013291, 818223, 929850, 909954, 1348379, 948208, 1179241, 1083501, 684587, 997652, 1157623, 1259247, 684752, 925252, 1318159, 1422540, 1030594, 1320925, 1197861, 1212848, 1107629, 1413469, 1382837, 1224961, 1611856, 1287233, 1092038, 1519602, 1288891, 1182150, 1212435, 1474328, 1394183, 1450343, 1735151, 1278887, 1555390, 1490984, 1951328, 1612509, 1377124, 1602195, 1262192, 1643956, 1709377, 1474382, 1663752, 1756181, 1535226, 1875722, 1850285, 1644226, 1794597, 2072197, 1605826, 2395290, 2007707, 1717187, 1860115, 1977068, 2166036]
16866B166036j78317l8252L59560l17202q4798M78220k90308M25848l96045L26076
16856B450818l38630K43476L16404k37351o547P1527j80614J30311m4848N05145
16846B909691p4837l06230J97352J82317k40713K83098j05328K93947j15148j68656
16836B855493J09892q8597M21079l30526L04666P5338p1154K57222K26900O2104
16826C822417J89932O2337l674j63085j67208M28086J2140j04301N89756l84258
16816D282142K40340j13080L11942k10234M45081R3840K39788m1167L40483k06479
16806E382656K97404P3978l2627L33018J59914K20233J08341M5775L16551R1340
16796F996583K31662K88438l84359N60029j7327J88269K91010K04331N67970k62779
$$ y = [2166036, 1987719, 1949467, 2309027, 1991825, 1907027, 2385247, 2094939, 2520787, 2124742, 2450818, 2112188, 2355664, 2672068, 2434717, 2428170, 2499697, 2319083, 2449394, 2404546, 2909691, 2834854, 2528624, 2725976, 2908293, 2667580, 2950678, 2845350, 3139297, 3024149, 2855493, 2965385, 2876788, 3297867, 2967341, 3272007, 3347345, 3276191, 3533413, 3760313, 3822417, 4012349, 4074686, 4071012, 3907927, 3740719, 4168805, 4180945, 4076644, 4666400, 4282142, 4522482, 4409402, 4721344, 4511110, 4956191, 5050031, 5289819, 5248652, 5589135, 5382656, 5680060, 5754038, 5721411, 6054429, 6214343, 6434576, 6542917, 6588692, 6905243, 6996583, 7228245, 7516683, 7132324, 7692353, 7675026, 7863295, 8154305, 8358636, 8926606, 8663827]
16786H663827K10862M53768M54077R5478M73306N06124j63981M88758L19048M51078
16776A1952345L89108O32558J96798P31602K34597N64156M10795O44657O78308
16767A6434924L00287P51659L36902Q41293Q14600J255391M05683J139965P85123
16758B3065827J205071Q36270J712054O55799J128183J629682J240077K201452
16750C3674415J341722K179979K106384J784912K244935K385629K934350K579259
16742E1231585K842000L546092L359106L941696M054791M102509M939812M991881
16734H3009472N955328N783706O194000O880025O831038P107782P544933Q032524
16726A37338808P574262P574054P533020O899794O105282N289396M251188K856125
$$ y = [8663827, 8874689, 9328457, 9782534, 9878012, 10351318, 10857442, 10693461, 11182219, 11501267, 11952345, 12341453, 12974011, 13170809, 13902411, 14137008, 14701164, 15111959, 15756616, 16434924, 16735211, 17486870, 17823772, 18665065, 19479665, 20735056, 21140739, 22280704, 23065827, 24270898, 25107168, 26819222, 27475021, 28603204, 30232886, 31472963, 33674415, 35016137, 37196116, 39302500, 41087412, 43332347, 45717976, 48652326, 51231585, 54073585, 57619677, 60978783, 64920479, 68975270, 73077779, 78017591, 83009472, 88964800, 94748506, 100942506, 107822531, 114653569, 121761351, 129306284, 137338808, 144913070, 152487124, 160020144, 166919938, 173025220, 178314616, 182565804, 185421929]
16718A85421929J481668k02743j504898l079350m079473n017653o348167p046326
16710A59624987p801621p180579q230562p744858p362292p647641p057854o362548
16702A00237032n951749o117539n341533n212180m959235m445073l895332l999300
16694F0315091l402756l566506l045892k721199k539509k439816k116333k028874
16686C8454206k191051j834519j299257j539980j944056j193660j250992j056739
16678B6143952j375644r62887p50455j378561j192004j08070j134936j039235
16670A8202160n28029m89757r97162l42671q06051k92012n57910n46557m01359
16661A3240652k94117o32048k28435n98601m3411m74580k69837o04104j83060
$$ y = [185421929, 186903597, 186700854, 185195956, 182116606, 178037133, 173019480, 166671313, 159624987, 151823366, 144642787, 136412225, 128667367, 121305075, 113657434, 106599580, 100237032, 94285283, 88167744, 82826211, 77614031, 72654796, 68209723, 64314391, 60315091, 56912335, 53345829, 50299937, 47578738, 45039229, 42599413, 40483080, 38454206, 36263155, 34428636, 33129379, 31589399, 29645343, 28451683, 27200691, 26143952, 24768308, 23805421, 23054966, 21676405, 20484401, 20376331, 19241395, 18202160, 17674131, 17184374, 16187212, 15844541, 15038490, 14746478, 14188568, 13642011, 13240652, 12946535, 12314487, 12086052, 11487451, 11444040, 10969460, 10699623, 10095519, 9912459]
16652I912459n6702o97242k39917j59347m71497L61302o83762j49648k24041k00827
16642G390778K14357n05161o9267n51371M3515R4419o57899K2266M28328n53141
16632E856824p1427l86763L09570m67471j373j54019k29824K290m10666O5486
16622D512627J85509l19133j84526J36649k85764J24666k69054P9207L1175J54462
16612D165818n93372K73869j92684k95822l3295j9641K20026j10236j66231J8021
16602C266453M1754k21842j87081J50267p9764k27502o2405M6555j6085R90P4999
16591B786339k19189o0333P2714k9417l22937K3546O9602q4575j98279J2154K5888
16580B075513k53489k2627M25650k16051m03905J17513k39007L50459j30186K22319
$$ y = [9912459, 9855757, 9158515, 8918598, 8759251, 8287754, 8649056, 7965294, 7815646, 7591605, 7390778, 7605135, 7099974, 7030707, 6479336, 6522851, 6617270, 5959371, 5981637, 6409965, 5856824, 5785397, 5398634, 5708204, 5240733, 5239360, 5085341, 4855517, 4857807, 4447141, 4512627, 4698136, 4379003, 4194477, 4331126, 4045362, 4170028, 3900974, 3980181, 4011356, 4165818, 3572446, 3846315, 3653631, 3357809, 3324514, 3304873, 3524899, 3414663, 3248432, 3266453, 3308207, 3086365, 2899284, 3049551, 2969787, 2742285, 2679880, 2726435, 2710350, 2711340, 2786339, 2567150, 2506817, 2579531, 2550114, 2227177, 2250723, 2320325, 2235750, 2037471, 2049625, 2075513, 1822024, 1799397, 2225047, 2008996, 1605091, 1722604, 1483597, 1834056, 1703870, 1926189]
16570A926189j39827L46479k78819j42739J23475Q5812k49107J44264l52358K43197
16560A706566l0195k07484L97169r8931j85489j38245J71106p8877j64213k76250
16550A095157M24806k86880J82030k5918j70935j57369L36493k64999J11059J47146
16540A390590n14707L83750k0691Q0467k21601O2143R8590j97226K41303K29002
16530A531620l29011m2591j02395O0139k47878M4941N1960K83724r0839m236l56134
16519G99300O8148m9125L12324D56291L89797K86345j20183l8877j21393j25214
16509G26766M79218m37897J83945j44332k1887J97410l96498L67343K092k33286
16499G22874j30387L93917D31691L70194L81235l69940K07803m05492J40861M1638
$$ y = [1926189, 1786362, 2132841, 1854022, 1711283, 1834758, 1920570, 1671463, 1815727, 1463369, 1706566, 1676371, 1468887, 1866056, 1767125, 1581636, 1443391, 1614497, 1535620, 1371407, 1095157, 1519963, 1233083, 1415113, 1389195, 1218260, 1060891, 1397384, 1132385, 1243444, 1390590, 875883, 1259633, 1238942, 1319409, 1097808, 1159951, 1258541, 1061315, 1302618, 1531620, 1202609, 1160018, 1057623, 1117762, 869884, 914825, 966785, 1250509, 1159670, 1155434, 799300, 867448, 818323, 1130647, 456291, 846088, 1132433, 1012250, 973373, 851980, 726766, 1205984, 768087, 952032, 807700, 785813, 983223, 586725, 954068, 956160, 722874, 592487, 986404, 431691, 801885, 1183120, 813180, 1020983, 615491, 756352, 797990]
16489G97990q8973k53755K98897n2503J43427j40686J38565N5598n0260j10088
16479G38212N4902j66354J12207J28171k26283o6749K54013B15438M32466j49504
16469D98400j59321K91102j10968J653R0649J55413j67237j34246J93967k07753
16459D51659K72663k00109K1851J10392P7790n2931P7660k29064N4164k84970
16449B99105L31119m6086m0900J99186j36377l6448K6761p8213l6134R6117k41369
16438C36761K27193k19260K66288k01294Q4074M1370K16896k13062l5291M2318
16428E45993n8485j04165J43343n1910A99283K38362j66383J13870j66314M88915
16418G07733o7699k95575l9140R7234L2769O118j31277J14476j85223p399m7645
$$ y = [797990, 709017, 455262, 754159, 701656, 845083, 704397, 842962, 898560, 848300, 738212, 793114, 626760, 738967, 867138, 640855, 574106, 828119, 215438, 647904, 498400, 339079, 630181, 519213, 520866, 611515, 766928, 599691, 465445, 659412, 451659, 724322, 524213, 546064, 656456, 734246, 681315, 758975, 529911, 584075, 299105, 630224, 584138, 543238, 742424, 606047, 569599, 596360, 518147, 482013, 578130, 336761, 563954, 344694, 610982, 409688, 493762, 535132, 752028, 538966, 503675, 545993, 487508, 383343, 526686, 474776, 199283, 437645, 271262, 385132, 218818, 707733, 640034, 344459, 305319, 402553, 435322, 441440, 310163, 424639, 239416, 232017, 184372]
16407A84372M03856Q8874C21947J8786j28282q0972L26723A18123J73614M24125
16397G15862l31683l4272L2914J47015k08894A57855L22670E4655M67247m5389
16387D76513a13446B77532J08902Q6885K63739B74412r1355K37853n6624n7037
16377C07249J29965j12632j08924G0981J44783N8423J6439J0348r7050J88755
16367C92679J17631B30911r6159B3853N57982j87765p5091r7307M054L27613r3028
16356D60311B16173L08361A20801L06467A4129L18964l2036q6122d1865C53359
16345A83530J51165j34585J86227J05347j07526A24274J28303k7525A00499J62329
16335B62828o9957d8843B07321b6568B47704r2970K30198G9142N44240A47308
$$ y = [184372, 588228, 677102, 321947, 340733, 212451, 131479, 458202, 118123, 291737, 715862, 384179, 349907, 382821, 529836, 320942, 157855, 480525, 54655, 521902, 476513, -113446, 277532, 386434, 473319, 737058, 274412, 183057, 420910, 364286, 307249, 437214, 324582, 215658, 70981, 215764, 274187, 290626, 300974, 203924, 392679, 510310, 230911, 134752, 23853, 581835, 394070, 318979, 221672, 225726, 553339, 460311, 216173, 524534, 120801, 427268, 14129, 333093, 301057, 214935, -41865, 353359, 183530, 334695, 200110, 386337, 491684, 384158, 124274, 252577, 225052, 100499, 262828, 192871, -48843, 207321, -26568, 247704, 154734, 384932, 79142, 623382, 147308]
16324C07929A40580K61941A92457e2720E25640B32820J53375l5524r6864J6279
16314B70086J41133Q5374A82431m4727B1107K76617K65412k15405O6216j65477
16304B48470K14383n6265F2380Q2282C6409O7515a07642C85614A68873l3235D8327
16292A81689m926R1202M5555F7827J09111j0477G1221K83237G2262K2110R3693
16281A88065J40848O8617a29349B48064H0602O4647l3735L09581a14460j9906
16271a34366B67205l3380a16749B12939b05888A21489J27279c9737B56415o767
16261B49648a47568D4253K11174J20123c7496F9531J78973a90260i1147C43188
16250a35264A05839j361N6251R9837K48679A33097F3170J14255J72682c9515o5628
$$ y = [307929, 140580, 402521, 192457, -52720, 525640, 232820, 386195, 350671, 253807, 270086, 411219, 496593, 182431, 137704, 21107, 297724, 563136, 347731, 413947, 248470, 462853, 406588, 62380, 144662, 36409, 103924, -107642, 385614, 168873, 135638, 48327, 181689, 176763, 267965, 313520, 67827, 176938, 166461, 71221, 354458, 72262, 94372, 188065, 328913, 397530, -129349, 248064, 80602, 145249, 111514, 421095, -114460, -134366, 267205, 233825, -116749, 212939, -205888, 121489, 248768, -39737, 256415, 249648, -147568, 44253, 255427, 375550, -37496, 69531, 248504, -190260, -91147, 343188, -135264, 105839, 104478, 160729, 260566, 509245, 133097, 63170, 177425, 350107, -39515, -105143]
16239a05143O773C67555d9535A95849K1920D6174J3396e0085B80617a01556A28058
16227D09293A53491B7541K1485o623b6374B4393K23147C3763K3670N6535J08282
16216B22250d783B86760j24931a78866b8615A61325M7653F4088J73703E2126b27673
16204B37982g6528A9744N09037A72680O0146c5372k11688H5315L61197H5733J15225
16193B00958J0764l9959O774e940B04090a03697B73654c19856e9980j78592B02984
16181G5969J00278E5806c5755A58524J7093d4347j9748D7985a04517A99809a9092
16169e7680J3195A07734A757a59883A54206N5110l2939n1406b13833B63045r1938
16158A71107a65230A8866f710A04524q424j5666L9654a03680A12694D617R3375
$$ y = [-105143, -98370, 367555, -49535, 195849, 217769, 46174, 59570, -50085, 280617, -101556, 128058, 409293, 153491, 27541, 49026, 42403, -26374, 24393, 247540, 33763, 57433, 113968, 222250, -4783, 286760, 161829, -178866, -28615, 161325, 208978, 64088, 237791, 52126, -227673, 237982, -76528, 19744, 528781, 172680, 232826, -35372, -247060, 85315, 446512, 85733, 200958, 211722, 171763, 178537, -5940, 204090, -103697, 273654, -319856, -59980, -238572, 202984, 75969, 176247, 55806, -35755, 158524, 175617, -44347, -64095, 47985, -104517, 199809, -19092, -57680, -44485, 107734, 1757, -159883, 154206, 209316, 176377, 124971, -213833, 263045, 171107, -165230, 18866, -6710, 104524, 96100, 80434, 120088, -103680, 112694, 4617, 97992]
16147I7992A8072a5446A5647a11209j4287A32401n5348B4819J61154a23845o3844
16136a87689B40535e9536j4451B97144A39716b51339A40325o2970f5791r6398
16126a62189d7202B9040b55929f6756B15520i2250G9217J10421H1318m105a28920
16114A60244J00443H6364J342N6523C245b31409j26065a38972B9949d3171A08533
16102B57072E3364a1899B22609l0426a02502A46548B0607K08638a04232a7687
16091A17738b74610D8188L54085e7864J4265F7798b38548A01338D2706q523J40814
16080A74997q0963K40509d752n9331K6092K444j71314C2018a71698D1670a01663
16068c5835A06537c57242h9318A8471a08898D622O0365c82192a34532B9480b38357
$$ y = [97992, 18072, -15446, 15647, -111209, -125496, 132401, 77053, 24819, 185973, -123845, -187689, 240535, -59536, -73987, 297144, 139716, -251339, 140325, 77355, -65791, -162189, -47202, 29040, -255929, -66756, 215520, -92250, 79217, 189638, 81318, 77213, -128920, 160244, 260687, 86364, 87706, 144229, 3245, -231409, -357474, -138972, 29949, -43171, 108533, 257072, 53364, -11899, 222609, 192183, -102502, 146548, 20607, 229245, -104232, -17687, 117738, -274610, 48188, 402273, -57864, -43599, 67798, -238548, 101338, 42706, 34183, 174997, 94034, 334543, -4752, -64083, -37991, -35547, -206861, 32018, -171698, 41670, -101663, -35835, 106537, -357242, -89318, 18471, -108898, 4622, 64987, -382192, -134532, 29480, -238357]
16056A75110a17068c8254A26780C2561g4756D7018a17121N3119B23044a34517
16045a19065N451A16084g0817P064B2534c6277j30361I9373R3057J40985C0993
16033A53376c84466a12953o7408P6954p4268c9973A63362O8617i4729j805G3391
16021B71638g8644M866A40599d6746b666r0611j80560J11764a1374F3284a22013
16009A39013J20979a27500H3506J22350e6140j92299B52799G0647P5149a75892
15998a57659P666a9410m20931h5323j23859d3759D2721e40082I283J08384A1855
15986B56940F5740n990N096g0239c5100A62876a98177C31035A51139e3492j16583
15975a70075q8345d2952C32665A09514L54796A37082B8869b18403P1772C35829
$$ y = [175110, -117068, -38254, 126780, 32561, -74756, 47018, -117121, -64002, 223044, -134517, -119065, -113614, 116084, -70817, -63753, 22534, -36277, -166638, 99373, 192430, 333415, 30993, 153376, -384466, -112953, -180361, -103407, -177675, -39973, 163362, 231979, -94729, -96534, 73391, 271638, -78644, -73778, 140599, -46746, -2666, -93277, -273837, -162073, -11374, 63284, -122013, 139013, 259992, -127500, 83506, 205856, -56140, -248439, 252799, 70647, 145796, -175892, -157659, -149993, -19410, -440341, -85323, -209182, -43759, 42721, -540082, 9283, 117667, 11855, 256940, 65740, 59750, 64846, -70239, -35100, 162876, -198177, 331035, 151139, -53492, -170075, -258420, -42952, 332665, 109514, 464310, 137082, 28869, -218403, -146631, 335829]
15964d4353j93730e5109d263B22248a97098I9598J03198C9135c10327B3363b1783
15952A35443b67936a01110K7118A30802h352j65980d0327C8516c8745J1823l0446
15941e7368o9715j6514A26582b76963O0701q6717j5278F740a11310J1775B12306
15929a02925J7324L4625B9143a93189j62685h9416n8799C58206j41282a61737
15918B76446d9534k77444B165d5844O043j9239j19944D6224a80052E1256J20397
15907A71653b58820A94024p4721b43639e6866H961e3280H2264a90628P7211I1404
15895A77560a60580M6740b0868j88106C5887P6877b2953c952B24218J37394b66361
15883F960J2282J0275A2939b15754c6259n2905J7183C0600a37610B6835P1846
$$ y = [-44353, -238083, -55109, -4263, 222248, -197098, 99598, 202796, 39135, -310327, 23363, -21783, 135443, -267936, -101110, -73992, 130802, -8352, -174332, -40327, 38516, -38745, -26922, -57368, -127083, -143597, 126582, -276963, -216262, -302979, -318257, 6740, -111310, -99535, 212306, -102925, -85601, -50976, 29143, -193189, -355874, -89416, -148215, 358206, 216924, -161737, 276446, -49534, -326978, 2165, -45844, -39801, -59040, -178984, 46224, -180052, 51256, 171653, -258820, 194024, 119303, -243639, -56866, 8961, -53280, 82264, -190628, -113417, 91404, 177560, -160580, -113840, -20868, -208974, 35887, 112764, -22953, -3952, 224218, 361612, -266361, 6960, 19242, 29517, 12939, -215754, -36259, -89164, -71981, 30600, -137610, 26835, 98681]
15872I8681j1909e7789I0985c29086D1447a24302b8408F9263j1967c73850i3514
15860A71929J06333b20912a05445e0686j10373j9073l6166C2468J74859B3570
15849B15632n7954a5300j04291k20488E6825i6489A29665e8428q9115j41176a33549
15837a48773b6390l41941J49004D7541a3787C8180a05773I441K47431c23717D2258
15825e7264j24666d0920A85103h6767K4633A5911b40867L4046A0254a05067r152
15814a14219A00558R5531H8931a07495j77297h7193p710c9899j29900f6456r622
15803g6078B33116f5626A90054a34517e6852p5757N7756D41789h1769C70095c46381
15791e8968k20747M9680A87484p5784m4140b27740K9319A61969a64105A44462
$$ y = [98681, 86772, -57789, 90985, -329086, 41447, -124302, -28408, 69263, 57296, -373850, -93514, 171929, 278262, -220912, -105445, -50686, -161059, -180132, -216298, 32468, 207327, 23570, 215632, 157678, -15300, -119591, -340079, 56825, -96489, 129665, -58428, -147543, -288719, -133549, -148773, -26390, -368331, -219327, 47541, -13787, 38180, -105773, 9441, 256872, -323717, 42258, -57264, -181930, -40920, 185103, -86767, -62134, 15911, -240867, -206821, 10254, -105067, -114219, 100558, 196089, 88931, -107495, -284792, -87193, -94903, -39899, -169799, -66456, -76078, 233116, -65626, 190054, -134517, -56852, -132609, -74853, 441789, -81769, 370095, -346381, -58968, -279715, -230035, 187484, 111700, 67560, -227740, -198421, 161969, -164105, 144462]
15780A16947J04650a70177a4051A85876d9549B81294a49559N2265l2110B9141
15769A54585H630K03509m0065p4239J5096K08934A19188n8808a44064M4767M7825
15758e1472n4031b8122G8803Q6826b13360I3491a2657j49350i035A8187J35224
15747A53411a08035B95713a01156D2528g3183C05718d27569H1168J1414a34919
15736b44230J07298J8757B28000A10817a02415C1127k613a76239C05993b59127
15725A3344c45789J58465L475A30727m5482a18924A84808b20367J4676I6172h957
15713I6475J55679d30851b11347c2620j45482G8716g264A56744M9575p1780f393
15701e02065B51099o4426c10883A34597n80e8138c494j20572l1644A4680L6331
$$ y = [116947, 221597, -170177, -14051, 185876, -49549, 281294, -149559, -97294, -129404, 29141, 154585, 8630, 212139, 172074, 97835, 112931, 321865, 119188, 60380, -144064, -99297, -51472, -105503, -28122, 78803, 165629, -213360, 93491, -12657, -162007, -9035, 18187, 153411, -108035, 295713, -101156, 42528, -73183, 305718, -427569, 81168, 92582, -134919, -244230, -136932, -118175, 228000, 110817, -102415, 31127, 28514, -176239, 305993, -259127, 13344, -345789, -187324, -183849, 130727, 85245, -118924, 184808, -220367, -205691, 96172, -8957, 96475, 252154, -430851, -211347, -32620, -178102, 78716, -7264, 156744, 206319, 134539, -6393, -502065, 251099, 186673, -310883, 134597, 134017, -58138, -3494, -124066, -155710, 14680, 51011]
15690E1011a23427b9990C8890m993j3737L3065d1042B05736F4495J4038f9594
15678a9168D1214a54201m4448f4507C6655K0251J07369R0620J54720a4002C86909
15666F2804g0945J8197Q027J5972k95427b5325B2015g8948o4185B10169a5423
15654B25396F7213a14315I7281a39356C70574a77263a8521j22855N8258k54887
15644c38005H9123J10905b3388l7955J6794j92061B87686D9278d49445R0328J40289
15633b18828j7954Q2310j12415B94625a78585j16570c3136k78287f8208j65768
15623b33976e5745B5315a48709J6350p7660F9412J09504a93005A23059B9376j4585
15612A4791i9856j79429B7872d4951j35216A0559q3O784R4741D5310Q0363d1128
$$ y = [51011, -123427, -29990, 38890, 33897, 20160, 53225, -41042, 205736, 64495, 78533, -69594, -19168, 41214, -154201, -198649, -64507, 36655, 56906, 164275, 254895, 409615, -14002, 386909, 62804, -70945, -52748, -44721, -28749, -324176, -25325, 22015, -78948, -143133, 210169, -15423, 225396, 67213, -114315, 97281, -139356, 370574, -177263, -18521, -141376, -83118, -338005, 89123, 200028, -23388, -61343, -44549, -236610, 287686, 49278, -449445, -359117, -218828, -236782, -154472, -266887, 294625, -178585, -295155, -33136, -311423, -68208, -233976, -55745, 25315, -148709, -132359, -210019, 69412, 178916, -193005, 123059, 29376, 14791, -99856, -279285, 27872, -44951, -180167, 10559, 10476, 17260, 112001, 45310, 125673, -41128]
15599b46692I955g9518c3953C0543a37955A55813D5068K44987a43536B75943D5425
15587c2551B27872c68111E8243J34831o1309l6617b26903J09819a8076j46417
15577a64493j65471A59300A0956b07653B37838g0178A4637g4533A59923R7177
15567B57100a84337N3202H2744B5916P0029J86420n9413a73491F650Q4077d33873
15555a01474A54242E2356b88073H1694a07799D19278B9196P3801a16921K3022
15545i3899m0938J2759B47670N1783g2746A55447m0652C1377I6J64852c20199
15533a0103j26137D549a92372j06791B42574A6972J6035a28893F3099B5519b13715
15521b86931A18609f1900C73397C4762M1902g123r3497K6309P68c3753j8217j73079
$$ y = [-246692, 9955, -79518, -33953, 30543, -137955, 155813, 45068, 290055, -143536, 275943, 45425, -32551, 227872, -368111, 58243, 193074, 131765, 95148, -226903, -117084, -18076, -164493, -329964, 159300, 10956, -207653, 237838, -70178, 14637, -74533, 159923, 257100, -184337, -131135, 82744, 25916, 95945, 282365, 222952, -173491, 6650, 90727, -433873, -101474, 154242, 52356, -288073, 81694, -107799, 419278, 29196, 102997, -116921, -93899, -134837, -122078, 247670, 299453, -72746, 155447, 114795, 31377, 96, 164948, -320199, -10103, -136240, 4549, -192372, -299163, 242574, 16972, 33007, -128893, 63099, 25519, -213715, -286931, 118609, -61900, 373397, 34762, 76664, -7123, -100620, -74311, -73543, -33753, -51970, -225049]
15509b25049k65183A02565K63010E9363a633k64191E2557i140o4546k84003J32074
15498b25615e8025q0637p2051g9389A94361a44809A19066g5225B924a25153k1011
15487a46164j91142h3576B08277J33137a11060B73265c29411g6621n6281F7091
15476d01336B80756a19776A38575c48648a44326c6499C0423O3042b50919d5559
15465a13585l0979B19431A0977J94790e3791E0083b70418B447J09458b89348G3148
15453a99946P9341j52212h6444A76064b00513b4873m2398H6735J30941i2519A51459
15441i1274j69831G0010a97450g5331A60320g8714A65807b07770B78746C2349
15430A67832a00366J7346j7388D5472A3851a33719j33068a6171o3075A063a16634
$$ y = [-225049, -490232, 102565, 365575, 59363, -1633, -265824, 52557, -9140, -73686, -357689, -225615, -58025, -138662, -210713, -79389, 194361, -144809, 119066, -75225, 2924, -125153, -146164, -337306, -83576, 208277, 341414, -111060, 273265, -329411, -76621, -132902, 67091, -401336, 280756, -119776, 138575, -348648, -144326, -36499, 30423, 93465, -250919, -45559, -113585, -144564, 219431, 10977, 205767, -53791, 50083, -270418, 2447, 111905, -289348, 73148, -199946, -120605, -272817, -86444, 176064, -200513, -24873, -67271, 86735, 217676, -92519, 151459, -91274, -261105, 70010, -197450, -75331, 160320, -78714, 165807, -207770, 278746, 32349, 167832, -100366, -83020, -100408, 45472, 13851, -133719, -266787, -16171, -79246, 1063, -116634]
15418A61187e9916r8218D690K81432E470b26131m3914J21497E2495g56D02152
15406b067p4440b9613B63669H4535a34875p1270d6710A34204K66324a63682e2184
15394A0602J94606a06422A63533J78831f4682a7664B06101c15936a32645j285
15384a33930E2185A7998a25048b8188j8867F4829J05750B6831L8351a55291E0
15372h9072A74400d3215j29857B84829F4636b8849H2712R08b81301B32136a21674
15360c6924D2535A0125a10942j54810b1356k30910i2475M5952A40568d59637A11376
15348b3506A07853i6239A17661G701a19162M0821m9152A21166C8755K10092J7223
15337B66070B9585M9452a0285B70799A05776b4735B98993f6832B9879J50750a24360
$$ y = [161187, -59916, -158134, 4690, 286122, 5470, -226131, -270045, -148548, 52495, -756, 402152, -2067, -76507, -29613, 263669, 84535, -134875, -206145, -46710, 134204, 400528, -163682, -52184, 10602, 205208, -106422, 163533, 342364, -64682, -17664, 206101, -315936, -132645, -133930, 52185, 17998, -125048, -28188, -47055, 64829, 170579, 26831, 65182, -155291, 50, -89072, 174400, -43215, -173072, 284829, 64636, -28849, 82712, 83620, -281301, 232136, -121674, -36924, 42535, 10125, -110942, -265752, -21356, -252266, -92475, -46523, 140568, -459637, 111376, -23506, 107853, -96239, 117661, 7701, -119162, -78341, -127493, 121166, 38755, 248847, 266070, 29585, 79037, -10285, 270799, 105776, -24735, 298993, -66832, 29879, 180629, -124360]
15325D6248f2422C443c39511a55670L4016a1845E64707b9298j40942C8984J06094
15314A45078J00999I2300h561j51451G3887a53845D10850a53347a0599k20839
15304b31438d3902j45067H060c6416n2119e743j88844B74536A21792l3826a04923
15292a70507L8724f5800B8534N8008J26084a68954H5676D569a53594I3614a86329
15280a15203C98865A25913l5607L3259a02427J5958C5653K14831e915G6790C4779
15268B2534M0221d1552A39900a09711B83404r3537J807p9409a49368E9662P9378
15257A39040b46011R3435A96221j3732a00612A21785K69008J95023R36038k51309
15247A270545j85402J54488B01199B0112Q9219n2217a38336B70446g5994A55214
$$ y = [46248, -62422, 3443, -339511, -155670, -121654, -11845, 564707, -29298, -170240, 38984, 145078, 246077, 92300, -8561, -160012, 73887, -153845, 410850, -153347, -10599, -231438, -43902, -188969, 8060, -36416, -88535, -5743, -194587, 274536, 121792, 87966, -104923, -170507, -131783, -65800, 28534, 86542, 212626, -168954, 85676, 4569, -153594, 93614, -186329, -115203, 398865, 125913, 90306, 123565, -102427, -86469, 35653, 250484, -5915, 76790, 34779, 22534, 62755, -41552, 139900, -109711, 283404, 189867, 191674, 112265, -149368, 59662, 139040, -246011, -152576, 196221, 182489, -100612, 121785, 390793, 585816, 1521854, 1270545, 1085143, 1239631, 201199, 20112, 109331, 57114, -138336, 270446, -75994, 155214]
15236H9717f2963k153F4755B5394K19281a65194F4071M1008f0793C7883J3272
15225E1155a479n04633d2640j49198B83492c15426i0633C16513E9469e4928o8523
15214a23451q585C4575b21876O6953b9931j7737A87963n7665q410L1810b06340
15202D55638A11058J23963F9818O802M9840E8401g2213E0817a8677j0897B06196
15190B7025b29553J3563I9802c99187a37620B15956a17985l06423H2284b8198
15179a01368A72769b79893a23070k4541A17857c1881j35596k9194M9437C66598
15168D40490b51180B23625C1832M625J41002a1987A09817l0030a66386f663E16472
15156e6093k46542f295B0553N130N4633J35820H3506e5201H5358a88243D8173
$$ y = [89717, -62963, -65116, 64755, 25394, 244675, -165194, 64071, 105079, -60793, 37883, 51155, -1479, -506112, -42640, -191838, 283492, -315426, -90633, 316513, 59469, -54928, -123451, -132036, 34575, -221876, -154923, -29931, -47668, 187963, 130298, 121888, 153698, -206340, 455638, 111058, 235021, 69818, 76620, 126460, 58401, -72213, 50817, -18677, -29574, 206196, 27025, -229553, -215990, 99802, -399187, -137620, 215956, -117985, -424408, 82284, -28198, -101368, 172769, -279893, -123070, -147611, 117857, -31881, -167477, -196671, -147234, 366598, 440490, -251180, 223625, 31832, 36457, 177459, -11987, 109817, 79787, -166386, -6663, 516472, -56093, -302635, -6295, 20553, 25683, 80316, 216136, 83506, -55201, 85358, -188243, 48173]
15144a88211A48047N3328p9915b51882N5086F2446a2258F65614A47717c05488
15133D2348L7554d4877D12868f4202A11282j3244J29464I381b33990C874c039
15121H2306K06667j01812B2451L11860A16010N7319k5591m2588J05934a99383
15110G9858K4500a74384G0289e2792k70932B32838j8287g9103B27285i7346A00368
15098g9887a6802A15036a93125B26376b5796D127L07689k8264E4438N6906C8754
15086C4946K51796b1854A22827n3635J44811p4603Q8107h1182B61963b0078A03118
15074H4701J63349m0094c0443B1250K67523I7658D3716J13823K77773A87132F6975
15062C12616A8607M3193f7791C37006q4705D914L91184E3133K21846e0213B10549
$$ y = [-188211, 148047, 201375, 121460, -251882, -196796, 62446, -12258, 665614, 147717, -305488, 42348, 79902, -44877, 412868, -64202, 111282, 98038, 227502, 9381, -233990, 3874, -3039, 82306, 288973, 187161, 22451, 334311, 116010, 173329, 147738, 105150, 211084, -199383, 79858, 104358, -174384, 70289, -52792, -323724, 232838, 214551, -79103, 227285, -97346, 100368, -79887, -16802, 115036, -193125, 226376, -25796, 4127, 311816, 283552, 54438, 111344, 38754, 34946, 286742, -21854, 122827, 69192, 214003, 139400, 227507, -81182, 261963, -20078, 103118, 84701, 248050, 207956, -30443, 21250, 288773, 97658, 43716, 157539, 435312, 187132, 66975, 312616, 18607, 61800, -67791, 337006, 252301, 4914, 396098, 53133, 274979, -50213, 210549]
15050i4892H0952Q4310n8214P4423J80748A02645K00907J0970k8255B9425J39258
15039A68683L13810e19j6429A5647J5083O8144J13382L493h537I7732m6336Q359
15027E9755J91531J41549A86014H8037a64376d0146E03314A76740Q7536J02632
15017C66908j3746A74528m4832b43219A67613b65889C39544l3200j09182k8479
15007A68683J01134i9518A93120a22167B89568A08575K74183d5317j8594C85292
14996D90368j528d8292j6075A49616G2630O662k6997J86202J26401g5554D07458
14984C7930J66264K7676j1244J7647c3518A64273C291Q6977P8042N6333K45938
14973D70581A25937J72048J1316j30016m9337a85855A40953Q8963J3576B1398
$$ y = [-94892, 80952, 165262, 107048, 181471, 362219, 102645, 303552, 314522, 286267, 29425, 168683, 482493, -519, -16948, 15647, 30730, 98874, 212256, 215749, -8537, 97732, 51396, 59755, 251286, 392835, 186014, 88037, -164376, -40146, 503314, 176740, 264276, 366908, 353162, 174528, 129696, -243219, 167613, -265889, 339544, 306344, 197162, 168683, 269817, -99518, 193120, -122167, 289568, 108575, 382758, -45317, -63911, 385292, 490368, 488840, -48292, -64367, 149616, 72630, 79292, 52295, 238497, 364898, -75554, 407458, 37930, 204194, 231870, 220626, 238273, -33518, 164273, 3291, 90268, 168310, 224643, 470581, 125937, 297985, 309301, 179285, 129948, -185855, 140953, 229916, 243492, 21398]
14962A00935b35187B14544E1777J48978e5218o6065o1b945C44210g6413D69492
14950A45388a25534A75000J53307O960c46867B37887c655o1435B16085O7128j40690
14939A42523l3156f899I9806J63809o2079l482G6252L33925D2927L83638B7209
14927D18849a1861F3437L29712A44553c6014a7504B30156a42926M0504E51250
14916D89514A06481J29741L38002B0272M24254j38152D6857L2580J27117K12961
14906D19515A19120L14357C6378M3506M51312H6305B3813L30931G805i1917E05594
14894C99286L8071D5398L01185B8684K76225J50109B3296L701K39516L44526n9760
14883E51279k37773N069l5160J42363E1669K29094J63697m8385p5177p0114k4016
$$ y = [100935, -235187, 214544, 51777, 200755, -55218, -121283, -121344, -2945, 344210, -76413, 469492, 145388, -125534, 175000, 328307, 335267, -346867, 237887, -3655, -65090, 216085, 283213, 142523, 109367, -6899, 99806, 263615, 201536, 198054, 76252, 410177, 42927, 426565, 27209, 418849, -11861, 63437, 393149, 144553, -36014, -17504, 230156, -142926, -102422, 551250, 489514, 106481, 236222, 574224, 20272, 444526, 306374, 46857, 79437, 206554, 419515, 119120, 433477, 36378, 79884, 531196, 86305, 23813, 354744, 7805, -91917, 505594, 399286, 437357, 45398, 346583, 28684, 304909, 455018, 23296, 26997, 266513, 611039, 551279, 313506, 318575, 283415, 425778, 51669, 280763, 444460, 396075, 320898, 250784, 226768]
14872B26768K00960p6537N7712A78864J21307D9266L42860D2481K88117n6846
14862B73752k844f1439C21747l5400Q6318L8749J74367k54954p8166p5318l6097
14851A41246R1782L01993A23052J39762K59419B35805K68563j14264o335j01530
14841B82239D0803K53791K54496k23051I2739L7680N871D2009L23679E6078J70543
14830B26621N11970B30461N75598C83213J25691q8155j14591Q0757H8019J93510
14820B81529J18562A70436J60939K87966r6754j70202j049m5176j10226K78725
14810D74659j54208J04031M1275j0990A44563J2784N21837k22456B21930J86606
14800D08536P6060Q5435j94202j39173n838J18031l0126K55911j48561O378l1919
$$ y = [226768, 427728, 351191, 408903, 178864, 300171, 49266, 392126, 42481, 330598, 273752, 270908, -61439, 321747, 286347, 372665, 411414, 585781, 330827, 252661, 177343, 141246, 233028, 535021, 123052, 262814, 522233, 235805, 504368, 390104, 383769, 282239, 40803, 294594, 549090, 326039, 92739, 130419, 136290, 42009, 365688, 56078, 226621, 738591, 230461, 806059, 383213, 508904, 420749, 306158, 386915, 88019, 281529, 400091, 170436, 331375, 619341, 522587, 352385, 351336, 306160, 195934, 474659, 320451, 424482, 465757, 454767, 144563, 157347, 679184, 456728, 221930, 408536, 484596, 570031, 375829, 236656, 230818, 348849, 318723, 574634, 426073, 432451, 400532]
14789D00532J14530j39107R5914j04647Q0051J5917P7165J00054j01225k48042
14779B91142j0792L19295k5070j47194Q2996J62859k60462L01341C07995J48512
14769D56507j01000j76886K80347j94986K85452J50517C12319K58605L3301K1109
14759F25334B81559M40299n7624k97314J78742J20252j09561J05056j4744k7580
14749F19085J90047B85531L88226k20754B06563K21626K00164j83021j51382K76055
14739E70005J28780k07235J73312j33403P4400P9004J57378L6348k31000p7261
14729E70328j92211n0198N51996l73349M79574l52318K29612l28357l1232J78735
14719F82580l272k380J36991D02290L9812R9152R9652J83491j00825l34051L33602
$$ y = [400532, 515062, 375955, 471869, 367222, 447273, 463190, 540355, 640409, 539184, 291142, 280350, 599645, 574575, 427381, 510377, 673236, 412774, 714115, 307995, 456507, 355507, 178621, 458968, 263982, 549434, 699951, 312319, 570924, 604225, 625334, 281559, 721858, 664234, 366920, 545662, 665914, 556353, 661409, 646665, 619085, 809132, 285531, 673757, 453003, 206563, 428189, 628353, 445332, 293950, 570005, 698785, 491550, 664862, 531459, 605859, 684863, 842241, 878589, 647589, 570328, 378117, 327919, 879915, 506566, 986140, 633822, 863434, 535077, 503845, 682580, 679308, 676928, 813919, 402290, 442102, 541254, 640906, 824397, 723572, 389521, 723123]
14708G23123j45010k0340N9075j16184J4192P1149j3923J03584A81637M42986
14698F24623L07799j00880P5586D16473N19076j52302k9590j43798l2281J76451
14688G54029L6444k54519Q5163J20947K51428l43938J12694J41727k07584p5251
14678F21140L37881k29761R6527k71040L71031j29551J50318k34030J2768K3804
14668G49087r9765K16679k82378K64000L3088J66651L3573m98286K29300J38893
14658I50842R0614j09641j23429J43059J29761j87431K93785E36337J46313L63087
14648A045737k85512J83511m3121N1687j2594j5193O9011k60693L22766J94336
14638A249935k25225K26145k34691L1686J21553l55583M13020k68034n0404L14883
$$ y = [723123, 578113, 557773, 616848, 500664, 514856, 586005, 572082, 675666, 181637, 624623, 932422, 831542, 907128, 416473, 935549, 783247, 753657, 609859, 577578, 754029, 790473, 535954, 621117, 742064, 993492, 649554, 762248, 903975, 696391, 621140, 959021, 729260, 825787, 554747, 925778, 796227, 946545, 712515, 725283, 749087, 649322, 866001, 583623, 847623, 880711, 1047362, 1080935, 582649, 811949, 950842, 1041456, 931815, 808386, 951445, 1081206, 893775, 1187560, 536337, 682650, 1045737, 760225, 943736, 900615, 952302, 939708, 924515, 993526, 732833, 1055599, 1249935, 1024710, 1250855, 1016164, 1047850, 1169403, 813820, 1226840, 958806, 908402, 1223285]
14628A223285m41311N49396k30634j17740J28821J28051k47774r9370L32521j51132
14618A074113L30775j61933K2993K04688k88088P5132j43954n7415M73065j69995
14608A359381o4133j01756o7662J04952p7568J00599J26946k30942O2600K71288
14598A483705n10105K32633M26732j28513j08249k27079J80629J96783K6065J19812
14588A692413J49081k46729l2929j6692p1586n2304k5348J60986q8249K23530
14578A692173q4139R1741P7512K27234k90803J0624k11340K28290L08519l44318
14568A705493l17260L31805L47352k73845M17888r4489n9403k18370P9731M64827
14558B383729n5928m8594K39589q5700L03725K95523O52794O49624Q51268J582462
$$ y = [1223285, 781974, 1331370, 1100736, 982996, 1111817, 1239868, 992094, 892724, 1225245, 1074113, 1404888, 1242955, 1265948, 1470636, 1182548, 1257680, 1113726, 1056311, 1529376, 1359381, 1295248, 1193492, 1125830, 1230782, 1153214, 1253813, 1380759, 1149817, 1212417, 1483705, 973600, 1206233, 1632965, 1504452, 1396203, 1169124, 1349753, 1546536, 1572601, 1692413, 1841494, 1594765, 1561836, 1545144, 1473558, 1421254, 1395906, 1556892, 1468643, 1692173, 1608034, 1699775, 1777287, 2004521, 1713718, 1724342, 1513002, 1741292, 2049811, 1705493, 1388233, 1720038, 2067390, 1793545, 2211433, 2116944, 2057541, 1839171, 1918902, 2383729, 2327801, 2279207, 2518796, 2433096, 2736821, 3032344, 3685138, 4334762, 5186030, 6768492]
14548F768492M429854Q608444J6540800J987915A8871201G352566l674065j117319
14540B561182q73873J03839k51883J62650J06079l86241O0712n5341K67022K45915
14530A940061p7404k36298J75726q6281M31599j32537k01493j2626J76302J67468
14520B144517J13162l74356L81120m98318K70307J72737K84996k88974J31536
14511B336727l3910j7891l265J63195k40525j02148K31427J6530N2192l88683
14501B013649M20430L33795j12698n5654j63451J25815Q6357J33190J64112l2070
14491B913475p5252k32024M37306m52172L03112J55450j79394J32225J21318J5599
14481C139643j38354n1076K55764k72387L79709l41782O4272N9935J23964R8449
$$ y = [6768492, 11198346, 19806790, 36347590, 38335505, 18871201, 7352566, 3678501, 2561182, 1687309, 1791148, 1539265, 1701915, 1807994, 1421753, 1482465, 1427124, 1694146, 1940061, 1862657, 1626359, 1802085, 1715804, 2147403, 2014866, 1813373, 1800747, 1977049, 2144517, 2257679, 1883323, 2264443, 1766125, 2036432, 2209169, 2494165, 2205191, 2336727, 2302817, 2284926, 2281661, 2444856, 2204331, 2102183, 2333610, 2350140, 2402332, 2013649, 2434079, 2767874, 2655176, 2599522, 2436071, 2561886, 2648243, 2781433, 2945545, 2913475, 2838223, 2606199, 3043505, 2591333, 2894445, 3049895, 2870501, 3002726, 3124044, 3139643, 3001289, 2950213, 3205977, 2933590, 3313299, 2971517, 3035789, 3095724, 3219688, 3318137]
14471C318137L24640j88136P1197R3314K54882j77170K8291l3812J55122m5690
14461C800775N65187l71747k02291N18504r8353j70231m4364J62756j9392J21750
14451D262594J75862J6541N8768J60370l80624J49152J97786j3556j6652N70635
14441E180876M6521m67502M33494n62497Q36811k44697P3359j5543K61399j68415
14431E373806L95570k86779L90583R3011J08565k7346J20602K17889k36739K25230
14421F374392l91239M85116J10069j33420L05542L34181O8878m1354l56347L33388
14411G089206K14174P9098K31267l2152L18125P5039k86158N95178J32854K13229
14401H629860j97631O24865j89298K94618n7938K66834K94161L82140k53279M22377
$$ y = [3318137, 3642777, 3454641, 3525838, 3619152, 3874034, 3696864, 3725155, 3691343, 3846465, 3800775, 4365962, 3994215, 3791924, 4310428, 4212075, 4041844, 3997480, 4160236, 4140844, 4262594, 4438456, 4454997, 4513765, 4674135, 4293511, 4442663, 4640449, 4626893, 4610241, 5180876, 5227397, 4759895, 5193389, 4630892, 5467703, 5223006, 5296365, 5280822, 5542221, 5373806, 5769376, 5482597, 5873180, 5966191, 6074756, 6047410, 6168012, 6385901, 6149162, 6374392, 5983153, 6468269, 6578338, 6444918, 6750460, 7084641, 7153519, 7112165, 6755818, 7089206, 7303380, 7382478, 7613745, 7581593, 7899718, 7974757, 7688599, 8283777, 8416631, 8629860, 8432229, 9057094, 8867796, 9162414, 9104476, 9371310, 9665471, 10047611, 9794332, 10216709]
14391A0216709k1711L71483l46682O39747j32706J20821L83307j18149O57784
14382A1770603J96130J24668J2820L42043K07467K16910J59360M83031q1995N81129
14372A4012166P6876N73936J46609M18937K31625R2414M87588O74700K87520J78395
14362A7180766K96986M55833L03357O40002N94083j33740Q60723M67629M27235
14353B1092874N01106L14468N94541L89680O57451N90066L90722J107362O20755
14344B6259025P47028N58963O62085R36976R70924M98211Q62849J067757R13038
14335C3476856R94396R44268Q75298J359281J394763J009691J353952R10139J754081
14326D4072725J540842J448180J577739J808494J877190J490342K538996K025736
$$ y = [10216709, 10194998, 10566481, 10219799, 10859546, 10726840, 10847661, 11230968, 11112819, 11770603, 11966733, 12091401, 12104221, 12446264, 12653731, 12870641, 13030001, 13513032, 13431037, 14012166, 14089042, 14662978, 14809587, 15228524, 15460149, 15552563, 16040151, 16714851, 17002371, 17180766, 17477752, 17933585, 18236942, 18876944, 19471027, 19337287, 20198010, 20665639, 21092874, 21593980, 21908448, 22502989, 22892669, 23550120, 24140186, 24530908, 25638270, 26259025, 27006053, 27565016, 28227101, 29164077, 30135001, 30633212, 31496061, 32563818, 33476856, 34471252, 35415520, 36290818, 37650099, 39044862, 40054553, 41408505, 42318644, 44072725, 45613567, 47061747, 48639486, 50447980, 52325170, 53815512, 56354508, 58380244]
14318E8380244K003367K287065K566870K599785K529321L156707L219597L124873
14310G9867829L629830L164642M468693L842456M426425M608186N267990M953868
14302A14229919N568171O119429O725594O590298P262821P701745Q544446Q841941
14294A71584364R624067J0025033J0583471J1191233J2182260J2719894J3424969
14287B51335291J4030709J4899456J5106389J5771377J6050940J6576411J5875854
14280C59646427J6146057J5596283J4230757J3418312J1910084R955841P834831
14273D48738592L972676q81760j922594k399141l318227l680671n968503j0242819
14265D24297553j2794312j4183337j5309054j6014154j6477375j6733655j6193360
$$ y = [58380244, 60383611, 62670676, 65237546, 67837331, 70366652, 73523359, 76742956, 79867829, 83497659, 86662301, 91130994, 94973450, 99399875, 104008061, 109276051, 114229919, 119798090, 125917519, 132643113, 139233411, 146496232, 154197977, 162742423, 171584364, 181208431, 191233464, 201816935, 213008168, 225190428, 237910322, 251335291, 265366000, 280265456, 295371845, 311143222, 327194162, 343770573, 359646427, 375792484, 391388767, 405619524, 419037836, 430947920, 440903761, 448738592, 452711268, 451829508, 449906914, 447507773, 444189546, 440508875, 434540372, 424297553, 411503241, 397319904, 382010850, 365996696, 349519321, 332785666, 316592306]
14258C16592306j6427243j5329473j4472658j4120972j3822515j2989209j2577280
14251B16852956j1685358j0868480j0223938r521699r237358q229520p705609
14244A49380994p343599p118691o389331o053999o094490n167545m924764n027484
14236A01261091l946201m583027l920503l723327l666119k892863l139714k872755
14228G2516582l063746k604868k853733k432024k163467k201104k208032j626198
14220E3363410j737167j913735j450886j566238k246104p21121j336820j253297
14212D1138042j528135j187466q80025j308921j006980p68828j016017j191914
14204C2249756p19864p06840j320940o28864k89862q79290j101575o92206m41037
$$ y = [316592306, 300165063, 284835590, 270362932, 256241960, 242419445, 229430236, 216852956, 205167598, 194299118, 184075180, 174553481, 165316123, 157086603, 149380994, 142037395, 134918704, 128529373, 122475374, 116380884, 111213339, 106288575, 101261091, 97314890, 92731863, 88811360, 85088033, 81421914, 78529051, 75389337, 72516582, 69452836, 66847968, 63994235, 61562211, 59398744, 57197640, 54989608, 53363410, 51626243, 49712508, 48261622, 46695384, 44449280, 43728159, 42391339, 41138042, 39609907, 38422441, 37542416, 36233495, 35226515, 34457687, 33441670, 32249756, 31529892, 30823052, 29502112, 28873248, 28583386, 27704096, 26602521, 25910315, 25469278]
14195B5469278q11405n12199k56253q59207p70844j73240o32389o53259m06684
14186B0393798m48576l88213p14646p6999m72483l75703q82164J47216l48475
14177A6833755n73821K0198q16726l27835M107k82790l52266l18704j71764n15417
14167A3498737J5312l32711n38948K17689l17279l61147j07047n87981Q2752l29654
14157A1239723n8653l49073K47737p49731J78384J42521l46118l62741n8748l54436
14147I528865r4447j84205n04097L19947k05986p0778k92497r1366J3620r1678
14137H327378k62725k55158J54676l35915j28152J0881m7143m4545m76374J61003
14127G103926l71670n9163j06053J95904J58217k23105j54294l18710k57579L70400
$$ y = [25469278, 24657873, 24145674, 23889421, 23030214, 22259370, 22086130, 21453741, 20800482, 20393798, 19945222, 19557009, 18842363, 18765364, 18292881, 17917178, 17035014, 17182230, 16833755, 16259934, 16280132, 15463406, 15135571, 15139678, 14856888, 14504622, 14185918, 14014154, 13498737, 13514049, 13181338, 12642390, 12860079, 12542800, 12181653, 12074606, 11486625, 11569377, 11239723, 11181070, 10831997, 11079734, 10330003, 10508387, 10650908, 10304790, 9942049, 9883301, 9528865, 9434418, 9250213, 8746116, 9066063, 8860077, 8789299, 8496802, 8405436, 8419056, 8327378, 8064653, 7809495, 7964171, 7628256, 7500104, 7510985, 7463842, 7419297, 6942923, 7103926, 6732256, 6673093, 6567040, 6762944, 6921161, 6698056, 6543762, 6225052, 5967473, 6337873]
14117F337873k46204n22420L93212l8432P7914k2688j00613l78169Q0387k06893
14107E373967j8221p5869K81150l67518L20121n36632L79321n23726k3150J5684
14097D825127J268k74329j37969L45250M56944p34930L1821Q544j08473j8388
14087D394865L0532p0217Q3535j53097J58166K5174n13018k61073M70688j98239
14077C967316j56567l5156L2045P1030k48377k42236M11049j59062q5655l79490
14067C174897M59889k15392m8700k38708j9648L45626K2524l69230L01197J9910
14057C432365p6517j40783N0941k23537J980O1282l55325K49680O8212m1896j97910
14046B828492r6118J41408m6918q0484j08934o2185N4673n938k17787k9425L05509
$$ y = [6337873, 6091669, 5569249, 5962461, 5924029, 6001943, 5979255, 5878642, 5500473, 5580860, 5373967, 5355746, 5279877, 5561027, 5193509, 5513630, 4976998, 5356319, 4832593, 4809443, 4825127, 4826395, 4552066, 4414097, 4759347, 5216291, 4481361, 4513182, 4521726, 4413253, 4394865, 4425397, 4355180, 4438715, 4285618, 4443784, 4468958, 3955940, 3694867, 4165555, 3967316, 3810749, 3775593, 3807638, 3878668, 3630291, 3388055, 3799104, 3640042, 3554387, 3174897, 3634786, 3419394, 3370694, 3131986, 3112338, 3457964, 3480488, 3111258, 3412455, 3432365, 3355848, 3215065, 3266006, 3042469, 3044449, 3105731, 2750406, 3000086, 3068298, 3026402, 2828492, 2732374, 2873782, 2826864, 2746380, 2637446, 2575261, 2629934, 2623996, 2406209, 2376784, 2682293]
14035B682293l0785J32109k03425N4703p8722J03525l47327L67121k74060J37480
14025B542912P529m76434n5441p9426M26837j57688K16186j4346l2394n63129
14015A814606K51415l2739J77018l51386J71497j3451j492m3457k49413J3148
14005A735746O1391K89316q9662k44275k0463L08385k15387J40261k75805R2070
13995A781577j19448L93648k37723Q9786N7133O66373R03867L045589P164072
13986A3744874J6085170P785602j4381995A1145647m289352k332523q59903k99243
13978C364626o25581J50001l48685j79900n4438m06076M96406k53411k48144K09588
13968B104386k99246L41436K9510o20353N36528Q0448k93724K4194P0670m53889
$$ y = [2682293, 2651508, 2783617, 2580192, 2634895, 2556173, 2659698, 2312371, 2679492, 2405432, 2542912, 2550441, 2074007, 2018566, 1939140, 2365977, 2208289, 2424475, 2410129, 2377735, 1814606, 2066021, 2033282, 2210300, 1858914, 2030411, 2016960, 2015468, 1972011, 1722598, 1735746, 1797137, 2086453, 1996791, 1752516, 1732053, 2040438, 1825051, 1965312, 1689507, 1781577, 1662129, 2055777, 1818054, 1907840, 1964973, 2631346, 3535213, 6580802, 13744874, 29830044, 37615646, 23233651, 11145647, 6856295, 4523772, 3663869, 3364626, 2739045, 2889046, 2540361, 2360461, 2306023, 1899947, 2396353, 2142942, 1894798, 2104386, 1805140, 2146576, 2176086, 1555733, 2092261, 2172709, 1878985, 1903179, 1973849, 1519960]
13958A519960J99372r1137o7826J01181r8987J74048p4126j46536J80488P8896
13948A775333k03464j39440O9940n2480J25401J04110k12721R4670K41549m73943
13938A328955k9033K6285k2222J62462j12723J43182j04969J34344m97014M29000
13928A458267m3319o8390j52882K06565k54072K32617j18653o4283n7587l77830
13918G60433M66871o5304K98628k94112k02513K40146J98595J6863o4286m74792
13908H80529K80005j07348J73340m5244K5284l19934J24480K42967J25700j9140
13898A360639r1160k29775K23575l14797j5726K25103l18280K35054N0759j06338
13888A019054K0573q8839M3086m1031m5954L50401k86428o9481J79032j03154
$$ y = [1519960, 1719332, 1628195, 1560369, 1661550, 1562563, 1736611, 1662485, 1515949, 1696437, 1775333, 1571869, 1432429, 1502369, 1449889, 1575290, 1679400, 1466679, 1561349, 1802898, 1328955, 1299922, 1326207, 1303985, 1466447, 1353724, 1496906, 1391937, 1526281, 1029267, 1458267, 1414948, 1346558, 1193676, 1400241, 1146169, 1378786, 1260133, 1195850, 1138263, 760433, 1227304, 1162000, 1460628, 1166516, 964003, 1204149, 1402744, 1419607, 1355321, 880529, 1160534, 1053186, 1226526, 1181282, 1206566, 886632, 1011112, 1254079, 1379779, 1360639, 1269479, 1039704, 1263279, 948482, 932756, 1157859, 839579, 1074633, 1125392, 1019054, 1039627, 950788, 993874, 952843, 906889, 1257290, 970862, 901381, 1080413, 977259]
13878I77259j09299J31175J8002m35806J14144O5627J21036J82892k51854K09926
13868A023102k89398J3565q821M00741j49787j0462J05599q1236j61573L9659
13858H81389j31829L70269l56654j08452M36733j12797l78467J37581K18913n4373
13848I02313k00664K46565J6835o5831r2315R1495O270k89689K22240j8421j98771
13837F20027J04564J74677l9036k56916K7332J32327P1971j23310j085J22682
13827H33233J44775m14264k8805N00745k86771P313j07756L22395q602l90373
13817E71890J01481K31729C76115J69023P6687R1321j63413L03495j66239l0124
13807F56865j07476N20066j19184j20754l50443P60739j71068n29048K21648L5480
$$ y = [977259, 867960, 999135, 1017137, 581331, 695475, 761102, 882138, 1065030, 813176, 1023102, 733704, 747269, 738448, 1139189, 989402, 978940, 1084539, 1003303, 841730, 881389, 749560, 1119829, 763175, 654723, 1091456, 978659, 600192, 737773, 956686, 902313, 701649, 948214, 965049, 899218, 806903, 898398, 904668, 614979, 837219, 818798, 620027, 724591, 899268, 860232, 603316, 630648, 762975, 834946, 711636, 710551, 833233, 978008, 563744, 534939, 1035684, 748913, 756226, 648470, 970865, 962263, 571890, 673371, 905100, 376115, 545138, 621825, 713146, 549733, 853228, 686989, 656865, 549389, 1069455, 950271, 829517, 479074, 1239813, 1068745, 539697, 761345, 796825]
13797G96825l8370l45160K72166q3564J46313J1629j79151k06016L91348j56527
13787F09493k21337K56595m2286l7831K27172j82200L502M0225q2874J91031l16389
13776D45101p8734J69K93223k62173M1491J03592J38924j50407o8573J91840J71127
13765H25580l71267L4601K05246j22674J90945k7714R9103D07979J80609J60959
13755G49547J22312j73244k27846o854J16563r753r0302j08143K56546k59157
13745C69669J23401l9917K06266j20238B49704K08005K43884k94542O0744M7801
13735E15596K09495m1592q5935j16383j09021K28135R847j33689j79729o4381
13725B32343K07500L18348C63560J67466r3653j76096K49725q5512l6803J31099
$$ y = [796825, 758455, 413295, 685461, 601897, 748210, 759839, 580688, 374672, 766020, 609493, 388156, 644751, 602465, 564634, 791806, 609606, 613108, 653333, 570459, 761490, 445101, 366367, 366536, 659759, 397586, 439077, 542669, 681593, 531186, 462613, 654453, 825580, 454313, 488914, 694160, 571486, 762431, 734717, 833820, 407979, 588588, 749547, 871859, 698615, 470769, 463915, 580478, 570725, 480423, 372280, 628826, 369669, 493070, 453153, 659419, 539181, 249704, 457709, 701593, 407051, 467795, 515596, 725091, 683499, 597564, 481181, 372160, 600295, 610142, 476453, 296724, 232343, 439843, 758191, 363560, 531026, 437373, 261277, 511002, 425490, 388687, 519786]
13715E19786j30924A52309J90057J01524K8524j43039O7794N4Q9933j97041N5049
13704C45164J32087J65359k52427j9704K10918F7087M13279K36450B45543M35002
13694F80545j94628k41350P2490K81433k84014j13249K57587L47570A38066M06090
13684E44156k20100K54653j63310A69657L25522m2286j16716M4001A27901M78104
13674F06005r0885j88612J96835J1161f0455C39818j43646M8597A10185J72978
13664B83163j31156R4602J02914J55673J8249q5864J9538R857q0323j08965A20360
13652B98657L2496l523F6660L95023A06362M26497B42794K4188J18326j21233
13642B64075K64031K8716q6889R0875j24905H0883N3197L67362k07266J77033
$$ y = [519786, 388862, 152309, 342366, 443890, 472414, 329375, 397169, 397223, 487156, 290115, 345164, 477251, 642610, 390183, 370479, 581397, 67087, 480366, 716816, 245543, 680545, 485917, 244567, 317057, 598490, 314476, 201227, 458814, 806384, 138066, 544156, 324056, 578709, 415399, 169657, 495179, 452893, 336177, 380178, 127901, 606005, 515120, 326508, 523343, 534504, -60455, 339818, 196172, 244769, 110185, 283163, 152007, 246609, 349523, 505196, 523445, 437581, 457119, 466976, 386653, 277688, 120360, 298657, 331153, 327630, 66660, 461683, 106362, 532859, 242794, 266982, 385308, 264075, 528106, 556822, 469933, 560808, 435903, 80883, 134080, 501442, 294176, 471209]
13632D71209k08704J85591q1676c4780A31478L14653n4660j31735R0564M4951
13622C95251J63018D5712K40766k2409J48031K053q4554K7460j45020K79262J39385
13611F30686j74420B18271J03053d2022A61663L32315B11947J95461D769L37245
13601C42014A70072K4820m2800M63262A87275Q666B8887J39662N6273m1072Q5661
13590B69411K53122k36067N5188F0881J31645I521K55503J43217C9984J76522
13580B16506J30739J1072j72654Q3307k5571n900Q9075C559a02215E11158A53393
13568C13889O1248Q1568j39418J7194C547d735A33431D2275L69210N613j5099
13557D01999j9634H5956K25053H9436J77548j9262L0767r131r6694K24619l3744
$$ y = [471209, 262505, 448096, 366420, -34780, 131478, 446131, 391471, 259736, 350300, 395251, 558269, 45712, 286478, 264069, 412100, 414153, 329599, 357059, 212039, 491301, 630686, 456266, 218271, 321324, -42022, 161663, 493978, 211947, 407408, 4769, 342014, 170072, 194892, 152092, 615354, 187275, 195941, 28887, 168549, 224822, 183750, 269411, 522533, 286466, 341654, 60881, 192526, 9521, 265024, 408241, 39984, 216506, 347245, 358317, 185663, 268970, 243399, 237499, 326574, 3559, -102215, 511158, 153393, 313889, 375137, 456705, 317287, 334481, 3547, -4735, 133431, 42275, 411485, 417098, 401999, 382365, 85956, 311009, 89436, 266984, 247722, 278489, 269358, 172664, 397283, 363539]
13546C63539A39946J64853I6518J99721j6979M6103A53047P9836J85972k5678
13536C93177c7052B70875G2149K20078E6862M53291J46142B96394J5982F4481
13525B24508H8386K26817j07573k498q3348K79306p3681O0955L4174A85924R994
13514A95918M9410K84876k00114A63737n8488L52055j92138d6738n1014c3690
13503C35008j44136k9273J27050N1391a90570C49686P56r9502J79454j69048A26566
13491C09495A38733n6533C3047K75036j24631K76315j93515k0001K55686j35525
13481C66412J22378a35772G8468L05085A53022K08015F9482K71413J88241A41996
13470a53126b3730A09944K16280j22110K63650A70667J55785A57196o6457P0055
$$ y = [363539, 139946, 304799, 96518, 296239, 279260, 325363, 153047, 232883, 418855, 393177, -37052, 270875, 72149, 292227, 56862, 510153, 656295, 296394, 312376, 64481, 224508, 88386, 315203, 207630, 205132, 121784, 401090, 327409, 388364, 422538, 185924, 195918, 245328, 530204, 330090, 163737, 105249, 457304, 265166, -46738, -97752, -33690, 335008, 190872, 161599, 288649, 340040, -190570, 349686, 350442, 250940, 430394, 261346, 126566, 309495, 138733, 82200, 33047, 308083, 183452, 459767, 266252, 246251, 501937, 366412, 488790, -135772, 78468, 383553, 153022, 361037, 69482, 340895, 529136, 141996, -153126, -23730, 109944, 326224, 204114, 467764, 170667, 326452, 157196, 90739, 160794]
13460A60794p9218R748M2580J74162K548j20650H9227L4926m2170J59627o5026
13449A76584R6235N5238j15393P8834j36162B9070K01115a27654j8967E62533
13438c56870d0711A20900K5022o811Q424C5324L9039J83647p4710J47432n1218
13427B79514d2127G6180L0159J79085k5828A28254J93846E3010J99038M6920A33317
13415A7531J52230i6586B37660a28674C86762j76036J1954b02955E6998K07343
13405B64341j9141J1037H0335b52091C61351j08172A05738J97505N7124p8839
13395B81528B4317K64735d136A71555b3464B40183k0111R7394A04319B9118J9328
13384D8446J45006q7078A1931M22827A38412a09621A96075C9799K23026m7350
$$ y = [160794, 81576, 91324, 133904, 308066, 310614, 189964, 89227, 124153, 81983, 241610, 176584, 272819, 328057, 212664, 291498, 155336, 29070, 230185, -127654, -146621, 562533, -356870, -40711, 120900, 145922, 139111, 147535, 35324, 74363, 258010, 183300, 330732, 279514, -42127, 76180, 106339, 285424, 259596, 128254, 322100, 53010, 252048, 298968, 133317, 17531, 169761, -96586, 237660, -128674, 386762, 210726, 222680, -202955, 56998, 264341, 245200, 256237, 80335, -252091, 361351, 253179, 105738, 303243, 360367, 281528, 24317, 289052, -4136, 171555, -23464, 240183, 220072, 317466, 104319, 29118, 48446, 193452, 106374, 11931, 434758, 138412, -109621, 196075, 39799, 262825, 215475]
13374B15475g203A30641M03581D5576K32630j15586J00091A16192K99749A60945
13363a26816A66431c6443A03601J58919H3118J0994J72947Q2266A73215b2788
13352E3643L11255A76999J41835L8019P5390A58545h2814A97316A3350K1683M51290
13341D86323B27310q647R8542n2227I1377R2434D9896P3706J53022J0858m9712
13330B37770d4461D3083b09961A53959f4897A01513K26272D6192j0419K02962
13320B38735c67833A96725P9400A07782J08104r7827E958J84474J89612a8481
13309a37630A2106J18227K00040D3724f4935D86013f0023D7792J67728a45101
13298B65129a6846H5315c3680A18842J19908P5678a7442j31968D24707j60625
$$ y = [215475, -7203, 130641, 534222, 45576, 278206, 162620, 262711, 116192, 415941, 160945, -126816, 166431, -36443, 103601, 262520, 83118, 94112, 267059, 349325, 173215, -22788, 53643, 364898, 176999, 318834, 356853, 432243, 158545, -82814, 197316, 13350, 35033, 486323, 227310, 218663, 317205, 264978, 91377, 183811, 49896, 123602, 276624, 287482, 237770, -44461, 43083, -209961, 153959, -64897, 101513, 327785, 46192, 35773, 238735, -367833, 196725, 276125, 107782, 215886, 118059, 5958, 190432, 380044, -18481, -137630, 12106, 130333, 330373, 43724, -64935, 486013, -60023, 47792, 215520, -145101, 265129, -16846, 85315, -33680, 118842, 238750, 314428, -17442, -149410, 424707, 264082]
13288B64082f5822B70377K2172A21581g1388p0915N9807B0693J14344g1925A68703
13276a45525A37904h4864A42285F2316R6274K27190F7511j2814a15740A79395
13265A97947D2168J6633J01229b2775H8868K7274N38078A48491n4643b3175H3306
13253b1562l4734A13559J17996b1217E7204P8181n023C8997a3350o9247H6418
13241b3228k18068B55624K52182h2300K3462A2731d8664B42073p8468e5500B82185
13229A77007N910O9249A5789d2363B96731C9682N1019J87952J39360R2609A76993
13217c47814J45108f1250j7218j39940J05497B41129b4821A73768A1091i696A64813
13205D3662J45638d7477B88857A10550b34843D9509M13200k22126o7184J50695
$$ y = [264082, -65822, 270377, 292549, 121581, -71388, -142303, -82496, 20693, 135037, -71925, 168703, -145525, 137904, -84864, 142285, 62316, 158590, 385780, 67511, 54697, -115740, 179395, 197947, 42168, 58801, 160030, -22775, 88868, 116142, 654220, 148491, 93848, -23175, 83306, -21562, -56296, 113559, 231555, -21217, 57204, 135385, 130362, 38997, -13350, -82597, 86418, -23228, -241296, 255624, 507806, -82300, -58838, 12731, -48664, 242073, 163605, -55500, 282185, 177007, 182917, 252166, 15789, -42363, 296731, 39682, 90701, 278653, 418013, 510622, 176993, -347814, -202706, -61250, -78468, -218408, -112911, 241129, -24821, 173768, 11091, -9696, 164813, 43662, 189300, -47477, 288857, 110550, -234843, 49509, 462709, 240583, 173399, 324094]
13195C24094j20797h6077F8191K29361e6653F8108b5188e820A42380J49517A9049
13183B24259O586a75384A64781P8394i973F2229k7997M21376j34100n9282l3226
13172B29000K31256A51244Q4508h0597E63112a42488A59014K75309A86598p4060
13162A12538M574L4354j6531K8133K0917a7041k86707p427A73035d7211A53171
13150C21859h4876A22963l1741J35837f336C28398A63940b7644J345p619l5971
13139f9889F3745c31162b1723B08710j2420D8618J82053a96779c4836A48710f5317
13127A49877C1330b8856B250a21680C25995n3249a07458q289j31201p1373B36231
13115a6389A24240M362a13414j28984R7388j46257D33430A0533e5926A93626q6750
$$ y = [324094, 203297, -86077, 68191, 297552, -56653, 68108, -25188, -5820, 142380, 291897, 19049, 224259, 230845, -175384, 164781, 243175, -9973, 62229, 34232, 455608, 321508, 262226, 229000, 460256, 151244, 235752, -80597, 563112, -142488, 159014, 434323, 186598, 112538, 117112, 151466, 134935, 163068, 183985, -17041, -303748, -311175, 173035, -47211, 153171, 321859, -84876, 122963, 91222, 227059, -6336, 328398, 163940, -27644, -26299, -33918, -69889, 63745, -331162, -21723, 208710, 196290, 48618, 230671, -196779, -34836, 148710, -65317, 149877, 31330, -28856, 2250, -121680, 325995, 272746, -107458, -115747, -246948, -318321, 236231, -16389, 124240, 128602, -113414, -242398, -145010, -291267, 433430, 10533, -55926, 193626, 106876]
13104A06876g6027j27522E4999a53344C59952A00158J36096O1070a15771A98722
13093a45387A22022b01166A21554N5590J2872a13357A24027K6699P7180j8674
13083B09232J14545B9149J39853a41871L6383A60644P7459K9868g2216A02110
13072b0279j90936h8B28573l3759D2587J94949I0483J05384g6576o2977N6993
13061h2560B42474q7167B1727J33186a7764C40610A16679b7347B92681E0270P9917
13050A30187J9095F716h7964G9925i3329A69877B3414J08233m8579a54462C98389
13038C30060b33498I4934M8052K4985l0190K12898g5557A56685n7752d1862j77920
13027b19782A80722D1496p259L45668M267I8395J47953M3892A15512K09429c34038
$$ y = [106876, -76027, -203549, 54999, -153344, 359952, 100158, 236254, 297324, -115771, 198722, -145387, 122022, -201166, 121554, 177144, 190016, -113357, 124027, 150726, 227906, 209232, 323777, 29149, 169002, -141871, -105488, 160644, 238103, 267971, -72216, 102110, -20279, -211215, -88, 228573, 194814, 42587, 237536, 90483, 195867, -76576, -139553, -82560, 242474, 155307, 21727, 154913, -17764, 340610, 116679, -27347, 292681, 50270, 130187, 149282, 6716, -87964, 79925, -93329, 169877, 23414, 131647, 83068, -154462, 398389, 330060, -233498, 94934, 142986, 167971, 137781, 350679, -75557, 156685, 98933, -41862, -219782, 180722, 41496, 34237, 379905, 384172, 98395, 246348, 290240, 115512, 324941, -334038]
13015F3560h9826A00803J38808a28663N8737j37505C01519A24086a8780I2410
13004A53018b6969A9170K76576a29073K8441C8195a88558a904m9240B09989I9865
12992i2946B042J28433J02175Q0416b0751j18262B28812F4957a21820A64623G6186
12980C1020K62770D267K1694J32049b04623B32071a56022d4215B03778c0728l9144
12969f9872B2093b00062G2551b11992C04207a58751a3924m7269a1969A01963J19391
12958B21354n845d40239K03310D1927a40029F197J10319a91739e8768B71723f9543
12946a29647F1083a65107d7793H5918i3364J5040C56997j09560A1570c4314q2083
12935a16397d4269C9625b7800l5664E0370h1477B75623I2664L6429a9401q6250
$$ y = [63560, -89826, 100803, 239611, -128663, -69926, -207431, 301519, 124086, -18780, 92410, 153018, -26969, 19170, 295746, -129073, -100632, 38195, -188558, -1904, -51144, 209989, 99865, -92946, 2042, 130475, 232650, 313066, -20751, -139013, 228812, 64957, -121820, 164623, 76186, 31020, 293790, 4267, 25961, 158010, -204623, 232071, -156022, -44215, 203778, -30728, -69872, 22093, -200062, 72551, -211992, 304207, -158751, -13924, -61193, -11969, 101963, 221354, 215509, -440239, -236929, 41927, -140029, 6197, 116516, -191739, -58768, 271723, -69543, -129647, 61083, -165107, -47793, 85918, -93364, -78324, 356997, 247437, 11570, -34314, -116397, -44269, 39625, -27800, -63464, 50370, -81477, 275623, 92664, 129093, -19401, -105651]
12924a05651A18674J08361H6469k6182K83502d2177B02294b03167A54115c6768
12913B28660K2042a67373j49348i784A3333b49269A59961a63809g7346j2534A3270
12901F6421C1166a21913j9290A88871Q8929E7297J51838n7842q407k303A018d2775
12888d38360d5022A45807C2854K59819F8535i5433A6900K47328b39358C1164a2658
12876H0530C0832J63135A2170b08368B51506N134a58196m35868B46777e6895r4315
12865a51210C13865J79194D7528A2777J20410K22639c2414B03227H7526j4001
12855G3525a55229A32109b97304i1996j47023b465A76917a63861A2205J39289
12845A51494i9127C8986L20401a52345A45923n6143J33972J89279B7977a74467
$$ y = [-105651, 118674, 227035, 86469, 60287, 343789, -42177, 202294, -203167, 154115, -36768, 228660, 250702, -167373, -316721, -9784, 13333, -249269, 159961, -163809, -77346, -89880, 13270, 66421, 31166, -121913, -141203, 188871, 277800, 57297, 209135, 151293, 142886, 140583, 1018, -42775, -438360, -45022, 145807, 32854, 292673, 68535, -95433, 16900, 264228, -239358, 31164, -12658, 80530, 30832, 193967, 12170, -208368, 251506, 256640, -158196, -594064, 246777, -56895, -151210, 313865, 493059, 47528, 12777, 133187, 355826, -32414, 203227, 87526, 73525, -155229, 132109, -297304, -91996, -239019, -2465, 176917, -163861, 12205, 151494, -99127, 38986, 359387, -152345, 145923, 89780, 223752, 413031, 27977, -174467]
12834f44B00859J23254a15241D3170K20095C4803b02987A1026a19494A13700f6047
12822e3593A78537D7683o408Q8420J58805h4584A67970K8352O7454a25198c5967
12810a50279O1515F888j688J17809e5123A30007N394b57856i6213o1669B08154
12798H846J94305C5152J64287c21278B36700a0685j50366D0816d5650j41465j37398
12787c24513C29006a92508c0774A753a15204B3403L4989d7021k09122R1900H7188
12775H5303J53758c69367I7184J07961e4138A96794m7320a98878G4848b12487
12764f2589J8914l19172D8643e3095n9033D82315i6131A26081P0798J27488B0869
12752a77275G9009j5273a47135A71751E9963b6113n5785q4585d8128r3202A75254
$$ y = [-644, 200859, 324113, -115241, 43170, 263265, 34803, -202987, 11026, -119494, 113700, -66047, -53593, 178537, 47683, 41275, 129695, 288500, -84584, 167970, 196322, 263776, -125198, -35967, -150279, -88764, 6888, 5200, 123009, -55123, 130007, 135401, -257856, -96213, -157882, 208154, 8846, 203151, 35152, 199439, -321278, 236700, -10685, -161051, 40816, -45650, -187115, -324513, 329006, -192508, -30774, 1753, -115204, 23403, 58392, -47021, -256143, -164243, 87188, 85303, 239061, -369367, 97184, 205145, -54138, 196794, 149474, -198878, 74848, -212487, -62589, -43675, -362847, 48643, -53095, -112128, 482315, -96131, 126081, 196879, 324367, 20869, -177275, 79009, 63736, -147135, 171751, 59963, -26113, -81898, -166483, -48128, -141330, 175254]
12740A39226Q0768M0583N6008j13420A8144Q6435k6241J61935A16604P5911R7675
12729B90190a5268B36077h3104b0211k18478c2372B29782H6247a11827M3275B07491
12717F4251k4260K21730j01346c31468a11705A60274J19517j11253m7600K02316
12707C23254Q757n3117j3470J65490A84792M6524a5038n6092B00252o3386k1414
12696A15452c33982C33802j60461d4837j38481P6274A20980J04171J4228G1767
12685A25550q110l2253K3886b84614A53487e4826i670j8769B22656J05561A48255
12673A30133g354B89501a00562B48730a00157a5832j76188E0749c9006F6267a9255
12661a34526B4694R6561A6399J04159j9903G613J9452O7776M3156b97616C37R6756
$$ y = [139226, 219994, 260577, 316585, 203165, 18144, 104579, 78338, 240273, 116604, 192515, 290190, -15268, 236077, -83104, -20211, -238689, -32372, 229782, 86247, -111827, -68552, 207491, 64251, 39991, 261721, 160375, -331468, -111705, 160274, 279791, 168538, 120938, 323254, 332011, 278894, 265424, 430914, 184792, 231316, -15038, -71130, 200252, 136866, 115452, -333982, 333802, 173341, -44837, -183318, -107044, 120980, 225151, 239379, 71767, 125550, 117440, 85187, 109073, -284614, 153487, -54826, -9670, -28439, 222656, 328217, 148255, 130133, -7354, 289501, -100562, 248730, -100157, -15832, -192020, 50749, -39006, 66267, -19255, -134526, 24694, 121255, 16399, 120558, 100655, 7613, 27065, 94841, 137997, -297616, 337, 97093]
12649I7093H449f262A92541a01593A25087b84511a35939e8302E9314b29077i3478
12637B73792a25360a6392C96927G2303L17738E1263J55680F4472L23987f383F1446
12625C61099G1857c3810C74427G9005a1866E3580b43924A63359i1942O951l1962
12614a16953J1660j8688F8495a82308f9750J8973j04477M3194B09252a88681B70127
12602A6006b65655A36907a02880E8515P7980P979L6967B5384b86378c511F8817
12590A76580a75503A70889a16410b4618F5906e11757B46094i0749B72432c5301
12579A47276j5014a26088G9113J22666O2241a10248o8200j24395A82247e5020
12568a43755k8712B50791F4350J27907J62566a85B20603i3390r7163j83293A82851
$$ y = [97093, 8449, -6262, 192541, -101593, 125087, -284511, -135939, -58302, 59314, -229077, -93478, 273792, -125360, -16392, 396927, 72303, 390041, 51263, 206943, 64472, 388459, -6383, 61446, 361099, 71857, -33810, 374427, 79005, -11866, 53580, -243924, 163359, -91942, -84991, -116953, -105293, -123981, 68495, -182308, -69750, -50777, -155254, -112060, 209252, -188681, 270127, 16006, -265655, 136907, -102880, 58515, 136495, 144474, 181441, 25384, -286378, -3511, 68817, 176580, -175503, 170889, -116410, -24618, 65906, -511757, 246094, -90749, 272432, -35301, 147276, 132262, -126088, 79113, 201779, 264020, -110248, -178448, -302843, 182247, -55020, -143755, -172467, 250791, 64350, 192257, 354823, -185, 220603, -93390, -190553, -373846, 182851]
12556A2639J2250e9141G5857J19196G9541Q3246d28223M0241I7271M1115e5349
12544b72880a26089d5210C89336M7943j85611b51389P9695B61460D0475K38551
12534B79026c31632a09091A53277f7935j1110B27960e3581K649q6344j22992A7097
12522A60585J6280K90547f518J525B26718m4026J32222a35549j9249D60957A03927
12510D4403J07910o8247K01641j22702J4697E2117P8738b12883c0634C24293a35468
12498a95396L7653j19985E5568J79600O8697a08861A05990J48989k4885a48922
12487a90118j723B33369p5024b67030A5455R5972c32554A07201K5518a26971l65439
12476d92410C05297C6127O236f8221B60523r8403J60415p2238I8765J865b46211
$$ y = [12639, 24889, -59141, 75857, 195053, 79541, 162787, -428223, -387982, 97271, 138386, -55349, -272880, -126089, -45210, 389336, 437279, 251668, -251389, -171694, 261460, 40475, 279026, -331632, -109091, 153277, -67935, -79045, 227960, -53581, -50932, -137276, -260268, 17097, 160585, 176865, 467412, -6518, -4993, 226718, 182692, 314914, -135549, -154798, 460957, 103927, 44403, 152313, 84066, 285707, 163005, 177702, 52117, 130855, -212883, -30634, 324293, -135468, -195396, -157743, -277728, 55568, 235168, 303865, -108861, 105990, 254979, 230094, -148922, -190118, -191841, 233369, 158345, -267030, 15455, 111427, -332554, 107201, 132719, -126971, -492410, 305297, 36127, 42363, -68221, 260523, 162120, 322535, 250297, 98765, 100630, -246211]
12464H0903h6572j17977Q133O3513C8768h8165F378b86266b9741A21163b14635
12452A77922a77743B19213a88498G5065l6983Q6639M7879L9674c23480A11086
12441B61266c14109H2480e1832j50245j00679b3605o5305l317P430M1021C07359
12429D30919a27037D12211e4349I699K75473e6334B10499J5677p8029F0131b32658
12417H0495J14237H2955a25549A61767C9856J41540d3686j36336j39760A99583
12406a36575o3534A93085h7036p2845A06643E0540a93300H8986J15789a69998
12395a35882j2313H806J29550b11073I8325L36K9684a66039G2630m356a030A49568
12382a31874A91963o0430a67504C7864o152o321a09353A71029f4364q1654E4655
$$ y = [80903, -86572, -204549, -196416, -132903, 38768, -88165, 6378, -286266, -29741, 121163, -214635, 177922, -177743, 219213, -188498, 75065, 38082, 124721, 172600, 212274, -323480, 111086, 261266, -314109, 82480, -51832, -202077, -302756, -23605, -88910, -92227, -84797, -43776, 307359, 430919, -127037, 412211, -54349, 9699, 285172, -56334, 210499, 226176, 148147, 60131, -232658, 80495, 194732, 82955, -125549, 161767, 39856, 181396, -43686, -180022, -319782, 199583, -136575, -200109, 193085, -87036, -159881, 106643, 50540, -193300, 88986, 204775, -169998, -135882, -148195, 8806, 138356, -211073, 98325, 98661, 128345, -166039, 72630, 68274, -1030, 149568, -131874, 191963, 131533, -167504, 37864, 31712, 25391, -109353, 171029, -64364, -146018, 54655]
12370B5545b814A38217O1683A7116a04346H6197K25040E083b98721A87324D6380
12358a57892F7313a09842k4075k36549A36038C9734N9092a29814C1679i1574j22909
12347b14483j92092F1384a02128C1760K51730h0784k33315N3242g8213a9564A27301
12335a5691D0576a03165I5416J77438a56823N9336A59963a74936M1433A23615
12324a56138j37787c5891l7489A55396g7670G868J43173a22708b8961j05507F4843
12312g7433j40240j39571J67605G0905a31157G0645K47788b49628Q0040E8261
12301b2300h919j37311I5549e7696n1906G3616e5752C649Q2294L8239K4818e2146
12288f1835j52377F6277P1709n2629A2614P6510J20193c9048H4488L7248B3947
$$ y = [25545, -2814, 138217, 199900, 17116, -104346, 86197, 311237, 5083, -298721, 187324, 46380, -157892, 67313, -109842, -133917, -370466, 136038, 39734, 98826, -129814, 31679, -91574, -214483, -406575, 61384, -102128, 31760, 283490, -80784, -314099, -260857, -78213, -19564, 127301, -15691, 40576, -103165, 95416, 272854, -156823, -97487, 159963, -174936, -133503, 123615, -156138, -293925, -35891, -73380, 155396, -77670, 7868, 151041, -122708, -28961, -134468, 64843, -77433, -217673, -357244, -189639, 70905, -131157, 70645, 318433, -249628, -169588, 58261, -22300, -8919, -146230, 95549, -57696, -109602, 73616, -55752, 3649, 85943, 124182, 149000, -52146, -61835, -214212, 66277, 137986, 85357, 12614, 89124, 209317, -39048, 84488, 121736, 23947]
12276a09100F5680J6351e6700B41588o3517P1524a46794k4154A88796L6006k4605
12265B00197G0045h9125M2405A04939J56156a97129e6156F6988O7215K79458b1898
12253A39357b4241n8740D39393r8444D5870H345J46968g720L147A25601f7584
12241C73064A47845b5701C9994b47453C61455C4804a53928I8038a6667E8023L64193
12230D22216j46973a42472B9224J64243P634L49278k70143k8948R2795k6866I1268
12218B3580J79368C3469l043J08018l6433J03890k8894M3380B2214d1910m2143
12207h4053A38151M6042f9712n5307H8753L87008I74L17984J8496j26809k1987
12196A88658O110k1586R7285A04667a45166q6580a15344A11787h5873r3495F03796
$$ y = [-109100, 65680, 82031, -56700, 241588, 178071, 249595, -146794, -170948, 188796, 224802, 200197, 70045, -89125, -46720, 104939, 261095, -197129, -56156, 66988, 134203, 413661, -21898, 139357, -24241, -82981, 439393, 340949, 45870, 8345, 155313, -7720, -4573, 125601, -67584, 373064, 147845, -25701, 39994, -247453, 361455, 34804, -153928, 98038, -16667, 58023, 422216, 275243, -142472, 29224, 193467, 201101, 550379, 280236, 251288, 344083, 317217, 91268, 23580, 202948, 33469, 30426, 138444, 102011, 205901, 177007, 220387, 22214, -41910, -84053, 138151, 184193, -69712, -125019, 88753, 475761, 974, 318958, 337454, 210645, 188658, 194768, 173182, 270467, 104667, -145166, -231746, -115344, 111787, -85873, -179368, 603796]
12184B26332E353J99347l6098c5404m7923A77690D8464f359A96670M7210a28472
12172I1680K02566J13613F9100L6667D3842a26185D63520f8464A71636a7516p7685
12161i5201G5383J98871b05221A55470E0475L62645h2337A27217C2319K12241
12151B44560J1290j17896E6986g1202H0071k8695a85795A61181C2944a92769I758
12139b40140f0648Q42B7181a79985h6871A21254a79782D08858A44983B5028J00692
12128A25720a13780A0183h7770C61942h4507j5768F3936a43123e6197G4344J27885
12117B02229a62212A5597a54485A00183J84512C0953a25932j76771d2002Q760
12107c3242B57067A271a61584G0164b4506a2128I3220l403D0563R9108b43148
$$ y = [226332, 5353, 204700, 168602, -35404, -83327, 177690, 48464, -6359, 196670, 243880, -128472, 91680, 294246, 407859, 69100, 105767, 43842, -126185, 463520, -68464, 171636, -17516, -95201, 75383, 274254, -205221, 155470, 50475, 413120, -82337, 127217, 32319, 244560, 255850, 137954, 56986, -71202, 80071, 51376, -185795, 161181, 32944, -192769, 9758, -240140, -60648, -59806, 27181, -179985, -86871, 121254, -179782, 408858, 144983, 25028, 125720, -113780, 10183, -87770, 361942, -84507, -100275, 63936, -143123, -56197, 74344, 202229, -162212, 15597, -154485, 100183, 284695, 30953, -125932, -302703, -42002, -33242, 257067, 1271, -161584, 70164, -24506, -12128, 93220, 89817, 40563, 139671, -243148]
12095c16826F3993N5731J13755a40920k82968A35880f0887A00552O2130a10582
12084h950A54857a62859p8193A07049a77175A71955f5383m2496c2973J3842A02546
12072d6515r4769A81994D3229c7094A32038a64713P9921C304c8482F93790J085379
12061A779169o16911B39737N7585q1984m2282k6240b67243B41385d6321B5667
12050B39763a80621n7965e7848r0499J9044A96928l394i2559I6338e041q2200
12039h7241B07903j5765f8332E2717g7989J6554p7617A84498D3547a34937d9360
12027a89432n7197a22692A8424b18464D5243f7303F9184P3228E5245c04201B21108
12015D4779a0939F3777B1541J4875d6083A21724B1303a92894k1690A57635f398
$$ y = [-316826, 63993, 119724, 233479, -140920, -423888, 135880, -60887, 100552, 162682, -110582, -8950, 154857, -162859, -241052, 107049, -177175, 171955, -65383, -107879, -32973, -19131, 102546, -46515, -141284, 181994, 43229, -37094, 132038, -164713, -84792, 3304, -38482, 693790, 1779169, 1162258, 239737, 297322, 215338, 173056, 146816, -267243, 241385, -46321, 25667, 239763, -180621, -238586, -57848, -148347, -129303, 196928, 193534, -92559, 96338, -5041, -87241, 207903, 192138, -68332, 52717, -77989, -61435, -139052, 184498, 43547, -134937, -49360, -189432, -246629, -122692, 18424, -218464, 45243, -67303, 69184, 142412, 55245, -304201, 221108, 44779, -10939, 63777, 21541, 36416, -46083, 121724, 21303, -192894, -214584, 157635, -6398]
12003C7653e928B08105a10715b3523k27856K2658E9761i5348A49772Q2764a76773
11991b45813L0551A90842a72373B2860a50754a1014H3562c01905B27762a8316
11980a40423B7832a46982g2676B6041R2562M061E0642b06908O1985j00497D2368
11968I8071a06365e770B06686n2451l7756A4286b10757B24314H7398a29844B48
11956a54795c743A38881h304n0272a3390j90979B3896R1071c02614H0074B0016
11944a76049e3614A49087a06577C8271J30099k7428f2490a3525l4954r4437M3061
11933i9855f255b387k78833A25951E1628b16697b9579D8833J12681g3070b1373
11921A33232K8327a43306L3939F5064a39811A20860a84124E1458j2269a13395
$$ y = [37653, -5928, 208105, -110715, -23523, -251379, -228721, 59761, -95348, 149772, 232536, -176773, -245813, -215262, 190842, -172373, 22860, -150754, -11014, 83562, -301905, 227762, -18316, -140423, 27832, -146982, -72676, 26041, 118603, 122664, 50642, -206908, -144923, -245420, 42368, 98071, -106365, -5770, 206686, 154235, 116479, 14286, -210757, 224314, 87398, -129844, 248, -154795, -3743, 138881, -8304, -58576, -13390, -204369, 23896, 114967, -302614, 80074, 20016, -176049, -53614, 149087, -106577, 38271, 168370, 140942, -62490, -13525, -48479, -142916, -99855, -6255, -2387, -281220, 125951, 51628, -216697, -29579, 48833, 161514, -73070, -21373, 133232, 161559, -143306, -109367, 65064, -139811, 120860, -184124, 51458, 39189, -113395]
11910B10009a40905O9670j39652H1645i8518o9670A55579b43745e243E6934b43844
11898a06535H9752B9432R8065g2557A30106c4771k60813G584a82018A81709i752
11886A03852C4766R485Q7592a54074d6902j35978a1070A35291K05713d0526D645
11874e0953j2682A91500M8754b804A11519C6637d03818A57385i5921l4312I9355
11862F6856K2199J00508G4183c11729a16623d3363r2937B10547a28477A12237
11851F8236c8879C4217b59243J22982B15857E3208a99697I6132f144A17211M5134
11840A62345G6931i5408A6797a22983H3303a23016E2365Q3115a18073F0270a71304
11828a6475k18839Q2672j21675d3467j11894j128d6406B16417a91125e5872D0743
$$ y = [210009, -140905, -71235, -210887, 81645, -98518, -168188, 155579, -243745, -5243, 56934, -243844, -106535, 89752, 29432, 127497, -72557, 130106, -34771, -295584, 7584, -182018, 181709, -9752, 103852, 34766, 44251, 131843, -154074, -46902, -182880, -11070, 135291, 341004, -40526, 4645, -50953, -63635, 191500, 240254, -2804, 111519, 36637, -403818, 157385, -95921, -130233, 99355, 66856, 89055, 189563, 74183, -311729, -116623, -43363, -136300, 210547, -128477, 112237, 68236, -38879, 34217, -259243, -136261, 215857, 53208, -199697, 96132, -6144, 117211, 162345, 76931, -95408, 16797, -122983, 83303, -123016, 52365, 135480, -118073, 60270, -171304, -16475, -235314, -152642, -274317, -43467, -155361, -156489, -46406, 216417, -191125, -55872, 40743]
11816c082q1233q2196b9932k11502B3213K189K11984r6836a40267A6762J0915
11805B7677a8105A679a05744j45301B20614c4181k27227J3328b0702A50977b02641
11793i4282B0328b46178D9203K13848a62125B12558m7879a0238F1902a70910e5668
11781G6368P8856b17442l6572G83M1504a01067A38730J01967a25922n8608j15363
11770b99893A15637b60112b3701l11191d0516A65909N7740e2630I052d4574A8318
11758a42331C44575F8809O1073c0609k24047b3930j58523B8519J10021J258j5217
11747A24581E0235J55798a64247j73926A7996a61681p98A57051b4800l45764A31403
11735D2675b90089a25852E7325B494K83420b0656j0788A48023c16924G3497O2674
$$ y = [-3082, -84315, -166511, -29932, -241434, 23213, 25402, 237386, 140550, -140267, 16762, 27677, -18105, 1679, -105744, -251045, 220614, -34181, -261408, -248080, -20702, 150977, -202641, -94282, 20328, -246178, 49203, 263051, -162125, 212558, 164679, -10238, 61902, -170910, -55668, 76368, 155224, -217442, -254014, 783, 42287, -101067, 138730, 240697, -125922, -184530, -299893, 115637, -260112, -23701, -334892, -40516, 165909, 223649, -52630, 9052, -44574, 18318, -142331, 344575, 68809, 129882, -30609, -254656, -23930, -182453, 28519, 138540, 139798, 124581, 50235, 206033, -164247, -338173, 17996, -161681, -162479, 157051, -24800, -370564, 131403, 42675, -290089, -125852, 57325, 2494, 285914, -20656, -31444, 148023, -316924, 73497, 136171]
11724A36171K15700j20270h7821o3925H8337n29c3937A30018h6104A19572a17952
11712a85883I4877f2661I4481A5756J34077M0834R9194A21913j9403K28590p5453
11701B55647i8069A6108a94561G8038R6684p2957J62170n2542D0217J71693L0142
11690B42052A3510J24054a25917A86583F9608N5132a05262l9879P0773B72611
11679B45112Q6513a03669p084d5684j19597B61758b61068d4765C74515I9064D8598
11667I1244m1669J0643b49k04868a4421j78413Q6442A6663J9154a72268I8305
11655e6580F9537J36122b4164D09405G9379c1444J5022A09012C6590a2288A26871
11643e5781l2131C50416j59315a43168A21081a34246j70694R777P2412Q7866D09388
$$ y = [136171, 351871, 231601, -87821, -151746, 88337, 87808, -33937, 130018, -86104, 119572, -117952, -185883, 94877, -62661, 94481, 15756, 149833, 190667, 289861, 121913, 102510, 331100, 255647, -98069, 16108, -194561, 78038, 174722, 101765, 263935, 211393, 40217, 211910, 242052, 13510, 137564, -125917, 186583, 69608, 124740, -105262, -145141, -74368, 272611, 245112, 331625, -103669, -110753, -45684, -165281, 261758, -261068, -44765, 374515, 99064, 48598, 91244, 49575, 60218, -249, -205117, -14421, -192834, -106392, 16663, 35817, -172268, 98305, -56580, 69537, 205659, -24164, 409405, 79379, -31444, -16422, 109012, 36590, -12288, 126871, -55781, -87912, 350416, 191101, -143168, 121081, -134246, -304940, -295163, -222751, -134885, 409388]
11631E8035c07550B65670m0455b00575D40690g5919C5064O8560b32684B58356
11620A37006b9911D7773J21156a1102j59575A17539a45574j9573H1675K2513c2277
11608B61736A05065j8420A5620b9786B9132N7500J86384D5473a3012B71916d7738
11596b74234q5975A33384K9194a55346C38242K18457k54976d588C94094j55047
11586B39047q5958C312J80773d4989C38703d30574B0203L8809M1312J06571n8287
11575A48608P1345A6631b1309A2115a00862A25718b19942B15160r2179D5953K24467
11564B70420A00449a06297l7178l9243h2962f785B24820f5192l8680o6813H096
11552c27467J05300A1988J04910J84418a01801B58376i3739A15015K40558J35350
$$ y = [58035, -307550, 265670, 225215, -200575, 440690, -75919, 35064, 103624, -232684, 258356, 137006, -29911, 47773, 168929, -11102, -170677, 117539, -145574, -165147, 81675, 104188, -32277, 261736, 105065, 86645, 15620, -29786, 29132, 86632, 273016, 45473, -13012, 271916, -47738, -274234, -360209, 133384, 162578, -155346, 338242, 556699, 301723, -4588, 394094, 239047, 153089, 3312, 184085, -44989, 338703, -430574, 20203, 59012, 100324, 206895, 148608, 219953, 16631, -21309, 12115, -100862, 125718, -219942, 215160, 122981, 45953, 270420, 100449, -106297, -143475, -182718, -82962, -6785, 224820, -65192, -103872, -170685, 8096, -327467, -222167, 11988, 116898, 301316, -101801, 258376, -93739, 115015, 355573, 490923]
11542D90923k20386e2920B05322b08737B7582J47344E0678J20559G2090J2539
11532H4629O381k1016c08233B12210f9734c4255A77394g0133I8320b10231I474
11520h1123A72995d2929A53910a5751k06369R2360B37135f2864A55162a70720
11509F8217J16130N8126H483J78071E2421L6637O2858m1092h4076B03638b6395
11497C30072j51646J64591D8704g4621j03680I96a71079G5107J22316e9584J8436
11486d1148k76307B57179a95759b7487r6408m0375G4940b402F6041C2463J05480
11475A37943O5231O9998j13906N4671p2437o4718M6218j983a1059B91042j15509
11464A75533e8554A89649a30457G6631a15219B22839J46025p5599j44399a6189
$$ y = [490923, 270537, -52920, 205322, -208737, 27582, 174926, 50678, 171237, 72090, 84629, 91010, 69994, -308233, 212210, -69734, -34255, 177394, -70133, 98320, -210231, 9474, -81123, 172995, -42929, 153910, -15751, -222120, -129760, 237135, -62864, 155162, -170720, 68217, 184347, 242473, 8483, 186554, 52421, 89058, 151916, 110824, -84076, 203638, -26395, 330072, 178426, 343017, 48704, -74621, -178301, 996, -171079, 75107, 197423, -59584, -41148, -317455, 257179, -195759, -27487, -123895, -164270, 74940, -2402, 66041, 32463, 137943, 203174, 273172, 159266, 213937, 141500, 76782, 123000, 121017, -11059, 291042, 175533, -58554, 189649, -130457, 76631, -115219, 222839, 368864, 293265, 148866, -16189]
11453a04069I2960j1572g5126B07984B8603c2784A15435g6140n6921A75660J57491
11442C33151p9984a81775A39020J02748B0286J95448a1979A32630j8058B1553
11431F5882O6838P4080L50659c1018m2836q531k5038j74806D3846J00365N7510
11420B01721K6010a06206C5775a8284A92939a7035B28721b28790B2562N1548b91765
11408A34327m1635J14673A4374J91797a32402A09692a68516B46867b14933A69634
11397g5797B7794h2234C115J31367a50936A79662k5322a20624i447q4882k20779
11386c15108c1225A9784O6516R1086b75868B9435K35571A2471b2298l3488B15714
11374A45160i3155A139M75128d9293o8892H911P4967a58314l838C77614f6815
$$ y = [-104069, 92960, 81388, -75126, 207984, 28603, -32784, 115435, -76140, -133061, 175660, 333151, 253167, -181775, 139020, 241768, 20286, 215734, -11979, 132630, 114572, 21553, 65882, 132720, 206800, 557459, -31018, -73854, -82385, -107423, -282229, 43846, 144211, 201721, 227731, -106206, 35775, -18284, 192939, -17035, 228721, -228790, 22562, 74110, -291765, 134327, 92692, 207365, 14374, 206171, -132402, 109692, -168516, 246867, -214933, 169634, -75797, 27794, -82234, 3115, 134482, -150936, 179662, 154340, -120624, -9447, -94329, -315108, -31225, 19784, 86300, 177386, -275868, 29435, 265006, 12471, -22298, -55786, 215714, 145160, -93155, 1139, 476267, -49293, -118185, 8911, 83878, -158314, -162152, 377614, -66815]
11362b43304k767c1408j32311r5298A14623b09876A45251M7942I511a69955Q2841
11351h7114J1787a3469A67474K5375c49864f1670B43123H8528a06478B23972E3151
11339a58042B6552P7476K04433a20581A81735c6437I3453e2818p6253C9271a33471
11327c08089a17119E5257d023r9901E4641f1280A29756o035B0734K8186b24071
11315C02422A06379a28605C32799b04643B08800D0341i633j62096N0731A18539
11304G5695a06724l18q8492I9716c7134C38315A8893J86171B3897c9257l2694
11293g1951A54870a58826c2706m35436K05622a04631A36978a8044A0937a18264
11282i8957p4271A80082B70N7982h9447J5262D5086A5580J67091a85795A45223
$$ y = [-243304, -246071, -31408, -163719, -259017, 114623, -209876, 145251, 193193, 9511, -169955, -87114, -75327, -13469, 167474, 192849, -349864, -61670, 243123, 88528, -106478, 223972, 53151, -158042, 26552, 104028, 308461, -120581, 181735, -36437, 93453, -52818, -129071, 39271, -133471, -308089, -117119, 55257, -4023, -103924, 54641, -61280, 129756, 123721, 20734, 48920, -224071, 302422, 106379, -128605, 332799, -204643, 208800, 40341, -9633, -171729, -120998, 118539, 75695, -106724, -107042, -195534, 99716, -37134, 338315, 18893, 205064, 23897, -39257, -71951, 154870, -158826, -32706, -468142, -262520, -104631, 136978, -18044, 10937, -118264, -98957, -173228, 180082, 270, 58252, -89447, -74185, 45086, 15580, 182671, -185795, 145223]
11270a15602c9510k76339J17795B3738P4801M9509a72436C6499b76807L4042R8969
11259a43796G8007q215l2791b62809B71103p5222b5970m02556G8593B6859J01444
11248A28303C7643d7204j75639a07468E5739g7264j35694L3954q1481D7464i7511
11236A93183I3316a05467d4551k6726q7074B41674a00901G4504b49570F3866e9232
11224c66360G8947a25129J2796A04006f8234B91213a5559m946k15700G8795b6957
11212A59826b79966e7210j4570m03573b17014i6948c2805j63463R5858p1271a8324
11200d162j93652B97756b32243O1309f3443l88177F4093a26167A41066A6887b14831
11188A50508L4287g2666p930k26997a10711D1803J09359M5011E4185a85271J5576
$$ y = [-115602, -39510, -315849, -198054, 23738, 98539, 148048, -172436, 36499, -276807, -242765, -143796, 78007, 69792, 37001, -262809, 271103, 195881, -25970, -428526, 78593, 26859, 128303, 37643, -47204, -222843, -107468, 55739, -77264, -212958, -179004, -260485, 47464, -97511, 193183, 93316, -105467, -44551, -71277, -158351, 241674, -100901, 74504, -249570, 63866, -59232, -366360, 78947, -125129, -112333, 104006, -68234, 291213, -15559, -20505, -236205, 78795, -26957, 159826, -279966, -57210, -71780, -475353, -217014, -96948, -32805, -196268, -100410, -171681, -18324, -4162, -197814, 297756, -232243, -170934, -63443, -451620, 64093, -126167, 141066, 16887, -214831, 150508, 184795, -72666, -80596, -307593, -110711, 41803, 151162, 196173, 54185, -185271, -169695]
11177a69695I1891h3494B6295K36800b43130F4881J8563a39568f2603A30387K3808
11166A54195i1369J4193E5045c74399I5680i2472M0844a3274F9009a1698j62193
11155a73891E7943E346h4861H010b66618a2980E3207r429d21362A46030o6073
11144G9957b7121E8975c06335Q8741A17263d1352l7325a7575C7026f5934H3646
11132B09763i4536I5747j9326J69081b15205A79500J18937b36827A09738b16507
11121f3564B25789C5520a35679A40854b39343A75141a03477E9020L15654D1771
11110F9068h8569a6182A01723M5638d21968B5325J73015q7476J28214j10643K39009
11099C67444k761b12441I3601d1040B96592J81217A25975a49191E4286J23580
$$ y = [-169695, 91891, -83494, 26295, 263095, -243130, 64881, 83444, -139568, -62603, 130387, 154195, -91369, -77176, 55045, -374399, 95680, -92472, -51628, -13274, 69009, -11698, -173891, 57943, 5346, -84861, 8010, -266618, -12980, 53207, 43778, -421362, 146030, 79957, -27121, 58975, -306335, -217594, 117263, -41352, -78677, -17575, 37026, -65934, 83646, 209763, -94536, 95747, 76421, 245502, -215205, 179500, 298437, -236827, 109738, -216507, -63564, 225789, 35520, -135679, 140854, -239343, 175141, -103477, 59020, 374674, 41771, 69068, -88569, -16182, 101723, 147361, -421968, 25325, 198340, 110864, 239078, 128435, 367444, 364683, -212441, 93601, -41040, 296592, 477809, 125975, -149191, 54286, 177866]
11089A77866J78785A31148J98459A09745L9659m6027M9399M2875J0588L50907
11079E57146A43274c5474B88172f6908C18583K98387B39870L1181q2373K79664
11069D68342n9310k5319A41921K93098Q0250i5457A72927d5727C89376J99544
11059E88920k62196J63793J56672j58135J19699P5921J00624j94358j12566K52537
11049G30911J35111j38915j83246L57667l67346m0584R5608j2954j28798R4776
11039E42230n3429L82379l30502M06213q9218D16378J51084J45821j21515j62213
11029D29555K332L67121j7497n2274j0785j43413j47660J23681J52721J86553
11019H90334j88141j18692o4248A94366L25100J25260l976C01229N51630j08891
$$ y = [177866, 356651, 131148, 329607, 109745, 149404, 103377, 152776, 195651, 206239, 557146, 143274, -35474, 288172, -66908, 318583, 616970, 239870, 271051, 188678, 468342, 409032, 383713, 141921, 435019, 515269, -95457, 172927, -45727, 389376, 588920, 326724, 490517, 647189, 489054, 608753, 684674, 785298, 590940, 478374, 730911, 866022, 727107, 543861, 901528, 534182, 493598, 589206, 576252, 447454, 542230, 488801, 871180, 540678, 946891, 857673, 416378, 567462, 713283, 591768, 429555, 431887, 799008, 781511, 729237, 718452, 575039, 427379, 551060, 703781, 890334, 702193, 583501, 519253, 194366, 519466, 644726, 640750, 301229, 852859, 743968]
11009G43968k01449K90703C64888L26330m4798j67559J69758J43622J6676C37820
10998D59500K55499k57055m5053J11331P6960J92584k63521K03787J64864J14110
10988A013006j90622l9641k19685N6386K11333J96451J0425J83962Q6230o0076
10978A247769j60405N43945N950P76566K2587J19768n3695J70481j66100j12290
10968B394576j39979l05263O5704n31902J3462j38395J31310k04110J53554R1699
10958A530656J48234j96006r8888l9493j11081l23796l13504J26318k16143M67
10948E06764l4870D281J46065R393J33297r6621n0933K80333A12730L9914a2854
10936a23913A85006A5274L59405F9937N504f3408a5455B81686b24236g8282B0595
$$ y = [743968, 542519, 833222, 364888, 691218, 646420, 478861, 648619, 792241, 808917, 337820, 459500, 714999, 457944, 412891, 524222, 601182, 793766, 530245, 734032, 898896, 1013006, 822384, 782743, 563058, 619444, 830777, 1027228, 1037653, 1221615, 1307845, 1247769, 1087364, 1631309, 1637259, 2413825, 2436412, 2556180, 2502485, 2672966, 2506866, 2394576, 2254597, 1949334, 2015038, 1483136, 1496598, 1358203, 1489513, 1285403, 1438957, 1530656, 1678890, 1482884, 1383996, 1344503, 1233422, 909626, 596122, 722440, 506297, 506764, 471894, 4281, 150346, 159739, 293036, 196415, 145482, 425815, 112730, 152644, -12854, -123913, 185006, 15274, 374679, 69937, 75441, -63408, -15455, 281686, -224236, -78282, 20595]
10924a54656c2763C21635G320J6195D724b62377M8802I4525a73595M4966j41165
10913b69794A09879D2214h7291A80519d7385I0966a14374L5370j31320B65989
10902C25606i2369l1722A07890b63702A7296N3402J9111a30301p5184G0686C1977
10890A0328P1423b36569Q7633j48179p0901A15019o349h0955j79445I5709R6663
10879A92372c266l63427i6818M228d0989A79619J9856F0845b86995J29408j99811
10868c57398a17842K500d1930B20312g2832A29174h9574G0c52199a04576q8851
10857a93427Q6858A90127J19901E8515j9027b7218B29397o7495a64996H7102j7564
10846F9538f0016b5661H4668m1574h2842f005B2106N6501d25762C0640d5363j17600
$$ y = [-154656, -32763, 321635, 7320, 23515, 4724, -262377, -213575, 94525, -173595, -128629, -269794, 109879, 42214, -87291, 180519, -47385, 90966, -114374, -79004, -210324, 265989, 325606, -92369, -124091, 107890, -263702, 17296, 70698, 89809, -130301, -205485, 70686, 31977, 10328, 81751, -236569, -148936, -297115, -368016, 115019, 108670, -80955, -260400, 95709, 192372, -3266, -366693, -96818, -92590, -40989, 179619, 199475, 60845, -286995, -157587, -357398, -117842, -115342, -41930, 220312, -72832, 129174, -89574, 70, -352199, -104576, -193427, -106569, 190127, 310028, 58515, 39488, -27218, 229397, 161902, -164996, 87102, 69538, -60016, -25661, 84668, 43094, -82842, -6005, 22106, 78607, -425762, 30640, -45363, -162963]
10834a62963a6299l12687G5873j1108R3005o6920a88669a963j6060B4230a20721
10822B094J70239a01813E7934b82740a10176j69397g3859B12330a66951q5886
10812b52837A88456b70482M0087B15516g8482H0646c42907i9739j27890A4053
10801B10877b14808e5263A54575a95138i1726A60799b55982a05299A01858b28075
10790g2362H7945a69921c6043A5446h6233A8915f1365j84418B28065a63361L2689
10779a30672A12853M7627a53870d9921H5233Q4496N5187E7842J43663I6899J72764
10768B69663h9360B25611a73131e3266A0324h0425n4891j26749E8358g1656j11812
10757a83468N609k23256b3733j35350A43439a52798a8831j05193j51930B69009
$$ y = [-162963, -16299, -328986, 75873, 64765, 157770, 90850, -188669, -1963, -18023, 24230, -120721, 2094, 172333, -101813, 57934, -282740, -110176, -279573, -73859, 212330, -166951, -252837, 188456, -270482, -230395, 215516, -78482, 80646, -342907, -99739, -227629, 14053, 210877, -214808, -55263, 154575, -195138, -91726, 160799, -255982, -105299, 101858, -228075, -72362, 87945, -169921, -36043, 15446, -86233, 18915, -61365, -245783, 228065, -163361, -130672, 112853, 160480, -153870, -49921, 85233, 169729, 224916, 57842, 201505, 96899, 269663, -89360, 225611, -173131, -53266, 10324, -80425, -135316, -262065, 58358, -71656, -183468, -177859, -401115, -23733, -159083, 143439, -152798, -18831, -124024, -275954, 269009]
10746B3190b9517H7924f0785n633E7138b3579p4895A76767g9026k5915n1184A39138
10733c05118K2237c3088j02507R830b7771r9010m6145G8504a1250j48451F068
10721c10285c2503C51252r8974c7514A13409e4017a3770j61288A43398J85059
10711C28457b56684J22028j41661A99594B4926f1662k95936a1374j18266k680
10701a32320k9327A32246O9991r9342N0762b15857P1118r7239R044e4389o3612
10690a18001A96393a10431D04050F1736P8020c53142A16475a00921A28074C5211
10679H5861B320J05184b30514i676D6165O5618a8777G708J39477a80075B38512
10667d9766k95358g0986r1492r0249C3890c68513a48195B9325h1259b0648H6234
$$ y = [23190, -29517, 87924, -60785, -66418, 57138, -23579, -98474, 176767, -79026, -104941, -156125, 139138, -305118, -282881, -33088, -135595, -125765, -27771, -126781, -172926, 78504, -11250, -159701, 6068, -310285, -32503, 351252, 252278, -37514, 113409, -54017, -13770, -175058, 143398, 328457, -256684, -134656, -276317, 199594, 24926, -61662, -357598, -11374, -129640, -132320, -161647, 132246, 202237, 102895, 153657, -215857, -144739, -241978, -232934, -54389, -118001, 196393, -110431, 404050, 61736, 139756, -353142, 116475, -100921, 128074, 35211, 85861, 2320, 107504, -230514, -9676, 46165, 111783, -18777, 7708, 147185, -180075, 238512, -49766, -345124, -70986, -162478, -252727, 33890, -368513, -148195, 29325, -81259, -20648, 86234]
10655G4654l5072K4360j1420J16791c64236J60860B42469a89935B0275d25633
10644A56566b83223A1142f1248C68477E6795a46048d9952A04940b60642a12295
10633A64450C804O6237o349c58716J55535q3640B29052q2328B1470J29032a0624
10621d76329i6317q8493h1046J0289j78050a16864c9880F6035M6272c47225L7113
10610c10112b1342j08383d3154D7956N8612b20712F7188b2087A44567d3023A68430
10598a41191h438j33549N991m5286f4597q7901B45715B0451c9961j75403P4451
10587a40913F2410i1257M063j83606I6200j2714a5713r8004q2290A91150b82614
10575g1033j80379g2874A08109d12974B2070K24505a82379M5249a5133D52452
$$ y = [74654, 39582, 63942, 52522, 169313, -364236, -203376, 242469, -189935, 20275, -425633, 156566, -283223, 11142, -61248, 368477, 56795, -146048, -49952, 104940, -260642, -112295, 164450, 3804, 70041, 63692, -358716, -203181, -286821, 229052, 146724, 21470, 150502, -10624, -476329, -96317, -184810, -81046, -70757, -248807, -116864, -39880, 66035, 112307, -347225, -310112, -21342, -129725, -43154, 47956, 106568, -220712, 67188, -22087, 144567, -43023, 168430, -141191, -8438, -141987, -135996, -181282, -64597, -152498, 245715, 20451, -39961, -215364, -140913, 62410, -91257, -87194, -270800, 96200, 83486, -15713, -113717, -196007, 191150, -282614, -71033, -251412, -72874, 108109, -412974, 22070, 246575, -182379, -137130, -15133, 452452]
10564A76430G788K53728a07221B6051J4184i1316B05480b28894j28253R2333K3567
10553b41247e9975A34832J59757d6104J8528k35402e1090A75453D0752a30821
10542D62370C950f4035B375a84366I6859a3999r346A74148D5314b39003D6266
10530C46684c8385k6270a4114A36567C9501L6427A2913a9896n943k3515A24053
10518I8240J58760A1773Q982I496i3k22729O9425D5983J18923H2041Q7614D0200
10505a93549Q4663k37668a10619a2809m7784n2422L586A94148E4603P4378b29895
10493B42584c05821c8887k47307E620a0166j65568J7440k3569A97154a10268C22660
10481B82176R6235J96037G525L28685g803B21685a17946A94175O7352g8539A42601
$$ y = [176430, 7788, 261516, -107221, 26051, 40235, -91316, 205480, -228894, -357147, -264814, -241247, -59975, 134832, 294589, -46104, -27576, -262978, -51090, 175453, 40752, -130821, 462370, 3950, -64035, 2375, -184366, 96859, -13999, -23345, 174148, 45314, -239003, 46266, 346684, -38385, -64655, -14114, 136567, 39501, 75928, 12913, -19896, -25839, -49354, 124053, 98240, 257000, 11773, 20755, 9496, -93, -222822, -153397, 45983, 164906, 82041, 169655, 40200, -193549, -108886, -346554, -110619, -12809, -60593, -113015, -109429, 194148, 54603, 128981, -229895, 242584, -305821, -38887, -286194, 5620, -10166, -175734, -158294, -181863, 197154, -110268, 322660, 282176, 378411, 574448, 7525, 336210, -7803, 221685, -117946, 194175, 261527, -78539, 142601]
10469a34367j58099a15407k84367A74617D6316c7575B52742c15128c9393A92622
10458a53386O8701j88359A01177i9393C06501j34206f5544m3626j89897a3266
10447A54683a76096A38134a89821d5627p3003A05708K67318I8299a13132C8708
10436C4220c9903B1570b909l8153I541a33442q1028D8587c73599g6516B83858
10424E3983O338b72214g6607b2839F7735b44588p5764D06J3451f6318F9354R8898
10412A68252i361k53672f626j79571k3641I5944l3606a80016A96995a32771j47062
10401b79833C31336h2880k59246E0518J78041A8417O0363J63262B3791J46463
10391A70254C0333L93729A30652f8959k6504B8614h0966G1585l1241i8288E73636
$$ y = [-134367, -292466, -115407, -399774, 174617, 46316, -37575, 252742, -315128, -39393, 192622, -153386, -84685, -273044, 101177, -99393, 306501, 172295, -65544, -109170, -299067, -13266, 154683, -176096, 138134, -189821, -45627, -118630, 105708, 373026, 98299, -113132, 38708, 34220, -39903, 21570, -2909, -41062, 9541, -133442, -214470, 48587, -373599, -76516, 283858, 53983, 60321, -272214, -76607, -22839, 67735, -244588, -320352, 406, 13857, -66318, 69354, 168252, -9361, -263033, -6626, -186197, -209838, 95944, 62338, -180016, 196995, -132771, -279833, 331336, -82880, -342126, 50518, 228559, 18417, 78780, 242042, 23791, 170254, 30333, 424062, 130652, -68959, -95463, 28614, -80966, 71585, 40344, -98288, 573636]
10379C86688A88833K93114A29836J32488J31097m2199A53838n7949K36569j00214
10369B32244N2962J37758K0149A75808K92010k428n3067j52954K32044B31746
10358B29305A02914R0654q7444r646P5415L08469j60509j39353K66885L13907
10348G61292C44515m3579P1039j76089J92511J80390o6193A87100L3178I0602
10337H512J41207c524B30046h00j07844H3301O7485a5484C94375a9401A83140
10325E5542B2917f5908A56158J18829A03899J9077a66089B6856b0590C44092a46810
10313h8777b4020r8733i820o336B17557I7502K3330N2386B8205c00292b1518I8809
10300B41416b61159B07301b7860A02277k4216k2666b448j20387A34168J2271b56348
$$ y = [386688, 188833, 481947, 129836, 262324, 393421, 351222, 153838, 95889, 332458, 232244, 285206, 422964, 443113, 175808, 467818, 465390, 412323, 259369, 491413, 231746, 229305, 102914, 193568, 106124, 96478, 171893, 480362, 319853, 180500, 447385, 761292, 344515, 300936, 371975, 195886, 388397, 568787, 502594, 187100, 220278, 90602, 8512, 149719, -3524, 230046, -800, -108644, 83301, 150786, -15484, 394375, -19401, 183140, 55542, 22917, -65908, 156158, 274987, 103899, 122976, -166089, 26856, -20590, 344092, -146810, -88777, -24020, -122753, -9820, -16156, 217557, 97502, 120832, 173218, 28205, -300292, -21518, 98809, 241416, -261159, 207301, -27860, 102277, 78061, 55395, -2448, -122835, 134168, 146439, -256348]
10288G2045A6766b44161o0664C6541j5069a37541k30519a72018M8454m51119C07015
10276a30166N9328j22658B11960a38882d2779F4746J32512H9773c04030i2154
10265A14888Q2041d2914C05719r8004P8068j04000L84401A82913m6830J78406
10255C14489j04291M6357E9936a20507k7815l5868g0403l36162F5444a5885j88443
10244b04328j8648B49712j07557J1717k4269c80149J52691A21376M8019q2248
10234H7147j2329e6315q4019j20490g9654D5493N7870d7576I2974a13987A73252
10222c7894l01266B7754b47419a23484B2009a34414O3070C1162C36a90549A0107
10210d2787l8668n9256A56841a76887P5690A66044k3226a6936F6928f0195k37727
$$ y = [72045, 16766, -244161, -304825, 36541, 21472, -137541, -368060, -172018, -123564, -574683, 307015, -130166, -70838, -193496, 211960, -138882, -42779, 64746, 197258, 89773, -304030, -92154, 114888, 196929, -42914, 305719, 207715, 285783, 181783, 566184, 182913, 136083, 314489, 210198, 256555, 59936, -120507, -148322, -184190, -70403, -406565, 65444, -15885, -204328, -222976, 249712, 142155, 153872, 129603, -380149, -227458, 121376, 169395, 87147, 74818, -56315, -140334, -260824, -79654, 45493, 103363, -47576, 92974, -113987, 173252, -37894, -339160, 27754, -247419, -123484, 22009, -134414, -71344, 31162, 336, -190549, 10107, -42787, -81455, -140711, 156841, -176887, -101197, 166044, 142818, -16936, 66928, -60195, -297922]
10199b97922e8994p0455B8051d31745i9781C6471D340c09972H8881L4828O7673
10188A91382b12812b5576j4275j82332B26623b2696j13997n0915n5390R3867c0197
10176a0339G5656a53239L2884k11024G7447b65875H5441D1776K30535a63717G5212
10164A06507b01899j44226J15615K6423j77991J18720B20711l000q6857a42534
10153B16856a73018j27945o7964A27046c35290J34834Q8884g506j69526A98905
10142C47445i2745c5006J5645j55007E8893a19478j47691Q9083A13645a7276n5877
10131g3153l16352a5130G6660A5835h5324b6584j41998m5436A28484b33220k7944
10120b61164j29855a0747A10217J20723b5987j03416j03343A31083m1039f6359
$$ y = [-297922, -58994, -129449, 28051, -431745, -99781, 36471, 4340, -309972, 88881, 123709, 191382, -212812, -25576, -39851, -222183, 226623, -22696, -136693, -187608, -242998, -149131, -30197, -10339, 75656, -153239, -120355, -331379, 77447, -265875, 85441, 41776, 272311, -163717, 75212, 106507, -201899, -346125, -230510, -204087, -382078, -263358, 220711, 217711, 130854, -142534, 216856, -173018, -300963, -368927, 127046, -335290, -200456, -111572, -7506, -177032, 198905, 347445, -92745, -35006, -19361, -174368, 58893, -119478, -267169, -178086, 113645, -17276, -73153, -389505, -15130, 76660, 15835, -85324, -26584, -168582, -214018, 128484, -233220, -261164, -391019, -10747, 110217, 230940, -25987, -129403, -232746, 131083, 90044, -66359]
10109H7950i9788m8905C00700h9372B14084a53158c2836p1970j02045E2975c0168
10097b28121A41135c4445n2233G7258a9611B58684a08688j18844B03312J206a70607
10085d34322i3172j8753e5166j3055H0516C8316K09216a10768n6892I9208a35662
10073G7581O3479b8854k97531k0538b7682A15472b26316B56013N4719a87760A52797
10061C1958c92900B36070A15647a89419f0136p6850r003c2082B2078d3833A8950
10049B25554q9765E5950K18605a43162b0050j18961I3317h85A4212K76556b2722
10037E267a09305I9254a59800q111j11216A53327E8291c32342M7555M8677A80786
10025a86298h3731A09187l7159a28920B4217K75666b27445g4003A7846a8511G9214
$$ y = [87950, -99788, -148693, 300700, -89372, 214084, -153158, -32836, -104806, -206851, 52975, -30168, -228121, 141135, -34445, -86678, 77258, -19611, 258684, -108688, -227532, 203312, 204518, -170607, -434322, -93172, -111925, -55166, -68221, 80516, 38316, 247532, -110768, -167660, 99208, -135662, 77581, 141060, -28854, -326385, -346923, -27682, 115472, -226316, 256013, 310732, -187760, 152797, 31958, -392900, 236070, 115647, -189419, -60136, -136986, -145989, -32082, 22078, -43833, 18950, 225554, 135789, 55950, 274555, -143162, -20050, -139011, 93317, -885, 14212, 290768, -22722, 5267, -109305, 99254, -159800, -167911, -279127, 153327, 58291, -332342, -284787, -236110, 180786, -186298, -83731, 109187, 72028, -128920, 24217, 299883, -227445, -74003, 17846, -18511, 79214]
10013H283Q3109j8558a68887G2366D045O4678a89625L1496J5262G8793a96423
10001c63316J00478J22750e4870l93889J69090a07671n2818B3541c36784L6619
9991c00165R4229j6661L7366Q7597A88356G0202b95063a16778E368b02839i8153
9979b10938a6495p8634D5868K93717d9651j11253L5804k23104Q8246A45182b4583
9967a21103m3346A83786c3732q0631l4994k3057k0725A00538k5471c40854i3578
9955b2594j37219L1743A68392D7191h9651B07475I1726N5391b9400k8051j09203
9944a66654k8278i5488C3313b721l08996d5595j98010A48543a37700E88c03076
9932I7162k0747a82374F3161a47881c6628P755E66084b74626a02745E483M2939
$$ y = [8283, 91392, 72834, -168887, 72366, 4045, 68723, -189625, -158129, -142867, 78793, -196423, -363316, -262838, -140088, -54870, -448759, -279669, -107671, -160489, 23541, -336784, -300165, -205936, -222597, -185231, -97634, 188356, 70202, -295063, -116778, 5368, -202839, -98153, -210938, -16495, -95129, 45868, 339585, -49651, -160904, -125100, -348204, -259958, 145182, -24583, -121103, -164449, 183786, -33732, -114363, -149357, -172414, -193139, 100538, 75067, -340854, -93578, -22594, -159813, -128070, 168392, 47191, -89651, 207475, 91726, 147117, -29400, -57451, -166654, -194932, -95488, 33313, -2721, -311717, -45595, -243605, 148543, -137700, 588, -303076, 97162, 76415, -182374, 63161, -147881, -36628, -28873, 566084, -274626, -102745, 5483, 48422]
9921D8422a13433A71683c61420N5361N4987O2227A53578m5185b1709j94689M5278
9910a71120p7721A68544K68666b80984i2598A98976A580h4374n7360m3691A3105
9898c4343E342c06256C10313m4441a54099e1466b1429A6115a20842A35712a45212
9886A67146a96427j9563N2443j18559e3444E6925c72140I8763c16058J39449d066
9874h3564K7935m7520A3023c02929O9071N581g826k26717b9464n26304K36314
9863c19454h2593m9294A36667d58707F1415a82859A53350b97854L0228A87391
9852h573l65975b4975A80332c6145j38021d6994A2477a76454B36712F4134a4206
9840c41458B08894a08549j02956A49006D6187J37328J3093C6820f2834j713j20333
$$ y = [48422, -113433, 171683, -361420, -306059, -251072, -188845, 153578, 108393, -21709, -216398, -171120, -248841, 168544, 437210, -280984, -92598, 198976, 1580, -84374, -141734, -185425, 13105, -34343, 5342, -306256, 310313, 265872, -154099, -51466, -21429, 16115, -120842, 135712, -145212, 167146, -196427, -215990, -163547, -282106, -53444, 56925, -372140, 98763, -316058, -176609, -4066, -83564, -55629, -103149, 13023, -302929, -233858, -228277, -7826, -234543, -29464, -555768, -319454, -82593, -131887, 136667, -458707, 61415, -182859, 153350, -297854, -267626, 187391, -8573, -374548, -24975, 180332, -36145, -174166, -46994, 12477, -176454, 236712, 64134, -14206, -341458, 208894, -108549, -211505, 149006, 46187, 183515, 196608, 36820, -62834, -64547, -184880]
9829a84880D2696N2048a06113A74517b79111R000r6465c0184p5388j45106j7184
9818b67862A8105c18417O1150C7521c15810B0497c93571h2984k91891E4617M6168
9807A00785e2334F6542Q6219a79360b6553k8305k47277R0856i6575j89228J19650
9796a66153A79865n765k897l2542P93b95850M0653b776A25242e307j70944D9959
9783c9581J3454j46111A48168a41602F1314e21049a53753C45546c02606c5988
9772G6878a59202P548K7302A09315a40086B02516N1599a16313B74013m4412o4395
9761A65206J02459f7499j08382A12361g323o9239B46973E0598a17177k04955B38467
9749b28569H9022a76844k44640K05080i4732G4436r644d8593j10808K9830j67927
$$ y = [-184880, 42696, 94744, -106113, 174517, -279111, -270111, -366576, -30184, -105572, -250678, -267862, 18105, -318417, -257267, 37521, -315810, 20497, -393571, -82984, -374875, 54617, 100785, -52334, 66542, 152761, -179360, -26553, -54858, -302135, -211279, -96575, -285803, -166153, 179865, 174100, 171203, 138661, 139454, -295850, -255197, -2776, 125242, -5307, -176251, 49959, -39581, -26127, -172238, 148168, -141602, 61314, -521049, -153753, 345546, -302606, -35988, 76878, -159202, -151654, -124352, 109315, -140086, 202516, 254115, -116313, 274013, 229601, 165206, 267665, -67499, -175881, 112361, -7323, -76562, 246973, 50598, -117177, -322132, 238467, -228569, 89022, -176844, -421484, -216404, -94732, 74436, 64792, -48593, -159401, -129571, -297498]
9738b97498h4461D8086A2246c95044J96098I552m767d117A73417c1094l23243
9727c54337a14633l0291E6890b81441K4799a17389k5987A64020K49695a75284
9716i1843C52543c7481n5171j01594r5902B70496D9276c32704J15649I4600b12954
9704h3076j61683B040J49308F4109K27285A35519f843l724c998A2410R0336b993
9691c07262d950j49338B71923E2147J28451e1250l30423a24595m06509A1774c55888
9679a79288A7994J0313a63842j03259B0026h1571K1243F1800b85984C7703a88380
9667A00420c7502l18382E1089a02591l34515c67A99506a11183b6323r6877d7819
9655B24639H6236a03582a8468C95681g982o55239A45813a26242I7900a10097A01608
$$ y = [-297498, -84461, 48086, 12246, -395044, -198946, 9552, 4785, -4117, 173417, -31094, -354337, -114633, -144924, 56890, -281441, -256642, -117389, -143376, 164020, 413715, -175284, -91843, 352543, -37481, -92652, -194246, -290148, 270496, 49276, -332704, -217055, 94600, -212954, -83076, -244759, 2040, 151348, 64109, 291394, 135519, -6843, -10567, -3998, 12410, 102746, -2993, -307262, -4950, -154288, 271923, 52147, 180598, -51250, -381673, -124595, -531104, 11774, -355888, -179288, 17994, 28307, -163842, -267101, 20026, -81571, -60328, 61800, -285984, 37703, -188380, 100420, -37502, -355884, 51089, -102591, -437106, -367, 199506, -111183, -26323, -123200, -47819, 224639, 86236, -103582, -18468, 395681, -7982, -663221, 145813, -126242, 97900, -110097, 101608]
9643g0301m1122k85138J24604C10224e11438H229K48601b0846j25142I4680a56250
9631a57425E5013a50743M1839a4734E8296a5772A64062a73054H2016c1001A76668
9619a92779f265j3046l1101D43459i3382C3160a88530P5153l2910K797r788D3107
9606A89474b5063j45435L2215q4470J9288B61601a35580B14385a09764k35040
9596c44804a42319d8325J9419j88215a4505j5843j1832n6565H0301r181a77911
9584D3168L99796a98500P4646f788j06102E1302b13942c9419j0855C21048A5384
9572A7770J95610c21548D8798J22196b16528m6152i143k15209J00550a9552j19994
9561a39546o1297i7023a7694A06654j757d57698C9738R990b63153g5621m03245
$$ y = [-70301, -111423, -396561, -271957, 310224, -511438, 8229, 256830, -20846, -145988, 94680, -156250, -157425, 55013, -150743, -108904, -14734, 58296, -15772, 164062, -173054, 82016, -31001, 176668, -192779, -6265, -19311, -50412, 443459, -93382, 33160, -188530, -113377, -146287, -143490, -153278, 43107, 189474, -25063, -170498, -138283, -222753, -203465, 261601, -135580, 214385, -109764, -344804, -142319, -48325, -28906, -217121, -14505, -30348, -42180, -98745, 80301, 71120, -177911, 43168, 442964, -198500, -123854, -6788, -112890, 51302, -213942, -39419, -50274, 321048, 15384, 17770, 213380, -321548, 48798, 170994, -216528, -262680, -9143, -224352, -123802, -19552, -139546, -200843, -97023, -17694, 106654, 104897, -457698, 39738, 49728, -263153, -75621, -478866]
9550d78866B9866P0328k4783d7960A59522B0147J9469K54671G392a77102M9643
9539a27459K8211A4623R6302a68452o4527a13716j06388f3841k40631B19987c36099
9527a55884A25161b0957N970B44274e35452b59381B91078c02005A2131a17111
9516I2943b96683A36698b00326f0246h176j18768B06535b7672k5246k76l4892
9505h8086K3271f863j43767D5705K9371N9990a22973E7526a04192J3210l5807
9494a26789K1057o9691l9574b5053A56991g793p3648a0472m1977j63618a06771
9482A58571a78567h6076A5084d9104j94593e0656A74521a18982A3323Q9130a66156
9470g6901L8102j5908k2279b4200m45248G4749i607j66628n2318a1616k2193j79009
$$ y = [-478866, 29866, 100194, 75411, -47960, 159522, 20147, 39616, 294287, 7392, -177102, -127459, -99248, 14623, 110925, -168452, -232979, -113716, -220104, -63841, -304472, 219987, -336099, -155884, 125161, -20957, -14987, 244274, -535452, -259381, 291078, -302005, 12131, -117111, 92943, -296683, 136698, -200326, -60246, -8176, -126944, 206535, -27672, -52918, -53194, -88086, -64815, -6863, -150630, 45705, 75076, 135066, -122973, 57526, -104192, -90982, -126789, -105732, -175423, -214997, -25053, 156991, -7793, -81441, -10472, -52449, -216067, -106771, 158571, -178567, -86076, 15084, -49104, -243697, -50656, 174521, -118982, 13323, 102453, -166156, -76901, -38799, -54707, -76986, -24200, -469448, 74749, -9607, -176235, -228553, -11616, -33809, -212818]
9458b12818R1956b9696j71607j86712c5016A79757q6166f3524N148A19494E0919
9446b14546E5603P7437C3138o874N2168k6022N4574R962d6960j4410j31109B40057
9433h3404k7193k82240A53166c47943A1326J11705a41113A20771J09995a03319
9422A95772a02311a0951q0511q5433M0878c2111n0796D6528b0857k4894a5609
9410a60192A05793a11229p119o3289c2576k0972B82870a8076n8285l52867a93126
9398a21181D61903a80440d8127J3391L017j81082c936A74458o8235N5288F0749
9386d0838j12562n4333A64444a88401j13824i9285A32716c17833c2579m1521B674
9374i9019R617n4890A22245C1196i9337r7648L4220A00101L9145d19227A39043
$$ y = [-212818, -120862, -29696, -201303, -388015, -35016, 179757, 93591, -63524, -58376, 119494, 50919, -214546, 55603, 133040, 33138, 26264, 78432, 52410, 106984, 116946, -46960, -61370, -192479, 240057, -83404, -110597, -392837, 153166, -347943, 11326, 123031, -141113, 120771, 230766, -103319, 195772, -102311, -10951, -91462, -176895, -136017, -32111, -82907, 46528, -20857, -45751, -15609, -160192, 105793, -111229, -118348, -181637, -32576, -53548, 282870, -18076, -76361, -429228, -193126, -121181, 461903, -180440, -48127, -34736, -31719, -212801, -3936, 174458, 106223, 161511, 60749, -40838, -153400, -207733, 164444, -188401, -302225, -99285, 132716, -317833, -32579, -74100, 2674, -99019, -89402, -144292, 122245, 31196, -99337, -196985, -162765, 100101, 139246, -419227, 139043]
9362i7428j63219f9577j2866F3287A8325b24533g392C0118b07994A84357m2889
9351A41468n2089a93953F0104a15551A5093a02397j2364j00315G0468a07828L2493
9340g5335M00j10352F6071b39392A51438b11761A3996a775n2859B12915h160k02388
9328b10548m6400C8961L7586g4503B14048a76933l21010a28548o426N2655G8277
9316b12372a4152j21530A03242a80455c7995k54573a44543C2020c99845A61714
9305b74916R7402C2766J28421g3893A19677b3025r7314J0185d7750j73411I160
9293c14967F8134C2562O6593N7110a03766n7746g8009K684n1223k4129P0668r4712
9281a74721N6880j48597A426b76885Q5909g9521A109h002D4781J08706b38969
$$ y = [-97428, -260647, -69577, -82443, 63287, 18325, -224533, -7392, 30118, -207994, 184357, 141468, 89379, -193953, 60104, -115551, 15093, -102397, -114761, -215076, 70468, -107828, -75335, -74935, -185287, 66071, -239392, 151438, -211761, 13996, -1775, -54634, 212915, -8160, -210548, -256948, 38961, 76547, -74503, 214048, -176933, -497943, -128548, -134974, -82319, 78277, -212372, -14152, -135682, 103242, -180455, -37995, -292568, -144543, 32020, -399845, 161714, -274916, -177514, 32766, 161187, -73893, 119677, -23025, -120339, -110154, -47750, -221161, 9160, -314967, 68134, 32562, 99155, 156265, -103766, -161512, -78009, -75325, -126548, -150677, -80009, -174721, -117841, -266438, 1426, -276885, -190976, -79521, 1109, -8002, 44781, 153487, -238969]
9269a75756M4292A04460J05953B654c50101h9514f435p617q7623A56769J04173
9258B60942c04152g5780j04539Q1713G0772b7402C2500c26897h6328j2319A77489
9246a7720A77440b7016j22739j6514G2487g5304A67215p3842c0753k0683Q245
9235d3191k08223C68396C2231M7188h9513A31186B2798f3342k21227B08496J9260
9224B27756B9960J43466a98650B06024D0361h9000A17596a21365C7396a59818
9213a68396A96857a08202j93333J48783B42828c32717e464C0420L15878b39222
9202b10744K4700A92244a10416b8917j51752P5278k13381N7179E1163K29045a1794
9190I6462j0409K5861c4485F1868K89285g162A5050Q8853a02950E6258J07070
$$ y = [-175756, -131464, 104460, 210413, 2654, -350101, -89514, -6435, -14052, -101675, 156769, 260942, -304152, -75780, -180319, -98606, 70772, -27402, 32500, -326897, -86328, -98647, 177489, -17720, 177440, -27016, -149755, -166269, 72487, -75304, 167215, 93373, -30753, -51436, -43191, -251414, 368396, 32231, 79419, -89513, 131186, 22798, -63342, -284569, 208496, 227756, 29960, 173426, -198650, 206024, 40361, -89000, 117596, -121365, 37396, -159818, -168396, 196857, -108202, -301535, -152752, 242828, -332717, -5464, 30420, 346298, -239222, -210744, -186044, 192244, -110416, -28917, -180669, -105391, -318772, -261593, 51163, 280208, -11794, 96462, 86053, 111914, -34485, 61868, 351153, -7162, 15050, 103903, -102950, 56258, 163328]
9179A63328d6969j74131g897j49936M6074j62313E7959a26053e7220q7268o0331
9168b04819Q8866J56F6677h2539k60675A67111h6599E6410d59650F5536a22116
9156A78528l0974f5732B67868D2419A2401e8299j04732F418P001b63149a6469
9144a51415b665A44187E9433b99761M5975d7481A73002e700j27410n91k3539k56304
9132d13544a32063B27301B0634e1965A86395N0942a6692j4576A86587i8807E943
9120A19384m7692j6203f3523j70957e6571p4266I64R5829M290c48999D0487r813
9108C0674a53778a8226A51501O1913F8735a0754A27852c0546H1652b3050n5099
9097g8149K0175A19885a44705j2514j22105A04164J58847a26696B061b5049F6350
$$ y = [163328, -46969, -221100, -7897, -157833, -111759, -274072, 57959, -126053, -57220, -144488, -204819, -115953, -115797, 66677, -82539, -343214, 167111, -86599, 56410, -459650, 65536, -122116, 178528, 147554, -65732, 267868, 42419, 12401, -58299, -163031, 6418, 13419, -263149, -16469, -151415, -2665, 144187, 59433, -299761, -253786, -47481, 173002, -5700, -133110, -133701, -157240, -413544, -132063, 227301, 20634, -51965, 186395, 237337, -16692, -31268, 186587, -98807, 5943, 119384, 71692, 55489, -63523, -234480, -56571, -130837, 964, 96793, 101083, -348999, 40487, 30674, -153778, -18226, 151501, 213414, 68735, -10754, 127852, -30546, 81652, -23050, -78149, -57974, 119885, -144705, -157219, -279324, 104164, 263011, -126696, 2061, -25049, 66350]
9085A49014g662j34965A71260a15265J2050R858B10797a26662L8828G1470J6877
9074H8347a15974j69373O3540I051i945k70465D3207e2919l50079I5579c06073
9062b51617A32529b38031A09472a37790A08904J3621D3796J57473a01564r9045
9052b00609k23180K08221k13039i0657B50867a98490B5422J46251a40849B34241
9041e4255o2867Q25B9209e4214A46259b22483r525Q1870j6198k23149J00285a21975
9028a05348E6198K00347a87059A90680b23246h4833l25571d8415o5284k313l48860
9017d64872H5989a02842o4604P7938G2565b4023G4725b20528J4109j1670M0551
9006a77538g4304C7829J1589M90g0890D2403a81970O5054p3526O5843A2528d21104
$$ y = [149014, -7662, -142627, 171260, -115265, -103215, -93357, 210797, -126662, -87834, 71470, 88347, -115974, -285347, -221807, 9051, -9945, -280410, 43207, -52919, -402998, 95579, -306073, -251617, 132529, -238031, 109472, -137790, 108904, 122525, 43796, 201269, -101564, -200609, -423789, -215568, -428607, -90657, 250867, -198490, 25422, 171673, -140849, 234241, -54255, -117122, -116297, 29209, -54214, 146259, -222483, -232008, -150138, -166336, -389485, -289200, -121975, -105348, 56198, 256545, -187059, 190680, -223246, -84833, -410404, -48415, -113699, -116012, -464872, 85989, -102842, -167446, -89508, 72565, -24023, 74725, -220528, -206419, -218089, -177538, -74304, 37829, 49418, 49908, -70890, 42403, -181970, -116916, -190442, -124599, 12528, -421104]
8993c19324B95949a22605J230H9509D0786b70143j761A59716A1020L09806B1727
8981A19061e3754G8323h3122k1384A96890G6352B1965a02084A79068i3978k10594
8970c04572A98416a76733H8056e1398A87003D525h3206k93804C2615J19385J1445
8959A63445n5858J15445a23846j10630e4788j22331L7083K5452l7508l8102C4309
8947d66856a80659j79897b7991m42828I217f7479B16640a34840H7938b17141h2351
8935A37756a6733m5200k40177g322j19033a0286k06034A28790b61534C3460b5263
8923a2119A120728K133488j522086C05144a0630k05177A44575f0225A84958a87997
8912E7712a24861I1012a333j72269Q0696G1861b42798A41405k3305N5128h7137
$$ y = [-319324, 295949, -122605, -121375, 89509, 40786, -270143, -271904, 159716, 11020, 320826, 21727, 119061, -53754, 78323, -83122, -104506, 196890, 76352, 21965, -102084, 179068, -93978, -304572, 198416, -176733, 88056, -51398, 187003, 4525, -83206, -377010, 32615, 152000, 163445, 107587, 223032, -123846, -234476, -54788, -177119, -140036, -114584, -152092, -190194, 34309, -466856, -180659, -360556, -27991, -470819, 9217, -67479, 216640, -134840, 87938, -217141, -82351, 137756, -16733, -61933, -302110, -7322, -126355, -10286, -216320, 128790, -261534, 33460, -25263, -12119, 1120728, 3254216, 1732130, 305144, -10630, -215807, 144575, -60225, 184958, -187997, 57712, -124861, 91012, -1333, -173602, -92906, 71861, -242798, 141405, 118100, 173228, -87137]
8900E2983p177c52813o4244c3131j02297d3229D2448a31361A77474d31676J45701
8889b85975J27737E130J68006E9520O9566K3757l3217A2457c73674i4273A00330
8877b1057B08800a674C0313F691f01461a87183C64132A728c00387A34623m517
8866A30106f2033A63573o5388c26531D4762M8873J00063a2041B50414a3604n0213
8855f3817j78106J17907A01725J4260K34037j41811b2823k69882B17899A3265
8844a97413M3222B05957C9018K62363g0616r9208e2062A77034a6291j33100r7394
$$ y = [52983, 45806, -352813, -417057, -33131, -135428, -43229, 42448, -131361, 177474, -431676, -285975, -158238, 5130, 173136, 59520, 129086, 152843, 119626, 12457, -373674, -94273, 100330, -21057, 208800, -1674, 30313, 6691, -601461, -187183, 364132, 1728, -300387, 134623, 130106, -62033, 163573, 98185, -326531, 44762, 93635, 193698, -12041, 250414, -13604, -63817, -241923, -124016, 101725, 115985, 350022, 208211, -22823, -292705, 217899, 13265, -197413, -154191, 205957, 39018, 301381, -70616, -169824, -52062, 177034, -16291, -149391, -246785]
$$ [...]
##END NTUPLES=NMR SPECTRUM
##END=
