##TITLE=NES1060_RRG_9883143_8TObMUu1Hl
##JCAMPDX= 6.0         $$ Bruker NMR JCAMP-DX V2.0
##DATA TYPE= NMR SPECTRUM
##DATA CLASS= NTUPLES
##ORIGIN= BRUKER
##OWNER= Administrator
$$ 1.72 TOPSPIN		Version 2.1
$$ 2016-08-26 21:30:58.211 -0500  Administrator@X
$$ Compression mode = diff/dup
##.OBSERVE FREQUENCY= 400.02188249412
##.OBSERVE NUCLEUS= ^1H
##.ACQUISITION MODE= SIMULTANEOUS (DQD)
##.ACQUISITION SCHEME= undefined
##.AVERAGES= 64
##.DIGITISER RES= 22
##SPECTROMETER/DATA SYSTEM= spect
##.PULSE SEQUENCE= noesygpps1d.comp
##.SOLVENT NAME= COFFEE_meoh
##.SHIFT REFERENCE= INTERNAL, COFFEE_meoh, 1, 14.9606
##AUDIT TRAIL= $$ (NUMBER, WHEN, WHO, WHERE, PROCESS, VERSION, WHAT)
$$ ##TITLE= Audit trail, TOPSPIN		Version 2.1
$$ ##JCAMPDX= 5.01
$$ ##ORIGIN= Bruker BioSpin GmbH
$$ ##OWNER= Administrator
$$ $$ E:\/data/COFFEE/nmr/NES1060_RRG_9883143_8TObMUu1Hl/22/pdata/1/auditp.txt
$$ ##AUDIT TRAIL=  $$ (NUMBER, WHEN, WHO, WHERE, PROCESS, VERSION, WHAT)
(   1,<2016-08-26 21:30:53.039 -0500>,<Administrator>,<X>,<go>,<TOPSPIN 2.1>,
      <created by zg
	started at 2016-08-26 21:19:23.398 -0500,
	POWCHK enabled, PULCHK disabled,
       configuration hash MD5:
       21 0F 79 D6 B3 7B B4 F6 88 20 88 DB 03 48 BD 9F
       data hash MD5: 64K
       08 33 2B D6 30 74 82 A4 F6 04 D2 D4 38 EC 2C D0>)
(   2,<2016-08-26 21:30:56.148 -0500>,<Administrator>,<X>,<proc1d>,<TOPSPIN 2.1>,
      <Start of raw data processing
       efp LB = 0.3 FT_mod = 6 PKNL = 1 PHC0 = 0 PHC1 = 0 SI = 128K 
       data hash MD5: 128K
       DB 52 3A 62 4A 2B FB B9 49 35 A5 5A 7B B3 CA 30>)
(   3,<2016-08-26 21:30:57.023 -0500>,<Administrator>,<X>,<proc1d>,<TOPSPIN 2.1>,
      <pk PHC0 = -87.57751 PHC1 = 0 
       data hash MD5: 128K
       88 FA ED C8 42 E5 06 E6 49 60 42 68 23 67 F9 27>)
(   4,<2016-08-26 21:30:57.398 -0500>,<Administrator>,<X>,<proc1d>,<TOPSPIN 2.1>,
      <abs ABSG = 1 
       data hash MD5: 128K
       74 A9 36 7E A2 C1 5E A2 A6 CD 8F FB 84 BB 9B 1E>)
(   5,<2016-08-26 21:30:57.508 -0500>,<Administrator>,<X>,<proc1d>,<TOPSPIN 2.1>,
      <abs ABSG = 2 
       data hash MD5: 128K
       EF BD 31 17 8E 86 F6 3C 9C E7 4B F7 C9 60 EA 41>)
(   6,<2016-08-26 21:30:57.586 -0500>,<Administrator>,<X>,<proc1d>,<TOPSPIN 2.1>,
      <abs ABSG = 3 
       data hash MD5: 128K
       27 E0 34 94 72 FF 15 F4 0B 5A 9E 74 E6 01 EE ED>)
(   7,<2016-08-26 21:30:57.679 -0500>,<Administrator>,<X>,<proc1d>,<TOPSPIN 2.1>,
      <abs ABSG = 4 
       data hash MD5: 128K
       C3 51 91 6D 55 86 F6 00 AB D3 1A 06 E9 EB BE 73>)
(   8,<2016-08-26 21:30:57.789 -0500>,<Administrator>,<X>,<proc1d>,<TOPSPIN 2.1>,
      <abs ABSG = 5 
       data hash MD5: 128K
       3B 16 9A 4A E7 9F 8B 18 94 55 9C 0E 57 F0 66 5F>)
$$ ##END=
$$ 
$$ $$ hash MD5
$$ $$ 11 3B AA 4A AF E0 EB 9A 85 04 00 32 7C CA 23 06
##$RELAX= 
##$RELAX= 
##$RELAX= 
##$RELAX= 
##$RELAX= 
##$RELAX= 
##$RELAX= 
##$RELAX= 
$$ Bruker specific parameters
$$ --------------------------
##$DU= <E:\>
##$EXPNO= 22
$$ [...]
150 150 150 150 150 150 150 150
##$TP07= 0
##$TPNAME0= <>
##$TPNAME1= <>
##$TPNAME2= <>
##$TPNAME3= <>
##$TPNAME4= <>
##$TPNAME5= <>
##$TPNAME6= <>
##$TPNAME7= <>
##$TPOAL= (0..7)
0.5 0.5 0.5 0.5 0.5 0.5 0.5 0.5
##$TPOFFS= (0..7)
0 0 0 0 0 0 0 0
##$TUNHIN= 0
##$TUNHOUT= 0
##$TUNXOUT= 0
##$USERA1= <user>
##$USERA2= <user>
##$USERA3= <user>
##$USERA4= <user>
##$USERA5= <user>
##$V9= 5
##$VALIST= <valist>
##$VCLIST= <CCCCCCCCCCCCCCC>
##$VD= 0
##$VDLIST= <DDDDDDDDDDDDDDD>
##$VPLIST= <PPPPPPPPPPPPPPP>
##$VTLIST= <TTTTTTTTTTTTTTT>
##$WBST= 2048
##$WBSW= 25
##$XGAIN= (0..3)
0 0 0 0
##$XL= 0
##$YL= 0
##$YMAX_a= 5606840
##$YMIN_a= -10351648
##$ZGOPTNS= <>
##$ZL1= 120
##$ZL2= 120
##$ZL3= 120
##$ZL4= 120
##$ABSF1= 14.9606
##$ABSF2= -5.597582
##$ABSG= 5
##$ABSL= 3
##$ALPHA= 0
##$AQORDER= 0
##$ASSFAC= 0
##$ASSFACI= 0
##$ASSFACX= 0
##$ASSWID= 0
##$AUNMP= <proc_prof1d_extract.lims>
##$AXLEFT= 0
##$AXNAME= <>
##$AXNUC= <1H>
##$AXRIGHT= 0
##$AXTYPE= 0
##$AXUNIT= <>
##$AZFE= 0.1
##$AZFW= 0.1
##$BCFW= 0
##$BC_mod= 0
##$BYTORDP= 0
##$COROFFS= 0
##$CY= 15
##$DATMOD= 1
##$DC= 0
##$DFILT= <>
##$DTYPP= 0
##$F1P= 0
##$F2P= 0
##$FCOR= 0.5
##$FTSIZE= 131072
##$FT_mod= 6
##$GAMMA= 0
##$GB= 0
##$INTBC= 1
##$INTSCL= 1
##$ISEN= 128
##$LB= 0.3
##$LEV0= 0
##$LPBIN= 0
##$MAXI= 10000
##$MC2= 0
##$MEAN= 0
##$ME_mod= 0
##$MI= 0
##$NCOEF= 0
##$NC_proc= -2
##$NLEV= 6
##$NOISF1= 0
##$NOISF2= 0
##$NSP= 0
##$NTH_PI= 0
##$NZP= 0
##$OFFSET= 14.9606
##$PC= 1
##$PHC0= -87.57751
##$PHC1= 0
##$PH_mod= 1
##$PKNL= yes
##$PPARMOD= 0
##$PPDIAG= 0
##$PPIPTYP= 0
##$PPMPNUM= 2147483647
##$PPRESOL= 1
##$PSCAL= 4
##$PSIGN= 0
##$PYNMP= <proc.py>
##$REVERSE= no
##$SF= 400.020009795549
##$SI= 131072
##$SIGF1= 0
##$SIGF2= 0
##$SINO= 400
##$SIOLD= 131072
##$SPECTYP= <>
##$SREGLST= <1H.CDCl3>
##$SSB= 0
##$STSI= 131072
##$STSR= 0
##$SW_p= 8223.68421052631
##$SYMM= 0
##$S_DEV= 0
##$TDeff= 65536
##$TDoff= 0
##$TI= <>
##$TILT= no
##$TM1= 0
##$TM2= 0
##$TOPLEV= 0
##$USERP1= <user>
##$USERP2= <user>
##$USERP3= <user>
##$USERP4= <user>
##$USERP5= <user>
##$WDW= 1
##$XDIM= 131072
##$YMAX_p= 392462271
##$YMIN_p= -10225
##$CURPLOT= <Network HP LaserJet P1505>
##$CURPRIN= <$Network HP LaserJet P1505>
##$DFORMAT= <normdp>
##$LAYOUT= <+/1D_H.xwp>
##$LFORMAT= <normlp>
##$PFORMAT= <normpl>
##$SURQMSG= 1
$$ End of Bruker specific parameters
$$ ---------------------------------
##NTUPLES= NMR SPECTRUM
##VAR_NAME=  FREQUENCY,     SPECTRUM/REAL,   SPECTRUM/IMAG
##SYMBOL=    X,             R,               I
##VAR_TYPE=  INDEPENDENT,   DEPENDENT,       DEPENDENT
##VAR_FORM=  AFFN,          ASDF,            ASDF
##VAR_DIM=   131072,        131072,          131072
##UNITS=     HZ,            ARBITRARY UNITS, ARBITRARY UNITS
##FACTOR=    0.0627417313425164, 1,          1
##FIRST=     8223.62146879497, 3935,         -51898
##LAST=      0,             5695,            -51752
##MIN=       0,             -10225,          0
##MAX=       8223.62146879497, 392462271,    0
$$ Real data points
##PAGE= N=1
##DATA TABLE= (X++(R..R)), XYDATA
$$ [...]
68011 143299 143471 143418 143203 142818 142067 141028 140202 139903 139807 139410 138641 137707 136567 134947 132740 129962 126424
67994 126424 121820 116227 110226 104542 99763 96252 93905 92022 89867 87477 85555 84458 83701 82660
67980 82660 81391 80450 80191 80546 81261 81945 82090 81463 80480 79832 79669 79457 78729 77675 76777 76100 75217 73804
67962 73804 72063 70465 69237 68254 67308 66332 65302 64145 62823 61426 60038 58602 57055 55532 54279
67947 54279 53431 53033 53199 53967 54975 55577 55435 54780 54046 53453 53124 53283 54024 55020 55773 56144 56389 56705 56953
67928 56953 56842 56199 55072 53821 53172 53873 56053 58978 61610 63402 64462 65039 65097 64506 63502 62731 62730
67911 62730 63421 64204 64466 63966 62836 61475 60395 59891 59716 59303 58507 57927 58255 59493 61041 62439 63572
67894 63572 64266 64191 63383 62437 61892 61707 61598 61585 61808 62028 61806 61157 60553 60254 60048 59783 59704 60022 60470 60593
67874 60593 60281 59804 59528 59816 60885 62411 63483 63406 62413 61254 60264 59335 58584 58312 58249 57564 55972 54244
67856 54244 53251 53025 53200 53779 54780 55510 55039 53364 51448 50063 49209 48665 48386 48132 47357 45911 44431
67839 44431 43658 43687 44221 45172 46569 48127 49474 50689 52164 53971 55842 57827 60435 63837 67260 69639
67823 69639 70811 71752 73566 76422 79570 82135 83686 84212 83953 83330 82687 81795 79882 76512 72306 68421
67807 68421 65344 62593 59612 56520 53798 51649 49937 48490 47179 45921 44824 44160 43952 43828 43510
67792 43510 43257 43516 44297 45188 45828 46037 45695 44897 44148 43957 44219 44383 44216 43991 43858 43555 42954 42502 42796
67773 42796 43907 45376 46660 47372 47299 46483 45265 44073 43210 42892 43302 44383 45721 46888 47803 48636 49465
67756 49465 50253 50998 51629 51820 51251 50133 49215 49162 50068 51592 53285 54664 55195 54551 52936 51060 49682
67739 49682 49098 48919 48434 47377 46331 46119 46737 47274 47045 46359 45764 44985 43325 41089 39649 39783 40651
67722 40651 40947 40530 40171 40052 39512 38330 37366 37461 38245 38575 37855 36475 35145 34232 33749 33586 33676 34076 34854
67703 34854 35767 36210 35786 34873 34321 34573 35343 36170 36951 37746 38387 38670 38799 39270 40212 41109 41363 40952 40312
67684 40312 39723 39109 38424 37837 37431 37090 36918 37337 38353 39052 38504 37118 36337 36863 37855 38214 38022 38168
67666 38168 39029 40190 41188 41849 42036 41743 41469 41892 42987 43946 44159 43815 43390 42958 42376 41830 41809 42550 43694
67647 43694 44484 44323 43325 42339 42200 42844 43415 43336 42989 43199 44284 45861 47352 48412 48982 49220 49440 49906
67629 49906 50578 51085 50998 50158 48811 47391 46209 45396 45133 45628 46686 47580 47736 47389 47220 47457 47819 48200
67611 48200 48800 49527 49961 50166 50870 52437 54188 55220 55452 55324 54892 53878 52396 50986 49996 49448 49393
67594 49393 49785 50100 49708 48692 47769 47307 46973 46474 46103 46248 46791 47292 47505 47456 47231 46882 46346 45354 43659
67575 43659 41523 39751 39084 39660 41020 42393 43006 42561 41546 40678 39962 38752 36935 35493 35497 36955 39047
67558 39047 41104 42821 43865 43959 43326 42530 41904 41543 41672 42496 43687 44585 44911 44796 44115 42496 40137
67541 40137 37975 36631 35771 34865 34106 33981 34365 34693 34844 35203 35914 36626 37101 37522 38059 38574 38886 39011
67523 39011 38922 38464 37714 37118 37009 37263 37663 38303 39229 39918 39616 38231 36525 35347 34961 35151 35608 36058
67505 36058 36283 36277 36260 36409 36684 37010 37429 37877 38050 37757 37287 37089 37153 37056 36677 36495 36984 37970 38879 39416 39661
67484 39661 39596 38963 37754 36516 35883 35913 36131 36143 36026 36084 36471 37131 37938 38763 39497 40136 40774 41379 41663 41292
67464 41292 40263 38912 37603 36497 35608 34892 34238 33576 33078 33128 33949 35370 37049 38768 40359 41526
67448 41526 42043 42143 42334 42692 42572 41317 39147 37067 35854 35431 35304 35363 35901 36968 38104 38841 39254
67431 39254 39705 40217 40378 39896 38983 38144 37792 38136 39204 40737 42194 43068 43207 42807 42187 41618 41201 40694
67413 40694 39618 37743 35389 33120 31270 30008 29638 30374 31794 32952 33262 32958 32560 32222 31950 32116
67397 32116 33245 35258 37326 38651 39200 39515 39959 40295 40006 38926 37518 36538 36422 37015 37795 38285 38319
67380 38319 38099 38073 38568 39366 39763 39238 38057 37092 37048 37930 39193 40210 40653 40601 40380 40250 40209 40097 39808
67361 39808 39342 38745 38072 37343 36498 35507 34579 34071 34034 34055 33768 33313 33090 33261 33830 34936 36572 38192 39194
67342 39194 39752 40555 41671 42432 42622 42880 43510 43675 42541 40629 39192 38632 38430 38323 38554 39058 39444 39895
67324 39895 41045 42693 43640 43293 42489 42113 41799 40849 39723 39475 40081 40444 39982 39203 38615 38078 37533 37493
67306 37493 38302 39539 40697 41945 43668 45611 47100 47889 48225 48195 47602 46570 45798 45939 46980 48341
67290 48341 49385 49673 48980 47385 45437 43993 43656 44283 45159 45685 45788 45613 45104 44163 43078 42359 42115
67273 42115 42013 41976 42479 43890 45864 47784 49467 50982 52027 52103 51295 50319 49651 49086 48385 47899 48200 49321
67255 49321 50669 51565 51655 50973 49868 48797 47961 47254 46732 46860 47947 49463 50410 50411 50060 50030 50217 50048 49395
67236 49395 48780 48717 49138 49515 49389 48723 47816 46979 46343 45997 46153 46927 47898 48225 47474 46162 45162 44708 44445
67217 44445 44372 45143 47127 49552 51065 51038 50028 49064 48774 49186 49990 50834 51490 51876 51971 51789 51521 51573 52236
67198 52236 53383 54604 55558 55995 55612 54266 52397 50886 50377 50885 52078 53646 55351 56985 58458 59734
67182 59734 60556 60518 59590 58346 57460 57161 57348 57957 58909 59846 60289 60124 59769 59832 60595 61738 62547 62574 62184
67163 62184 62174 62794 63462 63618 63392 63153 62880 62527 62563 63376 64358 64409 63381 62241 61694 61432 61048 60936 61721
67144 61721 63340 65182 66737 67618 67402 66099 64572 63938 64639 66441 68951 71544 73157 73071 71924 71143
67128 71143 71275 71559 71316 70980 71346 72505 74050 75768 77461 78558 78676 78383 78649 79607 80521 80985 81342
67111 81342 81780 81826 81192 80468 80373 80776 81184 81806 83257 85252 86532 86391 85579 85185 85257 85105 84638 84615 85620
67092 85620 87374 89187 90660 91770 92615 93283 93768 93940 93797 93740 94291 95499 96921 98225 99396 100299 100608
67075 100608 100462 100626 101493 102397 102595 102565 103474 105434 107220 107954 108187 108858 109899 110599 110892 111417 112443 113517
67057 113517 114332 115241 116596 118052 118975 119280 119436 119772 120216 120724 121580 123028 124857 126594 128062 129482
67041 129482 131012 132437 133484 134283 135241 136513 137831 139001 140274 142008 144060 145785 146694 146964 147296
67026 147296 148425 150753 154189 158132 161723 164378 166138 167470 168814 170439 172595 175442 178679 181534
67012 181534 183427 184591 185781 187397 189192 190917 192907 195693 199175 202564 205225 207343 209620 212504
66998 212504 215856 219234 222320 225124 227920 230978 234298 237627 240835 244152 247869 251849 255635 259075
66984 259075 262608 266646 270838 274277 276540 278301 280740 284449 289074 293946 298771 303620 308516 313364
66970 313364 318243 323454 329160 335151 341130 347112 353369 360087 367220 374628 382137 389463 396372 403015
66956 403015 409947 417658 426158 435112 444268 453603 463111 472615 481814 490438 498446 506176 514291 523420
66942 523420 533838 545502 558318 572140 586544 600857 614618 627897 641044 654257 667614
66931 667614 681429 696273 712457 729664 747259 764909 782803 801274 820395 839945 859623
66920 859623 879238 898843 918836 939831 962268 986129 1011059 1036707 1062827 1089203 1115724
66909 1115724 1142595 1170308 1199291 1229665 1261223 1293448 1325572 1357065 1388282 1420339 1454043
66898 1454043 1489114 1524661 1560179 1595706 1631221 1666488 1701513 1736678 1772225 1807929 1843442
66887 1843442 1878546 1912894 1945943 1977508 2008053 2037989 2066867 2093769 2118424 2141505 2163694
66876 2163694 2184822 2204008 2220359 2233456 2243430 2250784 2255964 2258954 2259431 2257391 2253371 2247789 2240226
66863 2240226 2229710 2215784 2199085 2180727 2161296 2140545 2117930 2093170 2066279 2037433 2007032
66852 2007032 1975730 1944062 1911986 1879043 1845038 1810318 1775283 1739909 1704032 1667929 1632308
66841 1632308 1597726 1564168 1531170 1498192 1464959 1431638 1398692 1366493 1335134 1304698 1275417
66830 1275417 1247284 1219672 1191770 1163437 1135307 1108032 1081708 1056069 1030920 1006290 982525
66819 982525 960262 939876 920704 901255 880619 859434 839112 820295 802509 785087 767853
66808 767853 750827 733879 716956 700332 684234 668483 652855 637690 623730 611243 599638
66797 599638 588104 576376 564707 553381 542575 532546 523421 514790 505929 496644 487454 478729 470154
66784 470154 461457 453206 446171 440126 434043 427493 421034 415048 408974 402185 394993 388144 381688 374978
66770 374978 367665 360163 353112 346830 341309 336441 332153 328455 325303 322352 319017 315007 310561 305982
66756 305982 301241 296362 291869 288306 285425 282323 278403 273785 268901 264123 259781 255978 252295 248157
66742 248157 243678 239746 237027 235184 233319 230936 228239 225662 223327 220935 218152 215116 212424 210437
66728 210437 208782 206848 204617 202564 200830 199032 196935 194729 192502 189990 187155 184522 182597 181291
66714 181291 180248 179353 178589 177718 176440 174623 172162 169012 165647 162972 161297 159830 157737 155329 153550
66699 153550 152620 151955 151218 150533 149605 147576 144180 140421 137657 136373 136135 136316 136482 136363 135894 135233 134489
66682 134489 133572 132447 131298 130239 129045 127412 125389 123406 121911 121065 120633 120142 119296 118322 117643 117183
66666 117183 116332 114825 113294 112586 112705 112821 112253 111080 109793 108692 107789 107037 106413 105847 105205 104383 103389
66649 103389 102288 101045 99508 97662 95837 94521 93908 93786 93851 93963 94082 94189 94383 94754 95025 94634 93430
66632 93430 92059 91353 91451 91834 92008 91833 91330 90650 90184 90272 90714 90932 90652 90081 89380 88413 87164 85997 85219
66613 85219 84755 84475 84445 84523 84114 82843 81228 80172 79862 79716 79343 79020 79020 79015 78462 77352 76244 75715 75924
66594 75924 76557 77053 76968 76296 75388 74569 73933 73475 73113 72544 71417 69908 68800 68698 69322 69835 69745 69229 68756
66575 68756 68689 69111 69718 69962 69633 69179 69078 69026 68298 66917 65857 65885 66695 67468 67778 67562 66705 65245 63718
66556 63718 62653 61810 60545 58972 58167 58946 60818 62428 62822 62113 61199 61062 62118 63923 65538 66348
66540 66348 66482 66425 66396 66300 66103 65912 65704 65234 64325 63148 62104 61507 61405 61643 62041 62543 63188 63937 64587
66521 64587 64935 65059 65279 65723 65967 65310 63517 61193 59297 58293 57928 57785 57780 57985 58226 58196 57906 57716 57867
66502 57867 58212 58467 58538 58505 58469 58507 58574 58352 57391 55626 53600 51985 50996 50454 50297 50644 51337 51763 51328 49998
66482 49998 48256 46666 45643 45498 46444 48416 50943 53331 55022 55819 55829 55264 54359 53452 52929 52940 53230
66465 53230 53387 53343 53445 53936 54485 54406 53403 51943 50828 50491 50813 51547 52645 54057 55384 56016 55679 54734
66447 54734 53887 53674 54213 55325 56676 57874 58562 58599 58169 57660 57285 56819 55830 54249 52559 51228 50136
66430 50136 48909 47768 47541 48594 50093 50714 49931 48326 46810 45971 46086 47220 49028 50748 51712 51798
66414 51798 51298 50481 49460 48349 47341 46597 46128 45850 45734 45943 46720 48057 49467 50256 50102 49305 48479
66397 48479 48076 48193 48642 49111 49368 49341 49023 48377 47538 46980 47142 47883 48654 49308 50327 51958 53512 54007
66379 54007 53350 52401 51896 51726 51361 50560 49480 48382 47502 47054 47095 47396 47616 47677 47868 48551 49750 51085
66361 51085 52154 52929 53678 54500 55198 55640 55927 55976 55293 53653 51781 50746 50636 50409 49277 47702 46681
66344 46681 46486 46582 46494 46219 45874 45428 44884 44405 44156 44237 44746 45719 46997 48353 49670 50772 51224 50739 49809
66325 49809 49431 49999 50795 50870 50148 49323 48910 48833 48894 49111 49426 49470 48972 48320 48358 49517 51313 52803 53479 53591
66305 53591 53648 53740 53420 52170 49907 47136 44738 43541 43858 45235 46727 47568 47676 47533 47578 47798 47885 47724
66287 47724 47522 47489 47530 47410 47150 47023 47145 47284 47148 46689 45970 44975 43827 43061 43317 44627 46274 47478
66269 47478 48053 48267 48266 47966 47458 47246 47819 49000 49908 49739 48596 47419 47049 47478 48104 48542 48931 49541 50367
66250 50367 51151 51629 51652 51260 50706 50275 50010 49772 49543 49447 49400 49054 48278 47514 47356 47888 48638 49114 49205 49155 49364
66229 49364 50179 51617 53279 54616 55353 55580 55517 55322 55009 54436 53458 52240 51228 50612 49990 48916 47665
66212 47665 47061 47518 48663 49970 51401 53172 55200 57059 58301 58655 58079 56860 55489 54246 53021
66197 53021 51682 50467 49742 49513 49470 49431 49489 49725 50048 50346 50578 50703 50711 50731 50883 51006 50822 50383 50076 50071 50129
66176 50129 50167 50621 51848 53358 54190 54003 53332 52722 52107 51293 50552 50329 50659 51331 52388 53905 55362 55900
66158 55900 55377 54647 54564 55075 55623 55978 56287 56625 56975 57455 58067 58334 57749 56533 55468 54979 54834 54770 54795
66139 54795 54741 54226 53406 53155 53969 55082 55357 54762 54349 54851 55928 56882 57461 57740 57677 57206 56554 56090 55841
66120 55841 55414 54509 53398 52813 53214 54270 55164 55443 55357 55302 55267 55038 54624 54133 53470 52646 52256 53093 55185
66101 55185 57617 59410 60302 60644 60925 61448 62100 62332 61770 60915 60751 61485 62198 62070 61518 61612 62695 64029
66083 64029 64669 64318 63457 62937 63322 64340 65198 65645 66371 67928 69651 70257 69362 67735 66125 64548 62869
66066 62869 61431 60740 60844 61285 61481 61075 60177 59322 58879 58535 57738 56578 55663 55070 54153 52682 51471 51363
66048 51363 52089 52817 53411 54443 56101 57807 58962 59492 59581 59374 59062 58871 58773 58529 58124 57834 57742 57605 57374
66029 57374 57523 58535 60269 62151 63849 65445 66994 68298 69247 70083 71078 72062 72545 72355 71884 71581 71426
66012 71426 71158 70814 70700 70844 70971 71095 71672 72856 74037 74548 74583 74911 75854 77076 78362 80000 82270
65995 82270 84943 87566 89937 92140 94343 96780 99676 102959 106159 108784 110727 112260 113693 115096
65981 115096 116189 116514 115868 114625 113372 112234 110833 108931 106741 104408 101578 97864 93569 89558 86470
65966 86470 84323 82824 81744 80907 80051 78912 77452 76008 75103 75022 75531 76183 76860 77772 78909 79830 80237
65949 80237 80461 81051 82012 82858 83365 83940 85161 87106 89266 91047 92344 93625 95328 97219 98603 99243
65933 99243 99721 100612 101667 102263 102476 103116 104659 106610 108142 109012 109678 110761 112592 115031 117524 119426
65917 119426 120502 121111 121928 123516 126103 129567 133573 137876 142462 147200 151472 154483 156036 156726 157291
65902 157291 158065 159107 160459 161960 163193 163938 164465 165038 165328 164762 163305 161428 159321 156656 153302 149740
65886 149740 146464 143293 139718 135739 131928 128648 125630 122466 119184 116139 113551 111422 109763 108537
65872 108537 107396 105802 103627 101435 99983 99460 99358 99022 98217 97204 96398 95964 95665 95064 93893 92205
65856 92205 90257 88411 87201 87205 88525 90485 92158 93225 94085 95078 95967 96358 96297 96127 95941 95642 95508 96156
65838 96156 97684 99277 100171 100792 102264 104742 106884 107413 106727 106367 107183 108752 110488 112447 114805 117266
65822 117266 119540 121895 124718 127900 131219 134966 139518 144425 148643 151725 154125 156233 157667 157799
65808 157799 156528 154326 151869 149794 148417 147359 145750 143128 140043 137593 136466 136510 136997 137121 136460
65793 136460 135154 133624 132117 130650 129288 128167 127308 126782 127090 128838 131856 135103 137763 140142 143269
65778 143269 148007 154794 163675 174036 184581 194214 202881 211144 219056 225842 230591 232809 232317 229088
65764 229088 223304 215327 205588 194732 183755 173645 164849 157339 151076 146063 142059 138773 136440
65751 136440 135734 136898 139341 142406 146282 151749 159157 168040 177777 188289 199864 212417 225303
65738 225303 237917 250203 262203 273293 282321 288673 292730 294960 294896 291528 284595 275005 263901
65725 263901 251736 238491 224483 210581 197564 185524 174090 163187 153306 144879 137653 131041
65713 131041 124982 119964 116157 113061 110233 107862 106222 104987 103560 101825 100110 98593 97198 95888
65699 95888 94673 93529 92684 92705 93748 94963 95253 94550 93752 93524 93831 94593 95964 97773 99365 100340 100979
65682 100979 101688 102501 103370 104453 105833 107329 108941 111169 114626 119479 125329 131333 136544 140738 145109
65667 145109 151562 161008 172710 185463 198834 212935 227617 242513 257484 272450 286915 300093
65655 300093 311364 320369 326950 331334 334095 335589 335662 334221 331817 329377 327650 327149 328175 330383 332731
65640 332731 334425 335620 336662 336927 335082 330391 323154 313896 302803 290076 276258 261920 247278
65627 247278 232290 216949 201478 186413 172501 160300 149909 141180 133998 128120 122957 117920
65615 117920 112971 108653 105641 104293 104274 104411 103375 100946 98329 96823 96544 96794 97117 97302 96815 95244
65599 95244 93202 91945 92061 93177 94769 96423 97431 97233 96406 96219 96903 97352 96893 96342 96739 97956 99340
65582 99340 100872 102705 104209 104669 104761 106281 110283 116237 123137 130690 139136 148476 158401 168808 180081
65567 180081 192720 206720 221380 235852 249814 263310 275892 286362 293644 297563 298546 296924
65555 296924 292883 286711 278532 268092 255399 241472 227861 215310 203337 191154 178644 166397
65543 166397 155215 145675 137833 131249 125579 121153 118628 118004 118284 118286 117522 116285 115202 114845 115427 116578
65527 116578 117573 117945 117758 117165 115940 113689 110428 106727 103306 100613 98689 97267 95988 94645 93261
65512 93261 91913 90530 88987 87376 86060 85392 85462 86136 87278 88803 90586 92398 93993 95178 95830 96012
65496 96012 96122 96718 97987 99495 100629 101172 101294 101214 101221 101835 103443 105735 107979 110029 112556 116036 119930
65479 119930 123183 125240 126209 126388 126038 125437 124732 123820 122652 121510 120626 119710 118183 115806 112742 109259
65463 109259 105734 102747 100636 99044 97416 95829 94790 94213 93330 91832 90471 90130 90721 91401 91570 91215
65447 91215 90580 89974 89828 90465 91684 92826 93426 93638 93942 94532 95190 95830 96946 99204 102512 105805 108028
65430 108028 109186 110164 111683 113777 116108 118313 119999 120849 120872 120271 118996 116820 113956 111186 109148
65415 109148 107810 106793 105885 105044 104251 103623 103405 103555 103618 103290 102885 102976 103770 105043 106470 107755 108672 109306
65397 109306 110098 111346 112872 114423 116175 118487 121356 124437 127434 130066 131783 131984 130595 128180 125524
65382 125524 123304 121955 121407 120993 120039 118550 117055 115867 114947 114422 114645 115553 116432 116618 116217 115939 116415
65365 116415 117757 119505 120897 121531 122001 123571 126917 131351 135538 138805 141518 144336 147492 150800 154087
65350 154087 157471 161348 166126 171777 177547 182200 184790 185366 184895 184433 184295 184078 183378 182248 180849 178920
65334 178920 175938 171724 166649 161285 156091 151379 147237 143440 139729 136274 133538 131583 129833 127748
65320 127748 125506 123742 122797 122426 122107 121460 120480 119600 119354 119715 119881 119015 117148 115048 113225 111399 109086
65303 109086 106368 103868 102115 101194 100955 101325 102330 103904 105770 107535 108944 110095 111403 113279 115791
65288 115791 118635 121379 123608 124827 124534 122704 120128 117920 116527 115457 114089 112476 111158 110512 110542
65273 110542 111052 111608 111529 110438 108820 107574 107050 106925 107030 107655 108856 110060 110708 110873 110892 110817 110697 110979
65255 110979 112019 113418 114449 115019 115654 116573 117396 117828 118042 118225 118311 118424 119000 120024 120567 119630 117261
65238 117261 114293 111247 108131 105352 103976 104541 106060 106851 106293 105291 104957 105356 105723 105544 105057 104873
65222 104873 105415 106561 107620 107855 107277 106723 106761 106766 105629 103310 101014 99737 99270 98926 98610 98639 98945 99081
65204 99081 98872 98558 98415 98592 99213 100225 101209 101716 101687 101278 100452 99227 98198 98209 99405 100965 101938 102071
65186 102071 101793 101765 102521 104210 106487 108777 110699 112108 112905 113140 113187 113417 113632 113234 111978 110238 108476
65169 108476 106887 105620 104915 104840 105200 105836 106683 107443 107627 107148 106559 106534 107338 108884 110930 113072 114918
65152 114918 116474 118014 119475 120463 121042 121944 123640 125686 127441 128949 130639 132580 134695 137430 141466
65137 141466 146785 152520 157792 162302 166184 169727 173256 176927 180623 184279 188055 191846 194890 196513
65123 196513 197133 197831 198906 199546 199166 198387 198240 198902 199705 200056 199814 198950 197375 195157 192522 189486 185782
65106 185782 181276 176246 171080 165849 160413 154922 149889 145650 141947 138289 134542 130927 127564 124403
65092 124403 121556 119267 117447 115753 114255 113577 113992 114858 115338 115351 115315 115319 115128 114822 114751 114886 114783 114221 113381
65073 113381 112392 111231 110143 109622 109828 110430 111184 112197 113488 114704 115467 115645 115225 114352 113632 113816 114871
65056 114871 115832 115927 115453 115162 115252 115458 115838 116796 118333 119792 120466 120148 119037 117418 115589 113831 112212
65039 112212 110502 108469 106327 104749 104236 104450 104438 103697 102793 102636 103295 103893 103613 102354 100457 98356 96635
65022 96635 95874 96084 96607 96823 96700 96461 96173 95996 96441 97808 99593 100964 101756 102554 103817 105394 107040
65005 107040 108985 111624 114752 117479 119078 119759 120335 121156 121803 122049 122668 124708 128127 131759 134564 136236
64989 136236 136649 135637 133673 131960 131231 131064 130893 131120 132511 134978 137759 140464 143165 145633 147367
64974 147367 148360 149109 149795 150085 149755 148890 147445 145281 142725 140383 138215 135464 131800 127925 124630 121841
64958 121841 119094 116579 115059 114870 115504 116159 116391 116170 115618 114836 113906 112960 112175 111644 111234 110611 109474
64941 109474 107875 106373 105789 106466 107740 108501 108473 108578 109728 111633 113214 113872 113819 113481 113211 113426 114286
64924 114286 115261 115641 115547 115736 116382 116759 116352 115583 115107 114951 114687 113973 112691 111074 109893 109883 110741 111347
64906 111347 111351 111735 113345 115689 117942 120374 123749 127772 131314 133986 136458 139213 142066 145105 149087
64891 149087 154427 160456 166231 171532 176637 181604 186413 191544 197745 205094 212655 219261 224424 228327
64877 228327 231071 232253 231496 229134 225957 222254 217622 211985 206228 201330 197238 193268 189323 185919
64863 185919 183095 180245 177280 175081 174286 174229 173664 172131 170022 167678 165066 162194 159184 155946 152330
64848 152330 148667 145633 143360 141037 137701 133239 128520 124707 122566 122130 122757 123565 123948 123764 123077 121972
64832 121972 120679 119682 119382 119675 119987 119732 118736 117292 115960 115260 115406 116299 117767 119659 121631 123082
64816 123082 123732 124191 125546 128217 131562 134826 138076 141804 145889 149580 152476 154997 157769 161013 164790
64801 164790 169348 174749 180384 185336 189173 192024 193927 194562 193764 191884 189326 185959 181391 175866 170533
64786 170533 166608 164358 163107 162113 161192 160434 159698 158733 157619 156696 156063 155529 155199 155662 157292 159587 161564
64769 161564 162707 163284 163893 165065 167263 170759 175312 180234 185024 189819 195082 200994 207341 213819 220202
64754 220202 226186 231369 235555 239027 242383 246061 250034 253939 257468 260676 263908 267374 270729 273106
64740 273106 273746 272503 269624 265097 258622 250400 241583 233518 226667 220576 214781 209312 204398 200207
64726 200207 196978 194933 193841 193055 192241 191718 191857 192459 193003 193178 192865 192038 191170 191418 193730 197839 202615
64709 202615 207339 212092 216938 221422 225111 228154 230859 232944 233467 231458 226562 219351 211139 203296
64695 203296 196465 190415 184640 178988 173709 169115 165298 162073 159130 156366 154096 152819 152733 153565 154794
64680 154794 155908 156528 156577 156371 156385 156864 157811 159257 161350 164206 167851 172236 177107 181996 186681 191541
64664 191541 197052 202959 208335 212400 214849 215462 214075 211151 207725 204397 200807 196479 191771 187559
64650 187559 184284 181751 179570 177373 174898 172333 170468 170045 170991 172610 174379 176243 178359 180974 184431
64635 184431 188807 193618 198351 203264 209189 216560 225086 234399 244417 254875 264967 273747 280644
64622 280644 285361 287575 287027 283784 278229 270913 262487 253550 244467 235469 226931 219228 212254 205521
64608 205521 198936 193119 188559 184794 180905 176677 172792 169830 167536 165233 162647 160094 158008 156529
64594 156529 155501 154747 154310 154470 155540 157595 160389 163426 166094 167930 168992 169977 171779 174814 178856
64579 178856 183568 188993 195441 203031 211579 220890 230901 241418 251873 261541 269980 277142 283070
64566 283070 287627 290540 291561 290505 287288 282080 275321 267412 258500 248785 238921 229745 221484 213610
64552 213610 205755 198436 192458 187810 183657 179475 175702 173099 171864 171648 172066 172805 173570 174344 175547
64537 175547 177420 179347 180334 180176 179650 179392 179087 177985 175804 172855 169710 167042 165325 164230 162677
64522 162677 160064 157216 155573 155587 156455 157256 157690 157757 157463 157063 156972 157205 157371 157406 157796 158835 160249 161861
64504 161861 163978 166641 169129 170898 172592 175345 179297 183620 187894 192677 198514 205097 211649 217612
64490 217612 222668 226478 228805 229734 229553 228597 227268 225960 224791 223620 222484 221800 221948 222787 223757 224344
64474 224344 224349 223764 222527 220454 217469 213926 210512 207656 205214 202918 200923 199541 198709 198262 198561 200186
64458 200186 202922 205801 208366 211189 214666 217939 219650 219396 217849 215818 213869 212574 212279 212546 212558
64443 212558 212213 212328 213634 216170 219769 224449 229972 235600 240850 246175 252430 259913 268419 278080 289672
64428 289672 304071 321722 342596 366341 392547 421287 453430 490205 532498 580900 636218
64417 636218 699278 769938 846705 927482 1010253 1092835 1172650 1247453 1316095 1377974 1431844
64406 1431844 1475701 1507771 1527078 1533137 1525943 1506627 1477461 1440553 1396625 1345308 1286305 1219915
64394 1219915 1146900 1068599 987228 905571 826169 750963 681479 618799 563182 514135 471109
64383 471109 433933 402485 376240 354337 335916 320210 306557 294532 284009 274886 266884 259726
64371 259726 253410 248056 243544 239509 235727 232302 229304 226380 222958 218862 214527 210423 206481 202363
64357 202363 198165 194384 191175 188197 185462 183763 183732 184851 186052 187078 188573 190962 194020 197554 201651
64342 201651 205933 209320 210968 210956 209688 207200 203522 199190 194813 190467 186015 181720 177998 174884 172277
64327 172277 170432 169671 169764 170125 170374 170236 169319 167736 166595 166933 168241 169034 168947 169262 171109 174101 177188
64310 177188 180015 182768 185398 187702 189684 191155 191285 189293 185445 180836 176349 172228 168451 164967
64296 164967 161677 158617 156035 153888 151557 148576 145423 143003 141488 140439 139915 140613 142625 144916 146526
64281 146526 147740 149513 152134 155063 157835 160529 163440 166766 170721 175480 180843 186239 191222 195856
64267 195856 200512 205361 210138 214253 217142 218647 219156 219262 219221 218825 217877 216678 215882 215918 216626 217428 217708
64250 217708 217047 215236 212199 207935 202563 196482 190344 184669 179437 174362 169638 166103 164342 163817 163318
64235 163318 162217 160899 159975 159535 159339 159267 159258 159132 158904 159056 160038 161579 162877 163448 163414 163001 162176 160959
64217 160959 159734 158971 158752 158732 158462 157670 156324 154560 152532 150333 148124 146275 145197 144980 145252 145470
64201 145470 145263 144632 143964 143766 144215 145019 145942 147354 149892 153528 157411 160765 163636 166570 169964 174066
64185 174066 179316 186158 194595 204189 214450 224889 234816 243536 250792 256615 260559 261488 258520 252076
64171 252076 243709 234864 226094 217438 209161 201754 195329 189432 183628 178050 173112 168899 165104 161559
64157 161559 158435 155872 153737 151892 150486 149756 149717 150238 151233 152590 154096 155690 157692 160475 163955
64142 163955 167599 170987 174161 177416 180857 184141 186606 187739 187688 187173 186743 186245 185229 183652 181854
64127 181854 179979 177873 175568 173441 171803 170669 170076 170249 171254 172772 174499 176563 179330 182960 187354
64112 187354 192360 197862 203768 210059 216708 223487 230096 236575 243245 249928 255563 259069 260438 260606
64098 260606 260404 260136 260182 261367 264399 269269 275390 282079 288629 294168 297867 299359 298882 297022 294287
64083 294287 290679 285529 277975 267927 256523 245457 235854 227863 221137 215364 210392 206154 202623
64070 202623 199654 196857 193910 191130 189421 189339 190392 191554 192350 193077 194058 195139 196108 197136 198478 200022
64054 200022 201537 203159 205197 207536 209745 211847 214497 218171 222629 227514 233109 240010 248149 256668
64040 256668 264832 272713 280802 289179 297271 304287 309706 313371 315200 314871 311953 306452 299152 291202
64026 291202 283379 275981 269367 264192 260865 259085 258228 258117 259126 261545 265029 268696 271592 273131 273293
64011 273293 272524 271240 269377 266486 262353 257365 252213 247389 243079 239317 236020 232925 229830 226938
63997 226938 224715 223311 222347 221458 220854 221027 222014 223332 224692 226383 228745 231547 234284 236949 240126
63982 240126 244240 249040 253946 258667 263237 267724 272250 277310 283609 291327 299702 307689 315021 322351
63968 322351 330231 338296 345829 353003 361026 370892 382384 394696 407750 422385 439288 458342 479273
63955 479273 502644 529829 562158 600381 644931 696508 756377 826154 907133 999632 1102945
63944 1102945 1216050 1338237 1468931 1607109 1751242 1899784 2051250 2203650 2354028
63935 2354028 2498707 2633739 2755055 2858733 2941864 3003323 3043286 3061873 3058479 3032451 2983951
63924 2983951 2913838 2823149 2713467 2587892 2451076 2307807 2161629 2014871 1869558 1727811
63914 1727811 1591538 1462321 1341660 1230833 1130238 1039300 957399 884680 821537 767427
63904 767427 720673 679596 643539 612652 586951 565794 548130 533040 520058 509119 500274 493354
63892 493354 487849 483035 478261 473233 468217 463944 461122 459908 459851 460380 461311 462972 466022 471146 478753
63877 478753 488811 501042 515164 530788 547222 563845 580842 599120 619110 639951 660262
63866 660262 679553 698334 716918 734632 750275 762936 772227 778299 781835 783558 783267 779710 771954
63853 771954 760723 747846 734443 720173 704312 687024 669263 651836 634939 618426 602102
63842 602102 585732 569002 551602 533285 513881 493361 471929 449966 427911 406248 385559
63831 385559 366388 348946 333007 318202 304405 291790 280505 270432 261335 253186 246137 240081
63819 240081 234417 228499 222310 216480 211577 207533 203925 200650 198055 196392 195417 194664 193910 193180 192393
63804 192393 191287 189717 187798 185686 183458 181351 179794 178857 177836 175880 173150 170946 170457 171595 173265
63789 173265 174479 174878 174435 173205 171492 169888 168833 168247 167682 166827 165747 164720 163890 163137 162267 161338
63773 161338 160667 160498 160797 161402 162145 162725 162774 162364 162219 163014 164510 165758 166083 165536 164433 163005 161600
63756 161600 160678 160275 159843 158930 157759 156824 156201 155666 155282 155457 156368 157669 158845 159743 160671 162004 163674
63739 163674 165113 165924 166513 167702 169685 171848 173824 176185 179582 183615 187191 189835 192044 194406 196984
63724 196984 199615 202282 204991 207747 210860 214876 219961 225631 231274 236588 241307 244851 246672 246805
63710 246805 245752 243885 241248 237953 234430 231112 227958 224534 220651 216835 213918 212193 211186 210412
63696 210412 210036 210489 211678 213019 214254 215748 217902 220631 223558 226371 228844 230831 232469 234111 235882
63681 235882 237487 238685 239681 240850 242263 243650 244664 244958 244314 242992 241791 241379 241687 242247 243040 244581
63665 244581 247096 250010 252508 254395 256126 258025 259688 260292 259394 257260 254405 251037 247096 242705 238243
63650 238243 234004 230048 226480 223605 221691 220778 220818 221709 223022 223980 224051 223581 223667 225384 229079 234127 239234
63633 239234 243235 245968 248379 251666 256380 262262 268564 274329 278868 282548 286916 293391 301757 310387
63619 310387 318038 325064 332791 342205 353540 366714 381685 398461 417099 437727 460345 484770
63607 484770 510965 539375 570489 603936 638212 671417 702000 728607 749579 763304 769339 768902
63595 768902 764038 756503 747543 738259 729578 721825 714689 707546 699455 688958 674564 655820 633620
63582 633620 609317 583875 557996 532525 508230 485449 464391 445521 429239 415430 403832
63571 403832 394665 388303 384396 381948 380433 380297 382073 385452 389579 394020 399054 405121 412314 420418
63557 420418 429258 438936 449805 462269 476579 492759 510684 530299 551948 576569 605317 638789
63545 638789 676740 718631 763963 811350 857200 896053 923033 936339 937614 930262 917574 902032
63533 902032 885618 870168 857233 847604 841077 836637 832805 827832 819892 807385 789221 765029 735405
63520 735405 702046 667233 632738 599192 566639 535401 506105 479068 454194 431473 411144
63509 411144 393258 377378 362875 349363 336838 325602 316016 308097 301387 295459 290394 286381 282964
63496 282964 279240 274891 270511 266792 263884 261749 260517 260033 259510 258277 256734 256049 256888 258781 260744
63481 260744 262273 263730 265939 269391 273713 278003 281807 285608 290134 295342 300309 304051 306243 307231
63467 307231 307565 307509 306825 305016 301900 297868 293527 289262 285295 281994 279780 278721 278425 278359 278170 277808
63451 277808 277584 278131 280016 283235 287142 291007 294661 298561 303240 308729 314689 321153 329018 339505
63437 339505 353209 370015 390017 414065 442983 476421 512597 548828 581884 608328 625637
63426 625637 633608 634431 631110 626082 621466 619847 623698 633827 649145 668433 691958 720807 755012
63413 755012 793024 832917 873134 911719 945680 972019 989305 997854 998790 993647 984511 973527
63401 973527 961911 949979 938108 926822 915643 902704 886133 865384 840773 812303 779740
63390 779740 743616 705470 667128 630222 596155 565846 539245 515526 493889 474052 456116
63379 456116 440371 427277 417241 410243 405824 403476 402918 404002 406584 410477 415470 421469 428701 437640
63365 437640 448576 461517 476633 494456 515310 538789 564175 591184 619999 650874 684167
63354 684167 720387 759503 800188 840309 878130 912541 942209 965313 980396 987107 986078 978742
63342 978742 967389 954643 942305 930855 920156 910056 899990 888553 874046 855309 831805
63331 831805 803408 770692 735261 699257 664436 631813 601956 575290 552211 533177 518651
63320 518651 508841 503553 502169 503170 503505 499190 487554 469038 446499 422927 400138 379168 360789
63307 360789 345193 331781 319834 309289 300558 293703 288075 282764 277308 271946 267258 263591 260817
63294 260817 258617 256819 255338 253946 252316 250298 247977 245514 243109 241047 239587 238684 237993 237122 235825
63279 235825 234030 231905 229860 228272 227178 226459 226218 226681 227760 229064 230440 232081 233969 235646 236833
63264 236833 237933 239537 241674 243959 246257 248696 251174 253367 255300 257400 259929 262824 266197 270411
63250 270411 275369 280278 284567 288692 293586 299672 306859 315195 324778 335203 345845 356757 368610
63237 368610 381610 395161 408880 423322 439207 456449 474453 493009 512276 532105 551950
63226 551950 571478 590859 610378 629993 649257 667550 684665 701391 719239 739113 760371
63215 760371 781478 801306 819341 834895 846828 854115 856183 852689 843574 829430 811300 789946
63203 789946 765727 739294 711823 684356 657421 631585 607861 587228 570099 556616 546991 541146
63191 541146 538382 537989 540038 545182 553848 565954 581145 598841 618220 638660 660164 682918 706496
63178 706496 729935 752623 774703 796504 817987 838864 858921 878014 896003 912834 928421
63167 928421 942243 953246 960385 963157 961359 954446 941508 922120 897021 867666 835090 799512
63155 799512 761239 721656 682815 646031 611316 578306 547300 519008 493672 471018 451014
63144 451014 434086 420326 408834 398215 387730 377805 369396 362972 358171 354304 350984 348186 345934
63131 345934 344196 342997 342327 341881 341253 340461 339968 340069 340581 341301 342410 344127 346256 348478 350863 353744
63115 353744 357242 361279 365818 370672 375241 378984 382147 385525 389483 393620 397435 400791 403622 405690
63101 405690 407011 408124 409591 411405 413184 414811 416585 418767 421172 423262 424632 425389 425998 426663 426960
63086 426960 426298 424632 422501 420434 418660 417359 416729 416669 416817 417127 418122 420354 423895 428536 434092 440254
63070 440254 446530 452806 459746 468136 477951 488512 499544 511611 525440 541224 558760 577943
63058 577943 598956 622185 648096 676998 708779 743072 779763 819096 861122 905245 950653
63047 950653 997036 1044576 1093256 1142552 1191890 1241002 1289577 1336926 1382565 1427119 1472169
63036 1472169 1518929 1567289 1616262 1664974 1712791 1758656 1800813 1837245 1866105 1885779 1895021
63025 1895021 1893300 1880771 1857713 1824248 1780771 1728481 1669312 1605515 1539456 1473481 1409604
63014 1409604 1349369 1294133 1245334 1204163 1171089 1145917 1128212 1117497 1113327 1115594 1124652 1140639
63002 1140639 1162612 1188809 1217939 1249889 1285010 1323071 1363112 1404023 1444926 1485254 1524843
62991 1524843 1563949 1602894 1641692 1680058 1717599 1753592 1786616 1814703 1836052 1849494 1854263
62980 1854263 1849540 1834443 1808459 1771743 1724993 1669172 1605565 1536070 1463104 1388892 1314852
62969 1314852 1241922 1171398 1105030 1044092 988653 938081 892002 850498 813564 780836 751827
62958 751827 726017 702664 680910 660287 640954 623231 606964 591468 576069 560678 545828
62947 545828 532027 519022 505922 492244 478576 465905 454470 443777 433520 423922 415107 406849
62935 406849 399156 392491 387025 382176 377314 372545 368357 364858 361779 358924 356185 353442 350946 349391
62921 349391 348971 348727 347586 345871 344930 345353 346422 347374 348242 349118 349432 348573 346690 344347 341772 338927
62905 338927 335969 333179 330635 328275 326076 323895 321444 318679 315941 313516 311425 309950 309809 311253
62891 311253 313384 315003 316006 317292 319359 321534 322771 322773 322185 321911 322326 323016 323272 322887 322371 322360 323080
62874 323080 324445 326266 328128 329504 330314 331001 331694 331727 330525 328466 326258 323913 321176 318603 317157
62859 317157 316774 316378 315474 314802 315083 315975 316697 316949 316768 316156 315401 315230 316102 317705 319545 321494 323316
62842 323316 324288 324020 323201 322827 322956 322945 322558 322008 321115 319460 317440 316249 316455 317365 318211 319276 321222
62825 321222 323807 326089 327715 329299 331380 333676 335633 337336 339322 341681 343845 345458 347115 349852
62811 349852 354021 358964 363817 368286 372575 376903 381401 386300 391870 398202 405284 413275 422466 432883
62797 432883 444182 456019 468397 481498 495225 509138 522955 537179 553189 572546 596034
62786 596034 623416 654191 688546 727355 771279 820152 873481 931378 994666 1063973 1138983
62775 1138983 1218643 1301743 1386889 1472030 1554492 1631619 1701145 1760898 1808638 1842510 1861441
62764 1861441 1864936 1852901 1826114 1786461 1736020 1676013 1607325 1532021 1453509 1374842 1297378
62753 1297378 1221429 1147596 1076918 1010083 947245 888519 834207 784531 739515 699131 663214
62742 663214 631257 602593 576754 553447 532305 513094 496173 482251 471437 462752 454816 446941
62730 446941 439450 433103 428314 424886 422356 420539 419651 419897 421091 422896 425342 428928 434116 440857 448582
62715 448582 456583 464525 472865 482743 495237 510642 528667 549328 573308 601295 633240 668543
62703 668543 706943 749049 796049 848999 908178 972867 1041806 1114164 1190130 1270349 1354629
62692 1354629 1441247 1527485 1610602 1688231 1758235 1818570 1867268 1902335 1921767 1924107 1909127
62681 1909127 1877793 1831579 1772138 1701663 1623035 1539201 1452585 1365268 1279303 1196352 1117224
62670 1117224 1042296 972220 907681 848531 793924 743513 697978 657995 623161 592282 564453
62659 564453 539424 517175 497559 480338 465247 451976 440198 429584 419762 410400 401391 392761
62647 392761 384349 375884 367480 359681 352752 346272 339767 333517 328358 324833 322863 322110 322280 323089 324249
62632 324249 325508 326545 326912 326295 324737 322485 319818 317214 315350 314507 314175 313702 313237 313559 315039 317238
62616 317238 319567 321842 324062 326166 328328 331186 335379 340960 347490 354571 362112 370171 378803 388196
62602 388196 398881 411644 427044 444932 464605 485597 508277 533567 562168 594274 629864
62591 629864 668815 710482 753376 795550 835420 872122 905018 932947 954194 967359 972106 968834
62579 968834 957841 939220 913633 882631 848002 811085 772844 734130 695603 657799 621593
62568 621593 588106 557787 530030 504216 480690 460110 442252 426219 411601 398576 387051
62557 387051 376597 367302 359784 354163 349763 346073 343297 341558 340215 338378 335762 332699 329758 327596
62543 327596 326716 326949 327461 327585 327490 327908 329493 332437 336222 339637 341631 342407 343239 345056 347744 351001
62527 351001 355132 360595 367477 375959 386686 400059 415614 432787 451915 473842 498979 527371
62515 527371 559266 594750 633077 673274 715363 760111 807463 855895 903446 948696 990564
62504 990564 1027817 1059150 1083341 1099157 1105594 1102558 1091057 1072528 1048173 1019007 986137 950763
62492 950763 914164 877845 843436 812194 784706 761135 741578 726110 714706 707250 703561 703486
62480 703486 707100 714715 726455 741864 760150 780587 802284 823691 842948 858832 870928 878860
62468 878860 881983 880078 873704 863356 848664 828988 804519 776232 744923 710958 675085 638915
62456 638915 604210 571912 542071 514466 488977 465487 443875 424290 407202 392934 381300
62445 381300 371843 364329 358681 354533 351249 348477 346350 345015 344392 344642 346303 349460 353115 356069 358219
62430 358219 360223 361941 362143 360058 356431 352479 348388 343527 337780 331925 326772 322520 318977 315867
62416 315867 312784 309340 305575 301891 298426 294791 290718 286677 283541 281761 281115 281199 281727 282299 282190 280782
62400 280782 278216 275431 273481 272892 273664 275643 278646 282233 285641 288152 289576 290327 291045 292150 293686
62385 293686 295417 297033 298383 299612 301106 303229 306172 310090 315212 321541 328431 334901 340674 346679
62371 346679 354131 363218 373115 383175 393617 405002 417668 431996 448659 468112 490139 514411
62359 514411 541270 571505 605600 643754 686482 734485 787730 845044 904652 964703 1023197
62348 1023197 1077864 1126398 1166773 1197541 1218329 1229956 1233502 1229203 1216777 1196732 1170512 1139080
62336 1139080 1102262 1060028 1013753 965567 917069 869421 824096 782406 744421 709371 677236
62325 677236 649075 625572 605995 588907 573287 558629 544540 530773 517292 503908 490106
62314 490106 475599 460790 446321 432406 418928 405934 393610 381925 370794 360583 352007 345381
62302 345381 340228 335771 331623 327941 325058 323101 321882 321055 320353 319706 319216 319039 319274 319797 320236 320326 320330
62285 320330 320872 322251 324172 326302 328765 331798 335232 338765 342556 347013 352049 357079 361843 366695
62271 366695 371917 377286 382704 388852 396712 406555 417845 430101 443557 459017 477289 498819 523645
62258 523645 551707 583366 619611 661606 709929 764194 823213 885344 948795 1011762 1072241
62247 1072241 1127680 1175145 1212263 1238124 1253195 1258563 1255422 1244928 1227863 1204223 1173440 1135267
62235 1135267 1090378 1040185 986330 930381 873742 817753 763886 713645 667922 626578 589115
62224 589115 555691 526895 502540 481448 462792 446901 434174 423706 413857 403981 394825 387231
62212 387231 381041 375385 369467 362946 356069 349704 344798 341489 338993 336518 333989 331675 329605 327776
62198 327776 326649 326866 328421 330547 332575 334683 337660 342088 347892 354529 361516 368794 376724 385730
62184 385730 395835 406493 416837 426195 434511 442386 450661 459720 469037 477424 483892 488399 491892
62171 491892 495720 501104 509003 520216 535430 555229 580032 609847 644048 681733 722540 766812
62159 766812 814452 863547 910560 952088 986298 1012758 1031500 1042705 1047021 1045571 1039457 1029353
62147 1029353 1015494 997836 976226 950686 921712 890314 857779 825439 794524 766037 740623
62136 740623 718525 699648 683737 670541 659784 650921 643145 635896 629315 623888 619719 616587 614743
62123 614743 615062 618063 623144 629034 634580 638787 640667 639808 636954 633478 630414 628324 627681 628477 629471
62108 629471 628624 624529 616993 606306 592833 577698 563063 550962 541979 535462 530755 527803 526798
62095 526798 527743 530437 534622 540060 546599 554070 562070 570023 577646 585215 593226 601879 611063 620721
62081 620721 631067 642493 655388 669965 686157 703699 722401 742254 763281 785370 808246
62070 808246 831409 854114 875724 896262 916477 937200 958792 981307 1004946 1030095 1056992
62059 1056992 1085506 1115129 1144897 1173221 1198076 1217621 1230889 1237965 1239501 1236117 1228276 1216447
62047 1216447 1200883 1181044 1155744 1124326 1087519 1046803 1003295 957823 911771 866884 824088
62036 824088 783258 744436 708563 676490 647861 621556 596935 574169 553632 535493 519806
62025 519806 506540 495533 486640 479747 474347 469356 463721 457151 450015 442674 435207 427639 420066 412589
62011 412589 405377 398780 393203 388919 386058 384597 384263 384738 386117 388827 392932 397906 403360 409572 416854
61996 416854 424689 431921 437545 441010 442136 441327 439586 437733 435706 433017 429584 425567 420710 414604
61982 414604 407515 400259 393257 386389 379707 373570 368001 362646 357558 353370 350416 348279 346442 344786
61968 344786 343235 341445 339206 336686 334045 331280 328644 326625 325202 323778 322206 321249 321489 322382 323088
61953 323088 323768 325268 327781 330638 333317 335965 338986 342758 347840 354781 363566 373669 384858 397563
61939 397563 412331 429312 448379 469352 491843 515165 538603 561651 583947 605302 625828
61928 625828 645679 664459 681218 695259 706672 715806 722436 725805 725296 720797 712591 701351 688236
61915 688236 674607 661490 649565 639660 632824 629665 629979 633471 640625 652321 668517 687834 708715
61902 708715 730554 753170 775424 795021 809880 819284 823468 822618 816771 806448 792653 776120
61890 776120 757002 735582 712846 689963 667398 645040 623163 602722 584476 568165 552898
61879 552898 538177 524224 511373 499469 487983 476496 464963 453620 442765 432644 423555 415998
61867 415998 410508 407196 405617 405293 406235 408604 412059 416017 420657 427136 436433 448351 462039 477293
61853 477293 494921 515957 540848 569343 600854 634898 671321 709977 750100 790289 829327
61842 829327 866691 901926 933912 961260 983105 998843 1007359 1007492 999525 985489 967688 947549
61830 947549 926215 905492 887485 873604 864509 860684 862425 869366 880667 895706 914036 934503
61818 934503 954842 972414 985146 991673 990955 982196 965188 940542 909533 873761 834874 794421
61806 794421 753709 713699 675067 638412 604306 573079 544727 519269 497078 478477 462986
61795 462986 449385 436780 425300 415516 407390 400188 393233 386425 380011 374212 369087 364513 360210
61782 360210 355964 351870 348134 344627 340885 336762 332867 330109 328778 328210 327342 325599 323273 321175 319884
61767 319884 319220 318363 316664 314419 312825 312991 314924 317547 319731 321254 322805 325232 328886 333508 338548
61752 338548 343553 348352 352860 356710 359302 360348 360265 359877 359836 360433 361667 363145 364096 363982 363116 362273 361635
61735 361635 360544 358488 355927 353863 352851 352722 353102 353885 355231 357303 360018 363000 365861 368534 371138
61720 371138 373545 375380 376666 378165 380801 384769 389393 393736 397246 399948 402138 403834 404518 403624 401326
61705 401326 398503 395746 392782 389130 384998 381050 377483 373846 369844 365943 362978 361293 360402 359467 358126
61690 358126 356846 356384 356894 357754 358286 358394 358337 358209 357863 357137 355919 354178 352160 350344 348978 347886 346903
61673 346903 346101 345234 343462 340303 336623 333950 332821 332462 332063 331625 331372 331104 330546 329780 328886 327565 325665
61656 325665 323800 322932 323435 324888 326605 328047 328884 329135 329255 329799 330969 332773 335485 339537 344837 350528
61640 350528 355660 359948 363802 367765 372064 376443 380142 382105 381586 378732 374507 369965 365595 361372
61626 361372 357199 353091 349040 345003 341134 337869 335605 334302 333497 332724 331984 331824 332854 334998 337293
61611 337293 338657 338848 338396 337583 335891 332643 327778 321682 314607 306778 298862 291781 286034 281642 278665
61596 278665 277222 276870 276486 275082 272506 269195 265638 262290 259521 257199 254625 251390 248141 245970 245068
61581 245068 244496 243427 242115 241329 241182 240956 240008 238433 236765 235321 234016 232637 231065 229332 227615
61566 227615 226129 224845 223390 221461 219338 217729 217006 216853 216766 216646 216615 216527 216072 215379 215086 215614 216593 217260
61548 217260 217356 217423 218160 219557 220751 220813 219576 217701 216020 214976 214645 214945 215639 216373 216972 217609 218470 219385
61530 219385 220038 220440 220920 221615 222261 222509 222249 221555 220516 219263 218004 216853 215673 214163 212179 209946
61514 209946 207905 206256 204682 202729 200505 198740 197995 197983 197911 197349 196577 196153 196321 196735 196602 195290 193021
61497 193021 190784 189327 188440 187510 186513 186005 186264 186937 187544 187864 187844 187559 187341 187541 188074 188573 189028 189852
61479 189852 191208 192694 193872 194742 195562 196496 197620 198907 200076 200743 200865 200758 200596 200264 199782 199408 199208
61462 199208 198996 198852 199174 199951 200561 200692 200921 201902 203413 204736 205630 206369 207111 207868 208835 210157 211407
61445 211407 211928 211637 211028 210448 209868 209333 209075 209124 209304 209744 210936 213149 216185 219855 224240 229278 234461
61428 234461 239172 243035 245782 247152 247291 246945 246896 247265 247687 248062 248801 250306 252494 254955 257381 259578
61412 259578 261185 261722 261183 260386 260331 261090 261616 260874 258900 256467 253970 251115 247665 243988 240640 237727
61396 237727 234960 232129 229265 226402 223532 220903 219109 218636 219289 220257 220847 220983 220863 220360 219170 217577
61380 217577 216571 216882 218158 219426 220247 221088 222608 224880 227329 229222 230261 230898 232063 234339 237382
61365 237382 240310 242610 244491 246415 248604 251023 253563 256141 258740 261442 264339 267437 270791 274733
61351 274733 279755 286117 293646 301871 310267 318414 326089 333111 339059 343425 346399 349265 353486 359322
61337 359322 365748 371710 376979 381666 385526 388236 390041 391616 393311 394784 395327 394332 391623 387599 383030
61322 383030 378456 373845 369081 364642 361380 359530 358315 356837 355082 353790 353450 353889 354891 356789 360115
61307 360115 364874 370555 376818 383831 391746 400125 408052 414670 419472 422263 423118 422396 420625 418362 416065
61292 416065 413940 411773 409134 405901 402412 398925 395160 390678 385581 380517 376066 372396 369459 367172
61278 367172 365424 364236 363974 365074 367466 370527 373702 376912 380275 383749 387255 390925 394912 399023
61264 399023 402789 405983 409040 412959 418710 426618 436220 446667 457123 466822 475070 481602 486906 491910
61250 491910 497264 503053 509069 515062 520702 525589 529404 531886 532745 531884 529632 526439 522344 517171 511199
61235 511199 505157 499353 493291 486495 479334 472676 466918 461746 456791 452212 448587 446329 445238 444673
61221 444673 444280 444450 445774 448084 450494 452489 454547 457456 461359 465761 470126 474119 477487 480084 481904
61206 481904 482908 483016 482509 482167 482751 484512 487412 491457 496492 502103 508323 516178 526858 540334 555305
61191 555305 570498 585444 599896 613128 624273 633118 640274 646671 653049 659794 666994 674491 681872
61178 681872 688487 693777 697703 700717 703127 704798 705665 706140 706527 706320 704723 701796 698391 694878 690619
61163 690619 684977 678225 671002 663344 654800 645242 635035 624505 613724 602858 592368 582726 574124
61150 574124 566527 559881 554230 549669 546112 542992 539247 533739 525785 515370 503088 489945 477056
61137 477056 465267 455003 446439 439651 434518 430659 427695 425550 424410 424416 425482 427366 429875 433103
61123 433103 437507 443612 451503 460760 470983 482275 495082 509720 526225 544523 564496 585976
61111 585976 608939 633666 660382 688613 717086 744452 770100 794269 817418 839535 859945
61100 859945 877725 892295 903692 912371 918749 922798 923910 921214 914309 903825 891085 877042 861693
61087 861693 844589 825676 805473 784664 763857 743570 724055 705087 686170 667028 647818
61076 647818 629071 611634 596320 583157 571113 559148 547475 537174 528595 520965 513826 507943
61064 507943 504129 501833 499813 497884 497075 498049 500239 502726 505345 508580 512875 518366 524994 532594 541030
61049 541030 550399 560867 572260 584163 596547 610015 625243 642562 662247 684828 710689 739545
61037 739545 770717 803892 839404 877838 919548 964403 1011683 1060241 1108932 1157135 1204948
61026 1204948 1253187 1303302 1357158 1416621 1483166 1557602 1639911 1729443 1825694 1929295 2042671
61015 2042671 2170556 2320661 2503624 2731203 3013879 3360479 3780258 4285320 4892529
61006 4892529 5626629 6524594 7636661 9017685 10704773 12681436 14838472 16958292
60998 16958292 18754949 19973769 20503289 20428321 19990337 19487450 19175083 19200008 19563144
60989 19563144 20107833 20554138 20593903 20014778 18784061 17043483 15028868 12974098 11050584
60980 11050584 9352847 7911863 6716789 5736089 4933917 4278531 3743421 3306077 2947791
60971 2947791 2653561 2410762 2207941 2035224 1885179 1752583 1633657 1525938 1428219 1339817
60961 1339817 1259968 1188220 1124820 1069989 1022997 982359 946503 913776 882310 850780 819161
60950 819161 788159 758147 729265 702212 677990 656790 637898 620783 605635 592707 581708
60939 581708 571965 562742 553311 543279 532920 522755 512744 502421 491886 482038 473565 466103 458611
60926 458611 450254 440893 431159 422180 414789 408808 403381 398041 393035 388617 384597 380715 376919 373165
60912 373165 369531 366701 365625 366272 367258 367218 366169 365173 365038 365828 367270 369073 370989 372917 374823 376408
60896 376408 377213 377347 377664 378809 380380 381502 381789 381230 379593 376742 373358 370428 367960 364927 360681
60881 360681 355682 350577 345283 339544 333837 328980 325087 321619 318527 316624 316438 317164 317332 316437 315433
60866 315433 315540 317011 319353 322381 326446 331602 337051 341712 345172 347857 350466 353469 357106 361589
60852 361589 367056 373263 379409 384464 387804 389442 389636 388617 386963 385882 386443 388439 390485 391362 390908
60837 390908 389588 387848 386162 385051 384491 383599 381451 378076 374245 370489 366736 362828 358891 355149 351718
60822 351718 348577 345482 341926 337516 332490 327612 323496 320135 317069 313905 310695 307951 306165 305112
60808 305112 303808 301434 298300 295646 294452 294603 295232 295687 296101 297115 299116 301828 304768 307976 311940
60793 311940 316773 321896 326825 331882 337666 344092 350429 356266 362026 368474 376040 384611 393693 402758
60779 402758 411663 420765 430520 441086 452439 464626 477617 491130 504994 519566 535336 552296
60767 552296 570104 588773 608630 629572 650944 672297 693775 715571 737446 759076 780435
60756 780435 801480 821607 839768 855094 867320 876697 883517 887552 887942 883821 875108 862484 846714
60743 846714 828277 807656 785453 762092 737752 712686 687257 661541 635402 609251 584223
60732 584223 561181 539882 519654 500617 483587 468804 455377 442245 429330 417448 407252
60721 407252 398555 390712 383474 377262 372560 369173 366290 363332 360503 358361 357001 355875 354368 352333
60707 352333 350030 347734 345575 343663 342058 340467 338147 334466 329649 324676 320285 316295 312039 307201
60693 307201 301935 296500 291199 286513 282775 279756 276993 274473 272501 270911 269043 266681 264425 262847
60679 262847 261787 260848 260091 259790 259809 259715 259316 258753 258276 258254 259073 260525 261563 261267 259980 258936 258752 258855
60661 258855 258547 258062 258176 259124 260390 261528 262749 264507 266701 268618 269753 270472 271658 273848 277002
60646 277002 280988 285760 290923 295625 299368 302582 305945 309265 311569 312324 312107 311900 312066 312226 311916 311096
60630 311096 310082 309196 308564 308164 307881 307455 306488 304758 302552 300446 298667 296881 294753 292482 290544 289125
60614 289125 288019 286921 285538 283580 280984 278142 275618 273661 272160 270998 270184 269702 269468 269480 269727 270004
60598 270004 269999 269542 268601 267107 265041 262642 260268 258030 255849 253837 252309 251377 250813 250462 250489 251045 251869
60581 251869 252481 252805 253394 254917 257456 260416 263222 265954 269075 272709 276658 281196 287263 295511 305524
60566 305524 316391 327616 338949 349665 358803 366027 371537 375129 376006 373693 368576 361419 352947
60553 352947 344127 336154 329781 325070 322037 321007 321973 324235 327219 331219 336770 343723 351578 360401
60539 360401 370508 381255 390889 397830 401675 402894 402125 399963 396895 393073 388429 383347 378940 376305
60525 376305 375575 375884 376180 375858 374815 373264 371598 370177 369080 368158 367394 367033 367224 367711 368164 368758 370114
60508 370114 372546 375741 379453 384229 391016 400180 411444 424895 441473 462120 486846 515077 546706
60495 546706 582216 621549 663136 704181 741742 773493 797653 812491 816203 807498 786470 754908
60483 754908 715776 672359 627686 584212 543627 506873 474450 446594 423070 403053 385613
60472 385613 370395 357610 347308 338869 331345 324073 316830 309550 302284 295490 290038 286565 284771
60459 284771 283588 282104 280227 278404 276955 275848 274866 273679 271898 269470 267003 265268 264233 262938
60445 262938 260533 257185 253801 251086 249087 247445 245894 244654 244426 245726 248073 250129 250868 250322 248915
60430 248915 246532 242831 238310 234336 231961 231143 231304 232236 234148 237076 240626 244270 247683 250696 253014
60415 253014 254200 254125 253345 252701 252446 252072 251162 250086 249513 249594 250106 251092 252677 254380 255396 255746 256422 258047
60397 258047 260009 261405 262364 263799 266087 268627 270693 272259 273931 276355 279710 283486 286756 288939
60383 288939 290265 291315 292232 292833 293359 294500 296425 298318 299336 299746 300642 302608 305172 307549 309471
60368 309471 311063 312318 313144 313788 314754 316195 317640 318519 318837 319165 320000 321278 322517 323322 323714 324083 324994
60351 324994 327080 330942 336865 344545 353253 362349 371500 380333 388178 394461 399189 402578 404189 402883
60337 402883 397906 389805 380104 370320 361419 353831 347562 342320 337821 334000 330855 328288 326246 324776
60323 324776 323683 322329 320172 317403 314674 312323 310223 308325 306881 306081 305957 306728 308783 312043 315737
60308 315737 319184 322596 326846 332626 340110 349284 360174 372638 386132 399769 412577 423691 432425
60295 432425 438300 441122 441093 438742 434649 429195 422615 415146 406983 398168 388770 379142 369801 361115 353321
60280 353321 346794 341882 338383 335509 332553 329409 326364 323667 321417 319585 317912 315991 313585 310708
60266 310708 307337 303371 299034 294960 291602 288824 286395 284530 283536 283145 282755 282265 282112 282406 282566 282113
60250 282113 281459 281469 282391 283577 284321 284659 285164 286095 287096 287780 288354 289395 291103 293125 295107 297088 299203
60233 299203 301258 302857 303804 304171 304157 304102 304527 305871 308075 310524 312430 313368 313619 314010 315179 316912 318445
60216 318445 319531 320885 323351 326924 330941 334994 339193 343662 348256 352863 357549 362279 366760 370811
60202 370811 374740 379128 384228 389620 394521 398444 401547 404290 406884 409328 411877 414986 418581 421804
60188 421804 423897 425055 425999 426881 427110 426158 424101 421289 417899 413943 409489 404814 400430 396861 394178
60173 394178 391828 389144 385883 382137 378051 373997 370666 368406 366665 364663 362470 360766 359699 358735
60159 358735 357673 356891 356444 355841 355146 355473 357629 360869 363708 365623 367243 369098 370909 372170 372855 373404
60143 373404 374266 375534 377011 378654 380982 384667 389643 395062 400318 405655 411406 417162 422197 426310
60129 426310 429651 432070 433327 433695 433716 433475 432795 432019 431862 432481 433410 434413 435663 436940 437550 437429 437677
60112 437677 439378 442259 444985 446500 446713 446205 445708 445614 445644 445093 443719 442153 441111 440387 439072 436626
60096 436626 433362 429908 426638 423691 421158 419032 417149 415378 413827 412730 412155 411929 411916 412387 413925
60081 413925 416744 420111 422720 423809 423783 423681 424256 425630 427491 429200 429903 428997 426646 423592 420411 417083
60065 417083 413299 408903 403951 398586 393014 387524 382343 377474 372732 367942 363091 358373 354093 350502
60051 350502 347697 345668 344367 343684 343446 343606 344377 346029 348547 351637 355051 358719 362579 366580 370929
60036 370929 376026 381846 387645 392646 396931 401237 405815 409848 412194 412395 410761 407878 404379 400943
60022 400943 397870 394567 389906 383350 375497 367374 359493 351785 344167 336751 329694 323223 317824 314033
60008 314033 311865 310663 309600 308279 306813 305517 304565 303893 303387 303238 303955 305819 308374 310726 312373
59993 312373 313443 314124 314301 313986 313782 314512 316495 319459 323001 326786 330351 333223 335423 337601 340364
59978 340364 343565 346420 348329 349402 350113 350580 350442 349513 348335 347706 347665 347309 345944 344091 342978 343084
59962 343084 343598 343393 342168 340487 339019 338004 337257 336421 335263 333944 333003 332886 333442 333995 333884 333001 331885
59945 331885 331378 331999 333497 335022 335886 336070 335937 335623 334954 333861 332548 331246 330075 329182 328684 328290 327306
59928 327306 325320 322743 320408 318727 317523 316638 316342 316996 318532 320433 322112 323225 323776 324089 324644 325776
59912 325776 327437 329254 330811 331908 332711 333727 335549 338444 342122 345948 349428 352446 355125 357597
59898 357597 359959 362314 364698 366918 368568 369303 369176 368709 368616 369348 370780 372350 373630 374844 376748 379877
59882 379877 383935 388055 391688 395132 399214 404553 411065 417953 424071 428566 431441 433415 435047 436061
59868 436061 435673 433462 429703 424962 419750 414614 410152 406644 403790 401013 398095 395486 394031 394400 396690
59853 396690 400641 406224 413766 423155 433055 441383 446721 449001 448871 447028 444413 442426 442220 443772 445913
59838 445913 447046 445708 440996 433205 423859 414556 405828 397607 390477 385609 383387 382916 383127 383654 384332
59823 384332 384603 384019 382760 381045 378472 374648 370199 366369 363581 361050 357924 354308 350946 348256 345930
59808 345930 343334 340170 336775 333741 331290 329254 327746 327386 328408 329900 330500 329760 328277 326609 324708
59793 324708 322448 319965 317206 313753 309475 304945 300847 297346 294381 292187 291060 290846 291048 291340 291684
59778 291684 292152 292847 293752 294453 294423 293886 293952 295359 297455 299050 299988 301123 302915 304940 306818 308789 311020
59761 311020 313092 314577 315601 316446 317098 317616 318521 320350 323079 326391 330154 334205 338031 341270 344318
59746 344318 347877 351956 355871 359222 362331 365572 368691 371063 372455 373364 374614 376557 378683 380198
59732 380198 381068 382095 383709 385139 385306 384213 382836 381884 381414 381521 382468 383948 385088 385572 386054 387020
59716 387020 387911 387971 387374 386857 386600 386250 385810 385774 386405 387479 388803 390436 392351 394287 396099 397893 399740
59699 399740 401531 403176 404685 405999 407042 407948 409031 410454 412130 413834 415186 415643 414879 413158 411063
59684 411063 408935 406909 405344 404629 404561 404506 404370 404808 406101 407291 406888 404192 399597 393920 387967 382522
59668 382522 378145 374796 371949 369175 366443 363881 361575 359661 358341 357633 357291 357109 357213 357875 359108
59653 359108 360668 362468 364786 367835 371202 373988 375606 376276 376589 376742 376460 375591 374459 373576 373174 373045
59637 373045 372605 371138 368294 364553 361038 358665 357507 357036 356792 356676 356727 356870 356943 356841 356541 355970 354933
59620 354933 353306 351284 349219 347130 344641 341553 338198 334972 331851 328918 327019 327153 329176 331847
59606 331847 334320 336837 339688 342307 344008 344968 345773 346463 346775 346967 347518 348115 347861 346594 345224 344544
59590 344544 344337 344008 343523 343275 343311 343154 342284 340581 338406 336375 334871 333655 332140 330156 328204 326831
59574 326831 325925 324792 322802 319886 316596 313754 311838 310584 309356 307942 306792 306453 307074 308535 310578
59559 310578 312595 313749 313805 313641 314393 316166 318053 319397 320486 321883 323612 325459 327680 330819 334842
59544 334842 338974 342607 346093 350368 356085 363504 373122 385961 402869 423554 446138 467394 483465
59531 483465 491115 489213 479455 465569 451526 440027 432015 427118 424575 424066 425772 429671 435015 440744
59517 440744 446230 451295 455628 458679 460164 460238 459061 456527 452591 447500 441473 434411 426187 417053 407537
59502 407537 398143 389358 381693 375366 369986 364893 359839 355175 351370 348493 346202 344132 342301 341100
59488 341100 340808 341099 341241 340892 340531 340946 342443 344700 347298 350149 353481 357548 362305 367324 372191 377067
59472 377067 382578 388879 395059 399826 402675 404060 404569 404422 403798 403116 402752 402755 403091 403944 405573 408079 411507
59455 411507 415994 421591 428027 434904 442133 450058 459181 469820 481864 494671 507296 518973 529304
59442 529304 537806 543414 544831 541538 534304 524587 513616 502159 490962 480877 472341 464879 457456
59429 457456 449397 440865 432462 424614 417577 411895 408393 407572 409185 412686 417951 425228 434460 445035
59415 445035 456475 469207 484382 502992 525152 549902 575089 597378 612961 619036 615121 603214
59403 603214 586874 569852 554887 543189 535020 530830 531377 536158 541931 543696 537750 523720 503819
59390 503819 480874 457400 435622 417035 401769 389084 378699 371041 366039 362420 358800 355040
59378 355040 352025 350369 349932 350334 351215 351919 351682 350493 349331 349117 349739 350487 351197 352456 354704 357605
59362 357605 360409 362664 364445 366125 368068 370443 373186 376295 380164 385466 392592 401346 411257 421978
59348 421978 433262 444842 456661 469158 482922 497998 513831 529949 546380 563149 579610
59337 579610 594638 607458 618021 626557 633050 637302 639233 638923 636360 631443 624232 615055 604357
59324 604357 592534 579946 566960 553934 541268 529508 519209 510576 503364 497239 492090 487877
59312 487877 484436 481772 480425 481065 483696 487609 492402 498732 507836 520331 535460 551072 564086
59299 564086 571382 570970 562763 548358 530243 511121 493344 478255 465915 455790 447697 441820 437906
59286 437906 435058 432589 430747 430194 430963 432271 433371 434294 435652 437859 440720 443795 446986 450607 454992
59271 454992 460328 467000 475720 486922 500139 514302 528594 542642 555920 567557 576934 584057
59259 584057 589055 591618 591258 587925 582050 574188 564886 554703 543998 532838 521380 510268 500187
59246 500187 491128 482496 474072 466420 460196 455400 451607 448651 446682 445709 445486 445940 447341 449903 453385
59231 453385 457291 461304 465350 469342 473111 476530 479427 481320 481553 479875 476669 472391 467029 460440
59217 460440 453068 445842 439283 433048 426519 419557 412546 405994 400279 395515 391325 386908 381747 376308
59203 376308 371761 368916 367544 366810 366213 365964 366560 368141 370354 372737 375065 377295 379417 381567 384168
59188 384168 387594 391649 395620 398924 401446 403239 404337 405080 406231 408302 410956 413539 416087 419331
59174 419331 423652 428530 433238 437734 442564 448165 454561 461619 469246 477327 485745 494550 503866 513570
59160 513570 523257 532671 541889 550843 558848 565010 569121 571654 572771 571821 568218 562415 555466 547859
59146 547859 539450 530490 521976 514701 508489 502680 496888 490937 484508 477425 470095 463135 456663 450375
59132 450375 444231 438661 434076 430528 427912 426265 425792 426667 428739 431332 433678 435810 438755 443423 449552
59117 449552 456200 463102 470845 479756 489312 498875 508385 518014 527645 537103 546476 555790 564669 572799
59103 572799 580452 588050 595398 601864 607225 611770 615485 617741 618061 616792 614615 611666 607606 602476
59089 602476 597072 592325 588580 585557 582783 579887 576759 573696 571235 569495 567733 564873 560521 555162
59075 555162 549312 542924 535807 528265 520859 513750 506671 499476 492372 485614 479297 473476 468202 463412
59061 463412 459036 455259 452375 450387 449021 448168 447935 448156 448249 447914 447623 448030 449014 449728 449589 448897 448412
59044 448412 448573 449274 450163 450992 451743 452544 453438 454224 454662 454889 455436 456638 458271 460072 462462 466242 471434
59027 471434 476988 482011 486910 492778 499897 507502 514939 522314 529844 537298 544501 551846 559762 567996
59013 567996 575904 583135 589501 594419 597164 597693 596763 595149 593176 591075 589379 588734 589435 591284 593892
58998 593892 597191 601682 607883 615391 622844 629169 634573 639841 645013 649341 652323 654031 654443 653174
58984 653174 650074 645439 639435 631885 622949 613564 604869 597471 591440 586653 582979 580522 579874 581698
58970 581698 585870 591395 597437 604039 611642 620263 629423 638494 646941 654660 662312 670824 680215 689342
58956 689342 697092 703316 708190 711306 712032 710361 706687 701028 693211 683662 673268 662508 651383 640222
58942 640222 629928 621244 614208 608408 603339 598430 593212 587670 582143 576774 571356 565786 560355 555525
58928 555525 551737 549432 548847 549617 550932 552228 553442 554549 555307 555782 556772 559255 563448 568688 574220
58913 574220 579950 586438 594322 603735 614171 624842 635141 644829 653902 662461 670715 678883 686949
58900 686949 694566 701252 706643 710626 713356 715243 716813 718401 719980 721400 722909 725375 729889 737190
58886 737190 747612 761433 778800 799032 820426 841334 861293 880506 898363 913341 924558
58875 924558 932567 938073 940586 939160 933971 926201 916483 904301 888950 870344 848821 825027 800292
58862 800292 776376 754320 733941 714800 697101 681146 666363 651622 636445 621306 606747
58851 606747 592753 579152 566155 554174 543331 533442 524348 516061 508638 502167 496798 492494 488683
58838 488683 484502 479564 474330 469487 465195 461244 457686 454802 452515 450432 448571 447512 447547 448153 448609
58823 448609 448693 448445 447824 447162 447521 449870 454013 458948 464031 469122 473751 477099 479036 480488 482428 484929
58807 484929 487379 489150 489858 489493 488558 487669 486817 485439 483409 481363 479778 478314 476616 475175 474719 475001
58791 475001 474906 473641 471294 468329 465184 462432 460717 460281 460855 462211 464512 468033 472797 478694 485660
58776 485660 493507 501712 509548 516399 521840 525532 527173 526572 523751 519067 513201 506890 500534 494103
58762 494103 487494 480899 474713 469061 463589 457811 451693 445797 440810 436990 434135 432069 430953 431019 432142
58747 432142 433891 436082 439113 443507 449110 454911 459886 463992 468182 473398 479777 486905 494521 502634
58733 502634 510991 518851 525477 530764 535263 539643 544181 548692 552877 556736 560552 564387 567708 569765
58719 569765 570343 569948 569215 568346 567238 566001 565171 565468 567360 570736 574886 578926 582434 585672 589097 592655
58703 592655 595600 597003 596375 593781 589423 583253 575072 564913 553123 540060 525930 511084 496257
58690 496257 482247 469499 458221 448746 441313 435502 430349 425266 420505 416538 413289 410319 407511
58677 407511 405109 403145 401254 399196 397208 395613 394379 393451 393428 395398 399907 406325 413533 421125 429605
58662 429605 439485 450562 462070 473106 482645 489574 493189 493597 491364 486954 480858 474036 467645 462190
58648 462190 457436 453302 450347 448981 448519 447575 445411 442562 440033 438175 436545 434680 432696 431090 430283
58633 430283 430518 431961 434510 437578 440491 443276 446682 451183 456230 460726 464019 466158 467444 468136 468487
58618 468487 468718 469044 470020 472606 477454 484204 491921 500052 508431 516488 523220 528192 531894 534757 536314
58603 536314 535772 533076 528971 524307 519690 515594 512284 509543 506804 503595 499734 495221 490295 485617
58589 485617 482063 480165 479852 480913 483544 488190 494806 502568 510603 518886 528038 538238 548713 558414
58575 558414 566787 573674 578995 583045 586758 591057 596054 601337 606820 612799 619418 626893 636169 648495
58561 648495 664104 682039 701489 722546 745256 768636 791256 812381 831946 849671 864698
58550 864698 875971 882670 884547 882207 876981 870296 863201 856378 850062 843750 836537 828091 818850 808888
58536 808888 797155 782515 765250 746862 728552 710460 692452 675056 659326 645981 634796
58525 634796 624919 615862 608144 602648 599381 597371 595939 595429 596307 598120 600005 601757 603670 605594 606993
58510 606993 607936 609244 611441 614103 616422 618027 619057 619846 620701 621671 622321 621928 620086 616988 613098 608804
58494 608804 604473 600605 597645 595678 594414 593564 593230 593798 595382 597528 599774 602437 606430 612225 619521
58479 619521 628115 638507 651124 665356 680012 694532 709177 724060 738548 751661 762606 770841
58467 770841 776045 778202 777508 774183 768704 762202 756275 752105 749813 748599 747474 746003 744656 744433 745909
58452 745909 748667 751822 754920 758045 761185 763921 765763 766355 765166 761337 754248 744306 732974 721851
58438 721851 711692 702347 693652 686158 680776 677871 677041 677743 679729 682769 686479 690706 695774 702053
58424 702053 709530 718041 727607 738267 749823 761973 774399 786483 797229 805826 812007 815639 816444
58411 816444 814585 811178 807648 804638 801889 798855 795071 790227 784480 778530 772925 767523 762147 757539
58397 757539 754976 754964 756900 760034 764201 769466 775567 781969 788189 793911 798974 803378 807202 810435 812922
58382 812922 814408 814740 814228 813740 813970 814562 814535 813737 813235 813927 815494 817221 819097 821331 823413 824710 825657
58365 825657 827401 830384 834246 839007 845367 853646 863230 873338 883791 894826 906634 919211 932242
58352 932242 945074 957026 967638 976375 982499 985864 987576 989232 991669 994937 999086 1004143 1009597
58339 1009597 1014917 1020625 1028013 1037682 1049071 1061426 1074518 1088347 1102864 1118145 1134220 1150624
58327 1150624 1166651 1181964 1196419 1209503 1220762 1230612 1239829 1248249 1255016 1260192 1265075 1270581 1276239
58314 1276239 1281228 1285710 1290670 1296979 1304981 1314522 1325104 1336314 1348183 1360845 1374103 1387825
58302 1387825 1402470 1418397 1435002 1451550 1468642 1487550 1508006 1527980 1546103 1563205 1580923
58291 1580923 1599826 1619597 1640209 1662091 1685585 1710761 1737386 1764762 1792050 1819005 1845912
58280 1845912 1872679 1898670 1923661 1948398 1974059 2001856 2033209 2069384 2110501 2155459 2203089
58269 2203089 2252783 2303900 2355442 2406802 2458359 2511100 2566011 2623754 2684298 2746862 2810826
58258 2810826 2876592 2944853 3015344 3087209 3160309 3235071 3311227 3388041 3465768 3545652 3628372
58247 3628372 3713798 3802438 3895810 3995073 4100383 4211754 4329431 4453340 4583467 4720854
58237 4720854 4866959 5022061 5185710 5358720 5543033 5739591 5948157 6169598 6406496
58228 6406496 6661080 6934188 7226731 7540511 7877177 8238115 8625809 9043803 9495162
58219 9495162 9982788 10511355 11086954 11714824 12399767 13148996 13972302 14879517 15880845
58210 15880845 16990157 18225042 19603255 21142611 22865777 24803540 26995272 29493080
58202 29493080 32369910 35723538 39675316 44371676 49988087 56724775 64794636 74420576
58194 74420576 85852777 99397553 115447161 134502633 157160850 184008814 215370894
58187 215370894 250896877 289064506 326821292 359731751 382898342 392462271 386962009
58180 386962009 367772174 338418056 303268776 266342631 230641758 198003643 169267213
58173 169267213 144571103 123656485 106091139 91396022 79109564 68822680 60190015
58166 60190015 52922189 46776686 41555595 37100737 33282310 29991242 27139378 24657931
58158 24657931 22489826 20584544 18899989 17403925 16070498 14877560 13807980 12849425
58150 12849425 11990213 11217243 10518720 9886125 9312314 8790035 8313129 7876497 7473681
58141 7473681 7096872 6740531 6403125 6084596 5784220 5501601 5237265 4990898 4760687
58132 4760687 4545228 4344345 4157349 3982368 3818205 3665110 3522919 3390107 3265417
58123 3265417 3148772 3039785 2936862 2838494 2744131 2653353 2565760 2482050 2403516 2329897 2259339
58112 2259339 2190994 2125930 2064899 2007048 1951681 1899558 1851408 1806580 1764087 1723618 1684747
58101 1684747 1646563 1608997 1573219 1539845 1507981 1476735 1446267 1416407 1385720 1353126 1319346
58090 1319346 1285712 1252656 1220421 1190181 1163169 1139390 1118146 1099020 1081481 1064342 1046653
58079 1046653 1028546 1010440 992094 973175 953983 934861 915651 896481 878246 861421 845158
58068 845158 828506 811844 796186 781630 767495 753567 740277 727919 716493 706039 696483 687290
58056 687290 677852 667943 657510 646441 634963 623759 613261 603282 593710 584980 577419 570689 564374
58043 564374 558560 553331 548218 542661 536588 530159 523486 516960 511222 506310 501390 495792 489721 483532
58029 483532 477007 469908 462567 455295 447793 439760 431601 423935 416972 410859 405996 402400 399289 395982
58015 395982 392630 389447 385881 381465 376974 373815 372445 372106 371857 371209 370100 369012 368919 370453 373156
58000 373156 375978 378288 379993 381064 381526 381608 381304 380061 377402 373564 369049 363919 358127 352190 346836
57985 346836 342207 338008 334194 330904 327991 325266 323003 321517 320393 318867 316968 315572 315174 315158 314562
57970 314562 313193 311705 310686 309873 308431 306135 304101 303915 305967 309149 312214 314837 317129 318921 320110
57955 320110 321181 322681 324483 326041 327039 327354 326834 325605 324247 323114 321883 320297 318896 318331 318348 318206
57939 318206 317861 318044 319328 321813 325572 330710 336955 343774 350896 358219 365266 371212 375475 377904 378449
57924 378449 377081 373996 369564 364090 357769 350661 342563 333322 323630 314954 308170 302581 296894 290883
57910 290883 285533 281827 279963 279577 280098 280942 281812 282736 283562 283755 282991 281522 279485 276404 271962 266850
57894 266850 262163 258389 255598 254084 253950 254530 255161 256178 258154 260551 262205 262973 263632 264241 263856 262037
57878 262037 259451 256655 253372 249372 245103 240951 236684 232172 227912 224415 221658 219502 217984 216845
57864 216845 215467 213805 212763 213161 214794 216911 219135 221530 224297 227868 232807 239083 245778 251936
57850 251936 257419 262654 267945 273384 278992 284436 288930 291812 293038 292890 291544 289204 286215 282685
57836 282685 278401 273510 268859 265166 262220 259461 257077 255881 256195 257484 259162 261236 263945 267151
57822 267151 270388 273387 276343 279656 283466 287456 291004 293348 293595 290941 285264 277424 268627 259577
57808 259577 250578 242189 235131 229491 224708 220565 217619 216306 216224 216761 217967 220194 223137 225826 227517
57793 227517 228139 227956 227237 226311 225514 224925 224378 223918 224161 226028 229951 235302 240801 245648 250118 254766
57777 254766 259295 262734 264679 265713 266345 266214 264746 262186 259407 256867 254162 250488 245256 238393 230364
57762 230364 221863 213402 205382 198503 193536 190362 187764 184683 181292 178320 175727 172841 169628 166961
57748 166961 165489 164961 164964 165703 167564 170246 172858 174799 176188 177325 178035 177734 176158 173896 172011 171087
57732 171087 170751 170185 168896 166901 164493 162147 160501 159930 160126 160421 160535 160670 160888 160871 160482 160108 160064 159975
57714 159975 159205 157796 156516 155977 156057 156255 156245 155910 155107 153745 151979 150139 148591 147753 148031 149399 151175
57697 151175 152638 153903 155800 158775 162226 165137 167088 168375 169371 170121 170418 169985 168632 166553 164467
57682 164467 163162 162836 163100 163728 165288 168915 175460 184850 196318 209390 224635 243264 266097 293381
57668 293381 325690 364257 409486 458959 507037 546313 569672 572282 553465 517345 471076 421648
57656 421648 373864 330459 292880 261540 236050 215800 200169 188164 178452 170120 163013 157122
57644 157122 152095 147605 143677 140271 137075 134157 132292 132020 132764 133525 134156 135206 136672 137754 137916
57629 137916 137522 137213 137177 137286 137426 137374 136709 135205 133148 131008 128935 126775 124455 122159 120173 118659
57613 118659 117573 116700 115827 114907 114021 113198 112388 111599 110895 110301 109861 109864 110690 112270 113850 114594 114443 114082
57595 114082 113998 113793 112633 110228 107123 104056 101342 98968 96978 95491 94454 93656 92971 92402 91968 91681
57579 91681 91642 91962 92580 93257 93732 93850 93697 93631 93903 94041 92980 90230 86668 83699 81823 80579 79688 79454
57561 79454 79927 80525 80841 81159 81717 82028 81524 80489 79818 80102 81397 83552 86171 88435 89567 89488 88689
57544 88689 87598 86494 85845 86098 87074 88028 88478 88642 89000 89662 90253 90196 89129 87277 85371 84035 83337
57527 83337 83119 83507 84731 86605 88615 90391 91644 91851 90718 88991 88101 88683 89995 91113 92085 93435
57511 93435 95016 96075 96273 96021 95792 95614 95359 95100 94948 94836 94698 94646 94744 94666 93899 92286 90237 88285
57493 88285 86542 84727 82646 80538 78863 77857 77378 77140 76976 76834 76650 76385 76200 76426 77249 78467 79746
57476 79746 81061 82647 84400 85584 85460 84162 82642 81793 81843 82558 83609 84551 84836 84257 83274 82522 82025
57459 82025 81132 79315 76802 74301 72289 70759 69650 69204 69623 70473 70777 69880 68005 65794 63627 61731
57443 61731 60634 60848 62110 63549 64801 66385 68713 71217 72886 73328 72909 72185 71638 71697 72482 73559
57427 73559 74389 74980 75784 77017 78405 79573 80310 80494 80075 79205 78189 77308 76819 76923 77518 78140 78503 78899
57409 78899 79681 80472 80455 79442 78198 77535 77509 77667 77705 77695 77911 78664 80054 81686 82844 83177 83095 83306 84065
57390 84065 85031 85776 86258 86841 87991 89967 92700 95815 98747 100959 102363 103537 105273 107696 110072
57375 110072 111702 112728 113671 114379 113981 111975 108923 105895 103501 101644 99918 98030 95981 94008 92339
57360 92339 90974 89834 89064 88929 89334 89688 89431 88627 87920 87976 88970 90495 91865 92562 92495 91885 91070 90425
57342 90425 90279 90646 91145 91397 91444 91607 91991 92392 92633 92746 92834 92976 93245 93585 93717 93493 93359 94101 95990
57323 95990 98373 100229 100928 100448 99169 97673 96525 96006 96015 96262 96524 96762 97109 97739 98606 99406 99912 100227
57305 100227 100483 100470 99976 99441 99802 101454 103668 105223 105472 104742 103967 104047 105286 107227 109063 110227 110548
57288 110548 110026 108882 107733 107217 107245 107062 106197 104922 103545 101775 99340 96825 95254 94862 94899 94701 94452
57271 94452 94640 95264 95971 96771 98136 100329 103029 105754 108383 111034 113612 115781 117357 118488 119505
57256 119505 120843 122923 125695 128379 130255 131742 133963 137005 139467 140348 140547 141579 143411 144859 145841
57241 145841 147800 151617 156356 160641 164250 167654 170836 173494 175880 178531 181410 184038 186273 188307
57227 188307 190108 191567 193127 195529 198836 202324 205504 208718 212439 216459 220185 223520 226973 230871
57213 230871 234844 238354 241580 245415 250433 256089 261236 265294 268634 271872 275226 278656 282272 286337
57199 286337 291008 296217 301656 306911 311831 316806 322416 328779 335499 342224 348873 355358 361597 367880
57185 367880 374718 382150 389706 397190 404898 412879 420722 428513 437211 447393 458242 468643 478848
57172 478848 490120 502925 516406 529657 542686 555960 569770 584346 600040 617009 634967
57161 634967 653393 671754 689492 706307 722585 739308 757302 776654 796793 816856 836099
57150 836099 854341 872140 890317 909310 929199 950083 971947 994260 1016333 1038202 1060683
57139 1060683 1084374 1109050 1134201 1159755 1186016 1213319 1242036 1272616 1305247 1339641 1375427
57128 1375427 1412645 1451760 1493410 1538317 1587192 1640422 1697944 1759585 1825399 1895564 1970139
57117 1970139 2049146 2132784 2221393 2315341 2415162 2521755 2636417 2760827 2897078 3047408
57107 3047408 3213685 3397462 3601131 3829166 4088148 4385924 4731492 5136047 5613849
57098 5613849 6181982 6859824 7669182 8634110 9778834 11124266 12685381 14470519 16481560
57089 16481560 18713946 21156708 23792174 26594064 29524382 32532105 35554830 38519653
57081 38519653 41339683 43909895 46110539 47820459 48933653 49372230 49095752 48109141
57073 48109141 46466130 44262936 41622859 38678928 35560505 32384462 29249594 26234178
57065 26234178 23396360 20775595 18394048 16258655 14364577 12699014 11244217 9979704
57057 9979704 8884072 7936290 7116505 6406759 5791513 5257532 4793300 4388767 4035301
57048 4035301 3725275 3451663 3208511 2991630 2798076 2624887 2469048 2328655 2203094
57039 2203094 2091571 1992319 1903882 1826541 1761828 1711132 1675456 1655947 1653410 1666747 1691693
57028 1691693 1720443 1742061 1744390 1717949 1659973 1575555 1475021 1369627 1268237 1176032 1094979
57017 1094979 1025053 965201 913741 868848 829343 794886 765086 738754 714496 691845 671182
57006 671182 652597 635414 618901 602916 587634 573032 558895 545129 531928 519726 508955
56995 508955 499674 491454 483909 477240 471946 468110 465380 463618 463099 464042 466441 470437 476192 483009 489071
56980 489071 492464 492156 487740 478882 465752 449730 432867 416597 401508 388197 377451 369345 362926
56967 362926 357353 352897 350349 349888 351150 354203 359772 368502 380452 395285 412311 430144 446706
56954 446706 459841 467788 469269 463784 452140 436311 418423 400015 382273 366347 352967 342086
56942 342086 333367 326806 322533 320332 319930 321610 326017 333456 343904 357616 375057 395990 418940
56929 418940 441582 461247 475102 480640 476661 463809 444094 420027 394100 368479 344718 323669
56917 323669 305550 289917 275780 262396 250083 239805 231822 225268 219290 214044 210142 207603 205808
56904 205808 204240 202726 201169 199532 198103 197386 197673 198838 200437 201926 203044 204208 206321 209912 214773
56889 214773 220672 228059 237604 249313 262477 276142 289023 299161 304521 304233 298852 289458 277057
56876 277057 262964 249064 237121 228031 221930 218752 218352 220388 224539 230913 240013 252340 268145
56863 268145 287535 310639 337660 368707 403319 439766 474625 503301 521520 526984 520103 503360
56851 503360 480044 453365 426265 401301 380265 363934 352314 345074 341799 342281 346965 356897 372905
56838 372905 395028 423166 458079 501057 552330 609940 669883 726635 773487 803676 812664 799985
56826 799985 768942 724711 672754 618220 565532 517772 476499 442267 415244 395315 381958
56815 381958 374412 372082 374803 382827 396642 416723 443290 476065 513964 554659 594309 627934
56803 627934 650459 658034 649130 625087 589754 548082 504342 461277 420548 383522 351327 324498
56791 324498 303050 286886 275790 269101 265949 266019 269745 277578 289457 305103 324263 346061 368329
56778 368329 388065 402534 409787 408629 398884 381793 359598 334556 308522 283202 260091 239906
56766 239906 222510 207553 194779 183710 173636 164271 156020 149264 143731 138857 134420 130512 127181
56753 127181 124430 122269 120467 118529 116238 113955 112091 110566 109115 107782 106768 106075 105759 106184 107505
56738 107505 109100 110111 110439 110654 111053 111359 111305 110936 110293 109365 108474 108180 108596 109212 109585 109839 110330 111117
56720 111117 111954 112561 112795 112817 113170 114332 116069 117528 118088 117819 117050 115911 114522 113260 112473 112136 112007
56703 112007 111934 111814 111418 110553 109323 108070 107073 106316 105432 103988 102039 100407 99953 100564 101214 101246 101073 101373
56685 101373 102045 102482 102559 102779 103497 104520 105494 106280 106857 107208 107487 108036 108995 110070 110836 111278 111851 112965
56667 112965 114448 115623 115982 115771 115733 116300 117197 117907 118301 118634 119142 119848 120646 121275 121331 120623 119580 119031
56649 119031 119507 120909 122841 124985 127066 128796 130141 131468 133110 134858 136242 137290 138621 140589
56635 140589 142667 144002 144436 144626 145181 146062 146883 147433 147704 147702 147526 147445 147626 147906 148061 148198 148533 148924 148985
56616 148985 148702 148453 148290 147597 145803 143231 140840 139195 138004 136656 134967 133209 131626 130162 128673
56601 128673 127204 125963 125055 124356 123633 122799 122037 121695 121959 122587 123074 123232 123451 124171 125238 126112 126684 127422
56583 127422 128611 129894 130837 131506 132139 132594 132610 132391 132441 132968 133873 135161 136823 138392 139261 139524 139997 141283
56565 141283 143301 145792 148811 152521 156982 162362 168881 176286 183771 190622 196586 201387 204460 205525
56551 205525 205016 203515 201186 198203 195273 193074 191413 189547 187218 184777 182402 179841 176995 174179
56537 174179 171657 169376 167310 165625 164353 163278 162344 161803 161760 161895 161856 161606 161201 160595 159990 159980 160862 161975
56519 161975 162270 161549 160692 160547 160963 161092 160366 158929 157291 155854 154715 153737 152812 152105 151936 152287 152546
56502 152546 152018 150696 149317 148639 148805 149409 149944 150109 149911 149652 149679 150013 150335 150431 150450 150628 150965 151342 151667
56483 151667 151660 150770 148775 146366 144660 144132 144354 144787 145381 146316 147619 149267 151279 153474 155404 156856
56467 156856 158144 159651 161217 162342 162818 162876 162779 162612 162471 162522 162755 162924 162893 162883 163175 163617 163679 163097 162282
56448 162282 161906 162140 162556 162831 163214 164038 165008 165383 164888 164150 164079 164938 166068 166545 166161 165819 166776 169301
56430 169301 172262 174222 174708 174176 173119 171764 170441 169537 169038 168705 168730 169535 170839 171657 171579 171334 171666
56413 171666 172260 172440 172363 172783 173860 174988 175721 176231 176799 177362 177777 178170 178797 179731 180735 181376 181347 180796
56395 180796 180274 180251 180830 181979 183688 185654 187186 187850 188039 188510 189523 190755 191889 192827 193445 193619 193519
56378 193519 193557 194034 195061 196685 198736 200668 201975 202751 203422 204003 204084 203622 203167 203143 203326 203340 203311 203649 204400
56359 204400 205183 205762 206297 206939 207414 207341 206929 207020 208209 210123 211851 212987 213878 214943 216267 217932 220118
56342 220118 222583 224593 225812 226794 228140 229591 230561 231211 232275 234010 236064 238281 240926 244015 247045
56327 247045 249583 251683 253611 255564 257729 260162 262533 264428 265902 267314 268594 269243 269123 268646 268052
56312 268052 267114 265800 264660 264161 264090 264031 264014 264250 264578 264701 264857 265758 267824 270747 273864 276749 279384
56295 279384 281857 284009 285505 286281 286758 287529 288997 291447 295075 299561 303907 307309 310094 313265 317231
56280 317231 321654 326457 332100 338628 345254 351357 357302 363809 371026 378674 386654 395016 403716 412879
56266 412879 422952 434159 446213 458976 472973 488665 505645 523312 542153 563644 588925
56255 588925 618209 651416 688710 730328 776509 827808 884968 948231 1017183 1091433 1170923
56244 1170923 1255252 1343071 1432550 1522199 1610836 1696814 1777651 1850458 1912533 1961598 1995878
56233 1995878 2014284 2016618 2003499 1976112 1936037 1885163 1825471 1758739 1686583 1610849 1533698
56222 1533698 1456962 1381498 1307507 1235483 1166543 1101797 1041711 986193 934978 887783 844389
56211 844389 804838 769311 737613 708950 682450 657739 634861 613894 594883 577937 563074
56200 563074 550075 538758 529271 521820 516178 511685 507723 503985 500338 496716 493213 490103 487650 485864
56186 485864 484471 483174 481997 481318 481403 481968 482394 482411 482265 482252 482484 483205 484880 487649 491018 494435 497979
56169 497979 502096 506850 511838 516810 522009 527828 534322 541105 547667 553870 560241 567623 576432 586381
56155 586381 597086 608686 621697 636463 653123 671987 693692 719030 748892 784304 826284
56144 826284 875704 933460 1000552 1077490 1163370 1255528 1350055 1442509 1528370 1603579 1665532
56133 1665532 1714173 1752252 1784202 1814187 1844523 1875215 1904200 1927945 1942761 1946867 1941711 1930969
56121 1930969 1918035 1904327 1889157 1869953 1842465 1802179 1746735 1677015 1595943 1507094 1414890
56110 1414890 1324857 1242063 1169118 1106300 1053253 1009673 974585 946269 923347 905368 892065
56099 892065 882621 875940 871214 868061 866518 866983 869688 874078 879096 884144 889286 894407 898890 902536
56085 902536 906311 911591 918813 927215 935675 943471 950428 956870 963515 970987 979191 987368 995005 1002517
56071 1002517 1010775 1020040 1029770 1039570 1049899 1061489 1074377 1087966 1101831 1115897 1129989 1143970
56059 1143970 1158422 1174417 1192303 1211350 1230926 1251316 1272903 1295280 1317894 1341003 1365085
56048 1365085 1389597 1413248 1435482 1456998 1478720 1500772 1522516 1543205 1562605 1581304 1600328
56037 1600328 1620254 1641005 1662741 1686411 1712955 1742478 1774865 1810675 1850550 1894068 1940087
56026 1940087 1988005 2037861 2089419 2142137 2195977 2251309 2308052 2365773 2424611 2485104 2547098
56015 2547098 2609865 2673531 2739382 2808496 2880985 2956935 3037060 3121831 3210699 3302838 3398207
56004 3398207 3497385 3600894 3709190 3823028 3943320 4070671 4205185 4346593 4494684 4649931
55994 4649931 4813565 4986710 5169766 5363220 5568699 5788420 6023794 6275448 6544433
55985 6544433 6832483 7141239 7472286 7828040 8211590 8625710 9073113 9557703 10084535
55976 10084535 10658505 11284331 11967990 12717125 13540111 14446301 15447696 16559450 17798980
55967 17798980 19186596 20748075 22516214 24530865 26840778 29508414 32614994 36264331
55959 36264331 40586264 45737674 51897400 59258128 68025061 78427538 90741435 105316753
55951 105316753 122599336 143119869 167406329 195774447 227976165 262761802 297550232
55944 297550232 328518259 351334086 362395362 360018377 344948774 319954779 288808102
55937 288808102 255215617 222113770 191417596 164101766 140444001 120296529 103303785
55930 103303785 89040244 77084459 67055112 58623888 51513862 45493498 40372183
55923 40372183 35995502 32238352 28998732 26194021 23757341 21632863 19772795 18137251
55915 18137251 16693943 15415886 14279493 13264783 12355726 11539067 10803028 10137232 9532790
55906 9532790 8981778 8477134 8013245 7585774 7190564 6823467 6481422 6162798 5866217
55897 5866217 5589750 5331506 5090161 4864469 4653077 4455325 4271588 4102250 3946748
55888 3946748 3803903 3672479 3550859 3436527 3326447 3217870 3108835 2998570 2887933
55879 2887933 2779155 2674751 2576651 2486077 2403427 2327839 2257414 2190328 2125572 2062555 2000643
55868 2000643 1939600 1880201 1823893 1771902 1724702 1681969 1642736 1605879 1570782 1537434 1505803
55857 1505803 1475371 1445410 1415351 1384708 1353086 1320589 1287939 1255861 1224498 1193540 1162577
55846 1162577 1131169 1099032 1066661 1035471 1006812 980921 957181 935213 915232 897396 881353
55835 881353 866552 852650 839419 826592 814075 802129 791043 780668 770564 760618 751198 742462
55823 742462 733709 723803 712260 699588 686480 673121 659540 646256 633966 622728 611985 601409
55811 601409 591203 581502 572096 563051 555034 548532 543021 537538 531966 527207 524034 522277 521323 520968
55797 520968 521311 522061 522514 522321 521881 521767 522096 522795 524168 526727 530580 535538 541824 549919 559229 567263
55781 567263 570648 566942 555547 537573 515479 492464 471248 453103 438199 426664 418823 414687
55769 414687 413825 415666 419105 421800 420861 414919 405226 394426 384608 376702 370974 367312 365197 363952
55755 363952 363093 362227 360897 358862 356353 353654 350490 346133 340089 332461 323759 314585 305476 296861 289201
55740 289201 283024 278455 274636 270196 264739 259477 255855 253813 252023 249606 246923 244604 242537 240147
55726 240147 237190 233881 230485 227132 223881 220749 217718 214824 212111 209479 206777 204238 202582 202415
55712 202415 203546 205071 206190 206849 207590 208870 210570 212128 213044 213190 212678 211612 209991 207738 204733
55697 204733 200954 196719 192696 189448 186979 184892 182950 181373 180554 180557 180867 180618 179182 176726 174149 172337
55681 172337 171567 171646 172372 173535 174670 175253 175274 175271 175696 176414 176925 176895 176386 175722 175215 174890 174454 173670 172784 172342
55661 172342 172592 173273 174051 174872 175720 176289 176177 175358 174302 173648 173754 174431 175091 175330 175464 176256 178000 180087
55643 180087 181675 182576 183211 183842 184209 183950 183066 181808 180299 178398 175853 172448 168074 162828 157125 151546
55627 151546 146478 141975 138117 135324 133931 133449 132785 131548 130722 131481 133552 135393 135905 135226 133748 131279
55611 131279 127715 123879 120925 119228 118420 118200 118398 118393 117364 115296 113200 112047 111828 111826 111449 110620 109666
55594 109666 109010 108781 108639 108172 107474 106987 106745 106255 105284 104361 104193 104865 105902 106894 107745 108436 108900 109140
55576 109140 109372 110030 111631 114374 117772 120906 123250 125094 127048 129324 131655 133701 135220 135988 135779
55561 135779 134405 131745 127922 123592 119730 116819 114372 111592 108376 105401 103286 101992 101001 99811
55547 99811 98242 96507 95038 94137 93794 93911 94504 95428 96111 95936 94959 94017 94043 95395 97724 100232 102053
55530 102053 102720 102383 101533 100647 100209 100753 102399 104387 105587 105604 105035 104538 104039 103089 101617 100002 98527
55513 98527 97107 95533 93789 92118 90825 90004 89445 88801 87786 86215 84075 81766 80031 79245 78901 78195
55497 78195 77071 76217 76109 76553 77249 78166 79112 79540 79135 78202 77155 76084 75157 74904 75522 76325 76513 76175
55479 76175 75944 75900 75601 75067 74960 75675 76913 78317 79858 81369 82278 82232 81570 80831 80049 78875 77206 75408
55461 75408 74078 73695 74307 75382 76201 76517 76625 76715 76553 76006 75435 75145 74757 73658 71972 70581 70107 70305
55443 70305 70572 70705 70929 71386 71841 71917 71495 70930 70831 71555 72885 74198 74941 74952 74480 74010 73938 74216 74346 73973
55423 73973 73400 73305 73898 74657 74994 74913 74840 75036 75485 76186 77172 78181 78670 78305 77269 75931 74480 73109
55405 73109 72271 72293 72747 72645 71522 70023 69181 69283 69718 69823 69547 69284 69421 70096 71196 72443 73621 74755
55387 74755 75876 76632 76474 75363 74017 73147 72711 72198 71528 71201 71606 72554 73595 74431 74844 74577 73561
55370 73561 72100 70640 69479 68862 69067 70061 71210 71719 71351 70467 69480 68652 68304 68605 69024 68561 66955
55353 66955 65242 64676 65330 66251 66777 67100 67560 68031 68271 68435 68910 69784 70736 71373 71553 71448 71351 71384 71427 71404
55333 71404 71451 71626 71672 71418 71243 71637 72385 72786 72676 72555 72527 71931 70456 68926 68303 68462 68653 68711 68955 69211
55313 69211 68913 68160 67800 68251 68965 69222 68892 68205 67428 66985 67294 68141 68725 68664 68415 68417 68398 67952 67248 66636
55293 66636 66022 65260 64778 65090 65883 66321 66181 66044 66361 67018 67906 69222 70914 72329 72879 72764 72714 73178
55275 73178 73947 74420 74014 72545 70490 68799 68169 68497 69081 69308 69039 68498 67991 67684 67507 67234 66780 66389
55257 66389 66436 67009 67791 68401 68805 69351 70367 71743 72944 73547 73741 74138 74963 75579 75058 73285 71266 70223
55239 70223 70499 71453 72244 72465 72161 71624 71224 71139 71070 70456 69159 67690 66629 66050 65776 65847 66327 66861 66978
55220 66978 66789 66854 67301 67578 67265 66635 66192 66029 65955 65887 65825 65744 65833 66518 67886 69369 70460 71455 72977 74941
55200 74941 76553 77298 77382 77150 76632 75855 75164 74908 75112 75596 76155 76418 75877 74403 72591 71318 70990 71345
55182 71345 71867 72239 72519 73051 74110 75494 76588 76948 76713 76277 75748 74985 74049 73300 72992 72993 73011 72934 72871 73033
55162 73033 73595 74518 75410 75777 75561 75328 75644 76286 76315 75035 72745 70474 69141 69083 70170 71958 73725
55145 73725 74678 74496 73666 73058 73143 73666 74072 74084 73789 73313 72689 72124 72146 73161 74845 76220 76498 75744 74660
55126 74660 73917 73817 74310 74998 75270 74819 74068 73766 74166 74872 75445 75763 75811 75576 75317 75472 76018 76383 76307 76389
55106 76389 77279 78643 79454 79201 78311 77466 77013 77047 77572 78365 79036 79488 80142 81475 83393 85137 85885 85542
55088 85542 84901 84843 85292 85305 84344 83079 82560 82946 83579 84045 84444 84661 84177 82947 81866 81904 82994 84085
55070 84085 84130 82886 81015 79583 79233 79651 79954 79706 79344 79491 80150 80756 80809 80233 79313 78479 78033 77886 77604
55051 77604 76828 75604 74332 73468 73233 73458 73744 73949 74428 75542 77059 78394 79321 80012 80445 80343 79828
55034 79828 79548 79911 80646 81302 81687 81600 80757 79358 78194 77687 77276 76302 75038 74251 74148 74456 75227 76696
55016 76696 78401 79279 78845 77713 76768 76358 76462 77057 77977 78733 78936 78799 78952 79684 80490 80455 79263 77853
54998 77853 77798 79777 82847 85438 86866 87509 87841 87898 87673 87406 87245 87003 86481 85823 85417 85593 86432 87661
54980 87661 88718 89184 89144 88954 88747 88499 88385 88638 89100 89392 89535 89897 90485 90864 90953 91328 92435 93956 95332
54961 95332 96498 97662 98647 98946 98356 97215 96013 95009 94207 93545 93124 93251 94085 95248 96006 95962 95346
54944 95346 94605 93966 93465 93045 92450 91361 89839 88397 87490 87138 87133 87248 87165 86660 86068 86087 86852 87688 88062
54925 88062 88287 88877 89806 90934 92583 94938 97352 99157 100938 103962 108424 113233 117680 122260 127461
54910 127461 132623 136655 139283 140904 141632 141150 139288 136205 132134 127430 122769 118861 115930 113736 111991
54895 111991 110443 108742 106729 104919 104226 104963 106379 107378 107546 107236 106869 106543 106332 106587 107557 108828 109584
54878 109584 109525 109287 109714 110940 112445 113863 115337 117172 119496 122360 125773 129503 133098 136211 138674
54863 138674 140183 140257 138743 136076 132764 128921 124566 120126 116176 112769 109465 106036 102785 100086 97899
54848 97899 95934 94049 92232 90302 87907 84986 82167 80480 80487 81702 83037 83852 84384 85112 86067 87011
54832 87011 88026 89423 91078 92258 92309 91315 89933 88730 87832 87078 86341 85702 85414 85728 86689 88053 89355
54815 89355 90100 90069 89580 89351 89902 91076 92245 92944 93158 93045 92672 92119 91661 91637 92140 92876 93319 93013 91929
54796 91929 90642 90078 90861 92806 95033 96643 97435 98004 99120 100921 102742 103771 103759 103036 102043 101084 100403
54779 100403 100167 100297 100581 100973 101522 101994 101920 101211 100489 100553 101649 103428 105486 107699 110123 112811 115724
54762 115724 118737 121753 124872 128330 132172 136091 139668 142641 144846 146107 146344 145594 143750 140519 135981
54747 135981 130956 126387 122395 118422 114336 110931 109007 108329 107847 106791 105158 103256 101259 99414 98301
54732 98301 98351 99122 99486 98828 97821 97666 98661 99917 100506 100483 100655 101704 103769 106587 109763 113112 117002
54715 117002 122098 128427 134972 140537 144773 147928 149907 150213 148727 145838 141812 136700 131029 125883
54701 125883 121878 118495 114803 110528 106142 102304 99565 98261 98231 98764 99161 99196 98886 98157 97076 96129
54685 96129 95808 96045 96409 96668 96842 96846 96525 95999 95627 95647 96073 96804 97539 97750 97087 95770 94303 92930 91712
54666 91712 90905 90763 90980 90813 89939 88858 88334 88669 89538 90241 90122 89070 87755 87186 87893 89582 91462
54649 91462 92704 92811 91967 90987 90631 90915 91335 91570 91605 91363 90816 90392 90644 91424 91936 91729 91159 90699 90419
54630 90419 90335 90642 91253 91698 91875 92385 93597 94905 95488 95475 95651 96294 96962 97300 97410 97373 97032 96408 95921
54611 95921 95981 96605 97518 98390 98903 98819 98078 96784 95156 93542 92292 91429 90649 89883 89608 90271 91624 92942
54593 92942 93760 94039 93899 93673 94054 95512 97526 98938 99137 98412 97160 95399 93338 91722 91144 91347 91591
54576 91591 91470 91050 90512 90029 89787 89779 89787 89871 90614 92430 94725 96253 96365 95565 94828 94725 95280 96258 97283
54557 97283 97930 98050 97954 98044 98318 98479 98511 98777 99373 99744 99323 98434 98104 98873 100195 101242 101956 102944 104560
54538 104560 106533 108418 109955 110936 111098 110334 108833 106991 105364 104631 105171 106551 107783 108239 108081 107750
54522 107750 107441 107248 107390 107891 108348 108364 108030 107635 107158 106446 105707 105350 105410 105583 105791 106197 106621 106484 105553
54503 105553 104333 103369 102525 101393 100208 99865 100902 102739 104119 104254 103456 102675 102461 102464 102079 101409 101314 102370
54485 102370 104042 105186 105247 104725 104527 105172 106632 108581 110555 112038 112670 112413 111467 110108 108726 107831
54469 107831 107746 108263 108866 109409 110329 112004 114056 115602 116188 116207 116354 116915 117769 118803 119981 121047 121600
54452 121600 121587 121432 121396 121030 119678 117488 115480 114437 114080 113611 112753 111832 110991 109911 108480 107208 106692
54435 106692 106927 107475 108108 108852 109532 109718 109266 108623 108444 109029 110237 111701 113048 114072 114913 116012 117686
54418 117686 119685 121276 121830 121367 120469 119705 119168 118633 118019 117512 117279 117283 117441 117702 117931 117978 118051 118646 119787
54399 119787 120682 120631 120059 119990 120592 121010 120828 120863 121957 123541 124141 123153 121449 120254 120018 120493 121359 122357
54381 122357 123019 122748 121365 119528 118381 118580 119618 120369 120376 120309 120909 121892 122371 122185 122166 122951 124085 124671
54363 124671 124507 124165 124091 124066 123618 122673 121675 121170 121343 121907 122443 122771 122947 122897 122320 121139 119926 119535 120219
54344 120219 121271 121683 121066 119857 118715 117916 117348 116924 116826 117296 118305 119527 120684 121816 123103 124453
54328 124453 125516 126245 127270 129380 132529 135614 137483 138070 138306 138942 139715 139772 138697 136859 134854 132879
54312 132879 130811 128699 126908 125709 124904 124015 122744 121115 119266 117370 115755 114778 114432 114303 114144 114231
54296 114231 114895 115881 116556 116662 116563 116733 117328 118226 119146 119699 119684 119404 119311 119304 118759 117487 116185 115662 115927 116364
54276 116364 116539 116450 116287 116334 116968 118266 119656 120372 120319 120189 120657 121694 122713 123191 123066 122704 122507 122536 122527
54257 122527 122331 122170 122345 122913 123807 125029 126452 127655 128281 128388 128166 127576 126680 126021 126094 126530 126466 125674
54239 125674 124689 123803 122736 121530 120909 121185 121435 120522 118549 116690 115750 115547 115612 115823 116198 116551 116620 116274
54221 116274 115508 114407 113245 112393 112071 112290 112959 113833 114416 114274 113573 113024 113112 113561 113747 113461 113016 112730
54203 112730 112593 112503 112579 113048 113925 115031 116299 117828 119544 120998 121747 121840 121733 121709 121649 121389 121051 120878 120910
54184 120910 121008 121067 121036 120799 120212 119265 118134 117150 116717 117156 118395 119876 120928 121252 120985 120362 119495 118479
54166 118479 117543 116956 116801 116953 117239 117501 117493 116846 115380 113449 111719 110508 109558 108611 107894 107718 107903 108125
54148 108125 108713 110400 113118 115709 117203 117871 118521 119201 119283 118663 118149 118520 119692 120969 121826 122276 122709
54131 122709 123475 124472 125155 125151 124808 124804 125243 125487 125015 124065 123264 122922 122920 123062 123252 123443 123672 124050 124520 124713 124294
54110 124294 123425 122655 122334 122311 122281 122231 122352 122589 122552 121987 121171 120614 120417 120200 119770 119526 120006 121218 122756
54091 122756 124397 126161 127821 128847 129067 128962 128990 128883 128050 126546 125200 124715 124969 125363 125610 125923 126546
54074 126546 127378 128091 128431 128357 128008 127633 127449 127474 127579 127777 128295 129161 129854 129733 128830 127929 127722 128158 128758
54055 128758 129270 129756 130330 131205 132766 135123 137584 139059 139152 138594 138491 139341 140820 142304 143535 144932
54039 144932 147276 150888 155245 159626 163981 168689 173578 177816 181004 183758 186895 190446 193926 197131
54025 197131 200191 203046 205400 207049 207934 208006 207448 206863 206797 207131 207294 206969 206189 204868 202759 199905 196786
54008 196786 193975 191965 191191 191689 192853 194104 195816 198971 203825 209588 215581 221790 227782 231887 232324
53993 232324 228877 222816 215485 207666 199971 192914 186405 179853 173046 166517 160947 156649 153698 152065
53979 152065 151426 151198 150982 150660 150040 148820 147102 145463 144321 143578 143083 142988 143393 144037 144722 145689 147192
53962 147192 148952 150439 151464 152186 152776 153387 154169 154927 155096 154513 153898 154034 154757 155371 155842 156781 158364
53945 158364 160117 161841 163924 166509 169168 171721 174653 178257 182028 185446 188736 192214 195409 197625
53931 197625 199074 200697 203002 205713 208477 211186 213628 215450 216693 217881 219421 221266 223214 225229
53917 225229 227338 229585 232097 235022 238433 242555 247833 254209 260478 265096 267780 269696 271749 273338
53903 273338 273219 271148 268124 265286 263080 261395 259950 258435 256522 253920 250453 246197 241542 236884
53889 236884 232180 227016 221274 215449 210138 205486 201362 197800 194923 192594 190508 188576 186933 185629
53875 185629 184560 183653 182873 182086 181110 179857 178264 176248 173998 172178 171417 171519 171463 170321 168040 165338
53859 165338 163098 161890 161756 162193 162491 162246 161575 160780 159980 159260 159059 160123 162902 167118 172113 177592
53843 177592 183885 191516 200805 211981 225190 239781 253637 263811 268201 266523 259765 249307 236807
53830 236807 224294 213496 204945 198048 192028 186592 181890 178241 175916 174886 174688 174752 174841 175074 175673
53815 175673 176874 178865 181530 184442 187474 191212 196290 202417 208604 214263 219487 224222 227913 230219
53801 230219 231463 231995 231655 230319 228522 226946 225518 223623 221141 218825 217624 217891 219207 220713 221704
53786 221704 222155 222604 223297 223645 222828 220767 218106 215380 212632 209790 206875 203735 200091 196086 192412
53771 192412 189581 187316 184907 181982 178759 175762 173516 172310 171955 171852 171501 170852 170029 168964 167621
53756 167621 166375 165747 165740 165840 165663 165285 164849 164237 163387 162609 162250 162222 162164 161980 161915 162112 162363 162325 161812 160874
53736 160874 159813 159130 159192 159861 160660 161376 162285 163657 165295 166801 168088 169333 170546 171528 172292 173246 174814
53719 174814 177025 179550 182036 184342 186558 188845 191185 193265 194684 195317 195410 195319 195268 195392 195857 196877
53703 196877 198741 201861 206592 212743 219294 224863 228594 230634 231799 232912 234391 236169 237771 238617
53689 238617 238583 238299 238649 239819 241047 241501 241153 240531 239825 238778 237484 236689 236954 237916 238780 239259 239521 239420
53671 239420 238504 236916 235691 235712 236625 237185 236617 235311 234185 233625 233194 232289 230878 229525 228758 228543 228420
53654 228420 227983 227213 226490 226375 227179 228559 229733 230268 230438 230589 230492 229857 229245 229739 231612 233997 236043
53637 236043 237749 239315 240405 240730 240882 241825 243684 245747 247582 249404 251258 252603 253120 253464 254681
53622 254681 257056 259921 262529 264817 267283 270373 274052 277842 281225 284075 286839 290260 294821 300309
53608 300309 305926 310970 315405 319612 323550 326488 327851 328146 328599 329849 331381 332357 332650 332792 333104 333325
53592 333325 333069 332361 331527 330667 329465 327589 325186 322868 321181 320121 319197 317951 316384 314887 313801
53577 313801 313027 312102 310700 309029 307669 307046 307178 307896 309048 310370 311377 311683 311437 311290 311915 313620
53561 313620 316341 319890 324212 329406 335339 341154 345464 347363 347186 346008 344494 342513 339810 336586
53547 336586 333342 330573 328807 328536 329747 331742 333838 336160 339375 343661 348346 352725 356942 361775
53533 361775 367765 374852 382819 391713 401673 412555 423921 435292 446307 456805 467068 477859
53521 477859 489946 503522 518325 534214 551262 569302 587900 607033 627341 649301 672468
53510 672468 696011 719778 744309 769870 795959 821820 847066 871690 895835 919644 943091
53499 943091 965895 987845 1009148 1030207 1051104 1071716 1092240 1113081 1134102 1154537 1173842
53488 1173842 1192185 1209864 1226850 1243330 1260186 1278250 1297278 1316208 1334313 1351549 1367804
53477 1367804 1382450 1394842 1404831 1412500 1417726 1420309 1420411 1418463 1414608 1408439 1399479 1387859 1374394
53464 1374394 1359894 1344667 1328839 1312942 1297645 1282804 1267238 1249803 1230487 1210107 1189161
53453 1189161 1167405 1144537 1120923 1097517 1075231 1054380 1034572 1015167 995972 977477 960328
53442 960328 944806 931071 919588 910801 904345 899107 894278 889965 886656 884515 883526 883930 886018 889581
53428 889581 894055 899239 905491 913086 921749 931104 941417 953568 968253 985376 1004245 1024182 1044900
53415 1044900 1066480 1089159 1113132 1138433 1165111 1193490 1224095 1257047 1291734 1327428 1364278
53404 1364278 1403397 1445831 1491714 1540519 1591739 1644951 1699411 1754084 1808295 1862206 1916602
53393 1916602 1972226 2029203 2086917 2144474 2201322 2257375 2312470 2365956 2417005 2465159 2510316
53382 2510316 2552338 2591035 2626480 2658930 2688292 2713956 2735317 2752279 2765044 2773610 2777678 2776963
53370 2776963 2771295 2760215 2742619 2717114 2682966 2640715 2591802 2537835 2480456 2421648 2363370
53359 2363370 2306445 2250241 2193907 2137713 2082779 2029901 1979209 1930757 1884592 1840152 1796344
53348 1796344 1752496 1708705 1665025 1620953 1576243 1531769 1489048 1449075 1412057 1377936 1346552
53337 1346552 1317367 1289702 1263508 1239527 1218466 1200226 1184116 1169519 1156029 1143051 1129718
53326 1129718 1115402 1100203 1084700 1069342 1054293 1039869 1026775 1015628 1006396 998566 991808 986261
53314 986261 982254 979996 979534 980741 983315 986980 991696 997557 1004575 1012792 1022460 1033799 1046733 1061193
53300 1061193 1077528 1096108 1116636 1138430 1161344 1185725 1211463 1237957 1265258 1294223 1324882
53289 1324882 1355419 1383648 1409076 1432718 1455274 1476420 1495631 1512751 1527671 1540243 1550638
53278 1550638 1559068 1564997 1567258 1565227 1559435 1550837 1539932 1526803 1511513 1494141 1474694 1453195
53266 1453195 1429733 1404429 1377595 1349862 1321804 1293433 1264468 1234981 1205313 1175434 1145070
53255 1145070 1114491 1084493 1055489 1027319 1000101 974379 949993 925715 900706 875654 851613
53244 851613 828274 804399 779662 755005 731197 708080 685514 664176 644907 627779 612377
53233 612377 598638 586831 576873 568116 559927 552194 545093 538517 531874 524433 515705 505507 493887
53220 493887 481240 468342 455853 443711 431351 418704 406648 396227 387621 380108 372834 365465
53208 365465 358300 351971 346751 341987 336515 329862 322663 315620 308603 301281 294129 287983 282906 278324
53194 278324 274129 270715 267811 264313 259694 254906 251389 249624 249018 248706 248081 246976 245748 244894 244292
53179 244292 243106 240698 237252 233371 229621 226721 225417 225490 225498 224349 222750 222256 223108 223991 223892 223195 222711
53162 222711 222512 222247 221937 221859 221951 221836 221281 220309 219054 217811 217029 216934 217237 217447 217387 217184 216850 216149 214910
53143 214910 213331 211925 211103 210746 210178 208793 206751 204833 203560 202771 202220 202205 203201 205059 206999 208395
53127 208395 209190 209551 209488 208997 208287 207695 207505 207955 209170 210881 212381 213058 212903 212300 211419 210188 208890
53110 208890 208227 208447 208654 207568 204983 202027 199829 198363 196898 195184 193643 192527 191529 190396 189408
53095 189408 188949 188904 188895 188890 189185 189817 190360 190410 189975 189263 188299 187018 185678 184971 185543 187370 189609 191162 191517
53076 191517 191070 190643 190705 191097 191393 191350 190998 190500 190044 189792 189788 189984 190433 191341 192729 194133 194964 195254 195742
53057 195742 197005 198704 200010 200621 200998 201603 202382 203117 203892 204894 205997 206857 207229 206884 205441 202755
53041 202755 199440 196571 194751 193722 192914 191995 190876 189586 188358 187523 187124 186894 186779 187098 187946 188772
53025 188772 188951 188548 188111 187891 187655 187212 186677 186212 185840 185581 185498 185609 185965 186784 188168 189744 190908 191466
53007 191466 191679 191645 191128 190157 189366 189368 190064 190894 191536 191976 192067 191513 190387 189291 188798 188920 189275 189653 190177
52988 190177 190974 191903 192758 193618 194745 196145 197410 198117 198201 197821 197078 196113 195277 194840 194639 194420 194462 195356
52970 195356 197086 198860 200100 201138 202603 204505 206367 207978 209501 211035 212548 214173 216107 218167
52956 218167 219762 220343 219637 217589 214476 211059 208166 206003 204132 202143 200025 197895 195764 193699 191917
52941 191917 190608 189922 190064 191024 192180 192713 192488 192014 191437 190273 188500 187167 187215 188164 188714 188387 187786
52924 187786 187429 187124 186573 185846 185059 184223 183609 183685 184393 184993 185023 184897 185208 185846 186286 186443 186710 187306 188074
52905 188074 188830 189486 189795 189398 188188 186461 184661 183145 182094 181426 180915 180597 180828 181586 181958 180994 179047
52888 179047 177613 177644 178620 179567 180343 181398 182727 183824 184451 184732 184545 183595 182259 181618 182233 183405 184125
52871 184125 184297 184492 184925 185449 186405 188482 191513 194201 195596 196217 197140 198439 199312 199459 199383 199237 198351
52854 198351 196302 193778 191805 190553 189505 188437 187562 186824 185744 184074 182157 180500 179348 178756 178676
52839 178676 178848 178920 178774 178469 177864 176734 175371 174601 174918 175916 176861 177543 178283 179349 180692 182064 183102
52822 183102 183426 182925 181872 180567 179044 177347 175812 174732 173970 173282 172873 173173 174141 175267 176262 177370
52806 177370 178897 180772 182597 183805 183808 182479 180622 179481 179495 179825 179391 178067 176626 175733 175383 175159 174679
52789 174679 173766 172466 171039 169875 169340 169606 170489 171474 172133 172567 173212 174122 174739 174565 173872 173442 173719 174461
52771 174461 175236 175955 176758 177524 177691 176791 175115 173596 172872 172678 172411 172014 171812 171679 171102 170205 169920 170716
52753 170716 171735 171859 171222 170952 171571 172359 172351 171403 170141 169321 169357 170128 171054 171612 171850 172173 172692 173165 173652
52734 173652 174749 176934 179970 183111 185672 187233 187693 187448 187352 188089 189509 190694 190759 189562 187785 186344
52718 186344 185650 185336 184749 183687 182556 181850 181693 181874 182091 182040 181507 180559 179538 178716 178029 177252 176358 175631
52700 175631 175440 175884 176559 176805 176421 176090 176756 178490 180305 181306 181718 182491 184079 186014 187613 188789
52684 188789 189978 191499 193185 194681 195953 197343 198979 200314 200445 199044 196828 195081 194769 195953 197793
52669 197793 199082 199072 197981 196577 195264 193850 192223 190781 189938 189525 189050 188367 187734 187382 187350 187741 188773
52652 188773 190594 193178 196248 199131 200879 200978 199879 198493 197219 195792 194058 192413 191310 190691 190137
52637 190137 189408 188620 188064 187980 188438 189359 190662 192332 194176 195676 196453 196893 197853 199561 201130 201494 200581
52620 200581 199267 198316 197740 197132 196222 194988 193508 191944 190631 189976 190127 190752 191282 191506 191875 193044 195084
52603 195084 197291 198857 199546 199708 199882 200543 201959 203932 205810 207068 207808 208408 208795 208557 207816 207448 208139
52586 208139 209593 211071 212375 213787 215221 216166 216535 216919 217631 218009 217272 215738 214543 214163 213866 212846
52570 212846 211311 210109 209649 209664 209794 209838 209516 208495 206840 205073 203648 202613 201913 201620 201603 201285 200153
52553 200153 198494 197259 197221 198487 200710 203342 205615 206772 206700 206149 205962 206241 206465 206268 205713 204936 204048
52536 204048 203475 203885 205397 207175 208157 208078 207459 206783 206069 205247 204498 204057 203928 203960 204039 204115 204203 204455 205099 206188
52516 206188 207457 208504 209058 209112 208944 209004 209625 210846 212570 214845 217734 221009 224256 227245 229907 231930
52500 231930 232857 232638 231621 229880 227132 223607 220379 218230 216719 214988 213122 211847 211129 210076 208381
52485 208381 206885 206325 206237 205685 204574 203619 203324 203627 204432 205891 208027 210401 212329 213301 213245 212570 211946
52468 211946 211880 212412 213269 214241 215372 216920 219198 222306 225866 229130 231529 233031 233873 234092 233532 232146
52452 232146 230096 227622 225036 222746 221026 219740 218499 217107 215669 214291 213002 212029 211856 212733 214220
52437 214220 215401 215549 214538 212829 211232 210563 211119 212368 213334 213463 213048 212770 212942 213316 213484 213261 212781
52420 212781 212443 212767 214035 215940 217749 218965 219782 220867 222798 225690 229214 232922 236831 241722 248548
52405 248548 257357 267055 276382 284731 291683 296192 296957 293632 287221 279312 271332 264385 259022 254891
52391 254891 251082 247152 243515 240680 238656 237339 236968 237663 238844 239658 239817 239615 239307 239021 239166 240375
52375 240375 242818 245928 248989 251824 254871 258731 263695 269536 275702 281779 287628 292991 297230 299837
52361 299837 301101 301825 302341 302190 300942 298945 297072 295950 295694 296170 297176 298409 299532 300403 301219 302398
52345 302398 304325 307138 310667 314640 318972 323832 329369 335507 342107 349265 357243 366109 375636 385695
52331 385695 396596 408827 422458 437035 452097 467604 483796 500890 519150 538994 560635
52320 560635 583668 607237 630545 652934 673682 692280 709051 724971 740667 755900 770183
52309 770183 783399 795479 805970 814479 821378 827556 833570 839386 844777 849513 853225 855592 856764
52296 856764 857269 857437 857161 856181 854217 850813 845441 837922 828617 818273 807917 798730 791465 785894 781277
52281 781277 777523 775504 776072 779311 784989 793139 803593 815321 827006 838309 850017 862860 876718
52268 876718 891175 906216 921817 937193 951221 963696 975533 987395 998655 1008206 1015905 1022529
52256 1022529 1028447 1033204 1036597 1039391 1042450 1045673 1048312 1049952 1050605 1050176 1048436 1045358 1040846 1034290
52242 1034290 1025094 1013694 1001467 989528 978120 967183 956844 947127 937823 929038 921449 915625
52230 915625 911395 908191 905762 904256 903757 903970 904301 904207 903721 903614 904748 907247 910585 914402 918759 923654
52214 923654 928873 934467 940717 947486 954215 960843 967975 975753 983253 989516 994600 999020 1002815 1005850
52200 1005850 1008535 1011366 1014154 1016532 1018927 1022057 1025647 1028580 1030415 1031888 1033798 1036147 1038532 1040693
52186 1040693 1042417 1043433 1043684 1043274 1042077 1039815 1036537 1032469 1027411 1021003 1013585 1006045 998647 990822
52172 990822 982428 974356 967454 961642 956693 953074 951198 950440 949851 949490 950137 951923 954222 956866 960445
52157 960445 965080 969755 973367 975933 978212 980517 982370 983166 982688 981085 978767 976445 974920 974577 975145
52142 975145 976131 977379 978993 980754 982017 982477 982805 984115 986856 990728 995670 1002327 1011166 1021647 1032846
52127 1032846 1044721 1058228 1074315 1093312 1115231 1139999 1167122 1195588 1224554 1253940 1284024
52116 1284024 1314542 1344481 1372745 1398781 1422508 1443861 1462624 1478656 1492017 1502672 1510136
52105 1510136 1513660 1512912 1508379 1501104 1492140 1482361 1472504 1463098 1454308 1446021 1438096 1430418 1422833 1415240
52091 1415240 1407710 1400319 1392859 1384905 1376179 1366664 1356459 1345842 1335547 1326656 1320031 1316006 1314736
52078 1314736 1316468 1321178 1328127 1336249 1345066 1354967 1366495 1379606 1393792 1408730 1424469 1440947
52066 1440947 1457591 1473612 1488597 1502607 1515585 1526867 1535471 1540933 1543716 1544707 1544358 1542389 1538331
52053 1538331 1532244 1524781 1516547 1507517 1497164 1485094 1471385 1456388 1440334 1423162 1404525 1383973
52041 1383973 1361454 1337744 1314112 1291380 1269593 1248848 1230066 1214382 1201945 1191858 1183364
52030 1183364 1176491 1171408 1167741 1164976 1163096 1162303 1162241 1161963 1160679 1158191 1154622 1150004 1144281 1137602 1130548
52015 1130548 1124003 1118513 1113606 1107994 1100708 1091788 1081555 1069516 1054629 1036641 1016565 995667
52003 995667 974507 953216 932126 911503 890874 869220 845975 821606 797153 773474 750990
51992 750990 730011 711069 694777 681248 669710 659036 648761 639382 631468 624731 618270 611473
51980 611473 604287 596673 588290 578831 568325 556930 544708 531835 518882 506684 495967 487110
51968 487110 480138 474858 471165 469248 469284 470877 473157 475677 478976 483896 490495 497947 505400 512539 519245
51953 519245 525168 529833 532883 533926 532425 528118 521612 514266 507408 501759 497552 494924 494028 494966 497863
51938 497863 503042 510891 521390 533863 547376 561376 575744 590095 603201 613420 619710 621949
51926 621949 620222 614165 603415 588576 571263 553060 534676 516217 497864 480056 463254 447891
51914 447891 434392 422878 412899 403815 395478 388216 382176 377086 372889 370177 369622 371155 374053 377795
51900 377795 382536 388728 396540 405728 415864 426467 436867 446046 452833 456448 456834 454300 448975 441014
51886 441014 431372 421847 413970 408077 403788 401075 400423 402174 406359 413162 422945 435619 450481 466839
51872 466839 484365 502491 519825 534531 545197 551212 552618 549946 543984 535295 523957 509958
51860 509958 493861 476915 460563 445918 433555 423614 416097 411181 409125 409767 412244 415377 418321
51847 418321 420706 422305 422840 422195 420624 418584 416338 413743 410458 406319 401424 395953 390162 384664 380345
51832 380345 377643 376085 374923 374070 373952 374642 375790 377289 379193 380837 380976 379256 376743 374404 371811
51817 371811 368143 363821 360112 357530 355729 354791 355476 357979 361454 365117 369034 373453 378030 382104 385178
51802 385178 386769 386341 383939 380502 377129 374184 371333 368124 364298 359926 355558 351887 348972 346088
51788 346088 342611 338783 335385 333069 332192 332798 334305 335653 336253 336447 336614 336337 335139 333622 332952 333309
51772 333309 333694 333394 332843 332807 333501 334958 337755 342732 350132 359398 369752 380660 391803 402795 412938
51757 412938 421199 426551 428515 427326 423502 417364 409055 398936 387840 376930 367236 359211 352681
51744 352681 347348 343300 340870 340000 340137 341041 343490 348852 357883 370087 384207 399043 413681 427222
51730 427222 438709 447520 453777 458326 462424 467392 474139 482414 490278 494737 493542 486716 476363 465023
51716 465023 454324 445022 437756 433138 431011 429987 428114 424051 417688 409879 401908 395133 390688 389155
51702 389155 390447 393982 398783 403382 406060 405677 402356 397257 391835 387490 385562 386913 391169 396633
51688 396633 401201 403391 402692 399384 394242 388147 381681 375163 369025 363867 360034 357442 356010 355943 357378
51673 357378 360108 364032 369616 377464 387539 399226 412137 426404 441997 457990 472661 484232
51661 484232 491432 493523 490048 480838 466501 448924 430968 415386 403865 396938 394418 395749 400205
51648 400205 406985 415031 422656 427763 428870 425951 420112 412508 403694 393805 383030 371943 361492
51635 361492 352471 344880 338030 331512 325745 321264 317845 314853 312196 310370 309588 309463 309531 309591 309495 309123
51619 309123 308687 308580 308834 309127 309412 309997 310873 311530 311709 311810 312228 312716 312857 312770 312851 313119 313401 314012 315651
51600 315651 318535 322080 325595 329042 332990 338095 344787 353198 363016 373207 381996 387446 388453 385412
51586 385412 379882 373521 367335 361786 357336 354631 354216 356231 360415 366438 374338 384641 397921 414139
51572 414139 432409 451435 470175 488260 506042 524247 543273 562529 580481 595524 607119
51561 607119 616474 626421 640412 661086 689413 725053 767158 814323 863809 911497 953142 985734
51549 985734 1007820 1019098 1020078 1011755 995087 970691 939201 901773 859998 815503 769818 724537
51537 724537 681255 641279 605408 573813 546037 521295 499065 479338 462191 447376 434525
51526 434525 423512 414287 406501 399695 393738 388701 384305 379925 375278 370741 366782 363316 359869 356235
51512 356235 352761 349997 348220 347322 346942 346613 345845 344347 342287 340206 338426 336658 334433 331896 329762
51497 329762 328434 327588 326855 326477 326818 327553 327913 327702 327534 327979 328915 329866 330584 331083 331330 331159 330371 328801
51479 328801 326499 323883 321479 319394 317263 314917 312880 311956 312477 314154 316491 319049 321384 323094 324039
51464 324039 324316 323975 322908 321044 318435 315125 311191 307051 303456 300879 299005 297109 294925 292987 292126
51449 292126 292867 295251 298980 303670 309231 316181 325429 337613 352646 369761 387543 403763 415805
51436 415805 422033 422935 420726 417806 415692 415025 415802 417235 417718 415491 409613 400536 389882 379590 370902
51421 370902 363948 358243 353449 349533 346460 344125 342557 341815 341666 341761 342182 343384 345414 347562 349032
51406 349032 349707 350047 350432 350871 351110 350835 349882 348412 346828 345451 344448 343998 344243 345068 346349 348492 352269
51389 352269 357935 364932 372739 381666 392528 405931 422129 441263 463458 489110 519365 555773
51377 555773 599086 648816 704289 765278 830682 897106 959913 1015728 1063144 1101265 1128815
51366 1128815 1145009 1150244 1145189 1129680 1103112 1065645 1018616 964090 904444 842234 780022 720103
51354 720103 664266 613557 568216 528045 492943 462970 437995 417570 401088 387770 376597
51343 376597 366767 358183 351010 344724 338217 331080 324210 318778 315031 312491 310824 309939 309446 308727 307638
51328 307638 306732 306561 306932 307003 306122 304499 302964 302046 301431 300526 299351 298536 298497 299011 299643 300178 300513 300549 300443
51309 300443 300561 300919 300936 300034 298246 296022 293774 291936 291122 291745 293450 295287 296446 296701 296226 295216
51293 295216 293676 291475 288656 285710 283309 281691 280560 279716 279475 280255 282061 284695 288254 293039 299044
51278 299044 305764 312403 318101 322198 324703 326423 328385 331077 334342 337712 340603 342405 342871 342419 341796
51263 341796 341424 341215 340784 339587 337104 333309 328899 324721 321037 317663 314606 312046 309759 307150 303999
51248 303999 300695 297557 294461 291393 288936 287743 287741 288244 288712 289048 289254 289197 288793 288184 287598 287204 287171 287708
51230 287708 288899 290462 291790 292301 291807 290620 289310 288327 287730 287289 286881 286791 287483 288953 290530 291559
51214 291559 292247 293457 295643 298311 300726 302781 304894 307320 309971 312724 315455 317766 319175 319721 320014
51199 320014 320525 321059 321122 320581 319763 319043 318486 317850 316831 315400 313964 313088 312919 312988 312685 311891 311089 310902
51181 310902 311613 312968 314323 315093 315322 315786 317353 320097 323154 325531 326927 327624 327704 326789 324699 322083
51165 322083 320015 318930 318288 317379 316215 315441 315561 316481 317715 318769 319339 319402 319151 318648 317482 315043 311375
51148 311375 307589 305139 304583 305204 305874 306061 305874 305497 305047 304976 306014 308349 311136 313266 314501 315448 316480
51131 316480 317212 317145 316270 314783 312669 310064 307786 306950 307986 310356 313218 316042 318622 320921 323177
51116 323177 325913 329491 333687 337885 341685 345102 348068 349974 350093 348509 346374 344968 344608 344636 344358
51101 344358 343710 343103 342990 343610 344782 345842 346118 345663 345289 345759 347182 349302 351936 354833 357444 359299
51085 359299 360526 361713 363292 365261 367271 368791 369352 368988 368258 367609 366880 365756 364496 363813 364119 365251
51069 365251 366871 368796 370962 373402 376325 380028 384776 390968 399220 409887 422525 435960 448738
51056 448738 459299 466256 469287 469867 470604 473677 479983 489335 500716 512483 523222 532849 542388 552387
51042 552387 561994 569823 575288 578837 581412 584032 587451 591544 594982 595756 592052 582783 567835 548252
51028 548252 525970 503039 481087 461431 445138 432561 423029 415425 409057 403927 400387 398798 399261
51015 399261 401343 404235 407397 410941 415228 420296 425909 431922 438309 444963 451709 458407 464869 470877
51001 470877 476480 482107 488248 495186 503142 512241 522078 531773 540935 550329 561122 573698 587643
50988 587643 602605 618505 635008 651581 668224 685631 704379 724339 744932 765336 784189
50977 784189 799706 810828 818176 823440 827973 832402 837566 845188 857161 874305 896217 922368 953050
50964 953050 989026 1030491 1076738 1126831 1180209 1236522 1295233 1355613 1416866 1477864 1536883
50953 1536883 1592088 1642355 1687468 1727526 1762464 1792204 1816995 1837454 1854422 1868882 1881919
50942 1881919 1894584 1907660 1921257 1934381 1945011 1951094 1951831 1948028 1941206 1932487 1922245 1910425
50930 1910425 1896756 1880590 1860822 1836352 1806802 1772697 1734696 1692660 1645701 1593246 1535902
50919 1535902 1475185 1412756 1350091 1288559 1229362 1173424 1121556 1074449 1032149 993782 958367
50908 958367 925852 896880 871611 849431 829854 812893 798230 784795 771799 759680 749313
50897 749313 740626 732710 725073 717963 711483 705256 699207 693980 690114 687284 684833 682715 681436 681245
50883 681245 681905 683183 685102 687678 690747 694250 698419 703598 709978 717524 725967 734812 743599 752313
50869 752313 761435 771534 782966 796025 811104 828435 847833 868949 891777 916726 944271 974772
50857 974772 1008665 1046570 1089094 1136686 1189819 1249205 1315743 1390282 1473439 1565439 1665922
50846 1665922 1774003 1888779 2009883 2137394 2271096 2409876 2551837 2694747 2836087
50837 2836087 2972738 3101043 3217508 3319369 3404475 3471119 3518652 3548216 3562229 3562897 3551782
50826 3551782 3531170 3505233 3479033 3456445 3439595 3430028 3429460 3438940 3457749 3483390 3512144 3539392
50814 3539392 3560013 3569373 3564126 3541974 3501035 3439967 3358694 3258659 3142333 3012707 2873117
50803 2873117 2727057 2577943 2429121 2284018 2145943 2017490 1900142 1794485 1700698 1618935
50793 1618935 1549376 1491988 1446226 1411039 1385281 1367943 1357880 1353461 1352792 1354281 1356803 1359408
50781 1359408 1361192 1361508 1360021 1356457 1350552 1342419 1332722 1322223 1311146 1299111 1285596 1270283 1253019
50768 1253019 1233682 1212265 1189012 1164330 1138513 1111591 1083465 1054243 1024517 995379 968129
50757 968129 943764 922608 904415 888864 875880 865511 857657 852166 849110 848767 851289 856544 864259
50744 864259 874180 886097 899970 916157 935387 958427 985790 1017639 1053775 1093778 1137470 1185297
50732 1185297 1237998 1295869 1358613 1425855 1497285 1572144 1649077 1726893 1805094 1883264 1960220
50721 1960220 2034275 2104161 2169112 2227952 2278480 2317870 2343571 2354079 2349487 2331647 2303674
50710 2303674 2269146 2231585 2194371 2160619 2132917 2113136 2102333 2100592 2107042 2120299 2138852 2160854
50698 2160854 2183696 2204145 2218993 2225410 2220775 2202631 2169206 2120180 2057143 1983379 1902927 1819414
50686 1819414 1735576 1653767 1576524 1506263 1444534 1391922 1348668 1315077 1291380 1277503 1273067
50675 1273067 1277547 1290484 1311740 1341308 1378573 1421862 1469051 1518449 1568679 1617843 1663416
50664 1663416 1703200 1736175 1762496 1783073 1799191 1812078 1822557 1831222 1838782 1845781 1851993 1856587
50652 1856587 1859141 1860146 1860457 1860730 1861613 1863983 1868574 1875599 1885146 1897809 1914614 1936397 1963407 1995362
50638 1995362 2031603 2071227 2113269 2156855 2201177 2245379 2288550 2329901 2369215 2407250 2445590
50627 2445590 2485657 2527351 2567898 2601138 2617961 2609101 2569811 2503121 2418598 2327720 2239944
50616 2239944 2161535 2095893 2043978 2005167 1978610 1963800 1959817 1964635 1975528 1989760 2004591 2017202
50604 2017202 2025067 2026082 2018146 1999281 1968652 1927126 1876406 1818021 1753491 1684807 1614041 1542725
50592 1542725 1472153 1403929 1339594 1279944 1225194 1175595 1131413 1092567 1058835 1030187 1006449
50581 1006449 986976 971188 959051 950422 944341 939823 937064 936875 939044 942255 945645 949428 953722
50568 953722 957850 961352 964908 969629 975983 984007 994057 1006677 1022017 1040041 1061130 1085921 1114579
50555 1114579 1146703 1181999 1220652 1262966 1308814 1357345 1406888 1455192 1500203 1540923 1577462
50544 1577462 1610176 1639070 1664393 1687662 1711540 1738346 1768892 1803109 1841553 1885688 1936648
50533 1936648 1994332 2058044 2127576 2203281 2285509 2374523 2470750 2574529 2685576 2802978 2925461
50522 2925461 3051253 3177933 3302991 3424404 3540011 3646436 3739494 3815972 3874426 3913965
50512 3913965 3932952 3929518 3903053 3854691 3786502 3700683 3599529 3485875 3363459 3236926 3111427
50501 3111427 2991982 2882992 2788004 2709597 2649441 2608639 2588004 2587756 2606956 2643390 2693857
50490 2693857 2754148 2818724 2880843 2933353 2969461 2983226 2970331 2929107 2860897 2769380 2659621
50479 2659621 2537416 2408645 2278376 2150310 2026943 1909979 1800505 1699022 1605538 1519634
50469 1519634 1440703 1368536 1303624 1246426 1196288 1151605 1111130 1074641 1042245 1013706 988797
50458 988797 967717 950610 937037 926355 918252 912519 908633 906063 904647 904251 904404 904839 906058 908750
50444 908750 912816 917619 923000 929373 936776 944550 952050 959154 965864 971945 977255 982084 987059 993033
50430 993033 1001150 1012504 1027374 1045047 1064615 1085737 1108467 1132670 1157969 1184019 1210529 1237136
50418 1237136 1263636 1290469 1318841 1350293 1386107 1426982 1473107 1524504 1581302 1643592 1711005
50407 1711005 1782513 1856674 1931929 2006568 2078550 2145680 2206193 2259160 2304207 2340677 2367127
50396 2367127 2381746 2383187 2370802 2344181 2302987 2247638 2180063 2103472 2021418 1937122 1853397
50385 1853397 1772792 1697708 1630535 1573536 1528261 1495113 1473776 1463995 1465543 1477412 1497485 1523235
50373 1523235 1552357 1582438 1610356 1632491 1645581 1647298 1636265 1612043 1575335 1528060 1472973
50362 1472973 1413045 1351039 1289334 1229854 1173844 1121657 1072972 1027447 985188 946460 911097
50351 911097 878525 848375 820756 795834 773443 753346 735629 720549 708135 698152 690393 684720
50339 684720 680843 678313 676776 676098 676284 677422 679683 683117 687346 691598 695141 697727 699740 702040 705530
50324 705530 710503 716252 721580 725869 729605 733699 738460 743415 748008 752194 756306 760597 765045 769546
50310 769546 774205 779514 786347 795692 808242 824093 842767 863531 885676 908435 930564 950040
50298 950040 964503 972355 973577 969478 961839 952440 943153 935766 931224 929190 928598 928587 928742 928808 928678 928711
50282 928711 929624 931804 935033 939121 944677 953038 965468 982421 1003116 1025143 1044342 1055688 1055285
50269 1055285 1042233 1018935 989723 958974 929849 903927 881494 862295 846283 833703 824440
50258 824440 817698 812679 809391 808242 808985 810716 813017 816385 821198 826987 833241 840261 848368 856720
50244 856720 863972 870000 875995 882679 889345 894925 899145 902087 903357 902477 899761 896150 892277 888075
50230 888075 883168 877278 870362 862708 854869 847404 840898 836257 834510 835991 840085 846247 854962 867377
50216 867377 884281 905837 931953 962311 996148 1032393 1069797 1106543 1140278 1169427 1194492
50205 1194492 1217437 1239795 1261945 1284019 1306457 1329221 1351076 1369953 1383487 1388974 1383603 1365606
50193 1365606 1335243 1294443 1245860 1192493 1137601 1084094 1033799 987667 946622 911791 883850
50182 883850 862496 846729 835335 826799 818823 808448 793127 771984 746104 717686 689034 662129
50170 662129 638418 618400 601532 587056 574972 565847 559720 555677 552689 550431 549164 549216 550844
50157 550844 554195 559044 564758 570814 577251 584442 592592 601585 610999 619960 627230 631842 633681 633316
50143 633316 631357 628126 623736 618249 611894 605373 599803 596094 594465 594802 597316 602423 609961 618827
50129 618827 627553 635201 641733 647756 653964 660679 667845 675418 683545 692247 701134 709732 718046 726500
50115 726500 735343 744392 753449 762721 772716 783914 796737 811664 829125 849211 871673 896369
50103 896369 923729 954721 990461 1031986 1080398 1136797 1201638 1273943 1351268 1430442 1508430
50092 1508430 1582928 1652783 1718145 1780094 1840059 1899633 1960571 2024085 2089735 2155176 2217051
50081 2217051 2271602 2314321 2340055 2344670 2326973 2288754 2233211 2163672 2083422 1995743 1903670
50070 1903670 1809884 1716818 1626470 1540168 1458971 1384252 1317312 1258352 1206483 1161035 1122249
50059 1122249 1090249 1063787 1040617 1018955 998188 978442 960103 943808 930328 920110 912946
50048 912946 908214 905321 903996 904310 906437 910302 915401 920986 926342 930869 934091 935828 936289 935841 934690
50033 934690 932953 930844 928539 925891 922617 918829 914999 911248 906979 901544 895140 888670 882722 876980
50019 876980 870720 863571 855616 847053 838109 829193 820678 812346 803317 792798 780857 768295 755882
50006 755882 743942 732621 722300 713552 706805 702189 699724 699644 702454 708597 717980 729964 743895
49993 743895 759478 776431 793934 810796 826266 840388 853524 865954 878184 891256 906171
49982 906171 922997 940993 959737 979771 1001952 1026447 1052697 1080185 1108816 1138435 1168211
49971 1168211 1196730 1222714 1245680 1266073 1284942 1303454 1322588 1343117 1365488 1389233 1412154
49960 1412154 1430317 1439320 1435936 1418745 1387709 1343857 1289642 1229030 1166553 1106108 1050620 1002275
49948 1002275 962289 930434 905485 886403 872614 862980 855263 847346 838689 829992 821668 813441 805252
49935 805252 797438 789484 779406 765162 746378 724124 699443 672979 645921 620268 597691 578645
49923 578645 562865 550164 540279 532502 526176 521379 518557 517579 517633 518032 518593 519296 520127 521336 523306
49908 523306 525991 528953 532133 536045 540921 546228 551527 557396 564972 574839 586915 601049 616966
49895 616966 633635 649430 663120 674232 682473 687481 689424 689218 687723 685098 681224 676224 669994
49882 669994 661592 649910 634924 617781 599585 580603 560857 541089 522772 507232 494814 484821
49870 484821 476208 468421 461600 456067 451894 449136 448077 448753 450422 452162 454032 457067 461880 467900
49856 467900 474363 481586 490623 501884 514670 528019 541526 555374 569941 585367 600955 614960
49844 614960 625450 631749 634800 636035 636234 635500 633691 630371 624725 616194 605234 593036 580563 568181
49830 568181 556133 544951 535249 527442 521697 517850 515360 513762 513323 514866 518768 524466 531228 538994
49816 538994 548059 558228 568879 579814 591468 604137 617414 630577 643152 654788 664842 672575
49804 672575 677807 681137 683465 685364 686829 687366 686253 682980 677617 670631 662168 651614 638202 622104
49790 622104 604684 587485 571109 555314 540114 526432 515456 507519 501775 496940 492201 487386
49778 487386 482533 477574 472591 468212 465428 464829 466085 468286 470748 473446 476871 481755 488790 498229
49764 498229 509577 521835 534104 545801 556344 565099 571867 577130 581501 585135 587930 589983 591312
49751 591312 591143 588006 580892 570166 557272 543726 530527 518277 507421 498168 490328 483539 477815
49738 477815 473658 471319 470042 468493 466100 463578 461924 461338 461563 462775 465359 468906 472292 474963 477497
49723 477497 480618 484312 488381 493328 499978 508456 518175 528859 540940 554698 569305 582973 593923
49710 593923 601122 604373 604054 600954 596235 591227 586862 583111 579063 573700 566738 558817 551006 543979
49696 543979 537389 530050 521063 510927 501236 493146 486484 480595 475604 472282 470922 470993 471961 473929 477287
49681 477287 482122 488172 495059 502423 510219 519086 530015 543326 558177 573362 588218 602260 614231
49668 614231 622346 625900 626243 625842 626459 628327 630741 633069 635303 638070 642189 647864 653961 658043 657359
49653 657359 650098 636129 616941 595036 573072 553026 535732 521065 508571 498008 489399 482703
49641 482703 477617 473776 471133 469959 470355 471830 473530 474869 475816 476530 476907 476547 475017 472071 467790
49626 467790 462669 457429 452528 447903 443296 438649 434011 429280 424425 419842 416089 413189 410615 408046
49612 408046 405861 404660 404625 405508 407033 409036 411354 413784 416097 418024 419363 420179 420710 421019 420987 420706
49596 420706 420548 420688 420951 421313 422135 423531 424958 425914 426670 427729 428830 429267 429084 429142 429829 430425 430111 429059
49578 429059 428175 428194 429349 431592 434693 438372 442629 447748 453737 460043 466167 472326 479257 487541 497352
49563 497352 508497 520217 531195 540315 547413 552868 556535 557597 555551 550888 544609 537425 529734
49550 529734 522107 515387 510241 506756 504537 503201 502703 503114 504155 505244 506169 507370 509242 511362 512919
49535 512919 513795 514711 516281 518494 521354 525429 531315 538961 547980 558349 570305 583713 598112 613246
49521 613246 628859 643853 656401 665380 671378 675867 679692 682902 685867 689790 695817 704136 714374
49508 714374 726609 741377 758475 776055 791124 800865 803503 798342 785593 766409 742808 717150
49496 717150 691580 667831 647222 630338 616705 605197 595095 586643 580303 575785 572219 569174
49484 569174 566867 565219 563328 560454 557115 554566 553308 552754 552388 552545 553763 555924 558447 560931 563206
49469 563206 565134 566860 568991 571988 575538 579115 582983 587922 593936 599911 604877 609006 612963 616757
49455 616757 619690 621124 620729 618117 612833 604911 595223 585157 575970 568359 562399 557814 554260 551339
49441 551339 548525 545484 542559 540593 540034 540515 541531 543185 546004 550333 556286 564013 573569 584742
49427 584742 597548 612797 631726 655202 683906 719353 764207 821237 891431 971595 1052108
49416 1052108 1117382 1151427 1146107 1105524 1042758 972443 905467 847993 802552 769083 745997
49405 745997 731412 723838 722008 724649 730600 738928 748800 759503 770682 782323 794370 806492 818254
49392 818254 829272 839145 847339 853276 856524 857047 855313 851969 847221 840681 832079 821977 811422 800990
49378 800990 790527 779860 769359 759673 751215 744078 738315 734072 731440 730194 729778 729757 730393 732436
49364 732436 735977 739695 741692 741068 738360 734548 730118 725095 719463 713346 707050 701065 695721 690790
49350 690790 685829 680951 676811 673703 671209 668987 667447 667237 668412 670446 672779 675034 676939 678389
49336 678389 679323 679329 677766 674673 671185 668443 666326 663849 660684 657655 655700 654946 654971 655471 656386 657712
49320 657712 659490 661767 664374 666900 669065 671073 673427 676448 679976 683489 686481 688794 690590 692056
49306 692056 693206 694028 694586 694899 694914 694735 694633 694668 694625 694648 695612 698359 702717 707777 713088 719025 725959 733612
49288 733612 741442 749224 757015 764860 772737 780597 788324 795893 803587 811685 819801 826963 832620 837328
49274 837328 842160 847697 853802 860116 866418 872636 878823 885199 892043 899617 908231 918176 929304 940584
49260 940584 950152 955899 956375 951677 943783 935952 931602 933478 943268 961280 986341 1016525 1049994
49247 1049994 1084591 1116519 1140518 1152421 1151556 1140303 1121721 1098236 1072176 1046208 1022480 1001560
49235 1001560 982549 964135 945677 927805 912256 900757 893721 890039 888199 887413 887664 889070 891594
49222 891594 895227 900110 906344 913735 921697 929423 936372 942733 949346 956981 965698 974846 983547 991085
49208 991085 997104 1001772 1005842 1010369 1016291 1024201 1034352 1046577 1060133 1073945 1087354 1100573 1114189
49195 1114189 1128177 1141727 1154175 1165785 1177258 1188629 1199161 1208421 1216942 1225509 1234141 1242317
49183 1242317 1250153 1258834 1269673 1283092 1298735 1316274 1335735 1357194 1380671 1406640 1436368 1471496
49171 1471496 1513305 1562424 1618747 1680679 1743858 1800952 1843576 1865401 1864461 1843578 1809136 1768887
49159 1768887 1729586 1695616 1669104 1650795 1640487 1637095 1639053 1644885 1653201 1662419 1671262 1679590 1688062
49146 1688062 1696755 1704772 1711503 1717583 1724150 1731740 1740474 1750664 1762459 1775294 1788526 1802374 1817511
49133 1817511 1833952 1851164 1869124 1888336 1908769 1929592 1950048 1969850 1988639 2005949 2021955
49122 2021955 2037399 2052403 2066229 2078727 2091127 2104670 2119076 2133271 2147234 2162245 2179616
49111 2179616 2200063 2224414 2254200 2291469 2338579 2398034 2471316 2556842 2649002 2740023 2824035
49100 2824035 2900584 2974603 3051647 3130927 3201761 3247589 3255624 3224878 3166384 3095774 3024091
49089 3024091 2953331 2878965 2796353 2705661 2612133 2522898 2443720 2377672 2325328 2285458 2255824
49078 2255824 2233965 2217736 2205474 2196025 2188668 2182931 2178451 2174969 2172198 2169462 2165707 2160239 2153446
49065 2153446 2146446 2140049 2134358 2129318 2125118 2121845 2119074 2116108 2112530 2108416 2104138 2100109 2096591 2093667
49051 2093667 2091494 2090456 2090755 2091812 2092490 2092101 2090970 2089836 2089073 2088714 2088826 2089401 2090140 2090917 2092415 2095779
49035 2095779 2101600 2109722 2120246 2134102 2152093 2173528 2196192 2217622 2236069 2250354 2259442 2262639
49023 2262639 2260102 2252916 2242681 2231111 2219755 2209637 2201036 2193775 2187840 2183590 2181332 2180964 2182185
49010 2182185 2184885 2189117 2194806 2201752 2209818 2218825 2228210 2237103 2244912 2251671 2257695 2263006 2267293 2270363
48996 2270363 2272438 2273923 2274959 2275262 2274427 2272384 2269483 2266002 2261651 2255824 2248482 2240591 2233378 2227229
48982 2227229 2221627 2216182 2211332 2207731 2205324 2203566 2202489 2202925 2205428 2209487 2214197 2219293 2224899 2230527
48968 2230527 2235108 2238170 2240303 2242220 2243897 2244975 2245451 2245453 2244808 2243497 2242316 2242355 2243869 2246299 2249475 2254216
48952 2254216 2261541 2271834 2284955 2300659 2318544 2338042 2358999 2382110 2408376 2438102 2470697
48941 2470697 2505373 2541809 2580112 2620370 2662342 2705554 2749758 2795264 2842770 2892762 2945121
48930 2945121 2999272 3054594 3110718 3167650 3225700 3285116 3345765 3407293 3469530 3532430 3595613
48919 3595613 3658436 3720656 3782509 3843623 3902183 3955795 4003292 4045393 4083653 4119222 4152683
48908 4152683 4184549 4215391 4245491 4274687 4302615 4328965 4353529 4376255 4397442 4417702 4437370
48897 4437370 4455901 4472123 4485305 4495728 4504007 4510126 4513513 4513879 4511478 4506531 4498913 4488515 4475462
48884 4475462 4459802 4441424 4420457 4397255 4371718 4343109 4310974 4275844 4238549 4199136 4156890
48873 4156890 4111098 4061268 4006902 3947814 3884656 3818636 3750765 3681798 3612798 3545101 3479684
48862 3479684 3417036 3357632 3301950 3249954 3201252 3155974 3115015 3079133 3048237 3021769 2999324
48851 2999324 2980588 2965061 2952142 2941213 2931523 2922521 2914637 2909231 2907358 2908840 2912943 2919561 2929170
48838 2929170 2941838 2956869 2973361 2990701 3008556 3026816 3045540 3064638 3083609 3101884 3119402
48827 3119402 3136564 3153694 3170913 3188462 3206736 3225882 3245697 3265949 3286535 3307281 3327971
48816 3327971 3348682 3369817 3391567 3413633 3435622 3457533 3479648 3502155 3525153 3548910 3573730
48805 3573730 3599516 3625640 3651437 3676762 3701994 3727610 3753868 3780920 3809013 3838320 3868525
48794 3868525 3898710 3927809 3955147 3980540 4004014 4025513 4044774 4061326 4074688 4084690 4091636
48783 4091636 4096044 4098120 4097399 4092774 4082948 4067067 4045027 4017083 3983230 3943391 3898325 3849845
48771 3849845 3799622 3747960 3694232 3638362 3581281 3523927 3466500 3409026 3352063 3296382 3242259
48760 3242259 3189630 3138762 3090259 3044395 3000891 2959495 2920466 2884347 2851528 2822244 2796851
48749 2796851 2775845 2759542 2747770 2739826 2734709 2731509 2729682 2728969 2729095 2729686 2730546 2731893 2734219 2737955
48735 2737955 2743336 2750424 2759012 2768479 2777896 2786364 2793297 2798477 2801981 2804028 2804738 2804050 2802011 2799045
48721 2799045 2795665 2792015 2787995 2783867 2780227 2777258 2774539 2771903 2769999 2769450 2769848 2770306 2770775 2772043 2774406
48706 2774406 2777184 2779753 2782281 2785062 2787791 2790044 2791968 2793898 2795640 2796775 2797497 2798584 2800626 2803728
48692 2803728 2807836 2812874 2818619 2824915 2831932 2839685 2847248 2852961 2855616 2855185 2852357 2847818 2842218 2836477
48678 2836477 2831661 2828398 2826377 2824421 2821221 2816133 2809038 2799361 2785739 2767224 2744651 2720130 2695175
48665 2695175 2669862 2643780 2617130 2590631 2565002 2540891 2518855 2498802 2479592 2459387 2436324
48654 2436324 2408855 2376065 2338230 2296964 2254540 2213031 2174054 2138799 2107823 2080968 2057834
48643 2057834 2038290 2022310 2009412 1998460 1987949 1976368 1962537 1945938 1926760 1905640 1883445
48632 1883445 1861243 1840016 1820202 1801723 1784464 1768313 1752614 1736238 1718618 1700276 1681847
48621 1681847 1663094 1643528 1623648 1604788 1587789 1572543 1558787 1546672 1536469 1528383 1522809 1520147
48609 1520147 1520075 1521592 1524130 1528111 1533961 1540907 1547263 1551728 1554040 1554489 1553310 1550704 1547204 1543756 1541345
48594 1541345 1540451 1540888 1542157 1543786 1545105 1544854 1541540 1534390 1523753 1510479 1495148 1478032 1459446
$$ [...]
##END NTUPLES=NMR SPECTRUM
##END=
