##TITLE=NES1060_RRG_9883143_8TObMUu1Hl
##JCAMPDX= 6.0         $$ Bruker NMR JCAMP-DX V2.0
##DATA TYPE= NMR SPECTRUM
##DATA CLASS= NTUPLES
##ORIGIN= BRUKER
##OWNER= Administrator
$$ 1.72 TOPSPIN		Version 2.1
$$ 2016-08-26 22:54:55.008 -0500  Administrator@X
$$ Compression mode = diff/dup
##.OBSERVE FREQUENCY= 400.02188249412
##.OBSERVE NUCLEUS= ^1H
##.ACQUISITION MODE= SIMULTANEOUS (DQD)
##.ACQUISITION SCHEME= undefined
##.AVERAGES= 8
##.DIGITISER RES= 22
##SPECTROMETER/DATA SYSTEM= spect
##.PULSE SEQUENCE= zg30
##.SOLVENT NAME= COFFEE_meoh
##.SHIFT REFERENCE= INTERNAL, COFFEE_meoh, 1, 14.98509
##AUDIT TRAIL= $$ (NUMBER, WHEN, WHO, WHERE, PROCESS, VERSION, WHAT)
$$ ##TITLE= Audit trail, TOPSPIN		Version 2.1
$$ ##JCAMPDX= 5.01
$$ ##ORIGIN= Bruker BioSpin GmbH
$$ ##OWNER= Administrator
$$ $$ E:\/data/COFFEE/nmr/NES1060_RRG_9883143_8TObMUu1Hl/10/pdata/1/auditp.txt
$$ ##AUDIT TRAIL=  $$ (NUMBER, WHEN, WHO, WHERE, PROCESS, VERSION, WHAT)
(   1,<2016-08-26 22:54:47.851 -0500>,<Administrator>,<X>,<go>,<TOPSPIN 2.1>,
      <created by zg
	started at 2016-08-26 22:53:40.945 -0500,
	POWCHK enabled, PULCHK disabled,
       configuration hash MD5:
       21 0F 79 D6 B3 7B B4 F6 88 20 88 DB 03 48 BD 9F
       data hash MD5: 64K
       8C A0 48 F5 D4 E5 79 D5 F5 38 C3 32 70 E3 13 02>)
(   2,<2016-08-26 22:54:50.929 -0500>,<Administrator>,<X>,<proc1d>,<TOPSPIN 2.1>,
      <Start of raw data processing
       efp LB = 0 FT_mod = 6 PKNL = 1 PHC0 = 0 PHC1 = 0 SI = 32K 
       data hash MD5: 32K
       64 7D 53 3A 98 FB 40 38 A9 13 C4 B2 8E A9 52 32>)
(   3,<2016-08-26 22:54:51.226 -0500>,<Administrator>,<X>,<proc1d>,<TOPSPIN 2.1>,
      <pk PHC0 = 92.47742 PHC1 = 0 
       data hash MD5: 32K
       25 EB 51 70 A3 3D 04 67 BB 2D D0 6B 80 83 B4 E7>)
(   4,<2016-08-26 22:54:51.336 -0500>,<Administrator>,<X>,<proc1d>,<TOPSPIN 2.1>,
      <abs ABSG = 1 
       data hash MD5: 32K
       E3 AD B7 45 CF E9 6A 59 34 74 14 74 44 C8 8C 03>)
(   5,<2016-08-26 22:54:51.398 -0500>,<Administrator>,<X>,<proc1d>,<TOPSPIN 2.1>,
      <abs ABSG = 2 
       data hash MD5: 32K
       52 63 A8 53 2B 32 F4 D6 96 15 00 15 EF 22 B2 E9>)
(   6,<2016-08-26 22:54:51.461 -0500>,<Administrator>,<X>,<proc1d>,<TOPSPIN 2.1>,
      <abs ABSG = 3 
       data hash MD5: 32K
       68 31 6E AB 53 15 41 0F 55 52 D4 71 66 D7 BB 6D>)
(   7,<2016-08-26 22:54:51.523 -0500>,<Administrator>,<X>,<proc1d>,<TOPSPIN 2.1>,
      <abs ABSG = 4 
       data hash MD5: 32K
       2D 7C 5B 73 5B 2D F9 33 D4 41 B2 E9 E3 E0 A6 C2>)
(   8,<2016-08-26 22:54:51.586 -0500>,<Administrator>,<X>,<proc1d>,<TOPSPIN 2.1>,
      <abs ABSG = 5 
       data hash MD5: 32K
       BE 51 F0 04 83 65 52 DD 6B C6 2E C3 1A AB 84 BC>)
$$ ##END=
$$ 
$$ $$ hash MD5
$$ $$ CB E6 60 D6 18 5A 9B FF 26 F2 7B 40 3B FB DC 90
##$RELAX= 
##$RELAX= 
##$RELAX= 
##$RELAX= 
##$RELAX= 
##$RELAX= 
##$RELAX= 
$$ Bruker specific parameters
$$ --------------------------
##$DU= <E:\>
##$EXPNO= 10
##$NAME= <NES1060_RRG_9883143_8TObMUu1Hl>
##$PROCNO= 1
$$ [...]
150 150 150 150 150 150 150 150
##$TP07= 0
##$TPNAME0= <>
##$TPNAME1= <>
##$TPNAME2= <>
##$TPNAME3= <>
##$TPNAME4= <>
##$TPNAME5= <>
##$TPNAME6= <>
##$TPNAME7= <>
##$TPOAL= (0..7)
0.5 0.5 0.5 0.5 0.5 0.5 0.5 0.5
##$TPOFFS= (0..7)
0 0 0 0 0 0 0 0
##$TUNHIN= 0
##$TUNHOUT= 0
##$TUNXOUT= 0
##$USERA1= <user>
##$USERA2= <user>
##$USERA3= <user>
##$USERA4= <user>
##$USERA5= <user>
##$V9= 5
##$VALIST= <valist>
##$VCLIST= <CCCCCCCCCCCCCCC>
##$VD= 0
##$VDLIST= <DDDDDDDDDDDDDDD>
##$VPLIST= <PPPPPPPPPPPPPPP>
##$VTLIST= <TTTTTTTTTTTTTTT>
##$WBST= 2048
##$WBSW= 25
##$XGAIN= (0..3)
0 0 0 0
##$XL= 0
##$YL= 0
##$YMAX_a= 566055
##$YMIN_a= -486002
##$ZGOPTNS= <>
##$ZL1= 120
##$ZL2= 120
##$ZL3= 120
##$ZL4= 120
##$ABSF1= 14.98509
##$ABSF2= -5.573092
##$ABSG= 5
##$ABSL= 3
##$ALPHA= 0
##$AQORDER= 0
##$ASSFAC= 0
##$ASSFACI= 0
##$ASSFACX= 0
##$ASSWID= 0
##$AUNMP= <proc_prof1d_extract_pilot.lims>
##$AXLEFT= 0
##$AXNAME= <>
##$AXNUC= <1H>
##$AXRIGHT= 0
##$AXTYPE= 0
##$AXUNIT= <>
##$AZFE= 0.1
##$AZFW= 0.1
##$BCFW= 0
##$BC_mod= 0
##$BYTORDP= 0
##$COROFFS= 0
##$CY= 15
##$DATMOD= 1
##$DC= 0
##$DFILT= <>
##$DTYPP= 0
##$F1P= 0
##$F2P= 0
##$FCOR= 0.5
##$FTSIZE= 32768
##$FT_mod= 6
##$GAMMA= 0
##$GB= 0
##$INTBC= 1
##$INTSCL= 1
##$ISEN= 128
##$LB= 0
##$LEV0= 0
##$LPBIN= 0
##$MAXI= 10000
##$MC2= 0
##$MEAN= 0
##$ME_mod= 0
##$MI= 0
##$NCOEF= 0
##$NC_proc= -8
##$NLEV= 6
##$NOISF1= 0
##$NOISF2= 0
##$NSP= 0
##$NTH_PI= 0
##$NZP= 0
##$OFFSET= 14.98509
##$PC= 1
##$PHC0= 92.47742
##$PHC1= 0
##$PH_mod= 1
##$PKNL= yes
##$PPARMOD= 0
##$PPDIAG= 0
##$PPIPTYP= 0
##$PPMPNUM= 2147483647
##$PPRESOL= 1
##$PSCAL= 4
##$PSIGN= 0
##$PYNMP= <proc.py>
##$REVERSE= no
##$SF= 400.02
##$SI= 32768
##$SIGF1= 0
##$SIGF2= 0
##$SINO= 400
##$SIOLD= 32768
##$SPECTYP= <>
##$SREGLST= <1H.CDCl3>
##$SSB= 0
##$STSI= 32768
##$STSR= 0
##$SW_p= 8223.68421052631
##$SYMM= 0
##$S_DEV= 0
##$TDeff= 65536
##$TDoff= 0
##$TI= <>
##$TILT= no
##$TM1= 0
##$TM2= 0
##$TOPLEV= 0
##$USERP1= <user>
##$USERP2= <user>
##$USERP3= <user>
##$USERP4= <user>
##$USERP5= <user>
##$WDW= 1
##$XDIM= 32768
##$YMAX_p= 449212472
##$YMIN_p= -685759
##$CURPLOT= <Network HP LaserJet P1505>
##$CURPRIN= <$Network HP LaserJet P1505>
##$DFORMAT= <normdp>
##$LAYOUT= <+/1D_H.xwp>
##$LFORMAT= <normlp>
##$PFORMAT= <normpl>
##$SURQMSG= 1
$$ End of Bruker specific parameters
$$ ---------------------------------
##NTUPLES= NMR SPECTRUM
##VAR_NAME=  FREQUENCY,     SPECTRUM/REAL,   SPECTRUM/IMAG
##SYMBOL=    X,             R,               I
##VAR_TYPE=  INDEPENDENT,   DEPENDENT,       DEPENDENT
##VAR_FORM=  AFFN,          ASDF,            ASDF
##VAR_DIM=   32768,         32768,           32768
##UNITS=     HZ,            ARBITRARY UNITS, ARBITRARY UNITS
##FACTOR=    0.250966925370066, 1,           1
##FIRST=     8223.43324360094, -98263,       -126033
##LAST=      0,             -56683,          45880
##MIN=       0,             -685759,         0
##MAX=       8223.43324360094, 449212472,    0
$$ Real data points
##PAGE= N=1
##DATA TABLE= (X++(R..R)), XYDATA
$$ [...]
$$ plain form
19596 -261880 28172 -10242 -48698 54176 200481 -101159 -143981 -173032 -196998 -231898 -105091
19584 -37258 49281 -208615 -175368 -115555 -153809 276880 -47158 98686 225648 99787 -2989
19572 -189715 -60740 -190025 -69310 113399 -133451 -360483 166274 95980 -19157 -246370
19562 -246370 -16990 84540 -88625 138579 -130117 -341 69548 65474 218380 250540 78379
19550 47865 -237367 138514 53638 -78798 -346238 -372408 -327632 19742 150306 -159242 -249039
19539 -249039 -22549 -142583 -74256 117429 182354 -130977 -110600 66733 155780 112111 224027
19528 224027 -112869 -362519 -66730 -283873 61184 119714 138403 -331900 172649 -203563
19517 78730 -278668 -269429 97967 -205985 -161498 -76537 -27545 10274 71126 -146090 41296
$$ packed form
19596b61880B8172a0242l8456E4176J46305a01159m2822k9051k3966l4900a05091
19584c7258D9281b08615L3247N9813l8254B76880d7158I8686J26962I9787b989
19572a89715f0740j29285f9310A13399a33451k27032A66274p0294a9157k27213
19562b46370a6990H4540h8625A38579a30117c41F9548m074J52906L2160G8379
19550D7865b37367A38514E3638g8798k67440k6170M4776A9742J30564a59242q9797
19539b49039b2549j20034O8327A17429O4925a30977K0377F6733Q9047m3669J11916
19528B24027a12869k49650f6730k17143F1184N8530J8689c31900A72649b03563
19517G8730b78668R239I7967b05985M4487g6537b7545A0274O0852a46090D1296
$$ plain form
19505 -114977 -177376 -26510 -152632 -137238 100678 115621 169943 -130847 359128 -144483
19494 -220646 15886 -130045 16958 -372218 -60421 -181798 -76987 120076 -97955 11502 -11514
19482 27100 -165809 85159 56619 -190492 3439 -103508 125026 50619 60910 75625 13507
19470 78265 -272179 -147032 318579 -133471 8279 -251072 -15988 -551721 106071 -85474
19459 -27717 -186091 17743 -299589 -96498 72454 -85908 334351 -221633 59863 -107987 -311163
19448 -311163 -82560 -18141 86515 -272450 122820 105690 -133879 -217159 -17809 -51638 -263377
19437 -263377 78904 -187568 -13108 -40040 10677 246812 -300056 19277 138303 -322698
19426 -203160 100988 19009 72069 118236 284523 -37262 -335794 -255121 -113736 -165466 77168
$$ packed form
19505a14977o2399b6510j26122J5394A00678J4943N4322a30847C59128a44483
19494b20646A5886a30045A6958c72218f0421j21377g6987A20076i7955A1502a1514
19482B7100a65809H5159k8540a90492C439a03508A25026E0619J0291J4715A3507
19470G8265b72179J25147C18579a33471H279b51072a5988n35733A06071h5474
19459b7717j58374A7743b99589i6498G2454h5908C34351b21633E9863a07987k03176
19448c11163h2560a8141H6515b72450A22820j7130a33879q3280a7809l3829k11739
19437b63377G8904a87568a3108k6932A0677K36135c00056A9277J19026c22698
19426b03160A00988A9009N3060M6167J66287c7262k98532Q0673a13736n1730G7168
$$ plain form
19414 -69715 59248 -121646 -94568 -20880 -55598 -210774 -131824 340613 -10000 -57077 -34763
19403 -34763 286103 -139048 193149 -77083 216935 -1554 56585 213797 84015 -113132 -291355
19392 -291355 -186451 -68296 -94549 -73126 -44914 -73668 -237649 -133804 -22229 91365 140101
19381 140101 160897 159749 -38464 -118582 -77195 -110468 -235677 -48852 532357 178048 29071
19369 -3262 138093 -83315 -30500 240739 136768 -232707 -262857 144021 228406 -18148 111403
19357 24540 -23352 -233399 -106768 -75036 -83784 153784 -81093 -257166 140570 -270040 -6583
19345 -35383 -135726 83647 -254890 176873 223130 66823 -25939 61120 86838 106022 -22227
19333 192398 170978 25532 -358391 82622 -174009 -12911 -121690 -215538 177285 -3910 -270026
$$ packed form
19414f9715E9248a21646K7078b0880l4718j55176P8950C40613a0000m7077K2314
19403c4763B86103a39048A93149g7083B16935a554E6585J57212H4015a13132j78223
19392b91355J04904f8296k6253K1423K8212k8754j63981J03845b2229I1365M8736
19381A40101K0796j148c8464q0118M1387l3273j25209d8852E32357A78048B9071
19369c262A38093h3315c0500B40739j03971b32707l0150A44021Q4385a8148A11403
19357B4540b3352k10047a06768L1732q748A53784h1093j76073A40570b70040f583
19345c5383j00343H3647b54890A76873M6257F6823b5939F1120K5718J9184b2227
19333A92398k1420B5532c58391H2622a74009a2911j08779r3848A77285c910k66116
$$ plain form
19322 -270026 -43881 -177128 11075 -73998 -13003 -203917 -93810 -352820 -123724 -90501 57963
19310 13948 -1714 -156973 -176216 -202295 198997 -22456 -145144 83289 188048 145482 -83755
19298 43261 180904 -35000 36745 -42557 155395 14728 24098 -172668 -21996 75093 -55593
19286 65443 -58442 -109253 160130 -323500 83476 -62052 -74409 -2785 -149384 98755 131668
19275 131668 -141358 169847 -81450 -112559 -108128 -137061 53089 -174284 100086 -101540 60186
19263 -65066 -152767 -89110 -28990 93009 30872 -148572 -113456 178249 158639 -1673 -78955
19252 -78955 71588 -121105 62285 -224689 -123983 55881 -16573 -316679 -67688 -417087 -176082
19240 148312 -47410 -78715 155058 -417474 156881 -158559 -239314 46200 128884 217315 -65772
$$ packed form
19322b70026d3881j33247A1075g3998a3003j90914i3810k59010a23724L3223E7963
19310A3948a714j55259j9243k6079A98997b2456j22688H3289J04759m2566h3755
19298D3261J37643c5000C6745d2557A55395A4728R370a72668b1996G5093e5593
19286F5443e8442n0811A60130c23500H3476f2052j2357b785j46599I8755L2913
19275A31668a41358A69847h1450l1109M431k8933E3089a74284A00086a01540F0186
19263f5066q7701O3657b8990I3009C0872a48572L5116A78249j9610a673p7282
19252g8955G1588a21105F2285b24689J00706E5881a6573l00106f7688l49399a76082
19240A48312d7410l1305A55058d17474A56881a58559q0755D6200Q2684Q8431f5772
$$ plain form
19228 -183363 266761 275729 137445 83111 63355 14273 39208 69331 348000 169033 -37201
19216 189757 -116523 114501 -345465 218404 -166579 -91433 44794 -105119 -140075 111940
19205 -21165 -169938 104481 299782 158628 25111 -359833 -127107 -155099 -106728 28816
19194 32824 42076 8414 -225325 -7196 -221260 -150899 2354 3363 59709 -112991 -123707 52438
19181 27982 -94947 3348 -83143 -215753 -30999 -68761 -58270 -4366 -304103 -460010 45945
19169 -232538 149426 81744 -154281 -159340 137658 116623 -197620 65610 -104142 52253 -67701
19157 -59506 -101945 307189 63466 50890 145708 -135403 250903 -89540 -90963 -228806 -112364
19145 -45311 -28294 -43564 -67535 -26088 151697 46585 -155237 -95161 148763 -104874 207266
$$ packed form
19228a83363B66761Q968A37445n4334j9756A4273K4935L0123K78669A69033c7201
19216A89757a16523A14501c45465B18404a66579P5146D4794a05119l4956A11940
19205b1165j48773A04481J95301j41154B5111c59833a27107k7992M8371B8816
19194C2824R252H414b25325g196k14064P0361B354J009N6346a12991j0716E2438
19181B7982i4947C348h3143j32610c0999l7762J0491d366k99737j55907D5945
19169b32538A49426o7682a54281n059A37658k1035a97620F5610a04142E2253f7701
19157e9506m2439C07189F3466j2576R4818a35403B50903h9540j423j37843a12364
19145d5311J7017j5270k3971b6088A51697D6585a55237O0076A48763a04874B07266
$$ plain form
19133 150126 -157716 189207 -6832 -28343 -210133 -130000 -5328 -57691 47292 265160 145645
19122 145645 -279227 -20098 -54957 -188194 3819 -290205 156514 98223 -219907 50265 -322233
19110 92799 -70922 -18267 -34419 -204912 -255835 341540 -142341 -244906 -152734 96722 -180296
19098 -108554 183456 -78122 -269387 137081 21060 -87187 153534 -64341 133561 -250939
19087 -151950 -120859 -260237 -169971 84622 54695 48135 -502661 -66994 -14588 288087 -5341
19075 -269787 180820 -299783 51036 171172 -197997 40925 -225811 -124164 -136834 50438
19064 -43108 -324609 -160165 216218 123311 -18784 -46740 -151840 42299 -66793 -116367 -70936
19053 -70936 -271148 -151547 -440893 -82540 76783 -78042 169006 184986 129816 -192743 -79008
$$ packed form
19133A50126a57716A89207f832k1511j81790Q0133e328n2363D7292K17868j19515
19122A45645b79227b0098l4859j33237C819b90205A56514n8291b19907E0265c22233
19110I2799g0922a8267j6152j70493n0923C41540a42341j02565R2172I6722a80296
19098a08554A83456g8122j91265A37081B1060h7187A53534f4341A33561b50939
19087a51950L1091j39378R0266H4622k9927o560e02661f6994a4588B88087e341
19075b69787A80820b99783E1036J20136a97997D0925b25811J01647j2670E0438
19064d3108k81501a60165B16218r2907a8784k7956j05100D2299f6793m9574M5431
19053g0936k00212J19601k89346h2540G6783g8042A69006J5980n5170a92743g9008
$$ plain form
19041 -90250 -14320 40236 -183731 -158135 30657 -75676 -304587 -81177 -16139 -243537 188208
19029 293145 67858 82028 44006 190038 139680 193018 -36544 343468 240501 -92690 63552
19017 -70754 -286941 -287032 140114 46645 90215 -23592 -156639 -253670 54401 220530 -277568
19005 57625 219936 -203038 -306625 -142509 -129846 -321358 167696 -37309 -46046 -155228
18995 -155228 -266308 131500 -116272 -232622 -9208 -86375 -212906 140346 -93215 -244808
18985 -244808 10463 -276179 85726 192172 235540 -32504 -221286 7075 158939 257719 -170118
18973 -126411 181934 -28414 -319449 -73421 -109049 -242227 224429 147992 -234406 -251683
18963 -251683 164083 128286 -232055 -260782 162192 -177615 281453 -28527 -102968 160231
$$ packed form
19041i0250a4320D0236a83731K5596C0657g5676k28911h1177a6139k27398A88208
19029B93145F7858J4170l8022J46032n0358N3338c6544C43468j02967i2690F3552
19017g0754k16187r1A40114D6645M3570b3592j33047r7031E4401J66129b77568
19005E7625J62311b03038j03587a42509J2663j91512A67696c7309q737j09182
18995a55228j11080A31500a16272j16350i208p7167j26531A40346i3215j51593
18985b44808A0463b76179H5726J06446M3368c2504j88782G075J51864R8780a70118
18973a26411A81934b8414k91035g3421l5628j33178B24429p6437b34406j7277
18963b51683A64083l5797b32055k8727A62192a77615B81453b8527p4441A60231
$$ plain form
18952 130953 20207 -73504 66261 -258605 196372 -110257 118686 -212250 41685 72172
18942 72172 -695 16 227487 84304 -223852 -63414 7144 -309915 -37183 -135427 -16477 -66763
18930 -66763 212622 -112051 -142338 111874 -50404 33729 -91310 -246823 294617 108022
18919 -308209 -225641 -46338 -115522 -213996 114663 126709 -57798 -6657 307988 -22479 66185
18907 9772 -243589 123539 -75125 -176058 130689 44795 -169236 -159723 -47174 -22066 -299004
18896 -299004 272510 -295111 39024 55712 100539 150920 117173 -194697 -62142 168815 27655
18884 -409637 115400 -514013 15160 -82028 -163478 -170594 33161 -169681 111472 28992 5720
18872 165045 -65640 -156826 -284693 190253 247702 102320 -93107 -143849 -348152 -271017 61657
$$ packed form
18952A30953B0207g3504F6261b58605A96372a10257A18686b12250D1685L0487
18942G2172f95A6K27471H4304b23852f3414G144c09915c7183r8244a6477n0286
18930f6763B12622a12051l0287A11874e0404C3729i1310j55513B94617A08022
18919c08209Q2568d6338o9184r8474A14663J2046e7798f657C07988b2479F6185
18907I772b43589A23539g5125j00933A30689D4795a69236R513d7174b2066k76938
18896b99004B72510b95111C9024J6688M4827N0381l3747a94697f2142A68815B7655
18884d09637A15400e14013A5160h2028q1450p116C3161a69681A11472B8992E720
18872A65045f5640r1186j27867A90253N7449A02320i3107n0742k04303P7135F1657
$$ plain form
18860 115793 -170665 76431 -8901 316415 -309327 -134886 -48464 -163536 -404768 -86788
18849 -179456 -341346 -193671 155879 -2363 -83130 61908 -49782 -200461 -152009 -190056 -6306
18837 77286 191051 74052 -220931 -26825 85643 16670 -257499 -145643 -13635 137063 -423063
18825 -38436 120200 -51551 -17829 -70632 -278342 23224 33926 -6442 101439 -206341 34165
18813 -51885 6745 147624 14547 288599 257874 11354 22601 -83226 -61683 80301 -308572
18801 -128522 86190 106848 196622 -61577 -284561 -207904 43984 -57749 -106969 -212338 288655
18789 -133054 -68524 -40376 337466 119312 47090 -238332 -9853 -520673 132302 -184897
18778 -104560 -220109 -121376 -344423 80232 -221767 -67029 -52044 -220086 -93390 196164
$$ packed form
18860A15793a70665G6431h901C16415c09327a34886d8464j15072k41232h6788
18849a79456j61890J47675A55879b363q0767F1908d9782j50679M8452l8047f306
18837G7286J13765G4052b20931b6825H5643A6670b57499J11856a3635A37063d23063
18825c8436A20200e1551a7829n2803k07710B3224J0702f442A01439b06341C4165
18813e1885F745J40879A4547K74052l0725A1354J1247h3226K1543H0301c08572
18801a28522H6190K0658Q9774f1577k22984P6657D3984e7749m9220j05369B88655
18789a33054O4530K8148C37466A19312D7090b38332i853n10820A32302a84897
18778a04560j15549R8733k23047H0232b21767f7029J4985j68042i3390A96164
$$ plain form
18767 -266362 -15774 -288665 2188 166656 132527 -99528 -38123 276722 -33466 113404 -231177
18755 -81334 -243220 -118222 -24779 -298665 -62385 -206872 38246 -118159 -59271 -131245 -182640
18744 -182640 57401 95955 -109747 130393 -2736 -230053 139254 -100507 -65425 -69639 182656
18732 6824 -175970 -81108 -56461 267448 24406 -116852 -173470 -305481 118317 133118 -21162
18720 123127 78901 -108713 24122 -25801 212988 200292 64077 -9400 61460 -225164 -163574
18709 -163574 -188903 -74666 1440 -303869 -218206 -182635 -175802 227935 21445 166125 81253
18697 -5239 54158 -200806 -83588 172198 -178130 365389 -126105 -85368 280811 -319316
18686 -35148 54079 -50165 -42193 -172647 -243975 -63289 -143622 32883 -5128 -219539 -113359
$$ packed form
18767b66362a5774k72891B188J64468l4129i9528c8123B76722c3466A13404b31177
18755h1334j61886a18222b4779k73886f2385j44487C8246a18159N8888p1974n1395
18744a82640E7401L8554a09747A30393b736k27317A39254a00507L5082m214A82656
18732F824a75970h1108K4647B67448B4406a16852n6618j32011A18317J4801b1162
18720A23127m4226a08713B4122b5801B12988j2696F4077i400F1460b25164O1590
18709a63574k5329g4666A440c03869Q5663L5571O833B27935B1445J44680H1253
18697e239E4158b00806h3588A72198a78130C65389a26105M0737B80811c19316
18686c5148E4079e0165P972j30454p1328f3289q0333C2883e128k14411J06180
$$ plain form
18675 -113359 -126303 -90539 -321229 182443 52093 160989 -364263 -85327 262668 -5245 -178740
18664 -178740 -180033 403447 -311295 2559 209044 -364878 30125 -175445 -169461 -157760 -165363
18653 -165363 -160990 -77856 -5669 118893 -222691 -457188 -190406 -108399 130699 -108462 20657
18641 -8718 67076 -70222 -51228 -25274 -258622 -73964 52266 -263720 -94145 91569 174139
18630 174139 -16549 -103365 -56569 -185173 -328879 -219899 -51713 -149144 242676 -119677
18619 -166760 217776 -36521 -108646 -182765 84990 245110 307331 101329 -292102 -92975 -70497
18608 -70497 169918 183956 -14520 -153135 -4964 269543 148968 187987 63533 -521868 -260903
18596 -75586 70431 25922 -124854 -236095 32864 35441 -85110 -46233 -92709 -87292 -28221 -246817
$$ packed form
18675a13359j2944L5764k30690A82443E2093J08896c64263h5327B62668e245j73495
18664a78740j293D03447c11295B559K06485c64878C0125a75445N984J1701p603
18653a65363M373g7856e669A18893b22691k34497a90406Q2007A30699a08462B0657
18641h718F7076g0222J8994b5274k33348g3964E2266b63720i4145I1569Q2570
18630A74139a6549q6816M6796j28604j43706J08980e1713r7431B42676a19677
18619a66760B17776c6521p2125p4119H4990J60120O2221A01329b92102i2975K2478
18608g0497A69918J4038a4520j38615d964B69543j20575L9019F3533e21868b60903
18596g5586G0431B5922a24854j11241C2864K577h5110L8877m6476N417b8221k18596
$$ plain form
18584 -246817 -166688 -67094 174835 -158379 113301 -341984 -186277 -24163 -208545 -133487
18574 -133487 -8237 53395 -301 166202 204312 105347 -190236 -121694 145140 220191 -25118
18562 -69926 246092 12484 -38150 -267783 92324 -69390 -88166 6237 -175326 214078 -203070
18550 -225046 -70745 -6742 180694 -133155 -268507 -186672 -250532 142038 246645 333447 -128664
18538 172249 -162598 27913 -117966 -123987 194108 -363240 94363 -172425 81222 -106407
18527 -37816 242833 182604 -35819 -250107 23154 237693 -241090 157548 -144425 -95950
18517 -95950 123545 -31996 -76102 72270 -148232 -45478 -7219 56887 -292266 -199347 -150796
18506 -150796 155130 13448 -211862 -81651 50383 -42368 -94352 -429824 -52116 -214333 -31627
$$ packed form
18584b46817Q0129f7094A74835a58379A13301c41984J55707b4163j84382P5058
18574a33487h237E3395c01A66202L8110r8965a90236O8542A45140P5051b5118
18562f9926B46092A2484c8150k29633I2324f9390j8776F237a75326B14078b03070
18550b25046g0745f742A80694a33155j35352Q1835o3860A42038J04607Q6802a28664
18538A72249a62598B7913a17966o021A94108c63240I4363a72425H1222a06407
18527c7816B42833o0229c5819k14288B3154K14539b41090A57548a44425M8475
18517i5950A23545c1996m4106G2270a48232d5478g219E6887b92266R2919M8551
18506a50796A55130A3448b11862h1651E0383d2368n1984l35472e2116j62217c1627
$$ plain form
18494 -162774 42064 69266 -4085 -34584 -66648 176807 24489 176130 -147044 -15635 193013
18482 -326770 67958 -130077 -222814 -57085 -264609 167555 -186825 -125354 -39943 -251160
18472 -251160 47406 69217 -212 -134940 -293237 22815 227831 -24356 -149123 170258 137787
18461 137787 -88341 177527 -158844 -131455 -50658 -133031 22719 -258056 -139623 -9783 63128
18449 -223279 -196153 -120067 -32794 -160584 -218228 -18071 -385834 -237988 -130683 -108627 -110363
18438 -110363 -6478 -544058 98998 -69836 53440 -132148 -156184 -105537 -354683 -304759 48219
18426 -236595 349606 -50702 -155924 -147160 -36628 26713 76425 99641 108693 -105370 198357
18414 -103633 260782 74089 -33106 -351726 -379760 -29865 130394 -102541 325818 82061
$$ packed form
18494a62774D2064K7202d085l0499l2064A76807B4489J51641a47044a5635A93013
18482c26770F7958a30077r2737e7085k07524A67555a86825O1471c9943k11217
18472b51160D7406K1811b12j34728j58297B2815K05016b4356j24767A70258l2471
18461A37787h8341A77527a58844K7389e0658q2373B2719b58056J18433i783F3128
18449b23279K7126P6086c2794j27790n7644a8071l67763J47846J07305K2056j736
18438a10363f478n37580I8998f9836E3440a32148k4036N0647k49146M9924D8219
18426b36595C49606e0702j05222Q764c6628B6713M9712K3216R052a05370A98357
18414a03633B60782G4089c3106l18620k8034b9865A30394a02541C25818H2061
$$ plain form
18403 90771 -183165 -449706 -97391 -114971 -204213 -252346 -148303 6636 8257 77128 -214962
18391 -90219 -31089 -55819 -162904 236597 -138396 52534 -271790 157119 118228 -388384
18380 -208306 4673 84724 -4053 -34146 150488 -98918 212007 -235641 45900 -102261 76194
18368 227017 -95683 58959 350173 159103 -77118 -272156 320165 101743 165819 -259181
18357 128561 -178689 -359386 -268826 -65298 -78697 -135218 -115283 -127099 139184 -27916 -66513
18346 -66513 -31664 -67967 -268574 -178174 -9879 -75163 -12297 -92721 231406 -92262 140723
18334 -137120 -67381 39723 82628 11180 -105989 214772 -75663 -26361 -270811 -112491 209211
18322 -27214 -377 -216645 -154607 -210009 346317 -121035 -70659 -180073 -124577 198500 156024
$$ packed form
18403I0771a83165k66541i7391j7580q9242m8133J04043F636J621O8871b14962
18391i0219c1089k4730j07085B36597a38396E2534b71790A57119l8891c88384
18380b08306D673Q0051d053l0093A50488i8918B12007b35641D5900a02261G6194
18368B27017i5683E8959K91214A59103g7118j95038C20165A01743O4076b59181
18357A28561a78689j80697R0560f5298j3399n6521J9935j1816A39184b7916l8597
18346f6513c1664l6303k00607R0400i879o5284a2297q0424B31406i2262A40723
18334a37120f7381C9723M2905A1180a05989B14772g5663b6361k44450a12491B09211
18322b7214c77k16268O2038n5402C46317a21035N0376j09414N5496A98500m2476
$$ plain form
18311 156024 -90367 130261 133354 -67976 164401 141095 207917 220762 21906 -82141 -120192
18300 -120192 232558 152293 -39488 -167584 -324693 -50462 -47528 -228982 -59767 -47960 55839
18288 -163482 -121963 -64569 -97393 -114738 -316600 -323315 -86208 -106504 100177 244976 -154826
18276 118775 73294 210478 68145 -32068 -63531 -158572 -25107 40018 71984 -256581 -244566
18265 -244566 -320529 -27751 -39592 -123209 169510 180015 -3190 82667 -145852 -209551 159673
18253 -171921 -103687 328673 -123536 16592 -54371 -80797 -204571 -171610 268531 159509
18243 159509 -4483 -318818 -53358 -208761 194128 -114105 -54910 -39679 113198 -119663
18232 -126062 -102225 39005 -230222 -247534 200553 362388 -20775 33288 310702 -19525 -31719
$$ packed form
18311A56024i0367A30261L093f7976A64401k3306O6822J2845B1906h2141l8051
18300a20192B32558q0265c9488j28096j57109e0462K934j81454e9767J1807E5839
18288a63482M1519N7394l2824j7345k01862o715h6208k0296A00177J44799a54826
18276A18775m5481J37184F8145c2068l1463r5041b5107D0018L1966b56581J2015
18265b44566p5963b7751j1841q3617A69510J0505c190H2667a45852o3699A59673
18253a71921O8234C28673a23536A6592e4371k6426j23774L2961B68531j09022
18243A59509d483l14335e3358j55403A94128a14105e4910J5231A13198a19663
18232a26062K3837C9005b30222j7312B00553J61835b0775C3288K77414a9525j2194
$$ plain form
18221 -31719 -317640 174296 -116606 -78833 -57982 -177149 -280112 -103616 4846 -251002
18210 -32816 -105500 -245479 -76 -205387 161030 -95462 -57178 -62704 140755 -30780 23624 3124
18197 -59458 102624 -168429 -13260 28367 -416071 16681 -120516 133113 52785 164477
18187 164477 259749 42047 47360 115807 76738 -85195 -48419 167183 -138024 -18725 -155423
18176 -155423 -151587 -181805 -102862 -17366 178704 68475 -365634 156024 -146896 163412 -6399
18164 -179903 -360403 45102 -123249 217127 -98944 -16170 -54404 -111644 -274381 53803 -76615
18152 -76559 -23745 29796 -102264 -219929 -124533 -4922 69984 -75617 -75320 250863 -453121
18140 -42278 -126102 -157085 201627 84776 -131652 109604 -28732 126674 -272649 148701
$$ packed form
18221c1719k85921A74296a16606L7773K0851j19167j02963a03616D846b51002
18210c2816p2684j39979g6k05311A61030i5462L8284n526A40755c0780B3624C124
18197e9458A02624a68429a3260B8367d16071A6681a20516A33113E2785J11692
18187A64477R5272D2047N313O8447l9069h5195L6776A67183a38024a8725j36698
18176a55423L836l0218P8943a7366A78704F8475c65634A56024a46896A63412f399
18164a79903j80500D5102a23249B17127i8944a6170l8234n7240j62737E3803g6615
18152g6559b3745B9796a02264j17665R5396d922F9984g5617K97B50863d53121
18140d2278q3824l0983B01627H4776a31652A09604b8732A26674b72649A48701
$$ plain form
18129 -59768 -190775 -172793 -387911 -56739 -2857 118892 79217 -176105 189140 57284 64677
18118 64677 133746 -108313 37695 186281 6997 348384 118128 -17210 -116 -204655 -194953
18107 -194953 -163970 -3903 -4457 96236 -28650 -21935 65166 -9244 25795 -27465 -22962 -13274 -126614
18094 -126614 130615 -61091 -225314 381611 -89435 13500 179902 80142 42957 66173 116991
18083 116991 -545789 -215159 65421 -203952 38765 -133621 -34350 -63939 70372 -97287 95566
18071 -45187 -51339 -200831 22998 53909 -29638 -335497 311638 -25388 140593 -239495 54266
18059 116712 -140616 -33731 -87522 77067 -46882 40182 -263938 -2934 -372810 -165669 -312473
18048 -312473 -68889 9239 -254495 -116089 57652 -92157 -155024 -218379 364380 -86014 9579
$$ packed form
18129e9768j31007J7982k15118e6739b857A18892l9675a76105A89140E7284P393
18118F4677O9069a08313C7695J48586F997L41387A18128a7210a16k04539R702
18107a94953L0983c903n54I6236b8650O715F5166i244B5795b7465M503R688j13340
18094a26614A30615f1091j64223C81611h9435A3500J66402H0142l7185K3216N0818
18083A16991e45789b15159F5421b03952C8765a33621c4350k9589G0372i7287I5566
18071d5187o152j49492B2998L0911b9638l05859C11638b5388A40593b39495E4266
18059A16712a40616c3731n3791G7067d6882D0182b63938b934l69876a65669j46804
18048c12473f8889I239b54495a16089E7652i2157o2867o3355C64380h6014I579
$$ plain form
18036 34196 -167739 32351 77645 -162837 232358 -174129 13556 -84246 -134976 -125188 18265
18024 126799 68429 -65509 -263583 127122 74058 100584 -54250 -19350 259778 -197704 26022
18012 16140 4906 104675 113158 -213108 -232729 223296 -8758 -108886 -296536 -250834 -120038
18000 -137268 43404 -195247 108133 -229549 -2785 35815 -344345 -118973 111839 -67031
17989 174973 73271 -208218 78271 78840 -14814 -24496 -74000 18580 133277 188182 258186 -138865
17976 -2832 -42230 -160514 119423 -66102 50372 -144283 -127340 16342 -433702 -175029 -217215
17965 -217215 -81057 196674 -53041 -65084 -98777 -204608 167041 103436 -410125 102304
17954 52344 184973 105244 -281657 -193559 117374 -159829 -31269 158518 -139636 -247320
$$ packed form
18036C4196a67739C2351M5294a62837B32358a74129A3556h4246n0730R788A8265
18024A26799n8370f5509j98074A27122n3064K6526e4250a9350B59778a97704B6022
18012A6140D906R9769Q483b13108j9621B23296h758j00128j87650M5702a20038
18000a37268D3404a95247A08133b29549b785C5815c44345a18973A11839f7031
17989A74973G3271b08218G8271N69a4814r682m9504A8580J14697N4905P0004a38865
17976b832l9398j18284A19423f6102E0372a44283J6943A6342d33702a75029m2186
17965b17215h1057A96674e3041j2043l3693j05831A67041o3605d10125A02304
17954E2344J32629p9729b81657Q8098A17374a59829c1269A58518a39636j07684
$$ plain form
17944 -247320 294656 -186923 21643 78462 95625 -180634 -71878 57140 537 215302 85578
17932 -76452 357452 56659 34617 40881 -108745 -208433 142971 188464 410352 -39812 -46704
17921 -46704 95295 179495 57530 -150230 45414 -158657 -176987 -254550 67329 96870 -141116
17909 -133308 -396867 -142281 -7088 -27784 -261055 -183910 23584 87660 35932 441100 61741
17897 370884 73672 120869 -30728 -217565 134416 -136652 -138166 -119585 65788 -59397 240655
17885 10740 -124694 213621 34318 196960 -109690 119453 153310 -53421 -96823 99798 -38724
17873 70640 255318 -62854 -56102 131045 73880 401220 108674 357052 -331635 -407906 -256030
17862 -256030 145141 313383 -92688 -87988 -103294 -523522 171218 -24669 63618 -236163 -99832
$$ packed form
17944b47320B94656a86923B1643N6819J7163a80634g1878E7140E37K14765H5578
17932g6452C57452E6659k2042O264a08745r9688A42971M5493K21888c9812o892
17921d6704I5295Q4200E7530a50230D5414a58657j8330p7563F7329K9541a41116
17909a33308k63559a42281g088k0696k33271P7145B3584O4076C5932M05168F1741
17897C70884G3672M7197c0728j86837A34416a36652j514J8581F5788e9397B40655
17885A0740a24694B13621C4318J62642a09690A19453L3857e3421m3402I9798c8724
17873G0640J84678f2854O752A31045n7165L27340A08674K48378c31635p6271J51876
17862b56030A45141J68242i2688M700j5306m20228A71218b4669F3618b36163i9832
$$ plain form
17850 228827 -80911 -218088 -102526 -9542 -88231 8166 -197006 386752 -231637 -190868 100547
17838 -155910 -195442 99593 54420 214428 -138883 157479 40186 135911 -227720 129367
17827 194840 151579 -114677 -1569 -152572 -184514 105207 -217386 -77635 -44098 165765 -29372
17815 122740 106935 -196973 -2546 6226 -71575 121963 -268981 -110868 -45150 -104122 -11335
17803 164395 149822 32777 -67684 -252188 -14858 270932 158952 -34430 156966 -96530 27053
17791 7455 164080 172296 -41861 -25426 299995 31020 264805 -231569 12979 -280601 13523
17779 73794 185634 7945 117118 -239922 -32704 59431 233943 379770 -148274 21087 -250560
17767 -40002 70425 67174 -130429 259300 -92416 -55430 -230791 340845 38772 -44350 -259504
$$ packed form
17850B28827h0911j37177a02526i542p8689H166a97006C86752b31637M0769A00547
17838a55910l9532I9593m5173J60008a38883A57479D0186R5725b27720A29367
17827A94840m3261a14677a569j51003l1942A05207b17386g7635L3537A65765b9372
17815A22740j5805a96973b546F226g1575A21963b68981a10868d5150n8972a1335
17803A64395j4573C2777f7684j84504a4858B70932j11980c4430A56966i6530B7053
17791G455J56625Q216d1861J6435B99995C1020K33785b31569A2979b80601A3523
17779G3794J11840G945J09173b39922c2704E9431J74512J45827a48274B1087b50560
17767d0002G0425l251a30429B59300i2416L6986j75361C40845C8772d4350k15154
$$ plain form
17756 -259504 -142820 383100 -20839 222364 -72423 3735 76497 65777 -72932 42004 4331
17744 2969 149962 36369 -166146 -318112 -48127 -202885 -401588 64529 135042 -213783 8017
17732 247728 65552 -34277 146244 15393 67450 -120514 -94215 11252 79036 -106619 -102723
17721 -102723 -164518 93676 -200389 -20244 192144 -245386 8431 46109 -218816 76552 -219075
17709 260604 -196227 -337 29991 24009 64039 -16108 -121621 -48067 117162 220974 57307
17697 -198883 -131192 104039 -173347 -31467 68730 133701 206920 -77540 205373 86624 83882
17686 83882 142870 -124347 242758 327855 242295 376951 43866 39423 -255164 -140490 128533
17674 220063 5470 111810 372180 44411 -327419 346563 -231075 121796 -148655 117650
$$ packed form
17756b59504J16684C83100b0839B22364g2423C735P2762j0720g2932D2004D331
17744B969J46993C6369a66146j51966d8127j54758j98703F4529P0513b13783H017
17732B47728F5552c4277A46244A5393N2057a20514K6299A1252O7784a06619L896
17721a02723o1795I3676b00389b0244A92144b45386H431L7678b18816G6552b19075
17709B60604a96227c37B9991n982M0030a6108j05513d8067A17162J03812E7307
17697a98883O7691A04039a73347c1467F8730O4971P3219g7540B05373H6624k742
17686H3882N8988a24347B42758Q5097q5560J34656D3866m443b55164J14674A28533
17674B20063E470J06340K60370D4411c27419C46563b31075A21796a48655A17650
$$ plain form
17663 2747 -168014 -177172 129276 65422 -96982 175956 99656 -175721 115188 80307 65769
17652 65769 -22844 -83608 105407 -46417 69003 209080 -118217 148973 29592 -86213 369228
17640 194047 233386 330706 -69689 -303851 103729 -322223 -161509 -338874 38859 27823
17630 27823 -65945 -30665 214411 161436 131987 299925 48549 217734 -279159 -20354 -263817
17619 -263817 -174526 -43105 -305361 -63306 14901 -48335 -29804 -93147 344364 59131 -48871
17607 -19429 -75662 -202771 -117167 -34852 98214 -107168 325600 135585 -11721 -10907 -150267
17596 -150267 -62460 -86671 -58085 69520 -27758 -260738 12678 189144 298865 4491 10411
17585 10411 -349455 -37852 145214 144439 142953 20049 18542 -10532 -359941 -22874 -74688 -32063
$$ packed form
17663B747a68014r158A29276o3854i6982A75956p6300a75721A15188l4881j4538
17652F5769b2844o0764A05407d6417F9003J40077a18217A48973B9592h6213C69228
17640A94047L9339R7320f9689k34162A03729c22223J60714j77365C8859j1036
17630B7823f5945c0665B14411n2975k9449J67938D8549J69185b79159b0354k43463
17619b63817Q9291d3105k62256f3306A4901d8335J8531o3343C44364E9131d8871
17607a9429n6233j27109Q5604c4852I8214a07168C25600A35585a1721Q14j39360
17596a50267f2460k4211K8586F9520b7758k32980A2678J76466J09721D491N920
17585A0411c49455c7852A45214p75j486B0049j507a0532l49409b2874n1814c2063
$$ plain form
17572 -42121 -140942 212498 127315 64151 -493710 -45306 145533 -40422 29725 -5449 56623
17560 46387 -220957 -283511 -108547 -127074 -314129 -247954 2912 -103571 158119 -24896 260928
17548 179600 63473 -288256 248980 323290 347564 46820 -11987 311913 -69055 -1626 77879
17536 32026 319855 38310 266585 155020 136810 50360 171395 136413 58855 171524 4075
17524 80677 225835 -191990 422764 -136182 55256 26106 -27905 271202 205358 -55566 37429
17512 -108912 91505 -60785 93813 181438 92046 247307 -46414 67282 39377 88339 222277
17501 222277 75143 -286305 203762 98022 213504 251263 -45238 208726 263589 417331
17491 417331 89559 152412 84911 -56501 36731 284982 400754 152172 658683 836 22810
$$ packed form
17572d2121r8821B12498q5183o3164d93710d5306A45533d0422B9725e449E6623
17560D6387b20957o2554a08547j8527j87055O6175B912a03571A58119b4896B60928
17548A79600F3473b88256B48980P4310K4274D6820a1987C11913f9055a626G7879
17536C2026K87829C8310K28275j11565j8210E0360J21035l4982E8855J12669D075
17524H0677J45158a91990D22764a36182E5256B6106b7905B71202o5844e5566C7429
17512a08912I1505f0785I3813Q7625q9392J55261d6414F7282k7905M8962J33938
17501B22277G5143b86305B03762I8022J15482L7759d5238B08726N4863J53742
17491D17331H9559O2853o7501e6501C6731K48251J15772A52172N06511H36K1974
$$ plain form
17480 22810 384344 168820 35496 206197 -79450 114573 180624 164920 16991 38247 -90782
17468 162072 189685 -171604 -45192 173548 265205 262989 -199792 -99338 -145759 268163 -138923
17456 365672 -177802 226096 117872 208925 411793 547783 120796 157037 148223 176246
17446 176246 418573 35308 91569 366566 126373 490993 222104 289770 205443 248539
17436 248539 -42819 68831 -41782 17095 225186 300443 28759 150969 429853 162418 296285
17425 296285 299622 280204 150068 252525 -15416 554839 39296 113336 440929 354539 177683
17414 177683 323641 -148772 217646 255388 157047 267469 -99941 -323650 203775 -52505
17403 178284 281967 200815 13709 -233339 30651 362897 295574 186145 234467 318363 214021
$$ packed form
17480B2810L61534A68820C5496J70701g9450A14573O6051j5704A6991K1256i0782
17468A62072K7613a71604d5192A73548R1657k216a99792i9338m6421B68163a38923
17456C65672a77802B26096j08224R1053K02868J35990A20796L6241q814K8023
17446A76246K42327C5308N6261K74997A26373L64620B22104O7666q4327M3096
17436B48539d2819F8831d1782A7095K08091P5257B8759J22210K78884A62418J33867
17425B96285L337j9418j30136J02457a5416E54839C9296P4040L27593q6390j76856
17414A77683J45958a48772B17646L7742r8341J10422i9941k23709B03775e2505
17403A78284J03683q1152A3709b33339C0651L32246o7323j09429M8322Q3896j04342
$$ plain form
17392 214021 12610 374626 -128742 410521 -270893 329171 -17415 68619 283588 197244
17382 197244 99844 39117 56696 -71755 75678 -127258 75784 139045 90579 262744 192734
17371 192734 -29660 134229 154943 54167 427863 287930 -30755 203761 -247979 59873
17360 219020 241205 11050 -5841 -95055 -17776 179789 392478 46896 112332 118233 100237
17349 100237 365384 308931 411525 12645 125640 39919 -182281 305931 95924 -66331
17338 -131423 227994 320952 343519 247765 232332 -36031 54842 19362 62910 284996 78757
17326 56003 131218 41051 75056 48638 -133679 292735 -111540 -50147 248162 414460 -34133
17314 112872 -50277 56352 -329500 86255 52093 101434 -169036 380419 44850 303356 22707
$$ packed form
17392B14021A2610L62016a28742D10521b70893C29171a7415F8619K14969q6344
17382A97244r7400C9117J7579g1755G5678a27258G5784O3261m8466J72165p0010
17371A92734b9660A34229K0714E4167L73696j39933c0755B03761b47979E9873
17360B19020K2185A1050e841q9214a7776A79789K12689D6896O5436N901j7996
17349A00237K65147n6453J02594A2645J12995C9919a82281C05931I5924f6331
17338a31423B27994R2958K2567r5754j5433c6031E4842A9362M3548K22086G8757
17326E6003P5215D1051L4005k6418a33679B92735a11540e0147B48162J66298c4133
17314A12872e0277E6352c29500H6255l4162M9341a69036C80419D4850K58506B2707
$$ plain form
17302 71104 -160566 399221 -71423 311911 -73164 -41626 -123607 310884 47460 -134740 397639
17290 16236 -80482 378121 381370 372714 262865 -8707 -313714 84352 -32085 -122478 28442 -178770
17277 25510 -142194 54437 -5175 42400 -87584 106804 179404 37156 16229 347844 -71553
17265 -110479 -39153 -11948 310731 78070 126020 117168 179062 -352213 -26714 71605 238618
17254 238618 216969 313163 155056 132205 -86370 240131 115680 79764 275870 193226 -31831
17242 161771 178251 241367 -62923 217298 -95545 323203 157277 76777 -4108 -116765 67883
17230 151621 197780 156461 258439 389362 105487 204367 93061 58377 41295 -11215 204054
17218 61109 7365 215519 346392 162485 -112889 244485 351146 167636 -23253 11488
$$ packed form
17302G1104a60566C99221g1423C11911g3164L1538q1981C10884D7460a34740C97639
17290A6236h0482C78121L249q656j09849h707l05007H4352c2085r0393B8442a78770
17277B5510a42194E4437e175D2400h7584A06804P2600C7156A6229L31615g1553
17265a10479c9153a1948C10731G8070M7950q852O1894c52213b6714G1605J67013
17254B38618k1649R6194A55056k2851h6370B40131A15680l5916J96106q2644c1831
17242A61771J6480O3116f2923B17298i5545C23203A57277G6777d108j12657F7883
17230A51621M6159m1319J01978J30923A05487R8880I3061l4684j7082a1215B04054
17218F1109G365K08154J30873A62485a12889B44485J06661A67636b3253A1488
$$ plain form
17207 190248 317395 109843 91602 -1488 -245507 171860 550634 369284 191321 265615
17197 265615 -91577 330732 233783 89862 54977 243510 94481 330285 141533 151014 21760
17185 85544 -55654 -152825 108712 648922 -115453 -110408 131255 64206 37451 191580 200041
17174 200041 -31 346399 174753 278382 322483 -71246 126963 406089 168379 -44863 31809
17162 14493 181648 187654 168835 -24788 295375 245316 -218046 304574 286255 93872 -9568
17150 246548 -75742 281826 75978 151110 -173382 -15705 205477 398617 312434 315051 565829
17139 565829 268996 140082 508110 393401 226683 477225 112551 111002 144200 177791
17129 177791 523886 256688 -127716 87172 146508 107178 270457 -43372 226441 130501
$$ packed form
17207A90248J27147A09843j8241a488k44019A71860L78774j81350j77963P4294
17197B65615i1577C30732r6949H9862l4885J88533I4481K35804A41533R481B1760
17185H5544e5654r7171A08712N40210a15453N045A31255F4206k6755J54129Q461
17174B00041c1C46399j71646J03629M4101g1246A26963K79126A68379d4863C1809
17162A4493J67155O006j8819b4788B95375n0059b18046C04574j8319I3872i568
17150B46548g5742B81826G5978P5132a73382a5705B05477J93140q6183K617K50778
17139E65829B68996j28914L68028j14709j66718K50542A12551j549L3198L3591
17129A77791L46095B56688a27716H7172N9336l9330J63279d3372B26441r5940
$$ plain form
17119 130501 142590 83282 40244 406144 328785 -139425 399326 453860 452988 183455 42835
17107 224299 539110 160972 425270 522310 315523 122637 490500 120989 256368 550979
17097 550979 381324 95268 171697 502504 69958 570069 258557 615752 393656 321997
17087 321997 133906 274437 5897 78257 213628 524848 453445 35018 238265 284754 318244
17076 318244 379339 406749 574283 438961 17804 395264 565628 116316 228050 265288
17066 265288 361545 532751 457729 435550 -10067 234055 355576 316486 387835 512774 154510
17054 365692 441356 358245 405948 363975 515525 574151 612353 761831 488411 371037 137206
17042 798001 416352 888052 418986 482170 391162 488140 156641 369876 615145 335173
$$ packed form
17119A30501J2089n9308D0244L65900p7359a39425C99326N4534q72A83455D2835
17107B24299L14811A60972K64298R7040k06787A22637L67863A20989J35379K94611
17097E50979j69655I5268P6429L30807F9958N00111B58557L57195k22096p1659
17087C21997A33906J40531E897P2360J35371L11220p1403C5018K03247M6489L3490
17076C18244O1095K7410J67534j35322A7804L77460J70364A16316J11734L7238
17066B65288R6257J71206p5022k2179a0067B34055J21521l9090P1349J24939A54510
17054C65692P5664q3111M7703m1973J51550N8626L8202J49478k73420j17374A37206
17042G98001l81649M71700D18986O3184r1008R6978A56641K13235K45269k79972
$$ plain form
17032 335173 494432 385017 453541 566846 223822 255379 544812 537052 599707 432687
17022 432687 752509 278475 511407 -67730 427009 312265 606965 404442 706883 310876
17011 462270 590216 427253 490412 678030 559130 650111 399467 616367 512261 321759
17001 321759 587558 455061 395193 501165 652587 768196 390026 559316 639337 116417
16990 494264 296020 745767 424399 679284 810343 403203 849440 646220 554199 618883
16980 618883 559773 799158 484758 88828 502313 763662 689671 829723 425048 636560
16970 636560 755224 711130 804998 333126 560007 448534 676447 939341 926978 839337
16960 839337 883350 818978 708645 845803 662036 470883 984147 710912 798746 498719
$$ packed form
17032C35173J59259j09415O8524J13305B23822L1557K89433p760O2655j67020
17022D32687L19822B78475K32932f7730D27009j14744K94700k02523L02441C10876
17011D62270J27946j62963O3159J87618j18900R0981k50644K16900j04106j90502
17001C21759K65799j32497n9868J05972J51422J15609l78170J69290Q0021A16417
16990D94264j98244M49747l21368K54885J31059D03203M46237k03220r2021O4684
16980F18883n9110K39385l14400H8828M13485K61349p3991J40052m04675K11512
16970F36560J18664m4094R3868C33126K26881j11473K27913K62894j2363q7641
16960H39337M4013o4372j10333J37158j83767j91153N13264k73235Q7834l00027
$$ plain form
16950 498719 1025440 650875 859098 993428 962692 664665 723301 797391 906831 797852
16940 797852 834374 799430 1055889 980090 891307 953877 921402 817972 1168872 1049158 976971
16929 976971 925382 598151 899863 927275 944553 1045899 909647 1405373 1388087 962429
16919 962429 1239607 1139737 1287620 1396191 1167748 1271861 1416061 1129901 893775 1092849
16909 1092849 958776 1333363 1165941 1088509 954429 1234438 1262239 1538626 1503267 1247977
16899 1247977 1537881 1434302 1743355 1213142 1583011 1384398 1458849 1538798 1372619 1273812
16889 1273812 1452583 1506126 1583666 1376801 1400938 1614151 1441812 1392742 1619489 1670060
16879 1670060 1937413 1683106 1832439 2065580 1814113 1529901 2092653 2031341 1854417 2378348
$$ packed form
16950D98719N26721l74565K08223J34330l0736k98027N8636P4090J09440j08979
16940G97852L6522l4944K56459p5799q8783O2570l2475j03430L50900j19714p2187
16929I76971n1589l27231L01712K7412J7278J01346j36252M95726j7286m25658
16919I62429K77178r9870J47883J08571k28443J04113J44200k86160k36126J99074
16909A092849j34073L74587j67422p7432j34080K80009K7801K76387l5359k55290
16899A247977K89904j03579L09053n30213L69869j98613P4451P9949j66179r8807
16889A273812J78771N3543P7540k06865K4137K13213j72339m9070K26747N0571
16879A670060K67353k54307J49333K33141k51467k84212N62752o1312j76924N23931
$$ plain form
16869 2378348 1770041 2079700 2324015 1936404 2169774 1976896 1886708 1761735 2046193 2396368
16859 2396368 2322353 2460919 2036454 2366774 2349934 2098963 2188972 2424501 2490135 2527106
16849 2527106 2952890 2793081 2426379 2457735 2714060 2741555 2885588 2702062 2932245 2769538
16839 2769538 2988937 2758551 3136117 3152558 3330317 3226863 3265942 3494171 3191381 3341562
16829 3341562 3279689 3727832 3817090 3791779 3954304 3945040 4355256 3989477 4157413 4125569
16819 4125569 4204661 4532375 4378319 4555023 4638205 4349092 4754181 4989570 5058822 5617096
16809 5617096 5315220 5874125 5359464 5740316 5634015 6142944 6306745 6114232 6333810
16800 6333810 6287556 6719565 6917551 7158299 7106251 7183199 7773684 7460524 7884910 8043653
$$ packed form
16869B378348o08307L09659K44315l87611K33370j92878r0188j24973K84458L50175
16859B396368p4015J38566m24465L30320j6840k50971R0009K35529O5634L6971
16849B527106M25784j59809l66702L1356K56325K7495J44033j83526K30183j62707
16839B769538K19399k30386L77566J6441J77759j03454L9079K28229l02790J50181
16829C341562o1873M48143Q9258k5311J62525r264M10216l65779J67936l1844
16819D125569P9092L27714j54056J76704Q3182k89113M05089K35389O9252N58274
16809E617096l01876N58905n14661L80852j06301N08929J63801j92513K19578
16800F333810m6254M32009J97986K40748n2048P6948N90485l13160M24386J58743
$$ plain form
16790 8043653 8219590 8683000 9029445 8736611 9373496 9717684 10038845 10286188 10581950
16781 10581950 11012315 10800574 11339542 11852740 12381530 12470180 12895064 13618469 13834732
16772 13834732 14290226 14899916 15498811 16038676 16607633 17200610 17794082 18486519 19176999
16763 19176999 19771572 20891655 21876948 22687356 23329599 24534035 25744261 26826251 28227105
16754 28227105 29590720 30994785 32562034 34218197 35809370 37719107 39885865 42157775
16746 42157775 44140157 46682016 49634408 52330703 55192939 58834781 62469855 66488478
16738 66488478 70923592 75415138 80411265 85528559 91197035 97206146 103654548 110478408
16730 110478408 117465053 125022472 132592581 140487387 148228002 155775714 162526190 169759643
$$ packed form
16790H043653J75937M63410L46445k92834O36885L44188L21161K47343K95762
16781A0581950M30365k11741N38968N13198N28790Q8650M24884P23405K16263
16772A3834732M55494O09690N98895N39865N68957N92977N93472O92437O90480
16763A9176999N94573J120083R85293Q10408O42243J204436J210226J081990J400854
16754B8227105J363615J404065J567249J656163J591173J909737K166758K271910
16746D2157775J982382K541859K952392K696295K862236L641842L635074M018623
16738F6488478M435114M491546M996127N117294N668476O009111O448402O823860
16730A10478408O986645P557419P570109P894806P740615P547712O750476P233453
$$ plain form
16722 169759643 175388741 180308718 183980027 186119998 186880001 186242973 184060819 180437706
16714 180437706 175688181 170298428 163370085 156108939 148570049 140806228 132649740 125130521
16706 125130521 117053658 109852496 103111691 96758780 90700700 84866254 79765105 74640854
16698 74640854 69785599 65527361 61172645 58132391 54662620 51433070 48188214 45563785
16690 45563785 43253834 41150336 38892441 36456353 34843203 32911541 31479800 29727494
16682 29727494 28623820 27140072 26298941 24849975 23770260 22523281 21536810 20642033
16674 20642033 19665995 19137137 18611853 17497309 16859859 16188194 15791753 14954463 14674796
16665 14674796 13902072 13656254 13314063 12397274 12307599 11684238 11329381 11522893 11116492
$$ packed form
16722A69759643N629098M919977L671309K139971P60003o37028k182154l623113
16714A80437706m749525n389753o928343p261146p538890p763821q156488p519219
16706A25130521q076863p201162o740805o352911o058080n834446n101149n124251
16698G4640854m855255m258238m354716l040254l469771l229550l244856k624429
16690D5563785k309951k103498k257895k436088j613150j931662j431741j752306
16682B9727494j103674j483748q41131j448966j079715j246979r86471q94777
16674B0642033r76038n28858n25284j114544o37450o71665l96441q37290k79667
16665A4674796p72724k45818l42191r16789q9675o23361l54857J93512m06401
$$ plain form
16656 11116492 10164322 10152735 10119513 9821715 9804180 9183654 8959536 8881478 7921693 8075122
16646 8075122 7717474 7359859 7436861 7077867 6964414 6688658 6617214 6339657 6384456 6125323
16636 6125323 6009585 5701286 5578496 5371020 5524578 5379532 5093612 5016987 4734297 5103790
16626 5103790 4811752 4806307 4644866 4351229 4448855 4357193 4425770 3891273 4217515 4006495
16616 4006495 3971592 3968584 3720898 3960558 3469815 3194805 3414968 3903580 3450350 3068333
16606 3068333 2798687 3062006 3227992 3008557 3123994 2932691 2885464 3036655 2685350 2764002
16596 2764002 2556306 2680597 2466789 2361855 2558755 2520073 2460018 2232953 2203094 1924176
16586 1924176 2411791 2160230 2333656 2230250 2441354 2250168 2269078 1998316 2055340 1801461
$$ packed form
16656A1116492r52170j1587l3222k97798j7535o20526k24118p8058r59785J53429
16646H075122l57648l57615P7002l58994j13453k75756p1444k77557M4799k59133
16636F125323j15738l08299j22790k07476J53558j45046k85920p6625k82690L69493
16626E103790k92038n445j61441k93637R7626r1662O8577n34497L26242k11020
16616D006495l4903l008k47686K39660m90743k75010K20163M88612m53230l82017
16606C068333k69646K63319J65986k19435J15437j91303m7227J51191l51305P8652
16596B764002k07696J24291k13808j04934J96900l8682o0055k27065k9859k78918
16586A924176M87615k51561J73426j03406K11104j91186J8910k70762N7024k53879
$$ plain form
16576 1801461 2057363 1750436 1853810 1613697 1917261 1788028 1761097 1483960 1738697 2032109
16566 2032109 1712304 1744317 1465034 1880360 1577483 1503866 1748352 1388217 1491787 1531773
16556 1531773 1427520 1478150 1406840 1175794 1271272 1258622 1113767 1477363 1284366 1222177
16546 1222177 1313844 1232428 1116877 1428757 1160830 1158242 1287594 1026202 1478900 1179832
16536 1179832 1267555 1247281 1318925 1476803 1081595 1066033 1033982 938298 1142793 806626
16526 806626 1005828 1192776 938108 1227130 730703 997089 807854 1076054 1020151 818503
16516 818503 826315 874716 825199 912317 779148 900346 726380 847685 632204 800043
16506 800043 587295 692545 574708 1049547 555180 917052 620320 641555 662230 607855
$$ packed form
16576A801461K55902l06927J03374k40113L03564j29233k6931k77137K54737K93412
16566B032109l19805L2013k79283M15326l02877p3617K44486l60135J03570L9986
16556A531773j04253N0630p1310k31046R5478j2650j44855L63596j92997o2189
16546A222177R1667q1416j15551L11880k67927k588J29352k61392M52698k99068
16536A179832Q7723k0274P1644J57878l95208j5562l2051r5684K04495l36167
16526H06626J99202J86948k54668K89022m96427K66386j89235K68200n5903k01648
16516H18503P812M8401m9517Q7118j33169J21198j73966J21305k15481J67839
16506H00043k12748J05250j17837M74839m94367L61872k96732K1235K0675n4375
$$ plain form
16496 607855 270581 822742 810429 505413 784567 781849 538488 698887 887393 680787
16486 680787 640928 580515 297228 748590 689505 627952 585800 478462 677410 399160
16476 399160 814797 931396 789448 618669 568391 658880 393859 548473 887565 417024
16465 660353 905157 812118 876861 495245 682867 605736 410514 930771 788773 541596
16455 541596 704901 474402 433947 593774 838789 639361 612060 360732 673726 668973
16445 668973 487827 458025 610700 392384 364596 371862 451958 169873 344783 484547
16435 484547 718749 389906 421129 448055 168203 461534 508742 280741 275215 407083
16425 407083 445021 608932 336571 190371 470063 514365 362170 422813 416944 462288 230724
$$ packed form
16496F07855B70581N52161j2313l05016K79154k718k43361J60399J88506k06606
16486F80787l9859o0413k83287M51362n9085o1553m2152j07338J98948k78250
16476C99160M15637J16599j41948j70779n0278R0489k65021J54614L39092D17024
16465F60353K44804r3039O4743l81616J87622p7131j95222N20257j41998k47177
16455E41596J63305k30499m0455J59827K45015j99428k7301k51328L12994m753
16445F68973j81146k9802J52675k18316k7788P266Q0096A69873J74910J39764
16435D84547K34202l28843L1223K6926A68203K93331M7208k28001n526J31868
16425D07083L7938J63911k72361j46200K79692M4302j52195O0643n869M5344B30724
$$ plain form
16413 267556 321196 347840 355212 361057 495468 493637 377732 267281 524931 308513 85907
16401 642661 669299 420139 178771 217866 57021 378138 348408 187423 213043 602064
16391 602064 789914 322984 -69040 398972 385304 412308 270163 576908 631494 -77698
16380 366465 255066 63671 304224 316878 325965 77983 403771 139168 349689 149839
16369 63848 476620 -23833 345809 328661 291287 244929 509450 350296 267848 214766 51417
16357 398294 263929 148708 450229 225216 212403 227340 393202 504962 410288 312808
16347 312808 122054 -59862 453103 -20365 342206 179738 678837 253179 220048 290341
16337 290341 124212 121807 414720 372439 438943 51428 -86777 402678 115800 240389 226329
$$ packed form
16413B67556N3640K6644P372N845J34411j831j15905j10451K57650k16418H5907
16401F42661K6638k49160A78771L9095E7021L21117k9730j60985K5620L89021
16391F02064J87850C22984f9040C98972j3668K7004j42145L06745N4586g7698
16380C66465j11399F3671K40553J2654R087G7983L25788A39168K10521A49839
16369F3848M12772b3833C45809j7148l7374m6358K64521j59154q2448n3082E1417
16357C98294j34365j15221L01521k25013j2813J4937J65862J11760r4674r7480
16347C12808A22054e9862D53103b0365C42206j62468M99099B53179l3131P0293
16337B90341A24212k405K92913m2281O6504E1428h6777D02678A15800J24589j4060
$$ plain form
16326 226329 674163 81476 454212 166741 127162 -61747 -41469 97336 21915 136623 345929
16315 345929 464653 -39413 559996 28846 225465 345628 189148 138679 345110 99221
16304 291919 256090 529611 312288 329364 113477 421022 39437 219903 252502 -22506
16293 47882 386175 153557 192298 6062 97848 167041 -55329 97881 283950 267226 281033
16282 281033 -24274 256038 -44394 209321 -33503 154046 513383 354885 64797 198262
16272 198262 -9131 118975 -124089 33902 73974 51471 297637 331208 235454 236917 27525
16260 160733 113386 -59763 92975 -42105 381684 178230 274213 -377221 109243 284377
16250 284377 97176 209212 -105182 419080 -260754 280767 -115920 -31581 -209158 178147
$$ packed form
16326B26329M47834H1476L72736A66741l9579f1747K0278I7336B1915J14708K09306
16315C45929J18724c9413E59996B8846J96619J20163j56480n0469K06431I9221
16304B91919l5829K73521k17323J7076A13477L07545C9437J80466L2599b2506
16293D7882L38293A53557L8741F062R1786O9193e5329I7881J86069j6724J3807
16282B81033b4274B56038d4394B09321c3503A54046L59337j58498F4797J33465
16272A98262i131A18975a24089C3902M0072k2503K46166L3571r5754J463B7525
16260A60733m7347e9763I2975d2105C81684A78230R5983c77221A09243J75134
16250B84377I7176J12036a05182D19080b60754B80767a15920c1581j77577A78147
$$ plain form
16239 251831 217741 97957 -779 54907 512360 161446 537001 3047 242928 -75333 184670
16227 -46079 -51917 135160 59978 -136888 140867 -229577 49141 275132 22611 85282 -142469
16215 31711 408822 -212924 218234 156623 117940 153302 -124069 -11578 47951 250157 219619
16204 219619 149921 189972 326283 191623 235591 295956 60988 26022 25683 -160384 -22786
16192 214991 534952 -45892 48066 95135 -57456 292395 84157 64589 375816 9727 125657
16181 125657 116776 -89318 -258909 47302 -309315 -12033 172175 -50777 -70180 108651 341219
16170 341219 209130 -125446 -15905 312379 155385 -30606 95805 -113513 45881 84787
16160 84787 186503 -38974 -47116 178305 50364 -143151 220381 -48479 134408 36521 -227559
$$ packed form
16239B51831l4090I7957g79E4907M57453A61446L75555C047K39881g5333A84670
16227d6079n838A35160E9978a36888A40867b29577D9141K25991B2611O2671a42469
16215C1711L77111b12924B18234o1611l8683L5362a24069a1578D7951K02206l0538
16204B19619o9698M0051J36311j34660M3968O0365F0988B6022l39a60384b2786
16192B14991L19961d5892D8066M7069e7456B92395H4157j9568L11227I727J15930
16181A25657q881h9318j69591D7302c09315a2033A72175e0777j9403A08651K32568
16170C41219j32089a25446a5905C12379A55385c0606I5805a13513D5881L8906
16160H4787J01716c8974q142A78305E0364a43151B20381d8479A34408C6521b27559
$$ plain form
16148 20395 -73695 12689 219973 290523 48968 -31991 192950 178825 5181 4810 -23480 -36371
16136 -36371 173819 21438 -168634 -35599 7610 -78017 -186944 -270222 231709 -79964 94010
16124 275453 3041 -102550 807 61096 147359 42632 -140309 23625 2406 -19598 312405 38166
16111 47040 142307 341749 -147458 -67611 -100325 -68953 56460 295401 454323 -15405 -53179
16100 -53179 90530 135009 -143400 33246 152830 255083 73921 -49967 -309875 130401 -236812
16088 275183 -127916 38170 191385 357 251342 174992 -14442 24516 -175082 227581 2005
16076 -138593 235337 307470 -17554 87048 -27440 -4543 -31014 -165547 157760 518630 460103
16065 460103 -106248 168046 175717 -263146 6617 -209578 -15796 327446 69724 52834 104127
$$ packed form
16148B0395g3695A2689K07284P0550D8968c1991A92950j4125E181l71b3480j2891
16136c6371A73819B1438a68634c5599G610g8017j08927q3278B31709g9964I4010
16124B75453C041a02550H07O0289Q6263D2632a40309B3625B406a9598C12405C8166
16111D7040R5267J99442a47458f7611l2714L1372E6460K38941J58922a5405l7774
16100e3179I0530M4479a43400C3246J19584J02253G3921d9967k59908A30401b36812
16088B75183a27916C8170J53215C57K50985p6350a4442B4516a75082B27581B005
16076a38593B35337P2133a7554H7048b7440d543k6471j34533A57760L60870n8527
16065D60103a06248A68046P671b63146F617b09578a5796C27446F9724j6890N1293
$$ plain form
16054 104127 -85007 207628 -291522 20616 -234154 -121342 92199 173776 -95269 -106628 -65308
16043 -65308 -27910 -12886 -144273 369663 456030 144123 290480 9603 -29210 60289 285626
16032 285626 -221734 191474 -114345 74408 170904 61446 18828 -263759 -7692 175527 -134140
16020 -115063 212743 198737 -18420 81639 -52316 199125 -48629 183913 -171897 155948
16009 -61829 47827 152718 342019 207353 -318189 -26163 -153686 -1555 -292922 7725 -150658
15997 269882 -326301 59591 -369539 -169480 160174 -156704 -174992 -181360 -192069 -206036 297260
15985 -124552 280179 70391 -243449 63448 389188 85543 -78983 423557 -89776 -110081 24873
15973 184726 -63067 67367 92391 115518 -288401 -47824 189109 189043 -228318 -78793 -881 -37873
$$ packed form
16054A04127h5007B07628b91522B0616b34154J12812I2199Q1577i5269j1359M1320
16043f5308b7910a2886j31387C69663Q6367A44123J46357I603b9210F0289K25337
16032B85626b21734A91474a14345G4408R6496F1446A8828b63759g692A75527a34140
16020a15063B12743j4006a8420H1639e2316A99125d8629A83913a71897A55948
16009f1829D7827J04891J89301j34666c18189b6163j27523a555k91367G725a50658
15997B69882c26301E9591c69539a69480A60174a56704j8288o368j0709j3967B97260
15985a24552B80179G0391b43449F3448L25740H5543g8983D23557h9776k0305B4873
15973A84726f3067F7367K5024K3127b88401d7824A89109o6b28318g8793h81l6992
$$ plain form
15961 -37873 79003 10087 92321 57544 -363486 -150254 359388 -34762 50415 -16660 -210812
15950 -210812 -70039 -64203 -90032 -256333 -310263 35615 -95603 -93378 -39845 -53637 -98908 -148407
15938 -148407 39008 123802 126798 132561 20025 233738 4479 244607 -28229 40497 -197652
15926 120513 -86837 -83712 11032 -158962 -180020 -507162 -154614 -316678 319238 -134172
15915 16936 179010 180611 -322768 -44501 121964 -422891 -35677 -197631 10617 -250460 -39685
15903 530 -220332 -272021 -159970 -86725 -48928 -77049 -81184 -252440 15660 -84714 -228080
15892 -228080 107352 29672 45370 232511 116013 -35367 -244544 -57400 174620 -69078
15881 -12509 102058 49581 68410 21545 -40918 20575 185864 -14174 153968 -89465 -5311
$$ packed form
15961c7873G9003A0087Q2234l4777c63486a50254C59388c4762E0415a6660j94152
15950b10812g0039N836k5829j66301n3930C5615i5603K225c9845j3792m5271m9499
15938a48407C9008Q4794K996N763B0025K13713D479K40128b8229D0497a97652
15926A20513h6837L125A1032a58962k1058l27142a54614j62064C19238a34172
15915A6936J62074J601c22768d4501A21964d22891c5677j61954A0617b50460c9685
15903E30b20332n1689J12051P3245L7797k8121m135j71256A5660h4714j43366
15892b28080A07352B9672J5698J87141A16013c5367k09177e7400A74620f9078
15881a2509A02058D9581J8829B1545d0918B0575J65289a4174A53968h9465e311
$$ plain form
15869 -67828 -14956 317003 99165 -7560 10444 -49592 -76241 -135774 37427 -84671 292857
15857 161962 -277378 -222936 -205845 -2009 -51344 36039 -43181 -50570 -234820 -168379 -204259
15846 -204259 -6907 16257 -83891 205140 167552 -157374 131970 -36882 -286329 105447 -178535
15834 -92064 146245 -43824 41836 -212896 -269824 -211635 11012 -8479 -128948 111698 -65090
15822 66163 -78527 -171339 -107061 395122 -14009 70380 -77677 7920 -190168 -188223 137454
15810 -103726 -48157 -188815 -141868 -79353 -275536 -33167 -41279 96791 149162 228570 -99537
15798 -140222 -171874 22854 161042 -207551 38990 41772 -7775 147422 195142 -175530 -154912
15787 -154912 -81495 -181167 -216635 357516 -10372 -298932 -217393 -93286 -389920 156242 -54575
$$ packed form
15869f7828a4956C17003I9165g560A0444d9592k6649n9533C7427h4671B92857
15857A61962b77378N4442J7091b009m9335C6039d3181p389j84250O6441l5880
15846b04259f907A6257h3891B05140l7588a57374A31970c6882k49447A05447a78535
15834i2064A46245d3824D1836b12896n6928N8189A1012h479j20469A11698f5090
15822F6163g8527r2812O4278C95122a4009G0380g7677G920a90168J945A37454
15810a03726d8157j40658M6947O2515j96183c3167q112I6791N2371P9408i9537
15798a40222l1652B2854J38188b07551C8990K782g775A47422M7720a75530K0618
15787a54912P3417r9672l5468C57516a0372k88560Q1539i3286k96634A56242e4575
$$ plain form
15775 -260240 -153016 -208469 74173 -172041 297539 -52150 -318590 76042 -29994 -141893
15765 -141893 -122831 -253358 -153248 -72145 -32831 -80180 93656 128613 -386168 131554 29021
15753 -111565 -25839 -26851 -205878 67317 -336809 -189749 73197 -55963 269594 57915 -104102
15741 -185409 35375 -381110 7644 379830 -146885 92149 -138534 -131942 -79290 2524 -81633
15729 224746 -108805 150043 172450 -385863 -144922 -137249 -105991 324298 277395 15227 -50739
15717 -583899 -159575 -50170 139479 -220821 -70972 13484 -67101 19127 -305039 65955 49035
15706 49035 75944 -166448 -403885 -195685 414550 -24475 -9949 -72340 -39743 -198849 322701
15694 -34323 71930 -108208 192380 116079 239959 -218144 -163698 200572 -106353 85579
$$ packed form
15775b60240J07224n5453G4173a72041B97539e2150k66440G6042b9994j11899
15765a41893J9062j30527J00110g2145c2831m7349I3656L4957c86168A31554B9021
15753a11565b5839j012j79027F7317c36809J47060G3197e5963B69594E7915a04102
15741a85409C5375c81110G644L72186a46885I2149a38534O592N2652B524h1633
15729B24746a08805A50043K2407c85863a44922P673L1258C24298m6903A5227e0739
15717e83899a59575e0170A39479b20821g0972A3484f7101A9127c05039F5955j6920
15706D9035K6909a66448k37437a95685D14550b4475i949o2391L2597j59106C22701
15694c4323G1930a08208A92380p6301J23880b18144N4446B00572a06353H5579
$$ plain form
15683 -66988 147943 27730 231435 49203 -111387 39104 36558 -199437 -132640 -165715 145219
15671 102074 34257 239098 54744 -199696 -2589 79055 -154053 372435 -321101 140950
15660 108439 132751 -100459 -206890 -303023 -137033 162885 -191508 -77201 -268776 162682
15649 51306 87899 86785 132325 207601 134263 42620 -318125 -129740 -365799 -22384 -157944
15638 -157944 -40640 76666 194583 102098 -326926 102336 -177844 -144102 105415 -296578
15627 -7281 112597 -240706 245724 -67230 -56147 -160382 -297758 -100322 39212 109287 -249013
15615 240997 -301862 86270 -185438 -25599 102302 -134813 -35354 -97275 -165703 -178938 -18408
15603 -232393 -136917 -61270 -7481 -87024 -237545 -161905 2997 153267 -130721 369660 -204296
$$ packed form
15683f6988A47943B7730K03705D9203a11387C9104k546a99437O6797l3075A45219
15671A02074C4257K04841E4744a99696b589G9055a54053C72435c21101A40950
15660A08439K4312a00459j06431r6133a37033A62885a91508g7201j91575A62682
15649E1306L6593j114M5540P5276p3338D2620c18125a29740k36059b2384j35560
15638a57944d0640G6666J17917r2485c26926A02336a77844L3742A05415b96578
15627g281A12597b40706B45724f7230J1083j04235j37376a00322C9212P0075b49013
15615B40997c01862H6270a85438b5599A02302a34813c5354o1921o8428j3235a8408
15603b32393R5476f1270g481p9543j50521P5640B997J50270a30721C69660b04296
$$ plain form
15591 16276 154011 -31204 -115256 -152366 17840 -132879 -99902 975 56347 132927 -38321 -34985
15579 -34985 -106116 -47337 61096 88728 -212883 75048 177259 -327461 -235845 157190 31231
15567 -106905 -196808 -212330 -37964 -225949 -51728 172993 156162 -273952 96755 -82957 -108265
15556 -108265 -45405 75142 -33489 -152817 124791 -145730 -76404 122032 -42413 56853 178948
15545 178948 -43579 75431 68273 -14463 -179382 180368 -21899 103477 -42842 70763 188718
15534 188718 67015 29292 -390423 -336569 -198280 -209667 -155859 -94300 153390 -306 105948
15522 -17594 -50964 -402327 11921 -22395 -97547 44445 -187775 144228 66140 68353 123454
15511 123454 248380 242217 155714 90148 -120564 -22582 -335105 41941 -35422 86416 257458
$$ packed form
15591A6276J37735c1204q4052l7110A7840a32879L2977I75N5372P6580c8321L336
15579c4985p1131d7337F1096K7632b12883G5048J02211c27461R1616A57190C1231
15567a06905q9903j5522c7964j87985e1728A72993j6831b73952I6755h2957k5308
15556a08265d5405G5142c3489j19328A24791a45730O9326A22032d2413E6853J22095
15545A78948d3579G5431p158a4463j64919A80368b1899A03477d2842G0763J17955
15534A88718F7015B9292c90423N3854J38289j1387N3808O1559A53390c06A05948
15522a7594l3370l51363A1921b2395p5152D4445a87775A44228F6140K213N5101
15511A23454J24926o163q6503o5566a20564b2582l12523D1941c5422H6416J71042
$$ plain form
15500 257458 -140235 43070 -12485 -55493 -279406 -159514 -63437 68765 58593 -162999 49427
15488 111593 -104372 -291368 -96558 -228474 94115 202029 139395 -213258 -75255 96959
15477 63199 -134487 179727 -23892 141888 -145258 -44481 -177307 -108005 49944 -75413 67783
15465 -13074 -75500 363957 117512 -77169 158505 -59285 74832 -193230 91549 -512833 -1279
15453 142411 -138686 80055 38416 -347152 46096 -151062 88968 -117380 -152734 166026
15442 76203 -123903 151345 -61817 -35896 -237070 186228 -213205 51479 211804 -49040
15431 155872 172782 401107 -188034 -6668 -41881 -314557 6197 -36093 -113620 32605 167839
15420 167839 72537 -81165 93758 -34313 -83376 -85830 -224489 210611 -95010 251167 -143965
$$ packed form
15500B57458a40235D3070a2485m3008k23913J19892f3437F8765j0172a62999D9427
15488A11593a04372j86996i6558j31916I4115J07914o2634b13258g5255I6959
15477F3199a34487A79727b3892A41888a45258d4481j32826O9302D9944g5413F7783
15465a3074o2426C63957A17512g7169A58505e9285G4832a93230I1549e12833a279
15453A42411a38686H0055C8416c47152D6096a51062H8968a17380l5354A66026
15442G6203a23903A51345f1817K5921k01174A86228b13205E1479J60325d9040
15431A55872J6910K28325a88034f668l5213k72676F197c6093p7527C2605J35234
15420A67839G2537h1165I3758c4313m9063k454j38659B10611i5010B51167a43965
$$ plain form
15408 89643 -371 -86451 71035 -74636 -176214 -22914 294035 7795 22365 -124051 203492
15396 46882 354479 152392 210788 -9469 73453 13657 69871 118794 -34240 -274253 -160289
15385 -160289 93070 -152991 229143 142704 -339262 177242 88938 -291470 94717 -185546
15374 38433 173567 91198 -19068 -13427 -33595 -14048 193703 220257 30184 -14820 -104412
15363 -104412 -265998 -157842 232380 422821 -175349 -197357 392787 -31677 86962 -126493
15352 -176728 -3905 -307780 49246 20803 50382 -302778 -227753 -39167 58620 183619 -137225
15340 228297 -58632 -49624 22116 265132 268387 -185281 53713 -247848 -86283 43625 44593 -116171
15327 131040 -40312 -91843 -131007 -345 -75619 54030 132071 -43311 70038 -286354 -6390 12590
$$ packed form
15408H9643c71q6080G1035g4636j01578b2914B94035G795J4570a24051B03492
15396D6882L07597A52392N8396i469G3453A3657N6214M8923c4240k40013J13964
15385a60289I3070a52991B29143q6439c39262A77242q8304b91470I4717a85546
15374C8433J35134q2369a9068N641k0168a4048A93703K6554C0184a4820q9592
15363a04412j61586J08156B32380J90441a75349k2008C92787c1677H6962a26493
15352a76728c905l03875D9246B0803K9579c02778P5025c9167E8620J24999a37225
15340B28297e8632R008B2116K43016L255a85281E3713b47848h6283D3625R68a16171
15327A31040d0312n1531l9164c45p5274E4030P8041d3311G0038b86354f390A2590
$$ plain form
15314 319944 -108330 -74224 254099 -16266 -1377 21881 34853 72924 13529 -88237 117292
15302 -21737 -300718 200036 -13247 261410 -148514 -58733 149357 142422 8956 184798 -83447
15290 201133 335824 43699 -144457 121796 19340 196240 -13823 -238724 -146798 -91981
15280 -91981 93071 -193232 241070 61614 129466 68799 139625 35787 -169815 165223 50718
15268 121087 -74879 18196 119275 -178545 148123 118469 53704 -112044 35550 -81181 -161544
15257 -161544 42961 607819 2118 39914 96290 123430 479680 1089519 1381178 924693 1143330
15246 1143330 996126 581410 -64423 -196898 -180076 -217476 -264874 314923 -163834 155400
15235 4554 -39935 -62526 338740 -209714 -58856 -144428 217159 -262238 -32274 78094 185564
$$ packed form
15314C19944a08330L4106B54099a6266a377B1881J2972L8071A3529h8237A17292
15302b1737k78981B00036a3247B61410a48514e8733A49357o935H956J75842h3447
15290B01133J34691D3699a44457A21796A9340J76900a3823k24901R1926N4817
15280i1981I3071a93232B41070F1614O7852o0667P0826C5787a69815A65223E0718
15268A21087g4879A8196J01079a78545A48123k9654E3704a12044C5550h1181q0363
15257a61544D2961N64858B118L7796N6376K7140L56250O09839K91659m56485K18637
15246A143330j47204m14716f4423j32475J6822l7400m7398C14923a63834A55400
15235D554c9935k2591C38740b09714e8856q5572B17159b62238c2274G8094J07470
$$ plain form
15224 185564 321703 -72224 -79403 154888 -10930 281252 -30694 64261 267962 -110183 11506
15212 72788 -131412 -195992 -108993 143194 171079 -43085 -172039 -208173 15578 -126841 132504
15200 25707 81791 -169832 -110900 325076 417946 -375431 163762 262651 298541 -297169 81363
15188 -74935 325956 194844 231210 -178487 177818 374761 185229 203845 329851 -88182
15177 171861 -47906 -57928 -164619 -126221 -47913 49050 -31611 52036 267421 -177430 -89691
15166 -89691 183005 264093 -1873 170510 62863 -105485 -87337 -30138 348287 -148424 -267837
15155 -267837 123752 88262 68356 4318 -35841 99252 146177 222757 19372 -87959 4027 227410
15143 227410 -25173 10076 254504 55804 205007 -15900 36503 165984 171322 318594 110258
$$ packed form
15224A85564J36139g2224p179A54888a0930B81252c0694F4261K03701a10183A1506
15212G2788a31412o4580Q6999A43194K7885d3085j28954l6134A5578a26841A32504
15200B5707N6084a69832N8932C25076R2870c75431A63762R8889L5890b97169H1363
15188g4935C25956j31112L6366a78487A77818J96943A85229J8616J26006h8182
15177A71861d7906j0022j06691L8398d7913D9050c1611E2036K15385a77430Q7739
15166h9691A83005Q1088a873A70510F2863a05485J8148c0138C48287a48424j19413
15155b67837A23752l5490j9906D318c5841I9252M6925P6580A9372h7959D027K23383
15143B27410b5173A0076K44428E5804J49203a5900C6503J29481N338J47272A10258
$$ plain form
15131 180798 -142812 267017 192393 160147 -12371 -171807 38398 43744 -48033 -27169 265816
15119 27479 69831 50563 186518 386241 -150716 -144556 124816 57847 107107 988 -77963
15107 -69714 -196799 72107 -22560 52890 8393 91188 -124823 37099 -23857 45887 -51619
15095 350112 96620 122574 137605 -38976 210397 73477 -187444 233874 -179976 302705
15084 164077 -120917 325356 58561 201310 -26739 62768 -2647 -62747 221003 -70695 -197924
15073 -197924 -116630 110646 287419 106054 76329 155582 597324 261218 -61630 124645
15062 251443 -237293 127427 -36492 -105433 -206127 143805 452893 219194 192730 117722
15052 117722 115215 -89412 261972 153743 40838 -58854 237472 -198750 113028 485095
$$ packed form
15131A80798a42812B67017p4624l2246a2371j59436C8398N346d8033K0864B65816
15119B7479M2352j9268J35955J99723a50716O160A24816E7847M9260I88g7963
15107f9714j27085G2107b2560E2890H393Q2795a24823C7099b3857D5887e1619
15095C50112I6620K5954J5031c8976B10397G3477a87444B33874a79976C02705
15084A64077a20917C25356E8561J42749b6739F2768b647o0100B21003g0695j27229
15073a97924Q1294A10646J76773A06054k9725P9253M41742B61218f1630A24645
15062B51443b37293A27427c6492o8941j00694A43805L09088B19194k6464p5008
15052A17722k507h9412B61972j08229D0838e8854B37472a98750A13028L72067
$$ plain form
15042 485095 146128 175437 70627 333201 -201804 15515 227929 21362 -163362 109732
15031 64533 243947 349752 188176 338068 -189168 64817 166392 340171 226621 -39066
15020 179042 79374 136034 -132515 161421 114754 107601 181861 -72960 43357 -25602 167550
15008 236361 149504 233034 198055 48122 180087 49851 12916 203578 75666 276159 180793
14997 180793 346141 409069 74313 23815 240721 405427 310746 222745 -353571 216361
14986 11128 -153674 117210 202708 276888 339368 208502 468669 401035 287691 -199675
14975 27893 91712 399664 78679 107437 141287 255337 -59827 229848 46169 144402 231717
14964 231717 188811 -107224 448456 368087 291947 351408 242625 296745 256446 283513 -27977
$$ packed form
15042D85095A46128K9309G0627K62574b01804A5515K12414B1362a63362A09732
15031F4533J79414J05805j61576J49892a89168F4817J01575J73779j13550c9066
15020A79042G9374N6660a32515A61421m6667p153P4260g2960D3357b5602A67550
15008B36361q6857Q3530l4979D8122J31965D9851A2916J90662G5666K00493r5366
14997A80793J65348O2928G4313B3815K16906J64706r4681q8001c53571B16361
14986A1128a53674A17210Q5498P4180O2480j30866K60167o7634j13344a99675
14975B7893O3819L07952G8679K8758L3850J14050e9827B29848D6169R8233Q7315
14964B31717m2906a07224D48456q0369p6140N9461j08783N4120m0299K7067b7977
$$ plain form
14952 -197467 105985 219202 101498 134152 422020 218309 -106422 357280 -26568 212481
14941 251149 165373 257950 -37568 417638 68068 505971 163511 180846 308644 140851
14930 271654 561280 252232 6875 -53362 79376 335372 101864 272979 206004 38082 138854
14919 138854 116375 486814 281782 151941 410834 213288 301571 106530 289456 338371
14909 338371 -164266 277577 404851 332594 743606 364816 334659 291791 85074 -32184
14898 40693 207511 388126 201964 177543 569729 117112 54932 170998 461652 663548
14888 663548 679638 305777 498016 246169 396830 276072 361812 286710 371729 85693
14877 389251 229065 348328 660898 137019 6061 160045 373210 234314 115482 246997
$$ packed form
14952a97467A05985J13217A01498L2654K87868k03711a06422C57280b6568B12481
14941B51149q5776R2577c7568D17638F8068M37903A63511J7335J27798A40851
14930B71654K89626B52232F875e3362G9376K55996A01864J71115o6975C8082J00772
14919A38854k2479L70439k05032j29841K58893j97546Q8283A06530J82926M8915
14909C38371a64266B77577J27274p2257M11012C64816l0157m2868H5074c2184
14898D0693J66818J80615j86162k4421L92186A17112E4932J16066K90654K01896
14888F63548J6090C05777J92239B46169J50661j20758Q5740p5102Q5019H5693
14877C89251j60186J19263L12570A37019F061J53984K13165j38896A15482J31515
$$ plain form
14867 246997 250383 713312 403183 359354 211398 198072 506711 412664 322893 117906 221717
14856 221717 333694 129592 181820 529755 280560 476813 298766 56560 510442 -42775
14845 34803 461653 438103 270312 304008 297742 327846 136920 194869 556379 316541 394084
14834 394084 457565 470255 -31309 281795 359628 493344 284934 236783 421789 187820
14823 -34106 538375 441034 328124 568064 189406 208638 117296 318550 219781 281513 408988
14812 408988 98364 275473 407313 289913 449650 227259 -24695 774693 471543 43974
14801 447316 327431 384757 306021 122233 207272 503783 518874 612357 635808 36188 420996
14790 420996 373944 364126 254231 314785 624914 431556 444365 447923 159230 854349 369903
$$ packed form
14867B46997L386M62929l10129m3829j47956j3326L08639r4047q9771A17906J03811
14856B21717J11977A29592N2228L47935k49195J96253j78047E6560M53882d2775
14845C4803M26850k3550j67791L3696o266L0104A36920N7949L61510k39838P7543
14834C94084O3481J2690c1309B81795P7833J33716k08410m8151J85006A87820
14823c4106E38375r7341j12910K39940A89406J9232r1342K01254r8769O1732J27475
14812D08988I8364J77109J31840j17400J59737k22391b4695G74693l03150D3974
14801D47316j19885N7326p8736A22233Q5039K96511J5091R3483K3451C6188L84808
14790D20996m7052r818j09895O0554L10129j93358J2809L558A59230O95119C69903
$$ plain form
14778 223797 512477 699289 395982 518502 722213 170879 300242 540512 473906 149812
14767 740975 522146 525478 442874 265958 693791 186421 560263 879504 320334 605828
14757 605828 552826 569709 794358 507439 382351 630533 681217 481292 633891 963713
14747 963713 601043 606003 580062 720266 630123 537679 672935 453032 558944 590335 649754
14736 649754 591763 703817 650776 606722 680959 270682 752097 485238 491482 563775 556664
14725 556664 447265 472437 530594 570667 635544 529088 629344 795991 422847 118914
14714 684971 443661 913681 701466 678031 809904 617984 536484 749919 957334 652503
14704 652503 675531 526711 768652 597369 627285 478693 490799 627237 344393 569396
$$ packed form
14778B23797K88680J86812l03307J22520K03711A70879J29363K40270o6606A49812
14767G40975k18829L332q2604j76916M27833A86421L73842L19241C20334K85494
14757F05828n3002J6883K24649k86919j25088K48182N0684j99925J52599L29822
14747I63713l62670M960k5941J40204r0143r2444J35256k19903J05912L1391N9419
14736F49754n7991J12054n3041m4054P4237B70682M81415k66859O244P2293p111
14725E56664j09399K5172N8157M0073O4877j06456J00256J66647l73144A18914
14714F84971k41310M70020k12215k3435J31873j91920q1500K13435K07415l04831
14704F52503K3028j48820K41941j71283K9916j48592J2106J36438k82844K25003
$$ plain form
14694 569396 876573 719912 463524 1056941 723964 548996 684189 331601 830533 690819
14684 690819 843795 516167 869571 757351 874777 534825 592484 1172415 780269 862931
14674 862931 440730 772616 1152084 429090 721307 796896 635010 878079 1120146 527580
14663 581990 1127158 809609 773218 764750 1052833 1033075 1004175 905118 799419 688388 643130
14652 643130 1085639 899510 1312619 855933 924351 710736 754913 890328 1002229 951062
14642 951062 1200494 607813 1000386 1033333 1341052 984188 1291129 687716 1001010 1076580
14632 1076580 1058621 1013333 1196443 1192584 1212531 1080867 1256084 1096900 867447 1326373
14622 1326373 1246807 1374374 1203332 1091626 1356298 934794 1249301 1049275 1235760 1037418
$$ packed form
14694E69396L07177j56661k56388N93417l32977j74968J35193C31601M98932j39714
14684F90819J52976l27628L53404j12220J17426l39952N7659N79931l92146Q2662
14674H62931m22201L31886L79468D29090K92217P5589j61886K43069K42067E27580
14663E81990N45168l17549l6391q468K88083j9758k8900r9057j05699j11031m5258
14652F43130M42509j86129M13109m56686O8418k13615M4177J35415J11901n1167
14642I51062K49432n92681L92573L2947L07719l56864L06941o03413L13294P5570
14632A076580j7959m5288J83110l859J9947j31664J75217j59184k29453M58926
14622A326373p9566J27567j71042j11706K64672m21504L14507k00026J86485j98342
$$ plain form
14612 1037418 1145407 1534043 1194827 1169965 1116865 1401324 1011971 1142218 1258014 899477
14602 899477 1102233 985902 1335504 1475709 1565754 1367095 1196260 1373874 1339699 1147822
14592 1147822 1590298 1242327 1478887 1532433 1425479 1233835 1278145 1486056 1431444 1441178
14582 1441178 1265104 1371240 1619779 1507749 1834240 1672470 1727454 1650327 1665167 1642007
14572 1642007 1928123 1950596 1793770 2087816 1843441 1919419 2001032 1988654 1926433 2154835
14562 2154835 1926413 2025061 2130214 2386092 2329996 2302387 2622998 2490590 3072726 3212344
14552 3212344 4203289 4301888 5586626 7371806 12958192 23728854 38904219 31449244
14544 31449244 15385192 7245961 3492144 2563978 1882344 1860857 1776266 1342393 1707305
$$ packed form
14612A037418J07989L88636l39216k4862n3100K84459l89353J30247J15796l58537
14602H99477K02756j16331L49602J40205R0045j98659j70835J77614l4175j91877
14592A147822M42476l47971K36560N3546j06954j91644M4310K07911n4612R734
14582A441178j76074J06136K48539j12030L26491j61770N4984p7127J4840k3160
14572A642007K86116K2473j56826K94046k44375P5978Q1613j2378o2221K28402
14562B154835k28422R8648J05153K55878n6096k7609L20611j32408N82136J39618
14552C212344R90945R8599J284738J785180N586386J0770662J5175365p454975
14544C1449244A5385192G245961C492144r28166o81634k1487q4591m33873L64912
$$ plain form
14535 1707305 2063122 1936179 2017650 1774200 1890339 1702392 1808277 1788865 1980816 2117393
14525 2117393 1681446 1780386 1883338 1624389 1927825 1897534 2195758 2247212 2099185 2125083
14515 2125083 1807617 2133413 2437645 2409394 1985948 2075085 2310438 2468557 2290289 2549652
14505 2549652 2355612 2477815 2492797 2655742 2550541 2192588 2552166 2799172 2555053 2704749
14495 2704749 2534196 2578343 2629343 2726933 3101211 2668850 2856472 2903004 3012998 3168235
14485 3168235 2696733 3164885 3238384 3127620 2924703 3544699 3373855 3264249 3408339 3242019
14475 3242019 3308942 3343734 3346320 3772003 3113014 3635478 3837858 3777806 3735032 3582401
14465 3582401 3710086 3592358 4053181 4036130 3711873 3477396 4021130 4224819 4308069 4085584
$$ packed form
14535A707305L55817j26943Q1471k43450J16139j87947J05885j9412J91951J36577
14525B117393m35947R8940J02952k58949L03436l0291K98224N1454j48027K5898
14515B125083l17466L25796L04232k8251m23446Q9137K35353J58119j78268K59363
14505B549652j94040J22203J4982J62945j05201l57953L59578K47006k44119J49696
14495B704749j70553M4147N1000R7590L74278m32361J87622M6532J09994J55237
14485C168235m71502M68152P3499j10764k02917O19996j70844j09606J44090j66320
14475C242019O6923L4792K586M25683o58989N22464K02380o0052m2774j52631
14465C582401J27685j17728M60823j7051l24257k34477N43734K03689Q3250k22485
$$ plain form
14455 4085584 4253956 4331567 4396447 4323439 4540075 4265937 4613098 4564485 4688364 4618613
14445 4618613 4906940 4360874 4441683 5067142 4768764 4906080 4942723 4972981 5451671 5034567
14435 5034567 5095620 5243479 5266714 5424568 5568386 5600471 5701437 5908295 6016450 6039880
14425 6039880 6141160 6120411 6110796 6225960 6189420 6574885 6480578 6289706 7010524 6633951
14415 6633951 7194738 7222331 7201301 6744016 7525461 7403464 7761619 7365128 7646939 8014069
14405 8014069 8341295 8487537 8278075 7979053 8564719 8907344 8910212 8991343 9128440 9251014
14395 9251014 9340122 9650265 9749875 10131501 9912849 9802414 10320098 10848630 10743037 10974691
14385 10974691 11249024 11312197 11766031 12099272 11689786 12150392 12380600 12651049 12993938
$$ packed form
14455D085584J68372P7611O4880p3008K16636k74138L47161m8613J23879o9751
14445D618613K88327n46066Q0809O25459k98378J37316L6643L0258M78690m17104
14435E034567O1053J47859K3235J57854J43818L2085J00966K06858J08155K3430
14425F039880J01280k0749r615J15164l6540L85465r4307j90872P20818l76573
14415F633951N60787K7593k1030m57285P81445j21997L58155l96491K81811L67130
14405H014069L27226J46242k09462k99022N85666L42625K868Q1131J37097J22574
14395I251014Q9108L10143R9610L81626k18652j10435N17684N28532j05593K31654
14385A0974691K74333O3173M53834L33241m09486M60606K30208K70449L42889
$$ plain form
14376 12993938 13263149 13284345 13842143 13915857 14074198 14469132 14762097 15385224 15334217 15898323
14366 15898323 16172579 16374721 16658217 17340398 17490431 17849776 17940219 18763164 19184713
14357 19184713 19484444 19989492 20354893 21136899 21797994 21777006 22572182 23160655 23433839
14348 23433839 24436104 24855649 25456614 26296912 26976533 27628185 27987423 29021982 29633852
14339 29633852 30836351 31444540 32395278 33330945 34532305 35421635 36276728 37739892 38589144
14330 38589144 39981367 41144879 42808390 43930831 45565053 47113240 48533789 49948236
14322 49948236 51901955 53911524 56046666 57912725 60481089 62338142 65136471 67254824
14314 67254824 69777660 72766231 76003333 79287859 82600132 86120888 89975015 94071085
$$ packed form
14376A2993938K69211K1196N57798P3714J58341L94934K92965O23127n1007N64106
14366A5898323K74256K02142K83496O82181J50033L59345R0443Q22945M21549
14357A9184713K99731N05048L65401P82006O61095k0988P95176N88473K73184
14348B3433839J002265M19545O00965Q40298O79621O51652L59238J034559O11870
14339B9633852J202499O08189R50738R35667J201360Q89330Q55093J463164Q49252
14330C8589144J392223J163512J663511J122441J634222J548187J420549J414447
14322D9948236J953719K009569K135142J866059K568364J857053K798329K118353
14314F7254824K522836K988571L237102L284526L312273L520756L854127M096070
$$ plain form
14306 94071085 98604006 102838560 107902941 113072230 118683625 124384983 130813969 137387635
14298 137387635 144441860 152005675 160184904 168952199 178093361 188158384 198232749 209940412
14290 209940412 221451223 233721204 246956823 260796191 275362161 290717578 306170264
14283 306170264 321869879 338295967 354307102 370388624 385458736 399820946 413425950
14276 413425950 425390277 435659767 443593011 448480522 449212472 446830058 444993112 440554140
14268 440554140 436085480 433066722 426224420 414518711 400248105 384701992 368596001
14261 368596001 352308793 335529077 318919408 302786052 287172375 272511936 258057820
14254 258057820 244282546 231164271 218822822 206684784 195612588 185197017 175539625
$$ packed form
14306I4071085M532921M234554N064381N169289N611395N701358O428986O573666
14298A37387635P054225P563815Q179229Q767295R141162J0065023J0074365J1707663
14290B09940412J1510811J2269981J3235619J3839368J4565970J5355417J5452686
14283C06170264J5699615J6426088J6011135J6081522J5070112J4362210J3605004
14276D13425950J1964327J0269490P933244M887511P31950k382414j836946m438972
14268D40554140m468660l018758o842302j1705709j4270606j5546113j6105991
14261C68596001j6287208j6779716j6609669j6133356j5613677j4660439j4454116
14254B58057820j3775274j3118275j2341449j2138038j1072196j0415571r657392
$$ plain form
14247 175539625 166446532 157729959 150018473 142589218 135692297 128920041 122153615 116916732
14239 116916732 111304575 106389781 101637369 96864088 92534977 88750550 84716603 81510612
14231 81510612 78422534 75027368 72165196 69285504 66400939 63781831 61661642 58717346
14223 58717346 56696340 55015728 52910828 51194975 49154542 47859925 45864920 44737631
14215 44737631 42898724 41914465 40815102 39464924 37981192 37182456 35602359 35083722
14207 35083722 34330595 33089087 32051833 31172657 30166681 29323882 28808644 28163614 27545501
14198 27545501 26555887 25716876 24892390 24670941 23904815 23100775 22652364 22287812 21349442
14189 21349442 20815798 20593519 20370030 19722346 19452815 18544421 18291624 17906020 17901744 16806418
$$ packed form
14247A75539625r093093q716573p711486p429255o896921o772256o766426n236883
14239A16916732n612157m914794m752412m773281m329111l784427m033947l205991
14231H1510612l088078l395166k862172k879692k884565k619108k120189k944296
14223E8717346k021006j680612k104900j715853k040433j294617j995005j127289
14215D4737631j838907r84259j099363j350178j483732p98736j580097n18637
14207C5083722p53127j241508j037254q79176j005976q42799n15238o45030o18113
14198B7545501r89614q39011q24486k21449p66126q04040m48411l64552r38370
14189B1349442n33644k22279k23489o47684k69531r08394k52797l85604m276j095326
$$ plain form
14179 16806418 16741082 16437118 15971676 15906285 15496238 15394141 15042179 14512814 14260108 14020427
14169 14020427 13697253 13519243 13259108 13216128 12546855 12815917 12062462 11858107 12044875
14160 12044875 11922189 11606195 11246131 11026561 11061545 10506343 10491509 10171080 10255551 10102778
14150 10102778 9913420 9591509 9709149 9249196 9177216 9228350 8717109 8812872 8237615 8428875
14140 8428875 8497993 8209051 8226981 8328903 7892574 7676139 7181749 7311823 7086927 6992640
14130 6992640 7246007 6718939 7262418 7033041 6610676 6585294 6367594 6801686 6499474 6322014
14120 6322014 6232257 6282968 6158261 6031498 6195213 5756723 6049040 5975210 5666694 5407344
14110 5407344 5556530 5765472 5310267 5354343 5320260 5146021 5261452 5327275 4968584 4983485
$$ packed form
14179A6806418o5336l03964m65442o5391m10047j02097l51962n29365k52706k39681
14169A4020427l23174j78010k60135m2980o69273K69062p53455k04355J86768
14160A2044875j22686l15994l60064k19570L4984n55202j4834l20429Q4471j52773
14150A0102778j89358l21911J17640m59953p1980N1134n11241R5763n75257J91260
14140H428875O9118k88942J7930J01922m36329k16435m94390J30074k24896r4287
14130F992640K53367n27068N43479k29377m22365k5382k17700M34092l02212j77460
14120F322014q9757N0711j24707j26763J63715m38490K92317p3830l08516k59350
14110E407344J49186K08942m55205M4076l4083j74239J15431O5823l58691J4901
$$ plain form
14100 4983485 4846317 4941502 4723198 4920452 4645530 4441932 4755441 4685924 4416504 4601897
14090 4601897 4492063 4417668 4141970 4143004 4291311 3943599 4224267 3815110 4007305 4097388
14080 4097388 3751186 3997143 3657725 3694813 3509315 3809148 3728984 3608520 3672126 3565912
14070 3565912 3853308 3494829 3320253 3254632 3391767 3541412 3309733 3360048 2991696 2850677
14060 2850677 3079084 3648829 2928986 3136074 3070801 3034646 2985089 3055368 2926360 2860055
14050 2860055 2943868 2965576 3041781 2682021 2690201 2424645 3145956 2333782 2609363 2758895
14040 2758895 2489041 2488048 2474322 2660482 2538034 2717037 2565902 2479205 2520092 2559919 2551122
14029 2551122 2239463 2767268 2456652 2282064 1866363 2192389 2504342 2005659 2264950
$$ packed form
14100D983485j37168R5185k18304J97254k74922k03598L13509o9517k69420J85393
14090D601897j09834p4395k75698J034J48307l47712K80668m09157J92195R0083
14080D097388l46202K45957l39418L7088j85498K99833q0164j20464O3606j06214
14070C565912K87396l58479j74576o5621J37135J49645k31679N0315l68352j41019
14060B850677K28407N69745p19843K07088o5273l6155m9557P0279j29008o6305
14050B860055Q3813K1708P6205l59760Q180k65556P21311q12174K75581J49532
14040B758895k69854r93j3726J86160j22448J79003j51135q6697M0887L9827q797
14029B551122l11659N27805l10616j74588m15701L26026L11953m98683K59291
$$ plain form
14020 2264950 2041619 2165223 2254472 2400055 1970846 1972022 2062957 1847392 2237929 2457301
14010 2457301 2101366 1888041 2119700 2185456 2028341 1841577 2000264 2005693 1430272 1598808
14000 1598808 1859171 2034054 1675506 1715171 1642532 1662119 2088590 2123484 1918123 2260325
13990 2260325 2873882 4440060 7531760 17600049 33294601 32244466 19230961 10887544
13982 10887544 6446011 4499235 3749677 3390695 2791014 2617713 2646733 2409585 2411089
13973 2411089 2153760 2190017 2222161 2161585 2067565 2142724 1724057 1820562 1823489 1626388 1740780
13962 1740780 1586856 1340581 1880526 1568895 1950830 2044489 1727461 1517938 1922453 1863267
13952 1863267 1557073 1675649 1502201 1520225 1303543 1574987 1413160 1549855 1720567 1677039
$$ packed form
14020B264950k23331J23604Q9249J45583m29209J176R0935k15565L90537K19372
14010B457301l55935k13325K31659O5756j57115j86764J58687N429n75421J68536
14000A598808K60363J74883l58548L9665p2639J9587M26471L4894k05361L42202
13990B260325O13557J566178L091700J0068289J5694552j050135j3013505q343417
13982A0887544m441533j946776p49558l58982n99681j73301K9020k37148J504
13973B411089k57329L6257L2144o0576r4020P5159m18667R6505K927j97101J14392
13962A740780j53924k46275N39945l11631L81935R3659l17028k09523M04515n9186
13952A863267l06194J18576j73448J8024k16682K71444j61827J36695J70712m3528
$$ plain form
13942 1677039 1636849 1314092 1423708 1394011 1415016 1337065 1483673 1279024 1554454 1281467
13932 1281467 1362831 1471133 1055293 1301496 1111654 1515099 1148925 1640602 1354102 1102626
13922 1102626 1408137 1144722 1079140 970592 1062923 910560 1360187 1075898 1173187 1434220
13912 1434220 1314302 1098503 1252380 1084749 1421028 963558 974249 1243310 1172450 1413107
13902 1413107 1108274 831484 1175051 822880 1104135 1087480 1173567 964130 1052775 849327
13892 849327 953437 910341 1093444 926808 833226 864358 877854 1343533 807952 1047371
13882 1047371 1037909 839331 895853 957733 687358 1194693 838046 1119489 776926 941914
13872 941914 964745 934785 1197410 1014081 978007 1012080 629990 790152 985132 1180633
$$ packed form
13942A677039m0190l22757J09616k9697K1005p7951J46608k04649K75430k72987
13932A281467Q1364J08302m15840K46203j89842M03445l66174M91677k86500k51476
13922A102626L05511k63415o5582j08548R2331j52363M49627k84289R7289K61033
13912A434220j19918k15799J53877j67631L36279m57470J0691K69061p0860K40657
13902A413107l04833k76790L43567l52171K81255j6655Q6087k09437Q8645k03448
13892H49327J04110m3096J83103j66636r3582L1132J3496M65679n35581K39419
13882A047371r462j98578N6522O1880k70375N07335l56647K81443l42563J64988
13872I41914K2831k9960K62625j83329l6074L4073l82090J60162J94980J95501
$$ plain form
13862 1180633 714499 954745 634467 655636 918684 648147 644494 958570 965676 906505
13852 906505 894559 853345 943358 855073 853843 723398 1077105 680696 577434 629072 619086
13841 619086 360770 716856 574673 1051860 702434 728396 551086 947170 868024 903090
13831 903090 590189 1046184 1053899 680641 558362 685100 946671 992086 420426 787180
13821 787180 485706 704301 571907 1017419 829368 662901 364690 607488 793938 763076
13811 763076 756118 563908 846044 609164 1003085 198082 613291 716890 843388 662460
13801 662460 515430 484419 489645 512842 763545 523886 856446 539643 464847 377877 587575
13790 587575 517303 463923 623129 531727 777682 703456 1019344 649338 973991 602794
$$ packed form
13862A180633m66134K40246l20278K1169K63048k70537l653L14076P106n9171
13852I06505j1946m1214R0013q8285j230j30445L53707l96409j03262N1638r986
13841F19086k58316L56086j42183M77187l49426K5962j77310L96084p9146L5066
13831I03090l12901M55995P715l73258j22279J26738K61571M5415D20426L66754
13821G87180l01474K18595j32394M45512j88051j66467k98211K42798J86450l0862
13811G63076o958j92210K82136k36880L93921A98082M15209J03599J26498j80928
13801F62460j47030l1011N226K3197K50703k39659L32560l16803p4796q6970K09698
13790E87575p0272n3380J59206r1402K45955p4226L15888l70006L24653l71197
$$ plain form
13780 602794 718015 663527 488374 562746 839170 183481 529647 482943 420553 562806
13770 562806 680609 372698 509266 689452 384525 563615 614844 574745 405925 801343
13760 801343 593410 738615 623177 246876 467539 507691 390260 724845 326595 199052
13750 199052 500203 399118 565383 539815 401834 169547 456787 467242 280796 427962
13740 427962 448910 566878 565822 267856 761729 653518 358079 331516 587739 653652
13730 653652 341765 325469 365813 502583 352096 420264 505168 409324 432724 245170 577153
13719 577153 279394 447779 591892 340546 553849 423059 508064 542966 233614 232278
13709 232278 292455 414051 358018 270462 754382 444519 139835 358509 193029 269023
$$ packed form
13780F02794J15221n4488j75153P4372K76424A83481L46166m6704o2390J42253
13770E62806J17803l07911J36568J80186l04927J79090N1229m0099j68820L95418
13760H01343k07933J45205j15438B46876K20663M0152j17431L34585C26595j27543
13750A99052L01151j01085J66265k5568j37981A69547K87240J0455j86446J47166
13740D27962K0948J17968j056B67856M93873j08211k95439k6563K56223O5913
13730F53652l11887j6296M0344J36770j50487O8168Q4904r5844K3400j87554L31983
13719E77153B79394J68385J44113k51346K13303j30790Q5005L4902B33614j336
13709B32278O0177J21596n6033q7556M83920l09863A39835K18674j65480P5994
$$ plain form
13699 269023 671655 371387 586418 754715 393425 331848 357609 413237 296784 444595
13689 444595 561767 365501 455149 449172 464111 275642 684868 463690 408112 212774
13679 212774 289206 468610 496277 317244 605387 539779 393399 425017 422607 187174 677815
13668 677815 617040 118975 249738 293968 256981 540456 641141 357061 357876 526864 582505
13657 582505 305512 175081 248921 217945 136274 31406 310280 382241 673663 72412 486997
13646 486997 180682 310406 313172 466798 307929 533764 77718 274280 338847 75502
13635 301379 656118 210607 340177 280306 597623 394906 434702 -48310 75859 258919
13625 258919 273613 117508 117084 469456 249295 187619 105192 219358 224633 361482 -44971
$$ packed form
13699B69023M02632l00268K15031J68297l61290o1577K5761N5628j16453J47811
13689D44595J17172j96266Q9648n977J4939j88469M09226k21178n5578j95338
13679B12774P6432J79404K7667j79033K88143o5608j46380L1618k410A87174M90641
13668F77815o0775A18975J30763M4230l6987K83475J00685k84080Q15J68988N5641
13657E82505k76993j30431P3840l0976q1671C1406K78874P1961K91422G2412M14585
13646D86997A80682J29724K766J53626j58869K25835G7718J96562O4567G5502
13635C01379L54739B10607J29570n9871L17317k02717L9796d8310G5859J83060
13625B58919J4694A17508m24L52372k20161o1676q2427J14166N275J36849d4971
$$ plain form
13613 247917 241013 407582 496968 99114 245103 310867 339239 344008 197004 325179 534292
13602 534292 338127 714733 217357 132486 377416 68276 -83809 581024 104313 236227
13592 236227 254744 -11583 388857 465101 330443 221953 261466 548067 296019 146871
13581 219915 32140 327509 153248 345060 340220 426793 -57460 254248 244604 395937 377029
13570 377029 323892 318301 102590 503464 350997 166241 675259 190500 342068 476952
13560 476952 248419 78415 211429 -10075 -31439 154199 146709 329785 404398 -391 585874
13548 540926 358060 415135 695560 266051 639741 -43159 138397 312214 429073 293191
13538 293191 360353 394475 400021 305431 288051 59661 133275 432610 56850 37493 123790
$$ packed form
13613B47917o904J66569Q9386I9114J45989O5764K8372M769j47004J28175K09113
13602E34292j96165L76606B17357q4871K44930F8276h3809E81024A04313J31914
13592B36227J8517a1583C88857P6244j34658j08490L9513K86601k52048A46871
13581B19915C2140K95369A53248J91812m840Q6573e7460B54248r644J51333j8908
13570C77029n3137n591A02590M00874j52467A66241N09018A90500J51568J34884
13560D76952k28533G8415J33014a0075k1364A54199p490J83076P4613c91E85874
13548E40926j82866N7075K80425B66051L73690d3159A38397J73817J16859j35882
13538B93191O7162L4122N546r4590j7380E9661P3614K99335E6850j9357Q6297
$$ plain form
13527 123790 181994 272360 11226 265845 190234 209758 290350 106211 174587 208551 7583
13515 -2911 252733 170198 285021 333172 56296 470499 -16717 219824 209930 338350 308755
13504 308755 -87108 470021 229766 22297 121271 -32377 142711 362543 23754 180059
13494 180059 266337 234732 154831 299134 434180 119414 49684 -28191 301813 423002
13484 423002 134455 166897 177620 -927 42377 459661 -103008 272618 302495 155346 -46675
13472 228994 170241 158728 168694 2553 175266 118933 214282 438179 23413 -64425 385415
13460 164091 510928 38626 75624 359701 173635 -102626 94560 208410 151027 -73899
13449 312793 430831 8068 280340 111605 127289 120051 272254 277542 228045 133515 199057
$$ packed form
13527A23790N8204R0366A1226K54619p5611J9524Q0592A06211O8376L3964G583
13515b911B52733q2535J14823M8151E6296M14203a6717B19824r894J28420k9595
13504C08755h7108D70021B29766B2297R8974c2377A42711K19832B3754J56305
13494A80059Q6278l1605p9901J44303J35046A19414D9684b8191C01813J21189
13484D23002A34455L2442J0723i27D2377M17284a03008B72618K9877j47149d6675
13472B28994n8753j1513R966B553J72713n6333R5349K23897B3413f4425C85415
13460A64091L46837C8626L6998K84077A73635a02626I4560J13850n7383g3899
13449C12793J18038H068K72272A11605J5684p238J52203N288m9497r4530O5542
$$ plain form
13438 199057 60417 178198 -100958 -4300 -70815 317852 -212960 91620 -6155 -164140 393661
13426 10906 45815 264553 273744 453154 -98395 283628 -174103 298736 18708 80564 261473
13415 261473 -38970 245797 -29034 -23034 64958 -78407 337702 -194250 203572 116392 444135
13404 444135 359657 -143708 58295 231684 369479 89499 50097 -16261 158550 167642 135405
13393 135405 116660 77531 -251680 244452 -56958 217413 204714 -239189 285077 134027
13382 148519 337078 295637 329905 164856 42601 73975 234282 339724 113396 93911
13372 93911 -310091 360367 485474 47971 165053 278783 134101 216675 495849 -98332
13361 34573 211225 137180 371022 124224 359829 136034 59725 253914 198240 280930
$$ packed form
13438A99057F0417J17781a00958d300o6515C17852b12960I1620f155j57985C93661
13426A0906L4909K18738R191J79410i8395B83628a74103B98736A8708O1856J80909
13415B61473c8970B45797b9034O000F4958g8407C37702a94250B03572q7180L27743
13404D44135q4478a43708E8295J73389J37795H9499l9402a6261A58550R092l2237
13393A35405j8745l9129b51680B44452e6958B17413j2699b39189B85077A34027
13382A48519J88559m1441L4268A64856D2601L1374J60307J05442A13396j9485
13372I3911c10091C60367J25107D7971J17082J13730A34101Q2574K79174i8332
13361C4573J76652p4045K33842A24224K35605A36034E9725J94189n5674Q2690
$$ plain form
13351 280930 -74803 -15063 199507 57637 258648 460557 92285 294370 259631 175989 373277
13340 373277 458220 300476 18165 460108 296069 100845 -26966 -20746 82960 443080 130091
13328 98418 405028 104860 355578 116138 -26929 107487 188086 421727 373167 -22852
13317 -20366 -13947 268371 216301 121904 415419 68265 260261 240269 149303 11263 335189
13306 335189 -116466 -34623 -237205 335665 181186 25371 21869 244623 100239 -89208
13295 -141973 557650 6078 102815 112052 111530 16536 -105366 100232 139151 23661 234941
13284 234941 -14673 13899 228281 33936 209675 197295 29631 44915 -166241 261497 96499
13272 294144 -70804 -69015 304688 441680 8002 -108287 125150 76633 43088 74142 82218
$$ packed form
13351B80930g4803a5063A99507E7637K01011K01909I2285K02085l4739q3642J97288
13340C73277Q4943j57744A8165M41943j64039A00845b6966O220H2960L60120A30091
13328I8418L06610A04860K50718A16138b6929A07487Q0599K33641m8560b2852
13317b0366O419B68371n2070r4397K93515F8265J91996j9992r0966A1263L23926
13306C35189a16466c4623k02582C35665j54479B5371l502K22754A00239h9208
13295a41973E57650F078R6737R237n22A6536a05366A00232L8919B3661K11280
13284B34941a4673A3899K14382C3936J75739j2380B9631J5284a66241B61497I6499
13272B94144g0804J789C04688J36992H002a08287A25150m8517l3545L1054Q076
$$ plain form
13261 82218 150512 361546 164031 195808 161506 -40750 162349 -6854 -128819 184848 -167410
13249 55170 350294 169087 37783 -46331 436965 166370 -114410 426782 134282 81400
13239 81400 164709 330824 314698 -223630 -153698 170306 366347 191782 -99222 458330
13228 245443 20548 -139353 -144064 57501 184438 40922 -305599 262609 127354 238275
13218 238275 -29549 173893 375210 -68798 -153607 -243526 72255 29595 108359 128769 84819
13207 84819 284276 -17549 55739 -84659 -51809 287479 194953 159318 -37218 106565 275350
13196 275350 -49316 -198261 4988 -188985 -67713 288680 211768 -130846 -51221 -32661 26777
13184 -36106 153467 -69652 -74504 -13458 -13888 277099 -25969 404244 17536 316619 455647
$$ packed form
13261H2218O8294K11034A64031L1777l4302d0750A62349f854j21965A84848a67410
13249E5170K95124A69087C7783d6331D36965A66370a14410D26782A34282n2882
13239H1400Q3309J66115j6126b23630O9932A70306J96041j74565i9222D58330
13228B45443B0548a39353m711E7501J26937D0922c05599B62609A27354J10921
13218B38275b9549A73893K01317f8798q4809q9919G2255B9595P8764K0410m3950
13207H4819J99457a7549E5739h4659L2850B87479r2526l5635c7218A06565J68785
13196B75350d9316j48945D988a88985f7713B88680p6912a30846e1221J8560B6777
13184c6106A53467f9652m852a3458m30B77099b5969D04244A7536K99083J39028
$$ plain form
13173 455647 200363 180116 317060 -179420 82826 57837 259481 213092 150498 -110601
13162 -77680 111558 392714 -165002 60320 168280 -443372 52190 335726 487669 149790
13151 52932 227795 67886 -176508 483585 167884 17298 -90277 197469 28775 -182542
13140 149950 60575 211533 123846 -4863 274212 -423291 -79127 215783 294385 295412 49555
13128 102224 -104283 -174261 128085 87817 158610 224650 -105885 271558 -170490 97883
13117 59533 -66930 100252 71923 84556 -131410 332944 29033 -63271 75125 444089 84421
13105 383700 222848 -189138 -31201 105739 82274 34799 -219707 78394 -84095 347127
13094 -101362 13523 29073 6499 -100230 146770 189141 -135522 287427 43285 93752 -323943
$$ packed form
13173D55647B00363k0247J36944a79420H2826k4989K01644m6389o2594a10601
13162g7680A11558K81156a65002F0320J07960d43372E2190K83536J51943A49790
13151E2932J74863F7886a76508D83585A67884A7298i0277A97469B8775a82542
13140A49950F0575J50958q7687d863B74212d23291g9127B15783P8602J027D9555
13128A02224a04283o9978A28085m0268P0793O6040a05885B71558a70490I7883
13117E9533f6930A00252k8329J2633a31410C32944B9033f3271G5125L68964H4421
13105C83700j60852a89138c1201A05739k3465C4799b19707G8394h4095C47127
13094a01362A3523J5550F499a00230A46770M2371a35522B87427D3285N0467c23943
$$ plain form
13082 18644 339566 76938 -192448 28960 -222807 292456 185940 302517 74593 -168518
13071 154587 -300614 -207444 182183 43553 215079 365055 98973 -72848 200023 62243
13060 -58102 247410 -2448 34107 70416 106018 15402 -224594 11056 168457 124085 -360211
13048 -167156 195076 58136 235795 86211 -370521 176286 131203 -65891 -274887 67948
13037 -35859 75892 102494 161520 -5454 378266 35304 -13678 -65140 114056 -48516 119921
13025 91313 100400 47060 65055 21202 122295 110472 235789 81185 251766 15718 311047
13014 311047 15172 120887 86255 365533 -157801 231592 237311 -162595 4785 179494 -85179
13002 155225 433997 -122958 129681 101183 -57295 39982 274309 220942 10395 -191181
$$ packed form
13082A8644L20922G6938a92448B8960b22807B92456j06516J16577G4593a68518
13071A54587c00614R3170A82183D3553J71526J49976I8973g2848B00023F2243
13060e8102B47410b448C4107L6309L5602A5402b24594A1056J57401m4372c60211
13048a67156A95076E8136J77659H6211c70521A76286m5083f5891k08996F7948
13037c5859G5892K6602N9026e454C78266C5304a3678n1462A14056d8516A19921
13025I1313R087D7060J7995B1202J01093j1823J25317H1185J70581A5718K95329
13014C11047A5172J05715l4632K79278a57801B31592N719a62595D785J74709h5179
13002A55225K78772a22958A29681k8498e7295C9982K34327n3367A0395a91181
$$ plain form
12991 14544 193339 -24049 9057 -87304 -216729 -176895 -131625 -324165 -161718 -51583 -6524
12979 56797 466068 193935 90783 96643 235183 6287 293688 96500 194339 47630 -6101
12967 -46032 181099 38657 135298 43841 290724 -362589 -81338 162794 -187708 255460
12956 -36834 -78551 -83221 87781 151160 173197 -80256 -4637 25023 93458 180305 -16271 -181524
12944 -181524 141795 -135827 -117621 4500 -98807 96170 350124 -108202 41707 64869 86550
12933 86550 -188111 14686 -28105 -123694 -140475 -75188 -16038 16188 -348680 -251445 -75693
12921 -470782 -54607 -343825 470071 -34149 -10842 -55926 -7387 142942 9831 -47331 178451
12909 52048 -164490 -89493 272863 7328 119391 189220 90354 -31590 96577 127701 -72330
$$ packed form
12991A4544J78795b4049I057h7304j29425L9834M5270j92540a61718e1583f524
12979E6797M09271A93935I0783N860J38540F287K87401I6500R7839D7630f101
12967d6032A81099C8657R6641D3841K46883c62589h1338A62794a87708B55460
12956c6834m1717m670H7781O3379K2037h0256d637B5023O8435Q6847a6271j65253
12944a81524A41795a35827J8206D500i8807I6170K53954a08202D1707K3162K1681
12933H6550a88111A4686b8105r5589j6781O5287a6038A6188c48680R7235g5693
12921d70782e4607k89218D70071c4149a0842m5084g387A42942I831d7331A78451
12909E2048a64490P4997B72863G328J12063O9829I0354c1590I6577L1124g2330
$$ plain form
12897 -190874 123602 -82753 -93102 118966 -96609 -87396 37616 -78619 208875 141158 261245
12886 261245 98894 -39787 -101826 -116382 46335 -70027 18978 87758 -42339 257535 115305
12874 156380 22444 359877 212139 358869 -270515 35922 346369 39643 125811 76454
12864 76454 -90984 -92379 -209837 -68576 152784 1837 49707 -78257 -217454 262134 -170815
12852 -110999 54048 -69207 349973 -254398 -183783 38239 -221058 134641 128603 41363 95831
12841 95831 211761 -38046 -36445 377697 -329621 -218420 -105262 -104982 93257 -214016 -27975
12829 218590 245487 -380086 215221 317054 101894 -385643 118301 -260330 -132872 -74905
12819 -74905 -11742 50331 171154 -195870 257935 -12982 27660 -175002 54271 50461 -227642
$$ packed form
12897a90874A23602h2753j0349A18966i6609R213C7616g8619B08875o7717J20087
12886B61245I8894c9787o2039j4556D6335g0027A8978O8780d2339B57535A15305
12874A56380B2444L37433j47738J46730b70515C5922L10447C9643Q6168m9357
12864G6454i0984j395j17458f8576A52784A837M7870g8257j39197B62134a70815
12852a10999E4048f9207C49973b54398P0615C8239b21058A34641o038D1363N4468
12841I5831J15930c8046J601C77697c29621J11201a05262K80I3257b14016b7975
12829B18590K6897c80086B15221J01833A01894c85643A18301b60330J27458N7967
12819g4905a1742E0331J20823a95870B57935a2982B7660a75002E4271l810b27642
$$ plain form
12807 41265 245314 67627 -212420 -236658 26490 49470 -31607 -96701 -10632 173192 131846
12796 131846 -52308 -221371 81490 -63618 -133812 74993 215004 350857 100557 -75031 -179347
12785 -179347 -238188 50448 144919 286864 101224 -247472 254124 229095 161470 -292125
12774 -14465 -21015 -75000 -132636 99871 -384507 -68287 337275 -216766 138348 161595 -177147
12762 14746 -99093 89502 130928 -52863 90036 -296493 -359976 -75901 149823 -163922 100245
12750 -283480 -82483 -180361 62641 -95047 -50785 -104776 156848 195281 -175200 -288544 114196
12738 435692 -172070 27732 121068 357782 -307165 109051 282302 26594 -263895 -15803
12727 147692 -76384 73381 -136268 -42445 4882 -183579 -99486 -149244 -144072 127168 -35570
$$ packed form
12807D1265K04049F7627b12420k4238B6490K2980c1607o5094a0632A73192m1346
12796A31846e2308j69063H1490f3618p0194G4993J40011J35853A00557g5031j04316
12785a79347n8841E0448R4471J41945A01224b47472B54124k5029o7625b92125
12774a4465o550n3985n7636I9871c84507f8287C37275b16766A38348K3247a77147
12762A4746i9093H9502M1426e2863I0036b96493o3483g5901A49823a63922A00245
12750b83480h2483r7878F2641i5047M4262n3991A56848L8433a75200j13344A14196
12738D35692a72070B7732R3336K36714c07165A09051J73251B6594b63895a5803
12727A47692g6384G3381a36268d2445D882a83579Q4093m9758N172A27168c5570
$$ plain form
12715 99939 187970 168609 -102487 116325 -7303 267911 195295 139242 -92046 353087 -112480
12703 13850 142987 276342 -82898 -100129 -21210 14466 -405875 -161726 12083 240815 -140762
12691 -199270 39397 -11618 90062 158121 -49731 43600 -36983 199662 4206 162363 110923
12680 110923 -51569 32573 299731 -349642 201781 106310 -291679 263752 100429 123738
12670 123738 -333100 46525 -50300 86211 32193 260141 -89035 -130057 144922 60102 164605
12659 164605 51167 392966 -30270 236411 200651 273603 21334 317509 60211 -80005 207567
12647 -65972 19381 15742 23363 -70894 -226150 -94752 88831 371239 166410 -146999 42668
12635 247712 -132694 294653 459813 227312 321062 114993 404635 201764 13736 -23563
$$ packed form
12715I9939Q8031j9361a02487A16325g303B67911p2616n6053i2046C53087a12480
12703A3850J29137J33355h2898j7231b1210A4466d05875a61726A2083K28732a40762
12691a99270C9397a1618I0062O8059d9731D3600c6983A99662D206J58157n1440
12680A10923e1569C2573K67158c49642B01781r5471b91679B63752A00429K3309
12670A23738c33100D6525e0300H6211C2193K27948h9035m1022A44922F0102J04503
12659A64605E1167L41799c0270B36411l5760P2952B1334K96175F0211h0005B07567
12647f5972A9381l639P621g0894j55256i4752H8831K82408A66410a46999D2668
12635B47712a32694B94653J65160B27312R3750A14993K89642B01764A3736b3563
$$ plain form
12624 215965 -76749 223001 -67654 121767 45470 504922 122484 116854 -262758 -204829 40517
12612 173992 -303066 62073 -110854 384144 -132907 -8586 -52338 100438 -157608 -12278
12601 301313 161707 568949 330228 256900 121465 211514 -138 100427 359181 304914 91308
12589 200871 109403 96462 23868 -67825 -89366 154162 32470 -61678 -97578 -101306 17735
12577 -85623 -75357 -374542 -118879 -80105 99574 860 66277 -267021 2789 121622 101990
12566 101990 -90696 -222399 -127715 107860 -115235 207612 72396 285616 89885 -281836
12555 -11615 154174 26012 -179362 -59119 108824 -59628 372925 26283 191985 -68828 169985
12543 311954 -222676 -39077 67454 439905 4034 -274945 -119398 115293 -40063 -469367
$$ packed form
12624B15965g6749B23001f7654A21767D5470M59452A22484n630b62758N7929D0517
12612A73992c03066F2073a10854C84144a32907h586m3752A00438a57608a2278
12601C01313j39606M07242k38721p3328A21465R0049a38A00427K58754n4267I1308
12589B00871r1468j2941B3868f7825k1541A54162C2470f1678l5900l728A7735
12577h5623J0266k99185a18879L8774I9574H60O5417b67021B789J18833j9632
12566A01990i0696j31703R4684A07860a15235B07612G2396K13220H9885b81836
12555a1615A54174B6012a79362e9119A08824e9628C72925B6283J65702f8828A69985
12543C11954b22676c9077F7454L72451D034b74945a19398A15293d0063m29304
$$ plain form
12533 -469367 12617 -3820 -268388 -132473 44584 204931 -119823 15315 445744 218419
12522 59134 4083 147604 368860 66575 106420 -201782 143584 120390 -90003 273913 29936
12510 -42056 98458 -9252 -86251 8485 147274 -76850 -53151 -124051 44437 57307 5910 49757
12498 49757 -271707 187288 204883 -76697 -135700 197201 70480 -61319 -225334 162356 -71826
12486 421204 248331 338506 185367 31894 -295942 123477 -27064 -165317 183340 -73576
12475 -17854 -91776 154319 128412 -160869 -404744 237774 -92902 -295383 -92029 277442
12464 133339 -121725 240974 -53558 6296 -150324 -408659 65542 23737 -191157 -43084 -71038
12453 -71038 -181621 -23521 285760 -264174 50696 126846 99413 -24347 -323411 87479 75987
$$ packed form
12533d69367A2617c820k64568a32473D4584J60347a19823A5315M30429B18419
12522E9134D083J43521K21256F6575L9845b01782A43584k3194i0003B73913B9936
12510d2056I8458i252p6999H485J38789g6850K3699p0900D4437J2870E910M3847
12498D9757b71707A87288J7595g6697n9003A97201G0480f1319j64015A62356g1826
12486D21204j72873R0175j53139C1894b95942A23477b7064j38253A83340g3576
12475a7854p3922A54319k5907a60869k43875B37774i2902k02481i2029B77442
12464A33339a21725B40974e3558F296a50324k58335F5542B3737a91157d3084k7954
12453g1038j10583b3521B85760b64174E0696P6150k7433b4347k99064H7479j1492
$$ plain form
12442 75987 -84845 -7120 165803 242067 12119 155321 353537 -1247 147791 -301564 -168822
12431 -168822 106279 -262 138483 -94341 -66513 183601 -71097 121662 366732 8013 -279829
12419 -241621 28741 -345240 -403628 -107605 -27329 -223906 -85448 -156846 210561 194478 -109483
12407 -118733 -219675 57557 -167260 82194 -21329 -215961 -20842 287728 -43296 -88425 -29468
12395 86902 -20288 108491 -118691 -30615 113773 -155884 9066 -185584 -137946 7172 229564
12384 229564 -148393 227326 -248062 190645 149887 -14776 -392471 14591 -26010 -62295
12374 -62295 176005 243154 101042 -11597 298898 62466 -151518 -332003 135662 239494
12364 239494 -50756 234083 232175 302424 -286534 292561 189784 240972 4527 -133843 -222799
$$ packed form
12442G5987h4845g120A65803P6264A2119J43202J98216a247A47791c01564J32742
12431a68822A06279b62A38483i4341K7828A83601g1097A21662K45070H013b79829
12419b41621B8741c45240n8388a07605b7329j96577h5448p1398B10561j6083a09483
12407a18733j00942E7557a67260H2194b1329j94632b0842B87728d3296m5129b9468
12395H6902b0288A08491a18691c0615A13773a55884I066a85584M7638G172K22392
12384B29564a48393B27326b48062A90645m0758a4776l77695A4591b6010l6285
12374f2295A76005O7149A01042a1597B98898F2466a51518j80485A35662J03832
12364B39494e0756B34083j908P0249b86534B92561j02777N1188D527a33843q8956
$$ plain form
12353 -222799 -267505 479715 -86788 146687 50787 -108898 157123 99081 -322630 -10474
12342 116407 -191097 -4093 -312949 297869 -12691 66136 -77512 -337638 -238668 152577 56768
12330 2562 -106547 362419 345978 -191627 -421639 295259 -184950 99566 53306 -14651 72244
12318 -15945 -46893 191664 -4693 -2667 100762 90391 -271995 -340714 -97187 -59 -39769 -237556
12306 -237556 97316 -253740 -34019 -35968 -76630 -15509 -414 -378941 224701 -227485 -370873
12295 -370873 314817 146425 -74758 113387 112033 125197 -91424 -323784 166880 94432 -46624
12283 229342 -233538 86196 -8939 -156862 -95790 354814 -25614 336910 39183 175698 -231096
12271 -43356 74614 -139214 -57229 223323 327168 20371 152670 -86616 88740 265246 14833
$$ packed form
12353b22799m4706D79715h6788A46687E0787a08898A57123n8042c22630a0474
12342A16407a91097d093l08856B97869a2691F6136g7512k60126R8970A52577E6768
12330B562a06547C62419j6441a91627k30012B95259a84950I9566m6260a4651G2244
12318a5945l0948A91664d693K026A00762j0371b71995o8719i7187e9l9710j97787
12306b37556I7316b53740c4019j949m0662a5509d14l78527B24701b27485j43388
12295c70873C14817A46425g4758A13387j354J3164i1424k32360A66880p2448d6624
12283B29342b33538H6196h939j47923O1072C54814b5614C36910C9183J36515b31096
12271d3356G4614a39214e7229B23323J03845B0371J32299h6616H8740J76506A4833
$$ plain form
12259 -48932 86896 15009 122824 69201 117656 43909 121089 15494 106980 15417 -132790
12247 133097 217426 -29721 178253 9456 249755 184275 -112553 219797 167440 -57356 117417
12235 -25085 40981 96742 -38109 391895 218685 55222 294017 322003 148923 214764 314757
12224 314757 -48389 73927 137319 298516 79943 45073 32036 196076 287300 -539 130221
12212 -8990 324960 270305 369193 202452 87055 157626 256082 332429 355230 -49815 -675 458649
12199 362526 163005 264370 349451 583950 -75776 257755 244701 238816 23920 23118 262308
12188 262308 186972 121810 72750 20481 157656 81768 170765 -186690 224562 340216 230611
12177 230611 -31724 76506 -34452 419050 -90298 235844 190622 29475 -46003 -156643 -88899
$$ packed form
12259d8932H6896A5009J07815n3623M8455D3909P7180A5494R1486A5417a32790
12247A33097Q4329b9721A78253I456K40299o5480a12553B19797n2357e7356A17417
12235b5085D0981N5761c8109C91895j73210E5222K38795K7986A48923O5841R9993
12224C14757d8389G3927O3392J61197G9943l4870j3037J64040R1224e39A30221
12212h990C24960n4655R8888j66741H7055P0571R8456P6347K2801d9815f75D58649
12199C62526A63005J01365Q5081K34499g5776B57755j3054n885B3920q02K39190
12188B62308p5336o5162m9060B0481J37175p5888Q8997a86690B24562J15654j09605
12177B30611c1724G6506c4452D19050i0298B35844m5222B9475d6003j10640O7744
$$ plain form
12166 -88899 69242 116773 274460 77465 5032 30201 318313 215458 221845 67678 23322
12154 79550 -48448 65057 119609 -41191 -31386 229624 310180 269477 -221569 94002 61085
12143 61085 -323003 -126430 -71794 163624 116347 24523 44394 -232870 -217613 -105895 27982
12131 63427 -370278 375408 -253230 -61958 -227641 354643 -124475 -139730 47847 214250
12121 214250 -77660 -271569 17327 -68241 -155274 109548 84104 -148979 58130 -127387 28567
12109 75569 -192515 -291902 -42776 94245 18476 -41002 164391 -45602 -441362 84768 -16537
12097 -369713 -135927 -171833 205864 -145823 192078 -36352 65891 -491479 -123823 20005
12086 -11069 49646 240307 263375 -161148 -266421 -150067 -74870 -128607 94533 11587 40248
$$ packed form
12166h8899F9242M7531J57687G7465E032K5169K88112j02855O387F7678B3322
12154G9550d8448F5057N4552d1191R805B29624Q0556m0703b21569I4002l2917
12143F1085c23003a26430N4636A63624m7277B4523J9871b32870J5257a05895B7982
12131F3427c70278C75408b53230f1958j65683C54643a24475j5255D7847J66403
12121B14250g7660j93909A7327f8241q7033A09548k5444a48979E8130a27387B8567
12109G5569a92515r9387d2776I4245A8476d1002A64391d5602l95760H4768a6537
12097c69713a35927l5906B05864a45823A92078c6352F5891d91479a23823B0005
12086a1069D9646J90661K3068a61148j05273J16354g4870n3737I4533A1587K8661
$$ plain form
12075 40248 -19768 -30258 -170375 -18274 -328600 -102293 417237 -267878 -326871 350351
12064 -139393 223669 1018754 1598593 775225 277667 -33005 132969 71207 -19653 -65525
12054 -65525 -258184 -98601 -272872 233415 162215 -4550 -89688 -92731 16437 65206 -89108
12042 -90438 44533 -87352 125858 -446088 213920 270496 -66795 -268837 220392 -63161 -229228
12031 -229228 46236 -173465 -270129 -78326 -11935 19667 101906 119039 72569 375410 322524
12020 322524 20757 39874 -131562 -53715 85538 -206258 157997 202663 23877 -193882 -43803
12008 -159773 -127437 66105 -1405 -247856 134717 164907 106808 29326 -129497 -72760 -510800
11997 -510800 69576 -396583 -170736 -60124 -19301 61538 139767 38904 -65016 81943 -111333
$$ packed form
12075D0248a9768j0490j40117a8274l10326a02293D17237b67878n8993C50351
12064a39393B23669P95085N79839G75225B77667c3005A32969o1762a9653m5872
12054f5525j92659i8601j74271B33415p1200d550q5138l043A6437M8769h9108
12042i0438D4533h7352A25858d46088B13920N6576f6795k02042B20392f3161j66067
12031b29228D6236a73465r6664g8326a1935A9667Q2239J7133m6470L02841n2886
12020C22524B0757J9117a31562e3715H5538b06258A57997M4666B3877a93882d3803
12008a59773L2336F6105a405k46451A34717L0190n8099B9326a29497N6737m38040
11997e10800F9576c96583a70736f0124a9301F1538P8229C8904f5016H1943a11333
$$ plain form
11985 -328980 -106100 191920 9001 65710 237229 -286663 -246801 -20873 -36360 52500 43676
11974 43676 23643 -122376 263383 -197637 73012 -50319 85229 -173951 -89115 -3258 296902
11962 -83898 -190227 197146 232425 -66062 -73968 -121482 -215011 -380377 77287 -324861 217556
11950 71340 -181163 228224 -227201 -89485 -22954 -194395 -239151 -8687 -200952 -29295 -169629
11939 -169629 138071 55687 -213548 -230612 251471 55933 -99219 67980 -39708 -227259 31569
11927 64792 -4512 33200 155648 216231 -108386 35948 -116962 40590 106990 -307965 348713
11915 -212885 15578 -43031 -2230 -19948 -376654 181158 -133717 -272354 289576 -577482
11904 -115011 185599 342151 164789 260353 57844 -344654 103068 -188673 -321877 58028
$$ packed form
11985c28980a06100A91920I001N6709J71519b86663L9862b0873j5487E2500q824
11974D3676k0033a22376B63383a97637G3012e0319H5229a73951Q4836c258B96902
11962h3898j06329A97146L5279f6062p906m7514r3529j65366G7287c24861B17556
11950G1340a81163B28224b27201h9485b2954j71441m4756h687j92265b9295j40334
11939a69629A38071E5687b13548j7064B51471E5933i9219F7980c9708j87551C1569
11927F4792d512C3200J22448O0583a08386C5948a16962D0590O6400c07965C48713
11915b12885A5578d3031b230j7718l56706A81158a33717j38637B89576e77482
11904a15011A85599J56552A64789R5564E7844c44654A03068a88673j33204E8028
$$ plain form
11893 158580 -70227 -77150 -49166 -297085 56884 22975 153772 -100211 233394 -177 -224040
11882 -224040 67326 131528 141091 -348996 248975 -49367 -219581 245121 -29080 -223143 210403
11870 -157809 272642 -75926 27664 -338567 -271344 -99587 -32461 -160189 -181875 128752 243289
11859 243289 59221 -140782 -157220 25061 51960 149502 67446 -51966 164391 -142484 -77990
11848 -77990 -300074 108356 -141162 206186 -11770 261533 141133 340612 -81115 -164794
11838 -164794 82279 -18274 -79236 248579 -85242 28816 156578 -259559 -69838 160139 -131700
11826 65286 141018 -113953 -137792 -477669 139746 155768 102180 298591 -269573 389504
11815 -559422 -52261 -72463 -298429 -59720 124783 49645 20479 -13918 -185000 -11582 -184315
$$ packed form
11893A58580g0227o923K7984k47919E6884B2975J30797a00211B33394a77k23863
11882b24040F7326O4202R563c48996B48975d9367j70214B45121b9080j94063B10403
11870a57809B72642g5926B7664c38567O7223i9587c2461j27728k1686A28752J14537
11859B43289E9221a40782j6438B5061K6899R7542F7446e1966A64391a42484O4494
11848g7990k22084A08356a41162B06186a1770B61533j20400J99479h1115q3679
11838a64794H2279a8274o0962B48579h5242B8816J27762b59559f9838A60139a31700
11826F5286P5732a13953k3839l39877A39746J6022n3588J96411b69573C89504
11815e59422e2261k0202k25966e9720A24783D9645B0479a3918j71082a1582j72733
$$ plain form
11804 -184315 32822 -110000 75924 37731 -203001 44152 87581 -300567 343734 145105
11793 -49297 -175802 -39274 -169373 209091 200184 51220 88448 15319 80702 -182156 -869
11781 198628 86385 -91023 -203444 -228279 59774 -49904 -129541 -479766 126024 278221 263853
11770 263853 139041 145603 -313213 124923 53713 -204953 -140229 56166 -335424 -129775
11759 -320183 109270 220339 132185 -49394 14792 -5064 -196234 72038 -61977 -263682 -110438
11747 113515 64574 -103802 -59744 -244941 -111981 61495 25174 -9761 115552 -120220 -18142
11735 333424 -92952 -191539 -261841 77444 130225 -4051 101968 70892 139809 -108717 2012
11723 -43426 292698 -56175 -10188 250341 -82457 147930 -31705 -168940 10983 -91306 145172
$$ packed form
11804a84315C2822a10000G5924C7731b03001D4152M3429c00567C43734A45105
11793d9297j26505c9274j30099B09091q907E1220L7228A5319O5383a82156h69
11781A98628H6385i1023j12421k4835E9774d9904p9637l50225A26024J52197j4368
11770B63853j24812O562c13213A24923E3713b04953O4724E6166c35424a29775
11759c20183A09270J11069q8154d9394A4792e064j91170G2038f1977k01705a10438
11747A13515m8941a03802M4058j85197a11981F1495B5174i761A15552a20220a8142
11735C33424i2952r8587p0302G7444N2781d051A01968l1076O8917a08717B012
11723d3426B92698e6175a0188B50341h2457A47930c1705j37235A0983i1306A45172
$$ plain form
11711 152054 141285 -182761 -157536 119164 187018 55565 -25010 -183439 79652 -98162 -78303
11700 -78303 133187 260586 295606 239339 -181383 -66214 52474 5842 123854 468841 -32835
11688 99368 39625 127239 -119238 -218083 255003 87231 -103292 149858 178555 -102650 -41357
11676 267096 -86413 238022 352677 237888 -48789 -66965 85046 -169365 228094 18183
11665 426357 -133036 103297 130223 66258 410733 105780 73508 -60485 65973 -7457 -20630
11654 -20630 -194066 116974 -115164 111568 38686 -29026 327606 260039 67293 -8025 159188
11642 -125563 -72942 -188286 -193476 255928 354188 -23333 95157 -90536 65491 51238 -120917
11630 21486 28193 -80331 -127224 65022 194062 208414 -65305 -297580 60590 -60689 -53733 -17391
$$ packed form
11711A52054j0769a82761K5225A19164O7854E5565b5010j58429G9652i8162J9859
11700g8303A33187J27399L5020n6267a81383f6214E2474E842J18012L44987c2835
11688I9368C9625Q7614a19238r8845B55003H7231a03292A49858K8697a02650d1357
11676B67096h6413B38022J14655j14789d8789j8176H5046a69365B28094A8183
11665D26357a33036A03297K6926o3965L44475A05780l2272f0485F5973g457j3173
11654b0630j73436A16974a15164A11568C8686b9026C27606o7567F7293h025A59188
11642a25563N2621j15344n190B55928R8260b3333I5157i0536F5491j4253a20917
11630B1486O707h0331m6893F5022J29040J4352f5305k32275F0590f0689O956a7391
$$ plain form
11617 -127028 -30545 143892 32899 75332 -105358 -116068 -57824 -22927 -2627 178016 151988
11606 151988 40319 -10715 -108452 -15402 247681 19369 90448 81681 -179915 42823 188829
11595 188829 379500 76952 -127738 124121 -22345 -227047 155778 348587 -204507 106605
11584 385841 -88945 232799 59827 241187 433138 -106649 -224241 -97119 79425 193517
11574 193517 23751 114742 132371 237808 45570 49693 212490 -210643 260400 -8609 54530
11562 -208821 168001 -9196 524014 -483 181218 -141523 -76483 57704 52903 267936 298996
11551 298996 47024 131945 141984 235598 45850 248531 34433 -72072 4618 158760 84481
11540 84481 155676 264806 116409 -36553 -46347 30759 -128796 149521 160580 209208 -39915
$$ packed form
11617a27028c0545A43892C2899M2433a05358j0710e7824b2927b627A78016k6028
11606A51988D0319a0715r7737a5402B47681A9369P1079q767a79915D2823J46006
11595A88829J90671G6952a27738A24121b2345k04702A55778J92809b04507A06605
11584C85841h8945B32799E9827J81360J91951a06649j17592i7119G9425J14092
11574A93517B3751R0991J7629J05437D5570M123J62797b10643B60400h609E4530
11562b08821A68001i196E24014d83A81218a41523O5040E7704m801K15033L1060
11551B98996D7024Q4921J0039R3614D5850K02681C4433g2072D618J54142p4279
11540H4481P1195J09130A16409c6553r794C0759a28796A49521J1059M8628c9915
$$ plain form
11528 247444 381860 141053 139556 -118366 431184 32941 451600 124267 -24626 160419
11517 -42065 83401 134277 -55230 64875 123814 84857 53886 24896 -59359 -28714 56629 -131587
11504 224054 229136 83690 78849 -7701 -209224 176769 306127 58690 218878 -142788 132395
11492 137721 -99910 -137880 427559 51877 -10311 -131986 18898 -32770 88868 365031 132547
11480 30625 57571 -200266 108117 243241 44619 46775 -4976 308388 234703 416737 -154939
11468 54690 -22107 211293 206320 291266 -125682 278356 227161 -70416 107608 292288 -32573
11456 227225 37457 -139010 41134 136664 237677 -94896 -220742 -195456 114544 126848 318452
11445 318452 214639 -23520 -5371 111254 -38140 240609 84985 -47299 -76370 308376 176791
$$ packed form
11528B47444J34416A41053j497a18366D31184C2941M18659A24267b4626A60419
11517d2065H3401N0876e5230F4875N8939l8957l0971B4896e9359b8714E6629a31587
11504B24054N082H3690m841g701k01523A76769J29358E8690J60188a42788A32395
11492A37721i9910l7970D27559E1877a0311j21675A8898c2770H8868K76163A32547
11480C0625K6946b00266A08117J35124D4619K156d976C08388p3685J82034a54939
11468E4690b2107B11293m973Q4946a25682B78356n1195g0416A07608J84680c2573
11456B27225C7457a39010D1134R5530J01013i4896j25846K5286A14544J2304J91604
11445C18452j03813b3520e371A11254c8140B40609H4985d7299k9071C08376j31585
$$ plain form
11434 176791 194326 240235 40609 -199955 26621 125337 185104 83904 -176418 -5598 42235
11422 151 -272949 -317159 -19149 416935 7465 -53179 270342 -14382 -80024 245901 139738
11411 139738 -186652 264439 394143 -146385 47105 -410805 -109087 -233032 -110416 319040
11400 -67740 -71932 87841 170441 -216750 127586 -250856 351729 74940 -236845 218481 -3167
11388 41959 83299 -127462 170026 -133559 322693 7736 -82388 31040 -112746 -252580 144861
11376 139350 98274 246782 -520 81265 -35236 -62375 38846 45255 -108837 158675 -86407
11364 -67828 23700 372423 -210233 -187266 293236 -121199 3761 63988 -176181 17695 -199099
11352 -65810 1322 228988 -30627 32398 -109198 17111 239718 -10924 -111918 94067 199465
$$ packed form
11434A76791J7535M5909D0609a99955B6621R8716N9767H3904a76418e598D2235
11422A51b72949m4210a9149D16935G465e3179B70342a4382o5642B45901j06163
11411A39738a86652B64439J29704a46385D7105d10805a09087j23945a10416C19040
11400f7740m192H7841Q2600b16750A27586b50856C51729G4940b36845B18481c167
11388D1959M1340a27462A70026a33559C22693G736h2388C1040a12746j39834A44861
11376A39350m1076J48508e20H1265c5236k7139C8846O409a08837A58675h6407
11364f7828B3700L48723b10233K2967B93236a21199C761O0227a76181A7695a99099
11352f5810A322K27666c0627C2398a09198A7111K22607a0924j00994I4067J05398
$$ plain form
11341 199465 35547 -59789 157632 57498 -79801 21357 75484 -234447 -46305 -30436 85039
11329 58552 -39426 151548 229560 10923 -135103 -38828 119617 199082 -89450 121058 -116267
11317 -228381 439012 1463 -174543 -193081 -385537 -342145 60305 20336 -38337 -262063 154224
11305 -164364 -112273 -320436 148985 -193074 114118 -72383 -57495 128591 103734 -151883
11294 126540 162060 -9215 32119 32214 177142 132189 -54409 -112371 -355131 -33923 106662 -43214
11281 -217679 44270 -271402 -128822 -274281 3392 -127504 98924 33752 8501 121725 -74093
11269 61847 -154786 -150834 -66247 257357 115575 -53382 -283388 42715 -94229 436714 -58079
11257 -84422 93598 -25626 4231 -302118 -147487 212194 176544 -194316 -45382 -178523 -478772
$$ packed form
11341A99465C5547e9789A57632E7498g9801B1357N4127b34447d6305J5869H5039
11329E8552c9426A51548P8012A0923a35103c8828A19617P9465h9450A21058a16267
11317b28381D39012A463a74543j8538j92456M3392F0305B0336c8337k23726A54224
11305a64364N2091k08163A48985a93074A14118g2383J4888A28591k4857a51883
11294A26540L5520i215C2119R5J44928m4953e4409n7962k42760c3923A06662d3214
11281b17679D4270b71402a28822j45459C392a27504I8924C3752H501J13224g4093
11269F1847a54786L952f6247B57357A15575e3382k30006D2715i4229D36714e8079
11257h4422I3598b5626D231c02118a47487B12194l5650a94316d5382j33141l00249
$$ plain form
11246 -478772 52928 -164623 -253126 -327662 -185378 28373 13282 -138226 -85563 -143602 -75409
11235 -75409 129574 171253 23295 141040 -83901 -55487 -4708 213025 -214878 -284866 -180468
11224 -180468 -34928 -35847 -336086 171449 221941 -161936 -75117 255214 -109140 95041 -12927
11212 483558 1416 -106657 -59417 339231 9510 -7090 -63635 -70638 -39366 -62316 -30102 -294905
11200 -294905 31838 -93040 -178030 -596454 1606 -124438 51268 -29396 -181813 -271730 -105147
11188 -290105 -10494 -396611 72434 -327979 171989 17764 363272 -312529 -54823 -195090
11178 -195090 13482 -94319 242931 -249086 114532 -411 69361 40398 -154736 -190191 146275
11166 -214203 -125772 46569 -27295 77354 -177446 -90658 -87226 -215931 -37655 60796 -42430
$$ packed form
11246d78772E2928a64623q8503p4536J42284B8373A3282a38226N2663n8039O8193
11235g5409A29574M1679B3295J17745h3901K8414d708B13025b14878o9988J04398
11224a80468c4928r19l00239A71449N0492a61936g5117B55214a09140I5041a2927
11212D83558A416a06657M7240C39231I510g090n6545p003L1272k2950c0102k64803
11200b94905C1838i3040q4990m18424A606a24438E1268b9396j52417q9917a05147
11188b90105a0494l86117G2434c27979A71989A7764L45508c12529e4823j40267
11178a95090A3482i4319B42931b49086A14532d11F9361k8963a54736l5455A46275
11166b14203Q8431D6569b7295G7354a77446Q6788L432j28705c7655F0796d2430
$$ plain form
11154 -56543 8024 -118696 376282 -124287 -106097 -141599 177696 -43201 93167 -34866 118313
11142 86606 176305 -108912 -9556 101283 -55211 -9617 17384 -2325 88615 9071 -83181 212912
11129 163272 83676 -16842 178624 92949 158891 -42535 314326 -135460 -23487 56632 131439
11118 131439 -169843 -470873 237587 -364111 -12244 101263 370320 320944 213583 63655
11107 -154776 -118393 313563 171628 175062 189400 -157935 308159 349450 207116 226010 -73873
11095 274616 -31894 360986 69635 122257 270549 171380 196467 241756 64498 97706 119784
11084 119784 143880 100651 292688 535153 277112 311044 427081 216329 176192 243931
11074 243931 366370 353911 263561 394857 305500 138446 295017 279604 148007 205394
$$ packed form
11154e6543H024a18696C76282a24287J8190l5502A77696d3201I3167c4866A18313
11142H6606Q9699a08912i556A01283e5211i617A7384b325H8615I071h3181B12912
11129A63272p9596a6842A78624q5675O5942d2535C14326a35460b3487E6632P4807
11118A31439a69843l01030B37587c64111a2244A01263K69057m9376j07361F3655
11107a54776L6383C13563j41935L434J4338a57935C08159M1291j42334J8894g3873
11095B74616c1894C60986F9635N2622J48292r9169K5087M5289F4498L3208K2078
11084A19784K4096m3229J92037K42465k58041L3932J16037k10752m0137O7739
11074B43931J22439j2459r0350J31296q9357A38446J56571j5413j31597N7387
$$ plain form
11064 205394 374152 518305 87766 574181 625970 351291 441829 501010 767677 432101
11054 432101 505528 434945 465591 486645 627280 747963 804997 592420 716301 791990 794518
11043 794518 822480 1031612 785842 671594 513924 814124 520821 413940 420317 783342
11033 783342 199989 1086644 760935 834851 773273 496794 497092 481772 427194 639741 395982
11022 395982 736279 448234 832070 540745 677506 364878 780599 438554 743636 476113
11012 476113 407944 598942 427804 19801 458019 556298 482977 554499 570967 462207 717215
11001 717215 328109 642856 577786 226727 499444 676116 342700 619385 583723 360850
10991 360850 677653 792915 566402 917720 966602 976763 821153 925955 955342 945262
$$ packed form
11064B05394J68758J44153H7766M86415N1789k74679R0538N9181K66667l35576
11054D32101P3427p0583L0646K1054J40635J20683N7034k12577J23881P5689K528
11043G94518K7962K09132k45770j14248j57670L00200k93303j06881O377L63025
11033G83342A99989Q86655l25709P3916o1578k76479K98j5320n4578K12547k43759
11022C95982L40297k88045L83836k91325J36761l12628M15721l42045L05082k67523
11012D76113o8169J90998j71138A9801M38218R8279p3321P1522J6468j08760K55008
11001G17215C28109L14747o5070B26727K72717J76672l33416K76685l5662k22873
10991C60850L16803J15262k26513L51318M8882J0161j55610J04802K9387j0080
$$ plain form
10981 945262 1157079 986801 1070360 1337165 1808584 1519538 2176373 2218858 2427304 2646965
10971 2646965 2282019 2671711 2125373 2176594 1583210 1817336 1389628 1504993 1433731 1479431
10961 1479431 1505007 1488280 1402572 1339535 1598819 1709402 1435850 981552 993376 765754
10951 765754 910510 369920 411814 482505 558580 306698 178881 316984 328224 311412
10941 311412 273540 582124 447716 322776 -239863 -145038 -178111 -31217 4455 172006 -16659
10929 85954 42306 105365 -180842 19900 107943 -236216 266505 178180 -41579 1810 32464
10918 32464 -33627 -96978 -152814 74240 226485 -169790 -151927 -73993 -174292 135350 53909
10906 9808 -34967 -19676 180176 -400357 -48268 220950 -70233 43764 2869 -65619 51313
$$ packed form
10981I45262K11817j70278Q3559K66805M71419k89046O56835M2485K08446K19661
10971B646965l64946L89692n46338N1221n93384K34126m27708J15365p1262M5700
10961A479431K5576j6727q5708o3037K59284J10583k73552m54298J1824k27622
10951G65754J44756C69920M1894P0691P6075k51882j27817J38103J1240j6812
10941C11412l7872L08584j34408j24940b39863R4825l3073c1217D455J67551a6659
10929H5954D2306O3059a80842A9900Q8043b36216B66505q8325d1579A810L0654
10918C2464c3627o3351n5836G4240J52245a69790J7863g3993j00299A35350E3909
10906I808c4967J5291A80176d00357d8268B20950g0233D3764B869f5619E1313
$$ plain form
10894 102569 72717 133600 -70191 -75076 517572 -141191 129903 104486 -340767 -66399 234260
10882 -221718 73596 253996 15604 -130463 -142158 -127463 130432 -145147 -57327 325536
10871 -89281 188848 87772 -263589 -203388 51065 -19107 90087 -71255 -192049 -257503 -254852
10860 -254852 -61617 -18535 -339914 37527 148018 -31810 -27734 -82823 435975 -164553 -221066
10849 -221066 44165 155818 -3155 178630 -262585 107748 55717 -111507 -115030 23100 -93404
10837 94813 -225166 33500 155000 -160637 65745 198741 -208846 109110 -54092 154691
10826 -9904 -30360 -181842 -167696 138026 204914 -148954 42715 234893 -55000 251371 -322689
10814 -233856 -495602 -402394 -73014 -224295 -177671 -7217 -173100 -56056 -44368 -247046 58897
$$ packed form
10894A02569k9852O0883g0191m885E17572a41191A29903k5417c40767f6399B34260
10882b21718G3596J80400A5604a30463j1695J4695A30432a45147e7327C25536
10871h9281A88848H7772b63589O0201E1065a9107I0087g1255j20794o5454K651
10860b54852f1617a8535l21379C7527J10491c1810M076n5089D35975a64553n6513
10849b21066D4165J11653c155A78630b62585A07748n2031a11507l523B3100i3404
10837I4813b25166C3500J21500a60637F5745J32996b08846A09110e4092A54691
10826i904k0456j51482J4146A38026O6888a48954D2715J92178e5000B51371c22689
10814b33856k61746R3208g3014j51281M6624g217j65883e6056J1688k02678E8897
$$ plain form
10802 -94639 -162533 -120041 -115576 -68218 -230431 12514 -90936 -268854 -216836 -86141 -456774
10791 -456774 -477440 154418 -303702 -141434 -37919 -35795 -87876 -111848 -80041 -5000 115451
10779 115180 -239277 -123832 -126151 -215356 -57562 80121 -131064 220774 290409 111298 93142
10768 93142 -48821 -317489 -422342 -5860 436302 110246 -43219 -175999 44832 -309599 44429
10756 -317052 -297921 211852 -417890 146812 -156978 33091 -85351 -540 197079 109094 -165535
10744 -290761 413142 -176521 -216074 -338234 -119918 -56781 -146866 -180219 -58702 144125
10733 -13002 -92755 81423 30041 162351 107559 53871 153201 128327 272353 153278 -73072
10721 75827 14200 68941 -188427 -388972 -222424 -139395 -187095 -41625 -108419 -123641 -276207
$$ packed form
10802i4639o7894M2492M465M7358j62213A2514i0936j77918N2018h6141l70633
10791d56774k0666A54418c03702a41434c7919K124n2081k3972L1807e000A15451
10779A15180b39277J15445k319q9205e7562H0121a31064B20774O9635A11298j8156
10768I3142d8821k68668j04853e860D36302A10246d3219j32780D4832c09599D4429
10756c17052J9131B11852d17890A46812a56978C3091h5351e40A97079q7985a65535
10744b90761D13142a76521l9553j22160a19918e6781r0085l3353e8702A44125
10733a3002p9753H1423C0041J32310n4792n3688R9330k4874J44026j19075g3072
10721G5827A4200N4741a88427k00545J66548Q3029m7700d1625o6794j5222j52566
$$ plain form
10710 -276207 22806 33260 -124350 27974 -55733 -204560 171619 -226946 -97401 71957 -68491
10698 -149706 22213 -110406 123103 34064 -33463 -137746 164828 -4846 -255847 24463 -268078
10686 -233071 66743 32961 -299871 -403311 -143134 -106073 -145435 123165 -16512 1140 -135713
10674 -112521 -60259 98292 -82748 17012 182840 -71937 -28095 74728 -45876 -180733 -55614
10662 -209206 5750 -25120 482122 -197687 64628 -195069 -57719 -66653 -1000 -129525 11302
10650 -347366 37732 -130448 -68246 40542 162414 -245783 -307685 -127005 241027 -158758
10639 96559 128630 -131473 -351561 -176211 -728 -232122 65321 -95283 -177712 81263 -328653
10627 -339701 -240962 258346 -255736 -28540 -207830 -138838 101268 -127377 -5540 -24657 -35457
$$ packed form
10710b76207B2806J0454a24350B7974e5733j48827A71619b26946i7401G1957f8491
10698a49706B2213a10406A23103C4064c3463j04283A64828d846k51001B4463b68078
10686b33071F6743C2961b99871j03440a43134L7061l9362A23165a6512A140a35713
10674a12521N2262I8292h2748A7012J65828g1937b8095G4728d5876j34857e5614
10662b09206E750b5120D82122a97687F4628a95069e7719q934a000j28525A1302
10650c47366C7732a30448O2202D0542J21872b45783o1902a27005B41027a58758
10639I6559L2071a31473k20088J75350g28k31394F5321i5283q2429H1263c28653
10627c39701R8739B58346b55736b8540j79290O8992A01268a27377e540j9117j0800
$$ plain form
10616 -35457 174518 -134862 -88263 9889 -31392 -139901 -142977 -171708 101970 -126838 -78481
10605 -78481 12970 81333 101740 44746 -380804 315448 -131942 -101851 -33893 -375137 36258
10593 -109004 -224724 -204426 128013 266789 43992 189980 251090 -208669 -43414 -189666
10583 -189666 169658 -124020 -23971 -18072 31080 109773 55203 161243 100826 20967 -382889
10571 -97375 -84846 56481 349034 -27846 -113644 92745 33158 -8423 -173934 1602 -70002 -5214
10558 -440403 187159 89159 271851 -45259 -81209 -40295 205172 136333 -130413 -145808 -278131
10547 -278131 37394 -210790 199265 757 86816 -157795 -38431 108516 113309 102529 -4630
10535 113490 -140541 118812 -107804 127542 35116 -156769 -131241 -212491 -107219 6931
$$ packed form
10616c5457A74518a34862M6599I889c1392j08509l076k8731A01970a26838M8357
10605g8481A2970O8363K0407D4746c80804C15448a31942L0091c3893l41244C6258
10593a09004j15720K0298A28013J38776D3992J45988O1110b08669d3414j46252
10583a89666A69658a24020b3971N899C1080P8693n4570J06040o0417B0967c82889
10571i7375J2529E6481K92553b7846q5798I2745C3158h423j65511A602g0002e214
10558d40403A87159H9159J82692d5259l5950d0295B05172o8839a30413j5395j32323
10547b78131C7394b10790A99265G57Q6059a57795c8431A08516M793j0780d630
10535A13490a40541A18812a07804A27542C5116a56769K5528q1250J05272F931
$$ plain form
10524 -3733 295070 52173 -224013 -91507 349825 -173842 -209991 -182230 -13806 202041 191664
10513 191664 306374 151686 -236362 -56338 220365 -18434 -132395 -49468 -286054 -120965
10502 -160220 218426 140542 176829 45683 -345231 -315714 -119168 -127493 -289803 -37602 -64949
10491 -64949 -233544 -43226 155997 -142188 168432 -30613 347622 410306 517318 450768
10481 450768 318677 -80813 302518 246132 -251192 109022 21879 -51306 144990 -253947
10470 263119 260585 -382168 -238349 106368 -25664 8083 -226961 15466 -148171 -205084 -34853
10458 -331301 -318410 177748 -119554 -48197 126085 -150730 -231221 137872 -146856 351830
10447 174450 -127782 -77966 286783 -189047 -32165 60219 -90128 -72230 472715 -204339
$$ packed form
10524c733B95070E2173b24013i1507C49825a73842l6149K7761a3806B02041j0377
10513A91664J14710A51686b36362e6338B20365a8434j13961d9468k36586a20965
10502a60220B18426p7884L6287D5683c45231K9517a19168q325j62310c7602k7347
10491f4949j68595d3226A55997a42188A68432c0613C47622O2684J07012o6550
10481D50768j32091h0813C02518n6386b51192A09022B1879e1306A44990b53947
10470B63119k534c82168J43819A06368b5664H083b26961A5466a48171n6913c4853
10458c31301J2891A77748a19554d8197A26085a50730q0491A37872a46856C51830
10447A74450a27782M9816B86783a89047c2165F0219i0128J7898D72715b04339
$$ plain form
10436 22072 102273 -40980 167095 -139726 -160953 189993 -107424 -53582 159987 260784
10426 260784 8938 -117822 308719 140635 25715 71708 161170 18057 -151672 -36171 -221809
10415 -221809 -334124 -32061 203041 -847 -45240 -32857 -380480 272069 118287 17304 -327995
10403 -37982 -114653 280570 -3356 -364367 -190805 282685 352961 169997 112011 -33016 205348
10391 162915 -65534 -157420 -187692 332307 164539 -306764 -66001 -70661 -4006 139539 265247
10380 265247 110421 150968 416973 374395 253965 219330 -83620 277364 489739 236079
10369 7921 372145 -89984 490015 316493 490503 614792 547349 22151 371942 226812
10359 226812 -142863 -486043 280050 168248 260949 193489 320329 442645 463631 810046
$$ packed form
10436B2072Q0201d0980A67095a39726k1227A89993a07424e3582A59987J00797
10426B60784H938a17822C08719A40635B5715M5993Q9462A8057a51672c6171j85638
10415b21809j12315c2061B03041h47m4393J2383l47623B72069A18287A7304c27995
10403c7982p6671B80570c356l61011J73562B82685P0276A69997n7986c3016B05348
10391A62915f5534r1886l0272C32307A64539c06764f6001m660d006A39539J25708
10380B65247A10421M0547K66005m2578j20430l4635h3620B77364K12375B36079
10369G921L64224h9984D90015j73522J74010J24289o7443B2151L49791j45130
10359B26812a42863l43180B80050j11802R2701o7460J26840J22316K0986L46415
$$ plain form
10349 810046 809298 183799 482555 183088 39855 186730 247865 206388 161952 376151 102649
10337 185600 397708 143377 254614 209689 -84759 -155422 38697 245775 124087 254407
10327 254407 126275 -186964 -22824 52131 71221 135537 157620 205336 -225510 12178 261317
10316 261317 -83480 144167 29784 103449 -87361 284960 -75773 155 302470 204270 -16056
10304 37337 -15986 62542 57547 151765 77048 -398768 43564 158002 235339 -194012 16270
10292 63871 -68165 -216714 -330417 -91546 132089 12640 44187 -28710 -27529 -254510 -288355
10281 -288355 -164527 118417 -100322 -218926 -231296 -268595 -113365 188415 38099 -14597
10270 -392858 -200432 284542 -29708 -13058 -98474 96400 21384 194942 -45849 306450 274355
$$ packed form
10349H10046p48A83799K98756A83088C9855J46875O1135m1477m4436K14199A02649
10337A85600K12108A43377J11237m4925h4759p0663C8697K07078j21688J30320
10327B54407A26275a86964b2824E2131J9090O4316K2083M7716b25510A2178K49139
10316B61317h3480A44167B9784P3665h7361B84960g5773A55L02315r8200a6056
10304C7337a5986F2542m995R4218p4717c98768D3564J14438P7337a94012A6270
10292F3871f8165j48549j13703i1546A32089A2640L1547b8710J181k26981l3845
10281b88355J23828A18417a00322j18604j2370l7299a13365A88415C8099a4597
10270c92858J92426B84542b9708a3058q5416I6400B1384J73558d5849C06450l2095
$$ plain form
10259 274355 217266 257585 258905 28437 128636 -1713 -78154 -40906 -207159 -30601 79964
10247 94166 217012 101220 -90484 -124597 -127687 -138138 -103841 -169754 -8232 328446 -54482
10235 -32637 -5765 56543 129703 -180967 181941 103632 -69241 340609 -57989 -221697 146745
10223 150061 54851 -13180 17739 122437 -233600 -323112 7461 189563 40341 227857 -235128
10211 90088 325161 -155940 -160223 -90793 687086 -48894 48632 -440354 -999 -175659 -244983
10200 -244983 -81148 -159432 -367142 -150319 26468 -136943 -222237 -345941 -53722 -495135
10190 -495135 -218709 -104952 -8745 226415 387567 95334 67946 -49362 -256342 -118530
10179 113363 -115814 -98465 -220433 -432685 1063 -156737 -233168 94540 98389 -2246 51824
$$ packed form
10259B74355n7089M0319J320B8437J00199a713p6441L7248j66253c0601G9964
10247I4166J22846A01220i0484l4113l090j0451L4297o5913h232C28446e4482
10235c2637e765E6543P3160a80967A81941p8309f9241C40609e7989j63708A46745
10223A50061E4851a3180A7739J04698b33600q9512G461J82102D0341J87516b35128
10211I0088K35073a55940m283O9430F87086d8894D8632d40354i99j74660o9324
10200b44983h1148p8284k07710a50319B6468a36943q5294j23704e3722m41413
10190d95135b18709a04952h745B26415J61152I5334k7388d9362k06980a18530
10179A13363a15814J7349j21968k12252A063a56737p6431I4540L849b246E1824
$$ plain form
10167 -189123 145908 88629 213096 -112098 -64173 39300 -141938 215047 -70028 95568
10156 150876 -187482 -32411 -199276 -291994 -173018 129583 -1278 -20808 274761 -39643 68589
10144 162931 -156110 -99597 64742 -7607 114311 -202885 119459 -30779 -359285 297207
10133 269144 -198829 206330 17500 -64300 -78770 -43969 -60921 -325596 -24053 -137053 34405
10121 -296719 140998 -54432 -12883 -249259 -162731 5648 -54312 -325918 135849 -19985 -219396
10110 -219396 -58755 21402 -72821 -90213 -448046 64969 -192463 47491 -123136 -43355 -183412
10099 -183412 30092 7903 -159070 259577 -258670 -286608 -334672 202730 -67461 98806 206599
10088 206599 -146825 -107273 -160149 -84936 -244271 130922 -100444 -162950 159252 -25405
$$ packed form
10167a89123A45908n7279J24467a12098M7925C9300a41938B15047g0028I5568
10156A50876a87482c2411j66865r2718J18976A29583a278j9530B74761c9643F8589
10144A62931a56110N6513F4742g607A14311b02885A19459c0779l28506B97207
10133B69144a98829B06330A7500f4300j4470L4801j6952k64675b4053j13000C4405
10121b96719A40998e4432a2883k36376Q6528E648e4312k71606A35849a9985j99411
10110b19396e8755B1402g2821j7392l57833F4969a92463D7491a23136d3355j40057
10099a83412C0092G903a59070B59577b58670k7938m8064B02730f7461I8806J07793
10088B06599a46825L9552n2876P5213j59335A30922a00444o2506A59252b5405
$$ plain form
10077 175283 81111 -100224 -254044 -98422 -47703 -114942 3518 -218289 -90237 106626 78520
10066 78520 -146402 208843 142379 -166538 16610 -141157 -179367 197890 -114583 256713
10055 35753 -117134 114681 -289079 21126 210202 -437706 989 -426399 -59717 74982 -170083
10043 181940 -126928 -47406 -44248 -64627 -302200 -75384 17995 -83371 -47183 -35474 -75092
10032 -75092 30053 -224829 -1634 -33256 -168877 -43153 -75756 105296 -186981 -59170 150976
10020 9407 -93746 -99647 -138399 111229 111775 -101800 -138245 -317986 214338 -50824 24215 232838
10008 232838 338692 -165385 112667 -175830 -154566 9398 -321930 127562 -113877 -153683
9998 -153683 159021 -225060 38156 -176991 -191561 -326528 -126189 -198592 -264574 72724 -48303
$$ packed form
10077A75283H1111a00224j53820i8422d7703o7239C518b18289i0237A06626k8106
10066G8520a46402B08843o6464a66538A6610a41157l8210A97890a14583B56713
10055C5753a17134A14681b89079B1126J89076d37706I89d26399e9717G4982a70083
10043A81940a26928d7406L158k0379k37573g5384A7995h3371L6188J1709l9618
10032g5092C0053b24829a634l1622j35621d3153l2603A05296a86981e9170A50976
10020I407i3746n901l8752A11229N46a01800l6445j79741B14338e0824B4215K08623
10008B32838J05854a65385A12667a75830K1264I398c21930A27562a13877l9806
9998a53683A59021b25060C8156a76991j4570j34967a26189p2403o5982G2724d8303
$$ plain form
9986 94827 -137226 -168600 -51803 110989 -158608 -83314 132594 143377 -192453 -103218 -52195
9975 -52195 23694 -218099 -147070 304701 130177 26517 -151321 -188110 100979 -133259 -112222
9964 -112222 -304530 141188 -133554 -32692 -170363 -32566 70270 -81254 209475 99472 -48845
9952 178813 -275233 76529 -132340 -272312 66464 -11074 -94002 85376 -182515 -79049 36038
9940 147476 -215603 211203 -173192 14176 -301627 -71432 -272348 -147285 -251004 -223312
9930 -223312 -103659 -156335 -394148 1094 -289862 -221226 -86433 -127716 143427 -175008 -47996
9918 125906 -79357 -72568 -157784 18077 179955 -97290 -251208 -290743 6542 62942 -111295
9906 -63993 213394 -103945 102139 136154 -35672 -57067 4203 69800 -63820 116416 -199652
$$ packed form
9986I4827a37226l1374e1803A10989a58608P5294A32594J0783a92453Q9235N1023
9975e2195B3694b18099P1029C04701A30177B6517a51321l6789A00979a33259K1037
9964a12222j92308A41188a33554c2692j37671c2566G0270h1254B09475I9472d8845
9952A78813b75233G6529a32340j39972F6464a1074q2928H5376a82515g9049C6038
9940A47476b15603B11203a73192A4176c01627g1432k00916J25063j03719K7692
9930b23312a03659n2676k37813A094b89862O8636h6433m1283A43427a75008d7996
9918A25906g9357O789q5216A8077J61878i7290j53918l9535F542N6400a11295
9906f3993B13394a03945A02139L4015c5672k1395D203O5597f3820A16416a99652
$$ plain form
9894 60717 -58036 -32094 15982 44789 51450 -14558 113092 134902 269988 26307 157064
9883 157064 -162542 -132073 -130277 -179503 -180884 -68289 -3697 23716 -218868 -75734 -33623 -65009
9871 -65009 -100389 54885 -229083 -303413 -117825 28247 -33962 -394379 21527 9715 -103994
9859 99975 123526 -36802 -64674 197501 -414609 176558 76188 195699 180024 200092 -203953
9847 -153148 -96591 -104264 -47830 184985 98077 -50245 -128865 -243791 141252 -113340 13096
9835 -2453 38625 203915 187028 -122812 1442 -171427 -86955 -219439 -134595 -128881 32191 -8260
9822 -82734 -193928 -122335 -197866 -217373 -160586 115907 287929 182891 3189 -35565 158123
9810 255805 -96055 28292 42506 63816 54067 52821 108935 -41166 83593 28290 -210880 -220523
$$ packed form
9894F0717e8036K5942A5982K8807O661a4558A13092K1810J35086B6307J30757
9883A57064a62542L0469J796m9226j381f8289c697B3716b18868g5734c3623l1386
9871f5009l5380E4885b29083p4330a17825B8247c3962l60417B1527I715a03994
9859I9975K3551c6802k7872A97501d14609A76558G6188J19511j5675K0068b03953
9847a53148N6557p673d7830A84985q6908e0245p8620j14926A41252a13340A3096
9835b453C8625J65290j6887a22812A442a71427Q4472j32484Q4844N714C2191h260
9822h2734j11194P1593p5531j9507N6787A15907J72022j05038C189c5565A58123
9810B55805i6055B8292J4214K1310r749j246N6114d1166H3593B8290b10880r643
$$ plain form
9798 -220523 -396159 -70260 -33664 -95622 122810 -35530 -357907 45096 30704 252351 -130048
9786 33691 -219769 77503 -67811 46615 87473 -75448 191702 -84481 -8185 -113988 -250327
9775 -250327 7698 -155885 -95201 142827 -8974 -176627 -74444 -353708 39740 -142074 38305
9763 -12442 -175963 -129501 -68005 283361 -366230 -186723 -21204 -310995 132685 336333
9753 336333 183959 -133347 383313 -265975 -275705 231976 -136995 -218671 -29346 -273929
9743 -273929 -120074 38533 -160077 55924 387199 126384 -163566 164168 -152240 -74758
9732 99902 -203470 -126572 75094 -223571 28347 77621 -171768 -378934 217652 -59558 24263
9720 -118590 -273441 -151102 -141252 -412948 85488 -314895 37761 104626 -70459 139708 -295760
$$ packed form
9798b20523j75636g0260c3664o1958A22810c5530l22377D5096j4392K21647a30048
9786C3691b19769G7503f7811D6615M0858g5448A91702h4481h185j05803j36339
9775b50327G698a55885O0684A42827h974j67653g4444k79264C9740a42074C8305
9763a2442j63521M6462O1496B83361c66230J79507b1204k89791A32685K03648
9753C36333j52374a33347C83313b65975r730B31976a36995q1676b9346k44583
9743b73929a20074C8533a60077E5924L31275A26384a63566A64168a52240g4758
9732I9902b03470P6898G5094b23571B8347M9274a71768k07166B17652e9558B4263
9720a18590j54851J22339R850k71696H5488c14895C7761O6865g0459A39708b95760
$$ plain form
9708 164863 107783 178080 -250569 -196001 -17162 -213714 -46926 112604 -308203 122204 201316
9697 201316 8534 70391 17536 -95007 -47178 52903 -155553 -120071 49599 -63612 -41875 -190134
9685 -190134 -182367 85474 -355793 -538076 -191488 -220647 54693 -111468 176352 17683 -427330
9673 -191848 -44563 2991 -227507 -170339 -73410 -164721 -151521 42401 144111 -11613 -158623
9662 -158623 93526 -290608 2069 -362837 152602 -179954 -121281 206926 98454 24012 -147331
9650 -112550 -90377 86744 -150020 -244451 -75913 122733 -165058 21231 -380141 60288 -103621
9638 194637 -101696 98453 -222555 -132548 197045 -129410 -169117 -336256 106692 115187 99400
9627 99400 54346 -247562 -244150 -20540 -23792 -55349 381259 -117164 -86669 -34310 -198185
$$ packed form
9708A64863n7080P0297b50569N4568a7162j96552d6926A12604c08203A22204P9112
9697B01316H534O1857A7536i5007d7178E2903a55553L5482D9599f3612K1737j48259
9685a90134P767H5474c55793j82283a91488k9159E4693a11468A76352A7683d27330
9673a91848d4563B991b27507N7168g3410r1311J3200D2401J01710a1613j47010
9662a58623I3526b90608B069c62837A52602a79954N8673B06926I8454B4012a47331
9650a12550K2173H6744a50020r4431g5913A22733a65058B1231c80141F0288a03621
9638A94637a01696I8453b22555R0007A97045a29410l9707j67139A06692Q495j5787
9627I9400m5054b47562L412b0540l252l1557C81259a17164L0495c4310j63875
$$ plain form
9616 -198185 88228 160316 259120 -198324 85222 220260 -253510 -16326 -32791 -86178 54634
9604 -163653 -259976 430871 -204259 -111626 279434 -92859 -86677 42517 -18192 -127388 -142321
9593 -142321 324392 -171592 -289704 -185910 -166899 -176916 -285379 113535 -51463 -128536
9583 -128536 -263045 -243710 -235161 -143830 202627 30221 200295 -113243 182510 -302564 -222954
9572 -222954 -84853 107845 -262950 9351 -183185 306612 231802 230536 -211721 128559 183234
9561 183234 -52134 -215329 75526 -46649 166820 -10664 -102683 -199432 -4763 -288827 -52706
9549 91856 -33501 12394 -35098 -170575 -104619 -52998 -149739 -209323 -76790 70793 14914 -21242
9536 196345 202185 157726 -40612 11800 -102378 -126539 -478792 -178261 -5289 -104563 -175604
$$ packed form
9616a98185H8228P2088R8804a98324H5222J35038b53510a6326j6465n3387E4634
9604a63653r6323D30871b04259R2633B79434i2859O182D2517a8192j09196j4933
9593a42321C24392a71592j18112J03794J9011j0017j08463A13535e1463p7073
9583a28536j34509J9335Q549R1331B02627C0221J70074a13243A82510c02564P9610
9572b22954h4853A07845b62950I351a83185C06612p4810j266b11721A28559N4675
9561A83234e2134j63195G5526d6649A66820a0664r2019r6749d763k84064e2706
9549I1856c3501A2394c5098j35477O5956N1621r6741n9584g6790G0793A4914b1242
9536A96345N840m4459d0612A1800a02378k4161l52253a78261e289r9274p1041
$$ plain form
9525 -175604 113038 -102957 -55996 303212 -16495 -43045 160864 -92291 -71148 141844 -253372
9513 -78728 110356 -128822 -278116 -205433 -148540 -23207 -41954 44952 -177715 83539 9677
9501 5899 81944 41396 235125 -322602 99380 -243270 294601 -8063 -176022 -48835 -231118
9490 -231118 -177804 -37023 -41254 -83371 -133614 -329719 -39679 118406 -269379 145622 -50970
9478 -65507 -147062 4937 242641 -55767 -444425 36596 -148169 -98885 -251221 188050 -28968
9466 -200556 -292852 -127230 413972 -78229 -201987 -14086 184969 113357 31483 266627 76498
9454 -199901 -59180 157174 -118583 2924 1235 -141683 23730 54569 -88829 -71522 75902
9442 -43286 5132 -172493 -200772 168526 282091 93320 58749 -33897 31274 -17357 185702
$$ packed form
9525a75604A13038a02957M6961C03212a6495k6550A60864i2291K1143A41844b53372
9513g8728A10356a28822j49294P2683N6893b3207j8747D4952a77715H3539I677
9501E899P6045m0548J93729c22602I9380b43270B94601h063j67959d8835j82283
9490b31118N3314c7023m231m2117n0243j96105c9679A18406b69379A45622e0970
9478f5507q1555D937K37704e5767l88658C6596a48169M9284j52336A88050b8968
9466b00556r2296a27230D13972g8229j23758a4086A84969p1612C1483K35144G6498
9454a99901e9180A57174a18583B924A235a41683B3730L0839h8829J7307G5902
9442d3286E132a72493k8279A68526J13565I3320l4571c3897C1274a7357A85702
$$ plain form
9430 59737 103368 -256737 -321600 188738 -178356 -95420 -260112 -77156 -72037 281615 -88956
9418 -207396 135724 410958 -6235 5944 44682 -56321 -219186 -48494 -147497 81176 216614
9407 216614 -19185 113866 240741 238800 -216577 55885 73599 192245 231594 -225687 -157975
9396 -157975 103904 -173871 -128380 53176 126307 70076 30612 3347 -101417 -149450 66321
9384 -43727 -26304 -129524 -178691 -511543 -279101 24769 -98130 -302299 28216 -300765 -109535
9372 252333 218371 -137925 -80767 261044 10578 -313332 36103 -113162 -28185 62232 -121429
9360 88854 124354 -117959 -211418 -160785 -218432 187984 109583 -15891 -189918 146836 -203039
9348 -476159 37005 -323983 -117003 -7626 -86667 25880 -45440 -161380 114384 -90577 -293656
$$ packed form
9430E9737M3631b56737o4863A88738a78356Q2936j64692g7156N119B81615h8956
9418b07396A35724K75234f235E944L8738e6321j62865d8494r9003H1176J35438
9407B16614a9185A13866J26875j941b16577E5885J7714J18646L9349b25687O7712
9396a57975A03904a73871M5491E3176P3131n6231C0612C347a01417m8033F6321
9384d3727J7423j03220m9167l32852K32442B4769i8130k04169B8216c00765a09535
9372B52333l3962a37925N7158B61044A0578c13332C6103a13162b8185F2232a21429
9360H8854L5500a17959r3459N0633n7647A87984p8401a5891j74027A46836b03039
9348d76159C7005c23983a17003g626p9041B5880d5440j15940A14384i0577k03079
$$ plain form
9337 -293656 -111795 -298575 150446 -91488 -237620 -215136 -251218 218772 210837 -70287 -1048
9325 -15038 -69541 -336296 -173035 148187 66783 -90525 144964 21282 215672 -122959 -173612
9314 -173612 138884 -130495 -108330 -126457 -76151 -71310 -117757 -155636 -192089 9387 -117237
9302 222910 45934 37286 -222149 89872 -104684 -63898 -65759 -219751 -211457 -101483 -22897
9290 -77988 -184594 -63683 -57600 -38154 162535 -170863 -350172 276295 -137371 -142422 -388340
9279 -388340 73033 212916 -370384 -107965 362674 -330492 50487 -2937 -83240 -224611 -193561
9268 -193561 20735 -102806 -65656 42891 -115207 -391672 173584 25290 226064 -23974 -119475
9257 -119475 -79349 -29264 79917 335849 24750 96758 -237357 -8140 -169803 -16221 -178361
$$ packed form
9337b93656a11795j86780A50446i1488j46132K2484l6082B18772p935g0287a048
9325a5038n4503k66755J63261A48187F6783i0525A44964B1282J94390a22959n0653
9314a73612A38884a30495K2165j8127N0306M841m6447l7879l6453I387a17237
9302B22910D5934q648b22149H9872a04684M0786j861j53992Q294a01483b2897
9290g7988j06606f3683O083J9446A62535a70863j79309B76295a37371n051k45918
9279c88340G3033J39883c70384a07965C62674c30492E0487b937q0303j41371L1050
9268a93561B0735a02806L7150D2891a15207k76465A73584B5290K00774b3974r5501
9257a19475M0126b9264G9917K55932B4750P2008b37357h140j61663a6221j62140
$$ plain form
9246 -178361 -1146 6703 77828 34770 -42831 -57223 38922 -4073 217232 -5705 -101072 -318580
9234 -318580 -33312 -286776 -176574 -308269 -285071 23796 -219007 330990 -116787 -157690
9224 -157690 30520 -381547 77612 -24100 97339 -88363 209712 213705 177676 99534 -100379
9212 52912 479420 340827 105590 122545 -103931 -12311 -272227 -43999 -75069 -40265 -127324
9201 -127324 -209445 -274718 158264 -135927 81668 -82658 58165 -124035 -296098 46233 32401
9190 32401 -185075 -232263 -136872 -226937 -106852 -49768 350535 -152901 -270161 -109113 -165875
9179 -165875 18507 148798 -167401 -308939 -98664 231977 -122879 150746 -38227 -32102 -391738
9168 -391738 168579 -190434 37676 128309 272223 -122899 -80237 -13296 34916 -130962 -212575
$$ packed form
9246a78361a146F703P1125C4770d2831j4392C8922d073B17232e705r5367k17508
9234c18580c3312k53464J10202j31695K3198B3796b19007C30990a16787m0903
9224a57690C0520c81547G7612b4100I7339h8363B09712L993l6029p8142a00379
9212E2912M26508j38593A05590J6955a03931a2311k59916d3999l1070L4804q7059
9201a27324q2121o5273A58264a35927H1668h2658E8165a24035j72063D6233j3832
9190C2401a85075m7188R5391r0065a06852d9768C50535a52901j17260a09113n6762
9179a65875A8507J30291a67401j41538i8664B31977a22879A50746c8227O125l59636
9168c91738A68579a90434C7676R0633J43914a22899M2662a3296C4916a30962q1613
$$ plain form
9157 -212575 -13556 -183879 351640 15844 -96252 -16074 251026 -193647 -205069 -59269 37846
9145 -166809 -57329 -192754 -66285 -142041 273767 258039 34765 -2918 -74314 23219 -108118
9133 -164383 14145 -315405 212082 86146 -221661 -140944 -25090 -265835 -175912 32804 40287
9122 40287 -111916 -235224 -268967 29302 18327 38770 -155701 94139 -109210 163065 -84121
9110 270509 -270503 170339 -155518 -165923 311183 33892 -95348 -350258 -103420 -109802 -113607
9099 -113607 421962 -39172 -131704 -321450 84793 -179776 285219 -256595 -47911 -298155
9089 -298155 -27125 9587 -99447 -337116 -25428 -350334 -85025 34626 59517 -165663 103400
9077 29418 132688 237395 -271267 119976 -213750 185749 -39584 -109200 14140 17194 -157097
$$ packed form
9157b12575a3556j70323C51640A5844i6252a6074B51026a93647j1422e9269C7846
9145a66809e7329j35425f6285p5756B73767j5728C4765b918p1396B3219a08118
9133a64383A4145c15405B12082H6146b21661Q0717b5090k40745Q9923C2804P483
9122D0287a11916j23308l3743B9302j0975K0443a55701I4139a09210A63065h4121
9110B70509b70503A70339a55518j0405C11183C3892i5348k54910a03420o382l805
9099a13607D21962c9172r2532j89746H4793a79776B85219b56595d7911k50244
9089b98155b7125I587i9447k37669b5428l24906h5025C4626K4891a65663A03400
9077B9418J03270J04707b71267A19976b13750A85749c9584o9616A4140L054a57097
$$ plain form
9065 -103097 -80783 19412 -176704 -98124 -204675 -56241 -155886 -230618 -96282 141523 43821
9053 -127449 292362 115503 -95549 -149201 -34202 102129 -163295 -247744 -161047 201567 -21054
9041 -217907 -222373 91400 96521 138926 -249521 149610 308922 49096 105182 -153838 64377
9029 -230546 -102322 -156418 -29311 107301 -187471 30726 -149378 13020 -148458 -20113 220274
9017 -369220 -155132 -114387 -242889 -134464 -30753 -9085 -58252 -131304 -60322 -201301 -54955
9005 -140997 -9128 -149974 17683 -161570 -199144 -373764 141568 -142236 -14457 -85299 160084
8993 117052 -131849 -131110 -90913 95267 79475 -308996 -283429 140038 -226097 -224354 -116594
8982 -116594 -187962 37414 271614 14254 -40484 -109630 -25343 -112717 -6899 85838 -218487
$$ packed form
9065a03097K2314A9412a76704P8580j06551e6241r9645p4732i6282A41523D3821
9053a27449B92362A15503i5549n3652c4202A02129a63295q4449Q6697B01567b1054
9041b17907m466I1400N121M2405b49521A49610J59312D9096N6086a53838F4377
9029b30546a02322n4096b9311A07301a87471C0726a49378A3020a48458b0113B20274
9017c69220a55132M0745j28502J08425c0753i085m9167p3052f0322j40979e4955
9005a40997i128j40846A7683a61570l7574j74620A41568a42236a4457p0842A60084
8993A17052a31849P39M0197I5267j5792c08996K5567A40038b26097J743J07760
8982a16594p1368C7414K34200A4254d0484o9146b5343q7374f899H5838b18487
$$ plain form
8970 5043 -523957 -227868 266434 115250 -153320 342417 -560337 -117420 71062 -109150
8959 -465520 -229280 -87542 -47993 185865 301812 53527 69769 111880 10770 -19880 149556
8947 -174039 227112 3470 35436 22426 -117924 101464 -127095 -207902 94817 -187379 2510
8935 169047 132894 8091 11511 -158632 -139783 60512 -137264 229596 -166934 -26349 231896
8923 548550 1593211 3138028 643958 372047 155319 3958 25049 266471 58835 -24540
8912 -54383 -5776 208712 -173597 140029 184201 -100349 -206692 -560140 -217531 -28224 21221
8900 -18323 -58034 -184432 132993 -152131 139656 -110950 -37630 -19753 -69321 -9092 -63060
8889 -63060 -54042 50112 -76137 -69387 108650 230755 -24502 40333 -9385 -51264 -9176 -46833
$$ packed form
8970E043e23957b27868B66434A15250a53320C42417e60337a17420G1062a09150
8959d65520b29280h7542L9549A85865J15947E3527J6242M2111A0770a9880A49556
8947a74039B27112C470L1966j3010a17924A01464a27095q0807I4817a87379B510
8935A69047l6153H091L420a58632J8849F0512a37264B29596a66934b6349B31896
8923E48550J044661J544817F43958k71911A55319C958K1091K41422E8835b4540
8912e4383e776B08712a73597A40029M4172a00349j06343l53448b17531b8224B1221
8900a8323l9711j26398A32993a52131A39656a10950c7630J7877m9568i092n3968
8889f3060R018E0112g6137O750A08650J22105b4502D0333i385m1879i176l7657
$$ plain form
8877 -46833 -95318 25020 -15250 -31653 12955 -154738 60570 42243 -85390 227554 -124493
8865 133299 -108049 -56789 251071 -80641 182222 -37258 -102129 48249 79238 -242024 -448130
8854 -448130 -1010 -118278 -437906 29449 -173022 127427 10598 -145974 -59877 -53862 136587
8842 -57723 -85107 -59025 -7167 -103824 -118387 92924 75653 -342314 -242559 -75226 54937 -183545
$$ packed form
8877d6833m8485B5020a5250j6403A2955a54738F0570j8327h5390B27554a24493
8865A33299a08049N1260B51071h0641A82222c7258o4871D8249L0989b42024k06106
8854d48130a010j17268l19628B9449a73022A27427A0598a45974e9877O015A36587
8842e7723k7384K6082g167r6657j4563I2924j7271c42314R9755g5226E4937a83545
$$ [...]
##END NTUPLES=NMR SPECTRUM
##END=
