##TITLE=NES1060_RRG_9883143_8TObMUu1Hl
##JCAMPDX= 6.0         $$ Bruker NMR JCAMP-DX V2.0
##DATA TYPE= NMR SPECTRUM
##DATA CLASS= NTUPLES
##ORIGIN= BRUKER
##OWNER= Administrator
$$ 1.72 TOPSPIN		Version 2.1
$$ 2016-08-26 23:07:58.383 -0500  Administrator@X
$$ Compression mode = diff/dup
##.OBSERVE FREQUENCY= 400.02188249412
##.OBSERVE NUCLEUS= ^1H
##.ACQUISITION MODE= SIMULTANEOUS (DQD)
##.ACQUISITION SCHEME= undefined
##.AVERAGES= 64
##.DIGITISER RES= 22
##SPECTROMETER/DATA SYSTEM= spect
##.PULSE SEQUENCE= noesygpps1d.comp
##.SOLVENT NAME= COFFEE_meoh
##.SHIFT REFERENCE= INTERNAL, COFFEE_meoh, 1, 14.9604
##AUDIT TRAIL= $$ (NUMBER, WHEN, WHO, WHERE, PROCESS, VERSION, WHAT)
$$ ##TITLE= Audit trail, TOPSPIN		Version 2.1
$$ ##JCAMPDX= 5.01
$$ ##ORIGIN= Bruker BioSpin GmbH
$$ ##OWNER= Administrator
$$ $$ E:\/data/COFFEE/nmr/NES1060_RRG_9883143_8TObMUu1Hl/12/pdata/1/auditp.txt
$$ ##AUDIT TRAIL=  $$ (NUMBER, WHEN, WHO, WHERE, PROCESS, VERSION, WHAT)
(   1,<2016-08-26 23:07:53.039 -0500>,<Administrator>,<X>,<go>,<TOPSPIN 2.1>,
      <created by zg
	started at 2016-08-26 22:56:23.429 -0500,
	POWCHK enabled, PULCHK disabled,
       configuration hash MD5:
       21 0F 79 D6 B3 7B B4 F6 88 20 88 DB 03 48 BD 9F
       data hash MD5: 64K
       39 E1 7E 1B 0B A5 11 8C 2B E8 BC 7E F1 82 38 10>)
(   2,<2016-08-26 23:07:56.242 -0500>,<Administrator>,<X>,<proc1d>,<TOPSPIN 2.1>,
      <Start of raw data processing
       efp LB = 0.3 FT_mod = 6 PKNL = 1 PHC0 = 0 PHC1 = 0 SI = 128K 
       data hash MD5: 128K
       A9 AE 52 8C 7E AF 36 FC 86 29 1B 31 7D 8D D5 F2>)
(   3,<2016-08-26 23:07:57.117 -0500>,<Administrator>,<X>,<proc1d>,<TOPSPIN 2.1>,
      <pk PHC0 = -84.63318 PHC1 = 0 
       data hash MD5: 128K
       54 BA 0F BB B3 4E AF D1 EE 1B 6E 95 D3 86 BB 36>)
(   4,<2016-08-26 23:07:57.539 -0500>,<Administrator>,<X>,<proc1d>,<TOPSPIN 2.1>,
      <abs ABSG = 1 
       data hash MD5: 128K
       0D 1E 7C 63 7C 49 B6 0F 22 AD 72 1D 2E 5B 23 F0>)
(   5,<2016-08-26 23:07:57.648 -0500>,<Administrator>,<X>,<proc1d>,<TOPSPIN 2.1>,
      <abs ABSG = 2 
       data hash MD5: 128K
       D9 8B 9D B9 D3 DF CA 84 5D AB 9F 0B 19 D0 F3 51>)
(   6,<2016-08-26 23:07:57.726 -0500>,<Administrator>,<X>,<proc1d>,<TOPSPIN 2.1>,
      <abs ABSG = 3 
       data hash MD5: 128K
       B0 91 05 7E D9 91 30 21 3F 8F B9 53 D0 22 D4 CD>)
(   7,<2016-08-26 23:07:57.820 -0500>,<Administrator>,<X>,<proc1d>,<TOPSPIN 2.1>,
      <abs ABSG = 4 
       data hash MD5: 128K
       C2 C0 6E D9 99 D3 24 8A 8E 53 4F 0E 02 C6 D0 CC>)
(   8,<2016-08-26 23:07:57.945 -0500>,<Administrator>,<X>,<proc1d>,<TOPSPIN 2.1>,
      <abs ABSG = 5 
       data hash MD5: 128K
       EE E1 34 57 FE E5 8B BD FE EE 40 B1 87 AA 3E 29>)
$$ ##END=
$$ 
$$ $$ hash MD5
$$ $$ 54 08 7A 2A EE 4F 0A 34 A4 9C EB 33 DE 9F FF 01
##$RELAX= 
##$RELAX= 
##$RELAX= 
##$RELAX= 
##$RELAX= 
##$RELAX= 
##$RELAX= 
##$RELAX= 
$$ Bruker specific parameters
$$ --------------------------
##$DU= <E:\>
##$EXPNO= 12
$$ [...]
150 150 150 150 150 150 150 150
##$TP07= 0
##$TPNAME0= <>
##$TPNAME1= <>
##$TPNAME2= <>
##$TPNAME3= <>
##$TPNAME4= <>
##$TPNAME5= <>
##$TPNAME6= <>
##$TPNAME7= <>
##$TPOAL= (0..7)
0.5 0.5 0.5 0.5 0.5 0.5 0.5 0.5
##$TPOFFS= (0..7)
0 0 0 0 0 0 0 0
##$TUNHIN= 0
##$TUNHOUT= 0
##$TUNXOUT= 0
##$USERA1= <user>
##$USERA2= <user>
##$USERA3= <user>
##$USERA4= <user>
##$USERA5= <user>
##$V9= 5
##$VALIST= <valist>
##$VCLIST= <CCCCCCCCCCCCCCC>
##$VD= 0
##$VDLIST= <DDDDDDDDDDDDDDD>
##$VPLIST= <PPPPPPPPPPPPPPP>
##$VTLIST= <TTTTTTTTTTTTTTT>
##$WBST= 2048
##$WBSW= 25
##$XGAIN= (0..3)
0 0 0 0
##$XL= 0
##$YL= 0
##$YMAX_a= 5515416
##$YMIN_a= -10547310
##$ZGOPTNS= <>
##$ZL1= 120
##$ZL2= 120
##$ZL3= 120
##$ZL4= 120
##$ABSF1= 14.9604
##$ABSF2= -5.597782
##$ABSG= 5
##$ABSL= 3
##$ALPHA= 0
##$AQORDER= 0
##$ASSFAC= 0
##$ASSFACI= 0
##$ASSFACX= 0
##$ASSWID= 0
##$AUNMP= <proc_prof1d_extract.lims>
##$AXLEFT= 0
##$AXNAME= <>
##$AXNUC= <1H>
##$AXRIGHT= 0
##$AXTYPE= 0
##$AXUNIT= <>
##$AZFE= 0.1
##$AZFW= 0.1
##$BCFW= 0
##$BC_mod= 0
##$BYTORDP= 0
##$COROFFS= 0
##$CY= 15
##$DATMOD= 1
##$DC= 0
##$DFILT= <>
##$DTYPP= 0
##$F1P= 0
##$F2P= 0
##$FCOR= 0.5
##$FTSIZE= 131072
##$FT_mod= 6
##$GAMMA= 0
##$GB= 0
##$INTBC= 1
##$INTSCL= 1
##$ISEN= 128
##$LB= 0.3
##$LEV0= 0
##$LPBIN= 0
##$MAXI= 10000
##$MC2= 0
##$MEAN= 0
##$ME_mod= 0
##$MI= 0
##$NCOEF= 0
##$NC_proc= -2
##$NLEV= 6
##$NOISF1= 0
##$NOISF2= 0
##$NSP= 0
##$NTH_PI= 0
##$NZP= 0
##$OFFSET= 14.9604
##$PC= 1
##$PHC0= -84.63318
##$PHC1= 0
##$PH_mod= 1
##$PKNL= yes
##$PPARMOD= 0
##$PPDIAG= 0
##$PPIPTYP= 0
##$PPMPNUM= 2147483647
##$PPRESOL= 1
##$PSCAL= 4
##$PSIGN= 0
##$PYNMP= <proc.py>
##$REVERSE= no
##$SF= 400.020009875937
##$SI= 131072
##$SIGF1= 0
##$SIGF2= 0
##$SINO= 400
##$SIOLD= 131072
##$SPECTYP= <>
##$SREGLST= <1H.CDCl3>
##$SSB= 0
##$STSI= 131072
##$STSR= 0
##$SW_p= 8223.68421052631
##$SYMM= 0
##$S_DEV= 0
##$TDeff= 65536
##$TDoff= 0
##$TI= <>
##$TILT= no
##$TM1= 0
##$TM2= 0
##$TOPLEV= 0
##$USERP1= <user>
##$USERP2= <user>
##$USERP3= <user>
##$USERP4= <user>
##$USERP5= <user>
##$WDW= 1
##$XDIM= 131072
##$YMAX_p= 371646368
##$YMIN_p= -12653
##$CURPLOT= <Network HP LaserJet P1505>
##$CURPRIN= <$Network HP LaserJet P1505>
##$DFORMAT= <normdp>
##$LAYOUT= <+/1D_H.xwp>
##$LFORMAT= <normlp>
##$PFORMAT= <normpl>
##$SURQMSG= 1
$$ End of Bruker specific parameters
$$ ---------------------------------
##NTUPLES= NMR SPECTRUM
##VAR_NAME=  FREQUENCY,     SPECTRUM/REAL,   SPECTRUM/IMAG
##SYMBOL=    X,             R,               I
##VAR_TYPE=  INDEPENDENT,   DEPENDENT,       DEPENDENT
##VAR_FORM=  AFFN,          ASDF,            ASDF
##VAR_DIM=   131072,        131072,          131072
##UNITS=     HZ,            ARBITRARY UNITS, ARBITRARY UNITS
##FACTOR=    0.0627417313425164, 1,          1
##FIRST=     8223.62146879497, -3821,        -52233
##LAST=      0,             -1541,           -52847
##MIN=       0,             -12653,          0
##MAX=       8223.62146879497, 371646368,    0
$$ Real data points
##PAGE= N=1
##DATA TABLE= (X++(R..R)), XYDATA
$$ [...]
68036 150571 151521 152706 153613 153883 153490 152543 151298 150270 149859 149835 149660 149285 149179 149507 149829 149693 149076 148079
68018 148079 146748 145413 144647 144522 144294 143305 141894 140961 140813 140897 140626 140061 139625 139423 139038 138049 136599 135291
68000 135291 134393 133348 131356 128331 124918 121647 118518 115422 112386 109215 105464 101132 96967 93675
67986 93675 91181 89098 87481 86520 85814 84698 83243 82223 81988 82034 81907 81911 82488 83302 83462 82470 80582 78337
67968 78337 76151 74306 72905 71719 70382 68840 67372 66066 64598 62812 61222 60532 60703 60946 60649
67953 60649 59917 59126 58385 57658 56995 56247 54968 53098 51474 51007 51449 51641 51034 50312 50286 50828 51312 51605
67935 51605 52067 52836 53696 54591 55776 57320 58805 59690 59835 59548 59196 58821 58211 57351 56703 56909 58262 60545
67917 60545 63197 65371 66081 64922 62790 61337 61373 62061 61923 60293 57601 54727 52529 51623 51990 52823
67901 52823 53167 52754 52006 51429 51284 51617 52201 52552 52411 52132 52258 52782 53239 53447 53758 54533 55699 56876
67883 56876 57695 57964 57768 57423 57163 56963 56798 56860 57193 57412 57183 56860 57151 58224 59597 60765 61489 61529 60721
67864 60721 59389 58126 57070 55897 54649 53915 53945 54130 53723 52670 51436 50349 49488 48882 48475 48113 47814
67847 47814 47826 48219 48685 48940 48999 48889 48476 47874 47581 47854 48287 48443 48590 49345 50848 52760 54845 57069
67829 57069 59255 61168 62921 64862 67047 69173 70983 72413 73429 74119 74859 75924 76994 77499 77480 77561
67813 77561 77967 78089 77252 75459 73088 70271 66992 63542 60392 57660 55034 52263 49504 47117 45224
67798 45224 43519 41574 39438 37945 38142 40212 43107 45426 46563 46797 46487 45622 44247 42892 42229 42398
67782 42398 42962 43483 43903 44319 44685 44896 45023 45227 45485 45606 45487 45207 44909 44732 44795 45031 45102 44811 44646 45493
67762 45493 47597 50057 51667 52056 51797 51640 51940 52619 53266 53340 52677 51793 51313 51142 50615 49558 48683 48684 49327
67743 49327 49790 49688 49404 49555 50446 51915 53326 53748 52609 50360 48234 47125 46828 46516 45715 44615 43632
67726 43632 43067 43111 43708 44261 43931 42594 41232 40913 41515 41870 41173 39822 38785 38585 39079 39836 40417 40589
67708 40589 40560 40836 41559 42198 42147 41456 40666 40126 39802 39576 39341 38917 38324 38098 38843 40420 41964 42821 43119
67689 43119 43324 43621 43942 44259 44615 45011 45451 45939 46355 46480 46203 45523 44390 42865 41422 40667 40585 40482
67671 40482 39872 38993 38186 37282 36165 35591 36639 39290 42132 43760 44090 44051 44383 45103 45982 46981 48057
67654 48057 48892 49187 49184 49529 50522 51744 52564 52727 52295 51356 50233 49637 49976 50630 50574 49770 49138 48984 48400
67635 48400 46792 45214 45250 46959 48918 50148 51048 52281 53662 54633 55256 56146 57582 59095 59928 59744
67619 59744 58932 58225 57971 57832 57359 56664 56233 56219 56322 56308 56168 55766 54828 53437 52151 51449 51378 51815 52562
67600 52562 53079 52745 51678 50761 50477 50256 49495 48667 48672 49422 49907 49514 48506 47247 45825 44571 44069 44180
67582 44180 43783 42133 40090 39319 40480 42745 44921 46431 47173 47111 46308 45019 43451 41687 40044 39183
67566 39183 39418 40072 39975 38673 36824 35311 34360 33723 33439 33970 35634 38209 41064 43435 44636 44379 43045
67549 43045 41429 40048 38844 37640 36617 36157 36367 36964 37493 37563 37069 36450 36549 37848 39880 41662 42728
67532 42728 43427 44197 44834 44663 43270 40939 38524 36970 36756 37588 38625 39145 39025 38671 38619 39205 40373
67515 40373 41666 42515 42697 42458 42140 41836 41503 41241 41164 41090 40630 39707 38734 38166 37989 37833 37474 37029 36710
67496 36710 36580 36686 37203 38213 39347 39874 39314 37921 36480 35658 35596 36078 36852 37722 38441 38735 38479 37773
67478 37773 36837 35961 35532 35824 36575 37040 36801 36440 36923 38263 39348 39379 38935 39095 39889 40348 39937 39164 38700
67459 38700 38664 39052 40085 41649 42947 43360 43281 43533 44248 44871 44998 44593 43622 42204 41043 40937 41749 42467
67441 42467 42428 41893 41319 40705 40010 39585 39732 40197 40532 40653 40654 40312 39244 37480 35615 34421 34387 35469 37094
67422 37094 38570 39606 40319 40779 40883 40663 40294 39714 38760 37825 37734 38593 39372 39118 38073 37053 36256 35486
67404 35486 35092 35703 37125 38423 39153 39716 40340 40576 40111 39348 38704 37937 36757 35694 35731 37127 39030
67387 39030 40251 40167 38939 37154 35389 34022 33306 33457 34476 35965 37329 38222 38731 39210 40084 41577
67371 41577 43345 44556 44677 44079 43476 42967 42162 41129 40490 40483 40646 40685 40970 41742 42429 42334 41610 41046 41130 41776
67351 41776 42677 43480 43814 43632 43363 43323 43169 42401 41206 40316 40074 40164 40219 40243 40344 40498 40672 40869 40958 40714
67331 40714 40130 39487 39095 39129 39655 40572 41551 42294 42866 43521 44277 44890 45201 45216 44922 44346 43755 43496 43594 43778
67311 43778 43875 43859 43587 42967 42419 42646 43749 44963 45531 45474 45248 44959 44401 43642 43122 43142 43586 44239 45136 46396
67291 46396 47771 48610 48372 47195 45735 44420 43052 41332 39559 38449 38297 38700 39148 39543 40036 40644
67275 40644 41215 41553 41518 41217 41186 41970 43360 44416 44535 44247 44564 45746 47086 47826 47837 47453 47020 46742 46706
67256 46706 46862 47081 47287 47452 47483 47306 47108 47279 47993 48929 49560 49668 49428 49014 48285 47016 45395 44096
67238 44096 43724 44213 44892 45128 44844 44476 44590 45513 47111 48827 50044 50566 50708 50882 51221 51584 51822 51971
67220 51971 52268 52983 54084 55050 55251 54644 53907 53713 53979 54020 53334 52103 50917 50187 49850 49561 49126 48674
67202 48674 48401 48265 48157 48250 48874 49939 50838 51120 51032 51172 51808 52757 53779 54771 55710 56615 57539 58338 58565
67183 58565 57811 56174 54267 52868 52595 53596 55309 56792 57623 58300 59393 60616 61244 61213 61078 60940 60247
67166 60247 58924 57915 58093 59151 60109 60531 60697 60837 60851 60724 60651 60732 60914 61304 62127 63298 64361 64976
67148 64976 65228 65382 65566 65734 65729 65385 64841 64755 65816 67862 69760 70459 69941 68975 68203 67838 68030 68955 70381
67129 70381 71549 71851 71515 71394 72083 73425 74829 75784 75998 75350 74061 72826 72389 72840 73551 73937 74071
67112 74071 74415 75209 76385 77838 79390 80608 81129 81185 81374 81868 82287 82518 83091 84419 86088 87355 88035
67095 88035 88435 88624 88382 87821 87498 87803 88618 89632 90621 91370 91776 92141 92984 94369 95786 96864 97784 98790
67077 98790 99691 100268 100806 101792 103191 104404 104953 104962 105021 105690 106974 108172 108498 108008 107624 108037 108983 109939 111060
67058 111060 112848 115156 117224 118612 119524 120249 120874 121553 122517 123713 124911 126155 127582 128856 129535 130052
67042 130052 131527 134279 137285 139467 140846 141934 142751 143109 143307 143767 144402 145062 146209 148330 150912 152936
67026 152936 154312 155918 158172 160406 161958 163179 164929 167517 170456 173001 174705 175712 176640 177923
67012 177923 179326 180492 181802 184077 187349 190633 193207 195470 198111 200991 203417 205160 206672 208537
66998 208537 211179 214881 219538 224443 228726 232089 234908 237728 240819 244051 247015 249511 252118 255877
66984 255877 261011 266319 270350 272977 275270 278088 281498 285374 289709 294192 298316 302275 307024 312964
66970 312964 319124 324288 328553 333089 338563 344474 350109 355546 361383 367850 374582 381214 387917 395122
66956 395122 402802 410305 417151 423837 431387 440074 449063 457541 465750 474452 483742 493014 501973 511034
66942 511034 520651 530818 541406 552545 564390 576837 589760 603253 617382 631943 646711 661737
66930 661737 677203 693222 709988 727772 746432 765167 783310 801252 820126 840547 862019
66919 862019 883579 904682 925431 946411 968436 992027 1016860 1042015 1066992 1092262 1118585
66908 1118585 1146082 1174267 1202765 1231570 1260719 1290138 1319925 1350502 1382284 1415296 1449207
66897 1449207 1483704 1518727 1554334 1590384 1626490 1662380 1698142 1733846 1769099 1803408 1837035
66886 1837035 1870935 1905500 1939811 1972613 2003664 2033533 2062300 2089332 2114439 2138416 2161915
66875 2161915 2184294 2204174 2220857 2234659 2245921 2254320 2259447 2261665 2262015 2261238 2259023 2254352 2246504
66862 2246504 2235623 2222284 2206706 2188637 2167972 2145157 2120837 2095304 2068457 2040186 2010609
66851 2010609 1980037 1948874 1917466 1885820 1853521 1820162 1785879 1751281 1716788 1682219 1647185
66840 1647185 1611733 1576434 1541805 1507829 1474090 1440312 1406650 1373514 1341281 1310217 1280405
66829 1280405 1251553 1222975 1194092 1165065 1136699 1109623 1083724 1058463 1033536 1008991 984891
66818 984891 961184 937920 915352 893692 872890 852753 833202 814380 796504 779551 763040
66807 763040 746258 728927 711584 695108 679860 665512 651710 638455 625674 612853 599594
66796 599594 586355 574109 563201 552988 542770 532665 523298 514894 506999 498906 490085 480417 470370
66783 470370 460837 452396 444679 436777 428279 419606 411367 403826 397054 391105 385713 380170 373910 367078
66769 367078 360240 353730 347566 341813 336634 331955 327401 322635 317621 312606 307974 304010 300586 297130
66755 297130 293111 288520 283772 279293 275315 271826 268384 264265 259264 254272 250574 248535 247308 245784
66741 245784 243424 240251 236611 233118 230279 227887 225225 222090 219147 216932 215023 212706 210098 207951
66727 207951 206491 205096 203183 200885 198656 196608 194527 192278 189861 187215 184259 181201 178616 176972
66713 176972 176102 175278 173916 172087 170251 168653 167135 165401 163153 160086 156171 152088 149000 147628 147700
66698 147700 148353 148842 148813 148227 147306 146329 145298 143991 142462 141132 140165 139061 137205 134617 131885 129607
66682 129607 128141 127627 127825 128097 127962 127559 127232 126824 125826 124150 122328 120950 120223 120034 120065 119890 119356 118806
66664 118806 118577 118283 117094 114831 112314 110473 109445 108749 108000 107215 106620 106360 106256 105772 104460 102570
66648 102570 100998 100495 101026 101984 102778 103159 103207 103138 103010 102602 101754 100788 100302 100455 100763 100727 100323 99762 99086
66629 99086 98222 97191 95995 94554 92998 91845 91571 92096 92887 93475 93663 93396 92697 91724 90641 89429 88015
66612 88015 86542 85327 84470 83702 82698 81482 80370 79586 79037 78604 78513 79144 80355 81261 81013 79736 78372
66595 78372 77643 77474 77478 77594 77986 78591 79089 79251 79121 78898 78776 78816 78860 78623 77958 76916 75578 73968 72222
66576 72222 70662 69568 69020 69021 69582 70505 71267 71347 70676 69620 68543 67507 66392 65224 64316 63963 63955 63632
66558 63632 62683 61714 61614 62323 62716 61884 60151 58591 57932 58225 59200 60463 61526 62152 62646 63436 64395 64934
66540 64934 64768 64238 63808 63559 63325 63059 62837 62601 62114 61246 60226 59509 59350 59564 59806 60001 60290 60583 60535
66521 60535 60081 59721 59949 60588 60964 60652 59823 58942 58356 58152 58201 58282 58227 57971 57445 56619 55633 54726 53964 53332
66501 53332 53071 53457 54058 53801 52273 50556 50106 51020 52073 52365 52193 52187 52337 52291 52093 52102 52369 52518 52242 51658
66481 51658 51131 50854 50645 50247 49789 49790 50529 51605 52375 52708 52950 53281 53518 53580 53688 53906 53838 52984 51254 49113
66461 49113 47374 46760 47228 47713 47012 45159 43519 43322 44479 46036 47328 48290 48997 49477 49847 50195 50326
66444 50326 49985 49299 48684 48290 47820 46970 45848 44905 44570 44937 45665 46248 46564 47125 48568 50839 53076 54381
66426 54381 54615 54403 54465 55030 55778 56190 55940 55081 54025 53303 53163 53299 53117 52419 51676 51402 51401 50955 49723
66407 49723 48111 46726 45801 45297 45234 45679 46619 47951 49446 50662 51174 51040 50742 50542 50217 49598 48999 48839
66389 48839 49172 49881 50908 51917 52167 51289 49969 49226 49199 49227 49013 48977 49377 49819 49915 49843 49903 49988 49898 49843 50168
66368 50168 50762 51090 50769 49947 49226 49256 50148 51192 51411 50606 49603 49282 49700 50371 51046 51780 52450 52711 52378
66349 52378 51543 50394 49256 48696 49107 50196 51204 51647 51512 50833 49615 48304 47766 48384 49493 50082 49834
66332 49834 49162 48410 47518 46452 45572 45389 46172 47865 50140 52368 53730 53678 52364 50493 48715 47246
66316 47246 46087 45384 45309 45587 45520 44724 43708 43386 44045 45095 45856 46189 46222 45934 45373 44939 44889 44714 43690
66297 43690 42145 41569 43050 46016 48915 50828 51880 52285 51769 50185 48161 46665 46041 45870 45706 45619
66281 45619 45918 46639 47509 48310 49058 49840 50647 51393 51973 52248 52132 51795 51649 51918 52280 52116 51159 49769 48589
66262 48589 48086 48381 49227 50033 50145 49375 48218 47445 47568 48690 50585 52608 53769 53382 51763 50063 49285
66245 49285 49560 50332 50977 51150 50806 50176 49606 49261 49035 48885 49080 49899 51122 52095 52420 52372 52473 52768 52800
66226 52800 52265 51441 50830 50575 50421 50174 49945 49938 50180 50484 50552 50106 49133 48073 47572 47931 48907 50076 51186
66207 51186 52102 52700 52958 53020 52981 52814 52554 52262 51675 50365 48515 47141 47032 47801 48490 48815 49106 49225 48463
66188 48463 46751 45203 45058 46517 48805 50887 51872 51361 49908 48788 48780 49436 49862 49867 49914 50273 50821 51547
66170 51547 52613 53842 54600 54404 53484 52605 52392 52780 53079 52693 51807 51169 51097 51111 50671 49922 49376 49217 49323
66151 49323 49705 50426 51290 52025 52648 53223 53520 53434 53487 54274 55472 56115 55915 55624 55879 56347 56350 55843 55316 55075
66131 55075 55028 55024 55096 55461 56405 58017 59910 61408 62122 62159 61740 60906 59683 58238 56714 55206 54006 53556
66113 53556 53904 54481 54627 54157 53254 52096 50869 49947 49787 50654 52465 54737 56689 57763 58142 58469 58964
66096 58964 59217 58936 58444 58125 57894 57572 57429 57860 58799 59906 61050 62165 62855 62720 61965 61199 60627 59912
66078 59912 58827 57680 57063 57474 59024 61115 62541 62471 61398 60650 60886 61535 61770 61498 61166 61056 61125 61236
66060 61236 61185 60752 60007 59455 59570 60235 60811 60747 60040 59190 58772 58966 59431 59720 59775 59840 59944 59768 59123 58298
66040 58298 57787 57864 58523 59650 61032 62320 63201 63612 63766 63997 64527 65280 65979 66598 67586 69331 71442 73001
66022 73001 73586 73673 73842 74008 73743 73010 72216 71719 71627 71946 72618 73474 74398 75462 76696 77820 78397 78241 77566
66003 77566 76861 76712 77480 78942 80443 81653 82950 84819 87131 89401 91517 93736 96110 98443 100748
65988 100748 103230 105779 107992 109832 111710 113654 114863 114474 112572 110130 108065 106567 105163 103255
65974 103255 100688 97910 95507 93590 91850 90174 88809 87817 86831 85589 84319 83243 82125 80724 79364
65959 79364 78497 77968 77329 76779 77075 78445 80218 81721 82967 84209 85348 86253 87288 88914 90925 92535
65943 92535 93253 93324 93316 93609 94356 95643 97495 99775 102196 104444 106332 107909 109289 110369 110878 110850 110825 111305
65925 111305 112134 112763 113070 113473 114213 115047 115904 117418 120308 124389 128637 132232 135222 138122 141243 144563
65909 144563 148012 151533 154910 157684 159368 159817 159412 158870 158767 159230 160111 161305 162767 164279 165464 166040
65893 166040 165868 164812 162850 160388 158116 156314 154550 152253 149328 145939 141995 137382 132567 128467
65879 128467 125534 123327 121132 118694 116221 113947 111914 110046 108215 106406 104859 103885 103439 103105 102642
65864 102642 102255 102150 102127 101902 101538 101161 100530 99437 98363 98045 98248 97677 95528 92710 90982 91106 92308
65847 92308 93450 94235 95123 96488 98149 99562 100256 100140 99594 99317 99934 101619 104001 106415 108253 109194
65831 109194 109263 108804 108372 108547 109721 111960 114998 118325 121408 124049 126569 129505 133028 136779 140386
65816 140386 143962 147863 152031 155828 158539 159867 159995 159438 158824 158494 158170 157229 155466 153339 151361 149498
65800 149498 147398 144950 142329 139659 137017 134685 133067 132286 132083 132159 132324 132400 132322 132457 133421 135330 137486
65783 137486 139156 140561 142851 147104 153535 161544 170217 178782 186924 194853 202891 210818 217759 222867
65769 222867 225956 227297 226963 224763 220712 215062 207741 198288 186841 174875 164326 155980 149208 143333
65755 143333 138707 136143 135796 137026 139126 141755 144885 148874 154480 162261 171812 181993 192077 202341
65741 202341 213394 225280 237469 249415 260693 270758 278954 284827 288230 289115 287436 283307 277060
65728 277060 269043 259453 248499 236671 224668 212960 201384 189364 176638 163806 152062 142352
65716 142352 134804 128859 123782 119077 114665 110851 108018 106200 104967 103748 102210 100337 98366 96764
65702 96764 96019 96150 96485 96191 95119 93935 93414 93780 94744 95952 97199 98351 99270 99848 100061 100016 99990 100323
65684 100323 101102 102035 102789 103483 104664 106704 109363 112076 114630 117403 121023 125942 132302 139902 148177
65669 148177 156411 164322 172409 181576 192344 204523 217602 231277 245501 260199 275020 289275
65657 289275 302053 312577 320653 326751 331455 334842 336576 336646 335789 335006 334767 334926 335335 336217 337738 339458
65641 339458 340547 340538 339585 337910 335298 331238 325258 316941 305913 292282 277002 261329 245863 230445
65627 230445 215063 200394 187211 175609 165211 155865 147696 140582 134103 128092 122828 118481 114702
65614 114702 111020 107461 104462 102289 100815 99843 99297 99024 98687 98099 97543 97496 98020 98617 98764 98497 98342
65597 98342 98716 99480 100071 100015 99296 98273 97320 96594 96107 95922 96179 96949 98158 99699 101594 103988 106956
65580 106956 110304 113624 116702 119931 124210 130263 138077 147079 156764 167014 177919 189594 202146
65567 202146 215518 229335 243108 256594 269579 281306 290633 297009 300871 302725 302234 298684 291992
65554 291992 282735 271445 258481 244493 230314 216336 202506 188939 176058 164120 153187 143634
65542 143634 136079 130606 126576 123335 120580 117957 115083 112271 110512 110239 110753 111295 111994 113102 114006
65527 114006 113869 112803 111489 109979 107875 105439 103458 101978 100237 98052 96326 95811 96137 96486 96507 96126
65511 96126 95145 93643 92278 91658 91712 92070 92619 93219 93370 92864 92452 93149 94915 96596 97125 96300 94535 92499
65493 92499 91057 90956 92200 94105 96153 98489 101362 104457 107145 109239 111175 113448 116101 118778 121097
65478 121097 122884 124115 124818 125101 125198 125324 125400 125022 123781 121608 118768 115666 112712 110193 108057 105933
65462 105933 103593 101364 99839 99178 98923 98565 98069 97718 97621 97553 97190 96390 95326 94476 94391 95227 96470 97263
65444 97263 97194 96680 96508 96982 97711 98289 98976 100362 102396 104129 104778 104807 105587 107930 111288 114518 117085
65427 117085 119262 121352 123126 124030 123713 122243 119963 117258 114400 111564 108939 106729 104986 103550 102376
65412 102376 101818 102285 103542 104669 104938 104532 104120 103967 103868 103884 104565 106146 107904 108803 108750 108876 110371 113266
65394 113266 116523 119193 121231 123152 125221 127229 128911 130177 130864 130657 129527 128037 126834 125970 125057
65379 125057 124018 123248 122973 122856 122477 121908 121530 121459 121443 121281 121138 121321 121803 122076 121728 121178 121542 123432 126185
65360 126185 128726 130917 133417 136374 139235 142005 145624 150544 155768 160085 163593 167152 170892 174219
65346 174219 176932 179286 181106 181960 182205 182832 184034 184864 184559 183384 181851 179917 177367 174214 170340
65331 170340 165438 159801 154452 149912 145480 140359 134916 130114 126222 122922 120324 118951 118789 119096 119196
65316 119196 118907 118263 117366 116506 115857 115056 113617 111798 110508 110230 110429 110191 109070 107214 105049 103094
65300 103094 101834 101532 102124 103323 104791 106424 108595 111876 116186 120425 123383 124899 125717 126293 126240 125080
65284 125080 123047 120957 119540 119028 119125 119151 118416 116693 114390 112197 110566 109428 108380 107241 106442 106622
65268 106622 107767 109038 109654 109602 109283 108905 108633 108852 109660 110422 110525 110398 111035 112621 114378 115736 116840
65251 116840 117855 118589 119063 119607 120092 119821 118621 117319 116553 115776 114119 111726 109541 108124 107385 107170
65235 107170 107340 107380 106721 105561 104788 104917 105515 105817 105536 104956 104464 104134 103650 102689 101500 100914 101465 102627
65217 102627 103248 102745 101536 100383 99659 99341 99280 99341 99451 99719 100351 101346 102337 102789 102385 101336 100400 100373 101318
65198 101318 102369 102569 101840 100903 100368 100182 99957 99504 99030 99032 99937 101590 103163 103960 104302 105163 106879 108709
65180 108709 109852 110420 111021 111808 112438 112767 113009 113251 113295 113103 113036 113461 114310 115112 115312 114544 112917 111204
65162 111204 110504 111378 113325 115240 116366 116707 116699 116750 117098 117829 118872 120054 121211 122188 122731 122623 122094 122002
65144 122002 123368 126590 131078 135679 139512 142554 145513 149137 153592 158511 163508 168478 173392 178060
65130 178060 182244 185874 189023 191780 194145 195923 196681 196138 194749 193589 193349 193681 193812 193477 192818 191702
65114 191702 189814 187392 185152 183331 181379 178843 176034 173478 171138 168596 165693 162629 159579 156484
65100 156484 153078 149027 144337 139655 135761 132580 129301 125765 123070 122190 122534 122631 121909 120929 120130 119389
65084 119389 118891 119354 120896 122397 122572 121334 119642 118386 117781 117525 117122 116277 115332 115104 115962 117273 118097
65067 118097 118186 117916 117489 116775 115857 115119 114678 114237 113736 113728 114699 116291 117606 118254 118714 119571 120666 121204 120650
65048 120650 119339 118118 117485 117233 116971 116781 117067 117752 117970 116843 114460 111843 109934 108823 107997 107094
65032 107094 106288 106039 106594 107648 108469 108478 107730 106669 105452 103877 102107 100986 101196 102369 103498 104097 104445
65015 104445 104831 105146 105294 105405 105558 105775 106383 107744 109454 110524 110765 111307 113151 115802 118040 119574
64999 119574 121149 123359 126225 129661 133405 136491 137840 137622 137234 137635 138458 139044 139503 140192 140863 141121
64983 141121 141309 142204 143986 146113 148114 149982 151829 153621 155216 156351 156610 155778 154222 152576 151083
64968 151083 149484 147444 144810 141549 137869 134398 131769 129935 128245 126287 124312 122712 121499 120552
64954 120552 120003 119945 119995 119578 118638 117664 116945 116215 115171 114061 113437 113468 113772 113851 113507 112873 112326 112296 112848 113416
64934 113416 113326 112717 112563 113502 114952 115780 115589 114957 114549 114527 114794 115312 115948 116321 116007 114779 112719 110384
64916 110384 108767 108608 109629 110847 111752 112721 114127 115609 116563 116971 117290 117810 118600 119855 121816 124409
64900 124409 127288 130214 133167 136222 139574 143526 148150 153107 158061 163092 168388 173742 178779 183555
64886 183555 188518 193893 199493 205050 210364 215158 219150 222305 224719 226309 226919 226627 225543 223367 219690
64871 219690 214758 209536 204882 201011 197731 194777 191877 188977 186504 184933 183998 182889 181344 179936
64857 179936 179030 178063 176273 173557 170167 166100 161431 156862 153176 150289 147442 144278 141170 138544 136413
64842 136413 134569 132736 130487 127523 124177 121269 119329 118275 117864 118003 118434 118547 117860 116559 115357
64827 115357 114944 115614 117222 119283 121262 122879 124138 125138 126040 127142 128687 130547 132366 134069 135934
64812 135934 138083 140295 142533 145260 148875 153076 157191 161070 165167 169705 174196 178074 181519 185218
64798 185218 189230 192515 193861 193129 191164 188559 185064 180484 175611 171628 168845 166633 164522 162631
64784 162631 160950 159040 156830 155078 154410 154334 153828 152633 151411 150871 151301 152748 154967 157226 158884 160271
64768 160271 162380 165557 169139 172628 176512 181414 187029 192540 197796 203354 209447 215542 221030 225801
64754 225801 230020 233813 237452 241484 246276 251582 256830 261758 266456 270832 274351 276436 276942 276079 274018
64739 274018 270747 266269 260750 254456 247676 240743 233972 227474 221169 215139 209915 206214 204264 203439
64725 203439 202630 201106 199075 197398 196679 196673 196682 196440 196277 196439 196677 196807 197354 199191 202650 207311 212511 217587
64707 217587 221787 224574 226204 227498 228800 229512 228866 226737 223396 218901 213164 206430 199270 192195 185575
64692 185575 179744 174880 170900 167756 165595 164327 163316 162056 161001 161073 162247 163189 162584 160473 158060
64677 158060 156513 156221 156900 158068 159454 161265 164090 168381 173948 179997 185719 190905 195981 201340 206600
64662 206600 210746 213113 213983 213944 212923 210388 206435 202009 197915 194075 190086 186034 182387 179371 176932
64647 176932 175128 174100 173724 173639 173697 174115 175179 177039 179749 183301 187540 192273 197463 203184 209439 216263
64631 216263 223993 233083 243433 254057 263644 271376 277156 281196 283643 284580 284073 282065 278344 272825
64617 272825 265808 257785 249031 239672 230168 221373 213807 207110 200587 194207 188643 184347 181049 178326
64603 178326 176192 174791 173818 172680 171140 169474 168106 167394 167675 169042 170973 172572 173412 173935 174803 176052
64587 176052 177154 177829 178518 179945 182442 185855 189970 194737 200124 206069 212732 220458 229158 237970 246094
64572 246094 253884 262447 271949 280922 287720 292196 295295 297336 297571 295463 291505 286376 279943 271730
64558 271730 262040 251992 242491 233630 225110 216858 209127 202299 196680 192290 188726 185482 182467 179990
64544 179990 178171 176666 175254 174402 174843 176617 178968 181260 183560 186060 188259 189210 188538 186816 184797
64529 184797 182586 179781 176251 172471 169036 166072 163275 160500 158161 156870 156660 156729 156162 154916 153893
64514 153893 153968 155072 156362 157164 157534 157926 158541 159186 159686 160246 161325 163271 166138 169731 173670 177511
64498 177511 181050 184594 188743 193791 199502 205464 211438 217211 222414 226758 230280 233079 234974 235762
64484 235762 235621 234900 233693 232087 230658 230058 230058 229619 228156 226100 223928 221228 217277 212175 206921 202581
64468 202581 199749 198440 197946 197122 195505 194106 194497 197032 200532 203772 206658 209651 212586 214613 215189
64453 215189 214666 213779 212829 211621 210209 209331 209781 211411 213173 214331 215205 216507 218368 220525 223188 227029
64437 227029 232365 238855 246118 254196 263290 273452 284767 297586 312449 329890 350354 374048
64425 374048 400967 431324 465937 505800 551251 601995 657978 719797 787994 862132 940546
64414 940546 1020635 1099380 1174242 1243999 1308485 1367305 1419022 1461655 1493526 1513416 1520474 1514645
64402 1514645 1497082 1469641 1433800 1390049 1338134 1277773 1209488 1135099 1057313 978640 900828
64391 900828 825278 753467 686534 624817 568331 517538 473154 435289 403201 375913 352768
64380 352768 333403 317534 304788 294496 285698 277638 270181 263483 257438 251830 246894 243169 240679
64367 240679 238693 236416 233512 229842 225179 219539 213476 207694 202461 197631 193068 188836 185110 182143
64353 182143 180232 179468 179590 180262 181437 183279 185819 188905 192467 196486 200618 204036 205895 205961 204700
64338 204700 202805 200696 198425 195871 192931 189590 185944 182186 178579 175465 173234 172076 171549 170615 168484
64323 168484 165606 163504 163372 164962 167065 168913 170760 173156 176127 179257 182219 184912 187167 188687
64309 188687 189371 189504 189475 189331 188647 186911 184004 180348 176555 172973 169553 166099 162546 159067 155994 153673
64293 153673 152202 151266 150336 149192 148210 147930 148408 149185 149950 150959 152569 154565 156306 157533 158682 160237
64277 160237 162140 164132 166444 169710 174224 179659 185569 191790 198149 204107 209034 212759 215563 217682
64263 217682 219034 219461 219053 218162 217246 216760 217044 218099 219474 220467 220522 219422 217111 213511 208677 203038
64247 203038 197205 191448 185622 179743 174378 170152 167048 164563 162469 161022 160359 160071 159526 158382 156737
64232 156737 155096 154262 154862 156635 158482 159491 159749 159958 160546 161432 162366 163075 163210 162637 161785 161369 161663
64215 161663 162265 162535 161990 160358 157707 154682 152287 151137 150984 151074 150887 150464 150138 150101 150204 150095 149564 148807
64197 148807 148388 148900 150533 152817 154872 156218 157433 159773 163971 169675 176268 183868 193036 203638
64183 203638 214597 224882 234341 243309 251682 258625 263060 264312 262468 258336 252976 247084 240737 233706
64169 233706 225875 217444 208910 200918 193961 188070 182899 178142 173752 169726 165913 162240 158996 156545
64155 156545 154763 152982 150758 148542 147310 147453 148289 148921 149382 150556 153124 157010 161830 167227 172506
64140 172506 176649 179326 181476 184141 186938 188475 188169 186803 185137 182934 179831 176318 173153 170352
64126 170352 167632 165510 164986 166095 167661 168780 169851 171738 174519 177686 181151 185292 190047 194748
64112 194748 199086 203664 209197 215596 222307 229213 236489 243608 249250 252551 253983 254709 255444 256358 257670
64097 257670 259708 262515 265944 270155 275458 281576 287541 292543 296486 299437 300885 299957 296277 290345
64083 290345 283080 275149 266741 257807 248462 239157 230447 222691 216043 210579 206182 202405 198826 195625
64069 195625 193508 192873 193300 194002 194580 195160 195943 196921 197955 198955 199942 201014 202240 203590 205051 206804
64053 206804 209129 212070 215327 218549 221655 224931 228926 234138 240518 247344 253917 260410 267612 275782
64039 275782 284238 292250 299752 306727 312362 315504 315812 313889 310347 305335 299100 292450 286316 281127
64025 281127 276801 273145 270025 267374 265297 264128 264155 265247 266886 268590 270223 271750 272671 271942 268755
64010 268755 263511 257730 252753 248661 244707 240617 236979 234313 232257 230044 227545 225397 224094 223341
63996 223341 222477 221303 220262 219909 220454 221802 223746 225975 228136 230186 232621 236088 240664 245705 250507
63981 250507 254993 259690 265135 271418 278167 284876 291273 297473 303811 310500 317507 324739 332228 340066
63967 340066 348228 356661 365587 375629 387480 401342 416753 433078 450230 468906 490180 515082
63955 515082 544511 579255 619924 667101 721793 785406 858978 942679 1036363 1140222 1254276
63944 1254276 1377474 1508097 1645087 1788176 1936418 2087260 2237438 2384034 2524039
63935 2524039 2653528 2768248 2865064 2942402 2999485 3035694 3050562 3043681 3014561 2963097 2890372
63924 2890372 2798575 2690098 2567232 2432965 2291487 2147199 2003202 1861078 1722123 1588383
63914 1588383 1462205 1344992 1236804 1137300 1046732 965679 894062 830989 775636 727737 686886
63903 686886 651897 621396 594811 572255 553515 537728 524066 512250 502187 493568 486106 479929
63891 479929 475262 471806 468703 465329 461965 459530 458647 459179 460737 463404 467695 473946 482152 492349
63877 492349 504668 518863 534253 550405 567506 585749 604763 624014 643394 662899 682007
63866 682007 699989 716676 732301 746619 758795 768281 775274 780099 782559 782176 778759 772548 763964
63853 763964 753405 741157 727409 712451 696811 681004 665176 649121 632563 615211 596704
63842 596704 576858 555953 534435 512464 490043 467512 445435 424032 403164 382919 363758
63831 363758 346029 329805 315248 302588 291600 281596 272274 264065 257323 251549 245830 239801 233797
63818 233797 228255 223285 218654 213903 208655 203171 198474 195550 194336 193706 192530 190658 188853 187825
63804 187825 187446 187044 186404 186125 186694 187536 187469 186026 183746 181241 178616 175976 173785 172283 171042 169593
63788 169593 168132 167164 166719 166383 165918 165436 165160 165314 166043 167042 167565 167212 166518 166242 166259 165750 164455 163138
63770 163138 162646 162996 163608 164010 164028 163575 162657 161523 160532 159805 159196 158657 158525 159231 160685 162151 162995 163421
63752 163421 164118 165180 165821 165370 164163 163167 163024 163830 165464 167618 169643 170949 171648 172370 173437 174605
63736 174605 175693 176931 178514 180165 181546 182837 184553 186816 189131 190950 192289 193678 195615 198218
63722 198218 201422 205324 210137 215804 221807 227386 231851 234784 236265 236944 237524 237999 237642 235948 233239
63707 233239 230110 226698 223002 219606 217367 216351 215722 214813 213826 213250 213125 213271 213867 215276 217390 219595
63691 219595 221448 223122 225082 227482 229966 231957 233152 233837 234774 236654 239527 242730 245411 247176 248236
63676 248236 249009 249711 250396 251183 252186 253282 254153 254684 255127 255824 256951 258580 260678 262902 264637 265520
63660 265520 265718 265399 264182 261563 257802 253884 250442 247113 243199 238688 234329 230820 228187 225970 223828
63645 223828 221903 220633 220274 220640 221324 222173 223488 225776 229295 233778 238570 243102 247296 251467 255817
63630 255817 260160 264256 268245 272585 277578 283135 289015 295171 301846 309345 317743 326831 336470 347002
63616 347002 359169 373571 390281 408974 429203 450590 473080 497188 523652 552554 583002
63605 583002 613922 644781 675127 703713 728658 748492 762598 770756 772977 770099 764096 757270
63593 757270 750995 745207 738897 731044 721246 709622 696142 680226 661230 639228 615064 589750
63581 589750 564097 538889 514960 492969 473306 456217 441631 428870 417069 406132 396911 390196
63569 390196 385862 383330 382481 383597 386580 390848 396109 402739 411068 420571 430199 439527 449236 460308
63555 460308 472999 486908 501952 518841 538503 561367 587425 616694 649315 685342 724672
63544 724672 766763 809845 850502 884707 909664 924662 930495 928665 921236 910696 899253 888181
63532 888181 877887 868385 859522 850945 842033 831887 819420 803687 784179 760757 733457 702715
63520 702715 669652 635725 602006 569111 537665 508227 480712 454598 430050 408217 389982
63509 389982 374869 361715 350012 339990 331620 324211 317073 310103 303644 298069 293541 289953 286986
63496 286986 284326 281794 279225 276470 273686 271369 269821 268711 267475 265996 264680 263976 264120 265193 267132
63481 267132 269721 272794 276380 280460 284804 289275 294022 299019 303618 307035 309184 310560 311330 311040 309311
63466 309311 306412 302993 299593 296511 293812 291290 288737 286394 284868 284368 284281 283754 282586 281333 280690
63451 280690 280984 282222 284332 287243 290791 294713 298791 303048 307795 313512 320738 330063 342073 357191
63437 357191 375617 397456 422784 451413 482607 514958 546399 574412 596732 612365 621992 627288
63425 627288 629919 631220 632454 634945 640002 648927 662892 682480 707418 737075 771002 808516 847919
63412 847919 886743 922853 954774 980900 999239 1008638 1010023 1005865 998456 989018 978286 967244
63400 967244 956795 946729 935370 920543 901027 877050 849407 818434 784184 747421 709889
63389 709889 673403 638966 606847 577110 549731 524546 501553 481214 464046 449964 438359
63378 438359 428866 421687 416949 414076 412193 411103 411563 414426 419726 426809 435218 445173 457106 471032
63364 471032 486589 503614 522508 544061 569009 597532 629026 662444 697078 733010 770628
63353 770628 809758 849319 887526 922136 950832 972060 985727 992825 994418 991317 984617 975742
63341 975742 965588 954113 941188 927402 913445 898899 882217 861920 837518 809456 778677
63330 778677 746318 713362 680465 648317 618167 591547 569334 551330 536872 525605 517516 512413
63318 512413 509434 506702 501428 491034 474884 454908 434064 414162 395387 377613 361332 347059
63306 347059 334554 323285 313329 305157 298649 293014 287789 283336 280018 277349 274448 271064 267632 264462
63292 264462 261364 258149 255085 252607 250817 249442 248148 246754 245207 243492 241580 239474 237322 235442
63278 235442 234169 233652 233841 234469 235000 234812 233795 232713 232656 234006 236099 237907 238885 239200 239454 240291 242054
63261 242054 244661 247818 251287 254825 258052 260786 263445 266703 270638 274694 278606 282925 288302 294624
63247 294624 301237 307784 314503 321910 330491 340490 351642 363306 375242 388132 402963 419951 438371
63234 438371 457345 476412 495430 514337 533166 552020 570922 589779 608403 626506 643930
63223 643930 661117 678990 697946 717231 735921 754243 773144 792552 810955 826926 840180
63212 840180 850638 857247 858618 854377 845096 831145 812509 789765 764428 738026 711374 684967
63200 684967 659529 635793 614115 594734 578187 565043 555364 548816 545280 545014 548178 554518 563712
63187 563712 575785 590906 608806 628614 649429 670969 693534 717274 741605 765471 788193
63176 788193 809891 831020 851638 871378 890015 907726 924577 939976 952876 962381 967858 968555
63164 968555 963610 952704 936436 915730 891054 862506 830513 796005 759899 722836 685586 649315
63152 649315 615123 583468 554271 527409 502884 480699 460838 443276 427797 413926 401375
63141 401375 390453 381656 374838 369142 363864 359049 355097 352095 349774 347933 346638 346074 346354 347302 348292
63126 348292 348586 348106 347748 348536 350523 352832 354798 356723 359332 362791 366495 369777 372588 375461 378882
63111 378882 382786 386711 390403 394071 397915 401570 404314 405817 406443 406834 407447 408554 410315 412569 414761
63096 414761 416423 417712 419238 421390 423945 426352 428199 429383 429950 429890 429100 427560 425544 423573 422088
63081 422088 421176 420663 420426 420606 421576 423761 427425 432553 438931 446277 454239 462405 470575 479041 488366
63066 488366 498814 510293 522952 537478 554420 573424 593596 614666 637507 663333 692538
63055 692538 724443 758141 793507 831275 872120 915857 961741 1009323 1058450 1108451 1158068
63044 1158068 1206601 1254560 1302599 1350311 1396869 1442586 1488872 1536573 1585157 1633707 1681799
63033 1681799 1728862 1773269 1812741 1845430 1870200 1886138 1892345 1888219 1873624 1848762 1814085 1770366
63021 1770366 1718853 1661418 1600415 1538041 1475814 1414931 1357085 1304362 1258202 1218946 1186566
63010 1186566 1161282 1143213 1132044 1127545 1129938 1139250 1154773 1175656 1201569 1232183 1266451 1303147
62998 1303147 1341715 1381789 1422210 1461616 1499913 1538160 1576832 1615107 1652078 1687675 1721933
62987 1721933 1754123 1783088 1807757 1826796 1838330 1840726 1833351 1816149 1788929 1751631 1704912 1649907
62975 1649907 1587796 1520206 1449654 1378723 1308784 1240142 1173386 1109877 1050784 996305 946168
62964 946168 900413 859316 822771 790069 760243 732523 706589 682532 660514 640493 622335
62953 622335 606018 591406 577837 564310 550247 535827 521460 507201 492911 478776 465361
62942 465361 453175 442356 432789 424348 416910 410166 403544 396531 389165 382129 376166 371370 367218 363217
62928 363217 359353 355877 352989 350859 349699 349486 349672 349460 348508 347207 346239 345912 345970 346018 345983 346127 346577 346976
62910 346976 346691 345408 343367 341007 338497 335747 332713 329472 326047 322445 318941 316116 314393 313629 313338
62895 313338 313248 313480 314211 315393 316848 318422 319928 321108 321813 322140 322299 322388 322436 322544 322849 323398 324200 325339
62877 325339 326869 328672 330584 332508 334151 334825 333984 331960 329732 327787 325689 323011 320252 318374 317661
62862 317661 317512 317204 316462 315365 314136 313064 312348 312003 312074 312722 313714 314177 313498 312422 312424 313859 315550 316497
62844 316497 317132 318223 319316 319347 318398 317707 317795 317637 316074 313307 310501 308519 307602 307794 308908 310250 311053
62827 311053 311287 311676 312902 315137 318235 321809 325079 327206 328188 329078 330935 333786 336911 339941 343259
62812 343259 347369 352321 357842 363661 369510 375122 380548 386320 392967 400373 407886 415159 422682 431351
62798 431351 441606 453151 465427 478210 491756 506534 522932 541126 561151 583081 607259
62787 607259 634368 665214 700385 740123 784570 834088 889249 950446 1017509 1089690 1165944
62776 1165944 1245174 1326282 1408093 1489185 1567612 1640803 1705980 1760940 1804445 1835747 1853864
62765 1853864 1857552 1846052 1819761 1780252 1729814 1670900 1605580 1535211 1460766 1383667 1306091
62754 1306091 1230181 1157069 1086995 1020275 957677 899763 846339 796949 751660 710922 674748
62743 674748 642472 613394 587329 564333 544175 526353 510517 496556 484246 473133 462982
62732 462982 454147 447225 442307 438749 435764 433101 431104 430252 430777 432582 435353 438792 442904 448001 454287
62717 454287 461489 469195 477589 487608 500187 515480 533011 552473 574218 598945 627089 658658
62705 658658 693652 732467 775751 823993 877469 936620 1001945 1073212 1149124 1228290 1310282
62694 1310282 1394966 1480751 1564334 1642517 1713649 1776831 1830458 1872290 1900632 1914620 1913595
62683 1913595 1897126 1865730 1820915 1764346 1697569 1622615 1542172 1458786 1374319 1290337 1208440
62672 1208440 1129819 1054963 984221 918361 858230 804136 755849 712802 673982 638099 604535
62661 604535 573948 547420 525068 505861 488646 472922 458739 446324 435795 426767 418299 409571
62649 409571 400616 391961 383691 375469 367452 360450 354868 350103 345427 340990 337423 334828 332818 331384
62635 331384 331048 331978 333448 334466 334585 333866 332308 329761 326419 323055 320561 319277 318846 318658 318317 317802
62619 317802 317333 317208 317671 318818 320622 323001 325847 329044 332610 336848 342197 348845 356576 365113 374494
62604 374494 385037 397047 410695 426114 443498 463151 485426 510489 538134 568084 600548
62593 600548 636063 674482 714436 754265 793201 831042 866754 898141 923120 940839 951356
62582 951356 954846 951516 941790 925908 903630 875031 841600 805940 770111 734607 699089 663706
62570 663706 629326 596746 566165 537530 511008 486861 465096 445551 428306 413689 401741
62559 401741 391963 383705 376632 370589 365244 360157 355127 350208 345469 341073 337517 335348 334568 334552 334647
62544 334647 334604 334436 334213 334149 334579 335698 337489 339910 342848 345869 348440 350592 352972 356094 359911 364309
62528 364309 369535 375862 383241 391696 401655 413551 427495 443783 463236 486436 512975 542119
62516 542119 573930 608985 647188 687714 730101 774543 820860 867899 914177 958432 999235
62505 999235 1034703 1063161 1083814 1096548 1101457 1098841 1089184 1072822 1050009 1021613 989300 954703
62493 954703 918787 882471 847406 815519 787951 764895 746253 731930 721656 715127 712382 713686
62481 713686 719036 728110 740590 756080 773745 792477 811490 830332 848220 863781 875663 883154
62469 883154 886107 884564 878682 868730 854811 836639 813857 786669 756115 723708 690818 658225
62457 658225 626095 594304 562922 532610 504560 479823 458481 439661 422621 407652 395461
62446 395461 385757 377146 368667 360911 355157 351826 350284 349785 350018 350876 352288 354267 356649 358804 359997
62431 359997 360053 359312 358055 356385 354451 352205 349053 344433 338746 333031 327614 321822 315261 308651 302971
62416 302971 298481 295077 293025 292622 293387 294205 294220 293292 291761 290093 288545 286909 284839 282551 280795 279839
62400 279839 279021 277738 276365 275653 275745 276506 278302 281467 285166 287871 289097 289808 290966 292489 293940 295416
62384 295416 297250 299460 302030 305318 309623 314683 320004 325496 331414 337905 344932 352504 360682 369519
62370 369519 379210 390056 402112 415141 429183 444861 462841 483257 505983 531250 559625 591589
62358 591589 627531 667952 713206 763057 816716 873196 931220 988923 1044089 1094718 1139147
62347 1139147 1175822 1203560 1222156 1232261 1234511 1229088 1216214 1196554 1170803 1139156 1101641 1058937
62335 1058937 1012680 965030 918037 873181 831114 791730 754690 720097 688705 661388 638325
62324 638325 618679 601134 584752 569238 554421 539890 525341 511011 497262 483772 469613
62313 469613 454302 438436 423125 409106 396608 385733 376549 368876 362315 356536 351429 347021 343379
62300 343379 340522 338243 336081 333617 330784 327814 324977 322541 320855 320246 320777 322215 324238 326583 329078
62285 329078 331641 334229 336743 339139 341727 345107 349523 354410 358885 362628 365998 369427 373186 377766
62271 377766 383883 391742 400656 409837 419415 430313 443266 458311 475256 494292 516059 541336
62259 541336 570799 604930 644048 688373 737954 792406 850695 911308 972592 1032814 1089994
62248 1089994 1141976 1186782 1222848 1249041 1264795 1270420 1267094 1256198 1238474 1213781 1181628 1142002
62236 1142002 1095856 1044932 991157 936135 881116 827184 775306 726221 680495 638681 601260
62225 601260 568336 539510 514136 491683 471867 454580 439743 427163 416500 407384 399499 392478
62213 392478 385877 379446 373281 367457 361639 355477 349334 344143 340400 337729 335650 334261 333850 334242 335047
62198 335047 336235 337978 340124 342356 344722 347474 350497 353575 357252 362683 370334 379331 388506 397734
62184 397734 407794 419101 430967 442081 451479 459153 465928 472728 479854 486947 493655 500186 507213
62171 507213 515485 525635 538239 553923 573486 597885 627787 663025 702635 745521 790786 837314
62159 837314 883345 926747 965621 998590 1024839 1044180 1056964 1063712 1064890 1061006 1052520 1039493
62147 1039493 1021694 999376 973587 945386 915218 883542 851680 821284 793081 766873 742748
62136 742748 721463 703412 687941 674195 662156 652313 644604 638267 632690 627983 624648 623040 623209
62123 623209 625051 628336 632595 637087 641007 643782 645157 645073 643723 641808 640357 639866 639665 638468 635461
62108 635461 630502 623399 613774 601920 589251 577358 566832 557429 549136 542589 538479 536961 537716
62095 537716 540303 544383 549826 556658 564734 573443 581941 589805 597372 605365 614222 623848 633971 644671
62081 644671 656446 669684 684161 699316 714986 731620 749679 769162 789943 812183 835979
62070 835979 860693 885108 908377 930637 952737 975581 999718 1025239 1051941 1079676 1108395
62059 1108395 1137621 1166021 1191946 1214358 1232811 1246575 1254482 1256025 1252042 1243721 1231238 1213876
62047 1213876 1191228 1163584 1131251 1094337 1053517 1010407 966679 923136 880011 837760 797007
62036 797007 757905 720318 684735 652394 624200 599888 578578 559767 543399 529229 516741
62025 516741 505665 496039 487625 479681 471578 463307 455148 447109 439061 431188 423896 417348 411452 406227
62011 406227 401736 397704 393756 390232 388209 388288 389782 391655 394000 397872 403700 410584 417393 423856 430132
61996 430132 435806 440022 442372 443002 441929 438982 434590 429969 426054 422508 418231 412662 406237 399710
61982 399710 393400 387197 381040 375234 370313 366526 363422 360062 355805 350787 345617 340867 337010 334486
61968 334486 333276 332486 330936 328359 325732 324236 324078 324437 324329 323371 321934 320734 320231 320341 320821 321828
61952 321828 323801 326825 330500 334568 339233 344689 350832 357811 366457 377560 390960 405891 422138
61939 422138 440191 460194 481360 502751 524203 546107 568496 590668 611693 631077 648929
61928 648929 665545 680803 694024 704546 712397 718082 721646 722266 719040 712027 702345 691440 680424
61915 680424 669942 660393 652282 646493 644093 645669 650979 659467 670984 685635 703005 721945 741217
61902 741217 760007 777605 792956 804934 812896 816655 815965 810438 800093 785677 768298 748890
61890 748890 728161 706733 685062 663343 641814 621120 601989 584495 567945 551706 535881
61879 535881 520982 507214 494403 482466 471523 461485 451981 442889 434692 428063 423175 419615 416907
61866 416907 414977 414141 414768 416956 420527 425310 431409 439109 448609 460039 473755 490335 510134 533017
61852 533017 558674 587034 618181 651999 688132 726184 765667 805734 845148 882532 916621
61841 916621 946381 971101 990266 1003215 1009104 1007545 999267 985868 969029 950245 931173 913566
61829 913566 898701 887279 880010 877725 880607 887813 898356 911941 928328 946137 962972 976659
61817 976659 985788 989189 985763 975169 958091 935405 907499 874801 838587 800663 762315 724058
61805 724058 686361 650183 616553 585860 557818 532104 508864 488484 470951 455645 441952
61794 441952 429902 419943 412102 405703 399993 394694 389814 385170 380426 375410 370210 365071 360340 356275
61780 356275 352721 349221 345706 342802 341031 339878 338153 335315 332009 329228 327344 326121 325275 324759 324717
61765 324717 325383 326910 329079 331361 333495 335946 339516 344415 349871 354710 358293 360871 363111 365409
61751 365409 367687 369715 371399 372733 373640 374019 373885 373371 372670 371977 371385 370734 369696 368100 366070 363854
61735 363854 361684 359837 358558 357820 357465 357708 359057 361482 364114 366215 368018 370127 372482 374641 376748
61720 376748 379348 382410 385411 388411 392016 396103 399584 401918 403937 406529 409235 410904 411229 410750 409688
61705 409688 407586 404141 399769 395377 391821 389376 387403 384845 381492 378430 376717 375976 374939 373036
61691 373036 370719 368425 366133 363964 362322 361153 359795 357910 356004 354659 353676 352335 350182 347283
61677 347283 344015 340951 338696 337505 337056 336723 336014 334743 333012 331110 329315 327718 326352 325360 324771
61662 324771 324230 323274 321874 320391 319091 318067 317625 318210 319858 322097 324479 326850 329054 330869 332386
61647 332386 334055 336188 338822 342156 346582 351994 357547 362442 366643 370500 374072 377147 379592 381251
61633 381251 381691 380450 377420 372795 366895 360286 353778 347957 342880 338425 334622 331426 328543 325920
61619 325920 324073 323488 323939 324842 326028 327658 329528 331014 331669 331433 330299 328211 325286 321774 317740
61604 317740 313141 308128 302976 297805 292761 288351 285103 282855 280823 278440 275758 272985 270147 267330
61590 267330 264877 263055 261736 260558 259209 257499 255387 253019 250609 248282 246219 244768 244058 243565 242542
61575 242542 240868 238987 237009 234491 231330 228274 226152 224967 224165 223448 222878 222405 221774 220846 219731 218613
61559 218613 217656 216966 216458 215897 215237 214735 214584 214656 214853 215438 216700 218462 220246 221760 222882 223368 223041
61542 223041 222203 221405 220798 220133 219437 219190 219677 220550 221311 221935 222752 223918 225293 226680 227929 228877 229391
61525 229391 229425 228883 227576 225505 223062 220680 218327 215661 212701 210059 208321 207456 206978 206478 205787 204835
61509 204835 203692 202667 202021 201594 201049 200530 200619 201457 202267 202107 200857 199178 197718 196734 196236 196029 195682
61492 195682 194927 194105 193787 193945 194019 193793 193609 193616 193477 193137 193193 194027 195141 195925 196582 197582 198681 199376 200095
61473 200095 201918 204990 208023 209634 209575 208501 207222 206443 206591 207425 208242 208797 209533 210657 211584 211743 211378
61456 211378 211009 210628 210065 209771 210413 211883 213391 214485 215312 215964 216265 216300 216469 216801 216807 216261 215671 215681 216406
61437 216406 217637 219361 221717 224664 227997 231536 235091 238378 241172 243479 245473 247335 249170 250912
61423 250912 252307 253186 253674 253895 253628 252770 252059 252674 254852 257450 259284 260381 261470 262619 263111 262494
61407 262494 261187 259937 259062 258324 257288 255688 253527 250866 247597 243692 239655 236293 233864 231915 230248
61392 230248 229477 230084 231351 232053 231992 232063 232791 233596 233706 233128 232324 231430 230268 228888 227712 227178 227395 228095
61374 228095 228892 229670 230662 232031 233534 234902 236338 238182 240234 241962 243403 245246 247865 250864 253870
61359 253870 257231 261521 266698 272180 277507 282616 287674 292974 298816 305249 312023 318882 325669 332062
61345 332062 337618 342328 346758 351366 356033 360598 365414 370912 376841 382424 387108 390812 393640 395847
61331 395847 397867 399869 401305 401363 399852 397202 393701 389307 384283 379447 375470 372312 369581 367159 365186
61316 365186 363648 362374 361431 361244 362233 364424 367446 370930 374890 379695 385663 392715 400365 407975 414971
61301 414971 421012 426018 429942 432505 433346 432529 430628 428191 425346 422154 419033 416383 413951 410947 406864
61286 406864 401966 397011 392705 389327 386573 383781 380592 377448 375283 374758 375917 378396 381643 385026
61272 385026 388175 391247 394621 398346 402190 406181 410598 415362 419903 423921 427988 433062 439584 447275
61258 447275 455634 464284 472836 480705 487303 492492 496834 501279 506440 512159 517826 523053 527826 532087
61244 532087 535476 537619 538406 537777 535476 531392 526090 520642 515669 510733 504938 498068 490847 484088 478035
61229 478035 472751 468679 466174 464643 462907 460553 458372 457229 457098 457580 458736 460797 463495 466387 469611
61214 469611 473593 478062 482058 484997 487184 489154 491061 492874 494710 496701 498855 501294 504298 507969
61200 507969 512079 516477 521486 527751 535796 545765 557435 570437 584486 599264 613970 627273 638132
61187 638132 646580 653465 659585 665416 671434 678025 684998 691645 697387 702053 705655 708393 710872 713694
61173 713694 716676 718933 719891 719803 719176 718095 716212 712947 707734 700607 692606 684938 677610 669527 660053
61158 660053 649736 639215 628347 616995 605940 596233 588071 580928 574414 568393 562600 556761 550828
61145 550828 544508 536949 527574 517036 506685 497188 488247 479540 471276 463875 457599 452529 448398 444558
61131 444558 440732 437765 437041 438957 442466 446259 449987 454181 459473 466174 474368 484019 495082 507695
61117 507695 522268 539303 559023 581024 604292 627843 651488 675778 701059 726914 752780
61106 752780 778630 804521 829738 853058 873808 892057 907740 920199 928826 933740 935582 934907
61094 934907 931886 926277 917583 905574 890853 874621 857731 840228 821900 802884 783421 763378
61082 763378 742524 721246 700561 681232 663146 645754 628962 613307 599234 586524 574616
61071 574616 563289 552783 543377 535211 528433 523126 518995 515530 512630 510768 510357 511252 513108 515897
61057 515897 519798 524775 530541 536798 543347 550244 558017 567474 578984 592144 606311 621260 637203
61044 637203 654529 673766 695415 719522 745725 773959 804732 838460 875015 914237 956330
61033 956330 1001275 1048307 1096505 1145486 1195081 1245035 1295787 1349082 1406958 1470399 1539658
61022 1539658 1615378 1698448 1789148 1887622 1995304 2115388 2252536 2413403 2607315 2845471
61012 2845471 3139773 3503700 3953952 4509822 5191046 6017541 7010220 8189095 9568783
61003 9568783 11153010 12921393 14800855 16637815 18212896 19321053 19876816 19963824 19786887
60994 19786887 19568729 19469914 19563641 19833962 20166767 20355809 20165586 19439733 18180922
60985 18180922 16539452 14725731 12919408 11229827 9704865 8355443 7174997 6151976
60977 6151976 5276348 4539028 3927811 3426449 3017753 2685936 2416188 2194388 2008623
60968 2008623 1850338 1713527 1593520 1486782 1391007 1304812 1227476 1158838 1098685 1046061
60958 1046061 999591 958401 922071 889688 859613 830374 801293 772255 743528 715933 690546
60947 690546 667942 647948 630068 613732 598275 583346 569403 557193 546642 536861 527262 518005
60935 518005 509184 500305 490944 481346 472003 463121 454770 447054 439713 432046 423768 415617 408597 402785
60921 402785 397309 391394 385043 378822 373357 369036 365881 363581 361784 360353 359327 358729 358550 358813 359540
60906 359540 360729 362423 364696 367406 370068 372096 373225 373674 373924 374399 375287 376542 377927 379001 379256
60891 379256 378575 377495 376638 375687 373347 368671 362171 355259 348918 343379 338734 335038 331809 328224 324116
60876 324116 320189 316983 314163 311229 308427 306474 305686 305918 307173 309711 313514 318020 322525 326699 330685
60861 330685 334800 339112 343310 347152 351051 355845 361730 367779 372955 377354 381803 386306 389586 390516
60847 390516 389546 388242 387659 387660 387662 387491 387309 387144 386807 386157 385183 383892 382282 380369 378095 375338 372199 369125
60829 369125 366455 363951 361061 357614 353892 350022 345746 340977 336194 332034 328748 326230 324251 322438
60815 322438 320354 317931 315603 313740 312217 310819 309704 309040 308523 307829 307369 308020 310141 313374 317270
60800 317270 321528 325644 329043 331845 334971 339227 344592 350584 356904 363529 370517 377943 385814 393919
60786 393919 402091 410709 420540 431894 444313 457262 470744 484992 499971 515580 532012 549526
60774 549526 568026 587301 607519 629111 652153 676136 700347 724313 747910 771131 793724
60763 793724 815029 834325 851369 866327 879070 888790 894502 895691 892361 884794 873607 859731
60751 859731 843860 825970 805733 783349 759667 735447 710919 686187 661792 638549 616802
60740 616802 596010 575269 554279 533687 514361 496510 479745 463857 449116 435722 423391
60729 423391 411749 400859 391115 382779 375825 370034 365050 360508 356233 352208 348357 344705 341766 340191
60715 340191 339758 339248 337834 336178 335526 336018 336501 335882 333997 331244 328042 324725 321381 317617 312993 307789
60699 307789 302881 298693 294828 290898 287147 283858 280676 277015 272861 268696 264859 261490 258906 257486
60685 257486 257152 257357 257650 257906 257986 257606 256737 255861 255568 256003 256840 257646 258111 258117 257870 257946 258954 260994 263504
60666 263504 265658 266844 266829 265728 264019 262461 261637 261457 261254 260567 259800 259955 261662 264500 267376 269570
60650 269570 271395 273843 277555 282233 287064 291639 296258 301302 306493 310997 314153 315907 316526 316180 314992
60635 314992 313371 311944 311039 310412 309634 308619 307610 306745 305893 304922 303788 302296 300056 296971 293525 290296
60619 290296 287348 284404 281502 279022 277061 275206 273039 270545 267968 265606 263859 263040 262911 262805 262479
60604 262479 262444 263047 263637 263254 261926 260633 259973 259541 258781 257859 257287 257136 257108 257194 257639 258235 258160 256923 255270
60585 255270 254665 255733 257490 258447 258327 258267 259265 260995 262587 264201 267123 272236 278948 285934 292509 298973
60569 298973 305950 313890 323036 333256 343675 352875 359810 364400 367064 367906 366749 363827 359875 355339
60555 355339 349908 343286 336204 330211 326401 324678 324299 324811 326338 329247 333762 339750 346729 354201 362019
60540 362019 370279 378807 387002 394247 400141 404251 406059 405500 403298 400379 397148 393619 389965 386504
60526 386504 383346 380543 378496 377683 377947 378474 378554 378023 376955 375419 373673 372157 371088 370356 369959 370233
60510 370233 371513 373923 377683 383197 390559 399343 409296 420993 435451 453303 474710 499825 528764
60497 528764 561074 595679 631506 667809 703631 737065 765362 785917 797230 798943 791067 773486
60485 773486 746567 712200 673696 634299 595930 559457 525622 495101 467862 443215 420691
60474 420691 400458 382757 367370 353908 342330 332826 325330 319333 314110 309106 304265 299999 296611
60461 296611 293704 290524 286970 283836 281744 280291 278628 276548 274429 272378 270125 267706 265524 263618
60447 263618 261490 258949 256548 254793 253447 252064 250829 250314 250594 251185 251720 252235 252837 253541 254344 254993
60431 254993 254768 253017 250000 246705 243813 241407 239798 239828 241902 245172 248273 250556 252215 253580 254854
60416 254854 256290 257951 259297 259635 259040 258349 258117 258109 258001 258032 258549 259269 259596 259574 259949 261196 262856 264123
60398 264123 264812 265394 266211 267114 267934 268905 270323 272036 273641 274990 276186 277188 277942 278831 280425 282644
60382 282644 284699 286093 287206 288585 290226 291997 294263 297396 300973 304097 306369 307942 308814 308863 308584
60367 308584 308911 310053 311121 311294 310835 310657 311304 312742 314741 317070 319490 321925 324537 327474 330805
60352 330805 334766 339715 345606 351874 358105 364492 371321 378319 384830 390264 394009 395318 393940 390736
60338 390736 386982 383047 378287 372299 365695 359396 353651 348146 342815 338076 334256 331105 328069 324953
60324 324953 322147 320112 318791 317728 316686 315800 314984 313666 311507 309165 307844 308170 309934 312836 316900
60309 316900 321970 327526 333449 340597 349969 361434 373822 386235 398671 411133 422725 432179 439035
60296 439035 443685 446290 446296 443276 437766 430824 423049 414537 405594 396863 388666 380749 372874 365298 358427
60281 358427 352424 347357 343322 340042 336716 332812 328775 325466 323002 320690 318067 315404 313007 310602
60267 310602 307801 304823 302287 300386 298684 296773 294824 293288 292215 291149 289743 288277 287360 287173 287241
60252 287241 286994 286350 285667 285277 285199 285168 284885 284420 284406 285493 287440 289151 289974 290604 292212 294889 297573 299400
60234 299400 300487 301296 301898 302204 302451 303055 304203 305811 307631 309272 310375 311034 311790 313025 314676 316698
60218 316698 319409 322957 326799 330134 332818 335453 338660 342562 346864 351116 354946 358393 362002 366325
60204 366325 371337 376554 381620 386471 391038 395239 399257 403401 407530 411010 413479 415388 417524 420185
60190 420185 423062 425764 428126 430017 431096 430983 429691 427792 425960 424221 421805 417939 412779 407261
60176 407261 402073 397081 391895 386578 381555 377148 373551 371046 369707 368907 367644 365576 363428 362146
60162 362146 361919 362274 362828 363501 364147 364558 364990 366147 368290 370660 372245 372960 373600 374755 376330 378134
60146 378134 380233 382375 383733 383869 383621 384294 386115 388265 390464 393635 398541 404524 410283 415490 420782
60131 420782 426243 430789 433407 434444 435138 436133 436968 436969 436136 434972 433825 432802 432177 432402 433546 435083
60115 435083 436488 437799 439284 440773 441831 442520 443429 444755 445851 446035 445494 444947 444632 444039 442610 440315
60099 440315 437557 434774 432171 429667 427149 424898 423513 423105 422783 421465 419115 416749 415236 414609 414600 415254
60083 415254 416682 418659 420806 422971 425190 427484 429840 432148 434002 434921 434939 434540 433809 432161 429291
60068 429291 425860 422667 419540 415762 411295 406790 402458 397818 392668 387535 382843 378290 373454 368486
60054 368486 363806 359559 355845 353091 351646 351230 351285 351756 353067 355377 358315 361397 364324 366924 369247
60039 369247 371838 375489 380455 386117 391573 396389 400609 404301 407415 410001 412182 413732 413861 411796
60025 411796 407660 402593 397748 393207 388130 381944 375077 368364 362039 355665 348908 342016 335513 329745
60011 329745 324782 320538 316857 313641 310977 309012 307669 306597 305466 304242 303212 302860 303614 305437 307630
59996 307630 309395 310669 312091 313986 315761 316680 316922 317409 318649 320275 321806 323429 325727 328885 332498
59981 332498 336148 339857 343830 347834 351079 352913 353594 354055 354792 355279 354780 353433 352039 350943 349770
59966 349770 348356 347255 346905 346870 346426 345561 344812 344369 343983 343600 343448 343462 343282 342969 343078 343751 344234 343678 342049
59947 342049 339958 337988 336572 336093 336585 337533 338403 339203 340082 340641 340187 338648 336693 334924 333396 331987
59931 331987 330703 329449 327979 326386 325295 325227 325904 326458 326296 325679 325547 326758 329232 331773 333042 332917
59915 332917 332707 333792 336288 339191 341570 343263 344556 345700 346834 348093 349516 350938 352157 353221
59901 353221 354470 356277 358748 361681 364791 367866 370709 373042 374617 375382 375495 375270 375233 375978 377694 379956
59885 379956 382353 385253 389493 395200 401403 407033 411928 416582 421283 425886 430155 433886 436809 438773
59871 438773 439964 440527 440087 438047 434387 429769 424776 419461 413832 408434 404127 401475 400550 401185 403141
59856 403141 406080 409667 413826 418827 425016 432363 440169 447135 451898 453747 453028 450877 448550 446923
59842 446923 446435 447147 448526 449206 447465 442423 434846 426535 418928 412443 406998 402588 399205 396674 394954
59827 394954 394262 394537 395059 395024 394293 393079 391133 387973 383874 379847 376396 372957 369041 365264 362566 360717
59811 360717 358424 354948 351016 347923 346200 345412 344841 343958 342463 340325 337863 335565 333693 332150 330750
59796 330750 329502 328541 327836 327025 325557 323082 319775 316311 313419 311405 310106 309211 308447 307471 305899 303736
59780 303736 301608 300308 300054 300392 300763 300927 300881 300775 301003 301963 303471 304751 305373 305898 307155 309064 310759
59763 310759 311875 313076 315075 317605 319847 321569 323404 325997 329283 332679 335788 338800 342255 346460
59749 346460 351098 355468 359184 362533 365976 369445 372440 374844 377246 380172 383201 385336 386257 386834 388107
59734 388107 390030 391608 392139 391942 391789 392031 392542 393160 393845 394432 394615 394225 393366 392274 391219 390542 390502 391028
59716 391028 391812 392711 393875 395347 396780 397725 398092 398153 398246 398668 399755 401694 404180 406512 408167 409168
59700 409168 409817 410310 410785 411553 412992 415201 417951 420916 423704 425759 426583 426197 425070 423488 421346 418776
59684 418776 416567 415451 415173 414777 413790 412624 411765 411084 410134 408697 406744 404198 401024 397362 393357 389052
59668 389052 384633 380504 376887 373594 370429 367575 365290 363535 362198 361450 361456 361920 362377 362860 363874 365710
59652 365710 368117 370655 373062 375274 377419 379797 382565 385426 387785 389165 389338 388365 386848 385820 385755
59637 385755 385794 384624 382092 379296 376990 374734 371994 369303 367702 367408 367662 367608 366774 364949 362224 359206
59621 359206 356721 355099 353960 352649 350692 347946 344654 341440 339041 337947 338222 339484 340990 342045
59607 342045 342644 343506 345197 347392 349317 350654 351535 351827 351148 349692 348398 347936 347946 347652 346904 346195 345880
59590 345880 345864 345964 346137 346289 346251 346025 345696 345000 343372 340684 337643 335106 333226 331640 330281 329469 329176
59573 329176 328789 327837 326546 325405 324556 323966 323817 324270 325020 325577 325866 326119 326268 326040 325632 325708 326522 327558
59555 327558 328315 328962 329850 330796 331415 331931 333121 335462 338721 342407 346282 350372 354897 360361 367454 376549
59539 376549 387406 399620 413289 428878 446016 462506 474905 480538 479103 472462 463179 453442
59527 453442 444870 438554 434928 433891 435229 438659 443460 448571 453370 457984 462507 466273 468421 468903
59513 468903 468378 467137 464729 460721 455299 448886 441606 433449 424751 416161 408210 401063 394540 388217
59499 388217 381669 374930 368642 363527 359710 356775 354412 352684 351536 350427 348794 346797 345276 344946
59485 344946 345811 347399 349347 351672 354650 358536 363310 368644 374251 380248 386890 393925 400547 406202
59471 406202 411076 415489 419100 421187 421529 420582 418905 416966 415449 415171 416404 418698 421584 425148 429698
59456 429698 435184 441234 447624 454570 462711 472809 485114 498923 513060 526858 540268 552832
59444 552832 563115 569594 571862 570473 565891 558179 547729 535739 523686 512407 501815 491394
59432 491394 480923 470729 461273 452596 444394 436651 429970 425136 422539 422138 423756 427244 432547 439832
59418 439832 449475 461736 476432 492967 510612 528881 547863 568023 589053 608651 623001 629025
59406 629025 626336 617033 604067 589972 576565 565095 556533 551801 551359 554092 556787 555302 546736
59393 546736 530874 510088 488047 467866 450664 435685 421879 409138 397884 388108 379488 372141
59381 372141 366474 362330 358940 355883 353538 352395 352322 352751 353310 354080 355305 356996 358737 360027 360864 361805
59365 361805 363309 365339 367807 370968 374917 379117 383044 387041 391891 397692 403919 410434 417623 425451
59351 425451 433326 441193 449989 460554 472692 485765 499627 514378 529648 544829 559844 575101
59339 575101 590636 605685 619136 630200 638707 644955 649199 651139 650086 645832 639161 631164 622178
59326 622178 611741 599666 586795 574488 563436 553213 543033 532810 523287 515184 508471 502637
59314 502637 497388 492795 488971 486052 484499 485001 487921 493129 500455 509981 521593 534368 546580 556277
59300 556277 561779 561888 556054 544742 529750 513854 499515 487527 477116 467472 458847 451890 446466
59287 446466 441912 438279 436427 436704 438269 440094 442082 444701 447971 451414 454840 458647 463286 468806
59273 468806 475076 482187 490404 499784 509975 520510 531206 542114 553060 563456 572665 580307 586050
59260 586050 589444 590298 589007 586110 581683 575548 567891 559165 549492 538732 527129 515424 504236
59247 504236 493836 484538 476769 470597 465661 461694 458745 456777 455533 454886 454927 455578 456638 458327 461253
59232 461253 465587 470714 475842 480521 484462 487405 489432 490838 491413 490382 487363 482849 477458 471239
59218 471239 464122 456427 448416 439888 430753 421647 413366 406072 399565 393979 389603 386232 383292 380449
59204 380449 377659 374909 372438 370995 371223 372851 374977 377030 378994 380863 382457 383818 385330 387391
59190 387391 390214 393787 397694 401139 403650 405646 407922 410668 413446 415962 418385 420919 423581 426412
59176 426412 429434 432400 435065 437841 441668 447028 453400 459930 466365 473118 480617 488809 497277 505737
59162 505737 514349 523429 532849 541884 549783 556249 561269 564693 566245 565723 562902 557533 549797 540622
59148 540622 531174 522131 513694 506042 499257 492887 486116 478536 470467 462543 455312 449195 444344 440357
59134 440357 436416 431972 427224 422889 419592 417484 416285 415637 415431 415777 416699 418097 420061 422996 427239
59119 427239 432721 439131 446205 453729 461527 469664 478398 487704 497097 506113 514696 522907 530606 537705
59105 537705 544341 550503 555791 559841 562647 564184 564328 563517 562906 563153 563544 563011 561620 560263 559273 558273
59089 558273 557106 555919 554396 551933 548700 545599 543009 540329 536943 532823 528016 522360 516010 509404
59075 509404 502402 494299 485170 476408 469319 463724 458563 453350 448373 443856 439712 435961 432743 429858
59061 429858 426777 423227 419528 416298 413953 412430 411277 410093 408913 408064 407632 407346 407031 406940 407488 408819
59045 408819 410615 412183 412765 412109 410803 409779 409506 409872 410717 412024 413617 415115 416323 417290 417984 418332
59029 418332 418658 419648 421834 425433 430627 437453 445459 454077 463335 473513 484081 493846 502424 510672
59015 510672 519190 527223 533700 538618 542526 545161 545633 543931 541369 539372 538339 537872 537662 537852 538714
59000 538714 540235 542236 544950 549157 555281 562419 568884 573854 577927 581814 585175 587239 588022 588271 588460
58985 588460 588332 587225 584432 579552 572955 565773 559060 553218 548417 545083 543414 542925 543190 544743 548474
58970 548474 554169 560380 565868 570706 575937 582570 590878 600219 609462 617901 625695 633205 640179 646034
58956 646034 650529 653500 654168 651661 646300 639492 632103 623642 613421 601838 589978 578425 567033
58943 567033 555658 544585 534325 525258 517454 510672 504609 499213 494569 490485 486564 482797 479651
58930 479651 477284 475094 472430 469477 467009 465452 464665 464440 464675 465064 465164 464945 464833 465048 465330 465544 466179
58913 466179 467759 470056 472360 474467 476955 480420 484845 489884 495400 501518 508374 516095 524849 534686
58899 534686 545376 556526 567714 578383 587902 596053 603388 610871 619323 629398 641769 656757
58887 656757 673792 691745 709978 728675 748020 767429 785829 802345 816387 827365 834800 838738
58875 838738 839706 838108 833741 825972 814376 799261 781676 762918 743952 725154 706517 688099
58863 688099 670391 654230 640216 628214 617590 607888 598941 590289 581087 570951 560479 550408
58851 550408 540655 530792 521157 512715 505820 499884 494296 488970 483855 478681 473521 468960 465250 461744
58837 461744 457623 452866 448236 444562 442190 440745 439247 436881 433906 431447 430227 429956 430025 430181 430259 429978
58821 429978 429515 429716 431143 433347 435626 438075 441195 444819 448162 450840 453245 455914 458987 462265 465415
58806 465415 468074 470005 471081 471088 469887 467963 466377 465742 465581 465038 463843 462149 459923 457127 454204 451716
58790 451716 449697 447925 446606 446168 446540 447323 448549 450620 453508 456709 460030 463854 468534 474019 480100
58775 480100 486497 492594 497571 500912 502397 501703 498565 493442 487463 481539 475937 470756 466212 462202
58761 462202 458103 453395 448196 442944 437936 433439 429954 427935 427354 427868 429364 432098 436175 441085 445933
58746 445933 450191 454097 458134 462247 465905 468934 471834 475034 478303 481306 484430 488497 493815 499904
58732 499904 506067 511802 516832 521233 525519 530158 534926 539021 541766 543007 543075 542756 543072 544445 546115
58717 546115 546875 546467 545878 546323 548402 552212 557597 564031 570714 577029 582716 587538 591103 593118 593536
58702 593536 592367 589601 585329 579685 572634 564079 554136 543112 531305 519090 506992 495276 483690
58689 483690 472191 461748 453690 448133 443698 439038 434088 429556 425725 422246 418783 415364 412131 409074
58675 409074 406111 403395 401493 401096 402414 404972 408261 412471 418318 426244 436041 447101 458638 469788
58661 469788 479849 488466 495318 499810 501502 500805 498792 496292 493431 489934 485506 480044 473919 467963
58647 467963 462773 458177 453745 449576 446001 442800 439488 436266 433859 432396 431305 430431 430402 431564 433315
58632 433315 434892 436221 437593 439087 440712 442606 444624 446137 446773 447044 447838 449460 451509 453515 455453
58617 455453 457750 460981 465470 471129 477759 485351 493745 502166 509567 515417 519740 522531 523787 524073
58603 524073 524267 524544 524260 523045 521337 519551 517386 514369 510589 506473 502230 497907 493686 489903 487069
58588 487069 485930 487003 489936 493895 498704 504933 512630 520794 528518 535949 543620 551458 559007 566055
58574 566055 572433 577792 582254 586890 592777 599837 607227 614661 622693 631880 642303 653934 666995
58561 666995 681814 698568 717038 736476 755888 774688 792822 810057 825453 837866 846729 852091
58549 852091 854194 853401 850344 845842 840677 835432 830166 824236 816892 808152 798602 788262 776355 762518
58535 762518 747433 731855 715815 699433 683778 669994 658028 647057 636877 628031 620850 615220
58523 615220 611185 608885 607883 607333 606968 607252 608404 609838 610835 611328 611751 612429 613342 614292 615164 616050 617079
58506 617079 618091 618697 618797 618735 618640 617947 616019 613050 609822 606703 603448 600006 596928 594736 593254 591871
58490 591871 590301 588864 588146 588623 590519 593738 597759 601758 605234 608597 612930 619003 626811 636190 647413
58475 647413 660626 675070 689506 703179 715665 725965 732787 735864 736101 734191 729995 723679 716517
58462 716517 709888 704142 699093 695005 692377 691271 691587 693616 697606 703076 709229 715825 722980 730288
58448 730288 736795 741777 745007 746270 745137 741392 735425 728099 720310 712579 705081 698220 692963 690114
58434 690114 689274 689175 689196 689889 691837 694775 698279 702588 708137 714813 722284 730566 739683 749207 758678 768079
58418 768079 777328 785672 792167 796509 798932 799673 798985 797331 795008 791853 787635 782466 776584 770281 764265
58403 764265 759437 755843 752464 748530 744420 740902 738266 736808 737318 740189 744590 749326 754026 758809
58389 758809 763351 767133 770192 772852 775115 776983 778859 780891 782434 782977 783153 784028 785775 787811 789834
58374 789834 791984 794397 797306 801143 805903 810860 815601 820741 826976 834116 841819 850438 860225 870439
58360 870439 880385 890688 902363 915185 928095 940672 953011 964616 974726 983358 990884 996950
58348 996950 1001052 1003848 1006673 1010032 1013710 1018017 1023615 1030347 1037522 1045206 1054060 1064106 1074845 1086396
58334 1086396 1099354 1113648 1128619 1143954 1159470 1174339 1187810 1200392 1213045 1225524 1236848
58323 1236848 1246982 1256565 1265230 1271926 1276877 1281626 1286999 1292534 1298056 1304271 1311491 1319216 1327403 1336933
58309 1336933 1348396 1361393 1375351 1390121 1405596 1421592 1438237 1455790 1474185 1493345 1513491
58298 1513491 1534329 1554657 1573872 1593061 1613360 1634026 1653707 1672736 1692314 1712212 1731482
58287 1731482 1750924 1772483 1796291 1820618 1844821 1870053 1896813 1924068 1951268 1979201 2008375
58276 2008375 2038406 2069455 2102439 2137437 2173704 2211645 2252923 2298182 2346398 2396785 2449476
58265 2449476 2504097 2559674 2616484 2676115 2739181 2804726 2872212 2942180 3014542 3088195 3162834
58254 3162834 3239334 3317932 3397875 3479184 3562895 3649294 3737920 3829571 3926379 4029626 4139341
58243 4139341 4255935 4380004 4510658 4646570 4788735 4939706 5100184 5269196 5447516
58234 5447516 5637728 5840674 6055201 6281932 6524039 6783685 7061006 7357331 7676209
58225 7676209 8020527 8391762 8792686 9227601 9699438 10210007 10763464 11366075 12022759
58216 12022759 12738136 13521234 14384640 15338926 16392972 17560215 18859418 20309135 21927825
58207 21927825 23741232 25785242 28103123 30749490 33801143 37360166 41548355 46509023
58199 46509023 52418759 59493758 67988551 78199553 90466628 105150185 122588081
58192 122588081 143057247 166732954 193614047 223414788 255430582 288324499 319830631
58185 319830631 346644362 364947147 371646368 365680616 348462758 323147549 293319648
58178 293319648 261971621 231149232 202065817 175355592 151304438 130014782 111480352
58171 111480352 95590122 82130764 70825418 61379583 53504039 46927694 41415280
58164 41415280 36775812 32852471 29511962 26646266 24173625 22028630 20153685 18501392
58156 18501392 17037335 15734790 14570055 13524765 12586718 11744333 10983834 10293856 9668133
58147 9668133 9101057 8584730 8112446 7680563 7284214 6915100 6566335 6236259 5925357
58138 5925357 5632642 5357153 5099499 4859382 4634214 4422214 4224250 4040804 3869703
58129 3869703 3708688 3557713 3416998 3285243 3161459 3046264 2939665 2839638 2744314 2653506
58119 2653506 2566885 2482967 2401409 2324034 2252026 2184045 2118447 2055395 1995435 1938037 1883020
58108 1883020 1831504 1783950 1738968 1695414 1653956 1615258 1578391 1542429 1507955 1475542 1444273
58097 1444273 1413107 1382245 1351919 1321341 1290192 1259707 1230943 1203313 1176064 1149822 1125319
58086 1125319 1101902 1078684 1056020 1034565 1013952 993644 973989 955220 936486 917115 897873
58075 897873 879717 862239 844517 826610 809063 791809 774756 758724 744572 731923 719755
58064 719755 707699 695951 684530 673536 663565 655014 647342 639632 631360 622266 612202 601594 591200
58051 591200 581050 570573 560155 551278 544476 538434 531992 525763 520670 516066 510715 504770 499331
58038 499331 494582 489720 484455 479354 474754 470209 464989 458552 450767 442174 433738 425843 417956 409675
58024 409675 401571 394451 388299 382487 376495 369992 362815 355475 349114 344313 340370 336248 331781 327457
58010 327457 323598 320350 317977 316535 315559 314521 313302 311956 310482 309125 308324 308013 307520 306439 305035
57995 305035 303505 301580 299214 296905 294874 292629 289843 287117 285424 285283 286696 289207 291726 293054
57981 293054 292996 292335 291592 290621 289620 289385 290087 290834 291020 291104 291415 291227 289904 288102 286982 286887 287504 288669
57963 288669 290259 291856 293171 294276 295040 295041 294446 294059 294060 293717 292857 292439 292897 293164 292325 291128 290725 290967
57945 290967 291183 291688 293124 295072 296763 298675 301961 306658 311683 316351 320749 324959 329024 333449 338574
57930 338574 343647 347427 349461 349878 348411 344723 339413 333637 327860 321872 315665 309362 302692 295613
57916 295613 289010 283669 278906 273513 267824 263490 261326 260612 260444 260471 260241 259211 257726 256837 256807 256763 256093
57899 256093 255232 254760 254638 254661 254823 254888 254388 253353 252358 251610 250652 249190 247459 245595 243341 240662 237963
57882 237963 235451 232877 230124 227381 224511 220927 216458 211839 208037 205450 203913 203010 202212 201160 199948
57867 199948 198752 197292 195147 192633 190696 189936 190307 191790 194611 198585 202941 207089 211040 214901 218512
57852 218512 221822 225100 228498 231806 234804 237424 239419 240346 240118 239189 238036 236763 235234 233274 230793
57837 230793 228177 226444 226367 227390 228093 227849 227489 228120 229890 232180 234464 236638 238913 241659 245079 248835
57821 248835 252287 255211 257957 260828 263638 265859 266771 265420 261014 253716 244726 235463 226818 219089
57807 219089 212127 205438 198606 191789 185587 180443 176491 173819 172393 171781 171489 171554 172262 173404 174433
57792 174433 175351 176728 178795 181275 184177 187907 192302 196407 199654 202581 205897 209481 212868 216176
57778 216176 219827 223693 227151 229856 231980 233818 235515 237006 237837 237198 234522 230053 224589 218749 212705
57763 212705 206524 200417 194592 189044 183620 178305 173354 168994 165007 160843 156350 152203 149361 148195
57749 148195 148331 149094 149827 150022 149592 148885 148187 147480 146945 147207 148464 149800 150141 149654 149326 149377 149054 147991
57731 147991 146753 145896 145456 145637 146938 149114 150896 151354 150867 150206 149406 148159 146700 145505 144542 143533
57715 143533 142651 142273 142208 141827 140905 139862 139176 138840 138403 137324 135392 132924 130471 128330 126637 125797 126235
57698 126235 127606 128871 129442 129684 129943 129741 128531 126745 125375 124728 124221 123408 122694 122933 124563 127176
57682 127176 129885 132215 134693 138411 144075 151872 162184 175770 193039 213736 237667 265208 296765
57669 296765 332250 371410 413753 457163 496803 526323 540629 537760 518983 487975 449670 408781
57657 408781 368648 331187 297471 268009 242674 220995 202575 187155 174457 164309 156710 151444
57645 151444 147735 144613 141490 138195 134784 131681 129747 129675 131237 133438 135353 136626 137354 137744 137851
57630 137851 137507 136692 135950 135997 136696 136934 135885 133977 132152 130607 128838 126602 124128 121549 118789 116009
57614 116009 113618 111783 110292 108945 107753 106803 106216 106149 106591 107293 108186 109574 111550 113511 114754 115282
57598 115282 115476 115238 114186 112551 111110 110095 108874 106975 104861 103356 102677 102326 101641 100267 98315
57583 98315 96277 94660 93649 93203 93287 93690 93782 92941 91290 89558 88142 86730 84980 83128 81670 80774
57567 80774 80215 79674 78937 78056 77363 77100 76943 76315 75295 74751 75283 76438 77355 77848 78370 79117 79808 80346
57549 80346 81056 82045 82816 82907 82598 82538 82849 83086 83078 83291 84182 85547 86791 87501 87588 87186 86784 87082 88247 89479
57529 89479 89846 89375 88794 88319 87462 86123 85047 84881 85340 85753 85934 86109 86397 86853 87712 89163 91086 93253
57511 93253 95462 97236 97896 97413 96767 96870 97408 97318 96218 94790 93859 93631 93748 93649 92899 91517 89963 88544
57493 88544 87110 85625 84665 84785 85618 86225 86189 85827 85445 85023 84556 84118 83596 82905 82398 82462 82786 82683 82154
57474 82154 81889 82134 82276 81754 80702 79398 77751 75762 73884 72536 71632 70961 70518 70114 69217 67778 66753
57457 66753 67098 68472 69568 69661 69204 68931 69031 69422 70184 71292 72195 72196 71235 69956 68918 68049 67006 65835
57439 65835 65001 64851 65367 66393 67741 69036 69800 69909 69702 69490 69238 68916 68810 69150 69717 70178 70576 71110
57421 71110 71659 71994 72321 73165 74693 76525 78101 78927 78638 77323 75697 74464 73602 72715 71892 71551 71548 71300
57403 71300 70934 71441 73249 75293 76147 75585 74443 73282 71966 70518 69613 69812 70687 71193 70900 70462 70661
57386 70661 71312 71627 71588 72260 74357 77045 78808 79268 79495 80581 82513 84519 85993 86856 87407 87930 88325
57369 88325 88184 87508 87089 87605 88531 88643 87638 86565 86509 87536 89154 91048 92959 94407 95118 95481 96102
57352 96102 97079 97959 98309 98197 98195 98845 99858 100057 98654 96453 95098 95134 95624 95760 95897 96603 97574 98146 98187
57333 98187 97823 96911 95504 94366 94196 94626 94712 94196 93704 93897 94965 96690 98423 99211 98613 97276 96247
57316 96247 95868 95778 95715 95688 95600 95382 95354 95826 96412 96336 95324 93674 91595 89209 87087 85998 86002 86488 87189 88402
57296 88402 90001 91082 91070 90580 90633 91398 92266 92877 93542 94721 96459 98332 99795 100658 101336 102479 104304
57279 104304 106496 108877 111786 115599 120116 124724 128955 132610 135546 137749 139572 141509 143635 145500
57265 145500 146681 147252 147632 148115 148701 149324 150078 151133 152424 153510 153893 153566 153173 153462 154533 155790 156688
57248 156688 157323 158062 158818 159111 158830 158439 158224 157803 156854 155954 156064 157272 158697 159732 160739 162294 164300
57231 164300 166257 167967 169516 170860 171927 172958 174270 175794 177290 179002 181626 185467 189920 194035
57217 194035 197469 200739 204586 209197 214081 218633 222702 226600 230771 235642 241528 248272 255086 261241
57203 261241 266978 273178 279964 286305 291344 295606 300314 305875 311696 317256 322749 328646 335178 342361
57189 342361 350145 358392 366886 375365 383465 390770 397188 403131 409104 415244 421460 427810 434433 441233
57175 441233 447920 454249 460048 465290 470374 476047 482675 489893 497316 505226 514138 524048 534696 546234
57161 546234 558956 572687 587145 602706 619914 638368 656990 675471 694494 714416 734678
57150 734678 754842 775243 796129 817032 837681 858895 881757 906350 932003 958471 986183
57139 986183 1015527 1046508 1078982 1112738 1147532 1183561 1221791 1263309 1308446 1357024 1409295
57128 1409295 1466038 1527768 1594537 1666682 1745055 1830056 1920758 2015414 2112602 2211576 2311708
57117 2311708 2412061 2511680 2610146 2707957 2806666 2908747 3017032 3133896 3260864 3398992
57107 3398992 3549531 3714244 3895408 4096124 4320933 4576132 4869509 5210171 5608992
57098 5608992 6079134 6635937 7296350 8078488 9000906 10080644 11330197 12754881 14351566
57089 14351566 16108396 18005127 20014638 22105802 24245970 26400450 28528631 30579627
57081 30579627 32490959 34191332 35606095 36664274 37307348 37498830 37230837 36523674 35418936
57072 35418936 33970758 32239044 30284969 28168054 25945534 23673964 21410165 19208592
57064 19208592 17116294 15169167 13391034 11794130 10380089 9142054 8067823 7142342
57056 7142342 6348850 5669820 5088445 4589809 4161039 3791092 3470741 3192403 2949660
57047 2949660 2737036 2550114 2385324 2239487 2109923 1994950 1893687 1805225 1728498 1663079
57037 1663079 1609497 1568550 1540669 1525817 1523363 1532189 1551595 1581182 1617362 1649233 1660545 1638856
57025 1638856 1583516 1504383 1413892 1321287 1232329 1150490 1076878 1010651 950951 897916 851541
57014 851541 810767 774481 742435 714390 689228 665847 644354 625354 608540 592935 578247
57003 578247 564927 552967 541643 530639 520603 512149 504904 497962 490957 484332 478797 474858 472690
56990 472690 472094 472600 473840 475963 479554 485035 492051 499374 505411 508886 509095 505653 498305 487274 473702
56975 473702 459298 445270 431721 418244 404957 392706 382361 374293 368587 365382 364699 366120 369034
56962 369034 373284 379353 387839 398763 411343 424175 435589 444016 448292 447765 442276 432212 418585
56949 418585 402827 386361 370257 355155 341285 328634 317365 308209 302227 300045 301431 305699
56937 305699 312366 321355 332805 346890 363575 382230 401400 419080 433155 441665 443114 437080
56925 437080 424596 407662 388248 367744 347016 326569 306566 287078 268545 251793 237525
56914 237525 225869 216466 208774 202225 196378 191203 187054 184097 181853 179573 177054 174719 172841 171049
56900 171049 168897 166646 165038 164423 164620 165692 168279 172787 178680 185080 191847 199572 208664 218963
56886 218963 230204 242086 253677 263340 269702 272427 271845 268321 262467 255568 249139 244008 240189 237519
56872 237519 236049 235912 237348 240937 247431 257202 270173 286287 305738 328542 354186 381879 410806
56859 410806 439711 466218 486955 498798 500328 492360 477243 457653 435803 413361 391693 371997
56847 371997 355363 342746 334856 332011 334261 341686 354512 372972 397238 427466 463567 504768
56835 504768 549623 596484 643439 687352 723283 745674 750744 738116 710657 673057 630158 585768
56823 585768 542406 501834 465514 434478 409078 389307 375221 366885 364213 367349 376956 393519
56811 393519 416370 443974 475142 509219 544737 578368 605620 622369 625839 615088 591513 558800
56799 558800 521538 483376 446335 411432 379425 350931 326363 306108 290580 279915 273743 271475
56787 271475 272802 277773 286394 298321 312987 329826 348032 365988 381153 390823 393188 387772 375153
56774 375153 356565 333799 309057 284471 261504 240751 222155 205351 189941 175691 162674
56763 162674 151179 141371 133051 125869 119779 115070 111793 109391 107184 105086 103489 102492 101705 100924 100547
56748 100547 101011 102096 103068 103291 102517 100880 98904 97271 96249 95563 95027 94930 95429 95995 96050 95864 96092 96603
56730 96603 96519 95481 94133 93190 92720 92577 92894 93695 94580 95248 95969 97128 98571 99798 100524 100690 100213 99186
56712 99186 98119 97511 97275 96942 96382 95983 96179 97126 98750 100683 102123 102227 100955 99311 98481 98762 99512
56695 99512 100081 100583 101660 103618 106004 108020 109157 109401 109052 108567 108399 108762 109565 110687 112148 113814
56679 113814 115151 115598 115079 113882 112286 110687 109769 109819 110009 109170 107389 106013 105854 106234 106252 106076 106266
56662 106266 106568 106355 105869 105966 106766 107480 107665 107799 108446 109560 110888 112433 114156 115665 116572 116886 116851 116698
56644 116698 116763 117461 118806 120215 121099 121508 121957 122778 123908 125183 126529 127857 128968 129698 130108 130518 131311
56627 131311 132643 134328 136039 137541 138664 139188 139000 138342 137611 136881 135811 134138 132060 130113 128797
56612 128797 128316 128436 128512 127911 126610 125205 124254 123742 123266 122459 121131 119272 117222 115662 115080 115282 115628
56595 115628 115693 115533 115395 115428 115585 115607 115159 114279 113647 114048 115468 116989 117703 117523 117010 116718 116930 117770 119223
56576 119223 121072 123015 124831 126294 127081 127046 126592 126545 127624 130119 133921 138566 143238 147156 150239 153343
56560 153343 157653 163823 171562 179847 187437 193413 197422 199482 199768 198765 197415 196541 195952 194535 191553
56545 191553 187548 183715 180689 178286 176102 173879 171433 168755 166165 163962 161953 159766 157608 156220
56531 156220 155958 156327 156598 156519 156292 156199 156486 157308 158496 159574 160204 160418 160275 159582 158261 156769 155760 155319
56513 155319 154793 153483 151398 149277 147894 147380 147244 147014 146683 146427 146165 145727 145337 145498 146362 147563 148694
56496 148694 149597 150162 150284 150154 150167 150347 150297 149916 149684 149895 150092 149730 149085 148893 149300 149724 149708 149444 149391 149777
56476 149777 150517 151295 151677 151405 150661 149855 149204 148748 148691 149323 150508 151564 151870 151462 150906 150700 151004 151845
56458 151845 153339 155455 157650 159049 159205 158520 157713 157060 156501 156309 157024 158615 160306 161485 162295 162997
56442 162997 163285 162739 161569 160376 159419 158653 158330 158902 160298 161793 162695 162868 162591 162257 162215 162617 163353 164278
56424 164278 165394 166611 167520 167771 167532 167287 167309 167633 168346 169436 170525 171202 171529 171785 171851 171419 170730 170457
56406 170457 170753 171031 170908 170864 171638 173291 175089 176141 176084 175447 175371 176593 178668 180526 181735 182695 183613
56389 183613 184067 183907 183900 184895 186702 188336 189097 188975 188244 187241 186463 186377 186996 187936 188942 190116 191579 193128
56371 193128 194313 194827 194851 195089 196271 198449 200834 202511 203299 203771 204445 205186 205461 205023 204179 203480 203307
56354 203307 203780 204775 205847 206392 206242 206051 206686 208198 209801 210951 211920 213033 213945 214253 214373 215136 216756
56337 216756 218825 221101 223585 225950 227760 229320 231495 234484 237478 239786 241579 243224 244605 245603
56323 245603 246641 248149 249931 251584 253109 254565 255547 255691 255455 255723 256706 257824 258614 259156 259591 259823
56307 259823 259905 260292 261415 263256 265519 268034 270818 273874 277077 280181 282936 285255 287327 289444 291672
56292 291672 293817 295735 297593 299677 301958 304092 305993 308294 311859 316764 322089 326977 331581 336592
56278 336592 342101 347535 352632 357867 363773 370394 377648 385736 394825 404683 414982 425774 437342
56265 437342 449848 463419 478363 494991 513334 533303 555090 579176 606087 636305 670338
56254 670338 708720 751938 800386 854209 913157 976794 1044942 1117663 1194760 1275519 1358984
56243 1358984 1444083 1529365 1612857 1692385 1765764 1830632 1884640 1926141 1954383 1968853 1968894 1954425
56231 1954425 1926639 1887491 1838642 1781376 1717326 1648659 1577370 1504671 1431161 1357430 1284537
56220 1284537 1214040 1147425 1085257 1026966 971716 919522 871352 828137 789817 755370 723725
56209 723725 694612 668450 645394 624793 605808 588320 572724 558986 546568 535302 525683 517994
56197 517994 511724 506139 500922 495962 491069 486362 482457 479734 477798 476080 474597 473719 473540 473938 474825
56182 474825 475877 476448 476348 476324 477148 478576 479898 481183 483152 485992 489102 492035 494942 498052 501388
56167 501388 505138 509676 514991 520588 526171 532035 538667 546279 554846 564280 574506 585691 598397
56154 598397 613224 630331 649641 671443 696401 725083 758054 796428 841835 895617 958343
56143 958343 1030018 1110132 1197206 1288587 1380824 1470052 1552234 1623987 1683913 1733166 1774461
56132 1774461 1810508 1843170 1873345 1900858 1924305 1941471 1950412 1950565 1943119 1930449 1915014 1898165
56120 1898165 1879286 1855616 1823163 1778590 1720901 1651761 1574487 1492895 1410671 1331030 1256483
56109 1256483 1188849 1129334 1078260 1034933 998387 968303 944722 926884 913134 902152 893582
56098 893582 887282 882785 879896 879006 880248 882998 886739 891736 898210 905513 912859 920304 928209 936233
56084 936233 943690 950552 957345 964330 971441 978731 986238 993741 1001227 1009193 1017933 1027014 1036036 1045328
56070 1045328 1055289 1065693 1076412 1088068 1101091 1114873 1128850 1143598 1159688 1176273 1192298
56059 1192298 1208485 1226496 1246494 1267158 1287858 1309088 1330737 1351683 1371468 1390923 1410744
56048 1410744 1430669 1450385 1470041 1489576 1508712 1527937 1548426 1570640 1593979 1617919 1642449
56037 1642449 1667404 1692658 1719191 1748654 1781495 1816659 1853443 1892387 1933950 1977579 2022689
56026 2022689 2069515 2118362 2168783 2220048 2271809 2324147 2377625 2433294 2491868 2552968 2616037
56015 2616037 2681597 2750495 2822333 2896162 2972488 3052882 3137703 3225941 3317494 3413756 3515622
56004 3515622 3622582 3734231 3851174 3974062 4103204 4239362 4383442 4535326 4694594
55995 4694594 4862314 5040294 5228770 5427117 5636824 5861243 6102123 6359091 6633125
55986 6633125 6927824 7246379 7589904 7959794 8359260 8791470 9258604 9763887 10312418
55977 10312418 10909253 11559199 12269401 13049697 13909826 14859207 15910313 17079595 18385069
55968 18385069 19847195 21493649 23360472 25489250 27929422 30746837 34028310 37879873
55960 37879873 42429112 47834380 54290625 62029055 71319145 82469272 95808765 111651192
55952 111651192 130257684 151800626 176304229 203551650 232956588 263367922 292817236
55945 292817236 318416966 336760696 344927622 341627447 327727653 305797836 279038836
55938 279038836 250308831 221670707 194400784 169193681 146380135 126089893 108336623
55931 108336623 93037577 80018372 69039944 59836584 52141423 45701639 40293985
55924 40293985 35734173 31872051 28582317 25762287 23331705 21226667 19392903 17785437
55916 17785437 16369679 15117804 14004925 13010282 12118803 11318179 10596001 9941449 9347095
55907 9347095 8806566 8312338 7857746 7438934 7052694 6694291 6359415 6046380 5754458
55898 5754458 5481674 5226015 4987096 4764778 4557576 4364051 4184168 4017671 3862674
55889 3862674 3717621 3583180 3460130 3346314 3237365 3129783 3022184 2914763 2809099
55880 2809099 2707646 2611924 2521532 2435648 2354511 2278581 2207354 2139996 2076078 2014769 1954588
55869 1954588 1895159 1838097 1784991 1735503 1688593 1644479 1604045 1567190 1533022 1500896 1470067
55858 1470067 1439159 1407287 1375093 1343590 1312667 1281720 1250942 1220755 1190714 1160180 1129480
55847 1129480 1099210 1069040 1038479 1008342 980175 954538 930825 908404 886918 865932 845413
55836 845413 826270 809385 794395 780329 767047 755013 744025 733358 722965 713422 704640 695598
55824 695598 685485 674411 662980 651732 640875 630091 618774 606942 595555 585372 575942 566351
55812 566351 556537 547168 538668 531111 524624 519068 513748 508294 503489 500366 498814 497998 497718 498289 499327
55797 499327 499871 499681 499368 499268 499204 499426 500737 503420 506941 510953 515770 521571 527883 533986 539011 541271
55781 541271 538465 529320 514804 497379 479402 462451 447518 435200 425733 419159 415434 414176 414372
55768 414372 414446 412644 407649 399247 388534 377237 366679 357290 348833 340877 333187 325992 319816 314918
55754 314918 311033 307653 304221 299912 293802 285801 277044 268854 261577 254893 248863 243957 240289 237527
55740 237527 235527 234362 233704 232841 231399 229634 227906 226313 224816 223353 221808 220190 218702 217239 215065
55725 215065 211589 207377 203761 201437 199965 198562 196814 194651 192295 190332 189157 188210 186420 183686
55711 183686 181321 180698 181830 183582 184890 185502 185820 186347 187164 187815 187740 186744 184849 181985 178290 174557
55695 174557 171704 169740 167848 165535 163116 160968 159042 157392 156468 156362 156353 155738 154802 154401 154871 155935
55679 155935 157484 159782 162814 165906 168224 169419 169679 169381 168891 168563 168647 169046 169303 169071 168571 168340 168454
55662 168454 168347 167605 166619 166148 166517 167622 169403 171747 174138 176047 177613 179291 180782 181065 179675 177348
55646 177348 175099 173258 171748 170694 170177 169754 168812 167223 165208 162740 159536 155652 151718 148418 145906
55631 145906 143683 141044 137757 134374 131749 130204 129346 128697 128154 127747 127323 126735 126085 125455 124619 123298
55615 123298 121567 119718 117852 115882 113884 112203 111138 110630 110246 109468 108137 106637 105515 104844 104124
55600 104124 102790 100647 97884 95021 92844 91906 91830 91523 90360 88857 87873 87545 87436 87370 87515 87774 87702
55583 87702 87148 86485 86060 85741 85197 84407 83706 83507 84052 85251 86656 87708 88183 88315 88473 88813 89264 89694
55565 89694 89955 89839 89185 88087 86944 86194 85991 86176 86585 87233 88089 88810 88980 88640 88324 88463 88955 89453
55547 89453 89795 89958 89795 89157 88209 87349 86855 86812 87265 88156 89093 89574 89570 89604 90130 91103 92340 93919 95825
55528 95825 97467 98101 97712 96981 96309 95452 94337 93590 93623 93643 92416 89973 87763 86889 86885 86559 85451 83965
55510 83965 82481 80987 79370 77555 75458 73237 71463 70586 70301 69851 68939 67937 67222 66728 66184 65447
55494 65447 64590 63947 64038 65063 66500 67612 68324 69141 70253 71257 71821 72057 72027 71449 70207 68740 67586
55477 67586 66866 66474 66433 66768 67284 67742 68062 68190 68044 67770 67702 67862 67824 67289 66463 65557 64334 62505 60322
55458 60322 58413 57223 56898 57395 58361 59208 59645 59932 60345 60714 60868 61173 62109 63530 64825 65624 65903 65639
55440 65639 64893 64076 63549 63107 62462 62088 62874 64801 66633 67165 66350 65025 64009 63661 63871 64146 64000 63426
55422 63426 62791 62208 61401 60318 59495 59490 60285 61428 62500 63250 63545 63496 63413 63411 63258 62739 61957 61069 60015 58774
55402 58774 57606 56777 56234 55845 55684 55748 55652 55106 54540 54700 55561 56186 55835 54825 54037 53964 54558 55704 57318
55383 57318 59055 60339 60838 60662 60062 59171 58144 57243 56601 56106 55727 55718 56248 56981 57431 57634 58042 58738 59213
55364 59213 59134 58934 59283 60244 61298 62080 62692 63349 64041 64576 64710 64269 63338 62385 61923 62024 62300 62359 62091
55345 62091 61547 60809 60043 59454 59087 58797 58510 58329 58334 58410 58346 58009 57433 56829 56474 56379 56114 55193 53704 52343
55325 52343 51763 52145 53369 55240 57320 58896 59482 59248 58693 58054 57355 56837 56908 57587 58345 58665 58552 58355
55307 58355 58325 58506 58888 59406 59858 60057 60080 60207 60524 60757 60631 60316 60334 60937 61713 61957 61455 60767 60609 61006
55287 61006 61231 60656 59533 58743 58775 59211 59298 58831 58211 57758 57321 56664 55989 55843 56567 58034 59846 61625
55269 61625 63094 64053 64466 64548 64656 64957 65245 65125 64472 63581 62842 62387 62118 61967 61883 61722 61421 61223 61396
55250 61396 61732 61713 61274 60974 61193 61592 61768 62067 63165 64984 66584 67173 66777 65875 64853 64002 63592 63599 63617
55231 63617 63358 63102 63365 64190 65029 65341 65055 64431 63677 62884 62249 62112 62666 63647 64486 64818 64789 64756 64757 64437
55211 64437 63586 62625 62322 62985 64054 64711 64838 65093 65933 66893 67162 66605 65739 64834 63714 62539 62098 62847
55193 62847 64177 65150 65602 65936 66148 65811 64990 64468 64847 65835 66580 66402 65188 63496 62321 62279 62912 63197
55175 63197 62851 62633 63230 64369 65412 66301 67405 68700 69670 69960 69743 69410 69152 68897 68516 68092 68042 68831
55157 68831 70421 72155 73352 73870 73953 73712 72944 71462 69482 67716 66995 67506 68375 68336 67017 65235 63856
55140 63856 62844 61778 60894 60926 62040 63517 64537 64867 64739 64539 64750 65703 67158 68383 68891 68848 68631
55123 68631 68357 68110 68282 69214 70519 71189 70506 68685 66581 65006 64382 64797 66061 67711 69212 70306
55107 70306 71149 72072 73254 74603 75831 76561 76550 76001 75570 75853 76849 78113 79296 80246 80607 79855 78050
55090 78050 76213 75493 76064 77163 78040 78451 78339 77656 76721 76269 76700 77519 77860 77452 76714 76059 75525 75113
55072 75113 75042 75472 76255 77170 78133 78962 79237 78760 77979 77530 77435 77203 76728 76553 77062 77909 78543 78906 79257 79599
55052 79599 79742 79649 79307 78449 76886 74935 73055 71259 69461 68225 68392 69911 71789 73358 74814 76244
55036 76244 76984 76599 75791 75588 76027 76433 76659 77152 77839 77864 76700 74941 73659 73398 74021 75141 76307 76995
55018 76995 76824 75920 74999 74989 76359 78645 80720 81730 81719 81254 80691 80133 79894 80415 81597 82643 82763 81752
55000 81752 79813 77189 74291 71866 70604 70567 71252 72202 73340 74687 75989 76804 76949 76680 76375 76129 75805
54983 75805 75394 75035 74684 74118 73463 73390 74421 76217 77943 79228 80318 81338 81976 82058 82040 82505 83388 84036
54965 84036 83986 83437 82886 82549 82279 82024 82125 82968 84365 85562 85998 85858 85665 85542 85185 84472 83731 83397 83648
54946 83648 84337 85009 85018 84004 82364 80983 80418 80566 81100 81783 82273 82102 81219 80321 80214 80904 81613 81685 81267
54927 81267 81045 81461 82350 83328 84371 85840 87943 90469 93201 96284 99932 104037 108442 113350 118957
54912 118957 124799 129993 134083 137061 138651 138305 136111 132949 129435 125409 120881 116748 113864 111830
54898 111830 109469 106275 102845 100096 98613 98475 99113 99480 98985 98144 97744 97601 96901 95632 94788 95014 95860
54881 95860 96661 97369 98130 98748 99154 99946 101801 104658 107976 111512 115343 119335 123168 126765 130100 132645
54865 132645 133551 132603 130530 128199 125785 122954 119544 115821 112215 109047 106370 103894 101161 98008 94804
54850 94804 92034 89629 86992 83756 80347 77649 76187 75847 76244 77122 78315 79556 80582 81302 81742 81904
54834 81904 81844 81804 82025 82395 82533 82307 82082 82284 82833 83201 82979 82237 81328 80496 79729 78859 77699 76199 74599
54815 74599 73399 73010 73356 73969 74574 75432 76903 78750 80220 80905 81236 81897 82981 84012 84696 85212 85709
54798 85709 85921 85538 84757 84101 83771 83494 83151 83229 84302 86107 87464 87379 86075 84716 84174 84334 84627 84868
54780 84868 85325 86233 87525 88941 90146 90805 90885 90900 91588 93204 95288 97178 98606 99791 101142 102960
54764 102960 105309 108147 111692 116426 122400 128548 133240 135799 137078 138261 139451 139828 138852 136719 133720
54749 133720 129847 125209 120407 116172 112856 110429 108683 107241 105635 103680 101723 100366 99992 100633 101979
54734 101979 103322 103767 102941 101440 100259 99764 99547 99189 98802 98686 98877 99321 100209 101860 104382 107695 111735
54717 111735 116423 121510 126728 131990 137137 141544 144311 145004 144023 142137 139818 137040 133535 129229 124579
54702 124579 120442 117381 115054 112616 109729 106835 104328 101995 99649 97843 97300 97803 98276 98014 97259
54687 97259 96441 95457 94049 92464 91246 90558 90121 89755 89606 89746 89856 89490 88569 87493 86753 86419 86071 85290
54669 85290 84228 83565 83858 85057 86691 88266 89416 89914 89842 89631 89600 89541 89023 88106 87435 87554 88368 89371
54651 89371 90148 90497 90319 89647 88740 87974 87642 87884 88622 89482 89930 89706 89050 88404 87942 87548 87098 86593 86131
54632 86131 85977 86505 87766 89172 89987 90187 90478 91377 92605 93494 93626 92886 91343 89451 88021 87496 87414
54615 87414 87050 86419 86141 86429 86838 87057 87357 88059 89084 90280 91654 92914 93309 92470 91084 90188 90018
54598 90018 90063 90040 90173 90555 90908 91146 91607 92451 93211 93206 92180 90396 88406 86859 86219 86387 86819 87144 87455
54579 87455 87830 88002 87810 87672 88126 89068 89825 89953 89586 89031 88425 87897 87730 88180 89308 91056 93252 95381
54561 95381 96567 96173 94463 92534 91418 91256 91377 91147 90654 90447 90710 90971 90760 90354 90594 91944 93911
54544 93911 95424 95713 94893 93806 93362 93859 94948 96260 97938 100369 103430 106269 107956 108198 107361 105992
54528 105992 104500 103147 102081 101258 100485 99661 98998 98914 99647 100934 102107 102597 102361 101822 101424 101294 101298 101296 101290
54509 101290 101372 101566 101728 101637 101250 100832 100695 100780 100688 100172 99472 99029 98983 99189 99640 100549 101843 102849 102787 101590
54489 101590 100005 98859 98436 98610 99276 100322 101300 101569 100968 100151 99995 100705 101659 102061 101654 100813 100157 100148
54471 100148 100948 102441 104325 106200 107757 108969 110070 111218 112240 112815 112925 112903 113003 113117 113020 112688 112233
54454 112233 111701 111217 111113 111609 112349 112605 112018 110930 109957 109451 109419 109655 109780 109387 108416 107274 106381 105706
54436 105706 104991 104362 104387 105394 106899 107954 108024 107386 106665 106157 105815 105752 106433 108129 110314 111909 112230 111587
54418 111587 110926 110983 111760 112619 112809 111987 110381 108488 106682 105181 104258 104213 104981 105961 106419 106139 105657 105839
54400 105839 107111 109027 110654 111534 112141 113202 114696 115885 116292 116167 115875 115311 114279 113062 112191 111908
54384 111908 112208 113144 114560 115700 115759 114917 114298 114720 115915 117146 118078 118686 118761 118070 116851 115684 114887
54367 114887 114429 114392 115069 116404 117698 118207 117908 117417 117260 117453 117755 117981 117988 117604 116827 115951 115290 114852 114510
54348 114510 114386 114716 115327 115676 115518 115217 115142 115111 114739 114082 113499 113116 112906 113149 114212 115885 117522 118958
54330 118958 120648 122666 124275 125027 125681 127242 129353 130547 130164 129219 128960 129180 128537 126283 123129 120419
54314 120419 118936 118597 118894 119250 119135 118266 116866 115505 114508 113612 112335 110598 108778 107330 106598 106904
54298 106904 108361 110434 112127 112902 113162 113518 113870 113707 113106 112821 113224 113703 113437 112453 111550 111353 111779 112401
54280 112401 112928 113256 113320 113183 113167 113606 114394 114940 114781 114123 113569 113324 112991 112271 111572 111556 112286 113175 113821 114469
54260 114469 115537 116999 118485 119797 121023 122193 123067 123350 123052 122578 122351 122326 121943 120766 119109 117835
54244 117835 117537 118139 119232 120418 121246 121243 120384 119216 118170 116980 115216 113272 112210 112547 113554 113999
54228 113999 113294 111794 110315 109556 109753 110492 110967 110666 109851 109288 109547 110680 112421 114384 116059 116895 116640
54211 116640 115612 114500 113854 113710 113702 113503 113111 112713 112316 111694 110780 110022 110156 111525 113639 115480 116299 116181
54193 116181 115825 115793 116027 116118 115935 115756 115802 115898 115748 115371 115034 114848 114682 114444 114212 114028 113770 113363 112928 112597
54173 112597 112294 111882 111381 110857 110143 108961 107374 105881 104938 104503 104245 104063 104194 104829 105809 106800 107613 108267
54155 108267 108792 109062 108845 108031 106863 105919 105700 106165 106824 107356 107975 109040 110483 111845 112804 113375 113704
54138 113704 114009 114688 116016 117536 118246 117744 116852 116675 117279 117821 117802 117517 117240 116616 115283 113599 112340
54121 112340 111869 111948 112229 112573 112962 113451 114188 115264 116539 117722 118603 119081 119082 118665 118150 117932 118100 118314 118058
54102 118058 117026 115420 113934 113248 113400 113796 113966 114009 114137 114183 113942 113695 113831 114139 114094 113749 113703 114162 114688
54083 114688 115024 115507 116383 117365 118273 119523 121359 123035 123440 122425 120983 120155 120197 120710 121135 121157 121032 121475
54065 121475 122874 124619 125600 125417 124698 124177 123892 123520 123168 123442 124638 126137 126870 126544 126174 127078 129383
54048 129383 132007 134171 136309 139095 142209 144777 146688 148632 150993 153459 155839 158518 161880 165823
54034 165823 170056 174409 178643 182389 185468 187989 190069 191848 193714 195937 198024 199100 199084 198853 199019
54019 199019 199266 199162 198900 198729 198382 197608 196680 195752 194351 192294 190566 190423 192000 194633 198160 202897
54003 202897 208585 214442 220178 225838 230515 232363 230357 225233 218341 210451 202097 194188 187382 181401
53989 181401 175676 170299 165708 161831 158268 155126 152892 151515 150277 148656 146814 145079 143452 141859
53975 141859 140534 139822 139706 139771 139603 139095 138388 137638 136953 136476 136373 136606 136869 136948 137064 137564 138385 139174 139954
53956 139954 141187 142973 144691 145775 146470 147365 148447 149236 149705 150442 151798 153436 154971 156624 158893
53941 158893 161880 165296 168915 172657 176325 179677 182823 186210 190028 193875 197194 199889 202225 204235
53927 204235 205591 206151 206353 206907 208294 210704 214163 218375 222634 226289 229353 232400 235941 240163 245131
53912 245131 250686 256036 260071 262415 263788 264977 265793 265461 263781 261364 258864 256442 254020 251593 249186
53897 249186 246768 244321 241792 238955 235578 231732 227754 223908 220312 217062 214106 211037 207410 203355
53883 203355 199467 196005 192600 188939 185319 182254 179882 178084 176807 175833 174497 172241 169432 167143
53869 167143 166011 165703 165565 165356 165171 165019 164796 164480 164093 163599 163019 162538 162241 161946 161555 161481 162359 164288
53851 164288 166646 168907 171450 175338 181266 188881 197253 205943 215401 226146 237544 247663 254381
53838 254381 256541 254077 247562 238091 227320 216886 207566 199241 191700 185040 179323 174447 170616 168393
53824 168393 167839 168098 168330 168757 170154 172605 175422 178192 181179 184648 188516 192764 197536 202488 206644
53809 206644 209264 210454 210658 210027 208696 207209 206169 205758 205981 206985 208595 209915 210116 209499 209141 209538
53793 209538 210211 210615 210753 210788 210705 210615 210827 211243 211125 209902 207885 205798 203904 201976 199908 197787 195450
53776 195450 192490 188888 185269 182332 180179 178343 176320 173986 171609 169614 168219 167173 165853 163805
53762 163805 161249 159044 158032 158353 159347 160104 160145 159590 158794 157951 157136 156557 156464 156743 156848 156462 156080 156506
53744 156506 157704 158562 158175 157028 156469 157108 158236 158821 158563 157850 157170 156877 157129 157758 158419 159100 160154
53727 160154 161600 162842 163526 164168 165356 166737 167632 168480 170620 174458 178753 182167 184744 187302 189976
53712 189976 192155 193540 194530 195576 196744 197956 199221 200545 201927 203544 205692 208494 211840 215505
53698 215505 219107 222079 224080 225465 226972 228896 230880 232593 234178 235862 237465 238627 239299 239702 239921
53683 239921 239844 239413 238684 237659 236362 235074 234244 234123 234624 235577 236802 237887 238197 237393 235778 233920 232037
53666 232037 230038 228011 226315 225127 224275 223655 223551 224224 225370 226245 226375 225927 225428 225244 225324 225282 224718 223598
53648 223598 222432 221950 222522 223902 225545 227127 228728 230532 232453 234138 235383 236427 237651 239088 240495
53633 240495 241910 243787 246286 248739 250244 250787 251436 253311 256476 259896 262323 263257 263306 263700 265335 268183
53617 268183 271594 275051 278534 282258 286277 290319 293863 296469 298262 300042 302665 306273 310247 313891
53603 313891 316964 319680 322424 325401 328294 330367 331187 331159 331047 331039 330744 329995 329092 328186 327017 325458 323789
53586 323789 322193 320495 318714 317352 316631 315920 314409 312078 309518 307165 305289 304390 304744 305591 305584 304314
53570 304314 302855 302504 303435 304889 306296 307823 310003 313191 317366 322190 327150 331730 335558 338457 340295
53555 340295 340784 339516 336441 332286 328221 324938 322319 320108 318508 317869 318172 319322 321636 325460 330432
53540 330432 335708 340915 346296 351906 357357 362613 368469 375819 384703 394376 404101 413632 423203 433336
53526 433336 444513 456813 469910 483497 497538 512142 527494 544004 562100 581681 602150
53515 602150 623239 645404 669053 693740 718609 743409 768554 794223 819907 844917 868999
53504 868999 892346 915268 937924 960179 981695 1002309 1022330 1042245 1062231 1082169 1102060
53493 1102060 1122066 1142090 1161710 1180654 1199081 1217183 1234815 1251792 1268400 1285293 1302860
53482 1302860 1320866 1338679 1355632 1371159 1384770 1396132 1405150 1411945 1416673 1419334 1419696 1417401 1412274
53469 1412274 1404572 1394944 1384047 1372145 1359087 1344672 1329026 1312619 1295954 1279228 1262246 1244564
53457 1244564 1225743 1205556 1184056 1161534 1138460 1115450 1093096 1071672 1050984 1030655 1010644
53446 1010644 991462 973844 958193 944311 931698 920180 910333 903100 898834 896704 895222 893403
53434 893403 891338 889769 889374 890480 893144 897244 902622 909303 917513 927372 938665 951078 964582 979503
53420 979503 996221 1014875 1035250 1056848 1079191 1102201 1126254 1151766 1178839 1207399 1237554
53409 1237554 1269615 1303861 1340465 1379594 1421309 1465346 1511236 1558781 1608227 1659842 1713412
53398 1713412 1768352 1824237 1881040 1938767 1997001 2054970 2112069 2168177 2223386 2277533 2330198
53387 2330198 2381134 2430434 2478090 2523539 2565857 2604437 2639366 2671092 2699768 2724969 2746038
53376 2746038 2762676 2775067 2783299 2786844 2784821 2776735 2762540 2741882 2713785 2677575 2633998 2585044
53364 2585044 2532697 2478157 2422128 2365325 2308465 2252046 2196351 2141574 2087912 2035683 1985367
53353 1985367 1937243 1890947 1845674 1800886 1756498 1712291 1667669 1622458 1577611 1534536 1493760
53342 1493760 1454730 1416969 1380903 1347323 1316509 1288297 1262733 1240083 1220158 1202161 1185435
53331 1185435 1170051 1156254 1143457 1130278 1115733 1100168 1084834 1070773 1058184 1046641 1035588
53320 1035588 1024810 1014739 1006246 999815 994991 990918 987379 984895 983853 984117 985679 989058 994612 1001953
53306 1001953 1010625 1021015 1033862 1049009 1065427 1082632 1101325 1122314 1145397 1169767 1195114
53295 1195114 1221765 1249977 1279566 1310069 1340736 1370404 1397938 1423027 1446205 1467949 1488084
53284 1488084 1506256 1522642 1537746 1551538 1563110 1571267 1575315 1575334 1571943 1565922 1557842 1547763 1535261
53271 1535261 1519881 1501658 1481118 1458773 1434756 1408989 1381561 1352803 1323110 1292865 1262463
53260 1262463 1232179 1202054 1172108 1142594 1113738 1085286 1056783 1028448 1001267 975827 951450
53249 951450 926991 902171 877491 853007 828039 802293 776576 751958 728669 706339 685004
53238 685004 665310 647736 632081 617833 604799 593281 583644 575723 568561 560920 552222 542889 533686
53225 533686 524870 516079 506775 496508 485009 472420 459372 446530 434139 422221 411030 400870
53213 400870 391662 383172 375601 369322 363995 358593 352550 346328 340499 334815 328649 321909 314939 307848
53199 307848 300579 293492 287257 282105 277657 273522 269668 266150 262916 259950 257226 254462 251369 248235
53185 248235 245780 244213 242889 241181 239250 237548 235937 233892 231420 229176 227647 226705 226069 225758 225831
53170 225831 225982 225756 225051 224185 223524 223178 223020 222832 222402 221584 220340 218751 217034 215489 214320 213462 212714
53153 212714 212047 211647 211519 211232 210250 208559 206744 205335 204218 202817 200907 199092 198317 198878 200038 200781
53137 200781 200824 200752 201164 201980 202672 202925 202814 202483 201982 201445 201143 201268 201768 202418 202939 203071 202740 202253 202127
53118 202127 202621 203525 204450 205190 205761 206224 206543 206475 205596 203717 201366 199511 198596 198090 197242 196013 194927
53101 194927 194238 193764 193377 193125 192800 191985 190676 189443 188676 188103 187338 186561 186197 186187 186004 185336 184370 183513
53083 183513 183174 183719 185210 187087 188499 189047 188964 188531 187773 186862 186369 186698 187466 187884 187658 187197 186969 187073
53065 187073 187514 188436 189748 190779 190784 189792 188677 188313 188913 190260 192237 194832 197766 200512 202725 204436
53049 204436 205818 206936 207754 208103 207614 205991 203519 201001 198972 197196 195200 193039 191117 189445 187612
53034 187612 185554 183822 182886 182594 182583 182821 183372 183868 183724 182837 181696 180768 180118 179674 179493 179513 179392 178905
53016 178905 178461 178880 180563 182995 185168 186440 186914 187081 187257 187417 187362 186836 185577 183600 181539 180359
53000 180359 180431 180999 180910 179830 178536 178092 179029 181231 184146 186952 188982 190228 191250 192393 193363 193753
52984 193753 193647 193390 193099 192777 192702 193171 193979 194626 195010 195427 195898 196015 195623 195194 195352 196311 197886 199699
52966 199699 201307 202587 204131 206753 210330 213579 215342 215682 215383 214869 214143 213339 212642 211813 210474 208761
52950 208761 207176 205832 204405 202771 201131 199569 198063 196897 196347 195883 194518 192252 190420 190084 190683
52935 190683 190903 190410 189978 190109 190308 189825 188630 187390 186702 186507 186205 185334 184121 183216 182898 182849 182807 183013
52917 183013 183671 184334 184352 183768 183274 183325 183732 184129 184418 184592 184510 184071 183458 183024 183017 183401 183827 183789 183035 181876
52897 181876 180934 180507 180293 179773 178711 177275 175841 174769 174300 174531 175411 176672 177812 178320 178111 177662 177564
52880 177564 177957 178466 178641 178296 177487 176356 175110 174130 173995 175246 177938 181396 184598 186881 188216 188944
52864 188944 189499 190297 191443 192397 192371 191262 189829 188719 187780 186685 185706 185322 185409 185435 185192 184753 183940 182581
52846 182581 181121 180231 179812 179197 178331 177876 177929 177545 175997 173778 171844 170496 169614 169356 169869 170661 171052
52829 171052 171100 171432 172291 173309 174127 174589 174381 173153 171185 169399 168463 168253 168345 168595 168977 169273 169320 169424
52811 169424 170098 171427 173003 174498 176070 177981 179942 181068 180607 178628 175911 173216 170830 168753 167063
52796 167063 165892 165209 164820 164533 164214 163800 163437 163487 164127 164923 165100 164441 163776 164324 166413 168990 170545 170504
52778 170504 169621 168988 168929 169015 168896 168693 168615 168550 168288 167904 167731 168058 168897 169885 170428 170182 169512 169202 169576 170167
52758 170167 170373 170152 169825 169597 169558 169882 170561 171185 171411 171541 172117 173058 173730 173877 173916 174194 174494 174568 174626 174919
52738 174919 175227 175250 175271 175891 177194 178673 179998 181381 183050 184812 186431 188074 189959 191741 192718 192698
52722 192698 192241 191882 191463 190519 189066 187618 186503 185631 184967 184825 185386 186158 186283 185389 183905 182511 181510
52705 181510 180770 180128 179570 179057 178416 177578 176863 176739 177246 177909 178368 178849 179759 181016 182188 183165 184264 185622
52687 185622 186998 188277 189766 191733 193961 195974 197399 197938 197380 195992 194511 193373 192228 190600 188753
52672 188753 187445 187040 187308 187919 188600 188932 188674 188271 188448 189188 189668 189379 188789 188659 189209 190228 191495 192721
52654 192721 193495 193793 194264 195517 197279 198720 199468 199830 199996 199600 198298 196464 194948 194220 193992 193672 193044
52637 193044 192390 191995 191725 191296 190872 191118 192453 194458 196249 197389 198156 198951 199733 200178 200155 199794 199176 198242
52619 198242 197035 195820 194874 194280 194038 194170 194566 194837 194656 194195 193994 194350 195092 195987 197030 198155 199006
52602 199006 199314 199303 199427 199868 200574 201542 202661 203479 203642 203503 203715 204161 204006 203070 202431 203090 204531 205313
52584 205313 204902 204145 203937 204191 204414 204603 205028 205485 205424 204769 204044 203600 203234 202770 202535 202826 203207 202893 201753
52565 201753 200448 199466 198512 197113 195483 194449 194644 195946 197503 198241 197636 196291 195455 195692 196257 196141
52549 196141 195375 194797 194771 194838 194591 194205 193978 193947 194189 194924 195978 196652 196526 196071 196139 197109 198798 200778 202428
52530 202428 203060 202625 202053 202383 203608 204851 205530 205808 205942 205791 205200 204396 203791 203632 203988 204735 205422 205511
52512 205511 205051 204865 205789 207863 210532 213424 216607 220124 223673 226790 229084 230198 229833 228116 225768
52497 225768 223632 221940 220261 218177 215816 213601 211665 209739 207542 205087 202664 200751 199942 200603 202442
52482 202442 204545 206057 206794 207205 207852 209051 210745 212495 213648 213783 213090 212263 211979 212469 213460 214477
52466 214477 215287 216121 217344 218918 220461 221992 224243 227783 231939 235066 236027 235129 233490 231855 230250
52451 230250 228503 226643 224803 223016 221287 219699 218266 216752 214830 212510 210293 208712 207739 206850 205786
52436 205786 204997 205076 205862 206427 206042 204920 203948 203864 204817 206441 208119 209270 209721 209844 210198 210983 211962 212874
52418 212874 213684 214386 214823 214992 215420 216886 219675 223363 227532 232508 239104 247619 257396 267414 276944
52403 276944 285326 291436 294008 292747 288766 283608 277990 271749 264791 257686 251315 246294 242817 240655
52389 240655 239131 237458 235443 233729 233018 233209 233581 233710 233870 234565 235996 238025 240383 242876 245606 248916
52373 248916 252840 256726 259867 262536 265800 270177 275007 279410 283288 286839 289604 290784 290398 289517 289279
52358 289279 290013 291272 292320 292546 291823 290594 289472 288805 288771 289653 291687 294747 298475 302557 306610 310201
52342 310201 313458 317349 322706 329154 335706 342285 349818 358810 368695 378811 389227 400347 412416
52329 412416 425830 441211 458740 477905 498206 519480 541226 562465 582893 603501 625227
52318 625227 647511 668898 688689 707196 724744 741298 756924 771796 785738 798339 809535
52307 809535 819543 828319 835610 841443 846082 849683 852480 855032 857599 859506 859849 858671 856663 853855
52293 853855 849611 843943 837748 831367 823943 814847 805059 796377 789697 784653 780646 777582 775773 775627
52279 775627 777552 781866 788735 798128 809646 822400 835441 848431 861675 875445 889687 904444
52267 904444 919990 936213 952266 967135 980267 991454 1000597 1007975 1014356 1020342 1025804 1030334 1034020
52254 1034020 1037419 1040962 1044745 1048638 1052110 1054126 1053721 1050804 1046097 1040309 1033570 1025645 1016415 1006147
52240 1006147 995386 984583 973825 963209 953468 945708 940167 935690 930940 925851 921374 918041 915459
52227 915459 913104 910892 908930 907364 906700 907648 910308 913899 917613 921323 925203 929127 932953 937065 942028
52212 942028 947820 953906 960040 966472 973282 979993 986130 991782 997273 1002456 1006714 1009699 1011819 1013957
52198 1013957 1016839 1020626 1024885 1028900 1032172 1034730 1036866 1038626 1039814 1040515 1041265 1042458 1043789 1044607 1044668
52183 1044668 1044158 1043040 1040816 1037044 1031744 1025188 1017629 1009425 1001098 992965 984934 976975 969640 963744
52169 963744 959582 956789 955004 954343 955014 956738 958787 960662 962551 965074 968581 972739 976818 980280 983014
52154 983014 985037 986211 986403 985838 985081 984606 984461 984370 984098 983637 983052 982305 981334 980301 979608 979593 980315 981763
52136 981763 984137 987684 992338 997824 1004212 1012082 1021938 1033700 1047030 1062087 1079673 1100538 1124666
52123 1124666 1151248 1179243 1207939 1237147 1266954 1297252 1327378 1356256 1383031 1407608 1430424
52112 1430424 1451579 1470317 1485576 1496950 1504837 1509668 1511416 1510062 1506166 1500588 1493833 1486027 1477399
52099 1477399 1468389 1459326 1450371 1441762 1433693 1425961 1418106 1410015 1401977 1394047 1385766 1376739 1367173 1357615
52085 1357615 1348476 1340064 1332816 1327151 1323263 1321329 1321786 1325102 1331297 1339918 1350403 1362308 1375258
52072 1375258 1388940 1403200 1418061 1433586 1449672 1465898 1481579 1496111 1509230 1520847 1530731
52061 1530731 1538639 1544645 1548963 1551417 1551539 1549320 1545393 1540224 1533578 1525132 1515206 1504398 1492742 1479750
52047 1479750 1465133 1449021 1431508 1412462 1391923 1370374 1348475 1326712 1305361 1284604 1264613
52036 1264613 1245684 1228366 1213383 1201380 1192571 1186440 1181813 1177561 1173442 1170069 1167881 1166400 1164720
52023 1164720 1162442 1159779 1156925 1153771 1150213 1146354 1142266 1137819 1132922 1127774 1122668 1117456 1111209 1102555
52009 1102555 1090485 1074896 1056340 1035489 1013042 989857 966640 943528 920445 897797 876139
51998 876139 855083 833362 810369 787006 764572 743506 723841 706159 691173 678674 667789
51987 667789 658080 649633 642180 634986 627666 620324 612804 604505 595132 585010 574388 562949 550318
51974 550318 536712 522886 509747 498125 488595 481269 475856 471956 469290 467800 467741 469396 472555 476619
51960 476619 481508 487850 495736 503885 510813 516363 521082 524553 525602 524020 520757 516377 510707 504350
51946 504350 499105 496109 494698 493950 494386 497179 502488 509617 518295 528750 540818 553907 567626 581605
51932 581605 594799 605684 613196 617040 617284 614112 607786 598338 585581 569936 552930 536221 520243
51919 520243 504379 488264 472301 457038 442745 429633 417960 407828 399282 392572 387858 384697
51907 384697 382293 380237 378691 377956 378311 380177 383875 389239 395866 403675 412724 422537 432104 440527 447144
51892 447144 451096 451478 448158 442034 434343 426148 418499 412431 408439 406331 405876 407274 410766 416191 423327
51877 423327 432388 443819 457618 473054 488960 504115 517412 527832 534452 536715 534893 530102
51865 530102 523475 515265 505002 492534 478604 464414 450963 438921 428720 420471 414005 409220
51853 409220 406252 405146 405539 406844 408612 410520 412105 412784 412209 410562 408405 406176 403772 400676 396540
51838 396540 391583 386413 381610 377563 374487 372389 371125 370710 371385 373129 375324 377254 378817 380320 381613
51823 381613 381970 380936 378856 376320 373441 369971 365927 361858 358538 356502 355785 356040 357045 359069 362529
51808 362529 367248 372331 376825 380253 382408 382978 381755 379102 375883 372810 369932 366800 363111 359155
51794 359155 355562 352628 350026 347281 344308 341334 338508 335884 333657 332022 330789 329579 328454 328046
51780 328046 328832 330508 332219 333248 333356 332634 331279 329569 328053 327581 328877 332015 336538 342185 349056
51765 349056 356870 364677 371942 379401 387986 397156 405231 411262 415517 417965 417564 413623 406994 399112
51751 399112 390582 381422 372123 363565 356223 350200 345721 342850 341023 339717 339460 341387 345896 352521
51737 352521 361073 371969 385182 399633 413929 427059 438120 446276 451699 456049 461216 467699 474661
51724 474661 481271 487148 491485 492639 489318 482023 472836 463869 456234 450381 446639 444800 443432 440404
51710 440404 434464 426116 416947 408450 401598 396948 394592 394137 395089 397146 399766 401728 401713 399496 396239
51695 396239 393531 392314 392648 394058 395979 398033 400000 401423 401417 399191 394783 388996 382695 376479 370911
51680 370911 366475 363072 360079 357242 355285 355389 358279 363968 372009 381661 392097 402948 414617 427735
51666 427735 442252 457166 470992 482188 489259 490975 486877 477599 464630 449789 434895 421717
51654 421717 411831 406148 404412 405391 407848 411320 415694 420119 422820 422317 418614 412909 406329 399192 391329
51639 391329 382662 373419 364045 355033 346709 339089 332034 325506 319674 314849 311412 309626 309247 309435 309340
51624 309340 308784 308149 307705 307384 307176 307296 307754 308168 308292 308426 308977 309783 310318 310480 310759 311477 312197 312149 311208
51605 311208 310253 310496 312463 315625 319025 322161 325159 328245 331492 335223 340223 347098 355524 364410 372542
51590 372542 378702 381566 380444 376383 371774 368384 366145 364212 362632 362359 364077 367831 373724 382154
51576 382154 393196 406349 421112 437332 454742 472686 490681 508907 527747 547005 565827
51565 565827 583243 598654 612158 624915 639087 657063 680523 710173 745956 787096 831878
51554 831878 877626 921009 958549 987359 1005908 1014141 1012761 1002546 984434 959772 929767 894799
51542 894799 854852 810817 764955 719861 677282 638018 602461 570790 542866 518356 496986
51531 496986 478493 462470 448511 436444 426143 417173 408942 401270 394458 388629 383233 377533 371455
51518 371455 365645 360639 356287 352177 348327 345186 343077 341918 341421 341179 340579 339061 336722 334308 332359
51503 332359 330622 328606 326427 324635 323428 322603 322248 322792 324149 325389 325743 325571 325790 326583 327303 327606
51487 327606 328061 329267 330853 331807 331650 330775 329669 328277 326357 324104 322004 320257 318685 317200 316026
51472 316026 315452 315668 316874 319173 322160 324912 326604 326910 325762 323065 318988 314212 309471 304997 300750
51457 300750 296987 294171 292412 291457 291181 291711 293139 295528 299092 303883 309365 314938 320995 328842 339355
51442 339355 352233 366678 381970 396876 409210 416956 419767 418961 416328 413395 411348 410619 410342 408863
51428 408863 405073 398987 391177 382284 373228 365200 358881 353929 349573 345537 342140 339639 337877 336559
51414 336559 335622 335289 335872 337525 340053 342862 345158 346352 346462 346122 346026 346220 346097 345185 343810 342752 342414
51397 342414 342607 343102 344076 346000 349303 354115 360109 366604 373161 380218 388939 400316 414645 431874
51383 431874 452209 476211 504504 537573 575764 619333 668503 723357 783334 846634 910174
51372 910174 970239 1023322 1066844 1099664 1122086 1134953 1138459 1131931 1114707 1086939 1049516 1003702
51360 1003702 951171 894116 834989 776127 719489 666334 617020 571577 530696 495598 466553
51349 466553 442159 420719 402011 386942 375676 366912 359070 351496 344354 337939 332462 328056 324616
51336 324616 321806 319315 316931 314393 311598 309036 307513 307225 307478 307576 307522 307498 307114 305807 303777 301902
51320 301902 300629 299534 298179 297005 296900 297988 299294 299773 299423 299069 299169 299247 298605 297216 295602 294137
51304 294137 292903 292072 291912 292390 293187 294123 295152 295898 295729 294484 292700 290864 288869 286539 284227 282493
51288 282493 281471 281038 281360 282796 285373 288765 292737 297253 302205 307335 312327 316763 320153 322439 324286
51273 324286 326446 328862 330853 332142 333177 334340 335338 335600 334994 333883 332724 331787 331071 330264 328853 326385
51257 326385 322684 317953 312890 308565 305701 303998 302458 300511 298480 296813 295286 293333 290899 288541
51243 288541 286711 285317 284048 282869 282074 281966 282607 283764 284965 285618 285294 284108 282814 282300 282841 283905
51227 283905 284745 285082 285138 285230 285573 286376 287859 290077 292808 295574 297821 299303 300427 301935 303991 305846
51211 305846 306746 306942 307404 308706 310640 312749 314704 316226 317228 318069 319115 320034 320096 319296 318484 318176 317835
51194 317835 316757 315047 313283 311695 310221 309010 308290 307951 307745 307790 308430 309695 311245 312770 314158 315416
51178 315416 316659 318014 319292 320031 320127 320136 320599 321344 321819 321823 321459 320658 319336 317850 316713 315916 315087 314257
51160 314257 313897 314125 314397 314171 313442 312474 311315 309799 307777 305216 302277 299390 297092 295748 295421 295886
51144 295886 296628 297131 297485 298473 300650 303501 305945 307508 308488 309154 309376 309070 308333 307056 305002 302480
51128 302480 300421 299540 299812 300894 302588 304672 306800 308899 311264 314015 316871 319746 323094 327202 331478
51113 331478 334939 337244 338800 339956 340524 340193 339163 338242 338252 339270 340555 341406 341938 342699 343678 344330 344660
51096 344660 345533 347541 350094 352121 353238 353706 353687 353250 352915 353449 355002 356939 358608 359925 361125 362303
51080 362303 363307 363885 363871 363377 362803 362469 362314 362133 361955 361961 362187 362616 363553 365584 369130 374213 380617 388041
51062 388041 396279 405548 416476 429227 442464 453663 460852 464074 465169 466430 469607 475705 484925
51049 484925 496383 508204 518584 527145 535127 543978 553756 563034 570266 574999 577902 580110 582551
51036 582551 585272 586973 585454 578990 567344 551518 532936 513095 493493 475203 458523 443381
51024 443381 430075 419315 411549 406509 403371 401249 399744 399229 400393 403260 406943 410651 414593 419410
51010 419410 425004 430529 435385 439598 443349 446889 450967 456579 463945 472220 480518 488736 497162 505843
50996 505843 514788 524425 535308 547541 560796 574748 589213 604048 619226 634945 651416 668666
50984 668666 686666 705430 724708 743735 761507 777218 790320 800480 807841 813282 818181 823893
50972 823893 831501 841753 854976 871274 891151 915798 946387 983089 1025055 1071294 1121234 1174555
50960 1174555 1230927 1289945 1350837 1412040 1471537 1527980 1581238 1631501 1678084 1719604 1755295
50949 1755295 1785707 1811972 1834799 1854391 1871052 1885470 1898449 1910648 1922503 1933957 1944069
50938 1944069 1951145 1953700 1951484 1945572 1937463 1928051 1917257 1904368 1888533 1868959 1844860 1815520
50926 1815520 1780604 1740319 1695092 1645138 1590633 1532310 1471596 1409926 1348201 1287161 1228077
50915 1228077 1172601 1121832 1075759 1033707 995186 960228 929031 901478 877073 855305 835926
50904 835926 818723 803122 788328 773976 760387 748050 737078 727377 719034 712102 706120 700336
50892 700336 694465 688920 684244 680629 678050 676528 676008 676126 676385 676551 676834 677729 679662 682728 686692 691289
50876 691289 696518 702659 710134 719357 730430 742792 755374 767435 779214 791653 805613 821584
50864 821584 839827 860405 883202 908314 936377 968121 1003748 1043202 1086995 1136156 1191318
50853 1191318 1252446 1319709 1394087 1476812 1568509 1669110 1778133 1894670 2017424 2145188
50843 2145188 2277250 2413112 2551867 2691807 2830302 2963892 3088854 3202037 3301154 3384443
50833 3384443 3450594 3499312 3531591 3549187 3554115 3548785 3536148 3519229 3500755 3483402 3470010 3463020
50821 3463020 3463864 3472981 3489836 3512316 3536501 3557689 3571717 3575121 3564688 3537769 3493091 3430671
50809 3430671 3350988 3254791 3143607 3019744 2885686 2744084 2598462 2453146 2311984 2177331
50799 2177331 2050465 1932520 1824767 1728350 1644165 1572740 1513863 1466432 1428963 1400135 1378776
50788 1378776 1363677 1353824 1348646 1347579 1349347 1352020 1353915 1354226 1352741 1349296 1343754 1336252 1327005 1315834
50774 1315834 1302297 1286472 1269248 1251569 1233532 1214555 1194143 1172046 1147855 1121210 1092593
50763 1092593 1063341 1034535 1006367 978933 953137 930218 910633 893955 879676 867631 857833
50752 857833 850446 845889 844415 845608 848722 853543 860452 869726 881315 895445 912887 934301 959667
50739 959667 988575 1020806 1056468 1095870 1139471 1187735 1240845 1298656 1360953 1427532 1497972
50728 1497972 1571551 1647450 1724798 1802535 1879472 1954544 2026776 2095021 2158003 2214463 2262844
50717 2262844 2300901 2326345 2338169 2337080 2324645 2302714 2273921 2241939 2210447 2181969 2158096
50706 2158096 2140391 2130326 2128334 2133525 2144395 2159405 2176775 2194183 2208990 2218643 2220714 2212734
50694 2212734 2192387 2158260 2110631 2051538 1983900 1910433 1833376 1754956 1677686 1604001 1535852
50683 1535852 1474731 1421826 1377918 1343305 1318025 1302042 1295243 1297490 1308801 1329133 1357730 1392971
50671 1392971 1433028 1476434 1521812 1567501 1611874 1653756 1692089 1725527 1753015 1774845 1792552
50660 1792552 1807630 1820618 1831453 1840227 1847320 1853126 1857934 1861964 1865291 1867836 1869712 1871663 1875009
50647 1875009 1880961 1889973 1901904 1916915 1935919 1959832 1988554 2021224 2057448 2097547 2141242 2186799
50635 2186799 2232160 2276574 2320437 2363863 2406229 2447029 2486287 2523847 2558671 2588549 2609438
50624 2609438 2614968 2598335 2556545 2493282 2417279 2337893 2262034 2193933 2135872 2088521 2051471
50613 2051471 2024273 2006906 1999027 1999155 2004941 2013923 2023667 2031467 2034583 2030994 2019552 1999348 1969290
50600 1969290 1928720 1878299 1819989 1756093 1688426 1618372 1547448 1477519 1410402 1347300 1288683
50589 1288683 1234724 1185736 1142047 1103578 1069836 1040501 1015771 995801 979990 967207 956779
50578 956779 948940 944193 942496 943185 945366 948268 951470 955018 959117 963614 968053 972469 977726 984800
50564 984800 994006 1005333 1019190 1036227 1056515 1079558 1105177 1133837 1165947 1201384 1239897 1281448
50552 1281448 1325676 1371348 1416822 1460971 1503290 1543308 1580422 1614463 1646025 1675976 1704896
50541 1704896 1733333 1762565 1794659 1831504 1873856 1921605 1974822 2034167 2100207 2172843 2251798
50530 2251798 2337391 2430367 2531000 2638686 2752361 2870937 2993273 3118001 3243377 3366988
50520 3366988 3485655 3596115 3695925 3783348 3856276 3911838 3947469 3962070 3955825 3929214 3882668
50509 3882668 3817015 3733807 3635256 3524345 3405122 3282569 3161842 3047480 2943101 2851563
50499 2851563 2775273 2716371 2676564 2656693 2656394 2674117 2707281 2752318 2804721 2859284 2910314 2951699
50487 2951699 2977232 2981587 2961565 2916762 2849249 2762557 2660603 2547150 2425901 2300754 2175559
50476 2175559 2053448 1936507 1826000 1722654 1626719 1538155 1457083 1383887 1318700 1261000
50466 1261000 1209831 1164186 1123068 1085686 1051971 1022583 997942 977453 960085 945438 933696
50455 933696 924718 917815 912485 908812 907008 906984 908455 911043 914191 917459 921051 925637 931476 938096 944916
50440 944916 951715 958303 964358 969998 976040 983239 991514 1000423 1010111 1021315 1034541 1049691 1066440
50427 1066440 1084604 1104159 1125200 1147821 1171757 1196252 1220665 1245214 1270875 1298702 1329513
50416 1329513 1364009 1402640 1445375 1492196 1543901 1601844 1666497 1736586 1809912 1884610 1959253
50405 1959253 2032183 2101516 2165901 2224726 2277338 2322366 2358036 2382820 2395465 2394641 2379200 2349010
50393 2349010 2305257 2249709 2184011 2109992 2030392 1948637 1867771 1790017 1717493 1652791 1598289
50382 1598289 1555122 1523280 1502607 1493093 1494091 1503814 1520070 1541202 1565818 1591615 1614975 1632064
50370 1632064 1640229 1638175 1625153 1600652 1565121 1520454 1469196 1413413 1354742 1295194 1236980 1181297
50358 1181297 1128051 1077209 1029749 986667 947612 911402 877642 846948 819601 794913 772163
50347 772163 751484 733425 718142 705357 694757 686123 679344 674489 671576 670144 669501 669586 671092 674441
50333 674441 679050 683975 688810 693523 697833 701409 704531 707947 712073 716700 721506 726451 731617 736930
50319 736930 742111 746782 750679 753923 757019 760521 764867 770542 778020 787351 798241 810836 825954
50306 825954 844037 864199 884861 904982 924019 940890 953809 961309 963021 959658 952829 944791
50294 944791 937519 931711 927055 923429 921171 920245 919994 920025 920667 922279 924806 928352 933463 940284 948105
50279 948105 956403 965956 978232 993742 1011178 1027542 1038660 1040432 1031068 1012501 989108 964835
50267 964835 941623 919987 900048 881820 865249 850490 837876 827549 819475 813912 811393 811939
50255 811939 814576 817990 821530 825467 830403 836602 843774 851342 858815 865932 872524 878468 883844 888896
50241 888896 893616 897588 900489 902498 903844 904194 902992 900303 896723 892445 886975 880032 872250 864695
50227 864695 858036 852518 848455 846372 846771 850053 856572 866559 880061 897152 918128 943305 972569
50214 972569 1005095 1039390 1073574 1105946 1135604 1162619 1187542 1210888 1233184 1255248 1277966
50203 1277966 1301520 1324856 1345959 1362589 1372769 1374710 1366731 1347724 1317959 1279310 1234547 1186352
50191 1186352 1136929 1088158 1041659 998653 959994 926364 898214 875492 857591 843531 831937
50180 831937 820829 807861 791161 770126 745549 719156 692906 668275 645926 625998 608658
50169 608658 594120 582215 572318 563937 557161 552386 549765 549085 549973 552023 554842 558169 562023 566664
50155 566664 572420 579437 587460 595889 604199 612168 619434 625085 628239 629084 628773 628038 626423 623179 618473
50140 618473 613291 608531 604690 602130 601123 601717 603961 608061 613873 620500 626990 633355 640290 647909
50126 647909 655480 662625 670089 678827 688719 698644 707694 715907 723985 732613 742086 752284 762962 774150
50112 774150 786293 799900 815146 831967 850543 871595 896180 925198 959045 997694 1041146
50101 1041146 1089842 1144553 1205723 1272791 1344051 1417197 1490103 1561239 1629578 1694500 1756224
50090 1756224 1816247 1876760 1939103 2002789 2066145 2127434 2184769 2235033 2273740 2296484 2300612
50079 2300612 2285640 2252653 2203706 2141493 2068968 1989011 1904266 1817071 1729344 1642702 1558806
50068 1558806 1479441 1406043 1339269 1279242 1226068 1179816 1139987 1105310 1074307 1046064 1020441
50057 1020441 997615 977524 959807 944231 930983 920387 912404 906635 902794 900866 900721 901906 904077
50044 904077 907433 912338 918533 925007 930684 935055 938173 940233 941295 941239 939887 937187 933370 928920 924373
50029 924373 920096 916097 912024 907475 902390 897088 891806 886425 880751 874790 868432 861098 852256 842366
50015 842366 832821 824622 817354 809680 800620 790129 778683 766748 754680 742855 731756 722008 714256
50002 714256 708896 706003 705664 708263 714164 723182 734684 748201 763590 780455 797815 814738 831083
49989 831083 847248 863321 878941 894109 909719 926979 946470 967974 991040 1015436 1041117
49978 1041117 1068057 1096155 1125035 1153818 1181305 1206609 1229615 1250758 1270555 1289475 1308122
49967 1308122 1327211 1347219 1367971 1388312 1405908 1417462 1419656 1410370 1389145 1356705 1314442 1264490
49955 1264490 1209881 1153988 1099645 1048853 1003067 963330 930058 903065 881963 866327 855337
49944 855337 847565 841369 835446 828994 821683 813744 805841 798456 791290 783324 773248 759682 741442
49931 741442 718381 692095 665306 640176 617382 596752 578332 562510 549483 539043 530808 524394
49919 524394 519452 515825 513571 512643 512683 513398 514905 517331 520188 522690 524783 527403 531437 536797 542728
49904 542728 548730 554872 561513 569142 578369 589598 602623 616755 631285 645496 658360 668756
49892 668756 676215 681122 684008 685020 684298 682387 679684 675701 669446 660538 649379 636183 620502 602199
49878 602199 582459 563286 546034 530750 516815 503799 491703 480787 471453 464089 458842 455559
49866 455559 453924 453570 454107 455271 457075 459659 462995 466939 471665 477734 485531 494771 504802 515347
49852 515347 526741 539411 553219 567433 581274 594381 606637 617608 626403 632328 635571 636972
49840 636972 637065 635544 631743 625427 616997 607138 596443 585303 573938 562557 551532 541373 532490
49827 532490 525099 519425 515815 514501 515322 517840 521699 526767 533037 540511 549138 558699 568862 579490
49813 579490 590889 603547 617467 631826 645322 656990 666704 674958 682187 688380 693334 696955 699037
49800 699037 698924 695852 689760 681442 671767 661029 649101 635861 621235 605271 588547 572247 557443
49787 557443 544389 532782 522474 513553 505959 499503 494205 490125 486847 483521 479586 475296 471518
49774 471518 469191 468808 470185 472791 476539 481982 489399 498024 506754 515426 524654 534462 543929 552412
49760 552412 560264 567898 574821 580186 583907 586613 588678 589743 588927 585160 577680 566793 554054 541238
49746 541238 529238 518225 508497 500454 493865 487925 482235 477220 473427 470839 469037 467574 466057 464364
49732 464364 463125 463531 466152 470086 473666 475929 477144 478115 479448 481532 484814 489805 496900 506185 517250
49717 517250 529250 541376 553375 565301 576681 586237 592720 595819 595997 593762 589574 584327 579243
49704 579243 574931 570943 566496 561370 555790 549815 543320 536435 529508 522584 515340 507643 499880 492628
49690 492628 486264 481051 477301 475200 474571 475055 476538 479321 483819 490093 497640 505791 514367 523892 535051
49675 535051 548007 562328 577267 591793 604514 614133 620198 623327 624740 625712 627166 629281 631479
49662 631479 633280 635206 638383 643197 648731 653504 656034 654609 647521 634403 617082 598436 580472
49649 580472 563719 548044 533400 519931 507946 497865 489867 483677 478945 475696 474017 473482 473329
49636 473329 473124 472868 472574 472190 471855 471684 471209 469488 466005 461174 455852 450603 445555 440665 435903 431291
49620 431291 426870 422652 418651 415033 412070 409791 407812 405751 403746 402374 402192 403447 405938 408856
49606 408856 411059 411985 412198 412631 413483 414276 414788 415316 416055 416830 417566 418498 419737 421036 422113 422881 423327
49589 423327 423521 423813 424643 426105 428016 430272 432672 434550 435312 435373 435811 437018 438481 440024 442248 445326
49573 445326 448414 451022 454203 459404 466652 474780 483126 492002 501655 511718 521706 531284 539928 547016
49559 547016 552366 556086 557819 556838 553056 547346 540635 533315 525810 519093 514049 510692 508455 507063
49545 507063 506672 507295 508512 509809 510999 512238 513739 515466 517077 518286 519277 520589 522626 525529 529572
49530 529572 535274 542895 552116 562555 574369 587935 603004 618542 633405 646833 658353 667669
49518 667669 674912 680648 685382 689245 692475 695993 701094 708604 718666 731186 745874 761602 776252
49505 776252 787688 794714 796773 793109 782967 766697 746116 723515 700613 678566 658402 640916
49493 640916 626255 613919 603234 593735 585290 578065 572284 567891 564524 561867 559893 558640 557968 557699
49479 557699 557786 558146 558511 558660 558748 559191 560303 562097 564290 566442 568357 570484 573611 577901 582536 586640
49463 586640 590295 594280 599041 604334 609645 614398 617841 619333 618922 617196 614417 610213 604313 597224
49449 597224 589882 582792 575764 568425 560834 553638 547671 543448 541014 540144 540387 540936 540995 540681 541242 543896
49433 543896 548647 554685 561742 570479 581683 595823 613495 635657 663127 696206 734971 779699
49421 779699 830999 889541 954506 1020531 1076037 1106926 1104709 1072175 1021206 965155 912757 867216
49409 867216 828653 796640 771338 753221 742149 736988 736314 739142 744718 752114 760758 771019 783380
49396 783380 796982 809728 820049 828030 834695 840780 846358 851001 853843 853949 851076 845905 839297 831597
49382 831597 822884 813452 803641 793500 783103 773048 764114 756449 749540 743120 737744 734240 732830
49369 732830 733026 734253 736168 738319 739896 740176 739109 737101 734274 730340 725294 719718 714071 708144 701678
49354 701678 695195 689593 685036 680922 676961 673634 671441 670287 669827 669888 670254 670557 670802 671561 673151 674908
49338 674908 675777 675407 674265 672810 671063 668924 666468 663934 661709 660314 660050 660679 661722 662992 664557
49323 664557 666235 667619 668668 669908 671850 674413 677106 679563 681790 683978 686216 688366 690200 691714
49309 691714 693164 694713 696180 697331 698201 698849 698995 698387 697497 697298 698206 699719 701348 703462 706828 711611
49293 711611 717299 723463 730105 737249 744652 752108 759760 767877 776464 785348 794580 804378 814508 823867
49279 823867 831117 835895 839241 842712 847156 852493 858404 864847 871959 879801 888309 897199 905874 913762
49265 913762 920952 928154 935688 942539 946730 946728 942525 935614 928313 923287 923347 930942 947001 970032 996834
49250 996834 1024729 1052996 1081605 1108638 1129789 1140969 1141104 1132135 1116838 1097308 1075249 1052500
49238 1052500 1030522 1009542 988737 967530 946615 927673 912227 900873 893462 889473 887914 887352
49226 887352 886807 886738 888537 892860 898982 905913 913466 921743 930281 938481 946506 954863 963196 970332 975681
49211 975681 979945 984162 988566 992780 996829 1001580 1008175 1017120 1028007 1040160 1053487 1068334 1084398
49198 1084398 1100344 1115009 1128546 1141748 1154611 1166453 1177234 1187749 1198330 1208380 1217593
49187 1217593 1226742 1236662 1247062 1256983 1266087 1275092 1285358 1298476 1315648 1336808 1360703 1386490
49175 1386490 1415073 1448307 1487175 1531264 1579683 1631566 1685364 1738023 1784928 1820607 1840209
49164 1840209 1841564 1826535 1800331 1769269 1738801 1712635 1692461 1678146 1668652 1663152 1661270 1662555
49152 1662555 1666344 1672183 1679884 1688982 1698488 1707366 1715017 1721345 1726754 1732216 1738904 1747486 1757884 1769743
49138 1769743 1782839 1796986 1811913 1827445 1843611 1860454 1877950 1896170 1915270 1935177 1955412
49127 1955412 1975262 1993995 2011096 2026696 2041729 2057208 2073167 2088672 2102972 2116325 2129609
49116 2129609 2143616 2158951 2176227 2196002 2218849 2245797 2278561 2319106 2369235 2430641 2504524
49105 2504524 2589999 2682539 2774630 2859223 2933889 3002278 3070567 3140238 3202822 3242602 3246839
49094 3246839 3215187 3159692 3095544 3031220 2965896 2894245 2812930 2723713 2632365 2545531 2468157
49083 2468157 2402629 2349214 2306760 2273318 2246898 2226193 2210605 2199536 2191834 2186078 2181232 2176852
49071 2176852 2172751 2168707 2164501 2160053 2155374 2150413 2145054 2139306 2133481 2128100 2123533 2119702 2116173 2112579
49057 2112579 2108990 2105857 2103615 2102294 2101553 2101085 2100893 2101058 2101305 2101069 2100067 2098620 2097216 2096029 2095180 2095229
49041 2095229 2096903 2100245 2104547 2109405 2115439 2123583 2133971 2146082 2159825 2175654 2193342 2211212
49029 2211212 2227174 2240184 2250147 2256662 2258727 2255988 2249641 2241613 2233128 2224477 2215913 2208131 2201757
49016 2201757 2196762 2192662 2189207 2186759 2186067 2187727 2191774 2197746 2205067 2213263 2221814 2230126 2237927 2245590
49002 2245590 2253668 2262065 2269888 2276181 2280594 2283313 2284572 2284385 2282659 2279483 2275338 2270944 2266752 2262592
48988 2262592 2257931 2252452 2246195 2239341 2232201 2225471 2220085 2216618 2215019 2214956 2216125 2218107 2220277 2222231
48974 2222231 2224154 2226533 2229543 2232840 2235837 2238075 2239507 2240630 2242172 2244467 2247165 2249673 2251752 2253552
48960 2253552 2255280 2257117 2259357 2262355 2266282 2271150 2277098 2284476 2293603 2304559 2317360 2332342 2350217
48947 2350217 2371667 2396773 2424941 2455417 2487782 2521911 2557712 2595174 2634568 2676208 2719982
48936 2719982 2765427 2812327 2860980 2911793 2964851 3019917 3076522 3134057 3192199 3251356 3312220
48925 3312220 3374650 3437423 3499374 3560441 3621289 3682293 3743210 3803438 3862079 3917999 3970304
48914 3970304 4018684 4063113 4103609 4140713 4175761 4209989 4243483 4275474 4305467 4333510 4359636
48903 4359636 4383749 4406041 4426870 4446208 4463819 4479929 4495005 4508763 4520137 4528433 4533823 4536486
48891 4536486 4535968 4531864 4524572 4514892 4503274 4489773 4474305 4456545 4435939 4412258 4385793 4356693
48879 4356693 4324576 4289184 4250924 4210158 4166345 4118519 4066382 4010316 3950626 3887548 3821922
48868 3821922 3755083 3687916 3620689 3553950 3488967 3426971 3368423 3313302 3261776 3214251 3171050
48857 3171050 3132378 3098404 3069023 3043619 3021270 3001219 2983123 2967054 2953344 2942253 2933651
48846 2933651 2927165 2922776 2921086 2922801 2927991 2936077 2946478 2959065 2973904 2990717 3008776 3027348
48834 3027348 3046090 3064852 3083200 3100527 3116834 3133156 3150811 3170208 3190556 3210702 3230031
48823 3230031 3248695 3267388 3286969 3307896 3329808 3351796 3373172 3393810 3413903 3433856 3454447
48812 3454447 3476446 3499699 3523082 3545823 3568518 3592305 3617385 3642981 3668594 3694522 3721122
48801 3721122 3748206 3775395 3802532 3829586 3856624 3884098 3912569 3941746 3970175 3996305 4019578
48790 4019578 4040188 4058218 4073592 4086647 4098055 4107981 4115615 4119602 4118740 4112391 4100525 4083369
48778 4083369 4060799 4032247 3997462 3957222 3912955 3865752 3816120 3764486 3711318 3656717 3600436
48767 3600436 3542577 3483935 3425502 3367923 3311506 3256406 3202672 3150495 3100585 3053883 3010719
48756 3010719 2970645 2933315 2899046 2868168 2840402 2815495 2794170 2777660 2766215 2758574 2753070 2748883
48744 2748883 2746118 2745010 2745352 2746625 2748480 2751036 2754759 2760083 2767160 2775785 2785338 2794843 2803381 2810517
48730 2810517 2816100 2819764 2821137 2820667 2819625 2818888 2818095 2816416 2813687 2810280 2806271 2801599 2796859 2793155 2790954
48715 2790954 2789664 2788478 2787197 2786127 2785686 2786284 2788148 2790970 2793986 2796612 2798801 2800781 2802734 2804730
48701 2804730 2806629 2807973 2808412 2808342 2808704 2810023 2812065 2814603 2817993 2822658 2828417 2834798 2841645 2848899 2855842
48686 2855842 2861053 2863318 2862512 2859653 2856178 2853051 2850379 2847833 2845243 2842504 2839025 2833790 2826174 2816185
48672 2816185 2803674 2787789 2767817 2744335 2718993 2693221 2667573 2642238 2617569 2593911 2571288
48661 2571288 2549530 2528537 2508165 2487891 2466643 2442937 2415293 2382833 2345826 2305820 2265213
48650 2265213 2226351 2190603 2158074 2128294 2101180 2077147 2056312 2037998 2021240 2005427 1990150
48639 1990150 1974739 1958463 1941090 1922808 1903618 1883315 1862188 1841270 1821632 1803575 1786662
48628 1786662 1770251 1753757 1736680 1718771 1700190 1681299 1662260 1643011 1623590 1604362 1586009
48617 1586009 1569451 1555593 1544734 1536158 1528769 1522419 1518285 1517496 1519647 1523219 1527292 1532092 1537657
48604 1537657 1542822 1546176 1547574 1547985 1548062 1547602 1546408 1544977 1544127 1544363 1545722 1547763 1549487 1549627 1547230 1541801
48588 1541801 1533003 1520784 1505864 1489462 1472247 1454132 1435358 1417139 1400679 1386044 1372644
$$ [...]
##END NTUPLES=NMR SPECTRUM
##END=
