##TITLE=NES1061_CD-4_9883097_TrpMTpxYQ5
##JCAMPDX= 6.0         $$ Bruker NMR JCAMP-DX V2.0
##DATA TYPE= NMR SPECTRUM
##DATA CLASS= NTUPLES
##ORIGIN= BRUKER
##OWNER= Administrator
$$ 1.72 TOPSPIN		Version 2.1
$$ 2016-08-26 20:45:31.320 -0500  Administrator@X
$$ Compression mode = diff/dup
##.OBSERVE FREQUENCY= 400.02188249412
##.OBSERVE NUCLEUS= ^1H
##.ACQUISITION MODE= SIMULTANEOUS (DQD)
##.ACQUISITION SCHEME= undefined
##.AVERAGES= 8
##.DIGITISER RES= 22
##SPECTROMETER/DATA SYSTEM= spect
##.PULSE SEQUENCE= zg30
##.SOLVENT NAME= COFFEE_meoh
##.SHIFT REFERENCE= INTERNAL, COFFEE_meoh, 1, 14.98509
##AUDIT TRAIL= $$ (NUMBER, WHEN, WHO, WHERE, PROCESS, VERSION, WHAT)
$$ ##TITLE= Audit trail, TOPSPIN		Version 2.1
$$ ##JCAMPDX= 5.01
$$ ##ORIGIN= Bruker BioSpin GmbH
$$ ##OWNER= Administrator
$$ $$ E:\/data/COFFEE/nmr/NES1061_CD-4_9883097_TrpMTpxYQ5/20/pdata/1/auditp.txt
$$ ##AUDIT TRAIL=  $$ (NUMBER, WHEN, WHO, WHERE, PROCESS, VERSION, WHAT)
(   1,<2016-08-26 20:45:24.195 -0500>,<Administrator>,<X>,<go>,<TOPSPIN 2.1>,
      <created by zg
	started at 2016-08-26 20:44:16.914 -0500,
	POWCHK enabled, PULCHK disabled,
       configuration hash MD5:
       21 0F 79 D6 B3 7B B4 F6 88 20 88 DB 03 48 BD 9F
       data hash MD5: 64K
       37 C8 65 0B C0 1C 09 55 21 7A 65 4F DE 6D 31 22>)
(   2,<2016-08-26 20:45:27.258 -0500>,<Administrator>,<X>,<proc1d>,<TOPSPIN 2.1>,
      <Start of raw data processing
       efp LB = 0 FT_mod = 6 PKNL = 1 PHC0 = 0 PHC1 = 0 SI = 32K 
       data hash MD5: 32K
       BA D2 49 D4 FE D3 F3 10 CD 4F 5C E1 B9 16 3A 60>)
(   3,<2016-08-26 20:45:27.539 -0500>,<Administrator>,<X>,<proc1d>,<TOPSPIN 2.1>,
      <pk PHC0 = 92.21375 PHC1 = 0 
       data hash MD5: 32K
       E8 CF 8F 1A AA 01 D4 9A 8C 01 A9 E0 6E 16 1B 75>)
(   4,<2016-08-26 20:45:27.648 -0500>,<Administrator>,<X>,<proc1d>,<TOPSPIN 2.1>,
      <abs ABSG = 1 
       data hash MD5: 32K
       20 39 D2 8D DD 7D 76 DE ED DF 65 32 6A CC 69 C1>)
(   5,<2016-08-26 20:45:27.711 -0500>,<Administrator>,<X>,<proc1d>,<TOPSPIN 2.1>,
      <abs ABSG = 2 
       data hash MD5: 32K
       9B DE FB D6 6E B3 F5 4D D4 A0 CF D9 37 AF E6 97>)
(   6,<2016-08-26 20:45:27.789 -0500>,<Administrator>,<X>,<proc1d>,<TOPSPIN 2.1>,
      <abs ABSG = 3 
       data hash MD5: 32K
       96 61 86 D2 73 A5 4C 47 DD B3 BF 18 73 95 AC 13>)
(   7,<2016-08-26 20:45:27.836 -0500>,<Administrator>,<X>,<proc1d>,<TOPSPIN 2.1>,
      <abs ABSG = 4 
       data hash MD5: 32K
       01 A3 D9 02 CE B6 95 D1 64 6A E1 2D E9 4E 67 D0>)
(   8,<2016-08-26 20:45:27.898 -0500>,<Administrator>,<X>,<proc1d>,<TOPSPIN 2.1>,
      <abs ABSG = 5 
       data hash MD5: 32K
       22 0A 91 C1 A2 08 3E C4 FA A3 C9 E0 39 66 21 24>)
$$ ##END=
$$ 
$$ $$ hash MD5
$$ $$ E5 FE 6B 9F BD AD 28 17 FE D0 6B 1C 3E DD DB 23
##$RELAX= 
##$RELAX= 
##$RELAX= 
##$RELAX= 
##$RELAX= 
##$RELAX= 
##$RELAX= 
$$ Bruker specific parameters
$$ --------------------------
##$DU= <E:\>
##$EXPNO= 20
##$NAME= <NES1061_CD-4_9883097_TrpMTpxYQ5>
##$PROCNO= 1
$$ [...]
##$TP= (0..7)
150 150 150 150 150 150 150 150
##$TP07= 0
##$TPNAME0= <>
##$TPNAME1= <>
##$TPNAME2= <>
##$TPNAME3= <>
##$TPNAME4= <>
##$TPNAME5= <>
##$TPNAME6= <>
##$TPNAME7= <>
##$TPOAL= (0..7)
0.5 0.5 0.5 0.5 0.5 0.5 0.5 0.5
##$TPOFFS= (0..7)
0 0 0 0 0 0 0 0
##$TUNHIN= 0
##$TUNHOUT= 0
##$TUNXOUT= 0
##$USERA1= <user>
##$USERA2= <user>
##$USERA3= <user>
##$USERA4= <user>
##$USERA5= <user>
##$V9= 5
##$VALIST= <valist>
##$VCLIST= <CCCCCCCCCCCCCCC>
##$VD= 0
##$VDLIST= <DDDDDDDDDDDDDDD>
##$VPLIST= <PPPPPPPPPPPPPPP>
##$VTLIST= <TTTTTTTTTTTTTTT>
##$WBST= 2048
##$WBSW= 25
##$XGAIN= (0..3)
0 0 0 0
##$XL= 0
##$YL= 0
##$YMAX_a= 603350
##$YMIN_a= -506444
##$ZGOPTNS= <>
##$ZL1= 120
##$ZL2= 120
##$ZL3= 120
##$ZL4= 120
##$ABSF1= 14.98509
##$ABSF2= -5.573092
##$ABSG= 5
##$ABSL= 3
##$ALPHA= 0
##$AQORDER= 0
##$ASSFAC= 0
##$ASSFACI= 0
##$ASSFACX= 0
##$ASSWID= 0
##$AUNMP= <proc_prof1d_extract_pilot.lims>
##$AXLEFT= 0
##$AXNAME= <>
##$AXNUC= <1H>
##$AXRIGHT= 0
##$AXTYPE= 0
##$AXUNIT= <>
##$AZFE= 0.1
##$AZFW= 0.1
##$BCFW= 0
##$BC_mod= 0
##$BYTORDP= 0
##$COROFFS= 0
##$CY= 15
##$DATMOD= 1
##$DC= 0
##$DFILT= <>
##$DTYPP= 0
##$F1P= 0
##$F2P= 0
##$FCOR= 0.5
##$FTSIZE= 32768
##$FT_mod= 6
##$GAMMA= 0
##$GB= 0
##$INTBC= 1
##$INTSCL= 1
##$ISEN= 128
##$LB= 0
##$LEV0= 0
##$LPBIN= 0
##$MAXI= 10000
##$MC2= 0
##$MEAN= 0
##$ME_mod= 0
##$MI= 0
##$NCOEF= 0
##$NC_proc= -8
##$NLEV= 6
##$NOISF1= 0
##$NOISF2= 0
##$NSP= 0
##$NTH_PI= 0
##$NZP= 0
##$OFFSET= 14.98509
##$PC= 1
##$PHC0= 92.21375
##$PHC1= 0
##$PH_mod= 1
##$PKNL= yes
##$PPARMOD= 0
##$PPDIAG= 0
##$PPIPTYP= 0
##$PPMPNUM= 2147483647
##$PPRESOL= 1
##$PSCAL= 4
##$PSIGN= 0
##$PYNMP= <proc.py>
##$REVERSE= no
##$SF= 400.02
##$SI= 32768
##$SIGF1= 0
##$SIGF2= 0
##$SINO= 400
##$SIOLD= 32768
##$SPECTYP= <>
##$SREGLST= <1H.CDCl3>
##$SSB= 0
##$STSI= 32768
##$STSR= 0
##$SW_p= 8223.68421052631
##$SYMM= 0
##$S_DEV= 0
##$TDeff= 65536
##$TDoff= 0
##$TI= <>
##$TILT= no
##$TM1= 0
##$TM2= 0
##$TOPLEV= 0
##$USERP1= <user>
##$USERP2= <user>
##$USERP3= <user>
##$USERP4= <user>
##$USERP5= <user>
##$WDW= 1
##$XDIM= 32768
##$YMAX_p= 454793508
##$YMIN_p= -651291
##$CURPLOT= <Network HP LaserJet P1505>
##$CURPRIN= <$Network HP LaserJet P1505>
##$DFORMAT= <normdp>
##$LAYOUT= <+/1D_H.xwp>
##$LFORMAT= <normlp>
##$PFORMAT= <normpl>
##$SURQMSG= 1
$$ End of Bruker specific parameters
$$ ---------------------------------
##NTUPLES= NMR SPECTRUM
##VAR_NAME=  FREQUENCY,     SPECTRUM/REAL,   SPECTRUM/IMAG
##SYMBOL=    X,             R,               I
##VAR_TYPE=  INDEPENDENT,   DEPENDENT,       DEPENDENT
##VAR_FORM=  AFFN,          ASDF,            ASDF
##VAR_DIM=   32768,         32768,           32768
##UNITS=     HZ,            ARBITRARY UNITS, ARBITRARY UNITS
##FACTOR=    0.250966925370066, 1,           1
##FIRST=     8223.43324360094, 138378,       35285
##LAST=      0,             -45666,          -10506
##MIN=       0,             -651291,         0
##MAX=       8223.43324360094, 454793508,    0
$$ Real data points
##PAGE= N=1
##DATA TABLE= (X++(R..R)), XYDATA
$$ [...]
19489c11449a7193j06134j12725L5201g3313A44263c88752J80648A32646b03038
19478c18608a9981o5311a5313m5220l9985j36748j36443J56179I1433k9501A5279
19466D1843a52295p5370B02058G8508L8515a29970B84024b98730J33705j07137
19456b72162N5877a5437k72151h8481b0815l8622A44963d579G952f0720I4242
19444a16479c7544j7532I5129A0486f5401E3754k6250Q3014b63125a04912A29445
19432b28475O5240J7362N4610C31161i5396D682b76097M9414L3245P2011j29165
19421b50592P6490h6580I7956B60c25723B58633c1647p4250l47243a14681M1331
19410g3350D5562a42345P0888k57415J12934g5279k16593f6092p852k39473E542
$$ y = [-311449, -17193, -123327, -236052, -200851, -73313, 144263, -388752, -208104, 132646, -203038, -318608, -19981, -85292, -15313, -60533, -100518, -237266, -373709, -217530, 91433, 61932, 15279, 41843, -152295, -227665, 202058, 78508, 117023, -129970, 284024, -298730, -165025, -272162, -216285, -15437, -287588, -88481, -20815, -59437, 144963, -4579, 7952, -60720, 94242, -116479, -37544, -55076, 95129, 10486, -65401, 53754, 27504, 110518, -263125, -104912, 129445, -228475, -163235, -145873, -91263, 331161, -95396, 4682, -276097, -226683, -193438, -121427, -250592, -174102, -86580, 97956, 260, -325723, 258633, -31647, -105897, -453140, -114681, -73350, 45562, -142345, -71457, -328872, -215938, -75279, -291872, -66092, -73944, -313417, 5542]
19398f1790l8174l18243a78960F7205a21040M6248A81985A1942a83944j03142
19388b87086b8420B7291a52353p5363C2406K0151b99550A97134e2523G4692c3020
19376e7973I5348L5297a39537C8367a19638M1151J232P432A07178J20743a71773
19364b61512M3094f9571L2226i269l924j50076C1831h262H607i1888B26779G0419
19351a19440E212a8810p0184j32028A2854a56655j32581K6065i3043o4338O8513
19340h8868b3719A5506b1819f867j5638r3535j07079h6021j89453f2045D4553
19328i4235o0112A00258a46785d7565m71055a46517c2720j63994O7521e7309K2999
19317c4310M525k96555a17641f483p3103a1359k9390A61405d6305n60633A08401
$$ y = [-61790, -99964, -418207, -178960, 67205, -121040, -74792, 181985, 11942, -183944, -287086, -28420, 27291, -152353, -227716, 32406, 52557, -299550, 197134, -52523, 74692, -33020, -57973, 95348, 130645, -139537, 38367, -119638, -78487, -77255, -69823, 107178, 227921, -171773, -261512, -218418, -69571, -37345, -9269, -13193, -163269, 31831, -8262, 8607, -91888, 226779, 70419, -119440, 5212, -18810, -88994, -221022, 12854, -156655, -289236, -263171, -93043, -157381, -88868, -23719, 15506, -21819, -6867, -22505, -116040, -223119, -86021, -275474, -62045, 44553, -94235, -154347, 100258, -146785, -47565, -518620, -146517, -32720, -196714, -129193, -57309, -34310, -29785, -326340, -117641, -6483, -79586, -11359, -40749, 161405, -46305, -606938, 108401]
19305b45754J04218G9846k3871a91736f1475I0096d3383C7765K3043K24859e2955
19293b84549g8720B65943i6256b7105A96757i7490I4937K79839c62204A91314
19282c23587B1159c32477J19272c5496j81884c7286j35637d6259j85398F6739
19271b43247h9132B30420a82759b9685n2711j97930F1980c0097j30712A57411
19260C2384g8323j5386B42379a35133l6028g7832j11073F9650d1705A08544A0525
19248c0193j42416g2393J9177k10930M0086B0786b46810G2964K12801b21154A81998
19236g4081j23741b2912j45865G2281A6360a02816P18b6513n7666k7741H6983
19224h6043A38563b73918A18240a6898j18035c7898k27666Q0254A47735e959j21331
$$ y = [-245754, -141536, 79846, 55975, -191736, -61475, 90096, -43383, 37765, 60808, 285667, -52955, -284549, -78720, 265943, -96256, -27105, 196757, -97490, 94937, 374776, -362204, 191314, -323587, 21159, -332477, -213205, -35496, -217380, -37286, -172923, -46259, -231657, 66739, -243247, -89132, 230420, -182759, -29685, -82396, -280326, 61980, -30097, -160809, 157411, 32384, -78323, -93709, 242379, -135133, -171161, -77832, -188905, 69650, -41705, 108544, 10525, -30193, -172609, -72393, -53216, -264146, -224060, 20786, -246810, 72964, 285765, -221154, 181998, -74081, -197822, -22912, -168777, 72281, 16360, -102816, -102098, -26513, -84179, -111920, 86983, -86043, 138563, -273918, 118240, -16898, -134933, -37898, -265564, -185310, 147735, -5959, -127290]
19213a27290j64702b4263j27870A29537A4011O8513P4799o1162j7700J1414k7889
19202F1986a07763A3259A05c98873b2817k31008H6533F520a77597M1921j92650
19191c28326h6770p7593g1718p8661K3035k91872F1742b81180M6080N728B42782
19179d402C96604c32634a18182H2971L1755c70768J37238i0938q3212j0099d0366
19167D5198b9141k25553a20722N4620P566n7132A25119c79897E4891J38714I5466
19155e10145D6261O0820b9147l9617A04879B135a16971N5979A31206J3344R0543
19144B35093a3296n5108j81740a01598R752g928H7869a30847f4957l5727M8212
19133e2472j05026D4523Q3748a65353B42575a10554l22132C7762a98476q9899
$$ y = [-127290, -291992, -24263, -152133, 129537, 14011, 82524, 157323, 96161, 78461, 89875, 61986, -107763, 13259, 105, -398873, -22817, -253825, 86533, 6520, -177597, -135676, -328326, -86770, -164363, -71718, -150379, -127344, -419216, 61742, -281180, -235100, -229372, 242782, -4402, 396604, -332634, -118182, 82971, 114726, -370768, -233530, -90938, -174150, -184249, -40366, 45198, -29141, -254694, -120722, -66102, -58536, -115668, 125119, -379897, 54891, 193605, 95466, -510145, 46261, 107081, -29147, -68764, 104879, 2135, -116971, -60992, 131206, 144550, 235093, -13296, -68404, -250144, -101598, -91846, -7928, 87869, -130847, -64957, -100684, -52472, -157498, 44523, 128271, -165353, 242575, -110554, -432686, 37762, -198476, -288375]
19123b88375B94664A26782f40749D1096b64318b4484F7928L3356g1585B22715
19112c45890J21104J07635B249e9714I4446f3717H5751a41832p6729C5830a00118
19100A26322b26658c8783A49779a33502J2944F7677J40319b47709G224J36575
19090A43799b27267H1084i1039o8226N6759i163E6354a54923e6958l1991q894
19079i7843A52785a3154l7017B8791K74540j41707j6615a48498j21587K039F6062
19067b4725B9796i2418B22032b85015a4812j33322j10629B25069l856j04271d2563
19055B4363a10367p5241I2336k3581b65440c7483A47226a94394g8540J5723l1312
19044i4129B38594m1599a06694k7060j60572a27055g198I364c52377a65917O1220
$$ y = [-288375, 294664, 126782, -640749, 41096, -264318, -24484, 67928, 101284, -71585, 222715, -345890, -224786, -117151, 2249, -59714, 94446, -63717, 85751, -141832, -218561, 35830, -100118, 126322, -226658, -38783, 149779, -133502, -120558, 67677, 207996, -247709, 7224, 143799, -227267, 81084, -91039, -159265, -102506, -9163, 56354, -154923, -56958, -88949, -97843, 152785, -13154, -50171, 28791, 303331, 161624, 145009, -148498, -270085, -268046, 66062, -24725, 29796, -92418, 222032, -285015, -14812, -148134, -258763, 225069, 221213, 116942, -42563, 24363, -110367, -185608, 92336, 68755, -265440, -37483, 147226, -194394, -78540, -62817, -94129, 238594, 196995, -106694, -133754, -294326, -127055, -7198, 9364, -352377, -165917, -104697]
19033a04697A58823E4006a32794H0424J92581e66754a38797O0279B14225d3542
19022a02133C6673J93615f9340I6797C950f7906q4342b2794j07062j02035o1880
19011b93771A68455a52019B09345a27522F1779b41699c1900F4859a63007L1423
19001a31584c3918j26505E3876a04706j03864D9060A6463d1358B96298e1752n3621
18990a05373o525A53669a92836P364D6102a63081C4413i3202c9710j00873B07806
18978b98490a0586A526a39905A02327L10748m0820k7266a7515C26081m2939a57428
18966a12933o0406k27867J35791M7890E1758b22794J2471B86318h4298k27026
18956c11324b5759D4885a1405q6012A38695d5852F8041b23595A54326E3702N4100
$$ y = [-104697, 158823, 54006, -132794, 80424, 273005, -566754, -138797, -78518, 214225, -43542, -102133, 36673, 230288, -69340, 96797, 3950, -67906, -152248, -22794, -129856, -231891, -293771, 168455, -152019, 209345, -127522, 61779, -241699, -31900, 64859, -163007, -131584, -33918, -160423, 53876, -104706, -208570, 49060, 16463, -41358, 296298, -51752, -105373, -111898, 153669, -192836, -185472, 46102, -163081, 34413, -93202, -39710, -140583, 207806, -298490, -10586, 1526, -139905, 102327, 413075, 372255, 344989, -17515, 326081, 283142, -157428, -112933, -173339, -401206, -265415, -217525, 51758, -222794, -210323, 286318, -84298, -311324, -25759, 44885, -11405, -97417, 138695, -45852, 68041, -223595, 154326, 53702, 107802]
18945A07802a88313G0877A5954a19774B95186D9896O9689P6332p1868g1847q9585
18934a61432A56043F4807a55714A5941c1237l9570E4697a71871g8106k8647J6968
18923h9785G7498b25827g4161k29732J05473h0351j3865k9421I2873C7118L278
18912D0396b12392C13295R6089J1123B08065D1984a49218k20354J63163N699j47994
18901c48704j3484a29073r5536a09629j0517J4043k61013B503a56532d7387D1010
18889B35734A05455l2943c3658A01202l2723a68833r4722q1288p9342b0170k37072
18878b57242B6329a19708A10805E4683b4111b780k21639B0892b68867B69831e5331
18866I3321a80818K1793A9383K20074a2588m2518k6374B28626a97639j61044a1344
$$ y = [107802, -188313, 70877, 15954, -119774, 295186, 49896, 119585, 195917, 124049, -71847, -161432, 156043, 64807, -155714, 15941, -31237, -70807, 54697, -171871, -78106, -106753, -89785, 77498, -225827, -74161, -303893, -198420, -80351, -94216, -123637, 92873, 37118, 40396, -212392, 313295, 409384, 420507, 208065, 41984, -149218, -369572, -206409, -200710, -348704, -362188, -129073, -224609, -109629, -120146, -106103, -367116, 2503, -156532, -47387, 41010, 235734, 105455, 72512, -33658, 101202, 68479, -168833, -263555, -344843, -424185, -20170, -257242, 26329, -119708, 110805, 54683, -24111, -2780, -224419, 20892, -268867, 269831, -55331, 93321, -180818, -159025, 19383, 239457, -12588, -55106, -81480, 228626, -197639, -358683, -11344]
18854g9071k65623C09205A53533h0191G0253l4715J90095p9260L811e720p7987
18843h3707B11370H4270b12861O7722C88035A77972c81680I4607c9849q7959M9740
18832g8068c3226B21492D070b12522j35512A1276J46675a76072a6300j76600f2669
18820i1854d0540n0927j36447B99815C2998a42840C3720L8048J7562J7167d8841
18808f0036B16525o4383K9342Q1763a68833i471j07931j06362o940J12945B80052
18796h3826B29436c9313j34593B75336C3601J37101F6867a25203a6154p3132j64802
18785b54088F4118b64830H546a8434j11760o8352j65048J3773a62088i357J776
18774g581l8936A98785E6796b2758k19922J12908k33885h7236k90953g2606A7176
$$ y = [-79071, -344694, 309205, 153533, -80191, 70253, 35538, 225633, 146373, 150184, -5720, -83707, 211370, 84270, -212861, -145139, 388035, 177972, -381680, 94607, -39849, -127808, -78068, -33226, 221492, 4070, -212522, -348034, 11276, 157951, -176072, -16300, -192900, -62669, -91854, -40540, -91467, -227914, 299815, 32998, -142840, 33720, 71768, 89330, 106497, -48841, -60036, 216525, 152142, 181484, 263247, -168833, -9471, -117402, -223764, -230704, -117759, 280052, -83826, 229436, -39313, -173906, 275336, 33601, 170702, 66867, -125203, -16154, -89286, -254088, 64118, -264830, 8546, -18434, -130194, -198546, -363594, -349821, -162088, -9357, -7581, -46517, 198785, 56796, -22758, -242680, -129772, -363657, -87236, -378189, -72606, 17176]
18762b40521A15285C1837h0350j91022i8510B14517b497B908J15026A6375J5976
18751C2351b49362a20121j42727L7378M1280b5281q8565B2133b82927A44009a4199
18739a07936E8411h067l4586J0947j40957B60873D2459M4298a7029I709c44985
18727a39486d8878j13601m677B90121A11117K54333D3367b8795k84924A16412
18716h0929B93010c49522g8531b6126k74017N4827m5991a20798d8511B1398b71592
18704A13389c7538B29477c11145B97072b06807E432O3803A900O5552b12981J5548
18693a97433e4409D9445b64880e8642n6526e4984m58776A50391e6866K6326j74116
18682b04656O966G0968J08554e45394c5711j65161j3748C27311c552H6829b19292
$$ y = [-240521, 115285, 31837, -80350, -271372, -98510, 214517, -2497, 2908, 117934, 16375, 32351, -249362, -120121, -262848, -225470, -184190, -25281, -113846, 22133, -282927, 144009, -14199, -107936, 58411, -8067, -42653, -31706, -172663, 260873, 42459, 86757, -17029, 9709, -344985, -139486, -48878, -162479, -167156, 290121, 111117, 365450, 43367, -28795, -313719, 116412, -80929, 293010, -349522, -78531, -26126, -300143, -245316, -291307, -120798, -48511, 21398, -271592, 113389, -37538, 229477, -311145, 297072, -206807, 5432, 69235, 1900, 67452, -212981, -197433, -54409, 49445, -264880, -58642, -115168, -54984, -513760, 150391, -56866, -30540, -204656, -197690, 70968, 179522, -545394, -35711, -200872, -214620, 327311, -3552, 86829, -219292]
18670b63971a29961h964j47725K6103K8126B10685D8288c2922B63919i2762k14549
18659c07311a52951j08649d2970p9999j73720a44781D5964K29167F9799b27033
18648b4049l76418A91217b79045K366b0755I8517e0219j4040E8881a21091c6153
18636a17444C9337b01229k81311A45969i0961A77364d4263f011D445K711J31674
18625A38830b16148j17402F2361L4928a05053f931A53105I529a33021K55j7602
18614a50368A40382G525M9674P5257c2364B606J03472B7678a56878n0625j8939
18603b26442N685q927B5114a85729r0405A06682c40465g4465O052n71382G3240
18591a34470k456n3533G6388g0777k33203N7258A06785c54470f8372A99810i8780
$$ y = [-263971, -129961, -8964, -156689, -130586, -102460, 210685, 48288, -32922, 263919, -92762, -307311, -152951, -261600, -42970, -122969, -296689, -144781, 45964, 275131, 69799, -227033, -24049, -400467, 191217, -279045, -276679, -20755, 98517, -50219, -64259, 58881, -121091, -36153, -117444, 39337, -201229, -482540, 145969, -90961, 177364, -44263, -6011, 4445, 7156, 138830, -216148, -333550, 62361, 97289, -105053, -6931, 153105, 9529, -133021, -132766, -150368, 140382, 7525, 57199, 132456, -32364, 2606, 106078, 27678, -156878, -207503, -226442, -220757, -229684, 25114, -185729, -276134, 106682, -340465, -74465, -68413, -639795, 73240, -134470, -136926, -190459, 76388, -70777, -303980, -246722, 106785, -354470, -68372, 199810, -98780]
18579A15179a01949D4291a11154A54667b30642D3917j8182F574b427j90844o1942
18568b55213A88930E134c23952H941a70283P3130B5120d35976K07290A40503a04265
18556b33522H6249c1617j72460A31841l7414K92875a32882l4067A46756E2028
18545a45371b6877m3940l27506A31838g7693B02330c0762A00586a65148l25313
18535d90461e769j0962k78027B14814b39498g8348K6512A76633A0305M0773L98013
18524D49091a34905N0763d606m765A24374b56014l1198d6500B3264a90149j7879
18513b08028A58468b84428J29571A7098a2587k41450O1121A51205c9641F5956
18502A39504n0657A2363R2896a23276B327g800m4229A72082a14686H8576l1010
$$ y = [115179, -101949, 44291, -111154, 154667, -230642, 43917, 25735, 6574, -2427, -193271, -255213, 188930, 5134, -323952, 8941, -170283, -97153, 25120, -435976, -228686, 140503, -104265, -233522, 86249, -31617, -204077, 131841, 94427, 387302, -132882, -166949, 146756, 52028, -145371, -26877, -70817, -398323, 131838, -77693, 202330, -30762, 100586, -165148, -490461, -5769, -16731, -294758, 214814, -239498, -78348, -51836, 176633, 10305, 51078, 449091, -134905, -84142, -4606, -9371, 124374, -256014, -287212, -46500, 23264, -190149, -208028, 158468, -284428, -154857, 17098, -12587, -254037, -192916, 151205, -39641, 65956, 139504, 88847, 12363, 105259, -123276, 2327, -7800, -52029, 172082, -114686, 88576, 57566]
18491E7566K55757E391Q3134i9859A51189G3969j1573e5487G5551B0624b8995
18479c96417a89193D763Q303b34890G5376a50151M9765a9149A47328k8531R9508
18468B18305b02127F7307a90904g0875k64720d7087p5084A65407h5389C5027b73756
18456e65469A36905d3377l00817A22568i7675I1887L1357a33920A10743N3291
18446A64034B3930c97648c2113K402j31682j10600A96855H585c41172a758j28113
18435a29871G1223c78488e2721B8217N7909b95754B17754q2856c3499A076a94083
18423h7342j26055A463c56300J51425c7055j44437k72315a72991A70910C8080
18412c0958k72246b1219q0287E3557b6756l67740B05028a0856k40210I3313b7814
$$ y = [57566, 313323, 5391, 88525, -99859, 151189, 73969, 62396, -55487, 75551, 20624, -28995, -396417, -189193, 4763, 13066, -234890, 75376, -150151, -100386, -19149, 147328, 118797, 218305, -202127, 67307, -190904, -70875, -335595, -47087, -122171, 165407, -85389, 35027, -273756, -565469, 136905, -43377, -344194, 122568, -97675, 91887, 123244, -133920, 110743, 164034, 23930, -397648, -32113, -29711, -161393, -271993, 196855, 8585, -341172, -1758, -129871, 71223, -378488, -52721, 28217, 86126, -295754, 217754, 134898, -33499, 1076, -194083, -87342, -213397, 1463, -356300, -204875, -37055, -181492, -453807, -172991, 170910, 38080, -30958, -303204, -21219, -101506, 53557, -26756, -394496, 205028, -10856, -251066, 93313, -27814]
18400A19823b46217n5449a18139d5134q5318N4485b8811k12568e4914I0163a55468
18388c2229A43896c71285D4028K38338F1997f2635D23536c36938e7849n0361C1808
18376a29124b1428m6461A1603b07093j58966b6402B87001a41733N3727A750J11090
18365A12840b9963A65074G290O2427K3642h6984A71518i8912j0540A36982a8824
18353A48114A6329g2995n0511B05596k8014a05721A79812L7310A0458a34062j67701
18342c01763J08550A16712a4837j1993B50848b03741D4437B885h039m6107K451
18331e1695B87312b62170c9343A35535b09193I4733a10178r6669O9368B66936
18320e9287G9892a40148l737D5359p941J75122F8778J20371c19026A4600a24378
$$ y = [119823, -246217, -301666, -118139, -45134, -130452, -75967, -28811, -241379, -54914, 90163, -155468, -32229, 143896, -371285, 44028, 282366, 61997, -62635, 423536, -336938, -57849, -108210, 31808, -129124, -21428, -67889, 11603, -207093, -366059, -26402, 287001, -141733, -88006, 1750, 112840, -29963, 165074, 7290, 69717, 93359, -86984, 171518, -98912, -109452, 136982, -18824, 148114, 16329, -72995, -123506, 205596, 177582, -105721, 179812, 217122, 10458, -134062, -301763, -193213, 116712, -14837, -26830, 250848, -203741, 44437, 2885, -8039, -54146, -51695, 287312, -262170, -39343, 135535, -209193, 94733, -110178, -206847, -137479, 266936, -59287, 79892, -140148, -143885, 45359, 37418, 212540, 68778, 189149, -319026, 14600, -124378]
18308b62135F358J02867i6302J2908B8028b9397k01533a8685j65170M0902G0640
18296d1972j09869M1463A25806a80407j8407K1300j65107J67001A42730g2289
18285C0499K0174g6028A21339J56800a11333m340b2917j54973j08623a11461A2185
18273C55571a87726Q9538G8112a28452j69401E2736P5742J72452c9848A35634
18262d49789A15945J49459a55733B03094b9224E1778b94756a31454D04493a60534
18251I9818R3179G4097a64057H5342J30350j90b03780N5693q7486a7371j5400
18240c2771k07230L293g6279A18031a9585B04258a79186e6663p956j16294b9970
18228i3270A05822B5726f8442B21291b56825B39665c9000B70228B3233O1079B0147
$$ y = [-262135, 6358, 109225, -96302, -83394, 28028, -29397, -230930, -18685, -183855, -142953, 70640, -41972, -151841, -110378, 125806, -180407, -198814, -177514, -342621, -175620, 142730, -72289, 30499, 50673, -76028, 121339, 278139, -111333, -115673, -22917, -177890, -286513, -111461, 12185, 355571, -187726, -98188, 78112, -128452, -297853, 52736, 128478, 300930, -39848, 135634, -449789, 115945, 265404, -155733, 203094, -29224, 51778, -294756, -131454, 404493, -160534, 99818, 192997, 74097, -164057, 85342, 215692, 215502, -203780, -148087, -235573, -17371, -32771, -240001, -236708, -76279, 118031, -19585, 204258, -179186, -56663, -64619, -180913, -29970, -93270, 105822, 25726, -68442, 221291, -256825, 239665, -39000, 270228, 23233, 84312, 20147]
18216a2943I2090e7217j63519M3984B4430K4856k3382d44398A54736c6271j04014
18205a40285k47526B00924A1427K75139a17651l59313f8582o8519l9548m574b2048
18193i9157A00850a51592j51117a38546e0055j29839G0841J21515a93071Q1783
18183a11288M4090H9718a73587B26588j11109a18622P601l6681B38953i7327B7477
18171A42565E7205J51079a44030L5647M6037q1013e1194J8925B50328C2949a76979
18159c4635k5493b3443p6014k37193B27861h3012A78073a52950A81083b79164
18148A91386G2645H102i391l7120A38407a06191j54664A192a43276B15308C2163
18136e0430k01442Q3471F5747l1281a99032g7884B4794r509M7041a89537q9679
$$ y = [-12943, 92090, -57217, -220736, -176752, 24430, 49286, 25904, -444398, 154736, -36271, -140285, -387811, 200924, 11427, 286566, -117651, -476964, -68582, -137101, -176649, -181223, -22048, -99157, 100850, -151592, -302709, -138546, -50055, -179894, 70841, 192356, -193071, -111288, -67198, 89718, -173587, 226588, 115479, -118622, -111021, -147702, 238953, -97327, 27477, 142565, 57205, 208284, -144030, -108383, -62346, -143359, -51194, -32269, 250328, 32949, -176979, -34635, -60128, -23443, -99457, -336650, 227861, -83012, 178073, -152950, 181083, -279164, 191386, 72645, 8102, -9391, -46511, 138407, -106191, -260855, 1192, -143276, 215308, 32163, -50430, -251872, -168401, 65747, 34466, -199032, -77884, 24794, 15285, 62326, -189537, -279216]
18125b79216I717R218a10159j15250F9073J15812c37717H9281K73592o0763a03954
18113e1346j83365r889B45519a74096Q0830k1158r8920B1339b906r5978j35026
18102b33910G6523i7588j88183A08307g8430D8829b52626M8013g5388G3978c1090
18090i0131k16870M8345F9868A7920L843b62154B23005h5917J7480A32348b64295
18078I3192J22131F5263a90736G3951a31298k0434L1929A05711f3776b5339E73154
18066c75979J3810B391K3494a10292J2188A46788a56589A52937a82399c762H7264
18054a6696G8401L26767j01105a07913j96430G3810k9488i0981L9700A7852K09397
18043B27249r1597B8770J30811E5780f2061C43630E7379b46787a18800k0193A37719
$$ y = [-279216, 9717, 18935, -110159, -225409, 69073, 184885, -337717, 89281, 362873, 302110, -103954, -51346, -234711, -244600, 245519, -174096, -93266, -114424, -213344, 21339, -2906, -98884, -233910, 76523, -97588, -285771, 108307, -78430, 48829, -252626, -204613, -75388, 73978, -31090, -90131, -307001, -258656, 69868, 17920, 21763, -262154, 223005, -85917, -68437, 132348, -264295, 93192, 215323, 65263, -190736, 73951, -131298, -151732, -119803, 105711, -63776, -25339, 573154, -375979, -362169, 2391, 25885, -110292, -98104, 146788, -156589, 152937, -182399, -3762, 87264, -16696, 78401, 405168, 304063, -107913, -304343, 73810, 44322, -90981, -51281, 17852, 227249, 135652, 28770, 159581, 55780, -62061, 343630, 57379, -246787, -118800, -138993, 137719]
18031i9091D829a82288n8618C19820g4022B92742E0156i0419a8711o956A5276
18019b97843A21794j271e3631E9394e3062j87032A80276B1473a10350o4279O3323
18008a11306j8552C2932a68003j1867K4260A42293J0052a96382Q1824E3072P0778
17997A23850n6085f5832C8525d2155E0780B5160b63327d3297A89611h5846l788
17986h9634A20573c21330E8053a92849P8601l1952e0825k66148f561A56920L0187
17975A87107p3118k6701a47389B06135b78346I2301r896b11071A02003R9558G4539
17963a97329D16913A57991B2378K23542B2238c952B0852J14347d1689l01302G9258
17951b92605o4275d2438A85267B6081K88675a53711C55005a6209A19147i1769
$$ y = [-99091, 4829, -182288, -240906, 319820, -74022, 292742, 50156, -90419, -18711, -25667, 15276, -297843, 121794, 120523, -53631, 59394, -53062, -240094, 180276, 21473, -110350, -174629, -111306, -129858, 32932, -168003, -179870, -155610, 142293, 152345, -196382, -114558, 53072, 123850, 67765, -65832, 38525, -42155, 50780, 25160, -263327, -43297, 189611, -85846, -89634, 120573, -321330, 58053, -192849, -114248, -146200, -50825, -316973, -6561, 156920, 187107, 113989, 87288, -147389, 206135, -278346, 92301, 82405, -211071, 102003, 201561, 74539, -197329, 416913, 157991, 22378, 245920, 22238, -3952, 20852, 135199, -41689, -342991, 79258, -292605, -356880, -42438, 185267, 26081, 314756, -153711, 355005, -16209, 119147, -91769]
17940I0553K4449a53234B54671a26379r169E9234b31583M0736B2857a30623i805
17928a68510K2710k8285j5121r6581a42097n5463R2670D6952J27530e2469A91096
17916G1226d15814A60364f9960j83388A13341m5847J69277j16994n0606A1179
17905G4724M2726b2894B16611b34975c3360A75634b42370i1582G6201f494A52280
17893a95687D1810b12475a5728B13954c09101A95409g286j59366Q2340B92506
17882a72708j01950A66761b20031a4184I2884A5881a45876E6764k3723D013M4858
17871D8871d08983C8721K08353A15327n19a06592C31229a88427A29685b38465
17860f2962H8763a24651j27127C45207a82742e9597B6151c52319d1002j90796
$$ y = [90553, 115002, -153234, 254671, -126379, -135548, 59234, -231583, -190847, 22857, -130623, -9805, -168510, -145800, -174085, -189206, -285787, -142097, -197560, -104890, 46952, 174482, -52469, 191096, 71226, -415814, 160364, -69960, -253348, 113341, 67494, 236771, 119777, 69171, 11179, 74724, 117450, -22894, 216611, -234975, -33360, 175634, -242370, -91582, 76201, -6494, 152280, -195687, 41810, -212475, -15728, 213954, -309101, 195409, -7286, -166652, -84312, 292506, -172708, -274658, 166761, -220031, -14184, 92884, 15881, -145876, 56764, 33041, 4013, 48871, -408983, 38721, 247074, 115327, 114808, -106592, 331229, -188427, 129685, -238465, -62962, 88763, -124651, -251778, 345207, -182742, -59597, 26151, -352319, -41002, -231798]
17850b31798O3342C5638M32374E144P521R0557e5301j4469j38099E1106a48503
17838a40992f9153H3500B292J86837g9540k87673J19163b6693A44195m6444A9900
17826a55785B28906a48157C14238Q860a06805G1160b76357A93267m3918C532L15200
17815C18732h771A90543a07228A54588k2428l6000a98740R696Q8559A91876b5417
17803D1773J56851c2712A24487A7612K52143j21376C4950J9858f2823H1132g1499
17791a04968j5109G3643a75015A60466i985I7893B3004K40105a76148B06334c5151
17779A9645i1981l8158H4219c3276j52499A30103J63090c0293j05568l0046n826
17768a71733C0315a55519D02666h7806L4378j30589l5507G9244b21388A97825
$$ y = [-231798, -168456, 35638, 468012, 5144, 12665, 103222, -55301, -69770, -207869, 51106, -148503, -140992, -69153, 83500, 2292, 189129, -79540, -367213, -248050, -26693, 144195, 97751, 19900, -155785, 228906, -148157, 314238, 323098, -106805, 71160, -276357, 193267, 149349, 3532, 318732, -8771, 190543, -107228, 154588, 132160, 96160, -198740, -189044, -100485, 191876, -25417, 41773, 198624, -32712, 124487, 17612, 269755, 148379, 34950, 54808, -62823, 81132, -71499, -104968, -120077, 73643, -175015, 160466, -9985, 97893, 23004, 263109, -176148, 206334, -35151, 19645, -91981, -130139, 84219, -33276, -185775, 130103, 293193, -30293, -135861, -165907, -171733, 30315, -155519, 402666, -87806, -53428, -184017, -219524, 79244, -221388, 197825]
17757f84l8132j23750A55487G2432j3432c9018G1084O7450F6211A1954K96002
17746C07956I5792g6036A93900K16780D5064p642g133k4197j98322B086J97114
17735A99200H0978h9804o616C2868J7492L09456j27622a49870B54798H8232K2221
17724A10453a4252m3239k3061C1024J28275a22096a5698k17478N1536L8670J1300
17713a31670A53013a43999e496j4200m0979B09278E2843P5512a63340l9583C59850
17701f5875l0944l5495b2731A22983D9964b1254B15845M4681C3115b42109N2963
17690a89146f9248j34624i1234I8355e8275A69664b00038A10637l9638g9662B703
17678a24042D3551K5867l0326h0072L9173A13555a3153I084K35751A07965D3156
$$ y = [-684, -38816, -162566, 155487, 72432, 59000, -39018, 71084, 138534, 66211, 11954, 307956, 95792, -76036, 193900, 410680, 45064, 37422, -7133, -31330, -229652, 2086, 199200, 80978, -89804, -96420, 32868, 50360, 359816, 232194, -149870, 254798, 88232, 110453, -14252, -57491, -80552, 31024, 159299, -122096, -15698, -233176, -181640, -142970, -131670, 153013, -143999, -5496, -19696, -60675, 209278, 52843, 128355, -163340, -202923, 359850, -65875, -96819, -132314, -22731, 122983, 49964, -21254, 215845, 260526, 33115, -242109, -189146, -69248, -203872, -91234, 98355, -58275, 169664, -200038, 110637, 70999, -79662, 2703, -124042, 43551, 69418, 39092, -80072, -40899, 113555, -13153, 9084, 244835, 107965, 43156]
17666A37262K038e9364C5686K08488b37986I1393K07072K1667M2224c5266A31324
17654D26359D6167b45750B62949A30408g0618G2177b27835E4920a99024I5898
17643E6676N8273Q8383R9352F0312L50644A91008E1939a5537m1506k28384h1978
17631A10881a1154G2433K86241I3567N4888b84966G4274M6627b82477A5009c08969
17619I3338P9253D3812F929L4097J37552Q166J59516A40076F8964k8650K26326
17608B66640a65907B21218j241H9216c0776A1267c59545i3027C2249b8807C3404
17596a21524E5834J03839n621n969K78207A54541a00936A56288e474j9574k1761
17585d6809q1469E6532J13771a75951C3450H113k846M0957E505J33696l1771D6021
$$ y = [137262, 139300, -59364, 35686, 244174, -237986, 91393, 298465, 320132, 362356, -35266, 131324, 426359, 46167, -245750, 262949, 130408, -70618, 72177, -227835, 54920, -199024, 95898, 56676, 114949, 203332, 302684, 60312, 410956, 191008, 51939, -15537, -57043, -285427, -81978, 110881, -11154, 72433, 358674, 93567, 148455, -284966, 74274, 120901, -282477, 15009, -308969, 93338, 172591, 43812, 6929, 41026, 178578, 186744, 346260, 140076, 68964, 40314, 266640, -165907, 221218, 219977, 89216, -30776, 11267, -359545, -93027, 32249, -28807, 33404, -121524, 55834, 159673, 154052, 148083, 426290, 154541, -100936, 156288, -5474, -25048, -46809, -128278, 56532, 170303, -175951, 33450, 8113, 5267, 46224, 5505, 139201, 107430, 46021]
17572A86551c37171C72638j75388A4439N2926J05498G6285R2234k2253K8385h8019
17560E16181d5300C35150q0696a4565k43364J07915A05349R2318a84886A43505
17549B35017q4277b09789A77996C4085L09412j13023j12592B4470L83141a29j9532
17538a9661A03316E0985K04784b07585C41323B9675J84302B5979K51209B408K10291
17527B12699J70747m8048L21632j34912L51249j91539K81683m32468Q53j66786
17517C65110H9820L48270j35538m7715K9876H7425B9938K66500M03909m8629P7564
17506G29282k49991k26513J5006L22659A80161L03710k01280r1020K67871A37535
17495C26332q92E2867J78887e823A72333L24609I3455J00980J4447J81849A44048
$$ y = [186551, -337171, 372638, 197250, 14439, 67365, 172863, 76285, 168519, 146266, 174651, -88019, 516181, -45300, 335150, 254454, -14565, -257929, -150014, 105349, 197667, -184886, 143505, 235017, 150740, -209789, 177996, 34085, 343497, 230474, 117882, 24470, 407611, -129, -19661, 103316, 50985, 255769, -207585, 341323, 29675, 213977, 25979, 277188, 2408, 212699, 383446, 335398, 657030, 522118, 873367, 681828, 963511, 531043, 531896, 365110, 89820, 438090, 302552, 254837, 284713, 87425, 29938, 296438, 700347, 651718, 729282, 479291, 252778, 267784, 590443, 180161, 483871, 282591, 191571, 459442, 137535, 326332, 325440, 52867, 231754, -5823, 172333, 496942, 93455, 194435, 208882, 390731, 144048]
17483C18475j36149O5687a9641C48810J42935D4928J73752j3330b0847D43201
17472B55773n4346o5498K72906a72978C85273I9230J5221K44900o6171j3688c127
17460f0284D28173k00288K29444p3262a83277B4502K78899K26820k17689F3496
17449D19978R9422k58825A17196J22143J80708D5205P38816B31046j13125L17963
17439D35884k7221A00543K75599r2740m5354J98130B05212m2039O6228M5768P8906
17428C54075r9432j17304J02005J4433I5249K30446J63243B38495F5312J57717
17418B23029J72354j58786M6844A25579M67276L1322l07115J14260q1738H6971
17407a24054H6308A7206K56717C1217L8024K8218R7622n7569K56905A17682j6451
$$ y = [318475, 182326, 248013, -19641, 348810, 491745, 44928, 218680, 205350, -20847, 443201, 255773, 201427, 135929, 408835, -172978, 385273, 99230, 114451, 359351, 293180, 279492, -3127, -60284, 428173, 227885, 457329, 384067, -183277, 24502, 303401, 530221, 312532, 63496, 419978, 519400, 260575, 117196, 239339, 420047, 45205, 784021, 231046, 117921, 435884, 408663, 100543, 376142, 283402, 238048, 436178, 205212, 163173, 229401, 275169, 354075, 254643, 137339, 239344, 253777, 95249, 325695, 488938, 238495, 65312, 223029, 395383, 236597, 283441, 125579, 592855, 624177, 317062, 431322, 349584, 86971, -124054, 86308, 17206, 273923, 31217, 69241, 97459, 195081, 137512, 394417, 117682, 101231]
17396A01231N8334B096J22277J71747a17433B12769b28942G0531L28223A86105
17385B77588Q722R5228J15695C2209L55735n9690j1617j49818M28787j57173f2707
17373f3976B19520G3651J0916M7208J51641f311A10165L8129J54083B8461K77175
17362C05636E136J62290G2056J05384J79903l7052B2668e7880H719L69595j27285
17351B51029J97928a8732j14873B08967l4121M21242k83901f1084F5533J14492
17341A80025Q3825L7992i4681A1613J55163h9727D17463r8807j02974h6363A0662
17329B31360D4484K70125e8908B75149J20455j48934l4729a0064C15209A02487
17318H7306J39155G0320K83260I9887J92637q1682J37494p6173J79579m5703J89520
$$ y = [101231, 159565, 2096, 124373, 296120, -117433, 212769, -228942, 70531, 398754, 186105, 277588, 286310, 381538, 497233, 32209, 387944, 328254, 316637, 166819, 595606, 438433, -62707, -63976, 219520, 73651, 84567, 131775, 283416, -6311, 110165, 148294, 302377, 28461, 305636, 5136, 167426, 72056, 177440, 357343, 320291, 22668, -57880, 8719, 378314, 251029, 448957, -18732, -133605, 208967, 174846, 596088, 312187, -61084, 65533, 180025, 263850, 301842, -94681, 11613, 166776, -89727, 417463, 318656, 215682, -86363, 10662, 231360, 44484, 314609, -58908, 275149, 395604, 246670, 211941, -10064, 315209, 102487, 87306, 226461, 70320, 353580, 99887, 292524, 210842, 348336, 272163, 451742, 406039, 595559]
17307E95559k85117n8285m8709J6677L52766k32823c4314a5820D05940h492D63208
17295D26703m0011n8297G6839J45888K17931A09601K24295A60282K32132M5314
17285D37728q9942j52388J16293p2647K27092H2219J75561m9789p6206J98361
17275C30146i4082I2465Q6955p0387J73332o954N5424a40771A58954Q4962M9022
17264B92938n7860q7917J05589K8858R7406A17930J92079G6877M01362k11710
17254B66529l217N0895l3280H170L05776J72647j70684j20696J18953a7584D92498
17242B61999K60310k26559J38852o4265j06169c7263E17462A4528h9664A76007
17231B26900m399J56273j71334M14285j47203B05305P7949J56912j43556J3372
$$ y = [595559, 310442, 252157, 203448, 220125, 572891, 340068, -34314, -15820, 405940, -8492, 463208, 426703, 386692, 328395, 76839, 222727, 440658, 109601, 333896, 160282, 392414, 437728, 347786, 195398, 311691, 239044, 466136, 82219, 257780, 207991, 131785, 330146, -94082, 92465, 179420, 109033, 282365, 275411, 330835, -140771, 158954, 243916, 292938, 235078, 147161, 252750, 281608, 379014, 117930, 310009, 76877, 478239, 266529, 263312, 314207, 280927, 8170, 313946, 486593, 315909, 195213, 314166, -17584, 492498, 261999, 522309, 295750, 434602, 370337, 264168, -37263, 517462, 14528, -89664, 176007, 226900, 222501, 378774, 207440, 621725, 474522, 205305, 283254, 440166, 296610, 309982]
17221C09982l795j32554p2205K45734K01888r8776G0059N16576q7256E571J18404
17210A23975M57275j31828j43571J3503J15648K02025A41731M32795B64922P068
17200B71990J28831r3707O1069l2079L17477B69514n7080q2204J37042J55781
17190D23053L39652l21842A87675n9998M63742B53616M9124j34439K06479K45960
17180F20740C06373j40323L21372B11984J79288m0515O864J10976B29047J49141
17170C78188o6626F3752L21927k8600J63698E4236F760K29361M64548l04224K1955
17159D18400j18005r8653I9646K66272O9237k3811J60937j22111J06521j69216
17149C87475O5941N023Q9704k06493J37165J62927k29722O2615J66878B58014
$$ y = [309982, 306187, 173633, 101428, 347162, 549050, 450274, 70059, 586635, 499379, 5571, 123975, 581250, 449422, 305851, 319354, 435002, 637027, 141731, 574526, 264922, 271990, 400821, 307114, 368183, 336104, 653581, 269514, 212434, 130230, 267272, 423053, 762705, 440863, 187675, 127677, 591419, 253616, 302740, 168301, 374780, 620740, 306373, 166050, 487422, 211984, 391272, 350757, 357621, 468597, 229047, 378188, 311562, 63752, 385679, 357079, 520777, 54236, 6760, 236121, 700669, 396445, 418400, 300395, 201742, 99646, 365918, 435155, 411344, 572281, 450170, 556691, 387475, 453416, 458439, 548143, 341650, 478815, 641742, 412020, 474635, 641513, 258014]
17138A88311L34016K04411A09701M95546j56294m431n7041J04208j87581K29233
17128E33341r3091J07178k30045J80604n527j26651O9748L19547B94565K11919
17118E06484o9118K96107B68649K92395k10072m2361M7668K51963K13024k03055
17108F18211j66508j29736J96965j69662P6262l9952P9928l2198M17884C33786
17097B15634K88414J82599J3183C34547J22459K73922k5195j13685k78388J26914
17087D40574K05391p9352j8380J20039K903k23080M61732k98930k64487M74156
17077H20566l0107l88529K52793J71717j45178Q9533j60950A79118F7296N62156
17067F29452M0782J59443p630j72011k57964J59820J74430J98647k56898q9302
$$ y = [188311, 522327, 726738, 109701, 605247, 448953, 444522, 387481, 491689, 304108, 533341, 440250, 547428, 317383, 497987, 492460, 365809, 435557, 755104, 294565, 506484, 437366, 733473, 268649, 561044, 350972, 308611, 356279, 608242, 821266, 618211, 451703, 321967, 518932, 349270, 425532, 385580, 465508, 433310, 851194, 333786, 215634, 504048, 686647, 699830, 334547, 457006, 730928, 705733, 592048, 313660, 440574, 645965, 566613, 548233, 668272, 671175, 448095, 909827, 610897, 346410, 820566, 790459, 401930, 654723, 826440, 681262, 770795, 609845, 179118, 67296, 629452, 670234, 829677, 822047, 650036, 392072, 551892, 726322, 924969, 668071, 578769]
17057E78769L44140l25630J82102M62792l12890r0687J17697k25847M26733l70462
17047G86717o7405K79622k2449j75853J67276j51249C59280M47434j25735K28709
17037I09688j76333K0586n483J93031J31262P1457m18523J03547j9891q6928J55809
17026H78222O7710n5156o8366J22048j53368p0139M77005l50802L9530k82957
17016F03727N70826k08612j94883L13276k49231k26444O02629j64341O5880k58193
17006H54634r6093J22107N38246k90172m4248k6029o3673J14154j23316k3210
16996I62400o597K02503j55242J23874K0985j96397J57249J43731j48997N2327
16986A155836j93994M34936l7105j66725J7958j3359k33915L98081m7930j03082
$$ y = [578769, 922909, 597279, 779381, 1242173, 929283, 838596, 956293, 730446, 1157179, 786717, 719312, 998934, 976485, 800632, 967908, 816659, 359280, 806714, 680979, 909688, 733355, 753941, 748458, 941489, 1072751, 1144208, 725685, 829232, 809341, 722413, 878222, 945932, 890776, 822410, 944458, 791090, 720951, 1197956, 847154, 886684, 603727, 1174553, 965941, 771058, 1084334, 835103, 608659, 1211288, 1046947, 1112827, 854634, 758541, 880648, 1418894, 1128722, 1084474, 1058445, 994772, 1108926, 985610, 962400, 955803, 1158306, 1003064, 1126938, 1147923, 951526, 1108775, 1252506, 1103509, 1155836, 961842, 1396778, 1359673, 1192948, 1210906, 1197547, 963632, 1361713, 1313783, 1210701]
16976A210701K8017L90621l77078j81362M66335k44732J35336m61886O41329m02436
16966A204845J71089p0165J5547q9216L1427k2747K64312J605J87119j24050j39077
16955A430689J72585j36886O3796k12859O5548m7225K47002J2435r7035k66188
16945A231862L76310K10287j50619m2465m245K15376n7827P4617j42625j89167
16935A521504M3839K06785K47996m16718J04762P6802L56882k58062m2635K36762
16925B077917K76595j42006k74878L82530j08651j28786j66003J73446J20911
16916B211075j11049o2273L79038k51574Q523J65699J75173k21425M36750n60437
16906B169500J09518P4181J35459J0268k41676l8838L98096L6355l56906N47460
$$ y = [1210701, 1238718, 1629339, 1252261, 1070899, 1537234, 1292502, 1427838, 965952, 1607281, 1204845, 1375934, 1305769, 1321316, 1232100, 1263527, 1240780, 1505092, 1506697, 1693816, 1569766, 1430689, 1603274, 1466388, 1530184, 1317325, 1382873, 1335648, 1582650, 1595085, 1498050, 1231862, 1608172, 1818459, 1667840, 1625375, 1621130, 1836506, 1778679, 1853296, 1710671, 1521504, 1565343, 1772128, 2020124, 1603406, 1708168, 1784970, 2141852, 1883790, 1841155, 2077917, 2354512, 2212506, 1937628, 2320158, 2211507, 2082721, 1916718, 2090164, 2211075, 2100026, 2037753, 2416791, 2165217, 2173740, 2339439, 2514612, 2293187, 2729937, 2169500, 2279018, 2353199, 2488658, 2498926, 2257250, 2218412, 2616508, 2652863, 2295957, 2843417]
16896B843417J214n3640P0029o595j15343L33195k42506L10848Q4842m6633N2108
16885C230936q1330j11448J09618M1832L0838k7038J69228J56555K0222M8817
16875C588230r338j04270K79148J56059N0124l45087J4157k6403L22806L41581
16865D267007l78909K44807J7702J4814n7037J29055N14844l30696J42379M10393
16855D974359m75811J87898K97303l4576n5466L62365k58430K07962o5457Q7031
16845E227178L80952R092K49542j94337J21474L86872K45602j32185L03768k68908
16835F329050K68205k08604M57802o3758K21392n8590K22974J78504k2636R4254
16825G418593M80880m45941M45060R0970O78556j06606l02677P60608m0897M55429
$$ y = [2843417, 2844631, 2790991, 2861020, 2854425, 2739082, 3072277, 2829771, 3140619, 3225461, 3178828, 3230936, 3149606, 3038158, 3147776, 3189608, 3220446, 3193408, 3362636, 3519191, 3539413, 3588230, 3578892, 3474622, 3753770, 3909829, 3959953, 3614866, 3629023, 3602620, 3925426, 4267007, 3888098, 4132905, 4150607, 4165421, 4108384, 4237439, 4752283, 4421587, 4563966, 4974359, 4498548, 4686446, 4983749, 4949173, 4893707, 5256072, 4997642, 5205604, 5140147, 5227178, 5608130, 5617222, 5866764, 5672427, 5793901, 6180773, 6426375, 6294190, 6597958, 6329050, 6597255, 6388651, 6846453, 6782695, 7004087, 6945497, 7168471, 7346975, 7324339, 7418593, 7899473, 7453532, 7898592, 7989562, 8668118, 8561512, 8258835, 9019443, 8978546, 9433975]
16815I433975K19867n3943O3960L99511j86948M6031K86288P63093M0927L39135
16805A1351896L38599J67440J66851K44535L47156K00962M61063l5659P75008
16796A4017851J70451M68194M9131J50850O65309Q16580j9429N23959N70071L53209
16786A7766176M93815N92817N37859N88354J45037R23144L15586P62347L30055
16777B2455190P86135J013057Q37177O72569N29203R89951Q94504O04316Q64625
16768B9646727J278888Q73424J029886R12994J300360J330877J292788J123714
16760C8789658J500304J281165J457144J596958J231496K043783J679479J589999
16752E1169986K115300J797999J980231K224422J792991K305875K071430K556058
$$ y = [9433975, 9653842, 9599899, 9663859, 10063370, 9876422, 9922453, 10208741, 10971834, 11012761, 11351896, 11690495, 11857935, 12024786, 12269321, 12616477, 12817439, 13278502, 13242843, 14017851, 14188302, 14656496, 14705627, 14856477, 15521786, 16338366, 16318937, 16842896, 17412967, 17766176, 18259991, 18852808, 19390667, 19979021, 20124058, 21047202, 21362788, 22125135, 22455190, 23241325, 24254382, 25091559, 25764128, 26293331, 27283282, 28177786, 28782102, 29646727, 30925615, 31799039, 32828925, 33741919, 35042279, 36373156, 37665944, 38789658, 40289962, 41571127, 43028271, 44625229, 45856725, 47900508, 49579987, 51169986, 53285286, 55083285, 57063516, 59287938, 61080929, 63386804, 65458234, 68014292]
16744F8014292K288884J836640K894400K729305K359191K451512K490762K457983
16736H7522969K284475K344683K637431J932360K190313K398009J796384J589962
16728A04696586J573234J001450J238859O74731O80586K80258K47615j85002l63010
16719A09845307j098928p36415j094669j408332j988203j575105k076152k155811
16711I7711692k270348j976303k418667k487847k078797k798958k429298k831422
16703G8420052k396217k074759k789521k018920k196063k500106j780291k368843
16695F0295332k125784k019970j619300k094029k111222j610234j658870j264580
16687D5791343j294773j675794j313131j460545j353047j417075j217798r07635
$$ y = [68014292, 70303176, 72139816, 75034216, 77763521, 80122712, 82574224, 85064986, 87522969, 89807444, 92152127, 94789558, 96721918, 98912231, 101310240, 103106624, 104696586, 106269820, 107271270, 108510129, 109184860, 109865446, 110145704, 110393319, 110208317, 109845307, 108746379, 108009964, 106915295, 105506963, 103518760, 101943655, 99867503, 97711692, 95441344, 93465041, 91046374, 88558527, 86479730, 83680772, 81251474, 78420052, 76023835, 73949076, 71159555, 69140635, 66944572, 64444466, 62664175, 60295332, 58169548, 56149578, 54530278, 52436249, 50325027, 48714793, 47055923, 45791343, 44496570, 42820776, 41507645, 40047100, 38694053, 37276978, 36059180, 35151545]
16679C5151545j116339q48937j244392j025486j217532n00893r56568q89141r38333
16670B6413924m69144n17832j040594j066504l79239m63607p55402l44106n90475
16661B0787021j079346m05261l14383m75259n41383l20880l40508n84922k90515
16652A6434564k98767n13499m37198k57396o02896l40226K9424j63799n06512
16643A3343695n13145j51157m52767j60529k68554Q9539m15948j02089j65597
16634A1203448m07746k79632j5177l86336j08545q6266l28614j4635l18568J14929
16624I372858l01694n77018J88951O4906m00921m35838k04192J86360k97269j5632
16614G580511j94093j00375N0718j42991K781j85765n82414J35398k18569q1451
$$ y = [35151545, 34035206, 33186269, 31941877, 30916391, 29698859, 29197966, 28241398, 27352257, 26413924, 25944780, 25426948, 24386354, 23319850, 22940611, 22477004, 21721602, 21377496, 20787021, 19707675, 19302414, 18988031, 18512772, 17971389, 17650509, 17310001, 16725079, 16434564, 16135797, 15622298, 15185100, 14927704, 14324808, 13984582, 14014006, 13850207, 13343695, 12830550, 12679393, 12226626, 12066097, 11797543, 11887082, 11471134, 11369045, 11203448, 10795702, 10516070, 10500893, 10114557, 10006012, 9919746, 9591132, 9576497, 9257929, 9372858, 9071164, 8494146, 8683097, 8748003, 8347082, 7911244, 7707052, 7893412, 7596143, 7580511, 7386418, 7286043, 7336761, 7193770, 7196551, 7010786, 6428372, 6563770, 6345201, 6263750]
16604F263750m3207j6259M8967l22548J80024k094k62968L0046l13475J4914j52039
16593E425111J20637j89468J88980m80630p0715M77411n21863k08955r2391L54760
16583E002877k49112k30441J77781j49547l73052J41725j3663Q6075l05119J85362
16573D272886k57634J03198k2723K62531m18862l8483k35353J96966K68390k87705
16563C843211j46826J59123n64521K40413J32641k9356k722L8334n51302L53378
16553C472373l64107K31725L8969J08092k97382j87666J84142j95649k26147L56170
16543C120520n0351m33108M72368o716l58015J9441J51827k54201P0797j20775
16533B611787m6250L07105k68732m7849K43270m0570j89586L52426l10741o1300
$$ y = [6263750, 6220543, 6204284, 6253251, 5930703, 6110727, 6108633, 5845665, 5875711, 5562236, 5577150, 5425111, 5545748, 5356280, 5545260, 5064630, 4993915, 5471326, 4949463, 4740508, 4648117, 5002877, 4753765, 4523324, 4701105, 4551558, 4178506, 4320231, 4306568, 4392643, 4087524, 4272886, 4015252, 4118450, 4095727, 4358258, 3939396, 3900913, 3665560, 3862526, 4130916, 3843211, 3696385, 3855508, 3290987, 3531400, 3664041, 3634685, 3631963, 3670297, 3118995, 3472373, 3108266, 3339991, 3378960, 3487052, 3189670, 3002004, 3186146, 2990497, 2764350, 3120520, 3070169, 2637061, 3109429, 3102713, 2744698, 2764139, 2915966, 2661765, 2732562, 2611787, 2565537, 2872642, 2603910, 2556061, 2799331, 2758761, 2569175, 2921601, 2610860, 2549560]
16523B549560K7372k74051k55612L33909r1007l24454L78287k4856M9729l76857
16513A992020K08492P8096m0981j41286J37269l13231K57701o5092n226J02945
16503B210707k03398j72081K01729j58728J40063L19761j51603j33996j49743
16494A902711P9167k27612J93566K82113n48495K08193J50116n18896J07233M44742
16484B072838j93819J64488j87389M4452j76107K2797j38239J9210J52316j42895
16474A637652j96458K00805j39269r240K40059J88998k53984k60155K56020m94703
16464A169725O52408j93349l41938Q2898J16958q2103q490K80874J1276j55876
16454A532383k33168p8929l5225M84294k42422q0635P5664j94617J5032K06850
$$ y = [2549560, 2576932, 2302881, 2047269, 2381178, 2290171, 1965717, 2344004, 2319148, 2368877, 1992020, 2200512, 2278608, 2237627, 2096341, 2233610, 1920379, 2178080, 2112988, 2107762, 2210707, 2007309, 1835228, 2036957, 1878229, 2018292, 2338053, 2186450, 2052454, 1902711, 1981878, 1754266, 1947832, 2229945, 1681450, 1889643, 2039759, 1520863, 1628096, 2072838, 1879019, 2043507, 1856118, 1900570, 1724463, 1747260, 1609021, 1628231, 1780547, 1637652, 1441194, 1641999, 1502730, 1493490, 1733549, 1922547, 1668563, 1408408, 1664428, 1169725, 1822133, 1628784, 1286846, 1369744, 1486702, 1404599, 1396109, 1676983, 1688259, 1532383, 1299215, 1220286, 1185061, 1669355, 1426933, 1346298, 1421962, 1227345, 1242377, 1449227]
16444A449227j35283l6871J59623j6357j72493j09365l5565L84241k92036K4832
16434A219953K66407j22204k56047k00765K83581k44441K79169l25575J57710
16425A057788k99286N97287k59977K79525j35748k1394J48813m21968J72836J20018
16415A237894N579q6184k61601o9603M13440j16109L9256l44135J789N7743J50988
16404A029057j08084K03943j47691J60654j71261p6590p239j9887M4350J4314
16394I21566j13519K18062o4266Q3475k03958k6612J56915K45297l23442J24681
16384A018199q9369J4874j4278o2723J18762r6917j31897Q9565J35840k11850
16374G70206M1492q8353K08267r8647K68284L5262k36289n1902Q8811j60262L85359
$$ y = [1449227, 1313944, 1277073, 1436696, 1420339, 1247846, 1138481, 1102916, 1487157, 1195121, 1219953, 1486360, 1364156, 1108109, 907344, 1190925, 946484, 1225653, 900078, 1057788, 758502, 1355789, 1095812, 1375337, 1239589, 1218195, 1367008, 945040, 1117876, 1237894, 1243473, 1157289, 895688, 826085, 1239525, 1123416, 1162672, 818537, 820326, 878069, 1029057, 920973, 1124916, 977225, 1137879, 966618, 890028, 882789, 862902, 907252, 921566, 808047, 1026109, 961843, 1045318, 841360, 814748, 971663, 1216960, 893518, 1018199, 928830, 943704, 929426, 866703, 985465, 888548, 756651, 846216, 982056, 770206, 811698, 723345, 931612, 832965, 1101249, 1136511, 900222, 848320, 937131, 776869, 1162228]
16363A162228n42460L61103j93073l01834L04661j3149k3872k43552J25651N20738
16353A156441k94093l85931K19027M90303j60010D47231M06180l24138K75056
16344H04329l3590m0262j5041j48853k5375k9056K32000M7507J0384j56217k07241
16333D38585L05026k66647j14108K30287m9852j13594K83849L1470p716L7470
16323G74770p7078J34687k20885O2620j13394K88794k56927J35396J993q9673
16313F40303K3157P553o8530j05700M49693m26140J86925m082k97121K93539J70581
16302H70178l09174J19065j21040j07905J48716p7975Q2780L00419k60399K10466
16292H55131j08930j22383j28507J59255k41936M11979Q1603C89822M2564K85541
$$ y = [1162228, 619768, 980871, 787798, 485964, 790625, 777476, 753604, 510052, 635703, 1156441, 862348, 476417, 695444, 1185747, 1025737, 447231, 853411, 529273, 804329, 770739, 730477, 715436, 566583, 541208, 512152, 744152, 791659, 802043, 645826, 438585, 743611, 476964, 362856, 593143, 543291, 429697, 713546, 745016, 737300, 774770, 697692, 832379, 611494, 674114, 560720, 849514, 592587, 727983, 729976, 640303, 663460, 671013, 602483, 496783, 946476, 520336, 707261, 703179, 406058, 699597, 870178, 561004, 680069, 559029, 451124, 599840, 521865, 604645, 905064, 644665, 855131, 746201, 623818, 495311, 654566, 412630, 824609, 906212, 389822, 432386, 717927]
16282G17927Q9833k23129K08155C77677L31881p4446J7054B87239N3133O9348
16272D09720M46288l37227L9651j70315L53452P2392l95356J44738k81288j8130
16262B63925M16844j28240k12009M696j11482K01384J61787j06487j94406K29776
16252E25788j95378k3672L1452L5495L4456L6968j59785L98454j61411k30614
16242B91753J7814J64065B27032J52306A47506L39548B19227K07439j6509r160
16232D00997Q3697j35171j61549J07587J38622r4923r0104K23584P8086B59993
16221E65772B59385L46995A13664N63135k39402A45791e7939C05410o8428L07480
16211E44462A76127Q0374K81898q0156J19224o0291J49549k98006O0083p0303
$$ y = [717927, 807760, 584631, 792786, 377677, 709558, 635112, 652166, 287239, 340372, 409720, 856008, 518781, 558432, 388117, 741569, 813961, 418605, 563343, 282055, 263925, 680769, 552529, 340520, 345216, 233734, 435118, 596905, 490418, 296012, 525788, 330410, 306738, 338190, 373685, 408141, 445109, 285324, 683778, 522367, 291753, 309567, 473632, 227032, 379338, 147506, 487054, 219227, 426666, 410157, 400997, 484694, 349523, 187974, 295561, 434183, 339260, 249156, 472740, 550826, 259993, 565772, 259385, 606380, 113664, 676799, 437397, 145791, -57939, 305410, 236982, 544462, 176127, 256501, 538399, 458243, 577467, 517176, 666725, 368719, 428802, 358499]
16201C58499J87811B62842j28975K58450J81016A80337J55886j18610L14083k7335
16191E04361k11089o2580k0944Q6483i7209C49461j1844Q9971J49315l6176B56042
16179B21624J20657j08484M40567C29930L4786m4129O4669J11322k16154A38263
16168B63443J83506A24873K89491j64184o9277K17509A23007N7925k9830K58728
16158D09830f9435B55662A22315L38280k01303J28638A43388L18857k02670K82970
16148E42545B32956Q6819P7074J50293k71285m5277R7592F4129n628J13513K86683
16137D58697A18060L51657A1203J59559R0593Q4726J79344A64920C2489L13558
16127C46047g9928B87065A05846J84322L2478M2073l7463j25898N9833f5323A00137
$$ y = [358499, 546310, 262842, 133867, 392317, 573333, 180337, 336223, 217613, 531696, 504361, 293272, 230692, 209748, 296231, -97209, 349461, 337617, 427588, 576903, 540727, 256042, 221624, 342281, 233797, 674364, 329930, 364716, 320587, 385256, 496578, 280424, 138263, 263443, 446949, 124873, 414364, 250180, 180903, 398412, 123007, 180932, 151102, 409830, -69435, 255662, 122315, 460595, 259292, 387930, 143388, 462245, 259575, 542545, 232956, 319775, 396849, 547142, 275857, 230580, 328172, 64129, 58501, 172014, 458697, 118060, 469717, 11203, 170762, 261355, 346081, 525425, 164920, 32489, 346047, -79928, 287065, 105846, 290168, 322646, 364719, 327256, 201358, 261191, -65323, 100137]
16115D6297J51981f2728D6656J10012p4551K00161K25593b82476A25823J5551
16105A41374K03580j15197M7521J40614F9033L49724n8301m9544i7929B13515
16094B30179j127N9823C6068K01436N2509n2969C4705K50991p7614F5056M26367
16083D91423B36665m7940q3603J02980k1597m3559d8543A85734J1338c4888g504
16071A91228e9303K0953j03963D55223c3785B760L25696q1334E4628a72983A98751
16059I5512m7399i5828D67171A32983k3956N6087d04926i6401a8473p8621B46590
16047B09932a48125B37071K17073G8271C2468g242b792B31676a24401A98862b2005
16035D4239L8486O2094A0484N41008B41718q2397o0784D0502K09370D5873L20889
$$ y = [46297, 198278, -62728, 46656, 156668, 82117, 282278, 507871, -282476, 125823, 141374, 344954, 229757, 277278, 417892, 69033, 418757, 360456, 310912, -97929, 213515, 230179, 229052, 288875, 36068, 237504, 290013, 237044, 34705, 285696, 208082, 65056, 491423, 236665, 188725, 105122, 208102, 186505, 142946, -48543, 185734, 197072, -34888, -7504, 191228, -59303, -38350, -142313, 455223, -33785, 2760, 328456, 247122, 54628, -172983, 198751, 95512, 48113, -95828, 467171, 132983, 109027, 165114, -404926, -96401, -18473, -97094, 246590, 209932, -148125, 237071, 454144, 78271, 32468, -7242, -2792, 231676, -124401, 198862, -22005, 44239, 82725, 144819, 10484, 551492, 241718, 159321, 98537, 40502, 249872, 45873, 366762]
16024C66762H5268K12371b8375A47486O7355K7045b45923J05247b0049k39620
16014b59669A48429A0396O2954P5138b4656o9867B08659a30684B17866M4985g7401
16002A49582L19668d1541j544A75816a71754C28179A6629A67L04967b72761B7548
15990C05214j06278M13478r8266L66551J86861J56024R2985j78740m38933k92644
15980D06252j34057J43148E9264K04219a1672j46302B05759b67212E0603L11483
15970C62086a74900A8865a04543A47114d4382A47557B9878a08286j27357e1894
15959B67891a14504A13568J5902D251a12814j1445j10940A57003D7837J67905
15949B15742f0811A92447h2013l071c0582k9926A2373c52397J24184e9109B68687
$$ y = [366762, 85268, 297639, -28375, 147486, 214841, 241886, -245923, -140676, -20049, -259669, 148429, 10396, 73350, 148488, -24656, -94523, 208659, -130684, 217866, 262851, -77401, 149582, 469250, -41541, -43085, 175816, -171754, 328179, 16629, 167, 305134, -272761, 27548, 305214, 198936, 612414, 514148, 880699, 1067560, 1223584, 1316569, 1137829, 698896, 406252, 272195, 415343, 59264, 263483, -11672, -157974, 205759, -267212, 50603, 362086, -174900, 18865, -104543, 147114, -44382, 147557, 29878, -108286, -235643, -51894, 267891, -114504, 113568, 129470, 4251, -112814, -124259, -235199, 157003, 47837, 215742, -60811, 192447, -82013, -85084, -30582, -60508, 12373, -352397, -228213, -59109, 268687]
15937H4924J18351J5204D0618O7645J1235d9292E8867J67534a55889A7874Q8342
15926A06216K83415e0887E2191L7682B1821i3750j02306A06788a27062l14413
15916d41475A15635K70187A02861b30780C06339j52653B7127G228M48446a38363
15905F5463c1078I1796D493J68355g6425F3943I924J58203a05914a2710m9818
15894f2528F3720J4735k9926K69851b19637R7611A17120a40270H9597K43462H2474
15882D67155B6067b29907a3049A44721a12992A5167Q3080a43958e6500m9489f148
15870A50971M9851a0414j7334B73335A01753K00251d4700B06998f9856j26348
15860a96204I1789h4725j58128h3923D9879a20668A24479d2569m3210l01207J85170
$$ y = [84924, 203275, 218479, 40618, 108263, 119498, -49292, 58867, 226401, -155889, 17874, 106216, 389631, -50887, 52191, 89873, 21821, -93750, -196056, 106788, -127062, -441475, 115635, 385822, 102861, -230780, 306339, 153686, 27127, 7228, 455674, -138363, 65463, -31078, 91796, 4493, 172848, -76425, 63943, 9924, 168127, -105914, -12710, -62528, 63720, 78455, 48529, 318380, -219637, -122026, 117120, -140270, 89597, 333059, 82474, 467155, 26067, -229907, -13049, 144721, -112992, 15167, 98247, -143958, -56500, -105989, -6148, 150971, 200822, -10414, -27748, 273335, 101753, 302004, -44700, 206998, -69856, -196204, 91789, -84725, -242853, -83923, 49879, -120668, 124479, -42569, -85779, -386986, -201816]
15849b01816A83680i8960j05156F5634d16879h2655j4350D9150J50941g8906B54
15837a60970A26438a83532B42K959a53585C32761j17660M6779a71374Q0531J988
15826h8855j78050A46390a41584J1179j48886Q6080e4025o4739A63083c19213
15815b98651A71836K5864a05264D369a8036D4823J68032a53965B21098I0305b64660
15803a94745f430k75331B74804c20555A11992a61517q582A87306b8539m6418A13870
15791I5188K1813P8206D1346P9170J04518c03630g5197k6653j2631A83236A6276
15779c7579B4773a30795N9928I0685D1034a37056A39458C7504N8865k8583b4714
15767b60707A47508C2729a43649e1744A38411a13818A60062a308A78129J2700
$$ y = [-201816, 183680, -98960, -204116, 65634, -416879, -82655, -97005, 49150, 200091, -78906, 254, -160970, 126438, -183532, 242, 3201, -153585, 332761, 215101, 261880, -171374, -90843, -88855, -266905, 146390, -141584, -130405, -279291, -193211, -54025, -118764, 163083, -319213, -298651, 171836, 197700, -105264, 4369, -18036, 44823, 212855, -153965, 221098, 90305, -264660, -194745, -6430, -281761, 274804, -320555, 111992, -161517, -170099, 187306, -28539, -74957, 113870, 95188, 117001, 195207, 41346, 120516, 225034, -303630, -75197, -101850, -114481, 183236, 16276, -37579, 24773, -130795, -70867, 90685, 41034, -137056, 139458, 37504, 96369, 67786, -24714, -260707, 147508, 32729, -143649, -51744, 138411, -113818, 160062, -1308, 178129, 190829]
15757A90829c2377F1134K7150M2311J53915a24696G8811f4353j70579A40419K76195
15746D16614A72986K2604P9067A6330f0074B07238a06478L9703C7485d35615d5981
15734I6297b36234A75237L5590I5872b72394h1658j1975B41154O2322e409k9451
15723c4860J7347l16030J03135o8418A70059a0163A26377M0806h1758D067a80621
15711A04795a8817F1072c4277j59605Q1102k00395J31127n0483R0611a226G8917
15699i8394k12053O0509i8861L8417r1087a8481E6313J13068K1065n0974a10181
15687i3008j44782g318j61367B6323Q4250h0429j47529P570D2241J74604F283
15675f0409j31875A7606J7174O6121a24804e8125B62473b30229A89688a2330E1875
$$ y = [190829, -32377, 61134, 88284, 130595, 284510, -124696, 78811, -64353, -234932, 140419, 416614, 172986, 195590, 274657, 16330, -60074, 207238, -106478, -66775, 37485, -435615, -45981, 96297, -236234, 175237, 210827, 95872, -272394, -81658, -93633, 241154, 303476, -5409, -34860, -17513, -333543, -230408, -298826, 170059, -10163, 126377, 167183, -81758, 4067, -180621, 104795, -18817, 61072, -34277, -193882, -112780, -313175, -182048, -232531, -141920, -1226, 78917, -98394, -310447, -249938, -98861, -60444, -151531, -18481, 56313, 169381, 190446, 139472, -110181, -93008, -237790, -7318, -168685, 26323, 110573, -80429, -227958, -220388, 42241, 216845, 6283, -60409, -192284, 17606, 34780, 100901, -124804, -58125, 262473, -230229, 189688, -12330, 51875]
15663b0530E1894E690a97502D2727b42020i3594d1179B8454f2989B15210c11396
15651C53259g8250C5813d9851k37937f8945k62851R064H2934a80788e2424k7325
15640g9749k59548a7801n4461p9833d1991F0662J7376c15006A14596b79057f8996
15628b4862k71646a19547c7705B33272c6949H4143L09651b67871e4730j82273
15618b37003o09I8173J64987A16274b66077B6088M882a43107j57369D1803i1337
15606b91685c4904o4347M2130A40991F5383a31691l06A81811b82382F1034a551
15594h8199j41985H7844a04800j11129a6017p9360b1910I4203a45944C07759B7809
15582G3338J24032a12072D51587a27461C73776B2644b74196q4474a63688j59180
$$ y = [-20530, 51894, 5690, -197502, 42727, -242020, -93594, -41179, 28454, -62989, 215210, -311396, 353259, -78250, 35813, -49851, -287788, -68945, -331796, -322732, 82934, -180788, -52424, -79749, -339297, -17801, -72262, -152095, -41991, 60662, 78038, -315006, 114596, -279057, -68996, -24862, -296508, -119547, -37705, 233272, -36949, 84143, 393794, -267871, -54730, -237003, -237612, 98173, 263160, 116274, -266077, 26088, 30970, -143107, -300476, 41803, -91337, -291685, -34904, -99251, -57121, 140991, 65383, -131691, -131997, 181811, -282382, 61034, -1551, -88199, -230184, 87844, -104800, -215929, -16017, -95377, -21910, 94203, -145944, 307759, 27809, 73338, 197370, -112072, 451587, -127461, 373776, 22644, -274196, -358670, -163688, -322868]
15572c22868G3644a03158M6706b1371E4800J65892A02244b02200H7800b59254
15561g8744A02479g1941o8309a0338k27902C6112a03583A03436L16074d463A54922
15549F626a06424B33970a88111A04570f8484A67667b50680e9770H6345J34846
15539B21191a18609k0063f7580m1316A84286a16930J7694b2495B03994b65687
15528a27673B76437A4287a09008A08245L33823b65598A89698B2715J67307h8528
15517b23562A74776a0733A36518l0225K6262L9932n4833O8586j8483O9183q7563
15506A49377L4071K10342o1830A30920C6344J3904P4804J80479a64774G9840b69330
15494h887D0696c33953d4528I0627m3672i5405q9854a4369C7465L67871j58855
$$ y = [-322868, 73644, -103158, -56452, -21371, 54800, 220692, 102244, -202200, 87800, -259254, -78744, 102479, -71941, -140250, -10338, -238240, 36112, -103583, 103436, 419510, -4463, 154922, 6626, -106424, 233970, -188111, 104570, -68484, 167667, -250680, -59770, 86345, 221191, -118609, -138672, -67580, -108896, 184286, -116930, -99236, -22495, 203994, -265687, -127673, 276437, 14287, -109008, 108245, 442068, -265598, 189698, 22715, 190022, -88528, -223562, 174776, -10733, 136518, 106293, 132555, 172487, 117654, 186240, 167757, 236940, 149377, 183448, 393790, 331960, 130920, 36344, 50248, 125052, 305531, -164774, 79840, -269330, -8887, 40696, -333953, -44528, 90627, 46955, -95405, -185259, -14369, 37465, 405336, 246481]
15483B46481e4372A44473Q5202C8301L16811a6560C9062K40201j9472j9980J73642
15472D13453O2144a0454C33158J6000a21814B91962P9823h7611L7358o075l8505
15461i4833c3420o5007k643K4590k6594A43420b503l1000A08456m0988i8969D0304
15448c3368k1175q3512A05637a43610D76895I6178L37261q3894K28436B47029
15437A86183Q1899J01377E2580a17908j78210d690A04635g757o7847C25164a13421
15425a51114I9999f5246E6372K85297r4392j12366B7599a38705E77R0426b78936
15413c6020p2712A82869q0101e2604j36517h294l26700a39992A3209J19255J13033
15402B45497D589a47589D07640b69695D0380O3364m5564a55720K3450a8607E650
$$ y = [246481, -54372, 144473, 229675, 38301, 355112, -16560, 39062, 279263, 259791, 239811, 413453, 475597, -10454, 333158, 349158, -121814, 291962, 371785, -87611, -50253, -56328, -94833, -33420, -98427, -101070, -76480, -103074, 143420, -2503, -33503, 108456, 67468, -98969, 40304, -33368, -54543, -138055, 105637, -143610, 476895, 96178, 433439, 349545, 577981, 247029, 186183, 268082, 369459, 52580, -117908, -296118, -4690, 104635, -7757, -75604, 325164, -113421, -151114, 99999, -65246, 56372, 341669, 247277, 134911, 27599, -138705, 577, 91003, -278936, -36020, -108732, 182869, 102768, -52604, -189121, -8294, -334994, -139992, 13209, 132464, 245497, 4589, -147589, 407640, -269695, 40380, 103744, 58180, -155720, -132270, -18607, 5650]
15390C5741B353b43561j79828d9903F5598b77914A71730l1400b3645j84175f7393
15378b21234E5367d4934B7866K81919d3420A20914J79509I2693J94125b6876I6118
15366a34303f0162A56045k3534J99449r5561K52543a6749B89194j37096N0445
15356B02543K63421B17940K7755A05632m1098K47145a70265C8393j0916i4351
15345A49008o8017P0023K15485d5800C38143o8258J20095C6266P4463K17859e3742
15333C1323O4460b11309C24811a48616d8562m3408j7200L8878c3223C06143e3589
15321A01083Q8029G2501k6775b2482C013K48462f6376A66667f7018A45928a93196
15309C12024b26154B72369J21344A10684i7491A86294e7960B64522I6584q536
$$ y = [35741, 2353, -243561, -423389, -49903, 65598, -277914, 171730, 140330, -23645, -207820, -67393, -221234, 55367, -44934, 27866, 309785, -43420, 120914, 300423, 92693, 286818, -26876, 96118, -134303, -60162, 156045, 132511, 331960, 236399, 488942, -16749, 289194, 152098, 202543, 465964, 217940, 245695, 105632, 64534, 311679, -170265, 38393, 27477, -94351, 149008, 80991, 151014, 366499, -45800, 338143, 269885, 389980, 36266, 110729, 328588, -53742, 31323, 95783, -211309, 324811, -148616, -48562, -91970, -109170, -70292, -33223, 306143, -53589, 101083, 189112, 72501, 45726, -22482, 3013, 251475, -66376, 166667, -67018, 145928, -193196, 312024, -226154, 272369, 393713, 110684, -97491, 186294, -57960, 264522, 96584, 88048]
15299H8048J21716E6450d4053F5720B6586a38078B46292A5773K5278a57988L1429
15288a26559A9163c32333K0699J25912c7866o1669H383g168A63741g6249M177
15277g2072A09044N10C0030A4178M0728K3694B6954J16263A9282L47540p3287
15266B93535l3235H3995a21122A1356J52349F3336a77150g5719F0742Q8401E5338
15254e2171D8556L06912i5369B18294j08996a33584A45248J63388N93060J93757
15244A095453p1184M5745j89228C85795A48447K63322g002k1132B44725F9166
15233i6760G6799c4241A09264a60490I1692a74504F4660m319J78854a81683O9494
15222a12189f28E4332b94864j64121C5175a77629K7519D43516A76560B1018a12904
$$ y = [88048, 209764, 56450, -44053, 65720, 26586, -138078, 246292, 15773, 41051, -157988, -126559, 19163, -332333, -311634, -185722, -37866, -99535, 8383, -7168, 163741, -76249, -72072, 109044, 109554, 30030, 14178, 54906, 78600, 26954, 143217, 19282, 366822, 293535, 260300, 83995, -121122, 11356, 163705, 63336, -177150, -75719, 60742, 149143, 55338, -52171, 48556, 355468, -95369, 218294, 109298, -133584, 145248, 308636, 901696, 1095453, 1024269, 1070014, 880786, 385795, 148447, 411769, -7002, -28134, 244725, 69166, -96760, 76799, -34241, 109264, -160490, 91692, -174504, 64660, 60341, 239195, -181683, -112189, -628, 54332, -294864, -458985, 35175, -177629, -150110, 443516, 176560, 21018, -112904]
15210E3316J88640f4545H4119O6252O6594f35l1443A83321h8544D71006a3918
15198b3633A16528J39417A12611c3354E1920a69542j39490B71012j4149E6202
15187E5337R9704D169K89415j28146C2816K10126E7187a52987g6319D8478J08122
15176A56600g3905A29076e0453C54110C032J33278F6575K92615j33428b00237
15165a56314j37998a15195r2848J8683Q7017A01354K38503a53352A89472a2501
15154b24455B45953L2659g0539B04717D5041M0785l0435J12893J85485p6636C2007
15142a74312p6797A013N0366J26261n4270F0146M8977a09614C32244H7381J41844
15131B29225b3561k52656a8283p5285A71279D2108c3983D01720C5909a84597d2744
$$ y = [53316, 241956, -64545, 84119, 150371, 216965, -635, -32078, 183321, -88544, 471006, -13918, -23633, 116528, 255945, 112611, -33354, 51920, -169542, -309032, 271012, 256863, 56202, 55337, 155041, 4169, 293584, 165438, 32816, 242942, 57187, -152987, -76319, 48478, 156600, -73905, 129076, -50453, 354110, 3032, 136310, 66575, 359190, 225762, -200237, -156314, -294312, -115195, -208043, -189360, -102343, 101354, 339857, -153352, 189472, -12501, -224455, 245953, 278612, -70539, 204717, 45041, 85826, 55391, 168284, 353769, 277133, 32007, -174312, -251109, 1013, 51379, 177640, 123370, 60146, 109123, -109614, 332244, 87381, 229225, -23561, -276217, -18283, -93568, 171279, 42108, -33983, 401720, 35909, -184597, -42744]
15119C58522j73859K4360E2097Q6288b07593h6562j57494D53268a22887e4378
15108A47422c28964d8392j55680C05528A30974K43847i3306A40309b77946a5056
15097a39556A22915a9889F7061c2401A68947a12879B27540F2548i6080D49416
15086I570L8176L36090A57154P8153o1879n9411J99014j22114c9158B41997a8820
15074B00799m3665F3674L2804e0250A2329K96838A31775C4391c5623i176B06920
15062D7913L1443J92636I7821b72411f5712F8676K9359M38753F897M81362a88453
15050A46320A0974L55043A43510J7673L73273k43114A8808K33920J18918G4175
15039I3268J92219J35215F1978J90473J89820A74742M0048J99740J69092k66171
$$ y = [358522, 184663, 209023, 52097, 138385, -207593, -86562, -244056, 453268, -122887, -54378, 147422, -328964, -48392, -204072, 305528, 130974, 374821, -93306, 140309, -277946, -15056, -139556, 122915, -19889, 67061, -32401, 168947, -112879, 227540, 62548, -96080, 449416, 9570, 47746, 383836, 157154, 235307, 173428, 114017, 313031, 190917, -39158, 241997, -18820, 200799, 157134, 63674, 96478, -50250, 12329, 309167, 131775, 34391, -35623, -9176, 206920, 47913, 79356, 271992, 97821, -272411, -65712, 68676, 98035, 536788, 6897, 488259, -188453, 146320, 10974, 366017, 143510, 161183, 534456, 291342, 18808, 252728, 371646, 74175, 93268, 285487, 420702, 61978, 252451, 442271, 174742, 214790, 414530, 583622, 317451]
15029C17451J77896L9888j09015q9086K7436q0850n0870l2335K49592k09603L29223
15018E69727A46525K70112j69928o3720J19539l4645A21849k2920R2398k5476
15008A65851J10976K5821p2317J71325j75251N5289r7882A8639K84260j39912
14998A62987l6808K69328L96656C76919O3355q3724j59619m9657o1530N40871
14988F26615B00591J66552j56788L5955J32553a5535B01371k1883M34109J28651
14978G42248k72918O8416j38459R7370A86306O7824o2248J30389J35334J88826
14968F46431j94528K4716n9183j07509H7715L6463J57277H8829L54585j76652
14958B66762N794J9460J29056j52788P84J15380d0248F58065A30594M88182B69418
$$ y = [317451, 495347, 535235, 426220, 337134, 364570, 283720, 232850, 200515, 450107, 240504, 569727, 146525, 416637, 246709, 182989, 302528, 267883, 121849, 98929, 191327, 165851, 276827, 302648, 230331, 401656, 226405, 281694, 183812, 18639, 302899, 162987, 126179, 395507, 792163, 376919, 440274, 356550, 196931, 147274, 85744, 626615, 200591, 367143, 210355, 246310, 378863, -15535, 201371, 179488, 613597, 742248, 469330, 537746, 399287, 496657, 186306, 254130, 191882, 322271, 457605, 646431, 451903, 476619, 417436, 309927, 87715, 124178, 281455, 88829, 443414, 266762, 272556, 292016, 421072, 268284, 269068, 384448, -40248, 658065, 130594, 618776, 269418]
14946E17669n1472B12764L49097j22832K31511j62234L3041r1634B14892p7903
14936A36989K99726r7486R9765K2504O9742J15253Q5737m5102P6407m0386K3656
14925G46805J78334J25745o916k54581Q3415J81595K25983j11406M20765K65661
14915A855400n79659j38138k24248k2332j00325k03097Q7603j58420a439G08747
14904C56599j41977K84367B37475J40853j1771q2554K40427q563k22849L64490
14894F57508B78628k9580J82502Q7853o3368o9003J44965B03340J86117J99473
14884E88930a6314E14479j67058L73591k66591o0770l0031j32972L37667K10663
14874G78978l34228j81103L21290r5655K4938B38449M40777j85237j55054Q1071
$$ y = [517669, 466197, 212764, 561861, 439029, 670540, 508306, 541347, 449713, 214892, 136989, 436715, 339229, 438994, 461498, 531240, 646493, 732230, 687128, 763535, 723149, 746805, 925139, 1050884, 1043968, 789387, 872802, 1054397, 1280380, 1168974, 1589739, 1855400, 1275741, 1137603, 913355, 891023, 790698, 587601, 675204, 516784, -1439, 708747, 356599, 214622, 498989, 237475, 378328, 366557, 284003, 524430, 515867, 293018, 657508, 278628, 249048, 431550, 519403, 456035, 387032, 531997, 203340, 389457, 588930, -16314, 514479, 347421, 721012, 454421, 393651, 363620, 230648, 568315, 778978, 444750, 263647, 584937, 489282, 514220, 238449, 679226, 493989, 338935, 420006]
14864D20006J56469M7397j85154j11659J11102A97624L47888k32186K78461k59293
14854C32494j7450j25586K97211A39446L21802A82963M0455L61199B85063M0434
14844C25497K92418J6510l8213j1875q7359N56478l99045J62376l03513J35874
14834F49148n4113k30297A73075R5438J32103M08598n6519A03697K13921J24330
14824D41948J53935J26262l53367K04145j9878q2803L17769k81093j66293M21932
14814G62557j7470k65939l1311B15165L55334j20984J4765K02648A95079N76862
14804G71941l2762k82411L96056k36327j88094R9138A74415J49806J83530A68586
14793D93754r1417A18416L63991j47957Q6603J60634B56334M21501C12421J19976
$$ y = [420006, 576475, 623872, 438718, 327059, 438161, 197624, 545512, 313326, 591787, 332494, 315044, 189458, 486669, 139446, 461248, 182963, 223418, 584617, 285063, 325497, 617915, 634425, 596212, 584337, 496978, 1053456, 654411, 816787, 513274, 649148, 595035, 364738, 173075, 268513, 400616, 809214, 752695, 103697, 317618, 441948, 595883, 722145, 368778, 572923, 553045, 470242, 788011, 506918, 340625, 762557, 745087, 479148, 447837, 215165, 570499, 449515, 464280, 666928, 195079, 771941, 739179, 456768, 852824, 616497, 428403, 527541, 174415, 324221, 507751, 168586, 493754, 402337, 118416, 482407, 334450, 421053, 581687, 256334, 677835, 312421, 432397]
14783D32397L00822l26374J17541J08051j86810M8835J38642Q7100B62601K24989
14773D87590K69769k86955N35450j85294C66945M02985j90195m8817K99355k73155
14763E57118J31416l263q239k94515j6959L1861N16329l31441L13979j83951k55325
14752D57010A51611L51071M50149l19719Q0315B68741Q6354K57274J6208J19265
14742G47842j07032j39840j4267j88083J74458J3218K41927P2677j24063j9656
14732F57181J47440j25512O1410j14878N69837k86625L86767j40326L53167k84493
14722A223968q4059l06491L34576m72964L61652k26722j10072l4451k659J07906
14712G90684k45761N7567J62190k6735o5180k43819O35802l98098J6661j0722
$$ y = [432397, 733219, 406845, 524386, 632437, 445627, 494462, 633104, 720204, 262601, 487590, 757359, 470404, 1005854, 820560, 366945, 769930, 579735, 530918, 830273, 557118, 688534, 685271, 677032, 382517, 365558, 397419, 913748, 582307, 896286, 712335, 457010, 151611, 502682, 952831, 633112, 713427, 268741, 355095, 612369, 628577, 747842, 640810, 500970, 486703, 298620, 473078, 486296, 728223, 800900, 676837, 657181, 804621, 679109, 740519, 625641, 1195478, 908853, 1295620, 1155294, 1508461, 1223968, 1139909, 833418, 1167994, 695030, 1056682, 829960, 719888, 685437, 682778, 790684, 544923, 602490, 764680, 737945, 672765, 428946, 1064748, 666650, 683311, 672589]
14702F72589K10438K58500K69528J04726k39417J51626l19081j65309j79741K49989
14692A013848j18183J01440q2867j10731K18925j48532n6250M3395L8810l17071
14682E82784L84003j70997K47979l39276L17083l46725K20721r0245j33626K33647
14672I05348j94097K89354j18334J09064J43739l44526M1934L13617J57992n03293
14662H00798L8431J92416j70453J36244j81536j57572M58183L84m33115M25221
14652A109001J34261m18505L27279k01284j3823J66245J87955k39142j30498k2816
14642H98673J98856k10426p3703M35164k41734J08936K56926j82594m3895j34368
14632A011835M2614k0370K42268k24690o5189J52818j9875q1017k06007M74553
$$ y = [672589, 883027, 1141527, 1411055, 1515781, 1276364, 1427990, 1108909, 943600, 763859, 1013848, 895665, 997105, 914238, 803507, 1022432, 873900, 817650, 861045, 899855, 582784, 966787, 795790, 1043769, 704493, 1021576, 674851, 895572, 805327, 671701, 905348, 711251, 1000605, 882271, 991335, 1135074, 790548, 832482, 1146099, 1304091, 800798, 839229, 1031645, 861192, 997436, 815900, 658328, 1116511, 1116895, 683780, 1109001, 1243262, 824757, 1152036, 950752, 936929, 1103174, 1291129, 1051987, 921489, 898673, 1097529, 887103, 813400, 1248564, 1006830, 1115766, 1372692, 1190098, 1146203, 1011835, 1054449, 1034079, 1276347, 1051657, 986468, 1139286, 1119411, 1038394, 832387, 1306940]
14622A306940K54044k67342k58079j55363N08413j6463l93160k19321O51577m85718
14612I25528L49070N5616l32137P19712n39390k3429L32743k50945N9351K21125
14602A517244k45977k0740L58513n7509k28495q6571R9275L86355l66012q4218
14592A271865K34957m7920J84844l82231M74845k51363j00430P8600K35109j93586
14582A504690k07790K80195M5883K25110n7995r5684J10255p698j21863M14980
14572B090083q6456j28032J32762j54938j1092j56265L82935n8447K06529j62701
14562B054378K899L89376j31863l34350N66452M145p8812K98869L01111K46948
14552C319153L09667Q71697N30208K276248M516096J0068065K0183507p394339
$$ y = [1306940, 1560984, 1293642, 1035563, 880200, 1388613, 1372150, 978990, 759669, 1411246, 925528, 1274598, 1330214, 998077, 1717789, 1178399, 1154970, 1487713, 1236768, 1296119, 1517244, 1271267, 1250527, 1609040, 1551531, 1323036, 1236465, 1335740, 1722095, 1356083, 1271865, 1506822, 1458902, 1643746, 1261515, 1736360, 1484997, 1384567, 1463167, 1698276, 1504690, 1296900, 1577095, 1622978, 1848088, 1790093, 1694409, 1804664, 1796966, 1675103, 2090083, 2003627, 1875595, 2008357, 1853419, 1842327, 1686062, 2068997, 2010550, 2217079, 2054378, 2057277, 2446653, 2314790, 1980440, 2546892, 2551037, 2472225, 2771094, 3072205, 3319153, 3628820, 4500517, 5030725, 7306973, 11823069, 21891134, 42074641, 34680302]
14544C4680302A4610957o992844k006488p52816j665279r04943n47395j98914
14536A542278N34503l55863K01764k2151j44496l9516N74089l92515k39801O5326
14526A723618K46622k40455J20478q1935L85889J61731p4564o4907R5448P9153
14516B351078k65366q494L14705q8770K74169m90711N26659k76076L5235j16565
14506B255864M06355j02425j17615J75108J77621j45011j33249M35122j73059
14497B778711J51458k6729J56698j97479q1674Q5991j00683K51914l18105K78972
14487B979074J10652p7266K62262j55830J5303J23842K96147k94807j06612J91615
14477C344380q3942J94363K31501l51505K69980o943K92510j06335j94870j23595
$$ y = [34680302, 14610957, 7618113, 5611625, 4858809, 3193530, 2288587, 1741192, 1542278, 2076781, 1720918, 1922682, 1900531, 1756035, 1716519, 2290608, 1898093, 1658292, 1723618, 1970240, 1729785, 1850263, 1768328, 2154217, 2315948, 2241384, 2176477, 2271925, 2351078, 2085712, 2077218, 2391923, 2303153, 2577322, 2086611, 2613270, 2337194, 2372429, 2255864, 2662219, 2559794, 2442179, 2617287, 2794908, 2649897, 2516648, 2951770, 2778711, 2930169, 2903440, 3060138, 2862659, 2780985, 2866976, 2766293, 3018207, 2700102, 2979074, 3089726, 3012460, 3274722, 3118892, 3134195, 3258037, 3554184, 3259377, 3152765, 3344380, 3260438, 3454801, 3686302, 3334797, 3604777, 3597834, 3890344, 3784009, 3589139, 3465544]
14467C465544L68346J83479q6556K03666j90420j59146J84141L77138q9124J96852
14457D453920p1257q8150j21287K14990K16304k30981J92480j28866M37186J32044
14447E006383j13694J10062j27263n792J48902J47268k56799K50514J99189L61967
14437E720737l08315K71393l3653N6959r1693j04084N09442j85915J26125P4879
14427F035875K02564r8443M81767P1028P062J97722J53852p7875N14739P154J37529
14416G632974J98911k64855k69887M14171m0144N54036m52432M69935J86806L03048
14406H732563k3610l06207O15089o2660O62432k43589Q6340l4374J598L71152
14396I798734K32981j7658j03733N18967J26281J42761J05762K61119L02466M4279
$$ y = [3465544, 3833890, 4017369, 3930813, 4134479, 3944059, 3784913, 3969054, 4346192, 4257068, 4453920, 4382663, 4294513, 4173226, 4388216, 4604520, 4373539, 4566019, 4437153, 4874339, 5006383, 4892689, 5002751, 4875488, 4869696, 5018598, 5165866, 4909067, 5159581, 5358770, 5720737, 5412422, 5683815, 5650162, 5707121, 5615428, 5511344, 6020786, 5834871, 5960996, 6035875, 6238439, 6139996, 6621763, 6692791, 6699853, 6897575, 7051427, 6973552, 7488291, 7495445, 7632974, 7831885, 7567030, 7297143, 7711314, 7671170, 8225206, 7772774, 8242709, 8429515, 8732563, 8708953, 8402746, 9017835, 8955175, 9617607, 9374018, 9460358, 9425984, 9427582, 9798734, 10031715, 10014057, 9910324, 10429291, 10555572, 10698333, 10804095, 11065214, 11367680, 11411959]
14386A1411959J71238L49558K75500N36031j97801N98538J44305L15330J93825
14377A3798483L2005L76824K16399L65637J38080J89420K96197M33214M51384
14368A6297643K34044P47058J13508K88831L43829O42179L59129L04721L07056
14359A9637998M81553L96462M93178K74015Q32019M89210O61054N34249M87350
14350B4287088J24191R86929P68239M44288Q60148Q22147M92204N19660J180529
14341C0485423R43647N26908J141845P10187Q54983J258376Q86587Q56167J485658
14332C9149781J302968J003562J291330J407097J551612J528516J275217K004122
14324E0514205J788106J864366J786748K017525K251648K047209J848841K787853
$$ y = [11411959, 11583197, 11932755, 12208255, 12744286, 12546485, 13145023, 13289328, 13604658, 13798483, 13830488, 14207312, 14423711, 14789348, 14927428, 15116848, 15413045, 15846259, 16297643, 16531687, 17278745, 17392253, 17681084, 18024913, 18667092, 19026221, 19330942, 19637998, 20119551, 20516013, 21009191, 21283206, 22115225, 22604435, 23265489, 23799738, 24287088, 24411279, 25398208, 26166447, 26610735, 27470883, 28293030, 28785234, 29304894, 30485423, 31429070, 31955978, 33097823, 33808010, 34662993, 35921369, 36807956, 37664123, 39149781, 40452749, 41456311, 42747641, 44154738, 45706350, 47234866, 48510083, 50514205, 52302311, 54166677, 55953425, 57970950, 60222598, 62269807, 64118648, 66906501]
14316F6906501K434079K882880K822563L305050L061277L156230L950206L765465
14308I2284251M076290M382900M576652M617022N080580N481641N863996N970909
14300A32334241O602102P167226P199061Q463135Q004452Q954130R230687J0155071
14292A98110105J1019341J1328918J1578650J2651585J3151162J3861115J4108340
14285B85809216J4807566J5132171J5814286J5465311J5756731J5521377J4733798
14278C93040456J4444311J3034581J1623473J0166186P691370M572208K20923
14271D54793508j062327j717238l359599o914798o651297q603860r636023j1713465
14263D05134901j2798540j4590143j5019006j5702412j6549351j5790586j5614679
$$ y = [66906501, 69340580, 72223460, 75046023, 78351073, 81412350, 84568580, 88518786, 92284251, 96360541, 100743441, 105320093, 109937115, 115017695, 120499336, 126363332, 132334241, 138936343, 146103569, 153302630, 161765765, 169770217, 178724347, 187955034, 198110105, 209129446, 220458364, 232037014, 244688599, 257839761, 271700876, 285809216, 300616782, 315748953, 331563239, 347028550, 362785281, 378306658, 393040456, 407484767, 420519348, 432142821, 442309007, 450000377, 454572585, 454793508, 453731181, 452013943, 448654344, 441739546, 435088249, 426484389, 416848366, 405134901, 392336361, 377746218, 362727212, 347024800, 330475449, 314684863, 299070184]
14256B99070184j5346584j4602449j4083387j3607096j1452199j1936250j1363347
14249B06678872j0966031r972968r391923q820427q201019p490013p432117o996975
14241A37407399o586285n839674n849595m979098m936602n242937m169729m248185
14233I5555294m059762l639273l219178l697314l210625k828127l123825k831587
14225F8945603k579100k198212k473916k105818k150502j528232j955017j937388
14217E2017418j953193j485865j540968j231972j064078j595022j249814j418757
14209D0477749j653682p06372l32342j873284j129521q91896p02338j124292m44411
14200C1619611q55329q09913r30774q57937o40093p72651m85594l95337q45932
$$ y = [299070184, 283723600, 269121151, 255037764, 241430668, 229978469, 218042219, 206678872, 195712841, 185739873, 176347950, 167527523, 159326504, 151836491, 144404374, 137407399, 130821114, 124981440, 119131845, 114152747, 109216145, 103973208, 99803479, 95555294, 91495532, 87856259, 84637081, 80939767, 77729142, 74901015, 71777190, 68945603, 66366503, 64168291, 61694375, 59588557, 57438055, 55909823, 53954806, 52017418, 50064225, 48578360, 47037392, 45805420, 44741342, 43146320, 41896506, 40477749, 38824067, 38117695, 37785353, 35912069, 34782548, 33890652, 33188314, 32064022, 31619611, 30764282, 29954369, 29023595, 28165658, 27525565, 26752914, 26267320, 25871983, 25026051]
14191B5026051o91164n98143l56302p77750o14961m09080n02599o11659n17835
14182A9946558k69419l4130n44165k94139m90657n39015m53213k82685m45385
14173A6593750r9152k30317q05179r5094j30321k03957p71624J37169k60519l59544
14163A3775212j17349l87552k93716J01355m20964j48819J8748l9483m79291k84712
14153A1723429n28838J44745k63484k49450j92200J04872l73723j27762m84884
14144I752705K17776k26787J08787k63642k62880j43411m05898N07113j42281
14135I141482k55442j69092N281p56252M79452l5695o64342J66863j54827j6244
14125G741184r9398j67479p6642M8661n0832o39295O01608o45410J52234n13093
$$ y = [25026051, 24334887, 23736744, 23380442, 22602692, 21987731, 21578651, 21076052, 20464393, 19946558, 19677139, 19643009, 19098844, 18804705, 18314048, 17775033, 17321820, 17039135, 16593750, 16494598, 16264281, 15459102, 15364008, 15233687, 15029730, 14258106, 14395275, 14134756, 13775212, 13657863, 13270311, 12976595, 13077950, 12656986, 12508167, 12526915, 12487432, 12008141, 11723429, 11194591, 11339336, 11075852, 10826402, 10634202, 10739074, 10365351, 10237589, 9752705, 9970481, 9743694, 9852481, 9588839, 9325959, 9182548, 8776650, 9283763, 9141482, 8886040, 8716948, 8722229, 7965977, 8445429, 8409734, 7745392, 7912255, 7757428, 7741184, 7641786, 7474307, 7397665, 7446326, 7395494, 6756199, 7357807, 6712397, 6864631, 6351538]
14115F351538M68703j80358k12940J16054n60680L24433j96798K37024k11042
14106F135934j77317q1138J55970l41380R7925k37834M8587j85069k02998J33044
14096E345724k79552k498J01942Q8176l20560J50639j9351j40632M4618n0771
14086D917735k88185n872k39124L63574j73785j7800J13938l56885j24313J06566
14076D295849L4957l33834M45344l33505J05307M9103j53488L2072k76350j04813
14066C760642K84715k02325j11291R9397J23568J73032q7446j28504m13524N3347
14056C551611K10212m37331J05182J89139m98100l3184N1078M39964n69790L73240
14046C382021j40521p9134k32372L75784k17593K69681k33422k40283j28929Q8692
$$ y = [6351538, 6820241, 6639883, 6426943, 6542997, 5982317, 6306750, 6109952, 6346976, 6135934, 5958617, 5877479, 6033449, 5692069, 5789994, 5552160, 5600747, 5415678, 5212680, 5345724, 5066172, 5063674, 5165616, 5253792, 4933232, 5083871, 5064520, 4923888, 4968506, 4917735, 4629550, 4623678, 4384554, 4748128, 4574343, 4556543, 4670481, 4313596, 4189283, 4295849, 4330806, 3996972, 4442316, 4108811, 4214118, 4263221, 4109733, 4141805, 3865455, 3760642, 4045357, 3843032, 3731741, 3831138, 3954706, 4127738, 4040292, 3911788, 3498264, 3551611, 3761823, 3324492, 3429674, 3618813, 3120713, 3087529, 3138607, 3578571, 3008781, 3382021, 3241500, 3162366, 2929994, 3305778, 3088185, 3357866, 3124444, 2884161, 2755232, 2843924]
14036B843924m09415M87040l50196K81818J02164K3189k09603o8747Q5543n8400
14026B727317k97770L97107l5844o441l21855J59876j37974l3574j52623j3370
14016B284849J53145m8548K0659n93884N63260o0036j97731j2969j75185j6885
14006A916675J79426K43461j57614k45531J95171j43711Q1119J94566k53146J57328
13996B167744N0479k62260P1749J3923J38668L77291j05144J016970K910943P631175
13986A4011538K0478613N649188j8975537r575781m089452k130546q48667n28077
13978C991279q53239j03980k80342J70074k52926J788l29442K58257k94346J0146
13968B317269J50269k45267j49278N9177m90745L48633m29743M62721j14236l6531
$$ y = [2843924, 2434509, 2921549, 2571353, 2853171, 2955335, 2978524, 2768921, 2700174, 2785717, 2727317, 2429547, 2826654, 2790810, 2784369, 2462514, 2622390, 2484416, 2450842, 2298219, 2284849, 2437994, 2389446, 2410105, 1816221, 2379481, 2319445, 2121714, 2108745, 1933560, 1916675, 2096101, 2339562, 2181948, 1936417, 2131588, 1987877, 2068996, 2263562, 2010416, 2167744, 2218223, 1955963, 2027712, 2041635, 2180303, 2557594, 2452450, 3469420, 6380363, 14011538, 34490151, 40139339, 21163802, 11588021, 7498569, 5368023, 4519356, 3991279, 3138040, 3034060, 2753718, 2923792, 2670866, 2672654, 2343212, 2601469, 2307123, 2317269, 2467538, 2222271, 2072993, 2132170, 1641425, 1990058, 1560315, 2023036, 1908800, 1872269]
13958A872269K122R2313r904j73039K11733k96898N0626k1257l250J49830j11316
13947A763229j57685J97196k22674K21107j34754K45495j77826l45530r3045J21439
13937A416952J15543J35451o9466m5035m8066k2929O6929j2344K06770j00537
13927A643268K30232k86283j8512j83256Q5673k7261O3554m93769L21184R5452
13917A430282J43953J57757n62186L88256j68324K78487m16927K6102K0383l06370
13907I91413J48599K50450K20109j81944l49389J15114J71825j13404j6828j65281
13897A070664K13719n41358N54886k52177J56924j9096K0715j73747L32010j93598
13887A168942K14412l97666P9570J8676j87501j9043R5684J55409L16590j3112
$$ y = [1872269, 1874391, 1966704, 1956800, 1783761, 1995494, 1698596, 1749222, 1727965, 1724715, 1874545, 1763229, 1605544, 1802740, 1580066, 1801173, 1666419, 1911914, 1734088, 1388558, 1295513, 1416952, 1532495, 1667946, 1598480, 1553445, 1505379, 1482450, 1549379, 1537035, 1743805, 1643268, 1873500, 1587217, 1568705, 1385449, 1471122, 1443861, 1507415, 1013646, 1334830, 1430282, 1574235, 1731992, 1169806, 1558062, 1389738, 1668225, 1251298, 1277400, 1297783, 991413, 1140012, 1390462, 1610571, 1428627, 1079238, 1194352, 1366177, 1252773, 1235945, 1070664, 1284383, 743025, 1297911, 1045734, 1202658, 1183562, 1204277, 1030530, 1362540, 1168942, 1383354, 985688, 1065258, 1083934, 896433, 877390, 973074, 1128483, 1445073, 1431961]
13877A431961k56338J75759j68586J74667m28693M37272j61767p5284J98037l41265
13867I85763K60693P2191J39506k66714k50637K4803k2356J72432k90434n7304
13857G67943K55275j57963r5696L05320j56658k09108L22150k92146J65558q6495
13847H18180J41025k0990l229J19927l17119j1451J48564J53467r7075j14965
13837H16334l4452o7202K04942q9599Q5100l2893k82328N39535o6346n19117J73646
13826G27620K21846N0523n2666j35361j12230l2534M60695j68720j27069l167
13816H28937J98639l23359J68145j62744L01684k03556J32019m04017m7982M42677
13806I30443l04172P8776K13430n0025M6297k21961J30170J76819j15173j18812
$$ y = [1431961, 1175623, 1351382, 1182796, 1357463, 928770, 1366042, 1204275, 1128991, 1327028, 985763, 1246456, 1318647, 1458153, 1191439, 940802, 965605, 943249, 1115681, 825247, 767943, 1023218, 865255, 769559, 1074879, 918221, 709113, 1031263, 739117, 904675, 818180, 959205, 938215, 934986, 1054913, 737794, 726343, 874907, 1028374, 931299, 816334, 781882, 714680, 919622, 830023, 915123, 882230, 599902, 1139437, 1073091, 553974, 727620, 949466, 999989, 947323, 811962, 699732, 667198, 1127893, 959173, 832104, 828937, 1027576, 704217, 872362, 709618, 1011302, 807746, 939765, 535748, 487766, 930443, 626271, 705047, 918477, 868452, 914749, 692788, 822958, 999777, 884604, 765792]
13796G65792M5916p6637k45157K41307q0185j12773N46240m40514Q1547J25373
13786H50909B69824J64903R5703l5149K13177m7084L31075m21557j69858M65693
13776H66727k00573j39631J55910M09580E21162L12663l95314K21911O261p3586
13766E93097J85342j75399B06060M12526j22339K2881J16776j02373J54391j61595
13756E26327L08467R3699j18286j70919L4966j4345P0611r1430j10598k6075l1462
13745D70955m8269L10043k10074R0359o3577K09963M6415j99433J55182l60474
13735D01090K15443Q0310j95666j28683R2242K67819o7506k94113L75504p8583
13725F67857j77985L19700k82535J05679j42319p5097K01557k72166j8537M11729
$$ y = [765792, 811708, 735071, 489914, 731221, 651036, 538263, 1084503, 643989, 725536, 850909, 269824, 434727, 530430, 495281, 708458, 661374, 992449, 570892, 401034, 866727, 666154, 526523, 682433, 1092013, 521162, 833825, 438511, 660422, 666683, 593097, 778439, 603040, 206060, 618586, 496247, 519128, 635904, 533531, 687922, 526327, 834794, 928493, 810207, 639288, 674254, 659909, 730520, 639090, 528492, 502417, 470955, 422686, 732729, 522655, 613014, 549437, 759400, 805815, 606382, 761564, 401090, 616533, 696843, 501177, 372494, 464736, 732555, 665049, 370936, 746440, 667857, 489872, 809572, 527037, 632716, 490397, 415300, 616857, 344691, 326154, 737883]
13715G37883k91437K38150k56479p2505P6901L1034p8829K9174p342L20960k38863
13704D88647j11628M2144R4790j16954M0163j64823K24943p0022L69906l24787
13694D72379j44653K82278j71718B14859R585J58870J41521n6294k0687K77498
13684G25352j10403O5274k27790L8326r6575p448j87741J64545J02217J80770
13674F46527k78271K49148A23779L59619J3617A89291K3355K62962k24565l0963
13664B20080L42244H8171N05250k86126j5353K09553N1349I4994Q66552C55414
13653D34579j51168K0842Q3950o1880J97544j9553a0034D05049q3674D5744r167
13642C6577K01025C4375O17055k43920J57025k62103J54255K35590l41903M521
$$ y = [737883, 446446, 684596, 428117, 355612, 432513, 463547, 384718, 413892, 406550, 727510, 488647, 377019, 419163, 513953, 396999, 437162, 272339, 497282, 427260, 797166, 472379, 327726, 610004, 438286, 214859, 224444, 383314, 524835, 468541, 447854, 725352, 614949, 680223, 452433, 490759, 394184, 386736, 198995, 363540, 465757, 646527, 368256, 617404, 123779, 483398, 497015, 189291, 212646, 475608, 251043, 220080, 562324, 88171, 593421, 307295, 291942, 501495, 552844, 94994, 961546, 355414, 434579, 283411, 304253, 388203, 326323, 523867, 504314, -10034, 405049, 321375, 45744, 36577, 237602, 34375, 651430, 407510, 564535, 302432, 456687, 692277, 350374, 354895]
13632C54895L33826l22443m7555L53042B14794o3147J25868O4834J26794q9261
13622C79882L8758l8244l6828j4980K7203K58390k46092A36318J14296L69714
13612F20328k71993j50452R9528j02820L9532M30152a23459D41076j34384A14783
13601E09012K9746k735J58657k66650R9762r4323K2992p8111L4311A67447L77562
13590E45009J47930l18448j79271L68511k28844H6711J74730l9998K04386j99470
13580B26359I2509J43550D0650K17060O8935r8102J49486J94475k03782A22665
13569a84170C80178K67855D5630M23421j30135C4765J25070K84731j64384l2888
13559B47294J9836G5487P6374c4928F20589B36887J54305r8498L0111i052A09634
$$ y = [354895, 688721, 366278, 318723, 671765, 214794, 151647, 277515, 342349, 469143, 379882, 418640, 380396, 343568, 328588, 355791, 614181, 368089, 136318, 250614, 620328, 348335, 197883, 297411, 194591, 234123, 664275, -123459, 441076, 306692, 114783, 509012, 538758, 536023, 694680, 428030, 527792, 433469, 456461, 378350, 412661, 167447, 545009, 692939, 374491, 195220, 563731, 334887, 86711, 261441, 221443, 425829, 226359, 92509, 236059, 40650, 257710, 326645, 228543, 378029, 572504, 368722, 122665, -184170, 380178, 648033, 45630, 469051, 338916, 34765, 159835, 444566, 280182, 247294, 267130, 75487, 151861, -34928, 620589, 236887, 391192, 292694, 322805, -9052, 109634]
13547B54319o4578j8285K59772E7138J24544J06874J16310j70992l8581J58800
13537C54093A73829K56635A71469p1117L65685A20468Q2414q3850K74834o0093
13527C33773I7626L40524G9970J31234b3021D38574B01664J70129j54518K07032
13517D24307G0515L21967a97953C6079L20305J46283l5575A96971c2314A7425
13506B86359N9922l0069j5760b14635A62776Q5741Q6050p4550J89187B04471J01936
13495C06407q4913q4300M9781J3314J00817f0061B70136A22872J66756B6460M0334
13484F6794M90263H6227J95606L818Q2756j44095K33446F9491j7782M18299j86800
13473B83208j35423m9253K86803A91869K86764A82045J65030A37562J98045A05366
$$ y = [254319, 189741, 171456, 431228, 57138, 181682, 288556, 404866, 233874, 195293, 354093, 173829, 430464, 171469, 100352, 466037, 120468, 202882, 119032, 393866, 333773, 97626, 438150, 79970, 211204, -23021, 438574, 201664, 371793, 217275, 424307, 70515, 392482, -197953, 36079, 356384, 502667, 467092, 196971, -32314, 17425, 286359, 346281, 316212, 300452, -214635, 162776, 248517, 334567, 260017, 449204, 204471, 306407, 221494, 137194, 186975, 200289, 301106, -60061, 270136, 122872, 289628, 26460, 66794, 557057, 86227, 281833, 285651, 368407, 224312, 457758, 69491, 51709, 470008, 283208, 147785, 98532, 385335, 191869, 478633, 182045, 347075, 137562, 335607, 105366]
13462A16453K23970k7937K55821D8144J70896M0217b4639B61145i068A68472n00
13451A67972k7546O8713J99788F5701K77110a8073C41869K7223k7213M3148J1279
13440C96306j18836A19468a9508C09120j7164j38091l0059C478K23507i2036A26597
13428I1816O7335a2814C18832B3285J88308J3026A02721c459E35455k54575q5840
13417A95040b939A83529q0348L9172P7560Q8151e999E6497j7947J96588b978E5465
13404B96303a753B26807m9623P2960A2727L479a84456B20183L34735k25572P95
13393C30141r1859A03568J05555l8666K77020m7544F6409A326K54303j17455J58035
13382B96209I9794l581M06710A55135J72257j08900j2778a26845A58453M2540
$$ y = [116453, 340423, 312486, 568307, 48144, 219040, 259257, -24639, 261145, -9068, 168472, 167972, 140426, 209139, 408927, 65701, 342811, -18073, 341869, 369092, 341879, 385027, 396306, 277470, 119468, -19508, 309120, 291956, 153865, 123806, 3478, 226985, -92036, 126597, 91816, 159151, -12814, 318832, 23285, 211593, 224619, 102721, -3459, 535455, 280880, 195040, -2939, 183529, 103181, 142353, 219913, 308064, -5999, 56497, 38550, 235138, -2978, 55465, 296303, -1753, 226807, 177184, 250144, 12727, 16206, -184456, 220183, 554918, 329346, 330141, 238282, 103568, 209123, 170457, 447477, 399933, 66409, 1326, 255629, 138174, 296209, 99794, 96213, 502923, 155135, 327392, 218492, 205714, -126845, 158453, 200993]
13372B00993a7186D03779j66765I5848P6048J10469J40375F3145d5422C98532
13361D47105r1291j58652M2087M0453A35999n5311J42369P0777J33307I4345J4858
13350A09203c754E42024q0540A85666o1004L86918c3873D03654P4866B01480N6962
13339B58442R8583A14448K85539J19572A23998F0366O0042c5574A79386j4983
13329A64403N865K9772b43233B78139G1323O2216j8679B5362J35463a46724C29261
13317C30733H2222g1363D10022a15578A22420M03783B24872j7991N5117K36555
13307D98553e0616A63544K6796n6518c6399q7779E35932j18676a23554A22121
13296C9022K66210a5772F1820e3626j68061A30181L03617A21389J33607I4970
$$ y = [200993, -17186, 403779, 237014, 95848, 171896, 282365, 422740, 63145, -45422, 398532, 447105, 355814, 197162, 239249, 279702, 135999, 80688, 223057, 293834, 427141, 94345, 109203, -3754, 542024, 461484, 185666, 124662, 511580, -33873, 403654, 478520, 201480, 258442, 357025, 114448, 399987, 519559, 123998, 60366, 120408, -35574, 179386, 164403, 170268, 200040, -243233, 278139, 71323, 133539, 114860, 25362, 160825, -146724, 329261, 330733, 82222, -71363, 410022, -115578, 122420, 526203, 224872, 206881, 261998, 498553, -50616, 163544, 190340, 133822, -36399, -124178, 535932, 417256, -123554, 122121, 39022, 305232, -15772, 61820, -53626, -221687, 130181, 433798, 121389, 254996, 94970]
13285B09961c32481A72164J40376j25356I0176J77650A24012l1810K22774b08554
13274b718G2467J66364j00888m1520L01894C2128G486P1249K64504J9700G5468
13262i8528J6934C14684F1243k9782J04669a05358B742P5619J56986J4941l7015
13251B13273r5227a1050A34256b5194r5388L3804i146E7576C696a84371B90165
13239F6930P1734f0223J0801A94629a134k32156f4391B7726L70083o9012I3166
13227A40556K9073a72266B9892R4968k3285k6674K9766b0735A23530D8213b87657
13215A82024J22024C8149i2147A57194a78120A51409n6371b97630A3149J44831
13205A57980B2968J16993m8720N0491e7758B954L43168j52170J17558F7333M7147
$$ y = [209961, -332481, 172164, 312540, 187184, 90176, 267826, 124012, 92202, 314976, -208554, -2718, 72467, 238831, 137943, 96423, 398317, 32128, 7486, 78735, 343239, 362939, 75468, -98528, -81594, 314684, 61243, 31461, 136130, -105358, 2742, 78361, 235347, 250288, 213273, 118046, -11050, 134256, -25194, -120582, -86778, -9146, 57576, 3696, -184371, 290165, 66930, 138664, -60223, -49422, 194629, -1134, -233290, -64391, 27726, 397809, 328797, 93166, 140556, 169629, -172266, 29892, 124860, 101575, 74901, 104667, -20735, 123530, 48213, -287657, 182024, 304048, 38149, -92147, 157194, -178120, 151409, 95038, -297630, 13149, 157980, 22968, 139961, 91241, 141732, -57758, 2954, 346122, 193952, 311510, 67333, 114480]
13194A14480O9864o8713N5074k1613R9608b21221D28703a89613F5586i0447A67245
13182A58295m9224O7749b60047B87248r1964J07407H7436a79843B76098P4073
13172C50171A07948j4188b43377F8854J37180a66428j04831B78297a59140e2243
13161b01251B15248m0371b06368I994J37230Q8660i4349M5945F7570l2896L16417
13150C51091j42889b6470H507K4340a3242E628R9896e6942n0896j09101B44095
13138C43241C0854a99379L4107C86087a25068C1500L4437h6518D1107K01539k8328
13127B14318A04093a71710F8891J78902h0136C94692a27980B01684J60458a41643
13116B34811b9701j55277c8197e209B70088D3778b05993I567J43651m2475p122
$$ y = [114480, 184344, 115631, 170705, 149092, 248700, -221221, 428703, -189613, 65586, -90447, 167245, 158295, 109071, 176820, -260047, 287248, 195284, 302691, 87436, -179843, 276098, 350171, 107948, 93760, -243377, 68854, 206034, -166428, -271259, 278297, -159140, -52243, -201251, 215248, 174877, -206368, 9994, 147224, 235884, -94349, -48404, 67570, 34674, 351091, 208202, -26470, 8507, 32847, -13242, 5628, 105524, -56942, -107838, -216939, 244095, 343241, 30854, -199379, -165272, 386087, -125068, 31500, 65937, -86518, 41107, 242646, 214318, 104093, -171710, 68891, 247793, -80136, 394692, -127980, 201684, 362142, -141643, 234811, -29701, -184978, -38197, -5209, 270088, 43778, -205993, 9567, 153218, 110743, 103621]
13105A03621l0890a3934m4181l08589a19926B15733N2611F3378K05660C1905R1701
13094A23606D02d45987h7885j18966N2118d0585J7808C13367b50354A97842e9283
13082B3508K06138D8790L81762A3244K1185J65297G3260Q4945c0663j99190D68036
13070f4895C69936a95193i2253B69780B9509g5348A79502b7166A29079J5563c3152
13058A66196K4892c3689m1395C51720A13401D1387b30824j0260C43827E2403l633
13047D8770d6272o1804A76344a32114j06100J12638B07686n5792R8034a31016
13036A54990b2594A71474G0845R5542J1091b05807F5565O295a1584j1958j70885
13025a94427D4384J68804H5308q117J74101q3918J3545E6728Q1580O2270K1833
$$ y = [103621, 72731, -13934, -58115, -366704, -119926, 215733, 268344, 63378, 269038, 31905, 123606, 402, -445987, -87885, -206851, -154733, -40585, -22777, 313367, -250354, 197842, -59283, 23508, 229646, 48790, 430552, 13244, 34429, 199726, 73260, 158205, -30663, -229853, 468036, -64895, 369936, -195193, -92253, 269780, 29509, -75348, 179502, -27166, 129079, 144642, -33152, 166196, 191088, -33689, -75084, 351720, 113401, 41387, -230824, -241084, 343827, 52403, 48770, -46272, -108076, 176344, -132114, -238214, -125576, 207686, 151894, 249928, -131016, 154990, -22594, 171474, 70845, 166387, 177478, -205807, 65565, 71860, -11584, -23542, -194427, 44384, 213188, 85308, 77191, 251292, 167374, 180919, 56728, 138308, 200578, 222411]
13014B22411F0654J12835k8133E2930J61559M8115j27724i8729A66814n9897B5880
13002C6420R201J10101J53785j17751I5718K00429i223C16420j20956p0090K05688
12991C31062d9478k81200E4076O6768K73383i1978K1899m5842j99071A2165K65249
12980B77414j5241g8553K2011j28630d7794A43957a23647A53672c22514A32927
12969G7551J61467Q132C9841a86655A62918F1279q57c67084A53211R3891g3224
12957i2270A56755a7071l23432B2836a75390b1345A98644p022b18936D134M0391
12946D4525b00418E6778j7106J20851a36681I5128A5559d9766G8689e3766A83231
12934c7387I1189J90591j27085c9090k10546J08753k3596f8900B3425p466J56236
$$ y = [222411, 60654, 173489, 145356, 52930, 214489, 262604, 134880, -98729, 166814, 106917, 25880, 36420, 45621, 155722, 309507, 191756, 95718, 296147, -9223, 316420, 195464, 125374, 331062, -49478, -330678, 54076, 120844, 394227, -91978, -70079, -115921, -314992, 12165, 277414, 262173, -78553, -56542, -185172, -47794, 143957, -123647, 153672, -322514, 132927, 77551, 239018, 247150, 39841, -186655, 162918, 61279, 60422, -367084, 153211, 247102, -73224, -92270, 156755, -17071, -340503, 22836, -175390, -21345, 198644, 191622, -218936, 4134, 44525, -200418, 56778, 39672, 160523, -136681, 95128, 15559, -49766, 78689, -53766, 183231, -37387, 91189, 281780, 154695, -39090, -249636, -140883, -164479, -68900, 23425, 15959, 172195]
12923A72195a66263G2072c6745k22429j67369c7544A29413K1220a8108j24381
12913a42489N8372I1600c9138J5492I2798l5109J88281j03448J20356a12547K6815
12902h5732A56076d33875E53504a24565r2121C15700a86824g7833C6236J72586
12892B08822i0082J247G7583J31138f4314j65228A2046J85462a01400d4453Q279
12881c6174A34213b26341I1674i8873A13306K9807L1815E0600a76045M3899A49514
12869b84674A31011e7457B83282b6987A84642q8012K40945a88548g5760B03201
12858B4118G039M4375K1124i5626C857f4586j2988A5981Q922j2141c5196j01359
12846a36555a3428A75792L8553k6070f2236A31414K3272D5507b11963b0431q2883
$$ y = [172195, -166263, 72072, -36745, -259174, -426543, -37544, 129413, 150633, -18108, -142489, -84117, 91600, -39138, -23646, 92798, 57689, 245970, 142522, 262878, -112547, -85732, 156076, -433875, 553504, -124565, -216686, 315700, -186824, -77833, 36236, 208822, -90082, -88835, 77583, 208721, -64314, -229542, 12046, 197508, -101400, -44453, -36174, 134213, -226341, 91674, -98873, 113306, 143113, 174928, 50600, -176045, -132146, 149514, -284674, 131011, -57457, 283282, -26987, 184642, 96630, 337575, -188548, -75760, 203201, 24118, 7039, 51414, 72538, -95626, 3857, -64586, -77574, 15981, 24903, 12762, -35196, -136555, -13428, 175792, 214345, 188275, -62236, 131414, 154686, 45507, -211963, -20431, -103314]
12835a03314k45179J35803Q7976A23032i415k8965C17326B3511P5610J58725H9568
12823i2239C4684b23343b4134o7255B39941f9436A05008J75340a66131a4077l694
12812a7771k93227A30042j4894K4491K25316b3974A10243a67810G8418J15833
12802A94251B2993a96914A11898b45B99129l6110i681k22650A08198J37644A1621
12790C70200g4902E8146J10339e189j19072O1258A79906F4524J2966c4683k6740
12779f1423B07433B6840a61817n9040a0068A52275b02994h2030G9488a43924l9069
12768a82993A34460d06933e6451B53706g4934A61590b27578F6433b44705m0221
12758b84926e9274r8367N3664A05048a20523B34714q3820a99913A69492Q9321
$$ y = [-103314, -348493, -212690, -124714, 123032, -9415, -38380, 317326, 23511, 99121, 257846, 89568, -92239, 34684, -223343, -24134, -91389, 239941, -69436, 105008, 280348, -166131, -14077, -17771, -310998, 130042, 115148, 139639, 364955, -23974, 110243, -167810, 78418, 194251, 22993, -196914, 111898, -245, 299129, 263019, -9681, -232331, 108198, 245842, 11621, 370200, -74902, 58146, 168485, -5189, -124261, -63003, 179906, 64524, 77490, -34683, -61423, 207433, 26840, -161817, -220857, -10068, 152275, -202994, -82030, 79488, -143924, -182993, 134460, -406933, -56451, 253706, -74934, 161590, -227578, 66433, -244705, -284926, -59274, -157641, -103977, 105048, -120523, 234714, 150894, -199913, 169492, 258813]
12748B58813b2646A54166b68962N3522A69708E4062f0163I2532j9606K18909K15906
12737E07741F7390e0241B0759M8301k2933c4326k41504H9358K41240A17179h4226
12725a28840A00967Q2024R5016F1609j9190c50542A36909g8293A93545a65327
12714I8119Q6687E3259N3656J7331h8473C17592H6827L12148j51827K0187K13623
12703D80958Q2783G4557K9489O7556K2323a28492r626j52461A39581C2643c0439
12691c779F3031c4631M798j14862B1496a1836p6697A35873a35846B66779m5430
12680B21349J35267A63477b38301A7683J30473E3045O2257d3693F7882a48594
12669a24177C7088J69408A5681M64048i0254A69343e949A02704J52322d6195C31703
$$ y = [258813, -22646, 154166, -268962, -215440, 169708, 54062, -60163, 92532, 72926, 291835, 507741, 67390, -50241, 20759, 69060, 46127, -34326, -275830, 89358, 330598, 117179, -84226, -128840, 100967, 182991, 278007, 61609, 42419, -350542, 136909, -78293, 193545, -165327, 98119, 184806, 53259, 106915, 124246, -88473, 317592, 86827, 398975, 247148, 267335, 480958, 563741, 74557, 104046, 171602, 193925, -128492, -138118, -290579, 139581, 32643, -30439, -3779, 63031, -34631, -29833, -144695, 21496, -11836, -88533, 135873, -135846, 266779, 221349, 356616, 163477, -238301, 17683, 148156, 53045, 115302, -43693, 67882, -148594, -124177, 37088, 206496, 15681, 479729, -90254, 169343, -5949, 102704, 255026, -46195, 331703]
12657A13571a00220B66673b34785B09619l758G2463j3752a59505A12582B0303
12646a9259A97768b04025B49297j17267g813k04669L9669j9567A60963j6484b4630
12634B16553p5037c9384k5386K380A73760k3008O8924a16612a6734G016J42746
12623A49762b4720H9658j0212R6651a39117f3641l77840A19811J1486D6705J6307
12612F3012a40851d848B08547a6834j46017B48760Q3194D6617J85711o1839m0449
12601A30040Q2707l9742H6464i3005j9834B49454c2992A60582I907J9349d8855
12589B87912F836a68080d7038K329C61537A22036D8269f9539C11205c5506c45
12577c1004j7792a7524B98685a00929A76672j8055L8314h3802L954F5372I035
$$ y = [113571, -100220, 266673, -234785, 209619, 205861, 72463, 58711, -159505, 112582, 20303, -19259, 197768, -204025, 249297, 132030, -7813, -212482, -172813, -192380, 160963, 144479, -24630, 216553, 141516, -39384, -64770, -62390, 173760, 150752, 219676, -116612, -16734, 7016, 149762, -24720, 89658, 79446, 176097, -139117, -63641, -441481, 119811, 131297, 46705, 63012, -140851, -4848, 208547, -16834, -162851, 248760, 331954, 46617, 232328, 170489, 130040, 212747, 173005, 86464, -93005, -112839, 249454, -32992, 160582, 9907, 29256, -48855, 287912, 6836, -168080, -47038, -44709, 361537, 122036, 48269, -69539, 311205, -35506, -345, -31004, -48796, -17524, 298685, -100929, 176672, 158617, 196931, -83802, -79848, 65372, 9035]
12565a30813D9596d6548I9923b10009L8118k1176A0573e2991A51029c16892B98339
12553c94217A60215a84049E7273c1985A73294b72785A73790e9170m3673C01307
12542d1156B12857J29741h3538J5462J8284A69975E1094J40811P7856g321B988
12530G9935C0406a13265r6860J5425l2221A1417J01506N5616a04655B71226e6830
12518C88628A49308d1063p9426A41507a17526A25096O5715a92680A3628e6342
12507a41970L9366G350K09236J01071a6122j4927A54794a49046a4083A79426J53364
12496C32790a9297r6253c2017j16568L2638H3834Q9920b13100l2305i9076l84871
12485d83947A69954e4970A05792J4568a58823N7419B19475k3089b838D12591A68229
$$ y = [-130813, 49596, -46548, 99923, -210009, -171891, -193067, 10573, -52991, 151029, -316892, 298339, -394217, 160215, -184049, 57273, -31985, 173294, -272785, 173790, -59170, -102843, 301307, -41156, 212857, 342598, -83538, -68076, -49792, 169975, 51094, 191905, 269761, -7321, 2988, 79935, 30406, -113265, -210125, -194700, -226921, 11417, 112923, 168539, -104655, 271226, -56830, 388628, 149308, -41063, -120489, 141507, -117526, 125096, 190811, -192680, 13628, -56342, -141970, -102604, 7350, 216586, 317657, -16122, -31049, 154794, -149046, -14083, 179426, 332790, -19297, -115550, -32017, -148585, -115947, 83834, 173754, -213100, -245405, -99076, -483947, 169954, -54970, 105792, 120360, -158823, -101404, 219475, 196386, -2838, 412591, 168229]
12473B25182E3614J36702a83490j81761D2990D586J52649i0993P9j45479C2084
12461B52952n1145a82105H2161a1997A2009h0972A84646g8848k00500A19969J92313
12450C12282c2498E6814R1183L3016a32745A16003C6823O2180c79524A26600g7474
12438B19530e1617q9074K5266c7793q0621A95613b1543A25579i4771K1039H3985
12426B56286j20122a40856J8392b4234n3412o7563j45844d0926I1630a51550f2522
12414a44513A04216Q8486a59412m2839A23034a13284b9215D3727O3899J29213
12404B36839a03350J0219A748i9353A83914b45284A55247a6144A76843a26157
12393B09572b04097C20407i660l19460B6935f0969A54678a26048B40060N451a84315
$$ y = [225182, 53614, 190316, -183490, -365251, 42990, 4586, 157235, -90993, -90914, -236393, 32084, 252952, 201807, -182105, 82161, -11997, 12009, -80972, 184646, -78848, -279348, 119969, 312282, -32498, 56814, 147997, 181013, -132745, 116003, 36823, 99003, -379524, 126600, -77474, 219530, -51617, -140691, -115425, -37793, -118414, 195613, -21543, 125579, -94771, -73732, 83985, 256286, 136164, -140856, -122464, -24234, -77646, -145209, -291053, -40926, 91630, -151550, -62522, -144513, 104216, 192702, -159412, -202251, 123034, -113284, -29215, 43727, 107626, 236839, -103350, -93131, 1748, -99353, 183914, -245284, 155247, -16144, 176843, -126157, 209572, -204097, 320407, -9660, -329120, 26935, -60969, 154678, -126048, 240060, 245511, -184315]
12381g4335q8590A73425A3631J32979F0875a25005E8323i6707L0990A1653J97620
12370B09273c1870D0454R130O0481P6828d9807j06599O533m0495r5008F4277J40797
12358B05074Q7862a08661A4939K7943a57988c7524E4663g9712A288K83343b8437
12346A91825E5057f9563A24044b87676J10181O8301H5671a55456r1220H8353l7161
12335E1192b87565a1846A55129J51609C2568f1790I7085a54958I7459m0513b66421
12323B35841a52937L1171A04272l4058B2496O9392J51879R0524J57795c62A21756
12311D9614c0585C64317H2432c24213A26656Q896a06410H3382A6342L62018b8792
12299A77813L332a99356A27961A1289P2406f3538J6481B5893K22626F7067f5274
$$ y = [-74335, -162925, 173425, 13631, 146610, 60875, -125005, 58323, -96707, -65717, 11653, 209273, -31870, 40454, 49584, 110065, 186893, -49807, -156406, -149873, -190368, -285376, 64277, 205074, 292936, -108661, 14939, 42882, -157988, -37524, 54663, -79712, 1288, 284631, -28437, 191825, 55057, -69563, 124044, -287676, -177495, -109194, 85671, -155456, -246676, 88353, 51192, -287565, -11846, 155129, 306738, 32568, -61790, 97085, -154958, 97459, 56946, -266421, 235841, -152937, -121766, 104272, 70214, 22496, 91888, 243767, 334291, 492086, -362, 121756, 49614, -30585, 364317, 82432, -324213, 126656, 135552, -106410, 83382, 16342, 378360, -28792, 177813, 181145, -199356, 127961, 11289, 83695, -63538, -47057, 25893, 248519, 67067, -65274]
12287C59726j70150i7122B1216K2015P5620D6239K08789b23655A99162l2987C9267
12275A20251O9096E9195A7776G971M7455J5331f9524F00886D4690P8211l8883
12264H4018b6857B58167a67816f9063A89137O7210A12205C2114K91633N2901A44501
12252a61769A01501f7738m2762A29298n2672K10559c3545l16555a6064H8390C9220
12240C08392j18316B8370b61H5524P051g038B58886a17521B847J43581B2291K2777
12228D5068M0181m2203K32198J16797D522K98839A21886P9907p7300J53624J6276
12217B94393k1492L17135B82343J97868i5712C21573p7731j11744K6232b1612
12206A00656a01366B51346A24337J47382p9446F5020L103c725C73197j68603r5635
$$ y = [359726, 189576, -97122, 21216, 43231, 118851, 46239, 255028, -223655, 199162, 166175, 39267, 120251, 189347, 59195, 17776, 7971, 55426, 70757, -69524, 600886, 44690, 122901, 84018, -26857, 258167, -167816, -69063, 189137, 256347, 112205, 32114, 323747, 376648, 144501, -161769, 101501, -67738, -110500, 129298, 76626, 287185, -33545, -350100, -16064, 88390, 39220, 308392, 190076, 28370, -261, 85524, 92575, -7038, 258886, -117521, 2847, 146428, 22291, 45068, 85249, 43046, 275244, 392041, 4522, 303361, 121886, 201793, 124493, 278117, 294393, 272901, 590036, 282343, 480211, -95712, 321573, 243842, 132098, 158330, -21612, 100656, -101366, 251346, 124337, 271719, 192273, 65020, 68123, -3725, 373197, 204594, 108959]
12195A08959J04870l1828q2708a114A83017c1310j02513c4601B00436a6084E70785
12183a08173K4685F300J59015E4033K2731a2606G4759h4970D93507A32348K07929
12172C40277l1410D5708a56782A04118K10560e8983B42048r2762O6080J04932
12162C20298n7958A8450J59518P2715j19957a67367B11026H2951b63948A10873
12151A68178J9079E3449J16082A203J81875a49532B09167L726F1192a76848C5902
12139A02770K21855m2775E82J45161b94426A66796j4223I681O4618f4014H0470
12127A04822q161K62787J35291F6639h8929B23870g3225E6057M0863a69215f7624
12115a43579A37065o4168O4922J22753L722g9439b9508H2702a2095A50516k1595
$$ y = [108959, 213829, 182001, 99293, -1114, 183017, -31310, -133823, -34601, 200436, -16084, 570785, -108173, -83488, 6300, 165315, 54033, 76764, -12606, 74759, -84970, 493507, 132348, 340277, 308867, 45708, -156782, 104118, 314678, -58983, 242048, 149286, 215366, 320298, 262340, 18450, 177968, 250683, 130726, -167367, 211026, 82951, -263948, 110873, 168178, 187257, 53449, 169531, 1203, 183078, -149532, 209167, 212893, 61192, -176848, 35902, 102770, 324625, 281850, 582, 145743, -294426, 166796, 152573, 9681, 74299, -64014, 80470, 104822, 96661, 359448, 494739, 66639, -88929, 223870, -73225, 56057, 96920, -169215, -67624, -143579, 137065, 72897, 137819, 260572, 264294, -79439, -29508, 82702, -12095, 150516, 128921]
12104A28921E6659c7211l25456J62262B04306b8200A22757f1685r9634B14356
12093c52262B59822j07836a21019a6197B71972k4294E7791N7a44545D046a64353
12081a47835a2774A02114D0923b5607l1853A99423q9215N7883J1523p1625O1563
12070A69552A6167L71235A87016K27037a5225j26959n2733B40356e4349B85716
12059b24839f1574j35925A00523J35558K5156D6920b9230H5997e7951A75615a74755
12047E4915a70169q3628J20525j63545f2283A44283b64547D9948L7203f7536A41653
12035a37301H8140J90429j12721R9319c75234I6091d9231i671A95443a4052B01473
12023b30137A45494d6377A09656h8364B00437Q802F8155J22013C0440K72381a38295
$$ y = [128921, 56659, -37211, -362667, -200405, 204306, -28200, 122757, -61685, -161319, 214356, -352262, 259822, 151986, -121019, -16197, 271972, 247678, 57791, 57848, -144545, 4046, -164353, -147835, -12774, 102114, 40923, -25607, -57460, 199423, 110208, 168091, 179614, 107989, 169552, 16167, 387402, 187016, 414053, -15225, -142184, -194917, 240356, -54349, 285716, -224839, -61574, -197499, 100523, 236081, 261237, 46920, -29230, 85997, -57951, 175615, -174755, 54915, -170169, -253797, -133272, -296817, -62283, 144283, -264547, 49948, 87151, -67536, 141653, -137301, 88140, 278569, 165848, 265167, -375234, 96091, -49231, -9671, 195443, -14052, 201473, -230137, 145494, -46377, 109656, -88364, 200437, 209239, 68155, 190168, 30440, 302821, -138295]
12011e52440a09657B00466b57343E3177M78019k20540a7698l3300j52773N3216
12001a50555e7137j2660h571A19357a87383c0657k8060F3651K7609L00878a41518
11989A22962B456b85893h0832a5793n7687A17371a72921j1889L5422H9256d50864
11977g4523D2719a07466K9074G8298a61860C4069a43362b010C05282c7434B2171
11965a91953N9140j18688J00959G816c7788A36715C3909b94897B06386i034C516
11953I8814a49093C33158b26752M8985K0505L7972A56960f6318A59693m4395C7239
11941g7204C4204b52519M416i0379A14816e2198m9906A57633d1317B00403G928
11929H0978K47494c24878B86525a10014M2654o6430n4915B7760K07460b9152B05825
$$ y = [-552440, -109657, 200466, -257343, 53177, 531196, 310656, -17698, -50998, -203771, -150555, -57137, -69797, -8571, 119357, -187383, -30657, -58717, 63651, 91260, 392138, -141518, 122962, 2456, -285893, -80832, -15793, -73480, 117371, -172921, -184810, -149388, 89256, -450864, -74523, 42719, -107466, -78392, 78298, -161860, 34069, -143362, -2010, 305282, -37434, 22171, -191953, -132813, -251501, -150542, 7816, -37788, 136715, 33909, -294897, 206386, -9034, 3516, 98814, -149093, 333158, -226752, -177767, -157262, -119290, 156960, -66318, 159693, 115298, 37239, -77204, 34204, -252519, -248103, -90379, 114816, -52198, -102104, 157633, -41317, 200403, 7928, 80978, 328472, -324878, 286525, -110014, -67360, -133790, -188705, 27760, 235220, -29152, 205825]
11917d1717C31225G5232R1728G8419j380b07595d3009A78272b62546C6335R4436
11906A30771l5863B7959J5847J39726a29533B8406J60566b74185A0765b10148
11895c22625B38680e9587E2936a12004j07020c8448o3908j7544C60533a08787
11884A69237A0781b38281f7345p637j19067P9236e0072r9713A89748M5879a43774
11872b57042i7415k59206a60135I4137L0204a93566M6913H1819a77628j94797
11862c72425H7277a210j90521K1325A2636K42334b05075B40784q7307b31614M789
11851b26825D1236M0575J94685r6898G855a98572O0074O0255n0267e8554j03337
11840a61891H3390M8832a74728p2224h3341G9664K73797d09722d0415j2311p993
$$ y = [-41717, 331225, 75232, 166960, 78419, 77039, -207595, -43009, 178272, -262546, 36335, 130771, 94908, 27959, 43806, 183532, -129533, 28406, 188972, -274185, 10765, -210148, -322625, 238680, -59587, 52936, -112004, -219024, -38448, -102356, -119900, 360533, -108787, 169237, 10781, -238281, -67345, -74982, -194049, -114813, -50072, -149785, 189748, 235627, -143774, -257042, -97415, -356621, -160135, 94137, 124341, -193566, -146653, 81819, -177628, -372425, 87277, -1210, -191731, -170406, 12636, 254970, -205075, 240784, 153477, -231614, -226825, 41236, 81811, 276496, 179598, 7855, -198572, -138498, -78243, -128510, -58554, -161891, 83390, 132222, -174728, -246952, -83341, 79664, 353461, -409722, -40415, -52726, -60719]
11829f0719p5275A1065J92974b27096A6316K07095c24012a03963d3276E3414a52837
11817e1359j79523B43349q6300i879A91096a81326e0695j88004a6420l30856g0349
11805a53810k31362h7241j49143J09984J7527d7244B2885a75705j02604A13323
11794b72866f8608L2254j19204N6574A58311a51258B09405r1298l5471g2621j24880
11783a97501B12856F3713N4289O6676n8336g393l8447A4360b53247B88539b02444
11771B9079J81325E2819b19168d9396F7019a63674c6948k72615J48740f6204D0997
11759D8515Q1706c08179a17684E9694N2933J81587a64010B8962J76132J96567
11749D01661h393A02996E556i7741E6407K17918b26967h4701k34679P7546J13970
$$ y = [-60719, -135994, 11065, 204039, -227096, 16316, 223411, -324012, -103963, -43276, 53414, -152837, -51359, -230882, 243349, 157049, -9879, 191096, -181326, -50695, -238699, -16420, -347276, -70349, -153810, -385172, -87241, -236384, -126400, -108873, -47244, 22885, -175705, -278309, 113323, -272866, -68608, -36354, -155558, -98984, 158311, -151258, 209405, 118107, 82636, -72621, -197501, 212856, 63713, 118002, 184678, 126342, -7393, -45840, 14360, -253247, 288539, -202444, 29079, 210404, 52819, -219168, -49396, 67019, -163674, -36948, -309563, -160823, -66204, 40997, 48515, 130221, -308179, -117684, 59694, 112627, 294214, -164010, 28962, 205094, 401661, -8393, 102996, 5556, -97741, 56407, 274325, -226967, -84701, -319380, -241834, -127864]
11738a27864B33112a77557a9089j64248f2964o4292k44455E3562Q3004A3638a40086
11726B18928c6828F7512G523J53917a16195C5138J654e6753j3550I009J61965
11715A70974O4973K6225A02518M7100F4680J00512b09661f8410C2702c7513B0832
11703B26375F0006J54045b06534A52812p2793d0030l3392A2491N2728C1234i5412
11691A63955J38341o3898P1222I9641Q4146I450b13719F6609a89787A60853m8486
11680A12367H93J50466K53568p0207B0998J85295a08715j63568c8360D54957r625
11669D45332b1926C29959a5754E279e6128Q583B10584B4982a60477A08563a3597
11657A29470d5027l4298A67840n9703h850B1658J40874N1857d64752b32070M8393
$$ y = [-127864, 233112, -177557, -19089, -183337, -62964, -127256, -371711, 53562, 136566, 13638, -140086, 218928, -36828, 67512, 7523, 161440, -116195, 35138, 36792, -56753, -70303, 9009, 170974, 235947, 262172, 102518, 149618, 64680, 165192, -209661, -68410, 32702, -37513, 20832, 226375, 60006, 214051, -206534, 152812, 80019, -40030, -73422, 12491, 65219, 31234, -95412, 163955, 302296, 238398, 309620, 99641, 183787, 9450, -213719, 66609, -189787, 160853, 112367, 893, 151359, 404927, 334720, 20998, 206293, -108715, -272283, -38360, 454957, 445332, -21926, 329959, -15754, 5279, -56128, -47545, 210584, 24982, -160477, 108563, -13597, 129470, -45027, -79325, 167840, 108137, -8850, 21658, 162532, 214389, -464752, -232070, -183677]
11646a83677r2824A32655n9528K70863h1012j30592e1616E38264A04831g5494
11635a92624g0882A47297B2990K09791q3707J0278K8825d2666C13697j6414A29402
11623a06018A17440l1196P2419j5961C7940i788B38127j07180N7743J09996j25006
11612A73680d3740j2872A84977m849a74878g4990k35025a02631B911N7824j1661
11601D9074a17364C2137P2078J19188l5581F140a35911E7051i8177A43829G0350
11589H5150d6849l60B74620k0293J08774D1170d6587J9483G1090K26305l0924
11578B66471a71711G8628P668c32025a44469A57618b33607B85929B6163g8094
11567E8312Q4934j4156a15881G0737L6127L2360f2047a0163A6077J82237d9038
$$ y = [-183677, -276501, 132655, 73127, 343990, -81012, -211604, -51616, 538264, 104831, -75494, -192624, -70882, 147297, 22990, 232781, 149074, 159352, 188177, -42666, 313697, 297283, 129402, -106018, 117440, 86244, 158663, 142702, 37940, -9788, 238127, 130947, 188690, 298686, 173680, -43740, -56612, 184977, 180128, -174878, -74990, -310015, -102631, 2911, 60735, 49074, -117364, 32137, 104215, 223403, 187822, 6140, -135911, 57051, -98177, 143829, 70350, 85150, -46849, -47209, 274620, 254327, 363101, 41170, -46587, -27104, 71090, 297395, 266471, -171711, 78628, 86296, -332025, -144469, 157618, -233607, 285929, 26163, -78094, 58312, 143246, 129090, -115881, 70737, 106864, 139224, -62047, -10163, 16077, 198314, -49038]
11555E5232M07793A09029L922K20020a280A20464k0390O3506K87367a15992j29476
11544b45468C13612d26709B5123J4064L46335b8763C25402A09912B9082R1990
11534A21072J39147a07914A64532R7558B5881L6026J24724J42955a84281f7386
11523D4982j7272J18153a48609A08552P6030r1761a61552N0020A84088G3692i4388
11511a69551f9537j76104e7456A48180E4370J83189a4286j3138j12493d2133D57490
11499b636A54461J12778b33313F8333P6046J62875h0334A43035c3668J5748r3006
11488a10926M1028A540J16115a53410B25978b05705f599B29353o8356K5453m6553
11477A39897o8818L91146I2515h5245A63539b45222C2378J41653o7920i8857B19936
$$ y = [55232, 463025, 109029, 112951, 332971, -1280, 120464, 100074, 163580, 450947, -115992, -245468, 313612, -426709, 25123, 39187, 385522, -28763, 325402, 109912, 29082, 121072, 260219, -107914, 164532, 262090, 25881, 61907, 186631, 329586, -184281, -67386, 44982, 27710, 145863, -148609, 108552, 184582, 92821, -161552, -111532, 184088, 73692, -94388, -169551, -69537, -245641, -57456, 148180, 54370, 237559, -14286, -27424, -139917, -42133, 457490, -2636, 154461, 267239, -233313, 68333, 144379, 307254, -80334, 143035, -33668, -17920, -110926, -69898, 1540, 117655, -153410, 225978, -205705, -6599, 229353, 160997, 186450, 139897, 71079, 462225, 92515, -85245, 163539, -245222, 32378, 174031, 106111, -98857, 219936]
11465C28865j10520j04877O7302n864K72986B00605a647H7587K92666j77115d6035
11453a43640C41774A47833K11239G8067K6419k7835a35206A08510j5896g1722
11442a5856E2212J35157J59076q7801q4156j9445e0856j16255n6364B34198a6450
11430a78144A89318o106J47929e73812H5079b49193B61660a26786A45921A2064
11419A81159a12678E7558M0629C9105E157Q3829a74580K9113f0566B1476h4386
11407A6411J2088q174i2663k45007B44560A2400g1564j05085b631j88329I3682
11395B15549b82084B04859O8218b17162E2472i0352j10924B62068A6946J77760
11385A94706p7760k2304J8547N653K32667G6559g3078H3939e1459J4063l0159
$$ y = [328865, 218345, 113468, 180770, 174906, 447892, 200605, -1647, 87587, 380253, 203138, -46035, -143640, 341774, 147833, 359072, 78067, 104486, 76651, -135206, 108510, 92614, -71722, -15856, 52212, 187369, 346445, 258644, 174488, 155043, -50856, -167111, -223475, 234198, -16450, -178144, 189318, 183212, 331141, -573812, 85079, -249193, 261660, -126786, 145921, 12064, 181159, -112678, 57558, 98187, 39105, 5157, 88986, -174580, -145467, -60566, 21476, -84386, 16411, 28499, 20325, -92663, -337670, 244560, 12400, -71564, -176649, -2631, -190960, 93682, 215549, -282084, 204859, 273077, -217162, 52472, -90352, -201276, 262068, 16946, 194706, 116946, 94642, 113189, 118842, 351509, 76559, -73078, 83939, -51459, -37396, -67555]
11374f7555H8589K41440a6955j2178A2321L33745E0739N0189M534K635g5210Q198
11362f7012B90032c1740a0735j16015j31728A26954K7809b59819A09897a31002
11351A15017J11987A04289f6969n7996B8296a61326B96520b7436E8482a52448
11340C93019c09709J01313A81977A4766c9142A59399a79234l52098B16188a55111
11329a36561k48286J70905d6734N160r9988B92726d1653b342j63599H5618C0489
11317h1632F1564p087G915J75832f1428A51656c22179K9288h2462A18273M5708
11306A63981i2817A14154b0499j13300d846j15694p5650n0542K4602P0366K6547
11295a25217B30546d2454i461j12345E046J97216c9944k35344F4306N670B034
$$ y = [-67555, 88589, 330029, -16955, -29133, 12321, 346066, 50739, 100928, 105462, 108097, -75210, -67012, 290032, -31740, -10735, -126750, -258478, 126954, 154763, -259819, 109897, -131002, 115017, 227004, 104289, -66969, -124965, 28296, -161326, 296520, -27436, 58482, -152448, 393019, -309709, -208396, 181977, 14766, -39142, 159399, -179234, -531332, 216188, -155111, -136561, -384847, -213942, -46734, -41574, -141562, 292726, -41653, -2342, -165941, 85618, 30489, -81632, 61564, 54477, 7915, 183747, -61428, 151656, -322179, -292891, -82462, 118273, 163981, -92817, 114154, -20499, -133799, -4846, -120540, -196190, -246732, -222130, -151764, -125217, 230546, -42454, -9461, -121806, 5046, 202262, -39944, -275288, 64306, 69976, 2034]
11283a78191o6555Q4032Q33J825j1625M198e0987k43876P5139Q2738d3493B4558
11270h6846C43355A68577a77144a344r7357l67697g1372K0580k9551p0047k1847
11259a72237A26950h7645q2j51369n2612c391A2961J76469B1496b35114J9231
11248b15883c1040C3584h5450r9472b6932E217K53967j29087a35448B53407a4175
11236E0334A0568b40909J17345n5726A11486b39797B9975Q3715C2895L6105a45281
11224i2711p1225P6675B46750h1907k96210B39996E4194M0219k5533Q456a83898
11212b1786A2092i0096o5019N6860B4467G375c80014B7770J7145P270a24359I2212
11199A70005a22089r9078D7165f4418B4474K55207b28249B30795b24676b4342
$$ y = [-178191, -244746, -160714, -159881, -158056, -169681, -165483, -50987, -294863, -219724, -136986, -43493, 24558, -86846, 343355, 168577, -177144, -1344, -98701, -466398, -71372, -50792, -80343, -150390, -172237, 126950, -87645, -87727, -239096, -291708, -3391, 12961, 189430, 21496, -235114, -215883, -31040, 33584, -85450, -184922, -26932, 5217, 259184, 130097, -135448, 253407, -14175, 50334, 10568, -240909, -123564, -179290, 111486, -239797, 29975, 113690, 32895, 69000, -145281, -92711, -163936, -87261, 246750, -81907, -378117, 239996, 54194, 94413, 68880, 77336, -183898, -21786, 12092, -90096, -155115, -98255, 24467, 7375, -380014, 27770, 44915, 52185, -124359, 92212, 170005, -122089, -221167, 47165, -64418, 24474, 279681, -228249, 230795, -224676, -24342]
11188g9486K1831F2530a4550C597e7837E4676f6061E1401J7196Q727C8056c67878
11175a82908f970l4297A92290a68102A14689n3287J54416i7440k94159b9809b947
11163A08858C0672a19024j91612b2529A11410a17203k65448F4326j2493b28869
11152c20467a05208B00801D9025b73258j4770A12816b34734A20276Q9291K9392
11142B38959e4286I382a77131b7762l6511B228a80275h1158K4067D7111a42919
11130G6282a75971D4955a51904j2435C12770j01143J5841a2750p1996C46456a4292
11118B12839a8870E0035N8138i9644c3915A65771M4833a09346I8891d7903J0213
11107c7690F9667i7726g984A72884j9837Q7122F8639J7902J8843a4984A90094
$$ y = [-79486, -57655, 62530, -14550, 3597, -57837, 54676, -66061, 51401, 68597, 77324, 38056, -367878, -182908, -6970, -41267, 192290, -168102, 114689, 61402, 215818, -97440, -391599, -29809, -2947, 108858, 30672, -119024, -310636, -22529, 111410, -117203, -382651, 64326, 51833, -228869, -320467, -105208, 200801, 49025, -273258, -288028, 112816, -234734, 120276, 209567, 238959, -54286, 9382, -177131, -27762, -64273, 2228, -180275, -81158, -57091, 47111, -142919, 76282, -175971, 44955, -151904, -164339, 312770, 211627, 227468, -12750, -84746, 346456, -14292, 212839, -18870, 50035, 108173, -99644, -33915, 165771, 210604, -109346, 98891, -47903, -37690, 69667, -97726, -7984, 172884, 153047, 240169, 68639, 86541, 105384, -14984, 190094]
11095B0857K82818a54757B29947l4248H5706K27255o5825F816b22481A10966J44858
11084B55824K68602h3782F605M75004e6244D02663n0556K11955A08770C3529L14273
11073C47802r1801o6252R7330k3069D1036L29189p2686k5701k4007L5874o9707
11062B13998M20762B91966J36115j89526J00925J23345J16816j77921J18213R9535
11052F19468j60471m0246K22681j70785O823j53649K16624J70942J19283k06558
11042F24112L03797D59811K35191j15556L93847k60103J04887J60156j92953j69788
11032F15492M44828m89990J56459k93801N09453k98832q0871k526K27531O0611
11022H48354k39731Q4463J55187l91130k21439L98189J68110C89644R7705K27201
$$ y = [20857, 303675, -154757, 229947, 195699, 85706, 312961, 247136, 6816, -222481, 110966, 255824, 524426, -83782, 6605, 481609, -56244, 402663, 352107, 564062, 108770, 33529, 347802, 256001, 189749, 287079, 264010, 41036, 370225, 297539, 271838, 247831, 283705, 213998, 634760, 291966, 428081, 238555, 339480, 462825, 579641, 401720, 519933, 619468, 458997, 418751, 641432, 470647, 477470, 323821, 540445, 711387, 830670, 624112, 927909, 459811, 695002, 579446, 973293, 713190, 818077, 978233, 785280, 615492, 1060320, 570330, 726789, 432988, 942441, 643609, 562738, 560212, 787743, 848354, 608623, 693086, 848273, 457143, 235704, 633893, 802003, 389644, 487349, 714550]
11012G14550K4020R2791l29202m2246K48686k76397J38121k5375B58611L78073
11002F36684k19281J53590J78372k99414j7691L62939o7909l9399J06554C53219
10991F54461K01690m4510j74113O6675j39365M4955L76097j39471k2836J99450
10981A023033j80068k35864M60053k9719J83115j42141K26791K07346L33347J14615
10971A960508J86662K95264N25557j77143Q1535j30915j76381K47769r6369m98091
10961B218396j30554q9268l46400L05443j1291r7754J9253M6251o4254j12788
10951A737034P059m69140k35787Q0037m53142K59392j72670k64518J06532k01814
10941C92983h4642C52943j30287J20029A29428J61876q9197J10626a50474B47040
$$ y = [714550, 738570, 831361, 502159, 459913, 708599, 432202, 570323, 544948, 258611, 636684, 417403, 570993, 749365, 449951, 432260, 795199, 727290, 687891, 794445, 353219, 654461, 856151, 811641, 637528, 704203, 564838, 609793, 985890, 846419, 823583, 1023033, 842965, 607101, 1067154, 1037435, 1220550, 1078409, 1305200, 1512546, 1845893, 1960508, 2147170, 2442434, 2967991, 2790848, 2872383, 2741468, 2565087, 2812856, 2716487, 2218396, 2087842, 1998574, 1652174, 1957617, 1946326, 1848572, 1867825, 1914076, 1849822, 1737034, 1744093, 1274953, 1039166, 1119203, 666061, 925453, 752783, 488265, 594797, 392983, -84642, 352943, 222656, 342685, 129428, 291304, 202107, 312733, -150474, 247040]
10930b4336D07784j49833E2166M13568A13956J408b25663A13253c9577E8134K19950
10919B78084b54675C03458a37760B04069c9757A72555B9129f4168B04039I7151
10908A1743b09020P0843d1602d851B39265a9384A66628B9464Q7556J55027J2343
10897B84390B7425Q1269L42180j43067o4789b27837A08825a51813L4013m0858
10887a58658B2124Q5904Q922b82757e1292j81100j48144A40294a10158A37992
10876a64344B7530J43247h1783J0336o1951L653E3061a24237A302a8146j58191
10865a76337Q7634r5911A62596F5831K34675n309c6046H6507h5528L7877A55542
10853C1925J89588p3983a31894J234f1429D299J99017b33859A34141d0882B7553
$$ y = [-24336, 407784, 257951, 52166, 465734, 113956, 115364, -225663, 113253, -39577, 58134, 278084, -254675, 303458, -137760, 204069, -39757, 172555, 29129, -64168, 204039, 97151, 11743, -209020, -138177, -41602, -4851, 239265, -19384, 166628, 29464, 117020, 272047, 284390, 27425, 108694, 450874, 307807, 243018, -227837, 108825, -151813, -117800, -158658, 22124, 108028, 116950, -282757, -51292, -232392, -380536, 140294, -110158, 137992, -164344, 27530, 170777, -81783, -71447, -133398, -129745, 53061, -124237, 1302, -18146, -176337, -88703, -184614, 162596, 65831, 300506, 295197, -36046, 86507, -85528, -47651, 155542, 31925, 221513, 147530, -131894, -130660, -61429, 4299, 203316, -233859, 134141, -40882, 27553]
10841F901a91704D3348K526M543k4859B084b088j57815M7760l0807j3496B82864
10828d16368a32083n7103f8494A78393a06854d1302A01330C2644d3157G4991a7416
10816d6728r8826e7129n9720k55037a38088j65635I9985i6141l13592c3694A8577
10804A276b02818H6500K35999f5120j45760i8383G6200P1094j7804g698C55370
10792A65625f5913a789k40854A50811c48545d3788D29536a1889k92782H9278a35872
10780b95845G6487P9807C7189a86137o7276I1913b61852A22750a54095A6183f4900
10768a5266B8540m586a64446G3932O9658C2638a52387r3331f16F8907a00845O31
10756a00214j42783A42768b90167J39559A8947a37066H7498h0006o1501A94096
$$ y = [6901, -191704, 43348, 45874, 50417, 25558, 2084, -2088, -159903, -112143, -142950, -156446, 282864, -416368, -132083, -189186, -68494, 178393, -106854, -41302, 101330, 32644, -43157, 74991, -17416, -46728, -145554, -57129, -116849, -371886, -138088, -303723, 99985, -96141, -409733, -33694, 18577, 1276, -202818, 86500, 322499, -65120, -210880, -98383, 76200, 147294, 129490, -7698, 355370, 165625, -65913, -1789, -242643, 150811, -348545, -43788, 429536, -11889, -304671, 89278, -135872, -295845, 76487, 156294, 37189, -186137, -253413, 91913, -261852, 122750, -154095, 16183, -64900, -15266, 28540, 23954, -164446, 73932, 143590, 32638, -152387, -245718, -616, 68907, -100845, -100214, -242997, 142768, -290167, -150608, 18947, -137066, 87498, -80006, -141507, 194096]
10745b1685r7219d4655j41903A18113O9865a12522n9468A43953l6050a33986A22476
10733B25027c252k88319J44419m4194i4086B24245n8860a10465F6756J9994K3478
10722A10228G852c5236A94231a34846p6415A17712b32592G0224A5319d305l01339
10711c05644H3254a6229A71672c19645D8407a17228d108E364R502b05466d5547
10699A81212J03443C607R0536b17731E399a31401A8853a66488A09534a47452k015
10688a49467m6456q7864d9165G431a67913b3332A76788c61131J24698I7440J72833
10677B70273k3512I1582b45579R9761G7188h2708j66069J5798f0900E597d09659
10665a99057F9803d9692i366j78069i1840C4719a44533A15897a07202j65205D8660
$$ y = [-21685, -118904, -44655, -186558, 118113, 187978, -112522, -171990, 143953, 107903, -133986, 122476, 225027, -3252, -291571, -147152, -191346, -94086, 224245, 165385, -110465, 66756, 86750, 110228, 7852, -35236, 194231, -134846, -211261, 117712, -232592, 70224, 15319, -4305, -305644, 83254, -16229, 171672, -319645, 48407, -117228, -4108, 5364, 14866, -205466, -45547, 181212, 284655, 3607, 94143, -217731, 5399, -131401, 18853, -166488, 109534, -147452, -149467, -195923, -283787, -49165, 7431, -167913, -23332, 176788, -361131, -236433, 97440, 270273, 246761, 91582, -245579, -145818, 77188, -82708, -248777, -232979, -60900, 5597, -409659, -199057, 69803, -49692, -9366, -187435, -91840, 34719, -144533, 115897, -107202, -272407, 48660]
10653A47467n2407A0968f2974j63215c9772l10118g1091j33168C9520e8104A21325
10641H7362c86130B23606b11369j02116B71786i0498D8553b8855D9645b85718
10630c60194A07855a24126H9723L7040b34881J12133C3674M6858a01419o5604
10620a67023f1919n86533D24705C3046J91696A6049b42329A71026d2549k38247
10610b80796R9174Q9885j4735j49033G0994c68445A50553f008l295k64817G7613
10598b85785A11314l0259b8313F3532b07126q2952B79541A22925c36844c7656
10587B555b66738A89774b67957B09780h1553k8485k48654k7442C49110a72160
10576A64686A7760a34238B3049a76688B0193b91940C4524K98778a40932C3410
$$ y = [147467, 95060, 10968, -62974, -226189, -39772, -349890, -71091, -204259, 39520, -58104, 121325, 87362, -386130, 223606, -211369, -313485, 271786, -90498, 48553, -28855, 49645, -285718, -360194, 107855, -124126, 89723, 126763, -234881, -122748, 33674, 80532, -101419, -167023, -61919, -648452, 424705, 33046, 224742, 16049, -242329, 171026, -42549, -280796, -181622, -91737, -106472, -255505, 70994, -368445, 150553, -6008, -9303, -274120, 77613, -285785, 111314, 81055, -28313, 63532, -207126, -290078, 279541, 122925, -336844, -37656, 2555, -266738, 189774, -267957, 209780, -81553, -110038, -358692, -386134, 349110, -172160, 164686, 17760, -134238, 23049, -176688, 20193, -291940, 34524, 333302, -140932, 33410]
10565c22686d489B30774F865K3140L045O7925c39616f8347k51128b9922j14969
10554a44891l4898C11412A45782a41231C25207I8155e0117R308A76992j1553c44971
10542f2555A72536a28897A82962K8398m5732O8261g9775J2091H6401a38389j85737
10531c24126a54977d1223k3825k74854I2719c94542A71588k6361a5732l62859
10521c78591A1551Q4130c01514F224L7629h8363r2909l34437B04214K23297a30732
10509d55335A2279a54659L9424N0168k57001c1960B56023b94261C4930a58672
10498a27894N9311k80421A5951J22226D2537A4475e3233A07583a33259A19685
10487a71283a4204k3359M246k28326d1357B24070a20426r5110I8552Q7025j0718
$$ y = [-322686, -4489, 230774, 6865, 30005, 33050, 100975, -339616, -68347, -319475, -29922, -144891, -179789, 311412, 145782, -141231, 325207, 98155, -50117, -40809, 176992, 165439, -344971, -62555, 172536, -128897, 182962, 211360, 165628, 233889, -79775, -67684, 86401, -138389, -324126, -154977, -41223, -65048, -339902, 92719, -394542, 171588, 145227, -15732, -378591, 11551, 95681, -301514, 6224, 43853, -88363, -181272, -515709, 204214, 427511, -130732, -455335, 12279, -154659, -115235, -65067, -322068, -31960, 256023, -294261, 34930, -158672, -127894, -68583, -349004, 15951, 138177, 42537, 14475, -53233, 107583, -133259, 119685, -171283, -14204, -37563, -33317, -261643, -41357, 224070, -120426, -215536, 98552, 185577, 174859]
10476A74859p8526J91925G1745B2329b1997A1117N1919B1216K05807a86833A18703
10464B30443j08422m336c6533j55540A96491b35844F2632R2072a78073A12242
10453a21508e5818A17923j6167a99238j4894c7084K553B99516E313d241B0501
10441a36004B21853D9407f0638K9395H4587b08333m349q8522J25542B65598c6545
10429b12456J4535n2960D2516a92929o1440a03060o2180h032j75419B47514H2980
10417a15050A87702b70896r2919a35104b381r1582J790C25766b32134p8552C942
10405f6701B52273b94110G9021C0456P7957D1151g0277k30545B35421q6370P4731
10394B23782c1897D550K75362D5681A1388h6747C63673A6393K93613j20526O7119
$$ y = [174859, 96333, 288258, 71745, 22329, -21997, 11117, 63036, 21216, 227023, -186833, 118703, 230443, 122021, 117685, -36533, -192073, 196491, -235844, 62632, 154704, -178073, 112242, -121508, -55818, 117923, 101756, -199238, -214132, -37084, -34531, 299516, 5313, -4241, 20501, -136004, 221853, 49407, -60638, -31243, 84587, -208333, -212682, -301204, -175662, 265598, -36545, -212456, -197921, -250881, 42516, -192929, -254369, -103060, -165240, -8032, -183451, 247514, 82980, -115050, 187702, -270896, -363815, -135104, -2381, -93963, -92173, 325766, -232134, -310686, 3942, -66701, 252273, -294110, 79021, 30456, 108413, 41151, -70277, -300822, 235421, 149051, 223782, -31897, 4550, 279912, 45681, 11388, -86747, 363673, 16393, 310006, 189480, 256599]
10383B56599J17089i9174B24053i2803I8995a12778B76278G3373l5206J13678
10373A51845J4335m3360J73688b39036D74548A0337M74949r9335n3576J78569
10363E10944k11285Q1584O5561A50307O5914a4675C52148j56789a46991A26466
10352A96486D431K05466L7908M5234M69943C62834K89207B44623L24401B15132
10341A77917R6457J98478B24926D3330K95221E8500K99250e200B69346J4379D6748
10329B31530a45188B52668a70034A42257a94297B3001d9430B61121J11001C6159
10318B37906L46324i457F7657B2715K403K87617A51186k2401C3087J50673i5366
10306a29539g471C81276C6532K2077A2124K35621d3299j70405J9070E2157g1374
$$ y = [256599, 373688, -99174, 224053, -92803, 98995, -112778, 276278, 73373, 38167, 151845, 166180, 122820, 296508, -239036, 474548, 10337, 485286, 385951, 332375, 510944, 299659, 381243, 446804, 150307, 216221, -14675, 352148, 195359, -146991, 126466, 196486, 4431, 209897, 247805, 293039, 762982, 362834, 652041, 244623, 569024, 215132, 177917, 274374, 472852, 224926, 43330, 338551, 58500, 357750, -5200, 269346, 283725, 46748, 231530, -145188, 252668, -170034, 142257, -194297, 23001, -49430, 261121, 372122, 36159, 237906, 584230, -9457, 67657, 22715, 25118, 312735, 151186, 128785, 33087, 183760, -95366, -129539, -7471, 381276, 36532, 58609, 12124, 247745, -43299, -213704, -194634, 52157, -71374]
10294A60582A988J32060h1441I8590b40657a7372n8771n7507r9058j2365l1955
10283b77028A34388C2457b11376A32294a65293C0924b73877g2213l30692B78J42175
10272A42453d9488A58527A1874b3098B2192o707d1990A7951J0703b48556J21937
10261a26619H7897b18769b2542G557e3262C09939J53563J37071p8605p605k09179
10250C05184J23761b9433B61669E9219B8878L6219f3372A50720c99369I5832c19388
10238i4680B17161q3188a28881N4952k72194h2098I0385a40111l2978r1370A62671
10226H2008J46621b10909h7418m9165j04685c5066j10879D8722h8874O573C3318
10214c24400h8770A6335a27975k96556h2747m1279A64514m2273k2587b51308b0329
$$ y = [160582, 1988, 134048, -81441, 98590, -240657, -17372, -76143, -133650, -232708, -245073, -277028, 134388, 32457, -211376, 132294, -165293, 30924, -273877, -72213, -402905, 278, 142453, -49488, 158527, 11874, -23098, 22192, 15485, -41990, 17951, 28654, -248556, -126619, 87897, -218769, -22542, 7557, -53262, 309939, 463502, 600573, 521968, 514363, 305184, 428945, -29433, 261669, 59219, 28878, 65097, -63372, 150720, -399369, 95832, -319388, -94680, 217161, 133973, -128881, -73929, -346123, -82098, 90385, -140111, -173089, -264459, 162671, 82008, 228629, -210909, -87418, -136583, -241268, -35066, -145945, 48722, -88874, -82301, 33318, -324400, -88770, 16335, -127975, -424531, -82747, -124026, 164514, 122241, 99654, -251308, -20329]
10202b31813B43938c8488j36857P7746F0791K648b83458a30037O2731E3564B5707
10190f206B51505b39709f3436A17895c59867A17638d4146J8014j20044B3436d769
10178b9973H7062J37233G066c4550C2361N6273H767N7360b72074E232a47672A01343
10165H7680a15019m6989B8309J06477P9345b39178g7061B94060b63173E1237b70857
10153c10544g0017j63998e8368A19383m3071a1234B97577J00877a44258j11979
10143b56237P7951A86918b29911d3818k2580j04900A82117P0196b01104j4732
10133b15836k60985h9100H2241b87879A44590A4032a82841Q4854A37823a59998
10122a0764r7426I7942b09864C6398J1093J07496A5569a34753d3522j57007B09809
$$ y = [-231813, 243938, -38488, -175345, -97599, 60791, 63439, -283458, -130037, -67306, 53564, 25707, -6206, 251505, -239709, -63436, 117895, -359867, 117638, -44146, -26132, -146176, 23436, -4769, -29973, 87062, 224295, 7066, -34550, 32361, 88634, 8767, 66127, -272074, 5232, -147672, 101343, 87680, -115019, -162008, 28309, 134786, 214131, -239178, -77061, 294060, -263173, 51237, -270857, -310544, -70017, -234015, -58368, 119383, 76312, -11234, 297577, 398454, -144258, -256237, -178286, 186918, -229911, -43818, -66398, -171298, 182117, 252313, -201104, -215836, -476821, -89100, 82241, -287879, 144590, 14032, -182841, -97987, 137823, -159998, -10764, -108190, 97942, -209864, 36398, 47491, 154987, 15569, -134753, -43522, -200529, 209809]
10110E3744a43948k2615A2990J30804a28916B0991b57290A29260C3267J96557
10100B29824h1866G8672e4387r920F1115K9753c481j61171B34399a2627F0140
10088A27521a07234G2662b91604a04150b6014o3818k26329B67991A31167o2796
10078F8371c01309R6570B84661b66447O3917A99841D7140P8627b35491A46645
10067B1257b45860G7940g7061E4948a1583k98817a12555b8163k75500f2652B59241
10055a5723A04728e5991j91145J16597A05997A8566i4096a1184k9030G1341a81974
10043b2514F2533b87570a35011M344A15548M6098b87879e6850A31292C4611K4133
10032E8744f3076j54328N204F421b36505n0182a22990C68254G1635a09689n5957
$$ y = [53744, -143948, -166563, 12990, 143794, -128916, 20991, -257290, 129260, 33267, 229824, -81866, 78672, -54387, -64307, 61115, 90868, -3481, -164652, 234399, -12627, 60140, 127521, -107234, 72662, -291604, -104150, -26014, -89832, -316161, 267991, 131167, 68371, -301309, -204739, 284661, -266447, -202530, 199841, 47140, 125767, -235491, 146645, 21257, -245860, 77940, -77061, 54948, -11583, -310400, -112555, -28163, -303663, -62652, 259241, -15723, 104728, -55991, -247136, -130539, 105997, 18566, -94096, -11184, -40214, 71341, -181974, -22514, 62533, -287570, -135011, -130667, 115548, 161646, -287879, -56850, 131292, 34611, 58744, -63076, -217404, -212200, 6421, -236505, -286687, -122990, 368254, 71635, -109689, -165646]
10021a65646j3774Q8053P734G1222j6172J6976e3779j66793i6987G746a32160
10009A17506a94061A19748a22383A05520B3b63423j1866a8112A44402a52120A4617
9997a31395A09902f9329E239K21395a06825o4410J93O2958M8862j17412K6721
9986a49913b4527n8135C5606a73030K005j0743j52802E59411E4629J28097a69834
9974B29490g6682C18509A35070c3521a3233n5076k96689a42240H185J20134g7634
9962c76782d4640n2942A4862a77105j57891i669C2082e1250B9517J95695I2626
9950c3259E1618b13835H6271a58180J822n1278i6894p0864g6353m0561q2077B60944
9937a17097B07642n3439d5714a9956p091A72706h2982E4622a67874j47035c1294
$$ y = [-165646, -179420, -91367, -83633, 71222, 55050, 72026, -53779, -220572, -96987, 7746, -132160, 117506, -194061, 119748, -122383, 105520, 23, -263423, -275289, -18112, 144402, -152120, 14617, -131395, 109902, -69329, 5239, 226634, -106825, -171235, -171042, -108084, -59222, -176634, -149913, -24527, -82662, 35606, -173030, -171025, -181768, -334570, 559411, 54629, 182726, -169834, 229490, -76682, 318509, 135070, -33521, -13233, -68309, -364998, -142240, 8185, 128319, -77634, -376782, -44640, -97582, 14862, -177105, -334996, -9669, 32082, -51250, 29517, 225212, 92626, -33259, 51618, -213835, 86271, -158180, -156358, -207636, -96894, -167758, -76353, -116914, -198991, 260944, -117097, 207642, 154203, -45714, -19956, -27047, 172706, -82982, 54622, -167874, -314909, -31294]
9925c25989A1283K31437f9896k26744P9128g371n8844F1935A7080M16057F5071
9913C42f6085A29046d9825B75132E4079c39026K3450d2565j68253D5368a40076
9901a19037G4106a27174B64195a30140A89132o9505a68975A0545L6074b65836
9890f5386K4915E5396a66335a9991g947j65422h4636J4951A78409A5742J61641
9879A77383E1899b0823p1670j14783j27124J67177a7675k49856e227l53148B10103
9867a4369l0661E5332c15309n9826A60966c14296G1347a29598r4744h3124k6885
9856a10009B75839h9289l5891c6508A3392b4599n972k19247k4682F5758B0849
9844i2612j56360H1448a50715B78361a25067l7027j13435j15937a07328h753n2376
$$ y = [-325989, 11283, 242720, -69896, -296640, -217512, -7371, -66215, 61935, 17080, 433137, 65071, 342, -66085, 129046, -49825, 275132, 54079, -339026, -315576, -42565, -210818, 45368, -140076, -119037, 74106, -127174, 264195, -130140, 189132, 119627, -168975, 10545, 46619, -265836, -65386, -40471, 55396, -166335, -19991, -7947, -173369, -84636, -69685, 178409, 15742, 177383, 51899, -20823, -92493, -207276, -334400, -167223, -17675, -267531, -5227, -358375, 210103, -14369, -45030, 55332, -315309, -375135, 160966, -314296, 71347, -129598, -224342, -83124, -110009, 275839, -89289, -125180, -36508, 13392, -24599, -30571, -249818, -274500, 65758, 20849, -92612, -248972, 81448, -150715, 278361, -125067, -162094, -275529, -391466, -107328, -8753, -61129]
9833f1129A12775a17983G9569c775k7321p6829M3020A31863c67442O7721a21268
9821d12796a5710j96472J04906K4942n7144j7426c1024J0645C41139b09693B73916
9809b27372N6499D2038j0070a92108P1015k24419E2736a66995A37843b3414k58851
9798b82265J27883j71307B28273b6897k79165J30098J8405j12570d6955j63816
9788b10771I1990a05317a8235C7059b36070A0290K04689b38570G9174a08872n5530
9777a64402l2924A46058J85697a31526O1712F4188K45851b15l57671b3569B30768
9765B13273b67536L4988B6011J05687n6401c787p8958J5719A48723c67954e6972
9753A13051n3320b53501A87076q4855c85884h6084K5058j52897j8207Q9081r2875
$$ y = [-61129, 112775, -117983, 79569, -3775, -31096, -107925, -64905, 131863, -367442, -299721, -121268, -412796, -15710, -212182, -107276, -82334, -139478, -156904, -31024, -20379, 341139, -209693, 273916, -227372, -170873, 42038, 31968, -192108, -121093, -345512, 52736, -166995, 137843, -23414, -282265, -154382, -325689, 228273, -26897, -306062, -175964, -157559, -270129, -46955, -210771, 91990, -105317, -18235, 37059, -236070, 10290, 214979, -238570, 79174, -108872, -164402, -197326, 146058, 331755, -131526, -69814, 64188, 310039, -215, -357886, -23569, 230768, 213273, -267536, -232548, 26011, 131698, 75297, -3787, -82745, -67026, 148723, -367954, -56972, 113051, 59731, -253501, 187076, 102221, -385884, -86084, -61026, -213923, -232130, -143049, -235924]
9742b35924J02097c7294j01789A59407J19379D6948a42322k07001A7848g6381
9731B43888h1427k31720J18472f3225j02367I7763h4259j90921F5575J03348k4442
9720A44481K5565G1941e4375j4529j71411d0260p7163G7300I524J50790c4150
9708a5657n3840D0501b81461I0028c84470A79156p7561f9731k51912A64124J4313
9697A78437A652J13204a72663B86771B6709a33880A74881a14731j88409a12785
9686a03059C24126a18842k7624A31170n8247a71906q2056a13867p9967K6661A65329
9674b0994k98637k213a12391n7301K2726D9717J1737f3646m8515D089L2991c77907
9661D7451a95340r3087E2876a79182a507j53249E1815a06101M8048k05J8778A12001
$$ y = [-235924, -133827, -37294, -139083, 159407, 278786, 46948, -142322, -349323, 17848, -76381, 243888, -81427, -313147, -194675, -63225, -165592, 97763, -84259, -275180, 65575, 168923, 144481, 170046, 71941, -54375, -68904, -240315, -40260, -117423, 77300, 9524, 160314, -34150, -15657, -69497, 40501, -281461, 90028, -384470, 179156, 101595, -69731, -321643, 164124, 178437, 1652, 114856, -172663, 286771, 26709, -133880, 174881, -114731, -303140, -112785, -103059, 324126, -118842, -146466, 131170, 72923, -171906, -253962, -113867, -193834, -167173, 165329, -20994, -319631, -321844, -112391, -169692, -146966, 49717, 61454, -63646, -112161, 4089, 37080, -377907, 47451, -195340, -288427, 52876, -179182, -1507, -154756, 51815, -106101, -58053, -58258, -39480, 112001]
9648b41j53474B3215b04837P2918I0345J8072c3269o1094j81956l74972e8657
9636a2143E4340H57L7098g327m0825k8283l18594J69094j28130g0261B33537j12095
9624A21442D2825A4879d48630C23456a50126k4622B858J66936b49916h5087q7643
9613a72730A11053b0759l8339j54268j8823M5511c612B54190b03417M0471o3066
9602b26012C62205d13684L1156A08144d55056A33761a61936g0717J5089j41780
9592a97408R7697A57800b09118A87077H5353d21056J77070E2963O0330b71807
9581c77178b5826j56471N4755B92880b32223F6491c22450G7167M0528E8515b34996
9569A98862J87382a70782A208L1567c53765A46464J160b85450A26371F2490a08963
$$ y = [-241, -153715, 23215, -204837, -131919, 90345, 108417, -33269, -94363, -276319, -651291, -58657, -12143, 54340, 857, 37955, -7327, -48152, -76435, -395029, -225935, -354065, -70261, 233537, 121442, 42825, 14879, -448630, 323456, -150126, -174748, 2858, 169794, -249916, -85087, -172730, 111053, -20759, -59098, -213366, -232189, -186678, -3612, 254190, -203417, -162946, -226012, 362205, -413684, -382528, 108144, -455056, 133761, -161936, -70717, -55628, -197408, -99711, 157800, -209118, 187077, 85353, -421056, -243986, 52963, 113293, -271807, -377178, -25826, -182297, -127542, 292880, -232223, 66491, -322450, 77167, 117695, 58515, -234996, 198862, 386244, -170782, 1208, 32775, -353765, 146464, 147624, -285450, 126371, 62490, -108963]
9557a61617a7342j11331k77830D15605F2936a4894j97864Q7655k45153B6610J59581
9546A86191F660J09736A7616P0699g5173L1265q4008j56230e8084A50623a80811
9534H2020J96719A30920k3182O3430C4966b63234k79960O7400h2316q4877b7136
9522b07909j29812f6870k52535A5210c92068B00433E233J23633d62566A00856
9511a56160l0184j08132A1351b05181I6585b92301a19223B77124n8557J07696
9501C26263f2781A96193A7237L42018a83434E0048J6144P9107b55040g219p3950
9490h1169F5065j9554R9168d12195N6456i2924E1942d59345B9511a98960D54i1053
9477c6534j04340D0108R3144B099O4138Q6266J774a99576B31846a7715n6090j97802
$$ y = [-161617, -17342, -128673, -406503, 415605, 62936, -14894, -212758, -125103, -370256, 26610, 186191, 6660, 116396, 17616, 88315, -75173, -43908, -127916, -284146, -58084, 150623, -180811, 82020, 278739, 130920, 107738, 171168, 34966, -263234, -543194, -475794, -82316, -167193, -27136, -207909, -337721, -66870, -319405, 15210, -392068, 200433, 5233, 128866, -462566, 100856, -156160, -186344, -294476, 11351, -205181, 96585, -292301, -119223, 277124, 218567, 326263, -62781, 196193, 17237, 359255, -183434, 50048, 66192, 145299, -255040, -7219, -81169, 65065, 45511, 144679, -412195, -355739, -92924, 51942, -459345, 29511, -198960, 454, -91053, -36534, -140874, 40108, 133252, 2099, 66237, 152503, 154277, -199576, 231846, -17715, -73805, -271607]
9465b71607H2094f2010j38304A8127a66333D3650k749J72808D4421a45724A30415
9453b10327N407A73706a61630B03152i9107D4675a46210D6471J60663E866c83855
9441i7187O777D5937i1820p3809P0785l09803a43825K5586B88765q739q510b65318
9428b20076H281f9294b8694F7394a34713j72975a17701K5122j99142A38000c31956
9416d0206F332d60599I586a67124a7097k02647A23799m0902l7743K233B0363l797
9404A6566d8625j2099A25746g3405j22115j1423A16318f2817B23580a2310j29584
9393a41894q413B1582a5535j83057j69032g1090q6461j14591B07958c6273k3226
9382e9499A16431c60023P606D39629a00712A48873g2705k9150D5019K0959b04329
$$ y = [-271607, 82094, -62010, -200314, 18127, -166333, 43650, 40901, 213709, 44421, -145724, 130415, -210327, -204920, 173706, -161630, 203152, -99107, 44675, -146210, 46471, 207134, 5866, -383855, -97187, -90410, 45937, -91820, -165629, -94844, -404647, -143825, -118239, 288765, 280026, 271516, -265318, -220076, 8281, -69294, -28694, 67394, -134713, -307688, -117701, -92579, -291721, 138000, -331956, -40206, 6332, -460599, 9586, -167124, -17097, -219744, 123799, 82897, 45154, 47387, 20363, 16566, -48625, -60724, 125746, -73405, -195520, -206943, 116318, -62817, 223580, -12310, -141894, -150307, 21582, -15535, -198592, -367624, -71090, -157551, -272142, 207958, -36273, -59499, 116431, -360023, -352417, 439629, -100712, 148873, -72705, -101855, 45019, 65978, -204329]
9370A11046a1426D0931J47650i1885o2261O4457n6815m2044c4095L147D63861
9358a31059j32683j07785A30009b89412h7782B4299d21323a670E228a32139C4272
9346h2367l813A52560h5326c5642B00159A9874L5770a31073A06634f8793m2117
9335a10910j43364A90113e2783j12103g6554q7624C9475a93618A4982Q174h6242
9323c80523A27205D5527A0819P7924b22690j11430h1257B44617b12064J03435
9313a08629E7124K91142a6792j03163j44473J09386A79082c04431d6528H2808
9302A83613D8800g6042n12j53489b5332k42065h9671K3806j94689e3375B04407
9290A20463J14305i1916A05781g8890L6853o8083j7905B69586c3961k18270P4773
$$ y = [111046, -11426, 40931, 188581, -91885, -154146, -89689, -146504, -188548, -34095, -30948, 463861, -131059, -263742, -371527, 130009, -289412, -87782, 24299, -421323, -1670, 5228, -132139, 34272, -82367, -86180, 152560, -85326, -35642, 200159, 19874, 55644, -131073, 106634, -68793, -110910, -254274, 190113, -52783, -164886, -76554, -164178, 39475, -193618, 14982, 23156, -86242, -380523, 127205, 45527, 10819, 88743, -222690, -334120, -81257, 244617, -212064, -108629, 57124, 348266, -16792, -119955, -264428, -155042, 179082, -304431, -46528, 82808, 183613, 48800, -76042, -76554, -230043, -25332, -267397, -89671, -65865, -260554, -53375, 204407, 120463, 234768, -91916, 105781, -78890, -42037, -110120, -128025, 269586, -33961, -252231, -177458]
9279a77458c3465k6194B77480h5575A60047o2034m6630J2479b00446F7995b01406
9267a451r0906I5871a01152j56653B05062b80816A05096b23687h9863A06167b04971
9255a24773n8622q8910j5786B8370b06283b0288i297n9768c0104k42926a07969
9243b85075A8262b52936J02519B59221a06400F9299h3740j60856B8336a7430k82483
9232b99913h7869a7328j06762j191I5094d4608B44752b46893b0795A5017b0464
9220F0879K30531d36601D97911a70357b9735r5006j43947a18965A41714L6419
9210A78133q5923a83236C53220A0526b16160B83036E0218a88177c5417F6740b0502
9198a03706K1886j05921e3964k0764b1643q3490a0807l18644e9673C8260f8979
$$ y = [-177458, -33465, -59659, 277480, -85575, 160047, 98013, 51383, 63862, -200446, 67995, -201406, -1451, -92357, 95871, -101152, -257805, 205062, -280816, 105096, -223687, -89863, 106167, -204971, -124773, -183395, -272305, -288091, 28370, -206283, -20288, -9297, -69065, -30104, -273030, -107969, -285075, 18262, -252936, -150417, 259221, -106400, 69299, -83740, -244596, 28336, -17430, -299913, -87869, -17328, -124090, -125281, 95094, -44608, 244752, -246893, -20795, 15017, -20464, 60879, 291410, -436601, 497911, -170357, -29735, -124741, -268688, -118965, 141714, 178133, 92210, -183236, 353220, 10526, -216160, 283036, 50218, -188177, -35417, 66740, -20502, -103706, -81820, -187741, -53964, -74728, -21643, -105133, -10807, -329451, -59673, 38260, -68979]
9186f5161k09754N5571h4834A33106b32731A61442m3694c10312F9359K312L37463
9175D09134A15492a30395E5943J27514K56999A22914E8336c5560A69493a06372
9164b08672d5770C6834a86846j80183a12183D2937c23952f6255o0235N7050F4141
9152a3945l25969b2498j90305j48070d3080r4173B47889b09090K344I3388L3751
9141A27139d6828j89026a17851j9384k7945j44292e3639k53094a43758D7100A337
9129G3277a6081B27367b24625O2237D8135b61218A90053a42520D3364a96205b2179
9117G0575k8222J49496O077A6797i3502j91692A31779e0061j28038k1723I2866
9105a18699C5860E879c3086l67694B71140E7721E026J12915a29339D2177K2374
$$ y = [-65161, -274915, -219344, -84834, 133106, -232731, 161442, 117748, -310312, 69359, 71671, 409134, 115492, -130395, 55943, 183457, 440456, 122914, 58336, -35560, 169493, -106372, -208672, -45770, 36834, -186846, -367029, -112183, 42937, -323952, -66255, -126490, -69440, 64141, -13945, -339914, -22498, -212803, -360873, -43080, -137253, 247889, -209090, -206746, 93388, 127139, -46828, -235854, -117851, -137235, -165180, -309472, -53639, -306733, -143758, 47100, 1337, 73277, -16081, 227367, -224625, -162388, 48135, -261218, 190053, -142520, 43364, -196205, -22179, 70575, 42353, 191849, 197926, 16797, -93502, -285194, 131779, -50061, -178099, -199822, 92866, -118699, 35860, 5879, -33086, -400780, 271140, 57721, 5026, 117941, -129339, 42177, 64551]
9094F4551b46916D2864K0763J329a71552C9542K15461c33108B5634m739b68550
9082b64024J03887A72731G0542b4900F301a1355E795M7148a544F0458f824B05514
9069f8301m487l00703R7303a34940p4823j18697A86154f1818C7739O0587m5400
9058E2926I597K6263i4756A89243b17925b3647j3804E1888a40349j08457J22340
9047a26466G9233d6189r381j16047j16915A18029c28111A38582e0949A9866L33692
9036C53558a4618r5168N3190m4240D2769K4415k9562h0349j11965b3324l58225
9025c81549a38897b4314r4553r2256C47501A70824b14837c9724m9431A31207a11546
9013H5022b4386k87655D2767b37811N3161F5449a86538Q5966B73198a74289k7479
$$ y = [64551, -246916, 42864, 63627, 64956, -171552, 39542, 255003, -333108, 25634, 20895, -268550, -264024, -160137, 172731, 70542, -24900, 6301, -11355, 5795, 52943, -1544, 60458, -6824, 205514, -68301, -72788, -373491, -276188, -134940, -209763, -328460, 186154, -61818, 37739, 98326, 52926, 9597, 35860, -94756, 189243, -217925, -23647, -37451, 51888, -140349, -248806, -126466, 79233, -46189, -55570, -171617, -288532, 118029, -328111, 138582, -50949, 19866, 353558, -14618, -109786, -56596, -100836, 42769, 67184, 37622, -80349, -192314, -23324, -381549, -138897, -24314, -118867, -211123, 347501, 170824, -214837, -39724, -89155, 131207, -111546, 85022, -24386, -312041, 42767, -237811, -184650, 65449, -186538, -100572, 273198, -174289, -201768]
9002b01768d8348r5615B6623d52398h7817p7505h0783B47942F6716b56361J23627
8991a32734d723E5036B1924c15192a23810k09008I2797b44297C08527I5960b10417
8979g5725n2226A72552E8010A5423e4838A55461a85040C12690F2447a7762m8207
8968f5969j37820g5725k27755B17099c75335J82198k9886F5744J34285d54427
8957a98704b1568F1102N2892a34805k01299e8451H5269B2232b29135A10231a35616
8945A3255b93247d8131j11352A32864d9242A05471k4316M2629a62666M481j23738
8934b81923g076j3451j76136D1177h8766B7752K25865e7521p871B14377I5788
8922d10997A44729L36426K165734M55592A088284A26467b05625C32139A09596
$$ y = [-201768, -48348, -143963, 26623, -452398, -87817, -165322, -80783, 247942, 66716, -256361, -132734, -4723, 55036, 21924, -315192, -123810, -332818, 92797, -244297, 308527, 95960, -210417, -75725, -127951, 172552, 58010, 15423, -54838, 155461, -185040, 312690, 62447, -17762, -65969, -203789, -75725, -303480, 217099, -375335, -193137, -223023, 65744, 200029, -454427, -198704, -21568, 61102, 113994, -134805, -336104, -58451, 85269, 22232, -229135, 110231, -135616, 13255, -293247, -48131, -159483, 132864, -49242, 105471, 81155, 123784, -162666, -158185, -281923, -7076, -20527, -196663, 41177, -88766, 27752, 253617, -57521, -65392, 214377, 95788, -410997, 144729, 481155, 2646889, 3102481, 1088284, 126467, -205625, 332139, 109596]
8912a75519B4779M3279A5261b26588J07358b9281j41936d9495C5085a27601e3353
8900c17682A15542J3062N9543b08857O9959i411p7299n1197A45238k7730a37370
8888C61135b48636b6652l31373A35498c138j85857A09696l0499j7007K223a71314
8876a3110j659j61594A91142h4243r3160A42207l3959b64407p3488I3606L2151
8865A25757D7050a56316p5659C54143I7262a0088E8840c67917A40992a12630j73264
8854b85894J14164D740a45727A0502h4205J4822F7820a7602A32847h0168C4700
$$ y = [-175519, 24779, 68058, 15261, -226588, -119230, -29281, -171217, -49495, 35085, -127601, -53353, -317682, 115542, 128604, 188147, -208857, -138898, -9411, -86710, -137907, 145238, 117508, -137370, 361135, -248636, -26652, -358025, 135498, -3138, -188995, 109696, 79197, 62190, 64413, -171314, -13110, -14769, -176363, 191142, -84243, -177403, 142207, 108248, -264407, -337895, 93606, 125757, 47050, -156316, -231975, 354143, 97262, -10088, 58840, -367917, 140992, -112630, -285894, -171730, 4740, -145727, 10502, -84205, -69383, 67820, -17602, 132847, -80168, 34700]
$$ [...]
##END NTUPLES=NMR SPECTRUM
##END=
