##TITLE=NES1061_CD-4_9883097_TrpMTpxYQ5
##JCAMPDX= 6.0         $$ Bruker NMR JCAMP-DX V2.0
##DATA TYPE= NMR SPECTRUM
##DATA CLASS= NTUPLES
##ORIGIN= BRUKER
##OWNER= Administrator
$$ 1.72 TOPSPIN		Version 2.1
$$ 2016-08-26 20:58:34.664 -0500  Administrator@X
$$ Compression mode = diff/dup
##.OBSERVE FREQUENCY= 400.02188249412
##.OBSERVE NUCLEUS= ^1H
##.ACQUISITION MODE= SIMULTANEOUS (DQD)
##.ACQUISITION SCHEME= undefined
##.AVERAGES= 64
##.DIGITISER RES= 22
##SPECTROMETER/DATA SYSTEM= spect
##.PULSE SEQUENCE= noesygpps1d.comp
##.SOLVENT NAME= COFFEE_meoh
##.SHIFT REFERENCE= INTERNAL, COFFEE_meoh, 1, 14.9621
##AUDIT TRAIL= $$ (NUMBER, WHEN, WHO, WHERE, PROCESS, VERSION, WHAT)
$$ ##TITLE= Audit trail, TOPSPIN		Version 2.1
$$ ##JCAMPDX= 5.01
$$ ##ORIGIN= Bruker BioSpin GmbH
$$ ##OWNER= Administrator
$$ $$ E:\/data/COFFEE/nmr/NES1061_CD-4_9883097_TrpMTpxYQ5/22/pdata/1/auditp.txt
$$ ##AUDIT TRAIL=  $$ (NUMBER, WHEN, WHO, WHERE, PROCESS, VERSION, WHAT)
(   1,<2016-08-26 20:58:29.429 -0500>,<Administrator>,<X>,<go>,<TOPSPIN 2.1>,
      <created by zg
	started at 2016-08-26 20:47:00.008 -0500,
	POWCHK enabled, PULCHK disabled,
       configuration hash MD5:
       21 0F 79 D6 B3 7B B4 F6 88 20 88 DB 03 48 BD 9F
       data hash MD5: 64K
       55 0B 0B 41 DC 54 7E 89 71 DC B4 7B 9E AB 5C 15>)
(   2,<2016-08-26 20:58:32.586 -0500>,<Administrator>,<X>,<proc1d>,<TOPSPIN 2.1>,
      <Start of raw data processing
       efp LB = 0.3 FT_mod = 6 PKNL = 1 PHC0 = 0 PHC1 = 0 SI = 128K 
       data hash MD5: 128K
       FA 52 80 9F 49 B9 39 C6 06 99 F3 C4 77 08 9F CA>)
(   3,<2016-08-26 20:58:33.461 -0500>,<Administrator>,<X>,<proc1d>,<TOPSPIN 2.1>,
      <pk PHC0 = -85.9845 PHC1 = 0 
       data hash MD5: 128K
       E5 B5 3E 84 CA 3A 60 CD 1E 83 CA 0B 39 92 93 85>)
(   4,<2016-08-26 20:58:33.820 -0500>,<Administrator>,<X>,<proc1d>,<TOPSPIN 2.1>,
      <abs ABSG = 1 
       data hash MD5: 128K
       6C 41 38 AC CA A4 A5 8D 56 1D 5C 03 CE 2A D6 18>)
(   5,<2016-08-26 20:58:33.914 -0500>,<Administrator>,<X>,<proc1d>,<TOPSPIN 2.1>,
      <abs ABSG = 2 
       data hash MD5: 128K
       D0 BF 64 A8 89 85 5E 35 B3 4E 79 C7 05 6E 46 A4>)
(   6,<2016-08-26 20:58:34.008 -0500>,<Administrator>,<X>,<proc1d>,<TOPSPIN 2.1>,
      <abs ABSG = 3 
       data hash MD5: 128K
       6F D1 CA 37 E4 4F 30 08 22 8B 21 61 BF 38 D9 28>)
(   7,<2016-08-26 20:58:34.101 -0500>,<Administrator>,<X>,<proc1d>,<TOPSPIN 2.1>,
      <abs ABSG = 4 
       data hash MD5: 128K
       0B 3D C8 08 A7 A1 AA 00 52 B5 65 05 91 EC E8 C8>)
(   8,<2016-08-26 20:58:34.195 -0500>,<Administrator>,<X>,<proc1d>,<TOPSPIN 2.1>,
      <abs ABSG = 5 
       data hash MD5: 128K
       6F 29 0B C5 FE F2 D3 FF 1B 8E 83 C2 77 76 8B 39>)
$$ ##END=
$$ 
$$ $$ hash MD5
$$ $$ 4A 13 33 3A 9A BF 5A BA 52 63 C3 23 33 36 34 5C
##$RELAX= 
##$RELAX= 
##$RELAX= 
##$RELAX= 
##$RELAX= 
##$RELAX= 
##$RELAX= 
##$RELAX= 
$$ Bruker specific parameters
$$ --------------------------
##$DU= <E:\>
##$EXPNO= 22
$$ [...]
150 150 150 150 150 150 150 150
##$TP07= 0
##$TPNAME0= <>
##$TPNAME1= <>
##$TPNAME2= <>
##$TPNAME3= <>
##$TPNAME4= <>
##$TPNAME5= <>
##$TPNAME6= <>
##$TPNAME7= <>
##$TPOAL= (0..7)
0.5 0.5 0.5 0.5 0.5 0.5 0.5 0.5
##$TPOFFS= (0..7)
0 0 0 0 0 0 0 0
##$TUNHIN= 0
##$TUNHOUT= 0
##$TUNXOUT= 0
##$USERA1= <user>
##$USERA2= <user>
##$USERA3= <user>
##$USERA4= <user>
##$USERA5= <user>
##$V9= 5
##$VALIST= <valist>
##$VCLIST= <CCCCCCCCCCCCCCC>
##$VD= 0
##$VDLIST= <DDDDDDDDDDDDDDD>
##$VPLIST= <PPPPPPPPPPPPPPP>
##$VTLIST= <TTTTTTTTTTTTTTT>
##$WBST= 2048
##$WBSW= 25
##$XGAIN= (0..3)
0 0 0 0
##$XL= 0
##$YL= 0
##$YMAX_a= 7098690
##$YMIN_a= -14799243
##$ZGOPTNS= <>
##$ZL1= 120
##$ZL2= 120
##$ZL3= 120
##$ZL4= 120
##$ABSF1= 14.9621
##$ABSF2= -5.596082
##$ABSG= 5
##$ABSL= 3
##$ALPHA= 0
##$AQORDER= 0
##$ASSFAC= 0
##$ASSFACI= 0
##$ASSFACX= 0
##$ASSWID= 0
##$AUNMP= <proc_prof1d_extract.lims>
##$AXLEFT= 0
##$AXNAME= <>
##$AXNUC= <1H>
##$AXRIGHT= 0
##$AXTYPE= 0
##$AXUNIT= <>
##$AZFE= 0.1
##$AZFW= 0.1
##$BCFW= 0
##$BC_mod= 0
##$BYTORDP= 0
##$COROFFS= 0
##$CY= 15
##$DATMOD= 1
##$DC= 0
##$DFILT= <>
##$DTYPP= 0
##$F1P= 0
##$F2P= 0
##$FCOR= 0.5
##$FTSIZE= 131072
##$FT_mod= 6
##$GAMMA= 0
##$GB= 0
##$INTBC= 1
##$INTSCL= 1
##$ISEN= 128
##$LB= 0.3
##$LEV0= 0
##$LPBIN= 0
##$MAXI= 10000
##$MC2= 0
##$MEAN= 0
##$ME_mod= 0
##$MI= 0
##$NCOEF= 0
##$NC_proc= -2
##$NLEV= 6
##$NOISF1= 0
##$NOISF2= 0
##$NSP= 0
##$NTH_PI= 0
##$NZP= 0
##$OFFSET= 14.9621
##$PC= 1
##$PHC0= -85.9845
##$PHC1= 0
##$PH_mod= 1
##$PKNL= yes
##$PPARMOD= 0
##$PPDIAG= 0
##$PPIPTYP= 0
##$PPMPNUM= 2147483647
##$PPRESOL= 1
##$PSCAL= 4
##$PSIGN= 0
##$PYNMP= <proc.py>
##$REVERSE= no
##$SF= 400.020009197052
##$SI= 131072
##$SIGF1= 0
##$SIGF2= 0
##$SINO= 400
##$SIOLD= 131072
##$SPECTYP= <>
##$SREGLST= <1H.CDCl3>
##$SSB= 0
##$STSI= 131072
##$STSR= 0
##$SW_p= 8223.68421052631
##$SYMM= 0
##$S_DEV= 0
##$TDeff= 65536
##$TDoff= 0
##$TI= <>
##$TILT= no
##$TM1= 0
##$TM2= 0
##$TOPLEV= 0
##$USERP1= <user>
##$USERP2= <user>
##$USERP3= <user>
##$USERP4= <user>
##$USERP5= <user>
##$WDW= 1
##$XDIM= 131072
##$YMAX_p= 408000046
##$YMIN_p= -11430
##$CURPLOT= <Network HP LaserJet P1505>
##$CURPRIN= <$Network HP LaserJet P1505>
##$DFORMAT= <normdp>
##$LAYOUT= <+/1D_H.xwp>
##$LFORMAT= <normlp>
##$PFORMAT= <normpl>
##$SURQMSG= 1
$$ End of Bruker specific parameters
$$ ---------------------------------
##NTUPLES= NMR SPECTRUM
##VAR_NAME=  FREQUENCY,     SPECTRUM/REAL,   SPECTRUM/IMAG
##SYMBOL=    X,             R,               I
##VAR_TYPE=  INDEPENDENT,   DEPENDENT,       DEPENDENT
##VAR_FORM=  AFFN,          ASDF,            ASDF
##VAR_DIM=   131072,        131072,          131072
##UNITS=     HZ,            ARBITRARY UNITS, ARBITRARY UNITS
##FACTOR=    0.0627417313425164, 1,          1
##FIRST=     8223.62146879497, -2858,        -58269
##LAST=      0,             38,              -59350
##MIN=       0,             -11430,          0
##MAX=       8223.62146879497, 408000046,    0
$$ Real data points
##PAGE= N=1
##DATA TABLE= (X++(R..R)), XYDATA
$$ [...]
$$ plain form
63339 403593 387515 371962 356828 341964 327418 313441 300511 289200 279718 271700 264639 258342
63327 258342 252710 247432 242346 237849 234422 231855 229518 227308 225687 224721 223723 222143 220320 219064 218866
63312 218866 219776 221656 224149 226636 228629 230141 231484 232796 233950 234766 235174 235224 235079 234866 234444 233503
63296 233503 232028 230456 229257 228498 227971 227554 227289 227212 227287 227417 227485 227440 227391 227470 227615 227800 228419 229997 232362
63277 232362 234542 235863 236767 238104 239909 241508 242666 243916 245626 247381 248690 249820 251415 253594
63263 253594 255985 258586 261913 266052 270174 273550 276713 280876 286148 291117 294583 297125 300340 304889
63249 304889 310049 315038 319947 325218 330951 337161 344185 352316 361360 371013 381423 392928 405436
63236 405436 418595 432486 447638 464267 481871 499759 517704 535953 554779 574133 593621
$$ packed form
63339D03593j6078j5553j5134j4864j4546j3977j2930j1311r482q018p061o297
63327B58342n632n278n086m497l427k567k337k210j621r66r98j580j823j256j98
63312B18866R10J880K493K487J993J512J343J312J154Q16M08N0j45k13m22r41
63296B33503j475j572j199p59n27m17k65p7P5J30O8m5m9P9J45J85O19J578K365
63277B32362K180J321R04J337J805J599J158J250J710J755J309J130J595K179
63263B53594K391K601L327M139M122L376L163M163N272M969L466K542L215M549
63249C04889N160M989M909N271N733O210P024Q131R044R653J0410J1505J2508
63236D05436J3159J3891J5152J6629J7604J7888J7945J8249J8826J9354J9488
$$ plain form
63225 593621 612707 631013 648507 665426 682113 698927 716110 733532 750753 767633 784759
63214 784759 802776 821121 837729 850274 857614 859891 857501 850435 838710 823066 804816 784997
63202 784997 763939 741763 719062 696866 676036 657048 640388 626809 616895 610459 606688 605018
63190 605018 605794 609995 618330 630694 646466 665070 686068 708876 732864 757920 784522 812884
63178 812884 842291 871669 900605 929349 957951 986048 1013577 1041038 1068737 1096177 1122468
63167 1122468 1146919 1168899 1187430 1201317 1209505 1211127 1205587 1192882 1173607 1148391 1117662 1082215
63155 1082215 1043574 1003276 962082 920372 879036 839427 802554 768802 738212 710467 684791
63144 684791 660554 638073 618254 601421 586990 574300 563102 553130 543880 535206 527602 521490
$$ packed form
63225E93621J9086J8306J7494J6919J6687J6814J7183J7422J7221J6880J7126
63214G84759J8017J8345J6608J2545P340K277k390p066j1725j5644j8250j9819
63202G84997k1058k2176k2701k2196k0830j8988j6660j3579r914o436l771j670
63190F05018P76M201Q335J2364J5772J8604K0998K2808K3988K5056K6602K8362
63178H12884K9407K9378K8936K8744K8602K8097K7529K7461K7699K7440K6291
63167A122468K4451K1980J8531J3887Q188J622n540j2705j9275k5216l0729l5447
63155A082215l8641m0298m1194m1710m1336l9609l6873l3752l0590k7745k5676
63144F84791k4237k2481j9819j6833j4431j2690j1198r972r250q674p604o112
$$ plain form
63132 521490 516550 512094 507822 503919 500639 498051 495986 494051 491939 489872 488426 487759 487348 486678 485838
63117 485838 485204 484999 485504 487190 490050 493095 495212 496482 498115 501059 505142 509603 513903 517840 521342
63102 521342 524499 527594 530805 533956 536736 539085 541255 543592 546283 549227 552103 554665 556930 558955
63088 558955 560597 561773 562969 564989 568003 571130 573301 574385 575231 576862 579906 584586 590711 597573
63074 597573 604313 610671 617222 624774 633684 643754 654524 665548 676697 688413 701419 715955
63062 715955 731519 747622 764579 783221 804074 827172 852525 880219 910054 941615 974799
63051 974799 1009851 1046771 1085148 1124727 1165599 1207458 1249156 1289491 1328210 1365908 1403251
63040 1403251 1440751 1478903 1517850 1556980 1595498 1633422 1671397 1709432 1746401 1781013 1812664
$$ packed form
63132E21490m940m456m272l903l280k588k065j935k112k067j446o67m11o70q40
63117D85838o34k05N05J686K860L045K117J270J633K944M083M461M300L937L502
63102E21342L157L095L211L151K780K349K170K337K691K944K876K562K265K025
63088E58955J642J176J196K020L014L127K171J084Q46J631L044M680O125O862
63074E97573O740O358O551P552Q910J0070J0770J1024J1149J1716J3006J4536
63062G15955J5564J6103J6957J8642K0853K3098K5353K7694K9835L1561L3184
63051I74799L5052L6920L8377L9579M0872M1859M1698M0335L8719L7698L7343
63040A403251L7500L8152L8947L9130L8518L7924L7975L8035L6969L4612L1651
$$ plain form
63029 1812664 1840845 1864113 1880248 1887462 1885201 1873844 1853980 1826094 1790803 1749237 1703100 1654300
63017 1654300 1604570 1555470 1508542 1465097 1425836 1390966 1360875 1336513 1319063 1309358 1307557 1313079
63005 1313079 1324848 1342018 1364687 1393562 1428735 1469124 1513342 1560710 1611053 1663870 1718336
62994 1718336 1773986 1830818 1888602 1946533 2003681 2059486 2113699 2166140 2216567 2264400 2308303
62983 2308303 2346253 2376223 2396676 2406378 2404079 2388744 2359979 2318005 2263323 2196765 2119965 2035531
62971 2035531 1946464 1855278 1763643 1672780 1584014 1498752 1417944 1341826 1270445 1204310 1144155
62960 1144155 1090042 1041041 996069 954806 917538 884228 854148 826491 801109 778475 758975
62949 758975 742361 727857 714772 702977 692765 684289 677185 670687 664012 656732 649069 641886 636025
$$ packed form
63029A812664K8181K3268J6135P214k261j1357j9864k7886l5291m1566m6137m8800
63017A654300m9730m9100m6928m3445l9261l4870l0091k4362j7450r705j801N522
63005A313079J1769J7170K2669K8875L5173M0389M4218M7368N0343N2817N4466
62994A718336N5650N6832N7784N7931N7148N5805N4213N2441N0427M7833M3903
62983B308303L7950K9970K0453R702k299j5335k8765m1974n4682o6558p6800q4434
62971B035531q9067r1186r1635r0863q8766q5262q0808p6118p1381o6135o0155
62960A144155n4113m9001m4972m1263l7268l3310l0080k7657k5382k2634j9500
62949G58975j6614j4504j3085j1795j0212q476p104o498o675p280p663p183n861
$$ plain form
62936 636025 631364 626783 621359 615408 609949 605378 601183 596928 592832 589185 585731 582037 578157 574500
62922 574500 571290 568432 565734 562940 559760 556146 552404 548713 544810 540533 536441 533337 531183 529028
62908 529028 526114 522702 519640 517468 516044 514763 513012 510660 508222 506360 505174 504211 503111 501836
62894 501836 500235 497838 494364 490138 485753 481517 477420 473361 469165 464568 459454 454113 449155 445264
62880 445264 442921 442049 441847 441359 440358 439372 438754 438211 437534 437236 437888 439060 439526 438508 436329 433887 431907
62863 431907 430700 430210 430058 429707 428742 427030 424725 422254 420129 418573 417350 416116 414828 413695 412901
62848 412901 412562 412808 413679 414962 416352 417694 419005 420375 421998 424129 426880 430142 433753 437562 441319
62833 441319 444883 448671 453465 459479 465925 471699 476203 479364 481426 483078 485146 487608 489423 489978
$$ packed form
62936F36025m661m581n424n951n459m571m195m255m096l647l454l694l880l657
62922E74500l210k858k698k794l180l614l742l691l903m277m092l104k154k155
62908E29028k914l412l062k172j424j281j751k352k438j862j186r63j100j275
62894E01836j601k397l474m226m385m236m097m059m196m597n114n341m958l891
62880D45264k343q72k02m88j001r86o18n43o77k98O52J172M66j018k179k442j980
62863D31907j207m90j52l51r65j712k305k471k125j556j223j234j288j133p94
62848D12901l39K46Q71J283J390J342J311J370J623K131K751L262L611L809L757
62833D41319L564L788M794O014O446N774M504L161K062J652K068K462J815N55
$$ plain form
62819 489978 490159 491214 493011 494425 495171 496100 497644 499153 500104 500990 502457 504266 505764 506913 508291
62804 508291 510335 512968 515876 518856 522021 525736 530244 535428 541205 547993 556358 566347 577704 590652
62790 590652 605777 623135 642208 662910 685902 711710 740318 771981 807718 848466 894255
62779 894255 944638 999391 1058329 1120899 1186404 1254205 1323314 1392182 1459206 1522938 1581482
62768 1581482 1632412 1673827 1704907 1724965 1732745 1727518 1710310 1683076 1647011 1602621 1551060 1494292
62756 1494292 1433917 1370813 1306015 1241052 1177223 1115272 1055949 1000145 948200 899805 854926
62745 854926 814251 778298 746563 717920 691555 667186 644819 624688 607179 592316 579453
62734 579453 567763 557002 547553 539788 533633 528739 524834 521778 519427 517635 516528 516607 518327 521510
$$ packed form
62819D89978J81J055J797J414P46R29J544J509R51Q86J467J809J498J149J378
62804E08291K044K633K908K980L165L715M508N184N777O788Q365R989J1357J2948
62790E90652J5125J7358J9073K0702K2992K5808K8608L1663L5737M0748M5789
62779H94255N0383N4753N8938O2570O5505O7801O9109O8868O7024O3732N8544
62768A581482N0930M1415L1080K0058P780n227j7208k7234l6065m4390n1561n6768
62756A494292o0375o3104o4798o4963o3829o1951n9323n5804n1945m8395m4879
62745H54926m0675l5953l1735k8643k6365k4369k2367k0131j7509j4863j2863
62734E79453j1690j0761r449p765o155m894l905l056k351j792j107P9J720L183
$$ plain form
62720 521510 525444 529655 534381 540149 547258 555957 566788 580242 596173 613995 633407 654602 677884
62707 677884 703601 732434 765277 802701 844896 892177 945130 1004105 1068976 1139601 1216125
62696 1216125 1298591 1386551 1479301 1576066 1675459 1774882 1870934 1960562 2041587 2112095 2169656
62685 2169656 2211460 2235251 2240059 2226110 2194325 2146122 2083557 2009270 1926027 1836345 1742549
62674 1742549 1646936 1551611 1458206 1367884 1281512 1199660 1122564 1050294 983008 920882 863855
62663 863855 811566 763582 719620 679615 643635 611667 583438 558425 535999 515414 495867
62652 495867 476940 459028 442898 428738 416030 404457 394318 385709 377883 370004 362112 354736
62640 354736 347915 341285 334887 329117 323899 318663 313215 308025 303497 299560 296083 293163 290815 288891
$$ packed form
62720E21510L934M211M726N768P109Q699J0831J3454J5931J7822J9412K1195K3282
62707F77884K5717K8833L2843L7424M2195M7281N2953N8975O4871P0625P6524
62696A216125Q2466Q7960R2750R6765R9393R9423R6052Q9628Q1025P0508N7561
62685B169656M1804K3791M808j3949l1785m8203o2565p4287q3243q9682r3796
62674A742549r5613r5325r3405r0322q6372q1852p7096p2270o7286o2126n7027
62663H63855n2289m7984m3962m0005l5980l1968k8229k5013k2426k0585j9547
62652D95867j8927j7912j6130j4160j2708j1573j0139q609p826p879p892p376
62640C54736o821o630o398n770n218n236n448n190m528l937l477k920k348j924
$$ plain form
62626 288891 287430 286598 286096 285159 283433 281448 279933 279075 278701 278765 279255 279950 280667 281620 283233 285743 289152
62609 289152 293370 298189 303297 308584 314354 321060 328958 338149 348816 361248 375717 392403 411366
62596 411366 432555 456001 481935 510516 541454 574180 608336 643705 679605 714788 748102
62585 748102 778824 806104 828526 844674 853929 856412 852350 841996 826077 805861 782553 756764
62573 756764 728723 698969 668719 639345 611438 584573 558212 532692 509017 487809 468915
62562 468915 451997 436948 423616 411578 400519 390480 381478 373214 365353 357779 350345 342769 335158
62549 335158 328298 322922 318814 315014 310808 306238 301788 297943 295006 293011 291821 291466 292294 294563 297980
62534 297980 301896 305866 309858 314070 318820 324540 331565 339935 349587 360663 373451 388104 404670
$$ packed form
62626B88891j461q32n02r37j726j985j515q58l74O4M90O95P17R53J613K510L409
62609B89152M218M819N108N287N770O706P898R191J0667J2432J4469J6686J8963
62596D11366K1189K3446K5934K8581L0938L2726L4156L5369L5900L5183L3314
62585G48102L0722K7280K2422J6148R255K483m062j0354j5919k0216k3308k5789
62573G56764k8041k9754l0250k9374k7907k6865k6361k5520k3675k1208j8894
62562D68915j6918j5049j3332j2038j1059j0039r002q264p861p574p434p576p611
62549C35158o860n376m108l800m206m570m450l845k937j995j190l55Q28K269L417
62534B97980L916L970L992M212M750N720P025Q370R652J1076J2788J4653J6566
$$ plain form
62521 404670 423338 444398 467933 493848 522299 553894 589321 628744 671659 717375 765712
62510 765712 817045 871363 927221 981901 1032790 1078417 1118059 1150745 1175110 1190102 1195445 1191377
62498 1191377 1178203 1156191 1125824 1088130 1044836 998028 949444 900157 851039 803291 758174
62487 758174 716288 677516 641712 609138 580047 554088 530400 508345 487999 469842 453982
62476 453982 439821 426603 414234 403335 394398 387060 380391 373813 367599 362498 359004 356964 355834
62463 355834 355217 355168 355986 357873 360843 364772 369341 374148 379216 385227 392811 401627 410697 419640 428935
62448 428935 438703 447906 455294 460656 464532 466997 467386 465115 460157 452780 443402 432805 421930 411193
62434 411193 400302 388932 377314 366049 355620 346302 338332 331850 326662 322255 318192 314526 311779
$$ packed form
62521D04670J8668K1060K3535K5915K8451L1595L5427L9423M2915M5716M8337
62510G65712N1333N4318N5858N4680N0889M5627L9642L2686K4365J4992N343m068
62498A191377j3174k2012l0367l7694m3294m6808m8584m9287m9118m7748m5117
62487G58174m1886l8772l5804l2574k9091k5959k3688k2055k0346j8157j5860
62476D53982j4161j3218j2369j0899q937p338o669o578o214n101l494k040j130
62463C55834o17m9Q18J887K970L929M569M807N068O011P584Q816R070Q943R295
62448D28935R768R203P388N362L876K465L89k271m958p377r378j0597j0875j0737
62434D11193j0891j1370j1618j1265j0429r318p970o482n188m407m063l666k747
$$ plain form
62421 311779 310402 310268 310875 312032 314145 317640 322376 327811 333620 339904 346936 354928 363988 374027
62407 374027 384739 395891 407607 420124 433274 446353 458540 469334 478650 486564 492987 497588
62395 497588 500069 500503 499219 496393 492038 486379 479848 472593 464490 455922 448105 442131 437960 434854
62381 434854 432554 431523 432145 434303 437839 443044 450543 460954 474682 491809 512212 535989 563628
62368 563628 595487 631292 670502 712997 758989 808327 860323 914119 968661 1022327 1073140
62357 1073140 1119532 1160441 1194629 1220536 1237163 1244701 1244036 1235984 1221270 1200788 1175338 1145183
62345 1145183 1110270 1070951 1028349 984082 939764 896666 855616 817095 781356 748452 718267
62334 718267 690705 665776 643358 622969 604015 586241 569656 554127 539382 525528 513234
$$ packed form
62421C11779j377j34O07J157K113L495M736N435N809O284P032P992R060J0039
62407C74027J0712J1152J1716J2517J3150J3079J2187J0794R316P914O423M601
62395D97588K481M34j284k826m355n659o531p255q103q568p817n974m171l106
62381D34854k300j031O22K158L536N205P499J0411J3728J7127K0403K3777K7639
62368E63628L1859L5805L9210M2495M5992M9338N1996N3796N4542N3666N0813
62357A073140M6392M0909L4188K5907J6627P538o65q052j4714k0482k5450l0155
62345A145183l4913l9319m2602m4267m4318m3098m1050l8521l5739l2904l0185
62334G18267k7562k4929k2418k0389j8954j7774j6585j5529j4745j3854j2294
$$ plain form
62323 513234 503222 495716 490361 486510 483644 481762 481405 482992 486083 489557 492537 494919 497003 498942
62309 498942 500606 501646 501525 499767 496288 491311 484917 476998 467715 457671 447518 437661 428403 420035
62295 420035 412607 405909 399841 394585 390328 387042 384642 383028 381957 381228 381169 382562 385876 390842 396903
62280 396903 403728 411112 418816 426822 435378 444535 454014 463878 474956 488180 503721 521169 540339
62267 540339 561544 585310 612245 642929 677395 714826 754228 795330 838278 882320 925210
62256 925210 964040 996475 1021291 1038249 1047739 1050326 1046413 1036353 1020775 1000473 975902 947113
62244 947113 914450 879072 842536 805888 769428 733405 698680 666459 637453 611581 588538
62233 588538 568303 550780 535259 520836 507445 495976 487101 480345 474613 469308 464583 460704 457636
$$ packed form
62323E13234j0012p506n355l851k866j882l57J587L091L474K980K382K084J939
62309D98942J664J040j21j758l479m977o394p919r283j0044j0153r857r258q368
62295D20035p428o698o068n256m257l286k400j614j071p29n9J393L314M966O061
62280C96903O825P384P704Q006Q556R157R479R864J1078J3224J5541J7448J9170
62267E40339K1205K3766K6935L0684L4466L7431L9402M1102M2948M4042M2890
62256I25210L8830L2435K4816J6958R490K587l913j0060j5578k0302k4571k8789
62244I47113l2663l5378l6536l6648l6460l6023l4725l2221k9006k5872k3043
62233E88538k0235j7523j5521j4423j3391j1469q875o756n732n305m725l879l068
$$ plain form
62220 457636 455206 453364 452151 451586 451556 451775 451976 452261 453078 454634 456511 458162 459670 461733 464967 469507
62204 469507 475248 482160 490256 499481 509750 521010 533245 546553 561240 577752 596463 617509
62192 617509 640736 665693 691730 718053 743564 766739 786006 800494 810287 815907 817857 816814
62180 816814 813924 810570 808061 807651 810457 816960 826890 840038 856864 877773 902055 928141 954794
62167 954794 981339 1006768 1029462 1048133 1062481 1072734 1079153 1082379 1083638 1083887 1082922 1079777 1073874
62154 1073874 1065403 1054778 1042268 1028242 1013359 998306 983569 969539 956703 945537 936231 928520
62142 928520 921800 915479 909303 903302 897416 891349 884962 878661 873109 868493 864284 859874 855354 851519
62128 851519 849183 848599 849489 851371 853763 856400 859573 864128 870760 879195 888377 897529 906724 916375 926648
$$ packed form
62220D57636k430j842j213n65l0K19K01K85Q17J556J877J651J508K063L234M540
62204D69507N741O912Q096R225J0269J1260J2235J3308J4687J6512J8711K1046
62192F17509K3227K4957K6037K6323K5511K3175J9267J4488R793N620J950j043
62180H16814k890l354k509m10K806O503R930J3148J6826K0909K4282K6086K6653
62167I54794K6545K5429K2694J8671J4348J0253O419L226J259K49r65l145n903
62154A073874q471j0625j2510j4026j4883j5053j4737j4030j2836j1166r306p711
62142I28520o720o321o176o001n886o067o387o301n552m616m209m410m520l835
62128H51519k336n84Q90J882K392K637L173M555O632Q435R182R152R195R651J0273
$$ plain form
62113 926648 937763 950442 965446 982735 1001579 1021519 1042799 1065765 1090150 1115022 1139166
62102 1139166 1161602 1182202 1201911 1222049 1243341 1265992 1290543 1317820 1347627 1378124 1407217
62091 1407217 1434422 1460962 1488307 1517185 1547871 1580752 1616337 1654928 1696382 1739976 1784553
62080 1784553 1829033 1872735 1915028 1954898 1991444 2024879 2056585 2087966 2119494 2150961 2182156
62069 2182156 2212965 2243088 2272091 2299620 2325242 2348220 2367852 2384106 2397633 2409122 2418873
62058 2418873 2427076 2434135 2440429 2445887 2450085 2452779 2454186 2454773 2454991 2455345 2456541 2459332 2464084 2470572 2478311
62043 2478311 2487145 2497466 2509828 2524330 2540400 2557173 2574016 2590742 2607430 2624202 2641077
62032 2641077 2657852 2674056 2689086 2702490 2714059 2723689 2731276 2736908 2741005 2744100 2746447 2747994 2748683
$$ packed form
62113I26648J1115J2679J5004J7289J8844J9940K1280K2966K4385K4872K4144
62102A139166K2436K0600J9709K0138K1292K2651K4551K7277K9807L0497K9093
62091A407217K7205K6540K7345K8878L0686L2881L5585L8591M1454M3594M4577
62080A784553M4480M3702M2293L9870L6546L3435L1706L1381L1528L1467L1195
62069B182156L0809L0123K9003K7529K5622K2978J9632J6254J3527J1489R751
62058B418873Q203P059O294N458M198K694J407N87K18L54J196K791M752O488P739
62043B478311Q834J0321J2362J4502J6070J6773J6843J6726J6688J6772J6875
62032B641077J6775J6204J5030J3404J1569R630P587N632M097L095K347J547O89
$$ plain form
62019 2748683 2748604 2747821 2746292 2744153 2741918 2740173 2739116 2738598 2738634 2739687 2742374 2747052 2753731 2762289 2772691
62004 2772691 2785104 2799762 2816444 2833897 2850125 2863563 2873859 2881151 2884818 2883616 2877177 2866777
61992 2866777 2854281 2840759 2826537 2812089 2798108 2784844 2772078 2759862 2748640 2738453 2728578
61981 2728578 2718337 2707913 2697991 2688869 2680196 2671367 2661833 2651213 2639386 2626434 2612389 2597282
61969 2597282 2581587 2566152 2551284 2536206 2519941 2502503 2484642 2466576 2447744 2427974 2408168
61958 2408168 2389391 2371707 2354362 2336887 2319599 2303123 2287784 2273472 2259905 2246970 2234910
61947 2234910 2224118 2214749 2206652 2199786 2194472 2191060 2189459 2189154 2189603 2190533 2191999 2194358 2198074 2203357
61933 2203357 2210002 2217699 2226358 2236051 2246811 2258716 2272065 2287232 2304501 2324396 2348139 2377332
$$ packed form
62019B748683p9p83j529k139k235j745j057n18L6J053K687M678O679Q558J0402
62004B772691J2413J4658J6682J7453J6228J3438J0296P292L667j202o439j0400
61992B866777j2496j3522j4222j4448j3981j3264j2766j2216j1222j0187r875
61981B728578j0241j0424r922r122q673q829r534j0620j1827j2952j4045j5107
61969B597282j5695j5435j4868j5078j6265j7438j7861j8066j8832j9770j9806
61958B408168j8777j7684j7345j7475j7288j6476j5339j4312j3567j2935j2060
61947B234910j0792r369q097o866n314l412j601l05M49R30J466K359L716N283
61933B203357O645P697Q659R693J0760J1905J3349J5167J7269J9895K3743K9193
$$ plain form
61921 2377332 2413043 2455419 2504386 2560505 2625049 2699464 2785012 2882824 2994144 3120622 3264635
61910 3264635 3429228 3617550 3832392 4076397 4352504 4663669 5011853 5397180 5817645
61901 5817645 6268604 6741441 7222075 7690409 8121195 8486379 8759009 8918031 8952104 8860809
61891 8860809 8653560 8347704 7966053 7533277 7071872 6599885 6131288 5677135 5245706
61882 5245706 4842154 4469096 4127721 3818023 3538402 3286148 3058832 2854826 2672362
61873 2672362 2508775 2361272 2228127 2108621 2001972 1906791 1821560 1745164 1676843 1615840
61863 1615840 1561287 1512403 1468777 1430502 1397895 1370944 1348973 1330895 1315709 1302764 1291780
61852 1291780 1282835 1276137 1271519 1268127 1264868 1261146 1256985 1252541 1247834 1243026 1238578 1234771 1231253 1227358
$$ packed form
61921B377332L5711M2376M8967N6119O4544P4415Q5548R7812J11320J26478J44013
61910C264635J64593J88322K14842K44005K76107L11165L48184L85327M20465
61901E817645M50959M72837M80634M68334M30786L65184K72630J59022L4073r1295
61891H860809k07249l05856l81651m32776m61405m71987m68597m54153m31429
61882E245706m03552l73058l41375l09698k79621k52254k27316k04006j82464
61873B672362j63587j47503j33145j19506j06649r5181q5231p6396o8321o1003
61863A615840n4553m8884m3626l8275l2607k6951k1971j8078j5186j2945j0984
61852A291780q945o698m618l392l259l722m161m444m707m808m448l807l518l895
$$ plain form
61838 1227358 1222980 1218887 1216136 1215262 1216093 1218171 1221077 1224386 1227560 1230119 1231830 1232544 1231873 1229275 1224595
61823 1224595 1218393 1211631 1205092 1199150 1193869 1189168 1184992 1181546 1179319 1178762 1180044 1183306 1189062 1197999
61809 1197999 1210359 1225725 1243552 1263723 1286529 1312320 1341361 1373888 1410173 1450559 1495442
61798 1495442 1545105 1599491 1658367 1721834 1790529 1865240 1946601 2035398 2133021 2241246 2361641
61787 2361641 2495388 2643709 2808284 2991444 3196273 3426531 3686119 3978599 4307557
61778 4307557 4677494 5093989 5562799 6088941 6676499 7328368 8045100 8823297 9654220
61769 9654220 10522149 11402173 12258767 13047285 13718735 14226308 14532279 14614484 14470757 14118903
61759 14118903 13591715 12929677 12174831 11366934 10540945 9725057 8939732 8198171 7507784
$$ packed form
61838A227358m378m093k751q74Q31K078K906L309L174K559J711P14o71k598m680
61823A224595o202o762o539n942n281m701m176l446k227n57J282L262N756Q937
61809A197999J2360J5366J7827K0171K2806K5791K9041L2527L6285M0386M4883
61798A495442M9663N4386N8876O3467O8695P4711Q1361Q8797R7623J08225J20395
61787B361641J33747J48321J64575J83160K04829K30258K59588K92480L28958
61778D307557L69937M16495M68810N26142N87558O51869P16732P78197Q30923
61769I654220Q67929Q80024Q56594P88518O71450N07573L05971Q2205j43727l51854
61759A4118903n27188o62038p54846q07897q25989q15888p85325p41561o90387
$$ plain form
61750 7507784 6871818 6290725 5763207 5286944 4858895 4475283 4131599 3823080 3545536
61741 3545536 3295788 3071221 2869030 2686274 2520716 2371318 2237627 2118793 2013231
61732 2013231 1918960 1834049 1757029 1687297 1625030 1570276 1522041 1478575 1438518 1401466 1367314
61721 1367314 1335457 1304898 1274974 1245722 1217717 1191746 1168437 1147821 1129209 1111714 1094953
61710 1094953 1079075 1064118 1049630 1035109 1020626 1006759 993869 981626 969382 956923 944647
61699 944647 932931 921477 909546 896900 884227 872346 861117 849565 837183 824755 813556
61688 813556 803975 795353 786969 778665 770415 761964 753296 745026 737818 731605 725877 720581 716158 712697
61674 712697 709634 706547 703769 701912 701048 700606 699853 698374 696358 694607 693916 694196 694514 694276 693986 694415
$$ packed form
61750G507784o35966n81093n27518m76263m28049l83612l43684l08519k77544
61741C545536k49748k24567k02191j82756j65558j49398j33691j18834j05562
61732B013231r4271q4911p7020o9732o2267n4754m8235m3466m0057l7052l4152
61721A367314l1857l0559k9924k9252k8005k5971k3309k0616j8612j7495j6761
61710A094953j5878j4957j4488j4521j4483j3867j2890j2243j2244j2459j2276
61699I44647j1716j1454j1931j2646j2673j1881j1229j1552j2382j2428j1199
61688H13556r581q622q384q304q250q451q668q270p208o213n728n296m423l461
61674G12697l063l087k778j857q64m42p53j479k016j751o91K80L18k38k90M29
$$ plain form
61658 694415 695346 695709 694893 693347 691911 690992 690451 689821 688548 686457 684121 682378 681291 679954 677544 674202
61642 674202 670694 667597 665206 663814 663518 663883 664372 665148 667058 670733 676137 683085 691693 701913 712956
61627 712956 723676 733461 742313 750071 756157 760340 763304 765861 767728 767674 765009 760501 755517 750585
61613 750585 745167 738716 731527 724391 717681 711056 704025 696665 689640 683488 678038 672651 666971 661157
61599 661157 655351 649259 642471 635026 627438 620306 614071 608943 604753 600987 597302 593993 591705 590699
61585 590699 590606 590882 591253 591778 592786 594807 598294 603321 609699 617368 626420 636796 648286 660872 674730
61570 674730 689839 705946 723065 741629 761810 782945 803961 824254 843968 863588 883523
61559 883523 903909 924468 944498 963320 980824 997459 1013644 1029366 1044404 1058713 1072382
$$ packed form
61658F94415R31L63q16j546j436r19n41o30j273k091k336j743j087j337k410l342
61642F74202l508l097k391j392k96L65M89P76J910L675N404O948Q608J0220J1043
61627G12956J0720R785Q852P758O086M183K964K557J867n4k665m508m984m932
61613G50585n418o451p189p136o710o625p031p360p025o152n450n387n680n814
61599F61157n806o092o788p445p588p132o235n128m190l766l685l309k288j006
61585E90699r3K76L71N25J008K021L487N027O378P669R052J0376J1490J2586J3858
61570F74730J5109J6107J7119J8564K0181K1135K1016K0293J9714J9620J9935
61559H83523K0386K0559K0030J8822J7504J6635J6185J5722J5038J4309J3669
$$ plain form
61548 1072382 1085263 1096844 1106600 1114415 1120541 1125129 1127884 1128176 1125419 1119375 1110310 1098954 1086169
61535 1086169 1072479 1057974 1042798 1027558 1013097 999975 988379 978339 969733 962154 955254 949354
61523 949354 945433 944289 945894 949725 955563 963837 975274 990375 1009197 1031568 1057558 1087719 1122869
61510 1122869 1163698 1210699 1264363 1325228 1393794 1470592 1556365 1651963 1758117 1875491 2004920
61499 2004920 2147222 2302406 2468901 2643335 2820888 2995959 3162673 3314822 3445537
61490 3445537 3547863 3616624 3650041 3649426 3617582 3557967 3475048 3374339 3261452 3141245 3017886
61479 3017886 2895086 2775874 2662465 2556580 2459589 2372180 2294256 2225440 2165380 2113542
61469 2113542 2069195 2031875 2001531 1978111 1961522 1952094 1950279 1955518 1966146 1981026 2000601 2025564
$$ packed form
61548A072382J2881J1581R756P815O126M588K755K92k757o044r065j1356j2785
61535A086169j3690j4505j5176j5240j4461j3122j1596j0040q606p579o900n900
61523I49354l921j144J605L831N838Q274J1437J5101J8822K2371K5990L0161L5150
61510A122869M0829M7001N3664O0865O8566P6798Q5773R5598J06154J17374J29429
61499B004920J42302J55184J66495J74434J77553J75071J66714J52149J30715
61490C445537J02326O8761L3417o15l1844n9615q2919j00709j12887j20207j23359
61479C017886j22800j19212j13409j05885r6991q7409p7924o8816o0060n1838
61469B113542m4347l7320l0344k3420j6589r428j815N239J0628J4880J9575K4963
$$ plain form
61457 2025564 2055093 2087293 2121045 2156340 2192887 2229459 2264937 2299223 2332774 2365741 2397954
61446 2397954 2429400 2460419 2491558 2523284 2555677 2588367 2620984 2653529 2686082 2718317 2749666
61435 2749666 2779797 2808536 2835470 2860057 2881933 2900445 2913973 2920563 2919516 2911909 2899308 2882454
61423 2882454 2861475 2836815 2809460 2780410 2750306 2719559 2688683 2658538 2630167 2604250 2580835
61412 2580835 2559918 2542122 2528278 2518317 2511154 2505808 2502108 2500075 2499167 2498454 2497064 2494070 2488409 2479441
61398 2479441 2467379 2452798 2436146 2418252 2400975 2386522 2376019 2369360 2366605 2369074 2378850 2397601
61386 2397601 2426252 2465530 2516369 2579722 2656207 2746119 2849777 2967782 3100820 3249105
61376 3249105 3411930 3587625 3773674 3966580 4161482 4352081 4531173 4691520 4826605
$$ packed form
61457B025564K9529L2200L3752L5295L6547L6572L5478L4286L3551L2967L2213
61446B397954L1446L1019L1139L1726L2393L2690L2617L2545L2553L2235L1349
61435B749666L0131K8739K6934K4587K1876J8512J3528O590j047p607j2601j6854
61423B882454k0979k4660k7355k9050l0104l0747l0876l0145k8371k5917k3415
61412B580835k0917j7796j3844r961p163n346l700k033r08p13j390k994n661q968
61398B479441j2062j4581j6652j7894j7277j4453j0503o659k755K469R776J8751
61386B397601K8651L9278N0839O3353P6485Q9912J03658J18005J33038J48285
61376C249105J62825J75695J86049J92906J94902J90599J79092J60347J35085
$$ plain form
61367 4826605 4931167 5001776 5037385 5039389 5010824 4955218 4875841 4775606 4657193 4523110 4375878
61356 4375878 4218281 4053273 3883576 3711570 3539677 3370522 3206515 3049423 2900558
61347 2900558 2761071 2631713 2512536 2403257 2303885 2214718 2135848 2067029 2007909 1958039
61337 1958039 1916670 1882950 1856337 1836568 1823325 1816250 1815201 1820057 1830336 1845415 1865075 1889354
61325 1889354 1917837 1949567 1983679 2019595 2056620 2093915 2130979 2167516 2202686 2235255 2264815
61314 2264815 2292144 2317875 2341413 2361722 2378606 2392458 2403215 2410469 2414500 2416343 2416692 2415281
61302 2415281 2411514 2405173 2396345 2385020 2370991 2353927 2333477 2309508 2282340 2252538 2220488 2186367
61290 2186367 2150586 2114038 2077837 2042896 2009693 1978358 1949056 1922395 1899283 1880182 1864569
$$ packed form
61367D826605J04562P0609L5609K004k8565n5606p9377j00235j18413j34083j47232
61356D375878j57597j65008j69697j72006j71893j69155j64007j57092j48865
61347B900558j39487j29358j19177j09279r9372q9167p8870o8819n9120m9870
61337A958039m1369l3720k6613j9769j3243p075j049M856J0279J5079J9660K4279
61325A889354K8483L1730L4112L5916L7025L7295L7064L6537L5170L2569K9560
61314B264815K7329K5731K3538K0309J6884J3852J0757P254M031J843L49j411
61302B415281l767o341q828j1325j4029j7064k0450k3969k7168k9802l2050l4121
61290B186367l5781l6548l6201l4941l3203l1335k9302k6661k3112j9101j5613
$$ plain form
61279 1864569 1851415 1840102 1830678 1823302 1817733 1813361 1809553 1805976 1802602 1799229 1794913 1788193 1778227
61266 1778227 1765497 1751004 1735017 1717084 1697201 1676397 1656143 1637831 1623002 1613516 1610927 1615834
61254 1615834 1628156 1647926 1675573 1711547 1756044 1809166 1871144 1942143 2021675 2108151 2199090
61243 2199090 2291870 2384138 2473364 2556106 2628063 2684886 2722806 2738775 2730783 2698581 2644019
61232 2644019 2570436 2481730 2382015 2275727 2167480 2061491 1961002 1867954 1782919 1705365
61222 1705365 1634305 1568937 1508795 1453514 1402611 1355586 1312167 1272456 1236796 1205394 1178075
61211 1178075 1154549 1134935 1119760 1109258 1102893 1099905 1100169 1104071 1111455 1121091 1131424 1141580 1151297
61198 1151297 1160159 1167427 1172701 1176373 1179171 1181409 1182829 1182997 1181737 1179284 1176134 1172605 1168379 1162618
$$ packed form
61279A864569j3154j1313r424p376n569m372l808l577l374l373m316o720r966
61266A778227j2730j4493j5987j7933j9883k0804k0254j8312j4829r486k589M907
61254A615834J2322J9770K7647L5974M4497N3122O1978P0999P9532Q6476R0939
61243B199090R2780R2268Q9226Q2742P1957N6823L7920J5969p992l2202n4562
61232B644019p3583q8706r9715j06288j08247j05989j00489r3048q5035p7554
61222A705365p1060o5368o0142n5281n0903m7025m3419l9711l5660l1402k7319
61211A178075k3526j9614j5175j0502o365k988K64L902P384R636J0333J0156R717
61198A151297Q862P268N274L672K798K238J420J68j260k453l150l529m226n761
$$ plain form
61184 1162618 1154697 1144745 1133346 1120889 1107444 1093082 1077928 1061978 1045276 1028294 1011705 995599
61172 995599 979320 962343 945013 928155 912143 896696 881428 866236 851200 836400 821908
61161 821908 807744 793800 779999 766462 753274 740029 725852 710027 692551 673969 654814
61150 654814 635352 615819 596692 578559 561757 546269 531982 518918 507161 496738 487776 480582
61138 480582 475242 471184 467548 464150 461795 461405 463052 466079 469919 474525 480076 486627 494035 502047
61124 502047 510419 519139 528483 538689 549612 560910 572558 584963 598493 613030 628008 642755
61112 642755 656658 669038 679036 685875 689412 690447 690217 689398 687709 684516 679633 673453 666564 659508
61098 659508 652676 646062 639188 631659 623816 616494 610026 603833 597165 590009 582977 576489 570395 564414
$$ packed form
61184A162618p921r952j1399j2457j3445j4362j5154j5950j6702j6982j6589j6106
61172I95599j6279j6977j7330j6858j6012j5447j5268j5192j5036j4800j4492
61161H21908j4164j3944j3801j3537j3188j3245j4177j5825j7476j8582j9155
61150F54814j9462j9533j9127j8133j6802j5488j4287j3064j1757j0423q962p194
61138D80582n340m058l636l398k355l90J647L027L840M606N551O551P408Q012
61124E02047Q372Q720R344J0206J0923J1298J1648J2405J3530J4537J4978J4747
61112F42755J3903J2380R998O839L537J035k30q19j689l193m883o180o889p056
61098F59508o832o614o874p529p843p322o468o193o668p156p032o488o094n981
$$ plain form
61084 564414 558636 553358 548477 543303 537082 529639 521421 513037 504945 497506 491024 485558 480873 476731
61070 476731 473096 469962 467169 464595 462382 460702 459340 457750 455630 453385 451981 452235 454042 456284
61056 456284 457759 458376 459196 461146 463971 466735 469075 471510 474702 478882 483980 489798 495920 501861 507591
61041 507591 513661 520612 528441 536830 545733 555494 566463 578633 591680 605273 619357 634163 649933
61028 649933 666667 684171 702355 721398 741622 763189 785917 809549 834351 861401 891916
61017 891916 926044 962485 999458 1035937 1072001 1108430 1146374 1187217 1232378 1283222 1341165
61006 1341165 1407448 1482408 1565242 1655041 1752206 1858984 1979353 2119164 2286154 2489089
60996 2489089 2736789 3038363 3404192 3846481 4379930 5023722 5803885 6754321 7915872
$$ packed form
61084E64414n778n278m881n174o221p443q218q384q092p439o482n466m685m142
61070D76731l635l134k793k574k213j680j362j590k120k245j404K54J807K242
61056D56284J475O17Q20J950K825K764K340K435L192M180N098N818O122N941N730
61041E07591O070O951P829Q389Q903R761J0969J2170J3047J3593J4084J4806J5770
61028F49933J6734J7504J8184J9043K0224K1567K2728K3632K4802K7050L0515
61017H91916L4128L6441L6973L6479L6064L6429L7944M0843M5161N0844N7943
61006A341165O6283P4960Q2834Q9799R7165J06778J20369J39811J66990K02935
60996B489089K47700L01574L65829M42289N33449O43792P80163R50436J161551
$$ plain form
60987 7915872 9329309 11011412 12910565 14867475 16629122 17938270 18654137 18819431
60979 18819431 18627475 18325758 18129755 18179391 18513526 19041603 19542150 19731859 19390588
60970 19390588 18462041 17059964 15388339 13645628 11971681 10442866 9089011 7911675
60962 7911675 6898669 6033862 5300867 4682904 4163322 3727402 3362686 3057548 2800679
60953 2800679 2582138 2393970 2229681 2084143 1954188 1838341 1735441 1643897 1562226 1489443
60943 1489443 1424605 1366622 1314657 1268006 1225203 1183915 1142197 1099500 1056286 1013280 971379
60932 971379 931555 894137 858515 824067 791136 760588 732680 706896 682731 660129 639149
60921 639149 619641 601337 584014 567556 552028 537608 524299 511900 500528 490873 483489 477901
$$ packed form
60987G915872J413437J682103J899153J956910J761647J309148P15867J65294
60979A8819431j91956l01717j96003M9636L34135N28077N00547J89709l41271
60970A9390588r28547j402077j671625j742711j673947j528815j353855j177336
60962G911675j013006q64807p32995o17963n19582m35920l64716l05138k56869
60953B800679k18541j88168j64289j45538j29955j15847j02900r1544q1671p2783
60943A489443o4838n7983n1965m6651m2803m1288m1718m2697m3214m3006m1901
60932I71379l9824l7418l5622l4448l2931l0548k7908k5784k4165k2602k0980
60921F39149j9508j8304j7323j6458j5528j4420j3309j2399j1372r655p384n588
$$ plain form
60909 477901 472913 467818 462892 458601 454796 451005 447184 443745 440911 438415 435921 433556 431885 431362
60895 431362 431859 432724 433306 433392 433167 432860 432620 432654 433268 434627 436603 439082 442335 446874 452864 459813 466927
60878 466927 473680 479963 485821 491248 496269 501052 505821 510681 515494 519820 522940 524145 523208 520581
60864 520581 516973 512802 508186 503369 498768 494519 490259 485721 481378 478137 476429 475945 476365 477905 480813
60849 480813 484598 488262 491328 494225 497540 501266 505053 508929 513341 518503 524080 529580 534849 539982
60835 539982 544980 549717 554290 559271 565461 573329 582630 592627 602698 612642 622371 631524 639678 646840
60821 646840 653419 659677 665452 670516 674954 679061 683070 687143 691358 695526 699138 701735 703145 703191 701396
60806 701396 697339 691226 683756 675418 666212 656040 645047 633466 621474 609358 597670 586969
$$ packed form
60909D77901m988n095m926m291l805l791l821l439k834k496k494k365j671n23
60895D31362M97Q65N82Q6k25l07k40L4O14J359J976K479L253M539N990O949P114
60878D66927O753O283N858N427N021M783M769M860M813M326L120J205r37k627
60864E20581l608m171m616m817m601m249m260m538m343l241j708m84M20J540K908
60849D80813L785L664L066K897L315L726L787L876M412N162N577N500N269N133
60835E39982M998M737M573M981O190P868R301R997J0071R944R729R153Q154P162
60821F46840O579O258N775N064M438M107M009M073M215M168L612K597J410M6j795
60806G01396m057o113p470q338r206j0172j0993j1581j1992j2116j1688j0701
$$ plain form
60794 586969 577526 569332 562279 556281 551321 547443 544646 542815 541955 542397 544489 547981 552070 556156 560257
60779 560257 564502 568607 572235 575647 579521 584158 589275 594562 600004 605495 610498 614423 617296 619848
60765 619848 622893 626676 630767 634562 637833 640781 643664 646695 650420 655764 663252 672312 681829 691335
60751 691335 701147 711339 721243 730228 738402 746023 752669 757563 760559 762184 762815 762322 760656 758391
60737 758391 756503 755793 756425 757808 759018 759650 760096 760602 760292 757786 752842 746691 740519 734212 726951 718464
60721 718464 709207 699692 690194 680867 671664 662266 652506 642707 633210 623713 613536 602497 591106
60708 591106 579952 569347 559628 551326 544788 539785 535702 532093 529049 527171 527092 528961 532445 537283
60694 537283 543551 551199 559663 568266 576773 585144 593020 599919 605745 610518 613649 614089 611262 605367
$$ packed form
60794E86969r443q194p053n998m960l878k797j831q60M42K092L492M089M086M101
60779E60257M245M105L628L412L874M637N117N287N442N491N003L925K873K552
60765F19848L045L783M091L795L271K948K883L031L725N344P488R060R517R506
60751F91335R812J0192R904Q985Q174P621O646M894K996J625O31m93j666k265
60737G58391j888p10O32J383J210O32M46N06l10k506m944o151o172o307p261q487
60721G18464r257r515r498r327r203r398r760r799r497r497j0177j1039j1391
60708E91106j1154j0605r719q302o538n003m083l609l044j878p9J869L484M838
60694E37283O268P648Q464Q603Q507Q371P876O899N826M773L131M40k827n895
$$ plain form
60680 605367 596826 586060 573908 561557 549740 538448 527568 517254 507498 498005 488826 480537
60668 480537 473440 467196 461725 457763 455848 455277 454935 454815 455822 458240 461300 464336 467478 470962 474482
60653 474482 477662 480630 483683 486705 489327 491464 493290 494835 495949 496711 497585 499025 500996 503013 504744
60638 504744 506502 509014 512710 517447 522970 529340 536648 544601 552720 560860 569209 577848 586692 595820
60624 595820 605573 616293 628175 641340 655719 670895 686356 701932 717712 733569 749081 763881
60612 763881 777686 789992 800276 808651 815820 821990 826127 826604 822464 813922 801939 787634 771968
60599 771968 755625 739128 723117 708297 694978 682861 671523 661020 651802 644220 638344 634204
60587 634204 631875 631206 631568 631998 631751 630910 630440 631362 633723 636503 638596 639642 639886 639697 639590 640342 642484
$$ packed form
60680F05367q541j0766j2152j2351j1817j1292j0880j0314r756r493r179q289
60668D80537p097o244n471l962j915n71l42j20J007K418L060L036L142L484L520
60653D74482L180K968L053L022K622K137J826J545J114P62Q74J440J971K017J731
60638E04744J758K512L696M737N523O370P308P953Q119Q140Q349Q639Q844R128
60624E95820R753J0720J1882J3165J4379J5176J5461J5576J5780J5857J5512J4800
60612G63881J3805J2306J0284Q375P169O170M137M77m140q542j1983j4305j5666
60599G71968j6343j6497j6011j4820j3319j2117j1338j0503r218p582n876m140
60587F34204k329o69L62M30k47q41m70R22K361K780K093J046K44j89j07P52K142
$$ plain form
60570 642484 645711 649201 652538 655922 659461 662704 665100 666642 667805 669026 670364 671552 672219 672200 671764
60555 671764 671460 671689 672538 674133 677034 682105 689962 700566 713424 728312 745954 767841 795129
60542 795129 827663 864220 903503 944383 985013 1022271 1052577 1073253 1083012 1081674 1070040 1050016
60530 1050016 1024300 995664 966563 939132 914947 894644 878213 865855 858202 855500 856946 861142
60518 861142 866981 873881 881508 889705 898517 907876 917389 926845 936934 949085 964568 984103 1008320
60505 1008320 1038167 1074646 1118482 1170394 1231599 1303873 1389086 1488673 1603419 1733687 1879945
60494 1879945 2043139 2224610 2425917 2649178 2897524 3174435 3481402 3814820 4163623
60485 4163623 4508843 4825660 5087623 5271337 5359747 5343826 5223885 5010628 4724094 4389468
$$ packed form
60570F42484L227L490L337L384L539L243K396J542J163J221J338J188O67j9m36
60555F71764l04K29Q49J595K901N071P857J0604J2858J4888J7642K1887K7288
60542G95129L2534L6557L9283M0880M0630L7258L0306K0676R759j338j1634k0024
60530A050016k5716k8636k9101k7431k4185k0303j6431j2358p653k702J446M196
60518H61142N839O900P627Q197Q812R359R513R456J0089J2151J5483J9535K4217
60505A008320K9847L6479M3836N1912O1205P2274Q5213R9587J14746J30268J46258
60494A879945J63194J81471K01307K23261K48346K76911L06967L33418L48803
60485D163623L45220L16817K61963J83714Q8410j5921j19941k13257k86534l34626
$$ plain form
60475 4389468 4031661 3671595 3324979 3002299 2709203 2447514 2216683 2014760 1838732
60466 1838732 1685011 1550363 1432459 1329482 1239465 1160219 1089760 1026678 970212 920043
60456 920043 875812 836645 801265 768714 738804 711648 686916 663885 642224 622341 604762
60445 604762 589375 575536 562771 551101 540721 531663 523816 516995 510844 504963 499339 494403 490256
60432 490256 486040 480533 473395 465511 458112 451970 447494 444975 444315 444805 445664 446712 448234 450296 452536
60417 452536 454589 456448 458350 460471 462770 465080 467369 469982 473436 477931 483193 488813 494468 499732
60403 499732 504126 507684 511161 515270 519956 524801 529888 535681 542136 548488 553977 558418 562003 564955
60389 564955 567438 569429 570650 570959 570789 570769 570938 570884 570666 570901 571631 571729 569980 566410 562071 557859 554042
$$ packed form
60475D389468l57807l60066l46616l22680k93096k61689k30831k01923j76028
60466A838732j53721j34648j17904j02977r0017p9246p0459o3082n6466n0169
60456I20043m4231l9167l5380l2551k9910k7156k4732k3031k1661j9883j7579
60445F04762j5387j3839j2765j1670j0380r058p847o821o151n881n624m936m147
60432D90256m216n507p138p884p399o142m476k519o60M90Q59J048J522K062K240
60417D52536K053J859J902K121K299K310K289K613L454M495N262N620N655N264
60403D99732M394L558L477M109M686M845N087N793O455O352N489M441L585K952
60389E64955K483J991J221L09j70k0J69n4k18K35P30R8j749l570m339m212l817
$$ plain form
60372 554042 550698 547945 545719 543812 542249 541290 540980 541002 541099 541426 542383 544255 547017 550354 553870 557455
60356 557455 561439 566147 571338 576381 581087 586009 591674 597731 603214 607513 610715 612978 614067 613761
60342 613761 612348 610321 607684 604057 599531 595004 591427 589021 587558 587177 588371 591106 594358 596906
60328 596906 598436 599621 601101 602710 603807 604112 603884 603322 602192 600276 597921 595825 594427 593798 593907
60313 593907 594560 595131 594958 594139 593475 593412 593477 593019 592029 590849 589527 587915 586091 584214 582168 579866 577619
60296 577619 575690 573672 570926 567553 564272 561355 558278 554578 550637 547451 545961 546554 548783 551576
60282 551576 554147 556765 560246 564785 569788 574762 579663 584370 588568 592337 596210 600354 604382 608269
60268 608269 612730 618307 624670 631310 638267 645550 652513 658655 664723 672182 681694 692816 705054 718507
$$ packed form
60372E54042l344k753k226j907j563r59l10K2R7L27R57J872K762L337L516L585
60356E57455L984M708N191N043M706M922N665O057N483M299L202K263J089l06
60342F13761j413k027k637l627m526m527l577k406j463l81J194K735L252K548
60328E96906J530J185J480J609J097L05k28n62j130j916k355k096j398o29J09
60313E93907O53N71j73q19o64o3O5m58r90j180j322j612j824j877k046k302k247
60296E77619j929k018k746l373l281k917l077l700l941l186j490N93K229K793
60282E51576K571K618L481M539N003M974M901M707M198L769L873M144M028L887
60268F08269M461N577O363O640O957P283O963O142O068P459R512J1122J2238J3453
$$ plain form
60254 718507 733362 749463 766651 785162 805454 827802 852151 878232 905902 935552 968145
60243 968145 1004614 1045369 1090563 1140587 1195996 1257064 1323784 1396088 1473599 1555164 1639120
60232 1639120 1724038 1808912 1892535 1973163 2048983 2118577 2180755 2234246 2277907 2311203 2334247
60221 2334247 2347398 2350996 2345533 2331896 2311280 2284867 2253816 2219694 2184767 2151583 2122188 2097804
60209 2097804 2079065 2066273 2059513 2058956 2065193 2079045 2101108 2131785 2171652 2221157 2279876 2346652
60197 2346652 2420631 2501464 2588072 2677820 2767478 2854503 2936911 3012505 3079080 3135078 3179312
60186 3179312 3210331 3226904 3229004 3217526 3193079 3155894 3106948 3048392 2982720 2912308 2839936
60175 2839936 2768857 2701758 2640146 2585142 2538310 2501159 2474266 2457456 2450635 2453934 2467202 2489877
$$ packed form
60254G18507J4855J6101J7188J8511K0292K2348K4349K6081K7670K9650L2593
60243I68145L6469M0755M5194N0024N5409O1068O6720P2304P7511Q1565Q3956
60232A639120Q4918Q4874Q3623Q0628P5820O9594O2178N3491M3661L3296K3044
60221B334247J3151L598n463j3637k0616k6413l1051l4122l4927l3184k9395k4384
60209B097804j8739j2792o760n57O237J3852K2063L0677L9867M9505N8719O6776
60197B346652P3979Q0833Q6608Q9748Q9658Q7025Q2408P5594O6575N5998M4234
60186C179312L1019J6573K100j1478k4447l7185m8946n8556o5672p0412p2372
60175B839936p1079o7099o1612n5004m6832l7151k6893j6810o821L299J3268K2675
$$ plain form
60163 2489877 2521386 2561305 2608957 2662945 2721034 2780409 2838135 2891582 2938582 2977461 3007248
60152 3007248 3027827 3039493 3042196 3035458 3019245 2994812 2964635 2931749 2899175 2869564 2844893 2826410
60140 2826410 2814993 2811577 2817324 2833589 2861829 2903296 2958680 3028204 3112223 3211567 3327135
60129 3327135 3459351 3608319 3774523 3958997 4162446 4384055 4621273 4870859 5129928
60120 5129928 5395666 5664108 5929822 6187145 6431315 6658014 6862408 7039649 7186352
60111 7186352 7300749 7381198 7425267 7430723 7396872 7324541 7215351 7071775 6897672 6698199
60101 6698199 6479225 6247274 6009737 5774275 5547477 5334100 5137521 4960458 4805027
60092 4805027 4672318 4562324 4474440 4408098 4362949 4338492 4333671 4347011 4377140 4422789 4482057
$$ packed form
60163B489877L1509L9919M7652N3988N8089N9375N7726N3447M7000L8879K9787
60152C007248K0579J1666K703o738j6213k4433l0177l2886l2574k9611k4671j8483
60140B826410j1417l416N747J6265K8240M1467N5384O9524Q4019R9344J15568
60129C327135J32216J48968J66204J84474K03449K21609K37218K49586K59069
60120E129928K65738K68442K65714K57323K44170K26699K04394J77241J46703
60111G186352J14397Q0449M4069N456l3851p2331j09190j43576j74103j99473
60101F698199k18974k31951k37537k35462k26798k13377j96579j77063j55431
60092D805027j32709j09994q7884o6342m5149k4457m821J3340L0129M5649N9268
$$ plain form
60081 4482057 4551826 4628113 4706796 4783770 4854668 4915163 4961870 4992836 5007110 5004186 4984035
60070 4984035 4947393 4895566 4829962 4751931 4662936 4564549 4458219 4345267 4227224 4106013
60060 4106013 3983741 3862517 3744538 3631998 3526552 3429046 3340083 3260789 3192671 3136793
60050 3136793 3093486 3062910 3045424 3041268 3050343 3072573 3108082 3156677 3217411 3288984 3370126 3459046
60038 3459046 3552765 3647599 3740294 3828215 3908502 3977666 4032265 4069804 4089043 4089932 4073218 4039612
60026 4039612 3989158 3921845 3838972 3743497 3638947 3528531 3415532 3303858 3197347 3098563
60016 3098563 3008634 2928219 2858169 2799288 2751935 2716144 2692050 2680022 2680458 2693576 2719510 2758564
60004 2758564 2811231 2877885 2958490 3052675 3159870 3279036 3408246 3544673 3684949 3825234
$$ packed form
60081D482057O9769P6287P8683P6974P0898O0495M6707L0966J4274k924k0151
60070D984035l6642n1827o5604p8031q8995r8387j06330j12952j18043j21211
60060D106013j22272j21224j17979j12540j05446r7506q8963p9294o8118n5878
60050C136793m3307l0576j7486m156R075K2230L5509M8595O0734P1573Q1142Q8920
60038C459046R3719R4834R2695Q7921Q0287O9164N4599L7539J9239Q89j6714l3606
60026D039612n0454o7313q2873r5475j04550j10416j12999j11674j06511r8784
60016C098563q9929q0415p0050n8881m7353l5791k4094j2028M36J3118K5934L9054
60004B758564N2667O6654Q0605R4185J07195J19166J29210J36427J40276J40285
$$ plain form
59994 3825234 3961035 4087415 4199756 4294414 4368893 4421837 4452957 4462560 4450812 4417533 4362906
59983 4362906 4288322 4196545 4091220 3976392 3856342 3735612 3618843 3510184 3412539 3327448
59973 3327448 3255796 3198427 3155898 3128004 3114058 3113436 3125266 3147827 3179115 3218264 3265746 3321928
59961 3321928 3385955 3456214 3531121 3608896 3687155 3763410 3835777 3902788 3962884 4014622 4057231
59950 4057231 4090459 4114086 4128048 4132967 4130147 4121166 4107834 4092518 4078149 4067941 4065249 4073534
59938 4073534 4096171 4136283 4196771 4280153 4388145 4521730 4681912 4869997 5086635 5330887
59928 5330887 5600516 5892707 6203613 6527152 6854669 7175645 7478292 7749774 7977051
59919 7977051 8148509 8255435 8292866 8260133 8160896 8002251 7793366 7544714 7267738 6974028
$$ packed form
59994C825234J35801J26380J12341R4658P4479N2944L1120R603j1748l3279n4627
59983D362906p4584r1777j05325j14828j20050j20730j16769j08659r7645q5091
59973C327448p1652n7369m2529k7894j3946o22J1830K2561L1288L9149M7482N6182
59961C321928O4027P0259P4907P7775P8259P6255P2367O7011O0096N1738M2609
59950D057231L3228K3627J3962M919k820q981j3332j5316j4369j0208k692Q285
59938D073534K2637M0112O0488Q3382J07992J33585J60182J88085K16638K44252
59928E330887K69629K92191L10906L23539L27517L20976L02647K71482K27277
59919G977051J71458J06926L7431l2733r9237j58645k08885k48652k76976k93710
$$ plain form
59909 6974028 6674153 6377126 6090457 5819930 5569284 5340839 5136635 4958572 4807468
59900 4807468 4682852 4584051 4510972 4463454 4440474 4440553 4462651 4506270 4570907 4655756 4759546
59889 4759546 4880110 5014013 5156772 5303192 5447281 5582121 5700345 5794881 5859358 5888431
59879 5888431 5878453 5828171 5738799 5613670 5457977 5278384 5082144 4876117 4666406 4458421
59869 4458421 4256774 4065046 3885871 3721149 3571927 3438179 3319008 3213089 3118770 3033950
59859 3033950 2956391 2884364 2816843 2753064 2692194 2633580 2577223 2523924 2475028 2431914 2395508
59848 2395508 2366133 2343802 2328363 2319166 2314756 2313283 2313104 2312638 2309791 2302307 2289079 2270734 2248569
59835 2248569 2223214 2194632 2163044 2129274 2094359 2059408 2025828 1995136 1968343 1945768 1927438
$$ packed form
59909F974028k99875k97027k86669k70527k50646k28445k04204j78063j51104
59900D807468j24616r8801p3079m7518k2980P9K2098M3619O4637Q4849J03790
59889D759546J20564J33903J42759J46420J44089J34840J18224R4536O4477K9073
59879E888431r978n0282q9372j25129j55693j79593j96240k06027k09711k07985
59869D458421k01647j91728j79175j64722j49222j33748j19171j05919r4319q4820
59859C033950p7559p2027o7521o3779o0870n8614n6357n3299m8896m3114l6406
59848B395508k9375k2331j5439r197m410j473j79m66k847p484j3228j8345k2165
59835B248569k5355k8582l1588l3770l4915l4951l3580l0692k6793k2575j8330
$$ plain form
59824 1927438 1913189 1902265 1893358 1885551 1879087 1875078 1874716 1879006 1888803 1904484 1925605 1951407 1981790
59811 1981790 2017367 2058268 2103008 2148751 2192612 2232650 2267767 2297050 2319599 2335105 2344361
59800 2344361 2348840 2349820 2348230 2345326 2342937 2342698 2345490 2352131 2364311 2384196 2413190 2451768 2500607
59787 2500607 2561247 2635480 2724748 2830582 2955226 3101345 3271294 3466951 3689873 3940872
59777 3940872 4218747 4518520 4829649 5135071 5412429 5637867 5790955 5858860 5838897 5739063
59767 5739063 5575941 5370175 5141654 4906720 4677704 4463258 4268607 4096018 3945686
59758 3945686 3816576 3706915 3614585 3537544 3474113 3423117 3383949 3356393 3340098 3334262 3338092
59747 3338092 3351514 3375140 3409541 3454776 3510709 3577447 3655365 3744951 3846895 3962312 4092709
$$ packed form
59824A927438j4249j0924q907p807o464m009l62M290R797J5681K1121K5802L0383
59811A981790L5577M0901M4740M5743M3861M0038L5117K9283K2549J5506R256
59800B344361M479R80j590k904k389k39K792O641J2180J9885K8994L8578M8839
59787B500607O0640P4233Q9268J05834J24644J46119J69949J95657K22922K50999
59777C940872K77875K99773L11129L05422K77358K25438J53088O7905j9963r9834
59767E739063j63122k05766k28521k34934k29016k14446j94651j72589j50332
59758C945686j29110j09661r2330p7041o3431n0996l9168k7556j6295n836L830
59747C338092J3422K3626L4401M5235N5933O6738P7918Q9586J01944J15417J30397
$$ plain form
59736 4092709 4239691 4404659 4588798 4793349 5019847 5270051 5545601 5847931 6178449
59727 6178449 6538402 6928051 7345749 7787776 8248775 8721952 9198876 9669665 10124104
59718 10124104 10553359 10951474 11316140 11648809 11954439 12240988 12518456 12797394 13087310
59709 13087310 13395617 13727122 14083543 14462908 14859372 15263748 15664465 16048568 16402740
59700 16402740 16714175 16971182 17164038 17286591 17337745 17321322 17244459 17116487 16949053 16755897
59690 16755897 16551224 16348154 16158757 15994674 15866566 15782954 15750264 15773923 15858873 16009202
59680 16009202 16228106 16518310 16881966 17319907 17831090 18412192 19056508 19752446 20482909
59671 20482909 21225521 21952611 22631177 23224440 23695497 24011624 24148148 24091778 23842844
$$ packed form
59736D092709J46982J64968J84139K04551K26498K50204K75550L02330L30518
59727F178449L59953L89649M17698M42027M60999M73177M76924M70789M54439
59718A0124104M29255L98115L64666L32669L05630K86549K77468K78938K89916
59709A3087310L08307L31505L56421L79365L96464M04376M00717L84103L54172
59700A6402740L11435K57007J92856J22553N1154j6423p6863j27972j67434j93156
59690A6755897k04673k03070j89397j64083j28108q3612l2690K3659Q4950J50329
59680A6009202K18904K90204L63656M37941N11183N81102O44316O95938P30463
59671B0482909P42612P27090O78566N93263M71057L16127J36524n6370k48934
$$ plain form
59662 23842844 23415134 22833507 22130695 21343875 20510463 19664048 18832589 18038811 17300078
59653 17300078 16626464 16019052 15470172 14964559 14480501 13992752 13478501 12923766 12326159
59644 12326159 11693312 11039366 10381262 9735170 9113894 8526248 7977737 7471033 7006221
59635 7006221 6581777 6195810 5846243 5530271 5244685 4986952 4755370 4548020 4362318
59626 4362318 4195922 4047469 3915992 3800105 3698228 3609248 3532428 3466753 3410725 3362774
59616 3362774 3321634 3286312 3255746 3228360 3201893 3173843 3142229 3105879 3064149 3016768 2964040
59605 2964040 2906752 2845667 2781500 2715517 2649619 2585308 2522934 2462486 2404805 2351363 2302993
59594 2302993 2259543 2220851 2187374 2159631 2137656 2121317 2110611 2105139 2103761 2105390 2109966 2118064
$$ packed form
59662B3842844m27710n81627p02812p86820q33412q46415q31459p93778p38733
59653A7300078o73614o07412n48880n05613m84058m87749n14251n54735n97607
59644A2326159o32847o53946o58104o46092o21276n87646n48511n06704m64812
59635G006221m24444l85967l49567l15972k85586k57733k31582k07350j85702
59626D362318j66396j48453j31477j15887j01877q8980p6820o5675n6028m7951
59616C362774m1140l5322l0566k7386k6467k8050l1614l6350m1730m7381n2728
59605B964040n7288o1085o4167o5983o5898o4311o2374o0448n7681n3442m8370
59594B302993m3450l8692l3477k7743k1975j6339j0706n472j378J629M576Q098
$$ plain form
59582 2118064 2129670 2143792 2159282 2175445 2191803 2207858 2223357 2238491 2253528 2268541 2283719
59571 2283719 2299702 2317383 2337530 2360772 2387716 2418821 2454306 2494441 2539899 2591691 2650825
59560 2650825 2718065 2793766 2877913 2970659 3073069 3186933 3313434 3452248 3602421 3763889
59550 3763889 3937461 4123108 4318835 4521474 4728198 4936901 5145435 5350970 5550103
59541 5550103 5738979 5912832 6065790 6192227 6289347 6358631 6404345 6430491 6439283 6432169 6411212
59530 6411212 6378958 6337689 6289748 6238571 6188829 6145638 6114018 6098785 6104216 6133569 6189176
59519 6189176 6272708 6384590 6522999 6683629 6860125 7044014 7224404 7388940 7525839 7625284
59509 7625284 7679499 7682792 7632031 7526586 7367721 7158908 6907076 6622557 6316744 5999840
$$ packed form
59582B118064J1606J4122J5490J6163J6358J6055J5499J5134J5037J5013J5178
59571B283719J5983J7681K0147K3242K6944L1105L5485M0135M5458N1792N9134
59560B650825O7240P5701Q4147R2746J02410J13864J26501J38814J50173J61468
59550C763889J73572J85647J95727K02639K06724K08703K08534K05535J99133
59541E550103J88876J73853J52958J26437R7120O9284M5714K6146Q792p114k0957
59530F411212l2254m1269m7941n1177m9742m3191l1620j5233N431K9353N5607
59519F189176Q3532J11882J38409J60630J76496J83889J80390J64536J36899R9445
59509G625284N4215L293n0761j05445j58865k08813k51832k84519l05813l16904
$$ plain form
59499 5999840 5680794 5368125 5069289 4789172 4529966 4292609 4077867 3886177 3717175
59490 3717175 3569714 3442139 3332638 3239773 3162854 3101735 3056333 3026459 3011860 3012161 3026988
59479 3026988 3056409 3100978 3161022 3236141 3325768 3429880 3548660 3681713 3828195 3987384
59469 3987384 4158174 4337791 4521541 4704009 4879966 5043936 5189607 5310285 5399999 5454186
59459 5454186 5469986 5446511 5384880 5287743 5158785 5002637 4824822 4631246 4427558 4219013
59449 4219013 4010656 3807077 3611650 3426061 3250729 3085731 2931381 2788160 2656388
59440 2656388 2536112 2427175 2329136 2241126 2161982 2090689 2026701 1969856 1920073 1877046 1840075
59429 1840075 1808220 1780873 1758191 1740718 1728553 1721145 1717929 1718694 1723159 1730652 1740710 1753722
$$ packed form
59499E999840l19046l12669k98836k80117k59206k37357k14742j91690j69002
59490C717175j47461j27575j09501r2865p6919o1119m5402k9874j4599L01J4827
59479C026988K9421M4569O0044P5119Q9627J04112J18780J33053J46482J59189
59469C987384J70790J79617J83750J82468J75957J63970J45671J20678Q9714N4187
59459E454186J5800k3475o1631r7137j28958j56148j77815j93576k03688k08545
59449D219013k08357k03579j95427j85589j75332j64998j54350j43221j31772
59440B656388j20276j08937r8039q8010p9144p1293o3988n6845m9783m3027l6971
59429A840075l1855k7347k2682j7473j2165p408l216P65M465P493J0058J3012
$$ plain form
59417 1753722 1770369 1790180 1810818 1828840 1841309 1847182 1847756 1845833 1844155 1844385 1847426 1854322 1866573
59404 1866573 1885581 1911744 1943590 1977507 2008991 2035238 2056982 2077713 2101196 2129823 2164775
59393 2164775 2206758 2256302 2313900 2380282 2456493 2543644 2642814 2755111 2881548 3022924 3180322
59382 3180322 3355823 3552326 3772544 4018536 4292232 4595763 4930745 5297299 5693654
59373 5693654 6115988 6557996 7010882 7464401 7908371 8333694 8732925 9100870 9434967
59364 9434967 9734913 10001919 10238259 10447016 10631575 10794946 10939191 11064666 11169135
59355 11169135 11247795 11294821 11305007 11273731 11195938 11066610 10883051 10646468 10361165 10032915
59345 10032915 9668623 9276697 8866212 8445197 8020028 7596385 7179930 6775757 6387803
$$ packed form
59417A753722J6647J9811K0638J8022J2469N873N74j923j678K30L041O896J2251
59404A866573J9008K6163L1846L3917L1484K6247K1744K0731K3483K8627L4952
59393B164775M1983M9544N7598O6382P6211Q7151R9170J12297J26437J41376J57398
59382C180322J75501J96503K20218K45992K73696L03531L34982L66554L96355
59373E693654M22334M42008M52886M53519M43970M25323L99231L67945L34097
59364I434967K99946K67006K36340K08757J84559J63371J44245J25475J04469
59355A1169135P8660M7026J0186l1276p7793j29328j83559k36583k85303l28250
59345A0032915l64292l91926m10485m21015m25169m23643m16455m04173l87954
$$ plain form
59336 6387803 6019156 5672378 5349035 5049441 4773574 4522004 4295301 4092611 3911545
59327 3911545 3749578 3605118 3477176 3364642 3266310 3181354 3109417 3050162 3002685 2965188
59317 2965188 2935394 2911703 2893971 2882851 2878484 2880322 2888137 2902483 2923877 2952159 2987022 3028601
59305 3028601 3077007 3131672 3191679 3256391 3325224 3396993 3469999 3542607 3613312 3680473 3742604
59294 3742604 3798951 3849324 3893461 3931047 3962446 3988972 4012363 4034194 4055589 4076883 4097410
59283 4097410 4116196 4133400 4151118 4172714 4201362 4238932 4285615 4340173 4400562 4464444 4529133
59272 4529133 4591283 4646999 4692518 4724933 4742550 4744867 4732147 4704816 4663377 4609068 4544400
59261 4544400 4472607 4396550 4318450 4240571 4165629 4096263 4034311 3980751 3936124 3900816 3874945
$$ packed form
59336F387803l68647l46778l23343k99594k75867k51570k26703k02690j81066
59327C911545j61967j44460j27942j12534r8332q4956p1937n9255m7477l7497
59317B965188k9794k3691j7732j1120m367J838P815J4346K1394K8282L4863M1579
59305C028601M8406N4665O0007O4712O8833P1769P3006P2608P0705O7161O2131
59294C742604N6347N0373M4137L7586L1399K6526K3391K1831K1395K1294K0527
59283D097410J8786J7204J7718K1596K8648L7570M6683N4558O0389O3882O4689
59272D529133O2150N5716M5519L2415J7617K317j2720k7331m1439n4309o4668
59261D544400p1793p6057p8100p7879p4942o9366o1952n3560m4627l5308k5871
$$ plain form
59250 3874945 3858044 3848880 3845796 3847379 3852656 3860411 3868585 3874796 3877462 3876149 3870930 3861882 3849190
59237 3849190 3833334 3815133 3796055 3778579 3765731 3759953 3762739 3775619 3801087 3842187 3901553 3981348
59225 3981348 4083910 4211735 4366599 4549053 4758958 4995964 5258727 5543337 5842553
59216 5842553 6146446 6443567 6721674 6968285 7171623 7321623 7410358 7432183 7384303 7267541
59206 7267541 7086423 6848665 6564848 6247960 5911674 5567906 5225787 4892745 4575507
59197 4575507 4279376 4007066 3758974 3534371 3331980 3150078 2987050 2841729 2712577
59188 2712577 2596801 2491158 2393633 2303710 2221233 2145876 2077664 2016993 1963754 1917070 1876138
59177 1876138 1840686 1810399 1784543 1762500 1744161 1729510 1718294 1710394 1706066 1705525 1708680 1715413
$$ packed form
59250C874945j6901r164l084J583N277P755Q174O211K666j313n219r048j2692
59237C849190j5856j8201j9078j7476j2848n778K786J2880K5468M1100N9366P9795
59225C981348J02562J27825J54864J82454K09905K37006K62763K84610K99216
59216E842553L03893K97121K78107K46611K03338J50000Q8735K1825m7880j16762
59206G267541j81118k37758k83817l16888l36286l43768l42119l33042l17238
59197D575507k96131k72310k48092k24603k02391j81902j63028j45321j29152
59188B712577j15776j05643r7525q9923q2477p5357o8212o0671n3239m6684m0932
59177A876138l5452l0287k5856k2043j8339j4651j1216p900m328n41L155O733
$$ plain form
59165 1715413 1725677 1739117 1755129 1773511 1794594 1818521 1844953 1873752 1905366 1940149 1977780
59154 1977780 2017837 2060539 2106535 2156311 2210172 2268402 2330926 2397122 2466336 2538367 2613002
59143 2613002 2689274 2765487 2839736 2910105 2974662 3031726 3080096 3118890 3147527 3166165 3175817
59132 3175817 3177622 3172187 3160071 3142683 3122311 3101293 3081437 3064133 3050722 3042788 3042130 3050240
59120 3050240 3067714 3094491 3130766 3177258 3234287 3300958 3375571 3456489 3542316 3631680 3723400
59109 3723400 3816760 3911368 4007101 4104586 4205383 4311212 4423163 4541953 4668512 4803615
59099 4803615 4946881 5096317 5248389 5397976 5538437 5662499 5763363 5835172 5873251 5874909
59089 5874909 5840135 5771061 5670848 5543492 5394178 5228613 5051526 4866184 4675345 4481967
$$ packed form
59165A715413J0264J3440J6012J8382K1083K3927K6432K8799L1614L4783L7631
59154A977780M0057M2702M5996M9776N3861N8230O2524O6196O9214P2031P4635
59143B613002P6272P6213P4249P0369O4557N7064M8370L8794K8637J8638R652
59132C175817J805n435j2116j7388k0372k1018j9856j7304j3411p934o58Q110
59120C050240J7474K6777L6275M6492N7029O6671P4613Q0918Q5827Q9364R1720
59109C723400R3360R4608R5733R7485J00797J05829J11951J18790J26559J35103
59099D803615J43266J49436J52072J49587J40461J24062J00864P1809L8079J658
59089E874909l4774o9074j00213j27356j49314j65565j77087j85342j90839j93378
$$ plain form
59079 4481967 4288695 4097262 3908847 3724683 3545987 3373565 3207940 3049784 2899945
59070 2899945 2759042 2627214 2504278 2390050 2284434 2187207 2097811 2015587 1940197 1871624
59060 1871624 1809701 1753926 1703838 1659190 1619516 1583979 1552084 1524210 1500899 1481789 1465776
59049 1465776 1452020 1440258 1430189 1421272 1413188 1405918 1399199 1392350 1384907 1377053 1369326 1362176 1355891
59036 1355891 1350550 1345993 1342234 1340009 1340498 1344318 1351181 1360591 1372322 1385943 1400339 1414174 1426618
59023 1426618 1437398 1446508 1454255 1461238 1467828 1473811 1478948 1483693 1488915 1494983 1501533 1508090 1514479 1520566
59009 1520566 1526061 1530772 1534701 1537609 1538674 1536882 1531660 1522936 1510725 1495036 1476234 1455186 1432807
58996 1432807 1409682 1386347 1363791 1343248 1325302 1309519 1295204 1282423 1271980 1264388 1259202 1255556
$$ packed form
59079D481967j93272j91433j88415j84164j78696j72422j65625j58156j49839
59070B899945j40903j31828j22936j14228j05616r7227q9396q2224p5390o8573
59060A871624o1923n5775n0088m4648l9674l5537l1895k7874k3311j9110j6013
59049A465776j3756j1762j0069q917q084p270o719o849p443p854p727p150o285
59036A355891n341m557l759k225M89L820O863R410J1731J3621J4396J3835J2444
59023A426618J0780R110P747O983O590N983N137M745N222O068O550O557O389O087
59009A520566N495M711L929K908J065j792n222q724j2211j5689j8802k1048k2379
58996A432807k3125k3335k2556k0543j7946j5783j4315j2781j0443p592n186l646
$$ plain form
58984 1255556 1253131 1252271 1253177 1255376 1258295 1262142 1267797 1275750 1285472 1296079 1307326 1319623 1333192
58971 1333192 1347651 1362488 1377659 1393628 1411045 1430409 1451804 1474828 1498994 1524217 1550727
58960 1550727 1578443 1606727 1634845 1662414 1689263 1715181 1740003 1763707 1786197 1807162 1826370
58949 1826370 1844019 1860748 1877489 1895333 1915143 1937085 1960816 1986310 2014170 2044911 2078339
58938 2078339 2114111 2152670 2195162 2242560 2295195 2353053 2416176 2484822 2559531 2641005 2729716
58927 2729716 2825806 2929624 3042247 3165250 3300086 3447974 3610119 3787734 3982018 4194527
58917 4194527 4427418 4682909 4962557 5267425 5598830 5958446 6347688 6767327 7217450
58908 7217450 7696971 8202771 8729514 9270185 9816144 10356372 10877230 11363540 11799937
$$ packed form
58984A255556k425q60R06K199K919L847N655P953R722J0607J1247J2297J3569
58971A333192J4459J4837J5171J5969J7417J9364K1395K3024K4166K5223K6510
58960A550727K7716K8284K8118K7569K6849K5918K4822K3704K2490K0965J9208
58949A826370J7649J6729J6741J7844J9810K1942K3731K5494K7860L0741L3428
58938B078339L5772L8559M2492M7398N2635N7858O3123O8646P4709Q1474Q8711
58927B729716R6090J03818J12623J23003J34836J47888J62145J77615J94284K12509
58917D194527K32891K55491K79648L04868L31405L59616L89242M19639M50123
58908G217450M79521N05800N26743N40671N45959N40228N20858M86310M36397
$$ plain form
58899 11799937 12171355 12463308 12663247 12762728 12758715 12653319 12452874 12167409 11810200 11396483
58889 11396483 10941454 10458889 9961104 9459339 8963385 8480806 8017035 7576333 7162169
58880 7162169 6776547 6419562 6090142 5787022 5508740 5253087 5017187 4798187 4593683
58871 4593683 4401725 4220937 4050723 3891087 3742093 3603386 3473996 3352606 3238394
58862 3238394 3131766 3033851 2944951 2863865 2789071 2720093 2657212 2600270 2548528 2501603 2459876
58851 2459876 2423952 2394171 2370654 2353334 2341908 2335997 2335290 2339278 2347209 2358739 2374262 2393983
58839 2393983 2417001 2442148 2469604 2500754 2536432 2576209 2619637 2667320 2720329 2779234 2844209
58828 2844209 2915534 2993552 3078621 3171601 3274002 3387138 3511422 3646994 3794803 3956642
$$ packed form
58899A1799937L71418K91953J99939R9481m013j05396k00445k85465l57209m13717
58889A1396483m55029m82565m97785n01765m95954m82579m63771m40702m14164
58880G162169l85622l56985l29420l03120k78282k55653k35900k19000k04504
58871D593683j91958j80788j70214j59636j48994j38707j29390j21390j14212
58862C238394j06628r7915q8900q1086p4794o8978o2881n6942n1742m6925m1727
58851B459876l5924k9781k3517j7320j1426n911p07L988P931J1530J5523J9721
58839B393983K3018K5147K7456L1150L5678L9777M3428M7683N3009N8905O4975
58828B844209P1325P8018Q5069R2980J02401J13136J24284J35572J47809J61839
$$ plain form
58818 3956642 4134233 4328705 4540947 4772183 5024187 5299182 5599532 5927363 6284328
58809 6284328 6671425 7088647 7534498 8005807 8497894 9004441 9516873 10023864 10511637
58800 10511637 10964905 11367892 11705237 11962898 12129293 12196626 12162004 12027748 11800879 11492339
58790 11492339 11116095 10687723 10222527 9734391 9235824 8738079 8250414 7779359 7329203
58781 7329203 6902956 6502491 6128304 5780009 5456974 5157889 4879986 4619772 4374724
58772 4374724 4143778 3926359 3721963 3530809 3353766 3190989 3041164 2902447 2773575
58763 2773575 2653780 2542404 2439192 2344392 2257968 2179158 2107313 2042754 1986149 1937368 1895546
58752 1895546 1860054 1830774 1807410 1789040 1774455 1762711 1753327 1746081 1740657 1736411 1732511 1728133
$$ packed form
58818C956642J77591J94472K12242K31236K52004K74995L00350L27831L56965
58809F284328L87097M17222M45851M71309M92087N06547N12432N06991M87773
58800A0511637M53268M02987L37345K57661J66395O7333l4622j34256k26869l08540
58790A1492339l76244m28372m65196m88136m98567m97745m87665m71055m50156
58781G329203m26247m00465l74187l48295l23035k99085k77903k60214k45048
58772D374724k30946k17419k04396j91154j77043j62777j49825j38717j28872
58763B773575j19795j11376j03212r4800q6424p8810p1845o4559n6605m8781m1822
58752A895546l5492k9280k3364j8370j4585j1744r384p246n424m246l900m378
$$ plain form
58740 1728133 1722266 1713445 1700218 1682047 1659370 1632689 1602072 1567765 1530781 1492569 1454430 1417480
58728 1417480 1382708 1350566 1320708 1292480 1265509 1239597 1214288 1188884 1162850 1136122 1109134
58717 1109134 1082639 1057232 1033045 1010096 988772 969485 951978 935652 920645 907757 897051
58706 897051 887366 877658 868063 858972 849702 838957 826257 812189 797568 783027 769177 756275
58694 756275 743763 730834 717512 704631 692742 681647 671083 661269 652530 644863 638208 632823
58682 632823 629076 627014 626456 627419 630225 635121 641909 650078 659272 669489 680724 692576 704406 715811
58668 715811 726754 737311 747568 757579 766933 774309 777967 776961 771670 763092 752012 739027 724944
58655 724944 710744 697260 685037 674335 665216 657799 652389 649075 647352 646631 647017 648964 652192 655822
$$ packed form
58740A728133n867q821j3227j8171k2677k6681l0617l4307l6984l8212l8139l6950
58728A417480l4772l2142k9858k8228k6971k5912k5309k5404k6034k6728k6988
58717A109134k6495k5407k4187k2949k1324j9287j7507j6326j5007j2888j0706
58706H97051r685r708r595r091r270j0745j2700j4068j4621j4541j3850j2902
58694G56275j2512j2929j3322j2881j1889j1095j0564r814q739p667o655n385
58682F32823l747k062n58R63K806M896O788Q169R194J0217J1235J1852J1830J1405
58668G15811J0943J0557J0257J0011R354P376L658j006n291q578j1080j2985j4083
58655G24944j4200j3484j2223j0702r119p417n410l314j723p21L86J947L228L630
$$ plain form
58641 655822 659840 665565 674077 684782 696170 707592 719689 733453 749433 767648 787748 809293
58629 809293 832204 856806 883356 911932 943013 977592 1016298 1058894 1105147 1155825 1212299
58618 1212299 1275594 1346334 1425205 1512752 1608910 1713438 1826774 1949886 2083187 2225884
58608 2225884 2376136 2531282 2687807 2841332 2986550 3117141 3226280 3308038 3358544 3376041
58598 3376041 3360620 3314553 3242419 3149916 3042251 2923776 2798640 2670900 2543893 2420035
58588 2420035 2301309 2189463 2085582 1989883 1902084 1821837 1748879 1683098 1624542 1573181 1528633
58577 1528633 1490164 1456842 1427526 1400991 1376346 1353341 1332252 1313609 1298006 1285777 1276615
58566 1276615 1269773 1264694 1261103 1258408 1255424 1250874 1243691 1232784 1217236 1197144 1173747 1148366 1121693
$$ packed form
58641F55822M018N725Q512J0705J1388J1422J2097J3764J5980J8215K0100K1545
58629H09293K2911K4602K6550K8576L1081L4579L8706M2596M6253N0678N6474
58618A212299O3295P0740P8871Q7547R6158J04528J13336J23112J33301J42697
58608B225884J50252J55146J56525J53525J45218J30591J09139Q1758N0506J7497
58598C376041j5421m6067p2134r2503j07665j18475j25136j27740j27007j23858
58588B420035j18726j11846j03881r5699q7799q0247p2958o5781n8556n1361m4548
58577A528633l8469l3322k9316k6535k4645k3005k1089j8643j5603j2229r162
58566A276615o842n079l591k695k984m550p183j0907j5548k0092k3397k5381k6673
$$ plain form
58553 1121693 1094338 1067275 1041142 1015652 990309 965279 941062 917883 895975 875888 857839
58542 857839 841289 825834 812005 800383 790401 780883 771461 762670 754949 748338 742914 738672 735141
58529 735141 731896 729237 727698 727102 726882 727058 728059 729698 731128 731722 731250 729379 725789 720665 714340
58514 714340 706630 697379 687440 678111 669658 661367 653069 645598 639565 634684 630575 627391 625259 623864
58500 623864 622987 622868 623733 625542 628527 633396 640592 649655 659644 669911 680285 690744 701000 710244
58486 710244 717456 722299 725579 728344 730649 731588 730378 726941 721665 715262 708818 703226 698449 693731
58472 693731 688568 683061 677448 671850 666447 661399 656604 651939 647653 644158 641666 640478 641228 644189
58458 644189 648606 653364 658064 662718 666660 668670 668190 665691 661849 657002 651316 644891 637842 630862
$$ packed form
58553A121693k7355k7063k6133k5490k5343k5030k4217k3179k1908k0087j8049
58542H57839j6550j5455j3829j1622r982r518r422q791p721o611n424m242l531
58529G35141l245k659j539n96k20J76J001J639J430N94m72j871l590n124o325
58514G14340p710r251r939r329q453q291q298p471o033m881m109l184k132j395
58500F23864q77j19Q65J809K985M869P196R063R989J0267J0374J0459J0256R244
58486G10244P212M843L280K765K305R39j210l437n276o403o444n592m777m718
58472F93731n163n507n613n598n403n048m795m665m286l495k492j188P50K961
58458F44189M417M758M700M654L942K010m80k499l842m847n686o425p049o980
$$ plain form
58444 630862 625387 622420 621406 621035 620831 621120 621812 622410 623099 624588 626721 628244 628212 626768 624453 621653
58428 621653 618827 616384 614071 611296 608260 605990 605131 605477 606774 609137 612462 616267 620379 625170 630936
58413 630936 637644 645417 654594 665218 676998 689695 702978 716087 728347 739833 750786 760741
58401 760741 769075 776095 782521 788212 792570 795970 799439 802931 805227 805579 804318 801806 798150 794075
58387 794075 790750 788469 786628 785153 784706 785360 786398 787667 789801 792719 795162 796036 795173 792629 788593
58372 788593 784212 781005 779062 777116 774752 773140 773168 774360 776188 778996 782927 787338 791906 797079 802792
58357 802792 808164 813088 818767 825859 833418 840439 847137 853847 859961 864883 868902 872278 874571 875679
58343 875679 876396 877155 877409 877097 877483 879568 882737 885930 889223 893424 899078 906573 916167 927166 938143
$$ packed form
58444F30862n475k967j014l71k04K89O92N98O89J489K133J523l2j444k315k800
58428F21653k826k443k313k775l036k270q59L46J297K363L325L805M112M791N766
58413F30936O708P773R177J0624J1780J2697J3283J3109J2260J1486J0953R955
58401G60741Q334P020O426N691M358L400L469L492K296L52j261k512l656m075
58387G94075l325k281j841j475m47O54J038J269K134K918K443Q74q63k544m036
58372G88593m381l207j943j946k364j612K8J192J828K808L931M411M568N173N713
58357H02792N372M924N679P092P559P021O698O710O114M922M019L376K293J108
58343H75679P17P59K54l12L86K085L169L193L293M201N654P495R594J0999J0977
$$ plain form
58328 938143 948670 959765 972058 984822 997452 1010453 1024162 1037955 1051660 1066348 1082657
58317 1082657 1099674 1116533 1133769 1151843 1169564 1185203 1198213 1208890 1217542 1224969 1232545 1240712
58305 1240712 1248527 1255625 1263357 1273011 1284238 1296288 1309374 1323744 1338848 1354592 1372021 1391508
58293 1391508 1411727 1431647 1452073 1473912 1496515 1519167 1542675 1567795 1593601 1619101 1645250
58282 1645250 1673627 1704348 1736979 1772376 1811749 1854796 1900295 1947683 1996703 2046446 2096011
58271 2096011 2145058 2192629 2236797 2276756 2313883 2349512 2383210 2414557 2444958 2476169 2508608
58260 2508608 2542593 2579535 2620350 2664383 2711421 2762914 2819674 2880423 2944372 3013096 3087873
58249 3087873 3167262 3249483 3335213 3425882 3521211 3620666 3725332 3836176 3952375 4073479
$$ packed form
58328I38143J0527J1095J2293J2764J2630J3001J3709J3793J3705J4688J6309
58317A082657J7017J6859J7236J8074J7721J5639J3010J0677Q652P427P576Q167
58305A240712P815P098P732R654J1227J2050J3086J4370J5104J5744J7429J9487
58293A391508K0219J9920K0426K1839K2603K2652K3508K5120K5806K5500K6149
58282A645250K8377L0721L2631L5397L9373M3047M5499M7388M9020M9743M9565
58271B096011M9047M7571M4168L9959L7127L5629L3698L1347L0401L1211L2439
58260B508608L3985L6942M0815M4033M7038N1493N6760O0749O3949O8724P4777
58249C087873P9389Q2221Q5730R0669R5329R9455J04666J10844J16199J21104
$$ plain form
58239 4073479 4201140 4336652 4479149 4628387 4786679 4955759 5134480 5322131 5521197
58230 5521197 5734203 5960964 6201851 6460495 6740049 7040105 7360723 7706052 8080341
58221 8080341 8484003 8917698 9386673 9896899 10450838 11051774 11708653 12431797 13227725
58212 13227725 14103282 15071133 16146313 17342191 18676058 20175184 21872883 23805031
58204 23805031 26018128 28577352 31563178 35070019 39219065 44168597 50106463 57242835
58196 57242835 65822560 76142275 88556715 103492281 121478603 143162929 169258389
58189 169258389 200364369 236528434 276473918 316829608 352173288 376480180 385468882
58182 385468882 378363048 357888588 328703721 295511888 261922226 230217426 201605512
$$ packed form
58239D073479J27661J35512J42497J49238J58292J69080J78721J87651J99066
58230E521197K13006K26761K40887K58644K79554L00056L20618L45329L74289
58221H080341M03662M33695M68975N10226N53939O00936O56879P23144P95928
58212A3227725Q75557R67851J075180J195878J333867J499126J697699J932148
58204B3805031K213097K559224K985826L506841M149046M949532N937866P136372
58196E7242835Q579725J0319715J2414440J4935566J7986322K1684326K6095460
58189A69258389L1105980L6164065L9945484M0355690L5343680K4306892Q988702
58182C85468882p105834k0474460k9184867l3191833l3589662l1704800k8611914
$$ plain form
58175 201605512 176571419 155181433 137298974 122693642 111057281 101956316 94763735
58168 94763735 88664834 82828258 76684928 70102815 63311255 56663466 50442698 44805337
58160 44805337 39804669 35424583 31610886 28300758 25435036 22953828 20796963 18913877
58152 18913877 17266253 15820534 14545558 13417687 12420067 11535218 10744063 10032124 9390278
58143 9390278 8809028 8277537 7788343 7337690 6921095 6533413 6172944 5840688 5535640
58134 5535640 5254985 4997930 4764587 4551715 4354315 4170970 4002937 3848305 3701788
58125 3701788 3560358 3424703 3294993 3169536 3048113 2932719 2824209 2721464 2624188 2533410
58115 2533410 2448871 2368924 2293164 2222425 2156332 2093745 2035366 1982850 1935534 1891175 1849865
$$ packed form
58175B01605512k5034093k1389986j7882459j4605332j1636361r100965p192581
58168I4763735o098901n836576o143330o582113o791560o647789o220768n637361
58160D4805337n000668m380086l813697l310128k865722k481208k156865j883086
58152A8913877j647624j445719j274976j127871r97620q84849p91155p11939o41846
58143I390278n81250n31491m89194m50653m16595l87682l60469l32256l05048
58134E535640k80655k57055k33343k12872j97400j83345j68033j54632j46517
58125C701788j41430j35655j29710j25457j21423j15394j08510j02745r7276r0778
58115B533410q4539p9947p5760p0739o6093o2587n8379n2516m7316m4359m1310
$$ plain form
58104 1849865 1813942 1783826 1757060 1731799 1708220 1685981 1663265 1639223 1614821 1590426 1564660
58093 1564660 1536256 1505147 1471339 1434717 1396316 1357874 1319819 1281448 1243062 1206033 1170745
58082 1170745 1136476 1103275 1071972 1042374 1013672 986569 962698 941722 921390 900949 882250
58071 882250 866837 853950 842080 830654 819468 808248 797556 788650 781776 775886 770408 765824
58059 765824 762029 757668 751751 744677 737216 729649 722317 715815 710156 704744 699369 694304 689399 684217
58045 684217 679073 674770 671340 668233 665589 663982 663100 662164 661552 662383 664458 666334 667556 669028 670876
58030 670876 671716 670693 668624 666337 663244 658449 652209 645487 638823 632187 625337 618052 610655 604231
58016 604231 599552 595997 592538 589455 587759 587182 586350 584955 584110 584365 585028 585773 587284 589794 592555 595318
$$ packed form
58104A849865l5923l0116k6766k5261k3579k2239k2716k4042k4402k4395k5766
58093A564660k8404l1109l3808l6622l8401l8442l8055l8371l8386l7029l5288
58082A170745l4269l3201l1303k9598k8702k7103k3871k0976k0332k0441j8699
58071H82250j5413j2887j1870j1426j1186j1220j0692q906o874n890n478m584
58059G65824l795m361n917p074p461p567p332o502n659n412n375n065m905n182
58045F84217n144m303l430l107k644j607q82r36o12Q31K075J876J222J472J848
58030F70876Q40j023k069k287l093m795o240o722o664o636o850p285p397o424
58016F04231m679l555l459l083j696n77q32j395q45K55O63P45J511K510K761K763
$$ plain form
58000 595318 598820 603102 606799 608941 610208 611524 612588 612651 611711 610020 607302 603308 598450 593184 587477
57985 587477 581454 575844 571164 567079 563063 559031 554936 550511 545867 541627 538052 534675 531129 527676
57971 527676 524574 521661 518845 516339 514182 512231 510683 509848 509404 508802 508418 509074 510294 510303 508169 504754
57955 504754 501130 497289 493033 489026 486161 484710 484536 485352 486406 486923 487254 488550 490898 493015 494242
57940 494242 495460 497268 498675 498599 497508 496355 494897 492349 488910 485340 481491 476445 469790 461839 452928
57925 452928 443415 434066 425596 418046 411257 405631 401736 399506 398476 398510 399731 402069 405485 410302 416756
57910 416756 424461 432786 441418 450172 458667 466620 474065 480821 486092 489039 489454 487663 484161 479545
57896 479545 474224 467995 460570 452627 445474 439296 432752 424798 416042 407677 400108 393409 388171 384782
$$ packed form
58000E95318L502M282L697K142J267J316J064O3r40j691k718l994m858n266n707
57985E87477o023n610m680m085m016m032m095m425m644m240l575l377l546l453
57971E27676l102k913k816k506k157j951j548q35m44o02l84O56J220Rk134l415
57955E04754l624l841m256m007k865j451j74Q16J054N17L31J296K348K117J227
57940D94242J218J808J407p6j091j153j458k548l439l570l849n046o655p951q911
57925D52928r513r349q470p550o789n626l895k230j030L4J221K338L416M817O454
57910D16756P705Q325Q632Q754Q495P953P445O756N271K947M15j791l502m616
57896D79545n321o229p425p943p153o178o544p954q756q365p569o699n238l389
$$ plain form
57882 384782 382500 380262 377969 376126 374760 373706 373522 375086 378413 382707 387398 392430 397710 403006
57868 403006 408287 413653 419088 424674 430640 436741 441980 445539 447574 448680 448995 448420 447129 445275 442706
57853 442706 439585 436712 434430 431816 427838 422959 418723 416076 414860 414547 414563 414143 412775 410744 408601
57838 408601 406288 403403 399987 396334 392329 387647 382335 376552 370098 362951 355824 349375 343186 336362
57824 336362 328764 320883 313014 305533 299510 295793 293698 291782 289695 288103 286953 285349 283316 282287
57810 282287 283384 286307 290422 295830 302705 310406 317930 324711 330582 335630 340586 346711 354615 363463
57796 363463 371709 378278 382915 385965 388234 390634 393538 396709 400018 403746 407893 411626 413793 413808 411751
57781 411751 407887 402300 394843 385376 374238 362457 351147 340654 330642 321040 312485 305729 300968
$$ packed form
57882C84782k282k238k293j843j366j054j84J564L327M294M691N032N280N296
57868D03006N281N366N435N586N966O101N239L559K035J106L15n75j291j854k569
57853D42706l121k873k282k614l978m879m236k647j216l13J6m20j368k031k143
57838D08601k313k885l416l653m005m682n312n783o454p147p127o449o189o824
57824C36362p598p881p869p481o023l717k095j916k087j592j150j604k033j029
57810B82287J097K923M115N408O875P701P524O781N871N048M956O125P904Q848
57796C63463Q246O569M637L050K269K400K904L171L309L728M147L733K167J5k057
57781D11751l864n587p457r467j1138j1781j1310j0493j0012r602q555o756m761
$$ plain form
57768 300968 297805 295518 293344 290963 288828 287636 287408 287446 287255 287054 287302 288164 289546 291273 293121 295064
57752 295064 297595 301420 306695 312919 319573 326408 333043 338855 343612 347827 352197 356884 361518 365681
57738 365681 369246 372436 375643 378911 381650 383145 383372 383067 383032 383756 385583 388645 392540 396551 400388
57723 400388 404385 408885 413854 419215 425083 431460 438067 444727 451656 459212 467562 476623 486105 495670
57709 495670 505400 516074 528533 542789 558197 574498 592098 611218 631492 652708 675480 700819
57697 700819 729431 761626 797555 837242 880823 929021 983051 1043702 1110977 1185050 1267324
57686 1267324 1360074 1465136 1583253 1714567 1859388 2018351 2191865 2379264 2578256 2785036
57676 2785036 2994852 3202706 3404198 3596608 3779630 3955059 4125362 4290940 4445737
$$ packed form
57768C00968l163k287k174k381k135j192k28L8j91k01K48Q62J382J727J848J943
57752B95064K531L825N275O224O654O835O635N812M757M215M370M687M634M163
57738C65681L565L190L207L268K739J495K27l05l5P24J827L062L895M011L837
57723D00388L997M500M969N361N868O377O607O660O929P556Q350R061R482R565
57709D95670R730J0674J2459J4256J5408J6301J7600J9120K0274K1216K2772K5339
57697G00819K8612L2195L5929L9687M3581M8198N4030O0651O7275P4073Q2274
57686A267324R2750J05062J18117J31314J44821J58963J73514J87399J98992K06780
57676B785036K09816K07854K01492J92410J83022J75429J70303J65578J54797
$$ plain form
57667 4445737 4572960 4645879 4636947 4531051 4333475 4067128 3762476 3447510 3142249 2858131
57657 2858131 2600542 2371738 2171879 1998646 1848054 1716839 1603563 1506999 1424554 1353341
57647 1353341 1292002 1240269 1197186 1161116 1131341 1108269 1091814 1080687 1073719 1070959 1072949 1079689
57635 1079689 1090887 1106666 1127388 1153163 1184112 1220828 1264035 1313954 1370531 1434199 1505962
57624 1505962 1586701 1676824 1776608 1886302 2005417 2131989 2262759 2393862 2520987 2638890
57614 2638890 2741267 2821643 2874644 2896777 2886624 2844973 2774910 2681396 2570289 2447395 2317953
57603 2317953 2186430 2056388 1930453 1810379 1697121 1591028 1492256 1401061 1317643 1241737
57593 1241737 1172611 1109450 1051612 998615 950176 906296 866985 831802 799953 770848 744305
$$ packed form
57667D445737J27223P2919q932j05896j97576k66347l04652l14966l05261k84118
57657B858131k57589k28804j99859j73233j50592j31215j13276r6564q2445p1213
57647A353341o1339n1733m3083l6070k9775k3072j6455j1127o968k760J990O740
57635A079689J1198J5779K0722K5775L0949L6716M3207M9919N6577O3668P1763
57624A505962Q0739R0123R9784J09694J19115J26572J30770J31103J27125J17903
57614B638890J02377Q0376N3001K2133j0153m1651p0063r3514j11107j22894j29442
57603B317953j31523j30042j25935j20074j13258j06093r8772r1195q3418p5906
57593A241737o9126o3161n7838n2997m8439m3880l9311l5183l1849k9105k6543
$$ plain form
57582 744305 720154 698016 677658 659194 642660 627646 613603 600282 587656 575682 564494
57571 564494 554624 546556 540024 534043 527747 521072 514649 509257 505404 503182 502308 502268 502565 503002 503893 505898
57555 505898 509461 514354 519935 525930 532787 541174 551277 562755 575231 588636 603103 618824 636124
57542 636124 655573 677729 702679 729971 759277 791082 826445 866082 910065 958606 1012638
57531 1012638 1073246 1140796 1215128 1296324 1384702 1480130 1581782 1688350 1797690 1906211
57521 1906211 2009226 2102140 2180831 2240975 2278124 2289306 2274400 2235727 2176687 2101106 2013229
57510 2013229 1917462 1817797 1717442 1618762 1523436 1432936 1348907 1272654 1204145 1142090 1085391
57499 1085391 1034110 988773 949250 914775 884594 858000 834162 812609 793761 778455 767076
$$ packed form
57582G44305k4151k2138k0358j8464j6534j5014j4043j3321j2626j1974j1188
57571E64494r870q068o532n981o296o675o423n392l853k222q74m0K97M37Q91K005
57555E05898L563M893N581N995O857Q387J0103J1478J2476J3405J4467J5721J7300
57542F36124J9449K2156K4950K7292K9306L1805L5363L9637M3983M8541N4032
57531A012638O0608O7550P4332Q1196Q8378R5428J01652J06568J09340J08521
57521A906211J03015R2914P8691O0144L7149J1182j4906l8673n9040p5581q7877
57510B013229r5767r9665j00355r8680r5326r0500q4029p6253o8509o2055n6699
57499A085391n1281m5337l9523l4475l0181k6594k3838k1553j8848j5306j1379
$$ plain form
57488 767076 759487 755416 754265 754850 756195 758672 763710 772279 784225 799164 817351 839349 865361
57475 865361 895314 929270 967391 1009796 1056905 1109835 1169996 1238141 1314029 1397104 1487168
57464 1487168 1583943 1685904 1789782 1891366 1986440 2070725 2139337 2187217 2210589 2207972 2180018
57453 2180018 2128917 2058125 1972000 1875101 1771748 1666074 1561769 1461223 1365222 1273916
57443 1273916 1187941 1108354 1035822 970344 911575 859004 811898 769434 730917 695798 663725
57432 663725 634755 609150 586676 566433 547709 530615 515519 502220 490190 479228 469281 459952
57420 459952 450890 442461 435306 429324 423788 418396 413477 409153 405127 401406 398430 396153 393769 390857
57406 390857 388200 386818 386553 386260 385275 384070 383401 383306 383225 382844 382444 382408 382662 382864 382995 383386 384153 384946 385443
$$ packed form
57488G67076p589m071j151N85J345K477N038Q569J1946J4939J8187K1998K6012
57475H65361K9953L3956L8121M2405M7109N2930O0161O8145P5888Q3075R0064
57464A487168R6775J01961J03878J01584R5074Q4285O8612M7880K3372k617k7954
57453B180018n1101p0792q6125r6899j03353j05674j04305j00546r6001r1306
57443A273916q5975p9587p2532o5478n8769n2571m7106m2464l8517l5119l2073
57432F63725k8970k5605k2474k0243j8724j7094j5096j3299j2030j0962r947r329
57420D59952r062q429p155n982n536n392m919m324m026l721k976k277k384k912
57406C90857k657j382k65k93r85j205o69r5q1l81m00l6K54K02J31L91P67P93M97
$$ plain form
57387 385443 385742 386059 386413 386945 388148 390320 392960 395230 396877 398279 399789 401517 403650 406373 409497
57372 409497 412665 415966 419780 424008 428023 431527 434934 438714 442858 447195 451768 456548 461173 465310
57358 465310 469093 472950 477117 481489 485752 489576 492878 496020 499549 503646 507925 511807 514929 517303
57344 517303 519357 521824 525238 529483 534002 538416 542738 547157 551919 557276 563146 568907 574017 578762
57330 578762 583942 589850 596056 602083 607791 613167 618435 624301 631330 638989 646128 652608 659554 667695
57316 667695 676419 685024 693961 703919 714337 723942 732488 741015 750402 760509 770870 781532 792954
57303 792954 805474 819068 833347 847770 862181 877207 893828 912442 932525 953234 974164
57292 974164 995514 1017750 1041205 1065886 1091610 1118309 1146073 1174761 1203718 1232020 1258970
$$ packed form
57387C85443K99L17L54N32J203K172K640K270J647J402J510J728K133K723L124
57372D09497L168L301L814M228M015L504L407L780M144M337M573M780M625M137
57358D65310L783L857M167M372M263L824L302L142L529M097M279L882L122K374
57344E17303K054K467L414M245M519M414M322M419M762N357N870N761N110M745
57330E78762N180N908O206O027N708N376N268N866P029P659P139O480O946Q141
57316F67695Q724Q605Q937R958J0418R605Q546Q527R387J0107J0361J0662J1422
57303G92954J2520J3594J4279J4423J4411J5026J6621J8614K0083K0709K0930
57292I74164K1350K2236K3455K4681K5724K6699K7764K8688K8957K8302K6950
$$ plain form
57281 1258970 1284234 1307546 1328350 1345694 1358498 1366117 1368737 1367143 1362117 1354245 1344243 1333103
57269 1333103 1321770 1310854 1300784 1292003 1284878 1279590 1276196 1274594 1274407 1275184 1276740 1279143 1282367 1286353
57255 1286353 1291333 1297633 1305088 1313180 1321841 1331548 1342424 1353876 1365443 1377429 1390261 1403757
57243 1403757 1417499 1431473 1445796 1460283 1474895 1490224 1506795 1524086 1540887 1556535 1571239
57232 1571239 1585413 1599371 1613644 1628837 1645002 1661583 1678104 1694521 1710951 1727545 1744703
57221 1744703 1762998 1782636 1803299 1824547 1846144 1868003 1890091 1912387 1934661 1956417 1977379
57210 1977379 1997971 2018861 2040071 2060986 2081270 2101291 2121522 2141940 2162306 2182690 2203405
57199 2203405 2224548 2245848 2266968 2287887 2308969 2330599 2352724 2374897 2396872 2418968 2441637
$$ packed form
57281A258970K5264K3312K0804J7344J2804P619K620j594n026p872j0002j1140
57269A333103j1333j0916j0070q781p125n288l394j602j87P77J556K403L224L986
57255A286353M980O300P455Q092Q661R707J0876J1452J1567J1986J2832J3496
57243A403757J3742J3974J4323J4487J4612J5329J6571J7291J6801J5648J4704
57232A571239J4174J3958J4273J5193J6165J6581J6521J6417J6430J6594J7158
57221A744703J8295J9638K0663K1248K1597K1859K2088K2296K2274K1756K0962
57210A977379K0592K0890K1210K0915K0284K0021K0231K0418K0366K0384K0715
57199B203405K1143K1300K1120K0919K1082K1630K2125K2173K1975K2096K2669
$$ plain form
57188 2441637 2464927 2488606 2512588 2536797 2560759 2583832 2605896 2627426 2648753 2669553 2689087
57177 2689087 2706759 2722394 2736229 2748712 2760218 2770967 2781237 2791384 2801428 2810924 2819602 2828008
57165 2828008 2837158 2847798 2860313 2874992 2891767 2909882 2928546 2947866 2968475 2990245 3012087
57154 3012087 3033153 3053457 3073073 3091524 3108458 3124323 3139753 3154657 3168498 3181148 3192865
57143 3192865 3203554 3212704 3220129 3226362 3232148 3237761 3242937 3247364 3251098 3254596 3258329 3262508 3267278 3273135
57129 3273135 3280979 3291710 3305889 3323809 3345640 3371388 3400844 3433678 3469500 3507851 3548300
57118 3548300 3590653 3635046 3681960 3732281 3787288 3848409 3917112 3995196 4084942 4188610 4307927
57107 4307927 4444551 4601187 4782080 4992718 5239774 5531753 5879633 6297215 6801641
$$ packed form
57188B441637K3290K3679K3982K4209K3962K3073K2064K1530K1327K0800J9534
57177B689087J7672J5635J3835J2483J1506J0749J0270J0147J0044R496Q678Q406
57165B828008R150J0640J2515J4679J6775J8115J8664J9320K0609K1770K1842
57154C012087K1066K0304J9616J8451J6934J5865J5430J4904J3841J2650J1717
57143C192865J0689R150P425O233N786N613N176M427L734L498L733M179M770N857
57129C273135P844J0731J4179J7920K1831K5748K9456L2834L5822L8351M0449
57118C548300M2353M4393M6914N0321N5007O1121O8703P8084Q9746J03668J19317
57107D307927J36624J56636J80893K10638K47056K91979L47880M17582N04426
$$ plain form
57098 6801641 7414159 8160580 9071270 10180751 11526230 13144393 15067577 17320834 19919206
57089 19919206 22863921 26139569 29715892 33552114 37595246 41768040 45955460 50004862
57081 50004862 53745128 57014102 59678400 61639286 62831225 63223252 62825271 61691218
57073 61691218 59910202 57587047 54824102 51714902 48348866 44817562 41215207 37633351
57065 37633351 34153693 30842191 27746133 24894661 22301649 19968788 17887940 16043400
57057 16043400 14414489 12978017 11710349 10589445 9596410 8715459 7932540 7234487 6609613
57048 6609613 6048434 5543193 5086875 4672989 4296042 3951742 3636782 3348741 3086011
57039 3086011 2847438 2631854 2438002 2264670 2110560 1974054 1853368 1746822 1652759 1569311
$$ packed form
57098F801641O12518P46421R10690J109481J345479J618163J923184K253257K598372
57089A9919206K944715L275648L576323L836222M043132M172794M187420M049402
57081E0004862L740266L268974K664298J960886J191939L92027l97981j134053
57073F1691218j781016k323155k762945l109200l366036l531304l602355l581856
57065C7633351l479658l311502l096058k851472k593012k332861k080848j844540
57057A6043400j628911j436472j267668j120904r93035q80951p82919o98053o24874
57048F609613n61179n05241m56318m13886l76947l44300l14960k88041k62730
57039C086011k38573k15584j93852j73332j54110j36506j20686j06546r4063q3448
$$ plain form
57029 1569311 1494643 1427551 1367611 1314740 1268840 1229897 1198084 1173582 1156540 1147512 1147808 1159177
57017 1159177 1183335 1222229 1278413 1353360 1443000 1533860 1604960 1636638 1620474 1562476 1477510
57006 1477510 1380644 1282295 1188522 1102867 1027059 961140 904225 855356 813515 777327 745419
56995 745419 717000 691664 668698 647096 626254 606216 587179 569252 552878 538995 528366
56984 528366 520830 515295 510015 502615 490430 471816 447501 420344 393493 368841 347007 328241
56972 328241 312893 301229 293228 288721 287564 289563 294348 301515 310914 322683 336924 353557 372725
56959 372725 395197 421762 451710 481869 507403 523795 528553 521803 505908 484419 460709 436986
56947 436986 414351 393486 375048 359505 346977 337470 331143 328193 328593 332062 338375 347746 361008
$$ packed form
57029A569311p4668o7092n9940n2871m5900l8943l1813k4502j7042r028K96J1369
57017A159177K4158L8894N6184P4947Q9640R0860P1100L1678j6164n7998q4966
57006A477510r6866r8349r3773q5655p5808o5919n6915m8869m1841l6188l1908
56995G45419k8419k5336k2966k1602k0842k0038j9037j7927j6374j3883j0629
56984E28366p536n535n280p400j2185j8614k4315k7157k6851k4652k1834j8766
56972C28241j5348j1664q001m507j157J999M785P167R399J1769J4241J6633J9168
56959C72725K2472K6565K9948L0159K5534J6392M758o750j5895k1489k3710k3723
56947D36986k2635k0865j8438j5543j2528r507o327k950M00L469O313R371J3262
$$ plain form
56934 361008 379282 403286 432688 465833 499579 529298 549620 556333 548348 528086 499903 468003
56922 468003 435290 403428 373393 345873 321309 299734 280808 264132 249459 236584 225196
56911 225196 215138 206673 200232 195797 192686 189919 186799 183297 180110 178221 178130 179499 181696 184517
56897 184517 188175 192807 198420 205253 213753 224159 236478 250913 267893 287503 309155 331866
56885 331866 354427 375051 391248 400598 401963 396103 385237 371881 357778 343757 330478 319023
56873 319023 310497 305369 303575 305085 309860 317363 326862 338474 353577 374034 401236 435767 477293
56860 477293 524226 573392 619885 657368 679610 683346 670216 645367 613918 579168 543670 510345
56848 510345 481606 458301 440498 428777 423865 425475 432529 444585 462463 487611 521478 565445
$$ packed form
56934C61008J8274K4004K9402L3145L3746K9719K0322O713p985k0262k8183l1900
56922D68003l2713l1862l0035k7520k4564k1575j8926j6676j4673j2875j1388
56911B25196j0058q465o441m435l111k767l120l502l187j889r1J369K197K821
56897A84517L658M632N613O833Q500J0406J2319J4435J6980J9610K1652K2711
56885C31866K2561K0624J6197R350J365n860j0866j3356j4103j4021j3279j1455
56873C19023q526n128j794J510M775P503R499J1612J5103K0457K7202L4531M1526
56860D77293M6933M9166M6493L7483K2242L736j3130k4849l1449l4750l5498l3325
56848E10345k8739k3305j7803j1721m912J610P054J2056J7878K5148L3867M3967
$$ plain form
56836 565445 620727 687884 765880 850492 932963 1001132 1043701 1054737 1034987 990105 928313
56825 928313 858480 788103 721811 661784 609351 565548 530473 503361 483756 471917 467856 470870
56813 470870 480573 497792 523881 559581 604887 659164 719996 781514 834523 869246 879072 862975
56801 862975 825425 774129 716950 659703 605666 556403 512751 475223 443835 418018 397093
56790 397093 381011 370383 365657 366443 371926 381776 396365 416218 441435 471210 503063 532341
56778 532341 553123 560515 552639 531027 499597 463148 425876 390388 357669 327935 301431 278481
56766 278481 259055 242590 228333 215916 205534 197453 191279 185919 180463 174977 170227 166732 164322
56753 164322 162561 161259 160500 160288 160264 159809 158602 157103 156156 155956 155750 154892 153767 153183 153098 152642 151336
$$ packed form
56836E65445N5282O7157P7996Q4612Q2471O8169M2569J1036j9750m4882o1792
56825I28313o9833p0377o6292o0027n2433m3803l5075k7112j9605j1839m061L014
56813D70870R703J7219K6089L5700M5306N4277O0832O1518N3009L4723R826j6097
56801H62975l7550n1296n7179n7247n4037m9263m3652l7528l1388k5817k0925
56790C97093j6082j0628m726P86N483R850J4589J9853K5217K9775L1853K9278
56778E32341K0782P392p876k1612l1430l6449l7272l5488l2719k9734k6504k2950
56766B78481j9426j6465j4257j2417j0382q081o174n360n456n486m750l495k410
56753A64322j761j302p59k12k4m55j207j499r47k00k06q58j125n84q5m56j306
$$ plain form
56736 151336 149640 148180 147039 146019 145080 144169 142969 141206 139060 137042 135587 134852 134767 135072 135414 135500
56720 135500 135169 134394 133331 132316 131666 131431 131429 131393 131016 130127 129050 128503 128770 129204 128964 128017 126934 125913
56702 125913 124699 123451 122936 123671 125321 127136 128507 129034 128627 127822 127476 127838 128342 128560 128869 129860 131487
56685 131487 133242 134765 135896 136412 136248 135804 135685 136137 137015 138124 139369 140766 142506 144825 147502 149755
56669 149755 150976 151394 151599 151578 150718 148817 146587 144923 143958 143133 142080 141056 140475 140273 140047 139683 139518
56652 139518 139775 140158 140243 139934 139328 138387 137216 136395 136474 137162 137576 137306 136685 135978 134957 133574 132400 131893
56634 131893 131671 131045 130038 129312 129202 129304 129073 128516 128178 128553 129541 130495 130870 130826 130926 131267 131247 130392 129091
56615 129091 128175 127962 128031 127867 127431 127116 127335 128184 129421 130759 132145 133625 135011 135943 136343 136545 136854
$$ packed form
56736A51336j696j460j141j020r39r11j200j763k146k018j455p35q5L05L42Q6
56720A35500l31p75j063j015o50k35kl6l77q89j077n47K67M34k40r47j083j021
56702A25913j214j248n15P35J650J815J371N27m07q05l46L62N04K18L09R91J627
56685A31487J755J523J131N16j64m44j19M52Q78J109J245J397J740K319K677K253
56669A49755J221M18K05k1q60j901k230j664r65q25j053j024n81k02k26l64j65
56652A39518K57L83Q5l09o06r41j171q21P9O88M14k70o21p07j021j383j174n07
56634A31893k22o26j007p26j10J02k31n57l38L75R88R54L75m4J00L41k0q55j301
56615A29091r16k13O9j64m36l15K19Q49J237J338J386J480J386R32M00K02L09
$$ plain form
56598 136854 137202 137359 137286 137173 137249 137644 138241 138637 138524 138169 138241 139056 140322 141762 143552 145871 148341 150309
56580 150309 151553 152411 153353 154683 156564 159023 161899 164939 167934 170767 173525 176658 180806 186240 192575
56565 192575 199208 205988 213350 221810 231349 241205 250331 258246 265432 272721 280300 287602 294036 299479
56551 299479 303983 307432 309646 310512 309887 307713 304396 300688 296931 292693 287390 281032 274132 267088 259858
56536 259858 252168 243949 235673 228131 221624 215567 209366 203562 199409 197230 195953 194484 192816 191326
56522 191326 189757 187509 184417 180628 176185 171438 167376 164754 163113 161427 159539 158169 157601 157236 156589
56507 156589 155914 155512 155037 153926 152145 150081 147998 146017 144470 143827 144154 144871 145233 145002 144565 144438 144799
56490 144799 145541 146543 147702 148797 149637 150321 151104 152040 153047 154295 156127 158519 160949 162978 164687
$$ packed form
56598A36854L48J57p3j13P6L95N97L96j13l55P2Q15J266J440J790K319K470J968
56580A50309J244Q58R42J330J881K459K876L040K995K833K758L133M148N434O335
56565A92575O633O780P362Q460R539R856R126P915P186P289P579P302O434N443
56551B99479M504L449K214Q66o25k174l317l708l757m238n303o358o900p044p230
56536B59858p690q219q276p542o507o057o201n804m153k179j277j469j668j490
56522A91326j569k248l092l789m443m747m062k622j641j686j888j370n68l65o47
56507A56589o75m02m75j111j781k064k083j981j547o43L27P17L62k31m37j27L61
56490A44799P42J002J159J095Q40O84P83R36J007J248J832K392K430K029J709
$$ plain form
56475 164687 166425 168391 170553 172704 174550 176042 177678 180120 183449 187167 190914 194687 198264 201085
56461 201085 202928 204251 205568 206920 208162 209262 210095 210462 210564 210871 211210 210609 208462 205298 201994 198889
56445 198889 196127 194174 193223 192515 191018 188559 185811 183527 182243 182240 183163 184045 184307 184363 184720 185002 184550
56428 184550 183495 182433 181499 180621 180319 181205 182876 184284 185170 186207 187658 188802 188935 188202 187243 186598
56412 186598 186648 187545 188916 190002 190263 189663 188462 187073 186003 185470 185162 184728 184321 184271 184460 184524 184453 184465 184498
56393 184498 184416 184545 185371 186831 188421 189859 191177 192365 193510 195023 197066 199041 200354 201409 203000
56378 203000 204873 205849 205413 204362 203775 204067 205095 206471 207652 208366 209079 210496 212619 214881 217075 219393
56362 219393 221618 223130 223811 224254 225031 226426 228759 232065 235374 237330 237745 237751 238182 238697 238810 238841 239298
$$ packed form
56475A64687J738J966K162K151J846J492J636K442L329L718L747L773L577K821
56461B01085J843J323J317J352J242J100Q33L67J02L07L39o01k147l164l304l105
56445A98889k762j953r51p08j497k459k748k284j284lR23Q82K62N6L57K82m52
56428A84550j055j062r34q78l02Q86J671J408Q86J037J451J144J33p33r59o45
56412A86598N0Q97J371J086K61o00j201j389j070n33l08m34m07n0J89O4p1J2L3
56393A84498q2J29Q26J460J590J438J318J188J145J513K043J975J313J055J591
56378B03000J873R76m36j051n87K92J028J376J181P14P13J417K123K262K194K318
56362B19393K225J512O81M43P77J395K333L306L309J956M15OM31N15J13L1M57
$$ plain form
56345 239298 240051 240777 241778 243756 246969 250920 254705 257551 259342 260774 262740 265499 268671 271951 275474
56330 275474 279635 284896 291532 299044 306064 311459 315361 318613 321584 324279 327162 330851 335166 339471
56316 339471 343825 348797 354256 359492 364500 369975 375939 381544 386374 390729 394435 396681 397502 398208 399780
56301 399780 401856 403790 405640 407521 409030 410037 411183 412955 415021 417042 419361 422327 425740 429540
56287 429540 434348 440809 449078 459290 471620 485499 499769 514209 529925 547695 567000 587352
56275 587352 609481 634286 661641 691294 724127 761391 803353 849748 901045 958268 1022129
56264 1022129 1093272 1172904 1262152 1361206 1469950 1588915 1718500 1857579 2003942 2155946
56254 2155946 2312719 2472749 2633206 2790711 2941992 3083612 3211772 3322765 3413572 3482245
$$ packed form
56345B39298P53P26J001J978L213L951L785K846J791J432J966K759L172L280L523
56330B75474M161N261O636P512P020N395L902L252K971K695K883L689M315M305
56316C39471M354M972N459N236N008N475N964N605M830M355L706K246Q21P06J572
56301C99780K076J934J850J881J509J007J146J772K066K021K319K966L413L800
56287D29540M808O461Q269J0212J2330J3879J4270J4440J5716J7770J9305K0352
56275E87352K2129K4805K7355K9653L2833L7264M1962M6395N1297N7223O3861
56264A022129P1143P9632Q9248R9054J08744J18965J29585J39079J46363J52004
56254B155946J56773J60030J60457J57505J51281J41620J28160J10993R0807O8673
$$ plain form
56244 3482245 3528103 3551588 3553781 3536245 3501324 3452077 3391494 3322011 3245721 3164349 3078665
56233 3078665 2988621 2894496 2797410 2698380 2597607 2495159 2391669 2287807 2183709 2079525
56223 2079525 1976058 1874336 1775084 1679058 1587220 1500027 1417102 1338136 1263544 1193855 1129190
56212 1129190 1069829 1016389 968762 925691 886192 850647 819708 792880 769024 747568 728242
56201 728242 710337 693270 677415 663364 650738 638671 627054 616395 606735 597577 588729 580573
56189 580573 573695 568652 565582 563603 561326 558591 556939 557584 559764 561931 563767 565963 568798 572186
56175 572186 576558 582336 588902 595240 601412 608310 616261 624937 634327 644653 655450 665850 675805
56162 675805 686068 696955 707933 718399 728161 737220 745739 754258 763415 773681 785663 800214
$$ packed form
56244C482245M5858K3485K193j7536l4921m9247o0583o9483p6290q1372q5684
56233C078665r0044r4125r7086r9030j00773j02448j03490j03862j04098j04184
56223B079525j03467j01722r9252r6026r1838q7193q2925p8966p4592o9689o4665
56212A129190n9361n3440m7627m3071l9499l5545l0939k6828k3856k1456j9326
56201G28242j7905j7067j5855j4051j2626j2067j1617j0659r660r158q848q156
56189E80573o878n043l070j979k277k735j652O45K180K167J836K196K835L388
56175E72186M372N778O566O338O172O898P951Q676R390J0326J0797J0400R955
56162F75805J0263J0887J0978J0466R762R059Q519Q519R157J0266J1982J4551
$$ plain form
56150 800214 817814 838405 862449 891556 927572 971767 1025519 1090809 1169076 1260272 1363737
56139 1363737 1478774 1602854 1729948 1852222 1963444 2060396 2142294 2210667 2269347 2322692
56129 2322692 2373150 2420694 2463684 2499158 2523277 2533460 2530500 2517842 2499064 2476502 2450946
56118 2450946 2420772 2381710 2329105 2260742 2177112 2080104 1973054 1861431 1751478 1647835
56108 1647835 1553186 1469447 1397754 1337718 1288241 1248946 1219611 1198805 1184495 1175584 1171334 1169789
56096 1169789 1168537 1166748 1164807 1162111 1156935 1148498 1137592 1125171 1111713 1097953 1084811 1072574
56084 1072574 1061268 1051660 1044680 1040156 1037338 1036178 1036793 1038337 1040057 1042841 1048023 1055175 1062908 1071280
56070 1071280 1081346 1092720 1103760 1114049 1124603 1135749 1146888 1158386 1171550 1186509 1202033
$$ packed form
56150H00214J7600K0591K4044K9107L6016M4195N3752O5290P8267R1196J03465
56139A363737J15037J24080J27094J22274J11222R6952Q1898O8373N8680N3345
56129B322692N0458M7544M2990L5474K4119J0183k960j2658j8778k2562k5556
56118B450946l0174l9062n2605o8363q3630r7008j07050j11623j09953j03643
56108A647835r4649q3739p1693o0036m9477l9295k9335k0806j4310q911m250j545
56096A169789j252j789j941k696n176q437j0906j2421j3458j3760j3142j2237
56084A072574j1306r608o980m524k818j160O15J544J720K784N182P152P733Q372
56070A071280J0066J1374J1040J0289J0554J1146J1139J1498J3164J4959J5524
$$ plain form
56059 1202033 1217661 1234194 1252000 1270548 1289636 1309347 1328892 1347371 1365555 1385002 1405503
56048 1405503 1425323 1443808 1461701 1479191 1495900 1512655 1530891 1550243 1569066 1587409 1607189
56037 1607189 1629346 1653166 1678447 1705881 1735206 1765536 1797675 1833601 1873499 1915883 1960834
56026 1960834 2010296 2064777 2122481 2182176 2244248 2308433 2373271 2438392 2504802 2572416 2640020
56015 2640020 2708134 2779174 2854131 2931654 3010874 3092505 3176819 3263346 3352938 3447366 3546667
56004 3546667 3649738 3757537 3872447 3994463 4121574 4253972 4394167 4542810 4698478
55995 4698478 4861871 5035880 5220964 5415015 5618597 5835785 6068831 6316678 6579866
55986 6579866 6862206 7166260 7491822 7840205 8215485 8620271 9055056 9522848 10029585
$$ packed form
56059A202033J5628J6533J7806J8548J9088J9711J9545J8479J8184J9447K0501
56048A405503J9820J8485J7893J7490J6709J6755J8236J9352J8823J8343J9780
56037A607189K2157K3820K5281K7434K9325L0330L2139L5926L9898M2384M4951
56026A960834M9462N4481N7704N9695O2072O4185O4838O5121O6410O7614O7604
56015B640020O8114P1040P4957P7523P9220Q1631Q4314Q6527Q9592R4428R9301
56004C546667J03071J07799J14910J22016J27111J32398J40195J48643J55668
55995D698478J63393J74009J85084J94051K03582K17188K33046K47847K63188
55986F579866K82340L04054L25562L48383L75280M04786M34785M67792N06737
$$ plain form
55977 10029585 10579204 11173860 11820048 12528775 13308912 14166825 15113683 16166384 17340404
55968 17340404 18649694 20115879 21770952 23651048 25797680 28268386 31139369 34499830
55960 34499830 38458211 43159331 48786793 55549521 63682123 73465104 85238125 99403745
55952 99403745 116450146 136986722 161739543 191453386 226615048 266850617 310031075
55945 310031075 351659784 385444184 405332940 408000046 394117279 367619754 333714813
55938 333714813 297066361 260967466 227350257 197125310 170544510 147499730 127718162
55931 127718162 110850808 96514152 84334496 73980253 65162130 57625196 51155141
55924 51155141 45581825 40765255 36583002 32934046 29741994 26944106 24481788 22305264
$$ packed form
55977A0029585N49619N94656O46188P08727P80137Q57913R46858J052701J174020
55968A7340404J309290J466185J655073J880096K146632K470706K870983L360461
55960C4499830L958381M701120N627462O762728Q132602R782981J1773021J4165620
55952I9403745J7046401K0536576K4752821K9713843L5161662M0235569M3180458
55945C10031075M1628709L3784400J9888756K667106j3882767k6497525l3904941
55938C33714813l6648452l6098895l3617209l0224947k6580800k3044780j9781568
55931A27718162j6867354j4336656j2179656j0354243q818123p536934o470055
55924E1155141n573316m816570m182253l648956l192052k797888k462318k176524
$$ plain form
55916 22305264 20378186 18670291 17150725 15792632 14577398 13488991 12509301 11623053
55908 11623053 10821585 10097307 9439250 8837865 8289197 7790257 7334550 6915655 6530921
55899 6530921 6177992 5851625 5547356 5264710 5003602 4761016 4534130 4323222 4128473
55890 4128473 3947102 3776519 3617179 3469610 3331737 3201936 3081637 2971943 2870307
55881 2870307 2773559 2681876 2597056 2519077 2447004 2381195 2321915 2267432 2215825 2167091 2121421
55870 2121421 2077028 2031543 1984032 1934099 1881024 1825710 1771597 1721603 1675503 1631741 1589978
55859 1589978 1550171 1511035 1471506 1432418 1394945 1358660 1322560 1286635 1250991 1214924 1178318
55848 1178318 1142539 1108529 1075512 1042942 1012189 984706 960054 937326 917108 900296 886189
$$ packed form
55916B2305264j927078j707895j519566j358093j215234j088407r79690q86248
55908A1623053q01468p24278o58057o01385n48668m98940m55707m18895l84734
55899F530921l52929l26367l04269k82646k61108k42586k26886k10908j94749
55890D128473j81371j70583j59340j47569j37873j29801j20299j09694j01636
55881B870307r6748r1683q4820p7979p2073o5809n9280n4483n1607m8734m5670
55870B121421m4393m5485m7511m9933n3075n5314n4113m9994m6100m3762m1763
55859A589978l9807l9136l9529l9088l7473l6285l6100l5925l5644l6067l6606
55848A178318l5779l4010l3017l2570l0753k7483k4652k2728k0218j6812j4107
$$ plain form
55837 886189 873396 861644 851231 841683 832366 823431 814898 805827 795556 784732 773993 762784
55825 762784 750538 737805 725020 711450 696649 681661 667500 653674 639641 626435 615306
55814 615306 605832 596970 588990 582856 578625 576012 575647 578135 582606 587777 593814 601623 610886 620352
55800 620352 629545 638585 646576 651693 652843 650108 643733 633921 621650 608645 596404 585780 577394
55787 577394 571807 569454 570684 575148 580558 582800 578378 566724 549829 530272 510132 490916 473446
55774 473446 457942 444623 433772 424937 416929 409071 401598 394388 386437 377315 368026 359502 351222
55761 351222 342449 333796 326347 319982 313873 308067 303324 299711 296431 292752 288236 282483 275557 268280
55747 268280 261328 254450 247243 240056 233311 226716 220085 214268 210136 207198 204276 201064 197993 195131
$$ packed form
55837H86189j2793j1752j0413r548r317q935q533r071j0271j0824j0739j1209
55825G62784j2246j2733j2785j3570j4801j4988j4161j3826j4033j3206j1129
55814F15306r474q862p980o134m231k613l65K488M471N171O037P809R263R466
55800F20352R193R040P991N117J150k735o375r812j2271j3005j2241j0624q386
55787E77394n587k353J230M464N410K242m422j1654j6895j9557k0140j9216j7470
55774D73446j5504j3319j0851q835q008p858p473p210p951r122r289q524q280
55761C51222q773q653p449o365o109n806m743l613l280l679m516n753o926p277
55747B68280o952o878p207p187o745o595o631n817m132k938k922l212l071k862
$$ plain form
55733 195131 192397 190346 189442 188846 187197 184391 181472 178910 176185 173066 170070 167507 164970 162024 158635
55718 158635 154870 150834 146951 143642 140733 137794 135021 133168 132662 133283 134626 136333 138004 139470 141015
55703 141015 142906 144805 146120 146669 146632 146176 145557 145161 144914 144185 142816 141715 141699 142309 142681 143122 144756
55686 144756 147798 151151 153700 155244 156162 156949 158129 159942 161996 163653 164685 165210 165218 164686 164007 163809
55670 163809 164513 166358 169438 173287 176845 179450 181511 183755 186321 189130 192512 196655 200940 204723
55656 204723 208312 212304 216328 219456 221598 223506 225550 227427 228880 229794 229609 227606 223895 219445 215068
55641 215068 210933 206860 202434 197025 190486 183714 177767 172596 167365 161820 156486 151678 147155 142710
55627 142710 138279 133550 128311 123086 118617 114772 110800 106579 102743 99599 96864 94482 92763 91580
$$ packed form
55733A95131k734k051r04n96j649k806k919k562k725l119k996k563k537k946l389
55718A58635l765m036l883l309k909k939k773j853n06O21J343J707J671J466J545
55703A41015J891J899J315N49l7m56o19l96k47p29j369j101j6O10L72M41J634
55686A44756L042L353K549J544R18P87J180J813K054J657J032N25Qn32o79j98
55670A63809P04J845L080L849L558K605K061K244K566K809L382M143M285L783
55656B04723L589L992M024L128K142J908K044J877J453R14j85k003l711m450m377
55641B15068m135m073m426n409o539o772n947n171n231n545n334m808m523m445
55627A42710m431m729n239n225m469l845l972m221l836l144k735k382j719j183
$$ plain form
55613 91580 90281 88569 86703 84796 82685 80592 79085 78271 77801 77695 78224 78978 79054 78328 77545 76965 75999
55596 75999 74524 73388 73030 72605 71199 69067 66954 64934 62749 60660 59092 57816 56239 54260 52204
55581 52204 50231 48410 47113 46675 46770 46749 46543 46673 47404 48372 49175 49870 50628 51163 50857 49465 47506 45787
55563 45787 44691 44106 44016 44724 46302 48194 49685 50569 51010 51093 50976 51190 52162 53471 54202 54046 53561 53396
55545 53396 53760 54675 56116 57796 59284 60508 61738 63036 64146 64980 65715 66360 66778 67253 68457 70644
55529 70644 73282 75759 78064 80620 83771 87558 91644 95335 98046 99854 101303 102623 103534 103867 103900
55514 103900 103949 104012 103918 103437 102108 99395 95204 90026 84533 79292 74672 70611 66533 62107 57964 55045
55498 55045 53174 51044 47808 44033 40808 38541 36978 35809 34799 33686 32318 30745 29033 27321
$$ packed form
55613I1580j299j712j866j907k111k093j507q14m70j06N29P54P6p26p83n80r66
55596G5999j475j136l58m25j406k132k113k020k185k089j568j276j577j979k056
55581E2204j973j821j297m38R5k1k06J30P31R68Q03O95P58N35l06j392j959j719
55563D5787j096n85r0P08J578J892J491Q84M41Q3j17K14R72J309P31j56m85j65
55545E3396L64R15J441J680J488J224J230J298J110Q34P35O45M18M75J204K187
55529G0644K638K477K305K556L151L787M086L691K711J808J449J320R11L33L3
55514A03900M9O3r4m81j329k713m191n178n493n241m620m061m078m426m143k919
55498E5045j871k130l236l775l225k267j563j169j010j113j368j573j712j712
$$ plain form
55484 27321 26073 25705 25835 25473 24207 22693 21721 21327 21036 20464 19365 17733 16218 15894 17089 18857
55468 18857 20033 20408 20450 20335 19810 18719 17220 15696 14734 14805 15584 16076 15851 15656 16284 17345 17972 18296
55450 18296 19220 20830 21978 21743 20533 19403 18822 18519 18154 17702 17288 16988 16795 16678 16643 16764 17057 17359
55432 17359 17492 17555 17875 18592 19446 20070 20423 20802 21426 22104 22430 22301 22122 22365 22999 23512 23516 23204 23191 23944
55412 23944 25363 26846 27820 28290 28759 29486 29976 29487 27966 26172 24847 24064 23436 22684 21850 21104 20516
55395 20516 19953 19205 18238 17247 16396 15654 15060 14911 15355 15939 15973 15340 14608 14353 14640 15182 15653 15864 15937 16323
55375 16323 17365 18842 20199 21118 21549 21352 20426 19206 18515 18778 19726 20876 21897 22504 22460 21782 20574
55358 20574 18669 15957 13022 10880 9879 9476 9221 9358 10096 10922 11159 10819 10484 10521 10804 10972 10725 9979
$$ packed form
55484B7321j248l68J30l62j266j514r72l94k91n72j099j632j515l24J195J768
55468A8857J176L75M2j15n25j091j499j524r62P1P79M92k25j95O28J061O27L24
55450A8296R24J610J148k35j210j130n81l03l65m52m14l00j93j17l5J21K93L02
55432A7359J33O3L20P17Q54O24L53L79O24O78L26j29j79K43O34N13Ml12j3P53
55412B3944J419J483R74M70M69P27M90m89j521j794j325p83o28p52q34p46n88
55395B0516n63p48r67r91q51p42n94j49M44N84L4o33p32k55K87N42M71K11P3L86
55375A6323J042J477J357R19M31j97r26j220o91K63R48J150J021O07m4o78j208
55358B0574j905k712k935k142j001m03k55J37P38Q26K37l40l35L7K83J68k47p46
$$ plain form
55340 9979 8945 7938 7063 6333 6010 6387 7201 7762 7833 7922 8496 9402 10297 11179 12112 12806 12827 12036 10638
55321 10638 9057 7855 7404 7481 7558 7527 7671 7893 7650 6911 6458 6807 7408 7398 6650 5622 4662 3951 3722
55302 3722 3989 4395 4756 5370 6456 7747 9115 11035 13793 16694 18711 19625 19926 19956 19863 20010 20590 20991
55284 20991 20380 18924 17740 17586 18207 18943 19331 19015 17768 15881 14097 12919 12277 11907 11702 11578 11359
55267 11359 10936 10349 9697 9150 8922 8990 8992 8730 8627 9241 10454 11554 12111 12328 12595 13109 13907 14722 14794 13390
55247 13390 10796 8401 7480 8107 9370 10379 10860 11015 11121 11301 11593 12108 12978 14066 14931 15351 15770
55230 15770 16898 18790 20544 21047 19975 18100 16693 16548 17438 18461 18910 18733 18289 17901 17736 17787 17841
55213 17841 17717 17637 18017 18681 18713 17443 15321 13468 12570 12521 12862 13175 13259 13313 13839 15040 16479 17596 18292
$$ packed form
55340I979j034j007q75p30l23L77Q14N61P1Q9N74R06Q95Q82R33O94K1p91j398
55321A0638j581j202m51P7P7l1J44K22k43p39m53L49O01j0p48j028r60p11k29
55302C722K67M06L61O14J086J291J368J920K758K901K017R14L01L0r3J47N80M01
55284B0991o11j456j184j54O21P36L88l16j247j887j784j178o42l70k05j24k19
55267A1359m23n87o52n47k28O8Kk62j03O14J213J100N57K17K67N14P98Q15P2j404
55247A3390k594k395r21O27J263J009M81J55J06J80K92N15Q70J088Q65M20M19
55230A5770J128J892J754N03j072j875j407j45Q90J023M49j77m44l88j65N1N4
55213A7841j24q0L80O64L2j270k122j853q98m9L41L13Q4N4N26J201J439J117O96
$$ plain form
55194 18292 18692 18684 18169 17433 16775 16019 14973 14061 13827 14012 13949 13747 14187 15327 16145 15929 15193 14700 14222
55175 14222 13049 11333 10135 10152 11021 12002 12893 14011 15555 17303 18913 20259 21347 22058 22240 21997
55159 21997 21629 21195 20445 19318 18253 17730 17704 17776 17743 17664 17492 17010 16123 14970 13760 12774 12426 12987 14213
55140 14213 15490 16450 17208 17980 18596 18584 17730 16542 16037 16832 18469 19859 20420 20443 20343 20084 19615 19346
55122 19346 19733 20685 21829 23074 24410 25484 25884 25776 25781 26304 27329 28699 30128 31116 31282 30712 29646
55105 29646 28114 26324 25057 24986 25767 26461 26764 27158 27944 28858 29697 30580 31426 31862 31818 31620 31291 30427 29060
55086 29060 28064 28268 29571 31298 32993 34496 35592 36167 36559 37290 38391 39219 39051 37831 36332 35492
55070 35492 35486 35570 35003 33924 33040 32677 32605 32712 33265 34351 35519 36189 36110 35350 34204 33213 32912 33329 33993
$$ packed form
55194A8292M00qn15p36o58p56j046r12k34J85o3k02M40J140Q18k16p36m93m78
55175A4222j173j716j198J7Q69R81Q91J118J544J748J610J346J088P11J82k43
55159B1997l68m34p50j127j065n23k6P2l3p9j72m82q87j153j210r86l48N61J226
55140A4213J277R60P58P72O16j2q54j188n05P95J637J390N61K3j00k59m69k69
55122A9346L87R52J144J245J336J074M00j08NN23J025J370J429R88J66n70j066
55105B9646j532j790j267p1P81O94L03L94P86R14Q39Q83Q46M36m4j98l29q64j367
55086B9060r96K04J303J727J695J503J096N75L92P31J101Q28j68j220j499q40
55070C5492oQ4n67j079q84l63p2J07N53J086J168O70p9p60j146r91l01M17O64
$$ plain form
55051 33993 34558 35181 36161 37475 38784 39696 39858 38982 37003 34178 31115 28670 27545 27760 28658 29678
55035 29678 30893 32519 34220 35399 36008 36577 37494 38695 39920 40856 41190 41029 41110 42082 43712 45341 46876
55018 46876 48727 50891 52913 54703 56595 58590 60301 61722 63263 64866 65865 65895 65222 64046 62267
55003 62267 60099 58057 56090 53581 50529 47794 45837 44129 42340 41133 41081 41668 42165 42751 43838 44929
54987 44929 45210 44873 44867 45534 46405 47221 48300 49807 51337 52343 52542 51961 51004 50417 50706 51593 52399 52933
54969 52933 53674 55130 57319 59906 62653 65734 69589 74256 79015 83172 87242 92700 100340 109572 119677
54954 119677 131052 144697 161123 180383 202486 226910 252086 276110 297714 315874 329001
54943 329001 335446 334693 327344 314218 296325 275473 253816 232685 212572 194188 178496 165504
$$ packed form
55051C3993N65O23R80J314J309R12J62q76j979k825l063k445j125K15Q98J020
55035B9678J215J626J701J179O09N69R17J201J225R36L34j61Q1R72J630J629J535
55018D6876J851K164K022J790J892J995J711J421J541J603R99L0o73j176j779
55003F2267k168k042j967k509l052k735j957j708j789j207n2N87M97N86J087J091
54987D4929K81l37oO67Q71Q16J079J507J530J006J99n81r57n87K89Q87Q06N34
54969E2933P41J456K189K587K747L081L855M667M759M157M070N458P640R232J0105
54954A19677J1375J3645J6426J9260K2103K4424K5176K4024K1604J8160J3127
54943C29001O445p53p349j3126j7893k0852k1657k1131k0113j8384j5692j2992
$$ plain form
54931 165504 153976 142874 132446 123541 116462 110955 106777 103621 100779 97537 94013 91321 90722 92616
54917 92616 96291 100608 105016 109986 116511 125293 136407 149524 164304 180706 199041 219498 241431
54904 241431 263257 283189 299867 312229 319283 320414 315686 305590 290835 272629 252727 232637
54892 232637 212995 194054 176457 161028 148109 137562 129114 122171 115725 109133 102815 97563 93430
54879 93430 89958 87176 85503 84720 83978 82853 81604 80305 78632 76739 75492 75317 75389 74452 72144 69140
54863 69140 66292 63924 61746 59297 56557 54121 52535 51645 50884 49986 48899 47296 44922 42327 40412
54848 40412 39171 37768 36027 34936 35204 36106 36382 35642 34312 32741 31148 30124 30393 32000 34171 36017
54832 36017 37171 37839 38481 39374 40361 41143 41807 42729 43921 44955 45694 46618 48038 49464 50234 50471 50952
$$ packed form
54931A65504j1528j1102j0428q905p079n507m178l156k842l242l524k692n99J894
54917I2616L675M317M408M970O525Q782J1114J3117J4780J6402J8335K0457K1933
54904B41431K1826J9932J6678J2362P054J131m728j0096j4755j8206j9902k0090
54892B32637j9642j8941j7597j5429j2919j0547q448o943o446o592o318n252m133
54879I3430l472k782j673p83p42j125j249j299j673j893j247j75P2r37k308l004
54863F9140k848k368k178k449k740k436j586q90p61q98j087j603k374k595j915
54848D0412j241j403j741j091K68R02K76p40j330j571j593j024K69J607K171J846
54832C6017J154O68O42Q93R87P82O64R22J192J034P39R24J420J426P70K37M81
$$ plain form
54815 50952 52199 54115 56346 58547 60440 62070 64024 67058 71471 77062 83573 90826 98506 106275
54801 106275 114314 123504 134908 149136 166184 185656 206947 229283 251760 273382 292982 309128
54789 309128 320307 325432 324215 317018 304588 288250 270194 252778 237083 222513 208218 194509
54777 194509 182366 171988 162672 154034 146472 140217 134715 129365 124340 120239 117256 115059 113305 112029
54763 112029 111730 113112 116454 121182 126450 132224 139377 148677 160226 173994 190189 208741 228932
54750 228932 249959 271194 291472 308671 320762 326940 327246 321619 310261 294713 277487 260302
54738 260302 243205 225628 207729 190457 174728 160938 148997 138489 128889 119902 111654 104463
54726 104463 98391 93066 88007 83113 78756 75311 72728 70656 68836 67119 65248 63047 60818 59109
$$ packed form
54815E0952J247J916K231K201J893J630J954L034M413N591O511P253P680P769
54801A06275Q039R190J1404J4228J7048J9472K1291K2336K2477K1622J9600J6146
54789C09128J1179N125j217p197j2430j6338j8056j7416j5695j4570j4295j3709
54777A94509j2143j0378r316q638p562o255n502n350n025m101k983k197j754j276
54763A12029k99J382L342M728N268N774P153R300J1549J3768J6195J8552K0191
54750B28932K1027K1235K0278J7199J2091O178L06n627j1358j5548j7226j7185
54738B60302j7097j7577j7899j7272j5729j3790j1941j0508r600q987q248p191
54726A04463o072n325n059m894m357l445k583k072j820j717j871k201k229j709
$$ plain form
54712 59109 58051 57326 56812 56718 56945 56944 56550 56367 56871 57666 58153 58470 59113 60019 60727 61223 61832 62387 62223 61072
54692 61072 59357 57554 55861 54568 54111 54519 55280 55918 56353 56595 56614 56655 57156 57982 58250 57392 56119 55819
54674 55819 57081 59219 61239 62920 64732 66988 69468 71958 74783 78309 82019 84700 85902 86647 88094
54659 88094 89873 90534 89562 88047 87196 86990 86797 86608 86963 87969 89077 89778 90036 90081 90169 90562 91425 92690
54641 92690 94221 96092 98417 101015 103494 105739 108052 110809 114217 118366 123147 128003 132047 134616
54627 134616 135557 134929 132694 128910 123986 118461 112604 106516 100534 95251 91083 87987 85603 83511 81460
54612 81460 79616 78613 79014 80591 82424 83824 84884 85938 86796 86879 85917 84172 82102 80099 78425 77003
54596 77003 75398 73309 70970 68683 66200 63172 60124 58198 57716 57679 57089 56100 55460 55333 55348 55357 55394 55091
$$ packed form
54712E9109j058p25n14r4K27jl94j83N04P95M87L17O43R06P08M96O09N55j64j151
54692F1072j715j803j693j293m57M08P61O38M35K42J9M1N01Q26K68q58j273l00
54674E5819J262K138K020J681J812K256K480K490K825L526L710K681J202P45J447
54659H8094J779O61r72j515q51k06j93j89L55J006J108P01K58M5Q8L93Q63J265
54641I2690J531J871K325K598K479K245K313K757L408M149M781M856M044K569
54627A34616R41o28k235l784m924n525n857o088n982n283m168l096k384k092k051
54612H1460j844j003M01J577J833J400J060J054Q58Q3r62j745k070k003j674j422
54596G7003j605k089k339k287k483l028l048j926m82l7n90r89o40j27J5RL7l03
$$ plain form
54578 55091 53903 51949 50014 48632 47612 46561 45352 44017 42678 41730 41650 42329 42994 43074 42835 42864 43237
54561 43237 43553 43663 43919 44692 45897 47057 47711 47751 47489 47378 47557 47660 47187 46139 45177 45056 45855 46853
54543 46853 47213 46766 46069 45772 46107 46941 48004 48928 49318 49137 48929 49367 50560 52008 53158 53823 54165 54632
54525 54632 55889 58379 61751 65038 67628 69847 72304 74891 76766 77283 76571 75127 73207 70894 68561
54510 68561 66828 65936 65436 64736 63778 62911 62228 61418 60370 59519 59368 59862 60479 60708 60235 58954 57210 55837
54492 55837 55462 55724 55613 54605 53124 51818 50814 49961 49442 49748 51116 53224 55407 57076 58016 58384
54476 58384 58435 58277 58018 58059 58916 60613 62512 63902 64563 64637 64265 63601 62953 62593 62478 62449 62577 63022 63599
54457 63599 63809 63369 62392 61041 59317 57371 55715 54876 54885 55356 55983 56762 57742 58696 59154 58736 57471 55836
$$ packed form
54578E5091j188j954j935j382j020j051j209j335j339r48q0O79O65Q0k39K9L73
54561D3237L16J10K56P73J205J160O54M0k62j11J79J03m73j048r62j21P99R98
54543D6853L60m47o97k97L35Q34J063R24L90j81k08M38J193J448J150O65L42M67
54525E4632J257K490L372L287K590K219K457K587J875N17p12j444j920k313k333
54510F8561j733q92n00p00r58q67o83q10j048q51j51M94O17K29m73j281j744j373
54492E5837l75K62j11j008j481j306j004q53n19L06J368K108K183J669R40L68
54476E8384N1j58k59M1Q57J697J899J390O61P4l72o64o48l60j15k9J28M45N77
54457F3599K10m40r77j351j724j946j656q39RM71O27P79R80R54M58m18j265j635
$$ plain form
54439 55836 54462 53723 53577 53807 54362 55384 56824 58162 58660 58028 56810 55938 55816 55969 55770 55356 55537
54422 55537 56687 58080 58637 58120 57268 56795 56713 56702 56720 56900 57141 57223 57271 57747 58931 60672 62714 65020 67659
54403 67659 70540 73387 75927 78073 80026 82190 84862 87944 91030 93740 95892 97483 98735 100040
54389 100040 101522 102668 102755 101711 100221 98883 97617 96093 94318 92518 90816 89389 88582 88290 87517
54374 87517 85276 81975 79276 78281 78310 77809 76102 73839 71925 70537 69288 67999 66989 66656 66983 67568
54358 67568 68093 68626 69408 70402 71193 71376 71006 70606 70752 71672 73261 75344 77855 80772 84054 87607 91112
54341 91112 93913 95503 96375 97987 101292 105468 108701 110179 110613 110734 110120 108051 104836 101536 98714
54326 98714 96129 93533 91043 88719 86348 83803 81216 78659 75936 72763 68981 64696 60439 57018
$$ packed form
54439E5836j374p39j46K30N55J022J440J338M98o32j218q72j22J53j99m14J81
54422E5537J150J393N57n17q52m73q2j1J8J80K41Q2M8M76J184J741K042K306K639
54403F7659K881K847K540K146J953K164K672L082L086K710K152J591J252J305
54389A00040J482J146Q7j044j490j338j266j524j775j800j702j427q07k92p73
54374H7517k241l301k699r95K9n01j707k263j914j388j249j289j010l33L27N85
54358F7568N25N33P82R94P91J83l70m00J46R20J589K083K511K917L282L553L505
54341I1112K801J590Q72J612L305M176L233J478M34J21o14k069l215l300k822
54326I8714k585k596k490k324k371k545k587k557k723l173l782m285m257l421
$$ plain form
54312 57018 54872 53626 52586 51530 50656 50040 49684 49923 51064 52575 53345 52930 51993 51314 50932 50483 49814
54295 49814 48886 47555 45844 44110 42635 41434 40705 40974 42385 44269 45881 47188 48409 49185 48919 47731
54279 47731 46403 45421 44731 44423 44952 46421 48220 49667 50603 51080 50944 50217 49568 49774 50692 51264 50716 49445
54261 49445 48517 48480 48955 49245 49021 48366 47467 46528 45912 46077 47196 48841 50159 50560 50311 50300 51004 51835 51863
54242 51863 51190 51065 52381 54492 55982 56259 55915 55726 55944 56490 57175 57605 57410 56750 56145 55712 55090 54273
54224 54273 53891 54340 55168 55752 56163 56841 57758 58394 58381 57691 56375 54601 52859 51728 51369 51448 51488 51130 50288
54205 50288 49301 48712 48564 48192 47084 45699 44932 44979 45300 45640 46384 47758 49259 50284 50916 51744 53022
54188 53022 54366 55241 55566 55738 56091 56414 56188 55335 54465 54182 54320 54212 53533 52531 51529 50653 50088 50113
$$ packed form
54312E7018k146j246j040j056q74o16l56K39J141J511P70m15r37o79l82m49o69
54295D9814r28j331j711j734j475j201p29K69J411J884J612J307J221P76k66j188
54279D7731j328r82o90l08N29J469J799J447R36M77j36p27o49K06R18N72n48j271
54261D9445r28l7M75K90k24o55q99r39o16J65J119J645J318M01k49j1P04Q31K8
54242E1863o73j25J316K111J490K77l44j89K18N46O85M30j95o60o05m33o22q17
54224E4273l82M49Q28N84M11O78R17O36j3o90j316j774j742j131l59P9M0l58q42
54205E0288r87n89j48l72j108j385p67M7L21L40P44J374J501J025O32Q28J278
54188E3022J344Q75L25J72L53L23k26q53q70k83J38j08o79j002j002q76n65K5
$$ plain form
54170 50113 50690 51280 51307 50674 49750 49072 49042 49652 50393 50676 50437 50158 50203 50380 50235 49535 48349 46952 45815
54151 45815 45450 45923 46669 46972 46614 45903 45246 44897 45031 45739 46815 47758 48156 48060 47881 47906 47999 47827 47294 46597
54131 46597 45896 45145 44356 43849 43983 44717 45599 46106 45885 44817 43184 41779 41480 42524 44319 46038 47232
54114 47232 47824 47781 47075 45926 44837 44291 44418 44996 45738 46436 46809 46458 45289 43973 43557 44419 45928 47380
54096 47380 48880 50885 53133 54658 54889 54236 53493 53083 53019 53202 53474 53598 53377 52731 51703 50657 50357
54079 50357 51406 53493 55632 57199 58345 59306 59891 59950 59809 59797 59763 59562 59670 60692 62446 64109 65168
54062 65168 65771 66227 66734 67548 68763 69795 69722 68474 67281 67546 69563 72616 75965 79319 82496 85225
54046 85225 87447 89531 91999 95111 98747 102598 106415 110212 114246 118822 124098 130157 137101 144907
$$ packed form
54170E0113N77N90K7o33r24o78l0O10P41K83k39k79M5J77j45p00j186j397j137
54151D5815l65M73P46L03l58p11o57l49J34P08J076R43L98r6j79K5R3j72n33o97
54131D6597p01p51p89n07J34P34Q82N07k21j068j633j405k99J044J795J719J194
54114D7232N92m3p06j149j089n46J27N78P42O98L73l51j169j316m16Q62J509J452
54096D7380J500K005K248J525K31o53p43m10o4J83K72J24k21o46j028j046l00
54079E0357J049K087K139J567J146R61N85N9j41j2l4k01J08J022J754J663J059
54062F5168O03M56N07Q14J215J032p3j248j193K65K017L053L349L354L177K729
54046H5225K222K084K468L112L636L851L817L797M034M576N276O059O944P806
$$ plain form
54032 144907 153191 161348 169026 176299 183296 189821 195569 200571 205107 209196 212493 214855 216714 218623
54018 218623 220523 221680 221312 219154 215540 211161 206700 202417 198097 193525 188950 184771 180827 176462
54004 176462 171432 166347 161874 157830 153503 148713 144105 140373 137620 135595 134136 133055 131875 130137
53990 130137 127965 126053 124942 124507 124281 124106 124203 124647 125014 124657 123264 121088 118796 117142 116554 116828 117322
53973 117322 117632 117971 118696 119567 119867 119297 118407 117952 118071 118327 118398 118453 118795 119285 119294 118253 116320 114419 113485
53954 113485 113696 114545 115567 116694 117962 119267 120644 122467 125085 128347 131679 134620 137230 140142 144225
53939 144225 149921 156794 164038 171601 180383 190973 202484 213203 222190 229711 236211 241542 245329
53926 245329 247547 248408 248131 247173 246368 246388 247150 248073 248852 249702 251024 253157 256441 261152 267210 274120 281325
$$ packed form
54032A44907Q284Q157P678P273O997O525N748N002M536M089L297K362J859J909
54018B18623J900J157l68k158l614m379m461m283m320m572m575m179l944m365
54004A76462n030n085m473m044m327m790m608l732k753k025j459j081j180j738
53990A30137k172j912j111m35k26j75R7M44L67l57j393k176k292j654n88K74M94
53973A17322L10L39P25Q71L00n70q90m55J19K56P1N5L42M90Rj041j933j901r34
53954A13485K11Q49J022J127J268J305J377J823K618L262L332K941K610K912M083
53939A44225N696O873P244P563Q782J0590J1511J0719Q987P521O500N331L787
53926B45329K218Q61k77r58q05K0P62R23P79Q50J322K133L284M711O058O910P205
$$ plain form
53909 281325 288451 295133 300898 305490 309149 312261 314699 315836 315349 313688 311555 309190 306507 303690
53895 303690 301090 298541 295292 290821 285273 278868 271409 262779 253545 244519 235988 227900 220540 214316
53881 214316 208911 203415 197511 191872 187139 183090 179238 175616 172430 169321 165664 161468 157372 153776
53867 153776 150441 146960 143172 139120 134986 131157 128000 125462 123255 121415 120234 119515 118449 116564
53853 116564 114366 112574 111064 109137 106679 104365 102670 101297 99830 98425 97446 96776 96000 95058 94251
53838 94251 93653 93095 92733 93091 94231 95366 95649 95161 94732 94987 95948 97322 98681 99401 99090 98252 98004 98763
53820 98763 99622 99494 98607 98314 99465 101503 103283 104363 105237 106596 108735 111563 114901 118650 122820 127435
53804 127435 132431 137639 142910 148206 153546 158918 164307 169725 175083 180056 184230 187480 190170 192881
$$ packed form
53909B81325P126O682N765M592L659L112K438J137m87j661k133k365k683k817
53895C03690k600k549l249m471n548o405p459q630r234r026q531q088p360o224
53881B14316n405n496n904n639m733m049l852l622l186l109l657m196m096l596
53867A53776l335l481l788m052m134l829l157k538k207j840j181p19j066j885
53853A16564k198j792j510j927k458k314j695j373j467j405r79o70p76r42q07
53838I4251n98n58l62L58J140J135K83m88m29K55R61J374J359P20l11q38k48P59
53820I8763Q59j28q87k93J151K038J780J080Q74J359K139K828L338L749M170M615
53804A27435M996N208N271N296N340N372N389N418N358M973M174L250K690K711
$$ plain form
53790 192881 195887 198953 201662 203900 205930 207987 209937 211431 212308 212603 212229 210946 208772 206146 203416
53775 203416 200368 196579 192144 187653 183437 179256 174875 170529 166583 163073 159894 157112 154669 152077
53761 152077 148959 145707 143037 140983 139061 137371 136696 137155 137636 137120 135943 135046 134557 133964 133289 132993
53745 132993 132815 131748 129409 126550 123917 121439 118911 116675 114950 113159 110666 107763 105254 103368
53731 103368 101842 100808 100755 101582 102420 102540 101959 101074 100231 99758 99831 100122 100087 99872 100441 102477 105495 108389
53713 108389 110524 111935 112744 112923 112584 112082 111741 111718 112290 114068 117728 123397 130289 137064 142750 147321
53697 147321 151346 155171 158668 161665 164233 166464 168230 169307 169596 169252 168887 169468 171550 174480 176901
53682 176901 178235 179144 180337 181612 182596 183732 185715 188318 190665 192436 193931 195010 195031 193997 192855
$$ packed form
53790A92881L006L066K709K238K030K057J950J494Q77K95l74j283k174k626k730
53775B03416l048l789m435m491m216m181m381m346l946l510l179k782k443k592
53761A52077l118l252k670k054j922j690o75M59M81n16j177q97m89n93o75k96
53745A32993j78j067k339k859k633k478k528k236j725j791k493k903k509j886
53731A03368j526j034n3Q27Q38J20n81q85q43m73P3K91l5k15N69K036L018K894
53713A08389K135J411Q09J79l39n02l41k3N72J778L660N669O892O775N686M571
53697A47321M025L825L497K997K568K231J766J077K89l44l65N81K082K930K421
53682A76901J334R09J193J275R84J136J983K603K347J771J495J079K1j034j142
$$ plain form
53667 192855 192235 191650 190487 189110 188277 187928 187247 185779 183839 181961 180479 179661 179726 180508 181415 181848 181616
53650 181616 180957 180282 179839 179490 178904 178050 177303 176928 176750 176620 176887 177984 179710 181388 182590 183275 183299 182379
53632 182379 180652 178795 177437 176802 177007 178226 180298 182601 184576 186137 187386 188330 189126 190223 191846
53617 191846 193576 194835 195623 196459 197824 199981 203055 206769 210313 213069 215462 218540 222696 227353 231990
53602 231990 236817 242116 247516 252449 257032 261890 267250 272656 277552 281767 285414 288634 291554 294288
53588 294288 296924 299561 302277 304923 307154 308933 310828 313392 316308 318629 319985 321099 322878 325380
53574 325380 327929 329968 331393 332277 332755 333200 334158 335896 338153 340344 341951 342832 343304 343915 344966 346310
53558 346310 347735 349363 351401 353593 355313 356311 357073 358338 360438 363235 366397 369504 372048 373637 374226
$$ packed form
53667A92855o20n85j163j377q33l49o81j468j940j878j482q18O5P82R07M33k32
53650A81616o59o75m43l49n86q54p47l75j78j30K67J097J726J678J202O85K4r20
53632A82379j727j857j358o35K05J219K072K303J975J561J249R44P96J097J623
53617A91846J730J259P88Q36J365K157L074L714L544K756K393L078M156M657M637
53602B31990M827N299N400M933M583M858N360N406M896M215L647L220K920K734
53588B94288K636K637K716K646K231J779J895K564K916K321J356J114J779K502
53574C25380K549K039J425Q84M78M45R58J738K257K191J607Q81M72O11J051J344
53558C46310J425J628K038K192J720R98P62J265K100K797L162L107K544J589N89
$$ plain form
53543 374226 374077 373542 372989 372780 373114 373848 374568 374865 374540 373688 372699 372161 372523 373714 375084 375871 375929 376018 377154
53524 377154 379502 382107 384000 385428 387589 391281 396317 402317 409400 417710 426818 436200 445994 456692
53510 456692 468238 480078 492118 504971 519144 534468 550562 567414 585229 604026 623671
53499 623671 644076 665164 686852 709297 732875 757685 783255 808953 834459 859608 884045
53488 884045 907451 930067 952673 976049 1000605 1026426 1053336 1080941 1108820 1136724 1164531
53477 1164531 1192186 1219851 1247892 1276349 1304567 1331736 1357721 1382959 1407600 1431323 1454085
53466 1454085 1476411 1498546 1519815 1539310 1556867 1572813 1587046 1599130 1609278 1618403 1626782 1633218
53454 1633218 1636110 1635047 1630912 1624657 1616553 1606578 1594840 1581389 1566140 1549335 1531748 1513934
$$ packed form
53543C74226j49n35n53k09L34P34P20K97l25q52r89n38L62J191J370P87N8Q9J136
53524C77154K348K605J893J428K161L692N036O000P083Q310R108R382R794J0698
53510D56692J1546J1840J2040J2853J4173J5324J6094J6852J7815J8797J9645
53499F23671K0405K1088K1688K2445K3578K4810K5570K5698K5506K5149K4437
53488H84045K3406K2616K2606K3376K4556K5821K6910K7605K7879K7904K7807
53477A164531K7655K7665K8041K8457K8218K7169K5985K5238K4641K3723K2762
53466A454085K2326K2135K1269J9495J7557J5946J4233J2084J0148R125Q379O436
53454A633218K892j063m135o255q104r975j1738j3451j5249j6805j7587j7814
$$ plain form
53442 1513934 1495490 1475490 1453630 1430500 1406726 1382354 1357294 1331917 1306792 1281957 1256879
53431 1256879 1231207 1205278 1179917 1155920 1133824 1113846 1095788 1079027 1062890 1047173 1032281
53420 1032281 1018784 1006822 996040 986128 977355 970432 965836 963381 962498 962778 964197 966967 971378 977783
53406 977783 986463 997383 1010159 1024401 1040107 1057620 1077174 1098494 1120953 1144173 1168444 1194454
53394 1194454 1222568 1252454 1283478 1315410 1348655 1383849 1421344 1461096 1502912 1546728 1592600
53383 1592600 1640441 1689801 1740020 1790695 1841935 1894118 1947387 2001515 2056155 2110986 2165590
53372 2165590 2219359 2271729 2322402 2371162 2417542 2460831 2500443 2536198 2568222 2596712 2621847
53361 2621847 2643787 2662579 2678085 2690104 2698560 2703441 2704578 2701659 2694628 2683991 2670488 2654374
$$ packed form
53442A513934j8444k0000k1860k3130k3774k4372k5060k5377k5125k4835k5078
53431A256879k5672k5929k5361k3997k2096j9978j8058j6761j6137j5717j4892
53420A032281j3497j1962j0782r912q773o923m596k455q83K80J419K770M411O405
53406I77783Q680J0920J2776J4242J5706J7513J9554K1320K2459K3220K4271K6010
53394A194454K8114K9886L1024L1932L3245L5194L7495L9752M1816M3816M5872
53383A592600M7841M9360N0219N0675N1240N2183N3269N4128N4640N4831N4604
53372B165590N3769N2370N0673M8760M6380M3289L9612L5755L2024K8490K5135
53361B621847K1940J8792J5506J2019Q456M881J137k919p031j0637j3503j6114
$$ plain form
53349 2654374 2635010 2611201 2581905 2546824 2506589 2462481 2415868 2367702 2318564 2269120 2220283
53338 2220283 2172768 2126609 2081328 2036492 1991908 1947361 1902529 1857245 1811679 1766127 1720807
53327 1720807 1675931 1631770 1588511 1546222 1505155 1465935 1429214 1395225 1363860 1335033 1308643
53316 1308643 1284234 1261066 1238636 1216920 1196057 1176096 1157150 1139506 1123391 1108871 1096153
53305 1096153 1085715 1077810 1072011 1067579 1064150 1061766 1060404 1059948 1060611 1062913 1067054 1072685 1079436 1087380
53291 1087380 1096770 1107643 1119899 1133468 1148101 1163326 1179052 1196022 1215205 1236735 1259813
53280 1259813 1283627 1307919 1332523 1356839 1380138 1402252 1423596 1444496 1464725 1483777 1501442
53269 1501442 1517846 1532904 1545918 1556042 1563215 1568416 1572861 1577033 1580596 1583014 1583955 1583272 1580919
$$ packed form
53349B654374j9364k3809k9296l5081m0235m4108m6613m8166m9138m9444m8837
53338B220283m7515m6159m5281m4836m4584m4547m4832m5284m5566m5552m5320
53327A720807m4876m4161m3259m2289m1067l9220l6721l3989l1365k8827k6390
53316A308643k4409k3168k2430k1716k0863j9961j8946j7644j6115j4520j2718
53305A096153j0438p905n799m432l429k384j362m56O63K302M141N631O751P944
53291A087380R390J0873J2256J3569J4633J5225J5726J6970J9183K1530K3078
53280A259813K3814K4292K4604K4316K3299K2114K1344K0900K0229J9052J7665
53269A501442J6404J5058J3014J0124P173N201M445M172L563K418R41o83k353
$$ plain form
53256 1580919 1576917 1571162 1563262 1552885 1540271 1526151 1511010 1494640 1476498 1456349 1434488 1411471
53244 1411471 1387735 1363371 1338263 1312498 1286494 1260536 1234390 1207745 1180970 1154919 1129954
53233 1129954 1105635 1081611 1058257 1036118 1015125 994793 974882 955389 936106 916689 897100
53222 897100 877618 858513 840137 823216 808567 796332 785828 776264 767408 759548 753034 747895
53210 747895 743608 739221 733974 727952 721945 716621 711936 707331 702229 696431 690331 684760 680271 676457
53196 676457 672294 667205 661458 655456 649151 642414 635445 628310 620434 611180 600774 590064 579382
53183 579382 568261 556427 544452 533084 522376 511915 501572 491530 481771 472125 462828 454452
53171 454452 447052 439788 431728 422773 413543 404540 395744 386879 377775 368523 359513 351265 343895 336857
$$ packed form
53256A580919m002n755p900j0377j2614j4120j5141j6370j8142k0149k1861k3017
53244A411471k3736k4364k5108k5765k6004k5958k6146k6645k6775k6051k4965
53233A129954k4319k4024k3354k2139k0993k0332j9911j9493j9283j9417j9589
53222H97100j9482j9105j8376j6921j4649j2235j0504r564q856p860o514n139
53210G47895m287m387n247o022o007n324m685m605n102n798o100n571m489l814
53196F76457m163n089n747o002o305o737o969p135p876r254j0406j0710j0682
53183E79382j1121j1834j1975j1368j0708j0461j0343j0042r759r646r297q376
53171D54452p400p264q060q955r230r003q796q865r104r252r010q248p370p038
$$ plain form
53157 336857 329523 322028 315173 309404 304260 298928 293048 286770 280362 274096 268332 263335 259040 255127
53143 255127 251343 247640 244127 240991 238340 236035 233782 231467 229181 226874 224302 221477 218769 216298
53129 216298 213541 210000 206030 202521 199852 197599 195232 192710 190368 188561 187407 186571 185339 183264
53115 183264 180665 178177 175930 173693 171746 170866 171212 171823 171641 170597 169274 167935 166453 164976 163970
53100 163970 163519 163107 162341 161565 161485 162348 163832 165665 168009 170998 174175 176845 178957 181155 183731 185964
53084 185964 186880 186380 185139 183635 181870 179939 178206 176784 175385 173842 172270 170518 168011 164495 160520
53069 160520 156856 153782 151228 149237 147870 146893 145949 144853 143445 141398 138566 135395 132622 130626 129234
53054 129234 128025 126708 125398 124704 125220 126727 128211 128851 128675 128029 127019 125835 125092 125169 125572 125616 125412
$$ packed form
53157C36857p334p495o855n769n144n332n880o278o408o266n764m997m295l913
53143B55127l784l703l513l136k651k305k253k315k286k307k572k825k708k471
53129B16298k757l541l970l509k669k253k367k522k342j807j154q36j232k075
53115A83264k599k488k247k237j947q80L46O11j82j044j323j339j482j477j006
53100A63970m51m12p66p76q0Q63J484J833K344K989L177K670K112K198K576K233
53084A85964R16n00j241j504j765j931j733j422j399j543j572j752k507l516l975
53069A60520l664l074k554j991j367r77r44j096j408k047k832l171k773j996j392
53054A29234j209j317j310o94N16J507J484O40j76o46j010j184p43P7M03M4k04
$$ plain form
53037 125412 125485 125702 125448 124729 124214 124136 123971 123339 122415 121293 119768 118035 116826 116392 116091 115443 114935 115141
53019 115141 115690 115850 115699 115830 116188 116071 115291 114574 114602 115225 115852 116164 116199 116039 115656 114972 113981 112861 111878
53000 111878 111048 110100 109047 108553 109160 110306 110740 110065 109225 109205 109830 110287 110304 110162 109895 109240 108360 107936 108380
52981 108380 109488 110990 112912 115138 117178 118799 120423 122384 124154 125001 125239 126016 127780 129689 130867
52966 130867 131591 132711 134358 135912 137044 138041 139086 139859 140138 140372 141289 143117 145480 147946 150422 153052
52950 153052 155939 159049 162204 165048 167177 168474 169489 171239 174380 178495 182438 185437 187653 189594
52936 189594 191340 192600 193288 193641 193829 193731 193107 191776 189781 187634 186194 185876 186015 185462 183844 181760
52920 181760 179804 177967 176174 174752 173958 173426 172540 171093 169291 167377 165582 164153 163073 162082 161233
$$ packed form
53037A25412P3K17k54p19n15p8j65o32r24j122j525j733j209m34l01o48n08K06
53019A15141N49J60j51J31L58j17p80p17K8O23O27L12L5j60l83o84r91j120r83
53000A11878q30r48j053m94O07J146M34o75q40k0O25M57J7j42k67o55q80m24M44
52981A08380J108J502J922K226K040J621J624J961J770Q47K38P77J764J909J178
52966A30867P24J120J647J554J132R97J045P73K79K34R17J828K363K466K476K630
52950A53052K887L110L155K844K129J297J015J750L141M115L943K999K216J941
52936A89594J746J260O88L53J88r8o24j331j995k147j440l18J39n53j618k084
52920A81760j956j837j793j422p94n32q86j447j802j914j795j429j080r91q49
$$ plain form
52905 161233 161039 161573 161940 161348 160410 160516 161995 163780 165050 166205 167888 169848 171441 172620 173682 174426
52889 174426 174375 173686 173100 172938 172781 172198 171321 170502 169913 169719 170249 171585 173203 174339 174676 174500 174239 174035
52871 174035 173762 173332 172900 172743 172868 172870 172347 171448 170734 170477 170367 169999 169361 168654 167967 167470 167651 168875 170726
52852 170726 172259 173030 173511 174314 175320 175841 175492 174653 174152 174661 176301 178592 180699 181869 181801 180730 179262
52835 179262 178053 177433 177193 176842 176130 175274 174649 174467 174849 175994 177983 180457 182773 184551 185927 187187
52819 187187 188319 189079 189426 189659 190045 190448 190544 190303 190004 189602 188482 186135 182989 180047 177746 175639 173287
52802 173287 170902 168774 166595 163936 161064 158635 156665 154495 151853 149343 147635 146651 145846 144894 143739
52787 143739 142335 140742 139304 138328 137688 137025 136186 135110 133505 131105 128288 125931 124484 123550 122596 121698
$$ packed form
52905A61233j94N34L67n92r38J06J479J785J270J155J683J960J593J179J062P44
52889A74426n1o89n86j62j57n83q77q19n89j94N30J336J618J136L37j76k61k04
52871A74035k73m30m32j57J25Kn23q99p14k57j10l68o38p07o87m97J81J224J851
52852A70726J533P71M81Q03J006N21l49q39n01N09J640K291K107J170o8j071j468
52835A79262j209o20k40l51p12q56o25j82L82J145J989K474K316J778J376J260
52819A87187J132P60L47K33L86M03R6k41k99m02j120k347l146k942k301k107k352
52802A73287k385k128k179k659k872k429j970k170k642k510j708r84q05r52j155
52787A43739j404j593j438r76o40o63q39j076j605k400k817k357j447r34r54q98
$$ plain form
52771 121698 121225 121073 120699 119845 118760 117639 116318 114753 113390 112607 112006 110788 108857 107039 106050 105646
52755 105646 105061 103950 102472 100754 98776 96738 95030 93680 92208 90263 88109 86348 85290 84773 84393
52740 84393 83761 82728 81542 80625 80074 79544 78776 78050 77860 78336 79191 80059 80570 80307 79110 77435 76005
52723 76005 75040 74160 73136 72255 71760 71295 70326 68892 67564 66784 66572 66769 67152 67352 67079 66538 66245 66290
52705 66290 66171 65574 64886 64617 64666 64642 64672 65272 66509 67886 69107 70330 71432 71694 70705 69153 68149 67961
52687 67961 67985 67797 67696 68175 69364 71107 73148 75077 76475 77425 78603 80570 83111 85513 87397 89011
52671 89011 90779 92781 94742 96385 97711 98934 100160 101165 101503 100866 99319 97249 95145 93379 92058
52656 92058 91018 90000 88828 87484 86092 84896 84096 83640 83226 82570 81545 80045 78056 75983 74577
$$ packed form
52771A21698m73j52l74q54j085j121j321j565j363p83o01j218j931j818r89m04
52755A05646n85j111j478j718j978k038j708j350j472j945k154j761j058n17l80
52740H4393o32j033j186r17n51n30p68p26j90M76Q55Q68N11k63j197j675j430
52723G6005r65q80j024q81m95m65r69j434j328p80k12J97L83K00k73n41k93M5
52705F6290j19n97o88k69M9k4L0O00J237J377J221J223J102K62r89j552j004j88
52687F7961K4j88j01M79J189J743K041J929J398R50J178J967K541K402J884J614
52671H9011J768K002J961J643J326J223J226J005L38o37j547k070k104j766j321
52656I2058j040j018j172j344j392j196q00m56m14o56j025j500j989k073j406
$$ plain form
52641 74577 74111 73925 73258 72330 72045 72661 73430 73620 73270 72696 71868 70745 69712 69180 69031 68918 68842 68936 68936 68465
52621 68465 67745 67471 67902 68566 68991 69238 69481 69489 68915 67909 67071 66763 66785 66793 66850 67319 68256 69258 69981 70583
52601 70583 71319 71855 71506 70236 69012 68837 69776 71220 72745 74238 75425 75886 75747 75828 76858 78726 80701
52584 80701 82212 83219 83979 84697 85451 86302 87314 88421 89410 90174 90938 92025 93358 94403 94744 94558 94390
52567 94390 94598 95235 96321 97986 100307 103135 106051 108445 109760 109862 109174 108394 108112 108644 109951 111609
52551 111609 113098 114237 115219 116118 116758 117206 117958 119224 120422 120926 121089 121899 123695 125829 127623 129024
52535 129024 130171 130939 131252 131448 131950 132817 133880 135071 136265 137053 137031 136264 135232 134280 133346 132247 131041
52518 131041 130042 129545 129662 130368 131531 132739 133277 132653 131274 130243 130258 130910 131309 131116 130636 130193 129832 129438
$$ packed form
52641G4577m66j86o67r28k85O16P69J90l50n74q28j123j033n32j49j13p6R4%m71
52621F8465p20k74M31O64M25K47K43Qn74j006q38l08K2QN7M69R37J002P23O02
52601G0583P36N36l49j270j224j75R39J444J525J493J187M61j39Q1J030J868J975
52584H0701J511J007P60P18P54Q51J012J107R89P64P64J087J333J045L41j86j68
52567I4390K08O37J086J665K321K828K916K394J315J02o88p80k82N32J307J658
52551A11609J489J139R82Q99O40M48P52J266J198N04J63Q10J796K134J794J401
52535A29024J147P68L13J96N02Q67J063J191J194P88k2p67j032r52r34j099j206
52518A31041r99m97J17P06J163J208N38o24j379j031J5O52L99j93m80m43l61l94
$$ plain form
52500 129438 128698 127116 124632 122151 120813 120717 120934 120866 120901 121486 122271 122641 122596 122520 122488 122327 122192 122504 123387
52481 123387 124564 125826 127246 128890 130582 132041 133109 133827 134396 135012 135664 136119 136183 135921 135649 135775 136583
52464 136583 137968 139392 140335 140763 140941 140921 140593 140160 140007 140027 139629 138643 137723 137567 138162 139096 140089 140923 141386
52445 141386 141791 143035 145549 148486 150559 151395 151494 151201 150442 149341 148331 147609 147053 146713 146790 147097 147118 146727
52427 146727 146277 145803 144691 142438 139363 136332 134045 132767 132361 132367 132249 131832 131384 131212 131352 131667 132019
52410 132019 132304 132568 133107 134203 135737 137284 138582 139681 140762 142106 144105 146899 150025 152879 155460
52395 155460 158158 160822 162711 163535 163986 164935 166518 168235 169521 170059 169974 169930 170523 171413 171586 170735 169736
52378 169736 169386 169288 168588 167268 166046 165455 165673 166887 168958 170948 171837 171777 171949 173138 175025 176949 178690
$$ packed form
52500A29438p40j582k484k481j338r6K17o8L5N85P85L70m5p6l2j61j35L12Q83
52481A23387J177J262J420J644J692J459J068P18N69O16O52M55O4k62k72J26Q08
52464A36583J385J424R43M28J78k0l28m33j53K0l98r86r20j56N95R34R93Q34M63
52445A41386M05J244K514K937K073Q36R9k93p59j101j010p22n56l40P7L07K1l91
52427A46727m50m74j112k253l075l031k287j278m06Oj18m17m48j72J40L15L52
52410A32019K85K64N39J096J534J547J298J099J081J344J999K794L126K854K581
52395A55460K698K664J889Q24M51R49J583J717J286N38q5m4N93Q90J73q51r99
52378A69736l50r8p00j320j222n91K18J214K071J990Q89o0J72J189J887J924J741
$$ plain form
52361 178690 180355 182099 184209 187029 190482 194063 197423 200667 203939 207124 210141 213138 216156 218889
52347 218889 221035 222675 224142 225759 227794 230356 233100 235376 236938 238352 240434 243409 246779 249852
52333 249852 252276 254269 256491 259498 263135 266655 269613 272484 276185 281188 287227 293693 300103 306388
52319 306388 312982 320454 328829 337428 345596 353407 361455 370201 379867 390700 402854 416004 429556
52306 429556 443296 457525 472486 487955 503505 518918 534272 549798 565674 581788 597767
52295 597767 613502 629504 646326 663652 680517 696464 711907 727075 741293 753835 765017
52284 765017 775754 786313 796239 805397 814225 822779 830293 836125 840606 844424 847531 849298 849597 849131
52270 849131 848586 847961 846947 845611 844392 843625 843393 843803 845075 847232 849930 852804 855951 859890 865036
$$ packed form
52361A78690J665J744K110K820L453L581L360L244L272L185L017K997L018K733
52347B18889K146J640J467J617K035K562K744K276J562J414K082K975L370L073
52333B49852K424J993K222L007L637L520K958K871L701N003O039O466O410O285
52319C06388O594P472Q375Q599Q168P811Q048Q746R666J0833J2154J3150J3552
52306D29556J3740J4229J4961J5469J5550J5413J5354J5526J5876J6114J5979
52295E97767J5735J6002J6822J7326J6865J5947J5443J5168J4218J2542J1182
52284G65017J0737J0559R926R158Q828Q554P514N832M481L818L107J767K99m66
52270H49131n45o25j014j336j219p67k32M10J272K157K698K874L147L939N146
$$ plain form
52255 865036 871366 878676 886967 896362 906769 917890 929614 942146 955616 969747 984122 998657
52243 998657 1013633 1029208 1045043 1060415 1074727 1088004 1100846 1113737 1126357 1137887 1148064
52232 1148064 1157517 1166666 1174658 1180053 1182518 1183187 1183239 1182776 1181406 1179270 1176930 1174598 1172058 1169182 1165979
52217 1165979 1162232 1157652 1152370 1146846 1141250 1135354 1129063 1122618 1116222 1109974 1104290 1099869 1096957 1095053
52203 1095053 1093652 1092914 1093281 1094782 1097079 1099872 1102832 1105403 1107239 1108693 1110368 1112319 1114135 1115742
52189 1115742 1117518 1119569 1121482 1122971 1124249 1125504 1126501 1127042 1127412 1127923 1128308 1127997 1126820 1125046 1122829
52174 1122829 1120047 1116642 1112701 1108219 1103149 1097773 1092697 1088310 1084474 1080825 1077142 1073319 1069252 1065011
52160 1065011 1060975 1057465 1054292 1050861 1046806 1042309 1037665 1032718 1027013 1020601 1014408 1009466 1005784 1002263
$$ packed form
52255H65036O330P310Q291R395J0407J1121J1724J2532J3470J4131J4375J4535
52243I98657J4976J5575J5835J5372J4312J3277J2842J2891J2620J1530J0177
52232A148064R453R149P992N395K465O69N2m63j370k136k340k332k540k876l203
52217A165979l747m580n282n524n596n896o291o445o396o248n684m421k912j904
52203A095053j401p38L67J501K297K793K960K571J836J454J675J951J816J607
52189A115742J776K051J913J489J278J255R97N41L70N11L85l11j177j774k217
52174A122829k782l405l941m482n070n376n076m387l836l649l683l823m067m241
52160A065011m036l510l173l431m055m497m644m947n705o412o193m942l682l521
$$ plain form
52146 1002263 997875 992710 987673 983408 979804 976438 973041 969456 965505 961139 956585 952098 947713 943425
52132 943425 939515 936395 934041 931752 928652 924478 919845 915768 912912 911238 910299 909794 909891 911028 913423
52117 913423 916734 920280 923679 927242 931619 937098 943492 950691 958953 968402 978575 988948 999757
52104 999757 1011844 1025651 1040838 1056936 1073926 1091956 1110900 1130518 1150677 1171050 1190876
52093 1190876 1209520 1227132 1244319 1261209 1277249 1291912 1305083 1316693 1326460 1334356 1340968 1346964
52081 1346964 1352301 1356337 1358640 1359371 1358804 1356905 1353678 1349706 1345834 1342241 1338167 1332797 1326225 1319278
52067 1319278 1312579 1306176 1300066 1294536 1289825 1285842 1282590 1280569 1280356 1281935 1284802 1288627 1293399 1298965
52053 1298965 1304885 1310827 1316769 1322704 1328496 1334127 1339732 1345222 1350175 1354346 1358013 1361595 1365135 1368338
$$ packed form
52146A002263m388n165n037m265l604l366l397l585l951m366m554m487m385m288
52132I43425l910l120k354k289l100m174m633m077k856j674r39n05R7J137K395
52117I13423L311L546L399L563M377N479O394P199Q262R449J0173J0373J0809
52104I99757J2087J3807J5187J6098J6990J8030J8944J9618K0159K0373J9826
52093A190876J8644J7612J7187J6890J6040J4663J3171J1610R767P896O612N996
52081A346964N337M036K303P31n67j899l227l972l872l593m074n370o572o947
52067A319278o699o403o110n530m711l983l252k021k13J579K867L825M772N566
52053A298965N920N942N942N935N792N631N605N490M953M171L667L582L540L203
$$ [...]
##END NTUPLES=NMR SPECTRUM
##END=
