##TITLE=NES1062_ptc150_9883053_uy56wyng8z
##JCAMPDX= 6.0         $$ Bruker NMR JCAMP-DX V2.0
##DATA TYPE= NMR SPECTRUM
##DATA CLASS= NTUPLES
##ORIGIN= BRUKER
##OWNER= Administrator
$$ 1.72 TOPSPIN		Version 2.1
$$ 2016-08-26 20:13:19.179 -0500  Administrator@X
$$ Compression mode = diff/dup
##.OBSERVE FREQUENCY= 400.02188249412
##.OBSERVE NUCLEUS= ^1H
##.ACQUISITION MODE= SIMULTANEOUS (DQD)
##.ACQUISITION SCHEME= undefined
##.AVERAGES= 8
##.DIGITISER RES= 22
##SPECTROMETER/DATA SYSTEM= spect
##.PULSE SEQUENCE= zg30
##.SOLVENT NAME= COFFEE_meoh
##.SHIFT REFERENCE= INTERNAL, COFFEE_meoh, 1, 14.98509
##AUDIT TRAIL= $$ (NUMBER, WHEN, WHO, WHERE, PROCESS, VERSION, WHAT)
$$ ##TITLE= Audit trail, TOPSPIN		Version 2.1
$$ ##JCAMPDX= 5.01
$$ ##ORIGIN= Bruker BioSpin GmbH
$$ ##OWNER= Administrator
$$ $$ E:\/data/COFFEE/nmr/NES1062_ptc150_9883053_uy56wyng8z/20/pdata/1/auditp.txt
$$ ##AUDIT TRAIL=  $$ (NUMBER, WHEN, WHO, WHERE, PROCESS, VERSION, WHAT)
(   1,<2016-08-26 20:13:11.992 -0500>,<Administrator>,<X>,<go>,<TOPSPIN 2.1>,
      <created by zg
	started at 2016-08-26 20:12:05.836 -0500,
	POWCHK enabled, PULCHK disabled,
       configuration hash MD5:
       21 0F 79 D6 B3 7B B4 F6 88 20 88 DB 03 48 BD 9F
       data hash MD5: 64K
       0C 03 35 A1 E3 B1 56 A1 B8 7E C7 87 08 AE D2 77>)
(   2,<2016-08-26 20:13:15.117 -0500>,<Administrator>,<X>,<proc1d>,<TOPSPIN 2.1>,
      <Start of raw data processing
       efp LB = 0 FT_mod = 6 PKNL = 1 PHC0 = 0 PHC1 = 0 SI = 32K 
       data hash MD5: 32K
       E0 79 2F B4 73 F8 37 00 E6 18 37 2C F8 04 B8 F4>)
(   3,<2016-08-26 20:13:15.398 -0500>,<Administrator>,<X>,<proc1d>,<TOPSPIN 2.1>,
      <pk PHC0 = 90.3186 PHC1 = 0 
       data hash MD5: 32K
       85 21 CF EA D8 C1 1E 69 DD A5 7F A3 7F 00 E0 DB>)
(   4,<2016-08-26 20:13:15.508 -0500>,<Administrator>,<X>,<proc1d>,<TOPSPIN 2.1>,
      <abs ABSG = 1 
       data hash MD5: 32K
       15 76 BF 8A 55 85 E2 C8 79 3D 56 C9 CD 15 E6 EC>)
(   5,<2016-08-26 20:13:15.570 -0500>,<Administrator>,<X>,<proc1d>,<TOPSPIN 2.1>,
      <abs ABSG = 2 
       data hash MD5: 32K
       F2 86 4C F0 91 E0 FA 26 18 21 71 79 F0 AC 90 61>)
(   6,<2016-08-26 20:13:15.617 -0500>,<Administrator>,<X>,<proc1d>,<TOPSPIN 2.1>,
      <abs ABSG = 3 
       data hash MD5: 32K
       8C F2 F6 4A 9A 4F CA 34 9F 3B B7 CE 08 5B 32 B9>)
(   7,<2016-08-26 20:13:15.679 -0500>,<Administrator>,<X>,<proc1d>,<TOPSPIN 2.1>,
      <abs ABSG = 4 
       data hash MD5: 32K
       5E 4C A7 A8 B4 F7 3A BA 93 D7 BB 5E 25 9A F5 CA>)
(   8,<2016-08-26 20:13:15.742 -0500>,<Administrator>,<X>,<proc1d>,<TOPSPIN 2.1>,
      <abs ABSG = 5 
       data hash MD5: 32K
       8D 36 F3 E2 CB C7 41 11 B1 D4 01 A3 DF 64 7A CD>)
$$ ##END=
$$ 
$$ $$ hash MD5
$$ $$ A0 FC 3C 24 B4 D0 35 6C D1 CC 8D C6 30 55 6D AB
##$RELAX= 
##$RELAX= 
##$RELAX= 
##$RELAX= 
##$RELAX= 
##$RELAX= 
##$RELAX= 
$$ Bruker specific parameters
$$ --------------------------
##$DU= <E:\>
##$EXPNO= 20
##$NAME= <NES1062_ptc150_9883053_uy56wyng8z>
##$PROCNO= 1
$$ [...]
##$TP= (0..7)
150 150 150 150 150 150 150 150
##$TP07= 0
##$TPNAME0= <>
##$TPNAME1= <>
##$TPNAME2= <>
##$TPNAME3= <>
##$TPNAME4= <>
##$TPNAME5= <>
##$TPNAME6= <>
##$TPNAME7= <>
##$TPOAL= (0..7)
0.5 0.5 0.5 0.5 0.5 0.5 0.5 0.5
##$TPOFFS= (0..7)
0 0 0 0 0 0 0 0
##$TUNHIN= 0
##$TUNHOUT= 0
##$TUNXOUT= 0
##$USERA1= <user>
##$USERA2= <user>
##$USERA3= <user>
##$USERA4= <user>
##$USERA5= <user>
##$V9= 5
##$VALIST= <valist>
##$VCLIST= <CCCCCCCCCCCCCCC>
##$VD= 0
##$VDLIST= <DDDDDDDDDDDDDDD>
##$VPLIST= <PPPPPPPPPPPPPPP>
##$VTLIST= <TTTTTTTTTTTTTTT>
##$WBST= 2048
##$WBSW= 25
##$XGAIN= (0..3)
0 0 0 0
##$XL= 0
##$YL= 0
##$YMAX_a= 552467
##$YMIN_a= -481218
##$ZGOPTNS= <>
##$ZL1= 120
##$ZL2= 120
##$ZL3= 120
##$ZL4= 120
##$ABSF1= 14.98509
##$ABSF2= -5.573092
##$ABSG= 5
##$ABSL= 3
##$ALPHA= 0
##$AQORDER= 0
##$ASSFAC= 0
##$ASSFACI= 0
##$ASSFACX= 0
##$ASSWID= 0
##$AUNMP= <proc_prof1d_extract_pilot.lims>
##$AXLEFT= 0
##$AXNAME= <>
##$AXNUC= <1H>
##$AXRIGHT= 0
##$AXTYPE= 0
##$AXUNIT= <>
##$AZFE= 0.1
##$AZFW= 0.1
##$BCFW= 0
##$BC_mod= 0
##$BYTORDP= 0
##$COROFFS= 0
##$CY= 15
##$DATMOD= 1
##$DC= 0
##$DFILT= <>
##$DTYPP= 0
##$F1P= 0
##$F2P= 0
##$FCOR= 0.5
##$FTSIZE= 32768
##$FT_mod= 6
##$GAMMA= 0
##$GB= 0
##$INTBC= 1
##$INTSCL= 1
##$ISEN= 128
##$LB= 0
##$LEV0= 0
##$LPBIN= 0
##$MAXI= 10000
##$MC2= 0
##$MEAN= 0
##$ME_mod= 0
##$MI= 0
##$NCOEF= 0
##$NC_proc= -8
##$NLEV= 6
##$NOISF1= 0
##$NOISF2= 0
##$NSP= 0
##$NTH_PI= 0
##$NZP= 0
##$OFFSET= 14.98509
##$PC= 1
##$PHC0= 90.3186
##$PHC1= 0
##$PH_mod= 1
##$PKNL= yes
##$PPARMOD= 0
##$PPDIAG= 0
##$PPIPTYP= 0
##$PPMPNUM= 2147483647
##$PPRESOL= 1
##$PSCAL= 4
##$PSIGN= 0
##$PYNMP= <proc.py>
##$REVERSE= no
##$SF= 400.02
##$SI= 32768
##$SIGF1= 0
##$SIGF2= 0
##$SINO= 400
##$SIOLD= 32768
##$SPECTYP= <>
##$SREGLST= <1H.CDCl3>
##$SSB= 0
##$STSI= 32768
##$STSR= 0
##$SW_p= 8223.68421052631
##$SYMM= 0
##$S_DEV= 0
##$TDeff= 65536
##$TDoff= 0
##$TI= <>
##$TILT= no
##$TM1= 0
##$TM2= 0
##$TOPLEV= 0
##$USERP1= <user>
##$USERP2= <user>
##$USERP3= <user>
##$USERP4= <user>
##$USERP5= <user>
##$WDW= 1
##$XDIM= 32768
##$YMAX_p= 443830835
##$YMIN_p= -677488
##$CURPLOT= <Network HP LaserJet P1505>
##$CURPRIN= <$Network HP LaserJet P1505>
##$DFORMAT= <normdp>
##$LAYOUT= <+/1D_H.xwp>
##$LFORMAT= <normlp>
##$PFORMAT= <normpl>
##$SURQMSG= 1
$$ End of Bruker specific parameters
$$ ---------------------------------
##NTUPLES= NMR SPECTRUM
##VAR_NAME=  FREQUENCY,     SPECTRUM/REAL,   SPECTRUM/IMAG
##SYMBOL=    X,             R,               I
##VAR_TYPE=  INDEPENDENT,   DEPENDENT,       DEPENDENT
##VAR_FORM=  AFFN,          ASDF,            ASDF
##VAR_DIM=   32768,         32768,           32768
##UNITS=     HZ,            ARBITRARY UNITS, ARBITRARY UNITS
##FACTOR=    0.250966925370066, 1,           1
##FIRST=     8223.43324360094, -53699,       -57212
##LAST=      0,             4316,            -46046
##MIN=       0,             -677488,         0
##MAX=       8223.43324360094, 443830835,    0
$$ Real data points
##PAGE= N=1
##DATA TABLE= (X++(R..R)), XYDATA
$$ [...]
19599a27139C47951a35541j12106B64302n0039B5785i769A390a90227Q2046A45500
19587B9629J37971c98825C9301O773d756p4062j1884j90270d1473k06762H6911
19575A52485L7691b02096D9916J19563b11503h5950C14710e5497B9530b20349
19564A39400F9660f6634j32222C3456Q6450L617a08851j04498B13275P9963b03280
19552I679e4808A48902b87191a6964C23069b16281b142A98901q5378f7713b0361
19540F2915e108j42557c4488A75420q3718b6978l4174j0186L0836l1314p0194
19529a42010B71899A034b49489q856J08913N7594D4911b90837R148E6298P5496
19518A31794i9053B1978Q4810c04564D714J1622R1532a87039j19380a47534j26801
$$ plain form
19599 -127139 347951 -135541 -247647 264302 214263 25785 -9769 1390 -190227 -108181 145500
19587 29629 167600 -398825 39301 46074 -4756 -78818 -90702 -280972 -41473 -248235 86911
19575 152485 190176 -202096 49916 169479 -211503 -85950 314710 -55497 29530 -220349
19564 139400 69660 -66634 -198856 33456 119906 123523 -108851 -213349 213275 293238 -203280
19552 9679 -54808 148902 -287191 -16964 323069 -216281 -2142 198901 113523 -67713 -20361
19540 62915 -5108 -147665 -34488 175420 91702 -26978 -61152 -71338 -40502 -71816 -142010
19529 -142010 271899 1034 -249489 -258345 -149432 -91838 44911 -290837 -281689 56298 131794
19518 131794 -99053 21978 106788 -304564 4714 16336 107868 -187039 -306419 -147534 -274335
19507b74335o0367P1035D16133D4161M4273h6874E603b5935E2393i1373L3536
19496e7837q9667l1770o618b9689A74218c27946F6525c07120i2207k49052J41675
19485a99584H1018J36888a59915b909H351P825J93616B2388b34285B86559C0005
19473A74774g6873J6396j02339c2625q0894q9909G638a8546j4860A336K06805
19462B08141g3919H3015a97769A30039i6624J2435J5209A61544O9661h8595A87479
19450c87648J02645N1766R5469K191E6672a29503j22107B13301a43738E6722a26813
19438a52043M7568d0497k18129A07571J6321g6892D08068I5864a15617I4327c23928
19426b48916a4709C85737d5279l42407a02108j11075P8459F7378b38828d8125
$$ plain form
19507 -274335 -334702 -263667 416133 44161 88434 -86874 5603 -25935 52393 -91373 -57837
19496 -57837 -147504 -179274 -185892 -29689 174218 -327946 66525 -307120 -92207 -341259 -199584
19485 -199584 81018 217906 -159915 -2909 8351 16176 209792 22388 -234285 286559 30005
19473 174774 -76873 -60477 -162816 -32625 -113519 -203428 7638 -18546 -33406 1336 208141
19462 208141 -73919 83015 -197769 130039 -96624 -84189 -68980 161544 231205 -88595 187479
19450 -387648 -285003 -233237 -137768 -135577 56672 -129503 -251610 213301 -143738 56722 -126813
19438 -152043 -104475 -40497 -258626 107571 123892 -76892 408068 95864 -115617 94327 -323928
19426 -248916 -14709 385737 -45279 -387686 -102108 -213183 -134724 67378 -238828 -48125
19415a22849B55234F4725J11975D5503h6517j6321C5871K4742b63556D52449c4971
19403E75a7419B30193b34823N9671b3066D1169e6917B00583c58542i7505E14691
19391a92144I9694c1997A93047f2975k59024A31644b40648f7578k19150a7203
19380A40764b44662d2028j3672k50497h8909k03069Q2213G0101d04810A32612
19369A20062M7397D5295a05777K3336k29615A44335e30442b4028g65r3876J5822
19358g8819k29824M9769I0288b11916f5902p7165A6495b93928I7078P7082a57963
19346A50903b95190m8074h8382A56687a06879C20569G7026J57912i7599B12851
19335H74b67764K1739a09642p8820E5628e9686j06729A1230Q8804Q9324n434a25619
$$ plain form
19415 -122849 255234 64725 176700 45503 -86517 -102838 35871 60613 -263556 452449 -34971
19403 575 -17419 230193 -234823 -175152 -23066 41169 -56917 200583 -358542 -97505 514691
19391 -192144 99694 -31997 193047 -62975 -321999 131644 -240648 -67578 -286728 -17203
19380 140764 -244662 -42028 -55700 -306197 -88909 -291978 -209765 70101 -404810 132612
19369 120062 167459 45295 -105777 -82441 -312056 144335 -530442 -24028 -765 -94641 -78819
19358 -78819 -308643 -258874 90288 -211916 -65902 -143067 16495 -293928 97078 174160 -157963
19346 150903 -295190 -343264 -88382 156687 -106879 320569 77026 234938 -97599 212851
19335 874 -267764 -246025 -109642 -188462 55628 -59686 -166415 11230 100034 189358 183924 -125619
19322b13479g3026A0129R1601f8911K4768H66K4406b84222h7580j28594b9851
19310d8785j57039a01088F1590a99806O7654l05297B8908a64627B18P2353a83847
19298A42609n3125M0976M097F1111b66693R1121k97212A21137c32964a36907n7918
19287a94825j4991K3192h2683j64408B9481a52183D4185a09553D3563L6491a85122
19275a13595I2789a04464p1848O60p698A00826m2223g6042J9884n7078m216j72837
19263b90289C03920a08650j01979e1884b4582A13134H184N9688a93959B17615
19252b42750a7740l7318a2413j30967A46153D3495O4214f0859C2627b45165P3652
19241a71513h2722j83661J30250L2904C4057A0012R1130d15581a3458l79750a56880
$$ plain form
19322 -213479 -73026 10129 101730 -68911 -44143 866 25272 -284222 -87580 -216174 -29851
19310 -48785 -205824 -101088 61590 -199806 -132152 -437449 28908 -164627 218 72571 -183847
19298 142609 89484 130460 134557 61111 -266693 -175572 -472784 121137 -332964 -136907 -194825
19287 -194825 -209816 -186624 -82683 -247091 29481 -152183 44185 -109553 43563 80054 -185122
19275 -113595 92789 -104464 -176312 -175652 -183350 100826 58603 -76042 -56158 -113236 -117452 -290289
19263 -290289 303920 -108650 -210629 -51884 -24582 113134 8184 67872 -193959 217615
19252 -242750 -17740 -55058 -12413 -143380 146153 43495 107709 -60859 32627 -245165 -171513
19241 -171513 -82722 -266383 -136133 -103229 34057 10012 101142 -415581 -13458 -393208 -156880
19229c4104F2994a09488A92179c31553J30292d3095l35133B22020c20258R1958
19219b28300J2758A17061i3822C6406b04511A98960H6821a68776c3420B4625K02783
19208B27408k2273c60088A7602L37143A47443A9559f5793j19278a0190j89215
19198a99405A64894a08282a8612H5196J4613P1556j5792d27028C45553b78405
19187b55745i4959A11990C1549I793c31705B9520a83285M6225l45713D1244a10217
19175a35932p7856Q5459N7497I7231a79481j13586d5662A29981P042a03194q3518
19164a86712j0845r7588B39841i6003A02344i0956k25745B68608b18025R0935
19154a27090k9824l5174k8520J8439a9517N57l6294H286a9026B368a06325k22684
$$ plain form
19229 -34104 62994 -109488 192179 -331553 -201261 -43095 -378228 222020 -320258 -228300
19219 -228300 -215542 117061 -93822 36406 -204511 198960 86821 -168776 -33420 24625 227408
19208 227408 205135 -360088 17602 354745 147443 19559 -65793 -185071 -10190 -199405
19198 -199405 164894 -108282 -18612 85196 99809 171365 155573 -427028 345553 -278405
19187 -255745 -94959 111990 31549 9793 -331705 29520 -183285 -137060 -482773 41244 -110217
19175 -135932 -213788 -128329 -70832 97231 -179481 -293067 -45662 129981 137023 -103194 -186712
19164 -186712 -197557 -295145 239841 -96003 102344 -90956 -316701 268608 -218025 -127090
19154 -127090 -156914 -192088 -220608 -202169 -19517 -18960 -55254 8286 -19026 2368 -106325 -329009
19142c29009A78275L37513a73835B12377k8678a13149E9752J07889a69133P95
19132a68338b6459k4928E9739J28093b54046O4534m1918e94D7232K742J88191
19121B38165l3952F1698K77999E2649G513K37538a29181b4913j10366j4042B25366
19109d885o3098j17032e3036l70799g140r1233J0949j09899B14184b47550F8069
19097b81882c7704B0634J53976A0400b34904A65876g2023C0211a5802k88339D1328
19085B05095b68637Q9485A58208f8453l3754m5591B43256A4758K78838m0266L2472
19074B85802e9483Q86j4542j74000F6292A0325b86655A31357a33486O5037r6334
19063a64783M9995j65615H5964b12710c5841j44567A96219I920L9819d7366B2301
$$ plain form
19142 -329009 178275 515788 -173835 212377 183699 -113149 59752 167641 -169133 -168338
19132 -168338 -26459 -51387 59739 187832 -254046 -189512 -231430 -594 47232 49974 238165
19121 238165 204213 61698 339697 52649 7513 245051 -129181 -24913 -135279 -149321 225366
19109 -4885 -67983 -185015 -53036 -423835 -7140 -98373 -87424 -197323 214184 -247550 68069
19097 -281882 -37704 20634 174610 10400 -234904 165876 -72023 30211 -15802 -304141 41328
19085 205095 -268637 -179152 158208 -68453 -102207 -147798 243256 14758 293596 253330 285802
19074 285802 -59483 -58597 -73139 -247139 66292 10325 -286655 131357 -133486 -68449 -164783
19063 -164783 -114788 -280403 85964 -212710 -35841 -180408 196219 9920 49739 -47366 22301
19051a0768j10516A26084m2040L08400c15953J18887A32939n6988b657D4582G737
19039A07905a71342A39302a89116j18508E0284A7089O8780d5469I685Q3046i932
19027b61300A86973b37l07727C0804I190L05306b1127H437J12152j8540b11596
19015a03301j44725A60794o9579N1658D4952a21855C3419c1262A22518g9854A85022
19003b23009o708B32902b87586J06008C64047A81828a59283A48122K64357b7447
18992a60121P7170A9778b52068I441c24734J11728N0336j41484J22119P1399p6406
18981a87042A42636o2960g7351A26635J44060C2439h0407r5718c7635j06265E7392
18969a08463H9415D2636i370H4436L6629b25843c5709l82979G0829f5236j41775
$$ plain form
19051 -10768 -121284 126084 84044 392444 -315953 -197066 132939 75951 -2657 44582 7737
19039 107905 -171342 139302 -189116 -307624 50284 17089 85869 -45469 9685 92731 -9932
19027 -261300 186973 -237 -307964 30804 9190 314496 -21127 8437 120589 102049 -211596
19015 -103301 -248026 160794 91215 142873 44952 -121855 33419 -31262 122518 -79854 185022
19003 -223009 -229717 232902 -287586 -181578 364047 181828 -159283 148122 412479 -27447
18992 -160121 -82951 19778 -252068 9441 -324734 -213006 -162670 -304154 -182035 -110636 -187042
18981 -187042 142636 79676 -77351 126635 270695 32439 -80407 -176125 -37635 -143900 57392
18969 -108463 89415 42636 -9370 84436 121065 -225843 -35709 -418688 70829 -65236 -207011
18958b07011P4839m34759d5883k48134g529p3913B27921b13671O7656A23240b79901
18946b7620H8544K7075e7504A9041i1382j01912f8340j8389A60311e4776n2802
18935a07578j77138a05012D5402a57134j50356p2524J77125D2659b06074d7460
18924i2709c8437j19999F7442N7369e2867r5840m970E9300B3203b82527j66284
18913d48811a55562E4325N7787f8832E0136a27311C8697a39625A28642O383b94799
18901f1175L0108A17470a80321O6036B2946a37690a4045j60222G7036a284E7304
18889b94703f2059k84659B9458J30552o924i4424k22560e8603C63149f5991m2230
18878a08221A07650d1231k08258A80103c828H6494j4100K2870b7123F3398h8364
$$ plain form
18958 -207011 -132172 -566931 -45883 -294017 -7529 -81442 227921 -213671 -146015 123240 -279901
18946 -27620 88544 115619 -57504 19041 -91382 -193294 -68340 -86729 160311 -54776 -107578
18935 -107578 -284716 -105012 45402 -157134 -307490 -380014 -202889 42659 -206074 -47460
18924 -92709 -38437 -158436 67442 124811 -52867 -148707 -153677 59300 23203 -282527 -448811
18913 -448811 -155562 54325 112112 -68832 50136 -127311 38697 -139625 128642 135025 -294799
18901 -61175 -31067 117470 -180321 -114285 22946 -137690 -14045 -174267 77036 -1284 57304
18889 -294703 -62059 -346718 29458 160010 153086 -94424 -316984 -58603 363149 -65991 -108221
18878 -108221 107650 -41231 -249489 180103 -3828 86494 72394 95264 -27123 63398 -88364
18866A21785A3541J32588d6060q6525L6594A19458m9404c26893f3952b1724A15263
18854H0368i8583k2213A4769c7933a5910m0526j01080K6784n7507e5919A86717
18842A30864n2410G733e6536n7400G8826b10669k802J03593M4249o581j3902p9415
18830a65527D7655c72346B06067D5591H186K49418C8360a68764A7389M47819A10496
18818b26372C00887A49046n1304L219K08845A40543Q3937h6249B06812f2926n1190
18807a14116B4661K6678J26973o0309J6029g7427B11897a57908g6093C6614B988
18795c8362j35630A5518c10684N2537A51299n5122P671b32499R2219K3981k49602
18784c65901h2749C9505b41844j14325a1922j73997h1431C6665Q707c71584h1683
$$ plain form
18866 121785 13541 146129 -46060 -132585 -95991 119458 70054 -326893 -63952 -21724 115263
18854 80368 -98583 -120796 14769 -37933 -15910 -56436 -157516 -130732 -188239 -55919 186717
18842 130864 78454 7733 -56536 -113936 78826 -210669 -213471 -109878 -65629 -72210 -86112 -165527
18830 -165527 47655 -372346 206067 45591 8186 257604 38360 -168764 17389 465208 110496
18818 -226372 300887 149046 97742 100961 309806 140543 224480 -86249 206812 -62926 -114116
18807 -114116 24661 51339 178312 118003 134032 -77427 211897 -157908 -76093 36614 2988
18795 -38362 -173992 15518 -310684 -258147 151299 96177 103848 -232499 -140280 -116299 -365901
18784 -365901 -82749 39505 -241844 -356169 -11922 -185919 -81431 36665 45372 -371584 -81683
18772h9258l2184F6863b99106K52a15604e976j21812j94815B52408e0244B80464
18760E1201i3249E7748a30418I3291d22007f9965A19591h0192n2371A37735E1528
18748a00608o8783L5959C4681a4431I0656c5630o1337q7805A37188a72048a1906
18736a49047A97261a74779A1797P9995a06373A71622h9008b511B11796a13658
18725c7300J2482k24179F911Q3233K0884a49798P2502A89279B1738b1529j66021
18714a87550D2865O8081a05949B04508a68284A7076a2092k45419a20967h723m31627
18703d40350A02993a92217l8142r9739J23233g8274a655j36641d8844k3804o5193
18692a37841d5322j11269C1569a84603E606c43050Q8891h5275n4683E3889b8227
$$ plain form
18772 -89258 -121442 66863 -299106 -298854 -115604 -5976 -127788 -322603 252408 -50244 280464
18760 51201 -93249 57748 -130418 93291 -422007 -69965 119591 -80192 -132563 137735 51528
18748 -100608 -169391 -133432 34681 -14431 90656 -35630 -96967 -184772 137188 -172048 -11906
18736 -149047 197261 -174779 11797 91792 -106373 171622 -89008 -2511 211796 -113658
18725 -37300 -24818 -248997 6911 90144 111028 -149798 -77296 189279 21738 -21529 -187550
18714 -187550 42865 110946 -105949 204508 -168284 17076 -12092 -257511 -120967 -8723 -440350
18703 -440350 102993 -192217 -230359 -330098 -206865 -78274 -1655 -138296 -48844 -72648 -137841
18692 -137841 -45322 -156591 31569 -184603 5606 -343050 -254159 -85275 -139958 53889 -28227
18680g8394F3547K4932b35117A99284b55632I4389P8637d4211k8564j01772c2770
18668g292m9353k33854g1268E2246a56053A33565a84256a8083l29256D37590b19627
18656a06724B85925e22453A3431a65613A61013n2226a70092C36592a68624E9542
18645b32850B8531b47155B29493i466l87630a60822O7110A55697a8818j50582
18635a69400C2302c3030b399l711B59235h5018O43a9908m8424E7814e9196k48640
18623c07836P334B30302d22575a2307n1864j93273b0889j58360l1497K5950D9521
18611G3985a63631a0277k00713d5140G2506b07596C63400a88976B71699a68059
18600i5540j87873f8844n8028q274b1042j81308G6330A5831c73226j3197C5036
$$ plain form
18680 -78394 63547 88479 -235117 199284 -255632 94389 173026 -44211 -72775 -174547 -32770
18668 -7292 -56645 -290499 -71268 52246 -156053 133565 -184256 -18083 -347339 437590 -219627
18656 -106724 285925 -522453 13431 -165613 161013 108787 -170092 336592 -168624 59542
18645 -232850 28531 -247155 229493 -9466 -397096 -160822 -93712 155697 -18818 -169400
18635 -169400 32302 -33030 -2399 -6110 259235 -85018 -84375 -19908 -68332 57814 -59196 -307836
18623 -307836 -300502 230302 -422575 -12307 -64171 -257444 -20889 -179249 -210746 -184796 49521
18611 73985 -163631 -10277 -210990 -45140 72506 -207596 363400 -188976 271699 -168059
18600 -95540 -283413 -68844 -126872 -135146 -21042 -202350 76330 15831 -373226 -386423 35036
18588i1540j44578e2302A414b4940A51804A2689J77446D0613K766I836N9572b20375
18575c7231J6978n8410A9576A730M8277e01163J62579J30655i2485A25693c8768
18563a93983L0410k3782C9349c90403A75617B3405b4924j16725B09652F9642k4492
18552D5150c75942J57993A1064c2631B38366b67186B8607a90429C0591J55238
18542A85829E999h8009k7135I8279a04203M1303K7790E9838c74416H5278c25749
18530a20989n2459L1208B00885a09184F3009j4260P2976d1682p531j95410E5677
18518b2674j37775R575p7551g6843H8955g4631j46605o698B02760b03323B1167
18506g0646A74905r620o8462a94629B891b12269j069K5329A24726c6769m1905
$$ plain form
18588 -91540 -236118 -52302 1414 -24940 151804 12689 190135 40613 43379 9836 69408 -220375
18575 -37231 -20253 -78663 19576 1730 50007 -501163 -338584 -207929 -92485 125693 -38768
18563 -193983 -163573 -187355 39349 -390403 175617 23405 -24924 -141649 209652 69642 45150
18552 45150 -375942 -217949 11064 -32631 238366 -267186 28607 -190429 30591 185829
18542 185829 5999 -88009 -115144 98279 -104203 -62900 -35110 59838 -374416 85278 -325749
18530 -120989 -173448 -142240 200885 -109184 63009 48749 121725 -41682 -49213 -244623 55677
18518 -22674 -160449 -150874 -228425 -76843 88955 -74631 -221236 -227934 202760 -203323 21167
18506 -70646 174905 165285 96823 -194629 2891 -212269 -213338 -188009 124726 -36769 -78674
18495g8674k74682h3919H7545a2584A31844a83006n9855I037O9584A2273b6870
18483B69277A29536d169l14030C1133i1068n2452i022H8900J8755B5555J38390
18472A63945K78860b91542B40930q8793g4077B70968A34669g5887j66164B01368
18461A24187a0897F0337f7853j51644A76440E601f2871A05401D9718b3837K906
18450b0931H0909b00095R8250M2565l1831E8548R6813O6766a8742E0815c39776
18438d3163P417A1386f1412A62701M213i3627A0259b06400P7826j39667j48876
18427d17117J81059L2742q7552B1455O6991c1053A13647A4180a47385A27613h8943
18415H7539e7972I7131a06804E0859K47986I8335O7507A0612K0470a20238d259
$$ plain form
18495 -78674 -353356 -83919 87545 -12584 131844 -183006 -242861 9037 78621 12273 -26870
18483 269277 129536 -4169 -318199 31133 -91068 -143520 -9022 88900 107655 25555 163945
18472 163945 442805 -291542 240930 152137 -74077 270968 134669 -75887 -242051 201368
18461 124187 -10897 60337 -67853 -219497 176440 5601 -62871 105401 49718 -23837 -20931
18450 -20931 80909 -200095 -101845 -59280 -91111 58548 155361 222127 -18742 50815 -339776
18438 -43163 -35746 11386 -61412 162701 166914 -93627 10259 -206400 -128574 -268241 -417117
18427 -417117 -236058 -203316 -290868 21455 88446 -31053 113647 14180 -147385 127613 -88943
18415 87539 -57972 97131 -106804 50859 298845 98335 165842 10612 31082 -120238 -4259
18403A87367a1198k4408l0601k5652n9770j57030j919A0J60243j9302a76010B18417
18390b21838k17446J29584i5668L1774j02392j13213A83625h3368k16456h0608
18379g3652j27531h3295p3041H1495a60866m8461c1079k989A9671L6260K18183
18368B74114b3897q8089K1224q9427A73499i7845A32020b95947C93545a47975
18357A10406A5486g7007q4378B30711E3615a24301A72909c69418G5222c8827C6419
18345b41688I129Q8032J91410c16695a17421D6646b17176C2130b84962N2530j73127
18334d05559a58222b1555C99538b38623A66426E0875P8594A0529a48160B5379
18323H6277e1019j04926M3967p6843A36282c16710O8985R020c1917G9298c08327
$$ plain form
18403 187367 -11198 -35606 -66207 -91859 -151629 -308659 -310578 10 160253 140951 -176010 218417
18390 -221838 -439284 -309700 -95668 -63894 -166286 -279499 183625 -83368 -299824 -80608
18379 -73652 -201183 -83295 -156336 81495 -160866 -209327 -31079 -34068 19671 55931 274114
18368 274114 -23897 -111986 -90762 -180189 173499 -97845 132020 -295947 393545 -147975
18357 110406 15486 -77007 -161385 230711 53615 -124301 172909 -369418 75222 -38827 36419
18345 -241688 9129 97161 288571 -316695 -117421 46646 -217176 32130 -284962 -232432 -405559
18334 -405559 -158222 -21555 399538 -238623 166426 50875 129469 10529 -148160 25379
18323 86277 -51019 -155945 -111978 -188821 136282 -316710 -247725 -238705 -31917 79298 -308327
18311B40144b15453g2667E2366a81796d3257j82869A35118J0635b19489b7322
18300B7315d79636a45156A6413d53709J21557A97035b13912l8981a06845d5327
18289b17524r1302E1901i8183G005P9997K8779h3537a608B83054D2692b01311
18277a97788o3733a2490m3164D47168b90266H8263c71188J50387h3791D8300e7557
18265a80876n5078j73996F7401f5521l73605a38907l0848H970a37298e6720j86615
18254b43335j65795a61562j48983b952B4292J90706r392d7999j58573e9346k2483
18243h1829A73457i8474b6951a801j38387F4377C575R0759f627r6166n0040E2021
18230a30220C0455K59205f8405l16323J85371j1170k439B42765c3687l08876c1624
$$ plain form
18311 240144 -215453 -72667 52366 -181796 -43257 -226126 135118 145753 -219489 -27322
18300 27315 -479636 -145156 16413 -453709 -332152 197035 -213912 -252893 -106845 -45327
18289 -217524 -308826 51901 -98183 7005 87002 115781 -83537 -1608 283054 42692 -201311
18277 -197788 -261521 -12490 -55654 447168 -290266 88263 -371188 -220801 -83791 48300 -57557
18265 -180876 -235954 -409950 67401 -65521 -439126 -138907 -169755 8970 -137298 -56720 -243335
18254 -243335 -409130 -161562 -310545 -2952 24292 214998 205606 -47999 -206572 -59346 -81829
18243 -81829 173457 -98474 -26951 -1801 -140188 64377 3575 94334 -6627 -102793 -152833 52021
18230 -130220 30455 289660 -68405 -384728 -199357 -210527 -212966 242765 -33687 -342563 -31624
18218C37205e05148a53553A62808J78527a23784E4371J06125D9928i3798n8124
18208a51922e2693j62842A27016a322k59042R5107B14750m1937q1799a57260A54387
18196a85194M3829K4104A68051e0569H4211N6683p770b23299q6251E1166d1181
18184A25333b17635B38523C5398a05999R831A09612c7928k17555A15851J4319
18174A30170b1329m15844A30086B2956b6975A8907A658K25120h789A635K43443
18163B45078I1756N465h7217r0620b0024C3061f1012j89566G7825a82906A80J42948
18151A43128a4830m01820a79016A7571Q6036L6329k7655a4777n0231C20681c45209
18139A59172a70427B1344h4436C7726h1111o84F7212r590K19775a09523C5520
$$ plain form
18218 337205 -505148 -153553 162808 341335 -123784 54371 160496 49928 -93798 -151922
18208 -151922 -52693 -215535 127016 -1322 -260364 -165257 214750 172813 91014 -157260 154387
18196 -185194 -141365 -117261 168051 -50569 84211 140894 133124 -223299 -309550 51166 -41181
18184 125333 -217635 238523 35398 -105999 -96168 109612 -37928 -255483 115851 130170
18174 130170 -21329 -437173 130086 22956 -26975 18907 1658 226778 -8789 1635 245078
18163 245078 91756 97221 -87217 -177837 -20024 33061 -61012 -250578 77825 -182906 180 143128
18151 143128 -14830 -416650 -179016 17571 103607 139936 112281 -14777 -65008 320681 -345209
18139 159172 -170427 21344 -84436 37726 -81111 -81795 67212 57622 277397 -109523 35520
18127D9992P5731a86245b2694k33000c2867o8444o5495A257b6088j24593c3806
18115D7130a90237B8540O884c4759l3739c3369D05K34716q4771b16222k243n1848
18103b70313A67513a13441N3624A8784A312a39761g936H4972a06167M5372J2838
18092d7957A42340a63301I2525d3888K315A57893a53753P5974k32866h7479j75621
18081b63100A04370N3271a4865r8735G3883N252d4204B02942b43363A16509i7863
18069d15530a30897j36113A12344D4038i5344L0524k18880J22831A35767a36002
18058A54096a36171m1863j49071g1864B84741C392c43596e8007K7208j51703B7275
18046f3959D3878d21373a32306l236b8280l2306C2632a11275a0678H1122K6349
$$ plain form
18127 49992 125723 -186245 -22694 -255694 -32867 -101311 -166806 1257 -26088 -150681 -33806
18115 47130 -190237 28540 35424 -34759 -68498 -33369 405 235121 150350 -216222 -218465 -270313
18103 -270313 167513 -113441 -59817 18784 1312 -139761 -7936 84972 -106167 -60795 -47957
18092 -47957 142340 -163301 92525 -43888 -41573 157893 -153753 -77779 -310645 -87479 -263100
18081 -263100 104370 157641 -14865 -113600 73883 79135 -44204 202942 -243363 116509 -97863
18069 -415530 -130897 -267010 112344 44038 -95344 -64820 -283700 -160869 135767 -136002
18058 154096 -136171 -178034 -327105 -71864 284741 3392 -343596 -58007 -30799 -182502 27275
18046 -63959 43878 -421373 -132306 -135542 -28280 -60586 32632 -111275 -10678 81122 107471
18035A07471b27212f8503p7186N8495n7914k08470B40932G7588f5726C3744i3171
18023I9189P2134b49877F2336a311k7359C04062a8158C9492J89846f9347B6625
18011e4912j39024B04649F7605c21942p63a52468B40290a73788G5941e3818C5865
17999a6112F376O3709e3814K3382j27950c1438G9433a24377j62343P4142g7485
17987c0193p3638N0035l39975J80227Q0472j46986a8077n6470j67367B39560f4801
17975a11684o5649K2569d6172A24519c06096A31535J37895a98798M4938B81784
17964D9738J98519a08962G5737b01157B05789a09010k53630H2457a28924B36909
17953a43452A74236D661K91097q5134m2187D1343b10133B8521m749d69348I6998
$$ plain form
18035 107471 -227212 -68503 -145689 -87194 -145108 -353578 240932 77588 -65726 33744 -93171
18023 99189 171323 -249877 62336 -1311 -28670 304062 -18158 39492 229338 -69347 26625
18011 -54912 -193936 204649 67605 -321942 -322705 -152468 240290 -173788 75941 -53818 35865
17999 -16112 6376 70085 -53814 -30432 -158382 -31438 79433 -124377 -286720 -212578 -77485
17987 -30193 -103831 -53796 -393771 -213544 -133072 -280058 -18077 -74547 -241914 239560 -64801
17975 -111684 -177333 -154764 -46172 124519 -306096 131535 269430 -198798 -153860 281784
17964 49738 248257 -108962 75737 -201157 205789 -109010 -362640 82457 -128924 236909
17953 -143452 174236 4661 295758 210624 168437 41343 -210133 28521 23772 -469348 96998
17941a50172n913I4490b74986B40292e6495C5148a81375L8031C9943K70401f8281
17929A11797b76940B90357j03588k4117J31132b8261o1804n4935k44830i9825
17918c1505A48558P081J5379h1259Q820L4966J1201l28610A13366f0656F6669
17906B13715f4060D7817Q3502n1563a40333E5141K0884c3799j74268c6984j05306
17895a42290j0805A6246J67340f7954K9728l56341H8466K87522a69668k80251
17885d49919a87798j87917A25721e6590b0292D1841b3680D782b1656E6046J06204
17874A62250c6376j7615M025j00142b840A01798b16614D7700J47815P4858c5295
17862a9947B1727O659b18340G8910l5949K4054O143b78063B3483d1141q1087e3385
$$ plain form
17941 -150172 -156085 94490 -274986 240292 -56495 35148 -181375 -143344 39943 310344 -68281
17929 111797 -276940 290357 186769 162652 293784 -28261 -90065 -145000 -389830 -99825
17918 -31505 148558 155639 171018 -81259 -72439 -37473 -26272 -354882 113366 -60656 66669
17906 213715 -64060 47817 131319 79756 -140333 55141 76025 -33799 -208067 -36984 -142290
17895 -142290 -153095 16246 183586 -67954 -38226 -394567 88466 375988 -169668 -449919
17885 -449919 -187798 -375715 125721 -56590 -20292 41841 -23680 4782 -21656 56046 162250
17874 162250 -36376 -53991 -49966 -150108 -2840 101798 -216614 47700 195515 270373 -35295
17862 -19947 21727 28386 -218340 78910 42961 67015 73158 -278063 23483 -41141 -122228 -53385
17849a39842f2023k8021r6434F6476b43934G8688J63193J37399D3386b20723q4870
17838c05593b9750l96874B8998N0414N2623M2823j7685R0004d30965A58780J33031
17827B91811F6869a44814E4074b86241A11176Q9242b64968b7783J1617e781B03019
17815b78423H4332c20113L1257A27803h2874J8777r6219M3663j08017J10881C6802
17803B40379a43849N4782B0746a34323A05100d5629k60177A37407K4920c5670
17792b93011B23370o1446M04768A59660a02308B8562h81A14220a05448c3487A48574
17780c9829k24568B45700l9301G8194d5301A10718J21847h7396A58499b20338
17769D789a97821F6502E331b12614a919k35992P7078j43193j31309a17043A09446
$$ plain form
17849 -139842 -62023 -90044 -186478 66476 -243934 78688 241881 379280 43386 -220723 -305593
17838 -305593 -29750 -426624 28998 79412 132035 174858 157173 247177 -430965 158780 291811
17827 291811 66869 -144814 54074 -286241 111176 200418 -264968 -27783 -16166 -5781 203019
17815 -278423 84332 -320113 -288856 127803 -82874 -64097 -160316 -116653 -224670 -113789 36802
17803 240379 -143849 -89067 20746 -134323 105100 -45629 -305806 137407 162327 -35670
17792 -293011 223370 161924 566692 159660 -102308 28562 -881 114220 -105448 -33487 148574
17780 -39829 -264397 245700 206399 78194 -45301 110718 232565 -87396 158499 -220338
17769 4789 -197821 66502 5331 -212614 -1919 -237911 -160833 -304026 -435335 -117043 109446
17757A04634a91597A88841f9679l83928A70551a35039B06765q5911D6157M026
17747E0183d8071G9959d94887K15389A4347e8801A972a41577C11574a25507j7475
17736a42982K5860B07464g0361A58671o3269b3224A72972b94653A93618a7714
17725d714B28892b596B26204d8852D7920D304m77b97465i5566j38854M69P231
17713b26720B53382d05970H9937j3959J7068a79672A63423l1475b91265j5337
17703c06602A92801C5305O7461a82370P5414l46763a77908G8749g3257l4914e501
17691E3623J35018b8585o760A29855b95410F7709b22808f9069L3759j09520f6599
17679b57511M5482F8882G214P5597a83374I6522c57875C1767a54099A01561K2514
$$ plain form
17757 104634 -191597 188841 -69679 -453607 170551 -135039 206765 120854 46157 50183
17747 50183 -48071 79959 -494887 -279498 14347 -58801 1972 -141577 311574 -125507 -142982
17736 -142982 -117122 207464 -70361 158671 95402 -23224 172972 -294653 193618 -17714
17725 -4714 228892 -2596 226204 -48852 47920 4304 3827 -297465 -95566 -234420 -233951 -226720
17713 -226720 253382 -405970 89937 75978 93046 -179672 163423 131948 -291265 -306602
17703 -306602 192801 35305 102766 -182370 -106956 -453719 -177908 78749 -73257 -108171 -5501
17691 53623 188641 -28585 -35345 129855 -295410 67709 -222808 -69069 -35310 -144830 -66599
17679 -257511 -212029 68882 7214 82811 -183374 96522 -357875 31767 -154099 101561 124075
17668A24075b15961A71054a60009q246C2781A319N5695b5354C75779j12721g4353
17656B48269h0435A90969m5909D0050a42961C27769j54772a5935A64624o6776
17646I7848B939M0149L186b38118A65892J53886a91914B38407b00218B33540a24494
17634H328e9898o9947d7104K3384B35824f7571j98603N8451C9626L0335a53699
17622c24892A70272d952j87418l9799a09209b3755j9535B78187D2197K68020r033
17611C01184C6854i7695B91369d9773j53661A33721a3552A49311J61217B0903
17600A08683b5818k5168k8459e964n1780K3363q8665d9521B3730P5690d3554A73597
17587C6216J45030e1842o775C03433r5839d80842D76683e4276K1281A6069a28589
$$ plain form
17668 124075 -215961 171054 -160009 -168255 32781 1319 57014 -25354 375779 263058 -74353
17656 248269 -80435 190969 145060 40050 -142961 327769 172997 -15935 164624 97848
17646 97848 2939 43088 46274 -238118 165892 319778 -191914 238407 -200218 233540 -124494
17634 8328 -59898 -129845 -47104 -23720 235824 -67571 -266174 -207723 39626 69961 -153699
17622 -324892 170272 -4952 -192370 -232169 -109209 -23755 -43290 278187 42197 310217 301184
17611 301184 36854 -97695 291369 -49773 -203434 133721 -13552 149311 310528 20903
17600 108683 -25818 -50986 -79445 -5964 -57744 -34381 -123046 -49521 23730 99420 -43554 173597
17587 36216 181246 -51842 -58617 303433 207594 -480842 476683 -54276 -32995 16069 -128589
17575b0729j2542A9365a76023B01396p6121K2287C800L39690a86628P2234D9241
17563A74242m7930J26802o0492m8566K40726d9902G0856k3488j6326J55912e1813
17551b34441A0699K75631b2194k04185G319d9689h746j80208i3400A62980g1547
17539A5389a30862j59599A39622R1144A0770A675a7491A77781i1547d4442D00845
17527B1213a78019A94284Q0371A5976K67642B2239L7847a38576k3858A08419B8323
17515A40564k1041Q7262e3407j51858C63952a91228Q4003d3560B75319G6627p245
17504F9382K4448p968a17355D8502J1113f2142B22656R7709a65444o3215B41952
17492G6983b4582J1655G7276C6701a81454e9881B17676c5615A3386b08358A10158
$$ plain form
17575 -20729 -33271 19365 -176023 201396 125275 147562 3800 343490 -186628 -114394 49241
17563 174242 126312 253114 192622 144056 384782 -49902 70856 47368 31042 186954 -51813
17551 -234441 10699 286330 -22194 -226379 7319 -49689 -8746 -188954 -93400 162980 -71547
17539 15389 -130862 -290461 139622 230766 10770 1675 -17491 177781 -91547 -44442 400845
17527 21213 -178019 194284 274655 15976 283618 22239 60086 -138576 -162434 108419 28323
17515 140564 119523 206785 -53407 -205265 363952 -191228 -107225 -43560 275319 76627 69382
17504 69382 93830 85862 -117355 48502 59615 -62142 222656 320365 -165444 -228659 241952
17492 76983 -24582 -12927 77276 36701 -181454 -59881 217676 -35615 13386 -208358 110158
17480C78746j66009a12776A75758q5127a08591B1232J6252J40400q1368b1449
17469A96770g9288D1543J08146e6555a2977A61254J06874D2294b53404g8448H1278
17457B9714J16165a19943H1368J18453P0325C7106M61J60619a19177C35282A6420
17445A1304M94660a50118b0461B20300R7286A34164J11730H2220J73133R8861
17435C54214N5167b08934A46741K09345j08156k5005p778J04768j33953G9512
17424B40880G7401K73838N2977q7887B8940K87819g4052F17863G8760A6053a00756
17412b9429A26209J39897m5882J28776B3139L55043A75916h921A8808e8006j33629
17401a91635A54513j5849b65163B67386b4316D9048L7501M5815P6174b41483B5466
$$ plain form
17480 378746 212737 -112776 175758 90631 -108591 21232 37484 177884 96516 -21449
17469 196770 -79288 41543 149689 -56555 -12977 161254 268128 42294 -253404 -78448 81278
17457 29714 145879 -119943 81368 199821 270146 37106 37567 198186 -119177 335282 16420
17445 11304 505964 -150118 -20461 220300 317586 134164 245894 82220 255353 354214
17435 354214 409381 -208934 146741 356086 247930 222925 215147 319915 185962 79512
17424 240880 77401 351239 404216 316329 28940 316759 -74052 617863 78760 16053 -100756
17412 -29429 126209 266106 220224 349000 23139 378182 175916 -8921 18808 -58006 -191635
17401 -191635 154513 138664 -265163 267386 -24316 49048 86549 132364 208538 -241483 25466
17389g0925A96188e7854D0622a21461B28331g1684B3317e4453j69590C31441A50179
17377E6492J43408J46216j54698C4348K16559G4888J50293j09830l3018K37146
17367C19479M9553j77703o3255a85851B38761o4218a23944G3778c56729A75159
17356A81539q3586K13167K3823j30811A6344J09445N777C0926J38885o9790J08386
17345B08407J06747a10252b564B73080A797Q435b4410A26087F0919B4178L2003
17334E6181a15373A55066Q4418h6814A26405B7538a12411B22092J08689j27555
17324B03226b19494J4801A20702C4475J47580f2840F1678C0677M04706A86963
17313A7757P7982J24928b2727B28934B6046i4897c3245D28301e3215A39353L1042
$$ plain form
17389 -70925 196188 -57854 40622 -121461 228331 -71684 23317 -54453 -224043 331441 150179
17377 56492 199900 346116 191418 34348 250907 74888 225181 115351 82333 319479
17367 319479 369032 191329 128074 -185851 238761 174543 -123944 73778 -356729 175159
17356 181539 97953 311120 334943 204132 16344 125789 131566 30926 169811 100021 208407
17345 208407 315154 -110252 -2564 273080 1797 10232 -24410 126087 60919 24178 56181
17334 56181 -115373 155066 239484 -86814 126405 27538 -112411 222092 330781 203226
17324 203226 -219494 -204693 120702 34475 182055 -62840 61678 30677 435383 186963
17313 17757 95739 220667 -22727 228934 26046 -94897 -33245 428301 -53215 139353 170395
17302A70395c30101A73573C6510R6272p814L871O3331A4740a22427B72267A3180
17290f1469D14645i0590A1047h6217o1179d0355B11120A01172K85113C2195g640
17278B28a27253B03933G5551L27609o9813C5407i8386A52480J88336c2850A12700
17266B45976a81632A05013K29659A65895C3037e0638q33m0751A66487R4762q9048
17255A72201J73303h3560A4318c9000E4345J40029K65391F8178a3766E15571a22455
17243a9335C4594A1441M9800A5477K9955J75548r1999b56068A38827J09793A23238
17231D06779j35528n268J36740d165B0103L37301j52287m6840o5271I778N3220
17220F2998J5161K16442n8649r8788a23847A29002K57589a7112C993I11K14838
$$ plain form
17302 170395 -330101 173573 36510 132782 124968 128839 192170 14740 -122427 272267 13180
17290 -61469 414645 -90590 11047 -86217 -147396 -40355 211120 101172 386285 32195 -7640
17278 228 -127253 203933 75551 403160 333347 35407 -98386 152480 340816 -32850 112700
17266 245976 -181632 105013 334672 165895 33037 -50638 -51471 -92222 166487 261249 172201
17255 172201 345504 -83560 14318 -39000 54345 194374 459765 68178 -13766 515571 -122455
17243 -19335 34594 11441 61241 15477 45432 220980 128981 -256068 138827 248620 123238
17231 406779 271251 265983 402723 -4165 20103 357404 205117 158277 93006 9778 62998
17220 62998 78159 294601 235952 137164 -123847 129002 386591 -17112 3993 911 215749
17209B15749c84058A52641G3502L32954b01614C0261Q8980b35210a8781j05795
17199a24576A55085a11823C3370L55298A87567h484A49417K4479c3236A92936
17188C49847j57619j9831L7167r7067p204J16781B417R7917e0506C75152F7136
17176A49860R1946K97062k47315I4123R1288p3148B8845L28821a26685a2998C57301
17164B85337n8435l0978J45250B3958K46215p5458K1006J12978j60896J01665
17154B69468b5872B65768C2137K48211R734F3495B1261L50804r6177A23010M35035
17143E58045A83052K16560o5170j3482A28895J87276D0488J34587E2138a1603
17132B9314J14914J63195j1374C0491K34853r7801J36887J03536L26930l54068
$$ plain form
17209 215749 -384058 152641 73502 406456 -201614 30261 119241 -235210 -18781 -124576
17199 -124576 155085 -111823 33370 388668 187567 -8484 149417 173896 -33236 192936
17188 349847 192228 172397 209564 112497 105293 222074 2417 100334 -50506 375152 67136
17176 149860 241806 538868 291553 94123 185411 112263 28845 357666 -126685 -12998 357301
17164 285337 226902 195924 341174 23958 270173 194715 215721 328699 167803 269468
17154 269468 -25872 265768 32137 280348 290082 63495 21261 372065 275888 123010 558045
17143 558045 183052 399612 334442 320960 128895 316171 40488 175075 52138 -11603
17132 29314 144228 307423 296049 30491 265344 167543 304430 407966 734896 380828
17122C80828m5608A65872G7699L97830N9560k47595J05889R4611m7845A88015
17111A25907N3396J34532q2331j7958J19811c4755B58519O574M8365L01193C06648
17099A43361a3410C67721K03237A53384L8270Q1338J2940F6117L16480j63593
17089B19004L32354k07662i57B56540P3511A49846L59774A0455L2692J39596E5326
17077E56894d8521F96011k81571a202E11603A34719K01390A34593K84121I0445
17066B37229L63674A604N65900j42488q6526n7447a1327B98104j29902R3021b8076
17054B56418K261R9035K12157j05293K5927K8828Q0209I2064K97697m7993J58031
17043D99799l675o8864j3832n9199K50105k34383J06010A63246N79550j79031
$$ plain form
17122 380828 335220 165872 77699 475529 535089 287494 393383 487994 440149 188015
17111 125907 179303 313835 231504 213546 333357 -34755 258519 265093 313458 614651 306648
17099 143361 -13410 367721 570958 153384 191654 272992 285932 66117 382597 219004
17089 219004 551358 343696 -957 256540 330051 149846 509620 10455 43147 182743 55326
17077 556894 -48521 696011 414440 -1202 511603 134719 336109 134593 418714 90445
17066 237229 600903 1604 567504 425016 338490 281043 -11327 298104 168202 261223 -28076
17054 256418 258679 357714 569871 464578 490505 519333 599542 92064 389761 341768 499799
17043 499799 496124 427260 413428 354229 604334 369951 475961 163246 742796 563765
17033E63765q4288A8818O75956B08235J79643q0375j30629N32784B91766N3530
17023C45296K71443k85444k6383J20204J56660k04439O9027k09462N61119C44006
17012C77626r0751N64658k50783M3165j20914P7250k75535L43094k32029L0092
17002D65873Q0266m2647J98626C14253J08150O2609L82083k12306j67013n1566
16992D36210K29114l9241J35862M9946C13072J36049L6402L75057j98436B37541
16981C01839O1051M76773k95445j71182K33234k3057J05771L8035C61513L09773
16971F71286Q3101L0783j61193J68087J16011j09193N0760j73576j04931J22434
16961F93569L19858l95208J4136k9177K76876n3443p115j60180P0616M0332M13973
$$ plain form
17033 563765 479477 18818 694774 208235 387878 307503 176874 709658 291766 345296
17023 345296 616739 331295 304912 425116 581776 377337 446364 236902 798021 344006
17012 377626 286875 851533 600750 643915 523001 600251 324716 667810 435781 465873
17002 465873 546139 503492 702118 314253 422403 485012 867095 654789 487776 436210
16992 436210 665324 626083 761945 811891 313072 449121 485523 860580 662144 237541
16981 301839 362890 839663 544218 373036 606270 583213 688984 727019 361513 671286
16971 671286 754387 785170 623977 792064 908075 798882 849642 676066 571135 693569
16961 693569 1013427 618219 632355 603178 880054 826611 819496 659316 729932 770264 1184237
16950A184237l46543J87004k30001K62744n17668O05011p1812j74694k57834m4591
16940E95853N66113k55817k37582J43704j9208L07543j38836k75618K78166K45026
16930A209344m14553K11751l49663L96063k93772J94675l402N4374n7909K13L4848
16919I81969r2873j40355M48413j78989J26728m14735M94731j93741J57676k23162
16909I65662J31995J60374j17720J86976O234J7666M1700K33425m44241J46145
16899A328216r898j54553M5760J21757J74282k43999J26097n99j9880J75606J72440
16888A715229k17458j40004k6477K2752J26503J45613J1188j8915j31652O0517
16878A547296k67310M78445k09874j328r4165K97022J17920L62593k47428m21521
$$ plain form
16950 1184237 837694 1024698 794697 1057441 539773 1144784 1072972 898278 640444 595853
16940 595853 1161966 906149 668567 812271 793063 1100606 961770 686152 964318 1209344
16930 1209344 794791 1006542 656879 1052942 759170 953845 950443 1004817 946908 947121 981969
16919 981969 889096 748741 1197154 1018165 1144893 730158 1224889 1031148 1188824 965662
16909 965662 1097657 1258031 1140311 1327287 1333521 1351187 1392887 1626312 1182071 1328216
16899 1328216 1318318 1163765 1209525 1331282 1505564 1261565 1387662 1387063 1367183 1542789 1715229
16888 1715229 1497771 1357767 1331290 1354042 1480545 1626158 1637346 1618431 1486779 1547296
16878 1547296 1279986 1758431 1548557 1547229 1453064 1750086 1868006 2230599 1983171 1561650
16868A561650N91076j28304j33792j34362J91419N3276N6582r6143L54847j82729
16858B133520k33579M18018l40977M15478k30498K85391j27199o6072j59267L09708
16848B404523k3418K39863O2064k89456L80075j11437j14659J97354Q888J05646
16838B859443K52580l22578N61777l34086J7710o0129J59076J19576k88379K40506
16828C205496L85587l06846N10528j05633K64056n04221O42140k0555n2427J40153
16818D158278M7539M36436k06413K80950n6090L6252K67082o6026K20406J86624
16808E305038l13663N74037j38022K8421J70817K79070l4566N71292j1067J74511
16798F605868P5000J20019J64214L1614K17745M55399J77661J72391N13802k70726
$$ plain form
16868 1561650 2152726 2024422 1890630 1756268 1947687 2000963 2057545 1961402 2316249 2133520
16858 2133520 1899941 2317959 1976982 2392460 2161962 2447353 2320154 2254082 2094815 2404523
16848 2404523 2381105 2620968 2683032 2393576 2773651 2662214 2547555 2744909 2753797 2859443
16838 2859443 3112023 2789445 3351222 3017136 3034846 2974717 3133793 3253369 2964990 3205496
16828 3205496 3591083 3284237 3794765 3689132 3953188 3448967 4091107 4070552 4018125 4158278
16818 4158278 4205817 4642253 4435840 4716790 4660700 4696952 4964034 4898008 5118414 5305038
16808 5305038 4991375 5565412 5427390 5455811 5626628 5905698 5871132 6442424 6431357 6605868
16798 6605868 6680868 6800887 6965101 6996715 7214460 7669859 7847520 8019911 8533713 8262987
16788H262987M41968N37695k3603K43815L48275M52890K66482K92334K18805K42527
16778A1284175R7828Q54649L78619L83468J90926O73705O91059K69362P10471
16769A5534262J94665N98385J91616R26844Q23211M64548J225079M38055J252081
16760B1648746O90884J233674Q87826J033215J089343J437745J326338J347265
16752C0695036J566750J519473J775491J997732J650921K440760K173724K636127
16744D6456014K296113K977530L156614L380098L767736L754942L903554M762772
16736G4455373M554452N358780N703483N916600O050823O755613P029528P185780
16728A23010432P611360P690971P873241P716052P122505O499622N909946M765430
$$ plain form
16788 8262987 8704955 9242650 9219047 9462862 9811137 10264027 10530509 10822843 11041648 11284175
16778 11284175 11382003 12236652 12615271 12998739 13189665 13863370 14554429 14823791 15534262
16769 15534262 15728927 16327312 16518928 17445772 18268983 18733531 19958610 20396665 21648746
16760 21648746 22339630 23573304 24461130 25494345 26583688 28021433 29347771 30695036
16752 30695036 32261786 33781259 35556750 37554482 39205403 41646163 43819887 46456014
16744 46456014 48752127 51729657 54886271 58266369 62034105 65789047 69692601 74455373
16736 74455373 79009825 84368605 90072088 95988688 102039511 108795124 115824652 123010432
16728 123010432 130621792 138312763 146186004 153902056 161024561 167524183 173434129 178199559
16720A78199559M168409K177663P30404p86544k248384l803679m738307o054673
16712A67644448o741943p510491p265805p986142p993231p572537p275061p648725
16704A07650513o426007o937210n661493n418195n413585n118040m487766l935376
16696F4252841l772414l774271l295438l184806k794024k491179k590866k123093
16688D0226750k378267j987777j342553k120707j630545j066775j725426j271976
16680B6702724j218452r02951r90745j153687r64735j239832m99536l83639r04165
16671A8444982r97245q50374n13727n56713p83386k36021l93178m84239m49632
16662A3180467n90195m63743o50784l19271j97423m35610R3265n04026k80624
$$ plain form
16720 178199559 182367968 184545631 185276035 184489491 182241107 178437428 173699121 167644448
16712 167644448 160902505 153392014 146126209 138140067 130146836 122574299 115299238 107650513
16704 107650513 101224506 94287296 88625803 83207608 77794023 72675983 68188217 64252841
16696 64252841 60480427 56706156 53410718 50225912 47431888 44940709 42349843 40226750
16688 40226750 37848483 35860706 34518153 32397446 30766901 29700126 27974700 26702724
16680 26702724 25484272 24581321 23590576 22436889 21472154 20232322 19732786 19349147 18444982
16671 18444982 17447737 16597363 16083636 15526923 14743537 14507516 14114338 13630099 13180467
16662 13180467 12590272 12126529 11475745 11156474 10959051 10523441 10616706 10112680 9832056
16653I832056k52319n02832j73742p7066l87237L5180n46964l18056J28104m09477
16643G327647q6527m53751m2797q0426k02048p1492l34965k11226K0113l76613
16633E487915J21490J7770k23769q7854k92697j9228r7118p2592k67605J00490
16623D666802j74790q4586k76505r7249j06395K35609k5967k44919l07502K3976
16613C608474j72091J08481R7269m93556K96729N3158M8005o26834L82350l24622
16603B977363J54734O715r7066k41482r1075j10870J39077m15577J63593j58488
16593B326924L80938k14383O2287n0315j55292L1259l65048M48841n30720N06671
16583B441162l13526J03826k58261R3316m6570l53610J62327K14979m17476L00013
$$ plain form
16653 9832056 9579737 9076905 8903163 8826097 8438860 8474040 7927076 7609020 7737124 7327647
16643 7327647 7241120 6787369 6744572 6664146 6462098 6390606 6055641 5844415 5864528 5487915
16633 5487915 5609405 5627175 5403406 5315552 5022855 5003627 4906509 4833917 4566312 4666802
16623 4666802 4492012 4407426 4130921 4033672 3927277 4162886 4136919 3892000 3584498 3608474
16613 3608474 3436383 3544864 3642133 3148577 3445306 3498464 3546469 2919635 3301985 2977363
16603 2977363 3132097 3138812 3041746 2800264 2709189 2598319 2737396 2321819 2485412 2326924
16593 2326924 2707862 2493479 2555766 2505451 2350159 2381418 2016370 2465211 1934491 2441162
16583 2441162 2127636 2231462 1973201 2066517 2019947 1666337 1828664 2043643 1626167 1926180
16573A926180J69671j50334j60590j3738k02165j17843K01274J05321j37625N9474
16563A679625p8437j05338K92041l91475q1909K23442j71398K32339j93528r0599
16553A314763L4217L8723j22512J14119l58254M01239k72221L1508J21571j072
16543A302081k63142J63028p1706j43703K4217J38899P7084O1483J15450m83924
16533I19767Q7912J18821j31880k4209O4041k2472O2865Q7878J56269k38537j25818
16522I54637j92447J83697J16677k01836J65402N1129l04609k8917J28385K2374
16512H94492O8881q6656P0978m3068j41211J26985j0649k32792K36837D06331
16501G47574R5909l9356O9577j02587N3786l06155j88172L33704k34810j45796
$$ plain form
16573 1926180 2095851 1945517 1784927 1771189 1569024 1451181 1652455 1757776 1620151 1679625
16563 1679625 1601188 1495850 1787891 1396416 1314507 1537949 1366551 1598890 1405362 1314763
16553 1314763 1348980 1387703 1265191 1379310 1021056 1422295 1150074 1181582 1303153 1302081
16543 1302081 1038939 1201967 1130261 986558 1010775 1149674 1226758 1288241 1403691 919767
16533 919767 1007679 1126500 994620 970411 1034452 1011980 1074845 1162723 1318992 1080455 954637
16522 954637 762190 945887 1062564 860728 1026130 1077259 772650 743733 872118 894492
16512 894492 963373 876717 947695 904627 763416 890401 879752 646960 883797 406331
16501 747574 843483 804127 873704 771117 824903 518748 330576 664280 429470 283674
16491B83674L21911M5140j02297R2109l2422J20850C30902J45554K12409m601
16481F84264k90095M07772l22460N27349l1814l73516J60308j1891j27081p7553
16471E45283j13162K09161k70507K21822K95318l51431Q6114J62342k17622j26007
16461D41311L74396j79583o6116q90J6897O5672k09245B15828O8335M27924j56206
16450E55881k64491J46555A58479M29551j00419j81690L43076j04482k4414K24768
16440G44869j75055K91351A07985L45468R2265j33872J00860r4897J74052n7166
16430E34695n2111j28070j23597M16331k70004j30421L06076o7192J5211J3910
16420E14828j55148F1930M06785J39315B34852K8960k6292N6947A16704J17633
$$ plain form
16491 283674 605585 650725 548428 640537 608115 728965 330902 476456 688865 684264
16481 684264 394169 801941 479481 1006830 975016 601500 761808 749917 622836 545283
16471 545283 432121 641282 370775 592597 887915 536484 622598 784940 567318 441311
16461 441311 815707 636124 570008 569118 586015 651687 442442 215828 284163 712087 555881
16450 555881 291390 437945 158479 588030 487611 305921 648997 544515 520101 744869
16440 744869 569814 861165 107985 453453 545718 411846 512706 417809 591861 534695
16430 534695 482584 354514 230917 647248 377244 246823 552899 485707 500918 514828
16420 514828 359680 61930 468715 608030 234852 263812 237520 294467 116704 234337
16410B34337L12474B47584K92793m2504K15646j50489k57992L9511R903c1225
16399E26861k16897m5891N9886A20941K5119J99077J65281k34344j12333K15490
16389C79231M9626B04185J03081q1962K0023J76644j50045o2220N209J97789j03837
16378C08867j24662M8054J83653j75094L28560k32699K5841J13518L1918k13226
16368B94730H1465K35666J35026j63884L27359k45473E953J32870J33295K51661
16358E23779j94744k5429K14510j43561j58183L09655A52818p3136K31656M78486
16348G89824k11095B3899L41648M6032A83670i662j28619B54889L4140M1922e4165
16336I8266O9824K32793p8796Q3240A65183n0913f1459A6873N13616A52636Q4804
$$ plain form
16410 234337 546811 247584 540377 497873 713519 563030 305038 344549 354452 -31225
16399 526861 309964 264073 323959 120941 146060 345137 510418 276074 163741 379231
16389 379231 428857 204185 307266 225304 245327 421971 271926 209706 214915 412704 308867
16378 308867 184205 232259 415912 240818 569378 336679 362520 476038 507956 294730
16368 294730 81465 317131 452157 288273 615632 370159 5953 138823 272118 523779
16358 523779 329035 303606 518116 374555 216372 526027 152818 79682 311338 789824
16348 789824 578729 23899 365547 411579 183670 -9662 -138281 254889 289029 330951 -54165
16336 98266 168090 400883 322087 405327 165183 114270 -61459 16873 530489 152636 237440
16325B37440D1263J89231L0053A09051j4017R6332j9498L56569b01831r068B38754
16313D3563L7117R2017R2292a47529P3554B67477b4805E40795j97817A29927L83567
16302E13494k23160r5925q8898K62812B3744O4584N5447L1757J08636A02401N6482
16291A58883l812K13137b6579o3191p8798A71118n7509R5655b6300A91905N4590
16280B46495m3530M478b6343C45054j49709P9357J45868A14954N2444O5777k8039
16269B05136o7805J82938A22666J35478B1469J82345M5441N0919K4680p1193I4860
16257B64052E8901e5942J7567n0374J2857B49151J4603E1175j106e0884A90471
16245A43267n6355K09689j32902D9426J22253M5421I260K41802k8049n7507b13664
$$ plain form
16325 237440 41263 230494 260547 109051 95034 191366 171868 528437 -201831 -210899 238754
16313 43563 80680 172697 264989 -147529 -73975 267477 -24805 540795 342978 129927 513494
16302 513494 290334 194409 105511 368323 23744 88328 143775 175532 284168 102401 158883
16291 158883 155071 368208 -26579 -89770 -168568 171118 113609 209264 -26300 191905 246495
16280 246495 202965 207443 -26343 345054 195345 274702 420570 114954 167398 233175 205136
16269 205136 137331 320269 122666 258144 21469 203814 249255 300174 324854 253661 94860
16257 264052 58901 -55942 -38375 -88749 -75892 249151 263754 51175 50069 -50884 190471
16245 143267 86912 296601 163699 49426 171679 217100 9260 251062 223013 165506 -213664
16233B65002a17788G1659J69888a99815A21276M3614J88862p8218b12634A8229
16222C7747P8169b1716A0088K44610j10570k6984L10167b7647H1355F657L0991
16211C7648J25015a17179F8028L4388b03841C4338K65474i3781A18657l5679j3596
16200F9382K20395G1186c0236n2108A80808A792Q8207A7799K76196G9903a56120
16188a67253g8749j03315J6767E04641b39489B10084A04628h379n6528m6168I7910
16176A47011f6742F5010P5484f1237A10948j7375N998m3483a09857r5695A44980
16164A98783c3404j02478c7032A81620K1381d2110B07848G6355d6432j29962A02076
16152A69365a56867A19552J13485H5430J03386a19429m456M8177C5741a35551
$$ plain form
16233 265002 -117788 71659 241547 -199815 121276 164890 353752 275534 -212634 18229
16222 37747 115916 -21716 10088 254698 144128 117144 427311 -27647 81355 6657 37648
16211 37648 162663 -117179 68028 102416 -203841 34338 299812 -93781 118657 82978 69382
16200 69382 289777 71186 -30236 -82344 180808 1792 89999 17799 293995 79903 -156120
16188 -167253 -78749 -182064 -165297 504641 -239489 210084 104628 -8379 -64907 -111075 97910
16176 147011 -66742 65010 140494 -61237 110948 93573 99571 56088 -109857 -205552 144980
16164 198783 -33404 -135882 -37032 181620 203001 -42110 207848 76355 -46432 -176394 102076
16152 169365 -156867 119552 233037 85430 188816 -119429 -123885 -75708 35741 -135551
16141f0281j5026C92036d7020p1414A97434D9419g0533a2242A42612k1533k7520
16130I3559l4448O5751i9439A17355A2135a04515C10972a51976e9978j46729b5467
16118B22760a00936H1900a98334A92139m7836b44575H3028b26121k8201H3324
16107a69794A17060h70A7568e3610H238K27184o8145K90951m9888a53320b8869
16095b81284a14997a9523O12A59435a24584o2532n5218j06292a63665A36927M8501
16084A85428J07943g1042A03815K11364a94324B82521C9725K19591F4409k2792
16074D1617a48427B34298I8021J66140b3160j10979j71741c7037j88597j1018
16064b36652k4067b7787k14259E2172a87953G5897J80270C8360K15840h9942D5438
$$ plain form
16141 -60281 -75307 392036 -47020 -118434 197434 49419 -70533 -12242 142612 121079 93559
16130 93559 59111 124862 -99439 117355 12135 -104515 310972 -151976 -59978 -206707 -25467
16118 222760 -100936 81900 -198334 192139 144303 -244575 83028 -226121 -254322 83324
16107 -169794 117060 -870 17568 -53610 8238 235422 167277 458228 408340 -153320 -28869
16095 -281284 -114997 -19523 -18911 159435 -124584 -187116 -242334 -348626 -163665 136927 185428
16084 185428 293371 -71042 103815 315179 -194324 282521 39725 259316 64409 41617
16074 41617 -148427 234298 98021 264161 -23160 -134139 -305880 -37037 -225634 -236652
16064 -236652 -260719 -27787 -242046 52172 -187953 75897 256167 38360 254200 -89942 45438
16052a27748c121j48127c9636B03625a1261n2726j5153E7417J19747B2518K1645
16041D4163J12592b99980e8802k05219J28382k9282N6895j28413B8293P535p904
16030B7924N5849a06429A96846a71159A41482a78505B04165o8238E9909a32157
16019b8408N929A03769g64j50585q4226K0433c685j51005a6768p88A2823l201
16007I622N7820o84b2001A05209a83754F9011J60898q9655K0596f4772j89222
15996b53994A42571i2580m8508A9364g8880L4060A40086b07502h8513j76339F3428
15984g878B59343r9840A73i9655A5876M25931h3755B24016k0415L518b20259d7952
15971h813j82386B8591N6969c8355l547B0865J58780G2839h5526A69666h3030
$$ plain form
16052 -127748 -3121 -151248 -39636 203625 -11261 -63987 -79140 57417 177164 22518 44163
16041 44163 156755 -299980 -58802 -264021 -135639 -164921 -108026 -236439 28293 35828 27924
16030 27924 83773 -106429 196846 -171159 141482 -178505 204165 135927 59909 -132157
16019 -28408 -22479 103769 -764 -151349 -235575 -215142 -3685 -154690 -16768 -17556 12823 9622
16007 9622 67442 66758 -22001 105209 -183754 69011 229909 140254 160850 -64772 -253994
15996 -253994 142571 -92580 -141088 19364 -78880 -44820 140086 -207502 -88513 -264852 63428
15984 -7878 259343 159503 173 -99655 15876 441807 -83755 224016 203601 207119 -220259 -47952
15971 -8813 -191199 28591 85560 -38355 -41902 20865 179645 72839 -85526 169666 -83030
15959D4720e6247A71936b2590B42363a93862B08007c47425B65549c03756a22432
15948A20607P2238h8688l34348a75124P1450B6376J97080c88616a67500E15R4552
15937I5067f6293m5583e2527C24545A1945c15472g4044B61208a23602j41680J19061
15926a46221M6208B74476B6755f653B21152a18665A17963k2043a03531j90854
15916b94385F5328e9674k76034A88708a08673l5646d7145j14607A5015a57848
15905A46953g2352l9136j5619B0901b88989J09922c0980C23292i2552A16942c41468
15893A70678e4235H6296i1885p6861P1682m0868f195j16536e0213o1390K6760
15882h4843B02199P7876a62520B65387M4621b86681R7581B09663a23468F1801
$$ plain form
15959 44720 -56247 171936 -22590 242363 -193862 208007 -347425 265549 -303756 -122432
15948 120607 192845 -88688 -423036 -175124 -103674 26376 223456 -388616 -167500 515 95067
15937 95067 -66293 -111876 -52527 324545 11945 -315472 -74044 261208 -123602 -265282 -146221
15926 -146221 -100013 274476 26755 -6653 221152 -118665 117963 95920 -103531 -294385
15916 -294385 65328 -59674 -335708 188708 -108673 -144319 -47145 -161752 15015 -157848
15905 146953 -72352 -111488 -127107 20901 -288989 -179067 -30980 323292 -92552 116942 -341468
15893 170678 -54235 86296 -91885 -168746 -97064 -137932 -6195 -122731 -50213 -111603 -84843
15882 -84843 202199 280075 -162520 265387 310008 -286681 -189100 209663 -123468 61801
15871C08747g0343A43384a36798r2589Q1680G3166N9089a43221A19027a91015
15860b19644c1447j64460A02914k8893a84851c0967j35269a4077p3190A09906
15849A91841D0984a08740A86569H5991b81119f1635j93647J22864Q872A15913
15838A35693E7464J27014p6434J6650b79439E1416a94732C4599p965c2215J4499
15827a7716F9056b42201Q0323B9975c94522A3654a6559A9351a47873A04755a59841
15815b22638M7146b576l6139D9455a72579f4717B926O8067B3541N2229b90749
15803I0021i9196d5976r2867C6075J06339a79495P7915d7368A82255n563j7785
15792A58907a44302A74203o4472J08329p8728e1398H3291B170e2832l35962B08421
$$ plain form
15871 308747 -70343 143384 -136798 -229387 -147707 73166 132255 -143221 119027 -191015
15860 -219644 -31447 -195907 102914 74021 -184851 -30967 -166236 -14077 -87267 109906
15849 191841 40984 -108740 186569 85991 -281119 -61635 -255282 -132418 -123546 115913
15838 135693 57464 184478 108044 124694 -279439 51416 -194732 34599 26634 -32215 -17716
15827 -17716 69056 -242201 -161878 29975 -394522 13654 -16559 19351 -147873 104755 -159841
15815 -222638 -175492 -2576 -38715 49455 -172579 -64717 2926 70993 23541 75770 -290749
15803 90021 -99196 -45976 -138843 36075 142414 -179495 -101580 -47368 182255 176692 158907
15792 158907 -144302 174203 109731 218060 139332 -51398 83291 2170 -52832 -388794 208421
15780B18953a62916b5712k81063n7924a70861B82502j36783K70263C5545a45957
15769G5224a75904R983G9032b0909A16016B3597M83141h7412H5206b30106E3302
15757C22181j46558a63796r5905j9777c8661G9650g0429A6406L47206E9863b45845
15745b72326E3143a47988A84442M1865a52146K7402r8675a6565k26983o7659B89318
15733e0038B5252J69814o2212n8869B3542a69556r2340b7312C8860b38785D3040
15721A34238a47376r4701a19563r8521K0758N1177B317K09121a15269E3570c3379
15709A78265a78144a4550n19670e6333k32490J13939M2450A6503l083L7475a06368
15697F6343Q0180b50758Q7176g375A46273F3585e5615A1600a39243M3779d2752
$$ plain form
15780 218953 -162916 -25712 -306775 -364699 -170861 282502 145719 415982 35545 -145957
15769 75224 -175904 -165921 79032 -20909 116016 23597 506738 -87412 85206 -230106 53302
15757 322181 175623 -163796 -259701 -279478 -38661 79650 -70429 16406 363612 59863 -245845
15745 -272326 53143 -147988 184442 226307 -152146 -124744 -223419 -16565 -243548 -311207 289318
15733 -50038 25252 195066 132854 73985 23542 -169556 -261896 -27312 38860 -238785 43040
15721 134238 -147376 -242077 -119563 -218084 -197326 -146149 2317 211438 -115269 53570 -33379
15709 178265 -178144 -14550 -534220 -56333 -288823 -174884 -132434 16503 13420 50895 -106368
15697 66343 146523 -250758 -163582 -7375 146273 63585 -55615 11600 -139243 -95464 -42752
15685H0174c22168B24038a66540h1529l3673j73090M8308a10865M4339l43245
15675d09771A24344a6207k98251e6855F4454K01028M5057O0912r7745d7699A09526
15663B3579K04802b69792A98304a71355E9138J10664a95312r8987M7058j30819
15653c78060a67532B1734O941L49903A28650b8524q0341e1847m6133c2301A59578
15641b2115A07586a5112O89A33617j57k5015k0669l2465a44016A50969a88330
15629b67143g9603J9237i548j34080H1552k5001K48779i0481F34g5354l1362n8677
15617a65393e4115B12869i3314A4733a03221H1862a43049j8961p3147G2192m799
15606F7393a68059O5000k51274c0973D381a05995o5917g4696E3423J30333a05291
$$ plain form
15685 80174 -322168 224038 -166540 -81529 -115202 -288292 -239984 -110865 -66526 -409771
15675 -409771 124344 -16207 -314458 -56855 64454 265482 310539 371451 273706 -47699 109526
15663 23579 228381 -269792 198304 -171355 59138 169802 -195312 -294299 -247241 -378060
15653 -378060 -167532 21734 28675 378578 128650 -28524 -108865 -51847 -97980 -32301 159578
15641 -22115 107586 -15112 -14423 133617 133460 108445 87776 55311 -144016 150969 -188330
15629 -267143 -79603 -60366 -9548 -143628 81552 56551 305330 -90481 634 -75354 -106716 -165393
15617 -165393 -54115 212869 -93314 14733 -103221 81862 -143049 -162010 -235157 72192 67393
15606 67393 -168059 -103059 -354333 -30973 4381 -105995 -171912 -74696 53423 183756 -105291
15594D2748a77707F408J23821b8892o5668A18789d5058A98061a3160p8950A20063
15582a38062j65201A752R4648Q3399a49951K1034A0598J17652c97558A96829q6606
15571A10223b71391k3954E0958O9614b7640r1651H0953b11846c2281j49129A90753
15559A57089E4856J35973a8722A32275P86J23583J19748A50091a23986L9635E6030
15547I7103m0378J25663c1470I2444J08746F0295B6289i1561K3449g425A66915
15535G463O6477M0349a46096k7281p8823i7221n5333r4238f9051j40559A78767
15523a33030A8803O9621K04129c99055F7772j7318a26496b7236r5032A75497F9151
15511a36320E3847b90047B6504J14395c15128M8420E1163g745j86023P5880j34101
$$ plain form
15594 42748 -177707 6408 130229 -28892 -94560 118789 -45058 198061 -13160 -92110 120063
15582 -138062 -303263 1752 96400 179799 -149951 -128917 10598 128250 -397558 196829 110223
15571 110223 -271391 -295345 50958 120572 -27640 -119291 80953 -211846 -32281 -181410 190753
15559 157089 54856 190829 -18722 132275 133061 256644 376392 150091 -123986 -84351 56030
15547 97103 56725 182388 -31470 92444 201190 60295 26289 -91561 -68112 -7425 166915
15535 7463 73940 114289 -146096 -173377 -252200 -97221 -152554 -246792 -69051 -209610 178767
15523 -133030 18803 88424 292553 -399055 67772 50454 -126496 -27236 -122268 175497 69151
15511 -136320 53847 -290047 26504 140899 -315128 -266708 51163 -7745 -193768 -117888 -251989
15500b51989C7800N2634b86127a41745O9422j0361A95772a48110j85730a6487
15489A65999A3829e5082k84240A09641d9640B06340n153c52137d1878m789D804
15477a79435O5177p666j7168K1747O785a7846h709j2490k20502a18170J1405r8254
15465b05019G9026R4489B838f1420A24893D9424M6331l9156i7991d3083D29639
15453b66763B0377b16630K9036f1118j45288A10888L42n258k8435C2390R3393
15442A25783c8410l3777j93574R2634e2065C39208j16341F627K72913d0774B18895
15430a52055r5178A74613A028b87455a02728A579f3233j2820B14725b6042A9331
15418B50050q9124J20213C8007I46J16458a74276R701B4849R5830J063c40037
$$ plain form
15500 -251989 37800 90434 -286127 -141745 -72323 -82684 195772 -148110 -333840 -16487
15489 165999 13829 -55082 -339322 109641 -49640 206340 201187 -352137 -41878 -46667 4804
15477 -179435 -114258 -121924 -139092 -117345 -110560 -17846 -8709 -21199 -241701 -118170 -106765 -205019
15465 -205019 79026 173515 2838 -61420 124893 49424 95755 56599 -97991 -43083 429639
15453 -266763 20377 -216630 -187594 -61118 -206406 110888 111230 105972 77537 32390 125783
15442 125783 -38410 -72187 -265761 -173127 -52065 339208 222867 6627 279540 -40774 218895
15430 -152055 -247233 174613 1028 -287455 -102728 1579 -63233 -76053 214725 -26042 19331
15418 250050 160926 281139 38007 946 117404 -174276 -164575 24849 120679 121742 -340037
15406a3227r0544A51206a82908O4200q7603g4689j5251c3859j29210f6562r6136
15395a62698f3222l1893b2757A71656D5629c99633I4938C7420r721K5304b64368
15383a91797A05888G31f39k39306i4765L3744C06838a22414k0345f6617A56198
15371a32892C07927C4083K0056a09406r2040E4807N3518f9621A52889a65738g5461
15359D782a86587N6867j22703F2818g54F2986J838M7376q937b32869A5193a9370
15346d1777A8319a20369j79238d3396k72617K4637K0332I0449J3433P4581a48705
15334F106c5440D6880A0460g6354B285L29755f4295j06783Q5328A09067J88548
15323B97615b30027A34916M1444C8483J77568q9960J60224o9659A3695J70060
$$ plain form
15406 -13227 -103771 151206 -182908 -118708 -206311 -74689 -89940 -33859 -163069 -66562 -162698
15395 -162698 -63222 -95115 -22757 171656 45629 -399633 94938 37420 27699 53003 -264368
15383 -191797 105888 731 -639 -239945 -94765 -61021 306838 -122414 -142759 -66617 156198
15371 -132892 307927 34083 54139 -109406 -201446 54807 108325 -69621 152889 -165738 -75461
15359 4782 -186587 -129720 -252423 62818 -754 62986 64824 112200 103263 -232869 15193 -19370
15346 -41777 18319 -120369 -299607 -43396 -316013 -291376 -271044 90449 103882 178463 -148705
15334 6106 -35440 46880 10460 -76354 2285 332040 -64295 -171078 -85750 109067 297615
15323 297615 -230027 134916 176360 38483 216051 126091 286315 216656 13695 183755
15313A83755H6533J04115b05966M173K6299C25724c2379l06569G8018a93860B16078
15301d2753j91105F198L63576a66779c1185j86589N3324B46834b88736g1911B17417
15289A63704M4281b12697A77063c1289a0028G6970g7784B17476b69600A16869
15278A44782e1467B65316L7031D4996P9624K76927i9752K1394D4756e0638E1013
15266D0975a77884A6095J04555l0845E981K64569a68765e5294B02342k0804a69677
15254b6150G9139B5253J15299L72362N21335P9644l73974P24096n61034A51012
15243C02850j08357M9274o9016c68913J63921F2622J7744J56599a73099A32706
15232A24217j5399b14184J03277B55a2185p4428B67324a43862C3935M8972b07024
$$ plain form
15313 183755 86533 190648 -205966 -201793 -175494 325724 -32379 -338948 78018 -193860 216078
15301 -42753 -233858 6198 369774 -166779 -31185 -217774 -164450 246834 -288736 -71911 217417
15289 163704 207985 -212697 177063 -31289 -10028 76970 -77784 217476 -269600 116869
15278 144782 -51467 265316 302347 44996 124620 401547 -99752 -78358 44756 -50638 51013
15266 40975 -177884 16095 120650 89805 5981 270550 -168765 -55294 202342 181538 -169677
15254 -26150 79139 25253 140552 512914 1034249 1113893 739919 1464015 902981 151012
15243 302850 194493 243767 174751 -368913 -204992 62622 80366 236965 -173099 132706
15232 124217 108818 -214184 -110907 255 -12185 -86613 267324 -143862 33935 82907 -207024
15220b34510B52722c331p8363E82J1924b75360g893A76824a47966c1148B69548
15208e9202C17922j36786a48047B19742C2168g3166L5366k26967P3954d5615r925
15197e5540r6285A0982b69454H5824l1267L3856C3040K72082d7169A29443O5234
15186A94677p2859J5104h0929A84903G012J73691D0813b95990i8949H338a30744
15174c1825A73474b52700A5168i5674B18142B8825b078A37858g8380a7593A16485
15162A85170q3398P4802o4992J6243K5302a12315o2664j54652D9382P2266c0670
15150B5453c0217j23015L8718m4210J7817A63506P2247F7900a584k05765D0689
15138A91324B7443k694b37762E0058J57967a22005H2301n717b3836m7712H6960
$$ plain form
15220 -234510 252722 -3331 -81694 582 12506 -275360 -7893 176824 -147966 -31148 269548
15208 -59202 317922 181136 -148047 219742 32168 -73166 -37800 -264767 -190813 -45615 -55540
15197 -55540 -151825 10982 -269454 85824 54557 88413 33040 305122 -47169 129443 194677
15186 194677 121818 136922 -80929 184903 7012 180703 40813 -295990 -98949 8338 -130744
15174 -31825 173474 -252700 15168 -95674 218142 28825 -2078 137858 -78380 -17593 116485
15162 185170 101772 176574 111582 127825 153127 -112315 -174979 -329631 49382 121648 -30670
15150 25453 -30217 -153232 -114514 -158724 -140907 163506 235753 67900 -1584 -207349 40689
15138 191324 27443 24749 -237762 50058 208025 -122005 82301 76584 -23836 -71548 86960
15126c12930C48915A04133a9994A64250h7161A65632m4620d604A31391A3548a1155
15114d03016A83937K63056A51670D0335R5132l8923a30147D68446c16577C383
15103c5066A05791L32098c3967B54886a68682B31391L1692b01119n1756J08777
15093a44098N7323B17921j00682J12514i3708D4347K98101g9889j13600B16916
15082A32559e2567j12994F28301D5662j987J49792r007j1227A8702G049J93920
15071B00969l8573b43712A22669P1517I75J95552J7345a46729l2604f9003F9886
15059c15095d4220j57294F6485J69426C8790a60046C8330K85292R8184l4492F1062
15047b40640A84615h4628K951E22385A30705i7252A73654a0760j09974F0631J75467
$$ plain form
15126 -312930 348915 104133 -19994 164250 -87161 165632 121012 -4604 131391 13548 -11155
15114 -403016 183937 446993 151670 40335 135467 96544 -130147 468446 -316577 3383
15103 -35066 105791 437889 -33967 254886 -168682 231391 263083 -201119 -252875 -144098
15093 -144098 -86775 217921 117239 229753 -93708 44347 342448 -79889 -193489 216916
15082 132559 -52567 -165561 628301 45662 43675 193467 184460 173233 18702 7049 200969
15071 200969 162396 -243712 122669 194186 975 196527 213872 -146729 -179333 -69003 69886
15059 -315095 -44220 -201514 66485 235911 38790 -160046 38330 323622 421806 387314 61062
15047 -240640 184615 -84628 -81677 522385 130705 -97252 173654 -10760 -120734 60631 236098
15036B36098b4116A91298R5498i9625D36569A39475J17060A18186i8326A47732
15025C9855a50194C5338J62003E1676A8448J32323H268L64195A01261j6142K18282
15014C03401J20492b05756A42650n4000A0265a05068A52233J84488J6289G8469
15003G9461d6546K0912C55830j45406l8816o2320K05460a43599B68863k0309J11048
14992C59602H9217a7134G0711J51497F4522q69k6487Q6258i082j74087D63681
14980A18858N5582K05008E5652A7729J39250J2514M7252P945L984j03020P6752
14969B02406J4962n7901j9972k4156K25093a18767f75I8853D6625R3492p200J01275
14957B34192L5068J30968D5861L48675B0102K09469K6l8793l7668K21691n0377
$$ plain form
15036 236098 -24116 191298 286796 -99625 436569 139475 256535 118186 -98326 147732
15025 39855 -150194 35338 197341 51676 18448 150771 8268 372463 101261 85119 303401
15014 303401 423893 -205756 142650 88650 10265 -105068 152233 336721 353010 78469
15003 79461 -46546 -25634 355830 210424 171608 109288 314748 -143599 268863 248554 359602
14992 359602 89217 -17134 70711 222208 64522 63653 37166 123424 -9082 -183169 463681
14980 118858 174440 379448 55652 17729 156979 169493 216745 224690 228674 125654 202406
14969 202406 217368 159467 139495 115339 340432 -118767 -675 98853 46625 140117 132917 234192
14957 234192 269260 400228 45861 394536 20102 229571 229597 190804 153136 374827 324450
14946C24450H3120J06024b5834C37432p0809e5946B39188A00956b1310C22004
14935G1268J05830L6111L6105a67662A05563N7040M2317R8278j06991J73819J38976
14924E09002n7551A62181a67921B32991f9511A50515L04835j42441A8928L55918
14914C74846n5202j6949j02542J69900K84153C09852n5578K01799b6851C91671
14903H6057J45957O9585J64656B33021D7149h909E154J16718L20565J27571A10256
14891D46473j59609a20507A67448K6612K29067k0287A78211J12007J98106L6777
14881E25101j88638A61201K12640F7181L41070J86016B37952L50896f4616D13757
14870E18805F6323R5315P4233K46066B05138K09749F3568J62630J61748K1625
$$ plain form
14946 324450 83120 189144 -25834 337432 266623 -55946 239188 100956 -21310 322004
14935 71268 177098 213209 249314 -167662 105563 162603 204920 303198 196207 370026 509002
14924 509002 451451 162181 -167921 232991 -69511 150515 455350 312909 18928 374846
14914 374846 319644 302695 200153 370053 654206 309852 254274 456073 -26851 391671
14903 86057 232014 301599 466255 233021 47149 -8909 5154 121872 442437 570008 110256
14891 446473 286864 -120507 167448 194060 423127 402840 178211 290218 488324 525101
14881 525101 336463 161201 373841 67181 408251 594267 237952 588848 -64616 413757
14870 518805 66323 161638 235871 481937 205138 414887 63568 226198 387946 409571
14860D09571m7351b1759B25228M5373F8272K10717A26101j0995L14430K5022A92685
14848B46078L8766P2420D3075J67309J51859P2213B11881F958K71200j6171j19087
14837A42900L35245B07793r3284J49831l2006L4622K25745q6235j2901n6201L55022
14826F92386k74964L875A01404N9628K53898A75270L2493H0623L22273j51562
14816B51334K23130J49380A96973K01970K6202A67959K01408K13289k08695j30521
14806B43440O6187j09522L14534B40754J77959F0986L53191K9667J32541L3909
14796F10294A98774J5711K99286n2553j70007j39345F88L62227m516M91314l11605
14785E38108B17517J66719l5379K09286j01793j32705J28722o1826J87043j65821
$$ plain form
14860 409571 362220 -21759 225228 270601 68272 278989 126101 115106 429536 454558 192685
14848 246078 284844 357264 43075 210384 362243 434456 211881 6958 278158 261987 142900
14837 142900 478145 207793 114509 264340 232334 266956 492701 406466 393565 337364 692386
14826 692386 417422 421297 101404 161032 414930 175270 207763 80623 402896 251334
14816 251334 474464 623844 196973 398943 425145 167959 369367 582656 373961 243440
14806 243440 309627 200105 514639 240754 418713 60986 414177 443844 576385 610294
14796 610294 198774 214485 513771 461218 291211 151866 688 362915 358399 849713 538108
14785 538108 217517 384236 348857 558143 456350 323645 452367 390541 577584 411763
14775D11763l514j17280J33199M202A78697K69059L62811k82430A10059M18977
14765E29036m7866j47263K04635J14807j36177n1996k2385K21947l624j69152
14755D91962K44498I9155N08101j06653K22224k51972r5341J83215B68776K0825
14745B89601j512K03202O2880r2903k27576L67125n9633k809J65842j42596L2884
14734E94505J0074k18372j28359O39347l98201O2428j02466k3j58850L61776j80255
14723D81604N4611K53772o4821j23900j24579K62696C24193K64743R700J46769
14713G45405p7174J82235C31073J15681R0416N43509E36711K87099k24593B70361
14702D97867L39309j806l14421L00165j70064Q507K8407q8582J84463p3433J47173
$$ plain form
14775 411763 408249 290969 424168 428370 178697 447756 810567 528137 110059 529036
14765 529036 481170 333907 538542 653349 517172 465176 442791 664738 661114 491962
14755 491962 736460 99155 607256 500603 722827 470855 375514 558729 268776 289601
14745 289601 288089 491291 554171 461268 233692 600817 541184 538375 704217 561621 594505
14734 594505 604579 386207 257848 897195 498994 561422 458956 458933 300083 661859 481604
14723 481604 536215 789987 725166 601266 476687 739383 324193 588936 598636 745405
14713 745405 668231 850466 331073 446754 537170 1080679 536711 823810 599217 270361
14702 497867 837176 835370 520949 821114 651050 659557 687964 599382 783845 710412 857585
14691H57585j72235k2599L9760l1747j25244K42785j5845P6571J08383k84440
14681F72974N740k17684K66162P683J48651j41496L7449q7047j31525K39868J19626
14670I20401m52910R158n4804K81558j47159o8265K24623l5616J51012j03478
14660G24520N2869K16949R0784j29405j18129R2656j71730l8811L62737j77955
14650I04485p2995K3301J95279j53545j71222J63595O8948j51351M14961k68588
14640I52868l34746M12306K44041j46454r2028k9177j03551o6215O2702J89262
14630A089008K89945n99550L28777o9844J44050P318j82372O4638n3083J87064
14620A205951J10150m00028k85121M80536L221J9379r111J95851J76567n22476
$$ plain form
14691 857585 685350 662751 702511 670764 545520 788305 772460 849031 957414 672974
14681 672974 678714 461030 727192 734875 883526 742030 779479 692432 560907 800775 920401
14670 920401 467491 476649 421845 703403 556244 487979 712602 676986 827998 724520
14660 724520 777389 994338 1085122 955717 837588 930244 758514 719703 1082440 904485
14650 904485 831490 854791 1050070 896525 725303 888898 957846 806495 1221456 952868
14640 952868 618122 1030428 1274469 1128015 1035987 1006810 903259 837044 899746 1089008
14630 1089008 1378953 779403 1108180 1038336 1182386 1189704 1007332 1071970 1018887 1205951
14620 1205951 1316101 916073 630952 1111488 1114709 1134088 1124977 1320828 1497395 974919
14610I74919r636M96140m44041M60827J85201k05649m38734K01722j32504J63334
14600A251579r0737J31194J57330j15033k78046M41470m0032k36076L60889o0185
14590A522353m80834J36362M90963k20496m4958K19140l56545M47823k44720M05982
14580A875070k81250n7275R5663l7651l1093J28603j44434M0697N8165q9961J95526
14569A752060l393L6060J11958J55254Q6106k78975n0165J36955J51930L3143
14559B130933M41270j66886L6176L1545K10042K94712L58082O35352L76114J183517
14549E530857K207155M951575R503916J6566248p030467A2734290E596936k256522
14541C340414p95991l32951j65917l47153L7849j76929L31161l59871l9169N34408
$$ plain form
14610 974919 965283 1461423 1017382 1478209 1663410 1457761 1019027 1220749 1088245 1251579
14600 1251579 1160842 1292036 1449366 1334333 1056287 1497757 1457725 1221649 1582538 1522353
14590 1522353 1041519 1177881 1668844 1448348 1403390 1622530 1265985 1713808 1469088 1875070
14580 1875070 1593820 1536545 1632208 1594557 1563464 1692067 1547633 1588330 1646495 1556534 1752060
14569 1752060 1748667 1784727 1896685 2051939 2138045 1859070 1808905 1945860 2097790 2130933
14559 2130933 2572203 2405317 2441493 2473038 2683080 2977792 3335874 3971226 4347340 5530857
14549 5530857 7738012 12689587 22193503 38759751 31729284 12734290 5596936 3340414
14541 3340414 2544423 2211472 2045555 1698402 1736251 1559322 1890483 1530612 1491443 2025851
14531B025851n27647m135K3705N57211j18652K8710j21160K04673J19141l34754
14521A852943K16624K38861k14370J56483k08335k36080L75791K73056J26668
14512B581641p44634M91144K14588m90815j48941M58249j15868J59217N812J18775
14502B529168l35697J73059M69803k85019n7519K88808k76487L50739k09957j869
14492B645029J86661M4521j51774j40397L36147q5583J89416j3910m2180p4138
14482B893792O0071k8224N9849J81077J48757l13063J85304j00687R9024J31259
14472C317159J30373J23910o1795j22586K86384l74647M25241O2317k2488m56428
14462C307440O60976n0114o282M4485K8853k24102q7397M78125p2612n1613O8081
$$ plain form
14531 2025851 1498204 1494069 1517774 2074985 1956333 1985043 1863883 2068556 2187697 1852943
14521 1852943 2069567 2308428 2094058 2250541 2042206 1806126 2181917 2454973 2581641
14512 2581641 1837007 2328151 2542739 2051924 1902983 2361232 2245364 2404581 2410393 2529168
14502 2529168 2193471 2366530 2836333 2551314 2493795 2782603 2506116 2856855 2646898 2645029
14492 2645029 2831690 2876211 2724437 2584040 2920187 2834604 3024020 3010110 2967930 2893792
14482 2893792 2953863 2925639 2985488 3166565 3315322 3002259 3187563 3086876 3185900 3317159
14472 3317159 3447532 3571442 3509647 3387061 3673445 3298798 3724039 3786356 3763868 3307440
14462 3307440 3968416 3918302 3912020 3956505 3985358 3761256 3673859 4151984 4079372 4027759 4095840
14451D095840K80613l7125k36322j83868K87976K44356l0570L33495k1608r8326
14441D634461j39922N65354k06363J61718j32242K61939j44854P8998K27394n3142
14431E253341L38711n4277l057j33597M16961K04051k31369M14996k96000J17863
14421F027623J28673K35572j69394J33238P42223n03002K14117Q8925k328j25427
14411F770220M05769L2572J34419J87723L58258k95682M58638k28111L98420m09349
14401G812877L43533O88262l91950K14139L16452J64801k84562M45950J76204
14392I485706J75857o5040M71264o383J02671J81870M98129K55759k9828K89699
14382A1359704J77483J06222K57842M31046K83850L0241K12588J52819M26629
$$ plain form
14451 4095840 4376453 4339328 4103006 3919138 4207114 4451470 4420900 4754395 4732787 4634461
14441 4634461 4494539 5059893 4853530 5015248 4883006 5144945 5000091 5079089 5306483 5253341
14431 5253341 5592052 5537775 5534718 5401121 5818082 6022133 5790764 6205760 5909760 6027623
14421 6027623 6156296 6391868 6222474 6355712 7097935 6594933 6809050 6897975 6895647 6770220
14411 6770220 7175989 7208561 7342980 7530703 7888961 7593279 8051917 7823806 8222226 7812877
14401 7812877 8156410 8844672 8452722 8666861 8983313 9148114 8863552 9309502 9485706
14392 9485706 9661563 9596523 10067787 10061404 10164075 10345945 10844074 11099833 11070005 11359704
14382 11359704 11537187 11643409 11901251 12332297 12616147 12646388 12858976 13011795 13438424
14373A3438424K78238J84013K32797N63514J15690N73175K53051L34943L11655
14364A6285500L67899N21028J51797L81081K36539N95763L16162N24790K22502
14355A9603061P29562J75388Q03932K98319P30666N02757N22164L97542P29674
14346B4493065J024124P6156J127341O16223L92018J505174O88522P24569R61086
14337C1608278O67994J084746J118043J095144Q48705J211082J191975J334682
14329D0160649J045284J619530J150966J871610J246429J795431J706490J545449
14321E2141838K365088J424035K213111K639673K340440K327708K602277K892468
14313G0946638K726161L477255K801989L640985L704677L696736M451473M528169
$$ plain form
14373 13438424 13716662 13900675 14133472 14696986 14812676 15385851 15638902 15973845 16285500
14364 16285500 16653399 17174427 17326224 17707305 17943844 18539607 18855769 19380559 19603061
14355 19603061 20332623 20508011 21311943 21610262 22340928 22843685 23365849 23763391 24493065
14346 24493065 25517189 25593345 26720686 27336909 27728927 29234101 29922623 30647192 31608278
14337 31608278 32276272 33361018 34479061 35574205 36422910 37633992 38825967 40160649
14329 40160649 41205933 42825463 43976429 45848039 47094468 48889899 50596389 52141838
14321 52141838 54506926 55930961 58144072 60783745 63124185 65451893 68054170 70946638
14313 70946638 73672799 77150054 79952043 83593028 87297705 90994441 95445914 99974083
14305I9974083M334948N149169M962461N923571N908195N871553P370520O866570
14297A46361070P822497P998540Q470981R378041R882682J0510648J0832035J1707078
14289B22963572J2514369J2579014J3664457J3927828J4693615J5307880J5189926
14282C20840661J5723692J5735691J5573111J5284275J4210701J3717520J1987826
14275D23073477J0343841P480696K626206L06615j84120j690266l006392m982012
14267D33968045q566226j0885471j3102558j4326040j5358266j5632146j5810134
14260C40287204j6471166j6069958j6074914j5331362j4110809j3903948j3646850
14253B34678197j2813475j2177552j1256961j0905291r604850r536298q460925
$$ plain form
14305 99974083 104309031 109458200 114420661 120344232 126252427 132123980 139494500 146361070
14297 146361070 154183567 162182107 170653088 180031129 189913811 200424459 211256494 222963572
14289 222963572 235477941 248056955 261721412 275649240 290342855 305650735 320840661
14282 320840661 336564353 352300044 367873155 383157430 397368131 411085651 423073477
14275 423073477 433417318 440898014 443524220 443830835 443646715 441956449 438950057 433968045
14267 433968045 425401819 414516348 401413790 387087750 371729484 356097338 340287204
14260 340287204 323816038 307746080 291671166 276339804 262228995 248325047 234678197
14253 234678197 221864722 209687170 198430209 187524918 177920068 168383770 159922845
14246A59922845q332452p591508p031830o725221o412515n943073n607241n281621
14238A06997384l908620m820858m556496m419992l553510l561120l155128k853524
14230G6168136l388330l213594k164097k974579k505359k321836k052359k094005
14222E5453977k030393j883499j513543j563327k202218j163656j334748j752484
14214D2010109o77536j428800j415680j216672j046128j123322q99135p50264
14206C3452572p71621j107407q89398j079883o91855m98440o64433q86551q46543
14197B6016441o87991k61564r55174o75552o29037l43912o86337k69266n58862
14188B0948746n00252n88442m03032l26942r19730j22184k79251l16048l84469
$$ plain form
14246 159922845 151590393 143998885 136967055 130241834 123829319 117886246 112279005 106997384
14238 106997384 103088764 98267906 93711410 89291418 85737908 82176788 79021660 76168136
14230 76168136 72779806 69566212 67402115 64427536 61922177 59600341 57547982 55453977
14222 55453977 53423584 51540085 50026542 48463215 46260997 45097341 43762593 42010109
14214 42010109 41332573 39903773 38488093 37271421 36225293 35101971 34202836 33452572
14206 33452572 32680951 31573544 30684146 29604263 28912408 28413968 27749535 26862984 26016441
14197 26016441 25328450 25066886 24111712 23436160 22807123 22463211 21776874 21507608 20948746
14188 20948746 20448494 19860052 19457020 19130078 18210348 18088164 17808913 17492865 17108396
14179A7108396k82892o78991l241m29594m23168j23684k99058o31059l2006j91159
14169A4013544k62970k51311j83305o78726J13104n15094L04930m37223n53100
14160A1549849R685l61936j00752k26811k87876j19978N3468m39944J23499q7222
14150A0111982l38964j77469K8267l69713r469m88045L9447k2324j58928R2211
14140H706995n49647K70632k48332O944k37032l47378Q0063J54111m63286M00787
14130G773857o34662j82846k78486L30030j18196j38667k17564K94474l88481
14121F439459K41631k39483k93106N9798l25910Q0007j4605o3965J03473n60411
14111E426888L48138m58797J73275K15060m67243K90374k27867k78285k9091K3337
$$ plain form
14179 17108396 16825504 16146513 16143272 15713678 15290510 15166826 14867768 14236709 14204703 14013544
14169 14013544 13750574 13499263 13315958 12637232 12750336 12235242 12540172 12102949 11549849
14160 11549849 11559534 11197598 11096846 10870035 10582159 10462181 10515649 10075705 10199204 10111982
14150 10111982 9773018 9595549 9623816 9254103 9244634 8756589 8796036 8773712 8614784 8706995
14140 8706995 8157348 8427980 8179648 8186592 7949560 7602182 7682245 7836356 7373070 7773857
14130 7773857 7139195 6956349 6677863 7007893 6889697 6751030 6533466 6827940 6439459
14121 6439459 6681090 6441607 6148501 6208299 5882389 5962396 5947791 5883826 5987299 5426888
14111 5426888 5775026 5316229 5489504 5704564 5237321 5527695 5299828 5021543 4992452 5015789
14101E015789K75959l38775l18156L15907k30164j14463J20523j57335l61481
14092D207804J09355J95881J96398j15644j59361k56152K42714k64235j03540
14083D053220k45801L36470k02632j23654K4573K22002k17780j09001J18713n721
14073C850389l24315o4767J21132q1899L428k10117k37952J35155o7012m0860
14063C083182J80181M638q1366m82348P08164k57973J90799j05304j02909l85915
14053B751149j12035M29666l62980P7432j10545L65017l50321J1698L5381j87122
14043B547340j42458M66166k71050j24859o147O5249J8554j62180j050j48276
14033B241289J19853K89747J04329m43718J36060k39574Q3366n49303N55323K33123
$$ plain form
14101 5015789 5291748 4952973 4634817 4950724 4720560 4606097 4726620 4569285 4207804
14092 4207804 4317159 4513040 4709438 4593794 4434433 4178281 4420995 4156760 4053220
14083 4053220 3807419 4143889 3941257 3817603 3842176 4064178 3846398 3737397 3856110 3850389
14073 3850389 3526074 3461307 3582439 3500540 3503968 3293851 3055899 3191054 3124042 3083182
14063 3083182 3263363 3268001 3186635 2704287 3412451 3154478 3345277 3239973 3137064 2751149
14053 2751149 2639114 3068780 2705800 2783232 2672687 3037704 2687383 2699081 2734462 2547340
14043 2547340 2404882 2871048 2599998 2475139 2468992 2534241 2552795 2390615 2389565 2241289
14033 2241289 2361142 2650889 2755218 2311500 2447560 2207986 2291352 1742049 2297372 2530495
14023B530495l74898r2995k09779O146L96512l22961L03890q9223l58338J12250
14013A901099N164J13984j46047M5276K7610J01048p7296j43201J22379j80805
14003A769211L8296J68083J89855k06864K7320r8592K5194K0449J50467m21751
13993A661668K94023M78785j81105O75541J606493L431283Q415702J6994446k19742
13984C3157094j6517092p748162k605795j784950j046558l3853n37727O5314k69973
13975B678298k08796j48878l9249k82781J0593r6437j65969O09974n64686J76282
13965A968351J66703k53184k14683j37315L71539K6343J16877l94690k36655N96439
13955B009725m76132Q9549p8096j58207L03258k03423L4257p1161L17819k08535
$$ plain form
14023 2530495 2155597 2062602 1852823 1858969 2255481 1932520 2236410 2147187 1788849 1901099
14013 1901099 1906263 2020247 1874200 1919476 1947086 2048134 1970838 1827637 1950016 1769211
14003 1769211 1807507 1975590 2165445 1958581 1985901 1887309 1912503 1932952 2083419 1661668
13993 1661668 1955691 2434476 2253371 2928912 4535405 7966688 16382390 33376836 33157094
13984 33157094 16640002 8891840 6286045 4501095 3454537 3420684 2882957 2948271 2678298
13975 2678298 2469502 2320624 2281375 1998594 2009187 1912750 1746781 2356755 1792069 1968351
13965 1968351 2135054 1881870 1667187 1529872 1901411 1927754 2044631 1649941 1413286 2009725
13955 2009725 1533593 1623142 1545046 1386839 1690097 1486674 1520931 1449770 1767589 1559054
13945A559054j49473K28802m03028Q8411J69959j44474p3657n7654l8200M09656
13935A589396m71254Q7110K74265l06290J83499m02463N14104l175l58722K08939
13925A315409K46285j69874P9633l14636P4378j5980K13357r5399R776Q1244l16656
13914A107537M02263l90290L09708M7518l00083m0691J73690o0118l54117K00081
13904A095498p7325M57630n20863K84353l74708r7796L61138Q1781o1386j70181
13894I78141K46721j15913q8618m4206J41983l4244j95965J91670L4194k00463
13884I13300L70827k45809l2870l3899N4163k43448L07145J72092l76533M4114
13874I29082K43228k70506L3160J6685j13765M0635K02546P4214m19120l5885
$$ plain form
13945 1559054 1409581 1638383 1235355 1323766 1493725 1349251 1275594 1217940 1179740 1589396
13935 1589396 1118142 1205252 1479517 1173227 1356726 954263 1468367 1465192 1106470 1315409
13925 1315409 1561694 1391820 1471453 1156817 1231195 1215215 1428572 1333173 1342949 1424193 1107537
13914 1107537 1509800 1119510 1429218 1476736 1176653 1135962 1309652 1249534 895417 1095498
13904 1095498 1018173 1475803 954940 1239293 864585 766789 1127927 1209708 1148322 978141
13894 978141 1224862 1108949 1020331 976125 1118108 1083864 887899 1079569 1113763 913300
13884 913300 1284127 1038318 1005448 971549 1025712 782264 1089409 1261501 884968 929082
13874 929082 1172310 901804 934964 951649 837884 878519 1081065 1155279 736159 700274
13864G00274J02662K33799j34596J74083l52008K3053J58486k0272J33179k16210
13854H02450J61230j73671K01715k18949K8458O7746j52819K06927o0368k5496
13844H37223J76957m29489M1394K8528N7517k24919L49242j16k2216j21711L1827
13833G24237R2699O9208j6631j51392M6171j35021K60739l23417n7119J82522
13823F91996j68927L93297l15985J45203q7322P114q4774m4615L74301j68627
13813G41661J01032k22575M36197j41620k98122J30273m0937J56816l53237J90280
13803F99768J8886j25333N3107O9119j04529p230M3155m2974K25015j11495l05438
13792D12051J6406K74470K94013l94814J34368l0563j21142j17958B28780L41736
$$ plain form
13864 700274 802936 1036735 902139 1076222 724214 747267 905753 885481 1018660 802450
13854 802450 963680 790009 991724 772775 801233 868979 716160 923087 862719 837223
13844 837223 1014180 584691 626085 654613 712130 487211 836453 836337 814121 692410 724237
13833 724237 816936 886144 869513 718121 764292 629271 890010 566593 509474 691996
13823 691996 523069 916366 600381 745584 658262 665376 580602 535987 910288 741661
13813 741661 842693 620118 1056315 914695 616573 746846 705909 862725 509488 699768
13803 699768 718654 593321 646428 715547 611018 603788 646943 603969 828984 717489 412051
13792 412051 428457 702927 996940 602126 736494 705931 584789 466831 228780 570516
13782E70516J701P5617l16522J79249j56520L63867l23869L39187o6536L5155
13772G01845j47200O7264j07066k8766J2734k36573J87357j82187M33530m1138
13762F59800J12901k84070L78190n7704l67182M889J93320j73451p5473K49005
13752F40225j31074J08693n9879J42809k48936J97253N4253j22516B49622M04243
13742F53865k87215J07954K9950n6581j95698L95654j17736l2766j02793n9355
13732C35279r2599L66886o2165n9463q6319K84197j25337B68054M44629q3547
13722F29136B89073J23784J02647r83p6799M162B17990J58681L07319k47638O3211
13711D99563K45561J4337j55338A60860L84576j44180Q905M2205P2206B25191
$$ plain form
13782 570516 572217 647834 331312 510561 354041 717908 394039 733226 666690 701845
13772 701845 554645 621909 514843 486077 498811 262238 449595 267408 700938 659800
13762 659800 772701 488631 866821 809117 441935 446824 640144 466693 391220 640225
13752 640225 509151 617844 557965 700774 451838 649091 703344 580828 249622 653865
13742 653865 366650 474604 504554 447973 252275 647929 530193 497427 394634 335279
13732 335279 242680 609566 547401 487938 401619 685816 560479 268054 712683 629136
13722 629136 289073 412857 515504 514521 437722 441884 217990 376671 683990 436352 499563
13711 499563 745124 759461 604123 160860 545436 401256 410161 452366 524572 225191
13700E52192j67525n7596O0779m7372J47224j66299j1502P6768k5836N2153q24
13689D12162M0551N873o0565N2926J35452j22778j32308A13630K09835o2143J23111
13678C84433q582L24177l46041P0371J17355m8648J98793k10024k12849l2997
13668B35988J66519j41534L9165G5434K51668p8570M503K70962B50788a3469D62619
13656B41857J50526j61175G0863J73981J18349A27338L02095a21342e2994D61282
13645C55053j5979H8974J96603q3649L62630A54174O0456I2817J42146P4782R5119
13634D04864J31460m2098r8648G1743J32807H2520K40749K24681J92533B90680
13623B36946K06522j93374M11816j93965j80925K44686k3592G4854J58320P8492
$$ plain form
13700 552192 384667 327071 387850 340478 487702 321403 309901 386669 360833 412986 412162
13689 412162 452713 458586 398021 450947 586399 463621 331313 113630 323465 261322 384433
13678 384433 375851 700028 353987 424358 541713 493065 691858 481834 268985 235988
13668 235988 402507 260973 300138 75434 327102 248532 253035 523997 250788 -13469 462619
13656 241857 392383 231208 70863 244844 363193 127338 429433 -121342 -52994 461282
13645 355053 339074 88974 285577 201928 564558 154174 214630 92817 234963 309745 404864
13634 404864 536324 494226 395578 71743 204550 82520 323269 547950 740483 290680
13623 236946 443468 250094 661910 467945 287020 531706 508114 74854 233174 311666
13613C11666c92A37081K24874A09090K35650R3694j62861J96484j77250L04308
13603E99115B3342L41196E6582M05486A95640J85916j68523K71545k20347M3060
13593C07291J34009A93488M97257k16572j76747A512R4880L94962A21631J25924
13583B47555I1819K80287A80592a5028k0786B49253L70436B80285A35361F2360
13572A78459M78285k57148n2454J64081B42139j18514K8303J81632r3862R3918
13562C33616j23745J2422N6824J91913B32032K00478A25898k0638m9980M0709
13552I5989P9624J71661j47815l7801L03830K10121j74406j01186j4182j21075
13542B64760K82229k24737A50908O6332J21682R6445j62048h5864F3104M8115
$$ plain form
13613 311666 -392 137081 361955 109090 344740 438434 275573 472057 294807 599115
13603 599115 23342 364538 56582 462068 195640 381556 213033 484578 264231 307291
13593 307291 441300 193488 690745 474173 297426 1512 96392 491354 121631 247555
13583 247555 91819 372106 180592 -15028 -35814 249253 619689 280285 135361 62360
13572 178459 656744 399596 347142 511223 242139 123625 151928 333560 239698 333616
13562 333616 209871 222293 279117 471030 232032 432510 125898 105260 55280 95989
13552 95989 175613 347274 199459 161658 465488 675609 501203 400017 385835 264760
13542 264760 546989 322252 150908 217240 338922 435367 273319 -85864 63104 111219
13532A11219O4173L0413K16296B10150K48899j27976r6716J91100A80978J61742
13522C42720j18723J47641p2474J8094M811j5495n8272J9553A31736J50709h713
13510A99949L51657A90192q7501l3581J41653k9869a2656I459L59338r2778N5435
13499C31454K46755j64110C7941L39604A33155J58120J83480R5848A10523L00450
13489D10973B0260L32348K9151i9679A77761Q1706l6063F0309K02451A07985a17707
13477B15625d3707E70256I2795K52249A33722L5654J23074j16306a35618A40269
13466A38866K17126P9370A41884o9095J11487b8753B92050m5627o24a55848E39505
13454a24373a0990B33005o2260J07375A02463b4178C88243A91662a50178A20968
$$ plain form
13532 111219 175392 205805 422101 210150 459049 331073 234357 425457 180978 342720
13522 342720 223997 371638 299164 317258 322069 306574 248302 267855 131736 282445 -8713
13510 199949 551606 190192 102691 69110 210763 180894 -12656 9459 368797 276019 331454
13499 331454 578209 414099 37941 377545 133155 291275 474755 570603 110523 410973
13489 410973 20260 352608 381759 -99679 177761 259467 223404 60309 262760 107985 -117707
13477 215625 -43707 570256 92795 345044 133722 169376 292450 176144 -135618 140269
13466 138866 355992 435362 141884 72789 184276 -28753 292050 246423 245799 -155848 539505
13454 -124373 -10990 233005 170745 278120 102463 -24178 388243 191662 -150178 120968
13443h9011A75506o8690M7580K12611j25935r3993a3109A07793L4032B5811J21428
13432A47239P4870l5304L55914a43891A34678f3236q2972B95435A32844b3934
13421C09720o5607N3746a7244B32539m2037J47409A38265J15346J7469E8660K56160
13410C14820a86779A73043N563p2247L5092O0466k2469c4774D0541i6312c0437
13398B55794A23063K89065G3454b8547B78061J24813A96850F423P4578O3578e3640
13386B84784b42B39355K3850a7194j40730f0197C11685b4595A46304L93171k42037
13375B97438A24983A3849K29711M67813A27815J25477O9478j39966R6935p7716
13365B02023G2879a6756B58319b09104f8252A5170c37r2901B34266K47361A50293
$$ plain form
13443 -89011 175506 106816 154396 367007 241072 147079 -13109 107793 141825 25811 147239
13432 147239 222109 186805 542719 -143891 134678 -63236 -146208 295435 132844 -23934
13421 309720 244113 297859 -17244 232539 190502 337911 138265 253611 271080 58660 314820
13410 314820 -186779 173043 178606 106359 141451 201917 179448 -34774 40541 -96312 -30437
13398 255794 123063 412128 73454 -28547 278061 402874 196850 6423 81001 144579 -53640
13386 284784 -242 239355 263205 -17194 -157924 -60197 311685 -24595 146304 539475 297438
13375 297438 124983 13849 243560 711373 127815 253292 322770 182804 279739 202023
13365 202023 72879 -16756 258319 -209104 -68252 15170 -337 -93238 234266 481627 150293
13353F68016A27327J42227A4030J96187J15155l2287j25526K0336J36893A7894
13342A19959K74832d1453B42125C6989J56609I0387K07532K565q3389P6914O9811
13331C63820A44L30838j44668D8113A2455J46401J54706a04102A29752m987P502
13320A32267J00572r5059J44397l8609p2463A4602f268j33101D63973A43576P9290
13309B22866K9487A19834O5005F510K19704e6256B18921j08778J76369E1816n934
13298D5882K36848M1028H8759I813b86363C22977j1102K4882N5020I8339f3199
13286A6477a50900A22548m6143a18268A80599h550B65113c78153A12506J17606
13276B30112l137f8140i948E16509e5379F0722b22868A60794I839a2241H0476
$$ plain form
13353 668016 127327 269554 14030 210217 325372 293085 167559 187895 324788 17894
13342 119959 394791 -41453 242125 36989 193598 90387 297919 300484 217095 294009 363820
13331 363820 144 330982 186314 48113 12455 158856 313562 -104102 129752 124765 132267
13320 132267 232839 137780 282177 243568 171105 14602 -6268 -139369 463973 143576 222866
13309 222866 252353 119834 184839 6510 226214 -56256 218921 110143 286512 51816 45882
13298 45882 282730 323758 88759 9813 -286363 322977 311875 336757 391777 98339 -63199
13286 16477 -150900 122548 76405 -118268 180599 -8550 265113 -378153 112506 230112
13276 230112 226975 -68140 -9948 516509 -55379 60722 -222868 160794 9839 -12241 80476
13264A61529J38109l2969C7498K35334a09921K2316I5721a20544N0366B1005i3058
13252A12031Q1375J48629j28374k870c2635a580A1358K25904I8395r407j2849
13241G6139D511J61112O0657I3666e6252B31647G7569O2380L389L78781A6549
13229B39973a08986I5597d1020j3754D07739A26056L21874G5270c14571b3906
13218D3047b92534G964a003m84C04576J1041a65403C46280E6178d761k87679B9522
13205A13632b0621G6542M367L24659f8354C62999g78r3825L3184C08308b92383
13193B89523o8933o0480k3486n8610K79802j27991a45866N4205A4731h7600A03647
13181B25010J46609A11929g2933B64954a5400A52014h7347A38073h4028j34891
$$ plain form
13264 161529 299638 266669 37498 272832 -109921 -87605 95721 -120544 -70178 21005 -93058
13252 112031 193406 342035 213661 210791 -32635 -1580 11358 237262 98395 88988 76139
13241 76139 4511 165623 226280 93666 -56252 231647 77569 139949 143338 522119 16549
13229 239973 -108986 95597 -41020 -54774 407739 126056 447930 75270 -314571 -23906
13218 43047 -292534 7964 -1003 -1487 304576 315617 -165403 346280 56178 -4761 -292440 29522
13205 113632 -20621 76542 80909 405568 -68354 362999 -778 -94603 -61419 308308 -292383
13193 289523 220590 160110 136624 78014 357816 229825 -145866 -91661 14731 -87600 103647
13181 225010 371619 111929 -72933 264954 -15400 152014 -87347 138073 -84028 -218919
13171b18919B77796A1920M962b25427A03201K16529n3287e1653A31841C9481L44929
13160C84410D6335b686C31101A05626J38320a9195j02968H5023a28234C11595
13149a3629I0059M236B4180a65550H4222J96210C3480a06710A88061a579j33941
13138a35520E6573L22089o6018F2197J87419b64197B79256i2366q8876M7826A54346
13126i8774j29701b4029B85824a61259B01467a78621j70889A51333c4924A15566
13115A08000K1058C1214a08576F069J02222J09823I6957Q2193i6854j21052F1945
13103A01171b8733j92198A43095g8904E25366f2041A56104R4433o7628L13231
13093D96140h5008A3520J46201a84261A84954C2855J62334k4881d7382F4643b93460
$$ plain form
13171 -218919 277796 11920 16882 -225427 103201 319730 266443 -51653 131841 39481 384410
13160 384410 46335 -2686 331101 105626 243946 -19195 -122163 85023 -128234 311595
13149 -13629 90059 94295 24180 -165550 84222 280432 33480 -106710 188061 -1579 -135520
13138 -135520 56573 378662 312644 62197 249616 -264197 279256 -92366 -181242 -133416 154346
13126 -98774 -228475 -24029 285824 -161259 201467 -178621 -349510 151333 -34924 115566
13115 108000 129058 31214 -108576 6069 108291 218114 96957 179150 -96854 -217906 61945
13103 101171 -28733 -220931 143095 -78904 525366 -62041 156104 250537 182909 496140
13093 496140 -85008 13520 159721 -184261 184954 32855 195189 170308 -47382 64643 -293460
13081C30400o0540D6198J18579C5216P9911c0245B69488J83761a533A89176A4390
13069A28000A7838J7460a17626B62994J78739A25893a55960O7067C14539m3581
13059B70958I1089d4625q1511M9804E08964a63826f2378l0251B94295q3221J02071
13048C13145p7507J00013f0121A34926L4967d91j07771C21703A5173J15878K2623
13037A53674J63487N2717a06592C24635A50103i4226F6148O9320J08995c61236
13026b22866B46712a82198B14631f1926F8499h4622L860D85989B8334K93714F9781
13014F3437b1577C12010A19397L58808A16485e2299p8828c2545A56991L61665
13004E18656c3331B06359O4197C2629K27108b2981k5474A61703P8962M2348m4004
$$ plain form
13081 330400 269860 46198 164777 35216 115127 -30245 269488 453249 -1533 189176 14390
13069 128000 17838 35298 -117626 262994 441733 125893 -155960 -88893 314539 270958
13059 270958 91089 -44625 -126136 -76332 508964 -163826 -62378 -92629 294295 211074 313145
13048 313145 235638 335651 -60121 134926 169893 -491 -108262 321703 15173 131051 153674
13037 153674 317161 369878 -106592 324635 150103 -94226 66148 135468 244463 -361236
13026 -222866 246712 -182198 214631 -61926 68499 -84622 -80762 485989 28334 322048 69781
13014 63437 -21577 312010 119397 478205 116485 -52299 -131127 -32545 156991 518656
13004 518656 -33331 206359 270556 32629 259737 -22981 -48455 161703 240665 283013 239009
12993B39009A13306q588I331J55698a20180A54732b7986A22293g3407H8734a00814
12981a27376G2941M3135f6477B34790b50800f9058B21885p7761B9826N6571h9297
12969F2975a02249A37673a1736p5722C59129c7969j03618P272h175p3126C06768
12957F2257L3934K94817C0230J72995C7770e5208A89911a51033L9274j1763B44381
12945b6172B03518a83491I4537b10646f070B46512R4924A51086L7080G5650P3951
12934A49601J08731j362F7105N7141n6183k6056N0341M3556n9545K69789d4825
12922A9165a61202A40225a15292k19908a64803G5886J251a7144C76228a12015
12911A27779c8543l81357g3787a7230C1280f5384j09936L2610L0665C57694a09341
$$ plain form
12993 239009 113306 104718 9331 165029 -120180 154732 -27986 122293 -73407 88734 -100814
12981 -127376 72941 116076 -66477 234790 -250800 -69058 221885 144124 29826 86397 -89297
12969 62975 -102249 137673 -11736 -87458 359129 -37969 -141587 -134315 -8175 -81301 306768
12957 62257 96191 391008 30230 203225 37770 -55208 189911 -151033 -111759 -123522 244381
12945 -26172 203518 -183491 94537 -210646 -6070 246512 341436 151086 188166 75650 149601
12934 149601 258332 256970 67105 124246 68063 42007 92348 135904 76359 346148 -44825
12922 19165 -161202 140225 -115292 -335200 -164803 75886 77137 -17144 376228 -112015
12911 127779 -38543 -419900 -73787 -17230 31280 -65384 -175320 -142710 -112045 357694 -109341
12899h3825C5555M1421J09137h4520A56707K26900A11648k082D2040c68086A21273
12887A70214k1509o6955A0671M90216a97769B62478b12500B57374c16378A1685
12876h4816k16738D23294d3648j59529b0774E6027a56490B6428b69684A51980
12865H5035J96317g4979K4465r0141B90404D2332d10313J40340d6183B68288b16349
12853H1120K20903A00848a17733A99734J8374H7306J18086A9463b92577A51813
12842A89415a33593A62216i3977L1022A59905a00155M5744C1304J39748a25534
12831A91068i6974m4712K697A67611N6510a95684M9429N7150A09245J35797J90435
12820D35477a89527B2573O4197N6848m0119b46350J22501A43415l4643J24949
$$ plain form
12899 -83825 35555 76976 186113 -84520 156707 383607 111648 109566 42040 -368086 121273
12887 170214 148705 81750 10671 500887 -197769 262478 -212500 257374 -316378 11685
12876 -84816 -301554 423294 -43648 -203177 -20774 56027 -156490 26428 -269684 151980
12865 85035 281352 -74979 -50514 -140655 290404 42332 -410313 -269973 -46183 268288 -216349
12853 81120 302023 100848 -117733 199734 218108 87306 205392 19463 -292577 151813
12842 189415 -133593 162216 -93977 -62955 159905 -100155 -54411 31304 171052 -125534
12831 191068 -96974 -141686 -138989 167611 224121 -195684 -146255 -89105 109245 245042 435477
12820 435477 -189527 22573 86770 143618 103499 -246350 -123849 143415 108772 233721
12810B33721e879A28121h3452b5688A88526b99520F7677b48198N5854F2172P5660
12799A37832m2511m1221J54942G7051L5887j9407g5180R218C14830O6419e2013
12787B39650m5274A2532P7674B0125i876q7875d1674l3478D00203I6252a38729
12775F711J19358b97220a21519B34166j15163b53943J11201a7315j21903j16727
12765b55945D45935d1906C7620J09802l4937C3081A5318a4522j27585j72464a14600
12753e8592j96789A19293c59565c2530m14199A92174a59572A17278e2900o7067
12743a19967o2579b5832A74959k8457a31083D92555H2105B2559a6881H9990g1222
12731B56026q2263a05298B22190n2961b49256A95548I582a22655d6152B75629
$$ plain form
12810 233721 -5879 128121 -83452 -25688 188526 -299520 67677 -248198 -192344 62172 137832
12799 137832 95321 54100 209042 77051 112938 93531 -75180 -65962 314830 381249 -52013
12787 239650 194376 12532 90206 20125 -9876 -97751 -41674 -75152 400203 96252 -138729
12775 6711 126069 -297220 -121519 234166 119003 -253943 -142742 -17315 -139218 -255945
12765 -255945 445935 -41906 37620 147422 112485 33081 15318 -14522 -142107 -314571 -114600
12753 -58592 -255381 119293 -359565 -32530 -446729 192174 -159572 117278 -52900 -119967
12743 -119967 -182546 -25832 174959 146502 -131083 492555 82105 22559 -16881 89990 -71222
12731 256026 173763 -105298 222190 169229 -249256 195548 9582 -122655 -46152 275629
12720B54948C4518a13593j96299f9749C48363a05171B88768B7878L30041A77063
12709C55519A67501k3551K68258A49076h8874B39454J5919K1407b27876C64415
12698B38381A9101d9977A31668a17552A87028n1463C169K15328a2689C11588a20829
12686b27182k29176G3269K95260A64673J40239e488A62086J02973a37973B01172
12675a6507B07507F7407J45161r6676a70620m7454L3536N486e3770A14650a554
12663c42954A08763c30438H5214m1412b37194d1442E9226A7213K37152F8832b8417
12651F8426K66880q9645n0281k9972n6931K87400B5806b11907b3765C6846K62075
12640B98921G2030a35996c7749A4715L55626j26474a27011Q535C9284Q5211n6088
$$ plain form
12720 254948 34518 -113593 -309892 -69749 348363 -105171 288768 27878 357919 177063
12709 355519 167501 143950 412208 149076 -88874 239454 255373 276780 -227876 364415
12698 238381 19101 -49977 131668 -117552 187028 135565 3169 218497 -12689 311588 -120829
12686 -227182 -456358 73269 368529 164673 304912 -5488 162086 265059 -137973 201172
12675 -16507 207507 67407 212568 115892 -170620 -218074 -184538 -179052 -53770 114650 -1554
12663 -342954 108763 -330438 85214 43802 -237194 -41442 59226 17213 254365 68832 -28417
12651 68426 335306 245661 195380 165408 108477 395877 25806 -211907 -23765 36846 298921
12640 298921 72030 -135996 -37749 14715 370341 243867 -127011 -118476 39284 124495 68407
12629F8407a57798D30500b8013A84717J29211H7382J32186m4950O0726n4229p1216
12618A09899j6114N1218B7849N6132m832g8609k1668F7343m085J02841K78584
12607D44683F0748i4971H4115J33071k6465B8416J65588g1015E60J83261K35442
12596D19263a58607k2877F7723B1222N27590j03830b8195D296a62898j75638K3177
12585c15359b1024k584C8260a58903A25929a75830B84185C9213J39028o1979c4441
12573f2909k14330I0971e6979C11278H3954d32185F9592J84576H2465C1739h3084
12561a786k99862d4738H3714h4018l12628B01988i0546q1388A03451c9837B43709
12549b7191A93592C4232a57032F8256b41166d1158M403a2722A99548Q4871K459
$$ plain form
12629 68407 -157798 430500 -28013 184717 313928 87382 219568 174618 235344 181115 109899
12618 109899 93785 145003 27849 83981 79149 -78609 -100277 67343 63258 166099 444683
12607 444683 60748 -94971 84115 217186 190721 28416 194004 -71015 560 183821 419263
12596 419263 -158607 -181484 67723 21222 548812 444982 -28195 4296 -162898 -338536 -315359
12585 -315359 -21024 -23608 38260 -158903 125929 -175830 284185 39213 178241 116262 -34441
12573 -62909 -277239 90971 -56979 311278 83954 -432185 69592 254168 82465 31739 -83084
12561 -1786 -301648 -44738 83714 -84018 -396646 201988 -90546 -171934 103451 -39837 243709
12549 -27191 193592 34232 -157032 68256 -241166 -41158 -36755 -12722 199548 284419 286878
12538B86878I5013K75672E154K1361c2633a4959j09873F3628K0746O0351m8378
12527I6347M0775o3204h3962A33074f2565C37682E8019B164J47801b2637B55099
12515B2136d0845r637o4139b5918I3081A221L75469E6696f1126a8998A9611K50159
12503B69770d3536B47882a19850b1640C5997b11027O9942L1253A63983b5584j69576
12492a95160H3459a36815A07704Q7252D3226k0514J46383a09097A03812g8678
12481A16712b04985i7766j03235G6199g5000b9990J0979k7440n1433A5205J40012
12470A55217H220J32104D5806J35455b34895b6916e531j11725D48434j25317d7006
12458b57026h769C04780j31584K67439G8887Q3578b37719D8437J62299a59394
$$ plain form
12538 286878 95013 370685 5154 26515 -32633 -14959 -124832 63628 84374 144725 96347
12527 96347 137122 73918 -83962 133074 -62565 337682 58019 2164 149965 -22637 255099
12515 22136 -40845 -50482 -114621 -25918 93081 1221 376690 56696 -61126 -18998 19611 269770
12503 269770 -43536 247882 -119850 -21640 35997 -211027 -141085 -109832 163983 -25584 -195160
12492 -195160 83459 -136815 107704 194956 43226 22712 169095 -109097 103812 -78678
12481 116712 -204985 -97766 -201001 76199 -75000 -29990 -19011 -46451 -97884 15205 155217
12470 155217 8220 140324 45806 181261 -234895 -26916 -5531 -117256 448434 323117 -47006
12458 -257026 -8769 304780 173196 440635 78887 162465 -237719 48437 210736 -159394
12447A61945a70742m999B31881J3325b45622f8373r9009M6790a1520F1812J68537
12436B30349b06241M4596A01457m9102d54946b22729A82860a95203i3663A13072
12425c4192D1415A5516J8517b7857k0016A78786o4004e6779D4155d5855j13977
12414a59832A88865R3685j10397B1981P7965a16542k0792A37332a03505n0819
12404a54324J3639A17651h7344J2715I0361b6877G0780J1394R8147i138l61972
12393c71110A41093D0750a33646A51612o9227k7925N127d3195A76863h9026A6372
12381C1035K20849r9544A563b27204C06520j42599i9023l2455B28225a54384M6997
12370a07387k43760J39843M9970A64365g1980j22731j57522H8051a20317C41050
$$ plain form
12447 161945 -170742 -175741 231881 245206 -245622 -68373 -167382 -120592 -11520 61812 230349
12436 230349 -206241 -161645 101457 52355 -454946 -222729 182860 -195203 -93663 113072
12425 -34192 41415 15516 34033 -27857 -47873 178786 114782 -56779 44155 -45855 -159832
12414 -159832 188865 282550 172153 21981 99946 -116542 -137334 137332 -103505 -154324
12404 -154324 -140685 117651 -87344 -74629 90361 -26877 70780 82174 180321 -9138 -371110
12393 -371110 141093 40750 -133646 151612 82385 54460 59587 -43195 176863 -89026 16372
12381 31035 251884 152340 1563 -227204 306520 163921 -99023 -131478 228225 -154384 -107387
12370 -107387 -351147 -211304 -161334 164365 -71980 -194711 -352233 88051 -120317 341050
12359b143B21144b36594h2966A95431a10290A03043P6434C4915q567c2219A23545
12347g6364l4005B06538A5213c75643A46733a08987L985C53354L998a61544C2584
12335b1065B09241B7993K5743A9829K37175I0090h2978B5677a93617H542b21977
12323b69239D5683a96421g1479G0282a23908L2730k1936m839A934J53149p6163
12312G8920K44208A996i2612n2762N5313a0747p8108A4264K3166b52758j86275
12301d39033G5302L19652c50981f7597j91985G0446f7654a124D5780e8996C98614
12289E68324E3067b6294h198l09095D39691G4027M3183N7667l8577f0458H3129
12277A91525K23204o8284a253I2737L95923b54118C20362a42650B7173h5042B46931
$$ plain form
12359 -2143 221144 -236594 -82966 195431 -110290 103043 179477 34915 26348 -32219 123545
12347 -76364 -110369 206538 15213 -375643 146733 -108987 -105002 353354 357352 -161544 32584
12335 -21065 209241 27993 53736 19829 257004 90090 -82978 25677 -193617 8542 -221977
12323 -269239 45683 -196421 -71479 70282 -123908 -91178 -113114 -117953 1934 155083 78920
12312 78920 323128 1996 -92612 -145374 -90061 -10747 -88855 14264 37430 -252758 -439033
12301 -439033 75302 394954 -350981 -67597 -259582 70446 -67654 -1124 45780 -58996 398614
12289 568324 53067 -26294 -8198 -317293 439691 74027 117210 174877 136300 -60458 83129
12277 191525 414729 346445 -1253 92737 488660 -254118 320362 -142650 27173 -85042 246931
12265e3211A30880a55832F9229J71121a93832f6721j34132M8064H4259J71455
12255B55714n3413C9298N7470J10870m2436d3929o7148A67536a47738N227L1348
12244a11163p3967A28254j5356M4159b6273B37691L0017a03100B04127K2238p5474
12233A50891a08750H7060J70248A20857N2173B3691L01036a54438e3423E0540
12222B96886O3373j14027G7428R525L1164L34C5143K65230F8923K49235G3015
12210B30827a43556B60868P9348D4420b3580H2191J86279G6331N6924O0110Q325
12199B01690a16735D56777B26932c8507B57732E8985f183E5280P4629E7398K56120
12188C13518j56393e0593j96020B52567D0493a44345o4570B21478p4980J06606
$$ plain form
12265 -53211 130880 -155832 69229 240350 -193832 -66721 -200853 -152789 84259 255714
12255 255714 202301 39298 96768 207638 165202 -43929 -111077 167536 -147738 -142511 -111163
12244 -111163 -185130 128254 112898 157057 -26273 237691 267708 -103100 204127 226365 150891
12233 150891 -108750 87060 257308 120857 173030 23691 324727 -154438 -53423 50540
12222 296886 360259 246232 77428 86953 118117 118451 35143 300373 68923 318158 73015
12210 230827 -143556 260868 340216 44420 -23580 82191 268470 76331 133255 193365 201690
12199 201690 -116735 456777 226932 -38507 257732 58985 -6183 55280 129909 57398 313518
12188 313518 157125 -50593 -246613 252567 40493 -144345 -208915 221478 146498 253104
12178B53104r1841a5597k21375A39968a25656A58559p3456K87216a0428B68265
12167C6998b24354A65383b960C29854A34591b38305C0227K46424F7192M21120
12157D88312E5644J723a60934a2714A32331J33163C8654c63041C59255F5110J12789
12146A77899e9418I3827L1483b7610B85293h5045J220A95533B853Q5100L63447
12135D51400b3021A52804F9897M7152A0040f8578K4061p7319H7068O613c49714
12123A69272i0254B5739K8162b1821j17089H3041a13678d6960B17303a96748O9841
12112a26907A14223b75499J0825B17363o1894l7737d6225r4674A07495c7953l8015
12101g5968p0040d9327k5385h871D35620a02762b1822k63675a32839b7039j1689
$$ plain form
12178 253104 161263 -15597 -236972 139968 -125656 158559 85103 372319 -10428 268265
12167 36998 -224354 165383 -2960 329854 134591 -238305 30227 276651 67192 488312
12157 488312 55644 57367 -160934 -12714 132331 265494 38654 -363041 359255 65110 177899
12146 177899 -59418 93827 125310 -27610 285293 -85045 -83825 195533 2853 87953 451400
12135 451400 -23021 152804 69897 117049 10040 -68578 -44517 -121836 87068 93681 -349714
12123 169272 -90254 25739 53901 -21821 -138910 83041 -113678 -46960 217303 -196748 -126907
12112 -126907 114223 -275499 -264674 217363 155469 117732 -46225 -140899 107495 -37953 -75968
12101 -75968 -146008 -49327 -74712 -8871 435620 -102762 -21822 -285497 -132839 -27039 -38728
12090c8728l5715B8791a0379j84221A33602C5456a75611B6766b30527h6090E8950
12078b64647A43915J73405a69309A9360c47275a55330I4788f0230l15508I4639
12067A99126b1169B24542K17081J228709H11841C79413B5402K96674j29995A5778
12056A20071a49726l2196N669B73916E9268j1925N2928m376i3823j74764A35527
12044F1721M1815l7518a46930Q53O3031a3465B54470j11834M9458g4835R740A05021
12031d14925A66126o6276a7286F2555L74298D0322a86525P5732b9121A12712e1119
12019A67929b8852j1050A88364D9028J61622J23054A65577o4105d8415B51621
12008A37234a53582a3253A10501i4263o0234n8728L3650Q6495L0461A42369m2373
$$ plain form
12090 -38728 -74443 28791 -10379 -194600 133602 35456 -175611 26766 -230527 -86090 58950
12078 -264647 143915 317320 -169309 19360 -347275 -155330 94788 -60230 -375738 94639
12067 199126 -21169 224542 441623 1670332 811841 379413 25402 322076 192081 15778
12056 120071 -149726 -181922 -176253 273916 59268 47343 100271 95895 -93823 -268587 135527
12044 61721 103536 66018 -146930 -146077 -83046 -13465 254470 142636 192094 -74835 -65095 105021
12031 -414925 166126 99850 -17286 62555 436853 40322 -186525 -110793 -29121 112712 -51119
12019 167929 -28852 -39902 188364 49028 210650 333704 165577 101472 -48415 251621
12008 137234 -153582 -13253 110501 -94263 -154497 -213225 -179575 -93080 -62619 142369 99996
11997I9996d30163J16556i7035F4000b04915h0467L3675j16133P1269d4405G3864
11985g8394E0592A6469o437J4596K4220c11439B52084h8929j28368g6217J0081
11974f6136j48281Q9875G5491e1810A84298b57609K7330C2616g0955k04509H9435
11962b35497b9912D567b70498I7465a21805A97694n1389h3298j08165B20336h9914
11950a08845c6011A1907J42567h4950C5957L511a88972B79201i0448j02386A29848
11938F1357b19596i4700K3726l24205A8788K81503e4163A59547M9751b87835j98035
11927d85870F9000e9503o4124A28936E6921J0532K8992a15426e2990j23163A30076
11915a80453A19388a07093c3447A11553a02047j28119B1849a43096k00408i1492
$$ plain form
11997 99996 -430163 -313607 -97035 64000 -204915 -80467 -46792 -162925 -91656 -44405 73864
11985 -78394 50592 16469 10032 24628 48848 -311439 252084 -88929 -217297 -76217 -66136
11974 -66136 -214417 -124542 75491 -51810 184298 -257609 -230279 32616 -70955 -275464 89435
11962 -235497 -29912 4567 -270498 97465 -121805 197694 146305 -83298 -191463 220336 -89914
11950 -108845 -36011 11907 154474 -84950 35957 39468 -188972 279201 -90448 -192834 129848
11938 61357 -219596 -94700 -70974 -395179 18788 300291 -54163 159547 209298 -287835 -485870
11927 -485870 69000 -59503 -123627 128936 56921 67453 96445 -115426 -52990 -176153 130076
11915 -180453 119388 -107093 -33447 111553 -102047 -230166 21849 -143096 -343504 -91492
11904A66634e9870l18541H3269e4070C42975a88917g1631l7738K1054k34319A55857
11892a54229r9780a06349F12K27210g2790B31748a57649N6036j19055g4631m3326
11881a17957m429A03612a7147k18407G9911a17287B54413a06133I9888P4239g1075
11869a39098G1822K04860a73392O7770j06663j4715A40709D6098a62121g908j64966
11858a72874r1928a20493k20799i1436H0859b6808j40752B72215d12902b7863
11847I4126g2941o5733m7529O8419j31200A12997J1303h0960D9506a21403I0877
11835B90843j13992b32964N6232D9723c74495a75522N2878J6564H7142O278l5837
11824E7583c4535A91058f8822l05877b1334k00466B69355A24366B893a25591A3135
$$ plain form
11904 166634 -59870 -378411 83269 -54070 342975 -188917 -71631 -109369 -88315 -322634 155857
11892 -154229 -254009 -106349 612 227822 -72790 231748 -157649 -101613 -220668 -74631 -117957
11881 -117957 -122386 103612 -17147 -235554 79911 -117287 254413 -106133 99888 174127 -71075
11869 -139098 71822 276682 -173392 -105622 -212285 -227000 140709 46098 -162121 -7908 -172874
11858 -172874 -264802 -120493 -341292 -91436 80859 -26808 -167560 272215 -412902 -27863
11847 94126 -72941 -138674 -186203 -117784 -248984 112997 124300 -80960 49506 -121403 90877
11835 290843 176851 -232964 -176732 49723 -374495 -175522 -122644 -106080 87142 93420 57583
11824 57583 -34535 191058 -68822 -374699 -21334 -221800 269355 124366 2893 -125591 13135
11812A06942a17874B35671a781m72643i936B4928b32931A29492d1500A66722g56
11800A40915f9779O646A22745F1119J02480d4471A94596G7284J26341f6177F0962
11788a2682m8013B2a05344n22045a7878A1632a20736A927N9113L5387K7450a3099
11775A30769b27932d9564D0399b75564H5183O5585a22738A4350J25737F8971J83138
11764B52109C0439i1826E524a73582H3047b0705i489H5114p923a18685H4524n969
11752G8555c9677J9420J344n1327A687J93053K6910a44065e1964F2919O3386a5736
11739e3158n4471o4047M5153j14727I336P1950m0490K778j9297J48210m5911P7873
11727B04449a65679J7251E2283a16267n3253A1260L33176A9352b27032A60477
$$ plain form
11812 106942 -117874 235671 -1781 -474424 -9936 24928 -232931 129492 -41500 166722 -756
11800 140915 -69779 -63133 122745 61119 163599 -44471 194596 77284 203625 -66177 60962
11788 -12682 -60695 22 -105344 -627389 -17878 11632 -120736 1927 61040 96427 123877 -13099
11775 130769 -227932 -49564 40399 -275564 85183 150768 -122738 14350 140087 68971 252109
11764 252109 30439 -91826 5524 -173582 83047 -20705 -9489 85114 77191 -118685 84524 78555
11752 78555 -39677 -20257 -18913 -70240 1687 194740 221650 -144065 -51964 62919 126305 -15736
11739 -53158 -107629 -171676 -126523 -241250 9336 81286 40796 43574 24277 172487 126576 204449
11727 204449 -165679 -148428 52283 -116267 -169520 11260 344436 19352 -227032 160477
11716D33961a3942p2575D17954C2914d4611l88155D5594K78830q4977A05805l6028
11705F9777K5645J02249a04536n2214L2898e2222A4350f5359B96530j31717D9709
11693b66034D7205a37699B16848F1883L31924A91386b41929F7601L6217N322a41767
11681F9556K05905A01930K7470f7999A4860A820a16160L4530E4327j5525J45044
11670A83846R9911a0405A85319Q187a24672j42989A87652G67d9576H5480h007
11658g8323A30873P9556B4808f0486B27245E119b37349m311m8057A0129b979A56975
11645a79932F0499a20555r2495J04250M8534B60411G8041J51284J47476c6646
11634A52376a8738r6057B1966J13646R831M4724a2924A29477M8092c18156B35923
$$ plain form
11716 433961 -13942 -86517 417954 32914 -44611 -432766 45594 324424 239447 105805 69777
11705 69777 95422 197671 -104536 -156750 -123852 -52222 14350 -65359 296530 164813 49709
11693 -266034 47205 -137699 216848 61883 393807 191386 -241929 67601 103818 109140 -141767
11681 69556 275461 101930 129400 -67999 14860 1820 -116160 -81630 54327 38802 183846
11670 183846 283757 -10405 185319 193506 -124672 -267661 187652 767 -49576 85480 -8007
11658 -78323 130873 210429 24808 -60486 227245 5119 -237349 -241660 -289717 10129 -2979 156975
11645 -179932 60499 -120555 -213050 -108800 -60266 260411 78041 229325 376801 -36646
11634 152376 -18738 -114795 21966 135612 145443 190167 -12924 129477 177569 -318156 235923
11622B45126A06672D4398J71909p2420F0990a12522A21763d62682f0410H5464
11611A28088R5785l233h971A80838p0421n3046b12287A23647a43839N8570A74893
11599A32126g3806A49518a60104B52379r3250E9294a43461C42474A33975I056
11588C5214a39351E65964A27824j7018a4416j79005d9049j54493b1651k46021
11578b67672B025a17197k4808k2330C7690a3646b168k881C17981A57393a34833
11566A83670d6909A19930a79889a4299C80924a55658B01620J1158p3227B3200
11555E8764N9488j1473O48P739k6771f6404B26027A4689b7689P449j12888k8450
11543a61578D8327N7223d5573B15528F8906J70994D6890N2707N2368N2141n9609
$$ plain form
11622 245126 106672 44398 216307 143887 60990 -112522 121763 -462682 -60410 85464
11611 128088 223873 220640 -8971 180838 110417 57371 -212287 123647 -143839 -85269 174893
11599 132126 -73806 149518 -160104 252379 159129 59294 -143461 342474 133975 9056
11588 35214 -139351 565964 127824 110806 -14416 -193421 -49049 -203542 -21651 -267672
11578 -267672 2025 -117197 -142005 -164335 37690 -13646 -2168 -5049 317981 157393 -134833
11566 183670 -46909 119930 -179889 -14299 380924 -155658 201620 212778 139551 23200
11555 58764 118252 106779 107427 115166 88395 -66404 226027 14689 -27689 -20240 -133128 -161578
11543 -161578 48327 105550 -45573 215528 68906 239900 46890 99597 151965 204106 144497
11532A44497j5985A9640g803I9931K29457q5826E0810K31617C7886M161K75822
11521C17869A03870J7675J05878F6031A7934J32230P7064h654B56650R0361A37308
11509a69539A86588R7140I2877a2439E22092F7236L46071f2044I5312K90599A12109
11497a01446A67708D9241c9043A35745J16486m4722a47741A003K88930A7501b1715
11485d2280qI7474R6225q889K7366A6782b3578n747A50198J13448a23233B13213
11472a23595A39593M95640A30600Q4127e3156A53119J13867G5190J17238a86318
11461A62838E8794J20634p1067K0853M9174o9173J20951B139e2982L707A81139
11449B16048A8189h1400C14973a46322j34874c0443n4635A7005i0027D39256I8253
$$ plain form
11532 144497 128512 19640 -7803 99931 329388 243562 50810 282427 37886 42047 317869
11521 317869 103870 121545 227423 66031 17934 150164 227228 -8654 256650 347011 137308
11509 -169539 186588 283728 92877 -12439 522092 67236 413307 -62044 95312 385911 112109
11497 -101446 167708 49241 -39043 135745 252231 207509 -147741 1003 289933 17501 -21715
11485 -42280 -42288 97474 193699 184810 212176 16782 -23578 -29325 150198 263646 -123233 213213
11472 -123595 139593 635233 130600 214727 -53156 153119 266986 75190 192428 -186318
11461 162838 58794 179428 108361 129214 178388 109215 230166 2139 -52982 -49275 181139
11449 216048 18189 -81400 314973 -146322 -281196 -30443 -85078 17005 -90027 439256 98253
11437a86661I8b14765A03661J9930E1782M8281a99624D8118g8291I4326O1834
11426A56160a10436k4272F679b54720a9098j49456j55595a224B7668a03398j56404
11415b59802D6277a85010A92068f9704I9119A0468R5126J1536b6945i085j20066
11404a29151o0828L6252O1191I0222i7570C5824Q3484a52648k28092f1402K5304
11393c6098j09665B64414b62339B26994B3406a4437A92233a63763J7410C597J15583
11382A19180a24999C3798J39924Q0843j10764o7578J92689a0739B91377A08468
11371B22475F3376h6609C76001a10770F1484M4465K6234C9557b15163P5361p595
11360a47397A67155l2501A4359Q9271c65863a53432j0991O6521I5132e1084k84558
$$ plain form
11437 -186661 98 -214765 103661 123591 51782 100063 -199624 48118 -78291 94326 156160
11426 156160 -110436 -134708 6679 -254720 -19098 -168554 -324149 -1224 27668 -103398 -259802
11415 -259802 46277 -185010 192068 -69704 99119 10468 105594 117130 -26945 -9085 -129151
11404 -129151 -189979 -153727 -92536 90222 -97570 35824 119308 -152648 -380740 -61402 -36098
11393 -36098 -145763 264414 -262339 226994 23406 -14437 192233 -163763 -146353 3597 119180
11382 119180 -124999 33798 173722 254565 143801 76223 268912 -10739 291377 108468
11371 222475 63376 -86609 376001 -110770 61484 105949 132183 39557 -215163 -139802 -147397
11360 -147397 167155 134654 14359 103630 -365863 -153432 -164423 -97902 95132 -51084 -335642
11349c35642a52864A71747C549J9790K4456c1739C22703j25532c12404i6869l4610
11338a31479N8225p7637l2637c387A03710e8753j26514l039H6095b42788D8557
11326H2545a01391j74441i6611H4482b04645e8338A1775L37186c4663D5758a28620
11314c9383l69104i5190A77257a01666B22858k3115q5380E4664a48243G9110b248
11302c9188A93756A4657a87442g3697c4904l60797A08394M2427Q1339a32140f2609
11290A64342L2494o549H4296a53938E3637e9325Q801k98874A40781d4321B11133
11278a59161G3223b62373h0626l2963B42801F199O1642k6331a2072j01338A12329
11266b6812A55728g4423B16999i8730C0060b5927j86554l81327B54521i6178h708
$$ plain form
11349 -335642 -152864 171747 3549 23339 47795 -31739 322703 197171 -312404 -96869 -131479
11338 -131479 -73254 -150891 -183528 -3387 103710 -58753 -185267 -188306 86095 -242788 48557
11326 82545 -101391 -275832 -96611 84482 -204645 -58338 11775 348961 -34663 45758 -128620
11314 -39383 -408487 -95190 177257 -101666 222858 199743 114363 54664 -148243 79110 -2248
11302 -39188 193756 14657 -187442 -73697 -34904 -395701 108394 150821 232160 -132140 -62609
11290 164342 196836 190287 84296 -153938 53637 -59325 -50524 -349398 140781 -44321 211133
11278 -159161 73223 -262373 -80626 -113589 242801 6199 67841 41510 -12072 -113410 112329
11266 -26812 155728 -74423 216999 -98730 30060 -25927 -212481 -593808 254521 -96178 -8708
11254b9490k07225a01257l34600C01036a83198M9076B0150a53687j15982C8340
11243b66380E3323b06647R6086J9093p4718E4073a11930b7880A32172e2578A27914
11231F1418J75398a5349j46999g5707C5663a31476c0098E48160E3958J57226I8754
11219b5019A58663o2153k442A2064c9127j87284j21177A69522F7091a96422p7961
11208b74383P0999H5426h4706m836n5651n6625e7049J4930k28048H3624b95401
11196E4931k1776N0356K14207b05444F5129c8935a5314D6694a38574L7333q0950
11185a82191A44042b57519A52211b44034j07148F4344N4751J26330D8043f5904
11174g5531J4120A64692K19476b57635F2102c9195r4198F01P7530a8322A08410
$$ plain form
11254 -29490 -236715 -101257 -435857 301036 -183198 -134122 20150 -153687 -269669 38340
11243 -266380 53323 -206647 -110561 -91468 -166186 54073 -111930 -27880 132172 -52578 127914
11231 61418 236816 -15349 -162348 -75707 35663 -131476 -30098 548160 53958 211184 98754
11219 -25019 158663 96510 94068 12064 -39127 -226411 -347588 169522 67091 -196422 -274383
11208 -274383 -203384 85426 -84706 -89542 -145193 -201818 -57049 -42119 -270167 83624 -295401
11196 54931 33155 83511 297718 -205444 65129 -38935 -15314 46694 -138574 -101241 -182191
11185 -182191 144042 -257519 152211 -244034 -351182 64344 119095 245425 48043 -65904
11174 -75531 -61411 164692 384168 -257635 62102 -39195 -133393 601 78131 -18322 108410
11162A50212h6005B71951d2395G3401J41694b08502B8297a10782j71307c519A06663
11150D4342c8084m95653B99506F5494N0287a81972B29769a263H9636e6125B2365
11138g1168I8K40614q6112G16N6320M0402Q9865d6033J1238j54814c2670k20238
11126b52908I3949A5079M46604f3176r269l02075A16160i7930B0467a15218j60507
11115b75725A71024h0856C20858b30266G9985L1515B8187i1168j01659A01800
11104E05983C3290L19775j47232q6524J15200K246g0987L0232C54807d7461B48629
11092e5927G8389K13732b3641B65131i3290D287K49722J5185B2006J71637E0011
11080D67372F1384J47272P5560l1108H0067K29934m8174o2168q4583L7792M3944
$$ plain form
11162 150212 -86005 271951 -42395 73401 215095 -208502 28297 -110782 -282089 -3519 106663
11150 44342 -38084 -533737 299506 65494 115781 -181972 229769 -1263 89636 -56125 22365
11138 -71168 98 240712 154600 716 57036 97438 187303 -46033 -34795 -189609 -32670 -252908
11126 -252908 93949 15079 461683 -63176 -72445 -374520 116160 -97930 20467 -115218 -275725
11115 -275725 171024 -80856 320858 -230266 79985 111500 28187 -91168 -192827 101800
11104 505983 33290 353065 205833 119309 234509 236755 -70987 -40755 354807 -47461 248629
11092 -55927 78389 292121 -23641 265131 -93290 4287 254009 269194 22006 193643 50011
11080 467372 61384 208656 284216 253108 80067 310001 261827 199659 115076 152868 196812
11069A96812J26982A61256J44086r3342n6307K89722P4357J41862j2090M280r2945
11058E60879p8505j21200K82177j35485K03098O624k4029r8578Q7252K7437k38937
11047D70733q9065K22071R2775J21501D01207M2980k7346L17428J31218k74365
11037E91122K48720D19658N3604K31499l9128k07837K29000k56654J30353Q3900
11027F44395j58533P3761M1231k07806L86390j91520Q4996B95352M11448B04977
11016C36057R2169K08874J45384l21233j38345j9102J63260J22742j04737J36595
11006F21664H1458N40210m4896A63100M94542J27854J45801j14859j95806K5772
10996F46404J0116r2079J43062K20140m23343Q6754n9857O2046j6576Q09742n67956
$$ plain form
11069 196812 323794 161256 305342 212000 155693 445415 519772 661634 649544 653824 560879
11058 560879 482374 361174 643351 507866 710964 717588 693559 594981 682233 709670 470733
11047 470733 381668 603739 696514 818015 401207 444187 416841 734269 865487 591122
11037 591122 839842 419658 473262 704761 665633 457796 686796 430142 560495 644395
11027 644395 485862 559623 600854 393048 779438 587918 672914 295352 706800 204977
11016 336057 428226 637100 782484 461251 322906 303804 467064 589806 485069 621664
11006 621664 81458 621668 576772 163100 657642 785496 931297 816438 620632 646404
10996 646404 656520 564441 707503 927643 504300 591054 531197 593243 576667 1386409 818453
10985H18453O9179N1173o6285L1149K52646J01524K4894M73933m1739R3286N06993
10974B315206N9021R569j38627P6162L74832m68075K20395p47271J2365k67377
10964A446200M4084l38267K78800J4385k1659J57651l06426K77598k66590j30023
10954A155753j32435k48070j65794j02618L4186j76021D0019K88913A29890K87321
10944D17211j33635k0677J49265J81531A25249O7948J0048j178A1949a63156P4903
10933h8253L0687Q902A27220J33077a42771A78013n5575P9818c22763C0499a25131
10921E2047d358I5339f7849p3882A9607b59895D6252a08417j56312H3275A1201
10909A66377k3851a48328I1402A745K75686k359a3962l109A5513J47207J76483
$$ plain form
10985 818453 887632 938805 872520 903669 1156315 1257839 1282733 1756666 1714927 1808213 2315206
10974 2315206 2374227 2383796 2245169 2321331 2696163 2228088 2448483 1701212 1713577 1446200
10964 1446200 1490284 1152017 1430817 1445202 1423543 1581194 1274768 1552366 1285776 1155753
10954 1155753 1023318 775248 609454 506836 541022 365001 40019 328932 129890 417211
10944 417211 283576 262899 412164 593695 125249 193197 203245 202067 11949 -163156 -88253
10933 -88253 -57566 -48664 127220 260297 -142771 178013 122438 202256 -322763 30499 -125131
10921 52047 -4358 95339 -67849 -141731 19607 -259895 46252 -108417 -264729 83275 11201
10909 166377 142526 -148328 91402 1745 277431 275072 -13962 -17071 15513 162720 339203
10898C39203d03018A00978J4474a53307O5355N613i02j53538A09053L2068j451
10887A39670E6505a94895g7535k74111b4370C9710b72925A43320a82952a833C34344
10875b52292J15792q1391o4046I3358n400a41131j01558D0735A9081a48398i652
10863a54525A73320o7576J23918j07830d854D18227I4077c19917A30916c08369
10852H1740M5443c25446E9327h8433B4609a61938N54B1183K94166p1600p1893
10841A71856k5791b34453l7288A37277a2058l59071A75478a96747j082A79235
10830h9473B64949b99508E1058k2458c53094B01952c68943C669K12913E2360D074
10818A5953d13463A2196a86574I6265c02745g1777m7026F0402a58280B69797r7298
$$ plain form
10898 339203 -403018 100978 115452 -153307 -87952 -82339 -902 -154440 109053 141121 139670
10887 139670 56505 -194895 -77535 -351646 -24370 39710 -272925 143320 -182952 -1833 334344
10875 -252292 -136500 -217891 -281937 93358 87958 -141131 -242689 40735 19081 -148398 -9652
10863 -154525 173320 105744 229662 121832 -4854 418227 94077 -319917 130916 -308369
10852 81740 127183 -325446 59327 -88433 24609 -161938 -161384 21183 315349 243749 171856
10841 171856 146065 -234453 -271741 137277 -12058 -371129 175478 -196747 -197829 179235
10830 -89473 264949 -299508 51058 28600 -353094 201952 -368943 3669 216582 52360 4074
10818 15953 -413463 12196 -186574 96265 -302745 -71777 -118803 60402 -158280 269797 172499
10807A72499b74347a5858k064C11157g8116k03989o7453C0943a8615A50467a8709
10795I9784e9477l9015J9271A08589b6744o5976G2434b72630f3185l44584B4422
10783B5982a97077O3038m3743k3582H5463M994C436c12898G4213a18877o6217
10772a85094P6673J7622C4682N8207d25490b06773B9654g3857C9296J35876A0684
10760i8740A05882M7215j5313P4935f7851A26339R2391d9227l04598J70617C3216
10748E03631b05780B01M52752b70287A22258n7867b1185B62425b14706D8045j4261
10737C3784b37088a05610p2297k82795E2570A6907b36314J0672I3561b89674A28156
10725a9294l4946B6387K01177b14979A19357J04298c6971m2245k52673l0267A60576
$$ plain form
10807 172499 -274347 -15858 -17922 311157 -78116 -282105 -349558 30943 -18615 150467 -18709
10795 99784 -59477 -98492 -79221 108589 -26744 -92720 72434 -272630 -63185 -407769 24422
10783 25982 -197077 -134039 -177782 -201364 85463 90457 3436 -312898 74213 -118877 -185094
10772 -185094 -108421 -90799 34682 92889 -425490 -206773 29654 -73857 39296 175172 10684
10760 -98740 105882 153097 137784 212719 -67851 126339 218730 -49227 -353825 -183208 33216
10748 503631 -205780 201 452953 -270287 122258 64391 -21185 262425 -214706 48045 33784
10737 33784 -237088 -105610 -177907 -460702 52570 16907 -236314 -225642 93561 -289674 128156
10725 -19294 -54240 26387 227564 -214979 119357 223655 -36971 -79216 -331889 -362156 160576
10713A0309a367D3836a49414j30381A58194n6635L5366b88889C3687b28349i6008
10701f9664A29025j248R0770m0287a36032p8592p3047a18480A70364c57284A03474
10689a31536F8301J84185g6204H1454Q0897a75443j51394c9677j39298C41929
10678d0254r1125J5303A65088a27414n7942E6819B6745a10234l7967e6072N29
10667e5543k1626p812j02955L9325j424A06985a2807j42013j42989e1328a2176
10655g3148j55018B37554i3788K9714b0802F4244b97212g06k56012R7658N1214
10644a07846p8870A37547b1364k9858q9435G524d96694A08353B1119e4712j9831
10633g4543E0763a30289B3606D206Q8976J56751e9979B77343D5780g7466b3288
$$ plain form
10713 10309 -1367 43836 -149414 -279795 158194 101559 136925 -288889 33687 -228349 -96008
10701 -69664 129025 127777 218547 178260 -136032 -214624 -287671 -118480 170364 -357284 103474
10689 -131536 68301 252486 -76204 81454 162351 -175443 -326837 -39677 -178975 341929
10678 -40254 -131379 -116076 165088 -127414 -185356 56819 26745 -110234 -148201 -56072 -55543
10667 -55543 -77169 -84981 -187936 -148611 -150035 106985 -12807 -154820 -297809 -51328 -12176
10655 -73148 -228166 237554 -93788 -64074 -20802 64244 -297212 -706 -256718 -159060 -107846
10644 -107846 -186716 137547 -21364 -51222 -140657 7524 -496694 108353 21119 -54712 -74543
10633 -74543 50763 -130289 23606 4206 93182 249933 -59979 277343 45780 -77466 -23288
10621a74358M1263M0557A74280L18948A2686i3445k9564n8906B74704a52552j73425
10610c25977E1096O1169b72507B77984g6612l4752A65054c5817k37876A436b5029
10598c71170a28576M0717k96325G7028g0828A15814c61628F5865D507h5329j85927
10587b71256I7658A1019R3678D8469e3916C01482B5353K21098b55393J19061K5422
10576a10910J4719E2255e7034I0817g86A6228a0243A34768a01395C29159A55461
10564a02469M5353b383D902b09920j71843B32997l6361a11545A86506b58367f0613
10552B19339a69262C5424a50381K8253L8952A9496Q6281c740A78518n1904b31903
10540g2638A61108K239a3254j81013C8857b99777h5226K5153b7313A56777g868
$$ plain form
10621 -174358 -133095 -92538 174280 493228 12686 -93445 -123009 -181915 274704 -152552 -325977
10610 -325977 51096 112265 -272507 277984 -76612 -111364 165054 -35817 -273693 1436 -25029
10598 -371170 -128576 -87859 -384184 77028 -70828 115814 -361628 65865 4507 -85329 -271256
10587 -271256 97658 11019 104697 48469 -53916 301482 25353 246451 -255393 -136332 -110910
10576 -110910 -96191 52255 -57034 90817 -786 16228 -10243 134768 -101395 329159 155461
10564 -102469 -57116 -2383 4902 -209920 -381763 232997 196636 -111545 186506 -258367 -60613
10552 219339 -169262 35424 -150381 -122128 -83176 19496 105777 -3740 178518 126614 -231903
10540 -72638 161108 163347 -13254 -194267 38857 -299777 -85226 -60073 -27313 156777 -7868
10528c744o3852o102D443K5354g071A73575f2374A24932B381f5888j18577M9733
10516a34732p9529P1967C99041g7696c3440k20330I2441d9164q6161d4327q9372
10505a33699K07j47718J28213B4791a18777C18661j49130E6631J64219E2355d1908
10493I288O2774b45939G1195d2277A31327J4307j0350K21951J07318j68989n1220
10482B44344R4880J2932A04143N5960M1715D3337a51195d1491o0719A59926n7843
10471A02083b81111a38045c8419B96048a36872a2865A88078b80751a18103k47964
10461c66067L1759b746o3314K8406q9523A30b22963B9649J66901i7700C3644i208
10448b27153F9896J95147b01978H5479b1995j13217J2918C4719J04474F5189a27394
$$ plain form
10528 -3744 -67596 -73698 4443 29797 -7071 173575 -62374 124932 2381 -65888 -184465 -134732
10516 -134732 -214261 -142294 399041 -77696 -33440 -253770 92441 -49164 -135325 -44327 -133699
10505 -133699 -133492 -281210 -152997 24791 -118777 318661 169531 56631 220850 52355 -41908
10493 9288 72062 -245939 71195 -42277 131327 145634 135284 357235 464553 295564 244344
10482 244344 339224 352156 104143 160103 201818 43337 -151195 -41491 -102210 159926 102083
10471 102083 -281111 -138045 -38419 296048 -136872 -12865 188078 -280751 -118103 -366067
10461 -366067 -334308 -2746 -66060 -37654 -127177 130 -222963 29649 196550 -97700 33644 -9208
10448 -227153 69896 265043 -201978 85479 -21995 -135212 -122294 34719 139193 65189 -127394
10436A37779l9380m2214i2196a5301l913j00798B211K8939L0094G420a66374j28498
10424b94872a18390A07013a46549I1412h0720b2285A64633c33425A45882e4002
10413a37218j89617B36253J0694g7841C5236b4372A40671a48332j05037C49987
10402a26184A221b0130l06360J38789A34541i9666q4840f7884q4693b1817C38497
10390E0568J07175D9735j6442L17598a61496I8059h6012A00998k1137f8796A14930
10378C8423K0933f479D5223J92954m5409J7800L327l5484J79879r2040K62058
10367E28308A83584J36046p6770n832A2602M09783j46000j15165n4443J64258
10357B71035j26528P5903b05396A69915o8772J21385L04702A70568O7099j216
$$ plain form
10436 137779 98399 56185 -92196 -15301 -19214 -120012 2211 31150 61244 7420 -166374 -294872
10424 -294872 -118390 107013 -146549 91412 -80720 -22285 164633 -333425 145882 -54002
10413 -137218 -326835 236253 246947 -77841 35236 -24372 140671 -148332 -253369 349987
10402 -126184 1221 -20130 -326490 -187701 134541 -99666 -184506 -67884 -152577 -21817 338497
10390 50568 157743 49735 33293 350891 -161496 98059 -86012 100998 79861 -68796 114930
10378 38423 59356 -6479 45223 238177 192768 210568 213895 178411 358290 266250 528308
10367 528308 183584 319630 242860 237028 12602 422385 276385 161220 106777 271035
10357 271035 144507 220410 -205396 169915 101143 222528 527230 170568 237667 236451
10347B36451J61630A33157J05468a07670B98985n6739l3328j5652a83898A59301
10336c7784C16581A43190J52415g2527A90296d2248A43179O2066a93585c2557
10325f0107A19202L8751J84746j34475C1221A4341J55975J5433H5657a77450B41735
10313f951C62523A6443b08068J02289j53643A03898D1327j0946J03924i0966B76816
10301b77160M5367C11637b6963j43282E4129J22193b0509n35633e8164E349g3680
10289B20184a29658K9115K6590D9455b92308A27924a16657j57457A23326b06036
10278a39073e0462c313p6183l021k30439B62116b06908C1207b13524g941m6243
10267e4184E2186b6577B29302j00596K5932L9442K5233J91930F4260M44876k804
$$ plain form
10347 236451 398081 133157 238625 -107670 298985 242246 208918 193266 -183898 159301
10336 -37784 316581 143190 295605 -72527 190296 -42248 143179 205245 -193585 -32557
10325 -60107 119202 157953 342699 208224 31221 14341 170316 185749 85657 -177450 241735
10313 -6951 362523 16443 -208068 -105779 -259422 103898 41327 30381 134305 -90966 276816
10301 -277160 -231793 311637 -26963 -170245 54129 176322 -20509 -556142 -58164 5349 -73680
10289 220184 -129658 -100543 -73953 49455 -292308 127924 -116657 -274114 123326 -206036
10278 -139073 -50462 -3313 -79496 -82517 -312956 262116 -206908 31207 -213524 -7941 -54184
10267 -54184 52186 -26577 229302 128706 154638 194080 219313 411243 64260 509136 506332
10256E06332B00115d095k58398M1448b2822j7376B48319K0675H2048A1668e5143
10244a51576j6495q681A81519h5341B10023q2513b9418F9579b31036F299g8366
10232C544L3495h1204b6510r9343k6760n319j54337E9412B4807a40099D7386R3733
10220A41119a2396m5237n4586B11181E8647b60930J17336A56280D893a33902F3170
10208A90696m8175d8355j2104k06792g7060b203H2764i1565D0741h4221c4502
10196D0267k984c9296k4615H7413b05393N5967J5134B39288A8635a23406H075
10184A18179b48093A94540F7960L1652J42518b07443k65866a92386j16132R3946
10174b14572L4697A48291L3040m4314b86082A07971f23907A13424b51968C26448
$$ plain form
10256 506332 200115 -4095 -262493 -221045 -22822 -40198 248319 268994 82048 11668 -55143
10244 -151576 -168071 -176752 181519 -85341 210023 127510 -29418 69579 -231036 6299 -78366
10232 3544 37039 -81204 -26510 -125853 -152613 -157932 -312269 59412 24807 -140099 47386 141119
10220 141119 -12396 -57633 -112219 211181 58647 -260930 -143594 156280 4893 -133902 63170
10208 190696 142521 -48355 -60459 -267251 -77060 -2203 82764 -91565 40741 -84221 -34502
10196 40267 37283 -39296 -63911 87413 -205393 -149426 -134292 239288 18635 -123406 8075
10184 118179 -248093 194540 67960 99612 242130 -207443 -473309 -192386 -308518 -214572
10174 -214572 -179875 148291 181331 137017 -286082 107971 -623907 113424 -251968 326448
10163a26509c1991m8722A51892n9233l774c69747B3860c12926B31707b77611c4134
10151a17729p9976G3600j7803a76801E4982J95446b40106h1877A6065e0844F2391
10139a30073k9260f3887q2743k209A90203r2303J11427b05550C0239B022a53348
10127G9882a23611K9735j29754J03152B6781b23092j29717Q1422F3837J23205
10117A87042b72803G4451a9599k9866A45417c3407H1806c1360l8418D6017i6867
10105a70964b1240j47940o9673a1428C5700h8111m9035l5631f7429j73950E6708
10093C78217a76521a4108j26970E1010i8372d8672l10281d5406j42258A20797
10082B0402L6770a78069A09402a00502l8000A58300B7450a0549q1989l11536a3198
$$ plain form
10163 -126509 -31991 -80713 151892 92659 88885 -369747 23860 -312926 231707 -277611 -34134
10151 -117729 -197705 73600 55797 -176801 54982 250428 -240106 -81877 16065 -50844 62391
10139 -130073 -159333 -63887 -146630 -148839 190203 97900 209327 -205550 30239 2022 -153348
10127 79882 -123611 -93876 -223630 -120478 26781 -223092 -352809 -271387 63837 187042
10117 187042 -272803 74451 -19599 -49465 145417 -33407 81806 -31360 -69778 46017 -96867
10105 -170964 -21240 -169180 -238853 -11428 35700 -88111 -137146 -172777 -67429 -241379 56708
10093 378217 -176521 -14108 -141078 51010 -98372 -48672 -358953 -45406 -187664 120797
10082 20402 57172 -178069 109402 -100502 -138502 158300 27450 -10549 -92538 -404074 -13198
10070A22741F899e0498J7499j11527a9957j49748c5264j89306B62889F152b42203
10058a8851o6364E2564I859b54119C20130c08417G1349P444c38974a03126l65922
10047d69048b9942A54794o1938M4386h3771e227G8447L9882l7684a54000q2877
10036b36877H5223a857I3356a69260F2521J9059c02045J01257B7956J63601A3483
10024b8757j00035j05962a12478A13770c01362a1219j05145j47281R0715B23827
10013d3052A38021l2808a30905a5981k27143A90605a72894A88430l5929d9024
10002C497J03187O3488d45334a57102M6180d7852B4465a20533F4122g2467n0109
9991a22576B4048b04164I8432J57645c36864A36710a2519I4612m0307d7674j97839
$$ plain form
10070 122741 6899 -50498 -32999 -144526 -19957 -169705 -35264 -224570 262889 6152 -242203
10058 -18851 -85215 52564 9859 -254119 320130 -308417 71349 78793 -338974 -103126 -469048
10047 -469048 -29942 154794 92856 137242 -83771 -5227 78447 118329 80645 -154000 -236877
10036 -236877 85223 -1857 93356 -169260 62521 81580 -302045 -200788 27956 191557 13483
10024 -28757 -128792 -234754 -112478 113770 -301362 -11219 -116364 -263645 -172930 223827
10013 -43052 138021 105213 -130905 -15981 -243124 190605 -172894 188430 152501 -49024
10002 3497 106684 170172 -445334 -157102 -110922 -47852 24465 -120533 64122 -72467 -122576
9991 -122576 24048 -204164 98432 256077 -336864 136710 -12519 94612 54305 -47674 -245513
9980b45513B76147G7098b1924j03796A47186c2549p26j09303m587d8149B12118
9968a79557j82621A21077C1749d61165a45429H9195a03725A37140L15669F5275
9957a32414M5637A90923a6738E4847a34734I4066g7635A49870c63591D454d4141
9945a66759O1849A87244c29609c8196j85691d3949A32995b99786b2052J990C0528
9933A42443i3909d131j75397j63720A973N2067A0850d185j86164J5088P8073B73901
9920b52934J16146a3796l77946A53991B6653c02972D5723Q1427a76901A24719
9909b60968b2838k94011C7926J82130e9460n9960C0452d8965q7735j67610B98311
9897b92152A98267c06654L9842g555k17006R8979J2249K4025j51381A41949a77544
$$ plain form
9980 -245513 276147 77098 -21924 -125720 147186 -32549 -33275 -142578 -147165 -48149 212118
9968 -179557 -362178 121077 31749 -461165 -145429 89195 -103725 137140 452809 65275
9957 -132414 -86777 190923 -16738 54847 -134734 94066 -77635 149870 -363591 4454 -44141
9945 -166759 -104910 187244 -329609 -38196 -223887 -43949 132995 -299786 -22052 -20062 30528
9933 142443 -93909 -4131 -179528 -343248 1973 54040 10850 -4185 -190349 -175261 -97188 273901
9920 -252934 -136788 -13796 -391742 153991 26653 -302972 45723 127150 -176901 124719
9909 -260968 -22838 -316849 37926 220056 -59460 -119420 30452 -48965 -136700 -304310 298311
9897 -292152 198267 -306654 -266812 -7555 -224561 -125582 -113333 -89308 -240689 141949 -177544
9885B04547D9600d9515B733a94142A45334a54111q1816b3529C7170J14195i198
9873e4969j45634A56249R5615q4008c12175h1815j51959J285A574R1732b64948
9861I7380m1260A4114a03164A54233g625C18268c43161D0759Q3287a30327C3911
9849C0847i546l31930A56380c3805I3318e643G5812C5908e0384C2008d6058k20432
9837b66490A45815k0480h6789A7760a4580B05955K7292B4909J18750a12055C6060
9825h9347B68259F3539i4837m19886H6246a51622B23876b37602f2243K9255a1268
9813g6131B0000a1366q0124k58912h5542m8948n4661e4944A18946a32224K7345
9802a04879F6618b49275O6016j18209B56526C0293a17031B07666f129I7095J29098
$$ plain form
9885 204547 49600 -49515 2733 -194142 145334 -154111 -235927 -23529 37170 151365 -9198
9873 -54969 -200603 156249 251864 167856 -312175 -81815 -233774 -232489 1574 93306 -264948
9861 97380 56120 14114 -103164 154233 -7625 318268 -343161 40759 124046 -130327 33911
9849 30847 -9546 -341476 156380 -33805 93318 -5643 75812 35908 -50384 32008 -46058 -266490
9837 -266490 145815 125335 -86789 17760 -14580 205955 233247 24909 143659 -112055 36060
9825 -89347 268259 63539 -94837 -514723 86246 -151622 223876 -237602 -62243 -32988 -11268
9813 -76131 20000 -11366 -91490 -350402 -85542 -134490 -189151 -54944 118946 -132224 -104879
9802 -104879 66618 -249275 -183259 -301468 256526 30293 -117031 207666 -6129 97095 226193
9791B26193G6619J18221b39810H3448D0445d89525J65014a9229j21466k70178
9781d10873G0341B1628b03623J2111e4702l4179a9480E3046C504c13547L9470
9770b74077h9987m2507A24278k7803o568e2693j29241k2440O7903j76659A852
9758F7650b9324A12559a19083c280A7686f1899A36963A5117M3226h7358A95996
9746C3434h2442j31490h248C1561m362a11478n0022B4740P0180J62722b17681
9734i5701A45637b98831A38017f6357j32340D3195b53547A58001a78226N5437
9724a22789A98977d44898a03397b7284A60828b10531b3233g861o2417q9326C7699
9712a51506j59988R9336C4542c16864J09874M7811b3515A29933a20817c4393F7393
$$ plain form
9791 226193 76619 194840 -239810 83448 40445 -489525 -324511 -19229 -140695 -410873
9781 -410873 70341 21628 -203623 -191512 -54702 -88881 -19480 53046 3504 -313547 -274077
9770 -274077 -89987 -132494 124278 96475 89907 -52693 -181934 -204374 -136471 -313130 1852
9758 67650 -29324 112559 -119083 -3280 17686 -61899 136963 15117 58343 -87358 195996
9746 33434 -82442 -213932 -8248 31561 27199 -111478 -161500 24740 94920 257642 -217681
9734 -95701 145637 -298831 138017 -66357 -198697 43195 -253547 158001 -178226 -122789
9724 -122789 198977 -444898 -103397 -27284 160828 -210531 -23233 -7861 -70278 -159604 37699
9712 -151506 -311494 -212158 34542 -316864 -206990 -159179 -23515 129933 -120817 -34393 67393
9700A56162E7984b1125l6517C238b75855p076a4280r8300A56947B900i1141c1368
9687b3030j5618B8495b91867e5601A0889a78016A90595c26810a50063J1544H8196
9675b91723n2919A41244J30684a46558r2891i1404j9477N3963j36022f013C871
9663A12094F851K61418a58756A20824A6416f7534m46780c380j91783c2289A70872
9651A56474a85919C38081b5238B4158a68940j88310a40673M5944l95535a9475
9640b06393A15205R5264d08785a70133E3608e5049J3124D2381j259a12698A7355
9628b24403A20705f3445N575j19857d4649j51112o104h4923B5034P8319L7296
9617A40649o0582a91449E5903K9558a32066f3675H583d6061o3747D6421J69679
$$ plain form
9700 156162 57984 -21125 -57642 3238 -275855 -282931 -14280 -112580 156947 2900 -91141 -31368
9687 -23030 -38648 28495 -291867 -55601 10889 -178016 190595 -326810 -150063 -138519 88196
9675 -291723 -344642 141244 271928 -146558 -239449 -91404 -110881 -56918 -192940 -6013 3871
9663 112094 6851 268269 -158756 120824 16416 -67534 -514314 -3380 -195163 -32289 170872
9651 156474 -185919 338081 -25238 24158 -168940 -357250 -140673 -94729 -490264 -19475
9640 -206393 115205 210469 -408785 -170133 53608 -55049 -41925 42381 41122 -112698 17355
9628 -224403 120705 -63445 -57870 -177727 -44649 -195761 -201865 -84923 25034 103353 140649
9617 140649 80067 -191449 55903 85461 -132066 -63675 8583 -46061 -109808 46421 216100
9606B16100a46172A80085b55818j0673a06475m8405P4646l1666g06B11862E6613
9594b67581h4554j54981A05133b13246a8016G6382J25410b80923J25145k19700
9584c75478J04079Q5682j77697J23765c6570j39155l09647E5438e4431A11031
9573e5315B82612F3397g9250H9886D3796c1613a0472H2828B5343a61989B52044
9561B04346b63311A4007c88845A14578D17J62416b89755i4832n1673j0240p0100
9550b26845O7584k23626A61990A4368c20621J48513A05822n1850R7400P7015d5958
9538c6256B04945a70457B69581c5255j61899q4594e7900H8642b86630h0217j73008
9527b53225J00137j02534A94334r3832d29406K0872E4502J31264i5748j45001
$$ plain form
9606 216100 -146172 180085 -255818 -266491 -106475 -154880 -80234 -111900 -706 211862 56613
9594 -267581 -84554 -239535 105133 -213246 -18016 76382 201792 -280923 -155778 -375478
9584 -375478 -271399 -185717 -363414 -239649 -36570 -175725 -485372 55438 -54431 111031
9573 -55315 282612 63397 -79250 89886 43796 -31613 -10472 82828 25343 -161989 252044
9561 204346 -263311 14007 -388845 114578 417 162833 -289755 -94832 -146505 -156745 -226845
9550 -226845 -159261 -382887 161990 14368 -320621 -172108 105822 53972 151372 228387 -45958
9538 -36256 204945 -170457 269581 -35255 -197154 -281748 -57900 88642 -286630 -80217 -253225
9527 -253225 -153088 -255622 194334 100502 -429406 -408534 54502 185766 -95748 -240749
9517b40749F1870J92667f1731D5602b4481k9373b5171G7122G993Q225a85469k6840
9505b12309H2480c93102a90893A35078a0561k28488F4556a39952L4652j08437
9495b13737d6487A22452b91214j16383J10747i806j19836j03166H4073J3067b12284
9483A01878b36210G8634a07866A52390L9061e4461r3805q6174H4898l1884e8257
9471h170A9393a2302r126F800O4148c3198C14274G4446b39021a15395G1296O2557
9459A33853J31344B8366b45528e5550n6504B3939e0941A51277E7634a30300j16791
9448b47091J04319B20166c72874Q4853e2557a624j12524A148J4543f3803A52762
9436D0973c8580A73710a90451f7727j15076A02413b32955o4176J47075L5840j3526
$$ plain form
9517 -240749 61870 254537 -61731 45602 -24481 -53854 -25171 77122 7993 16218 -185469 -212309
9505 -212309 82480 -393102 -190893 135078 -10561 -239049 64556 -139952 -105300 -213737
9495 -213737 -46487 122452 -291214 -407597 -296850 -9806 -129642 -232808 84073 97140 -212284
9483 101878 -236210 78634 -107866 152390 191451 -54461 -148266 -234440 84898 53014 -58257
9471 -8170 19393 -12302 -21428 6800 70948 -33198 314274 74446 -239021 -115395 71296 133853
9459 133853 265197 28366 -245528 -55550 -112054 23939 -50941 151277 57634 -130300 -247091
9448 -247091 -142772 220166 -372874 -288021 -52557 -1624 -114148 1148 15691 -63803 152762
9436 40973 -38580 173710 -190451 -67727 -182803 102413 -232955 -297131 -150056 -114216 -127742
9425a27742A01820a45699a0091k61871J21796B2530c45972A87667b12846J5261
9415a97585A1011g487A12234P9712b19609b5364B06745c21588a47048A51136a16172
9403a6176l3692m750B08575H9042d3320j81754I7345a80692e6287k8598c7537
9391B87705i6087A49804K6299C6648K13125a97503m0855N3357Q5627m9214p8834
9380b27422i709q717k94732b1527q6973N0510J5120n7948A01068e2305j96345
9369b48650A23479N6260a94120P9684K1135a5143A12679j6314D779d34844B73665
9357b33216i78B24592G0946h1921k73478M2686A37886h5253b2804C23004a9562
9345e3564A85933b84817A60172c578n0483M897A40046c74216A54423e5301j4758
$$ plain form
9425 -127742 101820 -145699 -10091 -271962 -150166 22530 -345972 187667 -212846 -197585
9415 -197585 11011 -7487 112234 191946 -219609 -25364 206745 -321588 -147048 151136 -116172
9403 -16176 -49868 -54618 208575 89042 -43320 -225074 97345 -180692 -56287 -84885 -37537
9391 287705 -96087 149804 176103 36648 249773 -197503 -238358 -185001 -99374 -148588 -227422
9380 -227422 -9709 -18426 -313158 -21527 -108500 -57990 -42870 -100818 101068 -52305 -248650
9369 -248650 123479 179739 -194120 -114436 -93301 -15143 112679 96365 4779 -434844 273665
9357 -233216 -978 224592 70946 -81921 -355399 -312713 137886 -85253 -22804 323004 -19562
9345 -53564 185933 -284817 160172 -3578 -54061 -49164 140046 -374216 154423 -55301 -70059
9334g0059k14544o3155G8604h7835E11350A9440a74082d9062a9171l18531A13618
9322d22742g6253a1048q075r5397j87586A62321a56882o7940A5733a40723A03712
9310b59862J02670C4597R0694i4953A06258Q515a6581D2908E259e3451j8969C9910
9297A12130b09721A33538b80831O1555B0216a9705j00024A64602J6199a84671
9286i0837K9759k42545J25234k90996D6973F068b06937J5523A12227C0167J46600
9275A76767F79a62887B13317C3316K116d0923l78299B41762D9273A5556c32F9998
9262h1548D5939J74659a19377e8962k6208G6997C7411J96021b90537i3184j704
9251i4888j3371p622E1601K7732l7198a04245k85190B51573o5721a34971k50551
$$ plain form
9334 -70059 -284603 -347758 78604 -87835 511350 19440 -174082 -49062 -19171 -337702 113618
9322 -422742 -76253 -11048 -19123 -114520 -302106 162321 -156882 -224822 15733 -140723 103712
9310 -259862 -157192 34597 125291 -94953 106258 114773 -16581 42908 5259 -53451 -72420 39910
9297 112130 -209721 133538 -280831 -219276 20216 -19705 -119729 164602 180801 -184671
9286 -90837 -61078 -303623 -178389 -469385 46973 6068 -206937 -191414 112227 30167 176767
9275 176767 679 -162887 213317 33316 35432 -40923 -419222 241762 49273 15556 -332 69998
9262 -81548 45939 220598 -119377 -58962 -85170 76997 37411 233432 -290537 -93184 -94888
9251 -94888 -108259 -115881 51601 79333 42135 -104245 -389435 251573 185852 -134971 -385522
9240c85522j00087A47291c00264g3391B33805d6729C7100M9307J49876d4247n5914
9229a00161c5337B86936a74991A28215J30265b96362a03851D14605a05934j63693
9219b69627A32206C7834b94916J37930O1860B19839Q4712a29258K2878r46j73526
9208b80852C8858i399d586C582g1232j31712J3212j0572A49865n6519F903c21035
9195b64438N8880K5692g9189j47162k2599b3372k1360H2411E900b06585m5422
9184b52007A50549E6764J20363b65288a00834I0356c56667M1890K7209J16915
9174a70653O3675G1366d35611B25712a84663a4834l17266B6913a22716H7200a37659
9162h9632J7792j80905M1529I4653b75075r1946A69886d06426A19801J18421K0365
$$ plain form
9240 -385522 -485609 147291 -300264 -73391 233805 -46729 37100 86407 236283 -44247 -100161
9229 -100161 -35337 286936 -174991 128215 258480 -296362 -103851 414605 -105934 -269627
9219 -269627 132206 37834 -294916 -156986 -95126 219839 304551 -129258 -106380 -107326 -280852
9208 -280852 38858 -9399 -4586 3582 -71232 -202944 -189732 -200304 149865 93346 6903 -321035
9195 -264438 -205558 -179866 -79189 -226351 -248950 -23372 -44732 82411 5900 -206585 -252007
9184 -252007 150549 56764 177127 -265288 -100834 90356 -356667 -314777 -287568 -170653
9174 -170653 -106978 71366 -435611 225712 -184663 -14834 -332100 26913 -122716 87200 -137659
9162 -89632 -71840 -252745 -211216 94653 -275075 -367021 169886 -406426 119801 238222 258587
9151B58587q0338a17879G252e0423Q922B32226a22013A26019n0164l5329b82246
9139A17067a4799j04714N8955m7401c0234A00645K6512b20669c2834l78025d9569
9127b46391O1159C08725o0773E1829j6244c71861A51411a40275O3014B62754b18293
9115G477J61800d3263C6807c63107a05372o0617f8857l64343a81837g6678k45846
9104c22524A81850a90545A57621a79990A35909a63333F94K52257E7855a40667
9093a17857B02007a65535k644C9841f7656l6951I8712b24513Q6731p0071b6649
9081f3700j02008B52859A14745J4430I637L6771q542a85098j417R1499F8643b70689
9068c2100D15255D2949c35530L1275R4099E9720f8888C23819j51665a222p4753
$$ plain form
9151 258587 178249 -117879 7252 -50423 -41501 232226 -122013 126019 75855 40526 -282246
9139 117067 -14799 -119513 -60558 -107959 -30234 100645 127157 -220669 -32834 -410859 -49569
9127 -246391 -185232 308725 247952 51829 35585 -371861 151411 -140275 -77261 262754 -218293
9115 7477 169277 -43263 36807 -363107 -105372 -165989 -68857 -433200 -181837 -76678 -322524
9104 -322524 181850 -190545 157621 -179990 135909 -163333 694 252951 57855 -140667
9093 -117857 202007 -165535 -168179 39841 -67656 -104607 98712 -224513 -137782 -207853 -26649
9081 -63700 -165708 252859 114745 129175 9637 46408 37866 -185098 -186515 -95016 68643 -270689
9068 -32100 415255 42949 -335530 -304255 -210156 59720 -68888 323819 172154 -1222 -75975
9057g5975k90024B3582b23095H1846b56629i8688p4354A25574a23661o4358H8455
9045a54055c4409I5282A4472K60629D5777g2527j68129A15917b50716d268k41166
9034b45434E0255K08235b48252g8431l81501f3369J8194B44909a93324j29328
9024c22652B92931p9127k5959H5024a94911b3404k12064C9588b22467q8937P3958
9013b37446c9534A13595J9062D1541b8820o8325j06669P3115E8515K23258b61638
9001A70198A3211a78013P1829J5655J8503j38001B9901a15140d233k51234M0822
8990b14645j85321a59136c3716A75725d01840A1903d3429D8983d2763a023A83772
8978D7030J1169b43464B22425c41154b7213r4250A62026a56301C0677a66493A4152
$$ plain form
9057 -75975 -365999 23582 -223095 81846 -256629 -98688 -173042 125574 -123661 -188019 88455
9045 -154055 -34409 95282 14472 275101 45777 -72527 -240656 115917 -250716 -4268 -245434
9034 -245434 50255 258490 -248252 -78431 -459932 -63369 -45175 244909 -193324 -322652
9024 -322652 292931 213804 187845 85024 -194911 -23404 -235468 39588 -222467 -311404 -237446
9013 -237446 -39534 113595 132657 41541 -28820 -97145 -203814 -130699 58515 281773 -261638
9001 170198 13211 -178013 -106184 -90529 -72026 -210027 29901 -115140 -4233 -255467 -214645
8990 -214645 -399966 -159136 -33716 175725 -401840 11903 -43429 48983 -42763 -1023 183772
8978 47030 58199 -243464 222425 -341154 -27213 -121463 162026 -156301 30677 -166493 14152
8966G0732a6538j61830c9490k77881J36163n1437C28933a07435B29086c3231j44030
8955a77261D3146l404J7067h1587E581J18862K0303b63437A99246b87359A12816
8943F3698a90505p8769N011A30412M6142c55296a14869j01195P7514d0828j89144
8932b29972j7366g0200B35252r2607J28013q7814c447B48233k3787J441829J460533
8921C126808E81911A40068b07866I086J17002D1315Q1056J88670j11897M4950
8911B44094H1736c82769J69127A61276B9497J24550a3390j22681G1671d0375o0179
8900a00554o9535k01815E1487J15297n7691b6977p2423A38330b40377g5934A28305
8888A42384j5658e79609h9156h827A68614a10838l4925O4579A80460b27768a00939
$$ plain form
8966 70732 -16538 -178368 -39490 -317371 -181208 -232645 328933 -107435 229086 -33231 -177261
8955 -177261 43146 39742 56809 -81587 5581 124443 144746 -263437 199246 -287359 112816
8943 63698 -190505 -269274 -264263 130412 176554 -355296 -114869 -216064 -138550 -40828 -229972
8932 -229972 -247338 -70200 235252 142645 270658 182844 -3447 248233 224446 1666275 3126808
8921 3126808 581911 140068 -207866 9086 126088 41315 122371 311041 199144 244094
8911 244094 81736 -382769 -213642 161276 29497 154047 -13390 -136071 71671 -40375 -100554
8900 -100554 -170089 -371904 51487 166784 109093 -26977 -99400 138330 -240377 -75934 128305
8888 142384 126726 -579609 -89156 -8827 168614 -110838 -145763 -81184 180460 -227768 -100939
8876D9945N9467b7199j17812M9290A21520K24503a07622A3959N8648b09183g6949
8864a39660j37448C2359b25521Q1344l04618I2972a19931j26070F0080i0109a6432
8852a63714d3049E11087a48985A67393b82797h5171k2099R436j48110B21871i0372
8840b22545i5328E3809b70368A32161e5820C74913d4411P570r4260j09222P2895
$$ plain form
8876 49945 109412 -27199 -145011 -95721 121520 346023 -107622 13959 72607 -209183 -76949
8864 -139660 -277108 32359 -225521 -144177 -448795 92972 -119931 -246001 60080 -90109 -16432
8852 -163714 -43049 511087 -148985 167393 -282797 -85171 -107270 -97834 -245944 221871 -90372
8840 -222545 -95328 53809 -270368 132161 -55820 374913 -44411 -36841 -131101 -240323 -167428
$$ [...]
##END NTUPLES=NMR SPECTRUM
##END=
