##TITLE=NES1062_ptc150_9883053_uy56wyng8z
##JCAMPDX= 6.0         $$ Bruker NMR JCAMP-DX V2.0
##DATA TYPE= NMR SPECTRUM
##DATA CLASS= NTUPLES
##ORIGIN= BRUKER
##OWNER= Administrator
$$ 1.72 TOPSPIN		Version 2.1
$$ 2016-08-26 20:26:22.148 -0500  Administrator@X
$$ Compression mode = diff/dup
##.OBSERVE FREQUENCY= 400.02188249412
##.OBSERVE NUCLEUS= ^1H
##.ACQUISITION MODE= SIMULTANEOUS (DQD)
##.ACQUISITION SCHEME= undefined
##.AVERAGES= 64
##.DIGITISER RES= 22
##SPECTROMETER/DATA SYSTEM= spect
##.PULSE SEQUENCE= noesygpps1d.comp
##.SOLVENT NAME= COFFEE_meoh
##.SHIFT REFERENCE= INTERNAL, COFFEE_meoh, 1, 14.96047
##AUDIT TRAIL= $$ (NUMBER, WHEN, WHO, WHERE, PROCESS, VERSION, WHAT)
$$ ##TITLE= Audit trail, TOPSPIN		Version 2.1
$$ ##JCAMPDX= 5.01
$$ ##ORIGIN= Bruker BioSpin GmbH
$$ ##OWNER= Administrator
$$ $$ E:\/data/COFFEE/nmr/NES1062_ptc150_9883053_uy56wyng8z/22/pdata/1/auditp.txt
$$ ##AUDIT TRAIL=  $$ (NUMBER, WHEN, WHO, WHERE, PROCESS, VERSION, WHAT)
(   1,<2016-08-26 20:26:16.961 -0500>,<Administrator>,<X>,<go>,<TOPSPIN 2.1>,
      <created by zg
	started at 2016-08-26 20:14:47.383 -0500,
	POWCHK enabled, PULCHK disabled,
       configuration hash MD5:
       21 0F 79 D6 B3 7B B4 F6 88 20 88 DB 03 48 BD 9F
       data hash MD5: 64K
       94 C4 D9 7C A2 20 4A EE D5 16 48 D0 2F AF D8 BE>)
(   2,<2016-08-26 20:26:20.070 -0500>,<Administrator>,<X>,<proc1d>,<TOPSPIN 2.1>,
      <Start of raw data processing
       efp LB = 0.3 FT_mod = 6 PKNL = 1 PHC0 = 0 PHC1 = 0 SI = 128K 
       data hash MD5: 128K
       29 CD 5B 2A D8 16 F9 04 CF A1 00 A3 E2 27 AC 95>)
(   3,<2016-08-26 20:26:20.945 -0500>,<Administrator>,<X>,<proc1d>,<TOPSPIN 2.1>,
      <pk PHC0 = -86.05042 PHC1 = 0 
       data hash MD5: 128K
       F9 AC 1C 55 A2 A2 53 72 E0 A7 3C A3 C6 64 10 F5>)
(   4,<2016-08-26 20:26:21.336 -0500>,<Administrator>,<X>,<proc1d>,<TOPSPIN 2.1>,
      <abs ABSG = 1 
       data hash MD5: 128K
       28 1D B5 FC D0 F7 2A 5D 0B 61 F6 DF 66 6C 28 17>)
(   5,<2016-08-26 20:26:21.429 -0500>,<Administrator>,<X>,<proc1d>,<TOPSPIN 2.1>,
      <abs ABSG = 2 
       data hash MD5: 128K
       8F 84 9A 5A B7 E8 C9 F4 39 84 BC 3F A7 43 D4 0A>)
(   6,<2016-08-26 20:26:21.523 -0500>,<Administrator>,<X>,<proc1d>,<TOPSPIN 2.1>,
      <abs ABSG = 3 
       data hash MD5: 128K
       51 64 7F B7 CB 87 89 38 DE 88 28 26 5C E7 67 BA>)
(   7,<2016-08-26 20:26:21.601 -0500>,<Administrator>,<X>,<proc1d>,<TOPSPIN 2.1>,
      <abs ABSG = 4 
       data hash MD5: 128K
       C7 61 A8 08 4A 07 07 4C 12 D0 75 6A 5B 1B CC B1>)
(   8,<2016-08-26 20:26:21.726 -0500>,<Administrator>,<X>,<proc1d>,<TOPSPIN 2.1>,
      <abs ABSG = 5 
       data hash MD5: 128K
       0C 0C BD 39 31 A9 8F 3F 34 8E 6D DD 00 6F 40 20>)
$$ ##END=
$$ 
$$ $$ hash MD5
$$ $$ B9 06 05 B8 E3 BD 29 E9 D4 F1 62 54 AC 4B 65 19
##$RELAX= 
##$RELAX= 
##$RELAX= 
##$RELAX= 
##$RELAX= 
##$RELAX= 
##$RELAX= 
##$RELAX= 
$$ Bruker specific parameters
$$ --------------------------
##$DU= <E:\>
##$EXPNO= 22
$$ [...]
##$TP07= 0
##$TPNAME0= <>
##$TPNAME1= <>
##$TPNAME2= <>
##$TPNAME3= <>
##$TPNAME4= <>
##$TPNAME5= <>
##$TPNAME6= <>
##$TPNAME7= <>
##$TPOAL= (0..7)
0.5 0.5 0.5 0.5 0.5 0.5 0.5 0.5
##$TPOFFS= (0..7)
0 0 0 0 0 0 0 0
##$TUNHIN= 0
##$TUNHOUT= 0
##$TUNXOUT= 0
##$USERA1= <user>
##$USERA2= <user>
##$USERA3= <user>
##$USERA4= <user>
##$USERA5= <user>
##$V9= 5
##$VALIST= <valist>
##$VCLIST= <CCCCCCCCCCCCCCC>
##$VD= 0
##$VDLIST= <DDDDDDDDDDDDDDD>
##$VPLIST= <PPPPPPPPPPPPPPP>
##$VTLIST= <TTTTTTTTTTTTTTT>
##$WBST= 2048
##$WBSW= 25
##$XGAIN= (0..3)
0 0 0 0
##$XL= 0
##$YL= 0
##$YMAX_a= 5671019
##$YMIN_a= -10530566
##$ZGOPTNS= <>
##$ZL1= 120
##$ZL2= 120
##$ZL3= 120
##$ZL4= 120
##$ABSF1= 14.96047
##$ABSF2= -5.597712
##$ABSG= 5
##$ABSL= 3
##$ALPHA= 0
##$AQORDER= 0
##$ASSFAC= 0
##$ASSFACI= 0
##$ASSFACX= 0
##$ASSWID= 0
##$AUNMP= <proc_prof1d_extract.lims>
##$AXLEFT= 0
##$AXNAME= <>
##$AXNUC= <1H>
##$AXRIGHT= 0
##$AXTYPE= 0
##$AXUNIT= <>
##$AZFE= 0.1
##$AZFW= 0.1
##$BCFW= 0
##$BC_mod= 0
##$BYTORDP= 0
##$COROFFS= 0
##$CY= 15
##$DATMOD= 1
##$DC= 0
##$DFILT= <>
##$DTYPP= 0
##$F1P= 0
##$F2P= 0
##$FCOR= 0.5
##$FTSIZE= 131072
##$FT_mod= 6
##$GAMMA= 0
##$GB= 0
##$INTBC= 1
##$INTSCL= 1
##$ISEN= 128
##$LB= 0.3
##$LEV0= 0
##$LPBIN= 0
##$MAXI= 10000
##$MC2= 0
##$MEAN= 0
##$ME_mod= 0
##$MI= 0
##$NCOEF= 0
##$NC_proc= -2
##$NLEV= 6
##$NOISF1= 0
##$NOISF2= 0
##$NSP= 0
##$NTH_PI= 0
##$NZP= 0
##$OFFSET= 14.96047
##$PC= 1
##$PHC0= -86.05042
##$PHC1= 0
##$PH_mod= 1
##$PKNL= yes
##$PPARMOD= 0
##$PPDIAG= 0
##$PPIPTYP= 0
##$PPMPNUM= 2147483647
##$PPRESOL= 1
##$PSCAL= 4
##$PSIGN= 0
##$PYNMP= <proc.py>
##$REVERSE= no
##$SF= 400.020009848487
##$SI= 131072
##$SIGF1= 0
##$SIGF2= 0
##$SINO= 400
##$SIOLD= 131072
##$SPECTYP= <>
##$SREGLST= <1H.CDCl3>
##$SSB= 0
##$STSI= 131072
##$STSR= 0
##$SW_p= 8223.68421052631
##$SYMM= 0
##$S_DEV= 0
##$TDeff= 65536
##$TDoff= 0
##$TI= <>
##$TILT= no
##$TM1= 0
##$TM2= 0
##$TOPLEV= 0
##$USERP1= <user>
##$USERP2= <user>
##$USERP3= <user>
##$USERP4= <user>
##$USERP5= <user>
##$WDW= 1
##$XDIM= 131072
##$YMAX_p= 381689286
##$YMIN_p= -11670
##$CURPLOT= <Network HP LaserJet P1505>
##$CURPRIN= <$Network HP LaserJet P1505>
##$DFORMAT= <normdp>
##$LAYOUT= <+/1D_H.xwp>
##$LFORMAT= <normlp>
##$PFORMAT= <normpl>
##$SURQMSG= 1
$$ End of Bruker specific parameters
$$ ---------------------------------
##NTUPLES= NMR SPECTRUM
##VAR_NAME=  FREQUENCY,     SPECTRUM/REAL,   SPECTRUM/IMAG
##SYMBOL=    X,             R,               I
##VAR_TYPE=  INDEPENDENT,   DEPENDENT,       DEPENDENT
##VAR_FORM=  AFFN,          ASDF,            ASDF
##VAR_DIM=   131072,        131072,          131072
##UNITS=     HZ,            ARBITRARY UNITS, ARBITRARY UNITS
##FACTOR=    0.0627417313425164, 1,          1
##FIRST=     8223.62146879497, 1056,         -49861
##LAST=      0,             2629,            -50232
##MIN=       0,             -11670,          0
##MAX=       8223.62146879497, 381689286,    0
$$ Real data points
##PAGE= N=1
##DATA TABLE= (X++(R..R)), XYDATA
$$ [...]
63982B46341M543M113L774L982M709N717O729P355P331P008P121P861Q465Q106
$$ 246341 250884 254997 258771 262753 267462 273179 279908 287263 294594 301602 308723 316584 325049 333155
63968C33155P025O422P184Q962J0682J1725J2327J2982J3996J5630J8160K1442
$$ 333155 340180 346602 353786 362748 373430 385155 397482 410464 424460 440090 458250 479692
63956D79692K4883K8293L2312L7521M3604N0119N7642O7090P8095Q9135R9414
$$ 479692 504575 532868 565180 602701 646305 696424 754066 821156 899251 988386 1087800
63945A087800J09415J19333J28123J34852J40057J44817J48982J51145J49969
$$ 1087800 1197215 1316548 1444671 1579523 1719580 1864397 2013379 2164524 2314493
63936B314493J44902J35818J22851J06520Q7609O6932M5360K3722K322j9121m0748
$$ 2314493 2459395 2595213 2718064 2824584 2912193 2979125 3024485 3048207 3050529 3031408 2990660
63925B990660o2173q2895j02403j19478j32339j40306j44568j46522j46054j42554
$$ 2990660 2928487 2845592 2743189 2623711 2491372 2351066 2206498 2059976 1913922 1771368
63915A771368j36871j30615j23841j15068j03886r2021q1284p1785o2895n4769
$$ 1771368 1634497 1503882 1380041 1264973 1161087 1069066 987782 915997 853102 798333
63905G98333m7967m2298l7108l2209k7774k3700j9910j6912j5157j4043j2415
$$ 798333 750366 708068 670960 638751 610977 587277 567367 550455 535298 521255 508840
63894E08840j0080q044p140p088p130p008o881o666n926m413k472p46M69J622
$$ 508840 498760 490716 483576 476488 469358 462350 455469 448803 442877 438464 435992 435246 435715 437337
63880D37337L514O360R335J1280J1923J2206J3264J5215J7051J7688J7002J5867
$$ 437337 440851 447211 456546 467826 479749 491955 505219 520434 537485 555173 572175 588042
63868E88042J5252J5343J5494J4959J3520J1521R449P637O201N011L708J952k61
$$ 588042 603294 618637 634131 649090 662610 674131 683580 691217 697418 702429 706137 708089 707828
63855G07828k556m608o492q530j0856j3301j5697j8097k0495k2482k3462k3261
$$ 707828 705272 700664 694172 685642 674786 661485 645788 627691 607196 584714 561252 537991
63843E37991k2338k1313k0463j9752j9112j8514j7829j6939j5910j4967j4193
$$ 537991 515653 494340 473877 454125 435013 416499 398670 381731 365821 350854 336661
63832C36661j3438j2521j1408j0261r364q979r065r153q682p545o186n137m574
$$ 336661 323223 310702 299294 289033 279669 270690 261625 252472 243790 236245 230059 224922 220348
63819B20348m327m191m058l830l399k760k125j800j866k022j870j437j177j360
$$ 220348 216021 211830 207772 203942 200543 197783 195658 193858 191992 189970 188100 186663 185486 184126
63805A84126j624j468r88p68j001j198j009p87j010j439j491j204j185j535j530
$$ 184126 182502 181034 180046 179278 178277 177079 176070 175283 174273 172834 171343 170139 168954 167419 165889
63790A65889o84M09Q54O06L16K42P3k82l74O0O43Q37N45q8r54j780k024j453n56
$$ 165889 165205 165614 166468 167074 167390 167632 167705 167423 167049 167109 167752 168589 169134 169046 168092 166312 164288 162835 162279
63771A62279o1k03p68j531k205k314j667p99m30n77o60l59J67P14J131J106N20
$$ 162279 162218 162015 161247 159716 157511 155197 153530 152731 152301 151724 151064 150705 150872 151586 152717 153823 154343
63754A54343k5K01R84J362J046P18Q05Q90O66N97R67J192P33Q6N6O30J353K217
$$ 154343 154318 154519 155503 156865 157911 158629 159434 160324 160990 161587 162554 163746 164479 164565 164621 165251 166604 168821
63736A68821L257L786L073J637Q16J099J753K090K178K224K180K221K771L713
$$ 168821 172078 175864 178937 180574 181390 182489 184242 186332 188510 190734 192914 195135 197906 201619
63722B01619M332M315M176M346M526M342L983L732L341K456J268J91p21j558k083
$$ 201619 205951 210266 214442 218788 223314 227656 231639 235371 238712 241168 242436 242627 241906 240348 238265
63707B38265k117k125k805m058m965m806l724k305j007r1K90K85L28O86J117J206
$$ 238265 236148 234023 231218 227160 222195 217389 213665 211360 210353 210262 210552 210837 211165 211851 212968 214174
63691B14174R51Q36J252K072K803L050K795K300J878J729J803J845J659J300R03
$$ 214174 215125 215961 217213 219285 222088 225138 227933 230233 232111 233840 235643 237488 239147 240447 241350
63676B41350M65qk53M9P58J390J768K135K512K471J908J476J760K372K444J725
$$ 241350 241815 241807 241554 241603 242361 243751 245519 247654 250166 252637 254545 256021 257781 260153 262597 264322
63660B64322O23n85j867k941l499l831m483n210n121m009k759k127j876j556j383
$$ 264322 264945 264360 262493 259552 256053 252222 247739 242529 237408 233399 230640 228513 226637 225081 223698
63645B23698j686k073j782o88O49J709K363K704K948L357L931M365M556M837N430
$$ 223698 222012 219939 218157 217469 218118 219827 222190 224894 227842 231199 235130 239495 244051 248888 254318
63630B54318N965O012N756N707N969O329O773P425Q009Q060P634P385P860R144
$$ 254318 260283 266295 272051 277758 283727 290056 296829 304254 312263 320323 327957 335342 343202 352346
63616C52346J1073J3330J5275J6313J6632J7207J8836K1409K4299K7043K9437
$$ 352346 363419 376749 392024 408337 424969 442176 461012 482421 506720 533763 563200
63605E63200L1289L2386L2580L1638K9099K4609J8425J1474M866o29m737p458
$$ 563200 594489 626875 659455 691093 720192 744801 763226 774700 779566 778937 774200 766742
63593G66742q872r166q757q182p864q120r380j2067j6020k0235k3512k5304k5799
$$ 766742 757870 748704 739947 731765 723901 715781 706401 694334 678314 658079 634567 609263 583464
63580E83464k5335k4153k2615k1131j9720j7917j5423j2578r996p864n905l919
$$ 583464 558129 533976 511361 490230 470510 452593 437170 424592 414596 406732 400827 396908
63568C96908k120q17k8N63J330K466L942N590P273R015J0905J2779J4098J4450
$$ 396908 394788 393971 393943 394506 395836 398302 402244 407834 415107 424122 435027 447806 461904 476354
63554D76354J4182J4302J5526J7620J9902K2216K5073K8923L3627L8604M2915
$$ 476354 490536 504838 520364 537984 557886 580102 605175 634098 667725 706329 749244
63543G49244M5185M3991L8867L0685K0847J0420L49p989j3239j5164j4783j3318
$$ 749244 794429 838420 877287 907972 928819 939239 939588 931599 918360 903196 888413 875095
63531H75095j1390r354p818p352p902r052j0933j4345j9660k5849l1053l4164
$$ 875095 863705 854351 846533 839181 831279 822227 811294 796949 777289 751440 720387 686223
63519F86223l5474l5719l5060l3394l1127k8922k6830k4404k1673j9247j7248
$$ 686223 650749 615030 579970 546576 515449 486527 459697 435293 413620 394373 377125
63508C77125j4940j1932r074p475p071o856o341n957o080o309n963m891l564k515
$$ 377125 362185 350253 341179 333704 326633 319777 313436 307479 301399 295090 289127 284236 280672 278157
63494B78157j868j325o70j93l88j099j459r47p8L81M72P19J106J187J069J385
$$ 278157 276289 274964 274294 274101 273713 272614 271155 270208 270130 270511 270983 271702 272808 273995 275064 276449
63478B76449K256L025L242L234L436L696L571K894J824P22M8j06m34j774l828
$$ 276449 278705 281730 284972 288206 291642 295338 298909 301803 303627 304349 304397 304291 303857 302083 298255
63463B98255n206n050m026l224k735j923o22O45J359J360P59Lj80N03J452J954
$$ 298255 293049 287999 283973 280749 278014 276091 275469 276114 277473 278833 279592 279595 279415 279918 281370 283324
63447B83324K174K736L639M362N004O345Q509J0547J1775J2904J5154J8737K2884
$$ 283324 285498 288234 291873 296235 301239 307584 316093 326640 338415 351319 366473 385210 408094
63434D08094K6972L0792L3692L4396L2102K7274K1013J4071P007R79k462k637
$$ 408094 435066 465858 499550 533946 566048 593322 614335 628406 635413 636392 633930 631293
63422F31293l30L155P220J1913J7050K2031K6510L0725L4860L8406M0435M0282
$$ 631293 630963 634118 641338 653251 670301 692332 718842 749567 784427 822833 863268 903550
63410I03550L7794L2996K5911J6834O789k432q997j2179j2794j2351j1786j1222
$$ 903550 941344 974340 1000251 1017085 1023874 1021442 1012445 1000266 987472 975121 963335 952113
63398I52113j0807j1287j3449j7400k2515k7891l2581l5850l7504l7916l7426
$$ 952113 941306 930019 916570 899170 876655 848764 816183 780333 742829 704913 667487
63387F67487l5947l3391l0200k7103k4442k2044j9563j6673j3172r365o222m553
$$ 667487 631540 598149 567949 540846 516404 494360 474797 458124 444952 435587 429365 424812
63375D24812l974l137j170J447L614M887N780P016Q739J0529J2038J3502J5501
$$ 424812 420838 417701 416531 417978 421592 426479 432259 439275 448014 458543 470581 484083 499584
63362D99584J8253K1332K4188K6630K8666L0231L1511L3166L5632L8266L9772
$$ 499584 517837 539169 563357 589987 618653 648884 680395 713561 749193 787459 827231
63351H27231L9443L7381L3553K7529J9533J1016L496k661p788j1688j3699j3843
$$ 827231 866674 904055 937608 965137 984670 995686 999182 996521 988733 977045 963346 949503
63339I49503j3109j2459j2219j2550j3916j6627k0329k4357k8350l2069l4862
$$ 949503 936394 923935 911716 899166 885250 868623 848294 823937 795587 763518 728656
63328G28656l5884l4971l2771k9888k6253k1704j6786j2375q596m832j215N64
$$ 728656 692772 657801 625030 595142 568889 547185 530399 518024 509428 504596 503381 503945
63316E03945j382o969j3877j9459k2516k3244k2277k0248j7822j5459j3169j0852
$$ 503945 502563 495594 481717 462258 439742 416498 394221 373973 356151 340692 327523 316671
63304C16671q822p545o922o334n472m683m286l962l254k333j855k064k506k662
$$ 316671 307849 300304 293382 287048 281576 276893 272607 268645 265391 263058 261203 259139 256633 253971
63290B53971k505k225j782j116n43n09r23j243j267j427j938k224j683p29l40
$$ 253971 251466 249241 247459 246343 245800 245291 244368 243125 241858 240431 238493 236269 234586 233857 233517
63275B33517o36o82J06J044J129L62m13o13l13K64R62J504J694J875K590L669
$$ 233517 232881 232199 232305 233349 234478 234840 234427 233814 233501 233765 234727 236231 237925 239800 242390 246059
63259B46059M199L664K703K383L011L986M557M450L971L777M380N606O634O905
$$ 246059 250258 253922 256625 259008 262019 266005 270562 275012 278983 282760 287140 292746 299380 306285
63245C06285O769P002P829Q802R626J0573J1972J3602J4901J5612J6055J6784
$$ 306285 313054 320056 327885 336687 346313 356886 368858 382460 397361 412973 429028 445812
63233D45812J8030J9425K0224J9961J8976J8148J8035J8369J8465J7999J7209
$$ 445812 463842 483267 503491 523452 542428 560576 578611 596980 615445 633444 650653
63222F50653J6552J6403J7019J8368J9864K0585K0010J8443J6490J4191J0979
$$ 650653 667205 683608 700627 718995 738859 759444 779454 797897 814387 828578 839557
63211H39557O474J077m387r356j3715j7552k0949k3972k6525k8231k8646k7613
$$ 839557 846031 847108 842721 833365 819650 802098 781149 757177 730652 702421 673775 646162
63199F46162k5323k2126j8477j4938j1881r143o245l080l5K635N173P850J0511
$$ 646162 620839 598713 580236 565298 553417 544274 538029 534949 534914 537549 542722 550572 561083
63186E61083J2851J4947J7005J8853K0128K0917K1675K2435K2645K2008K1073
$$ 561083 573934 588881 605886 624739 644867 665784 687459 709894 732539 754547 775620
63175G75620K0581K0531K0290J9522J8497J7427J5906J3343R712N622J561k640
$$ 775620 796201 816732 837022 856544 875041 892468 908374 921717 931429 937051 938612 935972
63163I35972p451j2915j8475k3496k7746l1261l3957l5588l6073l5655l4682l3296
$$ 935972 928521 915606 897131 873635 845889 814628 780671 745083 709010 673355 638673 605377
63151F05377l1428k9081k6526k4128k1991j9863j7506j5096j3042j1464j0047
$$ 605377 573949 544868 518342 494214 472223 452360 434854 419758 406716 395252 385205
63140C85205q524p015n834n085m629m222l562k451j112j35J31m4k27l35m08j69
$$ 385205 376681 369666 363832 358747 354118 349896 346334 343883 342771 342636 342767 342723 342496 342161 341753 341584
63124C41584O47J697K323K433K548K965L467L889M372M778M540L517K545K549
$$ 341584 342231 343928 346251 348684 351232 354197 357664 361553 365925 370703 375243 378760 381305 383854
63110C83854L410M219M422M195L840L337K612J809J117O06L40M69J035J814K385
$$ 383854 387264 391483 395905 400100 403940 407277 409889 411698 412815 413421 413761 414230 415265 417079 419464
63095D19464K439K073J733J751J883J548N56n97j343j632j745j818j827j768j523
$$ 419464 421903 423976 425709 427460 429343 430891 431447 430850 429507 427875 426130 424312 422485 420717 419194
63080D19194p71M88J562J730J334J624L335N836P865Q806Q971Q972R174R697J0538
$$ 419194 418423 418911 420473 422203 423537 425161 428496 434332 442197 451003 459974 468946 478120 487817 498355
63065D98355J1578J2644J3697J4928J6611J8797K1187K3346K5098K6683K8562
$$ 498355 509933 522577 536274 551202 567813 586610 607797 631143 656241 682924 711486
63054G11486L1086L4235L7516M0190M1894M3064M4485M6262M7637M7957M7483
$$ 711486 742572 776807 814323 854513 896407 939471 983956 1030218 1077855 1125812 1173295
63043A173295M6919M6484M5943M5329M5024M5123M5289M5371M5596M5904M5456
$$ 1173295 1220214 1266698 1312641 1357970 1402994 1448117 1493406 1538777 1584373 1630277 1675733
63032A675733M3277L9208L3819K7509K0023J0968M98j0726k2017l2851m2592n0463
$$ 1675733 1719010 1758218 1792037 1819546 1839569 1850537 1851035 1840309 1818292 1785441 1742849 1692386
63020A692386n6047n9623o1614o1910o0099n6285n1162m5265l8675l1596k4575
$$ 1692386 1636339 1576716 1515102 1453192 1393093 1336808 1285646 1240381 1201706 1170110 1145535
63009A145535j7826j0953l825K868Q521J3559J8774K4067K8686L2352L5286L7270
$$ 1145535 1127709 1116756 1112931 1115799 1124320 1137879 1156653 1180720 1209406 1241758 1277044 1314314
62997A314314L7765L7109L6531L6643L6745L6054L4911L4147L3784L3007L1087
$$ 1314314 1352079 1389188 1425719 1462362 1499107 1535161 1570072 1604219 1638003 1671010 1702097
62986A702097K7869K3536J8298J2233N179l058j2307k2039l1825m1422n0393n8098
$$ 1702097 1729966 1753502 1771800 1784033 1789212 1786154 1773847 1751808 1719983 1678561 1628168 1570070
62974A570070o4230o8839p1751p2514p1156o8395o4744o0096n4614m9256m4736
$$ 1570070 1505840 1437001 1365250 1292736 1221580 1153185 1088441 1028345 973731 924475 879739
62963H79739m0496l5625l0517k6641k4689k3747k2457k0438j8250j6486j5264
$$ 879739 839243 803618 773101 746460 721771 698024 675567 655129 636879 620393 605129
62952F05129j4486j4190j4413j4768j4530j3478j2397j2217j2687j2673j1722
$$ 605129 590643 576453 562040 547272 532742 519264 506867 494650 481963 469290 457568
62941D57568j0562r783r022p968p188p149p231o698n969n791n780n046l906l528
$$ 457568 447006 437223 428201 420233 413045 405896 398665 391967 385998 380207 374427 369381 365475 361947
62927C61947l987m126l473k794k477j797m18O92O61M5j33J17J60r5l54p31j406
$$ 361947 357960 353834 350361 347567 345090 343293 342875 343567 344228 344273 344140 344257 344417 344322 343968 343237 341831
62910C41831j911j704j152j055j412j507j192j122j656k323k559k363k000j556
$$ 341831 339920 338216 337064 336009 334597 333090 331898 330776 329120 326797 324238 321875 319875 318319
62896C18319j053o12l02p8P8J55K94O15R09Q20L71o7k51j70J97P71J090O85j68
$$ 318319 317266 316654 316352 316274 316352 316507 316801 317416 318325 319145 319516 319449 319198 319028 319225 319996 321086 321771 321603
62877C21603o32l82Q8L70O65J124J261O67k40p69r23j140j312q75J20Q10O47J02
$$ 321603 320971 320589 320677 321047 321712 322836 324097 324764 324524 323755 322832 321692 320380 319505 319625 320435 321082 321184
62859C21184p8K02N48P67R07Q75M93r3m33k32L65R49J122P21M9k94J8N98Q04M53
$$ 321184 321106 321308 321856 322623 323530 324405 324898 324805 324372 324140 324505 325454 326576 327297 327346 327052 327070 327668 328472 328925
62839C28925j08n81r43j144j058q18p93r47p12J87J125J274P03L25P31J589K171
$$ 328925 328817 328236 327293 326149 325091 324273 323480 322533 321821 322008 323133 324407 325110 325435 326166 327755 329926
62822C29926K198J988K006K370K701K471J675J065J472K882M446N388N621N447
$$ 329926 332124 334112 336118 338488 341189 343660 345335 346400 347872 350754 355200 360588 366209 371656
62808C71656N085M680M466M616N057N660O462P503Q652R796J1041J2399J3499
$$ 371656 376741 381421 385887 390503 395560 401220 407682 415185 423837 433633 444674 457073 470572
62795D70572J3931J3878J3964J4526J5456J6815J9017K2124K5497K8681L2149
$$ 470572 484503 498381 512345 526871 542327 559142 578159 600283 625780 654461 686610
62784F86610L6562M1510M5903M9595N3755N9215O5264P0587P4699P7699P9182
$$ 686610 723172 764682 810585 860180 913935 973150 1038414 1109001 1183700 1261399 1340581
62773A340581P8494P5790P1770O6209N7888M6405L3096J9602O175p765k1954l5112
$$ 1340581 1419075 1494865 1566635 1632844 1690732 1737137 1770233 1789835 1796010 1788245 1766291 1731179
62761A731179m6196n5159o2423o8178p2260p4296p4008p1800o8873o6294o4028
$$ 1731179 1684983 1629824 1567401 1499223 1426963 1352667 1278659 1206859 1137986 1071692 1007664
62750A007664o1291n7779n3916m9986m5734m1028l6339l2193k8552k5138k1992
$$ 1007664 946373 888594 834678 784692 738958 697930 661591 629398 600846 575708 553716
62739E53716j9378j7307j5465j3530j1439r367p597o259n216m292l570l184k849
$$ 553716 534338 517031 501566 488036 476597 467230 459633 453374 448158 443866 440296 437112 434263
62726D34263k043p32N02J229J744K547L607M511N161N909P027Q407R858J1447
$$ 434263 432220 431488 431990 433219 434963 437510 441117 445628 450789 456698 463725 472132 481990 493437
62712D93437J3360J5551J7744J9822K2107K5034K8601L2337L5934L9695M4116
$$ 493437 506797 522348 540092 559914 582021 607055 635656 667993 703927 743622 787738
62701G87738M9201N4477N9551O4361O8907P3087P6713P9497Q0937Q0574P8250
$$ 787738 836939 891416 950967 1015328 1084235 1157322 1234035 1313532 1394469 1475043 1553293
62690A553293P3901O7203N7824M6026L2529J7857K283j3530k8469m1793n3527
$$ 1553293 1627194 1694397 1752221 1798247 1830776 1848633 1850916 1837386 1808917 1767124 1713597
62679A713597o3791p2172p8095q1426q2467q1599p9282p6075p2325o7994o2987
$$ 1713597 1649806 1577634 1499539 1418113 1335646 1254047 1174765 1098690 1026365 958371 895384
62668H95384n7536n2086m7032m2599l8745l5133l1551k8293k5742k3592k1160
$$ 895384 837848 785762 738730 696131 657386 622253 590702 562409 536667 513075 491915
62657D91915j8507j6395j4850j2815r888p467p104q295r043q413p378p062p255
$$ 491915 473408 457013 442163 429348 419460 411993 404889 396594 387551 379138 371760 364698 357443
62644C57443p017o048m896m195m021l852l109j882r57q26r16l19Q79J633J292
$$ 357443 350426 344378 339482 335287 331266 327414 324305 322423 321466 320640 319724 319405 320284 321917 323209
62629C23209K89o06j102j275j222j053q84o04K0Q51J340J174O51L65P42J861L329
$$ 323209 323498 322892 321790 320515 319293 318240 317356 316752 316772 317623 318963 320137 320788 321153 321895 323756 327085
62612C27085M402M735M973O006P666Q878R216R486J0392J1555J2384J3241J4882
$$ 327085 331487 336222 341195 347201 354867 363745 372961 382447 392839 404394 416778 430019 444901
62599D44901J7303J9887K2443K5215K8148L0912L3534L6159L8267L8926L8022
$$ 444901 462204 482091 504534 529749 557897 588809 622343 658502 696769 735695 773717
62588G73717L6391L4436L1425K6611K0389J3678O648j143r495j7322k3675k8522
$$ 773717 810108 844544 875969 902580 922969 936647 943295 942152 932657 915335 891660 863138
62576H63138l2198l4714l5923l6076l5686l4951l3644l1635k9192k6683k4243
$$ 863138 830940 796226 760303 724227 688541 653590 619946 588311 559119 532436 508193
62565E08193k1870j9714j7965j6587j5283j3851j2368j1012r775q481p067n698
$$ 508193 486323 466609 448644 432057 416774 402923 390555 379543 369768 361287 354220 348522
62553C48522m597l779l104k516k140k021j901j456p16r4Q6m0l7L85J124J830K232
$$ 348522 343925 340146 337042 334526 332386 330365 328464 327008 326292 326198 326284 326244 326207 326592 327716 329546 331778
62536C31778K411K692L213L658L614L142K776K961L783N225P296R702J1796J3196
$$ 331778 334189 336881 340094 343752 347366 350508 353284 356245 360028 365253 372549 382251 394047 407243
62522D07243J4274J5764J8038K0935K4090K7130K9773L2056L4315L6782L9345
$$ 407243 421517 437281 455319 476254 500344 527474 557247 589303 623618 660400 699745
62511F99745M1874M4342M6334M6839M5078M1273L6172L0151K3307J6009Q589P10
$$ 699745 741619 785961 832295 879134 924212 965485 1001657 1031808 1055115 1071124 1079713 1080423
62499A080423p996j6744k3965k8971l2412l4881l6072l5599l3757l0928k7099
$$ 1080423 1072427 1055683 1031718 1002747 970335 935454 899382 863783 830026 799098 771999
62488G71999k2567j8347j5066j2049q284l840N03M519Q502J2243J5084J6976J8595
$$ 771999 749432 731085 716019 703970 695686 691846 692349 696868 705370 717613 732697 749673 768268
62475G68268K0316K1703K2136K1227J8655J4381R126M000o30n299j0376j5577
$$ 768268 788584 810287 832423 853650 872305 886686 895812 899812 899182 893883 883507 867930
62463H67930k0673k5801l0631l4096l5560l5694l5485l4938l3545l1472k9293
$$ 867930 847257 821456 790825 756729 721169 685475 649990 615052 581507 550035 520742
62452E20742k6859k3596j9879j6980j5328j3822j1510q991p411o664n705m218
$$ 520742 493883 470287 450408 433428 418100 404278 392768 383777 376366 369702 363997 359779
62440C59779k980k432j967r68J84P67Q34J048J629K066J832R20l59j751l082m207
$$ 359779 356799 354367 352400 351432 351616 352383 353217 354265 355894 357960 359792 360712 360353 358602 355520 351313
62424C51313n084n751o161o178n789n166m517l987l648l464l271k966k660k469
$$ 351313 346229 340478 334317 328139 322350 317184 312667 308680 305032 301568 298297 295331 292671 290202
62410B90202k208j552n26M02P66N00j32p21r12o66l78m89q84j010n91J12Q30J611
$$ 290202 287994 286442 285916 286318 287084 287584 287452 286731 285819 285153 284775 284286 283402 282392 281801 281913 282743 284354
62392B84354K402K789K538K087K007K171J936J153N25Q65K201L741M568M433L957
$$ 284354 286756 289545 292083 294170 296177 298348 300284 301437 301962 302827 305028 308769 313337 317770 321727
62377C21727M046N000O294P324Q110R049J0191J1179J1851J2469J3303J4292J5288
$$ 321727 325773 330773 337067 344391 352501 361550 371741 382920 394771 407240 420543 434835 450123
62364D50123J6429J8103K0588K3784K7281L0748L4315L8375M2938M7448N1443
$$ 450123 466552 484655 505243 529027 556308 587056 621371 659746 702684 750132 801575
62353H01575N5037N8240O0116N9321N5456M9330M1723L2692K2461J2209L229m429
$$ 801575 856612 914852 974968 1034289 1089745 1139075 1180798 1213490 1235951 1248160 1251389 1246960
62341A246960j1744j9272k6490l2633l7564m1603m4925m7444m8990m9339m8218
$$ 1246960 1235216 1215944 1189454 1156821 1119257 1077654 1032729 985285 936295 886956 838738
62330H38738m5552m1681l7146l2319k7419k2875j9375j7355j6448j5677j4353
$$ 838738 793186 751505 714359 682040 654621 631746 612371 595016 578568 562891 548538
62319E48538j2836j2183j3000j4736j6234j6769j6358j5296j3804j2159j0747
$$ 548538 535702 523519 510519 495783 479549 462780 446422 431126 417322 405163 394416
62308C94416r735q931q121p293o427n404m347l664l440l139k381j694j786k312
$$ 394416 384681 375750 367629 360336 353909 348505 344158 340494 337054 333915 331534 329840 328054 325742
62294C25742k151r95J85N55M69O52J054J216J200J392J709J859K154L152M531
$$ 325742 323591 322596 322781 323336 323805 324457 325511 326727 327927 329319 331028 332887 335041 338193 342724
62279C42724N213M785M039L877M371N184O188P179P660P449P185P640Q822J0194
$$ 342724 347937 352722 356761 360638 365009 370193 376381 383560 391220 398669 405854 413494 422316 432510
62265D32510J1580J3363J5881J9067K2535K5862K8911L2140L6312M1629M7327
$$ 432510 444090 457453 473334 492401 514936 540798 569709 601849 638161 679790 727117
62254G27117N2449N6667O0021O2228O2782O1400N7792N1267M1390K9116J6681
$$ 727117 779566 836233 896254 958482 1021264 1082664 1140456 1191723 1233113 1262229 1278910
62243A278910O011k459r508j6208k3284l0817l8227m4782n0142n4217n6676n7218
$$ 1278910 1284921 1282462 1272954 1256746 1233462 1202645 1164418 1119636 1069494 1015277 958601 901383
62231I01383n6220n4470n2049m8276m3050l7548l3043k9553k6301k3047k0171
$$ 901383 845163 790693 738644 690368 647318 609770 576727 547174 520873 497826 477655
62220D77655j7712j5216j2579j0357q986q203p514o806o263n980n938o099o231
$$ 477655 459943 444727 432148 421791 412805 404602 397088 390282 384019 378039 372101 366002 359771
62207C59771n947n174m392m072l977l434k300j193o31l02M57J681K713L121L249
$$ 359771 353824 348650 344258 340186 336209 332775 330475 329282 328651 328349 328806 330487 333200 336321 339570
62192C39570L750M771N946O938P767Q542R214R660R905J0115J0411J0737J0889
$$ 339570 343320 348091 354037 360975 368742 377284 386498 396158 406063 416178 426589 437326 448215
62179D48215J0605R740Q395O941N896N674O377P748R419J1243J3405J6253K0021
$$ 448215 458820 468560 476955 483896 489792 495466 501843 509591 519010 530253 543658 559911 579932
62166E79932K4609K9554L4324L8805M3336M7895N1383N2213M9818M5141L9416
$$ 579932 604541 634095 668419 707224 750560 798455 849838 902051 951869 997010 1036426
62155A036426L2960K5616J7858J0653M335j659p810j3930j9688k5149l0384l5047
$$ 1036426 1069386 1095002 1112860 1123513 1127848 1126189 1118379 1104449 1084761 1059612 1029228 994181
62143I94181l8654m0997m1998m1484l9512l6674l3609l0390k6799k3061j9766
$$ 994181 955527 914530 872532 831048 791536 754862 721253 690863 664064 641003 621237
62132F21237j7034j4241j0889p372m560k721j267M71K504M426O051P370Q001P272
$$ 621237 604203 589962 579073 571701 567141 564420 563153 563624 566128 570554 576605 583975 591976 599248
62118E99248N084K317n6j850l156l425j989M61J886Q68k058n471q685j1610j3586
$$ 599248 604332 606649 606593 604743 601587 598162 596173 596634 598520 599388 597330 591859 583174 571564 557978
62103E57978j3553j1424q426n808l783j931q9J530K675L301L693M430N829P313
$$ 557978 544425 533001 524575 518767 514984 513053 512964 514494 517169 520470 524163 528593 534422 541735
62089E41735P860P341O847P311Q306Q834Q882R417J0953J2898J4489J5634J6578
$$ 541735 549595 556936 563783 571094 579400 588234 597116 606533 617486 630384 644873 660507 677085
62076F77085J7363J8045J9000K0461K1970K2824K2964K2871K2726K2242K1491
$$ 677085 694448 712493 731493 751954 773924 796748 819712 842583 865309 887551 909042
62065I09042K1328K2551K4930K7488K9572L1175L2193L1918K9660K5607K0645
$$ 909042 930370 952921 977851 1005339 1034911 1066086 1098279 1130197 1159857 1185464 1206109
62054A206109J5336R524L157k983p916j1747j5712k0744k6430l1710l6135l9888
$$ 1206109 1221445 1230969 1234126 1231143 1223227 1211480 1195768 1175024 1148594 1116884 1080749 1040861
62042A040861m2867m4524m4711m4026m2986m1443l9180l6618l4267l1839k8629
$$ 1040861 997994 953470 908759 864733 821747 780304 741124 704506 670239 638400 609771
62031F09771k4741k1164j8466j6060j3254j0484q827q415q116p006n606n138n802
$$ 609771 585030 563866 545400 529340 516086 505602 496775 488360 480244 473238 467632 462494 456692
62018D56692o508o391n967o268p220p554o389m287k503j654j488j510j299m27
$$ 456692 450184 443793 437826 431558 424338 416784 410395 406108 403605 401951 400463 398953 397654 397227
62004C97227J323L569N549O824P496P779P682P165O287N043L374J418m04j752
$$ 397227 398550 402119 407668 414492 421988 429767 437449 444614 450901 455944 459318 460736 460332 458580
61990D58580k613l160l531l900m549n708p299q914j0024j0330r988r420q795p888
$$ 458580 455967 452807 449276 445376 440827 435119 427820 418906 408882 398552 388564 379144 370349 362461
61976C62461o632n508m959m695m112l292k876k963k882k277j664j513j484j099
$$ 362461 355829 350321 345362 340667 336555 333263 330387 327424 324542 322265 320601 319088 317604 316505
61962C16505o05m35m24k23j20m77p26K3J412K071J625J342K300L881M920N538
$$ 316505 315900 315465 315041 314818 314698 314221 313495 313518 314930 317001 318626 319968 322268 326149 331069 336607
61946C36607O745Q668J0301J1021J1394J2276J3819J5726J7783J9753K1187K1845
$$ 336607 343352 352020 362321 373342 384736 397012 410831 426557 444340 464093 485280 507125
61934E07125K2031K2102K1913K1167K0099J9223J8446J7021J4491J1353Q502O285
$$ 507125 529156 551258 573171 594338 614437 633660 652106 669127 683618 694971 703473 709758
61922G09758M300J895j242m818p967r728r768q707p544o752n905m175j137K850
$$ 709758 714058 715953 714711 709893 701926 692198 682430 673723 666179 659427 653522 649347 648210 651060
61908F51060O969J0645J3842J6623J8614J9269J8536J6875J4492J1114O737K094
$$ 651060 658029 668674 682516 699139 717753 737022 755558 772433 786925 798039 804776 806870
61896H06870k086n929j0027j4409j8458k1657k3875k4994k4908k3903k2514k0888
$$ 806870 804784 798855 788828 774419 755961 734304 710429 685435 660527 636624 614110 593222
61884E93222j8776j6306j4183j2964j2535j2521j2702j2782j2255j0929r283p964
$$ 593222 574446 558140 543957 530993 518458 505937 493235 480453 468198 457269 447986 440022
61872D40022p105o388n520m406l098j784o29N48K058L713M913N602O558Q367J0569
$$ 440022 432917 426529 421009 416603 413505 411721 411092 411640 413698 417411 422324 427926 434484 442851 453420
61857D53420J2446J4150J6361J9057K1518K3420K5241K7402K9687L1699L3351
$$ 453420 465866 480016 496377 515434 536952 560372 585613 613015 642702 674401 707752
61846G07752L4611L5163L4630L3015L0671K7942K4803K0797J5400Q675J453n277
$$ 707752 742363 777526 812156 845171 875842 903784 928587 949384 964784 973459 974912 969635
61834I69635j0976j5313j7781j8095j6808j4828j2366q937m454M08N067R561J3809
$$ 969635 958659 943346 925565 907470 890662 875834 863468 854531 850077 850485 855552 865113 878922
61821H78922J7021J8336J7634J5239J1210N587r94p693j4354k1331k8276l3843
$$ 878922 895943 914279 931913 947152 958362 963949 962955 955262 940908 919577 891301 857458
61809H57458l6997l8140l8441l8392l7628l6034l4189l2436l0174k6736k2617
$$ 857458 820461 782321 743880 705488 667860 631826 597637 565201 535027 508291 485674
61798D85674j9119j6760j4832j2647j0521r064q192p431o800o581o530o052n131
$$ 485674 466555 449795 434963 422316 411795 402731 394539 387108 380308 373727 367197 361145 356014
61785C56014m313l768l088k147j430j277j351j236j024r78j035j033j065j159
$$ 356014 351701 347933 344845 342698 341268 339991 338640 337404 336380 335402 334367 333334 332269 331110
61771C31110r24lJ266K059J900J057J63l29l80j98P5M88R80J157P62J98J16M27
$$ 331110 330186 330183 331449 333508 335408 336465 336628 336299 335919 335721 335796 336284 337264 338421 339183 339381 339497 339924
61753C39924L83k41p35n30k0J97K61N52P91M50j90k91L70J097J252Q77L69O8K30
$$ 339924 340307 340066 339331 338801 338781 338978 339239 339791 340582 341032 340842 340551 340921 342018 343270 344147 344516 344584 344814
61734C44814Q23J321J197P49Q54J772K742L040K909L067L683M274M380M046L615
$$ 344814 345637 346958 348155 348904 349758 351530 354272 357312 360221 363288 366971 371245 375625 379671 383286
61719C83286L331L181L040L006L377M141M666M265L028J700P02k41j498k972m341
$$ 383286 386617 389798 392838 395844 399221 403362 408028 412293 415321 417021 417723 417482 415984 413012 408671
61704D08671n371n842n585m828m125l697l232k614k307k635l080k951k442k420
$$ 408671 403300 397458 391873 387045 382920 379223 375991 373377 371070 368435 365355 362404 359962 357542
61690C57542l202m104m287l652k788k337k448k729k669k251j955k042k101j663
$$ 357542 354340 350236 345949 342297 339509 337172 334724 331995 329326 327075 325120 323078 320977 319314
61676C19314r65o21o42m65P9M10N3o94j200j235r57n24j11K2j58k34J35O69Q07
$$ 319314 318349 317728 317086 316621 316700 317110 317163 316469 315269 314034 313077 312553 312442 312464 312306 312072 312207 312876 313683
61657C13683N27M16Q46J494J800J639J358J268J352J395J313J312J708K562L490
$$ 313683 314210 314626 315472 316966 318766 320405 321763 323031 324383 325778 327091 328403 330111 332673 336163
61642C36163M007M053M006M131M214L893L208K482J764P17p09j921k302k067k087
$$ 336163 340170 344223 348229 352360 356574 360467 363675 366157 367921 368638 367929 366008 363706 361639 359552
61627C59552k767l557l720l297k926k963l152l097k681j986j144l44K72Q13J480
$$ 359552 356785 353228 349508 346211 343285 340322 337170 334073 331392 329406 328262 327918 328190 329003 330483
61612C30483K100K119J258j29j530k837m122n136n478n173m682m297l880l294
$$ 330483 332583 334702 335960 335831 334301 331464 327342 322206 316728 311555 306873 302576 298696 295402
61598B95402k744k580k902l520m131m433m300l907l589l465l360l136k902k732
$$ 295402 292658 290078 287176 283656 279525 275092 270792 266885 263296 259831 256471 253335 250433 247701
61584B47701k427j776r77n36p63j454k095k276j970j551j488j887k359k487k313
$$ 247701 245274 243498 242521 241985 241222 239768 237673 235397 233427 231876 230388 228501 226142 223655 221342
61569B21342k146j994j557q24l43n43j115j353j073p41p22p92n93k49j57k98j94
$$ 221342 219196 217202 215645 214821 214478 213935 212820 211467 210394 209653 208931 208139 207546 207297 207140 206842 206648
61552B06648L95J046J187Q62O34Q01R96P07M1l94l17j76m74r67r35j76O85J076
$$ 206648 207043 208089 209276 210138 210772 211573 212569 213276 213317 212923 212606 212430 211956 210989 210054 209878 210563 211639
61534B11639J163J369J635J674J659J991K381J954N02j018j634j517j459j646
$$ 211639 212802 214171 215806 217480 219139 221130 223511 225465 225967 224949 223315 221798 220339 218693
61520B18693j635j358j357j939k652k873k557k113j845j714j527j156o34j39J81
$$ 218693 217058 215700 214343 212404 209752 206879 204322 202209 200364 198650 197123 195967 195333 195194 195375
61505A95375L45L97K28k61q35j051p92m33m22p79j150j141o41O6N12M83K51J44
$$ 195375 195720 196117 196345 196084 195249 194198 193406 192973 192551 191772 190622 189481 188840 188906 189418 189901 190152 190296
61487A90296L7m12j036j174n25L72Q26P98P19P59P34O71R19J530J917J526P08
$$ 190296 190333 189921 188885 187711 187186 187558 188384 189182 189901 190660 191394 192065 192984 194514 196431 197957 198665
61470A98665M42J045J613J142p1p40l27L03K05l77o36m97m28l62K42J284J874
$$ 198665 199107 200152 201765 202907 202836 202096 201769 202072 202277 201900 201264 200767 200339 199977 200219 201503 203377
61453B03377J524P10J29k0J63N05N54p9r49j029j11Q19R62P09P72J088J302J626
$$ 203377 204901 205611 205740 205720 205883 206388 206942 206863 205914 204885 204774 205593 206555 207264 208036 209124 210426 212052
61435B12052K410L343L884M068M151L883K987J987J659J890J918J500R82M31l58
$$ 212052 214462 217805 221689 225757 229908 233791 236778 238765 240424 242314 244232 245732 246714 247145 246787
61420B46787j029q88k5O78Q68J112J812K556K860K778K377J413o2j347j881j879
$$ 246787 245758 244870 244845 245523 246391 247503 249315 251871 254731 257509 259886 261299 261237 259890 258009 256130
61404B56130j822j815j831k081k639l088l016k600k295k212k148j998j750j318
$$ 256130 254308 252493 250662 248581 245942 242854 239838 237238 234943 232731 230583 228585 226835 225517
61390B25517p44l99o48j338j837j630p82J05M34K08J5L15R06J377J740K139K259
$$ 225517 224773 224374 223726 222388 220551 218921 218139 218244 218678 218886 218901 219216 220122 221499 223239 225378 227637
61373B27637J736R96Q69J312J422Q80N08R69J776K139K098K193K581L071L547
$$ 227637 229373 230369 231238 232550 233972 234852 235360 236329 238105 240244 242342 244535 247116 250187 253734
61358B53734L813L533K899K802L709M879N401N551O192P266P838P495O730N910
$$ 253734 257547 261080 263979 266781 270490 275369 280770 286321 292513 299779 307617 315112 321842 327752
61344C27752M836L542K687K738L371M019M565N117N498N419M931M359L812L082
$$ 327752 332588 336130 338817 341555 344926 348945 353510 358627 364125 369544 374475 378834 382646 385728
61330C85728J991O79n32j491k361l355m349m893m677l852k889k201j911j843j660
$$ 385728 387719 388398 387866 386375 384014 380659 376310 371417 366740 362888 359999 357798 355887 354044 352384
61315C52384j193n85J4Q12K014L282L980M086M241M852N694O579P655Q620Q472
$$ 352384 351191 350606 350620 351432 353446 356728 360708 364794 369035 373887 379581 386160 393815 402435 410907
61300D10907O687M133K064O69o55j966k697k726k611k756l007l248l636m117m292
$$ 410907 417594 421727 423791 424460 423805 421839 419142 416416 413805 411049 408042 404794 401158 397041 392749
61285C92749l949l373k925k674k489k183j595q09j74J72O24J497K382K673K567
$$ 392749 388800 385427 382502 379828 377339 375156 373561 372752 372578 372750 373374 374871 377253 379926 382493
61270C82493K864L769M612M781M354L729L276L416M379N699O553O791P007P428
$$ 382493 385357 389126 393738 398519 402873 406602 409878 413294 417673 423372 429925 436716 443723 451151
61256D51151P436O542N172M015L193K536K259K721L746M700N062M644L499J989
$$ 451151 458587 465129 470301 474316 477509 480045 482304 485025 488771 493471 498533 503177 506676 508665
61242E08665P64J37l49j379k951m358n067n305n670o351o928o891o204n252m267
$$ 508665 509429 509566 509217 507838 504887 500529 495462 490157 484487 478136 471208 464317 458113 452861 448594
61227D48594l100j700n18n1j48j93O3L49N12Q37J552K488L415M275M893M874M111
$$ 448594 445494 443794 443276 443225 443077 442884 442947 443296 443808 444645 446197 448685 452100 456375 461268 466142 470253
61210D70253L089K362J966J544Q74Q5m42k21J011K888M600N665O332P142Q348
$$ 470253 473342 475704 477670 479214 480088 480173 479731 479510 480521 483409 488009 493674 500006 507148 515496
61195E15496R889J1580J3077J3990J4233J4061J3544J2358J0357Q083O330N399
$$ 515496 525385 536965 550042 564032 578265 592326 605870 618228 628585 636668 642998 648397
61183F48397N018M820M605M330M103M062M024L490K289J008M75Q12J265R52l63
$$ 648397 653415 658235 662840 667170 671273 675335 679359 682849 685138 686146 686621 687433 688698 689650 689287
61168F89287k126l487m041m195m658n562o370o751p154q229r950j1617j2517j2376
$$ 689287 687161 683674 679633 675438 670780 665218 658848 652097 644943 636714 626764 615147 602630 590254
61154E90254j1373j0066r027q227p026n117l260k586l326m740o132p419q647r638
$$ 590254 578881 568815 559788 551561 544535 539418 536158 533572 530246 525506 519374 511955 503308 493670
61140D93670j0273j0665j0694r869q007n783m131l255k662k015j445j017l91O86
$$ 493670 483397 472732 462038 452169 444162 438379 434248 430993 428331 426316 424871 423854 423463 424149
61126D24149J943K988L927N150O684Q217R677J1275J2930J4233J5202J6516J8573
$$ 424149 426092 429080 433007 438157 444841 453058 462735 474010 486940 501173 516375 532891 551464
61113E51464K0800K2409K3391K4203K4819K4890K4646K4709K4990K4582K3030
$$ 551464 572264 594673 618064 642267 667086 691976 716622 741331 766321 790903 813933
61102H13933K0892J8721J6241J3109R751O751L877O07k671m945o161p590j0201
$$ 813933 834825 853546 869787 882896 892647 899398 903275 903882 901211 896266 890105 882515 872314
61089H72314j3283j5314j5933j6266j7298j8578j9059j8717j8572j9084j9364
$$ 872314 859031 843717 827784 811518 794220 775642 756583 737866 719294 700210 680846
61078F80846j8405j6537j5008j4444j4368j4130j3546j2641j1332r666p892o174
$$ 680846 662441 645904 630896 616452 602084 587954 574408 561767 550435 540769 532877 526703
61066E26703m528l111k086j233j61J034J847K201K666L646M922O132P183P943
$$ 526703 522175 519064 516978 515745 515584 516618 518465 520666 523332 526978 531900 538032 545215 553158
61052E53158Q150Q019Q364R738J1778J3805J5579J7253J8923K0620K2389K4128
$$ 553158 561308 569327 577691 587429 599207 613012 628591 645844 664767 685387 707776 731904
61040G31904K5712K7439K9898L3189L6755M0156M3383M6249M8175M9027M9391
$$ 731904 757616 785055 814953 848142 884897 925053 968436 1014685 1062860 1111887 1161278
61029A161278M9699M9879N0377N2528N7119O3295O9804P6672Q4616R3405J02033
$$ 1161278 1210977 1260856 1311233 1363761 1420880 1484175 1553979 1630651 1715267 1808672 1910705
61018A910705J10595J21178J37007J61092J95088K38575K89683L47169M11855
$$ 1910705 2021300 2142478 2279485 2440577 2635665 2874240 3163923 3511092 3922947
61009C922947M86337N75068O86188Q31915J024440J268559J552296J833709K030072
$$ 3922947 4409284 4984352 5670540 6502455 7526895 8795454 10347750 12181459 14211531
61000A4211531K031432J754401J211236N34565p7399m59746n48556l80205n3488
$$ 14211531 16242963 17997364 19208600 19743165 19665766 19206020 18657464 18277259 18223771
60991A8223771K97819N20472M79844J26062m61898j106595j624918j913270j968481
$$ 18223771 18521590 19042062 19521906 19647968 19186070 18079475 16454557 14541287 12572806
60982A2572806j850944j636383j388216j149449r42131p71008o31590n17948m25380
$$ 12572806 10721862 9085479 7697263 6547814 5605683 4834675 4203085 3685137 3259757
60973C259757l49773k87825k37909j99275j70337j48563j31617j17861j06093
$$ 3259757 2909984 2622159 2384250 2184975 2014638 1866075 1734458 1616597 1510504
60964A510504r5684q6697p9110p2030o4336n5997m8098m1676l6977l3731l1647
$$ 1510504 1414820 1328123 1249013 1176983 1112647 1056650 1008552 966876 929899 896168 864521
60953H64521l0526l0170l0232l0046k8889k6618k3765k0935j8289j5816j3681
$$ 864521 833995 803825 773593 743547 714658 688040 664275 643340 625051 609235 595554
60942E95554j2043j0850j0050r691r583r256q535p813p489p531p802q358r037
$$ 595554 583511 572661 562611 552920 543337 534081 525546 517733 510244 502713 494911 486553 477516
60929D77516r278q822q171p848p653p189o760o942p496p478o490n220m508m368
$$ 477516 468238 459416 451245 443397 435744 428555 421795 414853 407357 399879 393389 388169 383661 379293
60915C79293m113l206j886r53r37j443j515p55K53Q34J108J561K131K299J945
$$ 379293 375180 371974 370088 369135 368198 366755 365240 364485 364738 365572 366680 368241 370372 372671 374616
60900C74616J494J251J110R11P23N47K14l77j087j728k253k659k942l120l229
$$ 374616 376110 377361 378471 379382 380105 380652 380866 380489 379402 377674 375421 372762 369820 366700 363471
60885C63471l327l596m250n157n727n479m647l915l609l407k863j903p77K37J036
$$ 363471 360144 356548 352298 347141 341414 335935 331288 327373 323764 320357 317494 315591 314814 315051 316087
60870C16087J660K167K560K880L348M148N039N519N464N317N351N168M358L353
$$ 316087 317747 319914 322474 325354 328702 332850 337889 343408 348872 354189 359540 364708 369066 372419
60856C72419L088L863M983N607N491M921M199L452K647J719O94k35q42r99o64
$$ 372419 375507 379370 384353 389960 395451 400372 404571 408023 410670 412389 413083 412848 412006 411007 410343
60841D10343K7N33J59j132k383k687k373k603l723m705m557l657l211l631m103
$$ 410343 410370 410903 411062 409930 407547 404860 402487 399884 396161 391456 386899 383242 380031 376400 372297
60826C72297l789k905k318k399k665k532k000j451j045o25j70J17J57K71Q36J865
$$ 372297 368508 365603 363285 360886 358221 355689 353689 352238 351193 350568 350398 350515 350672 350943 351779 353644
60810C53644L027L976M564M881N180N693O401P086P643Q226R022J0004J1011J1999
$$ 353644 356671 360647 365211 370092 375272 380965 387366 394452 402095 410321 419343 429347 440358 452357
60796D52357J3120J4579J6360J8093J9259J9745K0052K0760K1929K3201K4347
$$ 452357 465477 480056 496416 514509 533768 553513 573565 594325 616254 639455 663802
60785F63802K5328K5974K6053K5571K4579K2807K0027J6666J3359R890N483K89
$$ 663802 689130 715104 741157 766728 791307 814114 834141 850807 864166 874056 879539 879828
60773H79828m338p546j0094j3069j6253j8594j9743k0305k0798k1260k1642k1895
$$ 879828 875490 867944 857850 844781 828528 809934 790191 769886 749088 727828 706186 684291
60761F84291k1712k0847j9638j8714j8275j8096j7999j7829j7259j6199j5145
$$ 684291 662579 641732 622094 603380 585105 567009 549010 531181 513922 497723 482578
60750D82578j4529j3994j2979j1684j0627r610q078o411n679o040o432o193n916
$$ 482578 468049 454055 441076 429392 418765 409155 401077 394666 388987 382947 376515 370322 364406
60737C64406o297o994p277p092o801o376n509m238k953k030j684j868k043j542
$$ 364406 358109 351115 343838 336746 329945 323569 318060 313822 310869 308839 307155 305287 303244 301702
60723C01702m36L96M17J51K73O25O76N36P63J376J772J562Q94P0o70j036r67j038
$$ 301702 301266 301662 302079 302230 302503 303128 303804 304340 305103 306479 308251 309813 310707 310777 310107 309071 308104 307066
60705C07066j985l595m706m545l705l302l558l707l214k558k556l268l915l767
$$ 307066 305081 301486 296780 292235 288530 285228 281670 277963 274749 272191 269635 266367 262452 258685
60691B58685k816j625q04o82j194j900k261k104j674j188n77J89Q40J155J313
$$ 258685 255869 254244 253440 252758 251564 249664 247403 245299 243625 242437 241860 242049 242889 244044 245357
60676B45357J563J791J820J759J700J364O74L04Q75J786J772O22o23j253j622
$$ 245357 246920 248711 250531 252290 253990 255354 256028 256332 257207 258993 260765 261387 260764 259511 257889
60661B57889j920j475MJ495J950J855K357L361L752L291L021L589M289M270L781
$$ 257889 255969 254494 254498 255993 257943 259798 262155 265516 269268 272559 275580 279169 283458 287728 291509
60646B91509L600L802L778L221K473J957J694J434R93L53l53r20j150j020p51
$$ 291509 295109 298911 302689 305910 308383 310340 312034 313468 314461 314814 314461 313541 312391 311371 310620
60631C10620p35j182j918k599l129l670m171m235l715l113l024l333l400k889
$$ 310620 309885 308703 306785 304186 301057 297387 293216 288981 285266 282153 279129 275796 272396 269507
60617B69507k054j229n90l95q60j582j662p97J49K12l94o38j70K69L5n28p85q27
$$ 269507 267453 266224 265634 265239 264379 262797 261135 260338 260487 260699 260305 259667 259497 259766 259801 259273 258488 257661
60599B57661j152j658j681j047m11k86l71k09j2k21n77m10K68O36K75k12p2N74
$$ 257661 256509 254851 253170 252123 251712 251426 251055 250846 250834 250613 250036 249626 249894 250530 250805 250593 250521 251095
60581B51095J044J053R50J179J849K792L672M118M116M157M822O180P778R157
$$ 251095 252139 253192 254142 255321 257170 259962 263634 267752 271868 276025 280847 287027 294805 303962
60567C03962J0151J0769J0973J0630R526P578N072K526J15k468n282p501q101
$$ 303962 314113 324882 335855 346485 356011 363589 368661 371187 371302 368834 363552 356051 347950
60554C47950p131n760m860m068k575m76J223J881J999K561L865N333O429P315
$$ 347950 340819 335059 330199 326131 323556 323080 324303 326184 328183 330744 334609 339942 346371 353686
60540C53686Q396R433R570Q333O178L860J582q68l322n172o019n973n204l702
$$ 353686 362082 371515 381085 389418 395596 399456 401038 400170 396848 391676 385657 379684 374480 370778
60526C70778j696N4Q25N93j30r95j974k931l406l030j977q55j29K59P40J618K743
$$ 370778 369082 369136 369961 370554 370424 369429 367455 364524 361118 358088 356111 355256 355127 355386 356126 357744 360487
60509C60487L737M475N250O409Q038J0055J2462J5271J8290K1238K4067K6947
$$ 360487 364224 368699 373949 380358 388396 398451 410913 426184 444474 465712 489779 516726
60497E16726K9868L2545L4732L6326L6929L5574L1320K4096J4706M073p183j8343
$$ 516726 546594 579139 613871 650197 687126 722700 754020 778116 792822 796895 789712 771369
60485G71369k8262l5795m0439m2368m1972l9696l6157l2041k7792k3615j9831
$$ 771369 743107 707312 666873 624505 582533 542837 506680 474639 446847 423232 403401
60474D03401j6890j4865j3188j1239r147p656p214p375p299o593n462m188k865
$$ 403401 386511 371646 358458 347219 338072 330416 323202 315827 308528 301935 296473 292285 289420
60461B89420j661r53r25j239j434j522j852k460k930l007k887k850k866k864l016
$$ 289420 287759 286806 285881 284642 283208 281686 279834 277374 274444 271437 268550 265700 262834 259970 256954
60446B56954l407l656l190j834L7J700K348J535j38j175n89Q89J553O31j070k371
$$ 256954 253547 249891 246701 244867 244904 246604 248952 250487 250349 249174 248585 249474 251027 251658 250588 248217
60430B48217k918l005k849k414j618m34J009K252K809K782K806L194L462L031
$$ 248217 245299 242294 239445 237031 235413 234979 235988 238240 241049 243831 246637 249831 253293 256324
60416B56324J979Q62N3l99n88p49j170j738j840j073J31J005J361J576J850J960
$$ 256324 258303 259165 259218 258819 258231 257482 256312 254574 252734 251661 251792 252797 254158 255734 257584 259544
60400B59544J685J118N09J58L57J097J862K118J975J963K221K332K030J580J254
$$ 259544 261229 262347 262856 263014 263371 264468 266330 268448 270423 272386 274607 276939 278969 280549 281803
60385B81803R22M71K44N96J193J275O95K47O92J722K306J982J359J170J279J114
$$ 281803 282725 283196 283440 284036 285229 286504 287199 287446 288138 289860 292166 294148 295507 296677 297956 299070
60369B99070P31P70J359J818J714J494J638J800J463R66J014J498J657J389J419
$$ 299070 299801 300571 301930 303748 305462 306956 308594 310394 311857 312823 313837 315335 316992 318381 319800
60354C19800K085K815L123L361M044N085O209P523Q996R855R227P189M559J781
$$ 319800 321885 324700 327823 331184 335228 340313 346522 354045 363041 372896 382123 389312 393871 395652
60340C95652j264m386o777p855p914p645p326o755n765m476l218k305j904j924
$$ 395652 394388 390002 383225 375370 367456 359811 352485 345730 339965 335489 332271 329966 328062 326138
60326C26138k086k129j908j419q99p84j260j843j814j186p81j037j225l74J286
$$ 326138 324052 321923 320015 318596 317697 316913 315653 313810 311996 310810 310029 308992 307767 307393 308679
60311C08679K494K652K601L506N442P540R165J0429J1701J3016J4066J4428J3779
$$ 308679 311173 313825 316426 319932 325374 332914 342079 352508 364209 377225 391291 405719 419498
60298D19498J1998R192N560J414k635n839p924r348j0613j1543j1669j1099j0431
$$ 419498 431496 440688 446248 447662 445027 439188 431264 421916 411303 399760 388091 376992 366561
60285C66561r886r103p867o438n005l477j998j105r83j093r30o73o55p50q57j423
$$ 366561 356675 347572 339705 333267 328262 324785 322787 321682 320699 319606 318676 318003 317348 316598 315741 314318
60269C14318k737m069m395l797l230l028k555j529o82o78j120j227r49q23j033
$$ 314318 311581 307512 303117 299320 296090 293062 290507 288978 288296 287618 286498 285271 284322 283499 282466
60254B82466j273j289j105p19n7P67J469J852J880J565J021O14P06J291J970K308
$$ 282466 281193 279904 278799 278080 278023 278790 280259 282111 283991 285556 286577 287191 287897 289188 291158 293466
60238B93466K083J312K76m92n12K03J177J902K248K381K448K388K056J431O93
$$ 293466 295549 296861 297137 296645 296133 296336 297513 299415 301663 304044 306492 308880 310936 312367 313060
60223C13060J56O7N13J349K193K604K426J917J442J101Q39P96J215J994K646K920
$$ 313060 313216 313283 313796 315145 317338 319942 322368 324285 325727 326828 327667 328463 329678 331672 334318 337238
60207C37238L148L824M924N909O174N471M056K707K294L028M167M783M708M419
$$ 337238 340386 344210 349134 355043 361217 366688 370744 373451 375745 378773 382940 387723 392431 396850
60193C96850M153L632K670J600Q02L04L2J05M69N12l38j709k565k498k280k838
$$ 396850 401003 404635 407305 408905 409707 410011 410043 410148 410617 411129 410791 409082 406517 404019 401739 398901
60177C98901m068n030n117m566l924l420k984k538k059j548j119r86j202j510
$$ 398901 394833 389803 384686 380120 376196 372776 369792 367254 365195 363647 362528 361542 360340 358830
60163C58830j537j139n12NK35L43O87J342J854J717J126Q51J214J585J272N63
$$ 358830 357293 356154 355642 355647 355882 356225 356912 358254 360108 361825 362951 363802 365016 366601 367873 368436
60147C68436L23P23J037Q11N90J010J727J913J632J938L409N207O041N713N089
$$ 368436 368759 369482 370519 371330 371920 372930 374657 376570 378202 380140 383549 388756 394797 400510 405599
60132D05599M750M306L237J810P13J77n9j22R8M91P04O53O53Q18Q23M75J61L67
$$ 405599 410349 414655 417892 419702 420415 420592 420533 420411 420509 421000 421704 422357 423010 423828 424651 425126 425287 425654
60114D25654J014J586J757J564J124M81k18o53n27J66R72J209N67n15j332j828
$$ 425654 426668 428254 430011 431575 432699 433180 432962 432309 431782 431948 432920 434129 434696 434181 432849 431021
60098D31021k519l486m005l538k561j921j820j926k070k222k067j362m91m3L8
$$ 431021 428502 425016 421011 417473 414912 412991 411171 409245 407175 404953 402886 401524 401033 400990 401028
60083D01028K53O80J012J302J872K531K784K760K985L130K142qj811k166j828
$$ 401028 401281 401961 402973 404275 406147 408678 411462 414222 417207 420337 422479 422471 420660 418494 416666
60068D16666k111k996l560l632l856m419m884n215n838o569o483n178l474k451
$$ 416666 414555 411559 407999 404367 400511 396092 391208 385993 380155 373586 367103 361925 358451 356000
60054C56000k385k840l229k973j741OJ137J057M89O01J592K661L196L456L967
$$ 356000 353615 350775 347546 344573 342832 342838 343975 345032 345521 346122 347714 350375 353571 357027 360994
60039C60994M741N326N416N140M785M397L840L089K368J885J510R02q6j321k662
$$ 360994 365735 371061 376477 381617 386402 390799 394639 397728 400096 401981 403491 404393 404307 402986 400324
60024D00324m089n426o250o325n951n652n583n583n707o252p100p499o834n442
$$ 400324 396235 390809 384559 378234 372283 366631 361048 355465 349758 343506 336406 328907 322073 316631
60010C16631m224l561k989j981o67M09R51J073J017R62R77R84P75K75k85n85m89
$$ 316631 312407 308846 305857 303876 303209 303618 304569 305642 306659 307621 308598 309582 310357 310632 310347 309762 309273
59993C09273m0O46J313J598J430J231J453K017K493K677K655K447K063J814K016
$$ 309273 309233 309879 311192 312790 314220 315451 316904 318921 321414 324091 326746 329193 331256 333070 335086
59978C35086K352K067R90j37n98m88k87j56n8j71o08r95q30k12L09N35P52J122
$$ 335086 337438 339505 340495 340358 339760 339272 338985 338829 338771 338600 337992 336997 336167 335955 336264 336799 337551 338673
59960C38673J381J297R88O71L64km22q93j404j736j518p39M7K13k82q87j029n58
$$ 338673 340054 341351 342339 343010 343374 343372 342950 342057 340653 338917 337399 336660 336707 336920 336638 335751 334722 334164
59942C34164K70J006J230P39l09j490k335k610k458k323k537k877k668j612l54
$$ 334164 334434 335440 336670 337409 337100 335610 333275 330665 328207 325884 323347 320470 317802 316190 315836
59927C15836J04l93r52p62k9N17P16J033J691K335K637K682K593K293J898J849
$$ 315836 315940 315547 314595 313833 313804 314321 315037 316070 317761 320096 322733 325415 328008 330301 332199 334048
59911C34048K331K922L158L033K680K034J311J250K180L230L296K562K203K651
$$ 334048 336379 339301 342459 345492 348172 350206 351517 352767 354947 358177 361473 364035 366238 368889
59897C68889L071K636J468P2j266k199k286j666j058o92Q0J636L207L865L745
$$ 368889 371960 374596 376064 376136 374870 372671 370385 368719 367661 366969 367049 368685 371892 375757 379502
59882C79502L606L664L644L607L893M421M808M975N040M708L516J651j59j540
$$ 379502 383108 386772 390416 394023 397916 402337 407145 412120 417160 421868 425384 427035 426876 425336
59868D25336k666l578l961l701l121k552k140k092k429k497j412P56K829L967
$$ 425336 422670 419092 415131 411430 408309 405757 403617 401525 399096 396599 395187 395943 398772 402739
59854D02739M629N747P356Q534Q415O766L942P24j884l170l097k039l95J249J878
$$ 402739 407368 413115 420471 429005 437420 444186 448128 448852 446968 443798 440701 438662 438267 439516 441394
59839D41394O17k297n559p992r419j0208j0366r513p654n398l378j750m75L38
$$ 441394 442011 439714 434155 426163 416744 406536 396170 386657 379003 373605 370227 368477 368002 368340
59825C68340O54Q08J105J259P12m73j598k250k727l292l605l275k629k277k265
$$ 368340 368994 369802 370907 372166 372878 372405 370807 368557 365830 362538 358933 355658 353029 350752 348487
59810C48487k139j792j605j728j718j124j45N11L05o10j519j770j410j129j468
$$ 348487 346348 344556 342951 341223 339505 338381 338236 338747 339052 338442 336923 335153 333743 332614 331146
59795C31146k273k996l326l301l019k581k189k041k125k298k396k173j448n57
$$ 331146 328873 325877 322551 319250 316231 313650 311461 309420 307295 304997 302601 300428 298980 298423
59781B98423k37p48j409j481j141j037j178r72k58M63Q28J033J308J522J506J301
$$ 298423 298186 297438 296029 294548 293407 292370 291192 290220 289962 290425 291253 292286 293594 295116 296622 297923
59765B97923J027Q63J196K203L285L437K497J465J422K371L307L220K040Q57J056
$$ 297923 298950 299813 301009 303212 306497 309934 312431 313896 315318 317689 320996 324216 326256 327113 328169
59750C28169K804M615M996M220L693L845L785L122K762L316L889L382K131J301
$$ 328169 330973 335588 340584 344804 348497 352342 356127 359249 362011 365327 369216 372598 374729 376030
59736C76030J192J172R11O96O37M23j03o51r17q19m34K9K83L07L97N89M36k18
$$ 376030 377222 378394 379305 380001 380638 381061 380958 380307 379390 378571 378137 378166 378449 378756 379153 379742 380178 379960
59718C79960o79k75O59J255J307J230J085N79n6o9P47J708K145K087J851J607
$$ 379960 379281 379006 379665 380920 382227 383457 384542 385121 385065 384996 385743 387451 389596 391683 393534 395141
59702C95141J484J549J503R10m9o48o26m91n56l96K75Q46O28mr7M66P93L05m88
$$ 395141 396625 398174 399677 400587 400538 399890 399264 398773 398217 397821 398096 398942 399570 399566 399469 399935 400728 401033 400545
59683D00545p45m17k03o22j475k178k393k222j959j843k062k695l440l666l073
$$ 400545 399800 399383 399180 398558 397083 394905 392512 390290 388331 386488 384426 381731 378291 374625 371552
59668C71552k220j989k459k864k774k711l215l817l555k281p81L48J209J915K111
$$ 371552 369332 367343 364884 362020 359246 356535 353320 349503 345948 343667 342886 343234 344443 346358 348469
59653C48469J626J125J492K723L840L933K961J586N23O5m2k96q78j479j807k088
$$ 348469 350095 351220 352712 355435 359275 363208 366169 367755 368278 368343 368301 368005 367127 365648 363841 361753
59637C61753k626l029k580j447q15j350k138j842m90O56Q36N21L88L85J55l04
$$ 361753 359127 356098 353518 352071 351256 349906 347768 345926 345436 346092 346928 347449 347837 348222 348377 348073
59621C48073q59j616k580l285l235k566j905j729k042k472k437j521j8J205J695
$$ 348073 347214 345598 343018 339733 336498 333932 332027 330298 328256 325784 323347 321826 321808 323013 324708
59606C24708J911K404K917K861K328J881J523P00o00j571j623j136p80o60m87
$$ 324708 326619 329023 331940 334801 337129 339010 340533 341233 340633 339062 337439 336303 335523 334863 334376
59591C34376k01J7J19K03K31N8l34q31j334j759j983j945j726j431j177j150j492
$$ 334376 334175 334192 334311 334514 334745 334803 334469 333638 332304 330545 328562 326617 324891 323460 322283 321133 319641
59574C19641k051k399k224j534n69K75M80j94j233j678j149j76N99J090J429J438
$$ 319641 317590 315191 312967 311433 310864 311139 311619 311425 310192 308514 307365 307189 307788 308878 310307 311745
59558C11745R60L15l2j5K37Q34J800K575K530J866J470J781K472L193M016M975
$$ 311745 312705 313020 312988 312973 313210 314044 315844 318419 320949 322815 324285 326066 328538 331731 335747 340722
59542C40722N793O379P164Q692J1155J4456J8079K0605K0045J5372P668o18p389
$$ 340722 346515 352894 360058 368750 379905 394361 412440 433045 453090 468462 476130 475512 468123
59529D68123j1650j3126j1961q885n088j614J065K931M116M750M875M468L643
$$ 468123 456473 443347 431386 422501 417413 415799 416864 419795 423911 428661 433536 438004 441647
59516D41647K731J952J179J19j311k923m363n241n439n521o371q102r681j0073
$$ 441647 444378 446330 447509 447628 446317 443394 439031 433790 428351 422830 416459 408357 398676 388603
59502C88603r419q542p695o529n073l874l135k508j866j550j663j807j685j363
$$ 388603 379184 370642 362947 356418 351345 347471 344336 341828 339962 338412 336749 334942 333257 331894
59488C31894p39L95J621K056J603J194J339J377Q40M97J166K265K749K883L743
$$ 331894 331155 331550 333171 335227 336830 338024 339363 340740 341580 342077 343243 345508 348257 351140 354883
59473C54883N263O075N383L819K324J191M47K36M70P94J147J692K159K086J810
$$ 354883 360146 366221 371604 375423 377747 378938 379385 379621 380091 380885 382032 383724 385883 387969 389779
59458C89779K289L631M761M966M859N270O093O884P767Q906R779R886R649R611
$$ 389779 392068 395699 400460 405426 410285 415555 421648 428532 436299 445205 454984 464870 474519 484130
59444D84130R177P206L715j9l005n316p231q529q933q651q138p751p751q144q341
$$ 484130 493307 500513 504228 504209 501204 495888 488657 480128 471195 462544 454406 446655 438904 430760 422419
59429D22419p560n823m124l279k968k232n92J669M043O172P831Q992R986J1293
$$ 422419 414859 409036 404912 401633 398665 396433 395841 397510 401553 407725 415556 424548 434534 445827
59415D45827J3020J4832J6520J8481K1135K3721K3970J9615J0571m62r816j5284
$$ 445827 458847 473679 490199 508680 529815 553536 577506 597121 607692 607230 597414 582130
59403E82130j6932j6041j3681j0234n799q32L436N230L156k655j0319j7194k1339
$$ 582130 565198 549157 535476 525242 519443 518611 522047 527277 530433 527778 517459 500265 478926
59390D78926k2340k0994j8380j5219j1960r149p357o591o073m921l065j331n48
$$ 478926 456586 435592 417212 401993 390033 380884 373527 366936 360863 355942 352877 351546 350998
59377C50998p09j076r95m83K4L34O53J060J231R68P43J205K160K627K096J282
$$ 350998 350289 349213 348218 347735 347759 348093 348746 349806 351037 352005 352748 353953 356113 358740 360836 362118
59361C62118J298K330L547M137M123M154M714N614O258O452O772P847R421J0593
$$ 362118 363416 365746 369293 373430 377553 381707 386421 392035 398293 404745 411517 419364 428785 439378
59347D39378J1103J1652J2771J3928J4407J4466J4910J5752J6074J5249J3562
$$ 439378 450481 462133 474904 488832 503239 517705 532615 548367 564441 579690 593252
59336E93252J1567R421P073M640K240k10k781n262p237q396q760q742q983r825
$$ 593252 604819 614240 621313 625953 628193 627983 625202 619940 612703 604307 595547 586805 577822 567997
59322E67997j0947j1658j1537j0658r360q039p024o273n303l805k191j131n29
$$ 567997 557050 545392 533855 523197 513837 505798 498774 492501 487198 483393 481202 480071 479542
59309D79542M15K124M170O108Q205J0783J3152J3714J1233N806j239q168j3602
$$ 479542 479957 482081 486251 492359 500564 511347 524499 538213 549446 555252 554013 545845 532243
59296E32243j6858j7884j6983j4724j1927r444p666o321m864l059j185K16Q07
$$ 532243 515385 497501 480518 465794 453867 444423 436757 430436 425572 422513 421328 421544 422351
59283D22351P45N71P76J442K338L263M138M868N370N689N961O283O805P784R268
$$ 422351 423096 423667 424443 425885 428223 431486 435624 440492 445862 451551 457512 463795 470600 478384 487652
59268D87652J0810J1806J2158J2197J1936J0845Q604N701K955P24j162k900m503
$$ 487652 498462 510268 522426 534623 546559 557404 566008 571709 574664 575388 574226 571326 566823
59255E66823o045p673r347j0717j1368j1133j0232r228q652q447p901o452m553
$$ 566823 560778 553105 543758 533041 521673 510540 500308 491080 482428 473981 466080 459628 455075
59242D55075l352l332l602k865q92J313K695L123L094K969K824K724K730K689
$$ 455075 451723 448391 444789 441924 441032 442345 445040 448163 451257 454226 457050 459774 462504 465193
59228D65193K375J818J239O37k20j421k798m189n491o417o712o615o720p105p132
$$ 465193 467568 469386 470625 471262 471042 469621 466823 462634 457143 450726 444014 437399 430679 423574 416442
59213D16442o467n756n768o188n993m889l663l083k997k749k009q75M32J609K156
$$ 416442 409975 404219 398451 392263 386270 381381 377718 374635 371638 368889 366880 366005 366437 368046 370202
59198C70202J735O89kM36J798L048L347K764J953J261N32k52o26j42R59J939K322
$$ 370202 371937 372626 372624 373060 374858 377906 381253 384017 385970 387231 387763 387511 386885 386743 387702 389641 391963
59181C91963K269K307K802L635M332M648M912N542O230O156N131M054L904M701
$$ 391963 394232 396539 399341 402976 407308 411956 416868 422410 428640 434796 439927 443981 447885 452586
59167D52586N861P049Q197R050R320R197R139R185Q910P934O196L924J655Rj011
$$ 452586 458447 465496 473693 482743 492063 501260 510399 519584 528494 536428 542624 546548 548203 548212 547201
59152E47201k146l886n668o662p030p600q483q928q533p821p381p123o672n980
$$ 547201 545055 541169 535501 528839 521809 514209 505726 496798 488265 480444 473063 465940 459268 453288
59138D53288n303m908m871m919m523l583k714k366j926n45J343K325J933J243
$$ 453288 447985 443077 438206 433287 428764 425181 422467 420101 418175 417630 418973 421298 423231 424474
59124D24474J304J893K341K717L487M635N777O764P664Q402Q899R240R376R009
$$ 424474 425778 427671 430012 432729 436216 440851 446628 453392 461056 469458 478357 487597 496973 505982
59110E05982Q127P261O849O663O260N638N097M703M313L814L159K339J561J102
$$ 505982 514109 521370 528219 534882 541142 546780 551877 556580 560893 564707 567866 570205 571766 572868
59096E72868P78kj395k768l507l707l695l359k466j317n40m57j027k158l584m718
$$ 572868 573646 573644 572249 569481 565974 562267 558572 555213 552747 551430 550890 550433 549406 547248 543664 538946
59080E38946n107n020n144n834o872p824q267p975p211o690o869p339p271o352
$$ 538946 533839 528819 523675 517841 510969 503145 494878 486903 479692 473002 466133 458794 451523 445171
59066D45171n017l845l060k564k200j962j980k288k606k557k102j542j076o71
$$ 445171 440154 436309 433249 430685 428485 426523 424543 422255 419649 417092 414990 413448 412372 411701
59052D11701l91l71m00l0P47J340J319R05N13K73K48N30Q62O96O4j93M64J454
$$ 411701 411310 410939 410539 410509 411256 412596 413915 414820 415333 415606 415854 416384 417246 417942 418006 417813 418277 419731
59034D19731J881J731J651J929K355K804L317L767L992M145M474M902N265N718
$$ 419731 421612 423343 424994 426923 429278 432082 435399 439166 443158 447303 451777 456679 461944 467662
59020D67662O506P511Q475R375J0092J0032Q758O838N338M505L548J857j28j469
$$ 467662 474168 481679 490154 499529 509621 519653 528411 535249 540587 545092 548640 550497 550369 548900
59006E48900j793j508j186q62j33J139K388L051L530M770O687P811P040N115L629
$$ 548900 547107 545599 544413 543551 543418 544557 546945 549996 553526 558296 564983 572794 579834 584949 588578
58991E88578L067K642J812R50M93K06m48j650l158m580n579o040o070n810n280
$$ 588578 591645 594287 596099 597049 597542 597748 597300 595650 592492 587912 582333 576293 570223 564413 559133
58976E59133m466l265j465Q61K864L588L298L380M566O063O959P503Q235Q736
$$ 559133 554667 551402 549937 550798 553662 557250 560548 563928 568494 574557 581516 589019 597254 605990
58962F05990Q429P876P963Q173P182M938K810J634Q77j05j290k724m822p425r572
$$ 605990 614419 622295 630258 638431 645613 650551 653361 654995 655872 655767 654477 651753 646931 639506 629934
58947F29934j0774j1609j2564j3125j2640j1340r855q334o720n373m735m677m710
$$ 629934 619160 607551 594987 581862 569222 557882 548027 539693 532973 527600 522865 518188 513478
58934E13478m678m771n071n393n380m611k925q72N52R06P35P63J036J143R58P88
$$ 513478 508800 504029 498958 493565 488185 483574 480649 479777 480329 481235 481970 482733 483769 484912 485870 486658
58918D86658R15J315J727J914J931K236L260M774N957O220N852N669O173P040
$$ 486658 487573 488888 490615 492529 494460 496696 499956 504730 510687 516907 522759 528428 534601 541641
58904E41641P510P305P106P753Q976R498Q729P619P289P479P334P094P765R312
$$ 541641 549151 556456 563562 571315 580291 589789 598518 606137 613426 620905 628239 635333 643098 652410
58890F52410J0637J1493J3048J6031J9444K1754K2482K1942K0257J7500J4222
$$ 652410 663047 674540 687588 703619 723063 744817 767299 789241 809498 826998 841220
58879H41220J1029P915M680J621q20k870n185p956j0711j3007j4908j6730j8497
$$ 841220 852249 860164 864844 866465 865645 862775 857590 849634 838923 825916 811008 794278 775781
58866G75781j9711j9762j8663j7237j6212j5392j4245j3046j2561j2632j2163
$$ 775781 756070 736308 717645 700408 684196 668804 654559 641513 628952 616320 604157
58855F04157j0816r656r592j0132j0363j0318j0462j0548r951q759p593o633n628
$$ 604157 593341 583685 574093 563961 553598 543280 532818 522270 512319 503560 495967 489334 483706
58842D83706m652m037l714l367l074l050l001k521k021k323l316l863l280k105
$$ 483706 479054 475017 471303 467936 464862 461812 458811 456290 454269 451946 448630 444767 441487 439382
58828D39382j157o01l07l69o81n62M94J872K377J739J019J339K556L540L539K889
$$ 439382 438225 437624 437317 436948 436267 435705 436199 438071 440448 442187 443206 444545 447101 450641 454180 457069
58812D57069K331K086J919J804J983K359K396J808R64L33p8l68l12J85N17j9j065
$$ 457069 459400 461486 463405 465209 467192 469551 471947 473755 474719 475052 474974 474606 474294 474479 474996 474977 473912
58795D73912j475q91k84n41j094p44N56J553J381O81P47K159M571P322R760J1437
$$ 473912 472437 471546 471262 470721 469627 468883 469439 470992 472373 473054 473801 475960 480531 487853 497613 509050
58779E09050J2563J4059J6341J8248J8044J5547J2276R188N327m27p164j2595
$$ 509050 521613 535672 552013 570261 588305 603852 616128 625316 630643 630216 623052 610457
58767F10457j5522j6637j7000j6775j5711j3997j2244j1000j0471j0329r765q188
$$ 610457 594935 578298 561298 544523 528812 514815 502571 491571 481100 470771 461006 452818
58755D52818n977m107l013k255j310k03P66J413J678J648J649J962K353K382K177
$$ 452818 446841 442734 439721 437466 436156 435953 436719 438132 439810 441458 443107 445069 447422 449804 451981
58740D51981K403L356M536N306N559N670N984O536O944O700N790M877M519M476
$$ 451981 454384 457740 462276 467582 473141 478811 484795 491331 498275 504975 510765 515642 520161 524637
58726E24637M249L880L643L303K547J792J593J479N67p38r92J53J468K140K897
$$ 524637 528886 532766 536409 539712 542259 544051 545644 547123 547690 546952 545960 546113 547581 549721 552618
58711E52618M426N924O250N560M801M242L482K415J256o6j749l644n506p453r556
$$ 552618 557044 562968 569218 574778 579579 583821 587303 589718 590974 590908 589159 585515 580009 572556 563000
58696E63000j1377j2474j3041j3469j3587j2910j1383r397p325n419l945k993
$$ 563000 551623 539149 526108 512639 499052 486142 474759 465362 458037 452618 448673 445680
58684D45680k406k099k119k284k236k034k040k037j234N09K278L335L977M708
$$ 445680 443274 441175 439056 436772 434536 432502 430462 428425 427191 427700 429978 433313 437290 441998
58670D41998N464O343Q099J1039J4133J6217J7459J8689J9773J9665J7623J3545
$$ 441998 447462 453805 461904 472943 487076 503293 520752 539441 559214 578879 596502 610047
58658F10047P597N20o050j0637j3211j4661j5393j5238j4390j3313j1941r992
$$ 610047 617644 618164 612114 601477 588266 573605 558212 542974 528584 515271 503330 493338
58646D93338p952o757o501o344n812n284n191n362n309m611l056r45P96J499J559
$$ 493338 485386 478629 472128 465784 459972 454688 449497 444135 438826 434215 431159 430214 431010 432509 434068
58631D34068J849K501K957K901K482J814J053P56J278J971J897J197Q76J230J555
$$ 434068 435917 438418 441375 444276 446758 448572 449625 450381 451659 453630 455527 456724 457600 458830 460385
58616D60385J512J809L139N191P145Q442Q826Q142O473M250J969N0j161j612j679
$$ 460385 461897 463706 466845 472036 479181 487623 496449 504591 511064 515314 517283 517333 516172 514560 512881
58601E12881j675j461r90q83j731l017l614l289k892k905k734j704j21J067J313
$$ 512881 511206 509745 508755 507872 506141 503124 499510 496221 493329 490424 487690 485986 485865 486932 488245
58586D88245R45R05K039M285O607Q043Q656R020R161Q678P761P231P371P516O923
$$ 488245 489190 490095 492134 496419 503026 511069 519725 528745 537906 546584 554345 561576 568947 576463 583386
58571E83386N652M403L900M477N806P154Q220R533J1569J3852J5595J6972J8782
$$ 583386 589038 593441 597341 601818 607624 614778 622998 632531 644100 657952 673547 690519 709301
58558G09301K1016K2641K2914K2060K0547J8494J5952J3054R670N645J546j630
$$ 709301 730317 752958 775872 797932 818479 836973 852925 865979 875649 881294 882840 881210
58546H81210l686n476p550r357j0217j0454j0969j2084j3376j4416j5157j5739
$$ 881210 877524 872048 864498 855141 844924 834470 823501 811417 798041 783625 768468 752729
58534G52729j6183j6385j6240j5822j5320j4636j3263j0932q252o273n274m502
$$ 752729 736546 720161 703921 688099 672779 658143 644880 633948 625696 619423 614149 609647
58522F09647l203j574m30j70l49l35r7r2m23n59k10K5m28r67m87Q77J750J476
$$ 609647 606444 604870 604440 604270 603921 603586 603489 603397 602974 602415 602205 602230 601802 600835 600348 601225 602975 604451
58504F04451Q24M68l8j115k194k730l064l442l245k182j209j122j295r05l55j53
$$ 604451 605275 605743 605705 604590 602396 599666 596602 593160 589915 587733 586524 585402 584107 583202 582847 582694
58488E82694M55K017L211K566J139J232K952M314M547N030O741Q901J0655J2129
$$ 582694 583149 585166 588377 590943 592082 593314 596266 600580 605127 610157 616898 625799 636454 648583
58474F48583J3281J3384J2342J1022R721P660M564J363j113k934m169m530m304
$$ 648583 661864 675248 687590 698612 708333 715993 720557 721920 720807 717873 713704 709174 704870
58461G04870m281m367l611j946m66M10J544L296M731N292N759O678P251O597N001
$$ 704870 700589 696222 692611 690665 690199 690609 692153 695449 700180 705472 711231 717909 725160 731757 736758
58446G36758L004N07k390m801o180p045p844q114p502o523n538m060j905pQ17
$$ 736758 739762 740269 737879 733078 726898 719853 712009 703895 696393 689870 684332 680272 678367 678360 679177
58431F79177J032J507K361L369M637O076P046P239P233P632Q420R473J0735J1554
$$ 679177 680209 681716 684077 687446 692083 698159 705205 712444 719677 727309 735729 745202 755937 767491
58417G67491J0942Q955O647M385J601j344k862k486j917k601l776m138m004m389
$$ 767491 778433 787388 794035 798420 800021 798677 795815 793329 791412 788811 785035 780897 776893 772504
58403G72504n116n320m914m258l195j683n15j56L23K021M549O704P981Q375P634
$$ 772504 767388 762068 757154 752896 749701 748018 747503 747347 747670 749691 754240 760944 768925 777300 784934
58388G84934N880M234L560L307K638J867J606J374M72m82l36P62J661J918J970
$$ 784934 790814 795048 798608 801915 804553 806420 808026 809400 809872 809390 809054 809816 811477 813395 815365
58373H15365J976J729J497J842K773L931N309O960Q400R064R162R301R747J0550
$$ 815365 817341 819070 820567 822409 825182 829113 834422 841382 849782 858846 868008 877309 887056 897606
58359H97606J1831J3305J4153J4001J3364J2652J1590J0175R067Q317O881M404
$$ 897606 909437 922742 936895 950896 964260 976912 988502 998677 1007744 1016061 1022942 1027346
58347A027346K278J782K266K504K747L962N813P058P502Q106R414J1104J2818
$$ 1027346 1029624 1031406 1033672 1036176 1038923 1042885 1048698 1055756 1063258 1071364 1080778 1091882 1104700
58334A104700J4429J5704J6536J7206J7780J7747J6854J5673J4748J3915J3021
$$ 1104700 1119129 1134833 1151369 1168575 1186355 1204102 1220956 1236629 1251377 1265292 1278313
58323A278313J2305J1530R866P444N760N705O404O951P793R313J0509J0530J0271
$$ 1278313 1290618 1302148 1312014 1319458 1325218 1330923 1337327 1344278 1352071 1361384 1371893 1382423 1392694
58310A392694J0922J2071J2742J3214J4329J5949J7559J9345K1286K2282K1760
$$ 1392694 1403616 1415687 1428429 1441643 1455972 1471921 1489480 1508825 1530111 1552393 1574153
58299A574153K1021K1458K2481K2772K2509K2634K2985K2939K3023K4176K6135
$$ 1574153 1595174 1616632 1639113 1661885 1684394 1707028 1730013 1752952 1775975 1800151 1826286
58288A826286K8115L0148L2288L3533L3230L2559L2986L4105L4646L4467L4053
$$ 1826286 1854401 1884549 1916837 1950370 1983600 2016159 2049145 2083250 2117896 2152363 2186416
58277B186416L3212L2069L2131L4527L8221M1798M5736N1013N6664O0826O3220
$$ 2186416 2219628 2251697 2283828 2318355 2356576 2398374 2444110 2495123 2551787 2612613 2675833
58266B675833O4806O5994O6969O8492P0669P2300P3138P5061P9064Q3031Q4775
$$ 2675833 2740639 2806633 2873602 2942094 3012763 3085063 3158201 3233262 3312326 3395357 3480132
58255C480132Q5376Q7011Q9407R1187R2899R5707R8832J01322J04689J10644J17817
$$ 3480132 3565508 3652519 3741926 3833113 3926012 4021719 4120551 4221873 4326562 4437206 4555023
58244D555023J23978J29880J37559J46383J54394J62122J71495J82243J92918
$$ 4555023 4679001 4808881 4946440 5092823 5247217 5409339 5580834 5763077 5955995
58235E955995K04152K17301K31232K44128K57083K72361K89622L07525L27230
$$ 5955995 6160147 6377448 6608680 6852808 7109891 7382252 7671874 7979399 8306629
58226H306629L50439L75890M01923M30417M63827N00594N38364N79412O27748
$$ 8306629 8657068 9032958 9434881 9865298 10329125 10829719 11368083 11947495 12575243
58217A2575243O83116P43494Q11231Q90693R81973J083270J197540J330330J483047
$$ 12575243 13258359 14001853 14813084 15703777 16685750 17769020 18966560 20296890 21779937
58208B1779937J655331J852523K084568K360535K692112L100034L609094M238653
$$ 21779937 23435268 25287791 27372359 29732894 32425006 35525040 39134134 43372787
58200D3372787N004333N923064P006194Q253803R671442J1294948J3194323J5462672
$$ 43372787 48377120 54300184 61306378 69560181 79231623 90526571 103720894 119183566
58192A19183566J8208664K1527484K5409787K9603776L3487246L5999326L5725160
$$ 119183566 137392230 158919714 184329501 213933277 247420523 283419849 319145009
58185C19145009L1298296K2136444R109537n478927j8785732k8627704l4165354
$$ 319145009 350443305 372579749 381689286 376210359 357424627 328796923 294631569
58178B94631569l5775149l4479281l1426674k7599887k3685344k0057584j6863024
$$ 294631569 258856420 224377139 192950465 165350578 141665234 121607650 104744626
58171A04744626j4133229j1847845r952011q378014p072096n995371n108000m370076
$$ 104744626 90611397 78763552 68811541 60433527 53361431 47366060 42258060 37887984
58163C7887984l754867l246553k826615k474027k175916j926387j716337j534188
$$ 37887984 34133117 30886564 28059949 25585922 23410006 21483619 19767282 18233094
58155A8233094j374713j237566j118584j010956r13215q27720p52398o81889o15771
$$ 18233094 16858381 15620815 14502231 13491275 12578060 11750340 10997942 10316053 9700282
58146I700282n58084n09387m66218m27862l96869l72859l51738l31161l11568
$$ 9700282 9142198 8632811 8166593 7738731 7341862 6969003 6617265 6286104 5974536
58137E974536k92220k71460k50612k32696k17459k02241j87231j75147j65985
$$ 5974536 5682316 5410856 5160244 4927548 4710089 4507848 4320617 4145470 3979485
58128C979485j56762j46531j37344j30137j23562j17063j11388j06055r9754r3165
$$ 3979485 3822723 3676192 3538848 3408711 3285149 3168086 3056698 2950643 2850889 2757724
58118B757724q8101q4134p9372p4201p0745o8926o6491o2795n9301n6445n3290
$$ 2757724 2669623 2585489 2506117 2431916 2361171 2292245 2225754 2162959 2103658 2047213 1993923
58107A993923n0244m8764m8272m6523m3267m0505l8974l7388l5436l4649l5690
$$ 1993923 1943679 1894915 1846643 1800120 1756853 1716348 1677374 1639986 1604550 1569901 1534211
58096A534211l7417l9073m0959m2551m2385m0282l7539l4627l0836k6383k2686
$$ 1534211 1496794 1457721 1416762 1374211 1331826 1291544 1254005 1219378 1188542 1162159 1139473
58085A139473k0208j8144j6364j5661j5858j5731j5112j5086j5916j6640j6911
$$ 1139473 1119265 1101121 1084757 1069096 1053238 1037507 1022395 1007309 991393 974753 957842
58074I57842j7321j7748j7289j6089j5424j5620j5653j5021j4285j3575j2281
$$ 957842 940521 922773 905484 889395 873971 858351 842698 827677 813392 799817 787536
58063G87536j0565r558r624r818r378q603q047q046q918j0507j1726j1690j0970
$$ 787536 776971 767413 757789 747971 738593 729990 721943 713897 704979 694472 682746 671056 660086
58050F60086j0507r943q584p195p042p589p265o096n538n872n935n361n044n232
$$ 660086 649579 639636 631052 623857 616815 609226 601961 595865 590327 584455 578520 573159 568115 562883
58036E62883n140m716m775n244n222m925n585p142q103q129q603j0041j0876r850
$$ 562883 557743 553027 548252 543008 537786 532861 527276 520134 512031 503902 495299 485258 474382 464532
58022D64532p798o156n170m549m460m845m878m111l256l149l658m158m302l972
$$ 464532 456734 450578 445408 440859 436399 431554 426676 422565 419309 416160 412502 408344 404042 400070
58008D00070l225k562k400k289j550o14n28j166j300o27k74r37j855k076j631
$$ 400070 396845 394283 391883 389594 388044 387430 386902 385736 384436 383809 383535 382598 380743 378667 377036
57993C77036r81l61nj60n22o03o08j014j367q61M9K3r98j636j293r53j311j748
$$ 377036 376055 375694 375689 375529 375007 374404 373796 372782 371415 370554 370603 370626 369628 367992 366699 365746 364435 362687
57975C62687j776k008k837l379k749j375k50K84L68M2n11q60r30j043j082m50
$$ 362687 360911 358903 356066 352687 349938 348563 348313 348597 348965 349007 348496 347636 346706 345663 344581 344131
57959C44131Q40J887K089J758J382J131J211J751K155J613M78pM21O93K75N9Q50
$$ 344131 344971 346858 348947 350705 352087 353218 354429 356180 358335 359948 360426 360419 360840 361533 361808 361867 362717
57942C62717K098K835K918K759K674L017M072N344N807N222M354L613K530R63
$$ 362717 364815 367650 370568 373327 376001 379018 383090 388434 394241 399463 403817 407430 409960 410923
57928D10923l29q89j286k108l157m182n424o888p936q204q141q152q018p530o894
$$ 410923 410594 409705 408419 406311 403154 398972 393548 386660 378724 370520 362379 354227 346209 338679 331785
57913C31785o198n299m450m037l585k194k31Q40O19L50P64J000M67J91J099K277
$$ 331785 325587 320288 315838 311801 308216 306022 305791 306631 307250 307600 308364 309364 309831 310022 311121 313398
57897C13398K329J445P53N10K51R9N23J195J291P06M5l76p25j106j498k005k633
$$ 313398 315727 317172 317925 318435 318686 318785 319308 320503 321794 322500 322545 322169 321444 320338 318840 316835 314202
57880C14202l104l327l640m202m644m687m533m274l629k729k326k670k912k252
$$ 314202 311098 307771 304131 299929 295285 290598 286065 281791 278162 275433 273107 270437 267525 265273
57866B65273j080l31l17p12j058q50K12J564K165J920J892K632L364L419L348
$$ 265273 264193 263862 263545 262833 261775 260925 261137 262701 264866 266786 268678 271310 274674 278093 281441
57851B81441L753M044L380K114J258J156J433J679J400R6j855l153l200k901l100
$$ 281441 285194 289238 292618 294732 295990 297146 298579 300258 301658 301754 299899 296746 293546 290645 287545
57836B87545l250k655j902j825j871r74O55J946K634L164L478L317L329M363N862
$$ 287545 284295 281640 279738 277913 276042 275068 275723 277669 280303 283467 286945 290262 293591 297954 303816
57821C03816O420N787N057M829M483L410J716l78k847n300p109q259r214r866
$$ 303816 310236 316023 321080 325909 330392 333802 335518 335140 332293 326993 319884 311625 302411 292545
57807B92545r509p998o132m715l879l463l333l158k560j625q66n59n65o48n69
$$ 292545 283036 275038 268906 264191 260312 256849 253516 250358 247798 246173 245307 244748 244183 243535 242966
57792B42966q5O37R38N39J80P00J794K486K530K584L143M104N164N915N827M905
$$ 242966 242881 243518 244456 244995 245175 245875 247669 250155 252685 255269 258412 262516 267680 273595 279422 284327
57776B84327M083M111M378L801K537J677J435R38j89j299k064l077m687o239p033
$$ 284327 288410 292521 296899 300700 303237 304914 306349 307287 307098 305799 303735 300658 295971 289732 282699
57761B82699p173o975o337n246m261l804l539k974k308k055k130j911j111k11
$$ 282699 275526 268551 262214 256968 252707 248903 245364 242390 240082 238027 235897 233986 232875 232664
57747B32664J15k30o28m59J07K42m70j416j736j340q10n22m20m12m43k96J31M55
$$ 232664 232779 232549 231921 231462 231569 231811 231341 229925 228189 226849 226039 225517 225097 224685 224242 223946 224077 224532
57729B24532K35l12n65m24l98p31j015p77r7M38K63o31j494j426m02O36R57Q05
$$ 224532 224767 224455 223890 223466 223068 222337 221322 220545 220448 220886 221149 220518 219024 217598 217196 217832 218789 219594
57711B19594N85Q1q68j562j300o20n76j147j359q49j90K99Q66J406J354Q07P16
$$ 219594 220179 220260 219392 217830 216530 215910 215334 214187 212828 211979 211789 212088 212954 214360 215714 216521 217237
57694B17237J601K797L310K717J089j091k689k592j088K21L30m2K26J108J897
$$ 217237 218838 221635 224945 227662 228751 227660 224971 222379 221291 221512 221842 221800 222026 223134 225031
57679B25031K656M196O832R862J2408J4323J6212J8765K2239K6510L1499L7179
$$ 225031 227687 231883 238715 248577 260985 275308 291520 310285 332524 359034 390533 427712
57667D27712M2866M6617M5728L8195K3894M941j4830l1303m1848m6053m4930m0023
$$ 427712 470578 517195 562923 601118 625012 629953 615123 583820 541972 495919 450989 410966
57655D10966l3467k7700k3846k0821j7088j2965r983q400o921m937l420l090l172
$$ 410966 377499 349799 325953 305132 288044 275079 265096 256696 249775 244838 241418 238328 235156
57642B35156k792k297k280k250j429j63N15L60Nj61k90l56M7R60J650J301p7j543
$$ 235156 232364 230067 227787 225537 224108 223945 224460 224820 224825 224664 224374 224018 224065 225025 226675 227976 227899 226356
57624B26356k109j716j185j125j179p62q8J12k93p93j185j658j991j604o35M4
$$ 226356 224247 222531 221346 220221 219042 218280 218192 218304 218011 217218 216033 214375 212384 210780 210145 210189
57608B10189J64M21J115J412P14j73j19P33J327J159N96J2n28r55j233j594k176
$$ 210189 210353 210774 211889 213301 214015 213842 213723 214456 215783 216942 217538 217550 217022 216067 214834 213240 211064
57591B11064k568k246j300l32K33L53O8m81q90p37l2P61J087O14m70j399j451
$$ 211064 208496 206250 204950 204618 204851 205204 205272 204791 203901 203164 203132 203893 204980 205594 205124 203725 202274
57574B02274q26m57p62j087p09J24O47N89K44q7k19N2O99J303J546J593J641J517
$$ 202274 201448 200991 200229 199142 198433 198557 199204 199793 200037 199950 199731 199783 200482 201785 203331 204924 206565 208082
57556B08082J117R01J332K096K484K353K147K118K008J494N51n66j349j244k05
$$ 208082 209199 210100 211432 213528 216012 218365 220512 222630 224638 226132 226683 226117 224768 223524 223319
57541B23319J045J719J726J509J326J130R32Q04O20K11k33k89J57P35R48N80j01
$$ 223319 224364 226083 227809 229318 230644 231774 232706 233510 234130 234341 234108 233819 233976 234711 235659 236239 236138
57524B36138m38L6R46J400J184J126J882K859L052K550K358K807L043K303J013
$$ 236138 235700 235736 236682 238082 239266 240392 242274 245133 248185 250735 253093 255900 258943 261246 262259
57509B62259J94K05M50K43m48j024r28k02N55P75L89k06n55m71k01k03o11r08
$$ 262259 262453 262658 263108 263351 262903 261879 260951 260749 261304 262079 262468 262262 261707 261236 261035 260832 260221 259313
57491B59313m93M49J025P02p7n53m35J39J024K061K926L361L369L024K389J809
$$ 259313 258820 259269 260294 260996 260919 260366 259931 260070 261094 263155 266081 269442 272811 275835 278224 280033
57475B80033J803K385K883K778K331K013J746J236O69N63J006J567J836J734J454
$$ 280033 281836 284221 287104 289882 292213 294226 295972 297208 297877 298440 299446 301013 302849 304583 306037
57460C06037J316J505J727J489R18Q35J598K461K541K048J859K266K804L048K944
$$ 306037 307353 308858 310585 312074 312992 313827 315425 317886 320427 322475 324334 326600 329404 332452 335396
57445C35396K494J849J523J878K448K471K019J954K694L623L918L482K867K628
$$ 335396 337890 339739 341262 343140 345588 348059 350078 352032 354726 358349 362267 365749 368616 371244
57431C71244K871L240L292K977K633K459K295K138K423L320M229M499M303M147
$$ 371244 374115 377355 380647 383624 386257 388716 391011 393149 395572 398892 403121 407620 411923 416070
57417D16070L901L138K200J947K418K627J964J062R43J855L281M620N459N527
$$ 416070 419971 423109 425309 427256 429674 432301 434265 435327 436270 438125 441406 446026 451485 457012
57403D57012M802L662K743K617L427M701N627N772N433N135N079N212N502N771
$$ 457012 461814 465476 468219 470836 474263 478964 484591 490363 495796 500931 506010 511222 516724 522495
57389E22495N668N282N297O057O854O875O434O439O920O972O098M695L320K298
$$ 522495 528163 533445 538742 544799 551653 558528 564962 571401 578321 585293 591391 596086 599406 601704
57375F01704K048K836M086M729M462L892L389K730K088K296L610N031N531N354
$$ 601704 603752 606588 610674 615403 619865 623757 627146 629876 631964 634260 637870 642901 648432 653786
57361F53786N484O221O912O840O018N217N380O747Q414R168Q828Q325Q417Q868
$$ 653786 659270 665491 672403 679243 685261 690478 695858 702605 711019 720187 729015 737340 745757 754625
57347G54625R107R033Q858Q690Q621Q800R130R244R042Q828Q775Q680Q475Q454
$$ 754625 763732 772765 781623 790313 798934 807734 816864 826108 835150 843978 852753 861433 869908 878362
57333H78362Q799R322R880J0516J1066J1182J0946J0892J1191J1475J1625J2016
$$ 878362 887161 896483 906363 916879 927945 939127 950073 960965 972156 983631 995256 1007272
57321A007272J2708J3136J3025J2810J2728J2341J1510J0958J1160J1506J1491
$$ 1007272 1019980 1033116 1046141 1058951 1071679 1084020 1095530 1106488 1117648 1129154 1140645
57310A140645J1845J3441J5549J6535J6019J5174J4918J5008J5087J5555J6732
$$ 1140645 1152490 1165931 1181480 1198015 1214034 1229208 1244126 1259134 1274221 1289776 1306508
57299A306508J7940J8056J6847J5275J4540J4956J5832J6390J6676J7269J8233
$$ 1306508 1324448 1342504 1359351 1374626 1389166 1404122 1419954 1436344 1453020 1470289 1488522
57288A488522J8878J8807J8534J8649J8934J8888J8708J9032J9924K0845K1467
$$ 1488522 1507400 1526207 1544741 1563390 1582324 1601212 1619920 1638952 1658876 1679721 1701188
57277A701188K1950K2409K2732K2881K2992K3159K3489K4156K5037K5588K5550
$$ 1701188 1723138 1745547 1768279 1791160 1814152 1837311 1860800 1884956 1909993 1935581 1961131
57266A961131K5458K5922K6628K6727K6043K5180K4598K4208K3882K3651K3501
$$ 1961131 1986589 2012511 2039139 2065866 2091909 2117089 2141687 2165895 2189777 2213428 2236929
57255B236929K3480K3929K4962K5874K5838K5023K4308K3961K3528K2965K2904
$$ 2236929 2260409 2284338 2309300 2335174 2361012 2386035 2410343 2434304 2457832 2480797 2503701
57244B503701K3517K4143K4367K4619K5258K5942K6333K6710K7263K7620K7599
$$ 2503701 2527218 2551361 2575728 2600347 2625605 2651547 2677880 2704590 2731853 2759473 2787072
57233B787072K7792K8563K9156K8658K7502K6996K7540K8193K8027K7134K6189
$$ 2787072 2814864 2843427 2872583 2901241 2928743 2955739 2983279 3011472 3039499 3066633 3092822
57222C092822K5620K5443K5471K5470K5372K5377K5631K5786K5265K4016K2729
$$ 3092822 3118442 3143885 3169356 3194826 3220198 3245575 3271206 3296992 3322257 3346273 3369002
57211C369002K2220K2712K3757K4688K5201K5581K6318K7397K8191K8203K7673
$$ 3369002 3391222 3413934 3437691 3462379 3487580 3513161 3539479 3566876 3595067 3623270 3650943
57200C650943K7141K6753K6371K6153K6377K6699K6291K4934K3426K2586K2290
$$ 3650943 3678084 3704837 3731208 3757361 3783738 3810437 3836728 3861662 3885088 3907674 3929964
57189C929964K1883K1182K0468J9723J8578J7051J5807J5387J5634J6137J6830
$$ 3929964 3951847 3973029 3993497 4013220 4031798 4048849 4064656 4080043 4095677 4111814 4128644
57178D128644J7631J7814J6513J3998J1740J0832J0697R915P950N532L402J422
$$ 4128644 4146275 4164089 4180602 4194600 4206340 4217172 4227869 4237784 4245734 4251266 4254668 4256090
57166D256090q79l390n537p117q595j0618j3399j6536j9336k1302k2470k3185
$$ 4256090 4255211 4251821 4246284 4239167 4230572 4219954 4206555 4190019 4170683 4149381 4126911 4103726
57154D103726k3563k3347k2368k0961j9619j8351j6681j4339j1740r592q168p183
$$ 4103726 4080163 4056816 4034448 4013487 3993868 3975517 3958836 3944497 3932757 3923165 3914997 3907814
57142C907814o339n773n814o448p333q376r965j2380j5221j7659j9161j9678j9246
$$ 3907814 3901475 3895702 3889888 3883440 3876107 3867731 3857766 3845386 3830165 3812506 3793345 3773667 3754421
57129C754421j7841j5668j3182j0634p869m755j557J287L606N564P524J0027J3651
$$ 3754421 3736580 3720912 3707730 3697096 3689227 3684472 3682915 3684202 3687808 3693372 3700896 3710923 3724574
57116C724574J8519K4123K9857L5671M1994M9185N7358O6760P7962R1663J08472
$$ 3724574 3743093 3767216 3797073 3832744 3874738 3923923 3981281 4048041 4126003 4217666 4326138
57105D326138J28985J53909J84080K20521K64567L17824L81954M58583N49382
$$ 4326138 4455123 4609032 4793112 5013633 5278200 5596024 5977978 6436561 6985943
57096F985943O55935P79149R18335J070756J232195J398447J566464J733923J897087
$$ 6985943 7641878 8421027 9339362 10410118 11642313 13040760 14607224 16341147 18238234
57087A8238234K048488K176153K264991K299757K268173K162387J977789J710862
$$ 18238234 20286722 22462875 24727866 27027623 29295796 31458183 33435972 35146834
57079C5146834J359655R28423M33050r8118o29729j127444j563474j918099k179222
$$ 35146834 36506489 37434912 37867962 37769844 37140115 36012671 34449197 32531098 30351876
57070C0351876k342269k410717k395720k313764k182994k020207j839653j653024
$$ 30351876 28009607 25598890 23203170 20889406 18706412 16686205 14846552 13193528
57062A3193528j469294j294435j131831r83423q50413p33116o30757n41988m65630
$$ 13193528 11724234 10429799 9297968 8314545 7464132 6731016 6100259 5558271 5092641
57053E092641m00782l46430l01208k63679k32677k07412j87236j71263j58265
$$ 5092641 4691859 4345429 4044221 3780542 3547865 3340453 3153217 2981954 2823689
57044B823689j46992j36585j26558j16532j06241r5712q5058p4037o2056m8698
$$ 2823689 2676697 2540112 2413554 2297022 2190781 2095069 2010011 1935974 1873918 1825220
57034A825220l3911j7833j071J4441K5190K7202J7713l383l2520o2628q5762r7336
$$ 1825220 1791309 1773476 1772405 1786846 1812036 1839238 1856951 1853568 1821048 1758420 1672658 1575322
57022A575322r8151r2178q2918p2296o1848n2986m5877l9534l3562k8785k5684
$$ 1575322 1477171 1384993 1302075 1229779 1167931 1114945 1069068 1029534 995972 967187 941503
57011I41503k3263k0328j7113j4748j3608j3171j3182j3874j5078j5984j6172
$$ 941503 918240 897912 880799 866051 852443 839272 826090 812216 797138 781154 764982
57000G64982j6216j6928j8272j9308j9138j7762j6032j4770j3932j2854j1183
$$ 764982 748766 731838 713566 694258 675120 657358 641326 626556 612624 599770 588587
56989E88587r193p066m463j192K192M919O815P883P568N265J509k212m950o897
$$ 588587 579394 572328 567865 566673 568865 573784 580599 588482 596050 601315 602824 600612 595662 588765
56975E88765q375q993q277o526m562k890j485j55J246K834M696O862R333J1985
$$ 588765 580390 571397 563120 556594 552032 549142 547657 547502 548748 551582 556278 563140 572473 584458
56961E84458J4467J6496J8158J9594K0359J9537J6589J1716N411j811q981j4653
$$ 584458 598925 615421 633579 653173 673532 693069 709658 721374 726785 724974 715993 701340
56949G01340j7804j8542j7679j5933j3786j1649r688p750n751l973k560j057J163
$$ 701340 683536 664994 647315 631382 617596 605947 596259 588509 582758 578785 576225 575168 576331
56936E76331M156P415J0462J3080J5167J6548J6744J4719R359P86q997j7351k2885
$$ 576331 580487 587902 598364 611444 626611 643159 659903 674622 683981 684767 675770 658419 635534
56923F35534k5793k6670k5832k3798k1613k0140j9272j8228j6562j4635j3185
$$ 635534 609741 583071 557239 533441 511828 491688 472416 454188 437626 422991 409806
56912D09806j2543j2334j1901j0950r653q258o892n834n501n856o146n696m691
$$ 409806 397263 384929 373028 362078 352425 344167 337275 331441 325940 320084 313938 308242 303551
56899C03551l779l090k167p69Q70K568M429O408Q112R321J0340J1577J2952J3876
$$ 303551 299772 296682 294515 293746 294616 297184 301613 308021 316133 325454 335794 347371 360323 374199
56885C74199J3703J2069R010M910L42m025p473r424r843r297q386p271n954m681
$$ 374199 387902 399971 408981 413891 414233 410208 402735 393311 383468 374171 365785 358514 352560 347879
56871C47879l622k374l54K313M947P364J0198J3979J8370K2553K5962K8289K9073
$$ 347879 344257 341883 341529 343842 348789 356153 366351 380330 398700 421253 447215 475504 504577
56858E04577K7529K2771J4384L195q436j7699k3104k5028k4599k2564j9346j5494
$$ 504577 532106 554877 569261 572456 564020 546321 523217 498189 473590 451026 431680 416186
56846D16186j1464p276k848J572N676R694J4260J9784K6181L3022L9689M5450
$$ 416186 404722 397446 394598 396170 401846 411540 425800 445584 471765 504787 544476 589926
56834E89926M9541N1050M8598M0601K6460P712j2238k9669m2087m8796n0471m8301
$$ 589926 639467 690517 739115 779716 806176 813888 801650 771981 729894 681098 630627 582326
56822E82326m3374l6762k9756k3478j8080j2808p097j252M106Q857J3336J7929
$$ 582326 538952 502190 472434 448956 430876 418068 410971 409719 413825 422682 436018 453947
56810D53947K3024K8830L4564L8169L7480L1633K1070O831r280k4234l4929m0289
$$ 453947 476971 505801 540365 578534 616014 647647 668717 675548 666268 642034 607105 566816
56798E66816m1624m0731l8315l4476k9755k4931k0228j5498j1017p397m710k194
$$ 566816 525192 484461 446146 411670 381915 356984 336756 321258 310241 302844 298134 295940
56786B95940J007N052R412J3402J6538J8441J8540J6152J1003L687m590j2642
$$ 295940 296947 301999 311411 324813 341351 359792 378332 394484 405487 409174 404584 391942
56774C91942j9486k4169k6029k5397k3490k1318j8999j6414j4056j2538j1641
$$ 391942 372456 348287 322258 296861 273371 252053 233054 216640 202584 190046 178405
56763A78405j0573r090p695o610n389l863k758k683l032k703j646q97r59j129
$$ 178405 167832 158742 151047 144437 139048 135185 132427 129744 126712 124009 122363 121466 120507 119378
56749A19378p23k27m95j344j750j324p40o14o99m98j16m2l97q23r24n70J3K44
$$ 119378 118655 118428 117933 116589 114839 113515 112775 112161 111462 110964 110848 110806 110409 109586 108662 108092 108105 108349
56731A08349m24j743k643k339j210j73M30Q10R48O49K68M46J075J300Q13K80J98
$$ 108349 107925 106182 103539 101200 99990 99817 100247 101057 102005 102654 102922 103368 104443 105743 106556 106836 107034
56714A07034J57k24m40J5N92M76J5K70J313J986J537N66M8J10J97l9m64p17n52
$$ 107034 107191 106967 106527 106542 107134 107610 107625 107895 109208 111194 112731 113297 113345 113455 113652 113613 113149 112432 111880
56695A11880p8J63k24q56r14j94O41J009J001Q83O13J64k11m18o52q40n47J36
$$ 111880 111802 111965 111741 110885 109971 109777 110418 111427 112428 113311 113924 114088 113877 113459 112807 111967 111420 111556
56677A11556L46k82p85j99Q76J055J16q53j102q90n63j11K16m6o21n52L75J170
$$ 111556 111902 111620 110835 110636 111512 112567 112683 111830 110728 109838 109275 109164 109380 109334 108713 108161 108536 109706
56659A09706J080O05M93O26N93O25J060J452J107J96m76n56l43n6L42P89J145
$$ 109706 110786 111391 111884 112510 113103 113728 114788 116240 117347 117543 117067 116511 116168 116112 116454 117243 118388
56642A18388J519J989K204J784R43J52n26j190j424p60L30P94M25J19M96J049
$$ 118388 119907 121896 124100 125884 126827 126979 126453 125263 123839 123079 123409 124203 124628 124747 125243 126292
56626A26292J035N47K30L44N62N16J66k20l26j41Kj45l91m92o76j334k283k872
$$ 126292 127327 127874 128104 128448 129010 129526 129692 129472 129146 129005 129007 128862 128471 127979 127303 125969 123686 120814
56608A20814k842k544k308k031j555r50l53J17K39o7m42m96m01n27o40k32M80
$$ 120814 117972 115428 113120 111089 109534 108584 108231 108348 108587 108520 108078 107582 107181 106654 106014 105782 106262
56591A06262P26M86N60J100J178L02o24o23n6J28p7M3O57J179J200P60m0j001
$$ 106262 106988 107474 108034 109134 110312 110614 109990 109367 109311 109439 109362 109405 110062 111241 112441 113201 113161 112160
56573A12160j538j103Q4J285K036K325K215J921K005K848M036M899N479O381P669
$$ 112160 110622 109519 109603 110888 112924 115249 117464 119385 121390 124238 128274 133173 138652 145033 152702
56558A52702Q652Q738P840N971L173P4k116k626j892j047r14j568k542l221l249
$$ 152702 161354 170092 177932 183903 187076 187150 185034 182408 180516 179469 178555 176987 174445 171224 167975
56543A67975k743k106j649j481j674k208k815l101k864k204j365o58l55m55o95
$$ 167975 165232 163126 161477 159996 158322 156114 153299 150198 147334 145130 143765 143107 142752 142297 141602
56528A41602r07j212j625j764j258l01N77J047J057O04j38p10q27q15j159j767
$$ 141602 140695 139483 137858 136094 134836 134535 135112 136159 137216 137820 137682 136972 136145 135330 134171 132404
56512A32404k096j905j442r63m87k7L16N08N66N07M73P21J199J416J065M56J6
$$ 132404 130308 128403 126961 125998 125511 125484 125800 126308 126874 127381 127854 128575 129774 131190 132255 132711 132727
56495A32727l11o62o92j05O15O75M9o19j002j268j397j117n09J9L57P07R69Q84
$$ 132727 132416 131754 131062 130957 131572 132247 132296 131677 130675 129407 128010 126893 126384 126403 126760 127467 128436 129320
56477A29320P47J136J895K144J496N13k04o64r62q88l79K50Q45J545K167K081
$$ 129320 130067 131203 133098 135242 136738 137251 137047 136383 135421 134533 134154 134404 135249 136794 138961 141042
56461A41042J103q6p35q13o15j79N10J116J214P35K5l93j08P03J221Q61J04j21
$$ 141042 142145 142059 141324 140511 139896 139717 140227 141343 142557 143292 143317 142924 142816 143519 144740 145601 145705 145584
56443A45584K34M23K35K28N63O54K71k9mk09q55j170o34N4j5o59j077r67m49M70
$$ 145584 145818 146241 146476 146704 147267 147921 148192 148163 148159 147950 147095 145925 145291 145345 145330 144671 143594 142627 142178 142648
56423A42648J580K216K087J803J859J736Q04m84j192j182r15n56j40j42p73j257
$$ 142648 144228 146444 148531 150334 152193 153929 154733 154249 153057 151875 150960 150404 150264 150122 149349 148092
56407A48092q32m4J11q7M35J548J942J178L57L56P64J008J343K000K358J815Q48
$$ 148092 147260 147216 147327 147240 147675 149223 151165 152343 152700 153056 153820 154828 156171 158171 160529 162344 163192
56390A63192L65M59N49M13M04P28J068R63K84o23j155q96m0P89J224J473J889
$$ 163192 163557 164016 164565 164978 165382 166110 167178 168141 168425 167802 166647 165751 165711 166500 167724 169197 171086
56373A71086K429K667K222J113k15j120j204n69L85J267J740J538P57l4k94r1
$$ 171086 173515 176182 178404 179517 179302 178182 176978 176409 176794 178061 179801 181339 182096 182062 181768 181677
56357A81677J04J44L52J008J935K658K837K513K039J695J361P87J39j02R6J79
$$ 181677 181781 181925 182277 183285 185220 187878 190715 193228 195267 196962 198323 199110 199249 199147 199243 199422
56341A99422j18k29M64J764K992L738L871L289K269J607J717J964J598R56R27
$$ 199422 199304 199075 199539 201303 204295 208033 211904 215193 217462 219069 220786 222750 224348 225304 226231
56326B26231J595K297K755L114K999J756k67j713j831j261q83p71o42n68o80p08
$$ 226231 227826 230123 232878 235992 238991 240747 240480 238767 236936 235675 234792 234021 233379 232811 232131 231423
56310B31423l18M67J417K312K851K791K399K259K468K557K345K263K578K884K754
$$ 231423 231105 231572 232989 235301 238152 240943 243342 245601 248069 250626 252971 255234 257812 260696 263450
56295B63450K347K058J952J944K084K309K285J904J674K156L270M348M856M812
$$ 263450 265797 267855 269807 271751 273835 276144 278429 280333 282007 284163 287433 291781 296637 301449
56281C01449M629M639M753M672M519M941O196P512P900P418P005P212P851Q739
$$ 301449 306078 310717 315470 320142 324661 329602 335798 343310 351210 358628 365633 372845 380696 389435
56267C89435R926J1157J2024J2782J4156J6132J7805J8752J9690K1440K4098K7503
$$ 389435 399361 410518 422542 435324 449480 465612 483417 502169 521859 543299 567397 594900
56255E94900L1633L6119M0226M3972M8364N3899N9693O4770O9324P3877P8028
$$ 594900 626533 662652 702878 746850 795214 849113 908806 973576 1042900 1116777 1194805
56244A194805Q1075Q3168Q4623Q4597Q1732P5959O8475N9952M9866L7688K3785
$$ 1194805 1275880 1359048 1443671 1528268 1610000 1685959 1754434 1814386 1864252 1901940 1925725
56233A925725Q954o049k0264l2690m3062n1922n9558o5457o9126p0936p1750p2033
$$ 1925725 1934679 1928630 1908366 1875676 1832614 1780692 1721134 1655677 1586551 1515615 1443865 1371832
56221A371832p1721p0625o8617o5524o1318n6429n1574m7200m3217l9372l5743
$$ 1371832 1300111 1229486 1160869 1095345 1034027 977598 926024 878824 835607 796235 760492
56210G60492l2653l0170k7937k5628k3328k1236j9203j6953j4635j2722j1346
$$ 760492 727839 697669 669732 644104 620776 599540 580337 563384 548749 536027 524681
56199E24681j0248r285q493p647o384m975m280m565m985m631l590k490j498m68
$$ 524681 514433 505148 496655 489008 482624 477649 473369 468804 463819 459188 455598 453108 451610 451142
56185D51142L69N34J04k57o6N80J316J867K157K290K421K473K166J518J088J390
$$ 451142 451511 452045 452149 451892 451826 452406 453722 455589 457746 460036 462457 464930 467096 468614 469702 471092
56169D71092K333L439M427N305O156P098Q225R290R700R201Q341P995Q539R714
$$ 471092 473425 476864 481291 486596 492752 499850 508075 517365 527065 536266 544607 552602 561141 570855
56155E70855J1105J2506J4060J6223J9360K3150K6809L0095L3735L8638M5121
$$ 570855 581960 594466 608526 624749 644109 667259 694068 724163 757898 796536 841657
56144H41657N3147O2680P3156Q3003R0345R3968R3225Q7531P6894O3003M9026
$$ 841657 894804 957484 1030640 1113643 1203988 1297956 1391181 1478712 1555606 1618609 1667635
56133A667635L7986L1386K9010K9341L0028K8574K3418J4773M634m226r888j2376
$$ 1667635 1705621 1737007 1766017 1795358 1825386 1853960 1877378 1892151 1896785 1892559 1882671 1870295
56121A870295j3316j4629j7797k4076l4307m7937o2610p5288q3817q7327q5882
$$ 1870295 1856979 1842350 1824553 1800477 1766170 1718233 1655623 1580335 1496518 1409191 1323309
56110A323309q0288p1896o2045n1637m1494l2683k6007k1341j7828j4609j1194
$$ 1323309 1243021 1171125 1109080 1057443 1015949 983266 957259 935918 918090 903481 892287
56099H92287p536m015j197P80K315L781N107O034O433O300N906N964P001Q466
$$ 892287 884751 880736 879539 880319 882634 886415 891522 897556 903989 910289 916195 922159 929160 937626
56085I37626R164Q742P991P530P126O640O557P043P465P563Q128R668J1282J1840
$$ 937626 946790 955532 963523 971053 978179 984819 991376 998419 1005884 1013447 1021575 1031243 1042525 1054365
56071A054365J1576J1557J2178J3096J4121J5225J6084J6490J6838J7493J8148
$$ 1054365 1065941 1077498 1089676 1102772 1116893 1132118 1148202 1164692 1181530 1199023 1217171
56060A217171J8489J8916J9846K0894K1581K2233K3359K4724K5875K6873K7792
$$ 1217171 1235660 1254576 1274422 1295316 1316897 1339130 1362489 1387213 1413088 1439961 1467753
56049A467753K8203K8055K8176K8964K9450K8831K7953K7986K8549K8585K8236
$$ 1467753 1495956 1524011 1552187 1581151 1610601 1639432 1667385 1695371 1723920 1752505 1780741
56038A780741K8252K8297K7623K6928K7736L0235L3394L6827M0863M5066M8535
$$ 1780741 1808993 1837290 1864913 1891841 1919577 1949812 1983206 2020033 2060896 2105962 2154497
56027B154497N1537N5010N8520O0554O0948O1195O2209O3518O4913O7056P0010
$$ 2154497 2206034 2261044 2319564 2380118 2441066 2502261 2564470 2627988 2692901 2759957 2829967
56016B829967P2856P5361P8508Q2757Q7141R0743R3872R7207J00804J04510J08482
$$ 2829967 2902823 2978184 3056692 3139449 3226590 3317333 3411205 3508412 3609216 3713726 3822208
56005C822208J12881J17732J23265J29635J36426J43247J50677J59605J69869
$$ 3822208 3935089 4052821 4176086 4305721 4442147 4585394 4736071 4895676 5065545
55996E065545J80489J91017K01679K12619K24060K36672K50818K66049K82432
$$ 5065545 5246034 5437051 5638730 5851349 6075409 6312081 6562899 6828948 7111380
55987G111380L01287L23210L46679L70419L95920M25529M59141M95257N34175
$$ 7111380 7412667 7735877 8082556 8452975 8848895 9274424 9733565 10228822 10762997
55978A0762997N77601O26060O79555P39968Q09822Q89403R78250J078831J195682
$$ 10762997 11340598 11966658 12646213 13386181 14196003 15085406 16063656 17142487 18338169
55969A8338169J331869J489822J675206J896375K160992K477387K859231L325164
$$ 18338169 19670038 21159860 22835066 24731441 26892433 29369820 32229051 35554215
55961C5554215L893991M582947N408016O380622P506256Q794487J0274253J2000372
$$ 35554215 39448206 44031153 49439169 55819791 63326047 72120534 82394787 94395159
55953I4395159J4051278J6522241J9497303K2976384K6763216L0347834L2832026
$$ 94395159 108446437 124968678 144465981 167442365 194205581 224553415 257385441
55946B57385441L2990948K9601852K2044644J0873622k112397j4496761k4211344
$$ 257385441 290376389 319978241 342022885 352896507 350784110 336287349 312076005
55939C12076005l0218851l2578376l2059720k9677133k6363869k2809909j9425969
$$ 312076005 281857154 249278778 217219058 187541925 161178056 138368147 118942178
55932A18942178j6399837j3788332j1584155r745998q218394o950703n902322
$$ 118942178 102542341 88754009 77169854 67423856 59205462 52254759 46352437
55925D6352437n035778m315502l714185l212960k794527k441715k142295j888971
$$ 46352437 41316659 37001157 33286972 30074012 27279485 24837770 22695475 20806504
55917B0806504j673975j488566j327521j189027j069913r65267q72529p91462
$$ 20806504 19132529 17643963 16316442 15127415 14057502 13092235 12219706 11428244
55909A1428244p20186o55415n96556n45316n01094m60749m23074l89601l60682
$$ 11428244 10708058 10052643 9456087 8910771 8409677 7948928 7525854 7136253 6775571
55900F775571l34522l10490k89631k71316k52966k34016k16770k02346j88885
$$ 6775571 6441049 6130559 5840928 5569612 5316646 5082630 4865860 4663514 4474629
55891D474629j74917j61482j49643j38640j28140j19954j15784j14907j15332
$$ 4474629 4299712 4138230 3988587 3849947 3721807 3601853 3486069 3371162 3255830
55882C255830j15732j15177j12591j07697j01456r4687q7360p9780p3163o8385
$$ 3255830 3140098 3024921 2912330 2804633 2703177 2608490 2521130 2441350 2368187 2299802
55872B299802o5203o3246o2619o3013o3315o2583o0547n6974n1696m5474l9801
$$ 2299802 2234599 2171353 2108734 2045721 1982406 1919823 1859276 1802302 1750606 1705132 1665331
55861A665331l5503l2460l0582k9936l0005l0115l0602l2214l4382l5551l5370
$$ 1665331 1629828 1597368 1566786 1536850 1506845 1476730 1446128 1413914 1379532 1343981 1308611
55850A308611l4946l4739l3846l1865k9834k8582k7453k5563k3111k0758j8716
$$ 1308611 1273665 1238926 1205080 1173215 1143381 1114799 1087346 1061783 1038672 1017914 999198
55839I99198j7107j6319j6255j6185j5813j5733j6151j6230j5320j4033j3265
$$ 999198 982091 965772 949517 933332 917519 901786 885635 869405 854085 840052 826787
55828H26787j2848j2002j0610r327q689q732r236r994j0926j2116j3501j4521
$$ 826787 813939 801937 791327 782000 773311 764579 755343 745349 734423 722307 708806 694285
55816F94285j4518j3522j2214j1182j0584j0419j0533j0374r436p915o404n106
$$ 694285 679767 666245 654031 642849 632265 621846 611313 600939 591503 583588 577184 572078
55804E72078l893k916k352j758o18N91Q57J82l74k50M6J38M00J079J765K212K893
$$ 572078 568185 565269 562917 561159 560541 561132 561989 562171 561797 561547 561593 561731 562131 563210 564975 567187 570080
55787E70080M216N875P341Q239P815M829j260r227j6672k1549k3161k2153j9838
$$ 570080 574296 580171 587512 595751 603566 608395 607135 597908 581236 559687 536526 514373 494535
55774D94535j7222j4508j1537q427n455k744p01l31k247n534q465j0144j0677
$$ 494535 477313 462805 451268 442841 437386 434642 433941 433610 431363 425829 417364 407220 396543
55761C96543j0087q213n636l471k092j102o13j303l025m587n349n908o746p363
$$ 396543 386456 378243 372607 369136 367044 365942 365329 364026 361001 356414 351065 345157 338411 331048
55747C31048p344p186p288p038n812m215l418l682m147l929k927j784j317j719
$$ 331048 323704 316518 309230 302192 296380 292165 288747 285065 280918 276989 274062 272278 270961 269242
55733B69242k247k062j324q65r69j290j876l204m958n922n531m541l718k832j600
$$ 269242 266995 264933 263609 262744 261775 260485 258609 255405 250447 244525 238994 234453 230735 227903 226303
55718B26303o21o20j308j751j463o42K42P48Q02R48J672K415K003L40j239j588
$$ 226303 225682 225062 223754 222003 220540 219898 220140 220888 221690 222638 224310 226725 228728 229068 227829 226241
55702B26241r24j21K29k77j827l740m791m682m304m098l430k151j412j895k458
$$ 226241 225317 225196 225425 225148 223321 219581 214790 210108 205804 201706 198276 196125 194713 192818 190360
55687A90360j795m77Q7r0J63J143J964K104J926J686J133K61m74p99q60p67n28
$$ 190360 188565 188088 188175 188085 188248 189391 191355 193459 195385 197071 198204 198465 197991 197192 196332 195565 195037
55670A95037k89j65L9M32O58L92n1j39J40M48O51P52O86O38J021J647J635P16
$$ 195037 194748 194583 194622 195054 195712 196104 196053 195914 196054 196502 197153 197905 198591 199229 200250 201897 203532 204248
55652B04248n5K50R73Q73m1q00j078j321j555j379j028j248k082k760k914k905
$$ 204248 204193 204443 205416 206289 206248 205448 204370 203049 201494 200115 199087 197839 195757 192997 190083 187178
55636A87178k930k741k374k358k962l916m890n567n431m276k885k246k205j818
$$ 187178 184248 181507 179133 176775 173813 169897 165007 159440 154009 149733 146848 144602 142397 140579
55622A40579r72n37p52p13J01Q72O99j03o66q88j263j851k159j979j719j860k357
$$ 140579 139607 139070 138318 137605 137706 138578 139277 139174 138508 137620 136357 134506 132347 130368 128649 126789 124432
55605A24432k687k401j639r57o04k57K53L96l30j424j900j630j349j344j084l50
$$ 124432 121745 119344 117705 116748 116144 115887 116140 116536 116206 114782 112882 111252 109903 108559 107475 107125
55589A07125J82l2n10m53J41O52P48O07M65M41P03J379K279K906K921K530K388
$$ 107125 107307 107275 106765 106312 106453 107105 107853 108460 108925 109366 110069 111448 113727 116633 119554 122084 124472
55572A24472K949L826M022L081J742J064J087Q41k78j782k871l400l785m273m636
$$ 124472 127421 131247 135269 138350 140092 141156 142243 143084 142806 141024 138153 134753 130968 126695 122059
55557A22059m495l765k801k075j672j251o78m18r29j852k249j721q63n62j066
$$ 122059 117564 113799 110998 108923 107251 106000 105322 104904 103975 102123 99874 98153 97290 96728 95662
55542I5662j767j719n22J130K003J658R75J018J712K120J775J103O95P10R39R93
$$ 95662 93895 92176 91654 92784 94787 96445 97420 98438 100150 102270 104045 105148 105843 106553 107492 108485
55526A08485N47j96n71l66l06r67j747j742j244j249j755j711q25q7k66r28j359
$$ 108485 109032 108836 108265 107899 107593 106626 104879 103137 101893 100644 98889 97178 96353 96266 96000 95072 93713
55509I3713j474j408j128r03j273k008k012q69L71O30K50J91M84M45o2n25p34
$$ 93713 92239 90831 89703 88800 87527 85519 83507 82638 83009 83639 83889 84080 84564 85009 84947 84422 83688
55492H3688r67j260j229o19L24J059J051J45j042j453p41K40N28K48J68M35N19
$$ 83688 82721 81461 80232 79613 79937 80996 82047 82192 81150 79697 78956 79196 79724 79972 80140 80575 81094
55475H1094K34Q2M10Q19O41k57j337j877j585q26k45j31k47k38K8M97J009J209
$$ 81094 81328 81410 81820 82639 83280 83023 81686 79809 78224 77398 77153 77022 76775 76537 76565 77062 78071 79280
55457G9280Q27R8m84q76j387j836j609q30n99j391k070j374K20J197J174J143
$$ 79280 80107 80205 79721 78845 77458 75622 74013 73183 72584 71193 69123 67749 67969 69166 70340 71483
55441G1483J619J816J064J1k80J83L65m20j693k332j677j38J189J475P51l43j112
$$ 71483 73102 74918 75982 75993 75713 75896 76261 75841 74148 71816 70139 70001 71190 72665 73416 73073 71961
55424G1961j079j65R99J351N34m52m02M65Q31J80n40m74j15l85j083j170l66L83
$$ 71961 70882 70717 71716 73067 73601 73149 72747 73212 74043 74223 73683 73209 73094 72709 71626 70456 70090 70473
55406G0473J62q36j702j866j403o60N7N28O88O66O41N93M00J34P7M04R88J609
$$ 70473 70635 69799 68097 66231 64828 64168 64225 64753 65441 66107 66748 67341 67741 67875 67952 68356 69344 70953
55388G0953K072K074J257k89j710k073j345m34j34l18l37P1N16M57j70q22q50
$$ 70953 73025 75099 76356 76067 74357 72284 70939 70505 70371 70053 69716 69787 70303 70760 70590 69768 68918
55371F8918j42P21J062P51J73k61l47k1N00O27kr10j220q04l68l08j82L29O57
$$ 68918 68776 69497 70559 71310 71483 71222 70875 70854 71354 71981 71979 71069 69849 69045 68677 68369 68187 68516 69173
55352F9173J68p64j236j065q17p42m83J40O74P09M36L22M63N78M60J96m7k39m70
$$ 69173 69341 68577 67341 66276 65459 64717 64234 64374 65048 65757 66193 66515 66978 67556 68016 68212 68165 67926 67456
55333F7456p51r10p52l31R7L83O21R72J462K008K384K185J177k32j209j364j106
$$ 67456 66705 65795 65043 64712 64809 65192 65813 66785 68247 70255 72639 74824 76001 75769 74560 73196 72090
55316G2090r60r22p41m41k26j62k99p58j331j347m98M69N49k05p06k32Q26J605
$$ 72090 71130 70208 69467 69026 68800 68638 68339 67581 66250 64903 64405 64874 65423 65218 64512 64280 65106 66711
55298F6711J680J137K66n26p76l22M27P90L89m60r87p42j78j37o87r29k68O03
$$ 66711 68391 69528 69794 69268 68492 68170 68597 69387 69776 69316 68329 67587 67409 67272 66585 65656 65388 65991
55280F5991O18j66p34o50m96p29q98m44L57Q28Q84J020J409J546R49n3n12J19
$$ 65991 66609 66443 65709 65059 64563 63834 62936 62492 62849 63677 64561 65581 66990 68536 69485 69432 68920 69039
55262F9039J244J658Q57m58j327j589j652j542r12J65J015J154P64K76m9k1M07
$$ 69039 70283 71941 72798 72340 71013 69424 67772 66230 65318 65483 66498 67652 68416 68692 68643 68622 69029
55245F9029P98M94m74j215j070m11J0P2J72L95L98po26j214j643j789j613j301
$$ 69029 69827 70321 69847 68632 67562 67151 67161 67233 67405 67800 68198 68191 67565 66351 64708 62919 61306 60005
55227F0005j045p07l0Q36J370J308R38O85O51O65O21N21L70J58RR5M26O96N20
$$ 60005 58960 58253 58223 59059 60429 61737 62675 63360 64011 64676 65297 65818 66188 66346 66355 66450 66876 67572 68092
55208F8092j36p95q68k45N76R99Q26K89k98o56n70l7N39O15J27l35j64M95Q78
$$ 68092 67956 67161 66293 66048 66624 67623 68449 68738 68440 67784 67214 67177 67716 68331 68458 68123 67959 68454 69332
55189F9332N00k87p69o60k39J53M13N28M61L06K74L87M06J80j34l45m63n43m65
$$ 69332 69832 69545 68776 68116 67877 68030 68443 68971 69432 69738 70012 70399 70805 70985 70851 70506 70043 69500 69035
55170F9035j62J69K97K06K2j71k34pL40L16j60l74K77J260J431N06o48j207j204
$$ 69035 68873 69042 69339 69545 69567 69396 69162 69155 69495 69811 69651 69277 69554 70814 72245 72751 72103 70896 69692
55151F9692j016o65p0M68M69j42q84j136o34K06N66O1p41j018p32m07j7R22K101
$$ 69692 68676 68011 67941 68409 68878 68736 67852 66716 66082 66288 66854 66915 66174 65156 64424 64017 64000 64922 67023
55132F7023K255Q76p93j284p55m51p07o64J89J195J460Q30k73j294j607q42N12
$$ 67023 69278 70154 69361 68077 67322 66871 66164 65500 65689 66884 68344 69174 68901 67607 66000 65158 65670
55115F5670J338J101M42K34N22Q24R91J239J514J414Q16P4m55p41q45o52p4O50
$$ 65670 67008 68109 68551 68785 69307 70131 71122 72361 73875 75289 76105 76179 75724 74983 74138 73486 73412 74062
55097G4062J089J056Q01O96Q02Q05M31k02p27r43r46q71p36n43l21m1L21N79M95
$$ 74062 75151 76207 77008 77704 78506 79311 79742 79540 78813 77870 76924 76053 75317 74774 74453 74412 74733 75312 75807
55078G5807K05K36P97J397J441R82M87J10l03n90l25L78P10J58p88j210p94K5
$$ 75807 76012 76248 77045 78442 79883 80865 81352 81462 81159 80569 80244 80622 81332 81490 80702 79492 78698 78723
55060G8723O10M81m63j700k265j688n62K02M50O18P77N75M6k78k24j83k70MP97
$$ 78723 79333 79814 79351 77651 75386 73698 73136 73338 73788 74406 75183 75758 75804 75526 75302 75119 74849 74853 75650
55041G5650J398J149L92m8J4J80K18J14l26j171j772j333p9Q52Q33M03L11N30
$$ 75650 77048 78197 78589 78541 78555 78735 78953 79067 78741 77570 75798 74465 74386 75238 76071 76474 76785 77315
55023G7315O10M86M17M59L97J45j46l46m82o38q92j209j413j292q72m24j87j46
$$ 77315 77925 78411 78828 79287 79684 79829 79683 79337 78855 78217 77325 76116 74703 73411 72539 72115 71928 71782
55005G1782j77k17k53k65k57k10l3L02O43Q23R55J299J791K002J658R75M11K61
$$ 71782 71605 71388 71135 70870 70613 70403 70370 70672 71315 72138 73093 74392 76183 78185 79843 80818 81229 81490
54987H1490M54O26L59l38q47n46L56R89R30O37O24P12N01K28N07J386K097J854
$$ 81490 81944 82570 82929 82591 81744 81198 81554 82543 83473 84110 84734 85446 85947 86175 86682 88068 90165 92019
54969I2019O30q61j744j614q06p7J11m3n3K72P55J130J154O43k85j023r94l32
$$ 92019 92649 91788 90044 88430 87624 87547 87658 87615 87562 87834 88589 89719 90873 91516 91231 90208 89214 88882
54951H8882J89Q9l00l86j28K8j24k84k03j50m97j012r95k23O52Q65M44l3k57l38
$$ 88882 89071 89160 88860 88474 88346 88374 88250 87966 87763 87613 87116 86104 85109 84886 85538 86403 86847 86814 86557 86219
54931H6219k70J29O55P65M33M08J181K126K207J307L13J1M37J242K156K959L473
$$ 86219 85949 86078 86733 87498 87931 88339 89520 91646 93853 95160 95473 95484 95921 97163 99319 102278 105751
54914A05751L807M245M739M833M292L426K542J416k21j966l041l331l546m191
$$ 105751 109558 113803 118542 123375 127667 131093 133635 135051 134830 132864 129823 126492 122946 118755
54900A18755m856m846m102l104k151j199l94j41n33j164j638j934k085j856j105
$$ 118755 113899 109053 104951 101847 99696 98497 98103 97962 97429 96265 94627 92693 90608 88752 87647
54885H7647j22O51J027J045P58M20N00J149J877K163K116K154K322K465K799L566
$$ 87647 87525 88176 89203 90248 91006 91426 91926 93075 94952 97115 99231 101385 103707 106172 108971 112537
54869A12537M305M231L404K675K370J750K41j559k626k828k942l556m412m786
$$ 112537 116842 121073 124477 127152 129522 131272 131513 129954 127328 124500 121558 118002 113590 108804
54855A08804m289l306k688k857l298l284k844k534k322j574k48P43P52K37n8p0
$$ 108804 104515 101209 98521 95664 92366 89082 86238 83704 81382 79808 79560 80303 81055 81292 81234 81164
54839H1164o0O1L76N01J65k00j03J93K15J34L40N30J72m42n38j41k1m02o06k21
$$ 81164 81104 81165 81541 82042 82207 82007 81904 82097 82312 82446 82786 83316 83488 83046 82508 82367 82346 81944 81338 81117
54819H1117K17L6o39j119q92K7J123J697J483R63P29P33O20N19P85J094O97l35
$$ 81117 81334 81370 80731 79612 78720 78747 79870 81567 83050 84013 84742 85475 86095 86614 87399 88493 89190 88855
54801H8855r82o43Q9L71J41j60k79k29r4j33n53r89p28K26Q94N31m03r45q19m45
$$ 88855 87873 87230 87319 87690 87831 87671 87392 87163 87069 86936 86383 85394 84666 84892 85786 86317 85914 84969 84150 83705
54781H3705j78n5l8ML01Q61J341J546J717J999K026J502Q25O23R28J298J566J951
$$ 83705 83527 83472 83434 83438 83739 84600 85941 87487 89204 91203 93229 94731 95556 96179 97107 98405 99971 101922
54763A01922K551L185L681L969L970L769L653L641L239K105P32j41o35j558l118
$$ 101922 104473 107658 111339 115308 119278 123047 126700 130341 133580 135685 136417 136276 135641 134083 130965
54748A30965m508m942m546l923l329k629j788j016n67n52q94j298j416j141o88
$$ 130965 126457 121515 116969 113046 109717 107088 105300 104284 103717 103165 102271 100973 99557 98416 97728
54733I7728k97p1r2m47r74j199p42K55J279J925K112J935J544J213J309K039L161
$$ 97728 97431 97360 97268 96821 95847 94648 93906 94161 95440 97365 99477 101412 102956 104169 105478 107517 110678
54716A10678M120M515M432M213L940L313K125O97m29j204k152l598m954n133l782
$$ 110678 114798 119313 123745 127958 131898 135211 137336 138033 137604 136400 134248 130650 125696 120563 116781
54701A16781j859p75r99j783k215k134j874j555j077o03n10p96j008r08p93r90
$$ 116781 114922 114147 113148 111365 109150 107016 105142 103587 102510 101907 101397 100601 99593 98685 97892 96902
54685I6902j356j534j434j236j073r19p05l54P2K03l48j332j848j300j88M48K17
$$ 96902 95546 94012 92578 91342 90269 89350 88645 88291 88363 88566 88218 86886 85038 83738 83550 83998 84215
54668H4215l52n97l91n0P2j49n16n78r1O39J038R07N72L57K67J85J84L74O18N67
$$ 84215 83863 83266 82875 82825 82897 82748 82232 81654 81563 82202 83240 84147 84719 85076 85343 85528 85712 86086 86704 87271
54648H7271L1p68j309j204n59O1J42l06p88q06l10L01N66M00J43Q8P9j68m34j23
$$ 87271 87302 86534 85225 84021 83462 83523 83665 83359 82571 81765 81455 81756 82322 82722 82865 82953 83032 82864 82430 82307
54628H2307Q26J594J387M64k43l19j76k31l07p3L21M01k3o08q48m97K87J111J574
$$ 82307 83133 84727 86114 86578 86335 86016 85840 85609 85302 85229 85550 85951 85928 85320 84472 83975 84262 85373 86947
54609H6947J432O46m84j337j349n18N90J388J676J458P65r0m66m1O07O22m9n97
$$ 86947 88379 89025 88541 87204 85855 85337 85927 87315 88991 90449 91214 91124 90658 90617 91224 91846 91797 91200
54591I1200m01L03Q94J046P78J80n80j159j242q19j98K26K40L7M3L68N06q3j124
$$ 91200 90799 91102 91996 93042 93820 94000 93420 92261 91019 90200 90002 90228 90468 90505 90548 90916 91422 91339 90215
54572I0215j671j192j62N96P50M82K5l89m04J78R94J339R05Q7n38q21r83j048
$$ 90215 88544 87352 87190 87786 88536 89018 89043 88654 88250 88428 89422 90761 91666 91753 91215 90394 89411 88363
54554H8363o48L37J245J168J31p23m84L74P01K28k64j66K83O54R11J121J182J165
$$ 88363 87715 88052 89297 90465 90596 89873 89389 89763 90464 90692 90428 90262 90545 91199 92110 93231 94413 95578
54536I5578J332J490J003j24q23l02P76J191Q19M93N09L45j57l29K55R76Q94j79
$$ 95578 96910 98400 99403 99279 98456 98154 98930 100121 100940 101433 101942 102287 102130 101801 102056 103032 103926 103747
54518A03747j561k277j681m4J367J368K40o10m80j31l83q93r69q14r63j062l97
$$ 103747 102186 99909 98228 98184 99551 100919 101159 100549 100069 99938 99555 98662 97693 96879 95916 94854 94457
54501I4457O60R38K95m2O46J411J062j23r10q11l53P8O29J207J158K29q37j159
$$ 94457 95117 96055 96350 96308 96954 98365 99427 99304 98394 97583 97230 97308 97937 99144 100302 100531 99694 98535
54483I8535q41p29j104j228l56J169K232K209J592J199J167J017M93p5k97j61
$$ 98535 97694 96965 95861 94633 94277 95446 97678 99887 101479 102678 103845 104862 105355 105280 104983 104822
54467A04822J83P12J359J745J544R28L81J20K0JJ33K69Q0m09o77l47K39M79K91
$$ 104822 105005 105717 107076 108821 110365 111293 111674 111794 111814 111815 111948 112217 112297 111888 111211 110864 111103 111582 111873
54448A11873R7R6l9n86j222j338q40l45n10j243j770j492o37J7k3n65j080j188
$$ 111873 111970 112066 112027 111441 110219 108881 108041 107696 107186 105943 104173 102681 102044 102061 102038 101473 100393 99205
54430I9205q02m4P74J220J070N89L20N83J185J639J558R27J09m46n47l58j11J17
$$ 99205 98403 98359 99133 100353 101423 102012 102332 102915 104100 105739 107297 108224 108333 107887 107340 106982 106871 106988
54412A06988L07L35J01k61m94n35m91l59l7L74N68M74M45Q07J434J950K203K239
$$ 106988 107295 107630 107731 107470 106976 106441 105950 105591 105554 105928 106496 106970 107415 108222 109656 111606 113809 116048
54394A16048J968J248K71m41o59p03r62j283j175m17O58J447J495P67k72q96p61
$$ 116048 118016 119264 119535 119094 118435 117732 116770 115487 114312 113895 114553 116000 117495 118262 117990 117094 116333
54377A16333k28P9k1k73n49r04j131p75J19P87O53J16m0L13O74Q31J082J560J895
$$ 116333 116105 116184 116163 115890 115341 114437 113306 112531 112650 113437 114090 114206 114166 114479 115153 115984 117066 118626 120521
54358A20521J681Q89k59j434k176k153j585j004n27J25Q19Q75J08o25m92K24O83
$$ 120521 122202 123091 122832 121398 119222 117069 115484 114480 113953 114078 114897 115772 115880 115255 114763 114987 115670
54341A15670P26Q47J152J191Q13M74N71R85J438J785J815J309M86k5L9J89j17
$$ 115670 116396 117243 118395 119586 120399 120873 121444 122429 123867 125652 127467 128776 129262 129237 129276 129465 129348
54324A29348p34j127j127r99r39q64p66q97j465k227k574k127j227o16n77o36
$$ 129348 128614 127487 126360 125361 124422 123558 122792 121895 120430 118203 115629 113502 112275 111659 111082 110446
54308A10446l08J47K02N4L98J159J273J24j355j752r55j95l79j103j437j089m51
$$ 110446 110138 110285 110487 110541 110939 112098 113371 113495 112140 110388 109433 109238 108859 107756 106319 105230 104779
54291A04779J57O93J087J109P99O45J001J449J180J27p35n16M52J118J049O63
$$ 104779 104936 105629 106716 107825 108624 109269 110270 111719 112899 113026 112291 111775 112227 113345 114394 115057
54275A15057K47m15j202j329m44O09P94L13J49N33P10K88q6K61R69J133M68m17
$$ 115057 115304 114889 113687 112358 111914 112523 113317 113630 113779 114312 115022 115310 115224 115485 116454 117587 118055 117638
54257A17638p37k91M60Q24N16p5l73k57k3K47P65J386J430N58n96j118r16o66
$$ 117638 116901 116610 117070 117894 118410 118335 117962 117705 117682 117929 118694 120080 121510 122068 121472 120354 119438 118772
54239A18772p55q89p83o51p72r58q34m43j42o8k0O6n5m92r38j090j057j067r25
$$ 118772 118017 117128 116345 115694 114922 113964 113130 112687 112545 112477 112457 112523 112468 111976 111038 109948 108891 107824 106899
54220A06899k92N69R26O20L80P69J297J132K88n09q69r46p44j13N40M63k64o09
$$ 106899 106607 107176 108102 108722 109102 109871 111168 112300 112588 112079 111210 110264 109520 109407 109947 110410 110146 109537
54202A09537j15L57M9l54K16J416J911J368P80P19N46k75j179j471j400j498j514
$$ 109537 109422 109779 109828 109474 109690 111106 113017 114385 115165 115884 116430 116155 114976 113505 112105 110607 109093
54185A09093r40j05K09l6j95j34l66q77q23K26J485J943J607J137O99r1j209j987
$$ 109093 108153 108048 108257 108221 108026 107892 107526 106649 105826 106052 107537 109480 111087 112224 112923 112832 111623 109636
54167A09636j924j251n25m7J73K16K37L95O09N64J55k67l32j29M5J73L73L85k23
$$ 109636 107712 106461 105936 105889 106062 106278 106515 106910 107519 108083 108238 107971 107639 107510 107555 107728 108101 108486 108263
54148A08263j209j598q20M28R52M77j91k61K94J074J740K020J778J281R98Q43
$$ 108263 107054 105456 104636 105064 106016 106493 106302 106041 106335 107409 109149 111169 112947 114228 115226 116069
54132A16069K19r08j572j058l5L78K57N72J403J721J065L65M06N90j4j105j632
$$ 116069 116288 115380 113808 112750 112715 113093 113350 113922 115325 117046 118111 118476 118882 119472 119458 118353 116721
54115A16721j369r27n21K33J254J763J394P27L93K97O6k84n31o44o41m31j24o9
$$ 116721 115352 114425 113904 114137 115391 117154 118548 119275 119668 119965 120031 119747 119216 118572 117931 117500 117376 117307
54097A17307l19l93K8O34R86J104J094O48m42j585j870j182j99N79J185J570J383
$$ 117307 116988 116595 116623 117257 118243 119347 120441 121089 120647 119062 117192 116010 115811 116390 117575 119145 120528
54080A20528N92k30n76n76o33q17r07p49k81N05J379J859J653J005M31J93K20
$$ 120528 121120 120890 120314 119738 119105 118288 117381 116632 116351 116856 118235 120094 121747 122752 123183 123376 123596
54063A23596L08K28j63o87r03o50l58n21r64r69j21J208K256K564K213J637J271
$$ 123596 123904 124132 123969 123282 122379 121729 121371 120850 119886 118917 118796 120004 122260 124824 127037 128674 129945
54046A29945J313J735K398L056L327K942K180J735J938K390K669L001L794M725
$$ 129945 131258 132993 135391 138447 141774 144716 146896 148631 150569 152959 155628 158629 162423 167148
54032A67148N003M509M026M074M169L599K495J638J445J618J737J766J876K105
$$ 167148 172151 176660 180686 184760 188929 192528 195023 196661 198106 199724 201461 203227 205103 207208
54018B07208K267K184J947J910K336L046L567L657L296K224m4l366o591q482q873
$$ 207208 209475 211659 213606 215516 217852 220898 224465 228122 231418 233642 233598 230232 223641 215159 206286
54003B06286q505p977p339o556n733m837l733k559j690j250j089j219j737k298
$$ 206286 197781 189804 182465 175909 170176 165339 161606 159047 157357 156107 155018 153799 152062 149764
53989A49764k284j720j363j562j640r80m0K36k33p14p27m59j65O6M3m03r24r01
$$ 149764 147480 145760 144397 142835 141195 140215 140175 140411 140178 139464 138737 138278 138113 138179 138222 137819 136895 135994
53971A35994k61M51R07J251J436R85j72j227j417r40n15l43j04L07O22P19P14
$$ 135994 135733 136184 137091 138342 139778 140763 140591 139364 137947 137007 136492 136149 136045 136352 136974 137693 138407
53954A38407O07L34J70N60J410K027J991J673J642J921K167K320K616L071L367
$$ 138407 139014 139348 139518 140078 141488 143515 145506 147179 148821 150742 152909 155229 157845 160916 164283
53939A64283L345L276L458L772L820L422K766K149J731J596J772K018J853J136
$$ 164283 167628 170904 174362 178134 181954 185376 188142 190291 192022 193618 195390 197408 199261 200397
53925B00397N10Q42K086L132L094K379K056K438K925L144L409L947M307M100L699
$$ 200397 200907 201749 203835 206967 210061 212440 214496 216934 219859 223003 226412 230359 234666 238766 242465
53910B42465L642L664L045J717L18p87j798k652k714j760o28m02j196k232k828
$$ 242465 246107 249771 252816 254533 254851 254064 252266 249614 246900 245140 244512 244110 242914 240682 237854
53895B37854k896k702k612k956l728m443m654m462m217l929l429k946k913l215
$$ 237854 234958 232256 229644 226688 222960 218517 213863 209401 205184 201255 197826 194880 191967 188752
53881A88752l268k874k439k172j781j158p80r62j276j182p99o10o64n98j67O31
$$ 188752 185484 182610 180171 177999 176218 175060 174280 173318 172042 170860 170061 169451 168787 168189 168022 168653
53865A68653J638K363K184J299J013K326M565O343P606R534J2221J3708J1974
$$ 168653 170291 172654 174838 176137 177150 179476 184041 190384 197990 207524 219745 233453 245427
53852B45427P177J217m201q281j0506j0499q726o509m925l951k916j522j86M76
$$ 245427 252604 253821 249620 241339 230833 220334 211608 205099 200174 196223 193307 191785 191599 192075
53838A92075L00l40j048j816k813l827m318m097l678l615l819l773l257k500j747
$$ 192075 192375 192035 190987 189171 186358 182531 178213 174116 170438 166823 163004 159231 155974 153474 151727
53823A51727j033l83J60P13J398J975J942J164J75l10l7P34J523J887J641J136
$$ 151727 150694 150311 150471 151184 152582 154557 156499 157663 157838 157528 157491 158225 159748 161635 163276 164412
53807A64412J098J865K911L403L201K939L048L233L037K542K093J676J094N65
$$ 164412 165510 167375 170286 173689 176890 179829 182877 186110 189147 191689 193782 195458 196552 197117
53793A97117N24Q01O65j23q69q70k34N44J306J919J805N79j108k169k479k781
$$ 197117 197641 198442 199107 198984 198115 197245 197011 197555 198861 200780 202585 203164 202056 199887 197408 194627
53777A94627l294l331k585j879k062k870l397l192k362j124Q9N50n8j044j505
$$ 194627 191333 188002 185417 183538 181476 178606 175209 172017 169655 168531 168620 169170 169112 168068 166563
53762A66563j470j593j949j970j538j266j488j736j555j239j252j396j079k26
$$ 166563 165093 163500 161551 159581 158043 156777 155289 153553 151998 150759 149507 148111 147032 146806
53748A46806O11R83R52P91N76K85O7J28L96N18L49K19N10J057J290J013O57O27
$$ 146806 147417 148400 149352 150143 150719 151004 151071 151199 151595 152113 152462 152681 153191 154248 155538 156551 157208 157835
53730A57835Q17R51J032J111R78N89M60J067K039K565K508K405K475K351J928
$$ 157835 158652 159603 160635 161746 162724 163313 163773 164840 166879 169444 171952 174357 176832 179183 181111
53715A81111J696J869J895J311N72L89O64P19L63J59O39J767L176M434N073M778
$$ 181111 182807 184676 186571 187882 188454 188843 189507 190226 190589 190748 191387 193154 196330 200764 205837 210615
53699B10615L768K713K154K069K092J945J581J119P35N04L17O5j19K7M68P93O61
$$ 210615 214383 217096 219250 221319 223411 225356 226937 228056 228791 229295 229612 229677 229558 229585 230053 230846 231507
53682B31507J92k19m23o37j072j591j835j591r63k20L82O41M37j59q36j201j029
$$ 231507 231699 231480 231057 230420 229348 227757 225922 224331 223368 223148 223530 224171 224608 224449 223613 222412 221383
53665B21383m25K54O55P22O88O91N05j57j099j779j989k006j940j430l56O56R94
$$ 221383 220958 221212 221867 222589 223277 223968 224473 224316 223217 221438 219449 217443 215503 214073 213717 214373 215367
53648B15367R90J347J879J739R24N43J232K165K274J724J336J150N61l11m76M51
$$ 215367 216357 217704 219583 221322 222246 222789 224021 226186 228460 230184 231520 232670 233231 232920 232444 232895
53632B32895J532J690J012M12M62J003J672K288K749K948K900K772K762K983L381
$$ 232895 234427 236117 237129 237541 238003 239006 240678 242966 245715 248663 251563 254335 257097 260080 263461
53617B63461L690L622L275L085L282L531L527L562M117M951N205M566L682L212
$$ 263461 267151 270773 274048 277133 280415 283946 287473 291035 295152 300103 305308 309874 313556 316768
53603C16768K948K354J520R91Q66P74O09O61R42R61M49k61p89j202j632j888j836
$$ 316768 319716 322070 323590 324581 325447 326221 326830 327491 328433 329394 329843 329582 328793 327591 325959 324071 322235
53586C22235j738j842j898j537q57k21K68O13O04J66k12l3L99M16J28L94J564
$$ 322235 320497 318655 316757 315220 314363 314142 314410 315023 315627 315793 315581 315548 315947 316363 316491 316885 318449
53569C18449K923L535L120J925L61j007j662j670j605j789k080k424k943l270
$$ 318449 321372 324907 328027 329952 330313 329306 327644 325974 324369 322580 320500 318076 315133 311863
53555C11863k596r19N71R30P30J094K006K496K265K125K758L819M497M449L898
$$ 311863 309267 308348 308919 309849 310579 311673 313679 316175 318440 320565 323323 327142 331639 336088 339986
53540C39986L298L116L624M673N816O697P257P599P930Q547R581J0787J1771J2381
$$ 339986 343284 346400 350024 354697 360513 367210 374467 382066 389996 398543 408124 418911 430682 443063
53526D43063J2665J2633J2367J2245J2692J3725J4965J6059J6861J7453J8236
$$ 443063 455728 468361 480728 492973 505665 519390 534355 550414 567275 584728 602964
53515F02964J9724K1823K3605K4310K4330K4573K5059K4978K4120K3379K3480
$$ 602964 622688 644511 668116 692426 716756 741329 766388 791366 815486 838865 862345
53504H62345K3984K3986K3296K2447K1857K1534K1380K1357K1337K1079K0361
$$ 862345 886329 910315 933611 956058 977915 999449 1020829 1042186 1063523 1084602 1104963
53493A104963J9135J7740J6860J6964J7704J8171J7853J7057J6361J6064J6258
$$ 1104963 1124098 1141838 1158698 1175662 1193366 1211537 1229390 1246447 1262808 1278872 1295130
53482A295130J6838J7265J6863J5618J4211J2915J1066Q089M528J446q84l020
$$ 1295130 1311968 1329233 1346096 1361714 1375925 1388840 1399906 1407995 1412523 1413969 1413085 1410065
53470A410065n355p768j0053j2107j3731j4821j5675j6578j7224j7164j6799j7137
$$ 1410065 1404710 1396942 1386889 1374782 1361051 1346230 1330555 1313977 1296753 1279589 1262790 1245653
53458A245653j8436j9789k0373k0437k0709k1283k1693k1663k1309k0724j9854
$$ 1245653 1227217 1207428 1187055 1166618 1145909 1124626 1102933 1081270 1059961 1039237 1019383
53447A019383j8783j7767j6907j5971j4566j2440r725o984m857l553k777k206
$$ 1019383 1000600 982833 965926 949955 935389 922949 913224 906240 901383 897830 895053 892847
53435H92847j820j587j156j68J315K963M649O425Q106R306R908J0286J0956J2206
$$ 892847 891027 889440 888284 888116 889431 892394 897043 903468 911574 920880 930788 941074 952030 964236
53421I64236J4035J6225J8398K0242K1819K3417K5109K6675K8023K9368L0819
$$ 964236 978271 994496 1012894 1033136 1054955 1078372 1103481 1130156 1158179 1187547 1218366
53410A218366L2138L3176L4266L5853L7868L9902M1875M4138M6836M9598N1938
$$ 1218366 1250504 1283680 1317946 1353799 1391667 1431569 1473444 1517582 1564418 1614016 1665954
53399A665954N3681N4857N5556N5992N6404N6707N6564N5979N5425N5080N4358
$$ 1665954 1719635 1774492 1830048 1886040 1942444 1999151 2055715 2111694 2167119 2222199 2276557
53388B276557N2663N0292M8012M5911M3407M0335L7251L4457L1420K7581K3223
$$ 2276557 2329220 2379512 2427524 2473435 2516842 2557177 2594428 2628885 2660305 2687886 2711109
53377B711109J8998J5026J0954O675K359k143p403j3757k0977k8621l6425m4099
$$ 2711109 2730107 2745133 2756087 2762762 2765121 2762978 2755575 2741818 2720841 2692220 2655795 2611696
53365B611696n0995n6162n8875n9174n8013n6728n6139n6112n5928n4981n3102
$$ 2611696 2560701 2504539 2445664 2386490 2328477 2271749 2215610 2159498 2103570 2048589 1995487
53354A995487n0540m7870m5714m4275m3298m2657m2615m3207m3673m3158m1703
$$ 1995487 1944947 1897077 1851363 1807088 1763790 1721133 1678518 1635311 1591638 1548480 1506777
53343A506777m0024l8415l6596l4550l2658l0827k8332k4925k1435j8732j6714
$$ 1506777 1466753 1428338 1391742 1357192 1324534 1293707 1265375 1240450 1219015 1200283 1183569
53332A183569j4866j3308j2595j2790j3399j4040j4524j4495j3668j2379j1276
$$ 1183569 1168703 1155395 1142800 1130010 1116611 1102571 1088047 1073552 1059884 1047505 1036229
53321A036229j0492r626q497p340o254n027l615k206p32J109L195M932O034O898
$$ 1036229 1025737 1016111 1007614 1000274 994020 988993 985378 983172 982440 983549 986744 991676 997710 1004608
53307A004608P876Q829R703J1010J3165J5770J8054J9748K1099K2267K3259K4227
$$ 1004608 1012484 1021313 1031016 1042026 1055191 1070961 1089015 1108763 1129862 1152129 1175388 1199615
53295A199615K5324K6331K6967K7401K7980K8425K7866K5927K3341K1213J9843
$$ 1199615 1224939 1251270 1278237 1305638 1333618 1362043 1389909 1415836 1439177 1460390 1480233
53284A480233J8578J6647J4001J1172Q556N941K913m80l757o672r388j1925j3905
$$ 1480233 1498811 1515458 1529459 1540631 1549187 1555128 1558041 1557561 1553804 1547132 1537744 1525819 1511914
53271A511914j5280j6758j9001k1691k3995k5704k7161k8284k8569k8188k8181
$$ 1511914 1496634 1479876 1460875 1439184 1415189 1389485 1362324 1334040 1305471 1277283 1249102
53260A249102k9104l0204l0456k9893k9327k9153k9085k8789k8109k6865k5119
$$ 1249102 1219998 1189794 1159338 1129445 1100118 1070965 1041880 1013091 984982 958117 932998
53249I32998k3598k3202k3891k4636k4742k4629k4931k5286k4668k2778k0466
$$ 932998 909400 886198 862307 837671 812929 788300 763369 738083 713415 690637 670171
53238F70171j8615j7177j5584j3724j1985j0533r128p706o708o498o874p384p934
$$ 670171 651556 634379 618795 605071 593086 582553 573425 565719 559011 552513 545639 538255 530321
53225E30321q701r630j0383j0825j1197j1742j2352j2673j2393j1487j0287r305
$$ 530321 521620 511990 501607 490782 479585 467843 455491 442818 430425 418938 408651 399346
53213C99346q765q395p865p269o923o753o404n926n884o569p452p773p359o665
$$ 399346 390581 382186 374321 367052 360129 353376 346972 341046 335162 328593 321141 313368 306009 299344
53199B99344o156n932n834n688n424n072m660m148l546l025k721k533k279k039
$$ 299344 293188 287256 281422 275734 270310 265238 260578 256430 252884 249859 247138 244605 242326 240287
53185B40287k012k154k280k418k645k629j985j099r14j598k081j400M2R77P57
$$ 240287 238275 236121 233841 231423 228778 226149 224164 223065 222151 220553 218472 217072 217114 218091 218848
53170B18848k10j098j302o83K70P72N90L17M48N96J15q52j603j821j659j123k06
$$ 218848 218638 217540 216238 215555 215825 216597 217187 217504 217952 218548 218663 217811 216208 214387 212728 211605 211399
53153B11399N29L45n99j322j295r80r07r41p52m49l25l74m34m58m14j97J46L56
$$ 211399 211928 212273 211674 210352 209057 208077 207170 206229 205477 205028 204703 204329 203895 203437 203023 202826 202972 203328
53135B03328L27K15J05j58o56j201j598j835j880j644j164n90NN12N73j6p70r62
$$ 203328 203655 203870 203975 203817 203161 201960 200362 198527 196647 195003 193839 193249 193254 193766 194339 194323 193553 192591
53117A92591o14l30j81L46J126J137kj151j131l21Q6j64l63k15j32k97m09m22
$$ 192591 191977 191647 191466 191812 192938 194075 194073 192922 191791 191470 191556 191392 191029 190814 190682 190385 189976 189554
53099A89554o49j058j224j114j176j499j590j227q13o29m02M4L20J58m6J04L02
$$ 189554 188905 187847 186623 185509 184333 182834 181244 180017 179204 178575 178173 178217 178537 178695 178649 178753 179055
53082A79055M9m64n97j69M27R37J394J689J504Q33J34j70o8K47O22Q89Q62N48
$$ 179055 179104 178640 178043 177874 178301 179238 180632 182321 183825 184658 184792 184622 184554 184801 185423 186312 187174 187722
53064A87722K30J64L48N60N86L71J01J29N57R74Q60L23P6N20J186J320Q30L01
$$ 187722 187952 188116 188464 189024 189610 189981 190082 190211 190768 191742 192602 192925 193001 193521 194707 196027 196857 197158
53046A97158J58J33l48j439k558k904k324j589j547j985j811n99O33O83k54r35
$$ 197158 197316 197449 197101 195662 193104 190200 187876 186287 184740 182755 180944 180345 180978 181661 181407 180472
53030A80472q46o60r03j127q08k99k20m36l80m2P3j03o8M12R05R14M97J09O2K61
$$ 180472 179626 178966 178063 176936 176128 175829 175609 175173 174793 174751 174824 174721 174653 175065 175970 176884 177381 177490 177552 177813
53010A77813L33L9l18j15P39J449J283N82K54M56N06J45jM42P80K26p48q17M45
$$ 177813 178146 178185 177867 177752 178491 179940 181223 181805 182059 182515 183021 183166 183165 183607 184387 184613 183865 183048 183493
52991A83493J836J758K1j820k023m90J154J449O96K28M29L94l79j004m49R52K010
$$ 183493 185329 187087 187108 185288 183265 182775 183929 185378 186074 186302 186731 187125 186746 185742 185293 186245 188255
52974A88255K218K009J722J242O13K32K61M07M95P05J058J197R89Q74J224J675
$$ 188255 190473 192482 194204 195446 196059 196291 196552 196959 197454 198159 199217 200414 201403 202277 203501 205176
52958B05176J557Q04l3n68r51j427j952k409k848l201l051k100p70M2o9o57j106
$$ 205176 206733 207537 207504 206936 205985 204558 202606 200197 197349 194148 191097 188997 188227 188269 188200 187543 186437
52941A86437j330j540j624j217l03O23J047Q62L52r7k45k16l58p43r29n88j49
$$ 186437 185107 183567 181943 180726 180423 181046 182093 182955 183307 183210 182965 182749 182391 181648 180719 180131 179982
52924A79982l26j057j458r40J24J025J477J497J092M31k3k0J04o1l95n38n75q80
$$ 179982 179656 178599 177141 176201 176325 177350 178827 180324 181416 181847 181824 181804 181908 181847 181452 180914 180339 179459
52906A79459j368j452q38k6K24k65r20j053n20K69Q69J127R98L77n92j350j449
$$ 179459 178091 176639 175801 175775 175999 175734 174814 173761 173241 173510 174379 175506 176504 176881 176289 174939 173490
52889A73490j100p05j27R19J909J908J024M81Q43J154M28p92j290q98m27k92j88
$$ 173490 172390 171685 171558 172477 174386 176294 177318 177799 178642 179796 180224 179432 178142 177244 176817 176525 176337
52872A76337M6J91K28M44R08J387J750J914J586O24m86j141j363j416r99K60J709
$$ 176337 176383 176574 176802 177246 178154 179541 181291 183205 184791 185415 184929 183788 182425 181009 180010 180270 181979
52855A81979K013P87r60k108k377j970j244q83j411k173j747P1J638J444k1j163
$$ 181979 183992 184779 183819 181711 179334 177364 176120 175237 173826 171653 169906 169977 171615 173059 173038 171875
52839A71875j379j376j729k152k134j629r66n47o02r54j052n56K43P78Q56O39
$$ 171875 170496 169120 167391 165239 163105 161476 160510 159963 159361 158407 157355 156799 157042 157820 158676 159315
52823A59315K54k62p08q05m74J71R43J536J587J123P20Q65J297J406J125R64J176
$$ 159315 159569 159307 158599 157794 157320 157491 158434 159970 161557 162680 163400 164265 165562 166968 168093 169057 170233
52806A70233J413J320J053R38Q67M06n03j306j428r92p11j043j649j824j331n58
$$ 170233 171646 172966 174019 174957 175824 176230 175727 174421 172993 172001 171290 170247 168598 166774 165443 164885
52790A64885M9M20O82Q29P62N44L94M39N15L22j89o43o36l28k59n31o11k50j05
$$ 164885 164934 165354 166036 166865 167627 168171 168565 169004 169519 169841 169652 169009 168373 168045 167786 167255 166644 166394 166289
52771A66289p91j715j616k90J080J425R33L64n7n94j244j549j090L0J121J333
$$ 166289 165498 163783 162167 161877 162957 164382 165315 165679 165622 165028 163784 162235 161145 161175 162296 163629
52755A63629M70o50j029o19j35J08M73J003J101N76K29P36J560J637P47l47q49
$$ 163629 164099 163449 162420 161801 161666 161774 162247 163250 164351 164927 165156 165892 167452 169089 169836 169489 168640
52738A68640m32P09J846K075J307N96R06J867K373K128J817J895K002J674R27
$$ 168640 168208 168917 170763 172838 174145 174741 175647 177514 179887 182015 183832 185727 187729 189403 190330
52723A90330M1p67j282j358j157j056j152j226j182j235j529j847j766j045J28
$$ 190330 190371 189604 188322 186964 185807 184751 183599 182373 181191 179956 178427 176580 174814 173769 173897
52708A73897J155J432Q95O4m96o00k89L13Q14P44K05p6K76P40P29M32K90J46l35
$$ 173897 175052 176484 177379 177443 176947 176347 176058 176371 177185 177929 178134 178058 178334 179074 179803 180235 180525 180671 180336
52689A80336q04n50M25J404J788J418L57q86j291l91P77Q10j39o53j65L98L42
$$ 180336 179532 178982 179407 180811 182599 184017 184374 183488 182197 181806 182583 183393 183254 182601 182436 182834 183176
52672A83176J97N24Q17L97m29q85q09n19j21K91L23j55m67Q9J165J769J583J192
$$ 183176 183373 183897 184714 185111 184682 183797 182988 182469 182348 182639 182962 182807 182340 182429 183594 185363 186946 188138
52654A88138J055R62O57M38P16J213J011l71k160k932k193r47l71l63p3N26O37
$$ 188138 189193 190155 190812 191250 191966 193179 194190 193819 191659 188727 186534 185587 185216 184853 184780 185306 185943
52637A85943J81J49R57J610J174K33k9M61Q45P34M44J45j92k55L06R23N22r52
$$ 185943 186124 186273 187230 188840 190014 190247 190218 190679 191524 192258 192702 192847 192655 192400 192706 193629 194151 193199
52619A93199k187k024p45M09N77j37r81j245q83n43p35j094q67LQ27J167J239
$$ 193199 191012 188988 188243 188652 189229 189092 188111 186866 185983 185440 184705 183611 182744 182747 183574 184741 185980
52602A85980J229Q90J74l33m3Q71J703J982J745J320J071J146J272J007L23l14
$$ 185980 187209 188099 188273 187940 187897 188768 190471 192453 194198 195518 196589 197735 199007 200014 200337 200023
52586B00023n62n18l03J69P79J056Q55P34J108J421Q77k82r83q30n91r34j431
$$ 200023 199461 198943 198640 198809 199588 200644 201499 202233 203341 204762 205639 205357 204374 203544 202953 202019 200588
52569B00588j225l22M32M48k4l84m49n55j057j867k468k391j671p52K4O76J254
$$ 200588 199363 199041 199473 199921 199897 199513 199064 198509 197452 195585 193117 190726 189055 188303 188327 189003 190257
52552A90257J473R46k71j535k120j736o51N69J321J226M17m74q09n57l03n47j106
$$ 190257 191730 192676 192405 190870 188750 187014 186363 186932 188253 189479 189896 189422 188613 188056 187753 187206 186100
52535A86100j346r02L6J085J961K367K008J043K70L87J092J319M59j009k144k403
$$ 186100 184754 183852 183888 184973 186934 189301 191309 192352 192622 193009 194101 195420 195879 194870 192726 190323
52519A90323j787o13N71J151J020P58R23J381J761K209L062L891L780K722J936
$$ 190323 188536 187923 188494 189645 190665 191423 192346 193727 195488 197697 200759 204650 208430 211152 213088
52504B13088K262K922K507Q86p43j475j621j850k159k168j929j846j978j928j530
$$ 213088 215350 218272 220779 221665 220922 219447 217826 215976 213817 211649 209720 207874 205896 203968 202438
52489B02438j196j394j977k351k170j598r28k64L09N90N62O30J159J872K124J768
$$ 202438 201242 199848 197871 195520 193350 191752 190824 190560 190869 191459 192021 192651 193810 195682 197806 199574
52473A99574J382J450J709J517O49m72j153r24J01J184J567J291J217K009L344
$$ 199574 200956 202406 204115 205632 206281 205809 204656 203732 203833 205017 206584 207875 209092 211101 214445
52458B14445M323M327L237J261r81k507k734k155j782j987k313k357k255k167
$$ 214445 218768 223095 226332 227593 226612 224105 221371 219216 217434 215447 213134 210777 208522 206355
52444B06355j882j131k0R79J300O06p90j923k028j423j013r51n10N98J548J552
$$ 206355 204473 203342 203322 204301 205601 206207 205417 203494 201466 200043 199030 198079 197569 198167 199715 201267
52428B01267R98P81R60Q72L21j46j27J42L07M02N51O63O96R18J572K450L139L542
$$ 201267 202265 203046 204006 204878 205199 205053 204926 205068 205375 205777 206328 206991 207687 208605 210177 212627 215766 219308
52410B19308L913M429N091O023P520R466J0875J0492P985M298O85k348m897o797
$$ 219308 223221 227650 232741 238764 246284 255750 266625 277117 285102 289400 290085 287737 282840 276043
52396B76043p564p131o202n507n058m374l287k210j607j455j286o96K23R61J169
$$ 276043 268479 261348 255146 249639 244581 240207 236920 234710 233103 231648 230362 229666 229889 230850 232019
52381B32019J038J028J259J448J414J395J753K548L467M042L982L467L132L445
$$ 232019 233057 234085 235344 236792 238206 239601 241354 243902 247369 251411 255393 258860 261992 265437
52367B65437M129M450M106L434K776K083J350Q55P01N13j7o07q28p07m90r3O35
$$ 265437 269566 274016 278122 281556 284332 286415 287765 288620 289321 289834 289817 289210 288382 287675 287185 287092 287727
52350B87727J379J680J697K086L056M145M910N334N438N078M392L992M361N357
$$ 287727 289106 290786 292483 294569 297625 301770 306680 312014 317452 322530 326922 330914 335275 340632
52336C40632O555P750Q892R858J0717J1857J3485J5111J6078J6471J7011J8046
$$ 340632 347187 354937 363829 373687 384404 396261 409746 424857 440935 457406 474417 492463
52324D92463J9154J9898K0471K1243K2045K2329K1855K0814J9390J7687J6020
$$ 492463 511617 531515 551986 573229 595274 617603 639458 660272 679662 697349 713369
52313G13369J4845J4188J3508J2340J0763R148P780O873O535O371N525L608J370
$$ 713369 728214 742402 755910 768250 779013 788161 795941 802814 809349 815720 821245 824853 826223
52300H26223l9l58k75m44r23j518k067k350k360k702m066o152p750q164p865p413
$$ 826223 826184 825826 825551 825107 824184 822666 820599 818249 815889 813187 809121 802969 795219 787055 779190 771777
52284G71777o474m523j979J87J665K939M389N995P792R898J1983J3372J3874J4039
$$ 771777 765303 760780 758801 758988 760653 763592 767981 773976 781768 791666 803649 817021 830895 844934
52270H44934J4381J4825J5104J5307J5563J5516J4529J2438R879P761O521N856
$$ 844934 859315 874140 889244 904551 920114 935630 950159 962597 972476 980237 986758 992614
52258I92614N120L984K716J808J389J122P29L64L19L83j72j762l861n523o464
$$ 992614 997734 1001718 1004434 1006242 1007631 1008753 1009482 1009846 1010165 1010548 1010376 1008614 1004753 999230 992766
52243I92766p238q276r270r809j0101j0454j0494r658q292p320o860o078m598
$$ 992766 985528 977252 967982 958173 948072 937618 927124 917466 909174 901854 894994 888916 884318
52230H84318l139k373j961j333o14j68J73O55R67Q26P68J528K855L805M046M173
$$ 884318 881179 878806 876845 875512 874898 874730 874903 875558 876525 877351 878119 879647 882502 886307 890353 894526
52214H94526M781N881P061P743P443O404N683N995O735O812O098N272M547L601
$$ 894526 899307 905188 912249 919992 927435 933839 939522 945517 952252 959064 965162 970434 974981 978582
52200I78582K572K058K047J912J537J519K040K506K511K180J456J13j163j009
$$ 978582 981154 983212 985259 987171 988708 990227 992267 994773 997284 999464 1000920 1001033 999870 998861
52186I98861P22K350K332R45o77k171l659m791n239n622o753q240q796p892o229
$$ 998861 999583 1001933 1004265 1005210 1004533 1002362 998703 993912 988673 983051 976298 968058 959262 951370 945141
52171I45141m699l594k754j890q68q9k72j305j832q22R20J770J555J632K722L948
$$ 945141 940442 936848 934094 932204 931336 931247 930975 929670 927838 927016 927936 929706 931261 932893 935615 939563
52155I39563M260L773L154K543J764R32K28n07j309j626r69K07Q56N98J00J70
$$ 939563 943823 947596 950750 953293 955057 955989 956217 955710 954401 952775 951806 952013 952869 953467 953567 953737
52139I53737Q83J704K268K738L514M705O073P399Q756J0284J1842J3182J4435
$$ 953737 954620 956324 958592 961330 964844 969549 975622 983021 991777 1002061 1013903 1027085 1041520
52126A041520J6180J8823K2046K4997K7053K8264K9081K9747L0032K9572K8302
$$ 1041520 1057700 1076523 1098569 1123566 1150619 1178883 1207964 1237711 1267743 1297315 1325617
52115A325617K6439K4195K1671J8973J6118J2934R362N816K847L72k235n118p557
$$ 1325617 1352056 1376251 1397922 1416895 1433013 1445947 1455309 1461125 1463972 1464344 1462109 1456991 1449434
52102A449434q959r708j0503j1293j1491j0956j0128r256q212p039o081n499n172
$$ 1449434 1440475 1430767 1420264 1408971 1397480 1386524 1376396 1367140 1358928 1351889 1345808 1340309 1335137
52089A335137n176n837p183q709r849j0251r553p443m190p05K289M855P399R922
$$ 1335137 1329961 1324124 1316941 1308232 1298383 1288132 1278579 1271136 1266946 1266241 1268530 1273385 1280784 1290706
52075A290706J1957J3124J3540J3757J4315J5202J5791J5517J4542J3458J2444
$$ 1290706 1302663 1315787 1329327 1343084 1357399 1372601 1388392 1403909 1418451 1431909 1444353
52064A444353J1194R657Q185O829N087K740L76j398k855m692o936q908j0203j1154
$$ 1444353 1455547 1465204 1473389 1480218 1485305 1488045 1488421 1487023 1484168 1479476 1472540 1463632 1453429 1442275
52050A442275j2212j3325j4202j4935j6043j7850j9879k1111k1021k0282k0060
$$ 1442275 1430063 1416738 1402536 1387601 1371558 1353708 1333829 1312718 1291697 1271415 1251355
52039A251355k0591k0859j9887j7909j5863j4065j2020r428o807m923l990l598
$$ 1251355 1230764 1209905 1190018 1172109 1156246 1142181 1130161 1120733 1113926 1109003 1105013 1101415
52027A101415l235k677k042j644j769k505l745n267o737p753q104p959p708p629
$$ 1101415 1098180 1095503 1093461 1091817 1090048 1087543 1083798 1078531 1071794 1064041 1055937 1047978 1040270 1032641
52013A032641p830q368r236j0294j1468j3006j5204j7858k0185k1466k1601k0986
$$ 1032641 1024811 1016443 1007207 996913 985445 972439 957235 939377 919192 897726 876125 855139
$$ [...]
##END NTUPLES=NMR SPECTRUM
##END=
