##TITLE=NES1062_ptc150_9883053_uy56wyng8z
##JCAMPDX= 6.0         $$ Bruker NMR JCAMP-DX V2.0
##DATA TYPE= NMR SPECTRUM
##DATA CLASS= NTUPLES
##ORIGIN= BRUKER
##OWNER= Administrator
$$ 1.72 TOPSPIN		Version 2.1
$$ 2016-08-26 22:22:28.961 -0500  Administrator@X
$$ Compression mode = diff/dup
##.OBSERVE FREQUENCY= 400.02188249412
##.OBSERVE NUCLEUS= ^1H
##.ACQUISITION MODE= SIMULTANEOUS (DQD)
##.ACQUISITION SCHEME= undefined
##.AVERAGES= 8
##.DIGITISER RES= 22
##SPECTROMETER/DATA SYSTEM= spect
##.PULSE SEQUENCE= zg30
##.SOLVENT NAME= COFFEE_meoh
##.SHIFT REFERENCE= INTERNAL, COFFEE_meoh, 1, 14.98509
##AUDIT TRAIL= $$ (NUMBER, WHEN, WHO, WHERE, PROCESS, VERSION, WHAT)
$$ ##TITLE= Audit trail, TOPSPIN		Version 2.1
$$ ##JCAMPDX= 5.01
$$ ##ORIGIN= Bruker BioSpin GmbH
$$ ##OWNER= Administrator
$$ $$ E:\/data/COFFEE/nmr/NES1062_ptc150_9883053_uy56wyng8z/10/pdata/1/auditp.txt
$$ ##AUDIT TRAIL=  $$ (NUMBER, WHEN, WHO, WHERE, PROCESS, VERSION, WHAT)
(   1,<2016-08-26 22:22:21.789 -0500>,<Administrator>,<X>,<go>,<TOPSPIN 2.1>,
      <created by zg
	started at 2016-08-26 22:21:15.554 -0500,
	POWCHK enabled, PULCHK disabled,
       configuration hash MD5:
       21 0F 79 D6 B3 7B B4 F6 88 20 88 DB 03 48 BD 9F
       data hash MD5: 64K
       88 CE C4 1C 7F F6 85 26 23 22 0E CD 1E 6C AC 7B>)
(   2,<2016-08-26 22:22:24.883 -0500>,<Administrator>,<X>,<proc1d>,<TOPSPIN 2.1>,
      <Start of raw data processing
       efp LB = 0 FT_mod = 6 PKNL = 1 PHC0 = 0 PHC1 = 0 SI = 32K 
       data hash MD5: 32K
       2D 85 0A 21 97 89 90 88 1A 04 5E 86 92 0B A7 31>)
(   3,<2016-08-26 22:22:25.164 -0500>,<Administrator>,<X>,<proc1d>,<TOPSPIN 2.1>,
      <pk PHC0 = 92.4939 PHC1 = 0 
       data hash MD5: 32K
       AF 31 8B AE 76 C4 7C 78 FC E5 80 F2 F5 66 0F 0E>)
(   4,<2016-08-26 22:22:25.273 -0500>,<Administrator>,<X>,<proc1d>,<TOPSPIN 2.1>,
      <abs ABSG = 1 
       data hash MD5: 32K
       AC B2 8D BC 68 AE 9C D4 B4 E9 A7 BF F8 F8 C3 8A>)
(   5,<2016-08-26 22:22:25.336 -0500>,<Administrator>,<X>,<proc1d>,<TOPSPIN 2.1>,
      <abs ABSG = 2 
       data hash MD5: 32K
       97 5D BA 97 21 92 E3 43 55 4E 54 7E CF 90 69 66>)
(   6,<2016-08-26 22:22:25.398 -0500>,<Administrator>,<X>,<proc1d>,<TOPSPIN 2.1>,
      <abs ABSG = 3 
       data hash MD5: 32K
       03 82 F3 73 97 16 16 78 27 7D E1 82 1A E9 19 33>)
(   7,<2016-08-26 22:22:25.461 -0500>,<Administrator>,<X>,<proc1d>,<TOPSPIN 2.1>,
      <abs ABSG = 4 
       data hash MD5: 32K
       4F 5F BD E8 36 D9 39 D8 17 7A F9 CD E5 D4 F2 94>)
(   8,<2016-08-26 22:22:25.523 -0500>,<Administrator>,<X>,<proc1d>,<TOPSPIN 2.1>,
      <abs ABSG = 5 
       data hash MD5: 32K
       17 F2 FA E5 09 69 70 25 BC FD 0C 98 F4 4A 53 99>)
$$ ##END=
$$ 
$$ $$ hash MD5
$$ $$ 2C BC D5 E1 75 95 EF EA 76 5D 42 B8 00 17 82 65
##$RELAX= 
##$RELAX= 
##$RELAX= 
##$RELAX= 
##$RELAX= 
##$RELAX= 
##$RELAX= 
$$ Bruker specific parameters
$$ --------------------------
##$DU= <E:\>
##$EXPNO= 10
##$NAME= <NES1062_ptc150_9883053_uy56wyng8z>
##$PROCNO= 1
$$ [...]
150 150 150 150 150 150 150 150
##$TP07= 0
##$TPNAME0= <>
##$TPNAME1= <>
##$TPNAME2= <>
##$TPNAME3= <>
##$TPNAME4= <>
##$TPNAME5= <>
##$TPNAME6= <>
##$TPNAME7= <>
##$TPOAL= (0..7)
0.5 0.5 0.5 0.5 0.5 0.5 0.5 0.5
##$TPOFFS= (0..7)
0 0 0 0 0 0 0 0
##$TUNHIN= 0
##$TUNHOUT= 0
##$TUNXOUT= 0
##$USERA1= <user>
##$USERA2= <user>
##$USERA3= <user>
##$USERA4= <user>
##$USERA5= <user>
##$V9= 5
##$VALIST= <valist>
##$VCLIST= <CCCCCCCCCCCCCCC>
##$VD= 0
##$VDLIST= <DDDDDDDDDDDDDDD>
##$VPLIST= <PPPPPPPPPPPPPPP>
##$VTLIST= <TTTTTTTTTTTTTTT>
##$WBST= 2048
##$WBSW= 25
##$XGAIN= (0..3)
0 0 0 0
##$XL= 0
##$YL= 0
##$YMAX_a= 615497
##$YMIN_a= -525937
##$ZGOPTNS= <>
##$ZL1= 120
##$ZL2= 120
##$ZL3= 120
##$ZL4= 120
##$ABSF1= 14.98509
##$ABSF2= -5.573092
##$ABSG= 5
##$ABSL= 3
##$ALPHA= 0
##$AQORDER= 0
##$ASSFAC= 0
##$ASSFACI= 0
##$ASSFACX= 0
##$ASSWID= 0
##$AUNMP= <proc_prof1d_extract_pilot.lims>
##$AXLEFT= 0
##$AXNAME= <>
##$AXNUC= <1H>
##$AXRIGHT= 0
##$AXTYPE= 0
##$AXUNIT= <>
##$AZFE= 0.1
##$AZFW= 0.1
##$BCFW= 0
##$BC_mod= 0
##$BYTORDP= 0
##$COROFFS= 0
##$CY= 15
##$DATMOD= 1
##$DC= 0
##$DFILT= <>
##$DTYPP= 0
##$F1P= 0
##$F2P= 0
##$FCOR= 0.5
##$FTSIZE= 32768
##$FT_mod= 6
##$GAMMA= 0
##$GB= 0
##$INTBC= 1
##$INTSCL= 1
##$ISEN= 128
##$LB= 0
##$LEV0= 0
##$LPBIN= 0
##$MAXI= 10000
##$MC2= 0
##$MEAN= 0
##$ME_mod= 0
##$MI= 0
##$NCOEF= 0
##$NC_proc= -8
##$NLEV= 6
##$NOISF1= 0
##$NOISF2= 0
##$NSP= 0
##$NTH_PI= 0
##$NZP= 0
##$OFFSET= 14.98509
##$PC= 1
##$PHC0= 92.4939
##$PHC1= 0
##$PH_mod= 1
##$PKNL= yes
##$PPARMOD= 0
##$PPDIAG= 0
##$PPIPTYP= 0
##$PPMPNUM= 2147483647
##$PPRESOL= 1
##$PSCAL= 4
##$PSIGN= 0
##$PYNMP= <proc.py>
##$REVERSE= no
##$SF= 400.02
##$SI= 32768
##$SIGF1= 0
##$SIGF2= 0
##$SINO= 400
##$SIOLD= 32768
##$SPECTYP= <>
##$SREGLST= <1H.CDCl3>
##$SSB= 0
##$STSI= 32768
##$STSR= 0
##$SW_p= 8223.68421052631
##$SYMM= 0
##$S_DEV= 0
##$TDeff= 65536
##$TDoff= 0
##$TI= <>
##$TILT= no
##$TM1= 0
##$TM2= 0
##$TOPLEV= 0
##$USERP1= <user>
##$USERP2= <user>
##$USERP3= <user>
##$USERP4= <user>
##$USERP5= <user>
##$WDW= 1
##$XDIM= 32768
##$YMAX_p= 450676748
##$YMIN_p= -755779
##$CURPLOT= <Network HP LaserJet P1505>
##$CURPRIN= <$Network HP LaserJet P1505>
##$DFORMAT= <normdp>
##$LAYOUT= <+/1D_H.xwp>
##$LFORMAT= <normlp>
##$PFORMAT= <normpl>
##$SURQMSG= 1
$$ End of Bruker specific parameters
$$ ---------------------------------
##NTUPLES= NMR SPECTRUM
##VAR_NAME=  FREQUENCY,     SPECTRUM/REAL,   SPECTRUM/IMAG
##SYMBOL=    X,             R,               I
##VAR_TYPE=  INDEPENDENT,   DEPENDENT,       DEPENDENT
##VAR_FORM=  AFFN,          ASDF,            ASDF
##VAR_DIM=   32768,         32768,           32768
##UNITS=     HZ,            ARBITRARY UNITS, ARBITRARY UNITS
##FACTOR=    0.250966925370066, 1,           1
##FIRST=     8223.43324360094, -15388,       -254274
##LAST=      0,             130668,          -22754
##MIN=       0,             -755779,         0
##MAX=       8223.43324360094, 450676748,    0
$$ Real data points
##PAGE= N=1
##DATA TABLE= (X++(R..R)), XYDATA
$$ [...]
23844 -124292 -98245 -125663 55843 -138890 223012 66986 -39457 -109758 -106338 -27516 6191
23832 -245268 27575 -137098 136884 74385 -251498 -157855 -237956 95878 61023 -174978 153274
23820 -59864 138185 140933 135602 -149564 -37381 -66386 -158831 90405 -160428 -140043 -18541
23808 -249904 -74139 -154171 -121505 -177381 90023 65893 -202949 -26312 -38126 -153978 -24541
23796 -16080 -34226 96201 -61337 1005 91950 -109771 161641 -374654 259048 -454964 40855
23784 154982 -94987 140200 -204394 30007 129633 162677 4262 297224 146667 28030 -101773
23772 -126113 194922 -174086 70384 -63824 159265 -230992 -319792 -26356 119393 13155
23761 70416 -161790 -87959 11514 -236964 168407 22356 -286103 76744 -32951 290850 -79790
23749 -112098 206394 -63520 116663 102839 201785 91782 -333400 26183 -57969 -16446 -60804
23738 -60804 179355 -176323 -80056 156215 210269 -155288 81006 -241887 -240103 245466 349203
23727 349203 158717 365478 -274105 -25206 -65937 -140438 94009 -284994 -28524 -19876 176781
23715 233456 -17403 -77592 -151261 -186538 57933 -54831 128636 -126338 44034 205119 -34489
23703 150774 73495 -219038 -66706 -130213 117668 71539 152939 -144741 -117171 386681 -124049
23691 8933 26431 -128733 238315 63342 -120487 -221882 -7266 357755 -171461 97631 -6993
23679 -15285 -145278 307196 145691 131371 -81394 -283812 -18119 5621 -108955 -306518 -144865
23667 -96437 -484757 42710 63280 -316474 65626 -263796 -40122 -112988 -70882 189399 32438
23655 -90496 -152848 152325 226162 -92484 -57199 152937 69493 -108441 50431 -68583 34166
23643 213784 -124029 -153437 -41208 -143360 -21839 17189 -237081 -138904 164803 65132 -33668
23631 -173820 -286938 19486 32535 174767 -28590 -169288 -39047 -7505 -88020 205020 -251815
23619 -21685 -26414 62483 -127852 34269 181745 5723 -390157 -45988 -122768 -78944 -101748
23608 -101748 -26620 -363896 62785 101141 182494 -231380 -309061 -19491 -76282 21055 259500
23597 259500 -161215 -188220 -53640 -439087 318119 -189823 156249 -270718 -139764 37067
23586 -343710 312634 140038 237983 217134 -190860 196739 -92628 -44272 -74124 290422
23575 242533 99677 -118907 196870 -334952 59688 -27405 -17132 227585 -45303 36060 49332
23564 49332 -161566 -120100 188819 -119460 -132212 -162469 139894 -241619 -222040 -204836 -66402
23552 -11476 -12635 289296 -85769 -96839 -204642 -234162 -232113 -14579 -430671 -27943 141438
23540 14824 59156 406982 -36489 249932 51185 183235 139907 -273325 -239964 177759 -288120
23528 -66900 -249138 -39034 -112855 16426 49027 173088 174610 118305 91857 67316 50576
23517 50576 -43340 639758 89516 -233110 -58642 -47165 202333 14544 9128 -112944 113685
23505 -166792 -500229 164831 96151 -258052 112308 225939 -392375 -126913 23051 120120
23495 120120 226318 -153656 272154 117228 -91823 146088 -83377 80912 170446 124725
23485 124725 -312412 19003 129131 -33914 274879 -176780 153952 108464 -75420 -149181
23475 -149181 -62069 -246486 -38936 109621 136770 356936 185058 -153324 37958 -133733
23464 -209343 -63387 -302163 -160877 -263046 -172040 -34807 -90836 -165768 -35655 43980 -182663
23452 -84213 -190012 -273116 -372399 -74826 337673 -265202 98764 41734 92164 20743 -75722
23440 183528 218236 106458 223005 33467 -115944 -153410 -7654 -222638 152902 -224331
23429 144784 -39743 -204207 -105443 -66068 111161 13721 -116865 93719 105816 -173020 -73742
23417 -126537 167216 357676 -8125 -303550 365130 -39431 -65007 3085 -70199 -90838 74988
23405 -218686 -133583 -34961 -32585 376754 -291744 159028 158853 -1852 329869 343693 250564
23394 250564 -200741 -248772 78219 -36917 116150 -69009 153089 89613 92279 -266907 286696
23382 -4387 -238731 -32115 157108 372240 -60082 -21447 -189483 102819 39293 62847 -151991
23370 190016 3687 139699 -104272 -251960 118720 224861 -34569 19129 -28343 -71887 5199
23358 18403 -22254 -16405 130606 22805 -220847 50039 113079 215181 221593 139355 31990
23346 -248323 42393 9196 134162 -49876 -47913 -53054 113858 -276634 -512982 -79714 74813
23334 57890 155886 -164321 -304151 39135 -129078 -153427 -75757 -12731 -185200 -335270 -403244
23323 -403244 -269616 -44588 199593 210235 38606 210723 -10203 -73221 -81635 -50453 -119648
23312 -119648 -276009 347742 -101740 -149698 110470 37024 -198860 -182336 40665 -221793
23301 156849 -107287 -204757 55648 -83375 57008 -55956 -113043 18181 -62009 244667 140824
23290 140824 23621 -104258 -68800 -70359 47624 214520 -239906 -120734 -74865 -2014 148606
23278 -106037 -104478 119119 -160746 -162021 -127414 -137311 -241074 -217459 5051 -35405 -171194
23267 -171194 -41362 143400 236669 -7161 -78613 -41173 -225860 141139 -40000 -30470 29894
23255 341676 -335643 -170036 7912 -147295 -380807 200604 -46891 -186800 -174526 -146125
23245 -146125 -98438 -305507 28853 34647 112448 -34075 -144467 187131 135980 3487 -285583
23233 -121385 5522 107037 311735 123138 38460 150200 -265781 273728 129582 -44791
23222 -123659 -108486 -142973 -104245 15168 62876 -243127 232090 168301 -164378 -260654 11324
23210 64359 78697 -100615 -42715 -182473 -203629 -196947 156281 -110363 78316 54905 -249674
23198 25951 -49709 -112086 95315 83647 150507 111364 -212979 235192 205414 59267 -57107
23186 -21296 -158716 -234705 -34368 -125442 -137365 -129273 -244063 99592 14923 87813 42370
23174 -97073 22621 65540 188130 -92288 278333 53711 -113576 239717 93410 -32075 69550
23162 -2220 102142 135973 30790 90806 -106120 201496 -11047 45213 199847 -97409 -168203
23151 -168203 -75831 68851 -132620 209889 -111243 140253 146769 -30190 195402 -19538 37517
23139 297371 -137078 199950 -26432 144851 232908 -527359 160086 -103436 -10188 -21032
23129 -21032 97417 98591 -173591 118530 -128587 136520 -118746 -172155 -305729 116286
23118 5104 -30146 37472 -533329 197123 -56078 -129020 102528 125611 -82724 -189249 -34278
23106 -24795 -367690 -153047 72185 55984 -4369 95421 28752 -74341 105043 28257 137380
23095 137380 -99084 -71353 -143128 120971 73570 -194956 -141273 90930 -115103 -90640 -285046
23084 -285046 167562 -463708 23045 -104165 303980 -253127 -21064 201204 -49571 -32221
23074 -32221 86228 -113123 -111454 271524 237182 -69727 -21555 -112304 -221025 31 -308421 -266863
23062 -266863 -147970 -183977 108447 -232865 7000 127204 -338654 -46928 -130756 -295967
23052 -295967 6278 -61446 -593 31387 -268616 -89270 -27388 -69092 86803 -242580 120464
23040 11937 -250845 -207136 -302443 -106308 96454 -166010 419852 -225124 -279180 -76975 -39185
23029 -39185 1051 119297 -396632 -9436 -249271 -19744 -129299 -110094 419271 159506 -109694
23017 7794 59127 -210940 76776 118904 167439 19520 -28090 76662 353353 177461 -283360
23005 -133771 -68665 145793 75618 -103334 11092 -173870 -102185 67461 41987 -326246 36613
22993 -84102 -623787 107152 -71241 44231 -43474 135928 302209 198286 -67080 143748
22982 -260305 -73450 -363014 -22968 261007 -77044 -119950 -204585 181501 34808 87849 194824
22971 194824 123019 -63485 -22911 40232 15176 -202779 192536 203786 92535 118516 -47852
22959 9362 -276690 175963 320583 50645 100259 282919 -68118 -191850 160030 -132752
22948 213280 -87063 -153774 -324595 121647 -14508 77344 108921 46739 93236 -145963 -149314
22937 -149314 -154463 -64219 -218016 -27811 256284 -1082 -188050 -139820 -94785 57318 204230
22926 204230 63062 -264456 61362 -438561 143640 178626 535581 -51513 -315884 -81545
22915 -69406 8873 146150 -69478 -81267 -68075 219641 -345683 -58045 -332385 -167883 -304716
22904 -304716 -93882 -66474 101749 -96267 -201225 -256379 -99920 92474 39901 -57536 -10321
22892 -332900 -177407 -303329 -33384 -72486 -389687 21946 97057 -137120 -234754 -128133
22882 -128133 -179413 -251673 82082 -211765 90846 118697 87131 2364 248022 -77224 189161
22870 127368 279204 -46334 -200106 -225263 -305678 185867 -4560 11837 -241342 89052 -108684
22858 3024 222494 239770 353767 25454 -218486 12785 -12177 23829 424699 -155715 -129428
22847 -129428 151509 -84009 306091 -24541 -101112 162606 -167075 188045 -61639 351769
22836 183974 73422 199106 -241199 -308379 -90949 -78474 143221 39869 -26105 324810 -272809
22824 -240843 -55002 122396 -226310 -335084 -168853 199423 116386 -167767 -141317 208151
22813 41117 83538 -7503 376268 59274 -87394 144059 -256262 78083 15684 -41516 45946
22801 215736 -175561 24898 24202 49343 -90776 -152081 -7559 -70495 -98688 354790 16061 158995
22789 158995 208154 -57931 -17252 229058 -86975 -160728 -102146 -81710 93247 -55434 -199810
22778 -199810 -12639 237466 -108201 -199349 8868 168082 138796 126488 371148 -182789 -352239
22767 -352239 -223710 -305408 247375 -113238 -145606 11363 -204165 -108068 -40747 -137316 -24455
22755 40283 -136488 141519 32402 -275921 201544 134097 -90455 -119082 -132695 -179917 -106682
22744 -106682 -143803 66813 -321500 19430 -123537 25512 -164169 -56591 -70097 165908 29438
22732 70860 -217508 -202780 130782 -54052 -239392 -97103 -309687 -17634 -256989 -270737 -163363
22721 -163363 -113734 13712 222311 129443 146127 -226802 -16398 316221 42851 228155 208957
22710 208957 -133329 -28416 -2896 14454 30716 -51011 269710 143661 -80019 -181331 23955
22698 -151219 -135965 342968 42052 127528 -49319 -106463 111010 124699 -103401 64662 -218338
22686 -35625 354031 -90258 -378099 160293 4898 -288662 -79104 139799 -300364 -163644
22676 -163644 -78961 -131894 -144549 109075 89169 49367 97722 -30058 344617 79876 -74562
22664 83410 -46373 -434076 51207 147661 240497 -96759 233978 55551 193267 -224858 -293986
22653 -293986 -142640 -192773 -243063 -115931 169282 29147 201707 -236435 150431 -22166
22642 -319169 -209502 221429 -297904 86281 -132642 195636 337146 -43983 -261990 -94742
22631 36976 -261964 16290 -4599 -59918 33082 -358074 93907 222225 148298 -165204 -209202
22620 -209202 108430 -28695 -215205 72346 -376909 -950 -176423 123138 121242 -86425 -223107
22609 -223107 45164 478756 -350709 -104312 83369 -139959 -190393 146232 -159510 -243985
22599 -243985 335204 -135852 100936 -4663 120011 60095 131414 95321 -16701 -249753 -138681
22588 -138681 -78764 222888 -88279 265151 -94184 -287394 184228 -131326 18247 -352197
22577 5272 288283 -79614 364714 -23767 -246836 398176 -32912 -157707 54775 -151793 184942
22565 -33102 -367558 -39581 53568 -109191 -247542 -257028 -8160 64147 63915 181301 133218 -141086
22552 -9891 -199740 64894 24321 -302263 -258017 136599 -77879 32712 -96224 -163416 -286352
22541 -286352 28083 -11405 -315657 61713 10015 63711 -50542 -216060 140912 -117136 116205
22529 168661 -45440 29225 -132504 -236447 36898 -78213 -33561 -47180 134082 169654 251854
22518 251854 10556 -47605 -104582 -71136 -291862 -133778 32616 -193394 69115 -86141 -396244
22507 -396244 -129110 170083 92343 -77530 51506 -17917 -96124 -19558 -210233 -153831 136392
22495 143575 27522 125125 -243053 -105323 -218483 -63528 26349 156314 102553 178578 -136695
22483 -96684 105238 4553 -352600 -280574 -21959 -224081 -60843 18905 40946 8949 317046
22472 317046 -58268 109569 28501 377096 -139149 -197316 118305 -115137 -275276 -16403
22461 96490 17657 133426 362654 -132037 79944 272164 13147 -15317 -46570 39347 55573
22450 55573 -27301 62692 -22965 -247875 -338182 282189 -132718 229619 -49764 -112332 49288
22438 76231 -215503 53877 -25346 -1102 -161739 -456061 89669 -47878 43678 256387 178156
22427 178156 -218190 159391 91415 -97353 -134957 73101 -157078 45637 19941 -33587 -54093
22416 -54093 -1549 104084 -73455 146123 31783 -23464 -336948 -244339 -182112 -197922 -203728
22405 -203728 -309378 -6953 -116895 -307530 -60847 226739 4222 -47286 148504 137019 -198924
22393 107234 60683 -217875 -381353 308109 274967 -193273 90038 -30560 -15828 -111734 13555
22381 -81377 -55746 449685 37081 -103684 -39542 31501 145312 5761 -142255 -115691 -4332
22369 -147401 -132518 -156827 183914 -119702 194225 160965 83113 86770 235226 16704 -24919
22357 -18037 142738 -82091 143498 53437 123475 -176614 -25225 -84330 -117745 -73549 110484
22345 103956 -61473 135725 41452 25852 12386 -172697 -182164 -69455 56075 -252616 -41484
22333 -154778 38714 -8016 245149 255091 -111609 168910 -120144 39359 -139534 193602 -24484
22321 145510 109383 59628 309911 -21360 180830 89005 -128430 216791 -236628 252576
22310 451278 160594 210400 -38226 -83074 -88594 67547 -25102 -22624 -102499 -225113 33347
22298 -95061 -32140 185124 -202828 91270 -293174 -96599 -107684 164282 -64729 -194285 -386446
22287 -386446 -106550 -37030 172491 -198935 -141535 40291 -106139 -48887 -212765 -54546
22276 -170737 34878 124104 253359 -306932 156987 205926 -132881 -35774 -147313 -173203
22266 -173203 -27455 -224236 -13643 122233 -178743 75699 282871 -122700 98750 127139
22256 127139 97334 -225626 -9163 22835 268584 -24630 -115953 -67572 -91746 44004 -111061
22244 -32383 -10091 -91512 -49924 -294146 -136097 -106801 4563 135431 -64590 77990 -644835
22232 260219 53136 -121686 -351827 -309190 347581 -247568 64385 -107792 52017 5661 -100128
22220 150349 -216314 -37669 70031 -10807 49021 -245765 252095 -319652 -27341 60112 -132592
22208 26642 10250 -2700 -13882 105924 164431 62394 220025 111244 31546 -379218 -130232
22196 -5625 -244572 131554 113267 -510705 18827 182239 -153401 -294374 118245 -171511
22185 33045 -57530 191054 -152767 139786 -20438 143709 18643 359904 264346 -60982 -292371
22174 -292371 200022 -246809 -109642 -241119 105972 16386 88876 -35075 327482 26704
22163 44539 -250980 -100442 -77999 20114 -279069 -81864 93367 -125336 -112264 -350506 47975
22151 17073 -183285 -116160 95936 269046 255362 133254 84686 -194660 -103435 -166483 -41545
22139 -239576 -171078 93768 -49565 -54698 -81236 -245899 102138 132850 -148510 1413 -74046
22127 -29676 -52667 -111188 46529 115794 6703 -66735 -43566 49816 -72974 -1049 69126 -20871
22114 87992 -113098 157023 -90221 252055 22429 -139677 -272124 -5945 -130823 -185587 42005
22102 -215592 278635 -86002 214929 62704 -133378 -38853 27507 -172204 -77798 -163143 -35677
22090 -214047 254995 -29818 -92729 224352 -192743 33551 -149697 -1416 -94721 -101034 145354
22078 -65031 6618 176939 -360105 -311895 -106191 137009 -101304 -243418 3215 137813 41489
22066 11773 156401 206020 -31665 -64125 -146600 -149507 -239724 41691 -70496 -255600 -87812
22054 -166832 -24500 154746 -301025 126874 -117775 254278 -36182 25025 167774 153995
22044 153995 9926 28285 -146995 214648 -130468 109291 -104338 3634 37790 -150193 344316
22032 63431 -60031 9404 -70019 57360 217983 -33712 -204652 -5788 -29412 194462 -76767
22020 -5817 -109532 -99685 164934 -298752 172312 86158 -15244 114429 133981 -60677 209128
22008 -118103 288227 -5440 -195582 8697 215613 165722 199714 -87277 -440582 -1107 -149367
21997 -149367 -201955 -129012 -126807 -38362 -83885 89258 -79365 -94857 -70401 -211944 23392
21985 -141311 -72356 -163804 -120881 4169 -210752 183782 114113 -367621 -469685 -1317 2367
21973 23265 -272155 10495 67184 -11187 -85521 -302986 -143431 166085 117357 -138346 -195638
21962 -195638 -95897 121551 143724 93 -150810 -28856 -136463 -104558 -16998 100113 8933
21950 87004 -73070 1306 67734 443871 -24618 -220892 -210093 179043 -462017 379896 -28081
21938 -61183 -11918 -95852 -159403 -42271 82242 -76420 -491703 310959 107308 -124407 81530
21926 -148870 73039 -145787 -86512 124273 -211541 -129611 -8070 50384 62798 12925 -82385
21914 -347675 -219304 142057 -75608 -73229 -204646 -225449 -3462 357123 -243472 -113704 132443
21902 -505487 36901 -87112 -248973 287614 33946 -309220 255468 -107149 209066 204900
21892 204900 -14935 -59153 311815 133158 259928 233677 -129038 76775 -76900 -195431
21882 -195431 105889 -89269 -11367 -116001 -148487 -2089 32664 -383517 72630 15478 20967
21871 20967 -43149 -109046 258957 -195736 -279742 28536 -146038 253565 -76823 -258280 -65277
21859 62423 354 -155376 -148384 -123720 -104134 85174 29132 -88748 -108357 172402 170669 105834
21847 105834 55486 170296 92022 -131058 86793 -114440 -70303 -52295 296926 299972 203734
21836 203734 32924 -53858 27455 -139658 186748 -102869 -90528 -176553 -23906 108261 -321781
21824 127564 -60250 -150498 -73170 3826 128558 -46618 216133 -335418 -81631 -71671 51829
21812 91213 63335 52048 322195 -138860 -16870 459060 -112466 -27344 -43950 -136101 -96378
21801 -96378 -124826 -57328 -175390 87286 -129354 -149988 7798 -9851 207345 -102249 61108
21789 -174911 -168072 -209075 -198708 38851 -114035 -176013 48044 202746 10950 175457 -70730
21777 -63196 -227378 300626 12309 24905 2502 -82736 -195869 18930 85979 -54407 -241181
21766 -241181 81756 157552 89556 -146794 61321 -133697 -82467 250364 -102685 -213668
21756 -213668 -5259 -103233 305222 -2164 -66546 -134032 24600 -114567 208484 -377400 -20477
21744 -26751 -135665 -140660 166938 -184232 -97127 -100995 107248 117790 -92778 150135 164930
21733 164930 -312 -200792 -211011 74730 -15116 -277431 -486705 -295836 64166 -78313 296279
21721 -88760 -104568 -4198 -78707 28801 -71188 246104 175318 108449 6009 -90618 -77000 -10912
21708 -20042 -244440 -58992 23137 -59027 -172780 -126297 -71965 -64424 73358 83290 -94805 207906
21695 -84355 -101552 51924 24771 -133275 -18785 -227980 -11597 -183388 80312 -65445 8593
21683 -253713 33470 -136865 44353 -14733 -78465 -119581 11692 -1578 -272003 -157048 -30005
21671 -263406 152358 -410730 -344288 110779 241057 -213290 195006 2993 -76447 -113310
21661 -113310 64528 72553 -109769 -114066 59244 -23358 -275060 -38572 -128737 -292358 -62661
21649 31844 323238 -184773 -250754 -110205 -272320 -225171 -41854 -191239 1983 158090 286490
21638 286490 69005 -78710 -109426 38714 190244 218524 162418 -397772 69389 -347784 -200510
21627 -200510 95027 8963 118094 -198918 -21933 -60853 -121498 -94531 -60119 36257 -83182
21615 61895 -93612 143333 -351849 -303198 -70574 -209829 263687 -288729 -1358 -155924 59042
21603 -55533 -233681 -86278 42833 -203108 -80594 -54557 157030 -92507 -39420 47626 -156933
21591 11394 230605 -89673 -155182 -211495 -189753 -34178 161706 -128225 142309 -13202 41408
21579 -83681 -229049 -57425 110526 -176902 -104141 303256 64288 -202544 -42790 26749 -123652
21567 -13078 -94473 45970 -50394 -174269 35082 -73305 -318370 81737 -154708 -188376 179673
21555 -113359 -440 -123683 154306 104566 -227579 -57523 -188839 77999 -27775 292179 -129591
21543 275280 230775 134645 239422 1632 82882 100238 -79128 125143 129834 -51390 18251
21531 -98884 -11865 10006 -46522 -451268 -121982 129182 235856 64703 205655 71155 110409
21520 110409 -54832 -192707 -100978 204887 -61558 180682 -157534 -166844 39010 133654 -73383
21508 342158 -59386 -258308 -67388 211160 -14067 -13986 8800 -77392 40877 10481 93297 -84579
21495 -132154 13507 -175626 76988 -34601 -67202 -45349 -490895 -19810 64840 -14533 -77260
21484 -77260 -27752 -178160 -161380 -32878 219874 58411 -37897 95118 -147603 85823 -107926
21472 -64072 -143897 -148181 82504 -119300 -222159 66137 176028 1202 -235540 -219986 -182835
21461 -182835 184655 -174984 -197017 -179217 -44483 -72093 -61795 188329 -182855 -167357 -63777
21449 -21179 121769 2308 174963 -172198 -343251 192803 227642 -103287 190188 35708
21438 82010 321002 213845 -122560 234046 -79086 68005 123007 -64022 115990 -42326 120615
21426 -213056 35542 35659 17405 -7932 -353284 -94517 -21861 -43330 27046 93799 42127 -19047
21413 46828 -283650 -67616 181725 -9801 -43550 -105580 -44947 -105928 -73396 -173629 -266645
21402 -266645 -99344 -143278 -69708 152555 190752 -2486 178156 110805 -206264 -191909 -61072
21390 -2775 -100395 -73682 287423 -297595 -65613 27366 -163893 -116964 -335188 -102666 188792
21378 -169484 102333 -293276 25388 -252943 -101233 -41664 332503 37989 -134781 -193164
21368 -193164 -162332 -6728 -23845 82786 -411246 -154097 47854 -188082 43660 -186456 -217893
21357 -217893 -99834 188686 -65039 288743 -41393 -152602 9760 -1073 -123001 111921 84114
21346 84114 32103 1064 -81065 252556 -245436 999 287689 205931 -240061 55329 -192504
21334 -27924 -48323 -197748 8614 -114858 -82938 -42669 -113340 -217964 -298048 9711 205653
21323 205653 -1962 3856 -30049 -259173 -289914 116954 -91364 26828 23294 -161312 119124
21311 276818 -264139 192966 -79656 107803 103701 -232219 87671 -159801 143524 -535495
21300 -158835 -97221 71644 -145965 -116957 73994 208528 69595 61886 105078 83346 79670
21289 79670 -438385 62129 -252702 -198086 12534 -501966 -398508 -61660 -44753 -233484 -74732
21277 -92727 201454 -250366 -9634 -38540 49344 29002 -131932 137499 209094 -60651 -10807
21265 -139302 -123991 90694 108610 -200401 -272979 75852 1918 -105316 -218971 -136950 -48269
21253 -192088 116805 141370 85523 -155824 -4995 -257133 60767 -41167 49687 142454 -281682
21241 -125919 -136065 52041 50771 98151 15621 -45987 214516 -101558 -336669 66595 -342985
21229 80075 -40560 -193305 -95368 -64725 -19221 -120356 -12052 -249981 58081 153238 -92789
21217 14791 -17216 298533 50595 -141699 -15184 -124751 -375632 -95420 -198354 -161836 -80528
21205 199486 -7179 -260673 91674 -219351 -67553 -179280 180101 322728 12956 -234219
21194 -108875 -421076 -147832 -372566 241854 13851 -174168 222678 -52737 -116770 -4461
21183 21057 -192673 -416220 -113690 -90093 21153 60962 199952 -52796 -51655 110724 -24664
21171 -49774 -58765 -112849 -68011 172411 -191340 -126759 -69832 -23562 -111026 -132048 -179507
21160 -179507 -233021 139913 -287732 202144 -210066 23990 -19976 478901 -90420 -235357
21150 -235357 2916 36057 120316 4060 99426 -86094 -23797 -83032 95340 -177947 -395422
21139 -395422 16284 79520 -179680 256437 -59746 -160805 -278247 265463 -34166 -195608
21129 -195608 -44134 -300218 -190628 27995 100951 -80311 163600 -69249 -112036 -315226 -85657
21117 243580 55145 159049 113167 -85152 -107771 19550 -180032 145854 186805 122728 14537
21105 -68430 -42720 -89926 -367579 55810 16917 3395 -49913 -197108 -184672 -57793 -136072
21094 -136072 99322 -264064 90996 14438 210571 -165684 -112254 -132304 279433 -270046
21083 -18248 -333593 99807 -14499 178619 82105 -161905 -85399 -29787 -128783 -156897 52266
21071 149408 23652 -99826 90834 -79784 -262985 -176523 -182486 121190 -222553 102374 -194353
21059 -122408 -199630 -462 220807 -308748 245850 133265 -220211 -127074 111305 -285218
21048 -374336 17419 42023 -69990 7712 -251615 -43563 -183768 7806 -101686 4150 140622
21037 140622 35198 116467 -125394 -27134 -30459 -148202 -210715 -49848 118427 -123236 85459
21025 132374 -268512 -169138 -205492 171946 -58656 118775 -117854 -163806 -196581 -170338 206484
21013 53577 135759 175570 52636 -237698 140891 53283 48029 440591 204047 -83899 -77321
21002 -77321 -34408 97197 230746 194952 -161516 -215760 -234801 -91651 -21214 -180251 -42718
20990 -90282 -530313 -127369 226236 -292518 -39841 39906 187006 -450014 180181 -15764
20979 -56303 35887 -58491 31966 195776 312636 -148832 -114133 -174430 -25846 -360214 -160425
20967 182162 -38718 -68616 30 287210 287757 -234316 72696 -35729 104436 227926 -164053
20955 -201209 -239369 -55348 280551 -272422 -134492 -4384 -172084 53832 -170361 -245321 170218
20943 -163401 -167885 -323070 -67264 -84289 49557 16992 19815 -171677 -193863 -131817 -146824
20932 -146824 -17270 -208047 -61222 27505 -321986 -312538 134920 93382 -24351 270159 -96670
20920 -30799 103075 -139516 -148333 48468 -263585 -142353 -97942 -257138 -50650 -70073 246906
20908 274236 -335238 7549 -82963 -420781 -126495 -280805 17552 232470 35539 58408 215032
20897 215032 172497 -35162 -199028 44076 -163330 -263565 -135863 -308857 -308359 -264642 -162350
20886 -162350 -389321 27280 -137499 -3188 -123095 -14347 -441152 211781 36460 160384
20876 160384 -203694 -58536 -373750 -103117 -22664 26715 -160394 -290499 109201 -35883
20865 40324 -237273 209770 -214141 -28843 -173821 86665 -80477 -62869 334426 42118 201131
20854 201131 196881 -80383 337043 -321226 -144003 -198775 -199736 195783 -31621 -116654 132316
20842 164744 19638 -112369 8871 210655 -35015 87110 55219 -459333 143635 -99616 -153542
20831 -153542 178330 -5508 -395665 127986 -177017 -17784 -318888 -245276 -227202 3738 -297306
20819 -263854 130535 -33249 198969 148825 30976 260851 153415 -22402 -300143 89830
20808 52011 28218 -142227 -487280 192870 -25196 54784 -125106 22679 193794 99078 -50847
20796 -358551 -141554 155860 -20920 66356 22334 -118370 -14683 -260421 -34286 -116599 -211614
20785 -211614 74911 -6634 132512 178045 -94956 -38015 11027 126972 -68164 -25430 -92577
20774 -92577 -101130 -154605 -11246 64329 -130598 46580 -284158 94349 -209149 -29044 -236581
20763 -236581 -29548 -245815 -369759 107918 -84521 137838 34762 242509 325749 -323257
20752 187675 -30125 -19920 12478 -363742 5317 -64797 -37851 -1560 -321709 -31169 -270217
20741 -270217 -107618 122835 -217227 -169891 -165379 -5392 -298215 -104462 -24046 110153 -353195
20729 6570 -93547 -77208 74864 -7149 -167529 12472 -114266 394114 92621 271141 -530578
20717 9781 -48479 -97022 -137625 -54973 39637 193141 -228795 136205 20267 268150 280139
20706 280139 79033 247382 -1702 164201 27724 -6338 -300257 340786 -141424 -66083 -131682
20695 -131682 157703 37188 9939 96512 -105619 3764 -112596 -22656 -805 -156873 -340917
20684 -340917 24171 -21599 -503458 -203729 221882 101155 -25567 -69634 114635 1743 -43470
20672 -352733 362967 -267073 31071 125053 -73289 -399679 -5060 -146170 103202 224238
20662 224238 -103611 -230940 -184684 -36091 -188832 -20082 -56381 170780 -113244 -80764
20652 -80764 68593 12435 -61782 -322066 -167979 -46282 86431 -39327 -265473 -233516 -98044
20640 117818 -51048 81136 -144099 254315 -256203 -87101 -52788 -126008 281028 -137470
20629 244525 -6847 -99468 147958 127294 168732 15366 311952 -80005 -72583 76448 -509418
20617 128291 -176052 -86538 -207332 -285590 -100644 -355073 -152436 -179618 227583 43335
20606 165730 17618 81149 11474 -269 149870 140788 -54401 -184149 -170984 -61662 -49977 -95117
20594 -95117 -130841 30959 -76547 -236384 109916 278047 -20919 54235 64663 11417 -58407
20582 -68510 -201787 31085 -58507 61432 249574 157058 93090 -209512 72389 30097 -50306
20570 112724 -259368 -401245 -167201 -264842 3992 33929 -39567 -44152 77595 -259885 -45469
20558 197015 148478 -162973 -289455 199390 113772 -6146 -34367 -125066 122724 -164845 -182620
20547 -182620 259514 215057 267987 -224153 -45961 116680 -171693 184002 -497594 -82916
20536 -94787 -209988 -128830 -253210 107570 192387 6417 -302238 83903 12363 11576 150976
20525 150976 -238391 -256508 -12166 -224720 -222834 -206007 -101768 -363202 126492 90354 185727
20514 185727 -130901 -29871 -62358 81974 39841 -170215 -104087 -97933 179706 336433 28849
20502 -98183 -45108 89252 -297501 9691 -265647 -197664 116130 25419 -129868 -22571 -38975
20491 -38975 -121014 290595 -33278 255960 5549 -125153 113695 -26149 67644 -238515 -149476
20480 -149476 228732 20247 -376974 -301461 -24511 53098 96934 -266024 -404445 162478
20469 -244202 -110798 -126737 -115074 16349 -24093 126332 133387 -105557 87793 126144 145111
20458 145111 -132337 89294 12444 -91090 81637 72658 152175 -180968 243356 -49123 -197945
20447 -197945 -132487 -25968 -146754 -153545 -73529 1647 -55873 -117200 -51112 -129159 313133
20435 -29356 -276952 -179332 93259 -231604 174273 32654 147408 -30450 -88219 87329 88481
20424 88481 33330 -291387 -82577 165407 -234870 -100528 -40336 -177788 446769 -89158
20413 -181456 -39740 -297792 -46881 -163475 -332263 -149797 -135432 -188716 154492 207156
20403 207156 182891 3049 -293198 173818 46197 -63441 20312 -369569 32712 -210025 -58462
20391 -98639 121499 64085 -105259 -149930 52303 264344 -36049 -94285 -76130 78659 -246729
20379 -148756 67081 -2590 49540 168864 59929 -243528 353053 302745 -150039 -32049 247691
20367 -146738 -71773 -33164 -37388 76577 -229107 -225164 -204480 164527 310669 -231672 -118865
20356 -118865 235925 -78882 199524 -40615 -215811 81229 410577 128043 30882 -402458
20345 -393812 -346931 -52580 152073 -195468 77203 -56813 97956 -255802 334927 -52506 254072
20333 -54021 307285 101930 223189 -238965 160748 -248430 -359210 -78503 -80682 -234151
20323 -234151 -129561 -318413 -405316 -213885 -6662 -130511 -219716 125725 -63227 43845 93354
20312 93354 -30117 -50255 -170285 40177 -98524 -159449 132585 199480 -352585 137111 89074
20301 89074 -148982 -267515 140568 131325 -68847 -263645 240802 -326194 -79915 36551 72353
20290 72353 -287747 245262 -37329 -73416 115337 -100961 -90016 -304521 11675 -154133
20279 -183003 380350 -178528 -17162 -65603 -120745 -135932 -217827 115298 215249 231180 -348849
20267 67465 70046 -353435 13033 -184392 16261 -11315 -14028 -243774 -110558 -122796 44636
20255 -97247 26597 -30939 123128 -50640 57932 9403 -178748 93746 -158189 -91537 -40195
20243 -188620 -61675 -108299 -107200 -108485 -229159 -227372 55016 -105831 34165 -88124 47713 40520
20231 40520 -44295 -171135 -83810 -26083 173237 8616 81003 303748 9403 -343592 243597
20219 -275944 60541 -67247 39352 91079 -73739 -88126 -166375 149149 -163372 -293988 -212249
20208 -212249 -23204 56435 -181399 -77280 67086 188272 -433118 351917 -231594 -175341
20198 -175341 -90678 -93167 -10189 -204408 31991 -131655 238544 -169123 -46322 -458000 -122298
20186 362513 -80985 158484 86395 23867 76318 -20117 -390207 -84974 -407153 -161869 -270822
20175 -270822 -62588 55924 -78649 -5810 113936 -59061 -236261 17616 -237091 -17929 2679
20163 -75321 -281725 135829 -237366 -1933 -105167 226139 28388 -98314 184890 153654 -207488
20151 -213361 -145365 21746 -175516 113826 -155426 184300 193788 164250 -205490 -166992 173172
20139 35213 -168546 -38214 158478 400488 168246 15780 -75658 -30997 11813 -32012 -371245
20128 -371245 -57238 -288100 -38105 -319183 135521 212357 -266825 175101 167969 -307199
20117 -217716 -7288 -601043 -167233 -131483 -38896 86581 72662 -118114 -145337 -119751 -355270
20106 -355270 -332074 227779 -48945 -238751 -223834 -103682 -50628 -38966 -144299 -95133 -372457
20095 -372457 -174123 -317631 -468384 60621 -306759 238859 169491 -93751 157396 -72119
20084 -223998 139637 297051 41791 -197673 -52873 -40015 -163957 48790 -73528 88527 10726
20072 31607 -82796 81304 -193906 -3566 46070 -259219 -318320 52456 -101566 -76160 131194
20060 40484 62740 -251910 55084 -298589 -181102 158497 -82221 -434143 -159150 -145368
20050 -145368 -32213 -76271 48729 -233772 -27918 23124 -80616 -133124 -213281 179456 86372
20038 -186364 -67782 -102246 -155685 26650 -136478 -39292 -430946 -119512 -144078 99918 -126575
20026 -122351 83637 98287 63462 -164839 -92055 110020 -206203 -99739 -144194 -13045 -196674
20015 -196674 -103443 -81064 -85953 -119263 -244837 86639 -18179 212482 217395 -162542 -129068
20004 -129068 -11003 57235 120183 43119 -57227 -34930 -98823 100482 -112602 -331701 -45383
19992 -74586 -6957 -91386 -324821 -260783 -31001 -200159 182536 -563 -36446 -130856 205569
19980 -48516 -174692 -421675 23366 179053 238372 -2713 -137741 -46294 -131609 -79018 -195159
19969 -195159 -79649 -392070 -47297 135491 -84510 -59058 -212943 -308515 -152770 124432
19958 101720 -295088 -167667 183354 40476 -164347 241885 -333833 224365 132645 -29817
19947 86985 -27528 -138498 -24905 9383 70282 -89498 15827 159131 301974 -158231 -239533
19936 -239533 -274180 -196717 -53084 -269983 -95547 -47865 -141740 65119 10630 38652 91583
19925 91583 -212658 419637 -185206 -123513 -201828 -203431 204710 93379 -176690 13311 -195244
19913 -113570 -66418 20507 72356 -254302 -87853 -157198 -77420 100992 152045 25512 -564245
19901 122507 146111 -62755 -212510 -26275 -181309 161319 -215537 -201880 124980 -71321
19890 425133 -58509 117093 -165312 -527652 116166 -130421 127305 90509 67019 -14890
19879 -68908 38836 144400 -52467 -449969 76806 -344038 -137603 174016 -263218 -237937
19869 -237937 92546 -94457 -108753 -156632 206007 -15433 -213548 -86125 -133753 -45764 -3265
19857 -3790 -100499 240026 -214044 87302 -163208 169861 98284 -296009 -180443 242075
19846 -54266 -82785 -138716 70825 158283 -153394 -259718 -40585 -43405 48261 -257841 50806
19834 111751 -73369 -3441 102463 53085 -77063 221537 48295 -212965 145055 116991 55735
19822 39659 -202906 -262982 -259672 58787 37003 -115519 32636 15606 -207858 -357627 -389416
19811 -389416 -34235 -416971 389019 -12925 -55042 4530 -195123 159217 13120 -18920 -22536
19800 -22536 -71380 -270043 -364853 16992 104903 82694 49239 102331 364046 -111661 148399
19788 -34055 115258 63011 -136460 125721 -167961 -111742 -280112 273551 -148891 -20946
19777 -50155 -225168 -179489 499997 -58037 -158609 182949 -194711 -228643 -337164 149519
19766 -186130 -3944 38251 95891 -20623 -172481 130804 -150517 -145081 101187 -116438 -383800
19755 -383800 310559 102848 76998 -42277 110446 -201082 113339 -133836 32755 116947
19745 116947 -286665 -165562 56365 -241292 -98788 -106441 58332 9213 -490201 195893 -138745
19733 1793 -38510 -175197 -55541 192736 -231879 44950 175351 80933 167339 -47042 88570
19721 -61611 36378 -70312 50034 36617 107179 -114007 -424407 -28049 -46436 -17323 1044
19709 -88607 -579504 -53765 79479 -131716 35152 59155 -66879 -74712 -49152 258054 127781
19697 -356793 7605 -127490 -177980 -61580 93512 -145607 93047 59069 -90933 -73963 36328
19685 -352540 35102 -32149 3162 -295500 -90462 -55908 -33644 202984 -124960 -153151 300125
19673 -58151 -183251 10483 91970 -17979 22622 64401 -100651 296823 -155620 -263465 45858
19661 -75143 -212970 190951 124813 29688 -254024 -47439 -64418 -27058 -284427 186276 -94610
19649 163952 -266673 175585 62449 -353323 -97006 -103147 -144684 -139621 -39210 11652 -337090
19637 -451004 -176583 -81168 176573 -53497 106885 -225629 -159335 -18131 134158 85154
19627 85154 -214278 -137999 -131736 -106398 -1132 30552 -52984 -314134 159238 -171273 -95011
19616 -95011 -320430 -244877 -330906 273821 70897 -238911 -33559 331343 -204379 -218539 -289756
19605 -289756 -217415 -318100 -26703 381659 116088 -11110 169373 -55309 -301496 45933
19594 29810 75844 -320068 157070 -246948 -292622 -285281 48709 154253 180434 106354 -25007
19582 76487 103386 -169956 15444 -233612 -160373 -387539 -115087 -44670 -7115 134299 205545
19571 205545 -215468 243630 -218674 -109679 72472 -154990 411439 -253410 -217158 73805
19560 -363392 -178806 -176496 85377 -136492 122524 -62354 -143871 9457 -326876 -272092 335061
19548 -147936 127668 135833 33431 -300325 -220531 -91229 87540 -43396 202904 5261 -33936
19536 72740 -64292 78837 220327 -327325 -55622 -181467 -3984 157677 29776 -207038 -252307
19525 -252307 301919 72004 -167402 -6558 191616 -209233 162895 -32507 24372 -102817
19514 -448399 -83455 -118790 -171336 31170 -229792 34327 152241 -246941 134167 83404 -394015
19502 -271426 72082 315539 254558 -219567 -214641 -75267 -36604 -217866 -242162 57753 226633
19491 226633 -224962 120419 130129 196847 -47156 103184 -178408 -107199 96491 -93831 93015
19479 229673 -105465 -75361 317266 -120327 -222960 52818 -29965 -239935 -30037 -156807
19469 -156807 -218207 -6206 -57919 -263638 -309423 -87057 21454 -3558 -67629 209282 116884
19458 116884 -62139 163836 -109002 -114875 -19649 117010 -293150 -172928 -111117 -58293 -249257
19447 -249257 -306507 -111681 -73355 -73057 -98991 -291586 -284028 -289401 34791 -20591 218954 -1724
19434 -114442 -64475 92908 -193653 121022 -137605 -36386 8141 193730 -20214 -219270 -93791
19422 -180545 152010 -255723 1786 -334664 40712 57578 -60135 230967 -122442 171383
19411 -86651 76145 -144551 -67915 207311 133811 40815 -273439 -236855 -106575 125118 36766
19399 -98357 6024 56187 -30375 -27055 -111894 -89335 -253007 89543 -41390 343101 -128927
19387 50080 -174135 -280588 -271963 -213629 -92131 -122547 240852 43595 107121 -272421 -146275
19376 -146275 18515 120590 -5 -11902 -230016 -156445 -284769 207528 -19007 -43684 -173872
19365 -173872 101136 -142372 38656 -75306 -67566 -90836 -257605 299457 -512 121820 16637
19353 -22962 -11348 23408 -88846 -189935 -94795 172532 334087 -153815 13353 53903 -85545
19341 254896 27520 5098 -343643 -194587 -37878 -136914 -41911 94674 33980 166452 123951
19330 123951 -306410 -10410 -179924 37438 -294979 -55303 -436875 -43817 -221151 -16375
19319 -11130 -141579 69466 -452536 17641 95433 118395 -142549 -373700 196056 394412
19309 394412 -40424 -297648 62873 -118210 219948 24120 128011 -11799 41052 125876 59062
19297 -222764 -154177 -395695 -174090 -207950 -60863 305875 455008 -41061 168463 -249643
19286 -71905 134177 68360 -163881 -380466 -406768 -163304 -161831 23581 51850 -112709 -84539
19275 -84539 47742 -54967 -411671 -95752 -369503 -188830 -154847 -236649 58392 -44969 -171954
19264 -171954 -78740 -453376 -60638 -282924 91355 26867 111394 110184 -239275 -158548 45805
19252 -55010 63808 -280408 -96380 -13546 -44489 -614624 -226487 -52878 -115110 -376774 -13080
19240 -89113 1273 -339933 138218 159741 13314 -100351 183763 -18579 16444 -40219 -220297
19229 -220297 -108898 -206546 -137026 226287 -242444 36719 9003 -33508 99981 -169661 -155914
19218 -155914 -58386 -214834 -9165 -202982 -44462 -441956 27389 363799 -109671 -253713
19208 -253713 -158001 206501 -250252 58971 122902 -178348 -266538 83493 -177005 66832 168446
19197 168446 -455230 -176379 -27701 -131110 -339129 -115596 -43907 -210621 -176924 -42913
19186 -116066 -32418 30818 -49349 -145891 69540 -83249 91027 -2309 -108610 138165 129208
19175 129208 -208771 -95125 49046 -284800 -270113 477691 -35352 -84034 -38739 -118846 23806
19163 252986 368791 -221236 118168 97975 27742 -73405 -322770 -42135 -225528 -125539
19153 -125539 -125852 108047 22516 12661 47266 69605 132797 -88253 -45979 -124999 -28263 -196173
19141 -196173 -175791 -346081 168198 84553 -18127 34240 -87572 -251536 202354 -109085
19130 -81467 113506 63550 -180621 -137859 -312851 -33719 97082 69904 -15171 -31371 -112325
19119 -112325 -24403 199205 -815 -211562 -262686 39981 -88654 107541 135273 -59315 -27027
19107 -212985 349457 -3155 -233934 463005 -57297 15780 43069 29585 45929 -64709 -227630
19096 -227630 -481011 57810 307917 -193986 -25772 53797 -141939 -30109 194186 109826
19086 109826 222145 -10303 71273 -27156 -30552 -99183 -196275 -63080 -96526 -94156 -364511
19075 -364511 -137291 -130817 182488 -59109 -215273 -27350 -74319 17281 -256494 37856 2275
19063 -139747 -35351 -126072 -15023 156192 -305452 -15159 78302 -284942 -189589 -36281 -25877
19052 -25877 -268566 -288470 -267373 -103923 235719 -110245 36899 -8768 64118 -306427 -1109
19040 -86410 172933 -124986 -36613 -194338 -363285 116931 35405 -105588 -119209 254890
19029 180126 -24899 -41221 62132 111668 118385 -108707 119418 166026 91265 142921 -71491
19017 -76675 -88744 -114589 -96260 -271422 -82994 -96822 -284717 172270 -190238 -32151 34929
19005 255288 -137115 -196788 -368238 -194205 370624 -170069 -58852 -177556 316912 -133874
18994 -85579 -93175 793 -83757 -200532 87111 -351311 -15879 205223 -231489 268230 -70192
18982 -280175 -227284 -262165 253840 5549 -170607 77365 562740 -55342 -19757 173375 38750
18970 -169552 -229721 326471 -209552 115356 369801 -203795 33618 -235761 -169293 31156
18959 -219296 28254 -47869 -114019 -271887 -91347 -27190 187472 -24245 -288488 -135729 -113745
18948 -113745 55481 -244122 -92830 -189715 53095 -95221 -320215 108446 -45703 -224402 -111004
18936 40272 -198500 -12447 -272018 -219654 -14793 -290193 -41429 103702 -149245 -179347 -226686
18925 -226686 -64565 -278665 -200571 121890 -194303 -450967 202357 -15266 -315385 -193475
18915 -193475 199237 142916 37462 -105536 16925 81061 -107938 7765 176017 -222632 -306549
18904 -306549 -330885 214678 -130874 122653 -81568 123381 31850 61848 -143092 -336144
18894 -336144 34268 -154404 43615 -498917 -286873 -18952 -24437 -64924 77012 45059 246346
18883 246346 75619 -129881 53779 -169234 -436957 -68286 -107700 124240 -192165 -264383
18873 -264383 279196 189190 -245239 127234 171902 -118686 16042 -329510 -99308 -179657
18863 -179657 -295531 -247758 149999 -197764 96104 -165498 55821 216997 -17824 -334703
18853 -334703 53183 -234989 -334256 16939 56258 235505 164634 88147 -16320 -101603 -289766
18842 -289766 -289253 -164655 -292286 33504 178820 -524782 -62350 -103595 -113058 72429 96607
18831 96607 -181411 37528 -162725 146981 208936 200973 -264912 -261484 -205376 211674 -65647
18819 -90547 9213 -7970 389524 212556 40460 41330 13140 -6356 70412 55490 176957 12307
18806 -187922 -100625 -222619 -257252 123363 -193544 -242808 -165503 39568 38039 -56346 -41041
18795 -41041 227230 -86838 -52733 199782 63064 -126976 -43659 -311996 14152 29278 -105213
18783 -154489 -210838 -232046 -392218 50239 -189793 233066 122447 -481419 -90562 67065
18772 -62955 -150104 138660 143543 53861 -274492 -309573 139408 -255782 -229622 24890 -21195
18760 -290789 -243756 -297271 -3538 -205699 -193263 -260158 351502 -156067 260435 30002 -72109
18748 -253210 -3205 -87482 249014 -204866 154036 -59290 -299429 176078 -239843 96759
18737 64844 -5921 340585 145973 -141349 100477 -195708 -247938 416802 -45671 -377039
18727 -377039 289372 -379002 -35228 -258291 -86124 165955 -89405 -48656 -22412 -36789 -628
18715 176374 -137493 71045 96767 36008 38217 84870 58832 -103567 -135687 -87637 -236182
18704 -236182 80611 171883 -145064 -249669 -78321 -99711 -204880 189184 -112684 -283660
18694 -283660 268361 161039 -48038 356728 265001 86211 -279848 -297657 51155 165128
18684 165128 5897 -130458 -143767 -72589 -61905 -9681 22409 -6149 -585005 102091 -2178 -231292
18672 -231292 -120784 -28549 109214 -103527 113724 121745 116229 3544 -27778 -107628 -425903
18661 -425903 -271789 -170876 37312 53508 -62034 102298 -64706 -254811 -71652 -121464 120152
18649 -57051 190038 67810 -248293 -247973 -240871 -114390 251242 -324935 -342714 231023 124496
18638 124496 4196 -35882 -300149 -256723 -238564 -36182 -215932 -226610 -85343 78929 -27376
18626 -151142 82073 24902 -51096 -130053 -270900 -179245 -212086 83446 26204 35530 56840
18615 56840 -21243 50799 -209065 -32685 -111919 264283 -232155 39235 -186306 -57191 104671
18603 34705 -134220 177193 -396767 -226599 -249018 176027 -203316 66916 -239501 -30710
18592 -17131 -31102 89024 251016 -175740 -50511 88467 10188 -49077 267656 -70608 -404443
18581 -404443 27095 -99501 -291053 -240434 217262 -39989 20955 194041 10858 354581 -146594
18569 178150 -78771 -94298 339050 -116889 -27585 -61353 52275 -162907 -165881 -322014 116523
18557 -496 14213 12754 -310633 80277 84611 -158541 -8914 -69310 -478312 -126324 -137530 -44790
18544 14632 -99354 44298 83769 117112 108343 -1411 -8305 -87395 -55833 -404701 -49817 195352
18531 130090 -530429 -64274 -62168 119744 -316719 -173104 392032 -49435 -186867 194017
18520 -255602 51177 -95448 -33145 -36314 -121540 123941 7840 -301870 -146298 -233439 -49680
18508 -428360 23032 25122 -34337 36420 -190528 -259568 -45563 -205201 -70415 73977 -170366
18496 176893 -276276 -145369 -142803 66501 -45082 -68190 -124812 160048 112888 -11789 -96589
18485 -96589 -33217 -173172 -5054 -41610 -105254 -109056 54233 81947 -53371 47105 -297841 125299
18472 -213363 -209711 -213784 -181189 -67834 -183912 8406 -175763 23242 47395 -73880 -114717 -73514
18460 -73514 -72792 266939 -101436 -144406 158781 -93089 -2947 3006 -392010 83859 -209737
18448 -1302 155380 -167848 -190446 -144088 -184242 29351 26835 -180403 -201265 201621 -21197
18436 -143621 -138287 94218 125198 -75338 -48338 -3252 -179231 321041 -34303 -104828 -244539
18425 -244539 -16720 -407147 93172 -11263 -69402 49969 -311681 19473 -132959 -331298 90263
18413 -371526 -437394 -12328 -103359 141399 -152628 146944 85332 -101703 192935 105613
18403 105613 -26463 349567 46944 -39720 108909 -70333 147835 158627 -207478 -75330 -210072
18392 -210072 262796 -269983 -75204 112325 -234342 -147283 406754 339034 -108122 -219845
18382 -219845 28971 -429623 48553 -75794 222952 -135159 -134020 -146793 174335 -18533 52711
18370 94897 216404 85013 -25575 -22604 -46262 -1659 143059 273035 -171135 96166 116953
18359 116953 -229893 54141 -153451 49037 -138523 -7230 44797 21379 -144681 -286332 -324202
18348 -324202 -103329 76968 -121034 57707 -178813 -369078 -286251 -28820 186658 220208
18338 220208 14617 -134124 -97547 120523 221738 179295 -264078 -51579 -355065 23804
18327 36727 -105261 95265 101721 -70859 184893 -134105 130098 -138666 -119164 -169058 100840
18315 -261546 -83706 -113654 241813 377730 -140287 134767 109900 -245996 209974 -279310
18304 -39969 -125844 141908 -312046 -266123 -233545 261672 10121 -39847 -193916 -98705 -134522
18293 -134522 -86855 -245637 -193808 -69015 -107569 -53013 -373428 -230077 156193 -69542 2461
18281 58202 -84747 235110 -26244 134687 145500 141821 -5643 192490 152937 -64793 80443
18269 98695 112052 153975 298538 -95399 -82046 29235 -32903 200462 -209351 -3588 72700
18257 -288239 -158974 114911 -35832 -341772 -304850 110828 263533 65773 59631 122703 233332
18246 233332 -62404 -295343 -127746 -170690 -38963 -203351 81594 -88149 -43077 19572 131968
18235 131968 54952 131350 -409148 -30949 -286321 29770 98808 -15686 -21897 -275177 45503
18223 -124401 92716 -144542 219941 155357 -215131 65587 89127 -24158 -122156 265115 -6641
18211 -61182 104460 177201 -105229 -260837 -231163 -64387 301248 69322 -67489 -251544 -189124
18200 -189124 -21745 -269043 -83643 -57205 -235789 -86845 3979 -76227 159267 -74704 -11664
18188 -344072 22480 -104586 -101278 216648 -125607 3782 247002 56394 -17744 -235348 -20362
18176 137206 -465833 253841 26201 -120797 -251338 -178968 3603 -366644 -59737 -138863 246993
18164 4270 13112 121432 84548 -79977 -100944 155213 67659 16103 -304688 -30281 208497
18152 -48398 -21605 -6675 -299136 152482 131651 193420 41219 242058 -230184 -46150 -58034
18141 -58034 42232 -32359 119657 113740 118954 736 -231445 99958 -114234 313802 147294
18129 -252528 -156533 -755779 -138484 111865 -34397 -63398 -12128 -11783 68910 21262 255392
18118 255392 41059 23426 -20733 85360 -42652 -176345 25664 198048 -53807 19700 -34121
18106 -32523 89533 122639 221146 60377 224120 36765 -405904 -236321 -143834 75639 144298
18095 144298 -36329 387517 -334701 -137043 86841 41233 214756 -18422 267823 235522
18085 235522 -28581 31426 -193786 -198811 25515 -17313 42049 -50051 -97079 -30388 79221
18073 -108343 -240227 122265 -100472 -218920 -141508 -135596 -106158 -79958 -315534 169344
18062 -78411 392422 -188283 -214368 -153268 47748 -331563 186145 -196442 92807 -73839 48505
18050 -51792 174341 -74665 171662 -204818 10587 -133557 36628 -193980 -9130 -101878 -174478
18039 -174478 12352 53871 -386811 95868 163711 -314085 -379557 44179 -204224 45301 23192
18028 23192 -112011 230755 150421 -111224 160949 149319 -360322 -95635 92475 149541 184614
18017 184614 265890 78159 154807 -224279 132638 -107521 58502 -33311 49635 -239231 41940
18005 15438 -93408 7307 -260831 -101423 -141676 -175829 83519 52827 -358245 258725 -181154
17993 184425 -241676 350242 -92929 112974 -80959 22811 -224694 39763 30993 -92942 96189
17981 -10337 221439 -13702 179302 354835 -199334 -94703 467259 -51309 -82964 43910 -246486
17969 17351 -163588 174557 -26090 34301 14048 12256 38868 -45444 27477 -267468 -340593
17958 -340593 104974 51218 160144 43632 -145956 -48333 72855 237331 134269 50998
17947 -80387 -139113 178858 -96781 207736 227328 124282 58297 -942 -89724 -102479 240693
17935 246448 147533 -455876 -124823 14278 107181 108655 -72134 -1583 203990 -113169 165815
17923 186451 55233 165040 -329694 -179533 104516 -284683 -211896 -427330 -117245 136488
17912 -14461 -44131 89964 87722 266341 266374 -137675 -76286 180648 -203372 -222614 -9829 26601
17899 -70748 52047 -237706 -130588 81499 229782 -198038 -197342 -52078 98496 -79382 -109729
17888 -109729 -69201 42077 28083 215520 -342623 -331498 12432 -32904 104483 144944 231424
17877 231424 -88685 114040 -72371 37938 50002 -116449 -251565 153517 38437 172206
17867 172206 -192490 -155637 203562 -144831 -272325 175048 314353 36274 -27841 -154701
17857 -154701 -134988 54188 -3039 -26841 64968 242247 -90627 -123995 52822 -265394 183456
17845 -259129 106418 -82312 -145264 -14828 -405608 -82542 -49079 -382086 249739 -5388 94666
17833 104230 -100911 -185417 369156 22824 300939 14549 5503 51759 -98164 -50115 331725
17821 92438 259437 123965 74592 -190560 -34013 -75420 -173719 48589 127604 147245 -59781
17809 41300 134867 15831 93675 -22546 -63604 -328095 -71517 -66947 351450 -16185 -113517
17798 -113517 -136405 14244 -128805 -72249 -8105 -121534 -78747 -266616 37936 -49043 -114865
17787 -114865 140948 39521 130552 -68204 203678 -63975 102545 112718 -147253 -150388 258566
17775 -28133 -90974 -182979 -214447 507836 196597 103387 -300076 194071 94316 -119821 -253573
17764 -253573 -240119 223320 -181711 -235651 36249 35177 31139 -130239 81468 -81053 -83836
17753 -83836 -153591 67847 109391 268081 -192163 -121636 184833 306168 127310 156295 -63784
17741 -170071 176755 46130 -120788 156433 142014 123121 19940 -110753 64985 301745
17731 301745 -85717 194493 137910 -88347 254582 101185 231258 -138239 209684 184314
17721 184314 286244 -376763 198101 -35389 -46153 -57675 122954 187586 5617 86483 89090
17710 89090 -52059 -24198 -45415 316435 60761 -153372 -82718 -207612 -259191 56454 149798
17699 149798 18677 -260677 -133968 -192284 35220 82281 225280 60223 -183544 150815
17688 -39829 -157797 262355 -54065 -362352 -61291 363499 98850 315958 185890 -89907
17677 105669 -116886 240098 189824 -383136 -209351 245514 -7036 -178763 -2758 175264
17666 -44276 -143759 -100447 182314 296689 -104448 -103719 -108776 56805 11077 -47261 -258412
17655 -258412 -158676 638029 13424 51340 -162573 -19711 221326 21472 -74954 -118901 -5561
17643 44873 4164 344538 -35172 -312159 -238983 93952 -77274 218320 23441 101944 10690
17631 -315821 -280986 216695 -136180 6519 -144325 223728 -136963 -11306 136666 227244
17621 227244 -55824 153120 -59676 -69814 65988 -161471 20582 195741 75554 118410 -46302
17609 -50911 119946 361033 -277776 42206 409190 212121 44327 213635 84038 59064
17599 59064 59446 -92301 -194061 -125150 169458 -33105 -126476 148181 -32589 227063 326756
17588 326756 70847 9082 49334 -36126 22649 -23310 -51848 -44145 329910 -183203 65910
17576 186852 367558 -204779 -206984 -109181 304611 -173304 -254107 -156867 -121433 195158 130183
17565 130183 154175 142587 89254 -59240 322342 118715 184618 -114267 136167 -91902 -35776
17553 46901 118950 15315 177733 41258 326381 -97560 168059 -184773 26151 75289 -162387
17541 172671 262329 -60510 -75642 123743 34475 -46730 243572 24800 68433 -131486 134733
17529 60257 -73730 74320 99114 117117 46658 -324296 225952 47450 -123290 -78262 152187
17517 306040 139127 46907 60151 -321851 230497 -68399 207498 223370 143438 -104781
17506 90877 -9263 61776 349152 226304 -32398 62268 -70517 36725 -140094 -66330 135648
17494 323135 -112001 -29215 60332 206292 248996 50367 437651 70750 350654 236237
17484 236237 279061 148609 44268 72279 111014 11123 197768 267732 317037 259190 404511
17473 404511 50273 345568 16958 73131 294578 173682 267802 47314 -63879 -2231 113600
17461 89498 297179 208127 -62309 -77775 743560 3598 325602 307209 121422 389721 210098
17450 210098 229204 212851 349787 192782 341214 203865 90762 -43809 -62769 161894
17439 25736 156045 270680 325351 -75102 -21693 45274 32890 93307 79257 602398 299500
17427 310146 145313 399474 139823 124531 482830 458401 172084 318099 -214952 391384
17416 137740 604539 252088 -58391 -17780 -188183 184131 166981 -83117 105550 529323
17406 529323 3124 143497 174104 178107 67040 236878 521848 155943 120079 181925 183325
17395 183325 94552 307679 132070 -78954 35018 -31048 264916 207548 -84317 -148357 403093
17383 93203 189204 141722 66656 359430 -63071 -4482 55453 157716 3418 152073 212010
17372 212010 -50358 343208 -22929 68021 234491 7421 -153882 100034 226791 286870 29371
17360 62671 23672 113440 -46310 244829 310725 -35560 383183 398493 321615 89326 149931
17349 149931 -14508 -77097 107921 119972 93956 220960 -65888 513441 57240 222329 -45846
17337 371685 54540 -150159 190872 56575 259906 335652 132769 215148 96565 298555
17327 298555 159561 55372 -45810 -85218 170336 148711 34758 12490 -87468 131130 99881
17316 99881 -132588 86535 -81009 9708 168349 493504 -21689 98704 157921 126951 188835
17305 188835 -231270 31124 65835 -12535 380088 81104 424802 178422 -46336 -173245
17295 -173245 226486 171216 56795 283840 260192 42886 231729 -53096 576303 95184 -136068
17283 -207739 154810 69240 -114321 28228 334749 171846 -21674 -40818 -40469 69190 156342
17272 156342 106389 408428 321489 178111 -1744 33154 94103 -188919 301939 369180 94596
17260 -85609 306257 296884 213926 184512 87493 -66997 18250 456766 94211 25405 84398
17249 84398 173788 94859 70372 80632 -2668 216315 250252 192858 8889 270670 224394 41574
17236 120875 190797 110372 248527 51340 99181 479172 182130 235176 -16530 196919 -89610
17224 85928 -722 140922 258626 191927 173279 248440 231924 -22053 240041 301295 98353
17212 395098 114958 -15229 351318 409832 505179 76955 29351 192971 95275 -45196 258163
17200 315887 156710 290022 256812 55013 36816 160443 236077 103205 305041 447772
17190 447772 59677 284254 327424 92663 35984 -74105 192491 104874 -33485 307089 396903
17179 396903 288320 159283 415136 290889 317446 183604 319313 45331 159154 -54109
17168 339736 245600 100941 310104 260117 134480 163397 168552 313417 117317 46002 314566
17157 314566 202057 152390 314686 90992 413602 452472 98302 320338 329643 280253 314107
17146 314107 100717 -62963 125280 -139643 158592 431564 9128 137536 40269 425669
17136 425669 277845 105512 293137 633421 39987 628129 218524 26365 379173 432774
17126 432774 332236 289799 88925 -44440 365782 293883 282553 341288 66277 231408 263807
17115 263807 163176 386610 167340 347451 240456 -185192 404574 99750 531504 414675
17105 414675 309939 485554 325521 270777 276824 208182 133473 172137 368616 92684 501154
17094 501154 234405 221850 395823 370677 121799 304357 425356 382358 145897 454049
17084 454049 526103 415961 775238 766394 536233 356673 283974 330991 469742 428519 163503
17072 354010 421233 511331 73899 705942 536267 176810 18924 646181 194260 390865
17062 390865 683623 617524 579968 689686 728369 491377 251255 235080 270569 457834
17052 457834 885353 599773 514004 459084 539655 104100 477222 475008 538297 665695 285485
17040 297692 369587 590157 183271 472303 531121 387965 653811 664961 832633 698600
17030 698600 414503 314352 64408 594005 820293 310936 550901 455685 757340 437546
17020 437546 499634 521740 846125 432244 248608 506164 464262 541035 460649 126397
17009 559336 272182 365379 422882 442243 750036 825093 560000 679804 692351 777973 922608
16998 922608 607884 665275 562663 735411 511903 537376 696234 632833 521208 669608
16988 669608 760876 989140 328386 541065 584077 603815 419223 630633 699346 532765
16978 532765 663808 534448 796565 638557 629186 709193 371146 793628 992108 1039814
16968 1039814 994059 830450 929376 1079470 731288 787834 934112 703510 770174 566265
16958 566265 1038552 956798 652339 701173 900544 764394 1075957 753715 1204102 1059121
16948 1059121 996176 911639 976698 1171037 538729 564880 1123403 735249 948499 692496
16938 692496 1178394 942374 843149 1052256 854081 808805 663792 1070234 1045347 1148645
16928 1148645 891495 1292008 1175730 1337727 1121209 1232000 1253683 1102402 973631 1055363
16918 1055363 871471 1103170 1137570 1225807 1033487 1074994 1541193 1440218 1532471 1414509
16908 1414509 1283667 1456998 1528309 1169094 1550417 1230536 1775607 1226320 1735856 1428541
16898 1428541 1621101 1314283 1642533 1567869 1202261 1438572 1777896 1730730 1414851 1447588
16888 1447588 1555267 1690674 1849503 2005943 1810487 1968100 1396192 2231678 2001607
16879 2001607 1915908 1980059 1873237 1810798 1932726 2289390 2143541 1946310 2220558 2176856
16869 2176856 2372967 1907497 2091540 2308586 2296876 2396972 1925328 2370855 1979475 2397319
16859 2397319 2501695 2613709 2501221 2596255 2928603 2707115 2597484 2548862 2961107 3107715
16849 3107715 2615951 2692296 3173530 2954104 3022445 3158925 2919715 3377698 3179415 3133644
16839 3133644 3756511 3465436 3709931 3520508 3621273 3701047 3543353 3918342 3674574 3342907
16829 3342907 4163235 3881542 3928141 4580090 3847779 4249556 4047647 4332394 4427011 4830869
16819 4830869 4856254 4844449 5013131 4875987 5041122 4762003 5104572 5175454 5441797 5486463
16809 5486463 5479918 5614925 6104743 6199750 6215987 6561282 6557890 6542968 6844909 7034185 7040011
16798 7040011 7489490 7423310 7539040 7906339 8081499 8477544 8505819 8393944 9073180 9133736
16788 9133736 9542036 9652242 10408765 10535842 10878355 11005019 11343025 11743848 11865937
16779 11865937 12346970 12703530 13483993 13773805 13985772 14533748 15180423 15537954 15980862
16770 15980862 16571404 17374506 18146499 18631807 19049440 19912903 20711759 21878156 22648633
16761 22648633 23446024 24423173 25796678 26689733 27720592 28900760 30252632 31737395
16753 31737395 33361202 34715898 36532910 38682296 40319663 42848981 44975842 47677329
16745 47677329 50451270 53033984 56401581 59797756 63167959 67405308 71420825 75903513
16737 75903513 81217795 86046015 91759188 98158886 104510591 111637847 118596772 126394359
16729 126394359 134815705 143257588 151718421 160156480 168642537 176726036 183699740 190693326
16721 190693326 195788511 200020054 202391073 203582311 203102186 200874834 197431165 192266516
16713 192266516 186383630 179196203 171474267 163407685 154684660 146065144 137345729 129181481
16705 129181481 121306815 113460337 106492800 99596350 93142557 87350197 81551800 76603346
16697 76603346 71562733 67428857 63150910 59793138 56110047 52753696 50002676 47224227
16689 47224227 44686779 42081358 40216873 37982660 36077663 34160372 32633755 31193153
16681 31193153 29459497 28391747 26836798 25608238 24504600 23466003 22763980 21661432
16673 21661432 20657180 19760838 18984009 18343726 17599062 16480622 16656141 16142460 15121016
16664 15121016 14488837 14001075 13732123 12923353 12685258 12436069 12104685 11614848 11118113
16655 11118113 11054624 10780535 10288402 9980246 9465580 9311200 9326745 8871608 8683264 8440504
16645 8440504 8195150 7986523 7720417 7898407 7698494 7218125 6952150 6746386 6894948
16636 6894948 6521875 6467964 6059509 5910405 5804135 5652303 5735485 5540370 5381555 5162773
16626 5162773 4983032 4764163 4658904 4726519 4497024 4769989 4212663 4343575 4257487 4256939
16616 4256939 4004122 4101414 4104364 4021393 3889740 3967971 3601298 3514372 3635683 3239703
16606 3239703 3456482 3227334 3322306 3221565 2949724 3348951 3030768 2913634 2818686 3007605
16596 3007605 2571640 2710359 2512190 2734591 2557282 2461424 2365871 2567048 2187435 2420654
16586 2420654 2259579 2482618 2347550 1892070 2401506 2172102 1864807 2149285 2327836
16577 2327836 2187825 2039419 2111830 2144462 1924986 2139600 2013597 1785976 1856578 1616655
16567 1616655 1823202 1755205 1867492 1694370 1753714 1590665 1712934 1471257 1443996 1443953 1861089
16556 1861089 1584303 1312690 1542193 1406215 1454740 1356411 1171084 1559060 1287840 836154
16546 836154 1245868 1326543 1166111 1191568 1220781 982044 1380121 1226028 912191 934937
16536 934937 1135990 840782 1210103 1307355 1313520 1081915 1242902 1378232 1317403 820525
16526 820525 1131024 1259284 928700 1017652 955711 851118 1264274 972696 910065 1094267
16516 1094267 1256436 820416 936062 759406 869434 362620 883805 1026151 665107
16507 665107 580062 910008 850817 392545 880143 1179212 731627 768529 1066557 1009760
16497 1009760 1066601 739916 699516 762762 756181 845697 581223 893257 789140 566780
16487 566780 485879 730870 762776 750161 772917 649521 377425 658126 595364 793039
16477 793039 285536 860666 453374 573786 500317 616111 757275 657845 769548 600417
16467 600417 437812 348225 802284 596104 739921 664085 391124 671094 525891 472608
16457 472608 321162 716580 838514 848971 491552 778587 688296 581319 583586 630002
16447 630002 451497 228977 413907 448133 573861 535755 575065 610298 555235 536069 332064
16436 332064 530848 197552 593168 564999 204085 343590 538427 274279 605321 419704
16426 419704 523061 461584 463448 232480 357162 378036 286959 644255 676816 502859 324040
16415 324040 431376 447049 348815 365783 287171 484737 367852 321747 447528 478191 260130
16404 260130 531038 304309 244746 64761 306075 657093 599850 464623 195715 54179
16393 38990 238144 290044 375927 391799 382353 204039 297350 317876 319772 118150 87015
16382 87015 548428 434856 400771 66232 326671 322728 167958 181875 297339 254381 518563
16371 518563 126727 52710 441023 156169 126196 471099 232240 384748 166169 204836
16361 204836 304959 193181 310008 276469 358187 -100926 317903 245436 335082 365766
16351 365766 249010 55881 78306 142886 392375 137251 18867 801184 140600 385561
16341 385561 138853 -5857 93849 270347 214911 -197916 531436 270437 22972 226182
16331 226182 635837 444661 685868 161749 282797 342951 186181 440760 125935 183117
16321 183117 562853 122057 305811 290482 351105 117549 211343 303960 327411 121245
16310 29427 147922 195708 -22752 219018 492333 -1568 -117219 168648 -176771 75549 201173
16299 201173 70235 278477 108641 45513 221338 410273 336435 202490 262484 269958 -20789
16287 355998 46076 43010 413224 226448 301851 49305 232469 80040 82079 363016 498028
16276 498028 67957 369646 246361 51006 260264 -22026 366427 152825 213538 84745
16265 429396 134508 206972 114249 -87963 355480 295773 -91898 -36911 113320 -42527 176277
16253 234648 -17423 -9009 352736 207716 252456 349910 225753 -274426 232703 200045 453751
16242 453751 222010 -228954 94453 388339 -105077 64782 53894 219531 -435141 119008
16231 260583 198919 -309597 175505 156136 10893 104030 87061 190265 52695 36390 226942
16220 226942 273543 50530 166079 46595 232365 217498 206828 240705 -17099 74092 -95143
16208 233852 6672 216122 67354 241664 300422 4405 231756 -16408 213548 92079 65278
16197 65278 58483 42981 113939 135095 206826 -135405 162929 209230 329006 176792 -32990
16185 50289 -46164 -55508 417164 -300436 -57449 -64459 226332 -21600 173540 252033 -258112
16173 96621 -67139 213959 -240650 319996 -51313 153454 71476 60198 316470 -10489 43909
16161 -112300 -218922 21315 -41527 -104974 93141 106916 2947 65789 220020 -32028 -47335
16150 -47335 29251 40755 -202481 -90992 320077 -52045 140980 110509 -363214 -159307 -95201
16139 -95201 164402 104637 133054 96294 -286676 -192437 194639 18856 -67463 237716 228557
16128 228557 83893 103650 84777 289904 143759 -55051 179564 -1810 -260756 -24912 -97807
16117 -97807 -288697 98797 311244 -5480 406933 89713 -65294 12937 176326 -76068 -17354
16105 128347 57016 28539 -299195 218430 135484 -114095 443690 -104388 -208593 363493
16094 -267035 171646 250390 -66946 20747 -176972 21583 -32330 141983 20684 -11815 85824
16082 -50165 106585 167176 219279 -3650 2577 -178219 -14291 190275 -99085 345820 24990
16070 253213 -4515 -306748 -121405 -115500 -127746 -83960 -87863 249086 -54931 -113556 -172173
16059 -172173 -145351 -57699 -197732 -94036 54841 -256755 111615 81253 319036 203706
16049 203706 184428 -35683 229964 -256476 -231868 -323575 -49228 -126105 88700 -67357 75345
16037 189426 56312 25987 -134562 201115 46692 -140726 66324 106681 -91011 -145175 -214823
16026 -214823 -167731 -102403 50010 -350712 -176286 -260526 8201 -11074 -54190 250609 -137508
16014 -391426 -18989 6021 160346 9080 -114222 -197174 -145726 53604 -61429 55369 267878
16003 267878 130217 -126214 9105 -1175 86583 206369 -260082 181448 -266285 -29669 120107
15991 273723 236751 96997 -42171 -62039 266162 2947 174443 74719 -57645 -140580 308264
15979 226928 -130771 -19339 -97595 -106965 -42244 -31132 12341 -62211 57671 -239268 -204364
15968 -204364 146324 73100 -78763 100445 87983 185150 416313 -98130 168214 52202 124572
15957 124572 9668 -120942 41687 -223513 26525 -2418 205723 -177266 -55336 -296853 -178286
15946 -178286 35427 83677 162147 -162473 -111181 73868 -226719 -123265 -49511 161313 108366
15935 108366 -230808 263810 107660 -162956 -65498 -30531 -76755 -132014 -45163 -450479
15925 -450479 -157199 56492 309063 -135144 86995 -191299 62427 105889 116169 122526 -253341
15913 -33944 -134361 -19320 267140 -118288 -358006 95957 -273965 -219232 -158194 -170791 10166
15901 67999 106284 65213 31869 -192465 58119 -473318 -112811 51249 -261478 -47017 -287769
15890 -287769 -66121 -246948 -82147 -213362 117178 -47731 -19457 -159172 61294 12683 -12552
15878 76546 190687 -194912 -140661 -55552 -157339 67021 70825 -7078 -59629 -92150 -587115
15867 -587115 47603 -19019 245679 -59060 229503 -156488 -120491 -163347 -69728 130309 46186
15855 -32044 -156109 -40744 -66386 -125871 -196537 -223721 -214344 -190231 -126309 -43142 -228507
15844 -228507 312941 -28003 -24296 -330131 -284788 -18240 149328 48027 71038 -86558 334691
15832 -27219 -438922 13642 122406 -343795 -103599 88089 98031 196766 -187344 -154841 -135154
15821 -135154 394848 -4515 -78191 -83759 213321 -440710 13751 172404 -204134 -55186 47301
15809 -291880 175634 -131359 3083 321272 361546 -24021 127962 187789 302534 -191266
15798 -76996 12309 120206 -209784 -11895 166586 89414 -240963 -149872 139162 -207358
15787 384538 -343425 -78927 -313509 -300409 54745 61310 -90145 275297 -7283 -129584 42611
15775 177295 -6680 196023 96046 -404906 196660 -211146 -167340 -16001 -98913 -253956 68694
15763 288958 -77649 -178045 -313007 -175275 -315172 55983 -144962 366253 -211375 63699
15752 -175476 -104742 204314 -28267 96964 29439 78098 101100 137757 282298 -41697 -42242
15741 -42242 -85957 267620 -149342 -115665 -140462 65624 -32027 -140941 211657 -63204 -13967
15729 -85056 -175552 -269452 -175748 123339 180647 -208424 69143 26269 240907 -123210 -206950
15718 -206950 23158 -9963 -15734 -73080 280353 -270777 -297247 -352385 -113730 -216180 59566
15706 33155 -237513 -80698 2259 -159218 -162393 -212278 54700 76732 53173 -189634 225453
15694 71144 -100647 80282 32915 -114049 127670 -26239 162582 -28540 132095 -109461
15683 -30960 -46713 -101652 -20917 -64822 335821 -252586 -178172 -255853 42531 42214 17967 -49937
15670 210427 -10899 146930 90618 482494 305669 -88290 -157039 -167865 -121150 -28738 -338503
15659 -338503 -175048 -241009 50224 -61806 -34507 80400 72530 -113009 -105871 -45592 -47845 -159586
15647 -159586 -19662 149579 -68295 163543 -50703 49475 -135132 309660 -74517 46720 -122098
15635 184548 -176260 -417006 -267425 -95834 -160770 -159667 79153 72791 -84912 5312 -107372
15623 -44928 -166467 290054 4950 -250794 -216770 -210336 -83776 189689 -166218 22422 2195
15611 -4044 -94428 -128299 -77962 -157805 81145 -149620 -53946 132287 21242 -34422 26427
15599 -164568 110637 -1122 -95879 148603 -162617 219356 -17392 -164486 -89286 -187506 -99388
15588 -99388 12252 -160112 326278 250744 254935 124120 58770 185476 -104 -160960 294462
15576 -105829 -310404 38010 -160228 -385099 110784 -230744 -72528 -25372 79341 -136944
15565 -125807 -92654 -86378 -238895 238010 -74919 -188256 -44454 -105587 -1464 -294901 -19664
15553 26356 107447 45417 -200310 269859 32417 -178249 169549 -76439 39056 -43615 -52500
15542 -52500 -28636 7422 -101104 -140528 -80851 -119203 168890 110998 259285 -164500 -300733
15531 -300733 223826 82606 -133093 -232316 277442 -164447 -111052 40791 71603 8735 68403
15520 68403 -175113 58499 39534 -195621 28851 136815 -163788 -166584 502162 22218 -133082
15508 186242 -190472 -373639 -220542 -81895 -104538 83628 -246496 43230 -14811 -70152 -29580
15496 -298165 159779 -43924 94527 -115221 -221512 -85929 59984 158890 18468 -355002 55566
15484 74634 -169215 210033 52890 -22498 422163 -374976 -57112 -92028 -203638 214777
15473 -157935 -240059 -14191 -332842 -160611 101980 65414 53853 -13405 221080 14703 -185324
15461 305644 -61892 68907 -22585 71031 -87710 186712 113635 227947 147771 21905 -167614
15449 -2942 165900 -115817 -30660 73227 179294 1461 -99668 -171819 -280724 -172142 -73724
15437 71844 -138977 -205114 270412 -119723 370768 -92580 -289205 -311514 114442 -133970
15426 49052 38792 109402 -266159 87172 17646 -39310 317422 -367734 183741 8668 38246
15415 38246 -281189 -77002 232310 -144447 92022 148747 342062 -11050 260419 118214
15404 95821 -109811 91428 -96327 -146364 -190757 -100607 88639 -374471 218216 13878 -102092
15392 -87656 77898 19202 26104 298882 100018 107152 208687 -192100 -44830 67316 -25356
15380 -82137 -128950 42842 -148191 50040 -9706 -290840 438081 123271 150653 -64515 237535
15368 -25030 -81057 -159683 67321 38392 -56750 -289991 63066 285999 210901 -306179 -21090
15356 -397510 7125 -7898 190091 -126777 -115616 -54752 -101759 -278225 -410065 -219816 -129047
15345 -129047 -50063 -18093 11413 -343348 -214753 -38136 -105415 238021 46974 95233 89423
15334 89423 -95846 -13987 -70659 -2716 -166799 -24097 -100353 -53837 151922 -71027 433668
15322 291629 133605 -176334 529664 -59616 -48154 -141615 94334 -56330 41359 417400 124618
15310 353606 56475 -1361 225507 162373 -65438 49517 277543 122855 -46908 78024 47868
15299 47868 67511 351424 28360 109822 -66634 8050 -345989 276459 -58314 112808 -154638
15287 87367 -3115 -9045 33675 -3089 132470 207073 -138790 -276679 29423 245480 80060
15275 87322 385028 -198774 95932 -89088 169195 133664 118838 37952 -97726 49178 44537
15264 44537 142634 -43781 160233 -183157 244523 36721 -62298 -131929 304054 204127 95791
15252 250444 383431 361874 1050456 1292644 999463 1270372 871111 680002 24357 223577
15242 223577 -89470 22408 -67186 27696 252930 -10564 89403 -19793 257660 -73704 186088
15230 -52636 6705 -211442 43131 309757 -45645 152945 -230366 223025 19572 53461 204717
15219 204717 60603 -793 113764 157847 96768 280006 -129147 -93961 74107 -87859 28472
15207 66794 131328 -74268 -306434 -56447 -398113 141695 -115938 -35304 -54302 -111677 154912
15195 191716 -45114 -202230 113636 42106 187454 43241 67417 345632 -72622 22395 31416
15184 31416 -134058 -69277 14475 21638 -15548 287824 307922 223358 45869 357062 206926
15173 206926 63151 121123 -190275 -223742 -183209 -75274 -311753 -95817 -45691 -90869 267291
15161 69331 8334 113630 56763 119063 211479 207491 -26313 135987 29855 158265 193597
15150 193597 237719 43020 309158 288040 -258575 -150451 136858 69125 222016 121332
15140 121332 219897 121715 173991 189979 591646 -719 77239 -90380 -62488 18839 -221309
15128 185283 150019 -187217 223628 91787 129403 10246 380787 318651 -29885 -113327 46142
15116 435753 -122122 26424 -62981 84377 255093 216328 108281 338747 -87591 159344
15105 89463 215128 110288 -93200 163315 -30975 206199 192697 4415 290050 102057 186996
15094 186996 266203 155888 108842 137314 185313 130107 161248 -7781 79912 -25466 56051
15082 94368 227773 212010 -134082 64164 -36206 149930 -221484 -32024 117063 -153055
15071 154154 30306 323501 16421 -117846 306109 -106190 -133919 -100871 -42169 69631 138050
15060 138050 225912 -240387 259253 -4132 -223661 191756 155118 -83721 129976 230840
15050 230840 173242 -24635 -64560 130153 -97704 285550 231813 378793 -25068 327984 175039
15039 175039 148365 167380 93810 163232 -2156 172280 459347 -86586 117599 -80861 144312
15027 18268 331896 -101888 98775 -111321 391998 24396 179900 226897 221515 -33252 271803
15015 206267 251291 369652 -170375 367291 321976 388142 121975 667609 128326 178428
15005 178428 378318 232175 12257 165615 -37355 193127 436899 78891 381629 156544
14994 423452 -139330 344112 405845 169709 235789 109349 -101134 508045 283614 370974
14984 370974 -123453 41260 199849 487550 495918 313618 299593 353137 187993 245243 283287
14973 283287 30753 63165 618675 460992 74793 18518 62480 536154 -163274 242770
14962 91488 296401 287453 -109899 367007 365211 253942 220736 368602 31569 32903 -99731
14950 576993 222858 316411 394697 146884 542816 109490 124052 324532 179292 261817
14940 261817 262293 411593 194099 -49022 -59319 359098 112431 380359 609152 359114
14930 359114 188221 108283 360703 594080 202530 209499 228526 127306 26586 182550
14920 182550 356357 494888 254017 290897 40188 -68295 412891 464215 289655 416877
14910 416877 381849 283145 436778 114035 519617 326933 462366 377178 232234 281045
14900 281045 111728 296217 169828 457313 96286 108857 28904 535260 183341 329229
14890 329229 133674 423656 284783 380234 553124 524142 187431 112912 167432 449023
14880 449023 424263 474309 268734 227424 204406 602282 251895 388265 400553 168867
14869 477086 282084 317796 192613 191402 586810 337314 410656 239797 336954 363172 199772
14858 199772 521191 402330 650490 534037 423744 546204 229714 421656 274897 149578
14848 149578 402007 320896 339778 212385 252086 524457 495275 429414 583684 376530
14838 376530 438658 184671 405281 532748 319476 279521 629759 166155 720979 553128
14828 553128 620554 319506 375647 480015 446044 174315 294933 689382 541232 374915
14818 374915 695524 166757 703713 552271 515402 202062 503851 508724 601863 146472
14807 499575 631245 395688 253113 409683 586781 507851 688196 574238 702510 378071
14797 378071 315348 760696 442616 568528 435658 384314 691066 464954 674080 208160
14786 553528 533851 683709 411673 330547 450720 460170 361231 350020 602331 532067 389458
14775 389458 652444 679068 752469 738603 268767 779817 361348 658798 514646 392105
14765 392105 855408 521469 714632 817254 506101 764222 496673 505124 795368 421304
14755 421304 497121 825907 397664 702737 755340 616292 935414 333691 334133 729781
14745 729781 714903 693380 867376 663440 495692 1022571 563630 790893 522009 527728
14735 527728 910494 755298 507411 449047 583248 524035 853718 1008441 644504 559694
14725 559694 848972 993551 808863 739625 594185 1003177 984062 785607 847505 793240
14715 793240 601464 903072 752974 719339 569892 727513 893151 933250 613857 592608
14705 592608 766234 744431 1147472 1123691 784616 953317 832556 865211 980317 827350
14695 827350 603790 870452 993750 1107558 801348 989228 787952 1182256 885594 476734
14685 476734 818526 1076416 765482 685928 1004715 828159 1183229 878044 789772 771324
14675 771324 801330 875692 1026652 1114132 694981 1002018 899571 727390 921445 972875
14665 972875 1083825 1034039 908221 1179091 1023097 1273902 995668 1068657 1145356 1057980
14655 1057980 948550 1161629 951648 1140515 1158744 1091100 1217436 1160450 1054743 549563
14645 549563 1203543 1349926 1008742 1324678 1106814 1125497 1077734 1211197 1106675 1580054
14635 1580054 1239526 1212662 1062828 1165942 1172731 1324485 1295914 1409719 1556110 1247036
14625 1247036 1537172 1391963 1170537 1499165 1054518 1324019 1235503 1532888 1266193 1146175
14615 1146175 1411401 1408096 1427025 1309599 1714942 1274276 1530235 1824529 1248353 1653549
14605 1653549 1543089 1607276 1515059 1395721 1666641 1516443 1804149 1539051 1500890 1728866
14595 1728866 1346131 1849904 1818818 1560854 1518574 1517210 1941012 1928681 1775426 1963855
14585 1963855 1638936 2005718 1691524 1859728 1687895 1832638 2082145 1933276 2022436 2089089
14575 2089089 1983746 2083529 2291723 2462218 2060292 2203703 2316934 2166478 2164171 2285058
14565 2285058 2391604 2326457 2126097 2357939 2626011 2599413 2759219 3138035 3082088 3056030
14555 3056030 3417797 3615311 3991665 4132924 4878882 6334924 8920551 14858595 26604642
14546 26604642 39444163 30993591 17381515 8872482 4329340 3249727 2506516 2195762
14538 2195762 2024155 2012451 1599174 2028183 1913244 1887991 1978836 2103436 1990819 2257566
14528 2257566 1929662 2134904 2259203 2439253 2225430 2266263 2181078 2019839 2401463 2136878
14518 2136878 2448667 2451015 2583945 2778917 2442213 2598142 2651325 2709123 2705309 2415439
14508 2415439 2751403 3035906 2830009 2676882 3180581 2818628 3146881 3448488 2908907
14499 2908907 2771773 3074985 3144405 3042116 3048055 3233140 3436669 3587261 3349844 3181771
14489 3181771 3123707 3260593 3781291 3664811 3486669 3682350 3397745 3675848 3403205 3594178
14479 3594178 3880885 3753910 3972806 4034572 3880641 4152739 3893516 4176208 4135675 4337036
14469 4337036 4476151 4269812 4584887 4436294 4225567 4274829 4861508 4807819 5055320 4271193
14459 4271193 4653498 4601626 4815566 4961387 4963210 4975782 5259082 5031314 5002415 5240898
14449 5240898 5209074 5752489 5399538 5547303 5502254 5792007 5694949 5612267 5977019 5862827
14439 5862827 6204208 5899364 6258010 6068064 6383803 6598871 6316907 6494678 6539143 6890180
14429 6890180 6773669 6985092 7121258 7217951 7245190 7133751 7327692 7582782 7371064 7898947
14419 7898947 7839520 8086623 8003566 8334322 8093969 8181744 8521373 8731686 8902189 9077083
14409 9077083 8824896 9254964 9171222 9093554 9598130 9814640 9821803 9997233 10060149 10159351
14399 10159351 10575803 10263119 11001980 10963384 11024791 11237508 11791230 11810883 11917500 11908235
14389 11908235 12215533 12582079 12618556 13082377 13183997 13545296 13536241 13626612 14264819 14306209
14379 14306209 14685990 14932135 15190259 15532658 15970053 16081405 16413175 16700188 16908656
14370 16908656 17165003 17538564 18171692 18411757 19068505 19522626 19928587 20146278 20707329
14361 20707329 20794602 21349461 22016609 22070061 23344998 23576335 24002542 24353293 25120743
14352 25120743 25780638 26400465 26786529 27674031 28404691 29174259 29719815 30349767 31049146
14343 31049146 31816770 32906377 33805492 34945220 36047317 36692631 37868413 39192047
14335 39192047 39793264 41199285 42862352 44043266 45192367 46669540 47929422 49718011
14327 49718011 51095778 52924406 54601496 56414869 58589227 60561484 62668038 64814764
14319 64814764 67286980 69636537 72529030 75152285 78044916 80905562 84618324 87762567
14311 87762567 91442638 94976390 99038807 103339127 107824741 112461611 117608253 122732050
14303 122732050 128739255 134566178 141026060 147705753 155237100 162557010 170364187 179182947
14295 179182947 188611285 198275875 208587043 219166579 230458987 242499510 254877021
14288 254877021 268260038 281662546 295754506 310120335 324916448 339867824 355007638
14281 355007638 369668937 384146878 397969721 411018624 422543133 433022169 441495153
14274 441495153 447773295 450676748 450190668 447864442 445485671 440255685 435219421 432405160
14266 432405160 426365981 417034771 405857275 393067977 379288353 364629888 349330714
14259 349330714 334186518 318837499 304045369 289934592 276261314 262662574 249478649
14252 249478649 237194520 225162886 214445382 203651649 193523789 184131984 175232426
14245 175232426 166569484 159135929 151647168 144473835 137493514 131439562 125930597 120345996
14237 120345996 115163155 110111094 105720248 100931192 96839857 93178968 89545346 86167681
14229 86167681 82371074 79605673 76100163 73589424 70773727 68233909 66025103 63284190
14221 63284190 61179662 59431964 57302175 55459363 53767054 52015811 50478028 49431408
14213 49431408 47450739 46068168 44613567 43145049 41762874 40769625 39896829 38676244
14205 38676244 37615848 36586373 35813419 34370661 33711147 33112059 31820561 31404676 30498575
14196 30498575 29638369 28721693 28128134 27527524 26942156 25976424 25383014 24916393 24365145
14187 24365145 23704592 23373361 22848891 22130671 21904412 21429004 20803432 20285042 19928931
14178 19928931 19641834 18990513 18609466 18614777 17960201 17893678 17128636 17098179 16284037 16519024
14168 16519024 16078388 15770319 15534006 15074963 14713276 14623846 14590180 13975001 13935335 13408067
14158 13408067 13360395 13189809 12953113 12491388 12197527 12200577 11801168 11660896 11796562 11485516
14148 11485516 11044388 11101483 10814129 10649598 10785734 10537707 10546196 10199221 10247855 9587090
14138 9587090 9824877 9613596 9577507 9249022 8947987 8946233 8880963 8788168 8471568 8435167
14128 8435167 8647518 7987749 8162039 7992637 7886815 8105649 7370603 7508122 7592054 7446172
14118 7446172 7588005 7151831 6786968 6860413 6802012 6888033 6457623 6787637 6815340 6516255
14108 6516255 6475968 6140526 6205838 5909477 5934107 5896539 5996393 5834604 5737568 5559815
14098 5559815 5770707 5561561 5640007 5442226 5534086 5185457 5174711 5110023 4960884 5123700
14088 5123700 5040512 5102712 4748801 4796709 4614519 4474799 4888208 4546047 4665064 4660539
14078 4660539 4548081 4312894 4560829 4404996 4467737 4314556 4283557 4227302 4188519 4148277
14068 4148277 4036812 4230398 4109378 4111687 4025306 3931983 4087783 4014828 3953181 3777323
14058 3777323 3738399 3850779 3706524 3913046 3477859 3479047 3756294 3921018 3437916 3422754
14048 3422754 3787339 3381004 3527359 3291980 3337058 3210399 3462253 3166490 3258243 3239160
14038 3239160 3233927 2938758 2792532 2827510 2927317 2688723 2888629 3089545 2740061 3282618
14028 3282618 2713874 2795029 2934522 2880066 2664588 2641747 2641852 2945534 2628587 2973852
14018 2973852 2503379 2404127 2783491 2729489 2633176 2471386 2601848 2277564 2383464 2291797
14008 2291797 2192083 2401072 2102707 2303127 2168820 2270122 2298320 2049492 2291551 2128382
13998 2128382 2064709 2037549 1776093 2262836 2313869 1711550 2301354 2728223 3342546 4753658
13988 4753658 9112539 19999024 35070021 32510311 21032117 12741356 7823728 5599495
13980 5599495 4671195 4191099 3676133 3477336 2784891 2666084 2673782 2549799 2593602 2387024
13970 2387024 2590590 2270851 2177743 2311105 2154252 2291441 2260019 2149629 2024653 2019595
13960 2019595 2044784 1730015 2162968 2038046 1961420 1809384 2069430 2101389 2329241 1890560
13950 1890560 1951249 1942006 1702509 1943276 1813103 1660576 1785370 1818921 1909273 1932092
13940 1932092 1646056 2006281 1843892 1487079 1502344 1678347 1742481 1417049 1331002 1465376
13930 1465376 1600528 1496072 1659113 1774753 1316770 1582047 1681799 1658257 1472015 1338397
13920 1338397 1420115 1231139 1185836 1670069 1135660 1170793 1459273 1449177 1449499 1427386 1322985
13909 1322985 1494083 1305746 1043446 1443566 1292068 1212646 1109115 1249308 1252226 1058254
13899 1058254 1639920 1613540 1449169 1250016 1472193 1365168 1156247 1325935 1207504 1375292
13889 1375292 1044436 1025110 1247997 1121916 925737 938171 985103 1379938 1399758 1551717
13879 1551717 1414023 979920 1227307 1005366 1417596 1198479 1264174 1223474 905677 1323761
13869 1323761 1030689 1186911 1302951 1095709 1338261 990131 941198 1146140 1238645 1358620
13859 1358620 781993 934003 910575 1358677 1024414 981333 885034 1186455 1028386 889261
13849 889261 886732 895205 1030705 1159583 812627 967343 1093938 852154 974420 884940
13839 884940 1015875 867588 650464 760238 1004123 1045219 821953 920323 1088556 943945
13829 943945 874205 1088614 833416 797065 1093343 898425 754364 660722 843768 880046
13819 880046 812073 1168375 771774 751451 924483 710203 348694 1237113 845500 670035
13809 670035 654826 694885 1108965 416670 941788 642652 756993 647414 863041 950884
13799 950884 1019586 1014361 1147535 588323 916175 971932 1039778 715025 842619 780403 752514
13788 752514 560510 550419 916615 723453 911369 1095476 589706 753273 459043 831223
13778 831223 917015 645573 689791 774921 910618 710080 863069 651139 881554 383944
13767 670739 826836 843368 773981 1075368 663270 457937 373497 730841 633511 827600
13757 827600 944775 625584 666496 602354 659057 614939 640086 656025 713661 606070 733925
13746 733925 800360 602477 307726 348343 519371 644929 730323 651182 780587 296025
13735 322779 613365 470591 442286 506295 677849 560762 626392 639403 343396 588896
13725 588896 553274 770412 791015 595445 695939 631772 572757 345681 744151 322066
13714 323173 348557 797264 602708 476644 668314 489167 527078 418575 688093 408315
13704 408315 372595 480749 283290 449205 616567 258682 540714 574086 396588 447325
13694 447325 672635 569412 722246 752610 247378 399457 763213 306291 593270 413055
13684 413055 490880 470830 484413 398606 513227 488697 265676 291186 599944 481455 418872
13673 418872 331353 672263 369956 410184 223234 269825 528796 383619 279728 643882
13663 643882 564758 206021 400181 470210 399770 479209 369736 324287 427968 669273
13653 669273 -126307 259880 135388 339294 315192 52701 250559 580992 429272 453978
13643 453978 784284 286637 563325 508738 561750 443229 516400 207694 224626 496412
13633 496412 566295 372718 433066 286368 158632 454769 422721 493800 500079 248062 41784
13621 368318 526765 513097 325978 635330 137820 375845 318239 441826 458437 219422
13610 305088 353966 440636 253485 123212 378804 414009 629528 141128 360097 76426
13599 491263 395917 283926 343317 417806 -96819 255887 290173 139709 215956 341976 223967
13588 223967 274308 231392 602517 448375 235335 328475 308597 347841 284694 349158 360990
13577 360990 242119 508436 462044 492523 67254 490532 363617 350473 384098 353490 440434
13566 440434 237766 190685 328546 377867 -78158 299400 494326 415533 502596 88476 254027
13555 254027 484872 137782 308999 478852 124531 417661 290154 256303 98772 305972
13545 305972 170632 277630 398061 338953 29245 457357 300540 460804 211580 372749
13535 372749 399122 250622 232472 195514 455708 283186 118070 97950 328798 392835
13525 392835 544463 358945 60159 238436 219155 216100 333475 188255 163996 295595
13515 295595 86487 226674 623821 271332 22300 -21740 35516 52895 213748 -11807 122712
13503 236828 164306 206101 65389 197422 78426 289631 252694 384019 158459 -98600 -35247
13491 492311 282997 220485 321108 597084 507641 240239 190798 242135 124218 47264
13480 343444 347824 359327 -108234 214771 289356 153649 261796 82713 563931 213469
13469 206798 403080 129324 398237 51136 109168 15727 244417 326561 409717 103478
13458 79646 -67604 252290 -27157 21482 182654 -34704 159412 -163101 -139909 204585 192752
13447 192752 405492 85601 40449 491536 267520 12735 192961 83380 189020 271797
13437 271797 462876 43468 299012 -39865 92547 136743 365656 306491 123406 182263 30501
13425 -41400 121745 446489 581782 431441 147355 169826 313666 177746 23407 152895
13415 152895 430610 108019 164165 616202 355319 -68752 84486 264496 74494 243875
13405 243875 -45768 186978 -64819 90632 279469 239619 408380 272842 219908 393208
13395 393208 53982 306023 185323 278848 94538 66969 -6801 261545 265860 -106587 90514
13383 299168 313421 71596 241210 140408 572042 359035 -11380 92041 328403 166166
13373 166166 477105 248736 -63692 360381 331034 298314 221299 349768 324350 194014
13363 194014 173426 -74298 611576 372217 97023 176852 139275 309014 469692 169601
13352 563078 104611 348156 220401 45715 138581 378229 460505 352910 117082 199867
13342 199867 227828 691624 280403 213405 346202 211500 380867 116569 -273952 123535
13331 297642 481221 415919 171450 119071 375042 214053 -8587 270995 89703 418383
13321 418383 434131 -29601 -28941 282688 120544 248551 48403 134057 50546 159409 19548
13309 149936 223346 390218 99809 360521 452970 91996 -17599 98963 -16789 -202145 294831
13297 13657 67565 141020 352409 2125 6649 105874 279196 86870 118183 122261 15096 339014
13285 339014 9598 -211489 -22177 -43771 6755 151448 239657 -369014 176951 -62676 323802
13273 -36071 198973 142967 11189 -13331 512648 114496 -76078 602099 280783 -174043
13262 294395 176745 193639 330340 186642 107913 117635 -227857 138752 119034 9835 -87672
13250 43881 96899 83311 168704 96572 184132 396593 -193279 39808 243808 58185 323447
13239 323447 82703 111346 379923 583183 211878 92533 -53089 147388 -111983 165574
13228 -41014 210776 172895 183687 106373 52 -41955 -156364 123744 -6839 67819 198190 74030
13215 52507 -28847 10726 149032 485396 153828 -322944 -136612 129184 -27972 6086 125269
13204 125269 208179 29823 -125917 208260 -83139 346862 331257 -48850 -85195 80112 -72769
13192 81636 -2300 152170 302423 -46517 40181 -190975 -67480 45934 -191716 222780 230929
13181 230929 73234 166149 86220 145447 110176 57937 354690 167656 -196559 238380 81417
13169 413102 90067 411677 288081 -32081 -53878 230343 115255 156312 75753 115273 -105333
13157 93575 26333 192697 115610 -150349 186414 -16451 248038 -50946 54837 -361881 193509
13145 -250954 206445 195292 -125556 174150 151629 211834 18339 -7399 115763 104119 162641
13134 162641 -463900 -173048 -164380 199312 197276 -175094 -18256 -172179 183411 -183859
13123 153550 62437 306368 -95865 291613 -270375 195935 -15745 41339 161536 319614
13113 319614 126530 -5632 38020 176758 -113794 230318 51639 158104 293000 -105025
13102 271365 133206 -104253 77932 -146248 53990 111845 439914 65999 -101449 158130
13091 171379 147939 -289486 167529 11146 191586 -35704 75430 -186304 -27558 28586 -8078
13079 -126558 84724 182922 -1035 50642 -93720 189420 -62223 164549 189042 156421 79455
13068 79455 -124870 -26363 312482 201016 324283 70989 132146 306501 243873 -62771 462198
13056 270000 205901 -180906 -41062 -33192 220855 143771 404250 288812 236534 352290 51653
13044 415157 60567 154141 -149786 212375 -25223 7570 -275508 104414 -164306 227908
13033 -51178 29414 47933 120686 191066 91985 363818 628320 -33992 -269865 159296 208224
13022 208224 226214 -32533 136114 222553 345393 435074 -10410 -49119 -190595 168996 370035
13011 370035 -50729 106314 48487 -69507 329450 184930 37928 252970 -21418 153693
13000 192500 165673 120554 202166 -76815 -26827 242028 85874 109256 65606 183570 150799
12989 150799 -199382 -209767 -90483 275883 98395 -142163 -61411 325041 -36883 162200
12978 138706 -90428 77169 150492 191761 -147364 -60333 -254255 214065 73366 37877 -85476
12966 146561 -2926 -53262 460764 47695 -33376 354046 48647 175181 -127007 -33115 154913
12954 -166372 244093 -76788 289631 172267 328908 173207 -171844 -121071 59247 126024
12944 126024 20770 3116 109833 16438 271088 -130989 -90677 157931 -87132 -67808 18815
12932 81857 -205239 -113982 336858 -96236 49169 -2333 -201955 -99509 -51698 86415 137345
12921 137345 -175124 -130550 332034 -20265 -231181 -138707 193993 -163977 -50902 -138286
12911 -138286 -168295 100697 73485 -204084 178425 -167593 -95581 -187153 36838 193738
12901 193738 80910 -182940 -78794 -313619 198590 162069 229239 56679 -173066 -2596 -194939
12890 -194939 95052 24521 241377 104085 -237757 32192 -19586 188215 13821 -164227
12879 169721 62740 463670 -40405 120857 -227576 -61245 120541 -108132 328161 362132
12869 362132 -315661 375578 34721 -41588 -23335 301255 -54373 -5888 -7770 184599 231605
12858 231605 311403 -130726 293483 -150239 6688 98178 -271876 19692 -77078 -83004 -163027
12847 -163027 10818 164684 -412814 209365 101321 285762 -9103 173419 -165080 -38789
12836 -105148 -176523 161156 -24516 98593 -205404 -107034 -146723 -14912 110997 20012 65664
12825 65664 -445336 -270429 -473108 56553 192027 -5580 -123529 39141 146661 168020 65316
12813 70998 103531 88896 44693 124319 -34251 -92330 -47655 286525 -176073 287765 9380
12801 -12337 -317269 -176716 -148450 -350671 24634 -248962 158510 -132908 358810 146719
12790 -82997 26047 -103854 71272 55878 142984 132924 92517 231969 269886 241061 -109414
12778 -24809 192341 128326 131559 200021 38715 213939 -253510 91243 41184 131945 241365
12767 241365 150831 -146362 -82983 126158 3632 62449 -21928 -90971 388339 185263 -105121
12755 -144172 17627 169542 -67326 -108062 -9188 -26376 -207440 -213167 -55184 255162 189684
12744 189684 -142181 -69985 -116986 96312 346463 56164 -79619 -10344 417740 66624 -30544
12732 361028 187456 -23483 119149 -71040 212882 -332172 120239 312453 36487 126643
12722 126643 -52308 -158903 -111505 49869 -170743 73792 9362 -268590 142474 -161879 170505
12710 187741 2205 77820 217753 268603 147715 270330 123621 14390 59001 577343 388392
12699 388392 226435 14296 152368 216379 207035 132879 508 144915 165651 143323 -93800
12687 259921 73141 -190678 25961 -200791 65040 -79542 90416 340152 304096 165494 8669
12675 329042 98115 184359 134126 -251293 -68648 255256 -109413 -161195 115741 117244 136113
12664 136113 277686 80706 -33445 83023 -25863 -101773 174272 417320 157540 -61626 70888
12652 251296 -38455 -185712 140338 69839 41878 -54017 -241892 -218032 -12978 -326943 11345
12640 82174 -102618 169594 -69532 75021 429307 -63995 -92501 240341 354707 305044 75009
12628 360969 38348 189646 -119661 225003 -19082 -233012 265318 -11612 21987 125433
12618 125433 80562 -283297 243482 -81435 -142326 33252 4021 -81698 68324 53752 -227461
12606 42966 -23054 195243 124852 362025 -307233 100023 -38200 -20550 357749 278418 137915
12594 19814 162220 -103290 177912 159157 172002 -92077 72027 -222829 542628 -70724 154075
12582 -95337 239334 -199123 369832 113998 13432 133569 383687 131900 -39931 44863
12571 -152526 -205329 -167101 135390 81981 -68100 91513 -45637 213641 116924 37414 347476
12560 347476 142885 -26340 97553 -370908 104617 117802 220527 -11657 -39770 128793
12549 34135 -227990 147247 11311 162005 -43463 78490 105698 -81153 -145004 341927 -136024
12537 73612 -89871 210256 -83732 -335110 137480 -95533 203773 32164 -228696 -257190 244885
12525 145901 -106971 98701 215207 -170771 93302 -225372 55425 105943 302966 -69607
12514 198464 11639 519400 -54838 -38792 -124458 -27122 84540 3709 169653 -194328 -51612
12502 42147 -406188 -206283 181369 -69729 -91490 -213611 99831 14508 245276 -55957 203141
12490 109196 97094 -168440 136191 97251 338339 -98970 -73723 -315166 8455 -149464 -3055
12478 -19481 -23551 233253 135108 -33604 12278 172126 -130448 -189040 -54849 234557 29792
12466 247192 -162911 -43484 99267 -181400 -128300 -232916 28878 154584 33865 -115338
12455 -192971 116168 10585 -89148 50518 256590 -95568 121640 66889 -97540 273165 -21126
12443 324481 -203428 -173220 -118867 -46855 -323309 -91660 -236925 -65962 -300164 -121000
12432 374777 4749 -77733 169017 -79983 -22774 208368 -298377 -207322 -116776 -249584 -92814
12420 72389 -278908 18698 57856 46638 -118636 157758 -7409 215030 -66254 -59433 149919
12408 67540 -58368 -117604 -239866 -53939 -36846 -27659 -39949 -82931 127284 316350 -435404
12396 157568 -208948 62973 225144 52177 -134824 58748 32689 4949 -92773 240867 -169050
12384 386264 -32797 -99728 245266 85805 -71912 162342 -15909 172131 -74943 46719 276375
12373 276375 -185141 139921 -127428 -38226 -195038 20963 28609 73752 438301 184104
12362 -232901 -340302 194923 105693 117261 -71293 -262462 -67494 -77910 -129176 -179881 134534
12350 -334072 -114705 -13705 -292175 179876 142931 29094 -87557 -182297 -347598 264583
12339 208554 103524 -24501 119481 -178325 48670 110632 47863 53286 -170270 40859 93613
12328 93613 -93455 -92683 -133641 18923 -237921 -248082 177796 89962 130630 -148435 -84822
12317 -84822 -22254 20213 -213007 -380829 -125951 43428 141183 -346897 -260620 200656 -245463
12305 31662 187837 17318 118404 251844 96350 -44806 202219 -4050 46947 -24366 -41814
12294 -41814 -116506 -69126 132929 391788 -157633 300078 -209515 155437 431608 191637
12283 89497 89366 229812 269768 249394 -101492 533024 116382 92853 386612 376923 191 36773
12271 36773 -23431 96406 -42095 -39533 -21273 -11624 -163305 5758 51422 133945 127158 116811
12259 116811 394507 -102989 138581 114747 -179754 -290860 67113 46498 112582 453601
12249 453601 155138 -121447 32985 199569 62333 279637 9454 -188088 275382 169753
12239 169753 -10521 76647 -138347 97901 66311 141866 93758 193434 33 444236 349014 235523
12227 235523 52143 103394 -4504 197397 403947 136315 -46370 610828 172777 424338
12217 424338 87425 113404 -48730 241627 228889 -24345 12991 -130891 199343 263041 -11788
12205 55351 -100118 194641 188952 -295198 115456 -185005 403184 -61576 -107742 76730 55796
12194 55796 120685 117710 245753 414500 312638 263464 -136263 19626 -176681 54274 129051
12183 129051 366923 38403 -62841 300966 275004 81577 113852 90332 -128868 275973 -43774
12171 52215 272309 454344 222079 -5315 144838 121427 247033 52767 -130284 161267
12160 -68224 158705 -181935 -197933 -183915 193282 117003 210764 -34036 -116556 379249 230920
12149 230920 67353 -223870 -333419 10194 -260881 138241 -301066 218786 -104120 -144752
12139 -144752 -78928 -68500 200437 -73283 -129777 -175724 -52819 -143923 -169322 191370 68451
12127 -86318 -128811 94423 202172 183447 57014 -60473 -247086 35012 250264 -106721 -22926
12115 12409 -26883 43388 -196438 -193860 82378 -9135 -9708 227371 -89282 320611 -166200 178562
12102 145058 188153 -44069 -352682 -201755 31241 -380613 -159263 203046 -81821 52610
12091 4324 78738 -26376 -20848 -132898 241277 -30335 -331023 138981 78095 142978 -134701
12079 161407 -179624 -168115 -66837 110066 230708 -23669 -191669 46702 11168 -233818
12068 -166441 193353 45679 480651 573941 1235797 1089977 199741 619988 -56670 -53544
12058 -53544 148592 -55345 -181099 87328 -408223 216566 -113975 -166614 -195977 -68791 312301
12046 222302 -134756 134575 56731 -83333 -77010 9237 -137547 177303 -72706 -185203 45462
12034 -114386 96644 -147128 -65676 120415 266901 -134944 15488 -219085 95484 -71926
12023 190540 -277067 -137309 262178 40777 119637 -172520 66959 -9069 -321938 43752 45609
12012 45609 139127 281457 -72261 180471 32017 -5094 77742 169729 -8235 -301022 120216
12000 -152019 100220 -113794 -89826 138719 114249 188581 17803 -81063 -22628 -151878 238025
11988 -61660 -158923 -298562 -40231 -322706 -81251 27239 -235192 -253530 -125423 -96642 82227
11976 297292 6927 181660 97911 -121347 83559 -207939 -335 -47859 -168899 167698 19019
11964 -120746 174864 266270 108607 -6247 -210304 284230 60405 -74797 133299 -79494 -56424
11953 -56424 159893 -140602 271732 -131274 -109362 -259245 -112362 -5245 -52712 195844
11942 64767 151628 55704 103669 65400 150081 167189 1544 290393 -450 -152485 119362 123891
11930 123891 86420 -244573 494110 -179933 62608 33238 -190404 172360 -318367 64257
11919 -27730 -47389 -111209 118327 -457409 609 48055 11580 332991 -150559 -101999 -58776
11908 -58776 -176597 -22097 130293 -214913 33195 -92869 -284175 -317691 -3026 99760 -42855
11896 -210346 235676 6648 186385 145726 -49019 -84704 225447 -62502 -7467 -12181 -51946
11885 -51946 -49239 -137471 200038 128961 246939 -331558 -23871 158561 233296 -201553 -52251
11873 25072 166972 -259083 76690 -23565 23262 -177777 22464 -41405 117364 -8694 -97534
11862 -97534 -118046 69972 349598 -118849 -171746 225827 59085 -32979 84702 -14528 -319497
11851 -319497 -92361 -5795 -97761 14458 1208 28298 -194769 -253394 92979 -260580 -201591
11840 -201591 -145923 -140925 -287558 -97171 41200 -171721 -579200 -234695 -61100 -7624 -153508
11829 -153508 -88343 -92404 6537 40350 -78113 -93432 -67100 -41839 10986 107770 -32712 -65212
11817 -65212 9567 213824 -50795 -119199 31469 -83305 -145483 -345153 146151 157520 177336
11806 177336 -126410 39989 117562 113772 23941 -88950 -124921 -138651 -15582 32073 -21622
11794 139856 253141 -184829 -70057 -101948 43255 28131 -246962 -151490 1494 1997 -123565
11782 102547 43285 1782 -463176 -24358 -36071 130491 164538 -366817 -209751 -73396 24800
11770 -96987 101781 418668 -260176 7645 -89745 52703 186912 184378 328504 36750 -228319
11758 173539 -320178 180091 -11951 -31988 -5071 17638 -248569 -10664 269076 -40034 -33019
11747 -33019 -19279 105555 -44923 111773 -284662 -347832 -395412 -69758 259627 -66981 -353834
11736 -353834 -214208 -113909 -47279 79059 -163201 63768 128644 -227011 -226614 7472 195947
11725 195947 165875 44097 -32838 131100 69762 137199 -29905 180902 -216740 -67702 124517
11713 55602 134531 30324 15599 -105019 24515 -50771 94264 -164399 88603 -31480 189635
11701 335810 -112665 -163013 122066 43088 164597 102571 -165534 -143821 102639 -85733
11690 38686 170468 64391 255185 -108684 -144050 -139964 -109083 -61543 358787 -90380 -13397
11678 121469 -67052 -81946 -236794 71654 413656 23244 172515 276873 270498 -116005 59719
11666 47339 131139 335608 -216227 -73858 30915 -37268 198973 -55381 545409 -342039 -165464
11654 -16293 141885 -215948 142634 234244 69342 -13681 2161 69543 98139 204241 350816
11643 350816 101733 91128 120583 165106 -44458 84076 191265 174238 -94515 31090 -145223
11631 -69687 16860 429728 189299 -29708 226662 -151922 86165 8032 -128900 -37439 -39117
11620 -39117 118467 78536 198470 -109266 91095 -2952 -112357 -154476 -106446 -129851 -11515
11608 -200401 -54857 -116983 -239552 30238 -121719 97645 193494 194357 251479 235532 89804
11596 -173738 29836 -1852 107025 209800 272234 -257725 -8110 119886 86036 477981 103205
11584 68140 265938 -222214 428473 -996 -88519 -109676 74435 -72060 -104824 -84985 146599
11572 497358 -11453 97608 -109231 120684 76625 67051 -52199 187752 9396 -47234 408016
11560 -53941 134968 160943 -138063 38069 167610 250955 43351 126970 196566 -80581 88017
11548 267299 -38472 -18029 380496 -116056 -5344 -88377 71766 173534 -63782 230205 158783
11537 158783 208951 -32574 -120350 -8091 122892 -50443 250396 155148 237597 24238 224889
11526 224889 -18333 262302 34942 145704 54949 108276 27740 -222141 -149813 225205 -48818
11514 324733 389723 -186196 167638 171696 118009 64989 594873 404698 124815 154584 236626
11503 236626 93283 245091 507195 76168 -123415 127007 67139 63166 216251 -196898
11492 153589 53907 217436 230900 163125 279262 213733 198320 -51070 173448 84351 -126739
11480 209907 177364 -170791 57976 -14311 226553 284893 5402 -278389 122784 206194 -84253
11468 124493 -47803 208096 163801 2089 -113644 -4656 -98164 265402 -74766 27728 214620
11457 214620 114510 -83123 224597 276193 222653 -96843 -91177 92009 75219 -171264 59815
11445 -180133 308642 133083 51376 -88275 55258 310571 26974 99303 46045 287335 130377
11433 -264431 -281206 157897 144963 -30641 44965 135266 240159 -139416 163510 61136 26091
11421 15136 -190084 169564 129326 151516 144194 28732 76745 -46852 -112998 -140740 37198
11409 56142 -50229 -82082 -107134 174381 138114 -248791 153215 119902 -73090 103012 296179
11398 296179 184087 -162354 239107 -290701 -1323 -263774 -65593 180137 224330 -126284
11387 139931 41024 -94024 -115144 -224679 268695 -355867 -156643 -66535 55934 -15358 223239
11375 64200 55024 355435 -38643 -309476 -5471 -13646 -136647 6122 109261 -4548 103525 -43099
11362 52652 154901 -145980 -25226 -57718 255843 8989 -28469 -180832 -88039 8811 85547
11351 85547 -2171 -144515 152756 -142038 1082 139955 4548 -60978 -331912 94361 252781
11340 252781 247040 101789 -213577 -8332 12918 -9867 -256472 -167019 36356 -143292 -201342
11329 -201342 -128422 -263882 -121497 243367 89245 -289886 -76287 -13922 -179467 433234
11318 -19855 84455 64358 143276 -214302 -64609 249 -114628 52267 -158327 237939 -36319
11306 -354325 217529 -479 188336 95166 116935 -412371 -151008 -115597 -56035 13002 290113
11295 290113 -298710 -54917 -245748 -239418 63863 -200369 -498 -142206 -265554 -156080 2490
11283 -65536 -34184 -46478 292841 -249429 -154469 249869 318618 -484075 -79479 203942 43847
11271 -194535 -4893 2787 -446291 -164724 76055 123324 -282973 42967 81113 167859 492172
11260 492172 268767 -22649 -497631 -293095 -261675 -176608 25896 -310779 230228 5054 -40984
11248 -107933 8378 -309619 242036 26951 68037 -94753 -44507 -168025 -10966 191090 -71163
11236 -352313 20602 -22559 -83114 137909 49279 -74842 286749 144411 43097 -131786 19221
11224 156318 134684 -246425 -2830 -67939 -230458 98526 -151192 -315741 -198737 -121891 -111044
11213 -111044 -4301 6101 -102478 123701 -78876 100745 204025 -47712 41255 -106548 -255107
11202 -255107 39423 -53826 63252 -153480 193653 -107488 -36651 4988 41228 63522 -173561
11190 421246 -71725 -67347 103543 -46590 311575 -135434 -10735 -91399 -678 70168 40725
11179 40725 23632 130853 263644 -244469 136313 63859 -82932 14576 -212996 -151372 -1890
11167 49527 72735 116851 -14262 -84362 116701 -165998 -178177 34528 -12551 -288769 120885
11155 30086 -234906 -221622 13317 -115908 -89492 155161 145862 185290 200122 -216256 -135927
11144 -135927 6660 -59604 -160130 -171123 -94919 246291 365918 -148608 335045 90133 -195198
11132 43500 -20567 241288 -164477 255323 -138279 -196783 22631 124931 340028 110636
11121 17536 185992 40961 -35785 222869 -73291 -39260 236906 10264 143022 -47236 228395
11109 14920 86757 275718 -97225 433578 187891 452418 154436 355821 285535 47669
11098 -94731 -12584 112547 308968 257900 -11855 109862 413874 178446 -22694 7332 247291
11087 247291 402961 413757 195111 -231693 321520 367777 284343 148310 252016 385579
11077 385579 455332 308020 328610 283357 310298 443556 211684 178155 428168 216468
11067 216468 339955 446326 242938 394424 298397 357279 293503 580483 585354 724871
11057 724871 647022 623527 673380 502057 644777 672866 472245 546896 669300 384000
11047 384000 657308 859706 920641 600567 750346 803918 577820 597841 717048 638953
11037 638953 873238 842774 581509 408357 675445 823441 592364 456321 875821 455074
11027 455074 815912 635953 686416 691611 568917 851230 630437 223733 632551 438422
11017 438422 555911 840163 483691 452965 825851 289270 617692 717588 487169 551426
11007 551426 432792 444849 246886 492242 441571 990452 679664 939472 625437 530534
10997 530534 388485 740046 658725 578380 534889 974299 410430 849284 867657 614376
10987 614376 1007403 700529 986769 1580112 1313685 791816 1262205 1414440 1113631 1508685
10977 1508685 1527666 1581829 2312196 2563215 2486441 2913840 2684645 2815527 2387691 2119962
10967 2119962 2101305 1704414 1693589 2002680 1191865 1584819 1594205 1355481 1805175 1565406
10957 1565406 1261974 1387447 1350249 629455 683536 1150154 988823 389855 666389 295670
10946 525857 486586 239773 438061 -52569 287002 -100880 55803 191085 403928 62571
10935 129024 321282 111739 -119757 -137774 116738 244384 135536 101641 -281301 112167
10924 -17997 -204807 143100 281762 251948 375504 101414 97837 61839 248638 120740
10913 -66656 99696 -75772 -66136 344493 -111982 -159445 -247575 13223 306063 -131225 286880
10901 110733 259750 43195 22694 108710 93584 -215023 -245788 131107 -37610 -110519 -111756
10890 -111756 101339 -35950 323653 47010 156915 154274 252842 50632 -133455 -53175 -15890
10878 10687 20935 144514 -229543 80946 55872 -403508 98292 40690 -330606 100269 -1842
10866 195393 -34581 16987 127223 -187299 -40093 -95561 -297858 126077 -371791 -82046
10855 -206226 -241768 159722 88491 62959 74818 409013 -215507 -197597 -124480 -74894 -113192
10844 -113192 -28300 191938 352646 276576 -135518 -256815 -177340 -246202 14737 31450 26077
10833 26077 -236429 -231035 126274 94560 -241004 195405 50443 -233601 -353144 -82246 50542
10821 86744 87035 -60805 179187 -220529 -722 -18422 -33400 -192375 -85874 89579 54945 231167
10809 231167 -417864 -74601 -62743 -161801 -174099 -35990 267671 86598 -228156 -242727 -9551
10797 45605 -220344 222644 -52471 63548 -30939 -185151 -83955 -58080 -81249 39059 54335
10786 54335 -203708 -196376 -138744 154534 57454 68305 -127124 -222189 109234 -250380 -98688
10774 -120437 217570 1080 11511 -137112 -186481 -108035 -32190 172589 5244 201687 41875
10762 38523 -137693 227241 199852 -195779 -498138 213947 -196853 255854 56461 219222
10752 219222 138243 -271862 -328546 -271315 -52384 -150289 -121157 247162 -251983 -14941 123116
10740 242136 -167759 -171379 -552076 -338989 140038 186828 -153940 -67819 32286 244133
10730 244133 -160228 146035 -210209 157111 80239 -133542 -65419 137427 -260398 -93145
10719 431989 92224 -164143 154533 110487 34432 210131 50871 151377 -306123 -263499
10709 -263499 183812 52231 22279 188717 -186001 101484 -229657 -148974 -33132 -142018
10699 -142018 -24718 76072 -63728 -195834 -100490 -292244 -178590 95169 35954 -269987 -118505
10687 51849 191606 135843 -89871 -277397 -221182 51422 212668 71101 -16381 -405028 97059
10675 57054 -86310 -57432 -49386 -95077 -184743 -272886 -1004 152662 -93811 97003 67697 191897
10663 191897 -42117 3133 -14461 -52835 -44873 -150157 -195124 -88076 37089 16021 -338677
10651 -41696 148010 -63289 -39997 -330845 77893 -133574 19941 -18680 -81147 -294913 -325071
10640 -325071 80558 123073 -379327 15026 -82051 71827 216254 -188769 336586 -385301
10629 45778 100966 -143545 -45630 49447 72290 -47668 -25666 150798 -461490 109174 -127192
10617 -8437 -299190 28109 13440 -14545 -19622 6544 -157512 -6698 164102 38730 -213164 -140049
10605 -140049 -209985 -234258 -20931 319873 28763 41234 83261 -397343 -103413 -71478 -62236
10594 -62236 -72741 -109146 -418872 -60575 135994 -48682 -5314 -69800 5964 17733 75747 -361258
10581 -206167 128163 137813 49173 -33064 87412 411831 -98887 -401293 35829 190275 115597
10570 115597 -214873 -154302 -274159 21411 -138839 298310 -294833 -131014 -238196 38484
10559 -89 226995 84584 -128024 -133792 97958 -86639 -172632 -34403 -82101 220 -13300 9792 -78986
10545 168735 -22591 -201520 -13558 -84266 -137654 -29755 7902 -73641 71749 -408986 168899
10533 -208219 -184507 54389 -284161 -57508 -118880 -273532 -323572 -277474 -30509 -79223 -200777
10522 -200777 -99635 -340291 7684 20886 10050 147741 218569 -98170 191515 199977 -16793
10510 191221 -125131 -13650 32498 38285 -212505 -78452 -74459 -257884 -240666 -15769 99116
10498 244228 62244 49817 -95953 31869 -63841 429940 -195492 43312 9750 -31185 -262748
10487 -262748 -160166 21627 339545 316769 270827 227038 506645 138761 288246 361473
10477 361473 202008 9284 55336 368566 -94308 80525 84509 -106853 -341761 -213794 -92694
10465 51710 107527 -363594 68611 -37713 368270 -324114 -385060 -43261 -35374 -51426 36627
10453 -8238 -75385 105531 -98382 157704 -398658 -154388 12851 218155 144871 169741 -201392
10441 -107372 -230646 33081 -631697 -184647 -52119 100304 -89786 -136710 61159 -160059
10430 216773 10297 -83680 19002 261547 -91261 30847 197615 3010 139645 125367 85799
10419 85799 89118 -293675 -113047 -357614 -94021 171212 146502 145620 -53750 80408 -124637
10407 207938 111712 -5406 -254945 -155754 32505 -133296 358509 -103538 -203658 -40249 -184399
10396 -184399 -130152 10682 72061 379503 107492 140584 -199868 -11299 -65165 62653 46398
10385 46398 -289557 -39627 258474 299229 121582 58828 347555 -367 22266 333609 322938
10374 322938 361209 18725 216371 533270 389308 236155 335005 510862 281389 502437
10364 502437 152690 -83560 167268 11501 163793 -303968 82154 83789 405473 347780 -42205
10352 191408 230177 455594 506379 721544 315972 162832 482407 459557 618164 215287
10341 48880 287624 362831 280348 10657 295654 -216972 -85975 195204 475654 -208409
10330 -95771 170326 252759 93274 -23840 15144 255306 -43036 303328 439998 113498 60270
10319 60270 35119 208687 309943 95508 421691 110992 -187472 122162 74743 84747
10309 84747 -35630 162017 -12663 -54262 117922 -104788 -9132 -206835 11894 -161812 258614
10297 -89507 451421 120560 23150 254323 -423167 -156749 66114 220048 -357599 -48230
10286 58760 -158707 -7261 302747 -333911 96284 -140350 55420 -46130 241112 98025 -156332
10274 205254 -333706 47325 -107745 -153545 205677 18225 37026 -97203 274462 -31962 -199081
10263 -199081 252147 37222 665424 558220 174785 315035 446076 393073 325979 111946
10252 33287 2059 -271372 56782 -314364 70676 179202 -215876 -84557 -89178 -19810 -145731
10241 -145731 -130623 142264 -18355 -133372 -94980 -34567 -304259 -27599 -177899 -23701 -23105
10230 -23105 397118 -18838 -65222 185750 257901 -108157 -84616 -239498 -87425 -252028 196695
10218 -137933 -40935 -229786 -80703 78294 -110857 -348383 -296357 -20107 -43004 203136 11405
10206 -174669 214804 -225553 -434552 -384112 -200103 -34339 197032 19171 -156746 119068
10195 -208715 -196201 -221612 -237152 -80364 -60771 85870 -137641 -143679 -55788 -291280 4487
10183 81158 -253962 -219161 -193164 90386 -178562 295549 -168086 40053 21216 -110547 152325
10171 -297287 -300260 -249672 -175782 -132627 -88518 -142795 -7046 145640 -42106 -158781 -295535
10160 -295535 -163943 -134580 12329 -266258 -318467 -99461 81443 -57235 -237578 -178001 129743
10148 73848 97022 19647 22457 -120196 94139 50553 -136059 -65440 262187 -139910 -92747
10137 -92747 47708 -166940 116549 -131790 111244 -415340 -7322 -178600 -202818 -289412 -5680
10125 80508 441199 -90606 250676 61833 257073 -70590 -246581 136092 18860 -66503 298616
10113 -121991 81363 -75265 -47547 -298285 -285873 -15606 -107994 -98590 -98943 24482 -136927 -125317
10101 -125317 -102522 -156640 -166685 -69806 -56519 87896 130781 -282321 54456 -100265 -138518
10090 -138518 -11821 -82940 -89493 -168363 -266102 121955 -46199 78564 -133619 -59285 186671
10078 -361143 -177031 -388569 245 -66376 -99937 -225138 -32366 27673 -12451 -297383 -132575
10066 216769 22442 -163991 245073 803 -62599 167788 178740 -12295 -69256 -438779 -134892
10054 21934 -150196 -90021 -387335 -32874 -56765 2243 -174766 -132116 -277916 34324 -20370
10042 -182963 -40165 -184062 -313274 -264580 -26991 220800 -113666 215709 -260464 -99060
10031 -58912 -30264 -30596 -316740 -85861 68724 -347310 7551 -47420 -28314 -96907 -63963 -160849
10019 -160849 -353577 -77135 229690 -126237 -214038 -245758 -114810 50903 34012 -80107 28570
10007 -24399 -164639 -37608 -238333 -249867 23437 -378230 -179437 189070 -341323 -129669
9996 -187080 72347 -183456 -24951 94203 -338848 -138893 -114408 21223 -224001 156705 201011
9985 201011 367366 -53502 210519 140592 -233315 -145378 27053 -171813 -69558 -45638 -4225
9973 -49816 -158252 46404 -71933 -40588 -78447 136484 -237394 -372528 -206314 127531 24018
9961 -215876 -5779 54075 -146673 -533409 -103711 -295844 51168 82584 -153591 -266869 -164356
9950 -164356 -214373 -100201 28681 30821 150310 155605 -12386 146179 -294276 128722 172137
9939 172137 198647 442893 -58093 341142 -87256 -154702 -256938 323296 -98951 -200861 136137
9927 -144328 -119672 121524 31705 -340624 -118377 129083 -251928 -289242 -28299 90215 106401
9916 106401 -102448 -92228 71439 -204529 -298381 -243765 -85493 -193619 -166639 -187528 -422476
9905 -422476 -274938 -35426 430233 -63544 82915 23898 113049 -171786 124898 -43386 20729
9893 -182556 -189159 180805 -11559 186810 85216 -271257 71362 -360535 49820 -107017 175112
9881 -86014 -409190 -42561 -382266 168821 -358642 -51275 159725 230882 281314 -15671 5432
9869 -393469 39663 34683 29254 -185511 -179865 262135 -40807 -106116 -40013 -278158 -27180 -495767
9857 -495767 -146345 -240892 -196552 -291840 -399610 -661861 -74824 322131 -116324 -140265 -163231
9846 -163231 194361 -158600 -96252 -762 -42165 -264982 54026 -173855 -232092 -116112 -70085
9835 -70085 -23562 -225485 -96245 117652 -102322 -113851 138040 -12566 -214442 -103262 -105101
9824 -105101 -47034 -236567 -65498 -210771 -116642 -62974 59981 152633 101380 312672 343043
9813 343043 -173096 -182551 -171508 121957 -113500 -141621 -137993 179357 -28001 -192844 -249279
9802 -249279 43703 150063 -5744 89471 419666 -147769 81722 407061 -35683 -129608 85757
9790 -193995 -251275 -38447 -2940 -37139 -122220 -129324 -173113 63919 -122155 -50508 -18155 5734
9777 -201277 42752 12555 80866 27925 247328 -119438 18389 14957 199736 -9608 -203231
9766 -203231 114020 -20886 -31854 179892 104240 22373 -266645 -304148 142213 284430 -124982
9754 104778 -56159 -148773 -219562 -163911 -60849 -251798 5489 -401950 -124690 260326 -127339
9742 98094 77029 -81906 -49359 -111727 27909 -220390 -23243 -467385 146639 -105851 -92954
9731 -92954 -269129 10266 302610 -119409 -33551 86729 -82320 49256 -19178 -156139 -191281
9720 -191281 -147725 -25509 -596029 5570 -48704 -172844 -196057 122931 -10215 -158304 -89999
9709 -89999 -7974 -107306 -265127 -58416 -83518 -367419 121317 228599 295492 39795 -102436
9697 -338819 -303488 23269 17292 -203957 123066 -43435 -173316 -166548 -100614 -239820 -78768
9685 231899 -101347 -102785 -49978 113419 41036 -19490 -30844 75762 83605 -197538 252648
9673 -161693 -59115 195482 -117290 -101899 -25167 -162657 145792 -197696 -12190 -38397 128649
9661 -116520 179197 -132737 112714 -66590 83461 63825 -302891 60514 -450345 143710
9650 274255 -204444 15866 -150401 131153 96615 103426 -50679 -175925 -273794 79368 -78178
9638 -31774 -16068 146624 -18488 299343 128930 -327146 -78313 146932 -107172 -73076 -129708
9627 -129708 270675 -188508 -79270 -122423 -77660 290684 104315 -205411 134067 -143326
9616 -187691 76390 -109807 172286 84030 -223466 -78237 -130598 -58136 42110 208970 -34799
9604 -32699 -200181 177414 -97411 -360133 -486753 -215808 109342 9064 -186933 -149968 46427
9592 -64225 -123818 -285635 183305 -335245 -141581 278698 -221778 165289 76466 -233117
9581 52269 -116473 58847 -152870 -1584 186639 -141850 256587 -82515 63565 1708 78470
9570 78470 -202169 -75495 234542 -140833 83861 -53388 -181774 -107059 -191848 -399599 14618
9558 26193 -283188 -67890 56852 2178 144617 63873 106602 -87851 125924 -34422 -81619
9547 -81619 33020 -175077 -186748 -3400 165763 112976 48778 -192895 80780 -127268 -46390
9535 201363 -148601 -59352 156241 -279796 145701 -134552 -44397 -123355 -261819 -20690
9524 -307141 -116038 -138749 -174281 -328206 -900 -361670 23736 398633 -154198 -91917 -198325
9513 -198325 196238 -54488 -179467 136153 38958 -180611 -7056 -227833 -59495 -324627 -126471
9501 207645 -81031 -163251 46011 -350559 25092 35803 124617 86411 42833 33624 64764 76855
9489 76855 -49968 -173724 -61407 -221689 227918 -198865 -67212 110355 433257 -36997 76499
9477 184287 -322319 137852 -16854 -253680 -101998 -311172 104924 -220917 -163529 -99592
9467 -99592 -22366 136401 -9515 -53543 -19456 -317052 -301524 96940 166183 -193611 -53623
9455 66401 332444 31562 -75874 93169 -5115 -45404 -64011 -286489 -193519 -101268 126917
9443 51580 -55110 15878 -47974 -133382 73621 -101090 11016 89445 97144 209492 199115 106151
9431 106151 -170039 -74046 147883 266704 292919 170811 -3152 90135 44515 -36246 15495
9419 -195225 7448 -135947 31402 -190893 107109 -64457 -237543 -135386 -39929 160944 52949
9407 114234 -66571 -75948 64196 -206686 -125944 136947 -3249 -58847 407133 -53505 30569
9395 181724 -4322 90760 -111873 -55442 235134 45556 153704 194307 -117220 135211 -42325
9383 -61120 -237915 -338756 -324889 -236816 38795 220839 -26903 -46799 -169100 -176277 -42916
9371 -264829 73768 -244605 -143661 117424 -26073 -134152 -24778 -156606 221688 322869
9361 322869 211153 41413 -305128 -286671 29996 -65759 347193 27645 -56314 26955 -9160
9349 90220 48707 -123969 -58556 7834 -72516 -129542 -73417 -116722 99091 -77098 -204721 244815
9336 -67714 -92179 -334758 183853 -286036 -259833 -300303 -124465 -154679 -101050 -159333 -48931
9324 53879 34411 2462 -185180 273 -161685 -114590 -44289 -46715 -233439 48249 251241 -25613
9311 -54616 -63764 -85769 -57727 72839 -292413 126006 -227525 -34363 263248 295575 -6997
9299 -172658 -62902 -100035 -434639 -131232 114825 20086 -214455 -165357 -150908 -228388 -249010
9288 -249010 1661 -205283 133329 -97680 -160909 -155781 -195570 7829 -29005 146069 163469 -149312
9275 -180348 -105892 -244562 89290 16240 28283 -5624 28545 -182697 -180781 -12827 -102224 -120044
9263 -120044 109060 -204507 -56677 72073 33438 8584 -118463 29610 -53049 2632 -7487 268713
9250 -133529 231461 238533 -153147 42269 -38273 -21551 -160160 48001 80261 -225686 41289
9238 -11106 5188 41533 -147815 11987 -16237 -197739 348004 -32118 -32931 113599 148773 70113
9225 40020 -124505 -88463 -308503 -291459 -58981 -543 208758 104453 -118327 -192475 -125495
9214 -125495 -805 67068 -186324 -155750 121315 320638 -238338 -254186 -162516 -222654 -99448
9202 -152067 -18424 -168884 104187 -7482 6110 22286 3757 -218554 -256853 -181802 -79507 104078
9189 -91234 17199 153053 -199957 -323699 69312 -277102 -48586 -10532 -155414 135727 249787
9178 249787 1332 -234273 -268599 9099 -83389 8526 -17037 -143701 18406 -148849 -195424 -13536
9165 -61705 110079 7519 -7078 -108656 13524 72503 -57521 -143333 -71727 -247448 -267358 197810
9152 -33670 -64874 -23541 -73380 225281 30324 56879 -64424 170785 -131906 -93087 88147
9140 10190 141065 -59640 65036 -362588 -151006 73433 -137668 -271695 -136990 27601 -135314
9128 -113890 -97417 111762 -204676 -153181 -351068 -279029 -312397 -27299 71640 -114981 -1070
9116 -339905 66636 -247788 46504 -35222 66674 -120019 -212900 -17929 -131212 471028 -26066
9104 -32265 22482 84035 -117662 -36964 -25352 -136604 -14082 14428 192697 117890 297899
9093 297899 38042 8429 -45724 68140 -195844 -69816 -78704 -63843 -172046 -106127 -159157 105294
9080 -206172 -303784 -54858 64846 245324 249948 32397 -107782 -62323 276146 40886 -16519
9068 64556 -24933 155357 -289442 -54403 147555 -351235 -44920 -358090 -91122 708 271704
9057 271704 270597 -75754 120493 -46237 -220519 -58997 -28446 -58825 -46215 -43930 -84491 3551
9044 154446 -185227 273208 -289192 -421666 -192791 -58157 -107145 20401 -178163 107439
9033 -269178 163414 173631 -115332 -149043 -138434 291238 165908 -76858 243285 113253
9022 -62507 -69205 -400208 -22607 -319059 213881 27385 -267320 -337957 -206549 16433 167186
9011 167186 -27048 -258798 62748 -175923 -32800 88967 13813 5113 -66116 71180 -455923
8999 189929 -354712 22765 35496 74852 46132 25828 -36850 -199849 51805 -94406 -61118
8988 -61118 -78951 23711 -21826 11747 -127814 102293 -96541 -29345 -319084 -236778 -241822
8977 -241822 34867 -172511 38631 -97401 227033 309930 75736 -348033 91092 43983 -51509
8965 -301233 89779 141286 281947 -99167 -369195 198674 -104400 98745 68178 3470 -321038
8953 -80045 118280 -109968 -160667 -66658 9537 -11129 -65728 111000 308641 -155833 151922
8941 88218 -108242 -40390 83083 344677 -168979 240412 63744 -18899 -78877 60649 44610
8930 44610 295673 -144700 136604 -181095 -308347 23378 293160 1675210 2901638 1200194
8919 735050 19132 -91443 85584 42898 221892 -231542 156727 -344913 -176025 -303063
8909 -303063 33459 149645 -33477 214183 -36102 65963 -41437 53601 -21622 361131 -503330
8897 -130691 -35624 123716 149598 -30679 -127952 -32087 -125486 -202936 -77865 -130364 17550
8885 -105601 124418 49061 15521 -343973 -104084 -64039 35407 -195329 122672 6583 -89600
8873 -272552 -134779 -19045 171424 -251931 -150025 63201 33838 205769 -230782 79680
8862 148170 286111 -105101 8126 29481 -139235 35583 -151784 -91891 224105 -162457 -445048
8851 -445048 265016 67376 -101064 -203971 -443816 -118563 -63417 -98638 -225683 332059
8840 -26045 -65989 -30821 -25449 2646 253012 110195 -33720 236975 -160943 154636 86750
8829 86750 -21662 12008 -67391 -170340 224590 151528 101934 -264848 -94413 184194 -1786
8817 40800 -301070 162252 122547 -86192 -160388 7258 189909 -100158 82860 -297768 -186626
8806 -186626 4525 -146149 -1723 68786 -189755 -79273 -292730 -31642 -115900 -184534 -261255
8795 -261255 -105190 -221939 79717 -60537 -113185 -115647 -311782 -301786 -41029 -237884 -182901
8784 -182901 -54214 35094 17063 -24814 6387 -584462 -166510 39216 -131354 -56488 -145846
8773 -145846 112373 -106353 -102437 15831 106805 -49908 -204377 -134210 -40112 -195408 -63325
8761 -15996 101447 -141463 183803 37635 94190 80806 -174735 -282421 32884 -55216 -417014
8750 -417014 175480 -86016 -29852 -172572 223120 -41314 -72196 105315 -10352 -215252 45116
8738 182838 -23175 -141564 87073 -104941 54811 -29988 -368563 192135 193160 -254371 -86831
8726 -195666 -78081 62878 53163 231653 7310 317522 -240345 124199 -41988 -36469 -184673
8715 -184673 217202 -294790 132404 -373820 -19557 69590 -242455 79628 21050 20268 -6658
8703 166930 -179074 -83578 -156743 -246803 19081 36785 96854 28730 112595 203326 38020
8691 -120342 -99644 -184957 -175305 65762 -87782 -138653 -422718 224051 -138639 -252679 -109974
8679 -444556 -28929 -26171 73967 188402 -209370 -194896 44324 -48044 44994 -139611 -336925
8668 -336925 -206684 125618 116149 -191944 -299792 -52760 25333 -82768 -222683 -178911 -162041
8657 -162041 -216317 -106152 -100081 -332059 -63251 -61187 -357165 -150627 71824 -164160 -361361
8646 -361361 -431391 -297420 -62219 15272 3134 -212719 -210914 -313327 122949 104595 -57992
8634 -218703 -204971 -110787 -99436 -37116 12531 -16647 -23384 -247548 94440 -81968 40519 -12042
8621 -15401 -17493 -31403 125528 54045 57872 -7646 37647 -45020 156443 -14145 -95266 98308
8608 91860 56104 -166180 -124043 48575 54978 4585 -36238 -153574 -477127 -72328 -111844 308044
8595 33967 244337 143326 -158926 113382 124341 -38515 22993 3641 -215654 -166692 67751
8583 -56679 -183664 -91108 -385206 187094 -329388 -249379 52378 154146 115769 -324704 -872
8571 -124969 -394534 74567 -44435 329569 209860 337706 -272753 103208 -127973 -124272
8561 -124272 90253 -146923 -18406 -330403 -156924 -6294 -45613 -8897 -307986 -129440 -5189
8549 161807 -311617 -40232 -11845 -83199 228918 -65587 -10128 110143 197737 -158588 59773
8537 75088 178468 -87050 -67388 -90569 -106671 -41419 -155372 -257786 -107513 -117609 -113343
8526 -113343 235326 -169782 53918 -119850 -4727 -172898 55536 143241 -276595 -362744 -264428
8515 -264428 -49495 128594 -58131 66796 129630 -176084 62336 -33247 -65711 -435799 -47451
8503 8570 -168371 96182 214707 71725 -251211 26004 -169773 -120769 190861 -204128 -250978
8492 -250978 138893 28064 -24900 151049 -80115 78943 55493 234086 137610 -153621 -88597
8481 -88597 -165552 -73256 14790 49576 -65922 -97434 -265414 373900 101216 -107175 59955
8469 183979 -8953 -51528 -14372 46770 -134518 330038 -69650 -427676 90870 24320 -118091
8457 97305 5042 162027 112717 257490 -52040 -59035 -135863 72733 -54193 -215552 -21414 -61402
8445 -61402 -347371 -35356 79440 -228781 220622 97451 63115 13844 128976 -246930 -143326
8434 -143326 2647 20718 -62492 -86632 -123281 -266867 -49148 42225 -90546 -304229 -70919
8422 -40918 -29631 79426 27168 -400467 -307043 388598 -48991 -233057 -50885 -288685 101371
8410 -406939 55588 1025 -193095 -217626 -165070 -17518 -298831 376279 -109141 166361 -188159
8398 47106 -74280 10517 -194665 217034 -28405 -241304 25872 249932 -55087 -116391 11606
8386 266458 -182187 -248384 -207850 -187928 -274 57274 -294047 -219348 318800 121808 9756
8374 -326397 178759 -259051 -139959 -56661 -63214 -112356 -192323 141641 144790 81192 -155305
8362 217124 -6807 -15612 10712 98185 -36476 64759 -115661 -64488 75056 -80351 -104984 -222514
8350 -222514 290605 11384 251438 201648 331211 -283380 -111057 -137148 -1418 -19836 30921
8338 -196184 65204 -48603 -357292 -191107 -142067 120068 125059 235771 110801 -113414 23752
8326 -154998 -105865 34080 -456070 -62585 -25419 -141079 -73493 -56869 -176213 -221092 121646
8314 -126141 -440719 -257366 30680 -152399 -339952 -273973 -212333 -43708 -136141 118926 -48721
8302 -47966 -65678 250719 120517 -64019 -107376 1174 -43427 -67143 105928 -323321 -119115
8290 -335684 174244 -115292 281943 196387 -66780 -90272 -265933 193298 -184654 -55429
8279 3742 -81870 -137640 -28673 8219 190345 -555907 -155910 295587 -211412 118321 142424
8268 142424 48473 18684 -424 -92842 49838 -98018 70392 -103392 533281 -232443 117285
8256 -56707 30428 -64822 -145807 24390 -123461 -227408 64941 -94544 140999 -157135 -21694
8244 153228 -165106 72487 -79408 -109275 -283881 79417 -440993 13283 205048 -145729 -70255
8232 213207 72524 -3736 87650 28535 106133 42639 -367344 279162 -84383 -11135 206519
8220 290871 -304630 235680 -128108 153981 -104334 36325 -47042 -72091 -173550 -59447
8209 -288386 166818 -182325 -134739 142936 -152631 -50059 3270 -237734 309931 -280518
8198 -44476 -21836 137292 -7168 -105209 124753 -175200 -85470 150324 40065 21797 169213
8187 169213 -70881 -249079 -261525 -13653 97345 35538 174278 -268939 -380417 130702 66269
8176 66269 273441 -245381 -136613 54264 80837 -115320 -29529 192958 402735 68681 55586
8165 55586 -221230 15936 42841 -174225 120390 111935 -46963 -101935 129830 22223 -217375
8153 452052 287834 25925 -396321 -166226 -638293 -227235 118551 -187328 323138 -77640
8142 -103629 -106680 -283164 17265 -233412 -202457 34645 67041 159582 277677 183129 28729
8130 -196688 -55806 -145365 -306980 -74493 385944 266757 -141782 -41610 -159942 -133012 -123605
8119 -123605 -232625 55078 70883 290535 -134421 -133478 -295931 51375 -181103 233718 58677
8107 126198 87169 166251 -112691 -189793 -21290 456659 -33682 96472 31007 122605 -154421
8095 -71612 -308639 -42966 -269074 -229711 100826 -36360 -196297 9324 -107266 -247558 48728
8083 14954 -310813 8800 -148797 -116452 964 -10002 17356 -307300 315498 35350 -25399 -193870
8071 -193870 79941 -152346 50572 -156950 -79672 -4292 -297457 -389092 -137133 220635 141634
8060 141634 -93174 113620 112524 179973 98029 40640 -89107 -130057 176930 47630 -134439
8048 -1067 -125383 -351275 -87112 -425894 -107778 162029 -55350 -101442 -25097 -141781 173866
8036 -18737 -191718 24588 -336392 -354497 -185343 -11928 197951 140414 -152460 144225 75020
8025 75020 96690 69295 -76041 -268516 52968 -154584 164056 81145 154978 390918 -1142
8013 166341 -95158 -334131 -216493 12969 90820 -199274 -226484 79253 -1887 -279936 11129
8001 99396 38646 -81612 -123768 240009 -66666 176165 15814 -109144 -212928 30508 85359
7990 85359 -68883 -163199 -23407 -245095 -192106 -101236 -330370 67547 -374371 -307811 -78557
7978 -179912 -147980 -120636 179238 101654 -342632 -39298 -21180 -360548 -6918 153543 184500
7967 184500 -39937 21757 -81192 -81671 -296955 -147283 -285470 -145819 232697 -109849 19172
7955 158318 29920 115797 -100618 -114011 -43803 -222374 -35295 -25014 -2053 -95032 -270176
7944 -270176 -533125 109217 401039 -56073 -136760 -24872 148374 95916 -8825 -243975 -148603
7933 -148603 -196521 108365 -249536 -151760 37862 158358 133718 30081 -91846 138018 -7990
7921 14531 113197 -98714 187036 -24448 -66572 75028 14028 -68245 -292934 53281 174619
7910 174619 70361 48195 13970 83518 48236 -37101 -67456 313290 41586 -103849 99830
7898 -209203 5487 -15243 157679 -88505 124051 -199509 -89583 244010 245705 248438 37642
7886 -9454 102002 -220277 280308 183352 57680 -12333 -90641 21319 42394 -1333 73631 -338477
7873 53356 87153 -216315 -153495 185381 -225206 17008 67722 169695 -205563 171733 69519
7861 -150211 -266349 27356 -133865 -178791 -95642 -50689 320282 -77682 -148864 83728 190241
7850 190241 56311 -52164 -69592 -110706 11615 -148431 160607 16197 54084 -204589 141384
7838 172860 -155491 -3782 157667 53244 -133676 59779 -30174 75023 -2709 -220976 273016
7826 100738 79162 -97298 -350081 90054 -124747 -107730 -343807 -201368 -124179 -181049 -250222
7815 -250222 -193787 -75697 215166 -54499 -286470 111414 -117747 71028 316462 -82375 -286960
7804 -286960 -422861 42108 -139193 122635 -59864 -133834 -186358 -245911 -77765 -90179 -142258
7793 -142258 -138855 -82642 -412459 -193149 -5354 246651 171974 227184 -102024 -282521 -11253
7781 121950 -57434 -430004 -54270 190664 -186903 -138975 37338 -135295 -227848 -110603 110763
7769 -65697 166232 194327 -298417 -28350 206420 -202931 70744 -71076 6214 -84921 -380146
7758 -380146 -301728 -197830 -275405 -108600 -48711 -228244 166416 373527 -221352 -33424
7747 -7436 207099 138937 -32341 -135871 69865 -71362 125724 98381 -378674 -178617 30267
7735 251315 98859 -13468 -94596 -240562 8725 401332 -90698 -339459 -340295 -190948 88726
7723 143718 159154 206294 -94823 -117991 205046 -181244 169568 -514368 228316 -123542
7712 220238 -216980 19235 -124572 24623 -153228 1910 320996 -180917 75569 120480 142488
7701 142488 157370 343761 323170 -152150 389992 169583 -247823 108902 55015 30219
7691 30219 131670 -212128 -240204 -181111 20022 -344012 -246520 -108601 16715 175090 1094
7679 -206841 -160663 -223466 159631 168911 159276 176816 -103818 -322312 -231105 48537 47794 45672
7667 45672 -55657 -49146 -181870 -303143 241179 -186896 -463362 13853 -349363 -35724 -227173
7656 -227173 190963 -220734 -175498 -8652 119337 -104623 -66868 121406 20804 -90413 -71787
7645 -71787 -97045 37007 35112 252233 11685 -217635 -152836 175504 81828 236033 -78098
7633 -142674 -469576 52054 54805 25625 -9080 -95184 -26784 -241363 -163201 -8608 -261745 -251963
7621 -251963 43505 -185169 220524 43460 292073 -54 -133043 314837 -122600 81372 -69055
7609 277013 10441 -167704 -20527 146877 45089 -199819 -103821 115398 263970 14795 50127
7598 50127 -233818 -2631 -130023 -166298 -46087 -502573 -46560 -179533 -176618 -68459 -434389
7587 -434389 88440 30806 191035 -74260 144144 129660 104976 305334 122513 3675 13313
7576 13313 -138321 199868 -61311 107569 -248766 -175583 91213 -7440 192273 67467 -90997
7564 -267394 -52692 29264 131820 -10744 55542 -50123 323103 -11258 -323186 -59212 -91390
7553 -91390 83699 -313547 203053 -131930 3822 299429 -172276 -189067 -72572 -178655 -120354
7542 -120354 -16938 -56890 249862 -80446 10138 -142149 107502 77356 81474 47270 -564 40041
7529 -9545 -299088 15390 157463 -308276 382 -258864 -208403 -271243 -86489 447272 -45278
7517 168635 -137080 -38332 -259766 -145130 -4796 -327810 -46552 242546 147309 94595 -271762
7505 224757 -55081 -102374 29017 -52522 -109077 -344120 -322937 154957 -17193 -291345 -142569
7493 -56985 -76849 -115323 -262793 -192879 -97412 -143188 47349 -119593 40609 -51570 -37875
7482 -37875 191201 205160 39862 432420 -213483 -50716 -64750 225454 131251 -87150 -102340
7471 -102340 -13285 -334958 1857 -134228 297311 5491 -350291 336975 55671 -18717 -165747
7460 -165747 -75652 248639 -100158 -86677 -20932 -182454 -112358 -101678 156452 253702 -146342
7448 110383 59859 113710 -112676 256973 -31515 -118739 -372238 102704 -28207 954 -134172
7436 -72923 -169612 133075 115537 -262625 7549 -549844 -207319 -114790 -75805 28640 -256808
7424 -49071 55888 -48263 -28955 -266422 86689 -227850 175354 -144199 -188626 -185688 -31110
7412 67780 140225 -98081 -148111 -20524 242936 -187417 -147004 -56228 308516 -73636 139278
7400 91972 -21650 -50541 54681 -52740 272112 62139 -232912 75029 -37508 219232 -62942
7388 64088 -281254 -149734 184178 -142262 -146596 85035 71302 77110 205998 -18059 235509
7376 174729 -269226 -309493 24850 110842 88670 -51307 -322887 170959 165132 145549 91998
7365 91998 325387 15764 -54347 -27843 -54648 -90315 -94515 5692 -62473 -155633 -191373 15371
7352 125039 -5584 15098 76420 -125994 -295722 -119584 -137489 -454346 -209468 -100778 40341
7340 176088 -219468 -85579 16139 -15979 -111128 233456 -310971 -143027 -2545 -264072 -21413
7328 -100004 -129065 73698 -2161 21695 139496 485 257392 -39316 -412887 329333 229088
7317 229088 206740 -200357 -33338 -123750 143378 150715 -8507 149125 -141083 38752 -11278
7305 -21464 218987 -252294 -139227 140898 -196381 89416 134099 132657 82211 -12508 3858
7293 235832 -36887 294409 177119 163691 116426 -81862 -208787 215232 -147867 225662
7282 106171 74136 -65193 96796 -79960 -150871 11930 -213829 176591 67109 -77913 -279168
7271 -279168 -102702 149802 193391 -222018 175916 32990 197004 208150 -246160 -112414
7260 15534 -79750 -9816 -134818 107505 -104189 42645 -139079 -247795 11996 -286958 197603
7248 -197055 24685 211731 -121794 44856 69132 -354153 397500 -38873 -86065 89716 30473
7236 -128051 -166911 123046 17388 -123557 -253703 -282463 -179349 50817 106798 245098 83275
7224 -167571 422673 113704 -233136 -63584 134367 -112337 -55872 122590 159159 -257146
7213 2912 -398407 -83406 -251735 -142631 55384 -25553 -327239 -24004 -436830 -244598 -139440
7202 -139440 -196782 -198661 59351 -8618 -272716 -274488 -290058 92423 -232853 -205353 -18078 -51264
7190 -51264 -36158 -60835 -151765 32707 175641 315058 83602 180281 15748 -126594 -141510
7179 -141510 -27510 49278 45799 106631 -155341 -206717 -23582 -69403 -255293 -140258 102687
7167 184146 33745 -63527 109064 -246010 223319 26910 -106092 59792 -104083 18263 -330660
7155 27600 -108180 -737 171452 89918 -14430 213474 -286603 90666 151670 -30798 -28863 -69208
7143 -69208 54507 417417 -120029 -135518 -96664 -414633 -219091 261661 -284807 242825
7132 12368 152159 236742 32886 -131849 20911 20747 -92992 39583 -17389 140174 71512 -218350
7119 -66501 195469 62385 160790 135425 -202834 -4039 -304071 105643 189216 129418 -1765
7107 -13888 -63101 52244 -14020 321925 -73228 -357314 7008 -36216 -400668 24283 -14612
7095 204078 -84199 -331145 -192978 40017 106403 -184292 -177493 154623 -114507 -281595 235383
7083 -117467 -83770 1813 -38746 82725 -17388 21970 -102625 -156579 -130825 -219321 -157889 275928
7070 -453632 -40692 -215176 -201841 -31365 216869 -164869 264924 45809 501824 -13961 361881
7058 -116862 -244811 134002 -256063 90855 -174546 -138639 11739 -43164 55631 192740 78697
7046 259680 -141265 132697 51120 -159355 -276923 140983 -107830 -19954 49210 75213
7036 75213 330439 -185047 204906 -308570 126162 -48365 -134688 -89437 -9822 -92198 -7464
7024 45673 85259 -29514 126550 221199 -122282 125048 174897 -262252 -184476 -70681 93001
7012 134705 -44763 -185380 90412 -54103 -39904 271124 -7724 -430979 118555 -187771 365395
7000 16830 124427 34348 238630 152998 344372 -276279 -4265 152172 -8762 -211938 -72577
6988 -22124 20158 -23291 -85478 116179 8600 92233 220210 -42121 32741 117920 -194823
6976 170783 -185022 217147 -149626 -108097 185569 -45858 -205190 -127014 21894 -7088 -235769
6965 -235769 64164 68739 -108908 -114783 335303 136867 24774 250976 44907 4130 53281
6954 53281 -188200 -35709 -28733 -385051 111242 -314190 -75754 -246282 -221192 -337212 -85381
6942 133925 -12583 275245 -15140 123837 165383 -295890 256504 -190448 -74028 -187080
6932 -187080 174910 36314 -317286 -230780 -112496 104857 3999 -137068 111671 -128900
6921 211497 321403 14528 289945 121324 -171529 -118202 253892 -269229 -24314 -214635
6911 -214635 48638 -353000 373631 107571 -48862 -74464 6651 -227761 191674 11500 371654
6900 371654 -66786 -69902 -358132 -79213 -8097 -8916 3398 28707 20660 290617 -138746 76649
6887 226754 -32918 31050 -169205 177481 -50075 81902 144820 -207323 -21250 -148761 132711
6875 197855 -231508 -191514 -10099 41778 99824 -192103 -30463 54183 -104816 54009 -161428
6863 180871 290009 -38296 167359 -146583 5561 -216199 -30112 196767 -133289 71543 -54362
6851 144769 218005 -14429 -179585 12656 77866 -107536 34411 -287160 212024 -138330 242629
6839 84799 -58623 -132558 211339 10062 -245296 228226 -192642 302657 40901 28157 109414
6828 109414 116832 7937 221486 66695 -451072 310175 -79912 133812 -146198 85398 27470
6816 41749 184875 -14792 -170420 -124393 25004 -70599 -293071 278128 -300841 106334 -269655
6804 -134453 124912 152633 116533 251136 192261 37031 -3751 -87456 -279106 -106064 -302707
6793 -302707 -232511 135266 -141178 307325 -149345 -122066 2717 -119403 -52202 82203 974
6781 -35951 -392497 -86449 193967 39487 -95171 -164611 -68170 -286495 46996 258136 151595
6770 151595 24666 -295694 130717 -217563 -131751 -160632 -636 -51258 24509 -107223 -254941
6759 -254941 -148902 -87061 -78824 -244459 21627 -308955 -326840 -58715 229909 60223 -147769
6747 427774 27781 53619 -161610 -228971 150817 31257 -58306 466324 70709 75683 76088 79636
6735 79636 -2785 -144779 -208730 -61943 289781 -72164 -303130 -1338 394396 -193660 221799
6723 -50254 90102 -107615 94343 -76680 -3289 -198347 -13578 -284914 113119 42830 -125568
6711 -281715 180257 157600 45202 73833 799 62276 36280 38757 -7913 155081 52787 -8457
6698 -29318 3463 -73809 -78963 -149874 -7319 -97516 203028 233375 18179 -225230 -47567 43314
6685 -180882 310046 44518 -156970 187506 -88484 -151282 -295808 -91739 -211488 -141580 167495
6673 -201861 209826 -33892 -19575 178952 -77213 172856 6762 8704 -379220 206200 69744
6661 -27131 4764 -43075 190029 -336791 208125 -1770 172641 22231 -16114 50652 -24030
6649 -127 106285 7568 -118541 -11382 130540 290116 16630 -44487 60410 -18688 225804
6637 17368 97175 -143202 46459 -233230 258616 -19667 -101640 153350 -98588 -47791 -80920
6626 -80920 49232 277733 -5520 -120611 220760 -27257 -16212 34095 -369770 -268949 85039
6614 -50976 -139392 -102678 150225 218512 -31666 -235007 -93547 -25086 169174 -73153 129054
6602 295111 49733 148955 -233495 255814 195534 -109550 -145769 -140609 -68212 117677 49300
6590 86169 -113207 -155160 -103525 -93634 -24007 69201 140243 -175322 66850 -146800 -164389
6579 -164389 -94292 228706 -98470 -58259 177748 199329 28093 234468 -299016 -226110 -28539
6567 -173612 72984 29446 -26687 -44568 -159568 -121440 -58076 -114371 299546 12154 139728
6556 139728 -174929 309 76537 93317 123303 -32084 -215083 -118033 -20601 69635 -179706
6544 -54136 -99216 248334 244378 -84664 52276 263214 -74417 -152861 41121 89474 -135380
6532 -190093 93649 -223103 -131036 -395276 -272170 -51724 76619 -13233 -165881 -337717 -128300
6520 34745 10937 -160417 -114891 150229 131483 77709 -43773 -45573 -100974 -89703 54813 137048
6508 137048 88930 286053 -185177 -28451 63690 40621 27392 -70378 194317 37052 -193106
6496 -105679 -277717 64714 -181432 119978 -10240 326821 44229 -218414 -40146 -134730 -157860
6485 -157860 188104 17913 376918 -19052 -187680 146700 -203342 -254011 -99293 74350 -71574
6473 170960 129601 -144237 44532 -51775 166028 -139177 271880 -203939 -153282 -236537 185968
6461 -34577 -111987 -51750 21896 -142319 -131616 -142001 77816 -481994 -62982 16565 4240 142410
6449 142410 -65958 47949 -254556 -305099 -255345 -188182 -266632 198903 -39259 -24884 -124831
6438 -124831 -174989 -1389 219694 -80562 51962 299455 -97067 160339 -16916 154155 19543
6426 108888 -97388 -42394 -138450 -94811 -126139 12304 126285 -180496 -19308 -208768 242858
6414 -44747 -391073 -45522 -24400 17790 161679 514537 88359 200327 -51081 52400 59406
6403 59406 7512 160181 -59261 35094 -17830 -189796 -117810 25737 253175 -27816 -290417
6392 -290417 -124684 -23773 262836 97859 -47636 124636 1167 -53875 -16523 10950 121768
6381 121768 157468 -163188 125751 121142 73843 107137 33609 -155254 -106456 67683 -241397
6369 194634 -226235 69277 -71134 -145195 -159954 237590 -14514 189969 102813 -144303 -122653
6358 -122653 10118 52137 -294714 -69315 -99771 126719 -208744 -18692 -7905 -136890 94800
6346 -34295 -62824 -44602 -159087 -112119 27158 92494 407913 98350 112676 -56965 -30878
6335 -30878 69084 -68429 -63594 106584 25025 37915 -97752 -132517 -281345 -294614 -18205 250746
6322 -96022 -59052 49597 -55567 -120099 255962 -166356 -13296 -74979 235959 -17754 108770
6310 227957 -65995 -64891 -39954 -285587 12796 -207443 43875 -62992 -49387 -98369 78418
6298 -145386 9107 -185761 50015 -86271 100024 37426 381309 -78227 -72475 -211831 -160927
6287 -160927 90362 -221642 -245069 65346 207242 57030 134587 -235861 202661 117362 -107128
6275 -25667 -228784 -16448 -104989 76940 -149743 -84527 841 115129 -252843 -57537 75458
6263 22337 177930 -229253 -222659 -184978 -160733 -276836 211948 41525 277428 177062 60256
6251 53707 178066 -176551 -134037 36086 43182 -41256 -73254 -75650 209293 51208 -325895
6239 179818 -496493 -104194 150937 -70375 -173295 88039 -67343 -58586 -16253 -139134 -116123
6228 -116123 18678 -97824 -235834 147480 154877 106692 -134854 -194152 -182787 58188 47415
6217 47415 -192186 -32293 183525 -48322 -243813 -242365 79114 -3372 -189957 194619 -153521
6205 73820 90977 -73801 -159169 -14365 -217812 -120016 5661 -154723 356712 -160475 209121
6193 70434 -1911 -109072 102790 -152406 64747 -49747 22091 29410 90758 -118347 163243
6181 -249484 -221486 294696 -50049 155593 90005 -74894 -281909 230048 -120359 83420 -159788
6169 -284603 219904 -59633 -180514 -260367 4974 290450 185799 99470 250035 -190606 377427
6157 -67324 66334 -278512 -138455 -122312 30610 54602 -91300 -7709 -331243 -72379 -163404
6146 -163404 106267 -17581 -13158 -1610 107629 -11022 94891 -364259 -105120 -165599 -128778
6135 -128778 -3378 125194 404411 -79992 187560 -92166 -38316 101560 103498 -9333 113557
6123 -76834 -49380 -417173 -114865 -53591 239932 -30723 -258701 -411921 222260 156744 -14932
6111 88123 68564 -198923 -75414 340525 -184965 67302 -10756 -54890 34587 -94933 -32788
6099 384218 -128840 232419 -43915 185992 77396 -122920 -83469 -85988 -70529 80240 -419130
6087 -100363 209529 -351238 -124250 -163794 -28770 65292 126048 -316119 33522 -81217 150011
6075 -367862 -211178 -25885 488717 199739 -27097 -145533 228423 28263 137198 312531
6065 312531 65826 31730 -397457 -124839 -47526 -317835 254091 196872 -205768 1877 -114431
6053 50454 -69722 9843 -155611 -307532 -136157 -53436 17873 -112597 306754 197507 -154579
6041 185268 127109 43298 256765 50412 -247225 218731 -44088 -120505 156660 -137211 3373
6029 121607 -91840 -37009 -163315 43883 -158219 107275 -256896 -37668 358893 -299913
6018 23650 6484 -31456 297357 -407226 -99441 -110696 29269 -165949 179091 -97530 -85100
6007 -85100 -135927 -207360 73701 97809 -34464 -87293 -60983 -154978 -150338 140604 -107305 257560
5994 -47996 403100 22241 -311873 149574 18466 78710 -9717 -215746 39785 153182 117204
5983 117204 -44732 7475 -7049 -356431 -13757 -45273 -42812 203250 -278113 -576765 -17305
5971 56813 -121692 -245360 233800 -111867 -80646 52331 -53925 -172247 58219 -145464 37375
5959 244328 -223195 119740 -224119 -250607 117326 -85193 109145 -303083 -212851 48189
5948 -127755 259712 -51753 221050 -131913 108649 12151 -25225 1091 -16536 265590 150842
5937 150842 -38027 224942 96018 -115152 -19540 17348 59770 -112513 -288923 -65825 40571
5925 43740 -178105 -30820 -13271 57573 -85804 -90580 51285 100671 101597 -49012 -28476 -235766
5913 -235766 164407 179220 -75772 108942 -316731 -437483 -89238 -105948 59109 -72724 -152079
5902 -152079 208566 -157164 122055 -142875 4370 -59342 -190175 179799 38662 66829 30667
5890 77249 -49601 207622 -357858 -154120 90472 -68052 -163483 -126530 253929 51147 366028
5879 366028 135230 277867 -126551 80807 25072 -330933 73074 -19997 4923 -57957 143384
5867 111027 -99092 -257632 -68644 84967 -60404 -187725 -116597 119552 168901 33543 46581
5856 46581 -48093 -134149 45983 -146489 115045 -135596 -113387 -144312 -196764 -111922 103327
5844 -143126 -374514 -99601 -223497 -135311 107825 -138015 297384 242183 242082 59140 -49940
5832 -27660 -168648 -70708 381119 186169 -4904 77814 81525 -137368 104385 -101947 -88116
5821 -88116 112179 -246282 84634 140293 -43766 -75363 98742 211671 -47463 55270 129243
5810 129243 -41364 -248324 -116362 93549 -10258 206587 -63891 -37414 -116752 -292684 62830
5798 53700 -32904 179502 -322 61447 -84563 -298972 -1047 -10762 -365984 -6074 115824 -169676
5785 -4293 -70067 -95667 -122310 171801 -221701 -229446 -40299 -123235 -11219 -163594 -349017
5774 -349017 -168533 -258552 71522 -60479 -240680 -47752 -17982 -75488 -6353 -38692 -129919
5763 -129919 4316 -13618 38072 160407 -55613 -375748 -46958 188974 74885 78825 119658
5752 119658 -135505 353406 74761 170328 -13800 -144 47104 -167513 7472 71708 97996 123120
5740 123120 -212273 134991 -210517 -125407 -74150 -84038 -261915 59966 -133833 193393 -170744
5728 155313 124499 45242 -98988 49022 -193070 -778 207564 46619 123699 -37726 348695
5716 21424 -291479 124698 -193074 23570 165830 96719 12352 125392 -556141 1263 -237669
5704 28844 38419 -157370 -20433 217788 -157329 -44023 -105056 204355 274649 -41682 -80302
5693 -80302 -389622 121751 252801 98178 -11619 146734 160237 176707 4135 -114275 194594
5681 -112368 -174751 410823 -92024 -114768 245000 897 140859 -88060 69631 -216471 -25668
5669 -178981 -111484 -149310 -12389 92749 -85935 -61516 -8952 376732 522299 -111302 399423
5657 225122 16283 121197 -120197 -235208 -37587 -299674 366319 7932 -257583 -1913 75360
5645 320334 420152 81473 -49685 4558 -90245 121355 345227 268075 306916 105027 13496
5633 -59213 76364 -11089 68219 34213 -341173 287726 135652 31402 -31574 12267 -383682
5621 192179 -39117 6641 32580 -72427 -187893 85455 -377998 -207634 -122901 -53246 222862
5609 94719 15497 -194381 43537 -172170 -5772 -26776 233878 18802 -146923 28196 121198
5598 121198 308643 327224 198293 -47495 -193538 171513 -128342 65921 -177888 24783
5587 -15514 -194716 59886 156084 -170995 24663 129711 32709 -324599 -76469 53711 -244266
5575 213810 -300614 -12369 177383 -133533 35196 -16897 -268771 254654 36927 82088 58037
5564 58037 -265372 101226 1350 21156 -152679 -171606 -162551 -156732 23285 145241 34171 227877
5552 227877 -65369 -168624 -156078 29670 -168159 355335 106867 -123350 256487 -191030
5541 -185144 -42422 -183099 -298380 342969 98259 -56469 -105073 -123164 336388 58801 -159733
5529 -223792 161207 97890 194890 188512 104745 74014 68608 36517 -43714 17507 162690 121710
5517 121710 -150712 -137756 -43441 -118114 -179794 -167847 26750 21568 200963 46084 -83279
5505 -46550 129166 -144 173780 200082 -152361 -163510 224638 -4769 117594 338367 -292347
5493 271543 59658 -49421 5406 -125706 -25050 -11708 -43378 58629 207761 -90266 -103141
5482 -103141 46525 16083 -53916 -170530 -116027 -122975 120994 150026 -138445 -192237 300054
5470 -153296 -113832 25154 254935 -16326 -108609 -146099 39335 34654 29003 26719 -231751 187069
5457 126321 184560 211841 -22388 133770 -212608 -97252 34834 78500 43983 -126129 -140372
5446 -140372 120022 335817 -18105 -230307 -18337 230151 372775 462371 217597 -61799
5435 -84667 -55791 76421 485012 -52553 -359612 -21652 -159234 -261824 267050 -86736 120535
5423 45897 113214 51542 151916 101235 67 -120499 225383 -258183 304769 47081 -285297
5411 70995 95700 63138 346 -99439 304343 -267551 39450 -156034 309186 44676 -130910
5399 -342579 58622 129392 -123562 -40770 -204129 6856 -12784 222822 73038 -44633 137786
5387 -203202 -151628 332796 -20724 196059 62654 241162 10430 -99471 17078 -93840 -253116
5376 -253116 144903 -276758 -328735 130362 -119773 186837 132052 -178582 78446 198958
5366 198958 -57760 -188167 -62904 128565 -305758 207832 7618 9043 30509 -192138 -63732
5354 -184889 -205112 -22045 109568 32012 -45847 175583 -138644 56986 111466 -198056 224993
5342 71510 63328 1181 156674 16477 -148107 -183311 -316035 -50866 41238 -27633 -57072 118331
5329 53190 -319362 270983 -164198 1723 -126033 -93395 -294530 282282 108511 -295589
5318 -69314 -199419 116754 180082 -155874 -500923 -212139 162125 175250 -334069 -50557
5307 178396 -246224 -95016 52455 -82624 86304 100241 144038 153807 45938 -391934 -57176
5295 -30806 -372805 70002 206082 58775 -59148 211620 -157019 -227654 -271100 -494567 163895
5283 -73276 195522 73234 21681 -169333 322046 13695 -301463 -256063 -84887 -356016 -4854
5271 353387 -298547 -195670 -373750 -250745 -8550 23771 154020 270721 161113 106866
5261 106866 -69838 172838 -206472 166493 135878 123490 -162528 -179564 -168692 -38185 146394
5249 54361 -4087 192284 37186 42421 192734 220301 -154660 -26600 159011 132973 74732
5238 74732 283767 296556 39940 -187822 -192623 286441 241116 37037 193675 36341 231073
5227 231073 -13483 -47122 64050 -109208 -30236 118647 112846 38886 -64522 83761 154021
5216 154021 -88055 -214263 -227606 -224719 193090 45028 -45665 -97914 -207532 124841 -114222
5204 -52515 -50592 286036 61378 190999 -76551 78141 362317 228163 -155530 -214161 -48081
5192 165096 72059 -241312 245339 -38425 202162 -245212 -359912 177218 111734 230949
5182 230949 -328233 -91820 -113576 -145574 -112425 -57386 -39094 334978 -73359 177275 279974
5171 279974 31483 162130 102945 38925 -181207 -135418 253364 -1461 132521 181423 -161721
5159 -270873 -1110 288328 -129232 73307 -164273 161895 385097 57469 -60910 -19923 453615
5147 140245 82308 -172212 -59119 -47617 56606 -330989 45022 -234046 39086 -30772 -1412
5135 -168421 -70003 -115848 -600 -274058 -67919 -20907 94397 -195879 50901 259494 5921 -68256
5122 171394 47519 106034 -10924 -211435 56330 23277 136450 -425959 458923 -38893 -226289
5111 -226289 83634 -44614 -210143 59462 -387508 257191 -114420 132541 -349891 -29096
5100 -248326 -95357 -38543 174475 117195 -15767 -259642 -130376 -154373 -8603 7018 -116643
5088 -13 -309075 105598 139734 -58513 -145228 -117653 219016 -663 233036 120020 -129412 126904
5075 -189227 -69495 79254 -213170 153209 79748 -239507 19171 -32255 1328 -230193 466674
5063 -21054 87343 -115425 -110930 -29130 -24350 -103177 -130807 -209052 68912 -46281 -80129 1696
5050 -107709 74373 -27869 77703 41696 -145273 -197341 64666 -205890 312182 276803 -157426
5038 -363986 -141913 21485 257470 171475 7111 -254834 52936 316758 -205001 65080 -85039
5026 -33017 301683 33643 111396 218746 -107460 -65775 -144818 185394 -220183 303347 -438999
5014 -161716 -59631 30830 -19365 46982 15801 175133 -198338 149836 -63158 -47849 -46754
5003 -46754 -237858 -180749 -19628 213961 286762 -17978 546442 53955 15238 84889 -55666
4991 -204867 66772 30337 180886 18451 30513 -6950 225383 -48167 -15785 266667 -99199
4979 -126466 -254686 -157623 149627 212569 -163241 29456 6834 -156710 94141 266697 36333
4967 -63069 -89342 374420 135236 -85682 -234730 -112123 43053 -256575 36302 117499 46997
4955 -104880 61223 -42215 134069 175614 38610 -170566 382093 161970 -172944 127457
4944 21189 28284 -188610 96478 -222195 79372 -14772 312891 242099 -29261 -51195 -75299
4933 -75299 -5925 11688 -55427 117505 -497113 83376 -132937 22798 -54918 141933 -330766
4921 81010 -140174 6199 239948 -159017 -335689 -254022 -60019 30690 -115679 141655 208508
4910 208508 -1765 125824 204188 123443 -135714 1773 -199988 105766 -117810 -2582 73454
4898 -60372 37084 158888 -156792 -13186 -248101 44437 -265267 221205 -68852 28426 154680
4887 154680 -78328 72358 38579 314059 31521 -142337 -55209 -33721 -113018 189816 216028
4876 216028 61593 -36942 241000 214636 -136860 -118355 -68387 -144918 97846 -96869 -77641
4865 -77641 -3038 -200154 -68022 220245 387416 284730 113351 199866 -63416 -57298 -221712
4854 -221712 -162137 -283236 193001 -128768 241622 62150 -3236 -35173 -14484 95768 -132889
4842 -91266 -41049 71203 -184267 -61132 -363822 9224 -59423 161386 -67746 -4073 -68790 71219
4829 -117695 63936 122366 223226 105774 71458 -201975 -31362 -230131 -202173 -123880 212184
4817 12466 32564 119676 96801 286767 -142164 -263035 23003 64027 84624 18105 92601
4806 92601 42128 90671 113096 175520 -277887 173189 151499 -125662 31096 145399 8401
4794 191375 220672 -71972 -113325 -76108 249951 119236 -53164 -102492 66211 -140367 288763
4782 -112961 -121829 -99111 -130852 74225 1231 172836 -69209 -119470 118489 146390 201215 450242
4770 450242 -246771 -103388 422289 -286275 -178399 194898 75752 -32078 57565 -98497
4759 -143953 -315958 330085 229230 84724 176989 -157651 -94029 -426681 -190043 324930
4748 -96461 182910 -25191 -204247 128105 -75802 -232885 139635 -6808 222578 56 203680
4737 203680 -93286 -59937 -157541 -81896 -109439 -3256 13051 -355126 -189843 283786 -5151
4725 -27156 108353 60155 157925 -61094 82928 -46134 161705 -41100 -219550 128566 347850
4714 347850 -40053 78667 98754 97529 73682 20040 409458 75544 269253 -81749 31430
4702 41580 -131690 86833 -120188 -50190 296077 14800 -7877 -6081 -152827 18119 1487 -395669
4689 85444 67431 245974 -65900 206309 -81436 206571 191953 -278262 53800 -189099 63027
4677 146478 -60289 -60127 108644 26472 -116604 -134706 -286554 66297 83576 -60101 6779 313960
4665 313960 36040 -468001 129894 -89206 -68436 41164 49774 -260204 191301 2867 -98772
4653 -132133 -258047 253760 -114190 144827 75976 337208 199173 -19965 95967 -87861
4642 -83713 -253699 46349 132262 41284 -134009 105589 -108033 -132401 49976 198445 165167
4631 165167 -335004 -217221 103156 -38650 -543601 -263767 -180130 -113216 -13963 -29063 -61083
4620 -61083 -137884 116942 196903 -108640 -289116 -26935 -241126 32623 59528 117564 144315
4609 144315 -55803 -275881 166195 67121 12077 135527 -108245 66054 98939 50830 202316
4598 202316 -257583 -99194 -131765 -121106 -48381 163956 47817 111401 175496 534690 -57168
4586 -74568 -51777 -205823 275187 36423 -43001 207813 -113415 -14764 133842 227648 85759
4574 85000 -266430 -13771 -229904 72344 3105 35953 115397 -101093 -69386 -175914 45536
4562 236961 -4745 -87242 67353 206420 -323722 -134522 149423 176987 -353284 328057 -12358
4550 -50378 293281 -146142 39037 54708 264951 101940 71969 -107146 150175 212006 180300
4539 180300 26959 -80729 204508 191289 165256 123079 -43576 -160861 17056 -25411 58175
4527 -233440 78012 -152619 -63868 -404162 88121 275056 130065 212463 -281054 -167343
4517 -167343 115458 -27917 260604 -49680 -120306 -35223 52145 -86121 82228 127605 108904
4506 108904 -105201 -59200 118141 -12280 -198775 79273 -101230 -49631 147513 -144296
4495 -182437 -224900 -54847 -191369 -10587 47984 201105 -212156 -34575 49956 138141 7820
4483 258894 -149936 240062 -160630 -153417 -104193 248403 -161154 -243130 -32096 25804 -24298
4471 147741 91322 43848 6693 376059 199439 -6827 159047 -25598 45106 -258928 -257828
$$ [...]
##END NTUPLES=NMR SPECTRUM
##END=
