##TITLE=NES1062_ptc150_9883053_uy56wyng8z
##JCAMPDX= 6.0         $$ Bruker NMR JCAMP-DX V2.0
##DATA TYPE= NMR SPECTRUM
##DATA CLASS= NTUPLES
##ORIGIN= BRUKER
##OWNER= Administrator
$$ 1.72 TOPSPIN		Version 2.1
$$ 2016-08-26 22:35:31.648 -0500  Administrator@X
$$ Compression mode = diff/dup
##.OBSERVE FREQUENCY= 400.02188249412
##.OBSERVE NUCLEUS= ^1H
##.ACQUISITION MODE= SIMULTANEOUS (DQD)
##.ACQUISITION SCHEME= undefined
##.AVERAGES= 64
##.DIGITISER RES= 22
##SPECTROMETER/DATA SYSTEM= spect
##.PULSE SEQUENCE= noesygpps1d.comp
##.SOLVENT NAME= COFFEE_meoh
##.SHIFT REFERENCE= INTERNAL, COFFEE_meoh, 1, 14.96049
##AUDIT TRAIL= $$ (NUMBER, WHEN, WHO, WHERE, PROCESS, VERSION, WHAT)
$$ ##TITLE= Audit trail, TOPSPIN		Version 2.1
$$ ##JCAMPDX= 5.01
$$ ##ORIGIN= Bruker BioSpin GmbH
$$ ##OWNER= Administrator
$$ $$ E:\/data/COFFEE/nmr/NES1062_ptc150_9883053_uy56wyng8z/12/pdata/1/auditp.txt
$$ ##AUDIT TRAIL=  $$ (NUMBER, WHEN, WHO, WHERE, PROCESS, VERSION, WHAT)
(   1,<2016-08-26 22:35:26.461 -0500>,<Administrator>,<X>,<go>,<TOPSPIN 2.1>,
      <created by zg
	started at 2016-08-26 22:23:57.086 -0500,
	POWCHK enabled, PULCHK disabled,
       configuration hash MD5:
       21 0F 79 D6 B3 7B B4 F6 88 20 88 DB 03 48 BD 9F
       data hash MD5: 64K
       0F 79 F7 BF 16 37 F1 1E 53 44 52 0A B7 23 94 7B>)
(   2,<2016-08-26 22:35:29.554 -0500>,<Administrator>,<X>,<proc1d>,<TOPSPIN 2.1>,
      <Start of raw data processing
       efp LB = 0.3 FT_mod = 6 PKNL = 1 PHC0 = 0 PHC1 = 0 SI = 128K 
       data hash MD5: 128K
       63 CC 8C 7E CA E5 7D 8E 07 48 EC E8 D7 71 A6 3E>)
(   3,<2016-08-26 22:35:30.445 -0500>,<Administrator>,<X>,<proc1d>,<TOPSPIN 2.1>,
      <pk PHC0 = -84.79797 PHC1 = 0 
       data hash MD5: 128K
       7C 3B DC DD 9C C4 96 64 66 D8 6C 37 60 DF 63 7E>)
(   4,<2016-08-26 22:35:30.820 -0500>,<Administrator>,<X>,<proc1d>,<TOPSPIN 2.1>,
      <abs ABSG = 1 
       data hash MD5: 128K
       B5 86 16 CF 76 2E 83 7F 43 CD A8 9C 9E DD 60 DC>)
(   5,<2016-08-26 22:35:30.929 -0500>,<Administrator>,<X>,<proc1d>,<TOPSPIN 2.1>,
      <abs ABSG = 2 
       data hash MD5: 128K
       3B 51 61 73 A7 35 E5 FA 4B 55 3A 7D A9 FB B7 9F>)
(   6,<2016-08-26 22:35:31.008 -0500>,<Administrator>,<X>,<proc1d>,<TOPSPIN 2.1>,
      <abs ABSG = 3 
       data hash MD5: 128K
       E3 B5 F9 D4 69 B2 1D BC F8 08 5D CD 9C F0 9B 7F>)
(   7,<2016-08-26 22:35:31.101 -0500>,<Administrator>,<X>,<proc1d>,<TOPSPIN 2.1>,
      <abs ABSG = 4 
       data hash MD5: 128K
       2F 6C 26 AE 9A 26 53 CD E2 A3 D2 7B 9A 92 7E 96>)
(   8,<2016-08-26 22:35:31.226 -0500>,<Administrator>,<X>,<proc1d>,<TOPSPIN 2.1>,
      <abs ABSG = 5 
       data hash MD5: 128K
       3F 6B 5B F1 A1 39 F9 38 62 1B 7E D6 3D E8 86 AB>)
$$ ##END=
$$ 
$$ $$ hash MD5
$$ $$ F4 F4 DA 81 4E 9A 3B 8B 8F E8 8F 0B 2B C6 74 86
##$RELAX= 
##$RELAX= 
##$RELAX= 
##$RELAX= 
##$RELAX= 
##$RELAX= 
##$RELAX= 
##$RELAX= 
$$ Bruker specific parameters
$$ --------------------------
##$DU= <E:\>
##$EXPNO= 12
$$ [...]
##$TP07= 0
##$TPNAME0= <>
##$TPNAME1= <>
##$TPNAME2= <>
##$TPNAME3= <>
##$TPNAME4= <>
##$TPNAME5= <>
##$TPNAME6= <>
##$TPNAME7= <>
##$TPOAL= (0..7)
0.5 0.5 0.5 0.5 0.5 0.5 0.5 0.5
##$TPOFFS= (0..7)
0 0 0 0 0 0 0 0
##$TUNHIN= 0
##$TUNHOUT= 0
##$TUNXOUT= 0
##$USERA1= <user>
##$USERA2= <user>
##$USERA3= <user>
##$USERA4= <user>
##$USERA5= <user>
##$V9= 5
##$VALIST= <valist>
##$VCLIST= <CCCCCCCCCCCCCCC>
##$VD= 0
##$VDLIST= <DDDDDDDDDDDDDDD>
##$VPLIST= <PPPPPPPPPPPPPPP>
##$VTLIST= <TTTTTTTTTTTTTTT>
##$WBST= 2048
##$WBSW= 25
##$XGAIN= (0..3)
0 0 0 0
##$XL= 0
##$YL= 0
##$YMAX_a= 5973720
##$YMIN_a= -11241270
##$ZGOPTNS= <>
##$ZL1= 120
##$ZL2= 120
##$ZL3= 120
##$ZL4= 120
##$ABSF1= 14.96049
##$ABSF2= -5.597692
##$ABSG= 5
##$ABSL= 3
##$ALPHA= 0
##$AQORDER= 0
##$ASSFAC= 0
##$ASSFACI= 0
##$ASSFACX= 0
##$ASSWID= 0
##$AUNMP= <proc_prof1d_extract.lims>
##$AXLEFT= 0
##$AXNAME= <>
##$AXNUC= <1H>
##$AXRIGHT= 0
##$AXTYPE= 0
##$AXUNIT= <>
##$AZFE= 0.1
##$AZFW= 0.1
##$BCFW= 0
##$BC_mod= 0
##$BYTORDP= 0
##$COROFFS= 0
##$CY= 15
##$DATMOD= 1
##$DC= 0
##$DFILT= <>
##$DTYPP= 0
##$F1P= 0
##$F2P= 0
##$FCOR= 0.5
##$FTSIZE= 131072
##$FT_mod= 6
##$GAMMA= 0
##$GB= 0
##$INTBC= 1
##$INTSCL= 1
##$ISEN= 128
##$LB= 0.3
##$LEV0= 0
##$LPBIN= 0
##$MAXI= 10000
##$MC2= 0
##$MEAN= 0
##$ME_mod= 0
##$MI= 0
##$NCOEF= 0
##$NC_proc= -2
##$NLEV= 6
##$NOISF1= 0
##$NOISF2= 0
##$NSP= 0
##$NTH_PI= 0
##$NZP= 0
##$OFFSET= 14.96049
##$PC= 1
##$PHC0= -84.79797
##$PHC1= 0
##$PH_mod= 1
##$PKNL= yes
##$PPARMOD= 0
##$PPDIAG= 0
##$PPIPTYP= 0
##$PPMPNUM= 2147483647
##$PPRESOL= 1
##$PSCAL= 4
##$PSIGN= 0
##$PYNMP= <proc.py>
##$REVERSE= no
##$SF= 400.020009838684
##$SI= 131072
##$SIGF1= 0
##$SIGF2= 0
##$SINO= 400
##$SIOLD= 131072
##$SPECTYP= <>
##$SREGLST= <1H.CDCl3>
##$SSB= 0
##$STSI= 131072
##$STSR= 0
##$SW_p= 8223.68421052631
##$SYMM= 0
##$S_DEV= 0
##$TDeff= 65536
##$TDoff= 0
##$TI= <>
##$TILT= no
##$TM1= 0
##$TM2= 0
##$TOPLEV= 0
##$USERP1= <user>
##$USERP2= <user>
##$USERP3= <user>
##$USERP4= <user>
##$USERP5= <user>
##$WDW= 1
##$XDIM= 131072
##$YMAX_p= 391307684
##$YMIN_p= -10979
##$CURPLOT= <Network HP LaserJet P1505>
##$CURPRIN= <$Network HP LaserJet P1505>
##$DFORMAT= <normdp>
##$LAYOUT= <+/1D_H.xwp>
##$LFORMAT= <normlp>
##$PFORMAT= <normpl>
##$SURQMSG= 1
$$ End of Bruker specific parameters
$$ ---------------------------------
##NTUPLES= NMR SPECTRUM
##VAR_NAME=  FREQUENCY,     SPECTRUM/REAL,   SPECTRUM/IMAG
##SYMBOL=    X,             R,               I
##VAR_TYPE=  INDEPENDENT,   DEPENDENT,       DEPENDENT
##VAR_FORM=  AFFN,          ASDF,            ASDF
##VAR_DIM=   131072,        131072,          131072
##UNITS=     HZ,            ARBITRARY UNITS, ARBITRARY UNITS
##FACTOR=    0.0627417313425164, 1,          1
##FIRST=     8223.62146879497, 1738,         -51686
##LAST=      0,             2905,            -51355
##MIN=       0,             -10979,          0
##MAX=       8223.62146879497, 391307684,    0
$$ Real data points
##PAGE= N=1
##DATA TABLE= (X++(R..R)), XYDATA
$$ [...]
63973B80553P725P448P412P652P803P860Q168Q835R570J0172J0803J1635J2531
63960C98167J3294J4120J5557J8015K1398K5268K9288L3529L8481M4822N3009
63949G04948O2916P3796Q4665R4945J04716J14355J23933J33037J41160J48035
63939A786506J53449J56863J57395J54257J47126J36201J22148J05910Q8214O9077
63929C077146M8099K5405K036k0957m3448o5739q7185j06007j20783j31613j39452
63918B437502j44723j47136j46631j43827j39378j33436j25966j17246j07724
63909A231435r7630q7114p6668o7101n8965n2157m6156m0530l5183l0225k5799
63898F13907k2017j8969j6668j4907j3282j1463r513p867o952o769o854o595n646
$$ y = [280553, 288278, 295726, 303138, 310790, 318593, 326453, 334621, 343456, 353026, 363198, 374001, 385636, 398167, 411461, 425581, 441138, 459153, 480551, 505819, 535107, 568636, 607117, 651939, 704948, 767864, 841660, 926325, 1021270, 1125986, 1240341, 1364274, 1497311, 1638471, 1786506, 1939955, 2096818, 2254213, 2408470, 2555596, 2691797, 2813945, 2919855, 3008069, 3077146, 3125245, 3150650, 3152686, 3131729, 3088281, 3022542, 2935357, 2829350, 2708567, 2576954, 2437502, 2292779, 2145643, 1999012, 1855185, 1715807, 1582371, 1456405, 1339159, 1231435, 1133805, 1046691, 970023, 902922, 843957, 791800, 745644, 705114, 669931, 639706, 613907, 591890, 572921, 556253, 541346, 528064, 516601, 507088, 499221, 492269, 485500, 478646, 472051, 466405]
63885D66405m153k586j297k22R43K290L651M970O511Q464J0505J2083J3187J4474
63871E35225J6434J8651K0183K0583K0167J9263J7709J5384J2938J1376J0866
63860G18779J0372Q753O018L156R10r88l280o245r466j2418j4997j7386j9545
63847F63663k1077k1700k1681k1580k1616k1520k1060k0408j9871j9473j9021
63836D34656j8464j7853j7130j6179j5070j3986j2976j2030j1317j0963j0656
63825B78032r827q401o939n953n363m887m539m430m389m194l985l997m052l777
63811B03299l265k999l049k889k164j239o81n42n26n17o08p45p76p71r09j104
63795A80515j053p29m87o23j101j767k380k425j390L77J551J146k39j072p13m
$$ y = [466405, 462252, 459666, 458369, 458147, 459090, 461380, 465031, 470001, 476512, 484976, 495481, 507564, 520751, 535225, 551659, 570310, 590493, 611076, 631243, 650506, 668215, 683599, 696537, 707913, 718779, 729151, 737904, 743922, 747078, 747988, 747000, 743720, 737475, 728009, 715591, 700594, 683208, 663663, 642586, 620886, 599205, 577625, 556009, 534489, 513429, 493021, 473150, 453677, 434656, 416192, 398339, 381209, 365030, 349960, 335974, 322998, 310968, 299651, 288688, 278032, 268205, 259804, 252865, 246912, 241549, 236662, 232123, 227693, 223304, 219110, 215125, 211128, 207076, 203299, 200034, 197035, 193986, 191097, 188933, 187694, 187013, 186471, 185945, 185428, 184820, 184075, 183299, 182528, 181619, 180515, 179462, 178733, 178246, 177623, 176522, 174755, 172375, 169950, 168560, 168937, 170488, 171634, 171395, 170323, 169610, 169606]
63779A69606M8n15r91j137j286j589j669j145j44P68J068O87Q0j78K6K44J19j34
63761A63858j33m6l19q10p47J58J091J074K27m21k85J75L08K34N36J229J607J219
63743A68955N88N77J285K004K220K101J919J511P32K6OO60J419J955K343K548
63727A90849K330J848J745K377L293L850L991M109M386M613M565M231L780L421
63713B39388L232L019K404J249j83j495k442k937k997k816k635k501k381k414
63699B26491k695k775k010n64N88R31J052J517J846J371N89O13J546K391K588
63684B33479K659L107L527L305K568J921J637J516J324J018P14N64O12O76N65
63669B59192M09N16J000J797K867L943M314L557K344J695J435L78j694l379l598
$$ y = [169606, 169654, 169139, 168148, 167011, 165725, 164136, 162467, 161322, 161178, 161946, 163014, 163701, 163781, 163603, 163629, 163873, 163992, 163858, 163725, 163679, 163360, 162550, 161803, 161961, 163052, 164126, 164353, 163932, 163647, 163822, 164130, 164364, 164900, 166129, 167736, 168955, 169543, 170120, 171405, 173409, 175629, 177730, 179649, 181160, 181892, 181918, 181924, 182584, 184003, 185958, 188301, 190849, 193179, 195027, 196772, 199149, 202442, 206292, 210283, 214392, 218778, 223391, 227956, 232187, 235967, 239388, 242620, 245639, 248043, 249292, 249109, 247614, 245172, 242235, 239238, 236422, 233787, 231286, 228905, 226491, 223796, 221021, 219011, 218447, 219035, 219966, 221018, 222535, 224381, 225752, 226341, 226954, 228500, 230891, 233479, 236138, 239245, 242772, 246077, 248645, 250566, 252203, 253719, 255043, 256061, 256775, 257339, 257951, 258627, 259192, 259601, 260117, 261117, 262914, 265781, 269724, 274038, 277595, 279939, 281634, 283069, 283447, 281753, 278374, 274776]
63654B74776l184l567m648n164m688l986l572l177k782k882l318k941j186Q45
63640B30526J722J527J427J840K116K002K273L420M591M622L700L149L704M721
63626B71340N295N391N538N932O417P036P930Q839R337R601J0347J1860J3616
63613C78479J5126J6602J8429K0477K2402K4357K6797K9689L2360L4203L5134
63602F54055L5251L4315L1812K7447K1580J5154R105L867m46l529n056n454n914
63589H12187p256r160j0974j2833j5329j8370k1121k3076k4485k5641k6378k6480
63577E91084k6024k5078k3528k1438j9131j6713j3912j0746p865n817m327k743
63565D13762r37O65J855K926M217N741P267Q539R401J0019J0883J2352J4168J5810
$$ y = [274776, 271592, 268025, 263377, 258213, 253525, 249539, 245967, 242790, 240008, 237126, 233808, 230867, 229681, 230526, 232248, 233775, 235202, 237042, 239158, 241160, 243433, 246853, 251444, 256066, 259766, 262915, 266619, 271340, 276635, 282026, 287564, 293496, 299913, 306949, 314879, 323718, 333055, 342656, 353003, 364863, 378479, 393605, 410207, 428636, 449113, 471515, 495872, 522669, 552358, 584718, 618921, 654055, 689306, 723621, 755433, 782880, 804460, 819614, 828719, 832586, 832140, 828611, 823555, 818101, 812187, 804931, 795771, 784797, 771964, 756635, 738265, 717144, 694068, 669583, 643942, 617564, 591084, 565060, 539982, 516454, 495016, 475885, 459172, 445260, 434514, 426649, 420832, 416505, 413762, 412825, 413490, 415345, 418271, 422488, 428229, 435496, 444035, 453436, 463455, 474338, 486690, 500858, 516668]
63551E16668J7329J9451K2663K6516L0178L3431L6774M0458M3772M5398M4304
63540H76942M0220L3507K4932J5610O797n25n932r413j1158j1533j1095j0355
63528I37997r600r048r127j0389j3144j7274k2311k7466l1762l4481l5693l6114
63516F81588l6269l5987l4767l2531k9735k6892k4180k1614j9317j7457j5926
63505C86913j4309j2440j0759r881r709r376q282o786n622m856l993k948k291
63492B85661k456l094l487l257k467j386l78J77J78q2j93J11R46K270L748M911
63476B81202N576N907N976N601M780L877L130K322J232J10p12j347k053k688k953
63461C09960l030l332l687l421k373j283q60r25q56n20l15m15m48jQ69J805K660
$$ y = [516668, 533997, 553448, 576111, 602627, 632805, 666236, 703010, 743468, 787240, 832638, 876942, 917162, 950669, 975601, 991211, 998008, 997483, 991551, 982138, 970980, 959447, 948352, 937997, 928397, 919349, 910222, 899833, 886689, 869415, 847104, 819638, 787876, 753395, 717702, 681588, 645319, 609332, 574565, 542034, 512299, 485407, 461227, 439613, 420296, 402839, 386913, 372604, 360164, 349405, 339524, 329815, 320439, 312157, 305371, 299749, 294893, 290900, 287952, 285661, 283205, 280111, 276624, 273367, 270900, 269514, 269136, 269313, 269491, 269409, 269216, 269327, 270273, 272543, 276291, 281202, 286778, 292685, 298661, 304262, 309042, 312919, 316049, 318371, 319603, 319713, 319001, 317654, 315601, 312913, 309960, 306930, 303598, 299911, 296490, 294117, 292834, 291974, 291049, 290193, 289673, 289358, 288943, 288495, 288494, 289363, 291168, 293828]
63444B93828L635M874O155P171Q037R297J1335J4025J7071K0479K4410K8567L2009
63431D80893L3645L2887K9855K5195J9722J4168R086M920K134J232K551N904J0371
63418F72563J4792J8728K2817K7712L2887L7000L9460M0740M0917L8874L3706
63407A020196K6302J8580J1525M921j160n784q298r183r444r839j0950j3265j6662
63394I96939k0466k4367k8736l3529l7579l9684l9921l9170l7728l5286l2125
63383F28348k9323k7459k5845k3452k0216j6951j4223j1721q845n638k880j213
63371D40582l42O25K188M114O157Q520J1350J4162J6296J7805J9386K1518K4043
63358E86404K6609K9110L1632L4256L6972L9581M1627M2585M2137M0098L6312
$$ y = [293828, 297463, 302337, 308492, 315663, 323700, 332997, 344332, 358357, 375428, 395907, 420317, 448884, 480893, 514538, 547425, 577280, 602475, 622197, 636365, 645451, 650371, 652505, 653737, 656288, 662192, 672563, 687355, 706083, 728900, 756612, 789499, 826499, 865959, 906699, 947616, 986490, 1020196, 1046498, 1065078, 1076603, 1081524, 1080364, 1074580, 1066282, 1057099, 1047655, 1037816, 1026866, 1013601, 996939, 976473, 952106, 923370, 889841, 852262, 812578, 772657, 733487, 695759, 660473, 628348, 599025, 571566, 545721, 522269, 502053, 485102, 470879, 459158, 450313, 444675, 441795, 440582, 440240, 440865, 443053, 447167, 453324, 461844, 473194, 487356, 503652, 521457, 540843, 562361, 586404, 613013, 642123, 673755, 708011, 744983, 784564, 826191, 868776, 910913, 951011, 987323]
63347I87323L0834K4145J6908R620K799k736o323q151r112r942j0926j2319j4413
63334I97707j7111j9967k2870k6194l0034l3710l6303l7359l6882l5032l2179
63323F70066k8836k5214k1210j7001j3234j0374q398p507q471j1571j5590j8693
63311D83967k0163k0577k0463j9645j7983j5968j4222j2831j1515j0076q471o825
63299C05228n434m511l859l205k829l297m409n037m360k837j605j269j630k216
63285B58730k637k674k438k302k360k249j704j018n31p1O14J173J057M30L3J78
63269B44231M64N38N18N83P00R21J406J990K252K230K522L258L624K947J854J635
63253B71673K615L814M259M028L882M296N186O274P371Q350R091R586J0048J0798
$$ y = [987323, 1018157, 1042302, 1059210, 1068830, 1071629, 1068893, 1062570, 1054419, 1045307, 1035365, 1024439, 1012120, 997707, 980596, 960629, 937759, 911565, 881531, 847821, 811518, 774159, 737277, 702245, 670066, 641230, 616016, 594806, 577805, 564571, 554197, 545799, 538292, 529821, 518250, 502660, 483967, 463804, 443227, 422764, 403119, 385136, 369168, 354946, 342115, 330600, 320524, 312053, 305228, 299794, 295283, 291424, 288219, 285390, 282093, 277684, 272647, 268287, 265450, 263845, 262576, 260946, 258730, 256093, 253419, 250981, 248679, 246319, 244070, 242366, 241348, 240817, 240746, 241360, 242533, 243590, 244020, 244053, 244231, 244695, 245233, 245751, 246334, 247034, 247955, 249361, 251351, 253603, 255833, 258355, 261613, 265237, 268184, 270038, 271673, 274288, 278102, 282361, 286389, 290271, 294567, 299753, 306027, 313398, 321748, 330839, 340425, 350473, 361271]
63239C61271J1909J3028J3803J4460J5663J7606J9597K0758K0951K0640K0173
63228E49859J9687J9520K0053K0988K1391K0782J9785J9333J9576J9976K0237
63217G71187K0567K1002K0972J9801J7332J3912R941N695J399k907p557j2898
63205H78446j8566k3385k6361k7620k8012k7951k7086k5140k2501j9668j6623
63194F15533j3206r762o847m400j814J245M538P810J1109J4413J7372J9664K1282
63181F76937K2364K3052K3607K4229K4646K4294K3207K2206K1920K2010K1732
63170I30204K0841J9405J7131J3614R151M621M36l878q944j4759k0746k6186l0547
63157I10343l3745l6205l8303l9677l9490l7549l4792l2363l0479k8489k5853
$$ y = [361271, 373180, 386208, 400011, 414471, 430134, 447740, 467337, 488095, 509046, 529686, 549859, 569546, 589066, 609119, 630107, 651498, 672280, 692065, 711398, 730974, 750950, 771187, 791754, 812756, 833728, 853529, 870861, 884773, 894714, 900409, 901808, 898901, 891344, 878446, 859880, 836495, 810134, 782514, 754502, 726551, 699465, 674325, 651824, 632156, 615533, 602327, 592565, 585718, 581318, 579504, 580749, 585287, 593097, 604206, 618619, 635991, 655655, 676937, 699301, 722353, 745960, 770189, 794835, 819129, 842336, 864542, 886462, 908472, 930204, 951045, 970450, 987581, 1001195, 1010346, 1014967, 1015403, 1011525, 1002581, 987822, 967076, 940890, 910343, 876598, 840393, 802090, 762413, 722923, 685374, 650582, 618219, 587740, 559251, 533398]
63146E33398k2799k0069j8206j7044j5846j4017j1736r703q284p208o124n130
63134C77232m480m077l587k912k202j518p56M7O51Q86Q54Q02Q78J076J353J754
63118C66001K392L239L969M211L972L679L692L949M160M120L719K923J980J465
63104D13471J690K240K420K125J882K017K189J910J196M97K12M20R40J447J671
63089D36327J618J502J341Q44j33j197j735j548r16j38P12J555K161K418K574
63074D45385L018L864M862N757O602P671R043J0345J1098J1376J1932J3442J5696
63061E60091J7870J9477K0755K2166K3923K6138K8905L1984L4821L7259L9851
63050H63240M2948M5916M7877M9021N0254N1683N2364N1773N0653M9968M9832
$$ y = [533398, 510599, 490530, 472324, 455280, 439434, 425417, 413681, 403978, 395694, 388486, 382362, 377232, 372752, 368675, 365088, 362176, 359974, 358456, 357700, 357747, 358398, 359284, 360138, 360940, 361818, 362894, 364247, 366001, 368393, 371632, 375601, 379812, 383784, 387463, 391155, 395104, 399264, 403384, 407103, 410026, 412006, 413471, 415161, 417401, 419821, 421946, 423828, 425845, 428034, 429944, 431140, 431637, 431849, 432269, 433209, 434656, 436327, 437945, 439447, 440788, 441632, 441499, 440302, 438567, 437019, 436103, 435965, 436677, 438232, 440393, 442811, 445385, 448403, 452267, 457129, 462886, 469488, 477159, 486202, 496547, 507645, 519021, 530953, 544395, 560091, 577961, 597438, 618193, 640359, 664282, 690420, 719325, 751309, 786130, 823389, 863240, 906188, 952104, 999981, 1049002, 1099256, 1150939, 1203303, 1255076, 1305729, 1355697, 1405529]
63039A405529M9914N0239N0864N1407N1587N1743N1933N0992M7511M1492L4130
63028A937341K6070J6948O616m294j5229k6095l6471m5386n2375n7845o1916o3826
63016A623538o3105o0550n7183n2975m7405m0690l3565k6283j8764j1377m618
63005A207023J749Q301J4814K0476K5077K9129L2854L5988L8534M0759M2354M2697
62993A539755M2125M1878M2357M2471M1187L8847L6268L3407K9665K4784J8618
62982A931362J0670Q08r924k0152k9583l8752m7662n5640o2397o8214p2895p5474
62970A462147p5410p3360p0350o6682o2151n6976n1930m7646m4051m0557l6695
62959H36339l2631k9053k6439k4509k2594k0495j8606j7277j6427j5888j5672
$$ y = [1405529, 1455443, 1505682, 1556546, 1607953, 1659540, 1711283, 1763216, 1814208, 1861719, 1903211, 1937341, 1963411, 1980359, 1986975, 1982681, 1967452, 1941357, 1904886, 1859500, 1807125, 1749280, 1687364, 1623538, 1560433, 1499883, 1442700, 1389725, 1342320, 1301630, 1268065, 1241782, 1223018, 1211641, 1207023, 1208772, 1217073, 1231887, 1252363, 1277440, 1306569, 1339423, 1375411, 1413945, 1454704, 1497058, 1539755, 1581880, 1623758, 1666115, 1708586, 1749773, 1788620, 1824888, 1858295, 1887960, 1912744, 1931362, 1942032, 1942840, 1932916, 1912764, 1883181, 1844429, 1796767, 1741127, 1678730, 1610516, 1537621, 1462147, 1386737, 1313377, 1243027, 1176345, 1114194, 1057218, 1005288, 957642, 913591, 873034, 836339, 803708, 774655, 748216, 723707, 701113, 680618, 662012, 644735, 628308, 612420, 596748]
62948E96748j5685j5495j4709j3417j2083j1153j0871j1207j1746j1883j1409
62937D57090j0697j0109r511q640p655o881o224n388m496l889l391k484j381j108
62923C75236k047l101k924j622m19QJ2q4n57j492k253k219j585r74o97p18r79
62906C53585j332j504j545j881k551k904k566k191k425k668j937o16j19p44j176
62891C27426n20L98M04k96o59l18L20R74J576J783J328N95J66%k23l11P8M77P9
62872C33277q81j257o86j48m18r18o99R8N46K62k79n79o16n89o08o93p65o70l76
62853C24001q0P5K56O68J157J342J063N45J64K04O85J264J404Q93L4p30j304j779
62835C29862k014j707q45J57Q17R08N21M5j3N44J288J614J508J577K159K786K777
$$ y = [596748, 581063, 565568, 550859, 537442, 525359, 514206, 503335, 492128, 480382, 468499, 457090, 446393, 436284, 426773, 418133, 410478, 403597, 397373, 391985, 387489, 383600, 380209, 377725, 376344, 375236, 373189, 370088, 367164, 365542, 365123, 365131, 365143, 365059, 364502, 363010, 360757, 358538, 356953, 355979, 355282, 354564, 353585, 352253, 350749, 349204, 347323, 344772, 341868, 339302, 337111, 334686, 332018, 330081, 329465, 329346, 328602, 327426, 326906, 327304, 327708, 327412, 326753, 326435, 326755, 327729, 329305, 331088, 332416, 333011, 333177, 333177, 332954, 332643, 332721, 333198, 333277, 332396, 331139, 330453, 330305, 329887, 328969, 328270, 328368, 328914, 329176, 328897, 328318, 327702, 327113, 326505, 325812, 325047, 324377, 324001, 323921, 323996, 324252, 324920, 326077, 327419, 328482, 329027, 329191, 329395, 330080, 331344, 332748, 333641, 333675, 332945, 331641, 329862, 327848, 326141, 325296, 325453, 326270, 327178, 327699, 327744, 327731, 328275, 329563, 331177, 332685, 334262, 336421, 339207, 341984]
62818C41984K156J572J452J682K149L050M336N236M954L763K873L117M138N117
62804C87579N810O475P147P626Q065Q997J0561J2153J3130J3542J3918J4586J5550
62791E25139J6918J8941K1565K4214K6370K8247L0733L4557L9654M5407N1327
62780H63072N7244O2988O8262P3003P7493Q1806Q5265Q6782Q5657Q1879P5778
62769A699229O7679N7835M6407L3519J9490M916r616k3759l7058m8680n7964o5078
62757A686920p0657p4829p7192p7666p6761p4850p1930o8261o4605o1374n8059
62746I10736n4012m9309m4512l9968l5904l2599k9984k7334k4110k0787j8217
62735E34000j6366j4459j2270j0433r369q623p550o071m464k907j507l78O02J746
$$ y = [341984, 344140, 345712, 347164, 348846, 350995, 354045, 358381, 363617, 368571, 372334, 375207, 378324, 382462, 387579, 393389, 399864, 407011, 414637, 422702, 431699, 442260, 454413, 467543, 481085, 495003, 509589, 525139, 542057, 560998, 582563, 606777, 633147, 661394, 692127, 726684, 766338, 811745, 863072, 920316, 983304, 1051566, 1124569, 1202062, 1283868, 1369133, 1455915, 1541572, 1623451, 1699229, 1766908, 1824743, 1871150, 1904669, 1924159, 1929075, 1919459, 1895700, 1858642, 1809962, 1751998, 1686920, 1616263, 1541434, 1464242, 1386576, 1309815, 1234965, 1163035, 1094774, 1030169, 968795, 910736, 856724, 807415, 762903, 722935, 687031, 654432, 624448, 597114, 573004, 552217, 534000, 517634, 503175, 490905, 480472, 471103, 462480, 454930, 448859, 444395, 441488, 439981, 439603, 440205, 441951]
62721D41951K987L721L663L493M226O023Q084R727J1190J3210J6077J9260K1937
62708E65549K3791K5345K7605L1279L6218M1530M6336N0595N5131O0658O6830
62697A030867P2451P6743Q0028Q3026Q5728Q7287Q6846Q4047P8889P1433O1689
62686A899034M9553L4986J8589J806j3987k8589m2628n6072o7680p6192q1531
62675A637289q4483q5652q5299q3823q1734p9047p5196o9807o3394n7140n2019
62664H19695m8043m4322m0014l5304l1281k8695k7016k4976k1963j8557j5752
62653D83772j3953j2796j1730j0551r458q738q431q316q143p776p139o208n158
62640C65375m376m105m141m052l592k809j822p89j3J77k07p74j182j473j833k173
$$ y = [441951, 444938, 448659, 452322, 455815, 460041, 466064, 474148, 483875, 495065, 508275, 524352, 543612, 565549, 589340, 614685, 642290, 673569, 709787, 751317, 797653, 848248, 903379, 964037, 1030867, 1103318, 1180061, 1260089, 1343115, 1428843, 1516130, 1602976, 1687023, 1765912, 1837345, 1899034, 1948587, 1983573, 2002162, 2003968, 1989981, 1961392, 1918764, 1862692, 1795012, 1718820, 1637289, 1552806, 1467154, 1381855, 1298032, 1216298, 1137251, 1062055, 992248, 928854, 871714, 819695, 771652, 727330, 687316, 652012, 620731, 592036, 565020, 540044, 518081, 499524, 483772, 469819, 457023, 445293, 434742, 425284, 416546, 408115, 399799, 391656, 383880, 376741, 370533, 365375, 360999, 356894, 352753, 348701, 345109, 342300, 340478, 339689, 339676, 339853, 339646, 338872, 337690, 336217, 334384, 332211]
62624C32211k176j763j257r63p28k02N28R14P60P40J658L318M608M868M640M818
62608C51974N479O078O541P446R096J1009J2627J4104J5998J8477K1226K3985
62596E04040K6752K9492L2070L4519L7078L9650M1501M1790M0453L8219L5681
62585I01245L2492K7762K1159J3391N466k255r935j7390k3775k8424l1640l4287
62573H53809l6692l8369l8828l8249l7159l5742l3831l1350k8438k5242k1944
62562D87965j8999j6923j5675j4509j2693j0301q133o922o743o982o788n720m171
62549C53406l041k747k697k065r42k72n58j148j051j01J078J987K657L204L507
62534C51217L453L148K740K317K138K624L813N168O288P604R798J2581J4761J5800
$$ y = [332211, 330035, 328272, 327015, 326052, 325324, 325122, 325650, 326564, 327324, 328064, 329722, 333040, 337648, 342516, 347156, 351974, 357453, 363531, 370072, 377518, 386614, 397623, 410250, 424354, 440352, 458829, 480055, 504040, 530792, 560284, 592354, 626873, 663951, 703601, 745102, 786892, 827345, 865564, 901245, 933737, 961499, 982658, 996049, 1001515, 999260, 989325, 971935, 948160, 919736, 888096, 853809, 817117, 778748, 739920, 701671, 664512, 628770, 594939, 563589, 535151, 509909, 487965, 468966, 452043, 436368, 421859, 409166, 398865, 390732, 383810, 377067, 370085, 363297, 357577, 353406, 350365, 347618, 344921, 342856, 341914, 341642, 341084, 339936, 338885, 338784, 339862, 341849, 344506, 347710, 351217, 354670, 357818, 360558, 362875, 365013, 367637, 371450, 376618, 382906, 390510, 400308, 412889, 427650, 443450]
62520D43450J6710J8950K2710K6869L0412L3349L6201L9260M2488M5687M8399
62509H04485M9932M9918M8584M6264M2805L7833L1421K4086J6198P835p64r015
62497A149582j6432k2926k8487l2786l5448l6494l6266l4938l2466k8959k4830
62486H19550k0481j6062j1660p474l593K50M387Q646J2372J5125J7103J8709J9873
62473H56745K0054J8884J6539J3443R798N518N73m704r744j4290j8702k3466k8293
62460H42355l2104l4125l4744l4889l4925l4563l3653l2324l0440k7687k4333
62449D88568k1204j8624j6074j3275j0877r495q637p321n412l625k418j600q97
62436C69109k31N45J589K657L177K771J504k40j778k456k463k925m448n972o008
$$ y = [443450, 460160, 479110, 501820, 528689, 559101, 592450, 628651, 667911, 710399, 756086, 804485, 854417, 904335, 952919, 999183, 1041988, 1079821, 1111242, 1135328, 1151526, 1159361, 1158597, 1149582, 1133150, 1110224, 1081737, 1048951, 1013503, 977009, 940743, 905805, 873339, 844380, 819550, 799069, 783007, 771347, 763873, 760280, 760530, 764917, 773563, 785935, 801060, 818163, 836872, 856745, 876799, 895683, 912222, 925665, 935463, 940981, 941554, 936850, 927106, 912816, 894114, 870648, 842355, 810251, 776126, 741382, 706493, 671568, 637005, 603352, 571028, 540588, 512901, 488568, 467364, 448740, 432666, 419391, 408514, 399019, 390382, 383061, 377649, 374024, 371606, 370006, 369109, 368878, 369423, 371012, 373669, 376846, 379617, 381121, 380881, 379103, 376647, 374184, 371259, 366811, 360839, 354831]
62421C54831m797m046m533n187m928m168l802l771l555l297l455l702l288k255
62407C00047j409j151j049p04l41l96r03j471j606j036j2P91R25O06M15O45J228
62390B94579J982K596K657K077J367J060J129J310J760K830M308N467N846N610
62376C34578N128M771M967N949P324Q431R154R897J0774J1488J2107J3296J5364
62363D53228J7733J9820K1965K4930K8783L2947L7167M1769M6925N2146N6717
62352H34130O0257O2638O3615O2810N9930N4840M7530L8329K8108J8011Q786M59
62340A339443p281j4567k1449k8267l5406m2426m7874n0455n0371m9120m7966
62329I44261m6907m5193m2478l9121l5539l1736k7600k3439j9967j7728j6682
$$ y = [354831, 350034, 345988, 341455, 336268, 331340, 327172, 323370, 319599, 316044, 312747, 309292, 305590, 302302, 300047, 298638, 297487, 296438, 295734, 295393, 294997, 294094, 292623, 291017, 289981, 289969, 290760, 291685, 292291, 292706, 293351, 294579, 296561, 299157, 301814, 303891, 305258, 306318, 307447, 308757, 310517, 313347, 317655, 323122, 328968, 334578, 339706, 344477, 349444, 355393, 362717, 371148, 380302, 390199, 400973, 412461, 424568, 437864, 453228, 470961, 490781, 512746, 537676, 566459, 599406, 636573, 678342, 725267, 777413, 834130, 894387, 957025, 1020640, 1083450, 1143380, 1198220, 1245750, 1284079, 1312187, 1330198, 1338984, 1339443, 1332162, 1317595, 1296146, 1267879, 1232473, 1190047, 1142173, 1091718, 1041347, 992227, 944261, 897354, 852161, 809683, 770562, 735023, 703287, 675687, 652248, 632281, 614553, 597871]
62318E97871j6363j6287j6197j6085j6089j6293j6433j6007j4832j3364j2219
62307D27702j1497j0913j0346r811q964p366n343l927l647l823l529k699j911
62294C43926j474j268j144r82n86k2K54O5mO37J689K454K982L850M961N452M906
62277C65696L950L401L478M036M921N797O206O121O089O605P723R338J1321J3276
62263D57958J4777J6118J8230K1593K5735L0073L4667L9753M5128N0438N5554
62252H10024O0235O3791O5658O5871O4470O0953N4875M6645L7071K6518J5239
62241A371350M209n341j3292k0745k8629l6733m4180n0274n4646n7233n8421n8788
62229I47277n8422n6795n3586m9261m4556l9759l4882l0322k6767k4379k2437
$$ y = [597871, 581508, 565221, 549024, 532939, 516850, 500557, 484124, 468117, 453285, 439921, 427702, 416205, 405292, 394946, 385135, 376171, 368805, 363462, 359535, 355888, 352065, 348536, 345837, 343926, 342452, 341184, 340040, 339058, 338472, 338450, 338704, 338769, 338765, 339402, 341091, 343545, 346527, 350377, 355338, 360790, 365696, 369646, 373047, 376525, 380561, 385482, 391279, 397485, 403606, 409695, 416300, 424023, 433361, 444682, 457958, 472735, 488853, 507083, 528676, 554411, 584484, 619151, 658904, 704032, 754470, 810024, 870259, 934050, 999708, 1065579, 1130049, 1191002, 1245877, 1292522, 1329593, 1356111, 1371350, 1375559, 1370218, 1356926, 1336181, 1307552, 1270819, 1226639, 1176365, 1121719, 1064486, 1006065, 947277, 888855, 832060, 778474, 729213, 684657, 644898, 610016, 579694, 552927, 528548, 506111]
62218E06111k0080j7216j4567j2781j1762j0893r740q345p033o156o031o585p074
62205C67848o534m862l133k469k819l169k801j867p84L44J577K729L465L758M050
62190C55333M954O616Q404R338R059Q233P887Q455R634J0901J1813J1975J1231
62177D73833R958Q806Q056P525P108P050P537Q469R860J2155J5787K0578K5914
62164F22636L1393L6936M2319M7024N0631N3056N4101N3127M9608M4028L7667
62153A122526L1340K4687J7082Q906J327n094j0952j7027k3357k9489l5094l9776
62141A045079m2837m3868m3398m2322m0776l8200l4484l0350k6432k2640j8719
62130F61053j4904j1571q674n933l306q85J410L559N084N481M905L984K986J743
$$ y = [506111, 486031, 468815, 454248, 441467, 429705, 418812, 409072, 400727, 393694, 387538, 381507, 374922, 367848, 361314, 356452, 353319, 350850, 348031, 344862, 342061, 340194, 339410, 339754, 341331, 344060, 347525, 351283, 355333, 360287, 366903, 375307, 384645, 393704, 401937, 409824, 418279, 427913, 438814, 450627, 462602, 473833, 483791, 492597, 500653, 508178, 515286, 522336, 529873, 538342, 548202, 560357, 576144, 596722, 622636, 654029, 690965, 733284, 780308, 830939, 883995, 938096, 991223, 1040831, 1084859, 1122526, 1153866, 1178553, 1195635, 1204541, 1205868, 1200774, 1189822, 1172795, 1149438, 1119949, 1084855, 1045079, 1002242, 958374, 914976, 872654, 831878, 793678, 759194, 728844, 702412, 679772, 661053, 646149, 634578, 625904, 619971, 616665, 615780, 617190, 620749, 625833, 631314, 636219, 640203, 643189, 644932]
62116F44932M07l77l45j44m78j218j841k515l982o423r078j1148j2424j2739j1630
62101E70997r146o433m715l845k699q75R06K174L494N334O972P329O515N775N967
62086E87750O772P400P575P719Q444J0001J2018J3822J5123J6247J7497J8644
62074G29012J9374J9966K0934K2081K2608K2249K1750K2024K3175K4598K5757
62063I73528K6614K7525K8899L0827L2920L4519L5003L3843L0629K5523J9581
62052A299411J4043R103L802k641r823j6673k2598k7814l2750l7522m1851m5243
62040A089444m7348m8208m8094m7118m5336m3180m1269l9534l7041l3192k8684
62029F30440k4727k1542j8363j4877j1929j0444j0179r986r101p766o679o181
$$ y = [644932, 645339, 644962, 644617, 644473, 643995, 642777, 640936, 638421, 634439, 628016, 618938, 607790, 595366, 582627, 570997, 561851, 555418, 550703, 546858, 544159, 543284, 544190, 546364, 549858, 555192, 562164, 569493, 576008, 581783, 587750, 594522, 601922, 609497, 617216, 625660, 635661, 647679, 661501, 676624, 692871, 710368, 729012, 748386, 768352, 789286, 811367, 833975, 856224, 877974, 899998, 923173, 947771, 973528, 1000142, 1027667, 1056566, 1087393, 1120313, 1154832, 1189835, 1223678, 1254307, 1279830, 1299411, 1313454, 1322557, 1326359, 1323718, 1313895, 1297222, 1274624, 1246810, 1214060, 1176538, 1134687, 1089444, 1042096, 993888, 945794, 898676, 853340, 810160, 768891, 729357, 692316, 659124, 630440, 605713, 584171, 565808, 550931, 539002, 528558, 518379, 508393, 499292, 491526, 484847, 478666]
62017D78666o163o467p019p545p443o367m830l836l746l797l092j718m53N11J836
62002D18537L889N912O825O619O322O611O979O517N114L452K047P84n66j875k935
61987D74232l864m923o071p138q195r438j0621j1121j0646r571q454p535o897
61974C69758o667o692o340n145l592k717k846l207k971k352k134k445k505j716
61960C18429m85L19M35L40M89Q46J201J486J631J527J393J852L276N217O837P835
61944C52628Q605R634J1087J2943J5099J7280J9181K0763K2188K3400K4105K4232
61932E61145K4040K3692K3035K1906K0404J8694J6834J4846J2689J0111O930L556
61920G57882P13j543l989o998r651j0664r893q320o689m835k364O49L814O955
$$ y = [478666, 472503, 466036, 459017, 451472, 444029, 437662, 432832, 428996, 425250, 421453, 418361, 416643, 416190, 416701, 418537, 422426, 428338, 435163, 441782, 448104, 454715, 461694, 468211, 473325, 476777, 478824, 479608, 479042, 477167, 474232, 470368, 465445, 459374, 452236, 444041, 434603, 423982, 412861, 402215, 392644, 384190, 376655, 369758, 363091, 356399, 350059, 344914, 341322, 338605, 335759, 332552, 329581, 327229, 325095, 322650, 320145, 318429, 317944, 318263, 318698, 319038, 319527, 320373, 321574, 323060, 324691, 326218, 327611, 329463, 332739, 337956, 344793, 352628, 361233, 370867, 381954, 394897, 409996, 427276, 446457, 467220, 489408, 512808, 536913, 561145, 585185, 608877, 631912, 653818, 674222, 692916, 709750, 724596, 737285, 747396, 754326, 757882, 758595, 757052, 753063, 746065, 736414, 725750, 715857, 707537, 700848, 696013, 693649, 694298, 698112, 705067]
61906G05067J0127J3345J6410J8879K0159J9821J7916J4921J1378P608L638p49
61894H58520n724j0935j5501j8787k1044k2918k4427k4859k3814k1900k0206j9355
61882F29050j9166j9051j8499j7383j5996j4709j3632j2699j2018j1718j1426
61871D62753j0343q207n804m118l150k052l63J394K549L284M386O164Q105R603
61857D64201J0724J2015J3770J5855J8154K0852K4098K7628L0902L3547L5525
61846G07271L6986L8052L8642L8358L6729L3750K9984K5909K1309J5630Q908J971
61834A033499m282r441j3382j5933j6972j6598j4968j2167q400m112L22M814R240
61821I31620J3131J5959J7572J7924J6548J2842P019K33o507j3156k0058k6899
$$ y = [705067, 715194, 728539, 744949, 763828, 783987, 803808, 821724, 836645, 848023, 855631, 859269, 858520, 852796, 841861, 826360, 807573, 786529, 763611, 739184, 714325, 690511, 668611, 648405, 629050, 609884, 590833, 572334, 554951, 538955, 524246, 510614, 497915, 485897, 474179, 462753, 452410, 444203, 438399, 434281, 431131, 429079, 428716, 430110, 432659, 435943, 440329, 446493, 454598, 464201, 474925, 486940, 500710, 516565, 534719, 555571, 579669, 607297, 638199, 671746, 707271, 744257, 782309, 820951, 859309, 896038, 929788, 959772, 985681, 1006990, 1022620, 1031528, 1033499, 1029217, 1019776, 1006394, 990461, 973489, 956891, 941923, 929756, 921356, 917244, 917566, 922380, 931620, 944751, 960710, 978282, 996206, 1012754, 1025596, 1032615, 1032848, 1026341, 1013185, 993127, 966228]
61809I66228l2757l7015l9700m0974m0937m0005l8924l7907l6230l3179k9169
61798E59431k5416k2634k0562j8719j6995j5388j3734j2003j0430r026p388n394
61786C81742l773l390m080m719m459l527k655k099j490n24M87Q87N04KR9N84N38
61769C54127l54j239j271p74o74j016r30M4J312K076K142J683Q29j16o05m80k63
61752C54491m36p06n44n3K35K38L51O34O00Lo76q36m86r6O3Q4J20K30M93R64J478
61731C56151J736J775K071K936L942M237L585K713K477K924L450L725M004M551
61717D00277N182N519N391M855M052L307L000L085K946K061O18q22k118l570n134
61702D28649o168o167n497n023n168n552n570n109m584m324m144l654k906k486
$$ y = [966228, 933471, 896456, 856756, 815782, 774845, 734840, 695916, 658009, 621779, 588600, 559431, 534015, 511381, 490819, 472100, 455105, 439717, 425983, 413980, 403550, 394524, 387136, 381742, 377969, 374579, 370499, 365780, 361321, 357794, 355139, 353040, 351550, 351026, 351513, 352400, 352904, 352906, 353005, 353589, 354127, 353773, 352534, 351263, 350489, 349815, 348799, 347869, 347913, 349225, 351301, 353443, 355126, 355955, 355839, 355234, 354754, 354491, 354055, 353349, 352805, 352752, 352987, 353225, 353576, 354210, 354810, 354813, 354137, 353301, 352815, 352719, 352782, 352866, 352986, 353216, 353709, 354673, 356151, 357887, 359662, 361733, 364669, 368611, 372848, 376433, 379146, 381623, 384547, 387997, 391722, 395726, 400277, 405459, 410978, 416369, 421224, 425276, 428583, 431583, 434668, 437614, 439675, 440293, 439471, 437353, 433783, 428649, 422481, 416314, 410817, 405794, 400626, 395074, 389504, 384395, 379811, 375487, 371343, 367689, 364783, 362297]
61688C62297k771l343l411k796k127j989k229k332k195k154k291k230j748j234
61674C29447j172j440j470j078p08p32r25q70n88l97l63k90j37j08k13j77K05
61657C18984Q11J460K063K479K510K229K002K009K050J965J927K090K265K348
61643C47192K700L612M641N080M959M962N281N198M084K309P42k84j137k189l380
61628C83770m370m879m821m342l743l271k960k701k386j933j295n15K87J003J505
61613C49349J517Q20k77j007r38n64p82j826l017l602l576l532l947m727n384
61598C18507n474m947m183l719l811m233m500m383m114m013l975l541k602j780
61584B63232j817k654l461l562l026k326j788j538j579j696j567j294j454k253
$$ y = [362297, 359526, 356183, 352772, 349976, 347849, 345860, 343631, 341299, 339104, 336950, 334659, 332429, 330681, 329447, 328275, 326835, 325365, 324287, 323579, 322847, 321922, 321052, 320464, 320067, 319704, 319414, 319277, 319169, 318956, 318779, 318984, 319795, 321255, 323318, 325797, 328307, 330536, 332538, 334547, 336597, 338562, 340489, 342579, 344844, 347192, 349892, 353504, 358145, 363225, 368184, 373146, 378427, 383625, 387709, 390018, 390760, 390476, 389339, 387150, 383770, 379400, 374521, 369700, 365358, 361615, 358344, 355384, 352683, 350297, 348364, 347069, 346554, 346841, 347844, 349349, 350866, 351686, 351409, 350402, 349464, 348900, 348118, 346292, 343275, 339673, 336097, 332565, 328618, 323891, 318507, 313033, 308086, 303903, 300184, 296373, 292140, 287640, 283257, 279143, 275130, 271155, 267614, 265012, 263232, 261415, 258761, 255300, 251738, 248712, 246386, 244598, 243060, 241481, 239785, 238218, 236924, 235470, 233217]
61570B33217k975k800j938j303j201j105p54o44j049j326p76K72Q98Q10M59J38
61554B19923l23q65r26k04P17R06J39q35j061l08P77J338J138N70ro33j268j384
61536B17692n14R16J885J933J549J254R40L75j43j65J83M29M89O34P48K50j030
61519B27425k387k986k815k520k433k142j156K50J096O76o30j689j768j293j247
61504B06381j935k540k091o79N16M97m63j147p90O3K98l71j062r08j80J44k76
61487A95457p18m30L48P07K43n02p03j24P94J487J763J866K146K664L043K781
61471B10822J745L38q16j367j437j399j518j682j459n58P11J582J621J170Q04
61456B08557N47O3n11m99L46J328J659J432J237J169Q50K76j1K15N11M43J93J55
$$ y = [233217, 230242, 227442, 225504, 224201, 223000, 221895, 221141, 220497, 219448, 218122, 217346, 217618, 218516, 219326, 219785, 219923, 219600, 218735, 217809, 217605, 218322, 219228, 219367, 218532, 217471, 217163, 217940, 219278, 220416, 220986, 220977, 220344, 219076, 217692, 217178, 218094, 219979, 221912, 223461, 224715, 225655, 226030, 225887, 225722, 225905, 226334, 226823, 227457, 228205, 228455, 227425, 225038, 222052, 219237, 216717, 214284, 212142, 210986, 211236, 212332, 213008, 212378, 210689, 208921, 207628, 206381, 204446, 201906, 199815, 199136, 199652, 200149, 199686, 198539, 197749, 197812, 198110, 197739, 196677, 195769, 195589, 195733, 195457, 194739, 194309, 194657, 195364, 195607, 195105, 194402, 194278, 195072, 196559, 198322, 200188, 202334, 204998, 208041, 210822, 212567, 212905, 212089, 210722, 209285, 207886, 206368, 204686, 203227, 202669, 203380, 204962, 206583, 207753, 208557, 209104, 209167, 208656, 208157, 208503, 209831, 211490, 212922, 214159, 215328, 216178, 216454, 216443, 216658, 217169, 217612, 217805, 217960]
61438B17960L88P55J345K285L342M082M310M137L711L197K835K740K691K349J674
61423B57801R26L64Q6O0R2j0j03K76J268K301K714K551K309K061J374J31j121
61406B73080j826j997k010k146k517l116l737m069m056l889l577k904j925j132
61392B34179q06o10j24M50N68J32m27p44q49q61o98k49L69Q67J022Q73P13Q22
61374B34627J186J617K118K828L548L666K939K036J821K250K501K155J692J690
61360B66674K047K320K425K602K988L564M378N360O082O152N866N969O642P115
61346C30184O563N116L657K848K692K899L289L731M048M180M256M385M492M455
61332C86795M286M028L578K735J455l8j356k212k652l015l501l883l829l466l203
$$ y = [217960, 218348, 219103, 220448, 222733, 226075, 230157, 234467, 238604, 242315, 245512, 248347, 251087, 253778, 256127, 257801, 258727, 259091, 259177, 259237, 259329, 259319, 259216, 259492, 260760, 263061, 265775, 268326, 270635, 272696, 274070, 274201, 273080, 271254, 269257, 267247, 265101, 262584, 259468, 255731, 251662, 247606, 243717, 240140, 237236, 235311, 234179, 233373, 232763, 232639, 233089, 233657, 233789, 233362, 232618, 231769, 230908, 230210, 229961, 230330, 231197, 232219, 233092, 233805, 234627, 235813, 237430, 239548, 242376, 245924, 249590, 252529, 254565, 256386, 258636, 261137, 263292, 264984, 266674, 268721, 271041, 273466, 276068, 279056, 282620, 286998, 292358, 298440, 304592, 310458, 316427, 323069, 330184, 336747, 341863, 345520, 348368, 351060, 353959, 357248, 360979, 365027, 369207, 373463, 377848, 382340, 386795, 391081, 395109, 398687, 401422, 402877, 402839, 401483, 399271, 396619, 393604, 390103, 386220, 382391, 378925, 375722]
61317C75722k975k191p16O08J005Q99J364K636L898M610N143N887O493O541O380
61302D15304O573O814O132M144J604l68j226j191r46j164k010k934l278l080l014
61287D21360l449m006m130l735l029k124j164n93p33j240j376q70o3Q01J911L292
61271D00852M330M359L520K666K491K998L731M215M276M246M776O083P473P980
61257D63996P454O562N783N071M500M477M931N033M342L628L820M556M664L804
61243E32621K705J825P54q32k489l641m292m666m740m628m884n880p082p512o770
61228D80489n290l691k374j600j536j994k380k147j293l22L96J152K484M218N355
61213D71467N258M549M229M279L903K952K122J675J046R4k57O92K373L865N152
$$ y = [375722, 372747, 370556, 369840, 370448, 371453, 372352, 373716, 376352, 380250, 384860, 390003, 395890, 402383, 408924, 415304, 421877, 428691, 434823, 438967, 440571, 440203, 438977, 437786, 436840, 435676, 433666, 430732, 427454, 424374, 421360, 417911, 413905, 409775, 406040, 403011, 400887, 399723, 399130, 398397, 397157, 395781, 394911, 394848, 395649, 397560, 400852, 405182, 409541, 413061, 415727, 418218, 421216, 424947, 429162, 433438, 437684, 442460, 448543, 456016, 463996, 471450, 478012, 483795, 488866, 493366, 497843, 502774, 507807, 512149, 515777, 519597, 524153, 528817, 532621, 535326, 537151, 537905, 537073, 534584, 530943, 526651, 521985, 517245, 512617, 507733, 501853, 494771, 487259, 480489, 475199, 471508, 469134, 467534, 465998, 464004, 461624, 459477, 458184, 457862, 458258, 459410, 461894, 466112, 471467, 476725, 481274, 485503, 489782, 493685, 496637, 498759, 500434, 501480, 501574, 501317, 502009, 504382, 508247, 513399]
61198E13399O616Q009Q917R780J1332J3179J4106J3677J2611J1512J0257Q826
61186F42221P722P126O484N456M611M578N039N146M659M029L568L119K496J826
61172G08080J351J033N63l33j527k538l037l302l884m870n765o175o341o742p421
61157F59092p959q069q001q279r060r830r865r019p858o949o315n904o157p578
61143E48249r780j1602j2314j2257j2086j1892j1279j0003q198o206m437l186
61131D35009k372j615p65p3L06P13J592K893M195N276O287P487R089J1228J3716
61116D92966J5901J7243J8059J9316K1452K3789K5340K5921K6051K6095K6045
61105G38178K5999K6111K5844K4122K0708J6910J4174J2371J0260P403M589K371
$$ y = [513399, 520015, 528024, 536941, 546721, 558053, 571232, 585338, 599015, 611626, 623138, 633395, 642221, 649943, 657069, 663553, 669009, 673620, 678198, 683237, 688383, 693042, 697071, 700639, 703758, 706254, 708080, 709431, 710464, 711027, 710694, 709167, 706629, 703592, 700290, 696406, 691536, 685771, 679596, 673255, 666513, 659092, 651133, 643064, 635063, 626784, 617724, 607894, 598029, 589010, 581152, 574203, 567888, 561984, 555827, 548249, 538469, 526867, 514553, 502296, 490210, 478318, 467039, 457036, 448838, 442632, 438195, 435009, 432637, 431022, 430257, 430184, 430490, 431203, 432795, 435688, 439883, 445159, 451446, 458933, 468022, 479250, 492966, 508867, 526110, 544169, 563485, 584937, 608726, 634066, 659987, 686038, 712133, 738178, 764177, 790288, 816132, 840254, 860962, 877872, 892046, 904417, 914677, 922080, 926669, 929040]
61093I29040K47k297m847o762q266j0116j2630j5465j8039j9756k0282k0035j9906
61080G70886k0173k0217j9704j9266j9291j8985j7579j5824j4985j4816j3877
61069E76169j1699r313p619o439n369m428l530k398j280q12q35l15J222L023M255
61054E30632M946N458N935O638P952R629J0865J1508J2343J3751J5197J6477J8439
61041F69770K1671K5416K8580L1093L3470L5797L7949M0152M2525M4657M6322
61030A057402M7917M9582N0810N1670N3531N7544O3216O9391P5769Q2462Q9118
61019A748412R5870J04298J16136J31928J52467J80558K19448K70261L33187M10693
61009C763258N07365O27425P75182R56568J173703J413054J639664J804807J859787
$$ y = [929040, 929287, 926990, 922143, 915381, 907115, 896999, 884369, 868904, 850865, 831109, 810827, 790792, 770886, 750713, 730496, 710792, 691526, 672235, 653250, 635671, 619847, 604862, 590046, 576169, 564470, 555157, 547538, 541099, 535730, 531302, 527772, 525374, 524094, 523282, 522447, 522132, 523354, 526377, 530632, 535578, 541036, 546971, 553609, 561561, 571190, 582055, 593563, 605906, 619657, 634854, 651331, 669770, 691441, 716857, 745437, 776530, 810000, 845797, 883746, 923898, 966423, 1011080, 1057402, 1105319, 1154901, 1205711, 1257381, 1310912, 1368456, 1431672, 1501063, 1576832, 1659294, 1748412, 1844282, 1948580, 2064716, 2196644, 2349111, 2529669, 2749117, 3019378, 3352565, 3763258, 4270623, 4898048, 5673230, 6629798, 7803501, 9216555, 10856219, 12661026, 14520813]
61000A4520813J767114J512777J124062O79428K88680M4567k1548N2363J85921
60991B0154177K89745K86333J24960j99162o32408j078197j439887j661445j737970
60982A4106146j698114j581469j425592j259762j100612r52520q14648o87954
60974D585475n75531m78949l97218l28925k73302k29219j94727j67897j47066
60965A792641j30283j15582j02084r0130q0141p1823o4434n7353n0427m4178l9503
60954I46703l6785l5374l4282l3059l1645k9848k7519k4900k2260j9558j6890
60943F34583j4849j3710j2763j1275r728r153r510r747r394r020r039r043q692
60930D98660q293q122p878p329o880o956p284p305o977o686o564o268n430m101
$$ y = [14520813, 16287927, 17800704, 18924766, 19604194, 19892874, 19937441, 19915893, 19968256, 20154177, 20443922, 20730255, 20855215, 20656053, 20023645, 18945448, 17505561, 15844116, 14106146, 12408032, 10826563, 9400971, 8141209, 7040597, 6088077, 5273429, 4585475, 4009944, 3530995, 3133777, 2804852, 2531550, 2302331, 2107604, 1939707, 1792641, 1662358, 1546776, 1444692, 1354562, 1274421, 1202598, 1138164, 1080811, 1030384, 986206, 946703, 909918, 874544, 840262, 807203, 775558, 745710, 718191, 693291, 671031, 651473, 634583, 619734, 606024, 593261, 581986, 572258, 563105, 553595, 543848, 534454, 525434, 516395, 507352, 498660, 490367, 482245, 474367, 467038, 460158, 453202, 445918, 438613, 431636, 424950, 418386, 412118, 406688, 402587]
60916D02587k848k435l158m336m787l960k418j093l73n7J14K49M30P12J018J190
60900C80835J152Q69L65j97m89l35K8J58j21n04o04m67o62j678l258m495m676
60883C65921l984l213k929l072l300l441l551l681l683l285k359j101Q3R56J570
60868C30931K076K604L282M169N021N458N460N385N371N133M615M357M787N489
60854C94138N731N459N135M810M098L017K124J690J316O34j54o49p27m22J80O97
60838D27077N11n74k023l223m095m794n128m801m020l478l652m334m849m618l600
60823C74399k350j556j381j405j209q43n79m19o3P12J775K731L261L545M195N515
60807C86328O937P652P796Q366R790J1332J2296J3134J4585J6281J7188J7279
$$ y = [402587, 399739, 397304, 394146, 389810, 385023, 381063, 378645, 377552, 377179, 377122, 377236, 377485, 377915, 378627, 379645, 380835, 381987, 382856, 383221, 383024, 382535, 382200, 382228, 382386, 382265, 381761, 381157, 380690, 380028, 378350, 375092, 370597, 365921, 361937, 358724, 355795, 352723, 349423, 345982, 342431, 338750, 335067, 331782, 329423, 328322, 328405, 329361, 330931, 333007, 335611, 338893, 343062, 348083, 353541, 359001, 364386, 369757, 374890, 379505, 383862, 388649, 394138, 399869, 405328, 410463, 415273, 419371, 422388, 424512, 426202, 427518, 428152, 427998, 427349, 426622, 426200, 426380, 427077, 427588, 427014, 424991, 421768, 417673, 412879, 407751, 402950, 398930, 395452, 391800, 387466, 382617, 377999, 374399, 372049, 370493, 369112, 367707, 366498, 365655, 365076, 364657, 364594, 365306, 367081, 369812, 373073, 376618, 380813, 386328, 393265, 400917, 408713, 417079, 426869, 438201, 450497, 463631, 478216, 494497, 511685, 528964]
60795E28964J7747J9410K1760K3827K5228K5955K5912K5314K4957K5379K5950
60784G90403K5463K3547K0822J7693J3861R211M553P85k297n730r936j4063j6898
60771H57414j8155j8627j9273k0380k1446k1756k1077j9952j9277j9436j9916
60760F38119j9909j9247j8469j8005j7596j6720j5344j3932j2849j2084j1545
60749D62419j1281j1227j0980j0145q791p388o324n727n587n852o299o597o610
60736C59611o392n960n266m532m229m491m776m478l697l020k687k355j724r06
60722C05098j19O19J301J765J939K002K096K099J848J324N14n77j635k126k007
60707C14141j948k483l263l683l865m393n167n277m230k699j827k099l062l802
$$ y = [528964, 546711, 566121, 587881, 611708, 636936, 662891, 688803, 714117, 739074, 764453, 790403, 815866, 839413, 860235, 877928, 891789, 901000, 905553, 906338, 904041, 898311, 888375, 874312, 857414, 839259, 820632, 801359, 780979, 759533, 737777, 716700, 696748, 677471, 658035, 638119, 618210, 598963, 580494, 562489, 544893, 528173, 512829, 498897, 486048, 473964, 462419, 451138, 439911, 428931, 418786, 409995, 402607, 396283, 390556, 384969, 379117, 372818, 366221, 359611, 353219, 347259, 341993, 337461, 333232, 328741, 323965, 319487, 315790, 312770, 310083, 307728, 306004, 305098, 304979, 305598, 306899, 308664, 310603, 312605, 314701, 316800, 318648, 319972, 320486, 319909, 318274, 316148, 314141, 312193, 309710, 306447, 302764, 298899, 294506, 289339, 284062, 279832, 277133, 275306, 273207, 270145, 266343]
60693B66343l573k392j211j116k061k799k308r51J40M54M01M57N83N47L43R7j33
60676B52821k72j66K88J010J788K340K344J649O04q5ON56Q81O61J36l60o72o22
60658B62907L2J167K099K287K078K292L099L843M070M131M424M649M339L740L493
60643C08650L606L483K879K230J863J548R99L00l79j056j655j896j763j657j783
60628C15369j880j915k506m044n705o108m930l205j993j342q08m13n33j129j597
60613B77261j510j119r27r66q51m87l56q10j438j525j004m92l90m40k81J5J89
60596B64869J45j85q47j471j343l48O17O99J96k1J72J92r2j92O3K55K48N05J164
60577B64626J608J438J270J911L289M788O247P839R287J0041J0170J0267J0395
$$ y = [266343, 262770, 260378, 259167, 258051, 255990, 253191, 250883, 249932, 250072, 250526, 250927, 251384, 251967, 252514, 252857, 252954, 252821, 252549, 252383, 252671, 253681, 255469, 257809, 260153, 261802, 262406, 262321, 262327, 262883, 263764, 264425, 264561, 264201, 263529, 262907, 262939, 264106, 266205, 268492, 270570, 272862, 275961, 279804, 283874, 288005, 292429, 297078, 301417, 305157, 308650, 312256, 315739, 318618, 320848, 322711, 324259, 325258, 325558, 325179, 324123, 322468, 320572, 318809, 317152, 315369, 313489, 311574, 309068, 305024, 299319, 293211, 288281, 285076, 283083, 281741, 280933, 280520, 279987, 278858, 277261, 275751, 274632, 273705, 272739, 271888, 271401, 271045, 270235, 268797, 267272, 266268, 265776, 265386, 264946, 264665, 264680, 264869, 265014, 264829, 263982, 262511, 261168, 260820, 261437, 262136, 262332, 262311, 262483, 262675, 262583, 262391, 262454, 262709, 262957, 263462, 264626, 266234, 267672, 268942, 270853, 274142, 278930, 285177, 293016, 302303, 312344, 322514, 332781, 343176]
60564C43176R926Q660P285O259M855K159j427m418n911o277o207n844n158m416
60550C42662l761k785j117Q73K548L905N335O583O876O197N665O149P119P364
60536C93613O402M694K781R68m38j233j707k391l328m022m045l374k134n75O40
60521C85851P25l52j648k209j926j328q42n71m93m28k9R02K069K983L583M377
60505C90664N901Q155J0664J3077J5627J8859K2911K7182L0923L3929L6395L8176
60493F52463L8590L6985L3121K7016J8845R187j003j0915k0096k8015l3884l7264
60481F85030l8540l8389l7031l4417l0973k7565k4655k1932j9004j6109j3885
60470C82530j2540j1519j0145q494p345p140p236o605n153l873l429l285k582
$$ y = [343176, 353102, 361762, 369047, 375306, 380161, 382320, 380893, 376475, 370564, 364287, 358080, 352236, 347078, 342662, 338901, 336116, 334999, 335872, 338420, 342325, 347660, 354243, 361119, 367316, 372981, 379130, 386249, 393613, 400015, 404709, 407490, 408458, 408020, 406787, 405080, 402689, 399361, 395339, 391294, 387920, 385786, 385211, 385851, 386576, 386224, 384576, 382367, 380441, 379113, 378271, 377700, 377207, 376779, 376750, 377652, 379721, 382704, 386287, 390664, 396565, 404720, 415384, 428461, 444088, 462947, 485858, 513040, 543963, 577892, 614287, 652463, 691053, 728038, 761159, 788175, 807020, 816207, 815204, 804289, 784193, 756178, 722294, 685030, 646490, 608101, 571070, 536653, 505680, 478115, 453460, 431528, 412524, 396415, 382530, 369990, 358471, 348326, 339832, 332487, 325347, 318111, 311506, 306353, 302480, 299051, 295766, 293184]
60457B93184j508j048j629k587l070k922k542k328k428k741k888k456j470n10
60443B63057k16o80j367j535q55K18P64K75p85j554j779j966k504l112l238k664
60427B42059j536r3J334K354K819K984L097K996K384J393N52J99J99K65L19L92
60411B61717L60lo71j172r86j25P46R69O25M16Q44J684K363K570K360J907J421
60394B75025J193J370J745J961J944J887J844J629J208Q52P35O76M77L22N24J008
60378B94400J390J544J687J919K018J862J684J696J675J319P68M50N22P80J086
60363C14800J463J807J896J749J651J655J470J016P27J045J867K819L793M943
60349C42701O265P523Q418Q671Q134P055N995N157M050K163k44k434m071n339
$$ y = [293184, 291676, 290628, 288999, 286412, 283342, 280420, 277878, 275550, 273122, 270381, 267493, 265037, 263567, 263057, 262841, 262161, 260794, 259259, 258404, 258622, 259386, 259661, 258876, 257322, 255543, 253577, 251073, 247961, 244723, 242059, 240523, 240430, 241764, 244118, 246937, 249921, 253018, 256014, 258398, 259791, 260343, 260542, 260741, 261006, 261325, 261717, 262077, 262074, 261403, 260231, 259245, 259120, 259866, 260835, 261460, 261876, 262720, 264404, 266767, 269337, 271697, 273604, 275025, 276218, 277588, 279333, 281294, 283238, 285125, 286969, 288598, 289806, 290658, 291393, 292069, 292546, 292868, 293392, 294400, 295790, 297334, 299021, 300940, 302958, 304820, 306504, 308200, 309875, 311194, 311962, 312412, 312934, 313714, 314800, 316263, 318070, 319966, 321715, 323366, 325021, 326491, 327507, 328234, 329279, 331146, 333965, 337758, 342701, 348966, 356489, 364907, 373578, 381712, 388767, 394762, 399919, 403969, 406132, 405888, 403454, 399383, 394044]
60335C94044o351p041p524p954q008p143n495l928k991k423j900j619j741j844
60321C28082j533j120j087j194q26n9L27nm53l57J72O15R83J913L872O507Q975
60304C44812J0806J2253J3685J4874J5223J4574J3314J1556Q804M866O51k627
60292D62791m835o885r293j1421j2383j2172j1504j0873j0180r117p616n945m567
60279C46000l823l584l320k646j755j171j147j516k044k686l405l962m015l412
60265C07514k343j278p86j123j935k417k078j255o79o20p34p40p79r57j027p85
60249B87978m88l86j80N37J499K014J925J778J900J987J679J090M99N5n6L39R03
60232C03073R31L48RN35J369J568J140Q83J219J868K457K799K637J835Q64M96
$$ y = [394044, 387693, 380652, 373128, 365174, 357166, 350023, 344528, 340600, 337609, 335186, 333286, 331667, 329926, 328082, 326549, 325429, 324342, 323148, 322322, 322263, 322590, 322585, 322132, 321775, 321947, 322562, 323545, 325458, 329330, 335837, 344812, 355618, 367871, 381556, 396430, 411653, 426227, 439541, 451097, 459901, 464767, 465418, 462791, 457956, 451071, 441778, 430357, 417974, 405802, 394298, 383425, 373245, 364128, 356512, 350567, 346000, 342177, 338593, 335273, 332627, 330872, 329701, 328554, 327038, 324994, 322308, 318903, 314941, 310926, 307514, 305171, 303893, 303107, 301984, 300049, 297632, 295554, 294299, 293620, 293000, 292266, 291526, 290747, 289790, 288763, 287978, 287490, 287104, 286924, 287461, 288960, 290974, 292899, 294677, 296577, 298564, 300243, 301333, 301832, 301887, 301831, 302170, 303073, 304004, 304352, 304361, 304896, 306265, 307833, 308973, 309856, 311075, 312943, 315400, 318199, 320836, 322671, 323535, 324031]
60216C24031R15J601K135K558K885K882K601K613L331M399N077N031M605M391
60202C69055M694N259N543N307M848M498M180L721L352L369L479L116K391K068
60188D24880K430K729K139P50o52j519j920k228k647k988k874k374k203k959m202
60173D06362m851m521l872l522l287k735j958j316q75m98k68l91q64j435j726
60158C74243j379l87O06Q66N10L65P18R10M90Q5M47J231J464R30L43L26Q04J341
60140C83913J607J546J523K143L528M902N380M976M447M255M208L989L531K871
60126D32819K075J338Q22M10r6n89p70o03l12o1J49L50O27J073J505J491R57M48
60108D41633M10N91N83M89N40M11l03j254j698j587j476j549j537j538j976k645
$$ y = [324031, 324946, 326547, 328682, 331240, 334125, 337007, 339608, 342221, 345552, 349951, 355028, 360059, 364664, 369055, 373749, 379008, 384551, 389858, 394706, 399204, 403384, 407105, 410457, 413826, 417305, 420421, 422812, 424880, 427310, 430039, 432178, 432928, 432276, 430757, 428837, 426609, 423962, 420974, 418100, 415726, 413523, 410564, 406362, 401511, 396990, 393118, 389596, 386309, 383574, 381616, 380300, 379425, 378927, 378659, 378268, 377404, 375969, 374243, 372864, 372477, 373083, 373949, 374459, 374824, 375542, 376452, 376942, 377027, 377474, 378705, 380169, 381099, 381442, 381768, 382572, 383913, 385520, 387066, 388589, 390732, 394260, 399162, 404542, 409518, 413965, 418220, 422428, 426417, 429948, 432819, 434894, 436232, 437054, 437464, 437368, 436779, 436009, 435406, 435094, 435033, 435182, 435532, 436159, 437232, 438737, 440228, 441185, 441633, 442043, 442634, 443217, 443706, 444246, 444657, 444354, 443100, 441402, 439815, 438339, 436790, 435253, 433715, 431739, 429094]
60092D29094k690j831q15m08n88j025j531j720j022M44J669J926J627J528J649
60077D26307J626J547J711J872J466M65o01j379j986k584l177l776m400m868m978
60062D07245m813m648m559m434m309m311m319l968l123k139j577j708k226k379
60048C58732j582o0J226J541J177J081J788K947L867M265M394M659N129N451N192
60033C99807M322L280K505K048J654J098L08o63j647k433l012l678m686n864o684
60018C86355o829o512o221o208o297o269o188o200o055n236l708k217j500j434
60004C15481j338r47n71l84j13M08Q51Q07L02k64m91k49J82K79j19l94J69J353
59986C14962K228K470K736L471M122M062L641L568L739L449K607J872J573J247
$$ y = [429094, 426404, 424573, 423758, 423350, 422762, 421737, 420206, 418486, 417464, 417908, 419577, 421503, 423130, 424658, 426307, 427933, 429480, 431191, 433063, 434529, 434994, 434393, 433014, 431028, 428444, 425267, 421491, 417091, 412223, 407245, 402432, 397784, 393225, 388791, 384482, 380171, 375852, 371884, 368761, 366622, 365045, 363337, 361111, 358732, 357150, 357090, 358316, 359857, 361034, 362115, 363903, 366850, 370717, 374982, 379376, 384035, 389164, 394615, 399807, 404129, 407409, 409914, 411962, 413616, 414714, 415022, 414359, 412712, 410279, 407267, 403589, 398903, 393039, 386355, 379526, 373014, 366793, 360585, 354288, 348019, 341831, 335631, 329576, 324340, 320632, 318415, 316915, 315481, 314143, 313196, 312625, 312241, 312128, 312536, 313387, 314194, 314496, 314232, 313741, 313492, 313674, 313953, 313834, 313440, 313609, 314962, 317190, 319660, 322396, 325867, 329989, 334051, 337692, 341260, 344999, 348448, 351055, 352927, 354500, 355747]
59972C55747N02k72m45j19p4p93j774k029j198JN87M27J86K99L90m4q74j541j755
59953C47221j604j213o85k18L9J83L71N36N59N38O05N66J07p38j587k178k463
59936C40039k354j671n52M16N81k07j456k397k513j883j047n42n33q02r84q68
59920C23227n21j10M84J554K925L765L515K711K343K574K797K789K935L318L556
59905C57862L687M162M697M297K934K007K246K395J066j023k131k040j973k322
59891C75864k201j198o1O65J298K053K623L152M326N969O748O058N126N315O179
59876D21916O242N140L836K999K190P86j088k764l707l868l606l348l218l005
59862D18505k575k064j564q68K29J618L049M427N686O585O794O151M761L036J598
$$ y = [355747, 356249, 355977, 355532, 355413, 355339, 354546, 352772, 350743, 349545, 349546, 350133, 350560, 350746, 351045, 351435, 351391, 350517, 348976, 347221, 345617, 344404, 343719, 343501, 343540, 343723, 344094, 344630, 345189, 345727, 346332, 346898, 347005, 346267, 344680, 342502, 340039, 337685, 336014, 335462, 335878, 336459, 336252, 334796, 332399, 329886, 328003, 326956, 326414, 325881, 325079, 324095, 323227, 322706, 322596, 323080, 324634, 327559, 331324, 334839, 337550, 339893, 342467, 345264, 348053, 350988, 354306, 357862, 361549, 365711, 370408, 374705, 377639, 379646, 381892, 384287, 385353, 384330, 382199, 380159, 378186, 375864, 373663, 372465, 372404, 373069, 374367, 376420, 379043, 382195, 386521, 392490, 399238, 405296, 410422, 415737, 421916, 428158, 433298, 437134, 440133, 442323, 443109, 442021, 439257, 435550, 431682, 428076, 424728, 421510, 418505, 415930, 413866, 412302, 411434, 411663, 413281, 416330, 420757, 426443, 433028, 439822, 445973, 450734, 453770, 455368]
59847D55368Q25M73M4m52n06L4N92M51o85k729n289p509q498q242p572o997o159
59830D03149m838l697l390l443k927j839j024q60q76o71n06p92j507k330k989
59815C71460l297l198k847k401j777r02j71j84r12j511j223j94P42R52M74k18
59799C54793p24j015j318j789k361k875l254l497l604l620l608l485l029k213
59785C18401j361q65p71q41q37o41k79L1l5n43j156j491j453j128n41J51N76N88
59767C07805O09J113J896K315K192J963J941J977J980K208K688K857K269J424
59753C35237J273J996K778K913K728L034L972M834M998M694M564M752M735M066
59739C86574K993K184J930J803J204J21p69q15j55M64N36K79J47K26L63N98J005
$$ y = [455368, 456193, 456666, 456710, 456258, 455752, 455786, 456378, 456829, 456144, 453415, 448126, 440617, 432119, 423877, 416305, 409308, 403149, 398311, 394614, 391224, 387781, 384854, 383015, 381991, 381131, 380255, 379584, 379078, 378286, 376779, 374449, 371460, 368163, 364965, 362118, 359717, 357940, 357038, 356867, 356683, 355771, 354260, 353037, 352843, 353585, 354537, 355011, 354793, 354069, 353054, 351736, 349947, 347586, 344711, 341457, 337960, 334356, 330736, 327128, 323643, 320614, 318401, 317040, 316175, 315404, 314563, 313726, 313085, 312806, 312837, 312802, 312259, 311103, 309612, 308159, 307031, 306490, 306641, 307217, 307805, 308414, 309527, 311423, 313738, 315930, 317893, 319834, 321811, 323791, 325999, 328687, 331544, 333813, 335237, 336510, 338506, 341284, 344197, 346925, 349959, 353931, 358765, 363763, 368457, 373021, 377773, 382508, 386574, 389567, 391751, 393681, 395484, 396688, 396809, 396040, 395225, 395070, 395534, 396070, 396349, 396496, 396722, 397085, 397683, 398688]
59722C98688J246Q42m0n69k73L53N62L34K48N18O97L27l99q25n45J88P50Q18O67
59703D03587P71J188J509J412J049Q26R18J125J137Q82O52P82J165J252P01j27
59687D18829o51q11r46j103j000p02o31q39q73o36o91j401k277k690k794l140
59671C97644l760m175m143l859l551l281l024k632j901r98n41q87j583j883j518
59656C59908o47N59J748K259J947J729K501L709L911K735J235K92l40j031j379
59641C79136r95m01l59q04j112j120j149j269j224j013r15r45q04m43j90k44l98
59624C65751m91p36j339k013k186j692j039r38j543k285k433j858j107p26p07
59609C44658o56l60J22P04J334J770J713J276R66J043J130P70Q6m54p38r91j203
$$ y = [398688, 399934, 400776, 400736, 400167, 399894, 400247, 400809, 401143, 401391, 401909, 402606, 402933, 402534, 401709, 401164, 401352, 402102, 402920, 403587, 404358, 405546, 407055, 408467, 409516, 410342, 411260, 412385, 413522, 414404, 415056, 415838, 417003, 418255, 418956, 418829, 418178, 417367, 416421, 415318, 414318, 413616, 412985, 412146, 411273, 410637, 409946, 408545, 406268, 403578, 400784, 397644, 393884, 389709, 385566, 381707, 378156, 374875, 371851, 369219, 367318, 366320, 365779, 364892, 363309, 361426, 359908, 359261, 359820, 361568, 363827, 365774, 367503, 370004, 373713, 377624, 380359, 381594, 381886, 381546, 380515, 379136, 378141, 377740, 377381, 376577, 375465, 374345, 373196, 371927, 370703, 369690, 368775, 367830, 367026, 366583, 366393, 366149, 365751, 365260, 364524, 363185, 361172, 358986, 357294, 356255, 355317, 353774, 351489, 349056, 347198, 346091, 345365, 344658, 344002, 343642, 343764, 344468, 345802, 347572, 349285, 350561, 351527, 352570, 353700, 354470, 354556, 354102, 353364, 352373, 351170]
59592C51170j119q30p51q62n93J55N04k49j468j879j248n17m23p79j220j825k623
59575C35443l240l391l262l022k482j599q85p48q27m33N78J730K500K568J839
59560C24769O23l88o85l28L98J239J744J323J25o59l7J535K780L142L094L170
59544C41845L481M072M992O028P015Q386J0691J3685J6472J8453J9282J8026J3638
59531D86066O677l66n188p540q472q476p249m932k549r95j42P35J940L021L371
59516D55901K930K124J290M13n05j279j960l018m663o286p145p381p685q166q294
59501D06276p908p459p073o330n226m543m729n044m451k916j268j77J91j11q06
59486C48426j293j072j81J059K459L734M295L829K956K664L177L888M351M772
$$ y = [351170, 350051, 349221, 348470, 347608, 347015, 347170, 347674, 347425, 345957, 344078, 342830, 342313, 341890, 341111, 339891, 338066, 335443, 332203, 328812, 325550, 322528, 320046, 318447, 317562, 316814, 315987, 315554, 316132, 317862, 320362, 322930, 324769, 325392, 325004, 324319, 323991, 324389, 325628, 327372, 328695, 328820, 328161, 328124, 329659, 332439, 335581, 338675, 341845, 345326, 349398, 354390, 360418, 367433, 375819, 386510, 400195, 416667, 435120, 454402, 472428, 486066, 492743, 492377, 487189, 479649, 471177, 462701, 455452, 450520, 447971, 446976, 446834, 447569, 449509, 452530, 455901, 458831, 460955, 462245, 462658, 462153, 460874, 458914, 455896, 451233, 444947, 437802, 430421, 422736, 414570, 406276, 398368, 390909, 383836, 377506, 372280, 367737, 363008, 357964, 353513, 350597, 349329, 349152, 349343, 349232, 348426, 347133, 346061, 345880, 346939, 349398, 353132, 357427, 361256, 364212, 366876, 370053, 373941, 378292, 383064]
59472C83064N368N802N564M628L426K292J223J59o94r77n44L58J405K476L547
59457D17097M427M902N118N553O477P696Q867R836J0579J1030J1142J0932J0397
59444E24053R519Q342O805M515J095l113p001r576j0633j0546r798q903q420q609
59430D77730r204r691r682q934p354n245l236j710m90P73K169L682N487P773J0465
59415D52533J3316J6108J8627K0592K1824K2146K1063J7880J2461N693j056o697
59403F14490j0563j2241j1737r603o575l237k77J317P12k148o618j1765j6496
59390E25259j9647k0534j9485j7549j5649j4106j2726j1093q937o483m402l210
59378C71438k846k863k790k249j103L09J321J614J407J019O21N16J011J733J808
$$ y = [383064, 388432, 394234, 399798, 404426, 407852, 410144, 411367, 411526, 410832, 409855, 409311, 409669, 411074, 413550, 417097, 421524, 426426, 431544, 437097, 443574, 451270, 460137, 469973, 480552, 491582, 502724, 513656, 524053, 533572, 541914, 548719, 553234, 554329, 551216, 544215, 534639, 524006, 513460, 503662, 494759, 486339, 477730, 468526, 458835, 449153, 440219, 432865, 427620, 424384, 422674, 422184, 422957, 425126, 428808, 434295, 442068, 452533, 465849, 481957, 500584, 521176, 543000, 565146, 586209, 604089, 616550, 622243, 621187, 614490, 603927, 591686, 579949, 570346, 563771, 560534, 560257, 561574, 562286, 560138, 553520, 541755, 525259, 505612, 485078, 465593, 448044, 432395, 418289, 405563, 394470, 385533, 379050, 374648, 371438, 368592, 365729, 362939, 360690, 359587, 359896, 361217, 362831, 364238, 365257, 365878, 366394, 367405, 369138, 370946]
59363C70946J140Q26J671K977L610L643M015M928N667N899O138O811P701Q438
59349D34410Q964R333R679J0336J1509J2823J3788J4527J5381J6020J5797J4900
59337E87467J4113J3396J1715Q727N522L205J557k93k575m903o968q552r327r364
59323F03720r406j0005j0688j0567r540q268p242o463n875n501n149m515l513
59310E06988k113r9K538N116O818P736Q685R811R996P975L722j584o566j0374
59296E48649j2685j3535j3275j2458j1522j0588r514q167o633n142l792k444j007
59283D37887K99J134J531J966K825L879M482M313L768L611M279N586P097Q544
59269D91201R892J1124J2123J2751J2914J2495J1391R632P449N195L082J004j367
$$ y = [370946, 372086, 372912, 374583, 377560, 381170, 384813, 388828, 393756, 399423, 405322, 411460, 418271, 425972, 434410, 443374, 452707, 462386, 472722, 484231, 497054, 510842, 525369, 540750, 556770, 572567, 587467, 601580, 614976, 626691, 635418, 640940, 644145, 645702, 645409, 642834, 637931, 630963, 622411, 613084, 603720, 594314, 584309, 573621, 563054, 553514, 545246, 538004, 531541, 525666, 520165, 515016, 510501, 506988, 504875, 504776, 507314, 512430, 519248, 526984, 535669, 545480, 555476, 563451, 567173, 565589, 559023, 548649, 535964, 522429, 509154, 496696, 485174, 474586, 465072, 456905, 450272, 445130, 441338, 438894, 437887, 438186, 439320, 440851, 442817, 445642, 449521, 454003, 458316, 462084, 465695, 469974, 475560, 482657, 491201, 501093, 512217, 524340, 537091, 550005, 562500, 573891, 583523, 590972, 596167, 599249, 600253, 598886]
59256E98886m120o740q434q963q959r198r757j0119r982r526q964q265p428o648
59242D81783n959n113l995k897k027j063L95K045L055L105K866L193M059M550
59228D83997L866K229O88J14L22K53r65l096n071o113o409o637p114p685q175
59213D40204q466q200o917m840l047k425k651k719k247j815j962k465k723k378
59199C87349j349K58J940K912K873K403K212K243J977J362R17Q96R39P28N40Q31
59183D09031J516K021K012J821K026K798L768M548N071N330N088M196L153K897
59169D55276L879N594P179Q128Q447Q408Q392Q641Q973Q975Q584Q071P413O146
59155E62106M155K001J43j670l719n534o464o677o886p350p752p897p883p667
$$ y = [598886, 594766, 588026, 579592, 570629, 561670, 552472, 542715, 532596, 522614, 513088, 504124, 495859, 488431, 481783, 475824, 470711, 466716, 463819, 461792, 460729, 461124, 463169, 466224, 469329, 472195, 475388, 479447, 483997, 487863, 490092, 490780, 490894, 491216, 491469, 490504, 487408, 482337, 476224, 469815, 463178, 456064, 448379, 440204, 431738, 423538, 416621, 411781, 408734, 406309, 403658, 400939, 398692, 396877, 394915, 392450, 389727, 387349, 386000, 386258, 388198, 391110, 393983, 396386, 398598, 400841, 402818, 404180, 405097, 405993, 406932, 407660, 408200, 409031, 410547, 412568, 414580, 416401, 418427, 421225, 424993, 429541, 434612, 439942, 445030, 449226, 452379, 455276, 459155, 464749, 471928, 480056, 488503, 496911, 505303, 513944, 522917, 531892, 540476, 548547, 555960, 562106, 566261, 568262, 568405, 566735, 563016, 557482, 551018, 544341, 537455, 530105, 522353, 514456, 506573, 498906]
59141D98906p112o396n855n458m984m548m442m512m318l778l087k201j086k78
59127D40851l95j017r01N62K760M759O093O581O276N811N972O710P252P334P556
59112E06204Q226Q792Q803Q595Q501Q222P530O822O345N615M342L223L000L248
59098E97468K982K045J039J81q51k118l248l995m265l786k447r41l16p70j525
59083E79453j965k321l089m193n097n482n607n994o804p580p753p394p045o871
59069E02258o511n919n651n871n830m982l980l724l902l526k536j887k010k234
59055D43695j900j121k86M90J108J379J388J467J560J251N92L06P99J536J764
59040D54028J442J120J169J477J648J372P85M78Q82J670K218K519L086L945M525
$$ y = [498906, 491794, 485398, 479543, 474085, 469101, 464553, 460111, 455599, 451281, 447503, 444416, 442215, 441129, 440851, 440456, 439439, 438538, 439100, 441860, 446619, 452712, 459293, 465569, 471380, 477352, 484062, 491314, 498648, 506204, 514430, 523222, 532025, 540620, 549121, 557343, 564873, 571695, 578040, 583655, 587997, 591220, 594220, 597468, 600450, 602495, 603534, 603715, 602864, 600746, 597498, 593503, 589238, 585452, 583005, 582064, 581748, 580978, 579453, 577488, 575167, 572078, 567885, 562788, 557306, 551699, 545705, 538901, 531321, 523568, 516174, 509129, 502258, 495747, 489828, 484177, 478306, 472476, 467494, 463514, 459790, 455888, 452362, 449826, 447939, 445929, 443695, 441795, 440674, 440388, 440878, 441986, 443365, 444753, 446220, 447780, 449031, 449623, 449929, 450728, 452264, 454028, 455470, 456590, 457759, 459236, 460884, 462256, 463041, 463519, 464401, 466071, 468289, 470808, 473894, 477839, 482364]
59025D82364M669M988N850O748P179P459Q096Q872R213R037Q579P725O239M439
59011E81457K955J933J077L31r1k89o07r35o58M75J905K933L490M014M779N581
58995F08350N966N761N346N274N487N208L910K101O68k78j301k564l621m332n104
58980F30871o039o537o191n365m485l349j742j38R66J875L107M371N039N393O295
58965F24071P702Q565Q482Q304Q698R064Q578P509O590N700M131J868m13k462
58951G06387m679p128r215j0519j1251j1574j1260j0370r669r718r969r378p831
58938E83826o302n673n817n969n669n095m637m398m083l384k382j472r37o72m52
58923E26884k34j03j6J51L67N01O54J205K343L676M534M729M781N338O438P551
$$ y = [482364, 487033, 492021, 497871, 504619, 511798, 519257, 527353, 536225, 545438, 554475, 563054, 570779, 577018, 581457, 584412, 586345, 587422, 587753, 587662, 587373, 586766, 585831, 585173, 585648, 587553, 590486, 593976, 597990, 602769, 608350, 614316, 620077, 625423, 630697, 636184, 641392, 645302, 647403, 648071, 647793, 646492, 643928, 640307, 635975, 630871, 624832, 618295, 612104, 606739, 602254, 598905, 597163, 597025, 597991, 599866, 602973, 607344, 612383, 617776, 624071, 631773, 640338, 648820, 657124, 665822, 674886, 683464, 690973, 697563, 703263, 707394, 709262, 708849, 706387, 701708, 694580, 685365, 674846, 663595, 652021, 640761, 630391, 620722, 611004, 601035, 591657, 583826, 577524, 571851, 566034, 560065, 554396, 549301, 544664, 540266, 536183, 532799, 530417, 528945, 528008, 527336, 526884, 526650, 526547, 526531, 526682, 527049, 527550, 528204, 529409, 531752, 535428, 539962, 544691, 549472, 554810, 561248, 568799]
58907E68799Q222Q429Q338Q071P821P930Q467Q901Q563P438O283N812N988O198
58893F75260O062N878O212P203Q439R688J1371J3881J6563J8086J7973J7196J6897
58880H30709J6989J6561J5113J2781R716O073K422o26l231o024r042j1693j3738
58867H66010j5538j7148j8089j8329j8561j9060j9039j7844j6155j5216j5262
58856F75769j5505j5342j4837j4146j3191j2065j1121j0507r987r347q716q287
58844E32718p958p389o400n257m471m224m067l517k920l216m589n825n531l751
58830D63603j885j076j121j022k84N74O87r8r20p63M16J687K244K205K184K472
58814D68903K963L529M079M322L910K868J687R58R27J304J456R18j40j091j456
$$ y = [568799, 577021, 585450, 593788, 601859, 609680, 617610, 626077, 634978, 643541, 650979, 657262, 663074, 669062, 675260, 681322, 687200, 693412, 700615, 709054, 718742, 730113, 743994, 760557, 778643, 796616, 813812, 830709, 847698, 864259, 879372, 892153, 901869, 907942, 910364, 909738, 906507, 900483, 891441, 879748, 866010, 850472, 833324, 815235, 796906, 778345, 759285, 740246, 722402, 706247, 691031, 675769, 660264, 644922, 630085, 615939, 602748, 590683, 579562, 569055, 559068, 549721, 541005, 532718, 524760, 517371, 510971, 505714, 501243, 497019, 492952, 489435, 486515, 483299, 478710, 472885, 467354, 463603, 461718, 460642, 459521, 458499, 458215, 458789, 459476, 459378, 458458, 457695, 458111, 459798, 462042, 464247, 466431, 468903, 471866, 475395, 479474, 483796, 487706, 490574, 492261, 493219, 494146, 495450, 496906, 497824, 497684, 496593, 495137]
58799D95137j230o53j7K70j85j302k458l048k908k212j298o43n85q76q46j46R99
58782D77999K339L863N318O095N966N470N174M942M277L051J449l95k294l824
58768E19430m704n132n489n911o371o779o766n918m505l495l416l723l644l155
58754D50422k616k016j217m40R5O03J244J671J707J925K786L723L955L805M231
58739D69878N244N836N505M886M789N293N953O276N962N171M576M644M973M844
58725E43830M199L530L019K529K182K196K223J722Q91N49J000J735K236K398K267
58710E76506K072K433L667M970N143M190L206K645J693l13k828m964o586q014
58696E83820r276j0266j1204j2346j3439j3841j3093j1230q840o786n573m942
$$ y = [495137, 493907, 493254, 493237, 493507, 493322, 492020, 489562, 486514, 483606, 481394, 480096, 479453, 478868, 477992, 477146, 477000, 477999, 480338, 484201, 489519, 495614, 501580, 507050, 512224, 517166, 521443, 524494, 525943, 525548, 523254, 519430, 514726, 509594, 504105, 498194, 491823, 485044, 478278, 472360, 467855, 464360, 460944, 457221, 453577, 450422, 447806, 445790, 444573, 444133, 444228, 444831, 446075, 447746, 449453, 451378, 454164, 457887, 461842, 465647, 469878, 475122, 480958, 486463, 491349, 496138, 501431, 507384, 513660, 519622, 524793, 529369, 534013, 538986, 543830, 548029, 551559, 554578, 557107, 559289, 561485, 563708, 565430, 566321, 566870, 567870, 569605, 571841, 574239, 576506, 578578, 581011, 584678, 589648, 594791, 598981, 602187, 604832, 606525, 606212, 603384, 598420, 591834, 583820, 574544, 564278, 553074, 540728, 527289, 513448, 500355, 489125, 480285, 473499, 467926, 462984]
58684D62984m381l887l774l936l903l577l244k887k244j482j110j068p14J74J118
58669D28069J851K773M212N890P421Q706R587R764R289Q540P448N415K349q26
58655E10488l082m245m750m935m891m610m020l228k785l221m196m654m053k923
58641D54895k082j806j899k025j809j079j30O57J412K365L084K950K305K157K658
58626D61653K897K384J683J281R39O17R14J990L029L420L618M176M779N010N227
58611E03617N782O090N413M116L169K796K370J459K65p87j407j578j704k288l153
58596E24160l441k794j942j696j921k053k014j978j698q70K70J322K483M229O420
58581E18477Q283R196R184Q769Q579Q821Q974Q346P035N815N026M323L715L938
$$ y = [462984, 458603, 454716, 450942, 447006, 443103, 439526, 436282, 433395, 431151, 429669, 428559, 427491, 426777, 426951, 428069, 429920, 432693, 436905, 442795, 450216, 458922, 468509, 478273, 487562, 496102, 503550, 508965, 511314, 510488, 507406, 503161, 498411, 493476, 488585, 483975, 479955, 476727, 473942, 470721, 466525, 461871, 457818, 454895, 452813, 451007, 449108, 447083, 445274, 444195, 444065, 444722, 446134, 448499, 451583, 454533, 456838, 458995, 461653, 464550, 466934, 468617, 469898, 470837, 471454, 472368, 474358, 477387, 480807, 484425, 488601, 493380, 498390, 503617, 509399, 515489, 520902, 525018, 528187, 530983, 533353, 534812, 535077, 534290, 532883, 531305, 529601, 527313, 524160, 520719, 517925, 515983, 514287, 512366, 510313, 508299, 506321, 504623, 503753, 504023, 505345, 507828, 512057, 518477, 526760, 535956, 545140, 553909, 562488, 571309, 580283, 588629, 595664, 601479, 606505, 610828, 614543, 618481]
58567F18481N318P112Q581R962J1689J3418J4629J5609J6967J8538J9596J9858
58555G79758J9539J8676J7045J4572J1401P790M257J410p05k653m602n972o453
58542H54063o717p503q665r770j0979j2514j3856j4334j4153j4011j4036j3863
58530G13662j3449j3093j2803j2230j1128r475p469n681m665m140l138j441j06
58517F14844Pn34o48j80L19O58J032J462J890K341K472J679K12o70l26L16K21
58500F25095l68q29j402k372k997k597j881j801j855j072K5J01p75j272q46p2
58484F05082Q79K370M019M869N067N874P803J0054J1910J3422J4485J4623J3933
58471G14390J2989J1567Q791M892J508k25q20j254j728k109k524k961l071k849
$$ y = [618481, 623799, 630911, 639492, 649454, 661143, 674561, 689190, 704799, 721766, 740304, 759900, 779758, 799297, 817973, 835018, 849590, 860991, 868781, 873038, 874448, 873743, 871090, 866488, 860516, 854063, 847346, 839843, 831178, 821408, 810429, 797915, 784059, 769725, 755572, 741561, 727525, 713662, 700213, 687120, 674317, 662087, 650959, 641484, 634015, 628334, 623669, 619529, 616391, 614950, 614844, 614851, 614317, 613669, 613489, 613808, 614466, 615498, 616960, 618850, 621191, 623663, 625342, 625554, 624884, 624558, 624874, 625095, 624727, 623898, 622496, 620124, 617127, 614530, 612649, 610848, 608993, 607921, 607946, 608047, 607272, 606000, 605154, 605082, 605961, 608331, 612350, 617219, 622286, 628160, 635963, 646017, 657927, 671349, 685834, 700457, 714390, 727379, 738946, 747737, 752629, 754137, 753912, 753092, 751838, 750110, 748001, 745477, 742516, 739445, 736596]
58457G36596k669k323r78J477L918N340N915O148N907M890L406J888J80j942m003
58442G63750n244n649n909o430o885o793o136n225m146k668p52J155K636L863
58428G15567N205O391O809O666O937P955Q936R362R825J0765J1363J0587Q684
58415H25052O594M610K548P19m51j377k768m417n444n517n029m418m122m626n712
58400G95642o113m920k839j190k31N87J421K151L092M362N173M922M328M229M096
58385H14710L154K135K193K815K621J779J672K501L183L389L703L855K894J233
58371H51837N22J218K128K620L432M857N989O356O768P865R302J0751J2323J3635
58357I39603J3868J3259J3047J3541J3574J2306J0294Q369O748N590N133M927
$$ y = [736596, 733927, 731604, 730626, 732103, 736021, 741361, 747276, 753424, 759331, 764221, 767627, 769515, 769695, 767753, 763750, 758506, 752857, 746948, 740518, 733633, 726840, 720704, 715479, 711333, 708665, 707913, 709068, 711704, 715567, 720772, 727163, 733972, 740638, 747575, 755530, 764466, 773828, 783653, 794418, 805781, 816368, 825052, 831646, 836256, 838804, 839523, 839072, 837695, 834927, 830510, 825066, 819549, 814520, 810102, 805980, 801354, 795642, 789529, 784609, 781770, 780580, 780349, 780936, 782357, 784508, 787600, 791962, 797135, 802057, 806385, 810614, 814710, 817864, 819999, 822192, 825007, 827628, 829407, 831079, 833580, 836763, 840152, 843855, 847710, 850604, 851837, 852359, 853577, 855705, 858325, 861757, 866614, 872603, 878959, 885727, 893592, 902894, 913645, 925968, 939603, 953471, 966730, 979777, 993318, 1006892, 1019198, 1029492, 1037861, 1044609, 1050199, 1055332, 1060259]
58345A060259M174L063K583K963L608M595O623R325J1229J1748J1747J1939J2223
58332A156079J2777J4122J5773J6451J5982J5454J5278J4666J3360J2162J1406
58321A313510J0529R541R281R757R865R199Q627Q667Q796Q708Q852R446J0355
58308A435133J1908J4292J6344J6694J6035J6343J8030J9855K1279K2623K3161
58297A631697K1830J9807J9590K1280K2544K2564K2972K4383K5195K4775K4840
58286A881477K6494K8617L0293L2239L4738L6705L7906L9534M1637M2572M1998
58275B274210M1694M2390M2578M1498M0597M0877M1586M2463M4375M6867M8182
58264B747317M8754N1319N6413O1180O3951O6434O9945P3166P5374P8183Q2145
$$ y = [1060259, 1064433, 1067496, 1070079, 1073042, 1076650, 1081245, 1087868, 1097193, 1108422, 1120170, 1131917, 1143856, 1156079, 1168856, 1182978, 1198751, 1215202, 1231184, 1246638, 1261916, 1276582, 1289942, 1302104, 1313510, 1324039, 1333580, 1342861, 1352618, 1362483, 1371682, 1380309, 1388976, 1397772, 1406480, 1415332, 1424778, 1435133, 1447041, 1461333, 1477677, 1494371, 1510406, 1526749, 1544779, 1564634, 1585913, 1608536, 1631697, 1653527, 1673334, 1692924, 1714204, 1736748, 1759312, 1782284, 1806667, 1831862, 1856637, 1881477, 1907971, 1936588, 1966881, 1999120, 2033858, 2070563, 2108469, 2148003, 2189640, 2232212, 2274210, 2315904, 2358294, 2400872, 2442370, 2482967, 2523844, 2565430, 2607893, 2652268, 2699135, 2747317, 2796071, 2847390, 2903803, 2964983, 3028934, 3095368, 3165313, 3238479, 3313853, 3392036, 3474181]
58253C474181Q5193Q6349Q7561R0052R2520R4709R8854J05549J12111J17156J22858
58242D567093J30607J38676J46325J55685J67172J77742J86339J96246K09210
58233F075095K22371K34142K47840K65794K85184L03645L23843L48334L75064
58224H681312M02267M32616M68214N06753N47085N93018O47066P06529P70485
58215A3755345Q44279R31919J030938J140219J265565J411534J576048J760188
58207B3716035J975255K233077K538944K903019L349356L904571M588487N427077
58199E0635821O463771P746273R314628J1215267J3510894J6255839J9466115
58192A34608608K3106407K7040462L0912566L4065621L5632136L4768238L0881307
$$ y = [3474181, 3559374, 3645723, 3733284, 3823336, 3915856, 4010565, 4109419, 4214968, 4327079, 4444235, 4567093, 4697700, 4836376, 4982701, 5138386, 5305558, 5483300, 5669639, 5865885, 6075095, 6297466, 6531608, 6779448, 7045242, 7330426, 7634071, 7957914, 8306248, 8681312, 9083579, 9516195, 9984409, 10491162, 11038247, 11631265, 12278331, 12984860, 13755345, 14599624, 15531543, 16562481, 17702700, 18968265, 20379799, 21955847, 23716035, 25691290, 27924367, 30463311, 33366330, 36715686, 40620257, 45208744, 50635821, 57099592, 64845865, 74160493, 85375760, 98886654, 115142493, 134608608, 157715015, 184755477, 215668043, 249733664, 285365800, 320134038, 351015345]
58185C51015345K3804020J3970387K517932q908679j8694228k5806892k9994453
58178C07903432l1594889l1227310k9564525k7189678k4507536k1743969j9026860
58171A23048665j6456759j4110310j2022254j0197700q633468p315573o212138
58164D8100463n287293m516606l880671l354158k912383k541138k231026j968834
58156B1408354j742491j547795j382484j239252j111074r97525q99336q12120
58148A1676277p31496o59256n98374n46432m99510m58235m24603l96665l71279
58139F990427l48516l28881l09747k88820k67927k49499k32648k16026k01074
58130D547289j88940j77716j66025j55754j48082j40594j31586j23384j17931
$$ y = [351015345, 374819365, 388789752, 391307684, 382399005, 363704777, 337897885, 307903432, 276308543, 245081233, 215516708, 188327030, 163819494, 142075525, 123048665, 106591906, 92481596, 80459342, 70261642, 61628174, 54312601, 48100463, 42813170, 38296564, 34415893, 31061735, 28149352, 25608214, 23377188, 21408354, 19665863, 18118068, 16735584, 15496332, 14385258, 13387733, 12488397, 11676277, 10944781, 10285525, 9687151, 9140719, 8641209, 8182974, 7758371, 7361706, 6990427, 6641911, 6313030, 6003283, 5714463, 5446536, 5197037, 4964389, 4748363, 4547289, 4358349, 4180633, 4014608, 3858854, 3710772, 3570178, 3438592, 3315208, 3197277]
58121C197277j12935j06071r9275r4929r1315q5921q0075p6279p3730p0482o7314
58110B238951o5568o3725o0018n6140n4541n4295n3279n2208n2732n3540n2270
58099A620635m9525m7306m5170m1601l7690l5573l4422l1604k6962k2645j9470
58088A228667j6663j4378j3496j3502j3360j3727j5682j8011j8511j7382j6743
58077A057212j7334j8117j8571j9052j9248j8637j7925j8055j8261j7115j4990
58066H59907j3529j3198j3134j2894j2587j1946j0861j0210j0630j1265j1228
58055G28425j1276j2366j3585j3410j2130j1229j1050j0807j0230r576q697p479
58043E96590o495o026n421m506m318n158n535m565l731m379n257m794m181n560
$$ y = [3197277, 3084342, 2978271, 2878996, 2784067, 2692752, 2606831, 2526756, 2450477, 2376747, 2306265, 2238951, 2173383, 2109658, 2049640, 1993500, 1938959, 1884664, 1831385, 1779177, 1726445, 1672905, 1620635, 1571110, 1523804, 1478634, 1437033, 1399343, 1363770, 1329348, 1297744, 1270782, 1248137, 1228667, 1212004, 1197626, 1184130, 1170628, 1157268, 1143541, 1127859, 1109848, 1091337, 1073955, 1057212, 1039878, 1021761, 1003190, 984138, 964890, 946253, 928328, 910273, 892012, 874897, 859907, 846378, 833180, 820046, 807152, 794565, 782619, 771758, 761548, 750918, 739653, 728425, 717149, 704783, 691198, 677788, 665658, 654429, 643379, 632572, 622342, 612766, 604069, 596590, 590095, 584069, 578648, 574142, 569824, 564666, 559131, 554566, 550835, 546456, 541199, 536405, 532224, 526664]
58029E26664q364j0140j0199r901r828r208p835o508n697n414n881o823o955n779
58015D18132m796n203n666m565l046l295m826n341m497l978m222l979l003k480
58001C59235k631k371j546j211j531j508r91q40r86m03R10J867K274K935L755
57986C56958L774L075K605K121N29j666k584j926j436j909k125j315n33o20q64
57971C54084o26n37j107j703j810j898k215k116j376p89p46n13L49J094J048O30
57955C41769M38M25M30N11L48n06j442j182K91J500J589J264J243J262J198J675
57939C50813K752L450L413L660M800N810N641M816M325M017L253K236J446N02
57925D00934j190l188m539n250o155p535q698q975q427p604o976o633o256n489
$$ y = [526664, 518300, 508160, 497961, 488060, 478232, 469024, 461189, 454681, 448984, 443570, 437689, 430866, 423911, 418132, 413336, 408133, 402467, 397902, 394856, 391561, 386735, 381394, 376897, 372919, 368697, 364718, 361715, 359235, 356604, 354233, 352687, 351476, 349945, 348437, 347446, 346606, 345620, 345217, 346127, 347994, 350268, 353203, 356958, 360732, 363807, 366412, 368533, 369062, 367396, 364812, 362886, 361450, 359541, 357416, 356101, 355568, 354948, 354084, 353458, 352921, 351814, 350111, 348301, 346403, 344188, 342072, 340696, 339907, 339161, 338648, 338997, 340091, 341139, 341769, 342207, 342632, 343062, 343573, 343921, 343415, 341973, 340791, 341082, 342582, 344171, 345435, 346678, 347940, 349138, 350813, 353565, 357015, 360428, 364088, 368888, 374698, 380339, 385155, 389480, 393497, 396750, 398986, 400432, 400934, 399744, 396556, 392017, 386767, 380612, 373077, 364379, 355404, 346977, 339373, 332397, 325764, 319508, 314019]
57911C14019m356l182k181j445j173j349j379p27K10N70K94Q3K01J88r7k17mK37
57893B99692N56J385K446K668J635K13o97j230j852k378k344j828j348j301j832
57878B93785k871m073n094n937o655o836o024m593l449k899k567k358k568k932
57864B34929k575j211L40J195J277J081J164J927L220M205M330M274M986N983
57850B65125N835M342K892K453K474K100J281J87j266k739l365k983k541k751
57836B71044l193l236k949k532j819q70j96J76R67K386L491L569L295L751M919
57821B78803N883O040N477M626M004L817L442J849j096m307o733q256r076r080
57807B75393q324p431o999p052p378p710p447n996l754j897r41l59K20M72M09
$$ y = [314019, 309663, 306481, 304300, 302855, 301682, 300333, 298954, 298227, 298437, 299007, 299301, 299384, 299585, 299773, 299676, 299459, 299455, 299692, 300248, 301633, 304079, 306747, 308382, 308595, 307898, 306668, 304816, 302438, 300094, 298266, 296918, 295617, 293785, 290914, 286841, 281747, 275810, 269155, 262319, 256295, 251702, 248253, 245354, 242787, 240429, 237861, 234929, 232354, 231143, 231483, 232678, 233955, 235036, 236200, 238127, 241347, 245552, 249882, 254156, 259142, 265125, 270960, 275302, 278194, 280647, 283121, 285221, 286502, 286689, 285423, 282684, 279319, 276336, 273795, 271044, 267851, 264615, 261666, 259134, 257315, 256445, 256249, 256425, 257392, 259778, 263269, 266838, 270133, 273884, 278803, 284686, 290726, 296203, 300829, 304833, 308650, 312092, 313941, 312845, 308538, 301805, 293549, 284473, 275393, 267069, 259638, 252639, 245587, 238209, 230499, 223052, 217056, 213302, 211405, 210464, 210105, 210325, 210797, 211206]
57792B11206O91J416J708J197P69J110J679J981K667M330O099O704O211N616N312
57777B58696N023M710M505M088L110J891R31J32p70j450j556j578k300l667m933
57762B66832n659n936o000o154o704p379p291o002m205k817j986j500j444j804
57748B01951k049j881j737j900j827j089k38J21L07O58N31o30j917k000j080m63
57732A86757n41n46j08K59K63K01J34k68r86j570j843j922j650q66n7J56j4M9
57714A77448J78k65j043j236p73o32j270k000k193k075j962j651j059o44o85q19
57698A59319p03m60k00K73Q32Q95L78J48Q30J730J672N86m82p99o30m05J16J392
57680A64492L177M628N355N924P063Q727J0469J2525J5848K0946K7148L3273L8466
$$ y = [211206, 211897, 213313, 215021, 216218, 216987, 218097, 219776, 221757, 224424, 228754, 234853, 241557, 247768, 253384, 258696, 263719, 268429, 272934, 277022, 280132, 282023, 282954, 283086, 282316, 280866, 279310, 277732, 275432, 271765, 266832, 261173, 255237, 249237, 243083, 236379, 229000, 221709, 215707, 211502, 208685, 206699, 205199, 203755, 201951, 199902, 198021, 196284, 194384, 192557, 191468, 191230, 191351, 191658, 192316, 192847, 192217, 190300, 188300, 187220, 186757, 186216, 185670, 185562, 185821, 186084, 186285, 186419, 186151, 185165, 183595, 181752, 179830, 178180, 177314, 177257, 177413, 177399, 177448, 177626, 177361, 176318, 175082, 174309, 173677, 172407, 170407, 168214, 166139, 164177, 162526, 161467, 160823, 160138, 159319, 158616, 158156, 157956, 158229, 159061, 159956, 160334, 160482, 161312, 163042, 164714, 165300, 164818, 164019, 163389, 162984, 163100, 164492, 167669, 172297, 177652, 183576, 190639, 199366, 209835, 222360, 238208, 259154, 286302, 319575, 358041]
57667C58041M2105M3401M1497L5744K5839J2305k871j6776k7376l4378l8153l8704
57655D00674l6388l2731k9334k6316k2879j9009j5589j2966j0585q124o015m530
57643A76208l293k020j034o91p70p54m30L8L37K48j10l10r3K65L48J45p7k41l61
57624A67405k58P6J59m24j321j846j896j884j931j822j596j515j540j407j179
57609A49021j082j001o76l19l64p15r12q99r28q86m72J0j00q01j411j605j663
57592A35197j661j334q78r53j610k003j645j150j257j765j931j496p72j10L45
57577A16977N40N00K42l11j149j879k070j801j462j038k20P16R03O5q82q75O2
57560A08318R23Q75L0p40o40K54J064J195J056J349J877J828J105N35O01P61L83
$$ y = [358041, 400146, 443547, 485044, 520788, 546627, 558932, 556061, 539285, 511909, 477531, 439378, 400674, 364286, 331555, 302221, 275905, 253026, 234017, 218428, 205462, 194877, 186753, 180738, 176208, 172915, 170895, 169861, 169170, 168400, 167646, 167216, 167254, 167591, 167839, 167729, 167419, 167326, 167591, 167939, 168084, 168007, 167766, 167405, 167147, 167223, 167382, 166958, 165637, 163791, 161895, 160011, 158080, 156258, 154662, 153147, 151607, 150200, 149021, 147939, 146938, 146262, 145943, 145579, 144864, 143952, 143053, 142125, 141239, 140767, 140777, 140677, 139876, 138465, 136860, 135197, 133536, 132202, 131324, 130371, 128761, 126758, 125113, 123963, 122706, 120941, 119010, 117514, 116742, 116632, 116977, 117517, 118017, 118259, 117948, 116799, 114920, 112850, 111049, 109587, 108549, 108329, 109045, 109948, 110013, 109131, 108256, 108318, 109241, 110116, 110146, 109406, 108766, 109020, 110084, 111279, 112335, 113684, 115561, 117389, 118494, 119029, 119630, 120391, 120774]
57543A20774l72r58j221j248q84M5J197J834J540P23K74O04J001L66j206k145
57527A20324j314M23J381J294J190J326P82o93j872j723p38J25P71J398J614J137
57511A25425O52Q70J257Q10k58p36k04M46M01j32n60p41p76n85j48J75J1m91q09
57492A24607p24n72p56j189j389j151q06o49m16K74J140J426R29K54n5j39k95
57475A20489l91k46j58m82r67j118j053j382k155k546j952r53o73j329j936j652
57459A01496q66n46q01q02j07O92Q94O56N10M85L02Oj88m16q20r90m73L46O82
57440A00060M88L65M29J97l37n27j73J11%j4L75O41L51k2J36N86P40O45P45J036
57420A05832J121R73R37J126J248J037M52m07j256j626j263m70K20N84P07O80
$$ y = [120774, 120402, 119444, 118223, 116975, 116091, 116136, 117333, 119167, 120707, 121430, 121704, 122308, 123309, 123675, 122469, 120324, 119010, 119433, 120814, 122108, 123298, 124624, 125406, 124713, 122841, 121118, 120380, 120505, 121276, 122674, 124288, 125425, 126077, 126947, 128204, 129014, 128756, 128020, 127816, 128262, 128663, 128531, 127971, 127230, 126454, 125869, 125721, 125896, 125907, 125416, 124607, 123883, 123311, 122555, 121366, 119977, 118826, 118020, 117371, 116955, 117229, 118369, 119795, 120724, 120978, 120923, 120784, 120489, 120098, 119852, 119694, 119212, 118245, 117127, 116074, 114692, 112537, 109991, 108039, 107086, 106413, 105084, 103148, 101496, 100630, 100084, 99283, 98481, 98374, 99066, 99960, 100616, 101126, 101611, 101913, 101919, 101731, 101315, 100495, 99505, 99032, 99378, 100060, 100548, 100913, 101342, 101539, 101202, 100675, 100502, 100613, 100613, 100599, 100974, 101615, 101966, 101944, 102080, 102666, 103406, 104051, 104796, 105832, 106953, 107926, 108863, 109989, 111237, 112274, 112726, 112319, 111063, 109437, 108174, 107704, 107924, 108508, 109215, 109895]
57404A09895N85O48J032J507J569R69K9o20o05j56J39L7j50q5J38L68Q18J601
57386A17719K168J918J177Q65J183J453J258R31Q12P76P47Q90J090R93P35Q22
57370A35537J059N80o31j304n83O96J250R89O08K13n22j320j428p53rK73K87N42
57352A35484J203J854J729N38q39j033J30J331J498J053Q45P44K23l75k87L29
57336A44427O36M32J98N3k91n41M9J385K284J886N87o23j158j021n76l96p77j241
57318A45313r70R3J101J354J030O74M91L83L28L78N08P00R77J304J539J612J563
57301A58378J417J152Q37O56P38J006J104O66k28q98p52n8M76Q70J813L219L748
57284A74144K499M05q31p23q4M53R28J258J105O55P02J598K701L163K784J988
$$ y = [109895, 110480, 111128, 112160, 113667, 115236, 116205, 116234, 115614, 115009, 114853, 114992, 115029, 114879, 114794, 114932, 115300, 116118, 117719, 119887, 121805, 122982, 123847, 125030, 126483, 127741, 128672, 129484, 130260, 131007, 131897, 132987, 133980, 134715, 135537, 136596, 137176, 136545, 135241, 134658, 135354, 136604, 137593, 138201, 138414, 137892, 136572, 135144, 134391, 134382, 134655, 134942, 135484, 136687, 138541, 140270, 140808, 139969, 138936, 139066, 140397, 141895, 142948, 143793, 144537, 144760, 144385, 144098, 144427, 145063, 145495, 145693, 145746, 145455, 144914, 144963, 146348, 148632, 150518, 151105, 150482, 149324, 148303, 147727, 147331, 146554, 145313, 144343, 144436, 145537, 146891, 147921, 148595, 149086, 149469, 149797, 150175, 150683, 151383, 152360, 153664, 155203, 156815, 158378, 159795, 160947, 161784, 162440, 163178, 164184, 165288, 165954, 165726, 164828, 164076, 164018, 164494, 165364, 167177, 170396, 174144, 176643, 177048, 176217, 175494, 175410, 175863, 176791, 178049, 179154, 179809, 180511, 182109, 184810, 187973, 190757, 192745]
57268A92745J317J140J471J970K329K589K817K742K161J493J325J542J474R29
57254B18044M71N81J081J553J824J854J530Q59J96R5R05K428L865M422M121L768
57238B47597L862L985L605L020K919L335L652L427K697J698Q91R21J863K783K742
57223B88997K127K137L129M217M576M332M088M265M971N913O328N678M462L807
57209C49027M150M860N165M905M407M181M710N916O888O809O047N651N882O115
57195D24713O090O299O967P565P641P377P093O923P130P943Q889R072Q412P804
57181E29918P898Q451R093R799J0377J0382R958R835J0117J0060R498R419J0407
57168F55212J1493J1546J0943J0930J1808J2822J3466J3919J4421J4965J5560
$$ y = [192745, 194062, 195202, 196673, 198643, 200972, 203561, 206378, 209120, 211281, 212774, 214099, 215641, 217115, 218044, 218515, 219096, 220177, 221730, 223554, 225408, 226938, 227797, 227993, 228088, 228993, 231421, 235286, 239708, 243829, 247597, 251459, 255444, 259049, 262069, 264988, 268323, 271975, 275402, 278099, 279797, 280688, 281609, 283472, 286255, 288997, 291124, 293261, 296390, 300607, 305183, 309515, 313603, 317868, 322839, 328752, 335080, 340758, 345220, 349027, 353177, 358037, 363202, 368107, 372514, 376695, 381405, 387321, 394209, 401018, 407065, 412716, 418598, 424713, 430803, 437102, 444069, 451634, 459275, 466652, 473745, 480668, 487798, 495741, 504630, 513702, 522114, 529918, 537816, 546267, 555360, 565159, 575536, 585918, 595876, 605711, 615828, 625888, 635386, 644805, 655212, 666705, 678251, 689194, 700124, 711932, 724754, 738220, 752139, 766560, 781525, 797085]
57157G97085J6178J6554J6513J6331J6314J6377J6381J6540J6988J7316J7204
57146I79781J7130J7903J9594K1473K2831K3514K3846K4324K5190K6049K6358
57135A227993K6423K7311K9399L1774L3613L5368L7798M0563M2777M4537M6807
57124A624363N0006N3706N7564O1603O5629O9329P3022P7421Q2577Q7884R3251
57113B396355R9400J06830J15315J24729J35713J49029J64903J83386K04965K30445
57103C911070K60726K97122L41614L96446M63597N44782O41641P55621Q87635
57094H500254J037556J203480J381245J564822J747062J919588K072525K195760
57086B1622292K281192K322826K314161K247229K116555J924202J678673J387339
$$ y = [797085, 813263, 829817, 846330, 862661, 878975, 895352, 911733, 928273, 945261, 962577, 979781, 996911, 1014814, 1034408, 1055881, 1078712, 1102226, 1126072, 1150396, 1175586, 1201635, 1227993, 1254416, 1281727, 1311126, 1342900, 1376513, 1411881, 1449679, 1490242, 1533019, 1577556, 1624363, 1674369, 1728075, 1785639, 1847242, 1912871, 1982200, 2055222, 2132643, 2215220, 2303104, 2396355, 2495755, 2602585, 2717900, 2842629, 2978342, 3127371, 3292274, 3475660, 3680625, 3911070, 4171796, 4468918, 4810532, 5206978, 5670575, 6215357, 6856998, 7612619, 8500254, 9537810, 10741290, 12122535, 13687357, 15434419, 17354007, 19426532, 21622292, 23903484, 26226310, 28540471, 30787700, 32904255, 34828457, 36507130, 37894469]
57078C7894469J051079O68407K45520j98211o34866j038151j390987j686781j926070
57069C2984409k111716k245069k324886k349283k318831k238121k115162j960004
57061A5321337j783686j597426j411665j234997j073196r28766q01760o91590
57053E798251n98019n20148m55215l99451l50175l06386k67579k33055k02520
57044B465703j76132j53572j33862j16397j01138q7444p3867n9640m5288l1108
57034A487255j6413j211J2690K3518L1165L5056L1556J6362r925m0382o6588q3762
57022A419321r1434r1382q6363p9398p2479o5844n9022n2154m5831m0310l5512
57011F99592l1387k7771k4354k1266j9110j7995j7061j5620j4097j3235j2834
$$ y = [37894469, 38945548, 39613955, 39859475, 39661264, 39026398, 37988247, 36597260, 34910479, 32984409, 30872693, 28627624, 26302738, 23953455, 21634624, 19396503, 17281341, 15321337, 13537651, 11940225, 10528560, 9293563, 8220367, 7291601, 6489841, 5798251, 5200232, 4680084, 4224869, 3825418, 3475243, 3168857, 2901278, 2668223, 2465703, 2289571, 2135999, 2002137, 1885740, 1784602, 1697158, 1623291, 1563651, 1518363, 1487255, 1470842, 1469631, 1482321, 1505839, 1537004, 1572060, 1603616, 1619978, 1610053, 1569671, 1503083, 1419321, 1327887, 1236505, 1150142, 1070744, 998265, 932421, 873399, 821245, 775414, 735104, 699592, 668205, 640434, 616080, 594814, 575704, 557709, 540648, 525028, 510931, 497696, 484862]
57000D84862j2142j1076j0183r583q847p807o679n381l533j258Q07K468M219O256
56986D22123P952Q801R124R242Q464N845J719k385n480p924j0235j1903j2079
56973D23264j0978r770r171q792p947o494m666k698q57O14K031M245P540J0871
56959C87192J2817J3104J2480J1202Q487L750k248p982j2439j5478j7250j7868
56947C75767j7522j6486j4886j2797j0498q380o470m316j472K003N678R167J2304
56934C12092J4982J7031J8263J8425J7019J3463P672M75o782j3051j7864k1006
56922C60719k2347k2143k1134k0027j9007j7954j6840j5683j4295j2516j0595
56911A68178q969p704o470n115l958l350l211l150k875k376j782j127l11O79J554
$$ y = [484862, 472720, 461644, 451461, 441878, 433031, 425224, 418545, 413164, 409631, 408373, 409180, 411648, 415867, 422123, 430075, 438876, 448000, 457242, 465706, 471551, 473270, 470885, 465405, 457481, 447246, 435343, 423264, 412286, 402516, 393345, 384553, 376606, 370112, 365446, 362748, 361891, 362505, 364536, 368781, 376321, 387192, 400009, 413113, 425593, 436795, 445282, 449032, 446784, 438802, 426363, 410885, 393635, 375767, 358245, 341759, 326873, 314076, 303578, 295198, 288728, 284412, 282940, 284943, 290621, 299788, 312092, 327074, 344105, 362368, 380793, 397812, 411275, 418947, 419422, 412640, 399589, 381725, 360719, 338372, 316229, 295095, 275068, 256061, 238107, 221267, 205584, 191289, 178773, 168178, 159209, 151505, 145035, 139920, 135962, 132612, 129401, 126251, 123376, 121000, 119218, 118091, 117780, 118459, 120013]
56896A20013J936J883K011K863M446O505Q909J1336J2946J3138J2502J2207J2272
56883B22967J1193P801K882j543m186n214n376n206m989m758m115k509j8K607
56869B09536M761O672Q941J1760J4906J8239K1754K5126K7537K8095K6266K1903
56857D25496J5256P120j183q322j3522j6655j7985j7983j7224j6118j4594j2198
56845C12088q574l877J319O464J1493J6844K2921K9481L5676M0787M4518M6310
56833E55450M4797L8639K8026J4845J271j1440k2656l1632l7534m0017l9414l6472
56821D63863l2147k7332k2452j7385j1990o493j143M212R861J5737K1456K6616
56809D22803L0673L2757L2033K8263K1672J2567J557r951k0137k7831l2821l5213
$$ y = [120013, 121949, 123832, 125843, 128706, 133152, 139657, 148566, 159902, 172848, 185986, 198488, 210695, 222967, 234160, 241961, 244843, 243300, 239114, 233900, 228524, 223318, 218329, 213571, 209456, 206947, 206929, 209536, 214297, 220969, 229910, 241670, 256576, 274815, 296569, 321695, 349232, 377327, 403593, 425496, 440752, 447872, 446689, 438367, 424845, 408190, 390205, 372222, 354998, 338880, 324286, 312088, 303514, 299637, 300956, 307420, 318913, 335757, 358678, 388159, 423835, 464622, 509140, 555450, 600247, 638886, 666912, 681757, 683028, 671588, 648932, 617300, 579766, 539749, 500335, 463863, 431716, 404384, 381932, 364547, 352557, 346064, 344921, 349133, 358994, 374731, 396187, 422803, 453476, 486233, 518266, 546529, 568201, 580768, 582325, 572374, 552237, 524406, 491585, 456372]
56797D56372l5064l2847k9613k6265k2885j9105j4872j0556o524k857O61M426
56785B60871Q616J2671J5469J6401J5977J4845J2463P595K28p675j3842j7617
56773C26002j9816k1150k1542k0843j9353j7451j5270j3033j1215j0060r255q416
56761A38598p539o776o089n406m731l809k268n27R0j033k583k704j402m34p96
56746I2591j494j223k16L00j83r75j199o61O3K19l28q59o51J8L25J98L29P76O84
56727H7714k67j101r12j41L00L62N70R58J243J476J744J665J003L59M06Q49R59
56710I7187P06M88K26k70m57K87J416J769J236P25N59J07q77j698j846j628j414
56693I6516j110o92m10k19K39P83P47J10k35K35R11J060Q14O54N46K30j53k87
$$ y = [456372, 421308, 388461, 358848, 332583, 309698, 290593, 275721, 265165, 258641, 255784, 256445, 260871, 269487, 282158, 297627, 314028, 330005, 344850, 357313, 364908, 365136, 357461, 343619, 326002, 306186, 285036, 263494, 242651, 223298, 205847, 190577, 177544, 166329, 156269, 147014, 138598, 131059, 124283, 118194, 112788, 108057, 104248, 101980, 101453, 101543, 100510, 97927, 95223, 93821, 93387, 92591, 91097, 89874, 89658, 89958, 89775, 88800, 87601, 86940, 87003, 87222, 86894, 86035, 85384, 85402, 85727, 85925, 86254, 87030, 87714, 87447, 86346, 85434, 85293, 85593, 85955, 86525, 87483, 88726, 90202, 91946, 93611, 94614, 94973, 95379, 96228, 97187, 97893, 98381, 98607, 98337, 97880, 98167, 99583, 101352, 102588, 103313, 103872, 103979, 103102, 101404, 99558, 97930, 96516, 95406, 94714, 94304, 94085, 94324, 95107, 95854, 95964, 95729, 95964, 96875, 97935, 98749, 99403, 99949, 100179, 100026, 99739]
56675I9739j90r3q6j66l42n10m94l89m69p30r16j003j092r40k15O95R78N90L64
56656I4731P05J061J001R46J340J869K110K269K647K935K686K060J587J472J586
56641A21005J799J967J879J534J107N70k42j059j344j132j010j055o65K39P60
56626A24353L61k59k54J96N50Q71J350J502Q30k29r53j427k099k694k562j834
56610A17702j249j063r33p89q64j028r21o95q08j073p72J66R26Q93M22K11M21
56593A10546O46M78k9l49L1Q96J430J205P38O52P48M77n3k67n6J21K7j47k47k48
56573A16599mN72J207J629K019K507K572J737O85P31K199M184N933P558R137J0000
56557A69265R495P878N929M087K337O24r51k150k644k227j213l83l96j339k786
$$ y = [99739, 99549, 99456, 99370, 99204, 98862, 98352, 97858, 97469, 97000, 96270, 95354, 94351, 93259, 92319, 92104, 92799, 93777, 94367, 94731, 95436, 96497, 97498, 98444, 99784, 101653, 103763, 106032, 108679, 111614, 114300, 116360, 117947, 119419, 121005, 122804, 124771, 126650, 128184, 129291, 129861, 129619, 128560, 127216, 126084, 125074, 124019, 123354, 123593, 124353, 124714, 124455, 124201, 124397, 124947, 125818, 127168, 128670, 129500, 129271, 128318, 126891, 124792, 122098, 119536, 117702, 116453, 115390, 114457, 113668, 112804, 111776, 110855, 110160, 109352, 108279, 107507, 107673, 108599, 109492, 109914, 110125, 110546, 111192, 111670, 111641, 111292, 111323, 112219, 113649, 114854, 115592, 116244, 116992, 117469, 117416, 117149, 117093, 117214, 117241, 117094, 116847, 116599, 116595, 117167, 118374, 120003, 122022, 124529, 127101, 128838, 129523, 130254, 132453, 136637, 142570, 150128, 159265, 169265, 178760, 186638, 192567, 196654, 198991, 199615, 198664, 196514, 193870, 191643, 190430, 190047, 189651, 188312, 185526]
56542A85526m108m817m832m399l659k557j371q11j147j635j462r10q11j114r69
56527A50924j78M17K59j82l34m33q90j404j307n44K51M93J78k16j80K97O47L55
56509A48153l28o91n07k02o1J55N68P94M86j48p17j151j466j433r28l20o9j40
56491A41995j55J1K34N15R48J314J172M84j85k83R4M37N14N60P12O24k2q09q79
56472A47281o9O89M81m10q65l32O18J145J113R94J091J171Q65K55j05J69Q01J219
56454A56111J266J237J230J018O41N72R19J096O89K05K77N46R3j160k211k153
56438A60376j028M45J489J651J111O19P09J046R87O07N50R25J057M05p24j552
56422A68673j490m31J121K163K042J184N42L74J64l19o04m03r0k4L1M01Q59R87
$$ y = [185526, 181418, 176601, 171769, 167370, 163711, 161154, 159783, 158972, 157825, 156190, 154728, 153818, 153007, 151893, 150924, 150746, 151163, 151422, 151240, 150906, 150473, 149583, 148179, 146872, 146328, 146579, 147072, 147250, 147034, 146854, 147151, 147798, 148153, 147825, 147134, 146627, 146425, 146364, 146519, 147087, 147881, 148367, 148219, 147502, 146351, 144885, 143452, 142524, 142204, 142135, 141995, 141840, 141851, 142085, 142600, 143548, 144862, 146034, 146518, 146333, 146050, 146144, 146581, 147095, 147655, 148367, 148991, 148969, 148160, 147281, 147212, 147901, 148382, 147972, 147107, 146775, 147393, 148538, 149651, 150645, 151736, 152907, 153772, 154027, 153922, 154091, 154892, 156111, 157377, 158614, 159844, 160862, 161503, 162075, 162994, 164090, 164779, 164984, 165261, 165807, 165900, 164740, 162529, 160376, 159348, 159793, 161282, 162933, 164044, 164663, 165372, 166418, 167405, 168012, 168562, 169487, 170544, 170949, 170225, 168673, 167183, 166752, 167873, 170036, 172078, 173262, 173804, 174178, 174342, 174023, 173419, 173016, 172926, 172902, 172933, 173334, 174193, 175180]
56404A75180P97O51P18Q28P96O66P25J199J897K249J989J533J355J207N82k48
56388A92124m29J62O05K21m34k84R37K421L044K261N58q26r40n8O95O25L2l96
56370B00318l00L47J365K286K651K451K032J518Q26J83M5L65N71M08K16K39K34
56353B15755O6L5K71M21K18r1k59m47p70q30j71J101K462L451L866L805L702L892
56335B36477M029L424K099R77P34J052J281J276J232J218J267J531J911J988J656
56320B62152J344J267R82J72o10o35J7O96J104J307J158M45m37o73m3P78J140
56303B70164J237J693K561L186L099K698K725L237L538L206K584K072J530R01
56289C04431Q05J741L080L770L726L711L962M059L991M228M668M683M453N000
$$ y = [175180, 175977, 176628, 177346, 178174, 178970, 179636, 180361, 181560, 183457, 185706, 187695, 189228, 190583, 191790, 192372, 192124, 191695, 191857, 192462, 192683, 192249, 191965, 192902, 195323, 198367, 200628, 201186, 200360, 199420, 199362, 200057, 200682, 200714, 200318, 200018, 200365, 201730, 204016, 206667, 209118, 211150, 212668, 213494, 213677, 213722, 214087, 214658, 215066, 215282, 215521, 215755, 215821, 215856, 216127, 216548, 216766, 216675, 216416, 215969, 215199, 214369, 214198, 215299, 217761, 221212, 225078, 228883, 232585, 236477, 240506, 243930, 246029, 247006, 247740, 248792, 250073, 251349, 252581, 253799, 255066, 256597, 258508, 260496, 262152, 263496, 264763, 265745, 265917, 265307, 264672, 264689, 265385, 266489, 267796, 268954, 269399, 268962, 268289, 268246, 269024, 270164, 271401, 273094, 275655, 278841, 281940, 284638, 287363, 290600, 294138, 297344, 299928, 302000, 303530, 304431, 305236, 306977, 310057, 313827, 317553, 321264, 325226, 329285, 333276, 337504, 342172, 346855, 351308, 356308]
56275C56308O469P597P489O891O907P464P960Q602R972J1771J3057J3534J3811
56262D77832J4515J5718J7168J8658K0329K2741K6329L0638L4663L8166M1982
56251G58739M6743N2130N7801O4087P1072P7756Q3009Q6723Q9339R0777R0644
56240A568820Q8966Q5869Q0971P3835O4583N3491M0470K5707J0282m666j8846
56229B069482l2144m3686n2681n9752o6120p1771p5507p6823p6565p5608p3928
56218A364897p1234o7736o3911o0057n6344n2882m9502m5855m1863l7747l3728
56207G84038l0052k7143k5282k4082k2670k0476j7695j5057j3234j2267j1401
56196E64679r852p848o435o040n853n030l846l072k779k489k102j899j824j548
$$ y = [356308, 362777, 370374, 377863, 384754, 391661, 399125, 407085, 415687, 425659, 437430, 450487, 464021, 477832, 492347, 508065, 525233, 543891, 564220, 586961, 613290, 643928, 678591, 716757, 758739, 805482, 857612, 915413, 979500, 1050572, 1128328, 1211337, 1298060, 1387399, 1478176, 1568820, 1657786, 1743655, 1824626, 1898461, 1963044, 2016535, 2057005, 2082712, 2092994, 2088328, 2069482, 2037338, 1993652, 1940971, 1881219, 1815099, 1743328, 1667821, 1590998, 1514433, 1438825, 1364897, 1293663, 1225927, 1162016, 1101959, 1045615, 992733, 943231, 897376, 855513, 817766, 784038, 753986, 726843, 701561, 677479, 654809, 634333, 616638, 601581, 588347, 576080, 564679, 554827, 546979, 540544, 534504, 528651, 523621, 519775, 516703, 513924, 511435, 509333, 507434, 505610, 504062]
56182E04062j069o92m28J03J149K522L708M169L799L187L091L578M035M098L899
56167E39211L500K887K603L361M727N387N090N120O245P542Q104Q602J0034J2082
56153F24495J3907J5655J7881K0414K3089K6820L2515L9682M7440N6133O6372
56142I84403P7054Q5964R1861R4632R3818Q8808Q0267O9987N9407M9531M1807
56131A817539L7297L4950L2287K7917K2201J5712Q598J613l949p782j1050j5036
56119A960297k0318k7287l6279m6916n8045o8318p6272q0411q0275p7058p2125
56108A316993o5490n6941m7828m0009l3563k7371k1598j7572j5278j3038r939
56097I68366o691l800q34K090L923M445M845N865O846P231P522Q082Q376Q098
$$ y = [504062, 502993, 502301, 501873, 501976, 503125, 505647, 509355, 513524, 517323, 520510, 523601, 527179, 531214, 535312, 539211, 542711, 545598, 548201, 551562, 556289, 561676, 566766, 571886, 578131, 585673, 593777, 602379, 612413, 624495, 638402, 654057, 671938, 692352, 715441, 742261, 774776, 814458, 861898, 918031, 984403, 1061457, 1147421, 1239282, 1333914, 1427732, 1516540, 1596807, 1666794, 1726201, 1775732, 1817539, 1854836, 1889786, 1922073, 1949990, 1972191, 1987903, 1996501, 1998114, 1994165, 1986383, 1975333, 1960297, 1939979, 1912692, 1876413, 1829497, 1771452, 1703134, 1626862, 1546451, 1466176, 1389118, 1316993, 1251503, 1194562, 1146734, 1106725, 1073162, 1045791, 1024193, 1006621, 991343, 978305, 968366, 961675, 957875, 957041, 959131, 963054, 967499, 972344, 978209, 985055, 992286, 999808, 1007890, 1016266, 1024364]
56083A024364P877Q114Q251P832P300P188P371P630Q063Q652R179R749J0561J1268
56069A143399J1498J1818J3021J4662J5635J5975J6564J7313J7382J7105J7814
56058A312186J9524K0725K0810K0962K2117K3715K4984K5905K6462K6439K6323
56047A570152K6954K7995K8287K7924K8254K9691L1291L2768L4899L7590L9491
56036A915296M0062M0167M0187L9456L8050L7210L7477L8231L9360M1475M4125
56025B351096M5970M7085M8869N1437N3504N5174N8104O2342O5844O8002P0746
56014B978173P5177P9796Q3327Q6601R0375R3924R7017J00811J05584J10088J14256
56003D015129J19808J27154J34511J41267J49143J58800J68456J77275J86895
$$ y = [1024364, 1032241, 1040355, 1048606, 1056438, 1063738, 1070926, 1078297, 1085927, 1093990, 1102642, 1111821, 1121570, 1132131, 1143399, 1154897, 1166715, 1179736, 1194398, 1210033, 1226008, 1242572, 1259885, 1277267, 1294372, 1312186, 1331710, 1352435, 1373245, 1394207, 1416324, 1440039, 1465023, 1490928, 1517390, 1543829, 1570152, 1597106, 1625101, 1653388, 1681312, 1709566, 1739257, 1770548, 1803316, 1838215, 1875805, 1915296, 1955358, 1995525, 2035712, 2075168, 2113218, 2150428, 2187905, 2226136, 2265496, 2306971, 2351096, 2397066, 2444151, 2493020, 2544457, 2597961, 2653135, 2711239, 2773581, 2839425, 2907427, 2978173, 3053350, 3133146, 3216473, 3303074, 3393449, 3487373, 3584390, 3685201, 3790785, 3900873, 4015129, 4134937, 4262091, 4396602, 4537869, 4687012, 4845812, 5014268, 5191543, 5378438]
55994E378438J98198K09864K21695K35734K52449K69512K86271L05615L29225
55985G687001L54891L80820M08784M40520M75013N11943N53851O02265O55708
55976A2070796P14148P81178Q59231R47278J045981J160120J293238J445650J620935
55967B1938555J828412K076027K368120K714601L135208L650808M279609N047884
55959D7039224N995326P163608Q590068J0319556J2408693J4904980J7824795
55952A24246250K1139566K4726500K8269956L1201931L2776739L2248009K9046996
55945C23655947K2947349J4253690L920204o605098j5843230k2781187k7083025
55938B92464650k8968777k8959350k7659828k5611716k3206280k0678952j8170197
$$ y = [5378438, 5576636, 5786500, 6008195, 6243929, 6496378, 6765890, 7052161, 7357776, 7687001, 8041892, 8422712, 8831496, 9272016, 9747029, 10258972, 10812823, 11415088, 12070796, 12784944, 13566122, 14425353, 15372631, 16418612, 17578732, 18871970, 20317620, 21938555, 23766967, 25842994, 28211114, 30925715, 34060923, 37711731, 41991340, 47039224, 53034550, 60198158, 68788226, 79107782, 91516475, 106421455, 124246250, 145385816, 170112316, 198382272, 229584203, 262360942, 294608951, 323655947, 346603296, 360856986, 364777190, 358172092, 342328862, 319547675, 292464650, 263495873, 234536523, 206876695, 181264979, 158058699, 137379747, 119209550]
55931A19209550j5781805j3586214j1619178r890705q400496p136951o073669
55924D6720532n180167m433088l812398l294647k857986k489045k178739j915785
55916B0558677j689584j495065j329343j186810j061750r52331q57901p75283
55908A1210610p01206o35442n78320n27946m82652m43236m10021l80540l52647
55899F698600l27170l05084k84956k65494k47696k32029k16386j99399j82993
55890D437393j69161j56957j45254j35709j30153j27274j24692j22217j20408
55881C205568j18001j13489j07642j01926r6056q9441q3353p9203p6204p3021
55871B267232p0253o8979o8178o6136o3176o0763n8857n6396n3534n1277m9661
$$ y = [119209550, 103427745, 89841531, 78222353, 68331648, 59931152, 52794201, 46720532, 41540365, 37107277, 33294879, 30000232, 27142246, 24653201, 22474462, 20558677, 18869093, 17374028, 16044685, 14857875, 13796125, 12843794, 11985893, 11210610, 10509404, 9873962, 9295642, 8767696, 8285044, 7841808, 7431787, 7051247, 6698600, 6371430, 6066346, 5781390, 5515896, 5268200, 5036171, 4819785, 4620386, 4437393, 4268232, 4111275, 3966021, 3830312, 3700159, 3572885, 3448193, 3325976, 3205568, 3087567, 2974078, 2866436, 2764510, 2668454, 2579013, 2495660, 2416457, 2340253, 2267232, 2196979, 2128000, 2059822, 1993686, 1930510, 1869747, 1810890, 1754494, 1700960, 1649683, 1600022]
55860A600022m8034m6450m5123m3407m0838l8285l6454l4354l0912k7082k4610
55849A184473k3607k3000k2525k2486k2388k1573k0614k0392k0467j9942j9249
55838I48230j9341j9738j9103j7430j5925j5006j3997j2676j1676j1305j1203
55827G80830j1136j1149j1040j0630j0363j0762j1546j2058j2246j2462j2648
55816F54790j2556j2281j1924j1195j0107r408r488r465q357o574n305m877m670
55803E38583m238l586k713j699j022j016j391j806k405l133l194k014j98J276
55789E11444K345L652N423P250Q572Q806P489M699Q76l886r513j4752j7638j7707
55775D97060j6489j5198j3316j0251o868m195k074m76o86l404o871q781r196r707
$$ y = [1600022, 1551988, 1505538, 1460415, 1417008, 1376170, 1337885, 1301431, 1267077, 1236165, 1209083, 1184473, 1160866, 1137866, 1115341, 1092855, 1070467, 1048894, 1028280, 1007888, 987421, 967479, 948230, 928889, 909151, 890048, 872618, 856693, 841687, 827690, 815014, 803338, 792033, 780830, 769694, 758545, 747505, 736875, 726512, 715750, 704204, 692146, 679900, 667438, 654790, 642234, 629953, 618029, 606834, 596727, 587319, 577831, 568366, 560009, 553435, 548130, 543253, 538583, 534345, 530759, 528046, 526347, 525325, 524309, 522918, 521112, 518707, 515574, 512380, 510366, 510168, 511444, 513789, 517441, 522864, 530114, 538686, 547492, 554981, 559680, 560556, 556670, 547157, 532405, 514767, 497060, 480571, 465373, 452057, 441806, 434938, 430743, 428669, 428193, 427507, 424103, 417232, 408451, 399255, 389548]
55761C89548j0422r969q096o244n410n101m604l932l335k981l182l921m397l948
55747C14006l142k928l183l239l299l951m702m510l603l265l887m571m594m035
55733B61097l137k249k177l233m210l777k636k682m124n228n007m336m091l923
55719B10287l467l145l072k533j279j75J21L5O8Q4Q8O12J562J843Q52n56j324
55702B00001j507j653j777j733j857k434l076l300l190k990k634k180k044k309
55688A67317k337j643o32L1K40K54K15L21Q63J709K227K123J763J373O30m99j310
55671A72645j358j235j586j961j434m2J196J537J142N87L08M87R99J431J416R67
55655A75099M21J04J51M55P47Q85J022J215J051J31j178j963j809j146n42k41
$$ y = [389548, 379126, 369157, 361061, 354817, 349407, 344306, 339702, 335770, 332435, 329454, 326272, 322351, 317954, 314006, 310864, 307936, 304753, 301514, 298215, 294264, 289562, 285052, 281449, 278184, 274297, 269726, 265132, 261097, 257960, 255711, 253534, 250301, 246091, 242314, 239678, 236996, 232872, 227644, 222637, 218301, 214210, 210287, 206820, 203675, 200603, 198070, 196791, 196616, 196737, 196772, 196840, 196924, 197012, 197624, 199186, 201029, 201881, 201325, 200001, 198494, 196841, 195064, 193331, 191474, 189040, 185964, 182664, 179474, 176484, 173850, 171670, 169626, 167317, 164980, 163337, 162705, 162736, 162976, 163230, 163445, 163766, 164629, 166338, 168565, 170688, 172451, 173824, 174454, 173955, 172645, 171287, 170052, 168466, 166505, 165071, 165029, 166225, 167762, 168904, 169491, 169799, 170286, 171285, 172716, 174132, 175099, 175520, 175624, 175775, 176230, 176977, 177862, 178884, 180099, 181150, 181281, 180103, 178140, 176331, 175185, 174643, 174402]
55639A74402l45q91j593k057k337k787l354l626l597l670l914m018m013m217m337
55624A29646l603k040p48n48j105j666j904j699r79j60O6k66m01k07m44j348k036
55607A10558j968j856k280k536j903j078j148j778j772r61k34j3R6K94K96Q0j1
55590I3786J3j92o15r05j012j178j353j295j104r96p23N6R52J189P43L54M26O32
55572H8778O39N14L42J00M9N39J281J459P94p6n62r70j912l225l953l401k011
55555G8385r53q31r92m69N78J040N33L5L75R88R64N83P52J358J401O38r8k19m4
55536H4024O4K43N26N34J47j90j37J31L93O58P75M48j41l88j70m3k74m42k94k71
55516H5593o78j042r22p38j100j767k029j795j562j527j348q24k38L0q1l82o20
$$ y = [174402, 174057, 173166, 171573, 169516, 167179, 164392, 161038, 157412, 153815, 150145, 146231, 142213, 138200, 133983, 129646, 126043, 124003, 123255, 122707, 121602, 119936, 118032, 116333, 115354, 115194, 115260, 114994, 114593, 114386, 113942, 112594, 110558, 108590, 106734, 104454, 101918, 100015, 98937, 97789, 96011, 94239, 93278, 93044, 93031, 93127, 93421, 93717, 93797, 93786, 93799, 93607, 92992, 92087, 91075, 89897, 88544, 87249, 86145, 85149, 84426, 84482, 85434, 86623, 87366, 87720, 88146, 88778, 89417, 89931, 90273, 90373, 90422, 90961, 92242, 93701, 94495, 94419, 93857, 92887, 90975, 87750, 83797, 80396, 78385, 77432, 76601, 75609, 75140, 75718, 76758, 77291, 77326, 77701, 78689, 79653, 80236, 80988, 82346, 83747, 84385, 84287, 84068, 84024, 84088, 84331, 84857, 85391, 85538, 85348, 85211, 85342, 85735, 86393, 87168, 87616, 87475, 87087, 86917, 86874, 86600, 86158, 85864, 85593, 84915, 83873, 82951, 82213, 81113, 79346, 77317, 75522, 73960, 72433, 71085, 70261, 70023, 70053, 69972, 69590, 68970]
55499F8970p08q53j316j880j844q96K80P35L68j36l45m76p10p08j08Q28J437J415
55481F4053J048O66K42l64r39j056o80l38m90j028j534j800j793j419p31k10k71
55464E3356n88m12M34J361J868J983J809J225L44k81k66R9K66L9m29q75r61n16
55446E8456Q3K31pJ01P55J103M48o89j335j377j319j169n17M77J103J110R81J099
55428E9534J258J121O37o8p58j010o13L6L36K74K49K93J31j05J2L63L12k72q37
55409F0893j091j310j434q60M08J283R82J36j96J4Q6j26k02k0J71L41O40Q82P21
55390F1318K42k30o10q20m62N05J185P67j27j84O25J010L87l32k81J38K59K42
55372F3632M27M68M6k88K8L87j80j310j574m53Q81J042p9j553k489k538j827q28
$$ y = [68970, 68262, 67409, 66093, 64213, 62369, 61473, 61753, 62488, 62856, 62720, 62375, 61899, 61189, 60481, 60373, 61201, 62638, 64053, 65101, 65767, 66009, 65645, 64706, 63650, 62970, 62632, 62142, 61114, 59580, 57780, 55987, 54568, 53837, 53627, 53356, 52768, 52356, 52790, 54151, 56019, 58002, 59811, 61036, 61380, 61099, 60833, 60932, 61198, 61237, 60808, 59933, 58972, 58456, 58539, 58770, 58763, 58864, 59619, 60722, 61170, 60481, 59146, 57769, 56450, 55281, 54764, 55241, 56344, 57454, 58435, 59534, 60792, 61913, 62550, 62482, 61724, 60714, 60101, 60137, 60473, 60747, 60996, 61289, 61420, 61315, 61327, 61690, 62002, 61730, 60893, 59802, 58492, 57058, 56198, 56606, 57889, 58871, 59007, 58811, 58825, 58911, 58785, 58583, 58563, 58734, 59075, 59715, 60597, 61318, 61560, 61330, 60720, 59900, 59438, 59943, 61128, 61895, 61768, 61584, 62209, 63219, 63606, 63274, 62993, 63131, 63390, 63632, 64059, 64527, 64573, 64285, 64313, 64700, 64520, 63210, 61636, 61183, 62064, 63106, 63027, 61474, 58985, 56447, 54620, 53792]
55354E3792o6K73M12N75O60M27j84q69j111o04K91P87N47J06N5J90n1n44o66m09
55334E3611m80j100j467q29M57J442J667J284N40k94p70o59l97n97j149j330p68
55317D9161J02O89Q87R57J071J221J305J155O70M9k86j60J32J87m5l79p28j068
55299E4920j195q23k1P09R17O10J28k60m87n49m35j03M61J118J493J241O08L52
55281E8684Q81J618J620P52k21o70o66m95j52L34N77K96k40n84o80o41l07M10
55263F0516J003P78k23j198j505j165n44L1L40M15O12J119J450J001J3o40o36
55246F1367m35k81J99J004J295N45m90o67O5P57P20L4q72j524j477p10J02L16
55228E9948J28J24K47p1p63r61j90R20J460J274Q62O06M60K43j33n46p54o56m83
$$ y = [53792, 53726, 53999, 54411, 54986, 55646, 56073, 55889, 55020, 53909, 53305, 53596, 54383, 54930, 55036, 55091, 55281, 55230, 54686, 54020, 53611, 53131, 52031, 50564, 49735, 50192, 51634, 53301, 54585, 55125, 54831, 54061, 53402, 53005, 52408, 51259, 49929, 49161, 49263, 49952, 50839, 51796, 52867, 54088, 55393, 56548, 57218, 57267, 56981, 56821, 56953, 57140, 57095, 56716, 55988, 54920, 53725, 52902, 52881, 53590, 54507, 55117, 55245, 54985, 54498, 53949, 53514, 53411, 53872, 54990, 56483, 57724, 58332, 58684, 59565, 61183, 62803, 63555, 63334, 62664, 61998, 61503, 61351, 61685, 62262, 62558, 62318, 61734, 61054, 60413, 60106, 60516, 61519, 62297, 62074, 60876, 59371, 58206, 57662, 57693, 58033, 58448, 59060, 60179, 61629, 62630, 62643, 62003, 61367, 60932, 60651, 60850, 61854, 63149, 63694, 63204, 62537, 62602, 63359, 64079, 64113, 63241, 61717, 60240, 59530, 59632, 59948, 60076, 60200, 60447, 60376, 59613, 58652, 58462, 59382, 60842, 62116, 62978, 63584, 64044, 64287, 64154, 63608, 62854, 62198, 61715]
55209F1715n07o34n67l26j77q5K34O87P75M33K51N92J018R78N70J30m04j112j512
55190F2059j154n22n07j038j143m20L92O36O23Q22R18M02l73n68n8N02P19Q12
55172F2102Q97O45q0p82r37o05j88J19L17L97M52P18J170J328Q16k2m78k63L01
55153F5907P40P63L19k89n29k91j98p55j398j097J31J058Q81K30J64P59J248J177
55135F8820P49L03k2j49j13j93n81r95r51m46LK8j93k53M2N60R27P73O1p63j205
55114F6402j209j047p98l48J92N00N98Q37J178R30l00j741k087r83N50J278R63
55097F4915L03%K46R05J709K211J897O86p73j542j208k26N71P40N48N52Q45Q49
55079G3228L5j237k008j853j287p96j21J031K052K051J179M23J51j38n70m51M04
$$ y = [61715, 61208, 60574, 60007, 59681, 59504, 59419, 59653, 60340, 61115, 61548, 61799, 62391, 63409, 64387, 64957, 65087, 64683, 63571, 62059, 60905, 60383, 59876, 58838, 57695, 57275, 57667, 58303, 58926, 59748, 60666, 61068, 60695, 60127, 60069, 60571, 61290, 62102, 62999, 63644, 63564, 62782, 61845, 61240, 61052, 61171, 61488, 61885, 62337, 63055, 64225, 65553, 66369, 66347, 65869, 65606, 65907, 66647, 67410, 67729, 67440, 66911, 66620, 66422, 65667, 64269, 63172, 63303, 64361, 65242, 65472, 65636, 66395, 67643, 68820, 69569, 69872, 69850, 69701, 69588, 69395, 68814, 67819, 66868, 66422, 66425, 66453, 66260, 66007, 66049, 66609, 67536, 68309, 68370, 67607, 66402, 65193, 64146, 63348, 63000, 63192, 63692, 64290, 65127, 66305, 67235, 66935, 65194, 63107, 62124, 62674, 63952, 64915, 65218, 65218, 65464, 66369, 68078, 70289, 72186, 72872, 72099, 70557, 69349, 69123, 69694, 70434, 70982, 71534, 72379, 73228, 73263, 72026, 70018, 68165, 66878, 66082, 65961, 66992, 69044, 71095, 72274, 72697, 72848, 72710, 72140, 71689, 72093]
55062G2093J009N79k73n58m44o91j074o27O53J495R93l71j601k212k143j444n53
55045F4831j79m11l99M96J627J761O50o95j203q40l23j74k19j8M39O53K76l70
55027F5902o52l84R2M74P43Q30N84J70O0L75O36M43P6K0K05J93m8p3K58M44Pp89
55005F9566j178p97j6O23J029J380J613J502J229J316J843K161J747R46L75j3
54989H3326n99j108q48M5N19Q4m13l0Q63J138M44m67r04r66j048j150r65m42P1
54970G7550K58K48M98J148J714J604Q86K25J04L97P62J019J041P14K34Q8L85N75
54952H9450J51o80j350j679j827j758j268m77J12J48k44o03n18O4O86P35J33n24
54934H0551p40p08q14r07n31K56Q75R68P06L96K76O11J427K168K176J648J451
$$ y = [72093, 73102, 73681, 73408, 72850, 72406, 71715, 70641, 70014, 70667, 72162, 73155, 72784, 71183, 68971, 66828, 65384, 64831, 64652, 64241, 63842, 64338, 65965, 67726, 68376, 67681, 66478, 65638, 65315, 65141, 64922, 64904, 65343, 65996, 66272, 65902, 65250, 64866, 64958, 65432, 66175, 67005, 67589, 67759, 67819, 68194, 68830, 69273, 69349, 69369, 69574, 69767, 69719, 69646, 69904, 70348, 70355, 69566, 68388, 67591, 67575, 68198, 69227, 70607, 72220, 73722, 74951, 76267, 78110, 80271, 82018, 82964, 83339, 83326, 82727, 81619, 80771, 80816, 81335, 81419, 81006, 80976, 81839, 82977, 83421, 82954, 82050, 81084, 80036, 78886, 77921, 77479, 77550, 77808, 78056, 78554, 79702, 81416, 83020, 83906, 84131, 84235, 84632, 85394, 86413, 87454, 88168, 88402, 88490, 88875, 89450, 89601, 88921, 87571, 85892, 84065, 82307, 81039, 80562, 80674, 80822, 80578, 79975, 79457, 79521, 80207, 80942, 81075, 80551, 79811, 79103, 78289, 77382, 76851, 77107, 77982, 78950, 79656, 80052, 80328, 80939, 82366, 84534, 86710, 88358, 89809]
54917H9809J882K269K185K306L417N007N719N064L948L378L253K731J405l44j891
54902A30138k915l459l773m137m640n028m901m131l017j997j287r14r04j232j593
54887H6210j485p54J11M54J87j19L7N50R44J011R71J064J309J706K418L475M471
54870A02560M910M821M679M643M252L093J478R4q12j510k204k777l126l345l482
54855A13274l475l403l450l516l256k659k253k415k801k787k289j806j689j749
54841G5726j576j068n14k55k85k58J14O58R88J040J111J305J303Q48J62l47n65
54824G8387o29n79l41L1L18K96j39q46j423j493j140p57m27J51R91J525J316O98
54806G5939K99K83M51O89Q87P63L66L36J021J588R63n33j372p67M63J220J402
$$ y = [89809, 91691, 93960, 96145, 98451, 101868, 106875, 112594, 117658, 121606, 124984, 128237, 130968, 132373, 132029, 130138, 127223, 123764, 119991, 115854, 111214, 106186, 101285, 97154, 94137, 92140, 90853, 89939, 89035, 87803, 86210, 84725, 83971, 84082, 84536, 84723, 84604, 84641, 85191, 86135, 87146, 88117, 89181, 90490, 92196, 94614, 98089, 102560, 107470, 112291, 116970, 121613, 125865, 128958, 130436, 130530, 129718, 128208, 126004, 123227, 120101, 116756, 113274, 109799, 106396, 102946, 99430, 96174, 93515, 91262, 88847, 86046, 83259, 80970, 79164, 77475, 75726, 74150, 73082, 72568, 72313, 72028, 71770, 71884, 72542, 73530, 74570, 75681, 76986, 78289, 79137, 79299, 78952, 78387, 77758, 77179, 76838, 76869, 77187, 77483, 77344, 76498, 75075, 73582, 72442, 71685, 71258, 71409, 72400, 73925, 75241, 75939, 76238, 76521, 76972, 77661, 78548, 79311, 79677, 80013, 81034, 82622, 83585, 83052, 81680, 80913, 81376, 82596, 83998]
54789H3998J412J200N24l53r08j062j021o89J21J012J204N34k30l17J63N11L62
54772H6461Q6K63R51J626J789J537J421J761K346K816L100L377L693L914L937
54757A19078L789L558L324L100K757K066R90j51j035j783k819m187n276n412m646
54742A13353l667l013k601k111j534j118r64r67j060j255j414j328j037p70n13
54727I0001L0Q16J245Q72J16r0P12K125L358L833L528K983K887L386L907L857
54711A23566L269K521J764J016M93K46k83j682l532m698m696m094l460k680j665
54696A06085r22q78j136j103r28j150j661j819j505j343j615j705j018l5J74o01
54680H8840j349j097j78K21l91j240j390q54k49J59N26P71O22K72K60N56M71j97
$$ y = [83998, 85410, 86610, 87134, 86781, 85873, 84811, 83790, 83101, 83222, 84234, 85438, 85972, 85742, 85425, 85588, 86099, 86461, 86547, 86810, 87761, 89387, 91176, 92713, 94134, 95895, 98241, 101057, 104157, 107534, 111227, 115141, 119078, 122867, 126425, 129749, 132849, 135606, 137672, 138662, 138511, 137476, 135693, 132874, 128687, 123411, 117999, 113353, 109686, 106673, 104072, 101961, 100427, 99309, 98345, 97378, 96318, 95063, 93649, 92321, 91284, 90514, 90001, 90031, 90847, 92092, 92964, 93080, 92990, 93702, 95827, 99185, 103018, 106546, 109529, 112416, 115802, 119709, 123566, 126835, 129356, 131120, 132136, 132629, 132875, 132592, 130910, 127378, 122680, 117984, 113890, 110430, 107750, 106085, 105163, 104285, 103149, 102046, 101118, 99968, 98307, 96488, 94983, 93640, 92025, 90320, 89302, 89267, 89441, 88840, 87491, 86394, 86216, 86437, 86046, 84806, 83416, 82562, 82313, 82472, 82998, 83769, 84391, 84663, 84923, 85479, 85950, 85753]
54662H5753o67k91M19N52J20j41n0j47o10q04k55N74Q70N13O8n0j0j59n31q50
54642H4304q82o29j78L92R57J267J177Q49N70L27j07o74r47p45m49m05l37J84
54624H4674Q95R85J74q27j102m66N10J157J181P12J57j01l8M4l0jM50J077J176
54605I0627L82p96j500j407r13m75j76Q4K82M29O51Q62O32j33p08l29N63O54m93
54586H8236j695j614l48Q92J310J032M39k85r08j112q41l79N1M17O14M63J5m46
54568H5841p45q69p31l06L1j85p24p24J71J231J587J318J132J274J320R74M44
54551I1039ol99p60q69n75l6M60Q28J076J162J100J075J172J146P46J65j19N4
54533I7259L90N80O05N25L20R8J21M52P84Q64Q69J050J222R03j07j543k897l530
$$ y = [85753, 85086, 84795, 85214, 85766, 85886, 85745, 85695, 85548, 84938, 84134, 83879, 84453, 85323, 85836, 85904, 85854, 85844, 85685, 85154, 84304, 83422, 82793, 82615, 83007, 83964, 85231, 86408, 87257, 87827, 88154, 88047, 87373, 86426, 85681, 85232, 84827, 84490, 84674, 85569, 86554, 86728, 85901, 84799, 84333, 84843, 86000, 87181, 87893, 88050, 87949, 87911, 87955, 87925, 87924, 88374, 89451, 90627, 91009, 90213, 88713, 87306, 86393, 85918, 85742, 85826, 86108, 86537, 87188, 88050, 88682, 88549, 87841, 87512, 88075, 88729, 88236, 86541, 84927, 84579, 85471, 86781, 87813, 88252, 87967, 87059, 85947, 85106, 84727, 84778, 85195, 85809, 86272, 86287, 85841, 85096, 84227, 83496, 83190, 83221, 83036, 82312, 81588, 81759, 82990, 84577, 85895, 87027, 88301, 89621, 90595, 91039, 91033, 90634, 89874, 89005, 88430, 88394, 88854, 89682, 90758, 91920, 93020, 94095, 95267, 96413, 97159, 97324, 97205, 97259, 97649, 98229, 98834, 99359, 99679, 99777, 99898, 100350, 101134, 101998, 102867, 103917, 105139, 106042, 105935, 104392, 101495, 97965]
54515I7965k907j171N92J231P28M3j76j29q7J71P84J263J098M78p8m40p35p62
54497I7868k31N44Q19L94q0L5N67Q19M53j88n46n04m39o50q68o14M0M49K88M2
54477I8198L12R95J466J391R92O78P01J034J284R50O2o79p18l28j34k15j90R6
54459A05895M75R03J418J745J538R38L85nl89o29m46j01j49n17n68j66J06n3k24
54440A10156j24p6k98m64m72q07j590j977j278j05M26K52K30P22J166J070O41
54423A07472L40L18M68O06N17J32l48p10r76j102p49J83J060J166O59L33M36M04
54405A10209j33p72r51o28j06L81O62N95L28L42Q38J375J369Q51M65P58J602K284
54387A19469K131J098k00j032j130p21k22m9m35j168j631j407p31o4N25J127J449
$$ y = [97965, 95058, 93887, 94479, 95710, 96438, 96481, 96305, 96176, 96089, 96260, 97044, 98307, 99405, 99883, 99805, 99365, 98630, 97868, 97637, 98181, 99000, 99394, 99314, 99349, 99916, 100735, 101188, 101000, 100454, 99950, 99511, 98861, 97993, 97379, 97419, 97868, 98156, 98198, 98510, 99505, 100971, 102362, 103354, 104032, 104733, 105767, 107051, 108001, 108063, 107384, 106666, 106338, 106204, 105989, 105799, 105895, 106370, 107273, 108691, 110436, 111974, 112912, 113297, 113292, 112903, 112274, 111828, 111727, 111578, 111061, 110493, 110327, 110433, 110380, 110156, 110032, 109956, 109658, 109194, 108722, 107915, 106325, 104348, 103070, 102965, 103391, 103643, 103873, 104595, 105761, 106831, 107472, 107812, 108130, 108598, 109204, 109721, 109853, 109505, 108795, 107819, 106717, 105968, 106151, 107211, 108377, 109036, 109369, 109805, 110209, 110076, 109304, 108353, 107725, 107619, 108000, 108662, 109257, 109585, 109927, 110765, 112140, 113509, 114360, 114825, 115583, 117185, 119469, 121600, 122698, 122498, 121466, 120336, 119615, 119393, 119344, 118909, 117741, 116110, 114703, 113972, 113908, 114433, 115560, 117009]
54370A17009J159O53O95J238J352N63m05o71l51j73l89p14r81j239j321r30j24
54353A15371O13Q92P46M50K72L16M14K67j44m78n03l94l03K1P16J249R79J44l13
54334A20315M7O61Q39O46O55J212K095K694K379J105k65o93k26mp53j761j980
54317A26966j583j663k470k974k400j390j066j469j642j049j39M77P19O66J83
54302A11166o32j060n22N07R33M01l67o82o91p87q54n63o8J80J65K89O77J008
54284A09100J076J033R52N83j70p96o49K07R10O68l51j167r80J2Q94J034O35K39
54266A13230N0o8j31j1K45M20N35Q68J491K025K022J522J057J146J744K197J883
54249A30225Q99o4o20j087j772k355k406k123j904j531o01M67P72K88j01q6l56
$$ y = [117009, 118168, 118821, 119516, 120754, 122106, 122669, 122264, 121593, 121242, 121069, 120680, 119966, 118985, 117746, 116425, 115495, 115371, 115984, 116876, 117622, 118072, 118344, 118660, 119074, 119341, 119197, 118719, 118216, 117822, 117519, 117540, 118256, 119505, 120484, 120628, 120315, 120362, 121023, 121862, 122508, 123163, 124375, 126470, 129164, 131543, 132648, 132383, 131690, 131464, 131460, 130707, 128946, 126966, 125383, 123720, 121250, 118276, 115876, 114486, 113420, 111951, 110309, 109260, 109121, 109598, 110317, 110983, 111166, 110534, 109474, 108952, 109459, 110392, 110793, 110426, 109744, 109053, 108266, 107412, 106849, 106781, 106961, 107126, 107415, 108092, 109100, 110176, 111209, 112161, 112744, 112574, 111778, 111129, 111336, 112246, 112914, 112563, 111396, 110416, 110428, 111322, 112356, 112991, 113230, 113280, 113212, 113081, 113070, 113315, 113735, 114270, 115138, 116629, 118654, 120676, 122198, 123255, 124401, 126145, 128342, 130225, 131124, 131060, 130440, 129353, 127581, 125226, 122820, 120697, 118793, 117262, 116661, 117128, 117900, 118188, 118087, 118001, 117645]
54232A17645j200j727j235m04k02l94j79K61Q6n87o89P8O29N1j116j627j042L0
54214A08378Q03J039R85R17Q23N04m0n33p85q85q19k79P27J573J725J495J424
54197A17052J345P52j43n88m29k02j34L4J88j75q86j021k68M38J98p39j522j734
54179A12166j419p34j38j75o58o82KM01k52j230j326n26K80P08R61R04J77q58
54161A07601j296r22l91j11K75J041J794J906J165j82j536k137j600m08N60R34
54145A06693R32P45M36K87N58Q84O53l2m16k11N0l7j54J03O05J021J226J104M68
54126A14915m70j025p65m6M61L79k55j052j279m43Q95J449P69j41j79N07J052
54109A14772J204J310J390J068L39k60l78k04k7P6M2k65p36r33n39K17P58O93
$$ y = [117645, 116445, 114718, 113483, 113079, 112877, 112483, 112304, 112565, 112651, 112064, 111375, 111453, 112082, 112133, 111017, 109390, 108348, 108378, 109181, 110220, 111205, 112122, 112945, 113449, 113409, 112876, 112091, 111206, 110387, 110108, 110835, 112408, 114133, 115628, 117052, 118397, 119149, 119006, 118418, 117989, 117787, 117653, 117687, 117875, 117700, 116814, 115793, 115525, 115963, 116161, 115422, 113900, 112166, 110747, 110013, 109875, 109700, 109042, 108360, 108362, 108763, 108511, 107281, 105955, 105429, 105709, 106417, 107378, 108282, 108459, 107601, 106305, 105383, 104992, 104881, 105156, 106197, 107991, 109897, 111062, 110880, 109344, 107207, 105607, 105199, 105759, 106693, 107625, 108370, 108806, 109093, 109651, 110535, 111188, 111156, 110740, 110529, 110579, 110542, 110388, 110491, 111096, 112117, 113343, 114447, 114915, 114445, 113420, 112655, 112609, 113070, 113449, 113194, 112142, 110863, 110420, 111315, 112764, 113533, 113392, 113213, 113720, 114772, 115976, 117286, 118676, 119744, 120083, 119823, 119445, 119241, 119214, 119290, 119332, 119067, 118331, 117398, 116859, 117076, 117834, 118527]
54091A18527J87k33k03J27L37K46l0m18q79j048m05Q54J599R77m25j126m09J009
54073A18687J932J838J053K56o4Q3K29j0m06l90J81P82R22P16N56N07L37j2l24
54054A26873m97o77q51o63J82J408K353K650K489K256K128K086K040J901J752
54039A45430K027L094M487N090M497L734M019N084N554M850L857L468L365K773
54025B01329J728R39O93O42N65P40J415K328K958L131L156L376L670L624L183
54010B33477K784K517J579q35m161o787p830p897p893p847p413o786o368n974
53996A70566n178m151l496l334l243k970k613k114j249k09L69J64l86o42m31m1
53980A41042J85J40l0n9J96N92Q28O42p8j153k032k164j602r06l64K20P74P09
$$ y = [118527, 118714, 118481, 118278, 118405, 118742, 118988, 118958, 118540, 117661, 116613, 116208, 117062, 118661, 119638, 119213, 118087, 117678, 118687, 120619, 122457, 123510, 123766, 123702, 123785, 124014, 124004, 123598, 123208, 123389, 124171, 125093, 125809, 126365, 126872, 127209, 127197, 126873, 126376, 125699, 124848, 124185, 124367, 125775, 128128, 130778, 133267, 135523, 137651, 139737, 141777, 143678, 145430, 147457, 150551, 155038, 160128, 164625, 168359, 172378, 177462, 183016, 187866, 191723, 195191, 198556, 201329, 203057, 203996, 204689, 205331, 205896, 206636, 208051, 210379, 213337, 216468, 219624, 223000, 226670, 230294, 233477, 236261, 238778, 240357, 239522, 235361, 228574, 220744, 212847, 204954, 197107, 189694, 182908, 176540, 170566, 165388, 161237, 157741, 154407, 151164, 148194, 145581, 143467, 142218, 142009, 142378, 142542, 142156, 141514, 141083, 141042, 141227, 141367, 141337, 141278, 141474, 142066, 142894, 143536, 143458, 142305, 140273, 138109, 136507, 135601, 135237, 135457, 136231, 136940]
53962A36940p8o07n5R27J082L98K6M61R98J105J220J709K104J972J716J787J831
53945A53536J428J017J223J655J468R21J262K864M452M718L994L618M047M416
53931A90619L943L023K591K837L083K804K210J747J485J305J296J659K372L280
53917B24254M285N151N378M740L819L451L654L641K919J863J053N91K77j3m25
53902B64638j093j777j915j426r98j201j700j929k131k978m309n068m680l863
53888B29570l643m084m465m423m317m446m465l904k927k140j782j551j296j339
53874A84788j815k144j721q84n31q61j133q35l31m4L49J284K371K844K859L513
53858A87709N475Q049R902J0309R496P962N862L077k64l487n741o711o819o631
$$ y = [136940, 136862, 136255, 136200, 137127, 138209, 138607, 138633, 139094, 140092, 141197, 142417, 144126, 146230, 148202, 149918, 151705, 153536, 154964, 155981, 157204, 158859, 160327, 161248, 162510, 165374, 169826, 174544, 178538, 182156, 186203, 190619, 194562, 197585, 200176, 203013, 206096, 208900, 211110, 212857, 214342, 215647, 216943, 218602, 220974, 224254, 228539, 233690, 239068, 243808, 247627, 251078, 254732, 258373, 261292, 263155, 264208, 264799, 265076, 265063, 264638, 263545, 261768, 259853, 258427, 257429, 256228, 254528, 252599, 250468, 247490, 243181, 238113, 233433, 229570, 225927, 221843, 217378, 212955, 208638, 204192, 199727, 195823, 192896, 190756, 188974, 187423, 186127, 184788, 182973, 180829, 179108, 178224, 177693, 176832, 175699, 174864, 174533, 174489, 174838, 176122, 178493, 181337, 184196, 187709, 193184, 201233, 211135, 221444, 230940, 238902, 244764, 247841, 247577, 244090, 238349, 231638, 224819, 218188]
53844B18188o255n529m590l821l270k565j511m80O2J33J13J31m2n81j376k222
53828A86385l030l666l835l362k511j819j574j624j679j589j286o81J55Q75J174
53813A61933J144J066R23N10N6K34J313K598L156K922K654K762K784K239J545
53798A87839J569K409L174L078K343J789J794K039K063J711J088L89j67m61n71
53783B10086n76m17j69l15j213k372k803k262j606j670k293k829l084l245l267
53768A81965k961k465k071j731j224o94m73n06n07n18p98j221j439j520j814k154
53752A59869j938j122m37l43m51k35K15N04M89K69L2J45Q99J902K265J696Q57
53735A64616L64P3k43j76N93J430J428O76J24K74P43J058J275J617K076K432K470
$$ y = [218188, 211933, 206404, 201814, 197993, 194723, 192158, 190647, 190167, 190229, 190362, 190475, 190606, 190564, 189983, 188607, 186385, 183355, 179689, 175854, 172492, 169981, 168162, 166588, 164964, 163285, 161696, 160410, 159729, 159884, 160759, 161933, 163077, 164143, 165066, 165576, 165632, 165866, 167179, 169777, 172933, 175855, 178509, 181271, 184055, 186294, 187839, 189408, 191817, 194991, 198069, 200412, 202201, 203995, 206034, 208097, 209808, 210896, 211285, 211118, 210657, 210086, 209510, 209093, 208924, 208609, 207396, 205024, 202221, 199959, 198353, 196683, 194390, 191561, 188477, 185232, 181965, 179004, 176539, 174468, 172737, 171513, 170819, 170346, 169840, 169333, 168815, 168017, 166796, 165357, 163837, 162023, 159869, 157931, 156809, 156372, 156029, 155578, 155343, 155558, 156062, 156551, 156820, 156852, 156997, 157896, 159798, 162063, 163759, 164616, 164980, 165053, 164810, 164634, 165227, 166657, 168085, 168761, 168885, 169159, 169902, 170960, 172235, 173852, 175928, 178360, 180830]
53718A80830K134J739J802K404K827K342J171K15o8j6K6L23J335K986M561N288
53702B09899M980M216L756L754L738L401L005K781K398J537O01K76N31P41O74
53687B46288O63Q46Q40L66l31q36r71p70m46l68o89r35n59J69L26l79j173j337
53669B40704j117j090j143p34Q3N74K79m43r39j020r19p09j96N24P29k16j799
53652B32568k595j855m29L84M25M84P95Q10L87K94J044K040K398K147J957K156
53636B43010K467K474J959R99J75K99J488K774L115K615K195K306K518K348J930
53621B72672J712J960K658L555M200M206L686L201L129L290L273L019K910L229
53607C16700L684L639K878K022J868K435L001L033K634J987J031M6j72O36J430
$$ y = [180830, 182964, 184703, 186505, 188909, 191736, 194078, 195249, 195464, 195396, 195380, 195406, 195729, 197064, 200050, 204611, 209899, 214879, 219095, 222851, 226605, 230343, 233744, 236749, 239530, 241928, 243465, 244066, 244342, 244873, 245614, 246288, 246951, 247797, 248637, 249003, 248672, 247836, 246865, 246095, 245649, 245281, 244592, 243657, 243098, 243267, 243593, 243214, 242041, 240704, 239587, 238497, 237354, 236620, 236703, 237277, 237556, 237113, 236174, 235154, 234235, 233526, 233330, 233854, 234583, 234367, 232568, 229973, 228118, 227689, 228073, 228498, 228982, 229777, 230587, 230974, 231268, 232312, 234352, 236750, 238897, 240854, 243010, 245477, 247951, 249910, 250909, 251084, 251383, 252871, 255645, 258760, 261375, 263570, 265876, 268394, 270742, 272672, 274384, 276344, 279002, 282557, 286757, 290963, 294649, 297850, 300979, 304269, 307542, 310561, 313471, 316700, 320384, 324023, 326901, 328923, 330791, 333226, 336227, 339260, 341894, 343881, 344912, 344958, 344786, 345422, 346852]
53592C46852J006l75j376j431j239j338j265n85R6q3j029j889k156j936j420p31
53576C31101j66J7N5M01J058J646K083K605L026K683J399j6p33r53j444k226k444
53559C38092j652n89k45n56n93L0O11M02l28p68o67l61J19J090K296K814K411
53542C42106K187L071M273M335L469L493N270P404Q195P857P872Q787R855J0549
53528D28723J1213J2103J2789J2920J2891J3262J4074J5124J6441J8029J9454
53517E87023K0272K0639K1066K1750K2583K3615K4976K6294K6850K6491K5921
53506H47480K5838K6125K6327K6449K6718K6705K5554K3356K1609K1646K2949
53495A120756K3769K3284K2345K1956K1903K1430K0549J9895J9625J9336J8986
$$ y = [346852, 347858, 347483, 346107, 344676, 343437, 342099, 340834, 340249, 340345, 340262, 339233, 337344, 335188, 333252, 331832, 331101, 330935, 330952, 331007, 331408, 332466, 334112, 336195, 338800, 341826, 344509, 345908, 345892, 345159, 344206, 342762, 340536, 338092, 336440, 335851, 335606, 335050, 334457, 334487, 335098, 335500, 335172, 334404, 333737, 333376, 333495, 334585, 336881, 339695, 342106, 344293, 347364, 351637, 355972, 359441, 362934, 368204, 375608, 383803, 391660, 399532, 408319, 418174, 428723, 439936, 452039, 464828, 477748, 490639, 503901, 517975, 533099, 549540, 567569, 587023, 607295, 627934, 649000, 670750, 693333, 716948, 741924, 768218, 795068, 821559, 847480, 873318, 899443, 925770, 952219, 978937, 1005642, 1031196, 1054552, 1076161, 1097807, 1120756, 1144525, 1167809, 1190154, 1212110, 1234013, 1255443, 1275992, 1295887, 1315512, 1334848, 1353834]
53484A353834J9053J9628K0003J9500J8216J6687J5176J3542J1548R074O305L717
53472A526283J553o70l602o935r572j1106j2407j4264j6217j7409j7942j8469
53460A399243j8986j9042j9003j9897k1894k3894k4954k5258k5280k4815k3539
53449A152681k1961k0990k0758k0488j9464j7654j5416j3171j1385j0374r853
53438I71167q985p235n020l221k170j365k38J150K394L526N041P096R015R993
53424I81148J0222J0922J3036J6051J8483J9588K0266K1885K4464K6633K7501
53413A190199K7847K8967L0909L2714L4078L5747L8186M0857M3256M5741M8687
53402A597188N1481N3239N4122N5171N6946N8976O0501O1227O1358O1329O1456
$$ y = [1353834, 1372887, 1392515, 1412518, 1432018, 1450234, 1466921, 1482097, 1495639, 1507187, 1516261, 1522566, 1526283, 1527836, 1527166, 1523564, 1516629, 1507057, 1495951, 1483544, 1469280, 1453063, 1435654, 1417712, 1399243, 1380257, 1361215, 1342212, 1322315, 1300421, 1276527, 1251573, 1226315, 1201035, 1176220, 1152681, 1130720, 1109730, 1088972, 1068484, 1049020, 1031366, 1015950, 1002779, 991394, 981020, 971167, 962182, 954947, 949927, 946706, 944536, 943171, 942933, 944083, 946477, 950003, 955044, 962140, 971155, 981148, 991370, 1002292, 1015328, 1031379, 1049862, 1069450, 1089716, 1111601, 1136065, 1162698, 1190199, 1218046, 1247013, 1277922, 1310636, 1344714, 1380461, 1418647, 1459504, 1502760, 1548501, 1597188, 1648669, 1701908, 1756030, 1811201, 1868147, 1927123, 1987624, 2048851, 2110209, 2171538, 2232994]
53391B232994O1558O1119O0030N8900N8166N7263N5203N1777M7646M3518L9785
53380B827959L6644L3875L0621K6186K0946J5805J0849N353r08p326j3506j9837
53368B966661k6658l3643m0356m6714n2534n7172o0072o1351o1636o1664o1994
53357B402867o2506o2155n9968n6472n3411n1764n0852m9688m8328m7379m7025
53346A813319m7132m7588m7883m7064m4904m2448m0553l8503l5100l0661k6812
53335A364671k4443k2898k1286j9561j8062j6834j5786j5046j4771j4823j4851
53324A166310j4548j3842j2975j2267j1625j0592r098p740o881n965m319k300
53312A054158p97J99J618L903O391Q296R594J0702J1971J3719J6139J8804K0768
$$ y = [2232994, 2294552, 2355671, 2415701, 2474601, 2532767, 2590030, 2645233, 2697010, 2744656, 2788174, 2827959, 2864603, 2898478, 2929099, 2955285, 2976231, 2992036, 3002885, 3008238, 3007330, 3000004, 2986498, 2966661, 2940003, 2906360, 2866004, 2819290, 2766756, 2709584, 2649512, 2588161, 2526525, 2464861, 2402867, 2340361, 2278206, 2218238, 2161766, 2108355, 2056591, 2005739, 1956051, 1907723, 1860344, 1813319, 1766187, 1718599, 1670716, 1623652, 1578748, 1536300, 1495747, 1457244, 1422144, 1391483, 1364671, 1340228, 1317330, 1296044, 1276483, 1258421, 1241587, 1225801, 1210755, 1195984, 1181161, 1166310, 1151762, 1137920, 1124945, 1112678, 1101053, 1090461, 1081363, 1073623, 1066742, 1060777, 1056458, 1054158, 1053361, 1053560, 1055178, 1059081, 1065472, 1073768, 1083362, 1094064, 1106035, 1119754, 1135893, 1154697, 1175465]
53299A175465K1632K2108K3205K5162K7489K9610L1067L1521L1057L0356K9969
53288A478641K9530K8149K5599K2683K0269J8363J6415J4195J1926R566O555K548
53276A684439j805n369p699r417j1367j3814j6614j9630k2653k5248k7071k8269
53264A495483k9206k9994l0552l0967l1394l1763l1879l1821l1856l2025l2081
53253A151945l1812l1125k9921k8249k6650k5904k6261k7138k7673k7530k7071
53242H42611k6771k6570k5872k4326k2388k0732j9179j6896j3813j1145r908r567
53230F15444q939q014p874q907j0118j0486j0216j0222j0923j1969j2773j2992
53218D92011j2716j2446j2632j3039j2842j1568r726q287p738p776p807p532p099
$$ y = [1175465, 1197097, 1219205, 1242410, 1267572, 1295061, 1324671, 1355738, 1387259, 1418316, 1448672, 1478641, 1508171, 1536320, 1561919, 1584602, 1604871, 1623234, 1639649, 1653844, 1665770, 1675336, 1681891, 1684439, 1682634, 1677265, 1669566, 1660149, 1648782, 1634968, 1618354, 1598724, 1576071, 1550823, 1523752, 1495483, 1466277, 1436283, 1405731, 1374764, 1343370, 1311607, 1279728, 1247907, 1216051, 1184026, 1151945, 1120133, 1089008, 1059087, 1030838, 1004188, 978284, 952023, 924885, 897212, 869682, 842611, 815840, 789270, 763398, 739072, 716684, 695952, 676773, 659877, 646064, 634919, 625011, 615444, 606505, 598491, 590617, 581710, 571592, 561106, 550890, 540668, 529745, 517776, 505003, 492011, 479295, 466849, 454217, 441178, 428336, 416768, 407042, 398755, 391017, 383241, 375434, 367902, 360803]
53205C60803o771o597o486o542p001p682p955p523o839o390n945n167m474m525
53191B70906m998m883l999l324l525l965l708k792k015j835j983j955j534r79
53177B29411q16j211j573j202k61L55K34j06j09R2J37K3j27l72o80q01p35q31
53159B21428j181j394j246j041r65p40k78j8j73k96j09r5n79r24m72K72L62j84
53141B12367o12p32r06j009n47K26M51j9m51n65r48j731j937p99R52J858J355
53124B06953J14q21q52p5P77R00K33n02p32o27n64m78j80J33J37j33m41p94j212
53105B01836j354q68m7L60l4q36j357j187m52K37J65p58j735j846j070k41Kj44
53087A90671j89m8j9k20m01l25j08q8l61n85l43L09Q93J092J046R66Q03N44M80
$$ y = [360803, 354032, 347435, 340949, 334407, 327406, 319724, 311769, 304246, 297407, 291017, 285072, 279905, 275431, 270906, 265908, 261025, 257026, 253702, 250177, 246212, 242504, 239712, 237697, 235862, 233879, 231924, 230390, 229411, 228595, 227384, 225811, 224609, 224348, 224703, 224937, 224831, 224722, 224814, 224951, 224974, 224847, 224475, 223795, 222994, 222259, 221428, 220247, 218853, 217607, 216566, 215601, 214861, 214583, 214565, 214392, 214096, 213987, 213892, 213313, 212389, 211917, 212189, 212551, 212367, 211755, 211023, 210117, 209108, 208561, 208787, 209238, 209219, 208768, 208203, 207255, 205524, 203587, 202788, 203740, 205598, 206953, 207067, 206246, 205394, 205319, 206096, 206996, 207229, 206727, 205995, 205368, 204804, 204326, 204146, 204279, 204416, 204283, 203842, 203048, 201836, 200482, 199614, 199567, 199927, 199893, 199057, 197700, 196513, 196061, 196298, 196463, 195705, 193970, 192124, 191054, 190813, 190815, 190671, 190482, 190434, 190415, 190195, 189794, 189469, 189361, 189273, 188912, 188327, 187984, 188293, 189186, 190278, 191324, 192290, 193093, 193637, 194117]
53068A94117P16P16p7j178j402l54J019J682J659J497J174L29p37j123n03M25
53052A97960Q24O65N24P96J294J484J005J18m86n16n97j484k881l592l011j823
53036A90280j078j080j481j864j855j136Q4R52Q51J55l23l48j93M6M33P29O27
53019A84799L85N12Q76Q20K45j49J04O44R02P92M68mm50n05j39J58k1m53o78n40
52999A87766r5O33J433J791J396N64j72o13q56r23q51q51r84r08k93N47R05N10
52981A88999j47l44J65R72J431J266P44K20l28r96j357p83N43J558J649J458J881
52964A96931K750L175K889K511K519K589K165J223K76k56m58p65j386j962j991
52949B10210j530j175j251j486j634j870k279k471k135j548j032m71J46K15o03
$$ y = [194117, 194833, 195549, 195472, 194294, 192892, 192538, 193557, 195239, 196898, 198395, 199569, 199898, 199161, 198038, 197535, 197960, 198784, 199449, 199973, 200769, 202063, 203547, 204552, 204670, 204184, 203668, 203071, 201587, 198706, 195114, 192103, 190280, 189202, 188122, 186641, 184777, 182922, 181786, 181870, 182822, 183673, 183828, 183505, 183157, 182964, 183010, 183443, 184172, 184799, 185184, 185696, 186572, 187392, 187637, 187488, 187592, 188236, 189138, 189930, 190398, 190394, 189944, 189439, 189300, 189458, 189437, 188984, 188306, 187766, 187671, 188304, 189737, 191528, 192924, 193488, 193316, 192703, 191847, 190924, 190073, 189222, 188238, 187330, 187037, 187584, 188489, 188999, 188852, 188508, 188673, 189645, 191076, 192342, 193086, 193306, 192978, 191982, 190625, 189842, 190385, 191943, 193592, 195050, 196931, 199681, 202856, 205745, 208256, 210775, 213364, 215529, 216752, 217028, 216772, 216314, 215549, 214163, 212201, 210210, 208680, 207505, 206254, 204768, 203134, 201264, 198985, 196514, 194379, 192831, 191799, 191328, 191474, 191689, 191086]
52934A91086j471j306l94m5o29j045m36N23O06l23j321j571j086m32j48l16n02
52917A81190j94N84J246J318Q62K13l93q00q70n98k34j09l96r75j374j122l38
52900A78010J90ol48j2P53R11K26k71K97J535K395K332J452J10j140j654j329
52883A83451p57m22j17L49M60l42j578k110j523n01K59P93J436K097K358K016
52867A85869J335P63N70O66Q13R59J224J538J532R93K18l36o17q81j229j566j888
52850A89963k246k446k207j638j247j241j211p17K2L42l0o28q49o07k44N0L39
52833A75405M47j20j410k485k247p84O85J238J134J003Q82M46k05o78r15j085
52817A71311j043m76M20R85R82Q97J111J333J074L79k34l20K32J225K184K546
$$ y = [191086, 189615, 188309, 187915, 187870, 187241, 186196, 185760, 186283, 186889, 186566, 185245, 183674, 182588, 182156, 182008, 181692, 181190, 180996, 181580, 182826, 184144, 185006, 185219, 184826, 184026, 183156, 182558, 182324, 182215, 181819, 180844, 179470, 178348, 178010, 178200, 178194, 177846, 177834, 178587, 179498, 179724, 179453, 179750, 181285, 183680, 186012, 187464, 187574, 186434, 184780, 183451, 182694, 182272, 182155, 182504, 182964, 182622, 181044, 178934, 177411, 176910, 177169, 177962, 179398, 181495, 183853, 185869, 187204, 187967, 188537, 189203, 190016, 190975, 192199, 193737, 195269, 196262, 196480, 196144, 195527, 194646, 193417, 191851, 189963, 187717, 185271, 183064, 181426, 180179, 178938, 177727, 177010, 177032, 177374, 177344, 176716, 175867, 175260, 175016, 175066, 175405, 175852, 175732, 174322, 171837, 169590, 168806, 169491, 170729, 171863, 172866, 173748, 174194, 173989, 173311, 172396, 171311, 170268, 169792, 170212, 171197, 172179, 173076, 174187, 175520, 176594, 176973, 176739, 176419, 176651, 177876, 180060, 182606]
52801A82606K133J325N67j20r10j684k173k458k844l277l249k518j440m98K75
52786A65735R99J444J230M76j75k84n9M7o8j67j10p7k95o87q73n53J23O41O44
52767A67991K91l5j91l06m48n55o36o93m76K55J156J435Q20o3n37o78q66r62n71
52748A64931J47O21P67J122J927K648K646J943J064M54K87N51J045J399J353R82
52732A83887N53K43R0J10L77R74J779K301J966P85m47r09o11k10j35l24o85j284
52714A88460j989k387k230j624p48K92J198J526J207O63K44j08n02q22r84j153
52698A81043j358j267o36K25P77R00Q93J007J135J022N45j29o43p56n14p3M92
52681A82663R73R23K06n39n48l2J03l91p87o48n01q51j229q96Q8J080J723K015
$$ y = [182606, 184739, 186064, 186631, 186511, 185601, 183917, 181744, 179286, 176442, 173165, 169916, 167398, 165958, 165460, 165735, 166734, 168178, 169408, 169884, 169709, 169425, 169366, 169413, 169345, 169178, 169068, 168991, 168696, 168009, 167136, 166583, 166706, 167347, 167991, 168282, 168247, 168056, 167750, 167302, 166747, 166111, 165418, 164942, 165197, 166353, 167788, 168608, 168545, 168008, 167330, 166464, 165502, 164931, 165078, 165699, 166466, 167588, 169515, 172163, 174809, 176752, 177816, 178270, 178557, 179108, 180153, 181552, 182905, 183887, 184440, 184683, 184773, 184883, 185260, 186234, 188013, 190314, 192280, 193065, 192618, 191709, 191098, 190888, 190753, 190429, 189744, 188460, 186471, 184084, 181854, 180230, 179482, 179774, 180972, 182498, 183705, 184368, 184612, 184504, 184002, 183180, 182196, 181043, 179685, 178418, 177782, 178007, 178784, 179684, 180577, 181584, 182719, 183741, 184286, 184157, 183514, 182758, 182244, 182171, 182663, 183636, 184559, 184765, 184226, 183678, 183646, 183749, 183358, 182571, 181923, 181422, 180571, 179342, 178446, 178534, 179614, 181337, 183352]
52663A83352J886J325O80K54q8n28q12o70k60K25R78J961K413J797Q20N85R29
52646A94847P26k59r03m28M57N76j80r49j082p56n89r50j555j673q85L83J323
52629A88103J629J641J701J827J882J688J028K3o95o79l99n92j065r27o9N31K05
52612A95832n02p37m40r9N3R5J09K44O42J017Q09N5m02J5Q52J359J446J366J044
52593B02758L62k52l27j14j73l49oP92J166O89Q0K35J017J461R85M2m44p7P04
52574B08549J254J385J209O13o08k005k523j709m12K17O3j72k33n30j174j529
52558B02395j074j55M68M98K11o1k84n66q47q54l95K67N53K27k40k70O5K51J49
52539B00338J26K80K02k89o75m55Q0K75J22K08O81R19M61k30l50J68O55O21K06
$$ y = [183352, 185238, 186563, 187243, 187497, 187409, 186881, 186069, 185399, 185139, 185364, 186342, 188303, 190716, 192513, 193333, 193918, 194847, 195573, 195314, 194411, 193983, 194440, 195016, 194836, 193887, 192805, 192049, 191460, 190510, 188955, 187282, 186397, 186780, 188103, 189732, 191373, 193074, 194901, 196783, 198471, 199499, 199522, 198827, 198148, 197749, 197157, 196092, 195165, 195096, 195627, 195832, 195330, 194593, 194153, 194054, 194107, 194202, 194311, 194555, 195197, 196214, 197023, 197078, 196676, 196691, 197543, 198902, 200348, 201714, 202758, 203120, 202868, 202541, 202427, 202254, 201905, 201899, 202691, 203857, 204546, 204626, 204861, 205878, 207339, 208324, 208366, 207922, 207845, 208549, 209803, 211188, 212397, 213010, 212402, 210397, 207874, 206165, 205753, 205970, 206033, 205861, 205628, 205098, 203924, 202395, 201321, 201166, 201634, 202132, 202343, 202282, 201998, 201432, 200585, 199731, 199336, 199603, 200156, 200383, 200143, 199873, 199938, 200189, 200338, 200464, 200744, 200946, 200657, 199982, 199527, 199607, 199882, 200004, 200212, 200893, 201812, 202273, 202043, 201693, 201861, 202516, 203137, 203343]
52520B03343l02q49j331j364p90p3J81j0j38K5K98O20J170J966K808L700M718
52503B13972N366M790L005J226L68j86j546l445m425l850k728k300k571k639j960
52488B03077p58M40J141J070M30r3NM37N29J96O3N36J174J294R36O68O26L03m64
52469B11610r34m52M55P28L52L79J242K029J941J584J996L035L660L470K864J980
52453B35939N75r70j714j503j319j792k366k425k343k645k864k228r77l3L20N08
52437B14163N87R5r46j812k099k134k171j882j077k65M9J42O31J520K178K126
52421B09105J426M84j76j08O88J653K212K393K631L077L543M027M850O161P618
52406B49584Q771R419R445Q628O903M644K352J39k182m549o462p463p551p036
$$ y = [203343, 203041, 202192, 200861, 199497, 198707, 198634, 198815, 198805, 198667, 198692, 198990, 199610, 200780, 202746, 205554, 209254, 213972, 219338, 224128, 227133, 228359, 228727, 228541, 226995, 223550, 219125, 215275, 212547, 210247, 207676, 205037, 203077, 202319, 202759, 203900, 204970, 205400, 205307, 205312, 205749, 206278, 206474, 206537, 207073, 208247, 209541, 210477, 211145, 211771, 212074, 211610, 210676, 210224, 210679, 211407, 211759, 212138, 213380, 215409, 217350, 218934, 220930, 223965, 227625, 231095, 233959, 235939, 236514, 235544, 233830, 232327, 231008, 229216, 226850, 224425, 222082, 219437, 216573, 214345, 213368, 213335, 213655, 214163, 214750, 214845, 213899, 212087, 209988, 207854, 205683, 203801, 202724, 202459, 202508, 202650, 203281, 204801, 206979, 209105, 210531, 211015, 210839, 210731, 211419, 213072, 215284, 217677, 220308, 223385, 226928, 230955, 235805, 241966, 249584, 258355, 267774, 277219, 285847, 292750, 297394, 299746, 299885, 297703, 293154, 286692, 279229, 271678, 264642]
52392B64642o141m928l516k207j303r15r18j023r48n64K1N79R65J173J272J357
52376B47546J542J843K101K198K367L104M540O066O811O508N679M969M510M012
52362C03796L243K190R03n10j687k090j528m98J58Q8k50j61N61J590K615L525
52346C11945M119M072L501L178L788N097O278O932P331P779Q240Q732R475J0478
52332D00945J1464J2442J3858J5755J7372J8106J8432J9190K0278K0919K1025
52321E89786K1318K2017K2321K1690K0767K0394K0279J9386J7422J5211J3648
52310H04239J2798J2150J1277J0128Q872P588O121M375K687J687J554J705J420
52297H86601N22p62k240l636m376m225l888m378n726o986p549p724p797p287n679
$$ y = [264642, 258501, 253573, 250057, 247850, 246547, 245632, 244714, 243691, 242743, 242179, 242200, 242779, 243744, 244917, 246189, 247546, 249088, 250931, 253032, 255230, 257597, 260701, 265241, 271307, 278118, 284626, 290305, 295274, 299784, 303796, 307039, 309229, 310132, 309622, 307935, 305845, 304317, 303819, 303977, 304065, 303815, 303654, 304215, 305805, 308420, 311945, 316064, 320136, 323637, 326815, 330603, 335700, 341978, 348910, 356241, 364020, 372260, 380992, 390467, 400945, 412409, 424851, 438709, 454464, 471836, 489942, 508374, 527564, 547842, 568761, 589786, 611104, 633121, 655442, 677132, 697899, 718293, 738572, 757958, 775380, 790591, 804239, 817037, 829187, 840464, 850592, 859464, 867052, 873173, 877548, 880235, 881922, 883476, 885181, 886601, 887123, 886361, 884121, 880485, 876109, 871884, 867996, 863618, 857892, 850906, 843357, 835633, 827836, 820549, 814870]
52282H14870l368j194O85K792N290P606R189J0215J1272J2672J4219J5535J6355
52269I16138J6674J6676J6558J6301J5689J4598J3149J1604J0066Q461O792N337
52257A068043M468M222M149L706K789J717P67j20j099k118l035l894m884o053
52243A068658p318q674j0115j1321j1708j1028r762q672q019p496o828o121n537
52230I56059m943m184l430k911k387j318L14J751K224J842J420J581K288L215
52216I51521M214N263O158O552O392O099O222O818P404P534P231O754O112N172
52202A039446M089L273K907K867L105L685M313M383L731K877K284J778J089M30
52188A080257N4l48j086j722j633j084r20j329j826k444l841n925p452p518o730
$$ y = [814870, 811502, 810308, 810993, 813785, 819075, 826681, 835870, 846085, 857357, 870029, 884248, 899783, 916138, 932812, 949488, 966046, 982347, 998036, 1012634, 1025783, 1037387, 1047453, 1055914, 1062706, 1068043, 1072511, 1076733, 1080882, 1084588, 1087377, 1089094, 1089861, 1089741, 1088642, 1086524, 1083489, 1079595, 1074711, 1068658, 1061340, 1052666, 1042551, 1031230, 1019522, 1008494, 998732, 990060, 982041, 974545, 967717, 961596, 956059, 951116, 946932, 943502, 940591, 938204, 936886, 937200, 938951, 941175, 943017, 944437, 946018, 948306, 951521, 955735, 960998, 967156, 973708, 980100, 986199, 992421, 999239, 1006643, 1014177, 1021408, 1028162, 1034274, 1039446, 1043535, 1046808, 1049715, 1052582, 1055687, 1059372, 1063685, 1068068, 1071799, 1074676, 1076960, 1078738, 1079827, 1080257, 1080311, 1079963, 1078877, 1077155, 1075522, 1074438, 1073518, 1072189, 1070363, 1067919, 1064078, 1058153, 1050701, 1043183, 1036453]
52173A036453o230o168n886n074m003k925j978j465j580j895j728r56L1J040K148
52158I99784L180L723L733L584L394K827J786P48J83m1l24o74p38l29L46R29J242
52141A023353J337J362J398J441J583K108L230M789O330P582Q656R871J1487J3643
52127A098170J6276J9027K1378K3087K4407K5784K7355K8786K9598K9558K8841
52116A372267K7882K7056K6350K5267K3167J9960J6443J3587J1392Q806N118R98
52104A578293k431n209q268j1563j3607j3445j2129j1358j1293j0781r422q146
52092A460641p657p428o713n801n611o421p553q100p675o572n369m283k837m77
52078A378144K576N427P614R533J1602J3518J4779J5498J6108J6549J6385J5672
$$ y = [1036453, 1030223, 1024055, 1018169, 1013095, 1009092, 1006167, 1004189, 1002724, 1001144, 999249, 997521, 996565, 996596, 997636, 999784, 1002964, 1006687, 1010420, 1014004, 1017398, 1020225, 1022011, 1022759, 1022942, 1022901, 1022577, 1021903, 1021165, 1020836, 1021182, 1022111, 1023353, 1024690, 1026052, 1027450, 1028891, 1030474, 1032582, 1035812, 1040601, 1046931, 1054513, 1063169, 1073040, 1084527, 1098170, 1114446, 1133473, 1154851, 1177938, 1202345, 1228129, 1255484, 1284270, 1313868, 1343426, 1372267, 1400149, 1427205, 1453555, 1478822, 1501989, 1521949, 1538392, 1551979, 1563371, 1572177, 1577295, 1578293, 1575862, 1570653, 1562385, 1550822, 1537215, 1523770, 1511641, 1500283, 1488990, 1478209, 1468787, 1460641, 1452984, 1445556, 1438843, 1433042, 1427431, 1421010, 1413457, 1405357, 1397682, 1391110, 1385741, 1381458, 1378621, 1378144, 1380720, 1386147, 1393761, 1403294, 1414896, 1428414, 1443193, 1458691, 1474799, 1491348, 1507733, 1523405]
52066A523405J5084J4968J4711J3403J0963Q291O314N038L653J500j273m081o643
52053A605333r028j1126j2588j3456j4429j6108j8261k0154k1433k2257k2707
52042A423786k2566k1845k1101k0897k1116k1026k0024j8100j5632j3004j0510
52031A217965q454p004n993n066m147l522l330l242k969k811l358m645o044p021
52017A150359p597p945q006p747p582q082r467j1501j3773j5885j7594j8970k0255
52004I95955k1362k1781k1303k0539k0280k0522k0633k0428k0448k0947k1272
51993G66440k0586j8896j6877j4926j2917j0919r545r323r919j0267r463p500
51981F15302n287m087m663o715r046j0558j1098j1259j1412j1304j0622r635q860
$$ y = [1523405, 1538489, 1553457, 1568168, 1581571, 1592534, 1600825, 1607139, 1612177, 1615830, 1617330, 1616057, 1611976, 1605333, 1596305, 1585179, 1572591, 1559135, 1544706, 1528598, 1510337, 1490183, 1468750, 1446493, 1423786, 1401220, 1379375, 1358274, 1337377, 1316261, 1295235, 1275211, 1257111, 1241479, 1228475, 1217965, 1209511, 1202507, 1196514, 1191448, 1187301, 1183779, 1180449, 1177207, 1174238, 1171427, 1168069, 1163424, 1157380, 1150359, 1142762, 1134817, 1126811, 1119064, 1111482, 1103400, 1093933, 1082432, 1068659, 1052774, 1035180, 1016210, 995955, 974593, 952812, 931509, 910970, 890690, 870168, 849535, 829107, 808659, 787712, 766440, 745854, 726958, 710081, 695155, 682238, 671319, 661774, 652451, 642532, 632265, 622802, 615302, 610015, 605928, 601265, 594550, 585504, 574946, 563848, 552589, 541177, 529873, 519251, 509616, 500756]
51968E00756q316p432n766l538j416M9P87J201J848K932M048M600M604M740N448
51953E04545O156N745L838J287p20j905k902m089m826m242k534q85J8Q16K478
$$ y = [500756, 492440, 485008, 479242, 475704, 474288, 474337, 475124, 476325, 478173, 481105, 485153, 489753, 494357, 499097, 504545, 510701, 516446, 520284, 521571, 520851, 518946, 516044, 511955, 507129, 502887, 500353, 499468, 499486, 500302, 502780]
$$ [...]
##END NTUPLES=NMR SPECTRUM
##END=
