##TITLE=NES1063_T15_9883190_XKVSV2fwfb
##JCAMPDX= 6.0         $$ Bruker NMR JCAMP-DX V2.0
##DATA TYPE= NMR SPECTRUM
##DATA CLASS= NTUPLES
##ORIGIN= BRUKER
##OWNER= Administrator
$$ 1.72 TOPSPIN		Version 2.1
$$ 2016-08-26 23:59:26.976 -0500  Administrator@X
$$ Compression mode = diff/dup
##.OBSERVE FREQUENCY= 400.02188249412
##.OBSERVE NUCLEUS= ^1H
##.ACQUISITION MODE= SIMULTANEOUS (DQD)
##.ACQUISITION SCHEME= undefined
##.AVERAGES= 8
##.DIGITISER RES= 22
##SPECTROMETER/DATA SYSTEM= spect
##.PULSE SEQUENCE= zg30
##.SOLVENT NAME= COFFEE_meoh
##.SHIFT REFERENCE= INTERNAL, COFFEE_meoh, 1, 14.98509
##AUDIT TRAIL= $$ (NUMBER, WHEN, WHO, WHERE, PROCESS, VERSION, WHAT)
$$ ##TITLE= Audit trail, TOPSPIN		Version 2.1
$$ ##JCAMPDX= 5.01
$$ ##ORIGIN= Bruker BioSpin GmbH
$$ ##OWNER= Administrator
$$ $$ E:\/data/COFFEE/nmr/NES1063_T15_9883190_XKVSV2fwfb/10/pdata/1/auditp.txt
$$ ##AUDIT TRAIL=  $$ (NUMBER, WHEN, WHO, WHERE, PROCESS, VERSION, WHAT)
(   1,<2016-08-26 23:59:19.851 -0500>,<Administrator>,<X>,<go>,<TOPSPIN 2.1>,
      <created by zg
	started at 2016-08-26 23:58:13.711 -0500,
	POWCHK enabled, PULCHK disabled,
       configuration hash MD5:
       21 0F 79 D6 B3 7B B4 F6 88 20 88 DB 03 48 BD 9F
       data hash MD5: 64K
       02 9B 90 8B 5C A6 50 7C 01 4E 06 D2 7B C1 7F 1A>)
(   2,<2016-08-26 23:59:22.914 -0500>,<Administrator>,<X>,<proc1d>,<TOPSPIN 2.1>,
      <Start of raw data processing
       efp LB = 0 FT_mod = 6 PKNL = 1 PHC0 = 0 PHC1 = 0 SI = 32K 
       data hash MD5: 32K
       0B B4 57 F6 7F CA FE 55 26 44 D4 7F 64 BC 3A 88>)
(   3,<2016-08-26 23:59:23.195 -0500>,<Administrator>,<X>,<proc1d>,<TOPSPIN 2.1>,
      <pk PHC0 = 95.22949 PHC1 = 0 
       data hash MD5: 32K
       56 01 5E C6 94 6A 94 12 09 C0 E2 AC 18 0F 13 29>)
(   4,<2016-08-26 23:59:23.304 -0500>,<Administrator>,<X>,<proc1d>,<TOPSPIN 2.1>,
      <abs ABSG = 1 
       data hash MD5: 32K
       78 B8 FA 4C 57 33 E0 78 D0 19 D0 90 AB 3F A7 89>)
(   5,<2016-08-26 23:59:23.367 -0500>,<Administrator>,<X>,<proc1d>,<TOPSPIN 2.1>,
      <abs ABSG = 2 
       data hash MD5: 32K
       71 94 62 46 16 E2 31 B3 6A 39 EF C9 43 81 F3 60>)
(   6,<2016-08-26 23:59:23.429 -0500>,<Administrator>,<X>,<proc1d>,<TOPSPIN 2.1>,
      <abs ABSG = 3 
       data hash MD5: 32K
       17 B6 FC 1E 46 DB 69 F8 29 20 CC 25 17 C3 8C 8E>)
(   7,<2016-08-26 23:59:23.476 -0500>,<Administrator>,<X>,<proc1d>,<TOPSPIN 2.1>,
      <abs ABSG = 4 
       data hash MD5: 32K
       F8 A4 F4 17 66 7F EC D1 F7 DF B9 74 BE 7E B5 75>)
(   8,<2016-08-26 23:59:23.539 -0500>,<Administrator>,<X>,<proc1d>,<TOPSPIN 2.1>,
      <abs ABSG = 5 
       data hash MD5: 32K
       EB 1B F8 C7 AE 88 C6 6B CC F9 B1 AE B0 21 D3 BB>)
$$ ##END=
$$ 
$$ $$ hash MD5
$$ $$ 7A B8 E0 A1 F5 FE D0 85 6D 16 6D 0C 07 CE 80 69
##$RELAX= 
##$RELAX= 
##$RELAX= 
##$RELAX= 
##$RELAX= 
##$RELAX= 
##$RELAX= 
$$ Bruker specific parameters
$$ --------------------------
##$DU= <E:\>
##$EXPNO= 10
##$NAME= <NES1063_T15_9883190_XKVSV2fwfb>
##$PROCNO= 1
$$ [...]
150 150 150 150 150 150 150 150
##$TP07= 0
##$TPNAME0= <>
##$TPNAME1= <>
##$TPNAME2= <>
##$TPNAME3= <>
##$TPNAME4= <>
##$TPNAME5= <>
##$TPNAME6= <>
##$TPNAME7= <>
##$TPOAL= (0..7)
0.5 0.5 0.5 0.5 0.5 0.5 0.5 0.5
##$TPOFFS= (0..7)
0 0 0 0 0 0 0 0
##$TUNHIN= 0
##$TUNHOUT= 0
##$TUNXOUT= 0
##$USERA1= <user>
##$USERA2= <user>
##$USERA3= <user>
##$USERA4= <user>
##$USERA5= <user>
##$V9= 5
##$VALIST= <valist>
##$VCLIST= <CCCCCCCCCCCCCCC>
##$VD= 0
##$VDLIST= <DDDDDDDDDDDDDDD>
##$VPLIST= <PPPPPPPPPPPPPPP>
##$VTLIST= <TTTTTTTTTTTTTTT>
##$WBST= 2048
##$WBSW= 25
##$XGAIN= (0..3)
0 0 0 0
##$XL= 0
##$YL= 0
##$YMAX_a= 598488
##$YMIN_a= -502739
##$ZGOPTNS= <>
##$ZL1= 120
##$ZL2= 120
##$ZL3= 120
##$ZL4= 120
##$ABSF1= 14.98509
##$ABSF2= -5.573092
##$ABSG= 5
##$ABSL= 3
##$ALPHA= 0
##$AQORDER= 0
##$ASSFAC= 0
##$ASSFACI= 0
##$ASSFACX= 0
##$ASSWID= 0
##$AUNMP= <proc_prof1d_extract_pilot.lims>
##$AXLEFT= 0
##$AXNAME= <>
##$AXNUC= <1H>
##$AXRIGHT= 0
##$AXTYPE= 0
##$AXUNIT= <>
##$AZFE= 0.1
##$AZFW= 0.1
##$BCFW= 0
##$BC_mod= 0
##$BYTORDP= 0
##$COROFFS= 0
##$CY= 15
##$DATMOD= 1
##$DC= 0
##$DFILT= <>
##$DTYPP= 0
##$F1P= 0
##$F2P= 0
##$FCOR= 0.5
##$FTSIZE= 32768
##$FT_mod= 6
##$GAMMA= 0
##$GB= 0
##$INTBC= 1
##$INTSCL= 1
##$ISEN= 128
##$LB= 0
##$LEV0= 0
##$LPBIN= 0
##$MAXI= 10000
##$MC2= 0
##$MEAN= 0
##$ME_mod= 0
##$MI= 0
##$NCOEF= 0
##$NC_proc= -8
##$NLEV= 6
##$NOISF1= 0
##$NOISF2= 0
##$NSP= 0
##$NTH_PI= 0
##$NZP= 0
##$OFFSET= 14.98509
##$PC= 1
##$PHC0= 95.22949
##$PHC1= 0
##$PH_mod= 1
##$PKNL= yes
##$PPARMOD= 0
##$PPDIAG= 0
##$PPIPTYP= 0
##$PPMPNUM= 2147483647
##$PPRESOL= 1
##$PSCAL= 4
##$PSIGN= 0
##$PYNMP= <proc.py>
##$REVERSE= no
##$SF= 400.02
##$SI= 32768
##$SIGF1= 0
##$SIGF2= 0
##$SINO= 400
##$SIOLD= 32768
##$SPECTYP= <>
##$SREGLST= <1H.CDCl3>
##$SSB= 0
##$STSI= 32768
##$STSR= 0
##$SW_p= 8223.68421052631
##$SYMM= 0
##$S_DEV= 0
##$TDeff= 65536
##$TDoff= 0
##$TI= <>
##$TILT= no
##$TM1= 0
##$TM2= 0
##$TOPLEV= 0
##$USERP1= <user>
##$USERP2= <user>
##$USERP3= <user>
##$USERP4= <user>
##$USERP5= <user>
##$WDW= 1
##$XDIM= 32768
##$YMAX_p= 446708970
##$YMIN_p= -680227
##$CURPLOT= <Network HP LaserJet P1505>
##$CURPRIN= <$Network HP LaserJet P1505>
##$DFORMAT= <normdp>
##$LAYOUT= <+/1D_H.xwp>
##$LFORMAT= <normlp>
##$PFORMAT= <normpl>
##$SURQMSG= 1
$$ End of Bruker specific parameters
$$ ---------------------------------
##NTUPLES= NMR SPECTRUM
##VAR_NAME=  FREQUENCY,     SPECTRUM/REAL,   SPECTRUM/IMAG
##SYMBOL=    X,             R,               I
##VAR_TYPE=  INDEPENDENT,   DEPENDENT,       DEPENDENT
##VAR_FORM=  AFFN,          ASDF,            ASDF
##VAR_DIM=   32768,         32768,           32768
##UNITS=     HZ,            ARBITRARY UNITS, ARBITRARY UNITS
##FACTOR=    0.250966925370066, 1,           1
##FIRST=     8223.43324360094, -11781,       -132496
##LAST=      0,             48397,           -219345
##MIN=       0,             -680227,         0
##MAX=       8223.43324360094, 446708970,    0
$$ Real data points
##PAGE= N=1
##DATA TABLE= (X++(R..R)), XYDATA
$$ [...]
19480b48980F2232b13781K2061f7426B15976c74475A00695a26170N1554k41879
19470c16495a08439B02880J0287a37389I3320c96379B60154d02506C1838J04817
19460A36655d3199C38363H1365J0823J6711d1640J201j38035B41640B6251d3253
19448b64136A90398a6867m5722L1267p2366C5376a00167k97644a24620N6256j26159
19437a94523E384R4281a26477i944j39498e2525j31620A57240d41532A51863A6629
19425A6609g6964L1034o0272m8199l72412A23082c7282k25141B49101c42395a33129
19413B20201F3327J22922N6904G3403C5192b5371j27638j4082A29653a91512A94954
19401f7215B3956b1705n5056m6816b1390p4191A42368a99503D260i5654O713r5294
$$ y = [-248980, 62232, -213781, -191720, -67426, 215976, -374475, 100695, -126170, -74616, -316495, -108439, 202880, 213167, -137389, 93320, -396379, 260154, -402506, 31838, 136655, -43199, 338363, 81365, 92188, 108899, -41640, -40439, -178474, 241640, 26251, -43253, -264136, 190398, -16867, -62589, -31322, -103688, 35376, -100167, -397811, -124620, -68364, -194523, 5384, 99665, -126477, -9944, -149442, -52525, -184145, 157240, -441532, 151863, 16629, 16609, -76964, -45930, -106202, -154401, -526813, 123082, -37282, -262423, 249101, -342395, -133129, 220201, 63327, 186249, 243153, 73403, 35192, -25371, -153009, -167091, 129653, -191512, 194954, -67215, 23956, -21705, -76761, -123577, -21390, -95581, 142368, -199503, 4260, -95654, -88941, -184235]
19389a84235l9002B76822I4862A8396a48941C09554c3356j3715F4639b50996i9400
19377g2457I4133J33224f5533j5518L5169k13819B9460a77149j90212a56475A6974
19365E3563J02211J52643j32855h7625k5311H4452b2282B2667b77215k3508a42712
19353D4524a79550j28190i023A44886J54332a65337g7485j6434D31940E8858N527
19342F4385f80227h2242q9870n5436D6822i8876A78224D5019i9278I2409L3964
19331A26373a99739Q9888k52040f632l32708a32647d7243j65802e6878k78854
19321c35732A34837a52542j89217P1516O7389o0475p8339D2008P9050a42312k4124
19310a66436B2169o127a49623C1605J86774a45688H1892a42088a1772D6226L8810
$$ y = [-184235, -223237, 276822, 94862, 18396, -148941, 309554, -33356, -47071, 64639, -250996, -99400, -72457, 94133, 227357, -65533, -81051, -45882, -259701, 29460, -177149, -367361, -156475, 16974, 53563, 155774, 308417, 175562, -87625, -112936, 84452, -22282, 22667, -277215, -300723, -142712, 44524, -179550, -307740, -9023, 144886, 299218, -165337, -77485, -93919, 431940, 58858, 64385, -680227, -82242, -172112, -227548, 46822, -98876, 178224, 45019, -99278, 92409, 126373, -199739, -109851, -361891, -6632, -339340, -132647, -47243, -213045, -56878, -335732, 134837, -152542, -341759, -270243, -202854, -263329, -341668, 42008, 121058, -142312, -166436, 22169, 16042, -149623, 31605, 218379, -145688, 81892, -142088, -11772, 46226, 85036]
19299H5036C9870g622j70593J1798l01213A82330P4607A5692b13606P7313L1465
19288a04828H2945e8592m00170J08055J61793k47925a16619d1015j35326A75532
19277a87562n4113h199D5022a85242p0673P9709b09E8107a72161A60800a30754
19265a40669j27415A42917A149b1461o2170F8486b85680A13239a66063A42417
19254a0621r3099j48188h4449k36222c948o9543H5258a07971G1063M2503J4272
19243A27838J24658a43418K9377E7623b54314a00846m8210j33420J07946k21605
19233c96135Q6894f268k25384O030j00632a25752B77904g2306E0535b33275g1091
19221D36880a46113K5496l53647O1419a37330p9089B39017b92989g1669n4648
$$ y = [85036, 39870, -7622, -178215, -166417, -467630, 182330, 256937, 15692, -213606, -136293, -104828, 82945, -58592, -458762, -350707, -188914, -436839, -116619, -41015, -176341, 175532, -187562, -241675, -8199, 45022, -185242, -255915, -176206, -209, 58107, -172161, 160800, -130754, -140669, -268084, 142917, 1149, -21461, -83631, 68486, -285680, 113239, -166063, 142417, -10621, -103720, -251908, -84449, -320671, -3948, -73491, 85258, -107971, 71063, 113566, 127838, 252496, -143418, -114041, 57623, -254314, -100846, -149056, -282476, -174530, -396135, -309241, -6268, -231652, -225622, -326254, -125752, 277904, -72306, 50535, -233275, -71091, 436880, -146113, -120617, -474264, -412845, -137330, -216419, 239017, -292989, -71669, -126317]
19211a26317n2421k7141j468o9253J16076F1194a51487m12087b11152M642e0902
19199f9320j74848g3527D5318c61019D08519A46553a22948A62711J14616j36766
19189A40561e3384o2488B28941c84050d1552A06713h2237j00455h0675H9463N5167
19178A44630c28911H917a39494E833i7899M1874A15645a84412D8210a31535d8809
19166c43750a37288E6921b18375h9088r3271F0412L6696J25361a54773J4041b7800
19154d4470l10031Q1990J02792O9553n222L4960G1703i1227H8320k1214A6390
19142i5643A33348f945j35040g094j50086c6908E6174a25748F6397a45614B30231
19130a91308R1873A05871J11633a085k01375Q8846A9135e5550A0124M4875a69681
$$ y = [-126317, -178738, -205879, -207347, -276600, -160524, 61194, -151487, -563574, -211152, -206510, -50902, -69320, -244168, -73527, 45318, -361019, 408519, 146553, -122948, 162711, 277327, 140561, -53384, -115872, 228941, -384050, -41552, 106713, -82237, -182692, -80675, 89463, 144630, -328911, 8917, -139494, 5833, -97899, -56025, 115645, -184412, 48210, -131535, -48809, -343750, -137288, 56921, -218375, -89088, -182359, 60412, 97108, 222469, -154773, -140732, -27800, -44470, -354501, -272511, -169719, -100166, -105388, -70428, 71703, -91227, 88320, 67106, 16390, -95643, 133348, -6945, -141985, -7094, -157180, -36908, 56174, -125748, 66397, -145614, 230231, -191308, -99435, 105871, 217504, -1085, -202460, -113614, 19135, -55550, 10124, 54999, -169681]
19118d9316j25324C40507g9670A01004f2372l05278F4580D067K81390a83180A3632
19106i9028J9070B26494J1709a57952f7997A15167o00N1643a30635j99590A71417
19094A3362M1470K174b4248C90105a10878B01665I0362m3358j497f7446B09827
19082f6413k60227a28197J4940k3875j4173B99740b06999b3543A65310A7277h917
19070a18418j99761d8689k33839a3130D81310A56477a73801n9917C0774M4154
19060G4928g2095p6551B7268d7274E003J41115b29176B51666a13744a2988C9619
19048a61601D2350a77423M1584D6003e3730j28576f881j70083L9734K7810N096
19037a04324l7803A87108b29481g9947a7866G1044b05884D3124a92943E2897R3526
$$ y = [-49316, -174640, 340507, -79670, 101004, -62372, -367650, 64580, 4067, 285457, -183180, 13632, -99028, -79958, 226494, 238203, -157952, -67997, 115167, 114567, 166210, -130635, -330225, 171417, 13362, 54832, 57006, -24248, 390105, -110878, 201665, 90362, 47004, 45507, -67446, 209827, -66413, -326640, -128197, -113257, -137132, -151305, 299740, -206999, -23543, 165310, 17277, -8917, -118418, -318179, -48689, -282528, -13130, 481310, 156477, -173801, -233718, 30774, 74928, -72095, -148646, 27268, -47274, 5003, 146118, -229176, 251666, -113744, -12988, 39619, -161601, 42350, -177423, -135839, 46003, -53730, -182306, -6881, -176964, -137230, -109420, -104324, -142127, 187108, -229481, -79947, -17866, 71044, -205884, 43124, -192943, 52897, 146423]
19026A46423n4001J29794H2689e8810j5883c2763A55666N2664f4668K6727A13840
19014C9274a62664e9059A6636J22955B9448L0128R830b60386a7323p9662m7996
19003a44981H0179L14381c83335a17322B59049j15881L4467D792b29097P9983
18993a49114B53698a34849k56604a10600A82715i3117o0183j23667A4266J2723
18983B6989b64742I852a27254L221d3662j04006n1769A85157P6730K09139l7826
18972D33200G828f8721G4283d44154b0713f069j10169j32418B57539a71057r001
18961a80058g7714j94843K0378j6538a14754j50862E209b28132A61221G0567a6169
18949a59243n2344E4105a0411l56262J48370j16655a49563k3850e4374A97500
$$ y = [146423, 92422, 222216, 82689, -58810, -74693, -32763, 155666, 208330, -64668, -37941, 113840, 39274, -162664, -59059, 16636, 139591, 29448, 59576, 69406, -260386, -17323, -96985, -144981, 80179, 394560, -383335, -117322, 259049, 143168, 177635, 4792, -229097, -149114, 253698, -134849, -391453, -110600, 182715, -93117, -153300, -276967, 14266, 26989, -264742, 9852, -127254, -124033, -43662, -147668, -199437, 185157, 261887, 471026, 433200, 7828, -68721, 74283, -444154, -20713, -6069, -116238, -248656, 257539, -171057, -180058, -77714, -272557, -252179, -268717, -114754, -265616, 5209, -228132, 161221, 70567, -16169, -159243, -211587, 54105, -10411, -366673, -218303, -334958, -149563, -173413, -54374, 197500]
18938B70446a74971A15318c3087r6156B02450G2111O1085J04225k3226a91687
18927a108E5983e6171L410A43817E827a28923a2820E7078b08907A18519a68805
18915I5791a42538a5380l3475A75847n9023L67540j74267R7944D663J19712a8790
18903b04892n6923b5579j50652K9838k48823I0317b14998A08072n99g8274E5773
18891a71880B628J28100a98608A07062Q1156a1284M375C9227L3621g4959A41905
18879g0295j84411a22840k9359C0523i5408D8970N2862e3233A89134E7980a74826
18867I1942h1383j07889h7899j07273L5617C3830a21565F0886a49612d7498G8814
18855B18198j862j04309A3237K83015P8000E6128d45743b1110A40182j5133i0793
$$ y = [270446, -174971, 115318, -33087, -129243, 202450, 72111, 133196, 237421, 214195, -191687, -1108, 55983, -56171, -52761, 143817, 5827, -128923, -12820, 57078, -208907, 118519, -168805, 95791, -142538, -15380, -48855, 175847, 116824, 484364, 310097, 408041, 4663, 124375, -18790, -204892, -261815, -25579, -176231, -146393, -395216, 90317, -214998, 108072, 107473, -78274, 55773, -171880, 2628, 130728, -198608, 107062, 188218, -11284, -6909, 39227, 72848, -74959, 141905, -70295, -254706, -122840, -152199, 30523, -95408, 48970, 101832, -53233, 189134, 57980, -174826, 91942, -81383, -189272, -87899, -195172, -159555, 33830, -121565, 60886, -149612, -47498, 78814, 218198, 216336, 112027, 13237, 296252, 374252, 56128, -445743, -21110, 140182, 125049, -90793]
18843b94354C09574A05978L560n3144a86755e4769B6829b09868F4175b64300d258
18831H4473g3526f225n8587l00469a58059N6639j69770j59837a99090o4484e6251
18819A44100b83381A9520a46422j00175A24496i057D32517m9610i7022a1703B08341
18807A6006c0043q44j36571A15383a8609A43078k4676A1652b78454A83851b8778
18795A109c1389A18064M5045c16541g151G1580C4735q936a46988B00196A0294
18783d5976j05433B7702O9261c1586G5085d0260k63720B61285C8577a47772A13948
18771a29385C0146b58127k4693C1718f2049q6576H4256M8584n8640a36530k70015
18760d06545a40074b996m62194A9a3q7119B8155c52116L056g6892j05795C7822
$$ y = [-294354, 309574, 105978, 109538, 56394, -186755, -54769, 26829, -209868, 64175, -264300, -4258, 84473, -73526, -6225, -64812, -365281, -158059, -101420, -271190, -431027, -199090, -263574, -56251, 144100, -283381, 19520, -146422, -246597, 124496, -9057, 432517, 382907, -97022, -11703, 208341, 16006, -30043, -30887, -167458, 115383, -18609, 143078, 118402, 11652, -278454, 183851, -28778, 1109, -31389, 118064, 163109, -316541, -7151, 71580, 34735, 25799, -146988, 200196, 10294, -45976, -151409, 27702, 96963, -31586, 75085, -40260, -303980, 261285, 38577, -147772, 113948, -129385, 30146, -258127, -282820, 31718, -62049, -148625, 84256, 132840, 74200, -136530, -406545, -140074, -2996, -465190, 19, -13, -87132, 28155, -352116, -349060, -76892, -182687, 37822]
18747a25669M0798B4468c45888A10208g5925c416H6233a6643E468b7271k76489
18736c03760g5520j68804a03530f660I0062b10852R3001I2795e7463l4333k22323
18725c14119d1235D1437a04311j22540G955e7667j0118E2422C301a00320F4308
18713d6908A43979K074a09385p042a6684k2366j16131d4564k26353M1317d0060
18701a77474A21982h933A2905J83338G0255K1391N6538f9970A68936b89648B01766
18689b33946e9834G6018L5603P3435a18839n2181K8611I3646a41457k6575L6515
18678a31517J772B36285b74133a7400k30676k9903d1949o8814c9308n7723p4762
18667a71793D30573j60271j32480a39752q4996g2735A77862a55318l7507o4877
$$ y = [-125669, -84871, 24468, -345888, 110208, -75925, -3416, 86233, -16643, 5468, -27271, -303760, -75520, -244324, -103530, -6660, 90062, -210852, -117851, 92795, -57463, -91796, -314119, -41235, 41437, -104311, -226851, 7955, -57667, -67785, 52422, 3301, -100320, 64308, -46908, 143979, 146053, -109385, -116427, -16684, -39050, -155181, -44564, -270917, -229600, -40060, -177474, 121982, -8933, 12905, 196243, 70255, 91646, 148184, -69970, 168936, -289648, 201766, -233946, -59834, 76018, 111621, 185056, -118839, -171020, -142409, 93646, -141457, -168032, -131517, -129745, 236285, -274133, -17400, -248076, -277979, -41949, -110763, -39308, -97031, -171793, 430573, 270302, 137822, -139752, -224748, -72735, 177862, -155318, -192825, -257702]
18657b57702I536b33559A43745B046J52885C5553d92338a13823B38731o2976l2730
18646A43025b08379g7390l2324M3480B11904f7625j74303E8748c81748j10035
18636d91783a14220n6874A8524b53793A64042a65063H22d36745J98622a00270
18625a0005j20663j57244N5239C45117j68438b44577g2517K2277A0395b00638
18614C2227O6357A119J69328g0245k07952a35991A12504B8917a26426C01315d15327
18602G7792a14145n7073k596k1535P0140B10064f8833A21382a7078k29173g7448
18590A08345O6088o9103c23908a4585k57091A55225P7486a67816i574D6723h4563
18578a72484A1852a70652j00522J17677g1546D3392J5095b06377p1112I7555L47671
$$ y = [-257702, 9536, -233559, 143745, 2046, 154931, 35553, -492338, -113823, 238731, 175755, 143025, -208379, -77390, -109714, -66234, 211904, -67625, -241928, 58748, -381748, -491783, -114220, -171094, 18524, -253793, 164042, -165063, 822, -436745, -238123, -100270, -10005, -130668, -287912, -232673, 345117, 176679, -244577, -72517, -50240, 10395, -200638, 32227, 98584, 1119, 170447, -70245, -278197, -135991, 112504, 28917, -126426, 301315, -415327, 77792, -114145, -171218, -173814, -195349, -125209, 210064, -68833, 121382, -17078, -246251, -77448, 108345, 174433, 105330, -323908, -14585, -271676, 155225, 232711, -167816, -9574, 46723, -84563, -172484, 11852, -170652, -271174, -153497, -71546, 43392, 58487, -206377, -277489, 97555, 445226]
18567D45226j41133i8847B24607a44469A60472P521m0554m2410b66531A62178
18556D38986j50467d6059B42354b10167g7668k58001g98A47783c13811a00768
18545h2088l06403R5088D95J2839a38216J1849j22024j60136J68387A67913G0093
18533a90995J5246L4657E7132a75491a9978m8133A88197q8887a09149F0972f1765
18521A36442a32893A9983a74911a7488k82318k23820a60727A21325c95324B44447
18510a13123A52556b1933q9726J3041f208j90284R7178P481E1115g2647q1583
18499a54230D164b52277h6986k3411M704r1176Q5960k64041a37815k39557c3657
18487b67770J33862J9624F4359a28416k7565A8557h5032C45323g7616q2569n8794
$$ y = [445226, 304093, -98847, 224607, -144469, 160472, 167993, 127439, 85029, -266531, 162178, 438986, 288519, -46059, 242354, -210167, -77668, -335669, -798, 147783, -313811, -100768, -82088, -388491, -293403, 495, 13334, -138216, -126367, -248391, -408527, -240140, 167913, 70093, -190995, -175749, -141092, 57132, -175491, -19978, -68111, 188197, 99310, -109149, 60972, -61765, 136442, -132893, 19983, -174911, -17488, -299806, -523626, -160727, 121325, -395324, 244447, -113123, 152556, -21933, -111659, -98618, -6208, -196492, -99314, -91833, 51115, -72647, -154230, 4164, -252277, -86986, -110397, -105693, -196869, -110909, -374950, -137815, -377372, -33657, -267770, -133908, -114284, 64359, -128416, -155981, 18557, -85032, 345323, -77616, -160185, -218979]
18476b18979B37114b3586n4493A73710i0586l2815k05788h9693k79804a21715
18465c04700g3698B33015q84I898b53952Q6160A44221C3148i5931A53860o2379
18454I1481E031a56206j46459J45376B54429J2513a26194A67107b18686H5174
18443a5547A09447k4392C500J38353B2034H54a7379F2830a40978K2279D7408b99740
18430a99019g8875C69675b63734J28312j9391f0711k0214p2586O7036b1418A31238
18418C65883e9099d112j44621A79411k0815a48976A7368a44024b0968G1282e8239
18406C81438c4646A80432c3928k01193G3974J57216q3344M1896a79960J8898A2388
18394b79810a34721l28R711C1629J52767a86557r5685J08687H6587N8520l0055
$$ y = [-218979, 237114, -23586, -78079, 173710, -90586, -123401, -329189, -89693, -369497, -121715, -304700, -73698, 233015, 232131, 9898, -253952, -167792, 144221, 33148, -95931, 153860, 91481, 5031, -156206, -302665, -157289, 254429, 266942, -126194, 167107, -218686, 85174, -15547, 109447, 85055, 3500, 141853, 22034, 854, -17379, 62830, -140978, -118699, 47408, -299740, -199019, -78875, 369675, -263734, -135422, -154813, -60711, -80925, -153511, -86475, -21418, 131238, 365883, -59099, -4112, -148733, 179411, 158596, -148976, 17368, -144024, -20968, 71282, -58239, 381438, -34646, 180432, -33928, -235121, 73974, 231190, 147846, 189742, -179960, -161062, 12388, -279810, -134721, -135049, -125338, 31629, 184396, -186557, -282242, -173555, 86587, 145107, 115052]
18383A15052c1856A79087o1980h6672j296b5403H1056J56117J41161p305A15344
18371b20126a802B44764b7645k9408j082A63006L2373a42124o6748A85985M402
18360A90387L8804b11420I604a84563B882h4579L788j91285a4084A08868a44085
18348A96418L9598c02108B60137a95074A31820a00171b8785B35878B8660c25078
18337b609A36902c02652A09820b48699P0556C32214b68184g4082o8627d6587B06474
18325E0178c32188A90142c08373R0891J8753B0410K20043A1545J91443a59522
18314A4222P603J05696a42666M7296j26913H8701k9789a04422C04187A20138c51688
18302g8349K3867r4596L1538d6295j06606m2239D6180b88401a08872k46774E9600
$$ y = [115052, -31856, 179087, 117107, -86672, -87968, -25403, 81056, 237173, 378334, 371029, 115344, -220126, -1802, 244764, -27645, -57053, -58135, 163006, 195379, -142124, -208872, 185985, 190387, 229191, -211420, 9604, -184563, 2882, -84579, -80791, -272076, -14084, 108868, -144085, 196418, 236016, -302108, 260137, -195074, 131820, -100171, -28785, 235878, 28660, -325078, -2609, 136902, -302652, 109820, -248699, -178143, 332214, -268184, -74082, -142709, -46587, 206474, 50178, -332188, 190142, -308373, -217482, -198729, 20410, 240453, 11545, 202988, -159522, 14222, 21825, 127521, -142666, -95370, -222283, 88701, 58912, -104422, 304187, 120138, -351688, -78349, -54482, -149078, -117540, -46295, -152901, -195140, 46180, -288401, -108872, -355646, 59600]
18290c10150A5477b18608K4105f1482C028a42447A47849e0233q0015C88498b0796
18278B41417J06071c00314J17525m8420A92971a74672A7532a90736f3990Q06C4062
18266a14513M382l2923b7651j82291p1221F8836B3195J00473G881a06538q0596
18255a87134R2361c2252A8577L4850a62210I9213D2469b04592c9283G7826a02508
18243C27148j44997c0616n3046j17770j65235f4412j32699P1195C23410b38735
18232A07833b9198A24563a01798G5448c55265a74752e9500j777l4645B9259a46192
18220A84301D4201h2507G2825a36159F8100b48191a03205a7042G809b05241A03213
18208f9390A06674o75k1096J01817q7869g6718m7494B2151b32359j39387B60791
$$ y = [-310150, 15477, -218608, -194503, -61482, 3028, -142447, 147849, -50233, -130248, 388498, -20796, 241417, 347488, -300314, -182789, -231209, 192971, -174672, 17532, -190736, -63990, -63184, 34062, -114513, -110131, -143054, -27651, -209942, -281163, 68836, 23195, 123668, 7881, -106538, -187134, -94773, -32252, 18577, 53427, -162210, 99213, 42469, -204592, -39283, 77826, -102508, 327148, 182151, -30616, -83662, -201432, -366667, -64412, -197111, -125916, 323410, -238735, 107833, -29198, 124563, -101798, 75448, -355265, -174752, -59500, -61277, -95922, 29259, -146192, 184301, 44201, -82507, 72825, -136159, 68100, -248191, -103205, -17042, 7809, -205241, 103213, -69390, 106674, 105999, 84903, 186720, 98851, -76718, -124212, 22151, -232359, -371746, 260791]
18196a62299E5990a14093o2002G2105J19177f1335D6587a49577A23722a26905
18185a18948A94034H2731b75311H0766m647c5716j54501e0758B4507m49e308l87118
18173c92426b6699A93882h4395A100a22084j9383m0693D5800J74026a47364f2205
18161a61229m834B35304A8014a40985M7179B08060q8163a25333k9030r8218G1598
18149a06298A26120f3693A62006j293b19615a9704n4947H9414b0826k06362b6608
18137i7400A11357b71335h8979E5704c5099l5000B8418K65398b2280p2777c4058
18125d65052A19920n1685d1201B93849j46627e3378G7405c5155A07335e7648K0262
18114c7386B7936c0207r2718o8771a9797j81090J8430j12152d0989q6262e6113
$$ y = [-162299, 55990, -114093, -176095, 72105, 191282, -61335, 46587, -149577, 123722, -126905, -118948, 194034, 82731, -275311, 80766, 76119, -35716, -190217, -50758, 24507, 24058, -5308, -392426, -26699, 193882, -84395, 1100, -122084, -141467, -182160, 45800, 219826, -147364, -62205, -161229, -166063, 235304, 18014, -140985, -93806, 208060, 119897, -125333, -154363, -252581, 71598, -106298, 126120, -63693, 162006, 160713, -219615, -19704, -74651, 89414, -20826, -227188, -26608, -97400, 111357, -271335, -88979, 55704, -35099, -70099, 28418, 293816, -22280, -95057, -34058, -465052, 119920, 68235, -41201, 293849, 147222, -53378, 77405, -35155, 107335, -57648, -37386, 27936, -30207, -122925, -191696, -19797, -200887, -182457, -294609, -40989, -127251, -56113]
18102b41283n8378A78411L6566a81091A96917b22436E01785b6153k4220A60054
18091a82406k1398O5186I2552b25164e5779G8006f3397q1810B88004A19552a63658
18079A94890b58600a23056B45979E1272J36702H5499Q9448c3552k01142B3227
18068G157a10427o3426J5420j94002F7344k5641E815J51272C7608a19236A86198
18056a3882r7435A04484a38718e9571A20821l9807d8504k8062A70384n8274h1393
18044c0836k5353m89122b04665A21665J01269I065O7910a26274j80788A45382
18033C58772g9227m7528B8567J8547a5813j49915A08743g7780o344J4316B37964
18021D7751d358A47a4762p9326k885B29594B877K33476O365n8700c55142h8990
$$ y = [-241283, -299661, 178411, 214977, -181091, 196917, -222436, 501785, -26153, -50373, 160054, -182406, -203804, -138618, 92552, -225164, -55779, 78006, -63397, -145207, 288004, 119552, -163658, 194890, -258600, -123056, 245979, 51272, 187974, 85499, 174947, -33552, -234694, 23227, 7157, -110427, -173853, -158433, -352435, 67344, 41703, 5815, 157087, 37608, -119236, 186198, -13882, -111317, 104484, -138718, -59571, 120821, 81014, -48504, -76566, 170384, 112110, -81393, -30836, -56189, -545311, -204665, 121665, 222934, 9065, 76975, -126274, -307062, 145382, 358772, -79227, -126755, 28567, 47114, -15813, -165728, 108743, -77780, -84124, -69808, 237964, 47751, -4358, 147, -14762, -94088, -96973, 229594, 2877, 236353, 242718, 184018, -355142, -88990]
18008g3505p510C29505m081C5087a79159q5564a08430E7242b07844k4537l090
17997b35471N3164j54438D64353f413D7351a87848N3219A81600m5071g428l00810
17986c08238I9801L19853j45734d8202j62217j85518g0611m0445B13093A03032
17975B44377j04118b00059b1494B65590L7123H8306a59706O1784A64222b09796
17964A08193b39049B1454K38999f5536c0412l14013a12216m0969J3028A9473a62728
17952D0549J56183a66235C24431C6755b8170C129M8934g9945a364p5983n7586
17941a34933a1052l5570r68E3845J73877b85601R0901B50485a43060C4307j5599
17930A8708P5425f146l6560A16748b36263F9101e9171H7122j349o478J42920p2929
$$ y = [-73505, -81015, 329505, 325424, 35087, -179159, -264723, -108430, 57242, -207844, -232381, -235471, -182307, -336745, 464353, -6413, 47351, -187848, -134629, 181600, 136529, -7428, -308238, 99801, 419654, 273920, -48202, -210419, -395937, -70611, -111056, 213093, 103032, 244377, 140259, -200059, -21494, 265590, 302713, 88306, -159706, -97922, 164222, -209796, 108193, -239049, 21454, 260453, -65536, -30412, -344425, -112216, -153185, -140157, 19473, -162728, 40549, 196732, -166235, 324431, 36755, -28170, 3129, 52063, -79945, -1364, -77347, -134933, -11052, -46622, -47590, 53845, 227722, -285601, -194700, 250485, -143060, 34307, 18708, 94133, -6146, -42706, 116748, -236263, 69101, -59171, 87122, 85773, 79295, 222215, 149286]
17918A49286a35393J4449j1366p2233e3622E800J69127b84860J19944C32323a36688
17906a72941O2878q1059g3077F5108a98852F1803J8711C9199c25043K0388B82507
17894I0379B8276h6490K4914k24435E2041A5961M9709a04686M1154E6556a00142
17882E8849a07571H0269f1019j24296A57875a26212A84150D9002g4555E6379a68843
17870b36315A86487o987c18627G901b12076H9212B7465a29898C2294K84024g0682
17858A01285a89148O175F2103j8736c7960A61521i0149m5012E8167h7076a0818
17846A79812M6089A06401d1285j63608f296A51583K905c8291A48024e8253B5703
17834A38890E103c9858D8969d6926j18340D3675d5584C15411K1609E611P8561
$$ y = [149286, -135393, -120944, -132310, -204543, -53622, 5800, 174927, -284860, -164916, 332323, -136688, -172941, -110063, -191122, -73077, 65108, -198852, 61803, 80514, 39199, -325043, -304655, 282507, 90379, 28276, -86490, -61576, -286011, 52041, 15961, 65670, -104686, -63532, 56556, -100142, 58849, -107571, 80269, -61019, -185315, 157875, -126212, 184150, 49002, -74555, 56379, -168843, -236315, 186487, 179500, -318627, 7901, -212076, 89212, 27465, -129898, 32294, 316318, -70682, 101285, -189148, -182973, 62103, 43367, -37960, 161521, -90149, -135161, 58167, -87076, -10818, 179812, 225901, 106401, -41285, -204893, -6296, 151583, 154488, -38291, 148024, -58253, 25703, 138890, 5103, -39858, 48969, -46926, -165266, 43675, -45584, 315411, 337020, 5611, 84172]
17823H4172a56667j64149G6811L9607L03948C1353b13760g5389b1930F0079J20700
17812A80779b05615h7017A14717c02075F1659K5193J15248j3705q6985a90937
17801a19550C0757e9995N618d258A13910a31683A63723B9936q030a96801K0260
17790a76541N4203C48871f6380k46235g2980m3169A24568h9173j9527K0563k54500
17779c42637a05189A34925M6311D7901K05729I9783j4174R5726a08927j88264
17769b97191A35202C5185a4368G9980a37849B68482G2895g5013j76765c4686O653
17758b8033j27982g7068A27760K16518j14112e1060B48105A06417K8491a25388
17747A59572o1051m0617K31505o6553q086c46066A36527b1525A07575m5715K46949
$$ y = [84172, -156667, -320816, 76811, 116418, 420366, 31353, -213760, -75389, -21930, 60079, 180779, -205615, -87017, 114717, -302075, 61659, 86852, 202100, 188395, 101410, -190937, -119550, 30757, -59995, -54377, -4258, 113910, -131683, 163723, 29936, 21906, -196801, -176541, -122338, 348871, -66380, -312615, -72980, -116149, 124568, -89173, -108700, -88137, -342637, -105189, 134925, 181236, 47901, 253630, 99783, 85609, 181335, -108927, -297191, 135202, 35185, -14368, 79980, -137849, 268482, 72895, -75013, -251778, -34686, -28033, -156015, -77068, 127760, 344278, 230166, -51060, 248105, 106417, 134908, -125388, 159572, 98521, 57904, 289409, 222856, 214770, -346066, 136527, -21525, 107575, 61860, 308809]
17736C08809b23992M5319d0593A74527o7567J84189G5002J23269b83777a0139
17725B3546a24227D25802k04085M2480k5413p356a96925B44380e5282J6133j08459
17714a47608B16874k6320G4726i519A12501D4542K5467c26038J46089A35564b29189
17702B1994K7933i1304C00087m4247H6549B0085a78051I6053h9977b1882j04395
17691a26277B76018j34680R3874b25210A60427k8812K11642n2356g0425B2041
17680D4067J74929a13064j10928K6456L6497C89292h0768B08821B7313J67370
17670A94683F0923i4893A63190j567J10562a03543D60639A57001A9651J5346P9501
17659A14498a27216b0986C28483I7679c3263k50315b4627C24190A57561f8432
$$ y = [308809, -223992, -178673, -40593, 174527, 106960, 291149, 75002, 198271, -283777, -10139, 23546, -124227, 425802, 221717, 264197, 238784, 231428, -196925, 244380, -55282, -39149, -147608, 216874, 190554, 74726, -9519, 112501, 44542, 70009, -326038, -179949, 135564, -229189, 21994, 49927, -91304, 300087, 255840, 86549, 20085, -178051, 96053, -89977, -21882, -126277, 276018, 141338, 235212, -225210, 160427, 131615, 343257, 290901, -70425, 22041, 44067, 218996, -113064, -223992, -197536, -161039, 389292, -80768, 208821, 27313, 194683, 60923, -94893, 163190, 161623, 272185, -103543, 460639, 157001, 19651, 34997, 114498, -127216, -20986, 328483, 97679, -33263, -283578, -24627, 324190, 157561, -68432]
17648c4222A98974o8214K01375j15840r136o5923L2233E9477a55776A38949a3199
17636a11543B7997Q7260K9559J01649q5549L26633j82852a87813A5141b63188
17625b31289i4524l1812J2614F377O7714a52989F7995N6798K78668c3939B08542
17613a07810A27506K19120A57500a0294I6042b43281A27915b7545B0760J41872
17603A62632a51369l79026b6940A95680J3654G0523K59044P076e1164H0844P6209
17592A57053A3214i7255L9654E2310K01093e2933B56056e0684B97119A37930b26787
17580h0737D7592A2915R55K34023q4175p9843c7182j06221D10834j45419O6807
17569C32222A04593P2821o525G1385f8136A88519l3191L44585a7182Q475B65689
$$ y = [-34222, 198974, 130760, 332135, 216295, 207159, 141236, 173469, 59477, -155776, 138949, -13199, -111543, 27997, 115257, 144816, 246465, 160916, 487549, 304697, -187813, 15141, -263188, -231289, -94524, -126336, -113722, 6377, 74091, -152989, 67995, 124793, 403461, -33939, 208542, -107810, 127506, 346626, 157500, -10294, 96042, -243281, 127915, -27545, 20760, 162632, -151369, -530395, -26940, 195680, 209334, 70523, 329567, 336643, -51164, 80844, 157053, 13214, -97255, -57601, 52310, 253403, -52933, 256056, -50684, 297119, 137930, -226787, -80737, 47592, 12915, 13870, 247893, 163718, 83875, -37182, -143403, 410834, 265415, 332222, 104593, 177414, 170889, 71385, -68136, 188519, 155328, 499913, -17182, -8707, 265689]
17557D80507b03039B92203i4689I4032J06102J02353B2297L81860A79462J7822
17547A97284c9675D0635M34479j25708d0634l3707C07875q2430I8084a48205E56772
17535F7383b1263A71642J78214G0545J32900K43768p9004j25973J97450l9482
17525D00204j96663N16491O418A74364P82574D34401q2359J04967R4177k9808
17515E21378B14702J43699J21558A82963n6087P42837l69462R3817J58248j73639
17505E78677l85B85703l2654i1850A37787O6849L75188a00406C82761i375A71739
17493D94878A19467N7630J6202I5441b4678D92800B17248g2242A61024F5618J75192
17482B40810q070J0212o1727J83874L7063n6104g9829C22306A46337B3766J85786
$$ y = [480507, -203039, 292203, -94689, 94032, 200134, 302487, 22297, 404157, 179462, 197284, -39675, 40635, 475114, 349406, -40634, -74341, 307875, 225445, 98084, -148205, 556772, 67383, -21263, 171642, 349856, 70545, 203445, 447213, 368209, 242236, 439686, 400204, 203541, 720032, 726450, 174364, 956938, 434401, 352042, 457009, 551186, 521378, 214702, 358401, 479959, 182963, 126876, 869713, 500251, 594068, 752316, 578677, 578292, 285703, 253049, -91850, 137787, 204636, 579824, -100406, 382761, -9375, 171739, 494878, 119467, 177097, 193299, 95441, -24678, 492800, 217248, -72242, 161024, 65618, 240810, 232740, 242952, 181225, 365099, 402162, 346058, -79829, 322306, 146337, 23766, 209552]
17471B09552K39678k1193A12194a23798B07830F8369J67124L1164o9052q0970
17461A16635K92354F5270a4519F9064K95318q9381J9318c50592B72539a9728B45740
17449B07414J80715j11746o6110N4145a9631B97244H0471M9653n0332k1381J89953
17438B48364M3783o5757n8446K65971j34641i7134C47609A61037M22745j92682
17428C91100K11214B46351k2795p854K5012J44253o307E0290J06236M8292P716
17417B12534C7946L89322A6128P24824H5850J08259o0833Q7674N6915l4679J30636
17406C73822P3463H5836L098J78466J19983H9791J673J4436J49362K44520j97199
17395C02583m4341J56224A79638J50426c7605C31424a21518B34339R8695n2271
$$ y = [209552, 449230, 428037, 112194, -123798, 207830, 68369, 235493, 266657, 197605, 116635, 408989, 65270, -14519, 69064, 364382, 275001, 294319, -350592, 272539, -19728, 245740, 207414, 388129, 276383, 210273, 264418, -19631, 297244, 80471, 130124, 79792, 58411, 248364, 292147, 226390, 167944, 433915, 299274, -97134, 347609, 161037, 583782, 391100, 602314, 246351, 223556, 215702, 240714, 384967, 378660, 50290, 156526, 204818, 212534, 37946, 427268, 16128, 740952, 85850, 194109, 133276, 220950, 277865, 243186, 373822, 447285, 85836, 88934, 267400, 387383, 89791, 91464, 105900, 255262, 499782, 302583, 258242, 414466, 179638, 330064, -37605, 331424, -121518, 234339, 333034, 280763]
17385B80763A22102J27032m6692M3140I0188Q1753K26405Q252A57953L7294d4111
17373B57290l8688E5936R9750o916n9309f4277A62175m9717j3274Q0529L44510
17362E24223A26238L75254P2416B67907c2803C19858D5498j0487M94477B07146
17351a02489q6255A27889K70043A16072L8196k4293L94214k18614L2883D5797
17340E10873A8412b0513I5559L4054D1324K49539A18630J04827Q4404l792e5993
17328A21964J78705j35509G7382a49047D84742J13713k18883A01742J97600Q5076
17318C84418A53302M6427l4062J12843B0329J48657l0924K34700A18521k1465
17308I7056J35076K96167B29007J2002C6706K98538A14508b8639C96877l5115
$$ y = [280763, 122102, 249134, 202442, 245582, 90188, 171941, 398346, 406598, 157953, 195247, -44111, 257290, 218602, 55936, 155686, 148770, 89461, -64277, 162175, 112458, 99184, 179713, 524223, 126238, 501492, 573908, 267907, -32803, 319858, 45498, 35011, 529488, 207146, -102489, -188744, 127889, 397932, 116072, 154268, 129975, 524189, 305575, 338458, 45797, 510873, 18412, -20513, 95559, 129613, 41324, 290863, 118630, 223457, 307861, 304069, -55993, 121964, 300669, 165160, 77382, -149047, 484742, 598455, 379572, 101742, 299342, 384418, 153302, 199729, 165667, 278510, 20329, 168986, 138062, 372762, 118521, 97056, 232132, 528299, 229007, 241009, 36706, 335244, 114508, -28639, 396877, 361762]
17298C61762j30652c4564B64590J94294G7365J52953K01739j47410B8287a11586
17287B71877j30198O3262J71389R7821a27692D01119q7440Q4836j90802Q6288
17277B94001r261A23860a35260e8820B75062A11150J19653R3385E2736J50958
17267B03694C8585A0013O53919B30672K03873i348D5831M10656j00951A42576
17256A12336M6191p4730L75540k00703j12417J94164A35198J71278J5609R4913
17246D16998A94148L46206n4544q8418r2882K5819O3732j44314J77173A38984
17235A88967q5865J50354N6739j09999a04742B60972P5959K72492A46935L61079
17225E08014B22354J44049J41746A97050J28712k4609n249m3797J06306C5587
$$ y = [361762, 231110, -34564, 264590, 458884, 77365, 230318, 432057, 284647, 28287, -111586, 271877, 141679, 204941, 376330, 474151, -127692, 401119, 313679, 398515, 207713, 294001, 284740, 123860, -135260, -58820, 275062, 111150, 230803, 324188, 52736, 203694, 38585, 10013, 663932, 230672, 434545, -9348, 45831, 456487, 355536, 142576, 112336, 158527, 83797, 459337, 258634, 146217, 340381, 135198, 306476, 322085, 416998, 194148, 540354, 485810, 397392, 304510, 330329, 394061, 249747, 426920, 138984, 188967, 103102, 253456, 310195, 200196, -104742, 260972, 336931, 609423, 146935, 508014, 222354, 366403, 508149, 197050, 325762, 301153, 295904, 252107, 358413, 35587]
17214F03141l2118A11290J70356K4952J83938D6984J3486N7521K47724j8589L1158
17203C78284j29492K97482A19845J78816O8001G6753L39687J0646J86770B02657
17192D94049B14602k1028N4541K521L09422A56588k5499L04400k08561M41247
17182F68175Q8349C02826K38766B41326n359J54641J24203B30161K1110L36858
17172E88129Q5601k38444p4353J95177K8695k13862A52057M49041j35975J35618
17162F00741j02636j36321J39510j32454j25351L27144m9542o9188j86031M62082
17152G27954q3931o7501Q1360j66456j32391k2482k116q6243K85487j50197K52453
17141F35937j50562Q3410j57837M79752B72294J25827E0921Q2006O90098l09142
$$ y = [603141, 571023, 111290, 281646, 306598, 490536, 46984, 60470, 117991, 365715, 347126, 378284, 248792, 546274, 119845, 298661, 366662, 76753, 416440, 427086, 613856, 202657, 494049, 214602, 193574, 248115, 250636, 560058, 156588, 131089, 435489, 226928, 668175, 756524, 302826, 541592, 241326, 235967, 390608, 514811, 230161, 251271, 588129, 673730, 435286, 360933, 556110, 584805, 370943, 152057, 601098, 465123, 600741, 498105, 361784, 501294, 368840, 243489, 570633, 521091, 451903, 265872, 727954, 644023, 576522, 657882, 491426, 359035, 336553, 334437, 248194, 533681, 383484, 635937, 485375, 568785, 410948, 890700, 272294, 398121, 50921, 132927, 823025, 513883]
17131E13883j41162p7451J22468k938J54209k45210P2448L7461j20804K90140
17121F03044B45603J75658J4310J41137p5627n9817j36917J5186K74079r9471
17111D94141L0005m1487J03154j75515j22888L72570J99036l16848j63281K17042
17101E95929n4095B10493L40556J03911k60384J15759J68833P4777k32863l2011
17091D89071Q9690L34870C48460K00282r2017J25455K49400K6643k74073J38593
17081G22743j9874k37785L39196n3856M2087J07075j79707M684K18931m0728J84888
17070A087654E30242K16680C16361N04117j54402J52266k25881k90061P03587
17061A005987o2095l44383M16256l08354q6176K10501J15874j20404j37456J04981
$$ y = [513883, 372721, 295270, 417738, 414800, 569009, 323799, 396247, 433708, 312904, 603044, 245603, 421261, 435571, 576708, 501081, 441264, 304347, 319533, 593612, 494141, 524146, 482659, 585813, 410298, 287410, 659980, 859016, 542168, 378887, 595929, 541834, 210493, 551049, 654960, 394576, 510335, 679168, 753945, 521082, 489071, 578761, 913631, 348460, 548742, 456725, 582180, 831580, 858223, 584150, 722743, 702869, 465084, 804280, 750424, 792511, 899586, 719879, 724563, 943494, 902766, 1087654, 530242, 746922, 316361, 820478, 666076, 818342, 592461, 302400, 1005987, 943892, 599509, 1015765, 707411, 621235, 831736, 947610, 827206, 689750, 794731]
17051G94731o5973K03689n4119l26124O4098L18151j76696k72587P6300M61315
17041A022785k99819K2620J23055j30289O4017N1739R9554k57196q1948M30948
17031A045466m18438M69511m95897K18934J74192r9811o7483K287J87007l84610
17021F31158J79019O0153L20433k47536p9187K86981k74723Q3892l2003L59569
17011A287756k37794j08732O7046j79248K92302k55294J79557j25994J50814k40875
17001H29538J65272n0535k5487j96699O47961n8671j37502k96880Q0439Q1907
16991A039343K40650o8532l7334j89701Q7886L15511j4508P9974k01951k6003
16981A225335j25835L31271Q4555J28554p10966M61547j34895M2285K23399k85577
$$ y = [794731, 728758, 932447, 878328, 552204, 616302, 934453, 757757, 485170, 561470, 1022785, 722966, 745586, 868641, 738352, 802369, 854108, 953662, 696466, 614518, 1045466, 627028, 1096539, 600642, 819576, 993768, 893957, 826474, 828761, 1015768, 631158, 810177, 870330, 1190763, 943227, 864040, 1151021, 876298, 960190, 928187, 1287756, 1049962, 941230, 1008276, 829028, 1121330, 866036, 1045593, 919599, 1070413, 829538, 994810, 944275, 918788, 722089, 1370050, 1311379, 1173877, 876997, 957436, 1039343, 1279993, 1211461, 1174127, 984426, 1072312, 1387823, 1373315, 1453289, 1251338, 1225335, 1099500, 1430771, 1515326, 1643880, 932914, 1394461, 1259566, 1301851, 1525250, 1239673]
16971A239673J37205J59148k50488R8269L16782l14144r3419J27707L2666O366
16961A459765O0422K29745j26188k99665J33111r94P3063m6144K11578l31768
16951A362925L10250n2945K97414n0784k29416r8623q9076K44783j19398M08748
16941A983878k09353j46191L92217k37785j0008j387K83529p1458k13754j23783
16931A645905M03088J38735o10874N16670k89048M27111j09929J16332K06045
16922B444035K15417o28179O58072n10569K79087l21089K49248l18123J48821
16913B216720K00665J32281l383j58675Q8156J66255l0421K74876l53214K1822
16903B555082M4312R8137J79563l17457K03532k7586N9743o3697K21889k45041
$$ y = [1239673, 1376878, 1536026, 1285538, 1383807, 1700589, 1386445, 1293026, 1420733, 1453399, 1459765, 1520187, 1749932, 1623744, 1324079, 1457190, 1456196, 1529259, 1483115, 1694693, 1362925, 1673175, 1620230, 1917644, 1866860, 1637444, 1538821, 1449745, 1694528, 1575130, 1983878, 1774525, 1628334, 2020551, 1782766, 1772758, 1771371, 2054900, 1983442, 1769688, 1645905, 2048993, 2187728, 1576854, 2093524, 1804476, 2231587, 2121658, 2237990, 2444035, 2659452, 2031273, 2689345, 2178776, 2457863, 2136774, 2386022, 2067899, 2216720, 2417385, 2549666, 2546283, 2387608, 2475764, 2642019, 2611598, 2886474, 2533260, 2555082, 2599394, 2697531, 2877094, 2559637, 2763169, 2735583, 2795326, 2731629, 2953518, 2708477]
16893B708477J77131L91591N5730o21147N86084j79604l4420K12089J10582j42608
16883C263905Q5921J69937K2538Q2424r0702K18361K09277r2696j32421K20873
16873C957417J75283K5219k01564K74755j81489K89832m4334Q1386k02014j19944
16863D054547M52269R074J14561J24477K30688l00938j4150L20388K0523K37275
16853E248714l89010L91616q5451K02066M0385K99798p1118q274L8545M07110
16843F074381Q9763j07591K30061P96J38445K35416k68179K58625L51670L75458
16833G378845j15302J48112R1869p8559M49081j88485J36365M24289L32082l05230
16823H273067K85503p6617L86043K66767k40844N28097J03918m1492P40001P3037
$$ y = [2708477, 2885608, 3277199, 3332929, 2711782, 3297866, 3118262, 3083842, 3295931, 3406513, 3263905, 3349826, 3519763, 3542301, 3624725, 3534023, 3752384, 3961661, 3868965, 3736544, 3957417, 4132700, 4157919, 3956355, 4231110, 4049621, 4339453, 4295119, 4376505, 4174491, 4054547, 4506816, 4515890, 4630451, 4754928, 4985616, 4684678, 4670528, 4990916, 5011439, 5248714, 4859704, 5251320, 5165869, 5367935, 5408320, 5708118, 5637000, 5628726, 5667271, 6074381, 6164144, 6056553, 6286614, 6287410, 6425855, 6661271, 6393092, 6651717, 7003387, 7378845, 7263543, 7411655, 7503524, 7424965, 7874046, 7685561, 7821926, 8246215, 8578297, 8273067, 8558570, 8481953, 8867996, 9134763, 8893919, 9422016, 9525934, 9484442, 10224443, 10297480]
16813A0297480n1677N83298P414J68942J17482M71257M52527J49149q6533O53778
16803A2763117K29169J1919N86072N0745N68423N6318P54394J28835K66694J98143
16793A5613829M46547O30051J64264R13519K02268M08816P40312M88004P60432
16784B0368042K75611O17710L55073P00868N52444N63616N06186R59180R47173
16775B5845903O13046M97961Q53422R50765J061987P26583J008923J052113J223987
16766C3834690P55476Q32897J359860J211470J302559J360838J046121J442712
16758D3146623J575066J587421J141123J575507J951319J665275J963049J357619
16750E5963002K022129J899480K039031K234037J627010J975963K335876K142573
$$ y = [10297480, 10245803, 10829101, 10836515, 11005457, 11122939, 11594196, 12046723, 12195872, 12109339, 12763117, 12992286, 13004205, 13590277, 13641022, 14209445, 14265763, 15020157, 15148992, 15415686, 15613829, 16060376, 16690427, 16854691, 17768210, 17970478, 18379294, 19119606, 19607610, 20368042, 20643653, 21261363, 21616436, 22317304, 22869748, 23433364, 23939550, 24898730, 25845903, 26458949, 26956910, 27810332, 28761097, 29823084, 30549667, 31558590, 32610703, 33834690, 34590166, 35423063, 36782923, 37994393, 39296952, 40657790, 41703911, 43146623, 44721689, 46309110, 47450233, 49025740, 50977059, 52642334, 54605383, 55963002, 57985131, 59884611, 61923642, 64157679, 65784689, 67760652, 70096528, 72239101]
16742G2239101K055468K326771K130164J906104K115655K219679K252865J672749
16734H8918556J838728J945541J521073J452018J348208R66984J108462P43382
16726I9842952P81500M67417K06409p5541K0551p32214m72144p17288j209998
16717I8111644j292236j095226j773327j745989j771338j644041k351984j585865
16709H4851638k179249j943507k132507k180978k048945k273093j788199k047734
16701F8257426k108126k289483j953501j809973j782140k025555j667225j579410
16693E3042013j447697k292499j223326j510914j662655j513331r39965j474338
16685D0977288j230657j291577j453621q32514r72190j339685q68438o03637j258597
$$ y = [72239101, 74294569, 76621340, 78751504, 80657608, 82773263, 84992942, 87245807, 88918556, 90757284, 92702825, 94223898, 95675916, 97024124, 97991108, 99099570, 99842952, 100624452, 101091869, 101298278, 101222737, 101243288, 100511074, 100038930, 99321642, 98111644, 96819408, 95724182, 93950855, 92204866, 90433528, 88789487, 86437503, 84851638, 82672389, 80728882, 78596375, 76415397, 74366452, 72093359, 70305160, 68257426, 66149300, 63859817, 61906316, 60096343, 58314203, 56288648, 54621423, 53042013, 51594316, 49301817, 48078491, 46567577, 44904922, 43391591, 42451626, 40977288, 39746631, 38455054, 37001433, 36168919, 35196729, 33857044, 32988606, 32384969, 31126372]
16676C1126372q22975j068740n67349r55655p19284p77172o41262r45129k80074
16667B4348732p59898r93238j54777r39521m22388o01865l94494n53000n55798
16658A8973753k80008o86248m13645m95144k99688j6641n17897l16827l94504
16649A5553151m76227l06772l72454m98738K95010m37847p20652Q0866n06569
16640A2609768p5162k41908m41294j80683k49106J86360o73308K23219o48923
16631A0508963J10194l68102k0123j00451l49998j93654o32083J28403j38319
16622H944830k30859o1462M5180k93583L5311n61624J50829k03106l01439J80531
16612G704608j3645j74715k30275J56563m60994N7906k61592r4934n842J4632
$$ y = [31126372, 30303397, 29234657, 28667308, 27711653, 26992369, 26215197, 25573935, 24628806, 24348732, 23588834, 22595596, 22440819, 21501298, 21078910, 20477045, 20082551, 19529551, 18973753, 18693745, 18007497, 17593852, 17098708, 16799020, 16782379, 16264482, 15947655, 15553151, 15076924, 14770152, 14397698, 13898960, 14193970, 13756123, 13035471, 13116337, 12609768, 12534606, 12292698, 11851404, 11670721, 11421615, 11607975, 10934667, 11157886, 10508963, 10619157, 10251055, 10230932, 10130481, 9780483, 9586829, 8954746, 9083149, 8944830, 8713971, 8652509, 8697689, 8404106, 8439417, 7877793, 8028622, 7825516, 7524077, 7704608, 7690963, 7516248, 7285973, 7442536, 6981542, 7039448, 6777856, 6682922, 6677080, 6691712]
16602F691712l02981j59291o0771K7178p3838Q4144l27371K07586k91429j43624
16592E651315N1134n06382M55878L6622k03080k93981K48380m83227K35301J5792
16582E207752j46762j09002k61981J48785R7210l28638k70597L87283k53728K59053
16572D729375l51242j23186j07400q3372j88249M47722K9852k48037J94085m55160
16562C844388K04963j90766J61511M4761m19356j3418r4340M12369l86642Q175
16552C571645J55528j33074k13826o4182K13220K0607j23741j20914k36313L26770
16542C395720m30480L03977k53492J51407k51816J00135N5212N6947K02699m09445
16532B920864L722k55980J69376J05491k63986K02826K0917j17565M1435j28707
$$ y = [6691712, 6388731, 6229440, 6168669, 6195847, 6122009, 6206153, 5878782, 6086368, 5794939, 5651315, 5702449, 5196067, 5651945, 5688567, 5485487, 5191506, 5439886, 4956659, 5191960, 5207752, 5060990, 4951988, 4690007, 4838792, 4936002, 4607364, 4336767, 4724050, 4470322, 4729375, 4378133, 4254947, 4147547, 4064175, 3875926, 4323648, 4353500, 4105463, 4299548, 3844388, 4049351, 3858585, 4020096, 4064857, 3645501, 3632083, 3537743, 3950112, 3563470, 3571645, 3727173, 3594099, 3380273, 3316091, 3529311, 3549918, 3426177, 3305263, 3068950, 3395720, 2965240, 3269217, 3015725, 3167132, 2915316, 3015451, 3070663, 3127610, 3330309, 2920864, 2924586, 2668606, 2837982, 2943473, 2679487, 2882313, 2903230, 2785665, 2827100, 2698393]
16522B698393P7152k24891k60078K50455q2078k3758J33717J98983p10716K41496
16512B298675N47333k08361p1474n0262k35270J01518j29732O6239J72878J06504
16502B598048k90976k02749r1167K97688K55266l17424j73072J34302J93865k54159
16492B149622Q5836k19945L03346j54123j25844J05465m7708N7088n6975K2566
16482B119328m10976L26220n6791j7019J47108m7797j80373j01096L7865J61789
16472A978258k03855O5635L97718k55787l41633J77126r0779R7171M8125J56537
16462B028516k24164o908M2140M9296j15260L0474k01112j22906O2107Q4065J16492
16451A742740j48694k0265k76600M15129j0458j24110k5433l5256J66081J3676
$$ y = [2698393, 2775545, 2550654, 2290576, 2541031, 2458953, 2435195, 2568912, 2767895, 2057179, 2298675, 2846008, 2637647, 2566173, 2515911, 2280641, 2382159, 2252427, 2318666, 2491544, 2598048, 2307072, 2104323, 2013156, 2310844, 2566110, 2248686, 2075614, 2209916, 2403781, 2149622, 2235458, 2015513, 2318859, 2164736, 2038892, 2144357, 2096649, 2153737, 2096762, 2119328, 1708352, 2034572, 1977781, 1960762, 2107870, 2060073, 1879700, 1778604, 1816469, 1978258, 1774403, 1840038, 2237756, 1981969, 1640336, 1817462, 1726683, 1823854, 1871979, 2028516, 1804352, 1797444, 1839584, 1888880, 1773620, 1804094, 1602982, 1480076, 1542183, 1626248, 1742740, 1594046, 1573781, 1297181, 1712310, 1701852, 1577742, 1552309, 1517053, 1683134, 1696810]
16441A696810j24042K87873j09393m30866M72269k74285j71247L52137j65105
16432A534151P5945k45594N7242J00265J306J93470p7020m29775M59901L1458
16422A701349l39434m3034R8109n6758p5162j09343K94829K2350j36473m3288
16412A313145j71961J15866K14606k0670l62546N84529m40992J92376k24543L78290
16402A578100p2728m42825K32840K3129K5394j30448m2798j99132M2915j93477
16392H20970L16553J36829m06947K25409K76430k09920j55479M23257q7737k8101
16382A311264l05971K52848P9571r9893l1638j41753M8046L6141k86059J98701
16372A061257N6196J10246r2152J4338k17444K50483n1868j85173N5108l4868
$$ y = [1696810, 1572768, 1860641, 1751248, 1320382, 1792651, 1518366, 1347119, 1699256, 1534151, 1610096, 1364502, 1421744, 1522009, 1523315, 1716785, 1639765, 1209990, 1669891, 1701349, 1361915, 1318881, 1416990, 1360232, 1285070, 1175727, 1470556, 1492906, 1356433, 1313145, 1141184, 1257050, 1471656, 1450986, 1088440, 1672969, 1231977, 1424353, 1199810, 1578100, 1505372, 1062547, 1295387, 1318516, 1343910, 1213462, 1170664, 971532, 1014447, 820970, 1137523, 1274352, 867405, 1092814, 1369244, 1159324, 1003845, 1427102, 1339365, 1311264, 1005293, 1258141, 1337712, 1237819, 1206181, 1064428, 1112474, 1148615, 862556, 1061257, 1117453, 1227699, 1135547, 1149885, 932441, 1182924, 1131056, 945883, 1000991, 966123]
16362I66123K57788k45853L31391j83924k4217r4903J47344m46603L04691M07533
16352A419370m46917Q3518m3457K39551n25886K30018K13186k20798n3490m2263
16342H52832O8339R4312p8362o3758L05096K104m25171J00163K8020j31240j7145
16331G35190M49131M9688k85066n3429K97119j0214m7600k87613j66619L76689
16321A057276r4671k72872K98168j3975k59304M11807l82797J63650j90149j5605
16311G01528K01449R229K5m4815K26907m81444L53777k9988k58359m0929K84709
16300I22089m9762o9590J36L1597j12068Q1312j49622o0415L72417j59003j20802
16289F86289p0327R1281L37521k24245l72133L76312Q7876D20383L46258j62675
$$ y = [966123, 1223911, 978058, 1309449, 1125525, 1101308, 1006405, 1153749, 707146, 1011837, 1419370, 972453, 1055971, 1012514, 1252065, 726179, 956197, 1169383, 948585, 895095, 852832, 921171, 1015483, 937121, 873363, 1178459, 1180563, 755392, 855555, 883575, 752335, 735190, 1184321, 1234009, 948943, 895514, 1192633, 1182419, 1134819, 847206, 680587, 1057276, 962605, 689733, 987901, 973926, 714622, 1126429, 743632, 907282, 717133, 701528, 902977, 912206, 912231, 867416, 1094323, 612879, 966656, 936668, 678309, 637380, 922089, 872327, 802737, 802873, 834470, 722402, 803714, 654092, 593677, 966094, 807091, 686289, 615962, 707243, 1044764, 820519, 448386, 824698, 912574, 420383, 766641, 603966]
16279F03966j41936j10205M49405k57586K08099k9240J77585m25556L83654l98472
16269D59714K88114P784J47528k72970P8912j96005J6543L30495l74893J46180
16259F31402K2614j20447J22722k07055r6279L60358j10781P6867k78282J71937
16249E73056j03694n6860L08050p826K532k93824q3502O74297l98339J5977q6277
16238E43590J12928j79445K51798C46347K9580l8091L32775p787Q9941j34269
16228F18496J37065k67169O2759M0189J15388k61572j78385N27342j50042J60186
16218H04257j45391l09704M03970j25161p1143k14206J30105P3101p5406J6631
16208D87053J71183k50709M2942K43791A84077L12205P3413j31826A54012K24972
$$ y = [603966, 462030, 351825, 801230, 543644, 751743, 722503, 900088, 474532, 858186, 459714, 747828, 755612, 903140, 630170, 709082, 513077, 529620, 860115, 485222, 631402, 654016, 533569, 656291, 449236, 352957, 713315, 602534, 679401, 401119, 573056, 469362, 412502, 720552, 712726, 715258, 421434, 337932, 1012229, 613890, 629867, 543590, 656518, 477073, 728871, 346347, 375927, 337836, 670611, 662824, 752765, 618496, 755561, 488392, 551151, 591340, 706728, 445156, 266771, 794113, 644071, 804257, 658866, 349162, 753132, 627971, 556828, 342622, 472727, 545828, 470422, 487053, 658236, 407527, 450469, 694260, 184077, 496282, 569695, 437869, 154012, 378984]
16198C78984j4523m1955M12411C04510M34030B62046A29985L92896j75111J13675
16188D61445j86280K58J00631n5896l1375L71863j13798J09161B86853J41589
16178D28442N7874A98927K63475o6618J0003K11164k09146j73362r7110a28578
16167B38264L13167J93189l48877j04584J70922o9147A90685J00265J26988j95436
16157B22502r7185M40441A97043L2916M12355A65399J98425G2631K49634p998
16147C14267Q9307J35146k24868R0934a6213C05103q7029B4454R9436b419D96345
16135C23140f7253B63452J48972m5982A50834K4831L86544n4912j04351j01554
16125C01392J87769e653C07889K8473R835C8094K52567K33793A11295J31767J77761
$$ y = [378984, 364461, 322506, 734917, 304510, 738540, 262046, 129985, 522881, 347770, 461445, 275165, 275423, 376054, 320158, 288783, 660646, 546848, 656009, 286853, 428442, 486316, 198927, 462402, 395784, 405787, 616951, 407805, 234443, 137333, -128578, 238264, 551431, 744620, 395743, 291159, 462081, 392934, 190685, 290950, 417938, 222502, 125317, 565758, 197043, 229959, 642314, 165399, 363824, 72631, 322265, 314267, 403574, 538720, 313852, 404786, -16213, 305103, 218074, 24454, 123890, -2419, 496345, 323140, -67253, 263452, 412424, 366442, 150834, 175665, 562209, 507297, 402946, 301392, 489161, -5653, 307889, 336362, 346197, 38094, 290661, 524454, 111295, 243062, 420823]
16114D20823j87135J52646J7638j65477M2776p4847N6376j13163L09940k05178
16104B54399J77942G3078J18386j1715q1116o422a05612B68741G0324L22845k6604
16093C66565j38531J10276c93172C45181j57620q6890M31230k48464H6697J32238
16083B18935K67989j75157H6002f8146E0333N7882N1798A2040K10752Q1584a6914
16071G20518a87620A88184C6027M7714L25151A33622J37833A33452J06017I6801
16060A84377k1127l670K76665N8622k30980o7488a47755B46985A6105J18739J55367
16049B90211j11799J9690c928D38289l4486j90188J42442a00485A06334m7398
16039E8936J44474K2925G3559K98309I1970J92038j2020j02987A56L74622A32845
$$ y = [420823, 233688, 386334, 403972, 238495, 281271, 206424, 262800, 149637, 459577, 254399, 432341, 73078, 191464, 179749, 98633, 92211, -105612, 268741, 70324, 393169, 366565, 228034, 338310, -393172, 345181, 187561, 100671, 531901, 283437, 86697, 218935, 486924, 311767, 86002, -68146, 50333, 108215, 160013, 12040, 222792, 304376, -16914, 720518, -187620, 188184, 36027, 83741, 408892, 133622, 271455, 133452, 239469, 96801, 184377, 163250, 159580, 436245, 494867, 263887, 196399, -147755, 246985, 16105, 134844, 290211, 178412, 198102, -3928, 438289, 403803, 213615, 356057, -100485, 106334, 58936, 203410, 226335, 73559, 371868, 91970, 284008, 271988, 169001, 156, 374778, 132845]
16027A06471K27051j52034f9625C42868e2140A90850G6699f940A76202h1840F6052
16015b38414B8091G959J61038h5828c6912B00121p9756c2117C72319A31877J85209
16004C17086R2251j00610r1518e2017i176k31453H1338a53603D30972j75110R2249
15993C48111m8498h4359C6027L71673J60170j10086P09236J38259k67057q4306
15983I53916k33791N401a93186C21092N4878k3963A55291n380C4427J1371J19939
15972A65737l0902m4367K29889b74946B69046J4874j17052K26086A03706k3170
15962H0536Q6490L7713m5262J89236c53540a10976E3218j6844L336g1111A65992
15950F7052a72692A18495a24348m6064B13629r4907c82971a19873e141B12380
$$ y = [106471, 333522, 181488, -69625, 342868, -52140, 190850, 76699, -6940, 176202, -81840, 66052, -238414, 28091, 7959, 168997, -85828, -36912, 200121, 120365, -32117, 372319, 131877, 317086, 409337, 308727, 217209, -52017, -9176, -240629, 81338, -153603, 430972, 255862, 348111, 299613, -84359, 36027, 407700, 567870, 457784, 1167020, 1305279, 1038222, 953916, 720125, 725526, -193186, 321092, 375970, 352007, 155291, 149911, 34427, 45798, 165737, 134835, 90468, 320357, -274946, 269046, 283920, 166868, 392954, 103706, 80536, 167026, 204739, 159477, 348713, -353540, -110976, 53218, 36374, 39710, -71111, 165992, 67052, -172692, 118495, -124348, -170412, 213629, 118722, -382971, -119873, -5141, 212380]
15939C10841q4907h6425k4340B26380q8162K21530A26562p878K9669P6906B3503
15927D1657a09103m401C16255a33640H6015l4208Q7796c01950D01773I9499J19263
15916B18762N3698b28013c4790o5091j48548C71495E8417J7280C3498J91642E9983
15904A47484h1888A40529J74643a84710B60033A16518n3191b83964D1760h3821
15893a70868P6509B33675A14423E5337K623L7953b58129M6861I6486J30080g7164
15881a97641C88600b72799C9446g8841B31956a31801E9130I567J39434D348N4087
15870E8435c962m06235B42601B7144J1444J5887l095A7162a94242B04054a60359
15858B80989H8628K99858A24547c13223h5201H5550B2966b17847H6039K01406
$$ y = [310841, 225934, -86425, -110765, 226380, 138218, 359748, 126562, 118684, 148353, 225259, 23503, 41657, -109103, -113504, 316255, -133640, 86015, 51807, 139603, -301950, 401773, 99499, 218762, 272460, -228013, -34790, -99881, -248429, 371495, 58417, 75697, 33498, 225140, 59983, 147484, -81888, 140529, 315172, -184710, 260033, 116518, 63327, -283964, 41760, -83821, -170868, -94359, 233675, 114423, 55337, 57960, 95913, -258129, -211268, 96486, 226566, -77164, -197641, 388600, -272799, 39446, -78841, 231956, -131801, 59130, 9567, 149001, 4348, 58435, -3962, -410197, 242601, 27144, 38588, 54475, 51380, 17162, -194242, 204054, -160359, 280989, 88628, 388486, 124547, -313223, -85201, 85550, 22966, -217847, 86039, 287445]
15848B87445E0113a05551l4099o1525a2252A5136e5734A19698L7261g8811C39169
15836d96418c1019C2644c72335h9214n6309a2171p7790G1182L335k1135f8148
15824A74779n320d9780j13621j92818C5526a83523E4543J71769a1961D1328e9733
15812C77658b77606c7921C55972c20097a44929B8660b6772C26892c19027i0594
15801g9176A64713c2758B48653G6963d1563l326g245A5312b18642G839g5756k80664
15789c56420A65425g0823j75498B05132o5045a22860A2653a23788j76934A58646
15778f222l93649E1834k5025J22582O0623b99026a3374E6507i1084j90851n6811
15767c38746A80383C3022K16521k8376n9739o9498j466L1627a50364A69762a05743
$$ y = [287445, 50113, -105551, -139650, -201175, -12252, 15136, -55734, 119698, 156959, -78811, 339169, -496418, -31019, 32644, -372335, -89214, -145523, -12171, -89961, 71182, 74517, 53382, -68148, 174779, 169459, -49780, -163401, -356219, 35526, -183523, 54543, 226312, -11961, 41328, -59733, 377658, -277606, -37921, 355972, -320097, -144929, 28660, -26772, 326892, -319027, -90594, -79176, 164713, -32758, 248653, 76963, -41563, -44889, -7245, 15312, -218642, 7839, -75756, -356420, 165425, -70823, -246321, 205132, 140087, -122860, 12653, -123788, -300722, 158646, -6222, -399871, 51834, 26809, 149391, 210014, -299026, -13374, 56507, -91084, -281935, -338746, 180383, 33022, 249543, 221167, 161428, 91930, 90464, 122091, -150364, 169762, -105743]
15755B93489a8331B85780m3846A20757a12937p4652B2303J16797C4381J00295
15745A34676a79788f579B07071a78839A09677j4411M39a7255r4129E713a42999
15733a89988A00380a93193e7346q7983k84778A59028a73842j44476D58215c7111
15722c22896a34033A18228b46582f4248j14886a1089L647j6753k10411A29260
15711b67212i5415A74722P5414a8252j30023A65097P582B5832o180Q5903a887
15699c12136R1878G9413a64008A54038h5959A10328K2775b39082c8324m4754j17669
15688b00747j07676a7706C5002M5927B2293a95058N9273c8134A22193C0990a19540
15676B6433a98106e3567n0689A54076a88485j5027A62120f0537k9778A45257N0873
$$ y = [293489, -18331, 285780, 241934, 120757, -112937, -187589, 22303, 139100, 34381, 134676, -179788, -6579, 207071, -178839, 109677, 95266, 95705, -17255, -111384, 5713, -142999, -189988, 100380, -193193, -57346, -145329, -430107, 159028, -173842, -318318, 458215, -37111, -322896, -134033, 118228, -246582, -64248, -179134, -11089, -7442, -24195, -234606, 129260, -267212, -95415, 174722, 250136, -18252, -148275, 165097, 172679, 25832, 19652, 105555, -1887, -312136, -220258, 79413, -164008, 154038, -85959, 110328, 133103, -239082, -38324, -83078, -200747, -308423, -17706, 35002, 80929, 22293, -195058, -135785, -38134, 122193, 30990, -119540, 26433, -198106, -53567, -104256, 154076, -188485, -203512, 162120, -60537, -90315, 145257, 196130]
15665A96130c8396B28316f4371m2363d4955A04137K47927a78233B7657b7692A5141
15653b63653a1153A40862c73575a03212A97675C1879a71514b3466p2538j18341
15643b14345m4780I3497J9258F022b1284C72841F8527l0897O4880k1650i891l3001
15631d2892H6624k6110P3600b58193H8243a95806R5088C8077E117g0800K0583
15620e0217n69869A61721e8381F29259b96799J02886b5544B6107b18979j4612
15610b33591q9696G7457a04986j16013k05511a73951p0605j80391a70970a1621
15599A4838a41181O3373B10371b09480j01361d6418F1455d80365b11696L0682
15589a81014B44544d57005a93827c6180k55924j06908H7662b096k09663j22627
$$ y = [196130, -38396, 228316, -64371, -106734, -44955, 104137, 352064, -178233, 27657, -27692, 15141, -263653, -11153, 140862, -373575, -103212, 197675, 31879, -171514, -23466, -96004, -214345, -259125, 93497, 112755, 6022, -21284, 372841, 68527, 37630, 102510, 80860, -9891, -42892, 86624, 60514, 134114, -258193, 88243, -195806, -100718, 38077, 5117, -70800, -50217, -620086, 161721, -58381, 629259, -296799, -193913, -25544, 26107, -218979, -233591, -323287, 77457, -104986, -220999, -426510, -173951, -244556, -424947, -170970, -11621, 14838, -141181, -77808, 210371, -209480, -310841, -46418, 61455, -480365, -211696, -181014, 244544, -457005, -193827, -36180, -292104, -399012, 87662, -2096, -211759, -334386]
15579c34386D3339I49b6407j90450H593P0276B6506J26379o8908c65556J60142
15568b05414N4159b5259A6950b79112P1542E6135a64815o6141a12179B54662k9824
15557B24838a82512D3419L617n046J35646o4612a37644f4796j03402C43387a53079
15545C00006a6770B18999c06543d5364D34433A13638b1756j60947C566K1105K8019
15534E2690b3812B36727b3674A7607i8854K9899p1236C12479G6816J43565B7501
15522a09466D0736O0619i5548b2248A65994M1932m36D2114J90955J09762m0455
15511C02376a84986B08350a1012p5790B86847F6817K110J59554f1839D7959c8878
15499e5976A61639c1542C20635j51602b61039d185C37062G2223K95511A32762
$$ y = [-334386, 43339, 949, -26407, -216857, 8593, 78869, 26506, 152885, 83977, -365556, -205414, -151255, -25259, 16950, -279112, -207570, 56135, -164815, -230956, -112179, 254662, 224838, -182512, 43419, 47036, 41990, 177636, 113024, -137644, -64796, -168198, 343387, -153079, 300006, -16770, 218999, -306543, -45364, 434433, 113638, -21756, -182703, 3566, 24671, 52690, -23812, 236727, -23674, 17607, -98854, -68955, -140191, 312479, 76816, 220381, 27501, -109466, 40736, 101355, -95548, -22248, 165994, 207926, 207490, 42114, 233069, 342831, 302376, -184986, 208350, -11012, -86802, 286847, 66817, 68927, 228481, -61839, 47959, -38878, -55976, 161639, -31542, 320635, 169033, -261039, -4185, 337062, 72223, 367734, 132762]
15488B47406b35523M3412D7465K8949h6406j81053J6861h4285G3892a45732B66131
15476A85347R5721J31928j54823P4288p0645M939i7908B13461b12714h9305d3183
15464a75694j9881H2332a31238E4907b03971c760A77285a49181C8932J78748b5076
15452B2579b11490A47438p1131a40538a0422E8028O131a8842C09431R3184J65156
15441E67771L30455o0247l27294k31215a1264A78680n4495L9479I085a07751A48790
15429A3491a30337e2554j36787K3880j98730A9301a55807N9037K7851C7445a7817
15417h0728A64099J31110A17302a46972B70916B7475a19339B9278a22272A93474
15406E9579k0842K08397d39649E8792i8253K5760j6638j52103A36396a30123L9180
$$ y = [247406, -235523, -192111, 47465, 76414, -86406, -267459, -250598, -84285, 73892, -145732, 266131, 185347, 281068, 412996, 258173, 332461, 261816, 266755, -97908, 213461, -212714, -89305, -43183, -175694, -195575, 82332, -131238, 54907, -203971, -3760, 177285, -149181, 38932, 217680, -25076, 22579, -211490, 147438, 76307, -140538, -10422, 58028, 64159, -18842, 309431, 402615, 567771, 898226, 837979, 510685, 279470, -11264, 178680, 124185, 163664, 9085, -107751, 148790, 13491, -130337, -52554, -189341, -165461, -364191, 19301, -155807, -96770, -68919, 37445, -17817, -80728, 164099, 295209, 117302, -146972, 270916, 27475, -119339, 29278, -122272, 193474, 59579, 38737, 247134, -439649, 58792, -98253, -72493, -89131, -241234, 136396, -130123, -90943]
15395i0943B88955C2945a65494j54812a32609e262j48700I0267L23971B1996q186
15384A3810K36292J11967A61973B761a4581j39375C0853a10325p7027D1885J51855
15373A93740m9580F2783J57316o210p6075J7141F6322a62117E2865f610B72254
15361c2789A09728O1090L61470k48400h3318D6039J38316q0324a93696K229b0999
15349D6185L57935D7242J0742b00088A01749K42823e5058C66867A76193L41631
15339E17824j99310j14288N3281G1164J18435a85558M475b6817o2669A79007E2334
15327D0050J31514f7673J3863A46449a02370j1757A14492O1459H3218e5627A77818
15315A12824J1419b6909k05058B18129a21262N3513G4943L5818m2884g260B37208
$$ y = [-90943, 288955, 32945, -165494, -320306, -132609, -5262, -153962, 90267, 414238, 21996, 13810, 250102, 362069, 161973, 2761, -14581, -153956, 30853, -110325, -187352, 41885, 193740, 144160, 62783, 220099, 213889, 137814, 154955, 66322, -162117, 52865, -6610, 272254, -32789, 109728, 170818, 532288, 283888, -83318, 46039, 184355, 104031, -193696, -191467, -20999, 46185, 404120, 47242, 57984, -200088, 101749, 344572, -55058, 366867, 176193, 517824, 318514, 204226, 257507, 71164, 189599, -185558, -181083, -26817, -89486, 179007, 52334, 40050, 171564, -67673, -53810, 146449, -102370, -114127, 114492, 175951, 83218, -55627, 177818, 112824, 124243, -26909, -231967, 218129, -121262, -67749, 74943, 110761, 67877, -7260, 237208]
15303b18047i6805b4198A72450a03336B34751d022p8927b7688j15634j9295A29948
15291c56681G9097B1112g5050A46324a16562L7879k15810f8179o9801C37003d05259
15279e8784Q581A30567c6798I8721M8733a19633j52427Q5813j32255a30850I761
15267b22662f3805a2324n5310A68481n6296Q2767c4283A91648b6224F2753g1963
15255d2816E8361J07649k2185c9247G7912M492J02989R2219L9426N62309M49810
15244A329157k63642N1965l6767C47663J51274A80827l151a19745L6442B15203
15233b59404D4138A6196a96712B4071a98892A60146K38906e1017A42156C2777
15222c1394A8660J8397J92018n699D5627J70761j06898J50695a6648j41453B01570
$$ y = [-218047, -96805, -24198, 172450, -103336, 234751, -4022, -82949, -27688, -143322, -162617, 129948, -356681, 79097, 21112, -75050, 146324, -116562, -78683, -294493, -68179, -137980, 337003, -405259, -58784, -50203, 130567, -36798, 98721, 147454, -119633, -272060, -186247, -318502, -130850, 9761, -222662, -63805, -12324, -67634, 168481, 112185, 194952, -34283, 191648, -26224, 62753, -71963, -42816, 58361, 166010, 143825, -39247, 77912, 82404, 185393, 277612, 317038, 879347, 1329157, 1065515, 1117480, 1080713, 347663, 498937, 180827, 177676, -119745, -83303, 215203, -259404, 44138, 16196, -196712, 24071, -198892, 160146, 399052, -51017, 142156, 32777, -31394, 18660, 37057, 229075, 223376, 45627, 216388, 109490, 260185, -16648, -158101, 201570]
15210H164J75758C8283P1057l0787J08788a38656d1812M116j45881B68384K986
15199B71370c42324B72784c3129A70328o4231J0567N5277a28207h249o4892n8737
15188a31878C62309d0052B29743e462A5996L9640N5536b29588E26188A81322a4065
15176A50714b42650B12397A5795K06061E7154Q4848P8305J1202B3463M28382i9472
15164A21422L4840a85261F1401i1438A25840c4k56832D8241a35030F85K41437
15153B42122M799b02452E3584J5501K22914O8712C9441e2520J638B34683b057
15141A74507B9646j0897J85227Q7539g5155q8324C0959J10590J04047a51607a4518
15129A15435a23573q332B31280D0465i4332B37735g7025E66647A45270J42030
$$ y = [8164, 183922, 38283, 109340, 78553, 187341, -138656, -41812, -37696, -183577, 268384, 271370, -342324, 272784, -33129, 170328, 106097, 116664, 171941, -128207, -8249, -73141, -131878, 362309, -40052, 229743, -5462, 15996, 55636, 111172, -229588, 526188, 181322, -14065, 150714, -242650, 212397, 15795, 221856, 57154, 142002, 220307, 231509, 23463, 451845, -99472, 121422, 156262, -185261, 61401, -91438, 125840, -34, -256866, 48241, -135030, 685, 242122, 246921, -202452, 53584, 69085, 291999, 360711, 39441, -52520, -50882, 234683, -2057, 174507, 29646, 18749, 203976, 291515, -75155, -163479, 30959, 141549, 245596, -151607, -14518, 115435, -123573, -131905, 231280, 40465, -94332, 237735, -77025, 566647, 145270, 287300]
15119B87300H3615I246J36392l1685g8184B11596K59b43464A8845K62368J1589
15108B92802l8344B5562K8557a29619I3916L11568c0019J230D1910J65326P0844
15097B78080D9623a50086b5085A51911C5230O5731J5470J56398a03941A16834
15086A13596K01710M2097M4809B0469L8034J30429J93226J02599C9740J03983
15076A43723o576o0773K53695j48429j4361p8997K99811j36130J18636C3094g8649
15064B2531J45975B0262b81927D1947K7557M95116E6987P2008M2183N1316J78120
15053D00614A35630d7219C24440A28551K12792A64213o7750K15415r5091a68868
15042a21396B8680K13272K2005p2555K25422A30450b33764B60016m9605e8272
$$ y = [287300, 83615, 9246, 145638, 113953, -78184, 211596, 211855, -243464, 18845, 281213, 292802, 254458, 25562, 54119, -129619, 93916, 405484, -30019, -28789, 41910, 207236, 278080, 49623, -150086, -25085, 151911, 35230, 100961, 116431, 272829, -103941, 116834, 113596, 315306, 357403, 402212, 20469, 58503, 188932, 382158, 484757, 39740, 143723, 137147, 76374, 330069, 181640, 167279, 88282, 388093, 251963, 370599, 33094, -78649, 22531, 168506, 20262, -281927, 41947, 69504, 564620, 56987, 128995, 171178, 222494, 400614, 135630, -47219, 324440, 128551, 341343, 164213, 96463, 311878, 216787, -168868, -121396, 28680, 241952, 263957, 191402, 416824, 130450, -233764, 260016, 210411, -58272]
15031f2095C552K91574L32146j23958K74363C05563j04208L92690K5556k19247
15021D00354J37697A72250m4893L83288B14583K15456n2470k6461K0104G9025
15010D34825J85639B70547j18875K05798P2030A19393M27311k64674J51362e0291
14999D06015n2054A37234J79474J0550L1290E8245M90983B09297K03132A07090
14988D04824k5917j0620j59054J18736J19881A39855M99158k02362j5444L44414
14978G65621j13454Q8165C08064J58358j13805L37231o611C39206j2384k4008
14968C02814L43707j81808r6098A44179R5605M47923k25010j42723A34760K54736
14958C89496p6638K696o1735l621e4356D34352M9735A21586K72207K5984O8384
$$ y = [-62095, 3552, 295126, 627272, 503314, 777677, 305563, 201355, 594045, 619601, 400354, 538051, 172250, 127357, 510645, 214583, 430039, 377569, 351108, 371212, 79025, 434825, 620464, 270547, 151672, 357470, 429500, 119393, 546704, 282030, 433392, -50291, 406015, 353961, 137234, 316708, 327258, 358548, 58245, 549228, 209297, 412429, 107090, 404824, 378907, 368287, 209233, 327969, 447850, 139855, 639013, 436651, 421207, 765621, 652167, 740332, 308064, 466422, 352617, 689848, 683237, 339206, 326822, 302814, 646521, 464713, 368615, 144179, 239784, 687707, 462697, 319974, 134760, 389496, 312858, 315554, 253819, 250198, -54356, 434352, 484087, 121586, 393793, 419777, 488161]
14947D88161A80199L79451K8896n6451j70456p7833K63321A79650K10487J36657
14937E26794k27592j20807L92606j50861A57190K24958J07256K84707J1857M41567
14927A227535j93221j72875N0159K59539j60053O2326J4246l8915Q0301L52372
14917A481414M62842j29905n01728r7321l29170k29340J87142j46780J31396A28094
14906D22385o5460R4956k09289L07080B18962K18681K0521R293j31305l8738K59463
14895E56877j72760j53335j08524K92752A800L99289J5579J39625j37702M4561
14885D63152O1951p3O1542K25572j69889K11317k75495k22813k9829K47636L4678
14874F07749B22438L6920J07779J25430m2612j01426I3859N14004j8412j80435
$$ y = [488161, 180199, 559650, 588546, 532095, 361639, 283806, 547127, 179650, 390137, 526794, 299202, 178395, 571001, 420140, 157190, 382148, 489404, 774111, 785968, 1227535, 1034314, 861439, 911598, 1171137, 1011084, 1073410, 1087656, 1048741, 1129042, 1481414, 1944256, 1814351, 1312623, 1215302, 886132, 656792, 843934, 697154, 828550, 128094, 422385, 356925, 451881, 242592, 549672, 218962, 437643, 458164, 467457, 336152, 297414, 556877, 384117, 230782, 122258, 415010, 1800, 401089, 416668, 556293, 418591, 463152, 525103, 525030, 586572, 812144, 642255, 853572, 578077, 355264, 325435, 573071, 607749, 222438, 259358, 367137, 492567, 449955, 348529, 93859, 607863, 589451, 409016]
14864D09016l9454K88065l12496K12473j61497k3851J26520j33713L4384Q6024
14854D85471J0550F3252L25812j13351L22849j57509k08693J09140r7153J65898
14844D10245j6152K82085Q642L7534n5094J20749K58884k91332J48227l36662
14834E67126k49772K48517k56425K09330k7021M524j90264K20806K15171J11479
14824H53471C42598K07802j86031J48577J40958k91655o0404L96076j19080j90921
14814C87920Q2255J30304B06098K72324j73934l594J22321J98195j12403J94994
14804G04001j76367N43935E12502O30216D15775M69417m09619J36335B53603L38745
14794E92348J2161k30638J40769r6513L93970C21135K44949q0214R7931j48574
$$ y = [409016, 369562, 657627, 345131, 557604, 396107, 372256, 498776, 365063, 399447, 485471, 496021, 63252, 389064, 275713, 598562, 441053, 232360, 341500, 244347, 410245, 394093, 676178, 684820, 722354, 667260, 788009, 1046893, 755561, 903788, 567126, 317354, 565871, 309446, 518776, 491755, 496279, 306015, 526821, 741992, 853471, 342598, 550400, 364369, 512946, 653904, 362249, 301845, 697921, 578841, 387920, 470175, 600479, 206098, 478422, 304488, 300894, 423215, 621410, 509007, 704001, 527634, 1071569, 512502, 1142718, 415775, 885192, 475573, 611908, 253603, 592348, 604509, 373871, 514640, 418127, 812097, 321135, 566084, 485870, 583801, 435227]
14784D35227J99131q6473j28506L75067B00987R5821K97563k3272k2323K1566
14774E70342K17106L40973m59573q5317O4448k17727J71614J5512q301B87461
14763G91159l25999K36739R1089o5958B81303Q8929K42681q2874q0646J1152J31867
14752E92412j37518J30624J13297o7760K998k29469K83627q7664J91866k53308
14742E39105p1717K06387j72735J50867J65200L118k42362j28851K37458j46212
14732E40258A36423Q64571l3976Q1064m8599J24267n6221L14429o5231K21215
14722A537942q4852o90213K86100k290K01514m28270j86830K22271O7968m58489
14712D64851L48215M9088l38252K25275p2241K66452o3039Q2565j2359J89238
$$ y = [435227, 634358, 547885, 419379, 794446, 200987, 296808, 594371, 571099, 548776, 570342, 787448, 1128421, 668848, 583531, 647979, 430252, 601866, 617378, 609077, 287461, 791159, 465160, 701899, 792988, 727030, 281303, 370232, 612913, 530039, 449393, 460545, 592412, 454894, 585518, 698815, 631055, 634053, 404584, 688211, 600547, 792413, 539105, 467388, 673775, 501040, 651907, 817107, 820225, 577863, 449012, 686470, 540258, 136423, 1000994, 967018, 1048082, 999483, 1123750, 1067529, 1381958, 1316727, 1537942, 1453090, 762877, 1048977, 1046687, 1248201, 819931, 633101, 855372, 923340, 464851, 813066, 862154, 523902, 749177, 676936, 943388, 880349, 962914, 950555, 1139793]
14702A139793O8566K50416j48654J51124L9906k70133P416m22043o5389O8042
14692H19044m7307J3199q1640L43023m23069K24317r5765L68733D63785M47498
14682I11283L01901m87843J58820r4213k41846L68972j27672L48848k58260k88424
14672E91566Q7213M84291l16528o9280M2169K38053l64499K86303n1558p5252
14662H52478J04803j01416n919l56393L4117M85137j56006M1849N4100N3554J09236
14651A115540j72504L18856k83046J04513k40947J28048P7790o3247K10909l16143
14641H79769K05970k51844L17964j92377L47792m19338J56760r7922K62501j23775
14631A085500O47J4088n0149q9716L23564l39071M13886k50245J23246N7519k96706
$$ y = [1139793, 1208359, 1458775, 1310121, 1461245, 1501151, 1231018, 1238434, 816391, 751002, 819044, 771737, 784936, 703296, 1046319, 623250, 847567, 751802, 1120535, 463785, 911283, 1213184, 725341, 884161, 789948, 548102, 917074, 789402, 1138250, 879990, 591566, 678779, 1163070, 846542, 777262, 819431, 1057484, 692985, 979288, 927730, 852478, 957281, 855865, 849946, 493553, 527670, 1012807, 856801, 898650, 952750, 1006304, 1115540, 943036, 1261892, 978846, 1083359, 842412, 970460, 1048250, 985003, 1195912, 879769, 1085739, 833895, 1151859, 959482, 1307274, 887936, 1044696, 946774, 1209275, 1085500, 1086147, 1100235, 1050086, 960370, 1283934, 944863, 1358749, 1108504, 1231750, 1289269, 992563]
14620I92563K51061J0504j31795R9245j47452J5250J61405J3064j4111k49916
14610I99818N42541l96139J45253R8549j73513M3266K60637O7777j89478Q8334
14600A487045L35415l45338k51519L51262J17620l66751K61340K75P069q8071
14590A508347j61684N4181j91173L7141N9078L64056J52882p5162L6697l60133
14580A424230k66335N19379n7018o1516k58039L43048k2317N5918J16427j8904
14570A774873J59075K9885k16075P3687M70158l00498J27125l9405J01939l6147
14560B144617J71484K16723R140N3590P0885L9141M09792M7254K61015N83377
14550D007018Q14257J365164L866885P942587J5095200M361137A7638236H479372
$$ y = [992563, 1243624, 1254128, 1122333, 1221578, 1074126, 1089376, 1250781, 1263845, 1249734, 999818, 1542359, 1146220, 1291473, 1390022, 1216509, 1259775, 1520412, 1588189, 1398711, 1487045, 1822460, 1477122, 1225603, 1576865, 1694485, 1327734, 1589074, 1589349, 1596418, 1508347, 1346663, 1400844, 1209671, 1246812, 1305890, 1669946, 1822828, 1747666, 1784363, 1424230, 1157895, 1677274, 1620256, 1558740, 1300701, 1643749, 1621432, 1677350, 1793777, 1774873, 1933948, 1963833, 1747758, 1821445, 2291603, 1991105, 2118230, 2078825, 2180764, 2144617, 2316101, 2532824, 2541964, 2595554, 2666439, 2705580, 3115372, 3162626, 3423641, 4007018, 4821275, 6186439, 10053324, 17995911, 33091111, 37452248, 17638236, 8479372]
14541E721441M46691k441193q30546l70141k38334k80668n9518J19932j55516
14532A912148j12892L49332k44749O3331q2093L15380m07604N6301R1494j21389
14522A819259N28802m13933J99941k42448N04652o6961J13942J66870l21894L2568
14512B320798J68834k95581M35179j06621k08623K83900Q6867N1217q0056k4139
14502B631775K10156m90805N5575K39346K9703M21788j00895j65859J568k51136
14492B581216J54746M60629K9716j03659m24298N22229K56539m00997K94164n0285
14482C320000k32668M13365l80133J63272K84201l74218N16717j04537j38165
14473C467834J61547M43139n08929L98244j81272L63168m06268J85601J67970
$$ y = [5721441, 6168132, 3726939, 2896393, 2526252, 2287918, 2007250, 1947732, 2067664, 1912148, 1799256, 2148588, 1903839, 1967170, 1885077, 2200457, 1792853, 1849154, 1940648, 1819259, 2348061, 1934128, 2134069, 1891621, 2396273, 2329312, 2443254, 2610124, 2288230, 2320798, 2489632, 2194051, 2629230, 2522609, 2313986, 2597886, 2684753, 2735970, 2655914, 2631775, 2841931, 2351126, 2406701, 2646047, 2675750, 3097538, 2996643, 2830784, 2832352, 2581216, 2735962, 3196591, 3226307, 3122648, 2698350, 3220579, 3477118, 3076121, 3370285, 3320000, 3087332, 3500697, 3120564, 3283836, 3568037, 3193819, 3710536, 3605999, 3467834, 3629381, 4072520, 3563591, 3961835, 3780563, 4143731, 3737463, 3923064, 4091034]
14464D091034j18998L03755k92005L12898r3469J15619j25849m7009J31964K3242
14454D301182J13894R036L68287k40823M60929k50846k18557J56049K74962R9639
14444E073752K89360k27032J90842m6690M3591K51976j45566K55759j9018L50198
14434F017172q2872r861Q223J47864L71171j53990N4809J45554j25446L26335
14424F698959k1544L74531n09679P53682Q2850l288n9753L12504K25202j17886
14414G735578j0455M38187l71290L16270K1073J86473J05994P5854M48516j24548
14404H821652L75006L7460k08627K86309K72962J5715K79107k13215J90020Q9192
14394I945581O02500N0591M9501K35135L96449m2187K07313J94051j93548Q95252
$$ y = [4091034, 3972036, 4275791, 3983786, 4296684, 4203215, 4318834, 4192985, 4145976, 4277940, 4301182, 4415076, 4424112, 4792399, 4551576, 5012505, 4761659, 4543102, 4699151, 4974113, 5073752, 5363112, 5136080, 5326922, 5280232, 5323823, 5575799, 5430233, 5685992, 5666974, 6017172, 5934300, 5924439, 5932662, 6080526, 6451697, 6297707, 6352516, 6498070, 6372624, 6698959, 6677415, 7051946, 6542267, 7295949, 7378799, 7375511, 7315758, 7628262, 7853464, 7735578, 7725123, 8163310, 7792020, 8108290, 8129363, 8315836, 8421830, 8497684, 8946200, 8821652, 9196658, 9234118, 9025491, 9311800, 9584762, 9600477, 9879584, 9666369, 9856389, 9945581, 10548081, 10598672, 10648173, 10883308, 11279757, 11237570, 11444883, 11638934, 11445386, 12340638]
14384A2340638p5843M52912Q068K65692O13726j8971k88772L60200O13619J76619
14374A4447888J57265M62639O9725L16024O25169J87546M86154N46627P1899L89676
14364A7760612L04752M22525M23228K88560l7654Q73615M30976M09498P21348
14355B1597460J54432P55662L77112M12521O64091R56648K53185M97602Q36242
14346B6504955O22462N18110P31410P85759Q41610P96521N08971J431578O8751
14337C2810127Q67199J471788J216818P75134J240222R50593J086283J022466
14329D1440630J395911J685580J358441J177478J684900J656397J595913K088017
14321E4083267J769186J707977J906358K400822J892454K402094K516735K769693
$$ y = [12340638, 12264795, 12717707, 12725775, 12991467, 13605193, 13586222, 13297450, 13657650, 14271269, 14447888, 14605153, 15067792, 15137517, 15453541, 16078710, 16266256, 16752410, 17299037, 17370936, 17760612, 18065364, 18487889, 18911117, 19199677, 19162023, 20035638, 20466614, 20876112, 21597460, 21751892, 22507554, 22884666, 23297187, 23961278, 24917926, 25171111, 25668713, 26504955, 27127417, 27645527, 28376937, 29162696, 30004306, 30800827, 31309798, 32741376, 32810127, 33677326, 35149114, 36365932, 37141066, 38381288, 39331881, 40418164, 41440630, 42836541, 44522121, 45880562, 47058040, 48742940, 50399337, 51995250, 54083267, 55852453, 57560430, 59466788, 61867610, 63760064, 66162158, 68678893, 71448586]
14313G1448586K644395L156352L210266L025093L519680L583242L711634L965892
14305I8265140M678136M892542M848738M648872N820570N934088O600437O399521
14297A42088044P079924P384353Q449060Q293883Q998039R713752J0178870J1214435
14289B13400360J1401123J1623905J2912859J3292595J4086683J4221496J5077954
14282C06016975J5196354J5298383J5702455J6076217J4844448J4613815J3717806
14275D11466453J2142802J0881447P892892L847088n7630N35918j938883l735210
14267D41034877m806551q611464j0527395j2088719j2368516j2338179j3141132
14260C67152921j3192542j3971973j4350032j4521143j5262751j4594345j5107059
$$ y = [71448586, 74092981, 77249333, 80459599, 83484692, 87004372, 90587614, 94299248, 98265140, 102943276, 107835818, 112684556, 117333428, 123153998, 129088086, 135688523, 142088044, 149167968, 156552321, 165001381, 173295264, 182293303, 192007055, 202185925, 213400360, 224801483, 236425388, 249338247, 262630842, 276717525, 290939021, 306016975, 321213329, 336511712, 352214167, 368290384, 383134832, 397748647, 411466453, 423609255, 434490702, 442383594, 446230682, 446173052, 446708970, 444770087, 441034877, 436228326, 427616862, 417089467, 405000748, 392632232, 380294053, 367152921, 353960379, 339988406, 325638374, 311117231, 295854480, 281260135, 266153076]
14253B66153076j4393492j3286471j1771555j2298018j1676325j0862180j0176397
14246A81688638r524828q339494p911008p684959p467209o920125o394788o139403
14238A21306824m998901n282769n055395m951595m364138m350312l624372l224010
14230H5455332l576507l495260l047420l053799k851059k558935k704774k449798
14222F1717780j850498k407905k037482j622245k079209j821379j265276j683393
14214D6950393j499977j034738j765993j559953r35379j165177j002671q11488
14206C7175017r16588j328335j453193r50061q96859p85119o55744p07396r49541
14197B8532181r33597k88790p70894r17959m78229o28208n52691q31255k75280
$$ y = [266153076, 251759584, 238473113, 226701558, 214403540, 202727215, 191865035, 181688638, 172163810, 163824316, 155913308, 148228349, 140761140, 133841015, 127446227, 121306824, 116307923, 111025154, 105969759, 101018164, 96654026, 92303714, 88679342, 85455332, 81878825, 78383565, 75336145, 72282346, 69431287, 66872352, 64167578, 61717780, 59867282, 57459377, 55421895, 53799650, 51720441, 49899062, 48633786, 46950393, 45450416, 44415678, 42649685, 41089732, 40154353, 38989176, 37986505, 37175017, 36258429, 34930094, 33476901, 32526840, 31629981, 30844862, 30189118, 29481722, 28532181, 27598584, 27309794, 26538900, 25620941, 25142712, 24514504, 23961813, 23130558, 22855278]
14188B2855278q35117l60714n23630m72174m05700k54754m26728n02406m45816
14179A8628239l79730j83497q14325k89572k9543m58986n8022k53203l33849p13154
14169A5114358K16762n82483m30190k7146n43797j53458j48816l67087j41265
14160A2936878k04549k43588j95263M2979j61570j82987p62835l90398L10141
14151A1148808l41189l49871j1096J73031o79115j48541K10934n29649M56819
14142I930131o79509L9394j28185n79992O23308k62146k57695l12338j35224R1673
14132H329417j60318J1520n04789r9251p186m42389K01207m516o3665l44285J47548
14121G063293j90784k81690K59496k38362J07368j03084k24304j84784k5032P0788
$$ y = [22855278, 22020161, 21659447, 21135817, 20663643, 20257943, 20003189, 19576461, 19074055, 18628239, 18248509, 18065012, 17250687, 16961115, 16931572, 16472586, 16414564, 16161361, 15827512, 15114358, 15331120, 14748637, 14318447, 14291301, 13747504, 13594046, 13445230, 13078143, 12936878, 12732329, 12488741, 12293478, 12336457, 12174887, 11991900, 11229065, 10838667, 11148808, 10807619, 10457748, 10446652, 10619683, 9940568, 9792027, 10002961, 9473312, 9930131, 9250622, 9290016, 9161831, 8581839, 9205147, 8943001, 8685306, 8372968, 8237744, 8329417, 8169099, 8180619, 7675830, 7576579, 7569393, 7127004, 7328211, 7323695, 7260030, 6915745, 7063293, 6872509, 6590819, 6850315, 6611953, 6719321, 6616237, 6391933, 6207149, 6182117, 6252905]
14111F252905j78318j64645L39020l91318K44667M4613o16402m88208N13720m39669
14101E116365M41997m92641J68893j6887P6405k04164K17416l36067j30764J53625
14091D994178j30392l13385K04656J668o7325k88609J05824k4826n6683K04134
14081D629240k05494k84670Q5901K55072k49553l9936j14977K07723m64719J13602
14071C932189j79096K02857l10615J8017l106j924K8535k98852K91240j84879
14061C494366L00264J02083j11262J65367k90832m82837K09256j0525L85366m16736
14051C344510j51040j00880j35323M39597m04329j1231N13295n36139J46564l2216
14041C072808J23170n1217o9329j4083m31938N27310m70774K78466j89720M49475
$$ y = [6252905, 6074587, 5909942, 6248962, 5857644, 6102311, 6146924, 5530522, 5042314, 5556034, 5116365, 5558362, 5065721, 5234614, 5217727, 5294132, 5089968, 5307384, 4971317, 4840553, 4994178, 4863786, 4550401, 4755057, 4756725, 4689400, 4400791, 4506615, 4481789, 4425106, 4629240, 4423746, 4139076, 4224977, 4480049, 4230496, 4190560, 4075583, 4283306, 3818587, 3932189, 3753093, 3955950, 3645335, 3663352, 3660246, 3658322, 3686857, 3388005, 3679245, 3494366, 3794630, 3896713, 3785451, 3950818, 3659986, 3177149, 3386405, 3375880, 3761246, 3344510, 3193470, 3092590, 2957267, 3396864, 2992535, 2981304, 3494599, 2958460, 3105024, 3072808, 3195978, 3144761, 3075432, 3061349, 2629411, 3156721, 2685947, 2964413, 2774693, 3224168]
14031C224168m31923J27954J07180K70575k75544m19890J85921l23086L1525J82295
14021B679175j29486r3845j57676k1707m2733N6032j84330m1258J90018k40900
14011B013290J15225K24115j90053j60817k50823N41287l33747n889j81591K47551
14001B018548L3360p9787j87868J87175J07004p8807k6795J70966j2864j77695
13991A953237l1957O11692J115325J871729O433207J4024388J3199456j3974645
13983B5202432j2081445n241044j950128q08370j160930m71578k1885j34502q23010
13974B509540L10327k07093k31877J99975l21004L0809N2070l71547M21777m66640
13964A926337l6973K70240J07408j62195K12420j73325k92733J25938J10199l66410
$$ y = [3224168, 2792245, 2920199, 3027379, 3297954, 3022410, 2602520, 2788441, 2465355, 2496880, 2679175, 2549689, 2455844, 2298168, 2276461, 2233728, 2289760, 2105430, 2064172, 2254190, 2013290, 2128515, 2352630, 2162577, 2001760, 1750937, 2292224, 1958477, 1952588, 1770997, 2018548, 2051908, 1972121, 1784253, 1971428, 2078432, 1999625, 1972830, 2143796, 2130932, 1953237, 1921280, 2532972, 3648297, 5520026, 11953233, 25977621, 39177077, 25202432, 13120987, 7879943, 5929815, 5121445, 3960515, 3488937, 3467052, 3332550, 2509540, 2819867, 2612774, 2380897, 2580872, 2259868, 2290677, 2342747, 1971200, 2392977, 1926337, 1889364, 2159604, 2267012, 2104817, 2317237, 2143912, 1851179, 1977117, 2087316, 1720906]
13954A720906J33141o5564N3059K5992k30153j52262J97638L9018J42671k47228
13944A617218J9769J24921k00654K31677L9387j95457K49621m73815J71178L1683
13934A615528J32094n6068k16822k2854J39994l99472L23969N5715j44724r6212
13924A331148k15088j7685M80497J28889l39635Q7034k27302L30837j18985j18198
13914A321512q6786j03339K73817Q5505m59680J37734K62958n8110l00342K70711
13904A343980l42672K93073J07583j94276n4883n508p8041k2504M60043Q2894
13894A589689j44046m96166L84122J72678k72625r5638j28891K32269L4163o7803
13884A207752J6715N6561m24969L10528J26108l15298q5604m4815M01116k30090
$$ y = [1720906, 1854047, 1788483, 1841542, 1867534, 1637381, 1485119, 1682757, 1721775, 1864446, 1617218, 1636987, 1761908, 1561254, 1792931, 1832318, 1636861, 1886482, 1412667, 1583845, 1615528, 1747622, 1691554, 1474732, 1451878, 1591872, 1192400, 1516369, 1572084, 1427360, 1331148, 1116060, 1098375, 1578872, 1707761, 1368126, 1455160, 1227858, 1558695, 1439710, 1321512, 1234726, 1131387, 1405204, 1490709, 1031029, 1168763, 1431721, 1373611, 1073269, 1343980, 1001308, 1294381, 1401964, 1207688, 1152805, 1147297, 1069256, 1046752, 1506795, 1589689, 1445643, 949477, 1333599, 1506277, 1233652, 1138014, 1009123, 1241392, 1275555, 1207752, 1224467, 1281028, 856059, 1166587, 1292695, 977397, 891793, 846978, 1248094, 1018004]
13874A018004r1216j89299K03701R0125j11490O0948p2214L11789j74998j59437
13864H85913L41172l35728J72635K17462k24347j58614L39818o4905j16937j63531
13854H92938L73070m24938K51225k51546J40643Q9685k90751J84820n1591L09447
13844A223002k96623j63241J07661l7512J9042K54181m85684j474O1929J92082
13834H73363J1414J42789k13808K63733E23642J87154J98404L9101j79047N6410
13824H25664J8084K155j35279m8312J92828O9877k2796M7977l1052m31157L40278
13813H28267J4691k6335L55390k51530l09326L44555k92929K59072m25938K85478
13803G81395j01121L5330p3336l7294l4724K78103B8420P13153J329Q5166o9571
$$ y = [1018004, 926788, 737489, 941190, 1031315, 919825, 980773, 908559, 1220348, 1045350, 885913, 1227085, 891357, 1063992, 1281454, 1057107, 898493, 1238311, 1173406, 1056469, 892938, 1266008, 841070, 1092295, 840749, 981392, 1071077, 780326, 965146, 913555, 1223002, 926379, 763138, 870799, 833287, 852329, 1106510, 620826, 619352, 681281, 873363, 884777, 1027566, 813758, 1077491, 523642, 710796, 909200, 948301, 769254, 825664, 843748, 845903, 710624, 662312, 855140, 925017, 902221, 950198, 919146, 487989, 828267, 842958, 816623, 1172013, 920483, 611157, 955712, 662783, 921855, 495917, 781395, 680274, 715604, 642268, 604974, 570250, 848353, 28420, 741573, 742902, 828068, 758497]
13792G58497j52272J53978j39144K43901p7680j63231M52190C83976P8260L57866
13782H20102n3450r239l7677k94542J63959j51140L07551n4315J11960R605l63313
13771D49501O3862J68224n5115j46894j64268K51638K62901j35298p3822L0712
13761F51441o4122j94681K52147R9159m6917J69728C61808M65263B97273O47104
13751I44377o4342l83442o9588K79947B98107K66158K92769k68261j05051K88539
13741G72261j40533k9132P550L59903C21611M4461O889J34134K28292L7028j82405
13730E90010P4881j49468K11121N3939j89707k6623B80679J75532N9984j2916
13720E03279K40955j85191L47844C88025J6538K35321D5502K72652O4381K40249
$$ y = [758497, 606225, 760203, 621059, 864960, 787280, 624049, 1076239, 383976, 462236, 820102, 766652, 757413, 719736, 425194, 589153, 438013, 745564, 691249, 803209, 812814, 449501, 513363, 681587, 626472, 479578, 315310, 566948, 829849, 694551, 620729, 651441, 587319, 392638, 644785, 743944, 697027, 866755, 361808, 827071, 297273, 944377, 880035, 496593, 427005, 706952, 298107, 564265, 857034, 588773, 483722, 772261, 631728, 602596, 610146, 970049, 321611, 366072, 372961, 507095, 735387, 772415, 590010, 664891, 515423, 726544, 780483, 590776, 564153, 280679, 456211, 516195, 503279, 744234, 559043, 906887, 388025, 404563, 639884, 45502, 318154, 382535, 622784]
13710F22784j58545K47542B80303J30451J81631r0619K22488C54141J65811R738
13700E29690p3265j59109J90697J00137N1267j25530p2529j6909A93107J97647
13690C90754J38303K11025C48230K60577o8269j70783K46698j23957k5594k07855
13680B59047e3654C04535J22739J21925B36651K71965r2573j73310p0099K17746
13670C90380K20078B88217K3005j33834L30263j94970M09321C30171J32351J0338
13660D72860K61969G5339J32201M61836l12574L5783K32616B13127L86062k78960
13650C20229J5507n7670P7790j04085L4846J55931j49222L4057J98942J68854
13640F95179l38871J08125A49331K07253j76705A0251O60240k90836A42239L52545
$$ y = [622784, 464239, 711781, 280303, 410754, 592385, 501766, 724254, 354141, 519952, 529690, 456425, 297316, 488013, 588150, 639417, 513887, 441358, 424449, 193107, 390754, 529057, 740082, 348230, 608807, 540538, 369755, 616453, 492496, 466902, 259047, -53654, 304535, 427274, 549199, 236651, 508616, 416043, 242733, 172634, 390380, 610458, 288217, 311222, 177388, 507651, 312681, 722002, 330171, 462522, 472860, 734829, 75339, 207540, 669376, 356802, 392585, 625201, 213127, 599189, 320229, 335736, 278066, 355856, 251771, 286617, 442548, 293326, 327383, 526325, 695179, 356308, 464433, 149331, 356584, 179879, 10251, 670491, 379655, 142239, 494784]
13630D94784L69123C47926A54932K69412K7661A10266M11964k18683m474J47702
13620D46775K24428k92208j07797J71526J69267F9998J22943N12315j40829A22067
13609A95143M3133K20767k12257j06769M43858e8552C33167r5001K89920l0685
13599D97401A68178K29719K93625C41229K33533a1447C82907R4285j30122l8131
13589C08939Q6667j80217o7031J23435b9162C13694k6549D0047J84331K2031J1923
13578B58332J26763J33732k08142q6686Q6590j03667J21976m7565b13518C55120
13567A68357K72873j26244K38642j14699Q5436j09059B3944N61945B11634J23702
13557C35336n4678G3506J3588N30880a3457B22170K63228A59094J05047j19301
$$ y = [494784, 863907, 347926, 154932, 424344, 452005, 110266, 522230, 303547, 299073, 446775, 671203, 378995, 271198, 442724, 611991, 69998, 192941, 705256, 564427, 122067, 195143, 238276, 459043, 246786, 140017, 583875, -58552, 333167, 238166, 528086, 497401, 168178, 397897, 691522, 341229, 574762, -11447, 382907, 477192, 347070, 308939, 395606, 215389, 148358, 271793, -29162, 313694, 287145, 40047, 224378, 246409, 258332, 385095, 518827, 310685, 223999, 310589, 206922, 328898, 281333, -213518, 355120, 168357, 441230, 314986, 553628, 438929, 524365, 415306, 23944, 585889, 211634, 335336, 280658, 73506, 87094, 617974, -13457, 222170, 485398, 159094, 264141, 144840]
13547A44840J92829n9627K8988f9944B93785j34405L41845j81670M9291A69008
13536A95006p2942M2914p5010J4234M6699o818L61897l6975j04144K13174A35229
13524D48455A48373K81866K30368B68825n2047M06i3915B00325H9408K32005c9579
13512H2989N927f4058B30418J31652A30912J82088E7188g7068F14419B53200A4808
13500h0501A78783J06185H2921C7512J76937H5588M698K40796F924K27737j14330
13489A20331j1427K13184j24986g21A13659M08878I9964K3876J71950A18084L39733
13478D57817A99963K09668j27128j23710e935A32039K63452e8404C07286q8396
13468B18890J86218j43155J1989M7048l386e2158j68783F0473c2517A90542c2721
$$ y = [144840, 337669, 278042, 307030, -69944, 293785, 159380, 501225, 319555, 368846, 169008, 195006, 122064, 164978, 89968, 104202, 150901, 144083, 505980, 469005, 364861, 578035, 135229, 448455, 148373, 430239, 660607, 268825, 216778, 217184, -93915, 200325, 89408, 321413, -39579, 82989, 88916, -64058, 230418, 362070, 130912, 313000, 57188, -77068, 614419, 253200, 14808, -80501, 178783, 284968, 82921, 37512, 214449, 85588, 90286, 331082, 6924, 234661, 120331, 108904, 322088, 197102, -721, 113659, 522537, 99964, 123840, 295790, 118084, 457817, 199963, 409631, 282503, 158793, -5935, 132039, 395491, -58404, 307286, 218890, 405108, 261953, 273942, 320990, 317604, -52158, -220941, 60473, -32517, 190542, -32721]
13456B61095N9278I5912e142j6845F3812J36971K03300A70688Q724a02179C19819
13444C18632j34733q8612J02855L31052e2657C76823A73534Q8240l0235o5729
13434A65810O0651F8241J47189N8330O3116A788K24925J38388j15556m2943n6757
13423A49845C8550J73366a54809A92215a04493B38983R4212J24309G1679K8066
13413I9745L7182K0579k6452R1534a28675A24784F1329L53870G4249K87838A64684
13401A24342L07763B00743M36520A49884c5461A38662J29758C1317K6524c5859
13390i2341j61494C87233j41150K41913A02797K82903o1687m9582k3124J65620
13380D16927b2981A79617j7047M22935B07072o3183a75470A73683J20385r9418
$$ y = [261095, 320373, 95912, -5142, -21987, 63812, 200783, 404083, 170688, 179412, -102179, 319819, 318632, 183899, 95287, 198142, 529194, -52657, 376823, 173534, 261774, 231539, 165810, 226461, 68241, 215430, 273760, 336876, 1788, 226713, 365101, 249545, 206602, 149845, 38550, 211916, -154809, 192215, -104493, 238983, 333195, 457504, 71679, 99745, 136927, 157506, 131054, 222588, -128675, 124784, 61329, 415199, 74249, 362087, 164684, 124342, 432105, 200743, 637263, 149884, -35461, 138662, 268420, 31317, 57841, -35859, -92341, -253835, 387233, 246083, 487996, 102797, 385700, 324013, 274431, 251307, 416927, -22981, 179617, 162570, 585505, 207072, 143889, -175470, 173683, 294068, 194650]
13370A94650J38979C7444L70793j67274K82718B47972g9321B28534A6645e6547
13359B35493q5985K19123J40702e0888B56990P1787o019O0160G4146K76155c184
13347A03447a86425A69928a02670B35350A02583K19785A24652J05811b4448B61827
13336B07515d2616B01864b89353C30809a45210A00662J01970D2471J44639L7644
13326B24754L5129K7470K5468A22412E4322M66971A43182J60968N4962j53836
13316B05276G5860N347B7309i6636A69964L37186A4610J68986a09002D8105J42067
13305A90172J37773b28033J5810A18256M06648I5468L8070d2641B2972J66763
13295A89735M207G5044J02648a45961A14193E2120J26851J78480G6999b33733
$$ y = [194650, 333629, 37444, 408237, 240963, 523681, 247972, -79321, 228534, 16645, -56547, 235493, 149508, 368631, 509333, -50888, 256990, 328777, 322758, 382918, 74146, 350301, -3184, 103447, -186425, 169928, -102670, 235350, 102583, 322368, 124652, 230463, -24448, 261827, 207515, -42616, 201864, -289353, 330809, -145210, 100662, 202632, 42471, 187110, 224754, 259883, 287353, 312821, 122412, 54322, 521293, 143182, 304150, 359112, 205276, 75860, 81207, 27309, -96636, 169964, 507150, 14610, 183596, -109002, 48105, 190172, 327945, -228033, -212223, 118256, 524904, 95468, 133538, -42641, 22972, 189735, 193942, 75044, 177692, -145961, 114193, 52120, 178971, 357451, 76999, -233733]
13284c0217l8003A67761J48115D2380K14366J3173g9480F8922K09256f4381I194
13272C43566j49795N2378A11954l0538L65164k11677g1038C0037P8882d7718e221
13260a5951A66825a5592C59846d1892m0892F3143h3744D09144c091j14030F7484
13248A43590B6599P9822K84689j74572C9951b16541I4691J9437M7371k2507M0175
13237A79167b70985B44802B3206j1428O6992e8729B30965P8421A21457m8837K94767
13226C67387e5078B38300A01929K33184A40573A1444L18176G8855A7424J2949
13216C0373a55593A80929J50338j02433j00332J29858p452l1985c25326C93170
13205A11962E5753J89591C3183Q5277K09626E9130c0320A54196D1554L2654A4468
$$ y = [-30217, -68220, 167761, 315876, 42380, 256746, 269919, -79480, 68922, 278178, -64381, 9194, 343566, 193771, 246149, 111954, 81416, 446580, 234903, -71038, 30037, 108919, -47718, -5221, -15951, 166825, -15592, 359846, -41892, -82784, 63143, -83744, 409144, -3091, -117121, 67484, 143590, 26599, 106421, 391110, 216538, 39951, -216541, 94691, 114128, 161499, 138992, 179167, -270985, 244802, 23206, 11778, 78770, -58729, 230965, 309386, 121457, 72620, 367387, -55078, 238300, 101929, 335113, 140573, 11444, 329620, 78855, 17424, 30373, -155593, 180929, 331267, 228834, 128502, 258360, 250908, 218923, -325326, 393170, 111962, 55753, 245344, 33183, 118460, 328086, 59130, -30320, 154196, 41554, 74208, 14468]
13193a75994o7005J10456G2089Q9175a86416B27439a0321A46490a45497B05564
13182a51395A11102J78736G3321K9391g5486E9164M9856a46483C30606j02609
13172B27997G0992k7373a80661D1130J16213a02026j20004i3644L6525D18184
13161C01573G5256K1598J88452A6866J99882n7342C8844J35687K16559P259A10507
13149A54963r781R0293M0708a24955p2537C50536l8999M5369b751B24525k0947
13138B03578f6022n139B74455j15846F6710j0282L24574A70407o1466h005B34607
13126H7668b30397a14721b2630j52974A88214J77775A28245K55404B9151J01571
13116A30722P1145E297a03334r5263B6941K14468n3879D2625J58120P0329l7539
$$ y = [-175994, -242999, -132543, 72089, 161264, -186416, 227439, -10321, 146490, -145497, 205564, -151395, 111102, 289838, 73321, 102712, -75486, 59164, 109020, -146483, 330606, 227997, 70992, 43619, -180661, 41130, 157343, -102026, -222030, -93644, -57119, 418184, 301573, 75256, 96854, 285306, 16866, 216748, 159406, 38844, 174531, 391090, 398349, 110507, 154963, 145182, 235475, 276183, -124955, -197492, 350536, 311537, 356906, -2751, 224525, 203578, -66022, -71161, 274455, 158609, 66710, 56428, 381002, 170407, 108941, -8005, 234607, 87668, -230397, -114721, -22630, -175604, 188214, 365989, 128245, 383649, 29151, 130722, 201867, 5297, -103334, -198597, 26941, 241409, 187530, 42625, 200745, 271074, 233535]
13105B33535h1755j16911D1837K10404a325C92112q1148b20584A07548k2763l9150
13094D5635b30110F2522a64700N7187H9949K44228B4324L4564J3069N2947E4918
13082g0851B58091J19039C638L52408G605b9595C9215M4121a9742j97049A68207
13070F7069J7963R5560a67219a2353m1817A35096n14m3947c6851B4133M0318c9440
13057f4971j53889B16685B888K3632q210J74157r1579A3619Q8830i5948B30525
13045E3315d1720G4628R6108G7774J38483b807C06140B8441e03134B2357a50109
13033d6368B74465r5688g6k49224d2722B05042d0309j42863B3967J9283b64487
13021A96169D437K67930B0682e5348B63556G9714b28147M8376A70839p7195J2370
$$ y = [233535, -81755, -198666, 41837, 252241, -1325, 392112, 310964, -220584, 107548, 84785, 45635, -230110, 62522, -164700, -107513, 89949, 334177, 24324, 58888, 71957, 124904, 54918, -70851, 258091, 377130, 3638, 356046, 7605, -29595, 39215, 83336, -19742, -216791, 168207, 67069, 85032, 180592, -167219, -12353, -54170, 135096, 134582, 90635, -36851, 24133, 64451, -39440, -64971, -218860, 216685, 2888, 26520, 18310, 192467, 100888, 13619, 102449, -95948, 230525, 53315, -41720, 74628, 170736, 77774, 216257, -2807, 306140, 28441, -503134, 22357, -150109, -46368, 274465, 178777, -76, -249300, -42722, 205042, -40309, -183172, 23967, 43250, -264487, 196169, 4437, 272367, 20682, -55348, 263556, 79714, -228147, -179771, 170839, 93644, 106014]
13010A06014J69249I183a07836A00904a44916A26395c07239A27232m8506d9516
12999E9036a84857B46054b39795j38406A82795G5291a00465A19052D9681L8278
12989H7959C1428K85983F6099R3819N0715C1729b87338D4001a14892e6134l00
12978e6434B0885K8366c124l66206A10685I513e1236l475F9132b86915a00884
12966A181L15752A29811h5895E2682O0944D717R4799f1785B08073a26202N1025
12955g5177D379L9462b61861H2190a57788c5675j61294J7586C4083f7465H9729
12943G58Q0769L5573b23437A61929d51188b5017k99617A66457f1840O100A12550
12931A41980a25181A10859a13501A90138c72950A42622D5129i1708B38098B1181
$$ y = [106014, 275263, 9183, -107836, 100904, -144916, 126395, -307239, 127232, 78726, -49516, 59036, -184857, 246054, -239795, -378201, 182795, 75291, -100465, 119052, 49681, 87959, 31428, 317411, 66099, 159918, 210633, 31729, -287338, 44001, -114892, -56134, -56434, 20885, 49251, -3124, -369330, 110685, 9513, -51236, -54711, 69132, -286915, -100884, 1181, 316933, 129811, -85895, 52682, 113626, 4717, 99516, -61785, 208073, -126202, -75177, 4379, 43841, -261861, 82190, -157788, -35675, -196969, -179383, 34083, -67465, 89729, 758, 81527, 117100, -223437, 161929, -451188, -25017, -324634, 166457, -61840, -55740, 112550, 141980, -125181, 110859, -113501, 190138, -372950, 142622, 45129, -91708, 238098, 21181]
12920c93165J88674A33777o038b19576i1788C3058J89982b24522C570K19593e9863
12908a65290b5280B50717N1080K15647C4585J13298g4184B12543k984i8649q461
12897a07110A75226E5124Q1806d07948d1030B5614j51J0444J09812P0337N5081
12886B71137a85541A69008E7607A6325J18735b13357i5376F2046P2006L2592D7773
12874a65900P9679B14370I5632C3240i7249C80890A64501L4765e0957B17545b90713
12862A16125K5746a81864D505K4742c04983A98295a41912e5887A3785J87118a75344
12850B70431A5063L2692a62815q3408g1184n82A74091B5893M0092K80898H4861
12838b14168B37093r452N8140b85605Q1141A22917J217a8655k70242A8229d4635
$$ y = [-393165, -204491, 133777, 127739, -219576, -91788, 33058, 223040, -224522, 3570, 223163, -59863, -165290, -25280, 250717, 301797, 517444, 34585, 147883, -74184, 212543, 209559, -98649, -107110, 175226, 55124, 136930, -407948, -41030, 25614, 25463, 35907, 145719, 216056, 271137, -185541, 169008, 57607, 16325, 135060, -213357, -95376, 62046, 134052, 166644, 47773, -165900, -86221, 214370, 95632, 33240, -97249, 380890, 164501, 199266, -50957, 217545, -290713, 116125, 141871, -181864, 4505, 29247, -304983, 198295, -141912, -55887, 13785, 200903, -175344, 270431, 15063, 47755, -162815, -246223, -71184, -71766, 174091, 25893, 65985, 346883, 84861, -214168, 237093, 227641, 285781, -285605, -204464, 122917, 124134, -18655, -288897, 18229, -44635]
12826B21722F4756a0491B50780K3420a60476r2142C9392K34340B997K84908A7974
12814A23873Q2531f2444B70406b86933h6616A36672N1022E5892P9276E830M2853
12803D8683K6663a32313C15824a69883C51303B1154L02574a06234C1988a9822
12792A6733a70494j35849a41999B86691i180A0553J59535b24746Q1791C1242J74180
12781B05422h61m31358C45860A23957a5757A0178i672k04174A44755e2793p0550
12770a23343n0225B89558b35417B71877b6093H5982i5457C76066B8513J2855a66841
12758F6794k7363M2660B8627R9410e0977o0743j6540B91744j34169p6766b21538
12746B4065J89286N2121c00347C70806j68704b20865f9883J6502A01563M5328
$$ y = [221722, 64756, -10491, 250780, 274200, -160476, -252618, 39392, 273732, 2997, 287905, 17974, 123873, 206404, -62444, 270406, -286933, -86616, 136672, 187694, 55892, 135168, 5830, 48683, 75346, -132313, 315824, -169883, 351303, 21154, 323728, -106234, 31988, -19822, 16733, -170494, -306343, -141999, 286691, -9180, 10553, 170088, -224746, -142955, 31242, 205422, -861, -432219, 345860, 123957, -15757, 10178, -9672, -213846, 144755, -52793, -123343, -173568, 289558, -235417, 271877, -26093, 85982, -95457, 376066, 28513, 41368, -166841, 66794, 39431, 82091, 28627, 128037, -50977, -111720, -128260, 291744, 157575, 80809, -221538, 24065, 213351, 265472, -300347, 370806, 202102, -220865, -69883, -53381, 101563, 146891]
12736A46891A6499J59125a43858k19621C44758a78667h5856j38112j64600G4284
12725A13322A5885J29634g9135m8889r5435A05835K5493a9524G1420L8889a58012
12713i3623A81651L2590K23379a71161A52890D1689a04191E174a73411D3784H550
12701I5641J07328a09763C10972i1399B48802b1965j71644A20174B8104g9831
12690h9481p7549b0937D7783J41182a52308E5824b28244d2473A09187a58926C05517
12678a66751D41214F2392f2069I9458a98222b1248m6824E164e9397r1229H1423
12666f2715B06711p9196J70768b2952j05475B70018b52900C12618a69970H0835
12655f6730A44747d87022a13388C7618R9209c23570g6764B81970a83080r4577
$$ y = [146891, 16499, 175624, -143858, -363479, 344758, -178667, -85856, -223968, -388568, 74284, 113322, 15885, 145519, -79135, -128024, -223459, 105835, 131328, -19524, 71420, 110309, -158012, -93623, 181651, 214241, 437620, -171161, 152890, 41689, -104191, 5174, -173411, 43784, 8550, 95641, 202969, -109763, 310972, -91399, 248802, -21965, -193609, 120174, 28104, -79831, -89481, -167030, -20937, 47783, 188965, -152308, 55824, -228244, -42473, 109187, -158926, 305517, -166751, 441214, 62392, -62069, 99458, -198222, -21248, -68072, 5164, -59397, -150626, 81423, -62715, 206711, 127515, 298283, -22952, -128427, 270018, -252900, 312618, -169970, 80835, -66730, 144747, -487022, -113388, 37618, 136827, -323570, -76764, 281970, -183080, -277657]
12645b77657a33539G9107K67691A40864Q7056D3060L1969b59582e805l2065C11621
12633C17706d1289C532Q208l220b52691A98327k67f1871C85756c2873a3681A33760
12620h1224L7785H5076R9226a39419O6280A17406A6704a13851A57145o0321K02503
12609B99327G5643J13465D0512J7287b86555i8588A94329o7388O2684K21954d5461
12597c27979d6351k56804B1404b15619B40217A03159c4498B76870L9736c29848
12586A72017m2822a5293k68118I0499a29015A03731j0906h358j7091j15879k4307
12575a65635B34972q3247c21241a18898l244e4144G3657a63430n9130H8175b01500
12563e4931j52082d0307k21042a07136k35710e4788m0421C3710Q6050n8533M1018
$$ y = [-277657, -133539, 79107, 346798, 140864, 227920, 43060, 75029, -259582, -5805, -37870, 311621, 317706, -41289, 3532, 11740, 8520, -252691, 198327, 198060, -61871, 385756, -32873, -13681, 133760, -81224, -43439, 85076, 184302, -139419, -73139, 117406, 16704, -113851, 157145, 96824, 299327, 75643, 189108, 40512, 57799, -286555, -98588, 194329, 126941, 189625, 411579, -45461, -327979, -46351, -303155, 21404, -215619, 240217, 103159, -34498, 276870, 316606, -329848, 172017, 129195, -15293, -283411, 90499, -129015, 103731, 92825, -8358, -25449, -141328, -165635, 234972, 151725, -321241, -118898, -122142, -54144, 73657, -163430, -222560, 88175, -201500, -54931, -207013, -40307, -261349, -107136, -342846, -54788, -95209, 33710, 119760, 61227, 102245]
12552A02245O3671J06629c03598C6304g9320C7684K05174G2895C1914f2471K6653
12541c5818p2299D8231b06259A43453a40272G8178a11936B4089K35620C1281b04100
12529e0454B3438K86283I2069q834i6894A36325a5579A13389K2677b7091j80872
12518b07963B9964a37154j35640H3745e1861n6316j78137m9782A99039O201i0883
12506b04900B1012d6738A76026l3853a79380B92193B1795h5175A63813k6578a80387
12494a67723K455a6977m0183B26511J45643b05854a4075k6785D04079H5746h7492
12482B9904O722a48556r09B47100j00790k3453b08157R7621B9031d2701A0250
12470A04835f5495k42512A501a66946I629d1385k85810C5091h5171H3440d9301
$$ y = [102245, 165916, 272545, -303598, 36304, -79320, 37684, 242858, 72895, 31914, -62471, -35818, -108117, 48231, -206259, 143453, -140272, 78178, -111936, 24089, 259709, 31281, -204100, -50454, 23438, 309721, 92069, 83235, -96894, 136325, -15579, 113389, 136066, -27091, -207963, 29964, -137154, -272794, 83745, -51861, -108177, -286314, -336096, 199039, 205240, -90883, -204900, 21012, -46738, 176026, 142173, -179380, 292193, 21795, -85175, 163813, 137235, -180387, -167723, -165268, -16977, -57160, 226511, 372154, -205854, -14075, -40860, 404079, 85746, -87492, 29904, 36626, -148556, -149465, 247100, 146310, 122857, -208157, -110536, 29031, -42701, 10250, 104835, -65495, -308007, 1501, -166946, 9629, -41385, -327195, 35091, -85171, 83440, -49301]
12458B0854d3459p2113F5601b26265H3561L7256J43292E1236b9940k0097A74263
12446H9881a7616B90271A16026J09489O4979a43773B55139E4704h6492K1825O429
12435e8238B05613d7408r4760A25727J80089j22292c3019l3113J2136a6225H9544
12423b4345A79889q5040g057j96943e7914B48784a72388A1870b3896p3490D0762
12411F8338c46666E6896b48960R6790r235A30642k8653a18945A12755c7547A02551
12399a11671A03793L7770b7972A71176a31030e1721A03114b6039d036j09909B62048
12387a65155E8857b4064j00207l9255D05101f9810D378J52875b5161j6138B65847
12375e2428A10135R0506f0940A515J04837n2065h3746d949C9829j1238A1961b67602
$$ y = [20854, -43459, -115572, 65601, -226265, 83561, 120817, 264109, 51236, -29940, -50037, 174263, 89881, -17616, 290271, 116026, 225515, 290494, -143773, 255139, 54704, -86492, -64667, -58238, 205613, -47408, -142168, 125727, 305816, 183524, -33019, -66132, -53996, -16225, 89544, -24345, 179889, 94849, -7057, -204000, -57914, 248784, -172388, 11870, -23896, -97386, 40762, 68338, -346666, 56896, -248960, -152170, -161405, 130642, 101989, -118945, 112755, -37547, 102551, -111671, 103793, 141563, -27972, 171176, -131030, -51721, 103114, -26039, -4036, -113945, 262048, -165155, 58857, -24064, -124271, -163526, 405101, -69810, 4378, 157253, -25161, -41299, 265847, -52428, 110135, 200641, -60940, 1515, 106352, 54287, -83746, -4949, 39829, 28591, 11961, -267602]
12362b49566i2477A77677b3461A25663a60315k00080C760e0398F0758K1295J18210
12351B00263a33319j9225A701c2906E3557L6228b17632c9807C5788a1055j36877
12340a47932B31105c23043d8422B6363O7403N8552J75016j2425I0231K9989k0927
12329I9293a66415A11128a63166E024b26317H757J7030b7251l5502K228A83835
12317B95303R1975A36272P5682a5050B50863I7947A9685K08723b16421f7272B61475
12305A12918J14797C7303J16309R932a18802A1174K7607Q4249L0537a83325N6874
12294a26451L1073n8059b9953B20554G6378b9500B27478K5054j22640k7850J33507
12283B35549L05058E3658M5743c1010C92384b7265l7929A61739L9752b7B8534
$$ y = [-249566, -92477, 177677, -23461, 125663, -160315, -360395, 3760, -50398, 60758, 82053, 200263, -133319, -152544, 1701, -32906, 53557, 89785, -217632, -39807, 35788, -11055, -147932, 231105, -323043, -48422, 26363, 93766, 152318, 327334, 314909, 90231, 120220, 99293, -166415, 111128, -163166, 5024, -226317, 8757, 25787, -27251, -62753, -60525, 183835, 295303, 387278, 136272, 211954, -15050, 250863, 97947, 19685, 228408, -216421, -67272, 261475, 112918, 227715, 37303, 153612, 163544, -118802, 11174, 38781, 123030, 153567, -183325, -126451, -95378, -153437, -29953, 220554, 76378, -29500, 227478, 252532, 129892, 102042, 235549, 540607, 53658, 99401, -31010, 392384, -27265, -65194, 161739, 201491, -27, 28534]
12271I7048a62812B04164K07697q6602l4270J6786A48031b71120I567a70231C7933
12259I3504K38478g8876B94289A37687i8878I2286j4496J37006A4887O5834J03870
12248A84591A7730K3915a27045A80098J10743n4970O4052m5863j15005a87587
12237A55075J67636A36195K5231K19230I411a1733I0020J80882a52877A57549
12226B8282P0759J49793b05900F8734J1363b5117o9173K2479A99069k7276d4102
12214C92629a50693B43048D1744O6796J23717j07566C9107K74434A13254b0053
12203G0540L5717K2760i9917E3374N055d4143A6621a43664B11725A05043K2467
12192A27510b372B74571b26054G1031K81457J2936G3829K28621F0323L1549J02157
$$ y = [97048, -162812, 204164, 411861, 325259, 290989, 307775, 148031, -271120, 9567, -170231, 37933, 93504, 331982, -78876, 294289, 137687, -98878, 92286, 77790, 214796, 14887, 80721, 184591, 17730, 41645, -127045, 180098, 290841, 235871, 299923, 254060, 139055, -187587, 155075, 322711, 136195, 161426, 380656, 9411, -11733, 90020, 270902, -152877, 157549, 28282, 99041, 248834, -205900, 68734, 80097, -25117, -94290, -71811, 199069, 171793, -44102, 392629, -150693, 243048, 41744, 108540, 232257, 124691, 39107, 313541, 113254, -20053, 70540, 106257, 129017, -99917, 53374, 58429, -44143, 16621, -143664, 211725, 105043, 127510, -2372, 274571, -226054, 71031, 352488, 365424, 73829, 302450, 60323, 91872, 194029]
12181A94029b69680A82879e4011B29458a29582k7080B77061G4895k9066L66220
12171D12049A95254I0823L1409c13510B58873R8407j69462k4237l2833J2331P1930
12160B15009A9273J94599l8447D6641a97501B83315q4724c3587B46882q4555E6647
12148A64618d717j29389C2806A5649P4580c41958A0027K65290a10954A00812c45945
12136a0094D02356H7088a32257k5765J3968D4484i3482C52847A71048a50695D3514
12124c41302a1937B9377J2203J35782N64a59478A72303L0229K16747p2471e4749
12112A65338M0156a2594j08404A00820J19933a46791C94392I2630B2894J34906
12102A57800k1712k2455J44103N6754j22279f0697j41084E7437a68359A45715
$$ y = [194029, -269680, 182879, -54011, 229458, -129582, -156662, 277061, 74895, 45829, 412049, 195254, 90823, 122232, -313510, 258873, 357280, 187818, 163581, 130748, 143079, 215009, 19273, 213872, 175425, 46641, -197501, 283315, 198591, -33587, 246882, 162327, 56647, 164618, -4717, -134106, 32806, 15649, 90229, -341958, 10027, 275317, -110954, 100812, -345945, -10094, 402356, 87088, -132257, -158022, -144054, 44484, -93482, 352847, 171048, -150695, 43514, -341302, -11937, 29377, 41580, 177362, 177926, -159478, 172303, 202532, 419279, 346808, -54749, 165338, 205494, -12594, -120998, 100820, 220753, -146791, 394392, 92630, 22894, 157800, 136088, 113633, 257736, 314490, 192211, -60697, -201781, 57437, -168359, 145715]
12091B65529f832A81481H7265B5526J35058g293k50770B11540l1203p0865D7803
12079a31802B2866J82799A4218J41941b0201m7182L870L178I4644J41415c8815
12067A50859L0474C802N9519J20417f1064B50548K5429a23963F7116b02415B26914
12055G9804a14889L9438f780H730e5170A95100c74691A55156a6291j59961O2482
12044a13770k1200H8803a57113A10417l7069a8023j3811A99838A5829J04164a89569
12032c7656l0478k4407l5297A27314b50128D8569J57308D3158E349L10211G0088
12020B19548p7182o8052A9843J52350F1141A4346M98652a7298C0989L8536R2874
12009A62399j3265c3207D40315A54669c0755D5214N4605a37304K3846A01675J25671
$$ y = [265529, -6832, 181481, 87265, 25526, 160584, -7293, -258063, 211540, 180337, 109472, 47803, -131802, 22866, 205665, 14218, 156159, -20201, -67383, -63513, -60335, 94644, 236059, -38815, 150859, 181333, 3802, 63321, 183738, -61064, 250548, 275977, -123963, 67116, -202415, 226914, 79804, -114889, -75451, -6780, 8730, -55170, 195100, -374691, 155156, -16291, -176252, -113770, -134970, 88803, -157113, 110417, 73348, -18023, -31834, 199838, 15829, 119993, -189569, -37656, -68134, -92541, -127838, 127314, -250128, 48569, 205877, 43158, 5349, 315560, 70088, 219548, 142366, 74314, 19843, 172193, 61141, 14346, 512998, -17298, 30989, 69525, 162399, 149134, -33207, 440315, 154669, -30755, 45214, 99819, -137304, -113458, 101675, 227346]
11998B27346b12958J01396A5306L09298b9725p296l5173j31193M4399d579l5577
11987d0156H4646b0449E3532F356f6649C3588c6271B37634b04127j7068A89929
11975A19053J26192m1704a52878P1896k6344A2545c5458j27700B11182b11423
11964A4223a25785a1072B24673a94997A23204P986F4669b42261i1859j82521A1345
11952h0138j51106B12910k0893a76227k6287E4898K8083E079i0826A79115Q9938
11941B69053A03200b39579A53549C0716R089j0110c19451J09230q709J07464L977
11930a07489n3984M9245l9915p1215A70411J55424a29622D2356i466C11894M0204
11919C52098e011F8000K5692L39361B0958c95605b7847r2480D1417K60679b8987
$$ y = [227346, -212958, -111562, 15306, 324604, -29725, -37021, -72194, -203387, -158988, -4579, -40156, 84646, -20449, 53532, 6356, -66649, 33588, -36271, 237634, -204127, -221195, 189929, 119053, 245245, 203541, -152878, -80982, -107326, 12545, -35458, -163158, 211182, -211423, 14223, -125785, -11072, 224673, -194997, 123204, 131190, 64669, -242261, -91859, -274380, 11345, -80138, -231244, 212910, 192017, -176227, -202514, 54898, 82981, 5079, -90826, 179115, 269053, 103200, -239579, 153549, 30716, 39805, 29695, -319451, -210221, -218930, -111466, -107489, -161473, -112228, -152143, -223358, 170411, 325835, -129622, 42356, -9466, 311894, 352098, -5011, 68000, 93692, 433053, 20958, -395605, -27847, -120327, 41417, 302096, -28987]
11907f9216J5202A76514h0762B91223A36155c22238Q5819e4245A36745J44798
11897B81543F7915b18522a7863B06211b01034j5370B51068b57430h6749K3148
11887f3601j20334A81303c71071B16889I8459A0030i3346B34606J4481b9234A97040
11875i7385B6025g3285q201i621I6335K7766b37265A01048P7905a82840B68409
11863d3462B06682a81800c2346j74099A62257p5589b13921A11886O0003L574b7447
11851B9644f2070Q183j71305A92836E8234b4072A02860b40692J13058m7564M8385
11840a26813j09133B90784d0481C83505a62270E642f6713A9136J84318a98221
11829I1556D4601a29383A03951d33444g1744G4544c9324j57700i8415j8579J1935
$$ y = [-69216, -54014, 176514, -80762, 291223, 136155, -322238, -236419, -54245, 136745, 281543, 67915, -218522, -17863, 206211, -201034, -216404, 251068, -257430, -86749, -63601, -183935, 181303, -371071, 216889, 98459, 10030, -93346, 234606, 249087, -29234, 197040, -97385, 26025, -73285, -81486, -9621, 96335, 124101, -237265, 101048, 178953, -182840, 268409, -43462, 206682, -181800, -32346, -206445, 162257, 86668, -213921, 111886, 171889, 175463, -27447, 29644, -62070, -53887, -225192, 192836, 58234, -24072, 102860, -240692, -127634, -175198, -126813, -235946, 290784, -40481, 383505, -162270, 5642, -66713, 19136, 203454, -198221, 91556, 44601, -129383, 103951, -433444, -71744, 74544, -39324, -197024, -98415, -116994, -105059]
11818a05059A81184F8565c28146A42486a36553e5172k51991f0092A01110b2814
11807A84930r1101N1687e1482o9815A15497J36956r4335a8344A9064L69474b44151
11795B55365b02487H3432a70567f9560o367A56277p4332M1522a18581M1777a8030
11783g5549k78010a0665p0970H8761a11519A0731a98105c4083A99046a92831A96235
11771B72043j32656J95982c8794j1284p923j00332A92884c71644A35135b76455
11760F2666I962f7504A73069h2225n3755F4359a12856k03328i6223A66134d3466
11748D467J55299E197a51740r1059e9680C87878a86989C76534d8880A01425N409
11737A06834L2652a87167A95713p7863c91560c9832m7630j78745P5874A09036
$$ y = [-105059, 181184, 68565, -328146, 142486, -136553, -55172, -307163, -60092, 101110, -22814, 184930, 93829, 145516, -51482, -121297, 115497, 252453, 158118, -18344, 19064, 388538, -244151, 255365, -202487, 83432, -170567, -69560, -75927, 156277, 81945, 123467, -118581, -76804, -18030, -75549, -353559, -10665, -81635, 88761, -111519, 10731, -198105, -34083, 199046, -192831, 196235, 272043, 139387, 335369, -38794, -50078, -58001, -158333, 192884, -371644, 135135, -276455, 62666, 9962, -67504, 173069, -82225, -135980, 64359, -112856, -316184, -96223, 166134, -43466, 4467, 159766, 5197, -151740, -242799, -59680, 387878, -186989, 376534, -48880, 101425, 106834, 139486, -187167, 195713, 117850, -391560, -39832, -87462, -266207, -190333, 109036]
11726a12237B31160a52402A14148J23360c9513k12863A26711d02443E9506k3104
11716C6402a18068A56913a5906o1815j37204j15549H2830a27232H0954J26017
11706B06971C0827a17545F9814b4614j4306C6730e5268C4163a64520c1865k13488
11695b45353H5861c00179b1473B871h4925D6416J92088H0745g1115A96536f466
11683F3881B0845e5818b4199l8637m5654A41798h9892B0916b63762A56314e3018
11671H2723k16p938O5179r58J7517g0972C6671K24754G5369L77346h6158C06505
11658A26146K10943g5289c1408B34316b76366A83193J10655d5141A60366L7401
11648A97767m8567K87578a20010b6259j74776B05284r9850d29275K14557f7847
$$ y = [-112237, 231160, -152402, 114148, 237508, -39513, -252376, 126711, -402443, 59506, 36402, -118068, 156913, -15906, -77721, -214925, -330474, 82830, -127232, 80954, 206971, 30827, -117545, 69814, -24614, -38920, 36730, -55268, 34163, -164520, -31865, -245353, 85861, -300179, -21473, 2871, -84925, 46416, 238504, 80745, -71115, 196536, -6466, 63881, 20845, -55818, -24199, -62836, -108490, 141798, -89892, 20916, -263762, 156314, -53018, 82723, 82507, 74569, 139748, 138790, 156307, -70972, 36671, 261425, 75369, 452715, -86158, 306505, 126146, 337089, -75289, -31408, 234316, -276366, 183193, 293848, -45141, 160366, 197767, 149200, 436778, -120010, -26259, -201035, 205284, 105434, -429275, -214718, -67847]
11637A04700a62131g8953n4216m5068B2845J22753B7000d7021N111B8200a96453
11625B27738l6177n0965B3673i4934I1846D3962L0207b28417J8862c2991G4841
11613i1829H1102d7068c895B9528J10010a8044r3740o435I4417h448E4952Q3966
11601A38918j4655j3449g2779A59303b26060A10420a60616A92562f0175n4824
11591a14999A52638e6722K3910n9568k8818A90751j3945d11410A48367p3830K97490
11580C72027D1145b33156i1754B20131a10219H4037q347K30585C0431Q9470g7482
11568a34777J9629B33187A1791a3406G8281a01485a5104A32433B6540K219J24562
11557A53321a09608E0634M5124R5373h1627B00677r3905j4468m0269b04347A28038
$$ y = [104700, -162131, -78953, -133169, -178237, 22845, 145598, 27000, -47021, -41910, 28200, -196453, 227738, 191561, 140596, 23673, -94934, 91846, 43962, 74169, -228417, -209555, -32991, 74841, -91829, 81102, -47068, -3895, 29528, 139538, -18044, -111784, -118219, 94417, -8448, 54952, 138918, 124263, 110814, -72779, 159303, -226060, 110420, -160616, 192562, -60175, -114999, 152638, -56722, -32812, -92380, -121198, 190751, 176806, -411410, 148367, 74537, 372027, 41145, -233156, -91754, 220131, -110219, 84037, 75690, 306275, 30431, 119901, -77482, -134777, -115148, 233187, 11791, -13406, 78281, -101485, -15104, 132433, 26540, 28759, 153321, -109608, 50634, 95758, 191131, -81627, 200677, 106772, 92304, 52035, -204347, 128038]
11545F326J01352c23115F8985K00672N8584j12580H9985f8015j63523H1401c0693
11533A11754K8076b17768K6030A9485a04832A94784L6154P3626I52c29760c8695
11521C2035P134O374J10308f7577r8956f6963j19150E0110K34795j14963a09A15479
11508a04726o1457G7532H705J0442J58334B0802a69199B77343A19410k3446b17769
11496D33341A34139n0929g8651B61585r2042n8524K6398J14684C230c8169C28258
11484b99347I2165J42648J9228H35J87454i7439p7817f7186D3442L81709A35652
11472b9541m8820J8564A53396i5052a7139B0446J60351c3295q2284B39627a97510
11460D46535F49b8929K91k33115k0805B92011a4966A09038c16098a22368K7379
$$ y = [6326, 107678, -323115, 68985, 269657, 328241, 215661, 89985, -68015, -231538, 81401, -30693, 111754, 139830, -217768, -191738, 19485, -104832, 194784, 230938, 304564, 952, -329760, -38695, 32035, 39169, 45543, 155851, -67577, -166533, -66963, -186113, 50110, 284905, 169942, -109, 115479, -104726, -166183, 77532, 8705, 19147, 177481, 20802, -169199, 277343, 119410, 95964, -217769, 433341, 134139, 83210, -78651, 261585, 169543, 111019, 137417, 252101, 3230, -38169, 328258, -299347, 92165, 234813, 254041, 835, 188289, -97439, -175256, -67186, 43442, 425151, 135652, -29541, -78361, -59797, 153396, -95052, -17139, 20446, 180797, -33295, -115579, 239627, -197510, 446535, 649, -28929, -28638, -261753, -282558, 292011, -14966, 109038, -316098, -122368, -94989]
11449i4989c3368n172m7905B79825c04350g5108G3748a6556k62134A71992a21704
11437B83900p013f4849m1692L102A72113n3660J28717B5978j2604K892d7855K2746
11425b5109C5111A6313J05812b00920B19116K2828b2356A3059J7358c68371a26992
11413d8614j75219j87383A67308A7019O632c00059f456j48128f7563C45071a2347
11401a05684B04639I7563j1596b10014F0061K29978a10532k0845D0122b38658
11390g0684A86318i6446o8548C477J08516N3629D4466d8617p3848M9925A0547
11378e1328A50448a99206e1784B98945I8133L4966R3347g7344j14500i0988n1239
11367a42227H3962a65270G2556a02163j8418A18706N3896a43596A6250h0173a6248
$$ y = [-94989, -33368, -38540, -86445, 279825, -304350, -75108, 73748, -16556, -278690, 171992, -121704, 283900, 276887, -64849, -106541, -103439, 172113, 118453, 247170, 25978, 13374, 16266, -47855, -25109, 35111, 16313, 122125, -200920, 219116, 241944, -22356, 13059, 30417, -368371, -126992, -48614, -223833, -411216, 167308, 17019, 23651, -300059, -6456, -154584, -67563, 345071, -12347, -105684, 204639, 97563, 85967, -210014, 60061, 290039, -110532, -131377, 40122, -238658, -70684, 186318, -96446, -164994, 3477, 111993, 165622, 44466, -48617, -122465, -72540, 10547, -51328, 150448, -199206, -51784, 298945, 98133, 133099, 226446, -77344, -191844, -90988, -142227, 83962, -165270, 72556, -102163, -120581, 118706, 172602, -143596, 16250, -80173, -16248]
11355a80630o0804a11021j6629D04404h600F068d171k97150G3656J07348e7883
11343b51024A30126A2490a2793A0296b2041l0608D413b2097E6192e1558A92831
11331G9835g8546j41627A34482c3616d97j24065c4288A49758a98731B09259i083
11319E6336c41674B39618O155C9628b37206B03205l8646a20689L9963l4311C09386
11307a7414C04416j37340a0002B50371c4116B23225b17993A50414C5589K56495
11297B92084h3185J1735a4821A71284h0533j88932g4310A06670j3952i0997M3184
11286d7813j52237k09796J07223q0038A24246b18101D9599K01283c99509a31420
11275A0456d9167B52929a58560n9590j60947d7473B27246a3345I9473J1265d6528
$$ y = [-180630, -241434, -111021, -127650, 404404, -8600, 6068, -4171, -301321, 73656, 181004, -57883, -251024, 130126, 12490, -12793, 10296, -22041, -52649, 4413, -22097, 56192, -51558, 192831, 79835, -78546, -220173, 134482, -33616, -497, -124562, -34288, 149758, -198731, 209259, -9083, 56336, -341674, 239618, 245773, 39628, -237206, 203205, 164559, -120689, -80726, -115037, 309386, -17414, 304416, 167076, -10002, 250371, -34116, 223225, -217993, 150414, 35589, 292084, -83185, -71450, -14821, 171284, -80533, -269465, -74310, 106670, 92718, -90997, -47813, -200050, -409846, -302623, -382661, 124246, -218101, 49599, 250882, -399509, -131420, 10456, -49167, 252929, -158560, -218150, -379097, -47473, 227246, -13345, 99473, 110738, -46528]
11263a09057j95187h7343B5834h6132J0776j14346C9381h4042F367a40947B65203
11251a72035L094g7938E0680O6199j6984J65364a45890a7218C50868A568a7493
11239d4604k90813A98851F922e9150B9749m394J78741a48202f4924K5231A1152
11227A8622Q8240A0145a81660J2250M3385N3193k3241j47811C54588a6456B00251
11215A46094e1656H6083k0629P5828J47866r5467g2901C3136A5790i8820A30349
11203b07364f2776k97742A0237J79638F3811R6973A06J34973P7658b18400A63339
11191A94116J91773a94759M6460J5447K4835j91156J24537F8235f8053A11483
11180F7035a96275I0661b72595a22515A55385J9654a72321B95872D8142c05446
$$ y = [-109057, -304244, -87343, 25834, -86132, -75356, -189702, 39381, -84042, 6367, -140947, 265203, -172035, -168941, -77938, 50680, 116879, 99895, 265259, -145890, -17218, 350868, 1568, -17493, -44604, -335417, 198851, 6922, -59150, 29749, 25355, 204096, -148202, -64924, -39693, 11152, 18622, 106862, 10145, -181660, -169410, -126025, -72832, -96073, -243884, 354588, -16456, 200251, 146094, -51656, 86083, 65454, 141282, 289148, 193681, -72901, 33136, 15790, -98820, 130349, -207364, -62776, -360518, 10237, 189875, 63811, 160784, 106, 135079, 212737, -218400, 163339, 194116, 385889, -194759, -148299, -132852, -108017, -299173, -174636, 68235, -68053, 111483, 67035, -196275, 90661, -272595, -122515, 155385, 175039, -172321, 295872, 48142, -305446]
11169F861L94331g352B06326G2821L7770I083J94149D9884j1622d3801I8967b81915
11156I8469O4221G9771a42051A91581h5253a0391C527a33528k03520H3089b13771
11144f5154n6681J0724j96277I9226i1740k06957G8826h0766A27234a75977a6543
11132f5661j66312J5283H0329Q1713c3284j14642f7885J8284F4894a39374Q821
11121a30553j39852M2190F989K021e8211B04963e4851j76287A94433A1339b04545
11109A48662h941B7416c0107k9211A33967c104j17919B32883q5164a61297m9211
11098b10508i7288B48752E442K68773H7401J9599b6101E4232J27970c3047a4638
11086G8014a44269E1937b78900H7084K66524E4235N0796J03595E600J42158K4285
$$ y = [6861, 401192, -7352, 206326, 72821, 110591, 9083, 203232, 49884, 38262, -43801, 98967, -281915, 98469, 162690, 79771, -142051, 191581, -85253, -10391, 3527, -133528, -337048, 83089, -213771, -65154, -121835, -111111, -307388, 99226, -91740, -298697, 78826, -80766, 127234, -175977, -16543, -65661, -231973, -216690, 80329, 162042, -33284, -147926, -67885, -49601, 64894, -139374, -130553, -270405, -228215, 6989, 9010, -58211, 204963, -54851, -231138, 194433, 11339, -204545, 148662, -8941, 27416, -30107, -59318, 133967, -3104, -121023, 232883, 147719, -161297, -210508, -97288, 248752, 5442, 274215, 87401, 107000, -26101, 54232, 182202, -33047, -14638, 78014, -144269, 51937, -278900, 87084, 353608, 54235, 105031, 208626, 5600, 147758, 172043]
11075A72043a36964G1979a30961M2174I4280O7955J43146r8762M5764L54435E8877
11063B94122E8758J70044P9294I804g8534C53812J17620j10590L9411A83482K97584
11052D81066K32594k82798j89177J80422K43936k56630K20478j68905p6486L20863
11042G05363B71623M44324k21747A87891M06192k91079L47038B75105j14233M07061
11032E67933A29602L30116N5841N1479p2337J54569j49412l1339l9775k4862j17881
11021B86001J39568O6064j11480K55498k70277Q7460I4135K87688A02916K93030
11011C95946K28232m2671k30832j61300J20637j46140L10669k29374J16019J04922
11001D66108j74406l1579K79724I7441L19444R3825A30137M15809l373J09156
$$ y = [172043, -136964, 71979, -130961, -88787, 94280, 162235, 305381, 206619, 252383, 606818, 58877, 294122, 58758, 228802, 308096, 9804, -78534, 353812, 471432, 360842, 400253, 183482, 481066, 713660, 430862, 241685, 422107, 666043, 409413, 629891, 460986, 384500, 705363, 271623, 715947, 494200, 187891, 594083, 303004, 650042, 275105, 160872, 567933, 129602, 459718, 515559, 567038, 494701, 649270, 499858, 468519, 428744, 403882, 286001, 425569, 491633, 380153, 635651, 365374, 452834, 94135, 381823, 102916, 395946, 624178, 581507, 350675, 189375, 310012, 163872, 474541, 245167, 361186, 466108, 291702, 260123, 539847, 97441, 416885, 510710, 130137, 545946, 542573, 651729]
10991F51729k16500J81374j74297q452j41442O8334K96489l28331K38505J68235
10981G35644J08198l83573L67825L7586j19701K00974J46479j40384O390K57150
10971A216588j92285L99484O9280J69378J05050o1128o3095k74861j82449P7041
10961A263003j10635p1231M5247j62268L3904J53313Q3319k0824m09818M32362
10951A236372j5897P0129k75810k00096n4086j16376j21308k41304K47989k61592
10941B68021n3148j6937j8921m8493J73224j1117b764l0518A62040k0542f3936
10929C76964A05085D5435J86667J40558D9217c39693A04273M6196K3731q1627
10919I2573k9679h3940B86641f8147j89356C61651A12047a03012B42427C5532
$$ y = [651729, 435229, 616603, 442306, 433854, 292412, 360746, 657235, 328904, 567409, 735644, 843842, 460269, 828094, 865680, 745979, 946953, 1093432, 953048, 959438, 1216588, 1024303, 1423787, 1493067, 1662445, 1767495, 1706367, 1643272, 1368411, 1185962, 1263003, 1152368, 1081137, 1126384, 964116, 998020, 1151333, 1234652, 1213828, 804010, 1236372, 1220475, 1290604, 1014794, 814698, 760612, 644236, 522928, 281624, 529613, 268021, 214873, 197936, 179015, 130522, 303746, 292629, -2764, -33282, 162040, 141498, -63936, 376964, 105085, 45435, 232102, 372660, 49217, -339693, 104273, 150469, 174200, 92573, 62894, -83940, 286641, -68147, -257503, 361651, 112047, -103012, 242427, 35532]
10908g4643k3881B88670I7162j3519b07364j1000B08524D03a63181B73886B6511
10896b13601e9111k26153i4258j25856A77681l5861a13560A32622B0403K61497
10886B81900G5848A0321J6610i0066m39982B17964a81045C11445h6276k25411
10876c11687J10520H185R3323b7598I6671a73018e07j88026J5445k21267D0542
10864e0115B33711h7376r4995j81265C1941a44221N4313R425G6451f8014B23521
10852c93469i6317k86376A10634e400B9791K48077B1404J37594d2404n9359c5842
10840d128B3466a37432G1040J8266b64739B55226a12731K59J3462j08046P1250
10829a35806j86321A37926J1147l2027Q0705h1369B51665b2432m9A4371F232M41223
$$ y = [-74643, -98524, 288670, 97162, 83643, -207364, -218364, 208524, 403, -163181, 273886, 26511, -213601, -59111, -285264, -94258, -220114, 177681, 141820, -113560, 132622, 20403, 281900, 75848, 10321, 26931, -90066, -530048, 217964, -181045, 311445, -86276, -311687, -201167, 8185, 101508, -27598, 96671, -173018, -507, -188533, -173088, -394355, 40542, -50115, 233711, -87376, -182371, -363636, 31941, -144221, -89908, -80483, 76451, -68014, 223521, -393469, -96317, -382693, 110634, -5400, 29791, 277868, 21404, 158998, -42404, -101763, -35842, -4128, 23466, -137432, 71040, 89306, -264739, 255226, -112731, -112472, -99010, -207056, -135806, -322127, 137926, 149073, 117046, 197751, -81369, 251665, -22432, -22481, 14371, 6232, 447455]
10817D47455b177j72697j46141N9358A0323f0362k25811q3540c2584J1061A97131
10805c3505K804G0329j3425a91026n7747c2018C326J98362b48490i1181m8935
10794a40116q3736B51503a23314I156a82237c4922n3179J6928K8355i771j63055
10783a72826A21181a04286b5919l2635J2681C1703i0080L5617j39737h4520D54200
10771c54085a51943M7695B84174A7189M9839a75594j32295A45798a24944F6481
10760A85466d53987C2005a47890n6891i5395B46292J1130b18515I076c706j30197
10749a33903d6389j82474j93443A67782p4656m4680B1165b9350k17592b0592G7311
10737b46175D8766a4832B40500e40427I60J22323a24077K4547K1202A19075b02543
$$ y = [447455, -2177, -174874, -321015, -261657, 10323, -60362, -286173, -369713, -32584, -21523, 197131, -33505, -30701, 70329, 56904, -191026, -248773, -32018, 3326, 201688, -248490, -91181, -140116, -223852, 251503, -123314, 9156, -182237, -34922, -88101, -71173, -42818, -9771, -172826, 121181, -104286, -25919, -58554, -45873, 31703, -90080, -54463, -194200, -84520, 454200, -354085, -151943, -104248, 284174, 17189, 67028, -175594, -307889, 145798, -124944, 66481, 185466, -453987, 32005, -147890, -204781, -95395, 246292, 257422, -218515, 9076, -3706, -133903, -46389, -228863, -422306, 167782, 93126, 48446, 21165, -29350, -246942, -20592, 77311, -246175, 48766, -14832, 240500, -540427, 960, 123283, -124077, -99530, -78328, 119075, -202543]
10725i5952A04b84434E2486P1009l1474b44130E5157J62849b20193I5669A1630
10713a69303j48988g6465j72811h4214j7338N0757j36140B04113a97520m5867
10703b43387L819f6768k8110C6509i0023j98162J08255j8601F4764d1409F9235
10691D7960e3061r8441K3344o9964g0001A82759b32219H2548f8521K6202j4299
10680e6618k6149A50689e6205a1575j62360J141j71275B17202j00024e4077A18493
10668H6040P0979a38713D3907h2422k27093J29224F8162n5a06250b4857F8616
10656G9707c23146a44340b1305k2869A50966a2558q4518d1188p6222H42Q5794
10645H6636P1959b55391J23554l15822G4088d9571M177A11357a11209j46283j17218
$$ y = [-95952, 104, -284434, 52486, 123495, 92021, -244130, 55157, 218006, -220193, 95669, 11630, -169303, -318291, -76465, -249276, -84214, -101552, -50795, -186935, 204113, -197520, -243387, -239568, -66768, -94878, 36509, -90023, -288185, -179930, -198531, 64764, -41409, 69235, 47960, -53061, -151502, -128158, -198122, -70001, 182759, -232219, 82548, -68521, -42319, -56618, -82767, 150689, -56205, -11575, -173935, -172794, -344069, 217202, 117178, -54077, 118493, 86040, 157019, -138713, 43907, -82422, -309515, -180291, 68162, 68107, -106250, -24857, 68616, 79707, -323146, -144340, -21305, -44174, 150966, -12558, -97076, -41188, -117410, 842, 86636, 158595, -255391, -131837, -447659, 74088, -49571, -45394, 111357, -111209, -257492, -374710]
10634c74710J43820j78464a00873C521K39388C2925b17082B0829K3397Q053k1259
10623C1020a3401B02670d8181F812L46923b039q3199A93457A1892a27127A2628
10611b973o3273l23371J66006n3392c8671a3614j09710B5127K806M923a91044
10599E2505J56873i3887M1694L102H9558l3181b86315j01206D3293b19736m2814
10588b62550A38609a15397l5784N5934c5738R469k81918Q8689A63116D8336a6513
10576b54868a17927a0134p541B09231c3196B9150L49523a75911e6289E2301c65879
10564f9581A23218a90417M6194A70824J01694c8781g639F97a40069B1543K424
10553B3967d8634k4017r7644a6016o8983j93473d5316j82130e4232B10282i7610
$$ y = [-374710, -230890, -409354, -100873, 3521, 242909, 32925, -217082, 20829, 44226, 52279, 31020, -13401, 202670, -48181, 6812, 353735, -2039, -85238, 193457, 11892, -127127, 12628, -2973, -66246, -389617, -223611, -277003, -38671, -13614, -123324, 25127, 27933, 32856, -191044, 52505, 209378, -93887, -52193, -49091, 89558, 56377, -286315, -387521, 43293, -219736, -262550, 138609, -115397, -151181, -95247, -35738, -26269, -308187, -219498, 163116, 48336, -16513, -254868, -117927, -10134, -17675, 209231, -33196, 29150, 378673, -175911, -56289, 52301, -365879, -69581, 123218, -190417, -144223, 170824, 272518, -38781, -7639, 697, -140069, 21543, 23967, -48634, -72651, -170295, -16016, -84999, -278472, -45316, -227446, -54232, 210282, -97610]
10541a07245j63681R376G3018c837l17171A44552a31279i572I3666a88709a9306
10529a03548j9706i4k7381j79391b3359E7651A8389b23833F1982b44797q0472
10518c25269I3302c5806B87216b90712Q7574h0497o2731B52697E3383O8298J1970
10507A33651c29560A0011a44707n6183B8457O4884a66119j16617A64942E7379
10496I1123b53038I7681e2144a5087G7842j0742g2991j92558F5164M4149a28832
10484A75759c9431O231I2824B0263c29398H8234A9497a8267B42647P765K5617
10473B76029J3349L8115j21988a24800m9458A02964a26804b0590n5317A26350
10462f3383m3276D19945C1645a64653L6575I2715l4512b20422j40834a33967B71843
$$ y = [-107245, -270926, -261550, 73018, -3837, -321008, 144552, -131279, -9572, 93666, -188709, -19306, -103548, -123254, -94, -27475, -206866, -23359, 57651, 18389, -223833, 61982, -244797, -325269, 93302, -35806, 287216, -290712, -203138, -80497, -143228, 252697, 53383, 121681, 133651, -329560, 10011, -144707, -200890, 28457, 93341, -166119, -282736, 164942, 57379, 91123, -253038, 97681, -52144, -15087, 77842, 67100, -72991, -265549, 65164, 109313, -128832, 175759, -39431, -33200, 92824, 20263, -329398, 88234, 19497, -18267, 242647, 250412, 276029, 289378, 327493, 205505, -124800, -174258, 102964, -126804, -20590, -75907, 126350, -63383, -106659, 419945, 31645, -164653, -128078, 92715, 58203, -220422, -361256, -133967, 271843]
10450a06045K2221p204l33969I1045J52759G0157K49011d6358A63660a24457m4727
10439a69184N1779L8663A20609c2426j05697j05913R194R791p9635f6852A893
10427f2992a0993C15227j33276m8907f0012j44115A80514c8120J7382B023J44140
10416A46163a12966a113n0308j04311B32196L5196D2066M585b41735c9015a578
10404c74956M3987J60548E0164A4176K31213a76225n7073J00196j26850A74514
10393a81412A17014J460b61133E06847i7290n9145D1911a24576f1224A3785a12067
10381F860c9065a0608k02836I4487B8403J04449J48134a2487A38171F3447M1273
10370A04720a3184I0204F918M21158I9781M07113j02897A84364J73982j48640
$$ y = [-106045, -83824, -91028, -424997, 91045, 243804, 70157, 319168, -46358, 163660, -124457, -169184, -117405, -78742, 120609, -32426, -138123, -244036, -234842, -225051, -304686, -66852, 1893, -62992, -10993, 315227, 181951, 133044, -60012, -204127, 180514, -38120, -20738, 2023, 146163, -112966, -1113, -51421, -155732, 232196, 267392, 42066, 46651, -241735, -39015, -1578, -374956, -330969, -170421, 50164, 14176, 245389, -176225, -233298, -133102, -259952, 174514, -181412, 117014, 118474, -261133, 506847, -97290, -156435, 41911, -124576, -61224, 13785, -112067, 6860, -39065, -10608, -213444, 94487, 28403, 132852, 280986, -12487, 138171, 63447, 104720, -13184, 90204, 6918, 428076, 99781, 506894, 403997, 184364, 358346, 209706]
10360B09706j7402J04181e071A90033J4513J7110j4030Q2591D1371L4972i8823
10348B60326K60294j03061j39472a5516A85793e6131l7030C50819f315l86A04035
10336B25125a9999j53072o4718B56703a12297j01034H5008j5462g6527j40795
10326b17322A48352i9908L2106B32918H8588h8033A63443M28522E4015L44607
10316C98622A81841m9521i3626I0175J38923a09220j53881e8118D6971J62390
10306B09361n3056a91908B73803a46409G3436b64006a08746o064B95875A28178
10295d30368A9262K50589b9261J0958A38172P849a99172B22033J3665a00277F1438
10283b30991J00415d0496h330j76439j8988B7881e6848F1760a6948j70836b8116
$$ y = [209706, 192304, 296485, -5071, 190033, 204546, 221656, 207626, 290217, 41371, 76343, -98823, 260326, 520620, 417559, 278087, -15516, 185793, -56131, -93161, 350819, -6315, -6701, 104035, 225125, -19999, -173071, -237789, 256703, -112297, -213331, 85008, 69546, -76527, -217322, 148352, -99908, -67802, 232918, 88588, -88033, 163443, 591965, 54015, 398622, 181841, 132320, -93626, 90175, 229098, -109220, -263101, -58118, 46971, 209361, 156305, -191908, 273803, -146409, 73436, -264006, -108746, -114810, 295875, 128178, -430368, 19262, 269851, -29261, -18303, 138172, 146021, -199172, 222033, 235698, -100277, 61438, -230991, -130576, -40496, -8330, -184769, -203757, 27881, -56848, 61760, -16948, -187784, -28116]
10271b86636B69028a86057a7580B01250e8672A04863e3448h087l2632j02741B18282
10259a9160q6712M5976j1977F5153L23543l4252o5290j10665p3179h5888A18996
10247I8203c9600B50244C4140J25723h745j54447A43945a21676H3180g2209j55809
10236b28018J5353B80117F8897e3156B8004c9761C3070L0741b80178Q8112I5250
10224b33501e7115B98245d0557C5577a04444a3748j8120J978a986B13021l5944
10213A77077b37642k86949e405I0948J15401a45570L2083l04674A08315b62531
10202A12381k094c19052A20554c1044A57348b26009A40958g6247j50144k7781
10192b54172C5102i5285a0801o0041m7452D3350c76922C4698f8678c565j48686
$$ y = [-286636, 269028, -186057, -17580, 201250, -58672, 104863, -53448, -8087, -40719, -143460, 218282, -19160, -105872, -59896, -71873, 65153, 388696, 354444, 289154, 178489, 105310, -85888, 118996, 98203, -39600, 250244, 34140, 159863, -8745, -163192, 143945, -121676, 83180, -72209, -228018, -212665, 280117, 68897, -53156, 28004, -39761, 33070, 63811, -280178, -192066, 95250, -233501, -57115, 298245, -40557, 35577, -104444, -13748, -31868, -29890, -1986, 213021, 177077, -237642, -524591, -5405, 90948, 206349, -145570, -113487, -418161, 108315, -262531, 112381, 110287, -319052, 120554, -31044, 157348, -226009, 140958, -76247, -226391, -254172, 35102, -95285, -10801, -70842, -118294, 43350, -376922, 34698, -68678, -3565, -152251]
10181a52251G8639i6925D039J95283h0218B24853e28j41831L8278A40898a3252
10169d17542k5443a16714q6769m0657B72082p6715a04756A15572a06989p5827
10159a82816K9275j74177M1556a20552B46489n6319a17062A75346g4018m2738
10149a16756M6371e590k23475B15062a17951L8005b7282p794r3468O1134l7102
10138a04512C9562d56237C2451Q6993b22194M7337K0292A03443r511e5588B8631
10126b38218l0720A54587L8570b56850i406q2497p0241r7751B2268c7730B0335
10114i8681l5472C90541A38432N3716R2682a76387m149M3244D8536a6855A14392
10102c82010e6150C34831b02030f0332A57603a66278d1601j69788A00661c12256
$$ y = [-152251, 78639, -96925, 4039, 199322, -80218, 224853, -528, -142359, -104081, 140898, -13252, -417542, -442985, -116714, -203483, -244140, 272082, 195367, -104756, 115572, -106989, -182816, -153541, -327718, -286162, -120552, 246489, 190170, -117062, 175346, -74018, -116756, -70385, -5590, -229065, 215062, -117951, -79946, -27282, -35076, -128544, -67410, -104512, 39562, -456237, 32451, 119444, -222194, -174857, -154565, 103443, 93932, -55588, 28631, -238218, -268938, 154587, 193157, -256850, -9406, -91903, -162144, -259895, 22268, -37730, 20335, -98681, -134153, 390541, 138432, 192148, 284830, -176387, -180536, -137292, 48536, -16855, 114392, -382010, -56150, 334831, -202030, -60332, 157603, -166278, -41601, -211389, 100661, -312256]
10091b68526N8871n540f4285B25440a78597J561M1987G6530a7374o07577A05657
10079b28386j23776B28902A7228M3474a06344c9718q475I6866a36946r2357n3164
10068b82467m7200e903A26224a54643l8663f9544Q955D4900a45549M8186A39247
10056i1742A61670k7617c70535i6605H211b08593A15489a1291j96805j4836e2599
10044b87425B26837c36671d9239B63601c21817D2958C358J1433M5650K8018M9051
10033A37510a28446L6496I4580K40379a82125H126b6157B44004b0005A10413a66865
10021A16174a00819j69405i3739A6235e7308j43296G5240a29790j67685A2291
10010a03519b0846B90851H5801k9143N098d9845A28666e764j44296N5981j98894
$$ y = [-268526, -209655, -215195, -64285, 225440, -178597, -177036, -135049, 76530, -17374, -624951, 105657, -228386, -352162, 228902, 17228, 60702, -106344, -39718, -48193, 96866, -136946, -229303, -282467, -329667, -5903, 126224, -154643, -193306, -69544, -60589, 44900, -145549, -97363, 139247, -91742, 161670, 134053, -370535, -96605, 8211, -208593, 115489, -11291, -208096, -222932, -52599, -287425, 226837, -336671, -49239, 263601, -321817, 42958, 3358, 14791, 60441, 88459, 137510, -128446, -91950, 94580, 334959, -182125, 8126, -26157, 244004, -20005, 110413, -166865, 116174, -100819, -270224, -93739, 16235, -57308, -200604, 75240, -129790, -297475, 12291, -103519, -20846, 290851, 85801, 56658, 61756, -49845, 128666, -5764, -150060, -94079, -292973]
9999b92973A80971b9944A32873R6294q8336c07809A45721h5342b2117D8595L8190
9988H6785M6755a23148A90607c10244J12619A23713B305a98799b3983H6607A5495
9976h3789d0423m1732q745J7907p92j06509C3850c27153J24091G8284a7632k42721
9964b60353j7032D7350a59387B4058J6259a77548C9556a33770B5216e2513I5552
9952B7893e3563a755j47282O3460H7442d1193j07702D2608J64387f2875k13409
9941b76284i553j19217A43485b05704c8729A3431J98564b82623g9957Q345p0017
9930a41629a7803A77727h8974A28073e3788o7287C6512K29706c4368D72247f4721
9918D6209b1714A94305D8002K68777A09213a94639F4497c2951o393A66116k3344
$$ y = [-292973, 180971, -29944, 132873, 229167, 140831, -307809, 145721, -85342, -22117, 48595, 86785, 133540, -123148, 190607, -310244, -197625, 123713, 2305, -198799, -23983, 86607, 15495, -83789, -40423, -82155, -90900, -72993, -73785, -180294, 33850, -327153, -203062, 78284, -17632, -260353, -277385, 47350, -159387, 24058, 40317, -177548, 39556, -133770, 25216, -52513, 95552, 27893, -53563, -1755, -149037, -85577, 87442, -41193, -148895, 42608, 206995, -62875, -276284, -9553, -128770, 143485, -205704, -38729, 13431, 211995, -282623, -79957, -71612, -141629, -17803, 177727, -88974, 128073, -53788, -121075, 36512, 266218, -34368, 472247, -64721, 46209, -21714, 194305, 48002, 316779, 109213, -194639, 64497, -32951, -39344, 166116, 142772]
9907A42772c8361l9438B68844j14537K58147b22226h0372H0844a54769A7305a85399
9895c94497a33152B3434a45076o178H6691e9015B03099a49025B83418e1600q1207
9884a32807e8333A65336h1909B21386f9246C9658l417e30463B26866a76506g0586
9872c98717J61271o3603C02372a01027q8380j30370i0815m2853j25657J02348
9862a56977k20802a4134j44233q118f95p547A57471b31168A63755h173l06544
9851c14717A50769d4470j08966C513i1966j10755B5540b3608N157J021m1773C6838
9838B82993c35448g3320j01523B35989c42919e1591E2700f9279B81477b58831
9827a05634k20849F2653K1545a13939B25475a12273o2283l66456b8722K034D92603
$$ y = [142772, -38361, -77799, 268844, 154307, 412454, -222226, -80372, 80844, -154769, 17305, -185399, -394497, -133152, 23434, -145076, -151254, 86691, -59015, 203099, -149025, 283418, -51600, -132807, -58333, 165336, -81909, 221386, -69246, 39658, 36241, -530463, 226866, -176506, -70586, -398717, -237446, -301049, 302372, -101027, -189407, -319777, -90815, -133668, -259325, -156977, -377779, -14134, -158367, -166485, -695, -8242, 157471, -231168, 163755, -8173, -314717, 150769, -44470, -153436, 3513, -91966, -202721, 25540, -23608, -18451, -17430, -59203, 36838, 282993, -335448, -73320, -174843, 235989, -342919, -51591, 52700, -69279, 281477, -258831, -105634, -326483, 62653, 84198, -113939, 225475, -112273, -174556, -541012, -28722, -26688, 492603]
9815C8978J75058b3651k00852m0329A27487A8149n013a86101j57656E731d97828
9803E641K93355g5257n31640B21256G9178a95873O9045j5103A54463g6571j10106
9792a86677Q2903j64920h0139O937A1424a29120k0484c9085m6410j26323H9837
9780c0283a0106A6615N9226c37188h0226k79173i7630j481A98929c3832C00855
9768a13781J3624B04041c85605G7476L9612c0869o8461b2816A45953b98498a39578
9756c03095Q9866i8700A07446c39685q964M8140G6742a83765d8846l081A39533
9744G4420M4709c6086f205k5355m5552H4171i8603p5348f3630F0223b21041a9834
9731A80862a2274n4947l27881B7486c37774B40408b94104B97655j27429C9888
$$ y = [38978, 214036, -23651, -224503, -264832, 127487, 18149, 13136, -186101, -343757, 5731, -497828, 5641, 298996, -75257, -606897, 221256, 79178, -195873, -126828, -141931, 154463, -76571, -186677, -103774, -268694, -80139, -73202, 11424, -129120, -149604, -39085, -85495, -211818, 89837, -30283, -10106, 16615, 75841, -337188, -80226, -359399, -97630, -99111, 198929, -33832, 300855, -113781, -100157, 204041, -385605, 77476, 117088, -30869, -99330, -22816, 145953, -298498, -139578, -303095, -213229, -98700, 107446, -339685, -348649, -300509, 76742, -183765, -48846, -51927, 139533, 74420, 119129, -36086, -6205, -31560, -77112, 84171, -98603, -173951, -63630, 60223, -221041, -19834, 180862, -12274, -67221, -395102, 27486, -337774, 240408, -294104, 297655, 170226, 39888]
9720e8386k06278E3203B4545J14179d0734k7132j22645A09332C6028d9115A42014
9708a20511B11610a54776L168O1852A26779i6421k81433J65518A84235e8513k497
9697f1010l2706A6380K7967d67914b9812A15539B0100Q5982c03442h8244K7635
9686f0609j69754F5909a87938b6374l9839L871o7819K7572A49019c331j59560
9675a62891D2335a91039B6780N7290K0871a07356A25457a43467j42980g1268A38538
9663b78976g3333o1408f1809j68257R7259I5152g1710A70694j8470a3354j2300
9652b5654F6292b76986J0501E4373b17253d9820a4069q3023J4841A37547c54683
9640b71962A01447J32623i8308H6090I429d5061A26544H87a36446a2373F1371
$$ y = [-58386, -264664, 53203, 24545, 138724, -40734, -67866, -190511, 109332, 36028, -49115, 142014, -120511, 211610, -154776, -151608, -89756, 126779, -96421, -377854, -212336, 184235, -58513, -61010, -93716, 16380, 44347, -467914, -29812, 115539, 20100, 106082, -303442, -88244, -60609, -230363, 65909, -187938, -26374, -66213, -62342, -130161, -102589, 149019, -3331, -162891, 42335, -191039, 26780, 84070, 104941, -107356, 125457, -143467, -286447, -71268, 138538, -278976, -73333, -134741, -61809, -230066, -132807, 95152, -71710, 170694, 152224, -13354, -25654, 66292, -276986, -266485, 54373, -217253, -49820, -14069, -97092, -82251, 137547, -354683, -271962, 101447, 234070, -98308, 86090, 9429, -45061, 126544, 887, -136446, -12373, 61371]
9628D447J59564D3743c05143B20000a29881r2051q3810C8743b5960B5561a17634
9616h7435H6048F423M6018a63904e1227r5889A65289E388K51326d8745j17714
9605a66459A30935R5198c84411A11699K3805g7292m1583I4503Q9956G8112a12220
9593B20763l4012M6253D7716O908d8562b1762I7529i0383H3788B9960a9936l50752
9581c70688O6884A18785a36522M3722j36528L181E8306a57614A82603b56004J25503
9570a30501c2345j51942A21134b72476a19471M5723l3195d6699k52710E867e3678
9558A31244N15a2636r9711a2761l21504J19626n0656F6893k2449f6061n8240E0890
9545c68047a66084n6706F5368f5945B00106J25356D1739R1735a00467r1798K2863
$$ y = [4447, 164011, 43743, -305143, 220000, -129881, -221932, -305742, 38743, -25960, 25561, -117634, -87435, 86048, 6423, 52441, -163904, -51227, -147116, 165289, 5388, 256714, -48745, -166459, 130935, 226133, -384411, 111699, 135504, -77292, -118875, 94503, 184459, 78112, -112220, 220763, 186751, 233004, 47716, 54624, -48562, -21762, 97529, -90383, 83788, 29960, -19936, -370688, -303804, 118785, -136522, -92800, -229328, -226147, 58306, -157614, 182603, -256004, -130501, -32345, -184287, 121134, -272476, -119471, -73748, -106943, -46699, -299409, 5867, -53678, 131244, 131759, -12636, -112347, -12761, -334265, -214639, -265295, 66893, 44444, -66061, -124301, 50890, -368047, -166084, -222790, 65368, -65945, 200106, 325462, 41739, 133474, -100467, -192265, -169402]
9534a69402m1135L9916m6225B43890p8548c36852J65799j9356P8957j83131I8735
9522g4999K6016A28349b40178E7519b64171j76532F5244J1601e9640a0332j20635
9511a30967B57357a65778B26997d0600A57826m0043b06011i7192k9124B8487d2677
9499a91829N669d2407K331H8435d77687F6446a41618F6930N0278c02236A3379
9487A48801K24867f3013o8540l1016A0319c0059r5331k7825j98690B3487I826
9475b80885B67547a14685j93063f6354B04753a09442B4819A925a93883D4689K81763
9464C26452i1606o7584n4135A09575a0662n36399J74852C9645b10658B54805e8690
9452a53282L609I3490c72096O0616M2330A14842d9334k41660a21969j53256b6452
$$ y = [-169402, -210537, -170621, -216846, 243890, 165342, -336852, -171053, -190409, -111452, -294583, 98735, -74999, -48983, 128349, -240178, 57519, -264171, -440703, 65244, 76845, -59640, -10332, -130967, 257357, -165778, 226997, -40600, 157826, 117783, -206011, -97192, -126316, 28487, -42677, -191829, -186160, -42407, -40076, 88435, -477687, 66446, -141618, 66930, 117208, -302236, 13379, 148801, 373668, -63013, -131553, -162569, 10319, -30059, -125390, -153215, -351905, 23487, 9826, -280885, 267547, -114685, -307748, -66354, 204753, -109442, 24819, 1925, -193883, 44689, 326452, -91606, -159190, -213325, 109575, -10662, -547061, -372209, 39645, -210658, 254805, -58690, -153282, -149673, 93490, -372096, -311480, -269150, 114842, -49334, -290994, -121969, -275225, -26452]
9440A01377a88990j07233g1633j6291H4173a0277j32094j44148M9216A49167b01983
9428e6889n1192P171k2748n7957j47267g7988j64389f2899B2618J09998j69j596
9416A30851J24243h3180o8447F0657d84615d7980E3454b29877A00287a46958B46810
9404B29570b19222B33152H4253b0357F1086k4806K34656a00993A47498c3592A1435
9392A06838P969f5052m1326m363A3456a69640o9B71615a04210k25690B52413C1043
9379d7323j59327A3113i8586c3601H4160M5827a52020H904a51611A42783A3701
9367a16531k51373A99802a16270G440d15249B63227g3233A1860i164G3594b05077
9355g9560c794p7404j51648m0029j02080d5284m2077k7449A97758b72787a11414
$$ y = [101377, -188990, -296223, -71633, -87924, 84173, -10277, -142371, -286519, -237303, 149167, -201983, -56889, -108081, -100910, -123658, -181615, -328882, -77988, -242377, -62899, 22618, 132616, 132447, 130851, 255094, -83180, -151627, 60657, -484615, -47980, 53454, -229877, 100287, -146958, 246810, 229570, -219222, 233152, 84253, -20357, 61086, 36280, 270936, -100993, 147498, -33592, 11435, 106838, 114807, -65052, -106378, -110741, 13456, -169640, -169709, 271615, -104210, -329900, 252413, 31043, -47323, -206650, 13113, -98586, -33601, 84160, 129987, -152020, 8904, -151611, 142783, 13701, -116531, -367904, 199802, -116270, 7440, -415249, 263227, -73233, 11860, -9164, 73594, -205077, -79560, -3794, -81198, -232846, -272875, -374955, -45284, -87361, -114810, 197758, -272787, -111414]
9343d50383I7433O3136J3066f1542A65764a80148g520o6810b2902G9333k7399
9332E1934a94675J4347B12656D2997a88356c5398A11171l3412d10299B9905J16038
9321A45943k3557c60600a9327k01312A5517K3559d13004e5344k90651c4746p6607
9310a11353A00646m3552Q9235q980c03225d1018B40757g7253E7394b45394e8057
9298a01126m0286O1781I6380a36212A73165L726e322j79042j21039A8976a63155
9286e8791j89988N8487H4732d08424J03275k07015B6835a90242Q8651j5869D1477
9274G9979c41680B81990n5093p1003a6441k70231K0482a02568j38930B4554b75128
9262f9395E6599f8106j6483r3290B01870E7251a74828f3971B06154e1234k60447
$$ y = [-450383, 97433, 160569, 173635, -61542, 165764, -180148, -7520, -74330, -22902, 79333, 51934, -194675, -180328, 212656, 42997, -188356, -35398, 111171, 77759, -410299, 29905, 145943, 122386, -360600, -19327, -220639, 15517, 39076, -413004, -55344, -345995, -34746, -111353, 100646, 57094, 146329, 137349, -303225, -41018, 240757, -77253, 57394, -245394, -58057, -101126, -141412, -79631, 96380, -136212, 173165, 176891, -5322, -184364, -305403, 18976, -163155, -58791, -248779, -190292, 84732, -408424, -305149, -512164, 26835, -190242, -101591, -117460, 41477, 79979, -341680, 281990, 226897, 155894, -16441, -286672, -266190, -102568, -241498, 24554, -275128, -69395, 56599, -68106, -84589, -177879, 201870, 57251, -174828, -63971, 206154, -51234, -311681]
9251c11681B09128b8513j82442K0595b2673l15021B04599F8091a37747f0670a9985
9239e4878A24548M0187E2031P0749c6259E5150c9511A30563E590L4354c20178
9227e0248B14740a33345b6326j3264l25249a24535N5557k4675j76098A41816a08159
9215G0505C1321b84510a31151E1833b58762B0697O4984L1124n0996b21045A05363
9203A17682L6613b95108a25924A01806a69362a7420P340k7842F3468b38794b9022
9191A39283M8168a48411k19815E4414a07392B06516J36311b26988A38892K55958
9181C94850A4547J00887J62815a58731q519l7635A314g4562m1548k63944C4668
9169a6791A07440b35571b9372I7653b90939M5925C0773d9929l9736b3493A00155
$$ y = [-311681, 209128, -28513, -210955, -190360, -22673, -337694, 204599, 68091, -137747, -60670, -19985, -54878, 124548, 164735, 52031, 122780, -36259, 55150, -39511, 130563, 5590, 39944, -320178, -50248, 214740, -133345, -26326, -39590, -364839, -124535, -68978, -93653, -269751, 141816, -108159, 70505, 31321, -284510, -131151, 51833, -258762, 20697, 85681, 116805, 65809, -221045, 105363, 117682, 154295, -295108, -125924, 101806, -169362, -17420, -10080, -37922, 63468, -238794, -29022, 139283, 187451, -148411, -368226, 54414, -107392, 206516, 342827, -226988, 138892, 394850, 14547, 115434, 278249, -158731, -167250, -204885, 1314, -74562, -116110, -380054, 34668, -16791, 107440, -235571, -29372, 97653, -290939, -245014, 30773, -49929, -89665, -23493, 100155]
9157D4619J7409J75669D5868h7285D2218a31377M1005o484r2022H010a57757r1315
9145b49072e3028H1766A1995a21226A90958a67972F8421a71204C55939d17035
9134F611J36748b13103H5179j9156K0571J98655b03357A39103b09851b4060C13169
9122C7905M1189l5216a86647b6036A88353p6524c44391E7721b03869d3695l04525
9111c48220D4456a32170d7734j15310E0590g4506k61970A00667K68288r4469a03478
9099a90867O4318a533j01349A6961i4397k26644J57136j05618o6661j1560a3100
9087c56588B3223K0684e37658d1729J2954k64797B2242a23683J1573B9167d1236
9075C10878c7398k02845P0540L0143O0287G5715a72254A06042b54992A313R3306
$$ y = [44619, 62028, 237697, 45868, -87285, 42218, -131377, -90372, -96856, -188878, 8010, -157757, -249072, -53028, 81766, 11995, -121226, 190958, -167972, 68421, -171204, 355939, -417035, 6611, 143359, -213103, 85179, 66023, 86594, 285249, -203357, 139103, -209851, -24060, 313169, 37905, 79094, 43878, -186647, -26036, 188353, 111829, -344391, 57721, -203869, -43695, -348220, 44456, -132170, -47734, -163044, 50590, -74506, -336476, 100667, 368955, 274486, -103478, -190867, -126549, -1533, -102882, 16961, -94397, -321041, -163905, -269523, -336184, -347744, -13100, -356588, 23223, 43907, -537658, -41729, -28775, -293572, 22242, -123683, -112110, 29167, -41236, 310878, -37398, -240243, -169703, -139560, -79273, 75715, -172254, 106042, -254992, 1313, 94619]
9064I4619d22394a72856f876j2094m9925j70942c2576j556j46273e5986n1232
9053a07218F0481c92941B49201b28574a2274j41378G6479l7568i6007p8563f1800
9041A81568j8335m3635l9490a28691D2124b35400A40546a79516D5945a74467b3121
9029a39309a5632A83154p2777a59433j8675d8017l2301r1312h794A27958c92699
9017B32849A06285b82367G5608a3749F5381O9726o4293c03938O2116R4977B78634
9005b20363B35531c8985A07888a60446P0142D45801A54388E0598M3145b20212
8994e4001p293G7158O5691o9236K1910K1084J33470k641D2003a41665A06510a27130
8981D6611h8151A8623a55445C1791j4058K30638A4098J59013a50244e7402j26553
$$ y = [94619, -422394, -172856, -6876, -18970, -68895, -239837, -32576, -34132, -180405, -55986, -107218, 60481, -392941, 249201, -228574, -12274, -153652, 76479, 38911, -96007, -174570, -61800, 181568, 163233, 119598, 80108, -128691, 42124, -235400, 140546, -179516, 45945, -174467, -23121, -139309, -15632, 183154, 110377, -159433, -178108, -48017, -80318, -171630, -8794, 127958, -392699, 232849, 106285, -282367, 75608, -13749, 65381, 135107, 70814, -303938, -241822, -146845, 278634, -220363, 235531, -38985, 107888, -160446, -90304, 445801, 154388, 50598, 93743, -220212, -54001, -61294, 77158, 142849, 73613, 95523, 116607, 250077, 247436, 42003, -141665, 106510, -127130, 46611, -88151, 18623, -155445, 31791, 17733, 248371, 14098, 173111, -150244, -57402, -183955]
8970a83955f744j82712e4515l5849k9882A79049a23647G1883l1674J6597J41084
8959A97890E4924a49921O367O6556A67288A6541d19942M9466a10773M675E7824
8947D4470a28850l0796e523l566l93289J67296b9522B68940b34865B3529d8682
8935c66425A09240R4760i5085B68932a33294A8141e38407a89750L1060l6120A63787
8923a84863D9790a80533B8002J020698K157152j211634B82089Q560Q4082a12018
8912B82438i4353C18832A48456c72847d9326k08414I698J01100g5135B9752P666
8901C7418R1252M2810n9588c21648N057A36659j348b68735A48733L34364A292
8889b40036f1932j79284E3392k2118b92276G2512a02695b7326D3654R8440J4127
$$ y = [-183955, -6744, -189456, -54515, -90364, -120246, 179049, -123647, 71883, 40209, 56806, 197890, 54924, -149921, -143554, -76998, 167288, 16541, -419942, -370476, -110773, -106098, 57824, 44470, -128850, -159646, -5523, -9089, -402378, -235082, -29522, 268940, -234865, 23529, -48682, -366425, 109240, 204000, -95085, 268932, -133294, 18141, -538407, -189750, -158690, -194810, 163787, -184863, 49790, -180533, 28002, 1048700, 3205852, 1994218, 282089, 290649, 374731, -112018, 282438, -94353, 318832, 148456, -372847, -49326, -257740, 9698, 110798, -75135, 29752, 37418, 128670, 171480, 111892, -321648, -316591, 136659, 135311, -268735, 148733, 483097, 1292, -240036, -61932, -241216, 53392, 31274, -292276, 72512, -102695, -27326, 43654, 142094, 156221]
8878A56221J04698c28335a60792j26158B7352c65899J23076I0801B8235i0962
8867b549A40071b53820A8820b10822Q4823F6346b68937A9286i3358k46317a02420
8855H7201N6955f671k37286Q7980B32888a82742r8507J0695F5307a13059j42509
8844b55568q9038J05416O9194c7440j56085O2482A70536d72791a20975n7372C80
8832A39372m4901J16021a36552E7295K1130n054a88338A7290b55181d4188H0228
8820b86362C8651j3150c84643a15785A93177a91276C08229G9087b8065q3084E6156
$$ y = [156221, 260919, -328335, -160792, -286950, 27352, -365899, -242823, 90801, 28235, -90962, -2549, 140071, -253820, 18820, -210822, -125999, 66346, -268937, 19286, -93358, -339675, -102420, 87201, 144156, -6671, -243957, -155977, 232888, -182742, -281249, -270554, 65307, -113059, -255568, -344606, -239190, -169996, -37440, -193525, -131043, 170536, -472791, -120975, -178347, 380, 139372, 94471, 210492, -136552, 57295, 78425, 73371, -188338, 17290, -255181, -44188, 80228, -286362, 38651, 25501, -384643, -115785, 193177, -191276, 308229, 79087, -28065, -111149, 56156]
$$ [...]
##END NTUPLES=NMR SPECTRUM
##END=
