##TITLE=NES1063_T15_9883190_XKVSV2fwfb
##JCAMPDX= 6.0         $$ Bruker NMR JCAMP-DX V2.0
##DATA TYPE= NMR SPECTRUM
##DATA CLASS= NTUPLES
##ORIGIN= BRUKER
##OWNER= Administrator
$$ 1.72 TOPSPIN		Version 2.1
$$ 2016-08-27 00:12:29.429 -0500  Administrator@X
$$ Compression mode = diff/dup
##.OBSERVE FREQUENCY= 400.02188249412
##.OBSERVE NUCLEUS= ^1H
##.ACQUISITION MODE= SIMULTANEOUS (DQD)
##.ACQUISITION SCHEME= undefined
##.AVERAGES= 64
##.DIGITISER RES= 22
##SPECTROMETER/DATA SYSTEM= spect
##.PULSE SEQUENCE= noesygpps1d.comp
##.SOLVENT NAME= COFFEE_meoh
##.SHIFT REFERENCE= INTERNAL, COFFEE_meoh, 1, 14.96257
##AUDIT TRAIL= $$ (NUMBER, WHEN, WHO, WHERE, PROCESS, VERSION, WHAT)
$$ ##TITLE= Audit trail, TOPSPIN		Version 2.1
$$ ##JCAMPDX= 5.01
$$ ##ORIGIN= Bruker BioSpin GmbH
$$ ##OWNER= Administrator
$$ $$ E:\/data/COFFEE/nmr/NES1063_T15_9883190_XKVSV2fwfb/12/pdata/1/auditp.txt
$$ ##AUDIT TRAIL=  $$ (NUMBER, WHEN, WHO, WHERE, PROCESS, VERSION, WHAT)
(   1,<2016-08-27 00:12:24.258 -0500>,<Administrator>,<X>,<go>,<TOPSPIN 2.1>,
      <created by zg
	started at 2016-08-27 00:00:54.867 -0500,
	POWCHK enabled, PULCHK disabled,
       configuration hash MD5:
       21 0F 79 D6 B3 7B B4 F6 88 20 88 DB 03 48 BD 9F
       data hash MD5: 64K
       DA 1F CC C3 75 1C 38 0F 85 94 C9 35 89 33 F9 70>)
(   2,<2016-08-27 00:12:27.336 -0500>,<Administrator>,<X>,<proc1d>,<TOPSPIN 2.1>,
      <Start of raw data processing
       efp LB = 0.3 FT_mod = 6 PKNL = 1 PHC0 = 0 PHC1 = 0 SI = 128K 
       data hash MD5: 128K
       82 DE 64 A4 FF E6 85 AE EB 67 13 53 95 24 A9 CA>)
(   3,<2016-08-27 00:12:28.226 -0500>,<Administrator>,<X>,<proc1d>,<TOPSPIN 2.1>,
      <pk PHC0 = -82.00195 PHC1 = 0 
       data hash MD5: 128K
       48 6A DE D8 30 18 3F 26 AD 3B C4 2D 83 52 FA 97>)
(   4,<2016-08-27 00:12:28.633 -0500>,<Administrator>,<X>,<proc1d>,<TOPSPIN 2.1>,
      <abs ABSG = 1 
       data hash MD5: 128K
       46 50 04 A3 B1 B9 0F 23 81 61 3D 17 7A A5 90 2F>)
(   5,<2016-08-27 00:12:28.726 -0500>,<Administrator>,<X>,<proc1d>,<TOPSPIN 2.1>,
      <abs ABSG = 2 
       data hash MD5: 128K
       49 C3 95 51 47 EE 56 5C A4 0D F5 3D DD FB 63 8D>)
(   6,<2016-08-27 00:12:28.804 -0500>,<Administrator>,<X>,<proc1d>,<TOPSPIN 2.1>,
      <abs ABSG = 3 
       data hash MD5: 128K
       97 E8 AA AB 92 BD 35 96 57 96 7D F8 DC D3 01 D3>)
(   7,<2016-08-27 00:12:28.898 -0500>,<Administrator>,<X>,<proc1d>,<TOPSPIN 2.1>,
      <abs ABSG = 4 
       data hash MD5: 128K
       A5 F4 0A 13 CA 7B B6 48 05 13 36 4E 84 52 57 67>)
(   8,<2016-08-27 00:12:29.008 -0500>,<Administrator>,<X>,<proc1d>,<TOPSPIN 2.1>,
      <abs ABSG = 5 
       data hash MD5: 128K
       58 2C 46 3C 35 87 B1 FB 59 7F 64 92 AA 30 F9 67>)
$$ ##END=
$$ 
$$ $$ hash MD5
$$ $$ 35 68 40 8F 06 17 BD BA 6D 1E 78 71 08 34 E8 5B
##$RELAX= 
##$RELAX= 
##$RELAX= 
##$RELAX= 
##$RELAX= 
##$RELAX= 
##$RELAX= 
##$RELAX= 
$$ Bruker specific parameters
$$ --------------------------
##$DU= <E:\>
##$EXPNO= 12
$$ [...]
##$TP07= 0
##$TPNAME0= <>
##$TPNAME1= <>
##$TPNAME2= <>
##$TPNAME3= <>
##$TPNAME4= <>
##$TPNAME5= <>
##$TPNAME6= <>
##$TPNAME7= <>
##$TPOAL= (0..7)
0.5 0.5 0.5 0.5 0.5 0.5 0.5 0.5
##$TPOFFS= (0..7)
0 0 0 0 0 0 0 0
##$TUNHIN= 0
##$TUNHOUT= 0
##$TUNXOUT= 0
##$USERA1= <user>
##$USERA2= <user>
##$USERA3= <user>
##$USERA4= <user>
##$USERA5= <user>
##$V9= 5
##$VALIST= <valist>
##$VCLIST= <CCCCCCCCCCCCCCC>
##$VD= 0
##$VDLIST= <DDDDDDDDDDDDDDD>
##$VPLIST= <PPPPPPPPPPPPPPP>
##$VTLIST= <TTTTTTTTTTTTTTT>
##$WBST= 2048
##$WBSW= 25
##$XGAIN= (0..3)
0 0 0 0
##$XL= 0
##$YL= 0
##$YMAX_a= 6861316
##$YMIN_a= -14537458
##$ZGOPTNS= <>
##$ZL1= 120
##$ZL2= 120
##$ZL3= 120
##$ZL4= 120
##$ABSF1= 14.96257
##$ABSF2= -5.595612
##$ABSG= 5
##$ABSL= 3
##$ALPHA= 0
##$AQORDER= 0
##$ASSFAC= 0
##$ASSFACI= 0
##$ASSFACX= 0
##$ASSWID= 0
##$AUNMP= <proc_prof1d_extract.lims>
##$AXLEFT= 0
##$AXNAME= <>
##$AXNUC= <1H>
##$AXRIGHT= 0
##$AXTYPE= 0
##$AXUNIT= <>
##$AZFE= 0.1
##$AZFW= 0.1
##$BCFW= 0
##$BC_mod= 0
##$BYTORDP= 0
##$COROFFS= 0
##$CY= 15
##$DATMOD= 1
##$DC= 0
##$DFILT= <>
##$DTYPP= 0
##$F1P= 0
##$F2P= 0
##$FCOR= 0.5
##$FTSIZE= 131072
##$FT_mod= 6
##$GAMMA= 0
##$GB= 0
##$INTBC= 1
##$INTSCL= 1
##$ISEN= 128
##$LB= 0.3
##$LEV0= 0
##$LPBIN= 0
##$MAXI= 10000
##$MC2= 0
##$MEAN= 0
##$ME_mod= 0
##$MI= 0
##$NCOEF= 0
##$NC_proc= -2
##$NLEV= 6
##$NOISF1= 0
##$NOISF2= 0
##$NSP= 0
##$NTH_PI= 0
##$NZP= 0
##$OFFSET= 14.96257
##$PC= 1
##$PHC0= -82.00195
##$PHC1= 0
##$PH_mod= 1
##$PKNL= yes
##$PPARMOD= 0
##$PPDIAG= 0
##$PPIPTYP= 0
##$PPMPNUM= 2147483647
##$PPRESOL= 1
##$PSCAL= 4
##$PSIGN= 0
##$PYNMP= <proc.py>
##$REVERSE= no
##$SF= 400.020009009317
##$SI= 131072
##$SIGF1= 0
##$SIGF2= 0
##$SINO= 400
##$SIOLD= 131072
##$SPECTYP= <>
##$SREGLST= <1H.CDCl3>
##$SSB= 0
##$STSI= 131072
##$STSR= 0
##$SW_p= 8223.68421052631
##$SYMM= 0
##$S_DEV= 0
##$TDeff= 65536
##$TDoff= 0
##$TI= <>
##$TILT= no
##$TM1= 0
##$TM2= 0
##$TOPLEV= 0
##$USERP1= <user>
##$USERP2= <user>
##$USERP3= <user>
##$USERP4= <user>
##$USERP5= <user>
##$WDW= 1
##$XDIM= 131072
##$YMAX_p= 362005975
##$YMIN_p= -11708
##$CURPLOT= <Network HP LaserJet P1505>
##$CURPRIN= <$Network HP LaserJet P1505>
##$DFORMAT= <normdp>
##$LAYOUT= <+/1D_H.xwp>
##$LFORMAT= <normlp>
##$PFORMAT= <normpl>
##$SURQMSG= 1
$$ End of Bruker specific parameters
$$ ---------------------------------
##NTUPLES= NMR SPECTRUM
##VAR_NAME=  FREQUENCY,     SPECTRUM/REAL,   SPECTRUM/IMAG
##SYMBOL=    X,             R,               I
##VAR_TYPE=  INDEPENDENT,   DEPENDENT,       DEPENDENT
##VAR_FORM=  AFFN,          ASDF,            ASDF
##VAR_DIM=   131072,        131072,          131072
##UNITS=     HZ,            ARBITRARY UNITS, ARBITRARY UNITS
##FACTOR=    0.0627417313425164, 1,          1
##FIRST=     8223.62146879497, -1275,        -50542
##LAST=      0,             150,             -50284
##MIN=       0,             -11708,          0
##MAX=       8223.62146879497, 362005975,    0
$$ Real data points
##PAGE= N=1
##DATA TABLE= (X++(R..R)), XYDATA
$$ [...]
63336C05441r219p274o050n323m962m802m372l509k937l391m356m544l530k089
63322B39083q84K07J202J522R60M07Q04J827K386K147J817J962K317K404K185
63307B60346J812J161R9r88j429j150q27j014j377j204m84j9l28r19r56l05M53
63290B52871Q34Q61P14M75K72K82M38M03N2k64q1O23J417J849J823J613J597J929
63272B67708K360K447K007J370J126J577K455L204L553L711L973M298M433M304
63258C08526L988L434K629K080K494L769M856N020M796N137O030O620O486O086
63244C71951O041O603P805R487J1115J2151J2753J3501J4473J5185J5600J6398
63232E13063J7889J9410K0249K0541K0730K0719K0217J9476J8937J8487J7763
$$ y = [305441, 296222, 288948, 282898, 277575, 272613, 267811, 263439, 259930, 256993, 253602, 249246, 244702, 241172, 239083, 238199, 238406, 239608, 241130, 242090, 242497, 243301, 245128, 247514, 249661, 251478, 253440, 255757, 258161, 260346, 262158, 263319, 263418, 262430, 261001, 259851, 259024, 258010, 256633, 255429, 254945, 254926, 254598, 253679, 252723, 252418, 252871, 253705, 254566, 255280, 255755, 256027, 256309, 256747, 257150, 257202, 256938, 256857, 257480, 258897, 260746, 262569, 264182, 265779, 267708, 270068, 272515, 274522, 275892, 277018, 278595, 281050, 284254, 287807, 291518, 295491, 299789, 304222, 308526, 312514, 315948, 318577, 320657, 323151, 326920, 331776, 336796, 341592, 346729, 352759, 359379, 365865, 371951, 377992, 384595, 392400, 401887, 413002, 425153, 437906, 451407, 465880, 481065, 496665, 513063, 530952, 550362, 570611, 591152, 611882, 632601, 652818, 672294, 691231, 709718, 727481]
63221G27481J6970J6646J6782J6875J6765J6687J6489J5676J4366J3300J2486
63210I00523J0654O680J071m641r577j3868j7663k0654k2687k4072k5051k5408
63198G55307k4919k3799k2370k0564j8119j5082j1889q965o493m401k410j31K579
63185E98744N425P925R817J1135J1960J2383J2578J2748J2932J3099J3372J3967
63173G36085J4836J5577J5768J5311J4441J3532J2815J2091J0730Q203M694R85
63161H75068k285n059p629j0197j2814j5455j7950j9976k1287k1880k1906k1530
63149F97100k0896k0093j9084j7801j6285j4626j2850j1038r471q297p254o085
63137E33320n102m784m878m587l752l051k833k537j747j003r05j056p15l8K55
$$ y = [727481, 744451, 761097, 777879, 794754, 811519, 828206, 844695, 860371, 874737, 888037, 900523, 911177, 917857, 918928, 914287, 904710, 890842, 873179, 852525, 829838, 805766, 780715, 755307, 730388, 706589, 684219, 663655, 645536, 630454, 618565, 609600, 603107, 598706, 596296, 596165, 598744, 604169, 612094, 621911, 633046, 645006, 657389, 669967, 682715, 695647, 708746, 722118, 736085, 750921, 766498, 782266, 797577, 812018, 825550, 838365, 850456, 861186, 869389, 874083, 875068, 872783, 867724, 860095, 849898, 837084, 821629, 803679, 783703, 762416, 740536, 718630, 697100, 676204, 656111, 637027, 619226, 602941, 588315, 575465, 564427, 554956, 546659, 539405, 533320, 528218, 523434, 518556, 513969, 510217, 507166, 504333, 501796, 500049, 499046, 498141, 497085, 496370, 496332, 496587]
63122D96587J05J56P13J459K072K408K231J549J159J894L345M171L868L355L562
63107E28634M250M628M430L892L203K443J776J344J247J640K458L063K831K106
63093E67945J791J917J619Q05O87J955L460L782L238L169L794M149L936M016M874
63078F11137N810O109O055O276O756P115P384P847Q432Q773Q821R013R828J1358
63064G20714J3255J5032J6413J7578J8946K0794K3084K5616K8089L0146L1697
63053I61364L3193L5257L7857M0233M1764M2693M3656M4742M5344M4946M3724
63042A414773M2320M1216M0438L9779L9082L8398L7893L7653L7575L7361L6664
63031A843152L5184L2600K8559K2852J5628P362j444j0389j9087k7300l5164m2993
$$ y = [496587, 496692, 496848, 497561, 499020, 501092, 503500, 505731, 507280, 508439, 510333, 513678, 517849, 521717, 525072, 528634, 532884, 537512, 541942, 545834, 549037, 551480, 553256, 554600, 555847, 557487, 559945, 563008, 565839, 567945, 569736, 571653, 573272, 574077, 574764, 576719, 580179, 583961, 587199, 590368, 594162, 598311, 602247, 606263, 611137, 616947, 623056, 629111, 635387, 642143, 649258, 656642, 664489, 672921, 681694, 690515, 699528, 709356, 720714, 733969, 749001, 765414, 782992, 801938, 822732, 845816, 871432, 899521, 929667, 961364, 994557, 1029814, 1067671, 1107904, 1149668, 1192361, 1236017, 1280759, 1326103, 1371049, 1414773, 1457093, 1498309, 1538747, 1578526, 1617608, 1656006, 1693899, 1731552, 1769127, 1806488, 1843152, 1878336, 1910936, 1939495, 1962347, 1977975, 1985337, 1983893, 1973504, 1954417, 1927117, 1891953, 1848960]
63019A848960n0508n6569o0016o0687n9346n6813n3521m9638m5077l9519l3039
63008A284227k6657k1478j7214j2441o582p49L863P589J1461J5451J8591K0495
62996A276556K1812K3150K4461K5550K6370K6702K6222K5159K4248K3700K2770
62985A546700K0728J7800J4776J1973Q882M673j144q281j5718k2461k8372l3995
62973A515561l9510m4292m7759n0108n1844n2951n3004n1812m9502m6233m2361
62962I86185l8643l5715l3304l0591k7306k4025k1280j9015j7092j5665j4632
62951G08917j3317j1309r283q266q267q333p935p561p685p904p524o551n554m910
62937E94518m632m742n184n583n575n381n460n711n576n037m767n082n311m723
$$ y = [1848960, 1798452, 1741883, 1681867, 1621180, 1561834, 1505021, 1451500, 1401862, 1356785, 1317266, 1284227, 1257570, 1236092, 1218878, 1206437, 1199855, 1199106, 1202969, 1210558, 1222019, 1237470, 1256061, 1276556, 1298368, 1321518, 1345979, 1371529, 1397899, 1424601, 1450823, 1475982, 1500230, 1523930, 1546700, 1567428, 1585228, 1600004, 1611977, 1620859, 1625532, 1624388, 1616107, 1600389, 1577928, 1549556, 1515561, 1476051, 1431759, 1384000, 1333892, 1282048, 1229097, 1176093, 1124281, 1074779, 1028546, 986185, 947542, 911827, 878523, 847932, 820626, 796601, 775321, 756306, 739214, 723549, 708917, 695600, 684291, 675008, 666742, 658475, 650142, 642207, 634646, 626961, 619057, 611533, 604982, 599428, 594518, 589886, 585144, 579960, 574377, 568802, 563421, 557961, 552250, 546674, 541637, 536870, 531788, 526477, 521754]
62923E21754l552k649k466k878l720m807n559n351m377l639l776m225l915k551
62909D68289r08R5K88J51Q0L5j42l48l85l32n33j153j923k341k082j277n82p56
62891D56176j902l163l563l113k700k840l102k877k225j619j299j220j265j189
62877D24099o85J29O54N92L93M58L79m05j504j927j449q17o04n43k05K74M76K30
62859D19545l50j034j471j409j153j409k397l344l193j753QQ20K20j074j861j605
62843C98540q13k39k1J79M62O23O42P65J084J464J823K108K071J567J001Q97J032
62826D13185O66k47q41n39J63N33O38R89J648K248K622K874K990K849K518K286
62810D34582K414L004L900M616M730M598N199O917Q907J0090J0413J0597J1007
$$ y = [521754, 518202, 515553, 513087, 510209, 506489, 501682, 496123, 490772, 486395, 482756, 478980, 474755, 470840, 468289, 467381, 467476, 467764, 467915, 467995, 468030, 467888, 467540, 467155, 466823, 466290, 465137, 463214, 460873, 458791, 457514, 456932, 456176, 454274, 451111, 447548, 444435, 441735, 438895, 435793, 432916, 430691, 429072, 427773, 426553, 425288, 424099, 423414, 423543, 424197, 424789, 425182, 425640, 426019, 425614, 424110, 422183, 420734, 419917, 419313, 418770, 418565, 418839, 419315, 419545, 419195, 418161, 416690, 415281, 414128, 412719, 410322, 406978, 403785, 402032, 402040, 402860, 403080, 402006, 400145, 398540, 397727, 397488, 397467, 397646, 398108, 398731, 399373, 400138, 401222, 402686, 404509, 406617, 408688, 410255, 411256, 412153, 413185, 413851, 413604, 412763, 412224, 412387, 412920, 413558, 414547, 416195, 418443, 421065, 423939, 426929, 429778, 432296, 434582, 436996, 440000, 443900, 448516, 453246, 457844, 463043, 469960, 478867, 488957, 499370, 509967, 520974]
62797E20974J1450J1840J2371J3062J3812J4957J7071K0055K3036K5429K7685
62786G11742L0626L4423L8589M2653M6567N0500N4554N8613O2325O5375O7844
62775A263811P0107P2129P3084P1882O8096O2197N4917M6584L7065K6194J4171
62764A860237J595j0776k2363l2982m2758n1750n9577o5488o8968p0303p0338
62753A366529o9640o8108o5572o2450n9436n6556n3109m8718m4122m0434l7828
62742G60556l5336l2070k8294k5033k2816k1182j9376j7259j5289j3843j2789
62731E17269j1770j0604r337q033o747n658n030m881m761m078k706j187j40M78
62717D42815J341K932M961O690P748Q375R061J0118J1601J3367J5145J6785J8479
$$ y = [520974, 532424, 544264, 556635, 569697, 583509, 598466, 615537, 635592, 658628, 684057, 711742, 742368, 776791, 815380, 858033, 904600, 955100, 1009654, 1068267, 1130592, 1195967, 1263811, 1333918, 1406047, 1479131, 1551013, 1619109, 1681306, 1736223, 1782807, 1819872, 1846066, 1860237, 1861832, 1851056, 1828693, 1795711, 1752953, 1701203, 1641626, 1576138, 1507170, 1436867, 1366529, 1296889, 1228781, 1163209, 1100759, 1041323, 984767, 931658, 882940, 838818, 798384, 760556, 725220, 693150, 664856, 639823, 617007, 595825, 576449, 559190, 543901, 530058, 517269, 505499, 494895, 485558, 477525, 470778, 465120, 460090, 455209, 450448, 446370, 443664, 442477, 442337, 442815, 444156, 447088, 452049, 458739, 466487, 474862, 483923, 494041, 505642, 519009, 534154, 550939, 569418]
62704E69418K0644K3531K7032L0891L4861L8605M1691M3913M5629M7547N0042
62693I73804N2612N4081N3432N0558M6128M0709L4238K6432J7513Q140j227j0528
62681A345892j9649k8125l5533m1782m6818n0301n1945n2087n1565n0919m9940
62670H67228m8101m5313m2135l9246l6803l4365l1447k8087k4865k2416k0940
62659D93510k0033j8991j7336j5220j3191j1598j0356r294q464p873p249o407
62647C47498n718n719o327o788o450n339l982l008k841l452m289m757m722m400
62633B79706l868l135k516k407k634k598k129j644j320p74J42Q18P06J91J74R85
62617B59697K159L011L180K797K445K716L545M288M664N180O284P599Q572R437
$$ y = [569418, 590062, 613593, 640625, 671516, 706377, 744982, 786673, 830586, 876215, 923762, 973804, 1026416, 1080497, 1133929, 1184487, 1230615, 1271324, 1305562, 1331994, 1349507, 1357647, 1356420, 1345892, 1326243, 1298118, 1262585, 1220803, 1173985, 1123684, 1071739, 1019652, 968087, 917168, 867228, 819127, 773814, 731679, 692433, 655630, 621265, 589818, 561731, 536866, 514450, 493510, 473477, 454486, 437150, 421930, 408739, 397141, 386785, 377491, 369027, 361154, 353905, 347498, 341780, 336061, 329734, 322946, 316496, 311157, 307175, 304167, 301326, 297874, 293585, 288828, 284106, 279706, 275838, 272703, 270187, 267780, 265146, 262548, 260419, 258775, 257455, 256681, 256823, 257641, 258347, 258538, 258712, 259697, 261856, 264867, 268047, 270844, 273289, 276005, 279550, 283838, 288502, 293682, 299966, 307565, 316137, 325574]
62603C25574J0841J2766J4563J6008J7612J9781K2292K4767K7255L0042L3166
62592E54667L6235L8519L9313L8470L6613L4534L2311K9234K4633J8578J1816
62581H94923N239p13o313j2159j8259k3681k7424k9461l0555l1215l1308l0654
62569F58420k9496k8170k6766k5185k3344k1162j8678j6268j4531j3743j3610
62558D27467j3593j3360j2882j2284j1616j0730r460q019o950o536o432o160n676
62545C03769n131m473l735l412l797m167l448j697j33M86O93J246K022K462K560
62530B83245K749L185L664M074M537N240O376P996R734J1036J1970J3336J5583
62517C82725J8070J9974K1503K3516K6074K8185K9096K9150K9058K8820K7791
$$ y = [325574, 336415, 349181, 363744, 379752, 397364, 417145, 439437, 464204, 491459, 521501, 554667, 590902, 629421, 668734, 707204, 743817, 778351, 810662, 839896, 864529, 883107, 894923, 900162, 899449, 893136, 880977, 862718, 839037, 811613, 782152, 751597, 720382, 689074, 658420, 628924, 600754, 573988, 548803, 525459, 504297, 485619, 469351, 454820, 441077, 427467, 413874, 400514, 387632, 375348, 363732, 353002, 343542, 335523, 328573, 322037, 315605, 309445, 303769, 298638, 294165, 290430, 287018, 283221, 279054, 275606, 273909, 273776, 274262, 274955, 276201, 278223, 280685, 283245, 285994, 289179, 292843, 296917, 301454, 306694, 313070, 321066, 330800, 341836, 353806, 367142, 382725, 400795, 420769, 442272, 465788, 491862, 520047, 549143, 578293, 607351, 636171, 663962]
62506F63962K5618K2715J9731J6732J3054Q092K166l619q468j2590j6582k0436
62494G10375k3536k5467k6360k6408k5580k4017k2247k0727j9384j7913j6353
62483D62383j5018j3961j2843j1431r950q735p727o559n116l797l099l029l094
62470C58024k830k197j419n55N06J662K381K221J516J287K184L695M734N002N345
62455C81556O591Q369R419R001P604O289N582N130M240K622N92j427l431n676
62441D36461p967r625j0344j0690j1210j1432j0477q588p186p113p511o967n289
62428C22062l563k758k873l305l503l202k399j285j4J455L076M476N310N775O358
62413C25610P060P409P299P308P830Q342Q109P328O971P471Q100P894O708N111
$$ y = [663962, 689580, 712295, 732026, 748758, 761812, 769904, 772070, 768451, 759983, 747393, 730811, 710375, 686839, 661372, 635012, 608604, 583024, 559007, 536760, 516033, 496649, 478736, 462383, 447365, 433404, 420561, 409130, 399180, 390445, 382718, 376159, 371043, 367246, 364147, 361118, 358024, 355194, 352997, 351578, 351023, 351529, 353191, 355572, 357793, 359309, 360596, 362780, 366475, 371209, 376211, 381556, 388147, 396516, 405935, 414936, 422540, 428829, 434411, 439541, 443781, 446403, 446995, 445568, 442137, 436461, 428494, 418869, 408525, 397835, 386625, 375193, 364716, 356128, 348942, 341829, 334318, 327351, 322062, 318499, 315741, 312868, 309563, 306060, 302858, 300459, 299174, 299160, 300615, 303691, 308167, 313477, 319252, 325610, 332670, 340079, 347378, 354686, 362516, 370858, 378967, 386295, 393266, 400737, 408837, 416731, 423439, 428550]
62399D28550L615K403J558J002K94j032k794m240m911n066n095m907m185l050
62385D02142k042j493j102j56J823M516O903Q262R088J0642J3444J6708J9585
62372D88320K2343K5748K9741L3467L6372L8503L9930M0676M1201M1967M2346
62361H80614M0860L6919L1573K6070K0410J4026P238J084m071q878j3872j8646
62349A013327k2487k5331k7800l0357l2718l4134l4234l3394l2217l0719k8413
62338F81523k5230k1997j9667j8374j7466j6346j5013j3904j3310j3006j2305
62327D94905j0733q582o675n456m642l784k835j984j315q82q06r74r67o25l28
62312D44317m51p91r75j198k010l432m839n706o107o408o710o770o276n199l892
$$ y = [428550, 432165, 434568, 436126, 437128, 437422, 436390, 433596, 429356, 424445, 419379, 414284, 409377, 405192, 402142, 400100, 398607, 397505, 397349, 399172, 403688, 410591, 418853, 427941, 438583, 452027, 468735, 488320, 510663, 536411, 566152, 599619, 635991, 674494, 714424, 755100, 796301, 838268, 880614, 921474, 958393, 989966, 1016036, 1036446, 1050472, 1057710, 1058794, 1054723, 1045845, 1031973, 1013327, 990840, 965509, 937709, 907352, 874634, 840500, 806266, 772872, 740655, 709936, 681523, 656293, 634296, 614629, 596255, 578789, 562443, 547430, 533526, 520216, 507210, 494905, 484172, 475590, 468915, 463459, 458817, 455033, 452198, 450214, 448899, 448017, 447211, 446237, 445270, 444645, 444317, 443866, 443075, 442100, 440902, 438892, 435460, 430621, 424915, 418808, 412400, 405690, 398920, 392644, 387445, 383553]
62297C83553k841k194j706j131m82J93R37J598J785J497J378K032L279M525N622
62282C98045O810Q019Q805Q995Q932R089R718J0875J2424J4060J5665J7491J9650
62269E48578K1672K3088K4297K6164K8753L1145L2544L3010L2853L1945K9987
62258H64036K6933K2895J7913J2223O380Q60m290r161j3654j7632k1074k3935
62246H61494k6112k7768k9295l0650l1133l0179k8176k6005k3968k1702j9067
62235E67439j6583j4778j3547j2366j0978r561q326p228o094m870l662k619j872
62222D54955j436j118p12l31l33o56n73L51J334J176Oo53J29J530K353K602K874
62205D61498L012K652K554L874O197P761P882P746Q376R214R468R588J0333J1253
$$ y = [383553, 380712, 378518, 376812, 375681, 375199, 375392, 376329, 377927, 379712, 381209, 382587, 384619, 387898, 392423, 398045, 404855, 412874, 421679, 430674, 439606, 448695, 458413, 469288, 481712, 495772, 511437, 528928, 548578, 570250, 593338, 617635, 643799, 672552, 703697, 736241, 769251, 802104, 834049, 864036, 890969, 913864, 931777, 944000, 950380, 951240, 946950, 937789, 924135, 906503, 885429, 861494, 835382, 807614, 778319, 747669, 716536, 686357, 658181, 632176, 608208, 586506, 567439, 550856, 536078, 522531, 510165, 499187, 489626, 481300, 474072, 467978, 463108, 459446, 456827, 454955, 453519, 452401, 451689, 451358, 451025, 450369, 449796, 450147, 451481, 452657, 452663, 452010, 452139, 453669, 456022, 458624, 461498, 464510, 467162, 469716, 473590, 479787, 487548, 495430, 503176, 511552, 520766, 530234, 539822, 550155, 561408]
62191E61408J1460J1234J1590J2509J2863J2095J0949J0331J0284J0418J0679
62180F85820J1382J2828J5070J7788K0361K2401K4166K6015K7629K8242K7663
62169I19365K6457K4993K2927J9840J5948J1878Q085M797K219M29q00j913l283
62156A050942n063p110q938j0026j0301j0196j0088r842r053p620n927m559l915
62143I48304m025m583n134n291m931m243l604l291l247l148k716j901q27K27R07
62128I02497J176J634K957M904O377O761O718P156P999Q601R002R900J1474J3098
62114A000254J4362J5543J6926J8333J9617K0923K2126K2751K2848K3317K4611
62103A221611K5712K5234K3341K1721K1552K2276K2628K2287K2054K2636K3677
$$ y = [561408, 572868, 584102, 595692, 608201, 621064, 633159, 644108, 654439, 664723, 675141, 685820, 697202, 710030, 725100, 742888, 763249, 785650, 809816, 835831, 863460, 891702, 919365, 945822, 970815, 993742, 1013582, 1029530, 1041408, 1049493, 1054290, 1056509, 1056938, 1056138, 1054225, 1050942, 1045879, 1038769, 1029831, 1019805, 1009504, 999308, 989220, 979378, 970325, 962705, 956778, 952219, 948304, 944279, 939696, 934562, 929271, 924340, 920097, 916493, 913202, 909955, 906807, 904091, 902190, 901363, 901590, 902497, 903673, 905307, 908264, 913168, 919545, 926306, 933024, 940180, 948179, 956780, 965782, 975682, 987156, 1000254, 1014616, 1030159, 1047085, 1065418, 1085035, 1105958, 1128084, 1150835, 1173683, 1197000, 1221611, 1247323, 1272557, 1295898, 1317619, 1339171, 1361447, 1384075, 1406362, 1428416, 1451052, 1474729]
62092A474729K4069K3098K1205J9603J9140J9693K0636K1685K3022K4767K6646
62081A718293K8188K9137K9640L0190L1305L3077L5032L6531L7274L7356L7003
62070B083026L6430L5777L4880L3220L0450K6996K3738K1010J8372J5520J2961
62059B372380J1322J0340R129P368N682M660M068L305K294J509J346J869L005
62046B438277M559O017O841P064P279P876Q595Q975Q885Q416P606O551N526M637
62032B537104L592K155O56l67q80j323j985k771l568m346m894m870m236l454l119
62017B507694l515m420n096m724l252j621p22l49K43J006J288J236J931L663N113
62002B498475M997L734K609J848O30j276l000l871m323n175o519p776q499q783
$$ y = [1474729, 1498798, 1521896, 1543101, 1562704, 1581844, 1601537, 1622173, 1643858, 1666880, 1691647, 1718293, 1746481, 1775618, 1805258, 1835448, 1866753, 1899830, 1934862, 1971393, 2008667, 2046023, 2083026, 2119456, 2155233, 2190113, 2223333, 2253783, 2280779, 2304517, 2325527, 2343899, 2359419, 2372380, 2383702, 2394042, 2403171, 2410539, 2416221, 2420881, 2424949, 2428254, 2430548, 2432057, 2433403, 2435272, 2438277, 2442836, 2448853, 2455694, 2462758, 2470037, 2477913, 2486508, 2495483, 2504368, 2512784, 2520390, 2526941, 2532467, 2537104, 2540696, 2542851, 2543507, 2543140, 2542260, 2540937, 2538952, 2536181, 2532613, 2528267, 2523373, 2518503, 2514267, 2510813, 2507694, 2504179, 2499759, 2494663, 2489939, 2486687, 2485066, 2484344, 2483995, 2484238, 2485244, 2486532, 2487768, 2489699, 2493362, 2498475, 2503472, 2507206, 2509815, 2511663, 2512293, 2511017, 2508017, 2504146, 2499823, 2494648, 2488129, 2480353, 2471854, 2463071]
61988B463071q981r267r588r938j0537j1510j2478j2849j2605j2345j2409j2481
61976B328083j2377j2569j3481j4698j5542j5940j6100j5833j5055j4481j4796
61965B167211j5395j5139j4191j3814j4244j4252j3189j2076j1836j1781j0924
61954B020370r718r218r196q524p054n748m968l974k336p73q4m7J64J057K619
61939A962570M530O274P503Q546J0102J2275J4396J6151J8197K1207K4800K8117
61927B134668L1122L4693L9501M5429N2074N9345O7417P6533Q7056R9387J13668
61916B840893J29773J47751J68049J91173K17230K45967K76923L09367L42236
61907D869362L74395M04677M31261M51109M60415M55746M34477L94409L33942
$$ y = [2463071, 2454090, 2444823, 2435235, 2425297, 2414760, 2403250, 2390772, 2377923, 2365318, 2352973, 2340564, 2328083, 2315706, 2303137, 2289656, 2274958, 2259416, 2243476, 2227376, 2211543, 2196488, 2182007, 2167211, 2151816, 2136677, 2122486, 2108672, 2094428, 2080176, 2066987, 2054911, 2043075, 2031294, 2020370, 2010652, 2001434, 1992238, 1983714, 1976660, 1970912, 1965944, 1961970, 1959634, 1958861, 1958777, 1958730, 1958894, 1959951, 1962570, 1967100, 1973374, 1980877, 1989423, 1999525, 2011800, 2026196, 2042347, 2060544, 2081751, 2106551, 2134668, 2165790, 2200483, 2239984, 2285413, 2337487, 2396832, 2464249, 2540782, 2627838, 2727225, 2840893, 2970666, 3118417, 3286466, 3477639, 3694869, 3940836, 4217759, 4527126, 4869362, 5243757, 5648434, 6079695, 6530804, 6991219, 7446965, 7881442, 8275851, 8609793]
61898H609793K53286J55447M5841o8555j79538k78355l57912m15154m50977m67878
61888F845998m68287m55146m32641m05153l75561l45135l14712k85221k57267
61879C506875k31072k07035j85805j67503j51370j36576j23104j11530j02039
61870B090841r3877q5945p7790o9998o3411n8047n3064m7875m2847l8636l5189
61859A424162l1970k8827k5975k3288k0359j7359j5054j3646j2348j0508q599
61848A216229p521p336p326o953o189n136l997l280l284l389k572q17O89J085
61834A160203R39J297K183K696K423J937J878K124K169J885J643J911K962M751
61820A191001O783Q320R067R618J0881J3075J5609J7932K0189K2880K6110K9504
$$ y = [8609793, 8863079, 9018526, 9064367, 8995812, 8816274, 8537919, 8180007, 7764853, 7313876, 6845998, 6377711, 5922565, 5489924, 5084771, 4709210, 4364075, 4049363, 3764142, 3506875, 3275803, 3068768, 2882963, 2715460, 2564090, 2427514, 2304410, 2192880, 2090841, 1996964, 1911019, 1833229, 1763231, 1699820, 1641773, 1588709, 1540834, 1497987, 1459351, 1424162, 1392192, 1363365, 1337390, 1314102, 1293743, 1276384, 1261330, 1247684, 1235336, 1224828, 1216229, 1208708, 1201372, 1194046, 1187093, 1180904, 1175768, 1171771, 1168491, 1165207, 1161818, 1159246, 1158429, 1159118, 1160203, 1161142, 1162439, 1164622, 1167318, 1169741, 1171678, 1173556, 1175680, 1177849, 1179734, 1181377, 1183288, 1186250, 1191001, 1197784, 1206104, 1215171, 1224789, 1235670, 1248745, 1264354, 1282286, 1302475, 1325355, 1351465, 1380969]
61808A380969L2717L5795L9001M2447M5988M9485N3112N7270O2212O7885P4230
61797A941111Q1407Q9454R7950J06537J15709J26550J39519J54195J70422J89112
61787C211966K11266K36699K64594K95123L29648L69226M13635M62163N14556
61778F308876N70508O28424O85240P37386P81490Q13959Q30063Q23703P88451
61769A2968100P19361O14349M74600L04630J12753q8711k84900m61449o07361
61760A3751372p16350p86891q21563q25761q06021p68884p20614o66836o11605
61751G026847n56921n03677m53063m06713l65588l29315k96865k67560k41259
61742C605886k17830j96912j78190j61670j47384j34951j23563j12595j02172
$$ y = [1380969, 1413686, 1449481, 1488482, 1530929, 1576917, 1626402, 1679514, 1736784, 1798996, 1866881, 1941111, 2022518, 2111972, 2209922, 2316459, 2432168, 2558718, 2698237, 2852432, 3022854, 3211966, 3423232, 3659931, 3924525, 4219648, 4549296, 4918522, 5332157, 5794320, 6308876, 6879384, 7507808, 8193048, 8930434, 9711924, 10525883, 11355946, 12179649, 12968100, 13687461, 14301810, 14776410, 15081040, 15193793, 15105082, 14820182, 14358733, 13751372, 13035022, 12248131, 11426568, 10600807, 9794786, 9025902, 8305288, 7638452, 7026847, 6469926, 5966249, 5513186, 5106473, 4740885, 4411570, 4114705, 3847145, 3605886, 3388056, 3191144, 3012954, 2851284, 2703900, 2568949, 2445386, 2332791, 2230619]
61733B230619r2970q5404p9100p3188o7006o0621n4751n0196m7078m4661m2045
61722A533599l9061l6238l3937l1855k9529k7006k4724k2925k1514k0288j9120
61711A227402j7981j7021j6517j6531j6705j6612j6176j5551j4780j3881j3153
61700A052494j2993j3350j3671j3483j2769j1722j0508r356q603q318q055p304
61688I22362o151n326n512o671p960q333p300n382l783l442m258n242n450m776
61674H42776l907l618m101m816m944m090k706j764j863k672l335l353k951k653
61660G96003k770l270l883m189l905l205k619k451k545k694k968l359l468l001
61646G51676k302j978k065k070j717j212p45k84J64N16Q89J437J905J886J630
$$ y = [2230619, 2137649, 2052245, 1973145, 1899957, 1832951, 1772330, 1717579, 1667383, 1620305, 1575644, 1533599, 1494538, 1458300, 1424363, 1392508, 1362979, 1335973, 1311249, 1288324, 1266810, 1246522, 1227402, 1209421, 1192400, 1175883, 1159352, 1142647, 1126035, 1109859, 1094308, 1079528, 1065647, 1052494, 1039501, 1026151, 1012480, 998997, 986228, 974506, 963998, 954642, 946039, 937721, 929666, 922362, 916211, 910885, 905373, 898702, 890742, 882409, 875109, 869727, 865944, 862502, 858244, 853002, 847552, 842776, 838869, 835251, 831150, 826334, 821390, 817300, 814594, 812830, 810967, 808295, 804960, 801607, 798656, 796003, 793233, 789963, 786080, 781891, 777986, 774781, 772162, 769711, 767166, 764472, 761504, 758145, 754677, 751676, 749374, 747396, 745331, 743261, 741544, 740332, 739587, 739303, 739467, 739983, 740872, 742309, 744214, 746100, 747730]
61631G47730J908K914L941M448M723N064M989M032K795K330K662K746J887M41
61617G92610r25k038l019l853m453m899n281n517n509n337n147m995m864m833
61603G31940n049n565o142o372o110n728n575n282m139k388j423k096l369l428
61589F69274j967m05J46J89Q15K210L739M987O083P240Q519R885J1126J1846J1920
61574G45607J1891J2576J4286J6639J8938K0474K0748J9991J9356J9951K1389
61563I41846K1903K0356J7679J5796J5370J5310J4457J2968J1742J1161J0926
61552A109514J0799J0791J0815J0662J0318R868R130P836O123M366K551L70k037
61539A201106m010n325o551q205j0028j1457j2299j2519j1923j0595r273q605
$$ y = [747730, 749638, 752552, 756493, 760941, 765664, 770728, 775717, 779749, 782544, 784874, 787536, 790282, 792169, 792610, 791685, 789647, 786628, 782775, 778322, 773423, 768142, 762625, 757116, 751779, 746632, 741637, 736773, 731940, 726891, 721326, 715184, 708812, 702702, 696974, 691399, 686117, 681978, 679590, 678167, 676071, 672702, 669274, 667307, 666902, 667048, 667237, 668052, 670262, 674001, 678988, 685071, 692311, 700830, 710715, 721841, 733687, 745607, 757498, 770074, 784360, 800999, 819937, 840411, 861159, 881150, 900506, 920457, 941846, 963749, 984105, 1001784, 1017580, 1032950, 1048260, 1062717, 1075685, 1087427, 1098588, 1109514, 1120313, 1131104, 1141919, 1152581, 1162899, 1172767, 1181897, 1189733, 1195856, 1200222, 1202773, 1203143, 1201106, 1197096, 1191771, 1185220, 1177015, 1166987, 1155530, 1143231, 1130712, 1118789, 1108194, 1098921, 1090316]
61527A090316q269p352n462k968l32K201M421O267Q183J0769J4041J7483K0905
61514A150203K4771K9516L4949M0548M6133N2024N8737O6526P5225Q4442R4034
61503A757108J04205J15083J26438J37955J49411J60253J69317J75444J78114
61494C073328J77067J71512J60321J42918J19590R1164N9048K5513o855l6239
61484C977367o1851q3175r9506j10362j15893j16803j14193j09379j03356r6392
61474B966457q8483q0073p1815o3840n5967m8581m2447l7501l2682k7268k1659
61463B396141j6419j1225n410R61P120J2464J6901K0625K3795K6419K8244K9056
61451B528672K9161K9276K9785L0445L0984L1591L2543L3757L4996L6152L7084
$$ y = [1090316, 1082047, 1074695, 1069233, 1066265, 1065933, 1068134, 1072555, 1078822, 1087005, 1097774, 1111815, 1129298, 1150203, 1174974, 1204490, 1239439, 1279987, 1326120, 1378144, 1436881, 1503407, 1578632, 1663074, 1757108, 1861313, 1976396, 2102834, 2240789, 2390200, 2550453, 2719770, 2895214, 3073328, 3250395, 3421907, 3582228, 3725146, 3844736, 3935900, 3994948, 4020461, 4013606, 3977367, 3915516, 3832341, 3732835, 3622473, 3506580, 3389777, 3275584, 3166205, 3062849, 2966457, 2877974, 2797901, 2726086, 2662246, 2606279, 2557698, 2515251, 2477750, 2445068, 2417800, 2396141, 2379722, 2368497, 2363087, 2364048, 2371168, 2383632, 2400533, 2421158, 2444953, 2471372, 2499616, 2528672, 2557833, 2587109, 2616894, 2647339, 2678323, 2709914, 2742457, 2776214, 2811210, 2847362, 2884446]
61440B884446L7544L7456L6987L6167L4764L2780L0616K8512K6188K3269J9702
61429C228431J5537J0717N380o3n399j0754j6015k0627k4210k6902k8865l0034
61417C097196l0704l1602l2842l3370l2162k9446k6083k2378j8314j4443j1491
61406B814361r224o787m169k425k271l309m785o429q229r958j1321j2160j2253
61393B721041j1252r011n622j016N099J2698K1178K9983L9248M9642O1638P5103
61381B988729Q9477J04211J19084J34009J48523J61655J72508J80770J86262J88195
61371D473423J85354J77105J63679J45335J21748R2707N9369K4401r230l9742
61361E394149o6930r1354j13230j32142j47688j60033j69539j76138j79480j79627
$$ y = [2884446, 2921990, 2959446, 2996433, 3032600, 3067364, 3100144, 3130760, 3159272, 3185460, 3208729, 3228431, 3243968, 3254685, 3260065, 3260002, 3254603, 3243849, 3227834, 3207207, 3182997, 3156095, 3127230, 3097196, 3066492, 3034890, 3002048, 2968678, 2936516, 2907070, 2880987, 2858609, 2840295, 2825852, 2814361, 2805137, 2798350, 2794181, 2791756, 2789485, 2786176, 2781391, 2774962, 2766733, 2756775, 2745454, 2733294, 2721041, 2709789, 2700778, 2695156, 2694140, 2699239, 2711937, 2733115, 2763098, 2802346, 2851988, 2913626, 2988729, 3078206, 3182417, 3301501, 3435510, 3584033, 3745688, 3918196, 4098966, 4285228, 4473423, 4658777, 4835882, 4999561, 5144896, 5266644, 5359351, 5418720, 5443121, 5433891, 5394149, 5327219, 5235865, 5122635, 4990493, 4842805, 4682772, 4513233, 4337095, 4157615, 3977988]
61351C977988j77206j72758j66372j58171j48813j39163j29574j19848j09814
61342B656269r9628q9363p8761o7741n7002m7619l9851l2768k5346j7593j0255
61331B090342l696K384Q193J3468J8003K1992K5609K8703L1197L3392L5467L6982
61319B342036L7272L6225L4347L2182K9874K7199K3794J9551J5004J1146Q581
61308B617211O978N547L946K491J529Q58k37k370n445q697j1513j4089j6977k0144
61294B559088k3012k5398k7764l0296l2336l3204l3103l2722l2297l1519l0113
61283B227324k8116k5723k3220k0898j8730j6359j3636j0908q599o860n796n610
61271B042869o236p310q760j0899j3591j6016j7676j8957k0085k0269j8712j5816
$$ y = [3977988, 3800782, 3628024, 3461652, 3303481, 3154668, 3015505, 2885931, 2766083, 2656269, 2556641, 2467278, 2388517, 2320776, 2263774, 2216155, 2176304, 2143536, 2118190, 2100597, 2090342, 2086646, 2089030, 2097223, 2110691, 2128694, 2150686, 2176295, 2204998, 2236195, 2269587, 2305054, 2342036, 2379308, 2415533, 2449880, 2482062, 2511936, 2539135, 2562929, 2582480, 2597484, 2608630, 2617211, 2624189, 2629736, 2633682, 2636173, 2637702, 2638560, 2638323, 2635953, 2630508, 2621811, 2610298, 2596209, 2579232, 2559088, 2536076, 2510678, 2482914, 2452618, 2420282, 2387078, 2353975, 2321253, 2288956, 2257437, 2227324, 2199208, 2173485, 2150265, 2129367, 2110637, 2094278, 2080642, 2069734, 2061135, 2054275, 2048479, 2042869, 2036633, 2029323, 2020563, 2009664, 1996073, 1980057, 1962381, 1943424, 1923339, 1903070, 1884358, 1868542]
61259A868542j2382q166k395M635J1739J8597K6040L4489M3287N1915O0687O9634
61247B166622P7713Q3942Q8580R2269R4465R3571Q8613Q0083O9005N5721L9853
61236C030437K1250O99k0363m0723n9679p6479q9852r8577j02485j02537r9940
61225B361751r5447q9564q2968p6474p0667o5776o1814n8705n6169n3480m9710
61214A600977m4551l8777l3453k8721k3969j9119j4888j1522q209m392q88J099
61202A373587J523J238P20j4o90j020j421k486l845m536m399m222m490m995n695
61187A339255o965q753j0383j1483j2359j3316j4283j5320j6670j8105j8976j9113
61175A173529j8979j8756j8147j7296j6962j7332j7470j6564j5027j3764j2945
$$ y = [1868542, 1856160, 1847994, 1845599, 1850234, 1861973, 1880570, 1906610, 1941099, 1984386, 2036301, 2096988, 2166622, 2244335, 2328277, 2416857, 2509126, 2603591, 2697162, 2785775, 2865858, 2934863, 2990584, 3030437, 3051687, 3052386, 3032023, 2991300, 2931621, 2855142, 2765290, 2666713, 2564228, 2461691, 2361751, 2266304, 2176740, 2093772, 2017298, 1946631, 1880855, 1819041, 1760336, 1704167, 1650687, 1600977, 1556426, 1517649, 1484196, 1455475, 1431506, 1412387, 1397499, 1385977, 1377768, 1373376, 1372488, 1373587, 1375110, 1376348, 1377068, 1377054, 1376364, 1375344, 1373923, 1371437, 1367592, 1363056, 1358657, 1354435, 1349945, 1344950, 1339255, 1332290, 1323537, 1313154, 1301671, 1289312, 1275996, 1261713, 1246393, 1229723, 1211618, 1192642, 1173529, 1154550, 1135794, 1117647, 1100351, 1083389, 1066057, 1048587, 1032023, 1016996, 1003232, 990287]
61164I90287j2158j1340j0875j1021j1749j3036j4797j6639j8050j8893j9528
61153H32201k0448k1711k2688k2544k1178j9437j8068j6820j5092j3072j1477
61142F29666j0405r335q093o937n694l857j687k08K22M16J132K229L380M703O241
61127F01773P591Q590R628J0858J1821J2326J2865J3639J4002J3486J2642J2189
61115G41410J1986J1495J0570R143O820L687Q25q62j876l308n167o483o834o796
61101G64610o907p009o793o415o262o461o758o798o531o379o699p186p219o837
61087F70356o732p066p068o179m938m223m206m558n081n545n513m951m513m606
61073E95177m628l907k786k000j454n60N07R54O70L72M54N60M70N79J090J498
$$ y = [990287, 978129, 966789, 955914, 944893, 933144, 920108, 905311, 888672, 870622, 851729, 832201, 811753, 790042, 767354, 744810, 723632, 704195, 686127, 669307, 654215, 641143, 629666, 619261, 609926, 601833, 594896, 589202, 585345, 583658, 583450, 583672, 584088, 585220, 587449, 590829, 595532, 601773, 609364, 617954, 627582, 638440, 650261, 662587, 675452, 689091, 703093, 716579, 729221, 741410, 753396, 764891, 775461, 784604, 791424, 795111, 795936, 795074, 793198, 789890, 784723, 778240, 771406, 764610, 757703, 750694, 743901, 737486, 731224, 724763, 718005, 711207, 704676, 698297, 691598, 684412, 677193, 670356, 663624, 656558, 649490, 643311, 638373, 634150, 629944, 625386, 620305, 614760, 609247, 604296, 599783, 595177, 590549, 586642, 583856, 581856, 580402, 579842, 580349, 581303, 581973, 582345, 582799, 583359, 583829, 584408, 585498, 586996]
61057E86996J345J095J647L098M476M899M642M782N800O987P401P030O581O520
61043F53299O876P696Q931R988J0270J0186J0729J1976J2952J3199J3448J4329
61031G83879J5388J6066J6789J8290K0412K2320K3547K4307K5149K6619K8946
61020A021712L1799L4723L7768M1123M4231M6279M7593M9386N2086N5092N8373
61009A520165O2877O9044P6427Q5186R6263J09547J23632J38253J55231J76444
60999B613069K03047K37524K84011L45196M21521N14496O27366P60926R13014
60990F920170J083601J272247J464270J629188J747093J830042J892270J890819
60982A9729700J723963J325181P63336K24238j25143k49420k23148j27565m324
$$ y = [586996, 588341, 589436, 591083, 594181, 598657, 603556, 608198, 612980, 618780, 625767, 633168, 640198, 646779, 653299, 660175, 667871, 676802, 686790, 697060, 707246, 717975, 729951, 742903, 756102, 769550, 783879, 799267, 815333, 832122, 850412, 870824, 893144, 916691, 940998, 966147, 992766, 1021712, 1053511, 1088234, 1126002, 1167125, 1211356, 1257635, 1305228, 1354614, 1406700, 1461792, 1520165, 1583042, 1652086, 1728513, 1813699, 1909962, 2019509, 2143141, 2281394, 2436625, 2613069, 2816116, 3053640, 3337651, 3682847, 4104368, 4618864, 5246230, 6007156, 6920170, 8003771, 9276018, 10740288, 12369476, 14116569, 15946611, 17838881, 19729700, 21453663, 22778844, 23542180, 23766418, 23641275, 23391855, 23168707, 23041142, 23036818]
60973B3036818R3909N9213k14021p18982j306705j782017k029356k053539j927585
60964A3157735j725885j498697j276959j077367r03796p53733o25877n20243m34338
60955D340840l63765l05876k59904k24441j97193j76382j60352j46658j33499
60946B372770j21315j11215j02645r4193q5835p8564p2574o7568o4141o3046o3456
60935A448218o3626o2970o1910o0202n7077n2871m8795m5153m1302l7419l4648
60924H82245l3210l1830k9497k6613k3938k1498j9107j6988j5298j3732j2163
60913F38371j1071j0776j0715j0028q612p164o296n942n626n138m796m987n560
60900E41660n899n648n056m545m238m051l830l237j970l18R85J724K439L435M172
$$ y = [23036818, 23130727, 23189940, 22975919, 22256937, 20950232, 19168215, 17138859, 15085320, 13157735, 11431850, 9933153, 8656194, 7578827, 6675031, 5921298, 5295421, 4775178, 4340840, 3977075, 3671199, 3411295, 3186854, 2989661, 2813279, 2652927, 2506269, 2372770, 2251455, 2140240, 2037595, 1943402, 1857567, 1779003, 1706429, 1638861, 1574720, 1511674, 1448218, 1384592, 1321622, 1259712, 1199510, 1142433, 1089562, 1040767, 995614, 954312, 916893, 882245, 849035, 817205, 787708, 761095, 737157, 715659, 696552, 679564, 664266, 650534, 638371, 627300, 616524, 605809, 595781, 587169, 580005, 573709, 567767, 562141, 557003, 552207, 547220, 541660, 535761, 530113, 525057, 520512, 516274, 512223, 508393, 505156, 503186, 502868, 503853, 505577, 508016, 511451, 515623]
60885E15623M191M041M552N629O479O732O611O263N648M939M406L961L298K433
60871E84806J594P31m01j728k872l585l835l623l128k843l110l633l800l393k632
60856E48548j740q01O7Q07J577K499L418M148M728N197N384N233N086N268N653
60841E95072N946O131O287O269N967N600N479N646O061O798P763Q526Q758Q546
60827F88849Q045P261O456O267O929P757P882P126N896M609L642L250L118K551
60813G69638J499P97P56L41j417l841n506o243p102q535r769j0066r595q900q328
60798F93729q128q410q802q722q091p263o245m712k830j416r46r47o35J98J198
60783F27978K018K619L075L334L229K876K853L559M412M322L182K186K229K765
$$ y = [515623, 519814, 523855, 528407, 534036, 540515, 547247, 553858, 560121, 565769, 570708, 575114, 579075, 582373, 584806, 586400, 587131, 586730, 585002, 582130, 578545, 574710, 571087, 567959, 565116, 562006, 558373, 554573, 551180, 548548, 546808, 546007, 546074, 546881, 548458, 550957, 554375, 558523, 563251, 568448, 573832, 579065, 584151, 589419, 595072, 601018, 607149, 613436, 619705, 625672, 631272, 636751, 642397, 648458, 655256, 663019, 671545, 680303, 688849, 696894, 704155, 710611, 716878, 723807, 731564, 739446, 746572, 752468, 757077, 760719, 763969, 767087, 769638, 771137, 771934, 772690, 773031, 771614, 767773, 762267, 756024, 748922, 740387, 730618, 720552, 710957, 702057, 693729, 685601, 677191, 668389, 659667, 651576, 644313, 638068, 633356, 630526, 629110, 628164, 627217, 626582, 626780, 627978, 629996, 632615, 635690, 639024, 642253, 645129, 647982, 651541, 655953, 660275, 663457, 665643, 667872, 670637]
60769F70637K887K789L205L996M407M461M936O007O928P127O782O237N720N677
60755G41796O451P515P882P501P346P893Q337P763O357M892L659K499J456P78
60741H22125M47J83q2q3M15J187J545R13m64j624j987k088k855m353n793o628
60725H00858p069p529q114q719r239r608r954j0610j1576j2244j2142j1718j1759
60712F70577j2203j2239j1497j0406r334q163o801n417m023k492j080k31K73J205
60698E88169K708L967M403M471M831N418N803N888N680M850L171J141m48j413
60684F38639k258l398m719n907o925q021r331j0568j1183j0939j0149r254q388
60671E37599p565o898o280n176l345j524o87p50o81O9R95J442J329Q62J81l95
$$ y = [670637, 673524, 676313, 679518, 683514, 687921, 692382, 697318, 703325, 710253, 717380, 724162, 730399, 736119, 741796, 748247, 755762, 763644, 771145, 778491, 786384, 794721, 802484, 808841, 813733, 817392, 819891, 821347, 822125, 822572, 822755, 822673, 822590, 823005, 824192, 825737, 826650, 826186, 824562, 822575, 820487, 817632, 813279, 807486, 800858, 793789, 786260, 778146, 769427, 760188, 750580, 740626, 730016, 718440, 706196, 694054, 682336, 670577, 658374, 646135, 634638, 624232, 614898, 606735, 599934, 594517, 590494, 588002, 586922, 586691, 586964, 588169, 590877, 594844, 599247, 603718, 608549, 613967, 619770, 625658, 631338, 636188, 639359, 640500, 640052, 638639, 636381, 632983, 628264, 622357, 615432, 607411, 598080, 587512, 576329, 565390, 555241, 545987, 537599, 530034, 523136, 516856, 511680, 508335, 506811, 506124, 505374, 504693, 504762, 505757, 507199, 508528, 509390, 509571, 509176]
60655E09176m29O6N86Q93J267J874K431K691K732K578K131J672J782K491L127
60640E35068L300L424L924M594N129N673O370O886O996P107P790R053J0497J1741
60626F27552J2387J2148J1451J1321J2101J2856J2667J1971J1805J2156J2000
60615G60415J0812R184P950P358P132O772N717L780J446o86k659m924p435r655
60601G95207j1374j2896j4232j4796j4211j2923j1679j0747r911q899p512n677
60589F60350l746k413j913j547n03R22J635J243N91M76N71J53n45o04J65R50J204
60572F56989J256J418J287N81j09j43R2k35j054j541j426j257j366j394j042n96
60556F51460m34m91m20J86J734M222O901Q946J0555J2701J5756J9114K2318K5656
$$ y = [509176, 508747, 508813, 509399, 510292, 511559, 513433, 515864, 518555, 521287, 523865, 525996, 527668, 529450, 531941, 535068, 538368, 541792, 545716, 550310, 555439, 561112, 567482, 574368, 581364, 588471, 596261, 605314, 615811, 627552, 639939, 652087, 663538, 674859, 686960, 699816, 712483, 724454, 736259, 748415, 760415, 771227, 780411, 788361, 795719, 802851, 809623, 815340, 819120, 820566, 819880, 817221, 812297, 804862, 795207, 783833, 770937, 756705, 741909, 727698, 714775, 703096, 692349, 682438, 673539, 666027, 660350, 656604, 654191, 652278, 650731, 650228, 651150, 652785, 654028, 654619, 655095, 655666, 655819, 655274, 654670, 654835, 655785, 656989, 658245, 659663, 660950, 661531, 661422, 661279, 661371, 661136, 660082, 658541, 657115, 655858, 654492, 653098, 652056, 651460, 651026, 650535, 650115, 650301, 652035, 656257, 663158, 672104, 682659, 695360, 711116, 730230, 752548, 778204]
60542G78204K9270L2532L4806L6116L6476L5223L1683K5999J8669R842k08j0270
60530A058342j8674k4531k7944k9257k8635k6265k2437j7506j2161p430l892j090
60518H38520J724M495O548P672Q281Q575Q330P701P620R016J2000J6080K0848
60505I57410K6193L2113L8629M5848N3962O3186P3638Q5146R7206J09350J21575
60494A704256J34237J47598J61739J76882J93270K10442K26898K40764K50439
60485C446525K53912K47508K26385J87350J31389O3214j1446q7405j59288k20764
60475D077380k65965k91879k99168k91160k72534k48264k22309j96671j72003
60466A817427j49087j29051j12236r7796q4901p3770o4969n8234n2571m7307m2535
$$ y = [778204, 807474, 840006, 874812, 910928, 947404, 982627, 1014310, 1040309, 1058978, 1068820, 1068612, 1058342, 1039668, 1015137, 987193, 957936, 929301, 903036, 880599, 863093, 850932, 843502, 839610, 838520, 840244, 844739, 851287, 858959, 867240, 875815, 884145, 891846, 899466, 908482, 920482, 936562, 957410, 983603, 1015716, 1054345, 1100193, 1154155, 1217341, 1290979, 1376125, 1473331, 1582681, 1704256, 1838493, 1986091, 2147830, 2324712, 2517982, 2728424, 2955322, 3196086, 3446525, 3700437, 3947945, 4174330, 4361680, 4493069, 4556283, 4544837, 4457432, 4298144, 4077380, 3811415, 3519536, 3220368, 2929208, 2656674, 2408410, 2186101, 1989430, 1817427, 1668340, 1539289, 1427053, 1329257, 1244356, 1170586, 1105617, 1047383, 994812, 947505, 904970]
60455I04970l8562l5341l2494k9730k7087k4788k2851k1049j9311j7850j6667
60444F19240j5299j3478j1687j0488r651q669p771p458p345o607n524n289o037
60431E03937o521o138n918o589p083o064l939j987l92J436L123L589K889K311
60417D72654K428K417J598O37N59J443K563L302L434L026K524K596L503M785N744
60402E13213O099O007N756N579N635N912O218O302O000N362M706M380M424M543
60388E90136M545M558M679M719M477M016L339K177M64j223k175k382k454k818
60374F12058l412m067m782n494n944n852n141l935k480j027K23J068J301J036
60360E73552Q74J402K427L177L260L021K855K740K570K360J953J157L87L88R83
$$ y = [904970, 866408, 831067, 798573, 768843, 741756, 716968, 694117, 673068, 653757, 635907, 619240, 603941, 590463, 578776, 568288, 558637, 549968, 542197, 534739, 527394, 520787, 515263, 509974, 503937, 497416, 491278, 485360, 478771, 471688, 465624, 461685, 459698, 459306, 460742, 463865, 467454, 470343, 472654, 475082, 477499, 479097, 479734, 480293, 481736, 484299, 487601, 491035, 494061, 496585, 499181, 502684, 507469, 513213, 519312, 525319, 531075, 536654, 542289, 548201, 554419, 560721, 566721, 572083, 576789, 581169, 585593, 590136, 594681, 599239, 603918, 608637, 613114, 617130, 620469, 622646, 623110, 621887, 619712, 617330, 614876, 612058, 608646, 604579, 599797, 594303, 588359, 582507, 577366, 573431, 570951, 569924, 570147, 571215, 572516, 573552, 574426, 575828, 578255, 581432, 584692, 587713, 590568, 593308, 595878, 598238, 600191, 601348, 601735, 602123, 603106]
60345F03106R42l69k004k727k549k209j922j543j353j612j746j102j28K31J06
60330E85121M96J630K626K861K627K291J828J398J552K418L316L524K963J980
60316F16631J004M13K57M8o08j306j406j082j072j462j673j573j670k028k004
60301F02469j390q74j045j677k337k953l400l329k817k470k440k113j137l9O97
60286E75145J347K165K656K427K091K468L356L975M248M702N315N472N100M997
60272F25464N752O932P660P621P243P065P198P354P402P694Q648R999J0969J1328
60258G38329J1828J3126J4714J5556J5638J6161J8058K0894K3471K5188K6453
60247I39416K8085L0567L3866L7616M1433M5292M9604N4855O0931O6963P2083
$$ y = [603106, 604048, 603679, 601675, 598948, 596399, 594190, 592268, 590725, 589372, 587760, 586014, 584912, 584784, 585015, 585121, 585617, 587247, 589873, 592734, 595361, 597652, 599480, 600878, 602430, 604848, 608164, 611688, 614651, 616631, 617635, 618048, 618305, 618353, 617745, 616439, 615033, 613951, 612879, 611417, 609744, 608171, 606501, 604473, 602469, 601079, 600205, 599160, 597483, 595146, 592193, 588793, 585464, 582647, 580177, 577737, 575624, 574487, 574448, 575145, 576492, 578657, 581313, 583740, 585831, 588299, 591655, 595630, 599878, 604580, 609895, 615367, 620467, 625464, 631216, 638148, 645808, 653429, 660672, 667737, 674935, 682289, 689691, 697385, 706033, 716032, 727001, 738329, 750157, 763283, 777997, 793553, 809191, 825352, 843410, 864304, 887775, 912963, 939416, 967501, 998068, 1031934, 1069550, 1110983, 1156275, 1205879, 1260734, 1321665, 1388628, 1460711]
60236A460711P6265Q0203Q4279Q7973R0389R1058Q9959Q7110Q2611P6942P0643
60225B378143O3729N5753M6516L6379K5875J5416N433l604j1453j8114k3515k7371
60213B543187k9419k9594k8004k4961k0949j6191j0380l254M683J2567K0303K8665
60201B446653L8115M8074N7553O6051P3521Q0006Q5569R0156R3092R3159Q9657
60190C261606Q3095P4440O3989N1521L7371K2717Q661m640j7744l1011m3985n5576
60178C450444o4710p0870p4127p4820p3301o9786o4271n6652m7188l6683k5949
60167B792087j5187m217O734J7016K6273L4679M2293M8650N3155N5453N5223N2156
60155C164315M6413L8763K9972K0311R938o44j0788j9994k7701l3209l6248l7245
$$ y = [1460711, 1536976, 1617179, 1701458, 1789431, 1879820, 1970878, 2060837, 2147947, 2230558, 2307500, 2378143, 2441872, 2497625, 2544141, 2580520, 2606395, 2621811, 2627244, 2623640, 2612187, 2594073, 2570558, 2543187, 2513768, 2484174, 2456170, 2431209, 2410260, 2394069, 2383689, 2380435, 2385118, 2397685, 2417988, 2446653, 2484768, 2532842, 2590395, 2656446, 2729967, 2809973, 2895542, 2985698, 3078790, 3171949, 3261606, 3344701, 3419141, 3483130, 3534651, 3572022, 3594739, 3603400, 3598760, 3581016, 3550005, 3506020, 3450444, 3385734, 3314864, 3240737, 3165917, 3092616, 3022830, 2958559, 2901907, 2854719, 2818036, 2792087, 2776900, 2772683, 2779417, 2796433, 2822706, 2857385, 2899678, 2948328, 3001483, 3056936, 3112159, 3164315, 3210728, 3249491, 3279463, 3299774, 3309712, 3309068, 3298280, 3278286, 3250585, 3217376, 3181128, 3143883]
60143C143883l6504l3502k7556j8977q940J805J3430K6285M0274N5105P0598Q6486
60131C312387J02340J18063J34073J50586J67041J82651J97438K12097K26813
60122D803489K40539K51686K59237K63011K63102K59365K51332K38453K20494
60113G050708J97884J71593J42456J10736P6584M0725M258l2052o7820j02333
60103G592739j34392j62958j87403k06975k20663k28010k29547k25909k17113
60094E779769k03309j85761j66210j45399j23078r9441p5763n3241l1842j0760
60084D684965J0193L0043M7407O1565P2649Q0817Q5552Q6145Q2674P5807O5598
60073E383415N1363L3279J3289o448k5381m3985o1883p7850r1423j03260j13685
$$ y = [3143883, 3107379, 3073877, 3046321, 3027344, 3018404, 3020209, 3033639, 3059924, 3100198, 3155303, 3225901, 3312387, 3414727, 3532790, 3666863, 3817449, 3984490, 4167141, 4364579, 4576676, 4803489, 5044028, 5295714, 5554951, 5817962, 6081064, 6340429, 6591761, 6830214, 7050708, 7248592, 7420185, 7562641, 7673377, 7749961, 7790686, 7794944, 7762892, 7695072, 7592739, 7458347, 7295389, 7107986, 6901011, 6680348, 6452338, 6222791, 5996882, 5779769, 5576460, 5390699, 5224489, 5079090, 4956012, 4856571, 4780808, 4727567, 4695725, 4684965, 4695158, 4725201, 4772608, 4834173, 4906822, 4987639, 5073191, 5159336, 5242010, 5317817, 5383415, 5434778, 5468057, 5481346, 5474898, 5449517, 5405532, 5343649, 5265799, 5174376, 5071116, 4957431]
60062D957431j22016j27702j31108j32729j32346j29503j24176j16614j07006
60053C834231r5719q3362p0277n6404m1858k7189j2753J603J5929K9766M2701
60042C536668N4831O6279P6597Q5015R0995R4268R4568R1652Q5347P5573O2611
60031D414404M7316L0585J2657o540k6265m4958o1522p5946q8427r8600j06012
60020C996692j10608j12294j10632j05606r8087q9088p8892o7482n5285m2927
60010C125791l0579j8103n596O698J8810L1011M3550N6637P0359Q4271R7509J09492
59998C589850J20103J28928J34916J37166J35492J29806J19612J04774Q6255O5450
59988D752352M3218K0163k640k4118m4130o3126q0937r6579j09125j18053j22765
$$ y = [4957431, 4835415, 4707713, 4576605, 4443876, 4311530, 4182027, 4057851, 3941237, 3834231, 3738512, 3655150, 3584873, 3528469, 3486611, 3459422, 3446669, 3448272, 3464201, 3493967, 3536668, 3591499, 3657778, 3734375, 3819390, 3910385, 4004653, 4099221, 4190873, 4276220, 4351793, 4414404, 4461720, 4492305, 4504962, 4498422, 4472157, 4427199, 4365677, 4289731, 4201304, 4102704, 3996692, 3886084, 3773790, 3663158, 3557552, 3459465, 3370377, 3291485, 3224003, 3168718, 3125791, 3095212, 3077109, 3071513, 3078211, 3097021, 3128032, 3171582, 3228219, 3298578, 3382849, 3480358, 3589850, 3709953, 3838881, 3973797, 4110963, 4246455, 4376261, 4495873, 4600647, 4686902, 4752352, 4795570, 4815733, 4813093, 4788975, 4744845, 4681719, 4600782, 4504203, 4395078, 4277025, 4154260]
59977D154260j22621j17700j09085r8119q5667p2186n8094m3773k9369j4798r8
59966C402750J4230K7353L8806M9001N8653O7693P5232Q0610Q3939Q5318Q4263
59955D067848Q0444P4526O7581N9891N0954M0581K9462J8662Q901L84o843j2526
59943D479865j6041j6709j4213q459P28J3375K8847M6294O5692Q7758J12502J38608
59931D918247J64675J90402K16000K41028K64391K84949L01425L12123L15495
59922G208735L10738K97273K74011K39948J95398J42115Q2367J8494m6655j09474
59912H612950j66094k13304k49399k74436k89390k94907k91279k79689k62589
59903F291863k42279k19623j94728j68185j40980j13724q6773o0729l5993j2115
$$ y = [4154260, 4031639, 3913939, 3804854, 3706735, 3621068, 3548882, 3490788, 3447015, 3417646, 3402848, 3402750, 3416980, 3444333, 3483139, 3532140, 3590793, 3658486, 3733718, 3814328, 3898267, 3983585, 4067848, 4148292, 4222818, 4290399, 4350290, 4401244, 4441825, 4471287, 4489949, 4498850, 4499234, 4492391, 4479865, 4463824, 4447115, 4432902, 4424443, 4425171, 4438546, 4467393, 4513687, 4579379, 4667137, 4779639, 4918247, 5082922, 5273324, 5489324, 5730352, 5994743, 6279692, 6581117, 6893240, 7208735, 7519473, 7816746, 8090757, 8330705, 8526103, 8668218, 8750585, 8769079, 8722424, 8612950, 8446856, 8233552, 7984153, 7709717, 7420327, 7125420, 6834141, 6554452, 6291863, 6049584, 5829961, 5635233, 5467048, 5326068, 5212344, 5125571, 5064842, 5028849, 5016734]
59893E016734J1597L4999N7300P8016R7054J14045J28270J38979J45159J45374
59883E967527J38678J25472J06725Q2593N2784J8082j9398n7470r4466j28523
59873F192004j57372j79289j93853k01598k03408k00399j93792j84611j73679
59864D504003j61832j49820j38077j26923j16850j08233j00900r4346q8097q1572
59854C337353p4064o5371n6079m6656l6766k6248j6165p902j519L825Q018R774
59842C028200Q399M705j78n998j2958k0710k8217l4348l8530m1134m3101m4779
59830B771351m5401m4259m2007l9913l8104l5504l1504k6735k2106j8046j4689
59819B413083j1752q015k058N987J4203K0878K6000L0384L4118L6477L6776L4754
$$ y = [5016734, 5028331, 5063330, 5120630, 5198646, 5295700, 5409745, 5538015, 5676994, 5822153, 5967527, 6106205, 6231677, 6338402, 6420995, 6473779, 6491861, 6472463, 6414993, 6320527, 6192004, 6034632, 5855343, 5661490, 5459892, 5256484, 5056085, 4862293, 4677682, 4504003, 4342171, 4192351, 4054274, 3927351, 3810501, 3702268, 3601368, 3507022, 3418925, 3337353, 3263289, 3197918, 3141839, 3095183, 3058417, 3032169, 3016004, 3008102, 3006583, 3010408, 3018426, 3028200, 3036599, 3041304, 3041126, 3035128, 3022170, 3001460, 2973243, 2938895, 2900365, 2859231, 2816130, 2771351, 2725950, 2681691, 2639684, 2599771, 2561667, 2526163, 2494659, 2467924, 2445818, 2427772, 2413083, 2401331, 2393316, 2391258, 2397245, 2411448, 2432326, 2458326, 2488710, 2522828, 2559305, 2596081, 2630835]
59807B630835L0571K4945J9029J3664Q961M746J218j116j824p10K197O713J2650
59794B751879J9881K8241L7687M8777O2416P8670R6501J15318J36112J59956J85839
59783C721277K11236K34457K54972K71469K81172K81455K70676K46925K07540
59774E981179J51262Q0625K000p6155j45153j98158k32127k47930k48536k37467
59764D829540k18711j96264j72664j48677j24879j02646q2900o5093m8446l3306
59754C635954k0267q750K328J3131K3321L3388M4253N5760O6844P7210Q7831R9620
59742D110623J12612J26598J41765J58361J76301J95373K15498K36728K59316
59733E733175K83715L10054L37605L65157L91792M16824M39182M57467M70658
$$ y = [2630835, 2661406, 2686351, 2705380, 2719044, 2728005, 2732751, 2733969, 2732853, 2731029, 2730319, 2732516, 2739229, 2751879, 2771760, 2800001, 2837688, 2886465, 2948881, 3027551, 3124052, 3239370, 3375482, 3535438, 3721277, 3932513, 4166970, 4421942, 4693411, 4974583, 5256038, 5526714, 5773639, 5981179, 6132441, 6213066, 6215066, 6138911, 5993758, 5795600, 5563473, 5315543, 5067007, 4829540, 4610829, 4414565, 4241901, 4093224, 3968345, 3865699, 3782799, 3717706, 3669260, 3635954, 3615687, 3606937, 3609265, 3622396, 3645717, 3679105, 3723358, 3779118, 3845962, 3923172, 4011003, 4110623, 4223235, 4349833, 4491598, 4649959, 4826260, 5021633, 5237131, 5473859, 5733175, 6016890, 6326944, 6664549, 7029706, 7421498, 7838322, 8277504, 8734971, 9205629]
59724I205629M78064M78576M70728M54125M30455M02739L73869L46240L22382
59715A2962807L05054K96211K96138L03778L17606L35814L55924L74866L89659
59706A5937857L97625L96117L82875L57274L20671K75101K22056J63132J01231
59697A8553939M0207j6431o5741j04875j31658j45660j47621j37736j15544q1612
59687A7647268l8115J2686O9647J32059J98797K68677L40705M13291M83822N49546
59677B0078383O08198O57309O93421P12487P10404O83034O26864N40581M25745
59668B5736426K85846J25842m6752k21666l88041n36691o60185p52523q10659
59659B2731597q36098q33849q10076p71417p25387o79438o39310o09203n93122
$$ y = [9205629, 9683693, 10162269, 10632997, 11087122, 11517577, 11920316, 12294185, 12640425, 12962807, 13267861, 13564072, 13860210, 14163988, 14481594, 14817408, 15173332, 15548198, 15937857, 16335482, 16731599, 17114474, 17471748, 17792419, 18067520, 18289576, 18452708, 18553939, 18594146, 18577715, 18511974, 18407099, 18275441, 18129781, 17982160, 17844424, 17728880, 17647268, 17609153, 17621839, 17691486, 17823545, 18022342, 18291019, 18631724, 19045015, 19528837, 20078383, 20686581, 21343890, 22037311, 22749798, 23460202, 24143236, 24770100, 25310681, 25736426, 26022272, 26148114, 26101362, 25879696, 25491655, 24954964, 24294779, 23542256, 22731597, 21895499, 21061650, 20251574, 19480157, 18754770, 18075332, 17436022, 16826819, 16233697]
59650A6233697n94141o11635o40024o70755o95362p07569p04423o86608o57292
59641A0265888o20096n78109n34172m90833m49553m10600l74044l40258l09286
59632F158937k80590k53875k29571k07940j88298j69669j51896j35507j20725
59623D420866j07156r4401q2559p2019o3082n5825n0120m5700m2382m0386m0253
59612C726983m2268m6000n0606n5552o0760o5955p0276p2920p3909p3836p3007
59601C041894p1337o8917o5918o2015n6697n0424m4587l9855l5285k9774k3735
59590B493350j8472j4295j0215n473m82L886P301R956J2043J3668J5038J6381
59578B522686J7708J8759J9315J9589K0300K2161K5221K8872L2550L6254M0339
$$ y = [16233697, 15639556, 15027921, 14387897, 13717142, 13021780, 12314211, 11609788, 10923180, 10265888, 9645792, 9067683, 8533511, 8042678, 7593125, 7182525, 6808481, 6468223, 6158937, 5878347, 5624472, 5394901, 5186961, 4998663, 4828994, 4677098, 4541591, 4420866, 4313710, 4219309, 4136750, 4064731, 4001649, 3945824, 3895704, 3850004, 3807622, 3767236, 3726983, 3684715, 3638715, 3588109, 3532557, 3471797, 3405842, 3335566, 3262646, 3188737, 3114901, 3041894, 2970557, 2901640, 2835722, 2773707, 2717010, 2666586, 2621999, 2582144, 2546859, 2517085, 2493350, 2474878, 2460583, 2450368, 2444895, 2444413, 2448299, 2455600, 2465556, 2477599, 2491267, 2506305, 2522686, 2540394, 2559153, 2578468, 2598057, 2618357, 2640518, 2665739, 2694611, 2727161, 2763415, 2803754]
59567B803754M5060N0510N6721O3592P0893P8441Q6223R4377J03210J13186J24530
59556C690497J36777J49061J60848J72120J82806J92463K00594K06830K10759
59547E302755K11961K10195K05213J96598J84392J69579J52912J33376J09196
59538F876177Q0866N2013K6480N438j2015k6481l7720m5666n0611n2393n0320
59527F765768m3895l2993j7611J894K4466M8876P4253R9515J22540J40748J52386
59516G335947J56749J53358J41656J21327R2346N4993J0497l8418q8334j36560
59506G803561j81480k21780k55909k82195k99117l05886l03368k94108k80661
59497E379057k64044k44310k22263j99674j77873j56950j36501j16510r7358p9415
$$ y = [2803754, 2848814, 2899324, 2956045, 3019637, 3090530, 3168971, 3255194, 3349571, 3452781, 3565967, 3690497, 3827274, 3976335, 4137183, 4309303, 4492109, 4684572, 4885166, 5091996, 5302755, 5514716, 5724911, 5930124, 6126722, 6311114, 6480693, 6633605, 6766981, 6876177, 6957043, 7009056, 7035536, 7040974, 7028959, 7002478, 6964758, 6919092, 6868481, 6816088, 6765768, 6721873, 6688880, 6671269, 6673163, 6697629, 6746505, 6820758, 6920273, 7042813, 7183561, 7335947, 7492696, 7646054, 7787710, 7909037, 8001383, 8056376, 8066873, 8028455, 7940121, 7803561, 7622081, 7400301, 7144392, 6862197, 6563080, 6257194, 5953826, 5659718, 5379057, 5115013, 4870703, 4648440, 4448766, 4270893, 4113943, 3977442, 3860932, 3763574, 3684159]
59487C684159o2729m6892l1265j5580q4J5130L0507M6272O1884P6846R1567J06592
59475C956407J21379J34759J46355J56522J64990J70501J71937J68875J60924
59466E352649J47408J28104J03685P5083M2964Q016k8646o5541j00894j32639
59456E530189j58953j79116j93600k03191k08297k09094k05950j99602j91069
59447C781317j81283j70621j58985j46600j34428j23388j13449j03980r4762q6107
59437B467714p8110p0352o2425n4332m6493l9551l3956k9441k5170k0669j6252
59426A990963j2257q463m660j140J886M688P293R115J0074J1066J2265J1873Q230
59413B040933K697j248j636P63M590R440J4962K0268K5093L0166L5496L9349L9978
$$ y = [3684159, 3621430, 3574538, 3543273, 3527693, 3527609, 3542739, 3573246, 3619518, 3681402, 3758248, 3849815, 3956407, 4077786, 4212545, 4358900, 4515422, 4680412, 4850913, 5022850, 5191725, 5352649, 5500057, 5628161, 5731846, 5806929, 5849893, 5857909, 5829263, 5763722, 5662828, 5530189, 5371236, 5192120, 4998520, 4795329, 4587032, 4377938, 4171988, 3972386, 3781317, 3600034, 3429413, 3270428, 3123828, 2989400, 2866012, 2752563, 2648583, 2553821, 2467714, 2389604, 2319252, 2256827, 2202495, 2156002, 2116451, 2082495, 2053054, 2027884, 2007215, 1990963, 1978706, 1970243, 1965583, 1964443, 1966329, 1971017, 1978310, 1987425, 1997499, 2008565, 2020830, 2032703, 2040933, 2043630, 2042382, 2040746, 2041509, 2046099, 2055539, 2070501, 2090769, 2115862, 2146028, 2181524, 2220873, 2260851]
59400B260851L7858L5398L4939L7470M2702M9759N7996O7551P8770R1133J03487
59389B897914J15596J28683J43990J61416J80073J99534K20009K41760K64946
59380D553921K89684L15657L41787L66720L89505M09540M25984M37449M42223
59371G972470M38881M27005M07484L81994L52263L19968K87021K55307K25966
59362A1068359J99153J74356J50623J26669J01263P3504M2474P024l3380p7845
59352A1832200j24619j72379k20270k66909l10108l47691l78056m00291m14436
59343I197441m21557m22815m18574m08948l94865l77600l57647l35069l10833
59334E749533k86561k63017k40004k17849j97603j79452j62260j45177j28755
$$ y = [2260851, 2298709, 2334107, 2369046, 2406516, 2449218, 2498977, 2556973, 2624524, 2703294, 2794427, 2897914, 3013510, 3142193, 3286183, 3447599, 3627672, 3827206, 4047215, 4288975, 4553921, 4843605, 5159262, 5501049, 5867769, 6257274, 6666814, 7092798, 7530247, 7972470, 8411351, 8838356, 9245840, 9627834, 9980097, 10300065, 10587086, 10842393, 11068359, 11267512, 11441868, 11592491, 11719160, 11820423, 11893927, 11936401, 11943425, 11910045, 11832200, 11707581, 11535202, 11314932, 11048023, 10737915, 10390224, 10012168, 9611877, 9197441, 8775884, 8353069, 7934495, 7525547, 7130682, 6753082, 6395435, 6060366, 5749533, 5462972, 5199955, 4959951, 4742102, 4544499, 4365047, 4202787, 4057610, 3928855]
59325C928855j13869j00492q8078p6356o5270n4772m5062l6371k8266j9976j1585
59314C288758l972K633Q963J5264K0688K4737K8194L1796L4888L6305L5939L4564
59302C558757L2672L0148K6807K2596J7664J2629Q340N108K742J507K262N333
59290C726565J0045J5799K2663L0539L8663M6632N4812O2928O9265P2409P3142
59279D223462P3487P4328P4973P4558P2639O8508O1189N0419L7093K2496P509
59268D840661p479k2163l5934m7758n6677o2546o6006o7578o7264o5131o1708
59257D280417n7558n3030m8651m5072m2259l9480l6582l4526l4130l4920l5825
59246C818384l6428l6838l6932l6492l5638l4467l2496k9034k3807j6830q156
$$ y = [3928855, 3814986, 3714494, 3626416, 3550060, 3484790, 3430018, 3384956, 3348585, 3320319, 3300343, 3288758, 3284786, 3287419, 3296382, 3311646, 3332334, 3357071, 3385265, 3417061, 3451949, 3488254, 3524193, 3558757, 3591429, 3621577, 3648384, 3670980, 3688644, 3701273, 3709613, 3714721, 3717463, 3718970, 3721232, 3726565, 3736610, 3752409, 3775072, 3805611, 3844274, 3890906, 3945718, 4008646, 4077911, 4150320, 4223462, 4296949, 4371277, 4446250, 4520808, 4593447, 4661955, 4723144, 4773563, 4810656, 4833152, 4840661, 4833182, 4811019, 4775085, 4727327, 4670650, 4608104, 4542098, 4474520, 4407256, 4342125, 4280417, 4222859, 4169829, 4121178, 4076106, 4033847, 3994367, 3957785, 3923259, 3889129, 3854209, 3818384, 3781956, 3745118, 3708186, 3671694, 3636056, 3601589, 3569093, 3540059, 3516252, 3499422, 3491266]
59235C491266J864J2692K4490L8376N5085P3930R3701J14138J35759J58637J82159
59224D382097K05687K28659K50061K68396K82101K89728K89914K81557K63826
59215F742026K35999J97789J50205R5567L6369k5340q7244j46331j99760k45645
59205F753635k82479l08605l23110l26757l21478l09306k92241k72333k51068
59196D066258k29006k06619j85014j65267j47585j31655j17335j04525r3095q3453
59186B602704p6297p1185o6322o0660n5208n1190m7863m3531l8005l2559k7838
59175B032046k3383j8973j5049j1707q451n039j641J831N616R409J2701J5677
59163A993037J8808K1778K3948K5772K8487L2319L6131L8996M1134M3046M4791
$$ y = [3491266, 3493130, 3505822, 3530312, 3568688, 3623773, 3697703, 3791404, 3905542, 4041301, 4199938, 4382097, 4587784, 4816443, 5066504, 5334900, 5617001, 5906729, 6196643, 6478200, 6742026, 6978025, 7175814, 7326019, 7421586, 7457955, 7432615, 7345371, 7199040, 6999280, 6753635, 6471156, 6162551, 5839441, 5512684, 5191206, 4881900, 4589659, 4317326, 4066258, 3837252, 3630633, 3445619, 3280352, 3132767, 3001112, 2883777, 2779252, 2686157, 2602704, 2526407, 2455222, 2388900, 2328240, 2273032, 2221842, 2173979, 2130448, 2092443, 2059884, 2032046, 2008663, 1989690, 1974641, 1962934, 1954483, 1949444, 1947803, 1949634, 1955250, 1964659, 1977360, 1993037, 2011845, 2033623, 2057571, 2083343, 2111830, 2144149, 2180280, 2219276, 2260410, 2303456, 2348247]
59152B348247M6400M7936M8836M8149M5856M3058M0417L7224L2584K6694K0338
59141B785739J3783O925J33n841j0699j4798j8533k1836k4215k5106k4196k1670
59129B639686j8174j4437j0773o867k114L713J0140J6549K2931K9748L7065M4371
59117B751838N1328N8097O4705P0778P6270Q1822Q7851R3812R8994J03558J08274
59106C647327J13644J19744J26544J33685J40375J45930J49973J51680J49582
59097D878484J42870J32145J18046R9727P5834M6521J3475k1688n7825r3269j25661
59086E208659j53075j74641j90142j99803k04430k04940k01760j95280j86689
59077C497899j77499j68335j58892j49012j39007j29094j19287j09838j01123
$$ y = [2348247, 2394647, 2442583, 2491419, 2539568, 2585424, 2628482, 2668899, 2706123, 2738707, 2765401, 2785739, 2799522, 2806447, 2806580, 2800739, 2790040, 2775242, 2756709, 2734873, 2710658, 2685552, 2661356, 2639686, 2621512, 2607075, 2596302, 2589435, 2587321, 2591034, 2601174, 2617723, 2640654, 2670402, 2707467, 2751838, 2803166, 2861263, 2925968, 2996746, 3073016, 3154838, 3242689, 3336501, 3435495, 3539053, 3647327, 3760971, 3880715, 4007259, 4140944, 4281319, 4427249, 4577222, 4728902, 4878484, 5021354, 5153499, 5271545, 5371272, 5447106, 5493627, 5507102, 5485414, 5427589, 5334320, 5208659, 5055584, 4880943, 4690801, 4490998, 4286568, 4081628, 3879868, 3684588, 3497899, 3320400, 3152065, 2993173, 2844161, 2705154, 2576060, 2456773, 2346935, 2245812]
59068B245812r3151q5803p9314p3814o8739o3488n8409n4247n0858m7435m3711
59057A526843m0032l6439l2788k9561k7354k5653k3322k0403j8149j7103j6405
59046A239634j5298j4182j3623j3341j2751j1798j0742r725q851q099o948m837
59034A109439k165n5J058J833K835L845M664N729P363R114J0333J0994J1587J2588
59020A189162J4179J6029J7329J7604J7447J7731J8133J7398J5128J2293R650
59009A362083O798L299k67l110n358p564r597j0772j0824j0138r211q321p580
58996A289438o851n781m161k181k20J436K667L581M413N147N294M527L357K739
58982A303405L022L832M799N741O226N782M783M388N276P005Q727J0120J1355
$$ y = [2245812, 2152661, 2066858, 1987544, 1913730, 1844991, 1781503, 1723094, 1668847, 1617989, 1570554, 1526843, 1486811, 1450372, 1417584, 1388023, 1360669, 1335016, 1311694, 1291291, 1273142, 1256039, 1239634, 1224336, 1210154, 1196531, 1183190, 1170439, 1158641, 1147899, 1138174, 1129323, 1121224, 1114276, 1109439, 1107274, 1107219, 1108277, 1110110, 1112945, 1116790, 1121454, 1127183, 1134546, 1143660, 1153993, 1164987, 1176574, 1189162, 1203341, 1219370, 1236699, 1254303, 1271750, 1289481, 1307614, 1325012, 1340140, 1352433, 1362083, 1368881, 1372180, 1371913, 1368803, 1363445, 1355881, 1346284, 1335512, 1324688, 1314550, 1305339, 1297018, 1289438, 1282587, 1276806, 1272645, 1270464, 1270244, 1271680, 1274347, 1277928, 1282341, 1287488, 1292782, 1297309, 1300666, 1303405, 1306427, 1310259, 1315058, 1320799, 1327025, 1332807, 1337590, 1341978, 1347254, 1354259, 1362986, 1373106, 1384461]
58969A384461J2700J4274J5938J7310J8306J9498K1413K3654K5292K6056K6437
58958A605339K6790K7026K7187K7466K7566K6917K5651K4688K4607K5190K6158
58947A894585K7646K9752L2300L5246L8741M2623M6427N0001N3616N7458O1540
58936B369935O6033P0966P5769P9909Q3815Q8344R3454R8459J03566J09999J18425
58925C358674J28301J39005J50631J63393J77307J92738K10339K30115K51376
58916E001879K73818K97690L22832L48712L75491M03685M32427M59452M83312
58907H399298N04037N20861N30883N31238N21333N01623M71175M28013L71389
58898A2779850L02418K22951J35217M2461n1289j42290k27406l03607l68202m19834
$$ y = [1384461, 1397161, 1411435, 1427373, 1444683, 1462989, 1482487, 1503900, 1527554, 1552846, 1578902, 1605339, 1632129, 1659155, 1686342, 1713808, 1741374, 1768291, 1793942, 1818630, 1843237, 1868427, 1894585, 1922231, 1951983, 1984283, 2019529, 2058270, 2100893, 2147320, 2197321, 2250937, 2308395, 2369935, 2435968, 2506934, 2582703, 2662612, 2746427, 2834771, 2928225, 3026684, 3130250, 3240249, 3358674, 3486975, 3625980, 3776611, 3940004, 4117311, 4310049, 4520388, 4750503, 5001879, 5275697, 5573387, 5896219, 6244931, 6620422, 7024107, 7456534, 7915986, 8399298, 8903335, 9424196, 9955079, 10486317, 11007650, 11509273, 11980448, 12408461, 12779850, 13082268, 13305219, 13440436, 13482897, 13431608, 13289318, 13061912, 12758305, 12390103, 11970269]
58888A1970269m58650m85391n00634n04888m99109m85069m65275m42237m17539
58879G711477l91834l65709l40063l15553k92261k70317k50308k32702k17247
58870E035483k03317j90469j78368j66647j55135j43965j33220j22955j13567
58861C627840j05540r8595r1753q4547p7576p1492o6087o0743n5219m9569m3842
58850B822877l8223l2959k7815k2154j5895r809m493L66N270J0123J4663J9147
58838B721098K3987K9114L4265L9589M5469N1889N8448O4847P1178P7828Q5244
58827C302956R3567J02477J11676J21353J31886J43210J55099J67936J82507J99072
58817D711739K17264K36892K58143K81031L05379L31324L58946L87394M15161
$$ y = [11970269, 11511619, 11026228, 10525594, 10020706, 9521597, 9036528, 8571253, 8129016, 7711477, 7319643, 6953934, 6613871, 6298318, 6006057, 5735740, 5485432, 5252730, 5035483, 4832166, 4641697, 4463329, 4296682, 4141547, 3997582, 3864362, 3741407, 3627840, 3522300, 3423705, 3331952, 3247405, 3169829, 3098337, 3032250, 2971507, 2916288, 2866719, 2822877, 2784654, 2751695, 2723880, 2701726, 2685831, 2676022, 2671529, 2671895, 2677165, 2687288, 2701951, 2721098, 2745085, 2774199, 2808464, 2848053, 2893522, 2945411, 3003859, 3068706, 3139884, 3217712, 3302956, 3396523, 3499000, 3610676, 3732029, 3863915, 4007125, 4162224, 4330160, 4512667, 4711739, 4929003, 5165895, 5424038, 5705069, 6010448, 6341772, 6700718, 7088112, 7503273]
58808G503273M41226M64926M84762M98409N04127N01026M87798M62336M23198
58799A1771081L70538L05313K28660J42563N0278m4453j37976k26348l05544l72648
58789A1781464m26361m66207m92210n05493n08092n01770m87829m68171m45215
58780G480116m20426l94118l67055l40887l16545k93564k71724k52026k35269
58771D588502k20810k07593j95283j83628j71906j59981j48877j39360j30769
58762C030295j22114j13385j05030r7044q9411q2520p6373p0198o3607n7189n1402
58751B102022m5889m0584l6298l3350l0718k7466k4012k1190j9080j7631j7205
58740A788599j7685j8115j8131j8628k0128k1837k3229k5071k7734k9888l0313
$$ y = [7503273, 7944499, 8409425, 8894187, 9392596, 9896723, 10397749, 10885547, 11347883, 11771081, 12141619, 12446932, 12675592, 12818155, 12868433, 12823980, 12686004, 12459656, 12154112, 11781464, 11355103, 10888896, 10396686, 9891193, 9383101, 8881331, 8393502, 7925331, 7480116, 7059690, 6665572, 6298517, 5957630, 5641085, 5347521, 5075797, 4823771, 4588502, 4367692, 4160099, 3964816, 3781188, 3609282, 3449301, 3300424, 3161064, 3030295, 2908181, 2794796, 2689766, 2592722, 2503311, 2420791, 2344418, 2274220, 2210613, 2153424, 2102022, 2056133, 2015549, 1979251, 1945901, 1915183, 1887717, 1863705, 1842515, 1823435, 1805804, 1788599, 1770914, 1752799, 1734668, 1716040, 1695912, 1674075, 1650846, 1625775, 1598041, 1568153, 1537840]
58729A537840k9640k8955k7970k6208k4579k4058k3903k3083k2405k3224k4819
58718A258996k5163k3795k1931k0147j7941j5426j3558j2572j1730j0649r659
58707A076425q890q312q441r763j1639j2957j3715j4771j6229j7326j7700j7667
58695I19015j7387j6800j6149j5636j4889j3617j2253j1098r513p125n017m361
58683G75170m454l626j572N95K213L473M315M486M485N067N841N582L883J458
58669H06916q73k463k629j428k04r5m46mP54J10k360n185o870p060o047m462l323
58652G64331l111k907j511P58K572L453M010M641N324O382Q116R895J0819J1081
58638H23853J1550J2380J3179J4133J5690J7560J9253K1151K3789K6636K8895
$$ y = [1537840, 1508200, 1479245, 1451275, 1425067, 1400488, 1376430, 1352527, 1329444, 1307039, 1283815, 1258996, 1233833, 1210038, 1188107, 1167960, 1150019, 1134593, 1121035, 1108463, 1096733, 1086084, 1076425, 1067535, 1059223, 1050782, 1041019, 1029380, 1016423, 1002708, 987937, 971708, 954382, 936682, 919015, 901628, 884828, 868679, 853043, 838154, 824537, 812284, 801186, 791673, 784548, 779531, 775170, 770716, 767090, 765518, 766113, 768326, 771799, 776114, 780600, 785085, 790152, 795993, 801575, 805458, 806916, 806043, 803580, 800951, 799523, 799319, 799224, 798778, 798774, 799528, 799638, 797278, 792093, 785223, 778163, 772116, 767654, 764331, 761220, 758313, 756802, 757560, 760132, 763585, 767595, 772236, 777560, 783942, 792058, 801953, 812772, 823853, 835403, 847783, 860962, 875095, 890785, 908345, 927598, 948749, 972538, 999174, 1028069]
58627A028069L0951L3567L6390L8801M1680M6460N2884N9410O5546P2071P9292
58616A585121Q6821R4797J03643J12789J21303J29395J37650J45046J49615J50640
58606B816820J48481J42576J31713J15957R6250P2428M3915J2333j8868m7503
58596C514102p3310r5575j12575j23861j30834j34488j34550j31342j26337j20252
58586B330978j12460j03076r3724q5543p8091p0845o4093n7763n1180m4651l9659
58575A529893l6680l4340l1439k8347k5781k3627k1651k0071j8797j7344j5814
58564A256002j4784j4091j3144j2502j3407j5559j7172j7609j8077j9272k0273
58553A080112k0354k0078j9826j9007j7503j6250j5595j4637j2974j1521j0830
$$ y = [1028069, 1059020, 1092587, 1128977, 1167778, 1209458, 1255918, 1308802, 1368212, 1433758, 1505829, 1585121, 1671942, 1766739, 1870382, 1983171, 2104474, 2233869, 2371519, 2516565, 2666180, 2816820, 2965301, 3107877, 3239590, 3355547, 3451797, 3524225, 3568140, 3580473, 3561605, 3514102, 3440792, 3345217, 3232642, 3108781, 2977947, 2843459, 2708909, 2577567, 2451230, 2330978, 2218518, 2115442, 2021718, 1936175, 1858084, 1787239, 1723146, 1665383, 1614203, 1569552, 1529893, 1493213, 1458873, 1427434, 1399087, 1373306, 1349679, 1328028, 1307957, 1289160, 1271816, 1256002, 1241218, 1227127, 1213983, 1201481, 1188074, 1172515, 1155343, 1137734, 1119657, 1100385, 1080112, 1059758, 1039680, 1019854, 1000847, 983344, 967094, 951499, 936862, 923888, 912367, 901537]
58542I01537j0108q766p507p045o991o765o443o060n335m494m181m210l697k694
58528H17241k235k517k608k190j948j967j554r64j376k720l487l236l224l992
58514G83223m366l695k978k861k507j509r99j684k541k669k775l597m416m306
58500G42320l524k683j800j051r99j325p70P86J853J683J456K172L078L189K837
58485G47222K574K138J499J473K216K510J567J97n58o91m10L93J182R23j29m77
58469G61629J18R3j228k404k325j927k210k527k014j169o68k62J66k3p66r30k79
58452G43274o3q17j415j277j397k219k571j939j621k360k936k443j844j874j629
58437G16869o75l99j489k314j568n15o17r78j52J277K022K387L188L879L698L299
$$ y = [901537, 891429, 882663, 875156, 868111, 861120, 854355, 847912, 841852, 836517, 832023, 827842, 823632, 819935, 817241, 815006, 812489, 809881, 807691, 805743, 803776, 802222, 801258, 799882, 797162, 793675, 790439, 787215, 783223, 778857, 775162, 772184, 769323, 766816, 765307, 764308, 762624, 760083, 757414, 754639, 751042, 746626, 742320, 738796, 736113, 734313, 733262, 732263, 730938, 730168, 730954, 732807, 734490, 735946, 738118, 741196, 744385, 747222, 749796, 751934, 753433, 754906, 757122, 759632, 761199, 761396, 760838, 760147, 759737, 760130, 761312, 762235, 762106, 761629, 761747, 761840, 760612, 758208, 755883, 753956, 751746, 749219, 747205, 746036, 745368, 745106, 745272, 745249, 744483, 743553, 743274, 743211, 742394, 740979, 739702, 738305, 736086, 733515, 731576, 729955, 727595, 724659, 722216, 720372, 718498, 716869, 716194, 715795, 714306, 711992, 710424, 709909, 709292, 708314, 708162, 709439, 711461, 713848, 717036, 720915, 724613, 727912]
58421G27912L508L793L638L960N432O945P387P440P963Q199P412O721P357Q487
58407H16154Q590P773P124O941P074P738Q596Q513P388O650O791O409M920L998
58393I14659M666N248M124K476K147K726K847K649K839K982K627K570L225L410
58379I59195K457J634J774J618L40m68N07J807J651Q17Q36J310J340J694L176
58364I79688M624M807M542M844M908M000L328L917M728M895N483O913P278N671
58350A049626M475N604P129O551M929M515M819M369M123N586P539Q073Q060R311
58336A134709J1079J1647J1642J2551J3656J3578J3164J3848J4890J5177J5637
58325A281578J7047J7675J6234J4696J5006J5490J4001J1993J1772J2281J1557
$$ y = [727912, 731420, 735213, 738851, 742811, 748243, 755188, 762575, 770015, 777978, 786177, 793589, 800310, 807667, 816154, 824744, 832517, 839641, 846582, 853656, 861394, 869990, 878503, 885891, 892541, 899332, 905741, 910661, 914659, 919325, 924573, 928697, 931173, 933320, 936046, 938893, 941542, 944381, 947363, 949990, 952560, 955785, 959195, 961652, 963286, 965060, 966678, 967018, 966550, 967057, 968864, 970515, 971332, 972168, 973478, 974818, 976512, 979688, 984312, 989119, 993661, 998505, 1003413, 1007413, 1010741, 1014658, 1019386, 1024281, 1029764, 1036677, 1043955, 1049626, 1054101, 1059705, 1066834, 1073385, 1078314, 1082829, 1087648, 1092017, 1096140, 1101726, 1109265, 1117338, 1125398, 1134709, 1145788, 1157435, 1169077, 1181628, 1195284, 1208862, 1222026, 1235874, 1250764, 1265941, 1281578, 1298625, 1316300, 1332534, 1347230, 1362236, 1377726, 1391727, 1403720, 1415492, 1427773, 1439330]
58314A439330J0800J1877J3222J2572J1477J2660J4952J5464J4772J5415J7043
58303A589584J7577J7489J8488J9644J9168J8336J9304K0956K1193K1285K3421
58292A806445K6030K6310K5386K6059K7485K7156K6181K7388K9866L0650L0268
58281B109224L1445L3862L5252L6122L8465M1407M3034M4587M7978N1200N1364
58270B563940M9960M9973N0321M8602M6674M7555M9584M9623M9389N2163N6088
58259C113872N7476N7973O1459O6476O9050P0402P4424P9949Q3187Q5326Q9966
58248C909560R5461R7933R9423J04741J12520J17779J21085J26740J34282J40374
58238E059898J46497J56047J66670J74438J82350J95306K10267K21466K31558
$$ y = [1439330, 1450130, 1462007, 1475229, 1487801, 1499278, 1511938, 1526890, 1542354, 1557126, 1572541, 1589584, 1607161, 1624650, 1643138, 1662782, 1681950, 1700286, 1719590, 1740546, 1761739, 1783024, 1806445, 1832475, 1858785, 1884171, 1910230, 1937715, 1964871, 1991052, 2018440, 2048306, 2078956, 2109224, 2140669, 2174531, 2209783, 2245905, 2284370, 2325777, 2368811, 2413398, 2461376, 2512576, 2563940, 2613900, 2663873, 2714194, 2762796, 2809470, 2857025, 2906609, 2956232, 3005621, 3057784, 3113872, 3171348, 3229321, 3290780, 3357256, 3426306, 3496708, 3571132, 3651081, 3734268, 3819594, 3909560, 4005021, 4102954, 4202377, 4307118, 4419638, 4537417, 4658502, 4785242, 4919524, 5059898, 5206395, 5362442, 5529112, 5703550, 5885900, 6081206, 6291473, 6512939, 6744497]
58229F744497K46844K65431K81516K97468L19475L45171L68253L91458M21781
58220I681894M56891M90119N24708N68664O19967O72234P30172Q03151Q88587
58211A5436387R78989J080111J204055J350649J515219J708169J946144K232000
58203B7451723K566720K972802L481805M110004M874145N818865O998031Q442927
58195F6717022J0178349J2243429J4652799J7360503K0291485K3328966K6179411
58188A90951964K8348647K9444931K9451999K8389118K5597345J9750665J0071306
58181C62005975k377202j4850918k4536513l0063578l1705738l0573902k7817245
58174B00080879k4301520k0591253j7025153j3817250j1095505q856885p003839
$$ y = [6744497, 6991341, 7256772, 7538288, 7835756, 8155231, 8500402, 8868655, 9260113, 9681894, 10138785, 10628904, 11153612, 11722276, 12342243, 13014477, 13744649, 14547800, 15436387, 16415376, 17495487, 18699542, 20050191, 21565410, 23273579, 25219723, 27451723, 30018443, 32991245, 36473050, 40583054, 45457199, 51276064, 58274095, 66717022, 76895371, 89138800, 103791599, 121152102, 141443587, 164772553, 190951964, 219300611, 248745542, 278197541, 306586659, 332184004, 351934669, 362005975, 359628773, 344777855, 320241342, 290177764, 258472026, 227898124, 200080879, 175779359, 155188106, 138162953, 124345703, 113250198, 104393313, 97389474]
58167I7389474n539099m670336m592644n167675n922549o392123o405010o053590
58159E2646448n502259m878274m265996l710542l218959k786639k418680k116589
58151B3748510j865260j649537j468107j319406j190576j072061r68394q84244
58143A3330925q13145p48478o92430o46370o04501n63757n28322m98689m67777
58134G767456m32907m00243l72785l45361l15903k90070k70086k50167k27816
58125D862118k08940j96975j87209j76431j68236j63967j58072j47497j36797
58116C317994j29287j21611j11574j02963r8012r2908q5215p8319p4342o9998
58106B353765o3502n8493n6990n5299n0884m6750m5149m3305l9256l5796l4803
$$ y = [97389474, 91850375, 87180039, 82587395, 77419720, 71497171, 65105048, 58700038, 52646448, 47144189, 42265915, 37999919, 34289377, 31070418, 28283779, 25865099, 23748510, 21883250, 20233713, 18765606, 17446200, 16255624, 15183563, 14215169, 13330925, 12517780, 11769302, 11076872, 10430502, 9826001, 9262244, 8733922, 8235233, 7767456, 7334549, 6934306, 6561521, 6216160, 5900257, 5610187, 5340101, 5089934, 4862118, 4653178, 4456203, 4268994, 4092563, 3924327, 3760360, 3602288, 3454791, 3317994, 3188707, 3067096, 2955522, 2852559, 2754547, 2661639, 2576424, 2498105, 2423763, 2353765, 2290263, 2231770, 2174780, 2119481, 2068597, 2021847, 1976698, 1933393, 1894137, 1858341, 1823538]
58095A823538l3555l0289k7796k7940k8223k7033k6842k8756k9487k7197k5167
58084A511253k6040k7448k6777k5519k5490k5196k3363k1814k1738k1113j8701
58073A248054j6621j6363j6199j5004j4449j5012j4119j0776p911p561p777o765
58061A099497n875n981n135k550r95k350m546n421n946p058p150n461m284n053
58047A031692n673m384k827k691k650j353j72l02k62J083K098J478Q37J644K528
58032A021046K079J411J489Q32j629m124m962n280o503p704p757p561p913p655
58018I65769o046m526m148l830k914k703l547l431j443K78K36J50J625L260L550
58003I42280L703N014O175N917N669O894Q317Q374P997Q284Q011O084M064L413
$$ y = [1823538, 1789983, 1759694, 1731898, 1703958, 1675735, 1648702, 1621860, 1593104, 1563617, 1536420, 1511253, 1485213, 1457765, 1430988, 1405469, 1379979, 1354783, 1331420, 1309606, 1287868, 1266755, 1248054, 1231433, 1215070, 1198871, 1183867, 1169418, 1154406, 1140287, 1129511, 1121600, 1114039, 1106262, 1099497, 1093622, 1087641, 1082506, 1079956, 1078961, 1076611, 1072065, 1066644, 1060698, 1053640, 1046490, 1041029, 1036745, 1031692, 1026019, 1021635, 1018808, 1016117, 1013467, 1012114, 1011942, 1011640, 1011378, 1012461, 1014559, 1016037, 1016874, 1018518, 1021046, 1023125, 1024536, 1026025, 1026857, 1025228, 1021104, 1016142, 1010862, 1004359, 996655, 988898, 981337, 973424, 965769, 959723, 955197, 951049, 947219, 944305, 941602, 938055, 934624, 933181, 933459, 933695, 933845, 935470, 938730, 942280, 945983, 950997, 957172, 963089, 968758, 975652, 983969, 992343, 1000340, 1008624, 1016635, 1022719, 1026783, 1030196]
57989A030196K669K01k545l513l582m608n947o024n449n596n715m526l090l084
57975I79387l603k600l05J593K942M603O139O683P152Q911J1102J1759J0675Q980
57961A053418O842L901R67r90k650n013p284q130q053q267q295o932m730l234
57947A001550k537j612m21L91J069K142K952K691K136K560L658M296M436M577
57933A027888M209K663N79j201l327o675j0315j2575j3293j3334j2800j1448r954
57920I40417q911p465m711j591L99J432K569L659L977M026M774N864O299O204
57906I56942O173N771M441K992K352J802K27j842l309m597o514q149q079p011
57892I41199o847p739q262p982p678p336o162m317k696j249O02K334L017L212
$$ y = [1030196, 1032865, 1033066, 1030521, 1027008, 1023426, 1018818, 1012871, 1006847, 1001398, 995802, 990087, 985561, 982471, 979387, 975784, 973184, 972879, 974472, 977414, 982017, 988156, 994839, 1001991, 1010902, 1022004, 1033763, 1044438, 1053418, 1060260, 1064161, 1065128, 1064138, 1061488, 1056475, 1049191, 1041061, 1033008, 1024741, 1016446, 1009514, 1004784, 1001550, 999013, 997401, 996980, 997371, 998440, 1000582, 1003534, 1006225, 1008361, 1010921, 1014579, 1018875, 1023311, 1027888, 1032097, 1034760, 1035339, 1034138, 1030811, 1024136, 1013821, 1001246, 987953, 974619, 961819, 950371, 940417, 931506, 924041, 919330, 917739, 918138, 919570, 922139, 925798, 929775, 933801, 938575, 944439, 950738, 956942, 963115, 968886, 973327, 976319, 978671, 980473, 980700, 978858, 975549, 970952, 964438, 956289, 948210, 941199, 934352, 926613, 918351, 910369, 902691, 895355, 889193, 884876, 882180, 880931, 881533, 883867, 886884, 890096]
57878H90096M214N741O466O515P233Q621R162Q384P526P402P373O827O083N472
57864I87115M826M137L565K774J359k42j356k258l519m646m756m181l979m208
57850I74631m159l872l854l688k540q34K02M21O13P35n9j637k778k923k631k394
57834I45233k302k755m060n403n599m810m232m315m533m730n201n597n083l633
57820H82980j938l38J067J738J461J293K303L850M626M851N744P294Q500R441
57806I32872J1069J3086J4016J3558J2966J2880J2617J1896J1484J1716J1964
57795A070124J1916J1982J2135J1836J1392J1767J2777J2892J1293Q764O215L619
57783A196712P88k112n141q533j1740j3682j4184j4039j3687j2916j1923j1240
$$ y = [890096, 894310, 900051, 906517, 913032, 920265, 928886, 938048, 946432, 953958, 961360, 968733, 975560, 981643, 987115, 991941, 996078, 999643, 1002417, 1003776, 1003534, 1002178, 999920, 996401, 991755, 986999, 982818, 978839, 974631, 970472, 966600, 962746, 959058, 956518, 955684, 955886, 956307, 956920, 957655, 957596, 955959, 953181, 950258, 947627, 945233, 942931, 940176, 936116, 930713, 925114, 920304, 916072, 911757, 907224, 902494, 897293, 891696, 886613, 882980, 881042, 880704, 881771, 883509, 884970, 886263, 888566, 892416, 897042, 901893, 907637, 914931, 923431, 932872, 943941, 957027, 971043, 984601, 997567, 1010447, 1023064, 1034960, 1046444, 1058160, 1070124, 1082040, 1094022, 1106157, 1117993, 1129385, 1141152, 1153929, 1166821, 1178114, 1186878, 1193093, 1196712, 1197500, 1195388, 1190247, 1181714, 1169974, 1156292, 1142108, 1128069, 1114382, 1101466, 1089543, 1078303]
57771A078303j0550q976o626m540l032j527q8M82K56L73J256K168K783L631M650
57756A058563M954M576M894O583Q556R617R935J0141J0157R634Q684P593O573
57743A160460O079O453P046O840O004N593N655N111L812L096L708M575M473L727
57729A232632L476M219N646P073P696P387P328Q775J1109J2459J2383J2288J2993
57716A345464J3689J3877J4374J5505J6170J5908J6173J8135K0641K1969K2384
57705A534289K3418K5453K7679K9883L2654L6123L9766M3369M7221N1520N6352
57694A947727O2064O8861P6369Q4207R2692J02296J12716J23144J33227J43140
57684B946443J52837J61626J68488J72512J73217J70493J64121J53613J39049
$$ y = [1078303, 1067753, 1058777, 1052151, 1047611, 1044579, 1043052, 1042964, 1043446, 1043702, 1044075, 1045331, 1047499, 1050282, 1053913, 1058563, 1063517, 1068093, 1072987, 1079570, 1088126, 1097743, 1107678, 1117819, 1127976, 1137610, 1146294, 1153887, 1160460, 1166539, 1172992, 1180038, 1186878, 1192882, 1198475, 1204130, 1209241, 1213053, 1216149, 1219857, 1224432, 1228905, 1232632, 1236108, 1240327, 1245973, 1253046, 1260742, 1268129, 1275457, 1284232, 1295341, 1307800, 1320183, 1332471, 1345464, 1359153, 1373030, 1387404, 1402909, 1419079, 1434987, 1451160, 1469295, 1489936, 1511905, 1534289, 1557707, 1583160, 1610839, 1640722, 1673376, 1709499, 1749265, 1792634, 1839855, 1891375, 1947727, 2009791, 2078652, 2155021, 2239228, 2331920, 2434216, 2546932, 2670076, 2803303, 2946443, 3099280, 3260906, 3429394, 3601906, 3775123, 3945616, 4109737, 4263350, 4402399]
57675D402399J21976J04660Q8387P3025N8095M3482K9253J5455J452j5933m2703
57664D879548q3124j33478j81889k15989k30521k27841k13439j92549j69357j46549
57654C084812j25056j05120q7526p3133o1599n1606m2267l3642k6033j9361j3302
57643B446167p621k422K045O015J0457J6069K2263K7963L3287L9252M5929N2270
57631B691674N8098O4769P3180Q2507R1616J00490J09290J17202J23298J27562
57621C639686J29970J29388J24512J15161J01634Q3606O0851L4507O472k1921
57611D403866m9575p4517r4472j08581j17679j22966j25059j24109j20169j13585
57601C353154j05495r7569r0662q4142p7053o9482o2213n5636m9699m4468l9991
$$ y = [4402399, 4524375, 4629035, 4717422, 4790447, 4848542, 4892024, 4921277, 4936732, 4938184, 4922251, 4879548, 4796424, 4662946, 4481057, 4265068, 4034547, 3806706, 3593267, 3400718, 3231361, 3084812, 2959756, 2854636, 2767110, 2693977, 2632378, 2580772, 2538505, 2504863, 2478830, 2459469, 2446167, 2438546, 2436124, 2438169, 2444184, 2454641, 2470710, 2492973, 2520936, 2554223, 2593475, 2639404, 2691674, 2749772, 2814541, 2887721, 2970228, 3061844, 3162334, 3271624, 3388826, 3512124, 3639686, 3769656, 3899044, 4023556, 4138717, 4240351, 4323957, 4384808, 4419315, 4425787, 4403866, 4354291, 4279774, 4185302, 4076721, 3959042, 3836076, 3711017, 3586908, 3466739, 3353154, 3247659, 3150090, 3059428, 2975286, 2898233, 2828751, 2766538, 2710902, 2661203, 2616735, 2576744]
57590B576744l5956l2115k8699k5839k3077k0054j7171j4922j3085j1244r655
57579B344927q721q113p155n792m448l227j953p13K81J166K165L099L715M193
57565B319424M837N610O435P542Q994J0233J0706J0666J0909J1971J3862J6188
57553B437377J8231J9402J9949K0740K2119K3672K5304K7554L0464L3144L5140
57542B713096L7251M0260M3811M7410N1591N7037O3318O9545P5665Q2076Q8583
57531C369643R4773J00812J06820J11925J14906J15333J13125J07611R8098Q4890
57521D417936O8742M9764K8052M910j7611l8135n5928p0081p9944q6012q9128
57510D132565q9174q5782q0027p3957o8476o2943n6824n0468m4235l8101l2355
$$ y = [2576744, 2540788, 2508673, 2479974, 2454135, 2431058, 2411004, 2393833, 2378911, 2365826, 2354582, 2344927, 2336206, 2328093, 2320938, 2315146, 2310698, 2307471, 2305518, 2304805, 2305086, 2306252, 2308417, 2311516, 2315231, 2319424, 2324261, 2329871, 2336306, 2343848, 2352842, 2363075, 2373781, 2384447, 2395356, 2407327, 2421189, 2437377, 2455608, 2475010, 2494959, 2515699, 2537818, 2561490, 2586794, 2614348, 2644812, 2677956, 2713096, 2750347, 2790607, 2834418, 2881828, 2933419, 2990456, 3053774, 3123319, 3198984, 3281060, 3369643, 3464416, 3565228, 3672048, 3783973, 3898879, 4014212, 4127337, 4234948, 4333046, 4417936, 4486678, 4536442, 4564494, 4569404, 4551793, 4513658, 4457730, 4387649, 4307705, 4221693, 4132565, 4043391, 3957609, 3877582, 3803625, 3735149, 3672206, 3615382, 3564914, 3520679, 3482578, 3450223]
57499C450223k7587k3701j9860j5597j1184o930k957L37K616M391O615R438J2302
57486C378106J5128J8386K1972K5221K8205L1921L6793M1940M6365N0137N4018
57475C748192N8590O4008P0038P6155Q2090Q8289R5179J02055J07386J10166J10188
57464D712336J07106J00317Q9806P6227N9875M0549J8689m129k6141m6129o3124
57453E065382p6260q5247r0436r2195r0885q7402q2873p7596p1127o3558n5913
57442D191890m9025m2886l7403l2811k8984k5188k1125j7424j4593j2184r592
57431C900675p061n211l965k636q34J146K744L621L951M387N498P121Q566R398
57417C927400R685R507Q879Q222Q289R315J0722J1896J2755J3384J3612J3349
$$ y = [3450223, 3422636, 3398935, 3379075, 3363478, 3352294, 3345364, 3342407, 3342744, 3345360, 3349751, 3356366, 3365804, 3378106, 3393234, 3411620, 3433592, 3458813, 3487018, 3518939, 3555732, 3597672, 3644037, 3694174, 3748192, 3806782, 3870790, 3940828, 4016983, 4099073, 4187362, 4282541, 4384596, 4491982, 4602148, 4712336, 4819442, 4919759, 5009565, 5085792, 5145667, 5186216, 5204905, 5200776, 5174635, 5128506, 5065382, 4989122, 4903875, 4813439, 4721244, 4630359, 4542957, 4460084, 4382488, 4311361, 4247803, 4191890, 4142865, 4099979, 4062576, 4029765, 4000781, 3975593, 3954468, 3937044, 3922451, 3910267, 3900675, 3893614, 3888403, 3884438, 3881802, 3880968, 3882114, 3884858, 3888479, 3892430, 3896817, 3902315, 3909436, 3918002, 3927400, 3937085, 3946592, 3955471, 3963693, 3971982, 3981297, 3992019, 4003915, 4016670, 4030054, 4043666, 4057015]
57405D057015J2957J2954J3582J4697J5870J6525J6437J6103J6234J6904J7586
57394D226864J8025J8415J8746J8607J7900J7188J7046J7470J8066J8505J8643
57383D425475J8535J8422J8426J8324J7923J7559J7737J8405J9005J9174J8907
57372D627892J8334J7790J7814J8430J8719J7925J6627J6027J6297J6717J7074
57361D819646J7722J8334J8070J7141J6873J7796J8910J9343J9478J9846K0081
57350E023240J9747J9241J9080J9129J9212J9638K0400K0707K0145J9531J9681
57339E239751K0081J9762J8950J8747J9478K0337K0581K0267J9857J9698J9857
57328E457366K0035J9821J9354J9386K0307K1531K2244K2351K2133K1542K0495
$$ y = [4057015, 4069972, 4082926, 4096508, 4111205, 4127075, 4143600, 4160037, 4176140, 4192374, 4209278, 4226864, 4244889, 4263304, 4282050, 4300657, 4318557, 4335745, 4352791, 4370261, 4388327, 4406832, 4425475, 4444010, 4462432, 4480858, 4499182, 4517105, 4534664, 4552401, 4570806, 4589811, 4608985, 4627892, 4646226, 4664016, 4681830, 4700260, 4718979, 4736904, 4753531, 4769558, 4785855, 4802572, 4819646, 4837368, 4855702, 4873772, 4890913, 4907786, 4925582, 4944492, 4963835, 4983313, 5003159, 5023240, 5042987, 5062228, 5081308, 5100437, 5119649, 5139287, 5159687, 5180394, 5200539, 5220070, 5239751, 5259832, 5279594, 5298544, 5317291, 5336769, 5357106, 5377687, 5397954, 5417811, 5437509, 5457366, 5477401, 5497222, 5516576, 5535962, 5556269, 5577800, 5600044, 5622395, 5644528, 5666070, 5686565]
57317E686565J9503J9284J9911K0890K1859K2737K3316K3295K2712K1997K1641
57306E923710K1988K3063K4410K5426K6015K6553K7100K7303K7272K7789K9108
57295F209737L0280L0404K9905K9904L0674L1515L1749L1117K9494K7015K4259
57284F536053K1685J8970J5502J1252O627J831k961p104r985j1848j3398j4665
57272F551959j5032j4298j3053j1875j0819r739q591p342o039n000m513m355m038
57259F437265l381k500j450m37j23r70k300k814k169j390j505k450l518m316m807
57244F403135m915m597m150m038m403m937n270n331n409n779o260o283n553m498
57230F331712l808l664l624l286k718k280k276k754l444l912l899l577l320l425
$$ y = [5686565, 5706068, 5725352, 5745263, 5766153, 5788012, 5810749, 5834065, 5857360, 5880072, 5902069, 5923710, 5945698, 5968761, 5993171, 6018597, 6044612, 6071165, 6098265, 6125568, 6152840, 6180629, 6209737, 6240017, 6270421, 6300326, 6330230, 6360904, 6392419, 6424168, 6455285, 6484779, 6511794, 6536053, 6557738, 6576708, 6592210, 6603462, 6610089, 6611920, 6608959, 6601855, 6591870, 6580022, 6566624, 6551959, 6536927, 6522629, 6509576, 6497701, 6486882, 6477143, 6468552, 6461210, 6455171, 6450171, 6445658, 6441303, 6437265, 6433884, 6431384, 6429934, 6429497, 6429374, 6428404, 6426104, 6423290, 6421121, 6419731, 6418226, 6415776, 6412258, 6407942, 6403135, 6398220, 6393623, 6389473, 6385435, 6381032, 6376095, 6370825, 6365494, 6360085, 6354306, 6348046, 6341763, 6336210, 6331712, 6327904, 6324240, 6320616, 6317330, 6314612, 6312332, 6310056, 6307302, 6303858, 6299946, 6296047, 6292470, 6289150, 6285725]
57216F285725m116n530p414r012r741r907j0440j1865j3807j5473j6431j6915
57204F155074j7484j8501j9790k0869k1533k1947k2230k2315k2363k2882k3981
57193E921179k4993k5292k5165k5343k5903k6327k6431k6513k6621k6373k5739
57182E636479k5218k4970k4400k3079k1547k0648k0426k0231j9715j9090j8505
57171E398650j7830j7131j6796j6891j6853j6177j5149j4453j4273j4203j3910
57160E224984j3423j2851j2319j2191j2775j3683j4053j3662j3184j3146j3295
57149E080402j3411j3991j5426j7130j8352j9412k1108k3262k4859k5594k6161
57138D861696k6983k7605k7549k6965k6226k5555k5123k4808k3909k1911j9511
$$ y = [6285725, 6281609, 6276079, 6268665, 6259653, 6249912, 6240005, 6229565, 6217700, 6203893, 6188420, 6171989, 6155074, 6137590, 6119089, 6099299, 6078430, 6056897, 6034950, 6012720, 5990405, 5968042, 5945160, 5921179, 5896186, 5870894, 5845729, 5820386, 5794483, 5768156, 5741725, 5715212, 5688591, 5662218, 5636479, 5611261, 5586291, 5561891, 5538812, 5517265, 5496617, 5476191, 5455960, 5436245, 5417155, 5398650, 5380820, 5363689, 5346893, 5330002, 5313149, 5296972, 5281823, 5267370, 5253097, 5238894, 5224984, 5211561, 5198710, 5186391, 5174200, 5161425, 5147742, 5133689, 5120027, 5106843, 5093697, 5080402, 5066991, 5053000, 5037574, 5020444, 5002092, 4982680, 4961572, 4938310, 4913451, 4887857, 4861696, 4834713, 4807108, 4779559, 4752594, 4726368, 4700813, 4675690, 4650882, 4626973, 4605062, 4585551]
57127D585551j7794j6526j4509j1708r501q392p064m560j969p46m77M25K579N492
57113D500801R026J3827K0650L0151M2991N9309P8561J00622J26566J57509J93417
57102E333430K34138K81365L38601M09588M97686O06250P38297Q95519J077984
57093A0412858J283996J508858J743701J976584K195317K389778K553475K685436
57085B6750003K791514K882688K969074L050174L104282L084373K928701K584963
57077E0145772K033884J298156M36195m70923j335538k083075k669137l082721
57069D4272613l334438l442353l426505l309837l117768k875165k604244k323945
57061A9838358k048873j788404j547788j330093j136745r67254q20093o94144
$$ y = [4585551, 4567757, 4551231, 4536722, 4525014, 4515513, 4507121, 4500057, 4495497, 4493528, 4492782, 4492305, 4492730, 4495309, 4500801, 4509827, 4523654, 4544304, 4574455, 4617446, 4676755, 4755316, 4855938, 4982504, 5140013, 5333430, 5567568, 5848933, 6187534, 6597122, 7094808, 7701058, 8439355, 9334874, 10412858, 11696854, 13205712, 14949413, 16925997, 19121314, 21511092, 24064567, 26750003, 29541517, 32424205, 35393279, 38443453, 41547735, 44632108, 47560809, 50145772, 52179656, 53477812, 53914007, 53443084, 52107546, 50024471, 47355334, 44272613, 40938175, 37495822, 34069317, 30759480, 27641712, 24766547, 22162303, 19838358, 17789485, 16001081, 14453293, 13123200, 11986455, 11019201, 10199108, 9504964]
57053I504964n88730n02565m33346l78197l34085k98318k69330k46736k30008
57044F223649k17493k07285j98609j91703j86620j82822j79762j77214j75136
57035D507005j73446j71893j69929j67107j63720j60561j57832j54823j50999
57026C036695j46585j41688j35630j27827j18618j08578r7601q5480p2560n8991
57016A943137m4144k8101j3040j346P410J5319K1047J7899o95l3591p0906j00846
57004A712143j17201j20899j16211j06940r5546q3967p3723o5263n7929n0912
56994H23552m4089l7927l2861k8860k5359k1633j7421j3178r506o463l685j076
56982E81494R67J961J577l84l740p622j0875j2875j3671j3400j2145j0303q455
$$ y = [9504964, 8916234, 8413669, 7980323, 7602126, 7268041, 6969723, 6700393, 6453657, 6223649, 6006156, 5798871, 5600262, 5408559, 5221939, 5039117, 4859355, 4682141, 4507005, 4333559, 4161666, 3991737, 3824630, 3660910, 3500349, 3342517, 3187694, 3036695, 2890110, 2748422, 2612792, 2484965, 2366347, 2257769, 2160168, 2074688, 2002128, 1943137, 1898993, 1870892, 1857852, 1856506, 1863916, 1879235, 1900282, 1918181, 1917486, 1883895, 1812989, 1712143, 1594942, 1474043, 1357832, 1250892, 1155346, 1071379, 997656, 932393, 874464, 823552, 779463, 741536, 708675, 679815, 654456, 632823, 615402, 602224, 592718, 586255, 582570, 581494, 582461, 584422, 585999, 585615, 581875, 574253, 563378, 550503, 536832, 523432, 511287, 500984, 492529]
56969D92529o742m948l226k097j534p66P60K817M988P140R033J0285J1076J1995
56955E31310J2668J1444P253J205m597r241j3089j6169j7719j7365j5758j3729
56943D56213j1514r050o477m021j707N54K775M935P120R496J2144J4816J6971
56930D92255J8194J8464J7571J4392P625k348j2908k1148k5987k8028k7938k5912
56918D24232k2510j9005j6452j4858j3515j1903j0157q741p844p076n959m634
56906B81578l772l612l519k797j644q76q62j086p35M68K011L068L394L682M792
56891B80090O708Q691J0396J2149J4040J5542J6344J6723J6521J4575R968L460
56879D25207l042q043j0971j1816j1141j0060r207p871m995r10K835N396P530
$$ y = [492529, 485787, 480839, 477613, 475516, 473982, 473216, 473976, 476793, 481781, 488921, 497954, 508239, 519315, 531310, 543978, 555422, 562675, 563880, 559283, 550042, 536953, 520784, 503065, 485700, 469942, 456213, 444699, 435649, 429172, 425151, 423444, 423998, 426773, 431708, 438828, 448324, 460468, 475284, 492255, 510449, 528913, 546484, 560876, 568501, 566153, 553245, 532097, 506110, 478082, 450144, 424232, 401722, 382717, 366265, 351407, 337892, 325989, 315832, 307091, 299247, 292171, 286212, 281578, 277806, 274194, 270675, 267878, 266234, 265358, 264496, 263410, 262675, 263143, 265154, 268222, 271616, 275298, 280090, 286798, 295489, 305885, 318034, 332074, 347616, 363960, 380683, 397204, 411779, 421747, 425207, 422165, 414122, 403151, 391335, 380194, 370134, 360927, 353056, 348061, 347151, 349986, 355382, 362912]
56866C62912J0431J4423J8961K3304K6835K9246L0704L1576L1795L0576K6707
56855F37470J9098P584o173j8842k7302l0647l0162k7575k3770j8978j3405p435
56843D59863j638L541Q373J3930K0935K8694L5815M1834M7283N2188N5414N5663
56831H21895N2191M4195L0639J1699r990l0244m5544n4291n6671n4175m8966m2822
56819F17916l6281k9085k1327j3745o869m52N982J2415J8461K3933K8818L2853
56807F32619L5561L6646L5829L2042K3604R885p249k4202l7834m6600n0171m9031
56795E91099m4624l8903l3085k7265k1424j6086j1478o905j744L409P433J0240
56783D10667J2834J5820J8589K0015J9392J6557J1575M623l897j3038k1118k6377
$$ y = [362912, 373343, 387766, 406727, 430031, 456866, 486112, 516816, 548392, 580187, 610763, 637470, 656568, 664152, 657979, 639137, 611835, 581188, 551026, 523451, 499681, 480703, 467298, 459863, 458225, 461766, 470139, 484069, 505004, 533698, 569513, 611347, 658630, 710818, 766232, 821895, 874086, 918281, 948920, 960619, 950629, 920385, 874841, 820550, 763879, 709704, 660738, 617916, 581635, 552550, 531223, 517478, 510609, 510157, 516139, 528554, 547015, 570948, 599766, 632619, 668180, 704826, 740655, 772697, 796301, 806186, 798937, 774735, 736901, 690301, 640130, 591099, 546475, 507572, 474487, 447222, 425798, 409712, 398234, 391329, 389585, 392994, 400427, 410667, 423501, 439321, 457910, 477925, 497317, 513874, 525449, 530072, 526175, 513137, 492019, 465642]
56771D65642k8240k7774k6478k4930k2882k0261j7443j4743j2238j0039q296o985
56759B45333o048n488n033m082k567j481j817l147l994l605k595j910j771j876
56745A99919j967j947j838j796j899j892j484q28m23m93q21j154j463j825k275
56730A77814k701k702j863l96P43Q07Or26j525j602r82J02Q08N49j14j43O70J644
56712A70189K149J984J142m7p83n54J88P31J118J716K210K045J494J257J215P25
56696A86779L4J04R39J374Q21J03N1L07J16n04r18p64k24J91np16j142p54k07
56677A85585m86j333j560q70k30k76m72k75m5k76q23j409k079k750k993k760k582
56660A64366k677k594k069j458r97m28K44M26j12p00o68k02J60K40J66J24M35
$$ y = [465642, 437402, 409628, 383150, 358220, 335338, 315077, 297634, 282891, 270653, 260614, 252318, 245333, 239285, 233797, 228764, 224682, 222115, 220634, 218817, 215670, 211676, 208071, 205476, 203566, 201795, 199919, 197952, 196005, 194167, 192371, 190472, 188580, 187096, 186268, 185845, 185352, 184531, 183377, 181914, 180089, 177814, 175113, 172411, 170548, 170152, 170895, 171702, 171708, 170782, 169257, 167655, 166673, 166775, 167583, 168132, 168018, 167875, 168545, 170189, 172338, 174322, 175464, 175417, 174634, 174080, 174268, 174999, 176117, 177833, 180043, 182088, 183582, 184839, 186054, 186779, 186813, 186917, 187856, 189230, 190051, 190154, 190205, 190512, 190628, 190124, 189206, 188442, 188218, 188409, 188404, 187688, 186546, 185792, 185585, 185099, 183766, 182206, 181336, 181106, 180830, 180358, 180083, 180038, 179762, 178939, 177530, 175451, 172701, 169708, 166948, 164366, 161689, 159095, 157026, 155568, 154571, 154143, 154387, 154813, 154701, 154001, 153333, 153131, 153291, 153531, 153697, 153821, 154256]
56643A54256J168J601R19m24j090o81j56o3J69Q03R95K57n58p04o50r12q61K8
56625A54097Q35M86m96q61n85m78n28o7P13R13M02r8k75m11l60L46J364J681J085
56606A57763M92N31P47M81k14q46j066o72L46J523K090J700P44j05l77L7Q59J539
56588A65572J731J588J358R50K11n51q04l69M97J344J666J144J65l35P0P91J178
56571A76206J455K101K856L088K871K878L365L986M434M590M222L276K371K287
56557B19986K887L198K655J739J240J317J459J071N5j067j609j510j426j866k491
56542B25638k644k277j924j930k173k469k842l347l806l847l254k356j889k144
56528A88736k460k069j297j138j649j752r02J3o6j018k028k682k895k515j653
$$ y = [154256, 155424, 157025, 157944, 157520, 156430, 155749, 155593, 155530, 155699, 156502, 157497, 157754, 157196, 156492, 155842, 154930, 154069, 154097, 154932, 155418, 154922, 154061, 153476, 152998, 152470, 152403, 153116, 154029, 154431, 154333, 154058, 153647, 153287, 153633, 154997, 156678, 157763, 158255, 158786, 159533, 160014, 159800, 158954, 157888, 157216, 157562, 159085, 161175, 162875, 163619, 163514, 163137, 163174, 164033, 165572, 167303, 168891, 170249, 171199, 171410, 170859, 170055, 169686, 170183, 171527, 173193, 174337, 174502, 174167, 174237, 175028, 176206, 177661, 179762, 182618, 185706, 188577, 191455, 194820, 198806, 203240, 207830, 212052, 215328, 217699, 219986, 222873, 226071, 228726, 230465, 231705, 233022, 234481, 235552, 235607, 234540, 232931, 231421, 229995, 228129, 225638, 222994, 220717, 218793, 216863, 214690, 212221, 209379, 206032, 202226, 198379, 195125, 192769, 190880, 188736, 186276, 184207, 182910, 181772, 180123, 178371, 177469, 177482, 177416, 176398, 174370, 171688, 168793, 166278, 164625]
56513A64625r96r98j247j157q04n46l30N9N40R83J389J468P53m30r37l11N70Q89
56495A63520R90J295J244L04q26j143o95kJ005K371L272L064K447K350K382J786
56479A83364J142J490K369K474J870J773K342K516K058J977K609K926K281J405
56465B12596J153J430J887K586L479M040L919L292K326J012l44j217j514j486
56451B33159j106l89o6q96k340l025k587j942j688j427r02n99p85r90q81q08j075
56434B11653j398j480j453j470j444j377j404j361r21j91L48N57P07R29J092J114
56418B03901Q30o5j351k028j481m91j86m94o20m82n23n62j87J55j57n20L0R04
56400A96673O19p09j320m43Q03J351J406J322Q85K15KK61K27j04K70J527K456
$$ y = [164625, 163629, 162631, 161384, 160227, 159423, 158877, 158547, 158606, 159146, 160129, 161518, 162986, 163739, 163309, 162372, 162061, 162631, 163520, 164510, 165805, 167049, 167353, 166527, 165384, 164689, 164687, 165692, 168063, 171335, 174399, 176846, 179196, 181578, 183364, 184506, 185996, 188365, 190839, 192709, 194482, 196824, 199340, 201398, 203375, 205984, 208910, 211191, 212596, 213749, 215179, 217066, 219652, 223131, 227171, 231090, 234382, 236708, 237720, 237376, 236159, 234645, 233159, 232053, 231664, 231598, 230702, 228362, 225337, 222750, 220808, 219120, 217693, 216791, 216192, 215407, 214417, 213536, 212728, 211653, 210255, 208775, 207322, 205852, 204408, 203031, 201627, 200266, 199345, 199154, 199502, 200059, 200766, 201695, 202787, 203901, 204731, 204666, 203315, 201287, 199806, 199315, 199129, 198635, 198015, 197533, 197010, 196448, 196261, 196416, 196259, 195739, 195769, 196673, 197292, 196583, 195263, 194820, 195623, 196974, 198380, 199702, 200587, 200802, 200804, 201065, 201292, 201188, 201458, 202985, 205441]
56383B05441K285J783J793J985J794J474J445J516J465J477J526J255Q14Q66J385
56368B28304J556J201J120J644K048J892J712J852J842J505J440J852K069J788
56354B51825J623J845J805J242Q69J035J054N63L01P65J297J344J447K095K729
56339B71839K753K558K626K640K286K035K267K602K772L215M079M667M633M671
56325C15643N260N792N744N611N810N730M829L763L495M050M882N593N691M729
56311C86622L305K798L396L634K594J280Q64R67Q08P18J277J965K077K032K559
56296D16896L389L949M567N756P088P860Q229Q715R181R340R508J0023J0644J1303
56282E26448J2634J4909J7399J9523K1677K4120K6211K7704K9659L2937L6948
$$ y = [205441, 207726, 209509, 211302, 213287, 215081, 216555, 218000, 219516, 220981, 222458, 223984, 225239, 226053, 226919, 228304, 229860, 231061, 232181, 233825, 235873, 237765, 239477, 241329, 243171, 244676, 246116, 247968, 250037, 251825, 253448, 255293, 257098, 258340, 259209, 260244, 261298, 261861, 262162, 262927, 264224, 265568, 267015, 269110, 271839, 274592, 277150, 279776, 282416, 284702, 286737, 289004, 291606, 294378, 297593, 301672, 306339, 310972, 315643, 320903, 326695, 332439, 338050, 343860, 349590, 354419, 358182, 361677, 365727, 370609, 376202, 381893, 386622, 389927, 392725, 396121, 399755, 402349, 403629, 404493, 405460, 406268, 406986, 408263, 410228, 412305, 414337, 416896, 420285, 424234, 428801, 434557, 441645, 449505, 457734, 466449, 475630, 484970, 494478, 504501, 515145, 526448, 539082, 553991, 571390, 590913, 612590, 636710, 662921, 690625, 720284, 753221, 790169]
56271G90169M0956M5501N1200N7313O2943O8686P5645Q3568R1448R9242J07533
56260A574204J15981J23508J29675J34729J38564J40591J40336J37434J31559
56251B766581J22897J12062R9072Q3387O5555M7632L1115J5674P35j2975k4560
56240C307175l4366m3053n0324n5823o0259o4524o8658p2669p7246q2499q7246
56229B610508r0634r3334r6012r8018r8792r9082r9421r8749r6129r2413q8728
56218A559196q4643p9446p3858o8792o3736n8094n2773m8573m4412l9163l3951
56207I11755l0497k8293k5705k2827k0933j9891j8437j6466j4914j3837j2553
56196F87402j1234j0490r939q805p383o310n137l324j717j317j520j257q14p45
$$ y = [790169, 831125, 876626, 927826, 985139, 1048082, 1116768, 1192413, 1275981, 1367429, 1466671, 1574204, 1690185, 1813693, 1943368, 2078097, 2216661, 2357252, 2497588, 2635022, 2766581, 2889478, 3001540, 3100612, 3183999, 3249554, 3297186, 3328301, 3343975, 3344710, 3331735, 3307175, 3272809, 3229756, 3179432, 3123609, 3063350, 2998826, 2930168, 2857499, 2780253, 2697754, 2610508, 2519874, 2426540, 2330528, 2232510, 2133718, 2034636, 1935215, 1836466, 1740337, 1647924, 1559196, 1474553, 1395107, 1321249, 1252457, 1188721, 1130627, 1077854, 1029281, 984869, 945706, 911755, 881258, 852965, 827260, 804433, 783500, 763609, 745172, 728706, 713792, 699955, 687402, 676168, 665678, 655739, 646934, 639551, 633241, 628104, 624780, 623063, 621746, 620226, 618969, 618155, 617410]
56182F17410j77J669L521L873L681M790O735P630P473P842Q910R351Q970Q885
56168G00563R338R536R478R834J0281J0041R675J0327J1640J2369J2599J3345
56156H29026J4606J5772J7373K0388K4510K9082L4820M2498N0919N8558O6264
56145A203816P5927Q7285R8547J09197J19530J28286J33466J34721J32428J25538
56135B348741J13297R8196Q4047P1963O1100N2130M6266M1546L3998K2492R214
56124B982990m266j7802k9948l8458m4033n0211n9036o9790q1859r5434j08910
56113B383243j18839j23200j22308j16663j06713r4529q2591p1000n8712m6901
56103A441787l7875l1267k4946j9258j6385j5873j4910j3056j2580j3863j4619
$$ y = [617410, 617233, 618902, 622423, 626296, 629977, 634767, 641502, 649132, 656605, 664447, 673357, 682708, 691678, 700563, 709901, 719437, 728915, 738749, 749030, 759071, 768746, 779073, 790713, 803082, 815681, 829026, 843632, 859404, 876777, 897165, 921675, 950757, 985577, 1028075, 1078994, 1137552, 1203816, 1279743, 1367028, 1465575, 1574772, 1694302, 1822588, 1956054, 2090775, 2223203, 2348741, 2462038, 2560234, 2644281, 2716244, 2777344, 2829474, 2875740, 2917286, 2951284, 2973776, 2982990, 2978724, 2960922, 2930974, 2892516, 2848483, 2798272, 2739236, 2669446, 2587587, 2492153, 2383243, 2264404, 2141204, 2018896, 1902233, 1795520, 1700991, 1618400, 1547400, 1488688, 1441787, 1403912, 1372645, 1347699, 1328441, 1312056, 1296183, 1281273, 1268217, 1255637, 1241774, 1227155]
56092A227155j4022j3523j3202j1488q918p948q414p431m488k328j949j112J137
56079A133469K762K847L243M783N809N817O648Q792J0229J0186J0380J1438J1895
56066A228298J1662J2635J4854J6012J5697J6039J7406J7677J6700J6931J8652
56055A402563J9169J7901J7552J9030J9918J9385J9685K1403K2072K1092K1078
56044A620848K2813K3821K3541K4666K7674K9422K9038K9813L3171L6225L7531
56033A938563L9671M3708M6630M6905M7225M9127N0272M9611M9809N2004N3595
56022B467120N3755N5439N9404O2110O2195O3072O6399O9196P0157P2399P6986
56011C178232Q0289Q0936Q2701Q7335R1383R3288R6602J02752J08053J11327J16785
$$ y = [1227155, 1213133, 1199610, 1186408, 1174920, 1166002, 1158054, 1149640, 1142209, 1137721, 1135393, 1133444, 1132332, 1133469, 1136231, 1139078, 1142321, 1147104, 1152913, 1158730, 1165378, 1174170, 1184399, 1194585, 1204965, 1216403, 1228298, 1239960, 1252595, 1267449, 1283461, 1299158, 1315197, 1332603, 1350280, 1366980, 1383911, 1402563, 1421732, 1439633, 1457185, 1476215, 1496133, 1515518, 1535203, 1556606, 1578678, 1599770, 1620848, 1643661, 1667482, 1691023, 1715689, 1743363, 1772785, 1801823, 1831636, 1864807, 1901032, 1938563, 1978234, 2021942, 2068572, 2115477, 2162702, 2211829, 2262101, 2311712, 2361521, 2413525, 2467120, 2520875, 2576314, 2635718, 2697828, 2760023, 2823095, 2889494, 2958690, 3028847, 3101246, 3178232, 3258521, 3339457, 3422158, 3509493, 3600876, 3694164, 3790766, 3893518, 4001571, 4112898, 4229683]
56000D229683J25704J33214J37353J42981J52585J61756J68298J76843J89641
55991E618058K01810K10989K22428K39091K56179K71032K88646L11530L34300
55982G954063L54446L77959M08055M39388M69891N06561N52860O02758O54323
55973A2320304P15936P91733Q75195R65013J071881J201468J347745J512409J712588
55964B2514272J959839K252044K597191L023483L555229M204411M998975N991235
55956E1096679P224743Q723730J0523838J2666489J5144354J7898015K0859594
55949A44137442K3887159K6615456K8531057K9332245K9051418K7538063K3885716
55942C32978556J6838760O146925o532540j8319850k6809139l1197668l2097463
$$ y = [4229683, 4355387, 4488601, 4625954, 4768935, 4921520, 5083276, 5251574, 5428417, 5618058, 5819868, 6030857, 6253285, 6492376, 6748555, 7019587, 7308233, 7619763, 7954063, 8308509, 8686468, 9094523, 9533911, 10003802, 10510363, 11063223, 11665981, 12320304, 13036240, 13827973, 14703168, 15668181, 16740062, 17941530, 19289275, 20801684, 22514272, 24474111, 26726155, 29323346, 32346829, 35902058, 40106469, 45105444, 51096679, 58321422, 67045152, 77568990, 90235479, 105379833, 123277848, 144137442, 168024601, 194640057, 223171114, 252503359, 281554777, 309092840, 332978556, 349817316, 355964241, 349431701, 331111851, 304302712, 273105044, 241007581]
55935B41007581l0659590k7929882k4665055k1345611j8222548j5405504j2949521
55928H9829870j0872143r140823p700655o513009n548441m763790m114851l578757
55920C7597401l142211k781127k471292k206008j984792j795980j626472j476926
55912B0112593j351663j243694j143777j053920r78351r10655q42789p77910p22146
55903A1087688o72019o21618n74017n34473m99710m64521m31689m05196l80778
55894F503667l53209l26243l05561k88139k68295k48156k32595k19296k03205
55885D058968j86105j72791j62040j49749j37023j27251j18963j08967r8904r1715
55875B705460q5446p7363p0190o7456o6374o2162n5960n1975n0202m8375m7883
$$ y = [241007581, 210347991, 182418109, 157753054, 136407443, 118184895, 102779391, 89829870, 78957727, 69816904, 62116249, 55603240, 50054799, 45291009, 41176158, 37597401, 34455190, 31674063, 29202771, 26996763, 25011971, 23215991, 21589519, 20112593, 18760930, 17517236, 16373459, 15319539, 14341188, 13430533, 12587744, 11809834, 11087688, 10415669, 9794051, 9220034, 8685561, 8185851, 7721330, 7289641, 6884445, 6503667, 6150458, 5824215, 5518654, 5230515, 4962220, 4714064, 4481469, 4262173, 4058968, 3872863, 3700072, 3538032, 3388283, 3251260, 3124009, 3005046, 2896079, 2797175, 2705460, 2620014, 2542651, 2472461, 2405005, 2338631, 2276469, 2220509, 2168534, 2118332, 2069957, 2022074]
55864B022074n1164n5945n8147n7946n7545n5959n1516m6544m4006m2211l8161
55853A462930l3325l0793k9596k7219k4899k5041k6070k5182k3701k4323k5581
55842A167200k4425k1965k1333k1890k0906j9050j8924j9892j9408j7984j7930
55831I43493j8635j7866j6274j5962j6059j4316j1759j1143j2018j1832j0818
55820G86811j1299j3105j3910j3375j2946j2412j0490p992o711o088m492k679
55808F71312k371k599j191J187K151J681J490J367j62k448l578l811m754o046
55794F52228o229n868o372o745n038k155o11l47P17K619L273J856r07n042j0601
55779F10778j5390j6835j5615j4424j3906j2880j1596j1283j1231r827p876p616
$$ y = [2022074, 1970910, 1914965, 1856818, 1798872, 1741327, 1685368, 1633852, 1587308, 1543302, 1501091, 1462930, 1429605, 1398812, 1369216, 1341997, 1317098, 1292057, 1265987, 1240805, 1217104, 1192781, 1167200, 1142775, 1120810, 1099477, 1077587, 1056681, 1037631, 1018707, 998815, 979407, 961423, 943493, 924858, 906992, 890718, 874756, 858697, 844381, 832622, 821479, 809461, 797629, 786811, 775512, 762407, 748497, 735122, 722176, 709764, 699274, 691282, 684571, 678483, 673991, 671312, 668941, 666342, 665151, 666338, 668489, 670170, 671660, 673027, 672865, 670417, 666839, 663028, 658274, 652228, 645999, 640131, 633759, 627014, 621976, 619821, 619210, 618863, 619580, 622199, 625472, 627328, 626421, 621379, 610778, 595388, 578553, 562938, 548514, 534608, 521728, 510132, 498849, 487618, 477791, 469915, 462299]
55767D62299q941r952j0514j1878j3388j3097j1327j0109r516p936n680m733n068
55754C40160m737l651l725n214o203o097o309p198p473o973p028p648p304n825
55740B54775m717m300l353j892j381j887j850r87o97j202j174n76j006k635l628
55725B23490l235k886l430l900l665l386l224k440j409j560k729l023j891q56
55711A85856n94J15J688K594K033J373J675J910R83l07o56j09M89O81K63p56j524
55694A95714j033K25O94M2n92p40j105j719j614p28k52n53o29r4J89K1M15J578
55676A89819K279J973J751K301K730K289J702J791K261K702L419M368M682M046
55662B28113L425L607M155M444M631M963N095M687L840K623J013n50j524k153
$$ y = [462299, 453358, 443406, 432892, 421014, 407626, 394529, 383202, 373093, 363577, 355641, 349961, 345228, 340160, 335423, 331772, 328047, 322833, 316630, 310533, 304224, 297026, 289553, 282580, 275552, 267904, 260600, 254775, 250058, 245758, 242405, 240513, 239132, 237245, 235395, 234408, 233711, 232509, 231335, 230759, 229753, 227118, 223490, 220255, 217369, 213939, 210039, 206374, 202988, 199764, 197324, 195915, 194355, 191626, 188603, 186712, 185856, 185262, 185377, 187065, 189659, 191692, 193065, 194740, 196650, 197633, 197326, 196670, 196561, 197050, 197731, 197994, 197238, 195714, 194681, 194906, 195600, 195642, 195050, 194310, 193205, 191486, 189872, 189144, 188892, 188339, 187710, 187616, 187805, 187826, 188241, 189819, 192098, 194071, 195822, 198123, 200853, 203142, 204844, 206635, 208896, 211598, 215017, 219385, 224067, 228113, 231538, 235145, 239300, 243744, 248375, 253338, 258433, 263120, 266960, 269583, 270596, 270046, 268522, 266369]
55648B66369l059m028m399m345m536m774m450l973m154m495l885k728k402k865
55634B12276k938k730l475m885n208m272l923m874n626n285m978n402n403m297
55620A48980l431l909m662m297l267k673k418j981j768k195k567k161j522j492
55606A10637j865j943j682j384j149j221j947k791k564j200r3q0m42n06p68j530
55590H9472j919j347o80q32j306j226q06p15r57j282j862k591k631j576l08J63
55574F9597m4k76l99n73p00p85j093j501j417p51n3N10J272J884J409K3p98m10
55556F5895J26l9k05L52J012J024Q54J147J448J127O11N53O46L63L4J70M58M63
55538G6039N91J334K201K376J931J518J285R11L49m9J43J209K878M066L845K792
$$ y = [266369, 263310, 259282, 254883, 250538, 246002, 241228, 236778, 232805, 228651, 224156, 220271, 217543, 215141, 212276, 209338, 206608, 203133, 198248, 193040, 188768, 184845, 179971, 174345, 169060, 164082, 158680, 153277, 148980, 145549, 141640, 136978, 132681, 129414, 126741, 124323, 122342, 120574, 118379, 115812, 113651, 112129, 110637, 108772, 106829, 105147, 103763, 102614, 101393, 99446, 96655, 94091, 92891, 92798, 92718, 92276, 91770, 91002, 89472, 87553, 86206, 85526, 84694, 83388, 82162, 81356, 80641, 79684, 78402, 76540, 73949, 71318, 69742, 69434, 69597, 69553, 69277, 68878, 68305, 67605, 66820, 65727, 64226, 62809, 62058, 62005, 62515, 63787, 65671, 67080, 67103, 66305, 65895, 66021, 65982, 65777, 66129, 67141, 68165, 69019, 70166, 71614, 72741, 73352, 73905, 74551, 74914, 74948, 75118, 75576, 76039, 76630, 77964, 80165, 82541, 84472, 85990, 87275, 88186, 88535, 88486, 88629, 89838, 92716, 96782, 100627, 103419]
55522A03419K321K624K555J816J616K492L121K318Q18m3k84p04j381j957k599
55507A16132l524m244m322m218m528m993n021m616m017l175k208j599j429j254
55493F6984j168j866l140l616k778j882j936k130j496p12q75j530j526r34o28
55478D0767o16l14J03M8j66K85J296J937J796J191L57o76j592k026k024j728j050
55461C7588k28L5l76n85j49Q5n77j250p42N00J042N08j97l87j82J17K51r9p92
55442C4562r86k29O08L75p73j635j499o05M79J145Q58k56j194j109j71R44J807
55425C2321K031J250m8n64J41R19Q31N88J134J815J411K17l91jN28N22J9q10j710
55406D0203k085j679j108q80m36P32J708J223l68j509j585j315j208r56m15k2
$$ y = [103419, 105740, 108364, 110919, 112735, 114351, 116843, 119964, 122282, 123100, 123057, 122773, 122069, 120688, 118731, 116132, 112608, 108364, 104042, 99824, 95296, 90303, 85282, 80666, 76649, 73474, 71266, 69667, 68238, 66984, 65816, 63950, 60810, 57194, 54416, 52534, 50598, 48468, 46972, 46260, 45385, 43855, 42329, 41395, 40767, 40151, 39837, 39940, 39988, 39822, 40107, 41403, 43340, 45136, 46327, 46684, 46008, 44416, 42390, 40366, 38638, 37588, 37360, 37395, 37019, 36434, 36285, 36370, 35793, 34543, 33801, 34301, 35343, 35851, 35654, 35267, 35085, 35202, 35453, 35354, 34562, 33576, 33347, 33955, 34330, 33557, 31922, 30423, 29818, 30297, 31442, 32300, 32044, 30850, 29741, 29570, 30514, 32321, 34352, 35602, 35554, 34990, 35131, 36050, 36881, 37469, 38603, 40418, 41829, 42046, 41655, 41654, 42182, 42704, 42723, 41913, 40203, 38118, 36439, 35331, 34451, 34015, 34747, 36455, 37678, 37310, 35801, 34216, 32901, 31693, 30737, 30322, 30300]
55390C0300rq3J6K39M72N07N4o84q78k14M30J50o48r95p77m68lR32J886K026J327
55369C3580M59k21o88p51m35m07j074j729j530q20l73l9O90J300Q96j37n49q6
55351B8086L55K85L6k23o42q85m36L37N51J84j5J35J52K7K48O73O21R4j94r1j68
55330B9130n59p11m14o5J67M83P22M89R8L15J071J374O93m61j361j645j107P4
55312B8293R48O03n48j200r06m12l31m63n87q16j044r30n69m05m38l10j40k91
55294B0454m75o0P65J130Q68O47P42O94L03m6j98l88m89r0N78P69L75L5J6j5j36
55273B5479n7J08Np0M10R65N28p85j616j345p12k78L10J066J103P8r39q97j09
55254B3244M96O13M34J21j1M10J040R22r7q84o07N2k9q19j363j136m49J18J62
$$ y = [30300, 30291, 30208, 30224, 30463, 30935, 31442, 31496, 30812, 29934, 29720, 30150, 30300, 29652, 28657, 27880, 27412, 27409, 28341, 30227, 32253, 33580, 34039, 33818, 33130, 32379, 31944, 31537, 30463, 28734, 27204, 26384, 26011, 25972, 26662, 27962, 28858, 28721, 28172, 28086, 28441, 28726, 28762, 28539, 27897, 27012, 26576, 26913, 27464, 27648, 27633, 27768, 27920, 27947, 28195, 28868, 29489, 29583, 29389, 29298, 29130, 28571, 27860, 27446, 27381, 27548, 28031, 28753, 29242, 29340, 29655, 30726, 32100, 32793, 32332, 30971, 29326, 28219, 28293, 29241, 29844, 29296, 28096, 27190, 26778, 26447, 25984, 25397, 24581, 23537, 22607, 22038, 21633, 21195, 20885, 20745, 20454, 19979, 19919, 20684, 21814, 22682, 23329, 24071, 24765, 25068, 25022, 24824, 24436, 23947, 23857, 24435, 25204, 25579, 25614, 25630, 25615, 25479, 25422, 25530, 25535, 25465, 25875, 26840, 27368, 26583, 24967, 23622, 22910, 22632, 22942, 24008, 25111, 25189, 24250, 23353, 23244, 23740, 24353, 24787, 24908, 24897, 25307, 26347, 27269, 27172, 26288, 25681, 25733, 25704, 24885, 23522, 22386, 21937, 22055, 22217]
55235B2217l95j155j518j291p73j62O12J412J848J867J783J646J147L30k67m05
55219B6896m10n13n51m44l67k70J29P59J199J325J364J246O67k07q28j084j325
55202B7586j577j497j104p35l28M06J143J239P54K66j58q23j347j020j56K17m
55185B2862n7No14j563j325L60J825J921J453J304R28j42p99M1J469J766P56m14
55167B9776j115j501j474p52K30O34K91l55j060j789k174j814r06l6M90O29L38
55150A9412j61k83K10P98Q75M55j19o53r68q96o87p16o12M18K065K856K157J117
55132B5268Q80J035P25K20J54J89k67o81r9J218K075J980J390P20J30mM87R09
55114C6329M89l82o61j66L89O89J031J350J094K38m95o48n18m96n54n38m00n7
$$ y = [22217, 21822, 20667, 19149, 17858, 17085, 16923, 17535, 18947, 20795, 22662, 24445, 26091, 27238, 27568, 27301, 26896, 26486, 25973, 25422, 24978, 24611, 24341, 24470, 25229, 26428, 27753, 29117, 30363, 31030, 30823, 29995, 28911, 27586, 26009, 24512, 23408, 22673, 22345, 22751, 23894, 25133, 25887, 26153, 25995, 25172, 23825, 22805, 22649, 22866, 22862, 22805, 22810, 22196, 20633, 19308, 19668, 21493, 23414, 24867, 26171, 27099, 26957, 26158, 26199, 27668, 29434, 30190, 29776, 28661, 27160, 25686, 24934, 25164, 25798, 26089, 25734, 24674, 22885, 20711, 18897, 17991, 17955, 18445, 19074, 19412, 19251, 18968, 19178, 19976, 20851, 21306, 21187, 20534, 19566, 18670, 17983, 17267, 16655, 17073, 19138, 21994, 24151, 25268, 26148, 27183, 27908, 28128, 28282, 28471, 28204, 27523, 27424, 28642, 30717, 32697, 34087, 34807, 34937, 34933, 35420, 36329, 36818, 36436, 35775, 35609, 35998, 36687, 37718, 39068, 40162, 40400, 39905, 39257, 38739, 38243, 37689, 37151, 36751, 36694]
55096C6694N43J118J237Q29J52n43r88p28L52J522J775R80j1l65l5M44O05M11
55078D3992J61M8j21n16p59l49M06O43K45K8L23M06j27m69M1O20J78q71j180m13
55058D2286M99Q50Q07O60M21K02J19r7p24j350j287o36j73k20l84l85l71l44M6
55039C9919Q77J680J934J472M38p79j576j530q34k3N74R33J081J102J077P59k31
55022D6873j558k086j218K27J161J577J927J875R29j32jR71R23q28k601k625j403
55005D4011p58j291j927j760j204j047j183q96k8P61J010J112J577K075J854R79
54989D3285L61M97R25J163J347J559J391Q17O65J395K063J511J64m93L0P95R95
54972E8470Q85J020J443J995K672L369L799L941M162M710N485O448P721R171J0309
$$ y = [36694, 37237, 38355, 39592, 40421, 40573, 40030, 39042, 38314, 38666, 40188, 41963, 42943, 42932, 42567, 42532, 42976, 43581, 43992, 44153, 44201, 44080, 43564, 42805, 42456, 42862, 43505, 43750, 43778, 44101, 44507, 44380, 43911, 43952, 44572, 44750, 43879, 42699, 42286, 42785, 43635, 44442, 45102, 45523, 45725, 45844, 45747, 45023, 43673, 42386, 41750, 41577, 41357, 40973, 40588, 40217, 39873, 39919, 40796, 42476, 44410, 45882, 46320, 45541, 43965, 42435, 41601, 41578, 42152, 43085, 44166, 45268, 46345, 47104, 46873, 45315, 43229, 42011, 42238, 43399, 44976, 46903, 48778, 49707, 49575, 49574, 50545, 51468, 50640, 48039, 45414, 44011, 43253, 41962, 40035, 38275, 37071, 36024, 34841, 33945, 33917, 34678, 35688, 36800, 38377, 40452, 42306, 43285, 43646, 44143, 45068, 46231, 47578, 49137, 50528, 51345, 52010, 53405, 55468, 56979, 57143, 56650, 56680, 57475, 58470, 59355, 60375, 61818, 63813, 66485, 69854, 73653, 77594, 81756, 86466, 91951, 98399, 106120, 115291, 125600]
54957A25600J0826J0992J1264J1826J2528J3061J3012J1975R752O445K407j837
54945B37851n784r142j1804j3585j4337j4332j4080j3623j2506j0694q920p735
54933A01309o744n345l715k429j527o21K72P28O76N48P31J281K123L050L726M096
54917I8159M645N895P715R472J0684J1302J1626J2068J2623J2504J0885Q130N480
54904B21188L234K40m159q695j1632j2802j3195j3250j2789j2026j1309j0273
54892A14532q487o669n976o236o202n409m530l878k918j500l42Q1J50K16N4m70
54876F2416r89j234j352j383j177r37j094j499j503j027p34q90r22m43L3k08j179
54859D5878k283k841k441j286k36M6j07N1M08K46m08o94k80J55N1m17r75j586
$$ y = [125600, 136426, 147418, 158682, 170508, 183036, 196097, 209109, 221084, 230836, 237281, 239688, 237851, 232067, 222925, 211121, 197536, 183199, 168867, 154787, 141164, 128658, 117964, 109044, 101309, 94565, 89220, 85505, 83076, 81549, 80928, 81200, 81928, 82604, 83152, 83883, 85164, 87287, 90337, 94063, 98159, 102804, 108699, 116414, 125886, 136570, 147872, 159498, 171566, 184189, 196693, 207578, 215708, 221188, 224422, 224662, 220503, 211808, 200176, 187374, 174179, 160929, 148140, 136114, 124805, 114532, 106045, 99376, 93400, 87164, 80962, 75553, 71023, 67145, 64227, 62727, 62385, 62466, 62616, 62832, 62886, 62416, 61427, 60193, 58841, 57458, 56281, 55344, 54250, 52751, 51248, 50221, 49487, 48597, 47675, 47232, 47265, 47057, 45878, 43595, 40754, 38313, 37027, 36791, 36837, 36730, 36781, 37189, 37435, 37027, 36333, 36053, 36208, 36259, 35842, 34867, 33281]
54841C3281j884j269j9P11M30jL28J190J811J861J353L89m40k12J105K298K417
54824D3349J994K081K635K660J622j1j328j614o67R98K469L285L706L994L998
54809F9171L879M442O146Q114Q980Q559Q072Q725J0501J2412J3545J3736J3337
54796A89619J2513J0907Q149M502O84k818n884q358j0060j1107j1747j1822j0971
54783A53607r398p807o575n579m861m685m791m334k979j428n88o35j068j190m44
54768I7245J120K555K883K360K192K934M036N067O369Q087R600J0508J1298J2420
54754A78674J3362J3360J2300J0375P532L907J96l054n946q467r963j0046r425
54741A92805q980q626p852o835o105n605m987m537m804n626o319o679o912o774
$$ y = [33281, 31397, 30128, 30109, 30820, 31250, 31249, 31577, 32767, 34578, 36439, 37792, 38181, 37741, 37529, 38634, 40932, 43349, 45343, 47424, 50059, 52719, 54341, 54330, 53002, 51388, 50721, 51719, 54188, 57473, 61179, 65173, 69171, 73050, 77492, 83638, 91752, 100732, 109291, 117363, 126088, 136589, 149001, 162546, 176282, 189619, 202132, 213039, 221188, 225690, 226374, 223556, 217672, 209314, 199254, 188147, 176400, 164578, 153607, 144209, 136402, 129827, 124248, 119387, 114702, 109911, 105577, 102598, 101170, 100582, 99947, 98879, 97689, 97245, 98365, 100920, 103803, 106163, 108355, 111289, 115325, 120392, 126761, 134848, 144448, 154956, 166254, 178674, 192036, 205396, 217696, 228071, 235603, 239510, 239706, 236652, 230706, 222239, 212276, 202230, 192805, 183825, 175199, 167347, 160512, 154407, 148802, 143815, 139278, 134474, 128848, 122529, 115850, 108938, 102164]
54727A02164n807m383l620l944m499m271l271k304j893j829j612j129q00r92j432
54712F0378j479r98m38J0P56J901K631K114N53j144k362k885k413q68R83J962
54696E8701J653O88j56n88n89j47N64J065R88N01K10N81J365J717J065j64r62
54679F6492q87l08M07J381K566L326L117K273J641J703K340L104L437K981K005
54664I5578J233R81Q80N85K37jk58m20m0P59J054L31o26q64n32l06j57L62J064
54645I9860J391J413J595J846J789J799K630M048M903M794M663N364O479P020
54631A49594O692O000N415M875L933K251K0k169l952n460o746p352p003o282n928
54616A33888n690m723l019j616j237j521j839k080k296k240j751j208j108j393
$$ y = [102164, 96357, 91974, 88354, 84410, 79911, 75640, 72369, 70065, 68172, 66343, 64731, 63602, 62802, 61810, 60378, 58899, 57901, 57463, 57473, 58229, 60130, 62761, 64875, 65428, 64284, 61922, 59037, 56624, 55756, 56739, 58701, 60354, 61042, 60886, 60298, 59709, 59562, 60126, 61191, 62179, 62680, 62890, 63471, 64836, 66553, 67618, 67454, 66492, 65605, 65297, 65704, 67085, 69651, 72977, 76094, 78367, 80008, 81711, 84051, 87155, 90592, 93573, 95578, 96811, 97792, 98672, 99257, 99494, 99493, 99235, 98815, 98775, 99534, 100588, 100919, 100293, 99429, 98897, 98591, 98434, 98796, 99860, 101251, 102664, 104259, 106105, 107894, 109693, 112323, 116371, 121274, 126068, 130731, 136095, 142574, 149594, 156286, 162286, 167701, 172576, 176509, 178760, 178780, 176611, 172659, 167199, 160453, 153101, 146098, 139816, 133888, 128198, 123475, 120456, 118840, 117603, 116082, 114243, 112163, 109867, 107627, 105876, 104668, 103560, 102167]
54602A02167j566j338r75r87j546k197k285j780j398j719k461k998l202l256k996
54587G1463k161j186q72j234j436j041n87n90p28n37k77n25j179j543j251o89
54571E5627l72l26j54L41Q53R01M81J17J46K14j69p93j004p57p60j364j866j390
54553D9725j12R24J094P88O45O61M48L8r5J35R5o14j321j035J21R23O52J5P4Q67
54533E4028J596J784J668J639J852K307K957L682M396N038N307M756L416J992
54519I6418J034L47m30j081j246j228j660k501l086l081k791k557k423k349k259
54504G1107j879j118m58m40q14q07k77O6l73j389k344k652k003o74L62L45k41
54487E6411k26O05J304J328J325J861K277J645K64o57n97j53M3J03L91P73P78
$$ y = [102167, 100601, 99263, 98288, 97301, 95755, 93558, 91273, 89493, 88095, 86376, 83915, 80917, 77715, 74459, 71463, 69302, 68116, 67244, 66010, 64574, 63533, 62946, 62356, 61628, 61091, 60814, 60289, 59110, 57567, 56316, 55627, 55255, 54929, 54775, 55116, 55969, 56870, 57351, 57468, 57614, 57828, 57659, 56866, 55862, 55105, 54345, 52981, 51115, 49725, 49613, 50537, 51631, 52419, 53064, 53725, 54173, 54211, 54116, 54251, 54346, 53732, 52411, 51376, 51497, 52420, 53072, 53087, 53161, 54028, 55624, 57408, 59076, 60715, 62567, 64874, 67831, 71513, 75909, 80947, 86254, 91010, 94426, 96418, 97452, 97799, 97369, 96288, 95042, 93814, 92154, 89653, 86567, 83486, 80695, 78138, 75715, 73366, 71107, 69228, 68110, 67652, 67212, 66398, 65591, 65314, 65380, 65007, 63618, 61274, 58622, 56619, 55945, 56307, 56652, 56411, 56185, 56790, 58094, 59422, 60747, 62608, 64885, 66530, 66794, 66137, 65540, 65387, 65430, 65533, 65924, 66697, 67475]
54470F7475L17r7RL43J15q97j802j513j07J165J294N51J9L46J136J389M90j135
54452F9098k340k357j511o22n1L43N44L42q6k25PJ38j9K5N63R94N22o72j476j086
54432F2131Q4Q58N71j69j49R88K180K124Q03n80j031o19N7N80P19L24l51o57j90
54413F7673P96J759K374K443J827P81Q3L67J473K673L446L736L668L330K804K271
54397A01504J999K221K849L359L165K248J128K39m08r12j259j509j812k094k080
54382A08638j841j838k196k416k215k155k818l704l684k468r70j49p8k95n23o90
54366H0598o92n66o19j013j337j062k78L53M87M72O91R99J103J193J629K168K079
54349H6205J240N70J004K285L220L057K256J817K123K604K513J768R11K57m86
$$ y = [67475, 67792, 67695, 67704, 68047, 68162, 67265, 65463, 63950, 63843, 65008, 66302, 66853, 66872, 67218, 68354, 69743, 70233, 69098, 66758, 64401, 62890, 62268, 62217, 62560, 63104, 63446, 63360, 63135, 63142, 63280, 63261, 63286, 63849, 64843, 65365, 64693, 63217, 62131, 62215, 63073, 63644, 63475, 63326, 64314, 66494, 68618, 69421, 68841, 67810, 67191, 67248, 67828, 68547, 68871, 68520, 67863, 67673, 68469, 70228, 72602, 75045, 76872, 77653, 77736, 78103, 79576, 82249, 85695, 89431, 93099, 96429, 99233, 101504, 103503, 105724, 108573, 111932, 115097, 117345, 118473, 118712, 118304, 117392, 116133, 114624, 112812, 110718, 108638, 106797, 104959, 102763, 100347, 98132, 95977, 93159, 89455, 85771, 83303, 82333, 82184, 82106, 81811, 81288, 80598, 79906, 79340, 78721, 77708, 76371, 75309, 75031, 75384, 75871, 76343, 77034, 78033, 79136, 80329, 81958, 84126, 86205, 87445, 88015, 89019, 91304, 94524, 97581, 99837, 101654, 103777, 106381, 108894, 110662, 111573, 111830, 111344]
54334A11344j539k376k283j472r63j282j959k546l306m372m924m063k211q06o38
54319G6604j213j778k240k823l295l037j803k17O58L44m93q27n18l30o91j091
54303E7250r94o39m34k30J27J68m38j001o48K78O37Q9p30j359j817j843j074N
54285D7347L78J6m4N66R40M48k54l87l10o58j059o17O68J811K030J383M93j9P0
54266E2802L81L28j36m46k48J86M92O33N95K61j09P2P89J204P81N8k18q5P2L19
54246E7731Q32J266J168P63O15P68Q61P91O94N47L18K51M22L42l55j172j381j125
54228F3336j066j218r96l75j0j27j40K70N29R8n84n98K45J195J421P94n4l06L19
54209F2733J208J388M60r34j717j373m36M0m78j361j470m56P90J229Q43L63J47
$$ y = [111344, 109805, 107429, 105146, 103674, 102711, 101429, 99470, 96924, 93618, 89246, 84322, 80259, 78048, 77242, 76604, 75391, 73613, 71373, 68550, 65255, 62218, 60415, 60198, 60856, 61200, 60707, 59880, 59362, 59032, 58341, 57250, 56256, 55617, 55183, 54953, 55080, 55248, 54810, 53809, 53161, 53439, 54076, 54165, 53435, 52076, 50259, 48416, 47342, 47347, 47725, 47741, 47697, 48263, 49203, 49651, 49397, 49010, 48700, 48042, 46983, 46366, 47034, 48845, 50875, 52258, 52751, 52732, 52802, 53183, 53511, 53375, 52929, 52681, 52867, 53359, 53992, 54587, 54848, 54739, 54811, 55600, 56804, 57585, 57643, 57425, 57340, 57412, 57731, 58563, 59829, 60997, 61760, 62375, 63143, 64004, 64795, 65489, 66036, 66354, 66605, 67027, 67369, 67014, 65842, 64461, 63336, 62270, 61052, 60056, 59681, 59671, 59544, 59404, 59674, 60203, 60301, 59717, 59119, 59364, 60559, 61980, 62774, 62720, 62414, 62733, 63941, 65329, 65789, 64855, 63138, 61765, 61329, 61369, 60891, 59530, 58060, 57604, 58394, 59623, 60466, 60829, 60976]
54192F0976p9m15m51M5N63M26l15r53j029q23q47j135j198o98Q4N65N50L58K35
54173E5859m8p66j597j803j101j62Q2n05j138j077m85p8j01r8K68O21M09k76p97
54154D7207p22j61N01Q35N27k76r18q94m41p9K19P69J325J231M31l83p40p71n73
54135D7087J1O95O80j72q95o77M1L17j0m24o28o00k01M87P66N9j068j438p83R
54115D3256J64j28l00k14l4K07N63Q97R98Q52O24M07J68k1J47R02J844K018Q79
54096E3229q47j780j403n25j03j91l25l54l75k65J39O39R24J056J238J282Q71
54079E3210K05j24N7L34L58K67K85L39J95j58m63m20J08R54J724K024J747J144
54061F1786P00P65J190J434J251J058J350J872J950J449Q23K28n71j294j030M68
$$ y = [60976, 60897, 60482, 60031, 60076, 60639, 61065, 60750, 59797, 58768, 57945, 57098, 55963, 54765, 54067, 54151, 54716, 55266, 55624, 55859, 55811, 55045, 53448, 51645, 50544, 50382, 50464, 49959, 48821, 47744, 47259, 47181, 47080, 46982, 47250, 47871, 48280, 48004, 47207, 46485, 46324, 46825, 47660, 48187, 47911, 46993, 46099, 45658, 45579, 45798, 46567, 47892, 49123, 49554, 49171, 48431, 47660, 47087, 47098, 47793, 48473, 48301, 47406, 46729, 46770, 47087, 47077, 46653, 46025, 45425, 45224, 45711, 46477, 46536, 45468, 44030, 43247, 43256, 43420, 43292, 42992, 42778, 42744, 42951, 43514, 44411, 45409, 46261, 46885, 47292, 47460, 47439, 47586, 48488, 50332, 52350, 53229, 52382, 50602, 49199, 48674, 48571, 48380, 48055, 47701, 47326, 47061, 47200, 47839, 48763, 49819, 51057, 52339, 53210, 53415, 53291, 53348, 53682, 54040, 54307, 54592, 54931, 55126, 54968, 54505, 54085, 54193, 55147, 56871, 58895, 60642, 61786, 62486, 63251, 64441, 65875, 67126, 68184, 69534, 71406, 73356, 74805, 75628, 75856, 75285, 73991, 72961, 73429]
54045G3429K145K892K830K736K766K554K170K176K819L825M778N286N009M155
54031A19570L664M259N439O031N581M679L986L619L407L204K881K421J989J582
54017A72312Q38l67j385j504j007q23j245j657j669j740k402l348l748l249k423
54002A46583k203k908l828l974l243k466k206k057j529r49q84j184j337j395j672
53987A14748j842j304k77L40K69J02J61P9l01n27l54k33n16q20o61j56L26P43
53969A09777J168J376J092M18k81p52q85p32o27j003j773k190j661m61N31P56
53953A04753L74n5j32R6K76J83M1K66R64J843K525K805K623K115J692J844K732
53936A24945M040N154N530N052M196L636L552L506L093K400J696J055N84N62R37
$$ y = [73429, 75574, 78466, 81296, 84032, 86798, 89352, 91522, 93698, 96517, 100342, 105120, 110406, 115415, 119570, 123234, 127493, 132932, 138963, 144544, 149223, 153209, 156828, 160235, 163439, 166320, 168741, 170730, 172312, 173150, 172783, 171398, 169894, 168887, 168064, 166819, 165162, 163493, 161753, 159351, 156003, 152255, 149006, 146583, 144380, 141472, 137644, 133670, 130427, 127961, 125755, 123698, 122169, 121220, 120336, 119152, 117815, 116420, 114748, 112906, 111602, 111325, 111665, 111934, 112036, 112197, 112276, 111975, 111448, 111094, 110861, 110345, 109525, 108864, 108708, 109034, 109777, 110945, 112321, 113413, 113831, 113550, 112798, 111913, 111181, 110554, 109551, 107778, 105588, 103927, 103466, 103997, 104753, 105127, 105072, 104940, 105036, 105312, 105495, 105536, 105802, 106766, 108609, 111134, 113939, 116562, 118677, 120369, 122213, 124945, 128985, 134139, 139669, 144721, 148917, 152553, 156105, 159611, 162704, 165104, 166800, 167855, 168439, 169001, 169938]
53921A69938J164R66Q39J330K158K656K663K473K313K473L376M761N403M594L394
53906B10501L223L647L044J270j9L8K99l92j401j609j298j524k309k702k365k035
53890B06368k341l038l544l767m058m605n115n156m777m508m596m614m174l596
53876A48479l333l117k508j914k057k624k634k160k336l404m147l803l195l137
53862A08110l041k199j349j642k730l265k820k069j371m98L43N08N4k24j11l03
53846H7393j102j705j323l40K60J48j59j24K98P73R02M79k98q91r12n00j67k20
53828H2512n06o55m97j07L94R19J235J039L58k99n03l89k87j13L98R98J178J060
53810H6735J386K369L256L373K998K763K732K621K557K901L530L880L743L470
$$ y = [169938, 171102, 172068, 172907, 174237, 176395, 179051, 181714, 184187, 186500, 188973, 192349, 197110, 202513, 207107, 210501, 213724, 217371, 220415, 221685, 221666, 221704, 222003, 221611, 220210, 218601, 217303, 215779, 213470, 210768, 208403, 206368, 204027, 200989, 197445, 193678, 189620, 185015, 179900, 174744, 169967, 165459, 160863, 156249, 152075, 148479, 145146, 142029, 139521, 137607, 135550, 132926, 130292, 128132, 125796, 122392, 118245, 114442, 111247, 108110, 105069, 102870, 101521, 99879, 97149, 93884, 91064, 88995, 87624, 87126, 87469, 87977, 88031, 87807, 87696, 87393, 86291, 84586, 83263, 82923, 83183, 83331, 83172, 83048, 83346, 84119, 85021, 85500, 85202, 84311, 83399, 82899, 82732, 82512, 82006, 81351, 80854, 80747, 81141, 82060, 83295, 84334, 84692, 84393, 83890, 83501, 83214, 83101, 83499, 84497, 85675, 86735, 88121, 90490, 93746, 97119, 100117, 102880, 105612, 108233, 110790, 113691, 117221, 121101, 124844, 128314]
53796A28314L357L274L032K809K936L352L539L042K087J366J187J040L66n50r08
53781A58243n21l7M0o2N9L08L22m6o75j339j750j804j923k687l940m720m325l051
53763A32092j734r05o43p73r42q99q60j169j530j234k92M15M16K99N81Q25M95
53746A24142o2k63l24p42j260j282j020j218j892k265j929j283q35p29j004j536
53730A06498j787j302n59n90j520k239j767m70N32O89L72J92L63P38J133J541
53714A01824J966K145J684O50k71m54j72k61j049j886j830n94J241K800L616L827
53698A13236L760L517L134K938L212L589L318K309J313Q04L64m08r90p14R4N41
53682A40017M74N19R17J134P67J49k23l48n32q57j070q82l35J46J16k80m19q1
$$ y = [128314, 131671, 134945, 137977, 140786, 143722, 147074, 150613, 153655, 155742, 157108, 158295, 159335, 159701, 159151, 158243, 157722, 157685, 157725, 157663, 157722, 158030, 158352, 158306, 157631, 156292, 154542, 152738, 150815, 148128, 144188, 139468, 135143, 132092, 130358, 129453, 128810, 128037, 127095, 126196, 125336, 124167, 122637, 121403, 121111, 121526, 121942, 122241, 122822, 123647, 124142, 124080, 123817, 123493, 122751, 121491, 120209, 119189, 117971, 116079, 113814, 111885, 110602, 109767, 109038, 108034, 106498, 104711, 103409, 102850, 102260, 100740, 98501, 96734, 96264, 96796, 97485, 97857, 98049, 98412, 99150, 100283, 101824, 103790, 105935, 107619, 108269, 107998, 107544, 107372, 107111, 106062, 104176, 102346, 101752, 102993, 105793, 109409, 113236, 116996, 120513, 123647, 126585, 129797, 133386, 136704, 139013, 140326, 141130, 141494, 141086, 140096, 139382, 139476, 140017, 140491, 141010, 141927, 143061, 143828, 143977, 143754, 143406, 142874, 142017, 140947, 140065, 139730, 139876, 139992, 139712, 139293, 139212]
53664A39212J13m54j431j906j606j126r51q46l26O34J511J724J184M49K21N33
53648A36935P32M36P0O7M7n88j506j724r26J59P84R35R34Q82P76P26P79P70N60
53629A40848L03K95O93J407K085K338K070J556J100Q38R21J507K256K367J549
53614A62133O37N61J056J096M76O8M56J159J496J584J946K561K825K423J854J942
53598A84273K881L933M186L588K906K663K567K310K282K957L856L963L024J874
53584B27263J419J816K658L388L434K481Q53o05j195p83K09J038J042K82l72j57
53568B42771O75J229J079N51J00r4k1K08L98N69J072J914K377J899R65M68M78
53551B56638M62M34Q60J496J476P42L33Q77J718J999J801J699J828J948J954J849
$$ y = [139212, 139325, 138871, 137440, 135534, 133928, 132802, 131851, 131005, 130679, 131313, 132824, 134548, 135732, 136181, 136402, 136935, 137667, 138103, 138173, 138240, 138287, 137699, 136193, 134469, 133543, 133702, 134486, 135421, 136355, 137237, 138013, 138739, 139518, 140288, 140848, 141151, 141446, 142139, 143546, 145631, 147969, 150039, 151595, 152695, 153533, 154454, 155961, 158217, 160584, 162133, 162770, 163331, 164387, 165483, 165959, 166027, 166483, 167642, 169138, 170722, 172668, 175229, 178054, 180477, 182331, 184273, 187154, 191087, 195273, 198861, 201767, 204430, 206997, 209307, 211589, 214546, 218402, 222365, 225389, 227263, 228682, 230498, 233156, 236544, 239978, 242459, 243312, 242707, 241512, 240729, 240938, 241976, 243018, 243300, 242928, 242771, 243446, 244675, 245754, 246305, 246405, 246311, 246290, 246498, 246896, 247465, 248537, 250451, 252828, 254727, 255692, 256160, 256638, 257100, 257534, 258394, 259890, 261366, 262108, 262441, 263318, 265036, 267035, 268836, 270535, 272363, 274311, 276265, 278114]
53535B78114J581J244J086J084R67Q29J119J834K307K168J902K071K546K898L076
53520C04826L305L700M337N263O102O199N524M928N123N898O709P443Q155Q665
53506C86177R024R775J1020J1845J1493J0698J0836J2031J3138J3547J3865J4596
53494E28045J5227J5165J4824J5028J5795J6381J6347J5949J5506J4990J4448
53483F97705J4318J4893J5689J5797J5025J4258J4459J5499J6383J6445J5962
53472H66433J5545J5419J5476J5613J5734J5618J5158J4588J4203J3876J3139
53461A030802J1804J0255Q984P952O643M818K928J546N17q62k792m623n807o621
53447A065544p495q131p993p378p153p561q145q796r926j1375j2212j2075j1901
$$ y = [278114, 279695, 280939, 282025, 283109, 284076, 284905, 286024, 287858, 290165, 292333, 294235, 296306, 298852, 301750, 304826, 308131, 311831, 316168, 321431, 327533, 333732, 339256, 344184, 349307, 355205, 361914, 369357, 377512, 386177, 395201, 404976, 415996, 427841, 439334, 450032, 460868, 472899, 486037, 499584, 513449, 528045, 543272, 558437, 573261, 588289, 604084, 620465, 636812, 652761, 668267, 683257, 697705, 712023, 726916, 742605, 758402, 773427, 787685, 802144, 817643, 834026, 850471, 866433, 881978, 897397, 912873, 928486, 944220, 959838, 974996, 989584, 1003787, 1017663, 1030802, 1042606, 1052861, 1061845, 1069797, 1076440, 1081258, 1084186, 1085732, 1086249, 1085387, 1082595, 1077972, 1072165, 1065544, 1058049, 1049918, 1041925, 1034547, 1027394, 1019833, 1011688, 1002892, 992966, 981591, 969379, 957304, 945403]
53434I45403j2569j3532j3628j2750j1869j1603j1651j1591j1432j1170j0450
53423H13158q992p005m952l224k121j796j941j860j187l31M6j00j91K10J024K027
53407G82765L204M478N470N921O165O711P547Q311R105J0464J2353J3929J4634
53394H91057J4974J5745J7018J8466K0079K1903K3436K4202K4619K5522K6904
53383A123925K8016K8642K9358L0403L1235L1517L1662L2012L2170L1741L1074
53372A461755L0731L0527K9744K8088K6030K4263K3052K1970K0307J7879J5346
53361A729692J3352J1544R078O008L266J121j306m607q132j1126j3936j7125k0108
53348A697721k1796k2300k2817k3842k4697k4957k5312k6370k7434k7280k5845
$$ y = [945403, 932834, 919302, 905674, 892924, 881055, 869452, 857801, 846210, 834778, 823608, 813158, 804166, 797161, 792209, 788985, 786864, 785068, 783127, 781267, 780080, 779749, 779795, 779695, 779504, 779714, 780738, 782765, 785969, 790447, 795917, 801838, 808003, 814714, 822261, 830572, 839677, 850141, 862494, 876423, 891057, 906031, 921776, 938794, 957260, 977339, 999242, 1022678, 1046880, 1071499, 1097021, 1123925, 1151941, 1180583, 1209941, 1240344, 1271579, 1303096, 1334758, 1366770, 1398940, 1430681, 1461755, 1492486, 1523013, 1552757, 1580845, 1606875, 1631138, 1654190, 1676160, 1696467, 1714346, 1729692, 1743044, 1754588, 1763666, 1769674, 1772940, 1774061, 1772755, 1768148, 1760016, 1748890, 1734954, 1717829, 1697721, 1675925, 1653625, 1630808, 1606966, 1582269, 1557312, 1532000, 1505630, 1478196, 1450916, 1425071]
53337A425071k4431k4200k4986k5675k5323k3820k1781k0168j9762k0564k1637
53326A172724k1890k1083j9863j8814j7849j6659j5274j3897j2554j1237j0112
53315I93492r207q269p260o644o683o944o990p191q069r209r656r190q355p410
53301H82415o152m715l617k941k377j973j987j996j243Q8J046J551K581M384N803
53286H70867O050N950O679Q214R868J1384J2652J3157J2800J2520J3157J4178
53274I97476J4457J3813J2884J1921J0652R095P637O480N651N222M930M037K278
53261A106533M91m87j099k352m205n732o612p479q734j0043j1099j2007j2736
53248A024439j2968j2759j2809j3667j5025j6065j6354j6162j6040j6084j5742
$$ y = [1425071, 1400640, 1376440, 1351454, 1325779, 1300456, 1276636, 1254855, 1234687, 1214925, 1194361, 1172724, 1150834, 1129751, 1109888, 1091074, 1073225, 1056566, 1041292, 1027395, 1014841, 1003604, 993492, 984285, 976016, 968756, 962112, 955429, 948485, 941495, 934304, 926235, 917026, 907370, 898180, 889825, 882415, 876263, 871548, 867931, 864990, 862613, 860640, 858653, 856657, 855414, 855502, 856548, 858099, 860680, 865064, 870867, 876917, 882867, 889546, 897760, 907628, 919012, 931664, 944821, 957621, 970141, 983298, 997476, 1011933, 1025746, 1038630, 1050551, 1061203, 1070298, 1077935, 1084415, 1090066, 1095288, 1100218, 1104255, 1106533, 1107024, 1106537, 1105438, 1103086, 1098881, 1093149, 1086537, 1079058, 1070324, 1060281, 1049182, 1037175, 1024439, 1011471, 998712, 985903, 972236, 957211, 941146, 924792, 908630, 892590, 876506, 860764]
53237H60764j4544j2866j1616j1155j1106j1208j1614j2095j1882j0794r744r513
53225G22627r754r782r566r270q582p358o266n872n722n176m459l967l300k113
53211F31440j215j489k349k655k611l247m403m983n057n798p242p909p133o085
53197E69264n869o114o186o407o995p079n928m381l862m538n371n649n563n538
53183D89784n724o083o454o593o455o254o148o082o056o188o384o370o129n936
53169D02928n892n859n825n814n554m838m158m139m472m288l671l625m363m814
53155C35616m341l754l881m264m198m117m743n552n360m140l062k788k784k500
53141B80132k252k578l266l576l153k463k243k663l121l036k611k482k750k944
$$ y = [860764, 846220, 833354, 821738, 810583, 799477, 788269, 776655, 764560, 752678, 741884, 732140, 722627, 712873, 703091, 693525, 684255, 675673, 668315, 662049, 656177, 650455, 645279, 640820, 636853, 633553, 631440, 630225, 628736, 626387, 623732, 621121, 617874, 613471, 608488, 603431, 597633, 590391, 582482, 575349, 569264, 563395, 557281, 551095, 544688, 537693, 530614, 524686, 520305, 516443, 511905, 506534, 500885, 495322, 489784, 484060, 477977, 471523, 464930, 458475, 452221, 446073, 439991, 433935, 427747, 421363, 414993, 408864, 402928, 397036, 391177, 385352, 379538, 373984, 369146, 364988, 360849, 356377, 352089, 348418, 344793, 340430, 335616, 331275, 327521, 323640, 319376, 315178, 311061, 306318, 300766, 295406, 291266, 288204, 285416, 282632, 280132, 277880, 275302, 272036, 268460, 265307, 262844, 260601, 257938, 254817, 251781, 249170, 246688, 243938, 240994]
53127B40994k975l312l953m026l035j804j470j979k380k269k077k079k009j710
53113B05916j444j390j386j333j369j504j504j308j097q42k38O45J166R31N51
53098A95794R97K256L185K804J413J63k59j49j46m44p88r59j041j247j672k181
53082A97726k476k415k251k411k934l312l061k274j470j077j214j767k438k909
53068A65717l042k885k459j856j533j926k659k711j766p52n87j040j409j649j991
53053A37452k066j480q19q83j250q76qq7j491k755k536j246j40K99L77L76M39
53036A23306O42O88Q6q92j256o80r7k86p30o62m18p29j235r78j02J26q66k102
53018A13815k323j447l52K39L10K41K88L46J40l36o32l08N22J230J316Q57L63
$$ y = [240994, 238019, 234707, 230754, 226728, 223693, 221889, 220419, 218440, 216060, 213791, 211714, 209635, 207626, 205916, 204472, 203082, 201696, 200363, 198994, 197490, 195986, 194678, 193581, 192739, 192501, 193146, 194312, 195243, 195794, 196791, 199047, 202232, 205036, 206449, 206612, 206353, 206204, 206058, 205614, 204826, 203867, 202826, 201579, 199907, 197726, 195250, 192835, 190584, 188173, 185239, 181927, 178866, 176592, 175122, 174045, 172831, 171064, 168626, 165717, 162675, 159790, 157331, 155475, 153942, 152016, 149357, 146646, 144880, 144128, 143541, 142501, 141092, 139443, 137452, 135386, 133906, 133087, 132204, 130954, 130078, 130070, 129983, 128492, 125737, 123201, 121955, 121815, 122114, 122491, 122867, 123306, 123948, 124636, 124722, 123830, 122574, 121894, 121797, 121511, 120781, 120119, 119701, 118972, 117737, 116759, 116657, 116783, 115917, 113815, 111492, 110045, 109693, 109932, 110242, 110483, 110771, 111117, 111257, 110921, 110289, 109981, 110503, 111733, 113049, 113906, 114269]
53001A14269K60N35Q38R01O91K26n20j295j510r52k21p1m33o78n94m72l17K01
52983A10858R28J183P28J24m8K80J009J967K536K042Q49J73M25O08j20j114j241
52966A21187l88P30J646K181K027J202N29P53J489J807J601J536J841K066K022
52951A42229K136K701L423L860L906L699L377L042K660K037J092J27m15l96j33
52936A73345k04j084k557l515k881j049K64p0j346k139k040j651j413j267j186
52921A51207j265j317j036m86J2L85P71J086J101P75K56k87n11m5Q43J172M00
52904A53061p24j057m64K52M75J70n30j337j639j001J59J005J247J125P36O1m62
52887A51077k16O76J304J005j6j010j250m69Q18J560J216L58j64k56k29J05J106
$$ y = [114269, 114529, 115064, 115902, 116803, 117494, 117720, 117200, 115905, 114395, 113443, 113222, 113151, 112718, 112040, 111446, 110974, 110657, 110858, 111786, 112969, 113697, 113821, 113773, 114053, 115062, 117029, 119565, 121607, 122456, 122629, 123054, 123662, 123542, 122428, 121187, 120799, 121529, 123175, 125356, 127383, 128585, 129114, 129867, 131356, 133163, 134764, 136300, 138141, 140207, 142229, 144365, 147066, 150489, 154349, 158255, 161954, 165331, 168373, 171033, 173070, 174162, 174289, 173874, 173478, 173345, 173141, 172057, 169500, 165985, 163104, 162055, 162319, 162249, 160903, 158764, 156724, 155073, 153660, 152393, 151207, 149942, 148625, 147589, 147103, 147115, 147500, 148271, 149357, 150458, 151233, 151489, 151202, 150691, 150646, 151489, 152661, 153061, 152337, 151280, 150816, 151068, 151543, 151713, 151183, 149846, 148207, 147206, 147365, 148370, 149617, 150742, 151478, 151539, 151077, 150861, 151537, 152841, 153846, 153830, 152820, 151570, 151101, 151919, 153479, 154695, 155053, 154889, 154633, 154404, 154509, 155615]
52870A55615K312K713J970P04m30j200j479j241q12m93m9P36J339J170P43J073
52854A62671K036K522K183J818J786J427M61k61j23K54J53r9O0K60j17p59r46
52837A73326q13j053j580j455k22J389K313K211J634J358J608J854J509Q01M60
52822A83340N20K08o34r27J0J044O08r23j631q40n8o94k114k752k312j772j750
52805A69323j957k087k230k330k100j721j780k215k085q85M84P86J2q61j309j621
52789A47424k044k408k640k817k640j716m90o5p46j563j682j413j342j295r56
52774A23607p66j234j862j752r74m42n65r36j214j432j466j038l77j33m57q21
52758A08138r07j026j479k033k276k110j735j510j736k231k283j512n76l54o49
$$ y = [155615, 157927, 160640, 162610, 163314, 162884, 161684, 160205, 158964, 158152, 157659, 157610, 158346, 159685, 160855, 161598, 162671, 164707, 167229, 169412, 171230, 173016, 174443, 174904, 174643, 174520, 174774, 174927, 174828, 174888, 175148, 175031, 174272, 173326, 172513, 171460, 169880, 168425, 168203, 169592, 171905, 174116, 175750, 177108, 178716, 180570, 182079, 182880, 183340, 183860, 184068, 183434, 182507, 182517, 183561, 184169, 183246, 181615, 180775, 180717, 180023, 177909, 175157, 172845, 171073, 169323, 167366, 165279, 163049, 160719, 158619, 156898, 155118, 152903, 150818, 149933, 150417, 151203, 151215, 150354, 149045, 147424, 145380, 142972, 140332, 137515, 134875, 133159, 132669, 132604, 131858, 130295, 128613, 127200, 125858, 124563, 123607, 122841, 121607, 119745, 117993, 117019, 116577, 116012, 115076, 113862, 112430, 110964, 109926, 109549, 109416, 108959, 108138, 107231, 106205, 104726, 102693, 100417, 98307, 96572, 95062, 93326, 91095, 88812, 87300, 86724, 86370, 85721]
52743H5721n20J37L80k01p58m71L19P90Q27Q07P53M00j61n72p66r34j040r23p61
52724H3027j003j634j983j520o65m31j169j967j683l98O28N43j92p26r06r26n43
52707F8452M47J346J173Q0p49o61j32K80O34J022J139Q73O41P13P23K96l32o58
52689G5287m80J33R77J579J485R62R13J705K639K957K839K901L145L088K608K065
52673A04803J629J070L05k89k90J33K66m00j480k025j688j161j226j695j911j935
52657I4106k376l095l091j993q13p10j579k359k323j582p32l85p92j510j705j057
52641F8004j16M46N72N97O20N03K44m1l50p73j232j413r63Q1J020J025K32j39
52623F8317O78J774J682M60m94n58n54j088j477r89p4M20M89N58N40J12n18q66
$$ y = [85721, 85201, 85338, 85718, 85517, 84759, 84288, 84607, 85397, 86224, 87031, 87784, 88184, 88023, 87451, 86685, 85751, 84711, 83788, 83027, 82024, 80390, 78407, 76887, 76222, 75791, 74622, 72655, 70972, 70574, 71202, 71745, 71553, 70827, 69921, 68995, 68452, 68899, 70245, 71418, 71498, 70749, 70088, 69956, 70236, 70870, 71892, 73031, 73904, 74545, 75258, 75981, 76277, 75945, 75287, 74807, 74940, 75917, 77496, 78981, 79943, 80856, 82561, 85200, 88157, 90996, 93897, 97042, 100130, 102738, 104803, 106432, 107502, 107807, 107518, 107228, 107361, 107627, 107227, 105747, 103722, 102034, 100873, 99647, 97952, 96041, 94106, 91730, 88635, 85544, 83551, 82738, 82028, 80449, 78090, 75767, 74185, 73453, 73068, 72276, 70766, 69061, 68004, 67888, 68334, 68906, 69503, 70123, 70626, 70870, 70829, 70479, 69706, 68474, 67061, 66098, 66179, 67199, 68224, 68456, 68317, 68995, 70769, 72451, 72911, 72417, 71859, 71305, 70217, 68740, 67751, 67677, 68097, 68586, 69144, 69684, 69796, 69278, 68412]
52605F8412q58o48j65N92J204J309J098Q37L53m33r78p82k23l3k49k85J17O51
52587F9919R52R06O43N89J199K202K599J900R14P00J157J345Q92K73n7o0K15P32
52569H7020J156J118P15L99M26P18J116J325R60Q5n32k98M12Q01P09N12L12j06
52551I6848o39q70o25k2Q74J879K423K077J229N88K50j24m19j77M68Q12O56N97
52533A05825J056J716K110K190K029J504O00l13q12p79l23L98J133J547J464R58
52517A20303K39m00o94o34m71k74K38J152J897J806R28q5p55j018r30o00l39m29
52499A19934p95j204j529j539q22N04J404R86k52r48n61K10N95N76M36K95K97
52482A17587O30J108J222Q59N14O01R53J189J206J130J042R52P65L20l69r37r98
$$ y = [68412, 67554, 66906, 66741, 67333, 68537, 69846, 70944, 71781, 72134, 71701, 70723, 69941, 69718, 69685, 69436, 69151, 69268, 69919, 70871, 71777, 72420, 73009, 74208, 76410, 79009, 80909, 81823, 82523, 83680, 85025, 85917, 86190, 86133, 86073, 86288, 87020, 88176, 89294, 90009, 90408, 90834, 91552, 92668, 93993, 94953, 95038, 94506, 94208, 94620, 95421, 96130, 96642, 96954, 96848, 96209, 95339, 94714, 94692, 95566, 97445, 99868, 101945, 103174, 103762, 104012, 103888, 103469, 103292, 103760, 104572, 105228, 105825, 106881, 108597, 110707, 112897, 114926, 116430, 117030, 116717, 115905, 115126, 114803, 115201, 116334, 117881, 119345, 120303, 120542, 120142, 119448, 118814, 118343, 118069, 118307, 119459, 121356, 123162, 124090, 124005, 123250, 122232, 121302, 120702, 120363, 119934, 119139, 117935, 116406, 114867, 114045, 114549, 115953, 116939, 116687, 115739, 115178, 115388, 115983, 116559, 116995, 117290, 117587, 118217, 119325, 120547, 121406, 121920, 122521, 123474, 124663, 125869, 126999, 128041, 128993, 129758, 130078, 129709, 128772, 127774]
52465A27774n77M5P53J474J859J572Q63L64L77O62Q47O95J01o74j062p86k51J20
52447A34156N65J355J933J524M06k78K2P91J353J467J078L26j38K32Q53N13r24
52430A45234k202k318j641r99n67j01L95Q11J178J356R72N4p80j045q73m92J53
52413A39135R30J286Q88R7n05o89m31K34R88J409J539J753J871J245J8o32o5Q66
52395A49937J129R94J363K195K631K338J835J595J664K025K633L029K616J425
52381A77409K17l33k33L6M1k75n68m28J45P59J151J331J194M60o66j343r98n8
52363A77841O39Q32Q37R55J298J850K315K239J663J244J278J171M87p1L83J473
52347A96434K022J807J749K331K866K611J805J153R89J262J849K469K712K533
$$ y = [127774, 127197, 127242, 127995, 129469, 131328, 132900, 133763, 134127, 134504, 135166, 136013, 136708, 136809, 136135, 135073, 134287, 134036, 134156, 134721, 136076, 138009, 139533, 139939, 139661, 139683, 140474, 141827, 143294, 144372, 144698, 144560, 144792, 145645, 146158, 145234, 143032, 140714, 139073, 138074, 137507, 137406, 137801, 138612, 139790, 141146, 142118, 142172, 141392, 140347, 139474, 138982, 139135, 140065, 141351, 142239, 142336, 141831, 141142, 140711, 140945, 141933, 143342, 144881, 146634, 148505, 149750, 149768, 149136, 149071, 149937, 151066, 152060, 153423, 155618, 158249, 160587, 162422, 164017, 165681, 167706, 170339, 173368, 175984, 177409, 177626, 177293, 177060, 177096, 177137, 176862, 176294, 175866, 176011, 176770, 177921, 179252, 180446, 180906, 180240, 178897, 177899, 177841, 178480, 179312, 180149, 181104, 182402, 184252, 186567, 188806, 190469, 191713, 192991, 194162, 194649, 194578, 194961, 196434, 198456, 200263, 202012, 204343, 207209, 209820, 211625, 212778, 213767, 215029, 216878, 219347, 222059, 224592]
52333B24592K351K423K485K290K023J887J668J188Q19J061J783K444K865L355
52319B53234M011M471M467M242M201M444M887N582O564P482P793P377O771O654
52305C32180P305Q494R727J0474J0456R942R591R817J0391J0869J1187J1604J2179
52292D64216J2721J3177J3725J4353J4654J4238J3209J2212J2016J2928J4368
52281F11817J5126J4422J2745J1335J0887J0981J0852J0229R254Q017O527M972
52269G37164L647K679J974J429J105J144J516J844J599O70l72q31o53m04n57j018
52253G50936j330j059j14J067J784J895K180L440N338O790P393P842Q721R702
52239H04585J0214J0364J0637J1112J1400J1241J0763J0312J0150J0222J0137
$$ y = [224592, 226943, 229366, 231851, 234141, 236164, 238051, 239719, 240907, 241726, 242787, 244570, 247014, 249879, 253234, 257245, 261716, 266183, 270425, 274626, 279070, 283957, 289539, 296103, 303585, 311378, 318755, 325526, 332180, 339485, 347979, 357706, 368180, 378636, 388578, 398169, 407986, 418377, 429246, 440433, 452037, 464216, 476937, 490114, 503839, 518192, 532846, 547084, 560293, 572505, 584521, 597449, 611817, 626943, 641365, 654110, 665445, 676332, 687313, 698165, 708394, 717648, 725665, 732192, 737164, 740811, 743490, 745464, 746893, 747998, 749142, 750658, 752502, 754101, 754771, 754399, 753568, 752915, 752511, 751954, 750936, 749606, 748547, 748433, 749500, 751284, 753179, 755359, 758799, 764137, 770927, 778320, 786162, 794883, 804585, 814799, 825163, 835800, 846912, 858312, 869553, 880316, 890628, 900778, 911000, 921137]
52228I21137R625Q895Q245P444O023M177K638J597M45j125k503l121l370m087
52214I56020n516p266q846r858j0108r977j0215j0975j1476j1130j0452j0248
52202H39953j0457j0457j0161r933r692q890p368n636m296l742m141n156n750
52189G44274n064l487k283k080k303k146j525r19p55j180k041k835k999k543k155
52174G09959k486l430m213m186l426k591k163k023j856j764k072k580k652k162
52160F72355j756j874k050j768j419j750k652l273l147k665k371k360k412k366
52146F40492k276k396k903l427l246k221j220j142j791k246k113j784j676j763
52132F10288j858j881j865j968k402l065l487l407l029k442j360J17J103J050
$$ y = [921137, 930762, 939657, 947902, 955346, 961369, 965546, 968184, 969781, 970226, 969101, 966598, 963477, 960107, 956020, 950504, 943238, 934392, 924534, 914426, 904449, 894234, 883259, 871783, 860653, 850201, 839953, 829496, 819039, 808878, 798945, 789253, 780363, 772995, 767359, 763063, 759321, 755180, 750024, 744274, 739210, 735723, 733440, 731360, 729057, 726911, 725386, 724467, 723712, 722532, 720491, 717656, 714657, 712114, 709959, 707473, 704043, 699830, 695644, 692218, 689627, 687464, 685441, 683585, 681821, 679749, 677169, 674517, 672355, 670599, 668725, 666675, 664907, 663488, 661738, 659086, 655813, 652666, 650001, 647630, 645270, 642858, 640492, 638216, 635820, 632917, 629490, 626244, 624023, 622803, 621661, 619870, 617624, 615511, 613727, 612051, 610288, 608430, 606549, 604684, 602716, 600314, 597249, 593762, 590355, 587326, 584884, 583524, 583641, 584744, 585794]
52118E85794O58P75R80L74n21j50J835L951M935N198N774O776P591P992Q389R257
52102F49608J0658J2107J2867J2792J2694J3389J4552J5307J5716J6629J8085
52091H04404J9076J9151J8959J8823J8045J6360J4848J4440J4534J4082J3122
52080I85844J2117J0668Q303N911M819M664L713J411q46j816k058k868m494o207
52066A019161p433q131q337q070p537p092o905o897o896o742o425o144o024n796
52052I20732n031l809k753k270j968j157L32J990L202L697L613L322L256L631
$$ y = [585794, 586452, 587227, 588207, 588581, 588060, 587910, 589745, 593696, 598631, 603829, 609603, 616379, 623970, 631962, 640351, 649608, 660266, 672373, 685240, 698032, 710726, 724115, 738667, 753974, 769690, 786319, 804404, 823480, 842631, 861590, 880413, 898458, 914818, 929666, 944106, 958640, 972722, 985844, 997961, 1008629, 1016932, 1022843, 1027662, 1032326, 1036039, 1037450, 1036604, 1034788, 1032730, 1029862, 1025368, 1019161, 1011728, 1003597, 995260, 987190, 979653, 972561, 965656, 958759, 951863, 945121, 938696, 932552, 926528, 920732, 915701, 911892, 909139, 906869, 904901, 903744, 904076, 906066, 909268, 912965, 916578, 919900, 923156, 926787]
$$ [...]
##END NTUPLES=NMR SPECTRUM
##END=
