##TITLE=NES1064_ptc160_9883234_A9gzNZVP0y
##JCAMPDX= 6.0         $$ Bruker NMR JCAMP-DX V2.0
##DATA TYPE= NMR SPECTRUM
##DATA CLASS= NTUPLES
##ORIGIN= BRUKER
##OWNER= Administrator
$$ 1.72 TOPSPIN		Version 2.1
$$ 2016-08-26 19:08:56.929 -0500  Administrator@X
$$ Compression mode = diff/dup
##.OBSERVE FREQUENCY= 400.02188249412
##.OBSERVE NUCLEUS= ^1H
##.ACQUISITION MODE= SIMULTANEOUS (DQD)
##.ACQUISITION SCHEME= undefined
##.AVERAGES= 8
##.DIGITISER RES= 22
##SPECTROMETER/DATA SYSTEM= spect
##.PULSE SEQUENCE= zg30
##.SOLVENT NAME= COFFEE_meoh
##.SHIFT REFERENCE= INTERNAL, COFFEE_meoh, 1, 14.98509
##AUDIT TRAIL= $$ (NUMBER, WHEN, WHO, WHERE, PROCESS, VERSION, WHAT)
$$ ##TITLE= Audit trail, TOPSPIN		Version 2.1
$$ ##JCAMPDX= 5.01
$$ ##ORIGIN= Bruker BioSpin GmbH
$$ ##OWNER= Administrator
$$ $$ E:\/data/COFFEE/nmr/NES1064_ptc160_9883234_A9gzNZVP0y/10/pdata/1/auditp.txt
$$ ##AUDIT TRAIL=  $$ (NUMBER, WHEN, WHO, WHERE, PROCESS, VERSION, WHAT)
(   1,<2016-08-26 19:08:49.351 -0500>,<Administrator>,<X>,<go>,<TOPSPIN 2.1>,
      <created by zg
	started at 2016-08-26 19:07:43.008 -0500,
	POWCHK enabled, PULCHK disabled,
       configuration hash MD5:
       21 0F 79 D6 B3 7B B4 F6 88 20 88 DB 03 48 BD 9F
       data hash MD5: 64K
       3A DB 05 C6 23 89 E2 05 48 B2 4B A4 CE 31 CC 03>)
(   2,<2016-08-26 19:08:52.570 -0500>,<Administrator>,<X>,<proc1d>,<TOPSPIN 2.1>,
      <Start of raw data processing
       efp LB = 0 FT_mod = 6 PKNL = 1 PHC0 = 0 PHC1 = 0 SI = 32K 
       data hash MD5: 32K
       21 61 DE 36 31 83 3E 1E D6 02 AF 61 4B A2 7E 83>)
(   3,<2016-08-26 19:08:52.836 -0500>,<Administrator>,<X>,<proc1d>,<TOPSPIN 2.1>,
      <pk PHC0 = 89.60999 PHC1 = 0 
       data hash MD5: 32K
       83 94 8B 9C 16 38 5C 3F 3F 54 2E 5C 4A 8A F3 E4>)
(   4,<2016-08-26 19:08:52.945 -0500>,<Administrator>,<X>,<proc1d>,<TOPSPIN 2.1>,
      <abs ABSG = 1 
       data hash MD5: 32K
       39 20 10 B1 94 49 2A 96 08 A1 FD 5B D7 85 16 11>)
(   5,<2016-08-26 19:08:52.992 -0500>,<Administrator>,<X>,<proc1d>,<TOPSPIN 2.1>,
      <abs ABSG = 2 
       data hash MD5: 32K
       DB 2A ED 07 3E FC 69 9A 16 DF 68 C2 C2 78 91 90>)
(   6,<2016-08-26 19:08:53.070 -0500>,<Administrator>,<X>,<proc1d>,<TOPSPIN 2.1>,
      <abs ABSG = 3 
       data hash MD5: 32K
       E6 05 8A B8 5E 0D E9 0E 11 5E D1 B0 54 F3 6B ED>)
(   7,<2016-08-26 19:08:53.133 -0500>,<Administrator>,<X>,<proc1d>,<TOPSPIN 2.1>,
      <abs ABSG = 4 
       data hash MD5: 32K
       42 F6 B4 94 6C 79 EA 1E A2 47 66 32 02 0F 67 6A>)
(   8,<2016-08-26 19:08:53.195 -0500>,<Administrator>,<X>,<proc1d>,<TOPSPIN 2.1>,
      <abs ABSG = 5 
       data hash MD5: 32K
       7A 0B C1 5F 17 76 8D EA 31 F8 0C 6E 3B 75 74 38>)
$$ ##END=
$$ 
$$ $$ hash MD5
$$ $$ 0B DE F1 96 DD 41 16 66 BA 60 93 9F C6 23 EF A9
##$RELAX= 
##$RELAX= 
##$RELAX= 
##$RELAX= 
##$RELAX= 
##$RELAX= 
##$RELAX= 
$$ Bruker specific parameters
$$ --------------------------
##$DU= <E:\>
##$EXPNO= 10
##$NAME= <NES1064_ptc160_9883234_A9gzNZVP0y>
##$PROCNO= 1
$$ [...]
150 150 150 150 150 150 150 150
##$TP07= 0
##$TPNAME0= <>
##$TPNAME1= <>
##$TPNAME2= <>
##$TPNAME3= <>
##$TPNAME4= <>
##$TPNAME5= <>
##$TPNAME6= <>
##$TPNAME7= <>
##$TPOAL= (0..7)
0.5 0.5 0.5 0.5 0.5 0.5 0.5 0.5
##$TPOFFS= (0..7)
0 0 0 0 0 0 0 0
##$TUNHIN= 0
##$TUNHOUT= 0
##$TUNXOUT= 0
##$USERA1= <user>
##$USERA2= <user>
##$USERA3= <user>
##$USERA4= <user>
##$USERA5= <user>
##$V9= 5
##$VALIST= <valist>
##$VCLIST= <CCCCCCCCCCCCCCC>
##$VD= 0
##$VDLIST= <DDDDDDDDDDDDDDD>
##$VPLIST= <PPPPPPPPPPPPPPP>
##$VTLIST= <TTTTTTTTTTTTTTT>
##$WBST= 2048
##$WBSW= 25
##$XGAIN= (0..3)
0 0 0 0
##$XL= 0
##$YL= 0
##$YMAX_a= 615993
##$YMIN_a= -534530
##$ZGOPTNS= <>
##$ZL1= 120
##$ZL2= 120
##$ZL3= 120
##$ZL4= 120
##$ABSF1= 14.98509
##$ABSF2= -5.573092
##$ABSG= 5
##$ABSL= 3
##$ALPHA= 0
##$AQORDER= 0
##$ASSFAC= 0
##$ASSFACI= 0
##$ASSFACX= 0
##$ASSWID= 0
##$AUNMP= <proc_prof1d_extract_pilot.lims>
##$AXLEFT= 0
##$AXNAME= <>
##$AXNUC= <1H>
##$AXRIGHT= 0
##$AXTYPE= 0
##$AXUNIT= <>
##$AZFE= 0.1
##$AZFW= 0.1
##$BCFW= 0
##$BC_mod= 0
##$BYTORDP= 0
##$COROFFS= 0
##$CY= 15
##$DATMOD= 1
##$DC= 0
##$DFILT= <>
##$DTYPP= 0
##$F1P= 0
##$F2P= 0
##$FCOR= 0.5
##$FTSIZE= 32768
##$FT_mod= 6
##$GAMMA= 0
##$GB= 0
##$INTBC= 1
##$INTSCL= 1
##$ISEN= 128
##$LB= 0
##$LEV0= 0
##$LPBIN= 0
##$MAXI= 10000
##$MC2= 0
##$MEAN= 0
##$ME_mod= 0
##$MI= 0
##$NCOEF= 0
##$NC_proc= -8
##$NLEV= 6
##$NOISF1= 0
##$NOISF2= 0
##$NSP= 0
##$NTH_PI= 0
##$NZP= 0
##$OFFSET= 14.98509
##$PC= 1
##$PHC0= 89.60999
##$PHC1= 0
##$PH_mod= 1
##$PKNL= yes
##$PPARMOD= 0
##$PPDIAG= 0
##$PPIPTYP= 0
##$PPMPNUM= 2147483647
##$PPRESOL= 1
##$PSCAL= 4
##$PSIGN= 0
##$PYNMP= <proc.py>
##$REVERSE= no
##$SF= 400.02
##$SI= 32768
##$SIGF1= 0
##$SIGF2= 0
##$SINO= 400
##$SIOLD= 32768
##$SPECTYP= <>
##$SREGLST= <1H.CDCl3>
##$SSB= 0
##$STSI= 32768
##$STSR= 0
##$SW_p= 8223.68421052631
##$SYMM= 0
##$S_DEV= 0
##$TDeff= 65536
##$TDoff= 0
##$TI= <>
##$TILT= no
##$TM1= 0
##$TM2= 0
##$TOPLEV= 0
##$USERP1= <user>
##$USERP2= <user>
##$USERP3= <user>
##$USERP4= <user>
##$USERP5= <user>
##$WDW= 1
##$XDIM= 32768
##$YMAX_p= 451200122
##$YMIN_p= -738942
##$CURPLOT= <Network HP LaserJet P1505>
##$CURPRIN= <$Network HP LaserJet P1505>
##$DFORMAT= <normdp>
##$LAYOUT= <+/1D_H.xwp>
##$LFORMAT= <normlp>
##$PFORMAT= <normpl>
##$SURQMSG= 1
$$ End of Bruker specific parameters
$$ ---------------------------------
##NTUPLES= NMR SPECTRUM
##VAR_NAME=  FREQUENCY,     SPECTRUM/REAL,   SPECTRUM/IMAG
##SYMBOL=    X,             R,               I
##VAR_TYPE=  INDEPENDENT,   DEPENDENT,       DEPENDENT
##VAR_FORM=  AFFN,          ASDF,            ASDF
##VAR_DIM=   32768,         32768,           32768
##UNITS=     HZ,            ARBITRARY UNITS, ARBITRARY UNITS
##FACTOR=    0.250966925370066, 1,           1
##FIRST=     8223.43324360094, -325409,      -47759
##LAST=      0,             99363,           -197239
##MIN=       0,             -738942,         0
##MAX=       8223.43324360094, 451200122,    0
$$ Real data points
##PAGE= N=1
##DATA TABLE= (X++(R..R)), XYDATA
$$ [...]
19558I8581K33412a00782Q227A51747B8823a73731f45l61799C1797A1090N118
$$ 98581 331993 -100782 -92555 151747 28823 -173731 -645 -362444 31797 11090 16208
19547A6208K277J62073c62812B28738A12973b76922P3692Q9705B6108a4160B500
$$ 16208 18485 180558 -362812 228738 112973 -276922 -203230 -113525 26108 -14160 2500
19535D6007J6799g817k36895h8434j58635C7605K43837A1465b25478Q4241k7224
$$ 46007 62806 -7817 -244712 -88434 -247069 37605 281442 11465 -225478 -141237 -168461
19524a68461A2737a10089L2625b1599p1562K7682A60013A2737h4567I3230c53558
$$ -168461 12737 -110089 -77464 -21599 -93161 -65479 160013 12737 -84567 93230 -353558
19512F3813a45846H783i190A11387h3673J8129G5797b36130b8746G5484a38832
$$ 63813 -145846 8783 -9190 111387 -83673 -65544 75797 -236130 -28746 75484 -138832
19500b60079i1799R159k97304h8424G4378a94580r0056A5316c82746a25280j2237
$$ -260079 -91799 -82640 -379944 -88424 74378 -194580 -284636 15316 -382746 -125280 -137517
19489a37517n483N8025A06239f1013b1845B1223f9634k6001q2732n4497E1340
$$ -137517 -143000 -84975 106239 -61013 -21845 21223 -69634 -95635 -178367 -232864 51340
19477a65063P5690L6102C27787c960r8508G7991b40440h6000D64832a32886M075
$$ -165063 -89373 -53271 327787 -3960 -102468 77991 -240440 -86000 464832 -132886 -128811
19466a28811m8177b2498k40055I5703l667k1605a13388K5697j13513J2588O6858
$$ -128811 -176988 -22498 -262553 95703 92036 70431 -113388 -87691 -201204 -188616 -121758
19455a21758B18080b8155j40140g7010E2188K1079c29697R7628c5259m10719C095
$$ -121758 218080 -28155 -168295 -77010 52188 73267 -329697 -232069 -35259 -445978 3095
19443a31019n3039L0454B6620c64937a82360P2543k07761d3320k99641M9552J00882
$$ -131019 -184058 -153604 26620 -364937 -182360 -109817 -317578 -43320 -342961 -293409 -192527
19432a92527j3228a1018A25603h3105k1839A5091c88112J02406B08535b88426
$$ -192527 -205755 -11018 125603 -83105 -104944 15091 -388112 -285706 208535 -288426
19421B15061D4717J51903a44229I0408a9320H513a0520L039n0220l43774A0059
$$ 215061 44717 196620 -144229 90408 -19320 8513 -10520 -7481 -57701 -401475 10059
19409f44m5985q1329M5939H3123c64397f877C4689a95331E953J48851P8875j06354
$$ -644 -46629 -127958 -82019 83123 -364397 -6877 34689 -195331 5953 154804 233679 127325
19397A27325a21491H8365a78410b1761J0241C20250d02300a45482H9217a81951
$$ 127325 -121491 88365 -178410 -21761 -11520 320250 -402300 -145482 89217 -181951
19386c47549h5614F9342b88060F9121Q6833a41726e8876l88823a54047g3453q084
$$ -347549 -85614 69342 -288060 69121 155954 -141726 -58876 -447699 -154047 -73453 -81537
19375h1537N55p9390j18422J29048G6509g0681q055E5250d1943k2278A87439p7462
$$ -81537 -80982 -160372 -278794 -149746 76509 -70681 -78736 55250 -41943 -64221 187439 109977
19363A09977a78969i895j6491k0347G6749q247d26173A24803j7680b56588a11495
$$ 109977 -178969 -9895 -26386 -46733 76749 68502 -426173 124803 107123 -256588 -111495
19351B34452b02733A41561C4146j2953h6972k25063G8668a09350C80349h4714
$$ 234452 -202733 141561 34146 21193 -86972 -312035 78668 -109350 380349 -84714
19340A9158h2419F9718a57700C46490B4505M2555h6222R005b8331m9435K5973
$$ 19158 -82419 69718 -157700 346490 24505 67060 -86222 -77217 -28331 -77766 -51793
19329e1793j31439O3034j99169q8271J45156j314M6955m6071A65917b5614l21513
$$ -51793 -183232 -120198 -319367 -407638 -262482 -263796 -216841 -262912 165917 -25614 -347127
19318c47127A27700a51861A10161h9856c2677C38092b33779E912b6420j30688
$$ -347127 127700 -151861 110161 -89856 -32677 338092 -233779 5912 -26420 -157108
19308a57108B33126F8974A0366d357A64786B5542g2375E626J32950K9870f3013
$$ -157108 233126 68974 10366 -4357 164786 25542 -72375 5626 138576 168446 -63013
19296b65027l6106A03002B4938M3967A5262o685b45180A28609a2231j74113r504
$$ -265027 -301133 103002 24938 68905 15262 8577 -245180 128609 -12231 -186344 -195848
19285a95848A59212k9279g1329j79901A6828Q1515h7683B0397J1855f2635j2297
$$ -195848 159212 129933 -71329 -251230 16828 98343 -87683 20397 32252 -62635 -74932
19274g4932A02414l6754K6039g0571C76564a08422K0331D6794O5822a18644d8480
$$ -74932 102414 65660 91699 -70571 376564 -108422 -88091 46794 112616 -118644 -48480
19262B92613A13343a9998j06454j96601g0061G3486a19816r6487R4295d7605A67366
$$ 292613 113343 -19998 -126452 -323053 -70061 73486 -119816 -216303 -122008 -47605 167366
19250b0158j04442C4142K1005L1093c11654a3698j21184o9651J7690A20862m6136
$$ -20158 -124600 34142 55147 86240 -311654 -13698 -134882 -204533 -186843 120862 74726
19239G4726a18683I0314a05279I3167b42785H762i6654E5111a57231k10412a5247
$$ 74726 -118683 90314 -105279 93167 -242785 8762 -96654 55111 -157231 -367643 -15247
19227a6242k49405j0145a9803A89408C5568a00050k12305A29590n8693p842a88428
$$ -16242 -265647 -275792 -19803 189408 35568 -100050 -312355 129590 70897 63055 -188428
19215b5377k0938l7950j62014g6785a3019G1342c20439C8309L5880j1673d1920
$$ -25377 -46315 -84265 -246279 -76785 -13019 71342 -320439 38309 74189 62516 -41920
19203b04589G8539N8066b02361k8016d2582k8232k76190j49811d4228k70495B2277
$$ -204589 78539 136605 -202361 -230377 -42582 -70814 -347004 -496815 -44228 -314723 22277
19191b77471B59248a61575n1695B3663d8450j05141E5634K54815A7654J85138
$$ -277471 259248 -161575 -213270 23663 -48450 -153591 55634 310449 17654 202792
19181B02792b25694A03344d4830C4222a43974m9054j93187e4316G8643e0984j77680
$$ 202792 -225694 103344 -44830 34222 -143974 -193028 -386215 -54316 78643 -50984 -228664
19170b28664D06897G498e8789n0633B06987a75049A66175E4626h4455D1480O6911
$$ -228664 406897 7498 -58789 -109422 206987 -175049 166175 54626 -84455 41480 108391
19159A08391C7906b56309f7144A56065a83378I2380N7899b12089j05785d0251
$$ 108391 37906 -256309 -67144 156065 -183378 92380 150279 -212089 -317874 -40251
19148g6374j86728g4621q3535H0922b55004h4692I6653a87038j12236R0433k8991
$$ -76374 -263102 -74621 -158156 80922 -255004 -84692 96653 -187038 -299274 -208841 -237832
19137b37832E451P5141h0154l06616F7540a99878d2803n4452k07081f6821A0147
$$ -237832 5451 80592 -80154 -386770 67540 -199878 -42803 -97255 -304336 -66821 10147
19125a69788c4153l59724i5802B7610Q9047K42886a15047p5423j05608C2508d14331
$$ -169788 -34153 -393877 -95802 27610 116657 359543 -115047 -190470 -296078 32508 -414331
19113B7857O8769C5204a87401k6046A18714a00544I5784H913a96904A77195c55539
$$ 27857 96626 35204 -187401 -213447 118714 -100544 95784 8913 -196904 177195 -355539
19101a07713c468k15244M2292C7523c30228c6728r2818B33098g5116G1202L58698
$$ -107713 -3468 -218712 -176420 37523 -330228 -36728 -129546 233098 -75116 71202 429900
19090D29900b65634h4748B9308a37786C0462J41741J2164a20743k821A21465p232
$$ 429900 -265634 -84748 29308 -137786 30462 172203 184367 -120743 -123564 121465 114233
19079A14233a78566j9284k4613L7199G4705K00608j12304a68720m5312L5996B9554
$$ 114233 -178566 -197850 -222463 -185264 74705 275313 163009 -168720 -214032 -178036 29554
19067e7273K4206j45430I3349b03564E2876c3336k2222b2463f348B59756i1663
$$ -57273 -33067 -178497 93349 -203564 52876 -33336 -55558 -22463 -6348 259756 -91663
19055b3251j20080j74187D2272a06555j89549c6445B7091a45816N1177K1508A87565
$$ -23251 -143331 -317518 42272 -106555 -296104 -36445 27091 -145816 -94639 -73131 187565
19043b59953I623o25a20714L5454A40659c36832C7350b34348E9059g876q2442
$$ -259953 9623 8998 -120714 -85260 140659 -336832 37350 -234348 59059 -7876 -90318
19032i0318A49736J8871g6746D32680I4061i7785I1433d747C5643J7669J54118
$$ -90318 149736 168607 -76746 432680 94061 -97785 91433 -4747 35643 53312 207430
19021B07430a01874J2321A26716A3402a57446E1089N3038a60112j8949P0789A39679
$$ 207430 -101874 -89553 126716 13402 -157446 51089 104127 -160112 -179061 -108272 139679
19009a77529Q6209C4207a33083I6729e2427k50055A86575D5378K4526Q760a13019
$$ -177529 -91320 34207 -133083 96729 -52427 -302482 186575 45378 69904 78664 -113019
18997C11277j03289b6814r3088r0620D8212d42033K05231A81270A3222a31025
$$ 311277 207988 -26814 -119902 -210522 48212 -442033 -236802 181270 13222 -131025
18986B4325b43879i2018a3779j48296A25772m5862b3272o2299j8764q6267j35786
$$ 24325 -243879 -92018 -13779 -162075 125772 79910 -23272 -85571 -104335 -190602 -326388
18975c26388J13058A29359a8613k48566C77011A62820a56665O3619I6246j6845
$$ -326388 -213330 129359 -18613 -267179 377011 162820 -156665 -93046 96246 79401
18965G9401N5259a86043f6754B46667b51862a23355o4652E7067f2372r5537D9347
$$ 79401 134660 -186043 -66754 246667 -251862 -123355 -188007 57067 -62372 -157909 49347
18953a70100g2883A80887B5997l161f3359l26728J11782e513B36860a23100k7348
$$ -170100 -72883 180887 25997 22836 -63359 -390087 -278305 -5513 236860 -123100 -150448
18942a50448I5559b9090d745C0490b47301A26395b28078B53992q9548d72979C64238
$$ -150448 95559 -29090 -4745 30490 -247301 126395 -228078 253992 164444 -472979 364238
18930b89857A50628J76414a70169A7984O1874g6765p0641A3048J84161b1367j78712
$$ -289857 150628 327042 -170169 17984 79858 -76765 -147406 13048 197209 -21367 -200079
18919b00079A19747L52518d6159A56202J57238b19919c6832E6227J23944a23230
$$ -200079 119747 472265 -46159 156202 313440 -219919 -36832 56227 180171 -123230
18908A47998A565J9761N2419N0313l5426a16605M9682C38417j59649a90812E4029
$$ 147998 1565 21326 73745 124058 88632 -116605 -66923 338417 178768 -190812 54029
18896a36530d8354A22589P841C2849a85956B2074J67957a30318n4611B63498a43573
$$ -136530 -48354 122589 130430 32849 -185956 22074 190031 -130318 -184929 263498 -143573
18884f5055k0200C21988a17589b083k35584h6610I0176f5768o511j34626L176
$$ -65055 -85255 321988 -117589 -2083 -237667 -86610 90176 -65768 -72279 -206905 -203729
18873b03729A0856b05711g0075p5737j1584A06349a95416a4047k60898B64449
$$ -203729 10856 -205711 -70075 -145812 -157396 106349 -195416 -14047 -274945 264449
18862a31834b5031j8601j0584l1833C29992a68545p5969O4586j936d954k9650
$$ -131834 -25031 -43632 -54216 -86049 329992 -168545 -244514 -179928 -181864 -4954 -34604
18851c4604m53278A5615h0869j50496l2234D48174b20720a8260j05054j6321a9655
$$ -34604 -487882 15615 -80869 -231365 -263599 448174 -220720 -18260 -123314 -139635 -19655
18839a58109b7204e605p1566l885q0468j8502B70436b61575A09225K10272d8395
$$ -158109 -27204 -5605 -77171 -81056 -161524 -180026 270436 -261575 109225 319497 -48395
18827C6727a17674b6394n7656A0195J88188g4615b2273R480A4693a27722A18568
$$ 36727 -117674 -26394 -84050 10195 198383 -74615 -22273 -12793 14693 -127722 118568
18815D3098J1004a02698d6304B82197A07177J53038Q8470c10068F3931K4882K27046
$$ 43098 54102 -102698 -46304 282197 107177 260215 348685 -310068 63931 88813 315859
18804C15859a61968D7321K10743b57676C17819b21353k31356M6824a42912c7522
$$ 315859 -161968 47321 258064 -257676 317819 -221353 -452709 -405885 -142912 -37522
18793i6150p5551A65459a52274F7158h0928b499k09982F4358a33327n4571A16686
$$ -96150 -171701 165459 -152274 67158 -80928 -2499 -212481 64358 -133327 -187898 116686
18781c2876j89448E480K6303d9595H7907a12673l7979A65962a50681e0116F0686
$$ -32876 -222324 5480 31783 -49595 87907 -112673 -150652 165962 -150681 -50116 60686
18769A86823I167a5868k73742b9629B13080e0402o3921g077A7968h9720l40470
$$ 186823 9167 -15868 -289610 -29629 213080 -50402 -114323 -7077 17968 -89720 -430190
18758d30190a18978k91738B1693J4414b72087j2611j3899F163Q9292Q286C3988
$$ -430190 -118978 -410716 21693 36107 -272087 -284698 -298597 6163 95455 103741 33988
18746a29133C94807j25458q9474A3260b92972A28801a94850n7748E527c89703
$$ -129133 394807 269349 179875 13260 -292972 128801 -194850 -252598 5527 -389703
18735a54542Q669b4862A55400a03840A23839c1100h759j27631H9691c12767f3600
$$ -154542 -145873 -24862 155400 -103840 123839 -31100 -8759 -136390 89691 -312767 -63600
18723b59373h233E4409N6848L9292l9061A0143a04009b0555n0653B48553B5263
$$ -259373 -8233 54409 111257 150549 111488 10143 -104009 -20555 -71208 248553 25263
18711e6111B76763I3983g5417k26936i0744c5534k45277n8797f2202n5640L4985
$$ -56111 276763 93983 -75417 -302353 -90744 -35534 -280811 -339608 -62202 -117842 -82857
18700h2857F0151a55178E5077G670h8584c2849F0785h0582l12820A44171b10959
$$ -82857 60151 -155178 55077 7670 -88584 -32849 60785 -80582 -393402 144171 -210959
18688a80824I3045a30089i968B31218b49686a03758q1080A54628f1269B28193
$$ -180824 93045 -130089 -9968 231218 -249686 -103758 -184838 154628 -61269 228193
18677f5643A04440g2587h546j59981D1264j6637a29897C986c31299D6167b2395
$$ -65643 104440 -72587 -8546 -168527 41264 24627 -129897 3986 -331299 46167 -22395
18665a01468I126b7750B31436e3989l9537j33039o2680j34650J66521F9841b12724
$$ -101468 9126 -27750 231436 -53989 -93526 -226565 -289245 -423895 -257374 69841 -212724
18653b17780o5546A32293l1294a81830H7678a00646K919G068a5414p2202q6454
$$ -217780 -283326 132293 100999 -181830 87678 -100646 -97727 7068 -15414 -87616 -174070
18642a74070A53865B8660b13604J01q7025c5021j3353n4923r33H2683A0598K13199
$$ -174070 153865 28660 -213604 -213503 -300528 -35021 -48374 -103297 -104230 82683 10598 223797
18630B23797j05416J33746A04455a13131J6737l0668E5403k5942c27509D5670
$$ 223797 118381 252127 104455 -113131 -96394 -127062 55403 29461 -327509 45670
18619b08761N1209A78518R5415E5623K62185F5156K6404h1835D43476B5735D728
$$ -208761 -157552 178518 273933 55623 317808 65156 91560 -81835 443476 25735 4728
18607a28828A86729a32279L8000A15727a14809C07092h2324j0985p3194A10380
$$ -128828 186729 -132279 -94279 115727 -114809 307092 -82324 -93309 -166503 110380
18596f6837A79059b63620j58522H6126c1491f694K339m4794A23162b8050C1982
$$ -66837 179059 -263620 -422142 86126 -31491 -6694 -4355 -49149 123162 -28050 31982
18584A17681b4785A19333a77530H4558a13422A2713n637c10238A93264a81925
$$ 117681 -24785 119333 -177530 84558 -113422 12713 7076 -310238 193264 -181925
18573a39750j23252g4144D133a64294B2952K01546j05153f9402J1474E4833A4838
$$ -139750 -263002 -74144 4133 -164294 22952 224498 119345 -69402 -57928 54833 14838
18561a15025A05924e7199j38932P1818r5002a08767D665K83611a57239P0799A56996
$$ -115025 105924 -57199 -196131 -124313 -219315 -108767 4665 288276 -157239 -86440 156996
18549D9890c13732D4512c31519D0046f6594k47706B19883d54518c3339A6903J98206
$$ 49890 -313732 44512 -331519 40046 -66594 -314300 219883 -454518 -33339 16903 215109
18538B15109c3806H6503b15704K547B8198J64912B8212b64480a11901L1316H4234
$$ 215109 -33806 86503 -215704 -213157 28198 193110 28212 -264480 -111901 -80585 84234
18526g5370k48935A08863b81883a8482j75013e5319A857O3301i1373k3039F4711
$$ -75370 -324305 108863 -281883 -18482 -193495 -55319 1857 65158 -91373 -114412 64711
18514b3817M535A42309e5239j92311F8078L7474b75857C01864A06662A6221a94894
$$ -23817 -19282 142309 -55239 -247550 68078 105552 -275857 301864 106662 16221 -194894
18502I1038L3594e2383j60178l07786C56360g8351A04494B8380c48524Q0199B2714
$$ 91038 124632 -52383 -212561 -520347 356360 -78351 104494 28380 -348524 -268325 22714
18490f6403o3065G2853b31547I2602L1969l8561e7778C25492a03833K4858L5324
$$ -66403 -129468 72853 -231547 92602 124571 86010 -57778 325492 -103833 -78975 -43651
18479d3651A83667b07860r1435J39083j14293I8665a09055H8549b01272A98968
$$ -43651 183667 -207860 -299295 -160212 -274505 98665 -109055 88549 -201272 198968
18468a56248f2200G9195O8088J25927h8070D5173b84142A41681n7241a15128F878
$$ -156248 -62200 79195 147283 273210 -88070 45173 -284142 141681 84440 -115128 6878
18456a68151A8950F818J35943b68509i9064l6947C5024A4785K31801h5429A0343
$$ -168151 18950 6818 142761 -268509 -99064 -136011 35024 14785 246586 -85429 10343
18444A93168a98878i7418k8648l58589A53674i2129l1294I7647k3417J00719G0754
$$ 193168 -198878 -97418 -126066 -484655 153674 -92129 -123423 97647 74230 174949 70754
18432d9608j812j63541f4555j97044I9333O1115b88396B30223e6950l6486F5476
$$ -49608 -51420 -214961 -64555 -261599 99333 160448 -288396 230223 -56950 -93436 65476
18420D464c44095d279g55C0407b9138B11413r5537a42538k6070A40083b91748
$$ 4464 -344095 -4279 -755 30407 -29138 211413 115876 -142538 -168608 140083 -291748
18408C627J12585b9396p9648m7488b349C29437M728n7568A06956a22006j3059
$$ 3627 116212 -29396 -109044 -156532 -2349 329437 334165 276597 106956 -122006 -135065
18397a35065D9239b06907O6342J0342p3478D9525O2225d00978f8542j36013J01829
$$ -135065 49239 -206907 -140565 -130223 -203701 49525 111750 -400978 -68542 -204555 -102726
18386a02726c3832H1692C5631M0757a5378A13614k6471b52127H907d3864l2617
$$ -102726 -33832 81692 35631 76388 -15378 113614 87143 -252127 8907 -43864 -76481
18375g6481B33309D6410d3971j12188d8743l1488C5309d1341I6062a79467i057
$$ -76481 233309 46410 -43971 -156159 -48743 -80231 35309 -41341 96062 -179467 -9057
18363A93259n8322h5686B11527o5426a53764A5239J11699b00976o3157H8465M2130
$$ 193259 134937 -85686 211527 146101 -153764 15239 126938 -200976 -264133 88465 130595
18352A30595a92576h1515c5140H681d0882j05725e3671I8385d79673A00712d52187
$$ 130595 -192576 -81515 -35140 8681 -40882 -146607 -53671 98385 -479673 100712 -452187
18340a71827A55735i9104A67522f8872h419F8103a96068A38346o6872N135a18824
$$ -171827 155735 -99104 167522 -68872 -8419 68103 -196068 138346 71474 76609 -118824
18328e5953C47609F221b0058r5668J5040M1071E0728f2881B44922i9980K811A26645
$$ -55953 347609 6221 -20058 -115726 -100686 -59615 50728 -62881 244922 -99980 -97169 126645
18315G473M5769a73876I6267d1592j58814j45425A56285E1378k2775n762M7765
$$ 7473 53242 -173876 96267 -41592 -200406 -345831 156285 51378 28603 22841 70606
18304G0606i6459j47698A03447J22920n7057d8328C29578c5131o4746A32266E3011
$$ 70606 -96459 -244157 103447 226367 169310 -48328 329578 -35131 -99877 132266 53011
18292B06311I0965J4189a58881B06394a91946h4320B43510g3804O90A50650b19363
$$ 206311 90965 105154 -158881 206394 -191946 -84320 243510 -73804 -73114 150650 -219363
18280A30212a79663e7727j52696c3227q1717m17964e1271A21148A1412f6811B90402
$$ 130212 -179663 -57727 -210423 -33227 -114944 -532908 -51271 121148 11412 -66811 290402
18268h0573A986h0641C47463b76540J12774p5142G8360j3510k9353a3147j60913
$$ -80573 1986 -80641 347463 -276540 -163766 -238908 78360 64850 35497 -13147 -174060
18257a74060m2940C03348F234a46242O3793q5027O2371C43438f139r0708F3912
$$ -174060 -217000 303348 6234 -146242 -82449 -167476 -105105 343438 -6139 -96847 63912
18245b63881k84151K56376B53869J1337a24787I1916b42229l932g1637B65151
$$ -263881 -548032 -291656 253869 265206 -124787 91916 -242229 -246161 -71637 265151
18234A52290b84571A98104H3031f2138j43048A76448E2844b40223o4552A13432
$$ 152290 -284571 198104 83031 -62138 -205186 176448 52844 -240223 -304775 113432
18223D4010c99158B62211b68500a6761E5209J5272e6195A18634c68180a14971
$$ 44010 -399158 262211 -268500 -16761 55209 70481 -56195 118634 -368180 -114971
18212a84109B64868c0835q2989j4133k7270d605k78611H4969q935b73144A54725
$$ -184109 264868 -30835 -113824 -127957 -155227 -4605 -283216 84969 76034 -273144 154725
18200B66818o8766K7015F2039A5817K14218G942c1057k7773A41449P3517b6422
$$ 266818 198052 225067 62039 15817 230035 7942 -31057 -58830 141449 214966 -26422
18188c16722d0644j79669Q5927l6981i520k2279m4019N919A5225a06781J0026
$$ -316722 -40644 -220313 -134386 -171367 -9520 -31799 -75818 -69899 15225 -106781 -96755
18177i6755I6687C6050R1413J10949G7238K31152N6o3634o4598B7160l833a19669
$$ -96755 96687 36050 127463 238412 77238 308390 308446 244812 180214 27160 23327 -119669
18164a5992A3323J75714d8192A57073i7699D7685c44045O2821j01811a0886r0742
$$ -15992 13323 189037 -48192 157073 -97699 47685 -344045 -281224 -383035 -10886 -101628
18153a01628A51359g4487C16253a05704j71639i5507j48965i6120A3676C487a04364
$$ -101628 151359 -74487 316253 -105704 -277343 -95507 -244472 -96120 13676 3487 -104364
18141E3908a30509D9353f4420A351K0826b8958q2509j04582A01058a23779C04745
$$ 53908 -130509 49353 -64420 1351 22177 -28958 -111467 -216049 101058 -123779 304745
18129g9573A07049h1746C11390C9778Q3975e7707A5804K2321N3870b47319D304
$$ -79573 107049 -81746 311390 39778 123753 -57707 15804 38125 91995 -247319 4304
18117A05544O8854b5352E6614L5565g9915m4875A20117b11649G1385a03765l6950
$$ 105544 174398 -25352 56614 92179 -79915 -124790 120117 -211649 71385 -103765 -140715
18106a40715A18396E7634M4336a41708O4318A87248a65990Q2821H4889b98802
$$ -140715 118396 57634 101970 -141708 -77390 187248 -165990 -83169 84889 -298802
18095h3798j45166J02414J4714p4857B3185J91126A0682a63520O3329G3894K1781
$$ -83798 -228964 -126550 -111836 -186693 23185 214311 10682 -163520 -100191 73894 95675
18084I5675A7177a57301F0409a4692j15664A03988m6847e5781A9227M4977p193
$$ 95675 17177 -157301 60409 -14692 -130356 103988 57141 -55781 19227 64204 57011
18073E7011K85776a27408G0577B4384L29829a99225h2924k48881D7471j0930b37527
$$ 57011 342787 -127408 70577 24384 354213 -199225 -82924 -331805 47471 36541 -237527
18061H0052J74484e8501A17527c30275b5127A26482B3931g1528n7628d3041j79280
$$ 80052 254536 -58501 117527 -330275 -25127 126482 23931 -71528 -129156 -43041 -222321
18050b22321g2402l7185k8992k51495E2064f2566l17662f2004E5350J4364J54049
$$ -222321 -72402 -109587 -138579 -390074 52064 -62566 -380228 -62004 55350 69714 223763
18039B23763G2482a81257L5409a0539k0730k5518b8100H4541M4513h5811o7793
$$ 223763 72482 -181257 -145848 -10539 -31269 -56787 -28100 84541 129054 -85811 -153604
18028a53604P4459A83153K9367B8497i1484l30283B11850a89757G8124J79023
$$ -153604 -79145 183153 212520 28497 -91484 -421767 211850 -189757 78124 257147
18018B57147c85112E5489c23147B733J6095Q9959h55m658B65731g8617p5754A71201
$$ 257147 -385112 55489 -323147 2733 18828 108787 -855 -5513 265731 -78617 -154371 171201
18005A10616e7043j8551a8665k84296J04679e7733B607J19848f2021j05272b1341
$$ 110616 -57043 -75594 -18665 -302961 -198282 -57733 2607 122455 -62021 -167293 -21341
17993c27436J01796J03391j29324B73118a1744A07695B0791a07236j83363B32142
$$ -327436 -225640 -122249 -251573 273118 -11744 107695 20791 -107236 -290599 232142
17982a94276d1843m6953L4846b5542k52591e1030H5780A8759h7411b0366j27576
$$ -194276 -41843 -88796 -53950 -25542 -278133 -51030 85780 18759 -87411 -20366 -147942
17971a47942A5327b24046q3674E8484J85042F9080J52126k1148C0144a39051e7688
$$ -147942 15327 -224046 -307720 58484 243526 69080 221206 200058 30144 -139051 -57688
17959b3425O847p5268A3966J26981n521C8746a10797n5291A00365a28491o7781
$$ -23425 -16578 -91846 13966 140947 135426 38746 -110797 -166088 100365 -128491 -196272
17948a96272B03510M6971Q9047a07938k18186A07628j9588d898A45907E0040b69939
$$ -196272 203510 250481 339528 -107938 -326124 107628 88040 -4898 145907 50040 -269939
17936c09350J07490C083K21720c39793C3024J0113Q7552b3240A15733A8081J90521
$$ -309350 -201860 3083 224803 -339793 33024 43137 130689 -23240 115733 18081 208602
17925B08602a02361K2147A0517b10106H9743j8250e6541H0518J5801a61443P2357
$$ 208602 -102361 -80214 10517 -210106 89743 71493 -56541 80518 96319 -161443 -89086
17914h9086n4455b2181e723j45912l49219H6163c90730a60115A60772f0638A69607
$$ -89086 -143541 -22181 -5723 -151635 -500854 86163 -390730 -160115 160772 -60638 169607
17902C42724b49788j6209A51059E9474b02176b7444A40648n3233M5556i8324P935
$$ 342724 -249788 -265997 151059 59474 -202176 -27444 140648 87415 132971 -98324 -90389
17891i0389E0439f6477m1127j7479d1179k66611B37317R6161f1000A32494Q9177
$$ -90389 50439 -66477 -107604 -125083 -41179 -307790 237317 333478 -61000 132494 221671
17880B21671a72168Q3469I6586c4759I8161L1756j7319b91077G1466a15825p9963
$$ 221671 -172168 -88699 96586 -34759 98161 129917 112598 -291077 71466 -115825 -195788
17869a95788A38824E0588a93727B6187d06159A02274J39753B9701K34858N5545
$$ -195788 138824 50588 -193727 26187 -406159 102274 242027 29701 264559 320104
17859C20104F4745b49866C7887K49374h7122A21197g0267A02588C8924I76K6305
$$ 320104 64745 -249866 37887 287261 -87122 121197 -70267 102588 38924 976 27281
17848B7281K5426k3143J1434H562a46867I3668N21b20047F0866p253i493j57938
$$ 27281 52707 29564 40998 8562 -146867 93668 94189 -220047 60866 53613 -9493 -167431
17836a67431j39462a44650A92496E5493J07644F600a16742A33316m0802a50590
$$ -167431 -306893 -144650 192496 55493 163137 6600 -116742 133316 92514 -150590
17825a4506j27818r121B58306a46040B81863a66536n478A16825i0589l4166I19
$$ -14506 -142324 -151445 258306 -146040 281863 -166536 -172014 116825 -90589 -124755 919
17813D18052b97274A32881a78791D3840a64165d9762B55017a93242B29972a95880
$$ 418052 -297274 132881 -178791 43840 -164165 -49762 255017 -193242 229972 -195880
17802D5020a96699H6592L1626b28B7564b33085A13239P503b04598C6952P5207
$$ 45020 -196699 86592 118218 -228 27564 -233085 113239 120742 -204598 36952 112159
17791A12159n2135O5625K8607E9141a21264c6857I2538A4922J58081p6060P1197
$$ 112159 60024 125649 154256 59141 -121264 -36857 92538 14922 173003 96943 168140
17780A68140e2641B61616b01988A47693h9376A85651B9203b70223e0367r0533
$$ 168140 -52641 261616 -201988 147693 -89376 185651 29203 -270223 -50367 -140900
17770a40900L7957A51585a58545f784j77547l9198o5488A78971O9753c9051G1529
$$ -140900 -102943 151585 -158545 -6784 -184331 -223529 -289017 178971 248724 -39051 71529
17758I4340b11242K988A91186n6878c5541A10741B1778b41662F1829P7301K4372
$$ 94340 -211242 -208254 191186 134308 -35541 110741 21778 -241662 61829 139130 163502
17747A63502J23997i5132j70403D5685b18240A14942a02505I3300a48449A47917
$$ 163502 287499 -95132 -265535 45685 -218240 114942 -102505 93300 -148449 147917
17736A32275c567E5175M68358a58895G5875i9076A38423b74828H1993b06609k13576
$$ 132275 -3567 55175 523533 -158895 75875 -99076 138423 -274828 81993 -206609 -420185
17725d20185i1217B41375K1393j18208J8147l2295j746a15512A72970d7180E117
$$ -420185 -91217 241375 262768 144560 162707 130412 128666 -115512 172970 -47180 5117
17713A95253O3323p4808b35941Q5233h110B01035a15130A29375L2995j1865h2944
$$ 195253 258576 183768 -235941 -150708 -8110 201035 -115130 129375 162370 150505 -82944
17701I6637J11531C7146a08224m7811k56874F6406L52176A33565b81086A71498
$$ 96637 208168 37146 -108224 -156035 -412909 66406 418582 133565 -281086 171498
17690A24952c04532a07841B81741j08890K7906A5579b5994j55519A06724b47489
$$ 124952 -304532 -107841 281741 172851 200757 15579 -25994 -181513 106724 -247489
17679g9205B13972E2720a3073c493r5752A02096J10137a48604B80448a67697f0715
$$ -79205 213972 52720 -13073 -3493 -99245 102096 212233 -148604 280448 -167697 -60715
17667B68622o1231a01462G5356a22107E4207K43784A44716e7348a9827j107r0343
$$ 268622 207391 -101462 75356 -122107 54207 297991 144716 -57348 -19827 -20934 -111277
17656a11277B84588A39774k415a67359B51887b30137a9572j57420B4043A1718
$$ -111277 284588 139774 137359 -167359 251887 -230137 -19572 -176992 24043 11718
17645C0933i5039A75344a05462r552M4625A22760D6671J89342q1315b88778A04961
$$ 30933 -95039 175344 -105462 -115014 -70389 122760 46671 236013 154698 -288778 104961
17633h2051A83726d18323E2351a33003B49253g6661C0070a50378P2671m693B33756
$$ -82051 183726 -418323 52351 -133003 249253 -76661 30070 -150378 -77707 -82400 233756
17621a33254E774i0593R82l0800B7902f650j98671l1782j293C7966a19891r9283
$$ -133254 5774 -90593 -89611 -120411 27902 -6650 -205321 -237103 -238396 37966 -119891 -219174
17609b19174d4872R008F0260c6279m7543L5948j22248A43444a32782k26689c7355
$$ -219174 -44872 -35864 60260 -36279 -83822 -47874 -170122 143444 -132782 -359471 -37355
17597A1356e9880R165H5255d7516r858A64056a48921c335C19533F539a96808g1610
$$ 11356 -59880 -50715 85255 -47516 -57374 164056 -148921 -3335 319533 6539 -196808 -71610
17584F92593a21799M9352n3503f2591B76481Q8993I9709J04339F9296A2004J49227
$$ 692593 -121799 -72447 -125950 -62591 276481 365474 99709 204048 69296 12004 161231
17573A61231O485J14740j03759e4677R46A69263b5302B36966M8187E8490a30210
$$ 161231 167716 282456 178697 -54677 -53731 169263 -25302 236966 285153 58490 -130210
17561H5855f6509n9273A98855G4428h1736j016A81888L8787a65209D3342B685
$$ 85855 -66509 -125782 198855 74428 -81736 -82752 181888 220675 -165209 43342 2685
17549B45012A6494K32795f2258D1600j4118J51586L8310N1507l7801E4853f7109
$$ 245012 16494 249289 -62258 41600 27482 179068 217378 268885 231084 54853 -67109
17537A3708J06110a90489A96604J10338h2763F6542R4968B3636Q5892a17070C80855
$$ 13708 119818 -190489 196604 306942 -82763 66542 161510 23636 109528 -117070 380855
17525B82936d4411G7197L1793N7557j6840j4890a4898C50659I7796d692H9698
$$ 282936 -44411 77197 108990 166547 149707 134817 -14898 350659 97796 -4692 89698
17513A87743a0956I3221P1296Q2122F1426J45408a32941A25968E1269J95714i6201
$$ 187743 -10956 93221 164517 246639 61426 206834 -132941 125968 51269 246983 -96201
17501A70627a35208f0535A83810H3945p095c10639A41633b10861A57280C9659
$$ 170627 -135208 -60535 183810 83945 76850 -310639 141633 -210861 157280 39659
17490A17708A0252L2422j6697L57816a50829A20817O5696k6537k1424L4577J17447
$$ 117708 10252 42674 25977 383793 -150829 120817 186513 159976 138552 173129 290576
17479B90576p1381I6110c2960o4791A74402k2263C9758J18209K94656j64845j35427
$$ 290576 219195 96110 -32960 -97751 174402 152139 39758 157967 452623 287778 152351
17468A52351D5453e4900l5002j27781i6651K7140p3528D7179L46355d2401B41115
$$ 152351 45453 -54900 -89902 -217683 -96651 -69511 -143039 47179 393534 -42401 241115
17456B22956j10042k066P6175d7126j24479B46605A21697D8976f8344I5493K88096
$$ 222956 112914 110848 187023 -47126 -171605 246605 121697 48976 -68344 95493 383589
17445C83589A05533A9941J41007C0406J20424L24073k01728H1464J31515O0520
$$ 383589 105533 19941 160948 30406 150830 474903 273175 81464 212979 273499
17435B73499D8913r702L30206j79301J86584G9803J38276Q6223J0544k2931q6885
$$ 273499 48913 39211 369417 190116 376700 79803 218079 304302 314846 291915 205030
17424B05030K14974D2972M15126q5222F3375K95589A73052E5888K32020o6767
$$ 205030 420004 42972 458098 372876 63375 358964 173052 55888 287908 221141
17414B21141A02528Q2091b04696C62482A8731K14521P5722r131A5562a7094A5392
$$ 221141 102528 184619 -204696 362482 18731 233252 308974 299843 15562 -17094 15392
17402A09403a22536c8790F6766N09636B1293L30409k8282A21041N4658c44062
$$ 109403 -122536 -38790 66766 576402 21293 351702 323420 121041 175699 -344062
17391C12274p842C9988J61027E6981K70606a75974B18283O5847a416F72057i2075
$$ 312274 304432 39988 201015 56981 327587 -175974 218283 284130 -1416 672057 -92075
17379I1076J37371j2932J7566k2603j0785m2339b08911A20117Q0883e9760C20369
$$ 91076 228447 215515 233081 210478 199693 157354 -208911 120117 201000 -59760 320369
17367D01849G2141l1868a1064I9943Q8286J19031i0480A23825J89674C5699a61386
$$ 401849 72141 40273 -11064 99943 188229 307260 -90480 123825 313499 35699 -161386
17355b8317A21177j8364a23558D0709J10800A1404i5364C50017a90399A27846
$$ -28317 121177 102813 -123558 40709 151509 11404 -95364 350017 -190399 127846
17344E5739O2151c845j50821e2006A0608K12776e0538A29776D9652J95885K36279
$$ 55739 117890 -3845 -154666 -52006 10608 223384 -50538 129776 49652 245537 481816
17333D81816C002L54524d3471C17796f634B71456j02636J3081P9426A22901J03383
$$ 481816 3002 357526 -43471 317796 -6634 271456 168820 181901 261327 122901 226284
17322B26284K40133a83291B94949a61096e9304C67789j27477L6833c687C06226
$$ 226284 466417 -183291 294949 -161096 -59304 367789 240312 277145 -3687 306226
17311A00761I053K8181Q3394J24633E4915K99706j13739K10468g0692A03341K76925
$$ 100761 9053 37234 120628 245261 54915 354621 240882 451350 -70692 103341 380266
17300C80266j11780I453i8788b2815A88401q093a32210B75159j07218E6416b0753
$$ 380266 268486 9453 -98788 -22815 188401 180308 -132210 275159 167941 56416 -20753
17288d5819B25386b93861C1204O1083a25029B6190N5366C2557P9087b03904B38538
$$ -45819 225386 -293861 31204 92287 -125029 26190 81556 32557 111644 -203904 238538
17276B47203L6567a27945C66497E0677J45123M7327D1633L96353I8428o909a94463
$$ 247203 283770 -127945 366497 50677 195800 243127 41633 437986 98428 91519 -194463
17264B50212C2574a18124c3221i078B68523A19734K00829A35068k4179J6950c00597
$$ 250212 32574 -118124 -33221 -9078 268523 119734 320563 135068 110889 127839 -300597
17252B84123n8914H7437A2491L92872D7261K67943B4247N0638P0435n5455O7656
$$ 284123 225209 87437 12491 405363 47261 315204 24247 74885 145320 89865 157521
17241A57521f434E92191B82946j16792G0933K8974L9248f0261A41135K06859O2609
$$ 157521 -6434 592191 282946 166154 70933 99907 139155 -60261 141135 347994 410603
17230D10603A9226O1783a84380E9002L8603k3799i6569C75093j78255k2645k3147
$$ 410603 19226 81009 -184380 59002 97605 73806 -96569 375093 196838 174193 151046
17219A51046K90043i405B03209O8194K5143n8698L59966A24591J8969P2573N655
$$ 151046 441089 -9405 203209 271403 296546 237848 597814 124591 143560 216133 221788
17208B21788n759H829J18451K26946F0789K35384m943P3121I8264J09041J07065
$$ 221788 216029 8829 127280 354226 60789 296173 291230 364351 98264 207305 314370
17197C14370K6199A35222J39784j01072O7632J24656f8168E4027Q5585a14665
$$ 314370 340569 135222 275006 173934 241566 366222 -68168 54027 139612 -114665
17186A89735E6499J10329K25363j29602o8705H3457J00359N8451N6263P2556j48088
$$ 189735 56499 166828 392191 262589 193884 83457 183816 242267 298530 371086 222998
17175B22998d5090B97955K23662j63002F4554L71201P5821j86629n0497a5355
$$ 222998 -45090 297955 521617 358615 64554 435755 511576 324947 274450 -15355
17164D12734J04907A93193F3101J70183Q1386m8460J79240P6790A10218C7853
$$ 412734 517641 193193 63101 233284 314670 266210 445450 522240 110218 37853
17153A96016r82O6109j08195p4066h0049D80969j74640J36578q7540B9672L27661
$$ 196016 195034 261143 152948 78882 -80049 480969 306329 442907 355367 29672 357333
17142C57333L17102j91889j0082L9167k00917J48603Q593F0022M66398j59609
$$ 357333 674435 482546 472464 511631 310714 459317 467910 60022 526420 366811
17132C66811c5180C51563j9714q475O0061R1935M8601j72239J58737m0344A73492
$$ 366811 -35180 351563 331849 323374 383435 475370 523971 351732 510469 470125 173492
17120A95288K00871N3137O2174J151J42995C01399J53235R3648k64759M6779A17607
$$ 195288 396159 449296 511470 512621 655616 301399 454634 548282 283523 330302 117607
17108A52996F4014L78336M3700L47812l00745k14905A26183J34242p6323L0843
$$ 152996 64014 442350 486050 833862 533117 318212 126183 260425 184102 214945
17098B14945K25242p3354j8802o519p0530J09875p3466K77043k66907K54950B63691
$$ 214945 440187 366833 348031 341512 270982 380857 307391 584434 317527 572477 263691
17086E02014M9772j57417l7913K17301B76528K66169j64649L8646j32825J28727
$$ 502014 551786 394369 356456 573757 276528 542697 378048 416694 283869 412596
17076D12596j44808i6298C70179P1994J5807j35927J40303J6504J54508j25953
$$ 412596 267788 -96298 370179 442173 457980 322053 462356 478860 633368 507415
17066E07415I9259J78942J99930j82804M8179j34969J08671K04424O5332J65048
$$ 507415 99259 278201 478131 295327 343506 208537 317208 521632 586964 752012
17056G52012B46751K24384j51963J24029k02657L12628n941J53757C14269J42988
$$ 752012 246751 471135 319172 443201 240544 553172 547231 700988 314269 457257
17046D57257r7906L00350j13153j90481L13379C32381K01854m6754n0494M4773
$$ 457257 359351 659701 546548 356067 669446 332381 534235 487481 436987 481760
17036D81760Q3455R8222J3136A63419K88888j95468K39386k13404J64327k8825
$$ 481760 565215 663437 676573 163419 452307 256839 496225 282821 447148 418323
17026D18323O2945J6039J09928j06582R5429j33549J18079k05694L79957j95915
$$ 418323 481268 497307 607235 500653 596082 462533 580612 374918 754875 558960
17016E58960J3598L3248K83594l58462n7229K11548Q5905k36793r0845K91796
$$ 558960 572558 605806 889400 530938 473709 685257 771162 534369 443524 735320
17006G35320l54108L85601j89765j33915Q4502J23520J34519j54966k3689J31570
$$ 735320 381212 766813 577048 443133 527635 651155 785674 630708 607019 738589
16996G38589o8545J1197l24475K53035J25624k5927J97365m04698J29776K19910
$$ 738589 670044 681241 356766 609801 735425 709498 906863 502165 631941 851851
16986H51851l74216J57957M50273l32139k2396N4324j40458K03456M6724k53537
$$ 851851 477635 635592 1085865 753726 731330 785654 645196 848652 895376 641839
16976F41839J77721K68j45511j47603M17459j05215j68939p5103M1813K95392
$$ 641839 819560 819828 674317 526714 944173 838958 670019 594916 636729 932121
16966I32121j98828j6655j9897L46061j68985J33354m49196N27958l22256L14925
$$ 932121 733293 716638 696741 1042802 873817 1007171 557975 1085933 763677 1078602
16956A078602D88148K49784J27753K57011k81433M98828k94419j50228o6351N3599
$$ 1078602 488148 737932 865685 1122696 841263 1340091 1045672 895444 829093 882692
16946H82692l1145P0197J13543K02313j68279L1597Q39l2000j16145M09320p8352
$$ 882692 851547 921744 1035287 1237600 1069321 1100918 1101757 1069757 953612 1362932 1284580
16935A284580J54712k55966K22107o65391M84701n3648R4651j06032J420m5566
$$ 1284580 1439292 1183326 1405433 740042 1224743 1171095 1265746 1159714 1161134 1115568
16925A115568M3705r2462J92570L09785k66671L7400L37860m18254N2757l48225
$$ 1115568 1159273 1066811 1259381 1569166 1302495 1339895 1677755 1259501 1312258 964033
16915I64033L33839J32978j47589J31074k41670K90772J28360m5682J87186j92904
$$ 964033 1297872 1430850 1283261 1414335 1172665 1463437 1591797 1546115 1733301 1540397
16905A540397j94076M53333k00796j11760J93116J0202k34123L71443q6893j19285
$$ 1540397 1346321 1799654 1598858 1487098 1680214 1690416 1456293 1827736 1740843 1621558
16895A621558J04455j27687J22328k8995K54622l85708J63869J15791k4666j9778
$$ 1621558 1726013 1598326 1720654 1691659 1946281 1560573 1724442 1840233 1815567 1795789
16885A795789j40520K15820M05637l85522M57756k17436p0199M47484k73845j90949
$$ 1795789 1655269 1871089 2276726 1891204 2348960 2131524 2061325 2508809 2234964 2044015
16875B044015L10336j14807N2150J74624k32208J70053J08100j40928K95448m34297
$$ 2044015 2354351 2239544 2291694 2466318 2234110 2404163 2512263 2371335 2666783 2232486
16865B232486J27769J89141M2997N3299Q1553J28059j13306j01913Q8237K6588
$$ 2232486 2360255 2549396 2592393 2645692 2727245 2855304 2741998 2640085 2728322 2754910
16855B754910L01698k69751L99836P0378n18300N62384k43094j72205L31184k59281
$$ 2754910 3056608 2786857 3186693 3257071 2738771 3301155 3058061 2885856 3217040 2957759
16845B957759M48118l9029k9806k76750N15447J34288r1419j54925L55269M4436
$$ 2957759 3405877 3366848 3337042 3060292 3575739 3710027 3618608 3463683 3818952 3863388
16835C863388Q5841L9347n2197L04446m47921L46506K66786O3740q9785M24553
$$ 3863388 3949229 3988576 3936379 4240825 3792904 4139410 4406196 4469936 4380151 4804704
16825D804704m1189J34531J45278n3846j9990J82252M14623R8051k3079k47304
$$ 4804704 4763515 4898046 5043324 4989478 4969488 5151740 5566363 5664414 5641335 5394031
16815E394031L53145L60451J08120J10045k42287L92456J51451P5854K76450J36179
$$ 5394031 5747176 6107627 6215747 6325792 6083505 6475961 6627412 6703266 6979716 7115895
16805G115895J01579J42920L01258M4288J77362L79757J77581M49258j16862J1629
$$ 7115895 7217474 7360394 7661652 7705940 7883302 8263059 8440640 8889898 8773036 8784665
16795H784665N11231p2776K97613O33729K25433K68543j28930P00794M09542J5234
$$ 8784665 9295896 9223120 9520733 10154462 10379895 10648438 10519508 11220302 11629844 11645078
16785A1645078L39476O11410N08168K42622M56661J91501K63197O13224P86440
$$ 11645078 11984554 12595964 13104132 13346754 13803415 13994916 14258113 14871337 15657777
16776A5657777M08770L48985Q25423J13959J074341R48318L67881R69028M24507
$$ 15657777 16066547 16415532 17240955 17354914 18429255 19377573 19745454 20714482 21138989
16767B1138989Q69326P48645J283729J064242N22179J315577J089955J374615
$$ 21138989 22008315 22756960 24040689 25104931 25627110 26942687 28032642 29407257
16759B9407257J223950J286512J697293J588737J565730J408442K332759K011836
$$ 29407257 30631207 31917719 33615012 35203749 36769479 38177921 40510680 42522516
16751D2522516K179689K577353K365377K953988K618140L182337L654249L713503
$$ 42522516 44702205 47279558 49644935 52598923 55217063 58399400 62053649 65767152
16743F5767152L724774M485818M713128M979275N308388N913543O358743O293369
$$ 65767152 69491926 73977744 78690872 83670147 88978535 94892078 101250821 107544190
16735A07544190P513273O935661P849240Q649409Q078319Q321721Q668764Q294360
$$ 107544190 115057463 121993124 129842364 138491773 146570092 154891813 163560577 171854937
16727A71854937Q069465P003489O262051N335764L929931J794024K75195p49024
$$ 171854937 179924402 186927891 193189942 198525706 202455637 204249661 204524856 203775832
16719B03775832k692663l963537n317450o890140p109612q148959q491994q666312
$$ 203775832 201083169 197119632 191802182 184912042 177802430 169653471 161161477 152495165
16711A52495165q468767q694825p930864q096464p420150p214527o322209o336273
$$ 152495165 144026398 135331573 127400709 119304245 111884095 104669568 98347359 92011086
16703I2011086n790645n369341m933792m478811m411924l999111l526383l604194
$$ 92011086 86220441 80851100 75917308 71438497 67026573 63027462 59501079 55896885
16695E5896885l156420k996330k701684k517896k355489k385705k177977j684252
$$ 55896885 52740465 49744135 47042451 44524555 42169066 39783361 37605384 35921132
16687C5921132j580655j804045j531316j562875j080150j435430j172411r69064
$$ 35921132 34340477 32536432 31005116 29442241 28362091 26926661 25754250 24785186
16679B4785186j115350j105984q44013o77893j323081p88917q74312l71634n78571
$$ 24785186 23669836 22563852 21719839 21041946 19718865 18929948 18055636 17684002 17105431
16670A7105431o11313n97101n57523q16325j87483m38437m94559n77332p16598
$$ 17105431 16494118 15897017 15339494 14523169 14335686 13897249 13402690 12825358 12108760
16661A2108760p2820k30567o61678k84795k90687j55594n87499k62947k84833
$$ 12108760 12035940 11805373 11143695 10858900 10568213 10412619 9825120 9562173 9277340
16652I277340O010l59731o25486J19570n91584k48902K78100n59468J70769l35998
$$ 9277340 9283350 8923619 8298133 8417703 7826119 7577217 7855317 7295849 7466618 7130620
16642G130620j93838k46101j03093o6291j79132l24661k35603L66824l54337q3990
$$ 7130620 6936782 6690681 6587588 6521297 6342165 6017504 5781901 6148725 5794388 5710398
16632E710398p2678m33051J01550j28457l32014n5500l2191J17874k55120r293
$$ 5710398 5637720 5204669 5306219 5177762 4845748 4790248 4758057 4875931 4620811 4611518
16622D611518m1073l69210J49975j34672k65470K8360j95283N17497o01299p9843
$$ 4611518 4570445 4201235 4351210 4216538 3951068 3979428 3784145 4301642 3700343 3620500
16612C620500J35487k8053O6695m84449j82696K47960m06510L40327n32648L52088
$$ 3620500 3755987 3727934 3794629 3310180 3127484 3375444 2968934 3309261 2776613 3128701
16602C128701k68927K08662m12180J69369M3501n2963j96144J27817k75027J89550
$$ 3128701 2859774 3068436 2656256 2825625 2869126 2816163 2620019 2747836 2472809 2662359
16592B662359p0671k01352J42552j91119l39874L74286m5413k16589k11541M31696
$$ 2662359 2591688 2390336 2532888 2341769 2001895 2376181 2330768 2114179 1902638 2334334
16582B334334m41005J56954j77215k89280O04591K5874j80790m17758L0216q2370
$$ 2334334 1893329 2050283 1873068 1583788 2188379 2214253 2033463 1615705 1645921 1563551
16572A563551M16928j7588k68640j0830p9268R053k4699l79358K33491Q2248L81285
$$ 1563551 1980479 1962891 1694251 1683421 1604153 1613206 1588507 1209149 1442640 1524888 1906173
16561A906173o79755N885L41655J43278j00264k50976O5168n6149j61194J59648
$$ 1906173 1226418 1232303 1573958 1717236 1616972 1365996 1431164 1375015 1213821 1373469
16551A373469J26613P5818k33438n2014j80692M6434o0188K89457m3390j41881
$$ 1373469 1500082 1575900 1342462 1290448 1109756 1156190 1096002 1385459 1342069 1200188
16541A200188J1066K05223j92296m9483j83467J01151j83921J9657L31957l26457
$$ 1200188 1211254 1416477 1224181 1174698 991231 1092382 908461 928118 1260075 933618
16531I33618J15737J70465j33651l37921L43782J34643j21223M1129Q6834m8750
$$ 933618 1049355 1219820 1086169 748248 1092030 1226673 1105450 1146579 1233413 1184663
16521A184663O808j67512Q3536j07144l7867k46492L56649k15357m0215l02899
$$ 1184663 1191471 1023959 1107495 1000351 962484 715992 1072641 857284 817069 514170
16511E14170L67658j5028K92894k11725k33282N783J53885m22889K67258n754
$$ 514170 881828 866800 1159694 947969 714687 720470 874355 451466 718724 712970
16501G12970L83058D39451O49805D14366L42604N4503j41763m4246r6785K72040
$$ 712970 1096028 439451 1089256 414366 756970 811473 669710 625464 528679 800719
16491H00719r3421j23099K82947k47445k15424J12536L83505m20511K59964k30867
$$ 800719 707298 584199 867146 619701 404277 516813 900318 479807 739771 508904
16481E08904M75461l59479M2687j96692L83822l92382K53999J8022J14250I3855
$$ 508904 984365 624886 667573 470881 854703 462321 716320 734342 848592 93855
16470D26745J58863K11342k94310J53426k81481A60405N57435l44985K0052K31099
$$ 426745 585608 796950 502640 656066 374585 160405 717840 372855 392907 624006
16460F24006m5169o716j91078Q337K27959j14993L52881l62259L000L03437l5594
$$ 624006 578837 572121 381043 389380 617339 502346 855227 492968 495968 799405 763811
16449G63811A77900L26737K42226j1043l41088J28165A82131K80773k00601K52155
$$ 763811 177900 504637 746863 735820 394732 522897 182131 462904 262303 514458
16439E14458r8874j18076p2002p7427K10857K68542O7466k15058j9091j32857
$$ 514458 415584 297508 225506 148079 358936 627478 694944 479886 460795 327938
16429C27938K04434m1948j50727J81608A65982J86060a9152D74705J57791k13816
$$ 327938 532372 490424 339697 521305 165982 352042 -19152 474705 632496 418680
16419D18680n2336A14917f8242F84980C19626J48261j00144A39033J859k2130
$$ 418680 366344 114917 -68242 684980 319626 467887 367743 139033 140892 118762
16409A18762N7916J26563K82119B67071K41509o7999j75586K9780l6276F5601
$$ 118762 176678 303241 585360 267071 508580 440581 264995 294775 258499 65601
16398C33382o1836L78229C20146A40302a11297A80383K52885O8301k12243J8855
$$ 333382 271546 649775 320146 140302 -111297 180383 433268 501569 289326 308181
16388C08181Q6014n1754l0879J28795j03621r6709m1724q44a99838B7048J23525
$$ 308181 394195 342441 311562 440357 336736 240027 198303 197459 -199838 27048 150573
16377A50573K5021M6789J33329j9643J11739J17451A45117L13129j80601K92792
$$ 150573 175594 222383 355712 336069 447808 565259 145117 458246 277645 570437
16367E70437B167P2099J60994J56644q6109J9144M3405M0284G8850Q4845O9603
$$ 570437 2167 74266 235260 391904 305795 324939 368344 408628 78850 163695 233298
16356B33298C2997K98125A09973K17100d1254C28861A18198k3094P5309j8660
$$ 233298 32997 331122 109973 327073 -41254 328861 118198 95104 170413 151753
16346A51753J18323M9844A28725K10012j59329o9556J88402e5800D7939M39726
$$ 151753 270076 319920 128725 338737 179408 109852 298254 -55800 47939 487665
16336D87665k24402L7238A43747K15921A78768K8357L6457F7478A7909L75859
$$ 487665 263263 300501 143747 359668 178768 207125 243582 67478 17909 393768
16326C93768a2815A60110P4126p3997J97718J53738H8029A0966K31637q3713M1568
$$ 393768 -12815 160110 234236 160239 357957 511695 88029 10966 242603 158890 200458
16315B00458R4629K53683d02587A24085D9360K16244L96990H5391e051j03308
$$ 200458 295087 548770 -402587 124085 49360 265604 662594 85391 -5051 -108359
16305a08359D7684K77187A49707D4482g4260A95350K50208E4686J02090F3194
$$ -108359 47684 324871 149707 44482 -74260 195350 445558 54686 156776 63194
16294B6137L5781J67032c95512I9961J23239K01972l2172Q1045g3872B51548A02275
$$ 26137 61918 228950 -395512 99961 223200 425172 393000 474045 -73872 251548 102275
16282D13840q5940a08966h574A69720J54493A9925J67265J24707C0448J33001
$$ 413840 327900 -108966 -8574 169720 324213 19925 187190 311897 30448 163449
16272A63449P0861j02977a5180M756B05125C8033L25426E5487f5217B86036C9196
$$ 163449 234310 131333 -15180 -10424 205125 38033 363459 55487 -65217 286036 39196
16260B05771k9027f7755C98147a301H8743A9576Q3575J6078c653D24962F3611
$$ 205771 176744 -67755 398147 -1301 88743 19576 103151 119229 -3653 424962 63611
16248E0536J59226h8680B85976F3003J02913A0487K99109L1870c9623a6749A80436
$$ 50536 209762 -88680 285976 63003 165916 10487 309596 341466 -39623 -16749 180436
16236A21646a98430Q2708A36538J52300j16992o7998O6901b48096I3830J36512
$$ 121646 -198430 -115722 136538 288838 171846 103848 170749 -248096 93830 230342
16226B30342F5655b02259A62536A27J70716b2964A98679A4538J24695a1281B64036
$$ 230342 65655 -202259 162536 127 170843 -22964 198679 14538 139233 -11281 264036
16214B8909J00207a81996C30927b11746i45m048A37876L9420M458a60109F7865
$$ 28909 129116 -181996 330927 -211746 -945 -4993 137876 177296 181754 -160109 67865
16202C51416c9794B56851a64633A75306N3918n188e9937E6446a89410c7564A13858
$$ 351416 -39794 256851 -164633 175306 229224 224036 -59937 56446 -189410 -37564 113858
16190E13543b56323H2439J60199a5727p6512k73532F0564J78378b0345H7395R942
$$ 513543 -256323 82439 242638 -15727 -92239 -365771 60564 238942 -20345 87395 97337
16179I7337a81207A42481E3960J21960E7593J27088c93816A72042G0077N6227
$$ 97337 -181207 142481 53960 175920 57593 184681 -393816 172042 70077 126304
16169A26304a50075o1570C47134N1047g9308A35244h9010G2672A0341J09017k0314
$$ 126304 -150075 -211645 347134 398181 -79308 135244 -89010 72672 10341 119358 99044
16158I9044i149E3641g9929B37523B4222g5457C99572o9646E7509J00078a66244
$$ 99044 -9149 53641 -79929 237523 24222 -75457 399572 329926 57509 157587 -166244
16146B97541M4843j37421K2094D4394b68636B5257J40564K374e0951H5106K9104
$$ 297541 342384 204963 227057 44394 -268636 25257 165821 168195 -50951 85106 114210
16135A14210a58779k7970A36588C3604L7243r738L6579L5780D6574a22108A73659
$$ 114210 -158779 -186749 136588 33604 70847 61109 97688 133468 46574 -122108 173659
16123e8614p647j07395N1205d0744A2389J79599H4340b78498D8460J08943A8703
$$ -58614 -66261 -173656 -122451 -40744 12389 191988 84340 -278498 48460 157403 18703
16111F3639j78L6967K2316l1145K68070A37234m3781a07243a8314A19640P8470
$$ 63639 63461 100428 122744 91599 359669 137234 93453 -107243 -18314 119640 198110
16100A98110E6583L10775d9496D5759J60873F8673l1940d7886n2254H891K18094
$$ 198110 56583 367358 -49496 45759 206632 68673 36733 -47886 -100140 8891 226985
16089B26985A01995a75358J7352l28954b03014I5128a10267B8416P4899c03099
$$ 226985 101995 -175358 -158006 -486960 -203014 95128 -110267 28416 103315 -303099
16078b74019A14952i1620A9070f4268D19681A19143a54962d5845k76724b3589
$$ -274019 114952 -91620 19070 -64268 419681 119143 -154962 -45845 -322569 -23589
16067H7345l9015B2991J61268a27354M6260A17403i867A985J4167b22647b6800
$$ 87345 48330 22991 184259 -127354 -81094 117403 -9867 1985 16152 -222647 -26800
16055a09252G583c45706A02040a56478G5252C2504a82940A9145a56914E8563c20349
$$ -109252 7583 -345706 102040 -156478 75252 32504 -182940 19145 -156914 58563 -320349
16043E5364R0568a56591J4846G3122d97239J23247A21022a67804A62268b12052
$$ 55364 145932 -156591 -141745 73122 -497239 -373992 121022 -167804 162268 -212052
16032a42619A74679f1510j60762A16058a53700g4158C10952n6024a9409l0613
$$ -142619 174679 -61510 -222272 116058 -153700 -74158 310952 254928 -19409 -50022
16022e0022A46856b30191F39K02396e750j40524D5618J73547a23534l6590F2983
$$ -50022 146856 -230191 639 203035 -5750 -146274 45618 219165 -123534 -160124 62983
16010a2476k17750A91743a7744o0352j09521l3430f0377A2496m318b57098i218
$$ -12476 -230226 191743 -17744 -78096 -187617 -221047 -60377 12496 8178 -257098 -9218
15998h2270A7082b48473f4682r855L6173j24321c8193B03210f0982K6656E2423
$$ -82270 17082 -248473 -64682 -74537 -38364 -162685 -38193 203210 -60982 -34326 52423
15986I364L32734A62210A8668K35568b66112C57284A14603C0609K81134b45321
$$ 9364 342098 162210 18668 254236 -266112 357284 114603 30609 311743 -245321
15975a38562c3180q8818N0520g402k39741e164l22728J41047M0599A1616L6996
$$ -138562 -33180 -121998 -71478 -7402 -247143 -5164 -327892 -186845 -146246 11616 48612
15964D8612a74106b5713R269j97670f09l44522m8994B56115D6137b24279N4090
$$ 48612 -174106 -25713 -16444 -214114 -609 -345131 -394125 256115 46137 -224279 -170189
15953a70189A65594m124E1274a52389A14082c30618F4066O0825O7797O7937A30295
$$ -170189 165594 161470 51274 -152389 114082 -330618 64066 124891 192688 260625 130295
15941d0308n12357b11482D1544P0066a08339d180k35094J09211k01890a26110
$$ -40308 -552665 -211482 41544 111610 -108339 -4180 -239274 -130063 -331953 -126110
15930d7475C0370A0338P7864a40174C634K46985f7323l042q0376r8481a14563
$$ -47475 30370 10338 88202 -140174 3634 250619 -67323 -70365 -150741 -249222 -114563
15918g291B5457K2716a40506B0283i0814c9935m1201A25904b08249k3304N713
$$ -7291 25457 48173 -140506 20283 -90814 -39935 -81136 125904 -208249 -231553 -225840
15907b25840o9896C9087e6677G4724c27801a7381G2323a77071M2273B48519d338
$$ -225840 -295736 39087 -56677 74724 -327801 -17381 72323 -177071 -134798 248519 -4338
15895a79817G9322a48289j05197A32312Q3857b19371G836c61689a835k70141E7820
$$ -179817 79322 -148289 -253486 132312 216169 -219371 7836 -361689 -1835 -271976 57820
15883d2012F018a55529d2057j48401D27042j79202a92423C0880a78872C6889Q4765
$$ -42012 6018 -155529 -42057 -190458 427042 247840 -192423 30880 -178872 36889 121654
15872A21654B4967K8295b31703a04025c3270k18656B47433e5298j01599p4385
$$ 121654 24967 53262 -231703 -104025 -33270 -251926 247433 -55298 -156897 -231282
15862b31282L8738P8070j50162A68892E7309N0032d19421a46416e6447D20139
$$ -231282 -192544 -114474 -264636 168892 57309 107341 -419421 -146416 -56447 420139
15851d9581H5006k1590c7932I8172J36999A8307b05805a6107C64315A27669F23
$$ -49581 85006 63416 -37932 98172 235171 18307 -205805 -16107 364315 127669 623
15839g1177j52730A53870a95175c1858C14194b60993j08582A62682a71606N3284
$$ -71177 -223907 153870 -195175 -31858 314194 -260993 -369575 162682 -171606 -118322
15829a18322O68E9586b4941r5258D1053d053l25903P7311h7562n3435r7728O1354
$$ -118322 -117654 59586 -24941 -120199 41053 -4053 -329956 -252645 -87562 -140997 -238725 -177371
15817a77371A86401a26434b7085j02870i614B36137b53252c8512D9946K21120
$$ -177371 186401 -126434 -27085 -129955 -9614 236137 -253252 -38512 49946 271066
15807B71066R6351e0310G3837J6991B3948N1116a22252b7156F5939f3328o6489
$$ 271066 367417 -50310 73837 90828 23948 75064 -122252 -27156 65939 -63328 -129817
15796a29817A86131O4758a64278N8783D5723a31438f477p0649j61754j82938A02749
$$ -129817 186131 250889 -164278 -105495 45723 -131438 -6477 -77126 -238880 -421818 102749
15784H7930K6716e1808C9245J08417a93263e6128A46773b10929A70897c3276p7559
$$ 87930 114646 -51808 39245 147662 -193263 -56128 146773 -210929 170897 -33276 -110835
15773a10835B36357a90874C2557J06884P72E0080b1662m0182j39749B57223a24220
$$ -110835 236357 -190874 32557 139441 140213 50080 -21662 -61844 -201593 257223 -124220
15761A27053K00374I6787A4823J4522e7536k18589E0822c49958A21303j1189c2732
$$ 127053 327427 96787 14823 29345 -57536 -276125 50822 -349958 121303 110114 -32732
15749B5770c89770F2784c6659A57294J54796a46655j2671c9489F1915P6470b05113
$$ 25770 -389770 62784 -36659 157294 312090 -146655 -159326 -39489 61915 138385 -205113
15737b08206b6520k02152A33868D3833b19770b1555B5469j364b20780R7366B10212
$$ -208206 -26520 -228672 133868 43833 -219770 -21555 25469 24105 -220780 -123414 210212
15725a22470H015b20418o3489j07728A85540b85793Q2430H2164M4419e8140m1247
$$ -122470 8015 -220418 -283907 -391635 185540 -285793 -203363 82164 126583 -58140 -99387
15714i9387A8504K43519a23774m9059c1351j59172C4737a57911e2378G1357b49237
$$ -99387 18504 262023 -123774 -172833 -31351 -190523 34737 -157911 -52378 71357 -249237
15702A93223a12751G0748c2932j60707j11394A23831a32181B20400a91362g0207
$$ 193223 -112751 70748 -32932 -193639 -305033 123831 -132181 220400 -191362 -70207
15691e3632j13238B68519a34029j42833J08855e1277l07808L5866C0287a93324
$$ -53632 -166870 268519 -134029 -276862 -168007 -51277 -359085 -323219 30287 -193324
15680f97A64310h5935E6704M4112d1737B4929J34228k309b30110B09381J19686
$$ -697 164310 -85935 56704 100816 -41737 24929 159157 156848 -230110 209381 329067
15669C29067j14751A05486c9139B16538a67741j8961Q5680B33099D374m16N6091
$$ 329067 214316 105486 -39139 216538 -167741 -186702 -101022 233099 4374 3958 60049
15658F0049a42414C42492b25349A12653d7347A07083c2956k58633b3125B9348
$$ 60049 -142414 342492 -225349 112653 -47347 107083 -32956 -291589 -23125 29348
15647C9185K48229A05145r176k6041K2201c9224k2088C7143A6364M297b00927
$$ 39185 287414 105145 95969 69928 92129 -39224 -61312 37143 16364 20661 -200927
15635b48087P8557A79175g0650j37827e8539A26519P880j324b76885G9484K53498
$$ -248087 -169530 179175 -70650 -208477 -58539 126519 134399 133075 -276885 79484 332982
15624C32982a24138b700q8363m803D4384a31695D516e6833F6611a09167A57658
$$ 332982 -124138 -2700 -91063 -95866 44384 -131695 4516 -56833 66611 -109167 157658
15612f9394A87679a29965J1940n3601q2171e5175o2240A30085a60028d4342D4210
$$ -69394 187679 -129965 -118025 -171626 -253797 -55175 -117415 130085 -160028 -44342 44210
15600a37722j7916j41757d5432A37309a80575g0058F2356P9988k8008i0200H1734
$$ -137722 -155638 -297395 -45432 137309 -180575 -70058 62356 142344 114336 -90200 81734
15588B72419B280c18109i843A13117B6748a7957c913A8040f7859c3484j6145J3581
$$ 272419 2280 -318109 -9843 113117 26748 -17957 -3913 18040 -67859 -33484 -49629 -36048
15576c6048l2917A50136a41445f2938A21112N8393b11786B516d3013O920k31222
$$ -36048 -68965 150136 -141445 -62938 121112 179505 -211786 2516 -43013 -36093 -267315
15565b67315f4711o6528I6583a86602A68562Q127a19595b2944F7872a84698a7229
$$ -267315 -64711 -131239 96583 -186602 168562 176689 -119595 -22944 67872 -184698 -17229
15553B59590d7694k53051A80687a21335j12261B5517a87251L7743A23714a25769
$$ 259590 -47694 -300745 180687 -121335 -233596 25517 -187251 -149508 123714 -125769
15542A62545J84687a3011l9593B20511a0479F8437J7767J74635f4473j67891Q9887
$$ 162545 347232 -13011 -52604 220511 -10479 68437 86204 260839 -64473 -232364 -142477
15531a42477l1323k4162A97601a19676e3566C1553J35232c96267e8635B81435
$$ -142477 -173800 -197962 197601 -119676 -53566 31553 166785 -396267 -58635 281435
15520f2266r9465g1491L5516A97709C7621c7307I7157a53800N6473A17406i5955
$$ -62266 -161731 -71491 -35975 197709 37621 -37307 97157 -153800 -97327 117406 -95955
15508d5205A7815a31408l968A17329J69270D147a73272B02429a01726a3982A2808
$$ -45205 17815 -131408 -135376 117329 286599 4147 -173272 202429 -101726 -13982 12808
15496a89357a2980A07458n1199K3699i044A81522a63226a5717k09500N5921A60826
$$ -189357 -12980 107458 56259 79958 -9044 181522 -163226 -15717 -225217 -169296 160826
15484c9848G4617a06123k11627C6470M8364a64876p382L8026E0800K36613J0962
$$ -39848 74617 -106123 -317750 36470 84834 -164876 -172258 -134232 50800 287413 298375
15473B98375b81099Q5934k17822f9551C51312A34007a2956C5840a79827Q5908
$$ 298375 -281099 -195165 -412987 -69551 351312 134007 -12956 35840 -179827 -93919
15463i3919C5115J24557e2712a7532A51908O8371D17N7776g6225m5610A68327
$$ -93919 35115 159672 -52712 -17532 151908 220279 417 58193 -76225 -121835 168327
15451a36911e7116B34359j11286E1577a05314H4568c48405c2939j38902j37993
$$ -136911 -57116 234359 123073 51577 -105314 84568 -348405 -32939 -171841 -309834
15441c09834i8951J3756j2178H1025d9047K1982B31153g4684B23763L0090M2455
$$ -309834 -98951 -85195 -97373 81025 -49047 -27065 231153 -74684 223763 253853 296308
15430B96308A7793a95834h219I4386J13540Q6184F0980b73838D9694J21656a43121
$$ 296308 17793 -195834 -8219 94386 207926 294110 60980 -273838 49694 171350 -143121
15418B5255R5392E5660d6415A8809h433F5999a22056k15637B01910D5281a44471
$$ 25255 120647 55660 -46415 18809 -8433 65999 -122056 -337693 201910 45281 -144471
15406c16058I0580d6948h656A51301m4739K77640A10895b5826B722K47343c97862
$$ -316058 90580 -46948 -8656 151301 106562 384202 110895 -25826 2722 250065 -397862
15394h7949B11971b76401a35723H9615h0919A03667b23963k6793A86111j2265
$$ -87949 211971 -276401 -135723 89615 -80919 103667 -223963 -250756 186111 173846
15384A73846m2350e28332B93890f5831B8685j3864a63320a0882K535H3474b86332
$$ 173846 131496 -528332 293890 -65831 28685 14821 -163320 -10882 -8347 83474 -286332
15372a18447B11257f854A07337J01258a22145n2657l606B395a13897k96901A25017
$$ -118447 211257 -6854 107337 208595 -122145 -174802 -178408 2395 -113897 -410798 125017
15360h5857j93706I292J83292c38865P4259I9315a94994I671c8508D31774a83981
$$ -85857 -279563 9292 192584 -338865 -264606 99315 -194994 9671 -38508 431774 -183981
15348d90339a07096L7797q963A07803i9057j62288A84162o1823l2305K42703C7936
$$ -490339 -107096 -69299 -78262 107803 -99057 -261345 184162 122339 90034 332737 37936
15336a32684b0393F4685j7312c54199c9260j0234G1359L49781H7782J40230L7754
$$ -132684 -20393 64685 47373 -354199 -39260 -49494 71359 421140 87782 228012 265766
15325B65766a45433G0277h2326o5464B16916a6203k16787d2909H0543l6944N9285
$$ 265766 -145433 70277 -82326 -147790 216916 -16203 -232990 -42909 80543 43599 102884
15314A02884d6685A65474g7394o2047A72223P8464f8778B68304i8910A57662d4211
$$ 102884 -46685 165474 -77394 -139441 172223 250687 -68778 268304 -98910 157662 -44211
15302E8611J63996j385R0933c14209N7519E949P2798J45462J15074f8702B60871
$$ 58611 222607 221222 312155 -314209 -256690 5949 78747 224209 339283 -68702 260871
15290A57669a53015A31798a02579A78264b48561A10773D6971b31637C7353A7122
$$ 157669 -153015 131798 -102579 178264 -248561 110773 46971 -231637 37353 17122
15279I7464i5216o5919A35101c43663B68573F6631R7681K1954g6084a6667B89607
$$ 97464 -95216 -161135 135101 -343663 268573 66631 164312 186266 -76084 -16667 289607
15267b2853G4305O1591a81963j2078H6293p852d5175j10741A41557f9498n0354
$$ -22853 74305 135896 -181963 -194041 86293 78441 -45175 -155916 141557 -69498 -119852
15256a19852A97134a91829Q4623B73354o3156I687P61664Q92349H04600O06365
$$ -119852 197134 -191829 -107206 273354 210198 9687 771351 1663700 804600 1410965
15246A410965E20227B43577r7680J61983e6548b0228k10137A08479L9628R683
$$ 1410965 520227 243577 145897 307880 -56548 -20228 -230365 108479 148107 157790
15236A57790O8740l3896K1600n6500q096J25066R6016A17987a06769j03673A22375
$$ 157790 226530 192634 214234 157734 149638 274704 370720 117987 -106769 -210442 122375
15224B89706A04275B9049L83538a5762A27750j0737K0374l2205j3698L5377Q1006
$$ 289706 104275 29049 412587 -15762 127750 117013 137387 105182 91484 126861 207867
15213B07867r3344c4319a6911B57884c4322B03476a76259A97912n4992b7775j13936
$$ 207867 114523 -34319 -16911 257884 -34322 203476 -176259 197912 142920 -27775 -141711
15202a41711N3324C3210a31447B87146A19230a6550D13288I2259a54553d8671
$$ -141711 -88387 33210 -131447 287146 119230 -16550 413288 92259 -154553 -48671
15191B33630A00857a84892C83550H9521d9808B38685c79G2679O4859K02856A30657
$$ 233630 100857 -184892 383550 89521 -49808 238685 -379 72679 137538 340394 130657
15179i7626A51978i3191A22255C2371l035M25j3009J99504N7225D2544c1729B2002
$$ -97626 151978 -93191 122255 32371 29336 29761 16752 216256 273481 42544 -31729 22002
15166B84081I5624l5559K37812e6073B21175K59921A71787f8025Q531G8218L29532
$$ 284081 95624 60065 297877 -56073 221175 481096 171787 -68025 -59494 78218 407750
15155D07750A61161K74884B04079J57633c11903c2211H8229C7111J79281a70559
$$ 407750 161161 436045 204079 361712 -311903 -32211 88229 37111 216392 -170559
15144A85509e3141A57956L0762N2811O1865A3678K15242J79305j19639N910A17932
$$ 185509 -53141 157956 188718 241529 303394 13678 228920 408225 288586 294496 117932
15132a15918B43252K81768A93490c8021B39661J37447a34608D8666A9971k8M11584
$$ -115918 243252 525020 193490 -38021 239661 377108 -134608 48666 19971 19943 431527
15121D31527J47468b3682A15736f8380k7876A22984h1425B81998j40232O9807
$$ 431527 578995 -23682 115736 -68380 -96256 122984 -81425 281998 141766 211573
15111B11573b5411C30125m0546n568Q9246K1987A6741d9557B15403C1063R192
$$ 211573 -25411 330125 289579 284011 373257 395244 16741 -49557 215403 31063 40255
15100D0255J62274H8440l2598J32595D4655G259L07534j524C8958A5420K4837
$$ 40255 202529 88440 55842 188437 44655 7259 314793 313269 38958 15420 40257
15089D0257d2803o197j9615A72216J01787j09658e8723B15856J15406h5241C23695
$$ 40257 -42803 -49000 -68615 172216 274003 164345 -58723 215856 331262 -85241 323695
15077a89955N3221A30207Q9336q1475L7374L5254P0332g3776k6842A95238j5538
$$ -189955 -136734 130207 219543 138068 175442 210696 281028 -73776 -100618 195238 179700
15066A79700l3370o0835h1313A51916k1666c6139A77481E4800Q4145P0986D243
$$ 179700 146330 85495 -81313 151916 130250 -36139 177481 54800 138945 209931 4243
15054C5281K20759C3107K12525P4713j47224J02437f0306A13110a1865B21927
$$ 35281 256040 33107 245632 320345 173121 275558 -60306 113110 -11865 221927
15043b7536r0708L5895C33742A66252K40710q6801L7195K6823D7445h1546p0143
$$ -27536 -118244 -82349 333742 166252 406962 320161 357356 384179 47445 -81546 -151689
15032a51689b4615A72606p9195K25445L6481J19546B18524M5350C3386K61388
$$ -151689 -24615 172606 93411 318856 355337 474883 218524 263874 33386 294774
15022B94774A23814J40498j26344g8912C43367c49018B95998q0902p1103P6330
$$ 294774 123814 264312 137968 -78912 343367 -349018 295998 215096 143993 220323
15012B20323o3446J70526j11717j1595H212K93271C7442L97985k03526B3096P1910
$$ 220323 156877 327403 215686 204091 8212 301483 37442 435427 231901 23096 95006
15001I5006Q170J17040K52659A12683K70226H9780a72458A15171J22619I2417
$$ 95006 103176 220216 472875 112683 382909 89780 -172458 115171 237790 92417
14990B20058M6431K74248k06495j60360K21010A89614L40850B02716j2828J77191
$$ 220058 266489 540737 334242 173882 394892 189614 530464 202716 189888 367079
14980C67079F4953E563N4959h417A73216p7563J50303K03485j42650M8133H6901
$$ 367079 64953 5563 60522 -8417 173216 95653 245956 449441 306791 354924 86901
14968B23555J1486j593J47263n2419K13582C3510K83241L5177J02361F9831K64556
$$ 223555 235041 233448 380711 328292 541874 33510 316751 351928 454289 69831 334387
14957C34387J1161m0808c08165E12159r8550j35553b97947B1159K71500p0116
$$ 334387 345548 304740 -308165 512159 413609 278056 -297947 21159 292659 222543
14947B22543c1810G7124M43118G406K28300i2012B78855P5480e6179A06243K5745
$$ 222543 -31810 77124 520242 7406 235706 -92012 278855 354335 -56179 106243 131988
14936A31988J61601A35968o5019N42074k82544A64242J07757J08698b513D2125
$$ 131988 293589 135968 70949 613023 330479 164242 271999 380697 -2513 42125
14925D86275j05183c1401A26767N63824A60291O1319k8443D9745N9178N19490
$$ 486275 381092 -31401 126767 690591 160291 221610 193167 49745 108923 628413
14915F28413k92545J52901E6497L0807i8023D44545K07282B65534A06849f1494
$$ 628413 335868 488769 56497 87304 -98023 444545 651827 265534 106849 -61494
14904d2869I3811L68639A26539K29378I7276K62521j44597J83482N1986k22932
$$ -42869 93811 462450 126539 355917 97276 359797 215200 398682 450668 227736
14894B27736J28545o5957j29767L68378H8079L70065m9713J81043j68212j08824
$$ 227736 356281 290324 160557 528935 88079 458144 408431 589474 421262 312438
14884C12438J28136L7487j08717j25127K9020K9302K06540k32484O2020m8667
$$ 312438 440574 478061 369344 244217 273237 302539 509079 276595 338615 289948
14874B89948K66596m0095A82342K66516H6070O86461C61290R5995F2225K11128
$$ 289948 556544 516449 182342 448858 86070 772531 361290 457285 62225 273353
14864B73353L44500k79528J95026o9240J18676A17420M67679k54618L11707A74145
$$ 273353 617853 338325 533351 464111 582787 117420 585099 330481 642188 174145
14853A88717L51827J52714k53735A82967R5778K52403r3156q9684J09721K63576
$$ 188717 540544 693258 439523 182967 278745 531148 437992 348308 458029 721605
14843G21605B67377K15868k05221J72680J18971j07300j13287j68987K56533q1492
$$ 721605 267377 483245 278024 450704 569675 462375 349088 180101 436634 355142
14833C55142j25906J65601K57298j7193k30484J11033Q0192j86379R1710A35751
$$ 355142 229236 394837 652135 634942 404458 515491 595683 409304 501014 135751
14822D63120j39570J52870J35261r2765q9754J78780J0507J5283J56655a7402
$$ 463120 323550 476420 611681 518916 429162 607942 618449 633732 790387 -17402
14811F33537m4950Q1010j5024l6477R4337k44080A58944K74014j96193n148J52275
$$ 633537 588587 669597 654573 618096 712433 468353 158944 432958 236765 231617 383892
14800C83892J52783j18470J68660k6498m3704j7413r850K15325B40353L50847
$$ 383892 536675 418205 586865 560367 516663 499250 489400 704725 240353 591200
14790E91200q3599l8942N1172K43760l1489k23186K15345k29919j73402N31401
$$ 591200 507601 468659 519831 763591 732102 508916 724261 494342 320940 852341
14780H52341D16907J00037J98843q4782J23614q8778k67538L07686r8151Q795
$$ 852341 416907 516944 715787 631005 754619 665841 398303 705989 607838 616633
14770F16633j14336R5145K75726j67771N8654K4967l61135K79881J4677r6422
$$ 616633 502297 597442 873168 705397 764051 789018 427883 707764 722441 626019
14760F26019K94206m48993L85441D11113K71901k43503J23981R6172L77445E15102
$$ 626019 920225 471232 856673 411113 683014 439511 563492 659664 1037109 515102
14749F14938K55634j88270R8562j71540N4989J31544C39878M02798k73092r446
$$ 614938 870572 682302 780864 609324 664313 795857 339878 742676 469584 460138
14739D60138K95039k84176m4865L57816l13308J92816l01376L84748j88848k76146
$$ 460138 755177 471001 426136 783952 470644 663460 362084 746832 557984 281838
14729B81838N92660k74403L71188k31307k46667L70239J50289j54222R4225j92083
$$ 281838 874498 600095 971283 739976 493309 863548 1013837 859615 953840 761757
14719G61757K34746j32423N1881k18871M23469k20409K38004m18454K55151j83008
$$ 761757 996503 864080 915961 697090 1120559 900150 1138154 719700 974851 791843
14709G91843r3708k4066J42992L16959l98905L86024l48199J26238L27943n10164
$$ 791843 698135 674069 817061 1134020 735115 1121139 772940 899178 1227121 716957
14699G16957J95423J08036k74355M04909j28921D56009O61924q2476k63745P1994
$$ 716957 912380 1020416 746061 1150970 1022049 456009 1117933 1035457 771712 843706
14689H43706J42079n9555C80529R00214l34633j20359J26446L2383K11974j44859
$$ 843706 985785 926230 380529 1280743 946110 825751 952197 984580 1196554 1051695
14679A051695k3413Q7609j6137N5247r2630j56647L28542k29994J27926l56865
$$ 1051695 1028282 1115891 1099754 1155001 1062371 905724 1234266 1004272 1132198 775333
14669G75333N59387o37692K37000L80793l20135j83241K41590q7329K66714J8987
$$ 775333 1334720 697028 934028 1314821 994686 811445 1053035 965706 1232420 1251407
14659A251407m25248M59413L9990Q5161l43504J34955j19214k4313L72632l37566
$$ 1251407 826159 1285572 1325562 1410723 1067219 1202174 1082960 1058647 1431279 1093713
14649A093713R6858j31548J26364j05557L17109k96017N9350L3270l58775N35616
$$ 1093713 1190571 1059023 1185387 1079830 1396939 1100922 1160272 1193542 834767 1370383
14639A370383m28655N45383k12556L4704L10572m06547Q5887k06970K70126J60087
$$ 1370383 941728 1487111 1274555 1309259 1619831 1213284 1299171 1092201 1362327 1522414
14629A522414l47150J30930k32461K81787P3364j01246k08323O6987K23756l4957
$$ 1522414 1175264 1306194 1073733 1355520 1428884 1327638 1119315 1186302 1410058 1375101
14619A375101k30945K11460P0399M94747k61242j29419J7268o2670r6090K10081
$$ 1375101 1144156 1355616 1426015 1920762 1659520 1530101 1547369 1484699 1388609 1598690
14609A598690k23810J23399k4420J39036J27434l33059M79362j07259J56958j73479
$$ 1598690 1374880 1498279 1473859 1612895 1740329 1407270 1886632 1779373 1936331 1762852
14599A762852O5624J08018j61651j96121j1718N58244n31329O3427k25849L68696
$$ 1762852 1828476 1936494 1774843 1578722 1567004 2125248 1593919 1657346 1431497 1800193
14589A800193J4476p6037o6175K10128p748K74561j69968L68852l40991K0296
$$ 1800193 1814669 1738632 1672457 1882585 1874837 2149398 1979430 2348282 2007291 2027587
14579B027587k28034K87102J99462l28079Q0334J00311j01637J54208K07940r4799
$$ 2027587 1799553 2086655 2286117 1958038 2038372 2138683 2037046 2191254 2399194 2304395
14569B304395J66951j96825J1653J93992l24770N22360l11468O3136Q7411K27020
$$ 2304395 2471346 2274521 2286174 2480166 2155396 2677756 2366288 2429424 2516835 2743855
14559B743855J27773M77695k47221j9685L87171M98738k27991O54380O68587P58563
$$ 2743855 2871628 3349323 3102102 3082417 3469588 3968326 3740335 4394715 5063302 5821865
14549E821865J704975L961397Q628968J6640738M359447B0420917I989397m567076
$$ 5821865 7526840 11488237 20117205 36757943 41117390 20420917 9989397 5422321
14541E422321j639587r74444j28193m67921j08227M7233j2492m9030L94671n21490
$$ 5422321 3782734 2808290 2680097 2212176 2103949 2151182 2138690 2089660 2484331 1962841
14531A962841L51691M0737J8058J75707k59319K02375M1910l30617J11719R6679
$$ 1962841 2314532 2355269 2373327 2549034 2289715 2492090 2534000 2203383 2315102 2411781
14521B411781L4611Q8138K62608j33497J6501j62978J32686r119K89620k59396
$$ 2411781 2446392 2534530 2797138 2663641 2680142 2517164 2649850 2640731 2930351 2670955
14511B670955L50989p6272M6405J5278l60935o8665L27571n2116J67569j50462
$$ 2670955 3021944 2945672 2992077 3007355 2646420 2577755 2905326 2853210 3020779 2870317
14501B870317M79425n24847L94538l1872r021P3348j27779J7764L00777j01894
$$ 2870317 3349742 2824895 3219433 3187561 3178540 3251888 3124109 3141873 3442650 3340756
14491C340756L66197n8064q3914m5323K54764j38982k21430K43457J17091K0149
$$ 3340756 3706953 3648889 3564975 3519652 3774416 3635434 3414004 3657461 3774552 3794701
14481C794701j01132K02758q6484N10723j91402k12641K60055J10596r1695J27655
$$ 3794701 3693569 3896327 3809843 4320566 4129164 3916523 4176578 4287174 4195479 4323134
14471D323134p0164K86942o7081J23276k6801Q6314P1836l26824M14897j9445
$$ 4323134 4252970 4539912 4472831 4596107 4569306 4655620 4727456 4400632 4815529 4796084
14461D796084L73063k75106Q3603j41538L75596k0656M6581R0054K2082j58416
$$ 4796084 5169147 4894041 4977644 4836106 5211702 5191046 5237627 5327681 5349763 5191347
14451E191347J79352N01187k26682J51467j53026L09095k20652L73173j80574
$$ 5191347 5370699 5871886 5645204 5796671 5643645 5952740 5732088 6105261 5924687
14442E924687K68790K49249J05017O1091k49885N2290K89184R04K58622l5437
$$ 5924687 6193477 6442726 6547743 6608834 6358949 6411239 6700423 6701327 6959949 6924512
14432F924512p5231J23290k4942M35337j60729o6702M45874n1090J02953L33858
$$ 6924512 6849281 6972571 6947629 7382966 7222237 7155535 7601409 7550319 7653272 7987130
14422G987130l7629L53330n8443J37788n9283L4024N63166j16032R7191j7208
$$ 7987130 7949501 8302831 8244388 8382176 8322893 8356917 8920083 8804051 8901242 8884034
14412H884034M87057j4703J40261K4990R6024J23385M00298L26302k78610L80344
$$ 8884034 9371091 9356388 9496649 9521639 9617663 9741048 10141346 10467648 10189038 10569382
14402A0569382j94528L61781J89574j31448M93995L14367L4806K58113R8139L44117
$$ 10569382 10374854 10736635 10926209 10794761 11288756 11603123 11637929 11896042 11994181 12338298
14392A2338298L26796K78463K66596J50965j89077K19023M25309L02991L16415
$$ 12338298 12665094 12943557 13210153 13361118 13172041 13391064 13816373 14119364 14435779
14383A4435779J51006K07991K23451L87818J23522M24068N07121K5641K92881
$$ 14435779 14586785 14794776 15018227 15406045 15529567 15953635 16460756 16486397 16779278
14374A6779278N02307L37412K49911L29316J10774N54637M31845P21816J19735
$$ 16779278 17281585 17618997 17868908 18198224 18308998 18863635 19295480 20017296 20137031
14365B0137031O32172M5984P50005M52093M57771N35002M92512M86826J35818
$$ 20137031 20769203 20815187 21565192 22017285 22475056 23010058 23502570 23989396 24125214
14356B4125214R91169O02654M89238R04192O25221O13073M99483P78189M25800
$$ 24125214 25116383 25719037 26208275 27112467 27737688 28350761 28850244 29628433 30054233
14347C0054233J535727L83413R22536O59347J117457O26985Q15788J205889J149816
$$ 30054233 31589960 31973373 32895909 33555256 34672713 35299698 36115486 37321375 38471191
14338C8471191J233226P11928J346208J142360J349573J349865R26251J567932
$$ 38471191 39704417 40416345 41762553 42904913 44254486 45604351 46530602 48098534
14330D8098534J651929J443650J818422J587101J629773K110089J719325K029725
$$ 48098534 49750463 51194113 53012535 54599636 56229409 58339498 60058823 62088548
14322F2088548J954210K513259K467360J869356L106438K466948L086168K428075
$$ 62088548 64042758 66556017 69023377 70892733 73999171 76466119 79552287 81980362
14314H1980362L481274L240076L696308L438858L843714M136860M617044L954505
$$ 81980362 85461636 88701712 92398020 95836878 99680592 103817452 108434496 112389001
14306A12389001N034231M911070N402518N890691N629318O572909O839165P107543
$$ 112389001 117423232 122334302 127736820 133627511 139256829 145829738 152668903 159776446
14298A59776446P379266P641202Q514788R188199R048696J0104117J0398855J1014967
$$ 159776446 167155712 174796914 183311702 192499901 201548597 211652714 222051569 233066536
14290B33066536J1314188J2063844J2669528J3084154J3059992J4004881J4278857
$$ 233066536 244380724 256444568 269114096 282198250 295258242 309263123 323541980
14283C23541980J4035740J4618173J4363502J3696275J3722598J2817017J1876742
$$ 323541980 337577720 352195893 366559395 380255670 393978268 406795285 418672027
14276D18672027J0591113R118418P467072M383313R68179j803147k427857l769786
$$ 418672027 429263140 438381558 445848630 450231943 451200122 449396975 446969118 443199332
14268D43199332o431432o259949p430084r160281j0597613j1622431j3774921
$$ 443199332 436767900 430507951 423077867 413917586 403319973 391697542 377922621
14261C77922621j4971467j4853571j5299608j4702840j4743558j3722187j3911142
$$ 377922621 362951154 348097583 332797975 318095135 303351577 289629390 275718248
14254B75718248j3155372j2728409j2295984j1663522j0695418j0793227r769877
$$ 275718248 262562876 249834467 237538483 225874961 215179543 204386316 194616439
14247A94616439r652076q585124q363165p499089p535696p312761o354001o322257
$$ 194616439 184964363 176379239 168016074 160516985 152981289 145668528 139314527 132992270
14239A32992270o128887n143071n233600m994818m759932m205172m366652m000100
$$ 132992270 126863383 121720312 116486712 111491894 106731962 102526790 98160138 94160038
14231I4160038l508698l366446l540428l168922k972403k905128k381960l075307
$$ 94160038 90651340 87284894 83744466 80575544 77603141 74698013 72316053 69240746
14223F9240746k488298k345826k153063k249500j868549j722929j846205j867870
$$ 69240746 66752448 64406622 62253559 60004059 58135510 56412581 54566376 52698506
14215E2698506j659167j412333j123156j685463j764656j182477j425841j064103
$$ 52698506 51039339 49627006 48503850 46818387 45053731 43871254 42445413 41381310
14207D1381310j059423q65236j296509j167649r98225q53049o51061j074433q68676
$$ 41381310 40321887 39456651 38160142 36992493 35994268 35141219 34490158 33415725 32547049
14198C2547049r54460r18633n15706p11357q40226q42722o17932k28554q56539
$$ 32547049 31592589 30673956 30158250 29446893 28606667 27763945 27146013 26917459 26060920
14189B6060920n61815o60738n43195o74043l32407o24950l76314o39158o11556
$$ 26060920 25499105 24838367 24295172 23621129 23288722 22663772 22287458 21648300 21036744
14180B1036744k52895p14248j93482j71133n51500o58728J41996r20750k49872
$$ 21036744 20783849 20069601 19876119 19704986 19153486 18494758 18636754 17716004 17466132
14171A7466132m344k33325m08295m90332l41517m45981L3653m39520J72665n39487
$$ 17466132 17461788 17228463 16820168 16329836 15988319 15542338 15575991 15136471 15309136 14769649
14161A4769649n41140j72326p4035l12562l9364l00626j42576l03852m34829l41432
$$ 14769649 14228509 14056183 13982148 13669586 13630222 13329596 13187020 12883168 12448339 12106907
14151A2106907l04772J30546j64360j22978k92205j70005N4682o94983L25512
$$ 12106907 11802135 11932681 11768321 11645343 11353138 11183133 11237815 10542832 10868344
14142A0868344l19089n40455n2070j7808P817m39718L20563k82323n0467k17882
$$ 10868344 10549255 10008800 9956730 9938922 9946739 9507021 9827584 9545261 9494794 9276912
14132I276912k62110k153m0127k93575j17420n14824K74545k36260J06544k94667
$$ 9276912 9014802 9012649 8972522 8678947 8561527 8046703 8321248 8084988 8191532 7896865
14122G896865R2093k17134j75666K6082j09951l74818L8477j82433L01075l13852
$$ 7896865 7988958 7771824 7596158 7622240 7512289 7137471 7175948 6993515 7294590 6980738
14112F980738k94531L0527J14370j32435q9699k20500J70992l25414k6621q9375
$$ 6980738 6686207 6716734 6831104 6698669 6608970 6388470 6559462 6234048 6207427 6118052
14102F118052J8130r9931q3396K1296m23279N6556m1668j05807l8170K30237j80750
$$ 6118052 6136182 6036251 5952855 5974151 5550872 5607428 5565760 5459953 5421783 5652020 5471270
14091E471270p0737l49321R3881M1478k09403M8595j05708K67840j95406k51238
$$ 5471270 5400533 5051212 5145093 5186571 4977168 5025763 4920055 5187895 4992489 4741251
14081D741251k2145l7518l7108j59639L58804n18524J99907o8021q0015O1576
$$ 4741251 4719106 4681588 4644480 4484841 4843645 4325121 4525028 4457007 4376992 4438568
14071D438568N2434R9592n11177L28769q3742m43703p9316J62462j94855L55857
$$ 4438568 4491002 4590594 4079417 4408186 4324444 3880741 3801425 3963887 3769032 4124889
14061D124889p6857q9881l61013M82203j47522l5350l55741J47373n0593j55957
$$ 4124889 4048032 3958151 3597138 4079341 3931819 3896469 3540728 3688101 3637508 3481551
14051C481551K89738l27203J29446j47058k45565K82659j61021J07808o5965k37003
$$ 3481551 3771289 3444086 3573532 3426474 3180909 3463568 3302547 3410355 3344390 3107387
14041C107387p1887L96335Q3396l92513J20100m17804L60165j81201J52819j70553
$$ 3107387 3035500 3431835 3515231 3122718 3242818 2825014 3185179 3003978 3156797 2986244
14031B986244j32835K66074j99022l5580K1263k307N369k97611J41511l4003j2083
$$ 2986244 2853409 3119483 2920461 2884881 2906144 2903837 2909206 2611595 2753106 2719103 2707020
14020B707020l07863M95384k05135l01940J61816M4526J60841o4909k37522J33941
$$ 2707020 2399157 2894541 2689406 2387466 2549282 2593808 2754649 2689740 2452218 2586159
14010B586159R4582n26420O18740n12684J08255l02552K13361l89217K94428Q8647
$$ 2586159 2680741 2154321 2773061 2260377 2368632 2066080 2279441 1890224 2184652 2273299
14000B273299o4900j47819J58531j50465o1773n2711N06342j06780N1917p7783
$$ 2273299 2208399 2060580 2219111 2068646 2006873 1954162 2460504 2353724 2405641 2327858
13990B327858O68912M91357K807832O674480J5815246J2224649j5873866j0850920
$$ 2327858 2996770 3488127 6295959 12970439 28785685 41010334 25136468 14285548
13982A4285548n356859k438563j370080o57878q96531k48761k15461l50224J75218
$$ 14285548 8928689 6490126 5120046 4462168 3565637 3316876 3101415 2751191 2926409
13973B926409l873P2977j53589m48373J00311J4091L836k02958M6931R7465m64664
$$ 2926409 2922536 2995513 2841924 2393551 2493862 2507953 2511789 2308831 2355762 2453227 1988563
13962A988563M17084j89006l8645l18794Q1872M25520l13040J03786q4990m01312
$$ 1988563 2405647 2216641 2177996 1859202 1941074 2366594 2053554 2157340 2072350 1671038
13952A671038K7230L52598k0630l44388L06807j13743l23129L08077j87951J75159
$$ 1671038 1698268 2050866 2030236 1685848 1992655 1878912 1555783 1863860 1675909 1851068
13942A851068k38564p3178L09034k14279k97175M17009p877P0172P5368m14725
$$ 1851068 1612504 1539326 1848360 1634081 1336906 1753915 1746038 1816210 1891578 1476853
13932A476853L97240j81547m0858N5867j60504O0489L15041l51227K0064l93207
$$ 1476853 1874093 1692546 1651688 1707555 1547051 1607540 1922581 1571354 1591418 1198211
13922A198211J94633O9878k55697J46966J32242p3320K13985l50879K77919J03702
$$ 1198211 1392844 1462722 1207025 1353991 1486233 1412913 1626898 1276019 1553938 1657640
13912A657640k58013L1846j61767K15107k53122J28448N1532O8283k17922J56245
$$ 1657640 1399627 1431473 1269706 1484813 1231691 1360139 1411671 1479954 1262032 1418277
13902A418277q0208m0262j37394K55034k23649L64880k56242K21981j40058J22391
$$ 1418277 1338069 1297807 1160413 1415447 1191798 1556678 1300436 1522417 1382359 1504750
13892A504750j33320J74386j71504K2026k35335L66173k44306l05550M02688k19642
$$ 1504750 1371430 1545816 1374312 1396338 1161003 1527176 1282870 977320 1380008 1160366
13882A160366k42563J85519J58760k04903J70327J19842l95920Q993J20642o689
$$ 1160366 917803 1103322 1262082 1057179 1227506 1347348 951428 960421 1081063 1074374
13872A074374j23748N05478l79112p8659J32350k61661L57442j85121l20620M48379
$$ 1074374 950626 1456104 1076992 998333 1130683 869022 1226464 1041343 720723 1169102
13862A169102m904J69476j76698j34136K14954m4978k36919P2334k4976Q1328
$$ 1169102 1164198 1333674 1156976 1022840 1237794 1192816 955897 1028231 1003255 1084583
13852A084583k964j67754l7784N5483J72162p4202l04024Q5580l6083K26673k95322
$$ 1084583 1081619 913865 876081 931564 1103726 1029524 725500 811080 774997 1001670 706348
13841G06348L20946r8995j18574J26075K31426k73051j14923K4972P240p4751
$$ 706348 1027294 928299 809725 935800 1167226 894175 779252 804224 811464 736713
13831G36713L57331n10230Q2753K94556m03442L29921J14563l05775L15801j9261
$$ 736713 1094044 583814 666567 961123 557681 887602 1002165 696390 1012191 992930
13821I92930k86893J76545j09573K85921D96450M51399k84904J09100K4875P3490
$$ 992930 706037 882582 773009 1058930 496450 947849 662945 772045 796920 870410
13811H70410L75456n28395K37421k29354k19529M64150Q8011k73620J5133K7410
$$ 870410 1245866 717471 954892 725538 506009 970159 1058170 784550 799683 827093
13801H27093j23491k11711M95076j62174K2419k23709K70628n0822K65095C36071
$$ 827093 703602 491891 986967 824793 847212 623503 894131 843309 1108404 336071
13790H08898j64038L100K77819k93932J75289o2519K22741l40399M5483r0702
$$ 808898 644860 647960 925779 631847 807136 744617 967358 626959 672442 581740
13780E81740M08742j9394j00110k98150Q5106j3816n9586K0362J85827C06396
$$ 581740 990482 971088 870978 572828 657934 644118 584532 604894 790721 306396
13769F67448P1417C24885L23805N29732D52753J56882J13245O2275J33513k40116
$$ 667448 738865 324885 648690 1178422 452753 609635 722880 785155 918668 678552
13759F78552j27141Q5941q7789j54104J06250L93563l47512L74766D49853J21797
$$ 678552 551411 637352 549563 395459 501709 895272 547760 922526 449853 571650
13749E71650L39976p4267l42288K11445K946n1718K50275j06114j7483j49529
$$ 571650 911626 837359 495071 706516 709462 657744 908019 801905 784422 634893
13739F34893K9038O5105k40157j81977L18499n129Q0125m2987k7564J39925l45106
$$ 634893 663931 729036 488879 306902 625401 620272 700397 657410 629846 769771 424665
13728D24665J99818J9415k1439m8370J2802O5602K71674k83513K1850j27045J40750
$$ 424665 624483 643898 622459 574089 586891 652493 924167 640654 662504 535459 676209
13717F76209r0744k34317L12509j78843Q3680M662O4166Q914j79594J05656P8905
$$ 676209 585465 351148 663657 484814 568494 573156 637322 646236 466642 572298 651203
13706F51203C16161L38672J20768k61539R6805j11327J46475j18325J6442p8201
$$ 651203 316161 654833 775601 514062 610867 499540 646015 527690 544132 465931
13696D65931L43818l38297N7632K6976K8372B43083J90826K15969K4605k19310
$$ 465931 809749 471452 529084 556060 584432 243083 433909 649878 674483 455173
13686D55173B26909M19413K9931C29621O5073o8432J73268j39670Q564L25672
$$ 455173 226909 646322 676253 329621 394694 326262 499530 359860 368424 694096
13676F94096j84046J15187j02878M3708J28241j25338B32767J06385L77853C35299
$$ 694096 510050 625237 522359 566067 694308 568970 232767 339152 717005 335299
13665B91941L49034l3121j28663J73903C23362N35561k86672Q9409j42896j4618
$$ 291941 640975 607854 479191 653094 323362 858923 572251 661660 518764 504146
13655E04146L0501J2351k45804j39089J86568R8406j58225M58676l29212K51886
$$ 504146 534647 546998 301194 162105 348673 447079 288854 747530 418318 670204
13645F70204k98409A06356O21253l58097J47310j22520A01488K82491j36129J30404
$$ 670204 371795 106356 727609 369512 516822 394302 101488 383979 247850 378254
13635C78254K69858B51139L59786B44948N16963j57059A86565L14692A97060P2404
$$ 378254 648112 251139 610925 244948 761911 604852 186565 501257 197060 269464
13625B69464J36809A27314K79948K4085B15277m3984L38824j05947m4795A63943
$$ 269464 406273 127314 407262 431347 215277 171293 510117 404170 359375 163943
13614D95755k38754J67752j21423J91270B46234l2098N02326B30902J94781L54686
$$ 495755 257001 424753 303330 494600 246234 214136 716462 230902 425683 780369
13604G80369l57704K2934a1653B60508e95E22116H8728J07432J16106q5720j13219
$$ 780369 422665 445599 -11653 260508 -595 522116 88728 196160 312266 226546 113327
13593A13327L73998A40126K91321j72776A23661K8752L01536j93620K11287j52307
$$ 113327 487325 140126 431447 258671 123661 152413 453949 260329 471616 319309
13583C19309L55069E1654J72870L56600H4127K66369L04118k48452o6535J68362
$$ 319309 674378 51654 224524 581124 84127 350496 654614 406162 339627 507989
13573E07989j27239M6230o4406J0235M68A74705k9386O6581K4783k5611J83712
$$ 507989 380750 426980 362574 372809 373277 174705 145319 211900 236683 211072 394784
13562C94784N4644q160j62222P3838K29616k28572j05912N5626K84038D7205J85670
$$ 394784 449428 441268 279046 352884 582500 353928 248016 303642 587680 47205 232875
13551B32875m1661J94785l5945K04788q8964l4120j56656J72086m9441A17506
$$ 232875 191214 385999 350054 554842 465878 431758 275102 447188 397747 117506
13540B08437J93013A75693Q2410Q8251J94131A17716K36005K5357J45012k17044
$$ 208437 401450 175693 258103 346354 540485 117716 353721 379078 524090 307046
13530C07046q6005L09547A39152N1747M360L42664p6315j89479J25143N2089A95218
$$ 307046 221041 530588 139152 190899 195259 537923 461608 272129 397272 449361 195218
13518C03405j00035J38574m7998D564M12456A95873Q9539o1307a74482G4286M97714
$$ 303405 203370 341944 293946 4564 417020 195873 285412 224105 -174482 74286 572000
13507E72000B27440J33907H2628L29230I2645C7220O4243K51561r9594A22057
$$ 572000 227440 361347 82628 411858 92645 37220 101463 353024 253430 122057
13496E46275k34416j146j00969d8105B57674N622G8425J24828J33119r7681L08699
$$ 546275 311859 310713 209744 -48105 257674 263296 78425 203253 336372 238691 547390
13485E47390B50280N7573G7170L15715A59171L45812A91240K37825A35440K49120
$$ 547390 250280 307853 77170 392885 159171 504983 191240 429065 135440 384560
13475C84560J4110A56654k3145m4468J06040J72559M3786f1430C05774A8857K67727
$$ 384560 398670 156654 133509 89041 195081 367640 411426 -61430 305774 18857 286584
13464B86584j03125a07072A73371M0716J37560A60885L0916a26061B9627c7375
$$ 286584 183459 -107072 173371 214087 351647 160885 191801 -126061 29627 -37375
13453A08964k895m7287K40695A4183L44517h9314D87449A34493J28070r360q4753
$$ 108964 106069 58782 299477 14183 358700 -89314 487449 134493 262563 253203 168450
13442A68450L18210A10061J74965A24088L35854k10754d8894J0280B81044A39140
$$ 168450 486660 110061 285026 124088 459942 249188 -48894 -38614 281044 139140
13431a5566B24187n8892K4027K52847B16958G487c9083B38063K86212b9863H9359
$$ -15566 224187 165295 189322 442169 216958 7487 -39083 238063 524275 -29863 89359
13419D54143A90910J85285E5119L16989l9920J09838A64548D0803J52490K69994
$$ 454143 190910 376195 55119 372108 332188 442026 164548 40803 193293 463287
13409D63287H9574M1737J95202j51014b2241D607J09213n2057M68467D9952J30951
$$ 463287 89574 131311 326513 175499 -22241 4607 113820 61763 530230 49952 180903
13398A80903L05423A08492J2970m522K32885A63966n62D13O9707f2245I956J20284
$$ 180903 486326 108492 121462 116940 349825 163966 163404 413 70120 -62245 9956 130240
13386A30240N9088J09919A36512j0504C5793J88772J70594j43876C3962N99581
$$ 130240 189328 299247 136512 126008 35793 224565 395159 251283 33962 633543
13376F33543B15991K8296J2893q7591J63545M6815A77391G4634M23713I1771N0808
$$ 633543 215991 244287 257180 169589 333134 379949 177391 74634 498347 91771 142579
13365A42579c0071C59116L2464A50782J25695A35020r759Q2217K0459B8900J69485
$$ 142579 -30071 359116 391580 150782 276477 135020 125261 207478 227937 28900 198385
13354A98385F0405L20185K0659A25366J7649a66761B12529n5254L8922J87269
$$ 198385 60405 380590 401249 125366 143015 -166761 212529 157275 196197 383466
13344C83466K21336r9669j45914j29185J99576p5858A04740L01891A28472n019
$$ 383466 604802 505133 359219 230034 429610 353752 104740 406631 128472 123453
13334A23453D183J52628j4473K05498k9077E5835P7136J36069r5630l545J23182
$$ 123453 4183 156811 142338 347836 318759 55835 132971 269040 173410 169865 293047
13323B93047a4859B17091j1633M772I5928K12850A3957K41971p3146J43897b3354
$$ 293047 -14859 217091 205458 210230 95928 308778 13957 255928 182782 326679 -23354
13311a5182A05006b99251A60403L8010P4802C4469b53942A54941J49723f7692
$$ -15182 105006 -299251 160403 198413 273215 34469 -253942 154941 304664 -67692
13300B93694k5564J09375l6278j40985J25777j47717n2425L51979I8523F824d2881
$$ 293694 268130 377505 341227 200242 326019 178302 125877 477856 98523 6824 -42881
13288B94951j34318L073K04836a65783D6139A5109K27544D7693L80260p0247G2199
$$ 294951 160633 163706 368542 -165783 46139 15109 242653 47693 427953 357706 72199
13276i2434C3926J41036O6688E1796L03357I5699J54163m1014Q6440A39122P3863
$$ -92434 33926 174962 241650 51796 355153 95699 249862 208848 295288 139122 212985
13265B12985h1296b1171A16838J80194A9481a53149j6051B40641A03608K28028
$$ 212985 -81296 -21171 116838 297032 19481 -153149 -169200 240641 103608 331636
13255C31636j05799a77897c0175o2113H7174a36827I2069g278A99683K33390a27190
$$ 331636 225837 -177897 -30175 -92288 87174 -136827 92069 -7278 199683 433073 -127190
13243A67394K93095a1044B66784k1588J03808F1996C240a78191M1122A38299Q1365
$$ 167394 460489 -11044 266784 245196 349004 61996 3240 -178191 -137069 138299 219664
13232B19664a56098E7951a5794C01794j04919J74298b3532H1134O5371b0220B02137
$$ 219664 -156098 57951 -15794 301794 196875 371173 -23532 81134 146505 -20220 202137
13220I5909J02468a01490A41661m9533M4232b6779p1941A47336E2218j0409K64174
$$ 95909 198377 -101490 141661 92128 136360 -26779 -98720 147336 52218 41809 305983
13209C05983a13750A52735p5337b49217I5732b12941B27812f5293N940G6921d511
$$ 305983 -113750 152735 77398 -249217 95732 -212941 227812 -65293 -59353 76921 -4511
13197B12906K33729A91191I5219A8023P6072P7793o8052K5615K13613B2452A0872
$$ 212906 446635 191191 95219 18023 94095 171888 103836 129451 343064 22452 10872
13185A62167G4144N6358P3210M3155p9728C3075J59491m3547j4455Q7363n0947
$$ 162167 74144 130502 203712 246867 167139 33075 192566 149019 134564 221927 170980
13174A70980p4284P8606i1629M4102b1010C01233B3414I201J57365D6808Q7611
$$ 170980 96696 175302 -91629 -47527 -21010 301233 23414 9201 166566 46808 134419
13163A34419J97874a97862a7557A82486b07809a00084q2353O8152o5355B30815
$$ 134419 332293 -197862 -17557 182486 -207809 -100084 -182437 -114285 -179640 230815
13152f7165K4913G5973J76872c1991A39189K491M7501a87534A81743g662D6481
$$ -67165 -42252 75973 252845 -31991 139189 141680 189181 -187534 181743 -7662 46481
13140F3671L12533c0007M433B95388i7752B05959r3567P8526J58740A55221J37533
$$ 63671 376204 -30007 -25574 295388 -97752 205959 112392 190918 349658 155221 292754
13129B92754P1460A04912m9657O596K20336O0452e9246b0308k4395A86151E4833
$$ 292754 364214 104912 55255 61851 282187 342639 -59246 -20308 -44703 186151 54833
13117d2061B31634n9469e06486b43787P339A79321q4370J20999k5042e3002J7342
$$ -42061 231634 172165 -506486 -243787 -236448 179321 94951 215950 190908 -53002 -35660
13106c5660A93814m1072g1800C96968A79507J12018l4010I7101c2633M423B6695
$$ -35660 193814 152742 -71800 396968 179507 291525 257515 97101 -32633 -28210 26695
13094b35844H1486I80b14935O2203Q889D4566J33639A2179J03996c36646J64124
$$ -235844 81486 980 -214935 -152732 -143843 44566 178205 12179 116175 -336646 -172522
13083a72522j4715h1946B81565A6729Q0223L93876k16971F9979P8383J28111k1894
$$ -172522 -187237 -81946 281565 16729 96952 490828 273857 69979 148362 276473 254579
13072B54579J01794E5336d52397B1113J54833K07140o4057b8557C5045K45795
$$ 254579 356373 55336 -452397 21113 175946 383086 319029 -28557 35045 280840
13062B80840A33635C8547a62272j59178J26588C72818q6211a25055B748J28224
$$ 280840 133635 38547 -162272 -321450 -194862 372818 286607 -125055 2748 130972
13052A30972J88311a06668H9978c4437C95391c3355C44399A64236E5186K98221
$$ 130972 319283 -106668 89978 -34437 395391 -33355 344399 164236 55186 353407
13042C53407a31233d5487D6946J80595F9851A6049J05624P0135c62724J43222
$$ 353407 -131233 -45487 46946 227541 69851 16049 121673 191808 -362724 -219502
13032b19502A91276N8154j03550o0623C7151K42844N5823k4471a73185A0377L10588
$$ -219502 191276 249430 145880 85257 37151 279995 335818 311347 -173185 10377 320965
13021C20965j28114J93376A29575N2490L1705f8842A12347N264b43375i2023E6438
$$ 320965 192851 386227 129575 182065 213770 -68842 112347 117611 -243375 -92023 56438
13009C3995K60898A29040O5191A5011J95723b25013B39506g2856B15152g2497
$$ 33995 294893 129040 194231 15011 210734 -225013 239506 -72856 215152 -72497
12998A81261R5104a0137j15791q1790i6629B22005b1493C03677b92751B90783
$$ 181261 276365 -10137 -125928 -207718 -96629 222005 -21493 303677 -292751 290783
12987a01332O683L7986j48722A19470a02158j25922B90490I1957d7574b2544A46593
$$ -101332 -94649 -56663 -205385 119470 -102158 -228080 290490 91957 -47574 -22544 146593
12975b59471B49443p8522b8169D3137J16649j303j612G1992R9953L1541b42199
$$ -259471 249443 170921 -28169 43137 159786 158483 156871 71992 171945 203486 -242199
12963a19921A8158J72167O6481H9631O5654K0225A4974L5758a80809G6286b19694
$$ -119921 18158 190325 256806 89631 155285 175510 14974 50732 -180809 76286 -219694
12951g3732B24530F5993J1975J18929d9375k0185j68084k9035A3450J88433G1903
$$ -73732 224530 65993 77968 196897 -49375 -69560 -237644 -266679 13450 201883 71903
12939A61792J58315E3945Q4670a76399A24935n4599M5667h7657A50594b10430
$$ 161792 320107 53945 138615 -176399 124935 70336 116003 -87657 150594 -210430
12928f3992b4373k84273H0211a6870O474q1846A19613d249G2339k4544c8117G084
$$ -63992 -24373 -308646 80211 -16870 -10396 -92242 119613 -4249 72339 47795 -38117 7084
12915A50310C7933L43805E9001O5689h0207j5018H7958b19377F36044C17292H4426
$$ 150310 37933 381738 59001 124690 -80207 -95225 87958 -219377 636044 317292 84426
12903A29260a51170G2710c2763E1737b36760F4306M0764k1023c12851B08320P7427
$$ 129260 -151170 72710 -32763 51737 -236760 64306 105070 84047 -312851 208320 285747
12892B85747j34678n0660O416A5850b31772J15227l06692B91437A20828J90174
$$ 285747 151069 100409 106825 15850 -231772 -116545 -423237 291437 120828 311002
12882C11002k1639a13636C31857c1256B23195L3620c2485B81578K01118A33000
$$ 311002 289363 -113636 331857 -31256 223195 256815 -32485 281578 482696 133000
12871B51625m1264I9112a70897K8471G3563R3043K2821H501J47065A6839G904
$$ 251625 210361 99112 -170897 -142426 73563 166606 189427 8501 155566 16839 7904
12859a07406I3240e3645d172k66798P1195D5202J33230j6116K3387C0282b00749
$$ -107406 93240 -53645 -4172 -270970 -199775 45202 178432 162316 185703 30282 -200749
12847b4283C4557R0399f6168K7122D669L31103L6856c22475I6707b07564M0401
$$ -24283 34557 124956 -66168 -39046 4669 335772 372628 -322475 96707 -207564 -167163
12836a67163B8764p495L8039c7284F7664L07084i2555C28428E2958P5231D7594
$$ -167163 28764 21269 59308 -37284 67664 374748 -92555 328428 52958 128189 47594
12824b31797N3620A1671g9182A0649c79374J2695B33255e4690j54032O8768J7588
$$ -231797 -178177 11671 -79182 10649 -379374 -366679 233255 -54690 -208722 -139954 -122366
12813a22366G8000a99866k2568J03670k06138J50296L2501m5645C19642b45462
$$ -122366 78000 -199866 -222434 -118764 -324902 -174606 -142105 -187750 319642 -245462
12802C92817H2310J49408I6423m6021a42787O7296G6123k9631N4033I325c52823
$$ 392817 82310 231718 96423 50402 -142787 -75491 76123 46492 100525 9325 -352823
12790B63615a24745k62987E3284L0373Q0836A0504b0402C3804J648J06712F1307
$$ 263615 -124745 -387732 53284 83657 164493 10504 -20402 33804 35452 142164 61307
12778B02293o7812o4576e807A05089c5992O184A04649a00991G6277J12263a86877
$$ 202293 134481 69905 -5807 105089 -35992 -29808 104649 -100991 76277 188540 -186877
12766f7789m5048a8166C5809b9814A0292b27800J6827A43676L1211b02549C6731
$$ -67789 -112837 -18166 35809 -29814 10292 -227800 -210973 143676 174887 -202549 36731
12754C1230a3619o0480B713d4409E0129a04727L9556H5700d2322C00150f1535
$$ 31230 -13619 -74099 2713 -44409 50129 -104727 -65171 85700 -42322 300150 -61535
12742A0431K9947c8245H8725J82250I9147k9368J8217J36741G0587d7515K3416
$$ 10431 40378 -38245 88725 270975 99147 69779 87996 224737 70587 -47515 -24099
12731b4099I4845O8020G609K07780a28471H2793L7112c1350F7800d36055J36089
$$ -24099 94845 162865 7609 215389 -128471 82793 119905 -31350 67800 -436055 -299966
12720b99966k155A18417Q3264F7930h7907G4757B2100J16238F423c46662B72812
$$ -299966 -302121 118417 201681 67930 -87907 74757 22100 138338 6423 -346662 272812
12708A59234E860K77212A24226j0353J9803n9429J41386Q1135K78460g8514B82152
$$ 159234 5860 283072 124226 113873 133676 74247 215633 296768 575228 -78514 282152
12696A21218a00656m87011H2768J56434f612F2323a57740L2013a6960M082A15674
$$ 121218 -100656 -587667 82768 239202 -6612 62323 -157740 -125727 -16960 -12878 115674
12684D41137k03201f2765f672A66544G2962K04615a88479C77152F7182a49835
$$ 441137 237936 -62765 -6672 166544 72962 277577 -188479 377152 67182 -149835
12673g3144B30737p9716F4326P4228L7648E7182M4945b57929a1039H2321b2560
$$ -73144 230737 151021 64326 138554 176202 57182 102127 -257929 -11039 82321 -22560
12661b22186D80001f9557L0114A19365K01776e3680A17629A2834c0036k26432
$$ -222186 480001 -69557 -39443 119365 321141 -53680 117629 12834 -30036 -256468
12651b56468d442B21313j5019b9540C2034b12805H4591a93131f8138q3342F6938
$$ -256468 -4442 221313 206294 -29540 32034 -212805 84591 -193131 -68138 -151480 66938
12639A40062i6951A39111B6620P0826P0005L5337k464F7220L05086r2275j21658
$$ 140062 -96951 139111 26620 97446 167451 202788 200324 67220 372306 280031 158373
12628A58373L38681K2485B51354a7384q332p0914G39L75318I499J17860e8402
$$ 158373 497054 519539 251354 -17384 -25716 -96630 739 376057 9499 127359 -58402
12616A71656G3232h7306a0778o1249B9381a99790d869C92644A50083a19145b8598
$$ 171656 73232 -87306 -10778 -72027 29381 -199790 -4869 392644 150083 -119145 -28598
12604A26268m0861i0970C59282N5264A14767J83260J22327j64259H5702D0135
$$ 126268 85407 -90970 359282 414546 114767 298027 420354 256095 85702 40135
12593g4657B37472d6552A28011a2045B13453p831g515A12727n5208a45019A0941
$$ -74657 237472 -46552 128011 -12045 213453 205622 -7515 112727 57519 -145019 10941
12581c6966k59100J18691F2465h6652a2747F665K23714H0792b63305c1677m4383
$$ -36966 -296066 -177375 62465 -86652 -12747 6665 230379 80792 -263305 -31677 -76060
12570g6060c445I2714K808K5633b4245j43918B06953q5132a49673I4705P5279
$$ -76060 -3445 92714 95522 121155 -24245 -168163 206953 121821 -149673 94705 169984
12559A69984n734a50893G4091i3897L7242C5257a12783N3541A28620l3320D1228
$$ 169984 164250 -150893 74091 -93897 -56655 35257 -112783 -59242 128620 95300 41228
12547a58250k0644A69647A7483a7682k92748d6569o7594J0292F5415g579k10881
$$ -158250 -178894 169647 17483 -17682 -310430 -46569 -114163 -103871 65415 -7579 -218460
12536b18460B19404b08462D7284K8718a710A80767q3769b20542d1874A06140m7427
$$ -218460 219404 -208462 47284 76002 -1710 180767 96998 -220542 -41874 106140 58713
12525E8713a6787A076M3626O4888O9645a01914j18770B27646c8743j49561m2791
$$ 58713 -16787 1076 44702 109590 179235 -101914 -220684 227646 -38743 -188304 -231095
12514b31095c5563D33423b65183D2736K23134a88710J9231A21644m5092K27586
$$ -231095 -35563 433423 -265183 42736 265870 -188710 -169479 121644 76552 304138
12504C04138a70566A05898c131A30014a06044d2141I0895j8771a0670A02799f4646
$$ 304138 -170566 105898 -3131 130014 -106044 -42141 90895 72124 -10670 102799 -64646
12492a53500A18816M5439M5267c0664p6780K9590r1376P369E3244J06843b79559
$$ -153500 118816 164255 209522 -30664 -107444 -77854 -169230 -161861 53244 160087 -279559
12480b8518j65436A03569e2383B64555A31946J38637K4849e4902n265b0748r1676
$$ -28518 -193954 103569 -52383 264555 131946 270583 295432 -54902 -60167 -20748 -112424
12469a12424j67134a11295B6039J8682c601k679B24685m6398a49077M4700o993
$$ -112424 -279558 -111295 26039 44721 -3601 -6280 224685 178287 -149077 -104377 -111370
12458a11370E055R341a3503j30698A37684o6958b7310j71440B08650b47133K3656
$$ -111370 5055 14396 -13503 -144201 137684 70726 -27310 -198750 208650 -247133 -223477
12447b23477A9675a60050M7857k13669A03839a44179O3395j6612j31912B58832
$$ -223477 19675 -160050 -112193 -325862 103839 -144179 -80784 -97396 -229308 258832
12436d16475A89847g9821K3019A7295L6478P7649c4915H7403h433E7492A319b6884
$$ -416475 189847 -79821 -56802 17295 53773 131422 -34915 87403 -8433 57492 1319 -26884
12423C5909a91800l2287k24070c4315p5797k1844B54305b79148A16448a89139
$$ 35909 -191800 -224087 -448157 -34315 -110112 -131956 254305 -279148 116448 -189139
12412A19874A2841i5435E2600a91739I1331b16210l5274e0217F4392j9746a96259
$$ 119874 12841 -95435 52600 -191739 91331 -216210 -251484 -50217 64392 44646 -196259
12400B78712a16541n6427d8239j07683A73607n0855n2237i9873G8843K57584d16856
$$ 278712 -116541 -172968 -48239 -155922 173607 122752 70515 -99873 78843 336427 -416856
12388a89486D39862A91480b3321K450p7816c1560B16337M0215a39424l6844A46401
$$ -189486 439862 191480 -23321 -20871 -98687 -31560 216337 256552 -139424 -176268 146401
12376D5860a65440M4762B57571b16613j2711k71085C82746H1794M4263b74938
$$ 45860 -165440 -120678 257571 -216613 -229324 -500409 382746 81794 126057 -274938
12365C55136A39160b36989B77360o1548D6561J17073a06811F0928L20357A59631
$$ 355136 139160 -236989 277360 215812 46561 163634 -106811 60928 381285 159631
12354A87255n0036a89445L8522C18562A9590d7128j63353a3031j6717j33601j4383
$$ 187255 137219 -189445 -150923 318562 19590 -47128 -210481 -13031 -29748 -163349 -177732
12343a77732J8633d3254A31035b27652A38031c3167j72567C49465F4860J58988
$$ -177732 -159099 -43254 131035 -227652 138031 -33167 -205734 349465 64860 223848
12333B23848b3969l49315D4860J10196a40426A74291P1622G451L2403b94242a41018
$$ 223848 -23969 -373284 44860 155056 -140426 174291 245913 7451 39854 -294242 -141018
12321C1962h2177C74308d8583C160b19468A6883N2451d2678a3152k61959C5880
$$ 31962 -82177 374308 -48583 3160 -219468 16883 69334 -42678 -13152 -275111 35880
12309b30633A69371Q0525c0707D3119b19843J02262j35241A80603i6674F599a71452
$$ -230633 169371 249896 -30707 43119 -219843 -117581 -252822 180603 -96674 6599 -171452
12297B73321a15461A66122p7500E236b10659Q0573k505C36880n8345n7357g3584
$$ 273321 -115461 166122 88622 5236 -210659 -130086 -132591 336880 278535 221178 -73584
12285A5889J34162k7402b98797J44098e6962b013j39638B82775h2877A02918O6300
$$ 15889 150051 122649 -298797 -154699 -56962 -2013 -141651 282775 -82877 102918 169218
12274A69218F099K73293N9877H905J00730a06502B07489C9817K71223b30A3146
$$ 169218 6099 279392 339269 8905 109635 -106502 207489 39817 311040 -230 13146
12262B09925K56460f3527A39076J94428a57774A52794h8897B70690d4132j67789
$$ 209925 466385 -63527 139076 333504 -157774 152794 -88897 270690 -44132 -211921
12252b11921c0381A73891K7295a00867A46176E4642N1171K4563M47e2117A26146
$$ -211921 -30381 173891 201186 -100867 146176 54642 105813 130376 130823 -52117 126146
12240C68475H0242h3103D26843a54160D9239J832J69701a36685A45011l7789e6518
$$ 368475 80242 -83103 426843 -154160 49239 51071 220772 -136685 145011 107222 -56518
12228b20934A7765e4790C62064b29019C9949A6090K63335F3497A2962J42766J2346
$$ -220934 17765 -54790 362064 -229019 39949 16090 279425 63497 12962 155728 168074
12217A68074F3653J27211K3682P5278D4310c0912C13606H7305a33699d7674B34855
$$ 168074 63653 190864 214546 289824 44310 -30912 313606 87305 -133699 -47674 234855
12205A02556f4073G3526Q6228J07128O4234G8755R7859P9705a54159A20100O2199
$$ 102556 -64073 73526 159754 266882 331116 78755 176614 256319 -154159 120100 182299
12194A82299R1593b5619A87822K1530E4244a31073F583J23372o2011f937A2063
$$ 182299 273892 -25619 187822 209352 54244 -131073 6583 129955 67944 -6937 12063
12182d0686C1766J34195A3773J74050o0706c35354A05805I420P1939L6773J29215
$$ -40686 31766 165961 13773 187823 127117 -335354 105805 9420 81359 118132 247347
12171B47347A03367A6454a5693F0655G443J36216a10474E9336c77m2435B5355
$$ 247347 103367 16454 -15693 60655 7443 143659 -110474 59336 -377 -42812 25355
12159A22128K82063A14004h079k894j50729d6147B81176a26494B13440a57259
$$ 122128 404191 114004 -8079 -10973 -161702 -46147 281176 -126494 213440 -157259
12148c835j62668N6234C43823B6842a94029j52543a16642j4582J7018B8383J04648
$$ -3835 -166503 -110269 343823 26842 -194029 -346572 -116642 -131224 -114206 28383 133031
12137A33031a5255j59874e7988E4091K90980j27598a32390f704A99421b08297
$$ 133031 -15255 -175129 -57988 54091 345071 217473 -132390 -6704 199421 -208297
12126b58464B35291P915A06472D9639B4306P1869b76584B97620j36825A6911h6631
$$ -258464 235291 243206 106472 49639 24306 96175 -276584 297620 160795 16911 -86631
12114B63540b31637A20570K61994D3663R910P2256e6055q4424l1762A83562j4865
$$ 263540 -231637 120570 382564 43663 53573 125829 -56055 -140479 -172241 183562 168697
12103A68697i1159A77451b63133d5681I3765L78050h5225j04370B39811A8371
$$ 168697 -91159 177451 -263133 -45681 93765 471815 -85225 -189595 239811 18371
12092A39796b45182a18997B05719c04704C1094R2102b18364b017q9907m7831e307
$$ 139796 -245182 -118997 205719 -304704 31094 123196 -218364 -2017 -91924 -139755 -5307
12080A03835m2729B7950b17122m7382M1884G8655b07789D01461f6640B89336G8832
$$ 103835 61106 27950 -217122 -264504 -222620 78655 -207789 401461 -66640 289336 78832
12068G94086P79650E42780k62669Q3198a5023A29370j4709a67421j3832A35021
$$ 794086 1573736 542780 280111 363309 -15023 129370 114661 -167421 -181253 135021
12057A67199D6752d1018j62906A74064n6354a51702A53966A3630m384a38443A76108
$$ 167199 46752 -41018 -203924 174064 117710 -151702 153966 13630 9246 -138443 176108
12045H1909a94588I3091C9022R4930A7300a47646m3085B62705c93634a38364B1796
$$ 81909 -194588 93091 39022 133952 17300 -147646 -190731 262705 -393634 -138364 21796
12033a07216A10759L84354A27001a7870m78701B77899f7161F9518a04493K2342
$$ -107216 110759 495113 127001 -17870 -496571 277899 -67161 69518 -104493 -82151
12023h2151B8736j3655b24440I293g9224D7936g46C81296A11331N9263a22374
$$ -82151 28736 15081 -224440 9293 -79224 47936 -746 381296 111331 170594 -122374
12011a78013A69608b02948B79966j23140E5893b97376e470j06116J495c4589q7615
$$ -178013 169608 -202948 279966 156826 55893 -297376 -5470 -111586 -110091 -34589 -122204
12000a22204k19385a15814A23458a25235n8263B02035d3124E8884a76909g9195
$$ -122204 -341589 -115814 123458 -125235 -183498 202035 -43124 58884 -176909 -79195
11989a87414B27397G9796h3036c7828H9583c35162L137j17525g4951B9795i8063
$$ -187414 227397 79796 -83036 -37828 89583 -335162 -332025 -449550 -74951 29795 -98063
11977a04276q2215A27372a16018I6010b01248A56070g38942E4387J54074m1288
$$ -104276 -186491 127372 -116018 96010 -201248 156070 -738942 54387 208461 167173
11967A67173i4666B1288e6188C08795c32479c0117B9481M2827J9045O2094O1408
$$ 167173 -94666 21288 -56188 308795 -332479 -30117 29481 72308 91353 153447 214855
11956B14855a04448E7018i3704A59274j8755a40823B9382a98050k12776E5351
$$ 214855 -104448 57018 -93704 159274 140519 -140823 29382 -198050 -410826 55351
11945G3887a76061a6962l62700A06136a16179j76466A95497q52J34926D0009A1675
$$ 73887 -176061 -16962 -379662 106136 -116179 -292645 195497 194645 329571 40009 11675
11933A08692c70377h7177E8878A0297B268P1863B460K5312a56334j8563A66747
$$ 108692 -370377 -87177 58878 10297 2268 74131 2460 27772 -156334 -174897 166747
11921a03896f578k32728A43306j1492J5404B3968b33754b6446o7234j44631G8055
$$ -103896 -6578 -239306 143306 131814 147218 23968 -233754 -26446 -93680 -238311 78055
11909B78446h8610A64440b2455C29426a34943F021L15205b57346K0577B35893
$$ 278446 -88610 164440 -22455 329426 -134943 6021 321226 -257346 -236769 235893
11898a25790j20962B0628J00439C7710J94176a17249N3417j3305A23415b00525
$$ -125790 -246752 20628 121067 37710 231886 -117249 -63832 -77137 123415 -200525
11887h4533j03670G8731P0502J44028b9824A2392b60248H1920N537R3105L5141
$$ -84533 -188203 78731 149233 293261 -29824 12392 -260248 81920 87457 180562 215703
11876B15703h8881q0500E0133K3122J90083o2649a9917m1957j6043h890A0917
$$ 215703 -88881 -169381 50133 73255 263338 200689 -19917 -61874 -77917 -8890 10917
11864h779k7716A06813b9241H8177a7002j23586B8322e3611I5923i1024j33p7881
$$ -8779 -36495 106813 -29241 88177 -17002 -140588 28322 -53611 95923 -91024 -91157 -169038
11852a69038A86463d9782j16920k1586N5831c9599J0964m3433j02675A33617b61498
$$ -169038 186463 -49782 -166702 -188288 -132457 -39599 -28635 -72068 -174743 133617 -261498
11840i8034m0773A35371m0934i6262j44811R850a01163J5492a3399k24171M8253
$$ -98034 -138807 135371 94437 -96262 -241073 -231223 -101163 -85671 -13399 -237570 -189317
11829a89317B8030d4816j43487a3070j58477K4405G3861J43400b11479o849e5079
$$ -189317 28030 -44816 -188303 -13070 -171547 -147142 73861 217261 -211479 -218328 -55079
11817a95203M7312d8834l3519A69994i5094m2660B8359b71534A91605b03959h8779
$$ -195203 -147891 -48834 -82353 169994 -95094 -137754 28359 -271534 191605 -203959 -88779
11805b22102H9782h351B52068D4588M8626K08467F4723J30714a78637F2709e4654
$$ -222102 89782 -8351 252068 44588 93214 301681 64723 195437 -178637 62709 -54654
11793A68700B315L2352a29377A84134p5960a12419A25125c15401a23869r6912
$$ 168700 2315 34667 -129377 184134 108174 -112419 125125 -315401 -123869 -220781
11783b20781C1843D792J85145h6802l201m6354A19013N0161a87372b1044l689
$$ -220781 31843 4792 189937 -86802 -90003 -136357 119013 169174 -187372 -21044 -24733
11772b4733j28382C33060j09651b73912A06246O8708d29896A24281g0967n9000
$$ -24733 -153115 333060 223409 -273912 106246 174954 -429896 124281 -70967 -129967
11762a29967B51368a2793B3822K09648j03223b72880b2848k01674B85743c1774
$$ -129967 251368 -12793 23822 233470 130247 -272880 -22848 -224522 285743 -31774
11751G5898a60027C34645A28607a1218j23938e0032j0075k04646a09578D8719
$$ 75898 -160027 334645 128607 -11218 -135156 -50032 -60107 -264753 -109578 48719
11740d1427B69142A02765Q3848a270p055j68086c884a771m8648j2869k25880g9862
$$ -41427 269142 102765 186613 -1270 -8325 -176411 -3884 -1771 -50419 -63288 -289168 -79862
11727A85923b99039a17050M3043B52216G9788J79799D6815P8787J32921I3568
$$ 185923 -299039 -117050 -74007 252216 79788 259587 46815 125602 258523 93568
11716a85151C8435A8240b35611a5784A00810c14247F0647L5144f5482I4911J4005
$$ -185151 38435 18240 -235611 -15784 100810 -314247 60647 95791 -65482 94911 108916
11705A08916D5992b04735L3785A59687p2983a48715M3709M9593F8313b46213m3453
$$ 108916 45992 -204735 -170950 159687 86704 -148715 -105006 -55413 68313 -246213 -289666
11694b89666A14998M26661A32095D1675J06939L4809b9376B72412b60613A70022
$$ -289666 114998 541659 132095 41675 148614 183423 -29376 272412 -260613 170022
11683b4394A50078M5565K8853E7581J25406J24699N1446A66585k7291C3971L81122
$$ -24394 150078 195643 224496 57581 182987 307686 359132 166585 139294 33971 415093
11672D15093j5929a66379c2475D8845O8393K1016a43801r0445A10965I689a33575
$$ 415093 399164 -166379 -32475 48845 117238 138254 -143801 -234246 110965 9689 -133575
11660A09776c0952p1992j04545e9273B9595J67258g8124A43445a76134j61952
$$ 109776 -30952 -102944 -207489 -59273 29595 196853 -78124 143445 -176134 -338086
11650c38086c6255d318r1274A20927L3520b8345C5735b32133a14634l29470A13389
$$ -338086 -36255 -4318 -95592 120927 154447 -28345 35735 -232133 -114634 -444104 113389
11638a83017j62434G6097g8941B54253a48742A35472j6007a50359M9133j1796
$$ -183017 -345451 76097 -78941 254253 -148742 135472 119465 -150359 -101226 -113022
11628a13022h046A27061h5817h665A25843L93694B35107q2178a17669D3256j7581
$$ -113022 -8046 127061 -85817 -8665 125843 519537 235107 152929 -117669 43256 25675
11617B5675b51440A33256j1349K10944f243p9047m5599A13745d5585A29814K38956
$$ 25675 -251440 133256 121907 332851 -6243 -85290 -130889 113745 -45585 129814 368770
11606C68770b2806G1405K29507b35633d155F0632N4210C6485o510K08027m2032
$$ 368770 -22806 71405 300912 -235633 -4155 60632 114842 36485 29975 238002 195970
11595A95970b76922B11977a02675l69450B27021K29952A49652E9362O2674b8334
$$ 195970 -276922 211977 -102675 -472125 227021 456973 149652 59362 122036 -28334
11584A31353B9047a92783E7158J41062n7438E3055J69637a28492j2145j03409
$$ 131353 29047 -192783 57158 198220 140782 53055 222692 -128492 -140637 -244046
11574b44046d4227C5553O0683J39497m9451a65860D0736J0317J39232l3284J32204
$$ -244046 -44227 35553 96236 235733 186282 -165860 40736 51053 190285 157001 289205
11563B89205A33850F137O1258b79811e3349F5602Q0000o3730L4564m7918K7213
$$ 289205 133850 6137 67395 -279811 -53349 65602 145602 81872 116436 68518 95731
11552I5731O8454F2980j8553a08920p8680A0728L3660Q0514E0364c19998A37511
$$ 95731 164185 62980 44427 -108920 -187600 10728 44388 124902 50364 -319998 137511
11540A32178j4005a93473A80955d801I1556Q021A9168c2529D28924d6916A02754
$$ 132178 118173 -193473 180955 -4801 91556 99577 19168 -32529 428924 -46916 102754
11528B94274r8808b28587j028I4711c9341A17363J15378I7201a5051j34610H9134
$$ 294274 195466 -228587 -229615 94711 -39341 117363 232741 97201 -15051 -149661 89134
11516A69049n6156J52565j17249L02086C1387K51359i8850B62574c2972H2172
$$ 169049 112893 265458 148209 450295 31387 282746 -98850 262574 -32972 82172
11505B95679I8718H281b01949A1451e2124j18366K6487B42686J30075f8748j36046
$$ 295679 98718 8281 -201949 11451 -52124 -170490 -144003 242686 372761 -68748 -204794
11494b04794A66656b7607B79846j34780b37689c4094q3183C55555m2238g6218
$$ -204794 166656 -27607 279846 145066 -237689 -34094 -117277 355555 313317 -76218
11483f5506r1976C72282n6784j30144J88096j02545j2C2817K54618c6905I7002
$$ -65506 -157482 372282 315498 185354 373450 270905 270893 32817 287435 -36905 97002
11471e520C540h5334A22347O6536q5340J04376a42859C92111a52855G9912b24121
$$ -5520 3540 -85334 122347 188883 103543 207919 -142859 392111 -152855 79912 -224121
11459A54405G0320b7985E1129J31678D3725J93701c4556i048C9406b17514P5033
$$ 154405 70320 -27985 51129 182807 43725 237426 -34556 -9048 39406 -217514 -142481
11448a42481A23441a22719C7188L2166a30223E9613i6384B36295H6010R838J35616
$$ -142481 123441 -122719 37188 69354 -130223 59613 -96384 236295 86010 95848 231464
11437B31464E5352c56815A67357B2313N7005h2386A43535l7035L5679q069b6129
$$ 231464 55352 -356815 167357 22313 79318 -82386 143535 106500 142179 134110 -26129
11425h394B6313O845K56253j00315h1291c3495A44420N8567F2572e1954b1304
$$ -8394 26313 33158 289411 189096 -81291 -33495 144420 202987 62572 -51954 -21304
11413B81178c00413A67156n4676a01125b0940A42151d6183j40105B5194f1115
$$ 281178 -300413 167156 112480 -101125 -20940 142151 -46183 -186288 25194 -61115
11402A63202a72522B99480b45043K0699j32553b67G1916o388H020c25895D3243
$$ 163202 -172522 299480 -245043 -224344 -356897 -267 71916 65528 8020 -325895 43243
11390a85932h6151A91603b28028d8833m5167q8801A963i7627A32919h2990B72927
$$ -185932 -86151 191603 -228028 -48833 -94000 -182801 1963 -97627 132919 -82990 272927
11378B5796J21271a29856N7329B15275e5188J0162j55757a6027j1462C94971d6701
$$ 25796 147067 -129856 -72527 215275 -55188 -45026 -200783 -16027 -27489 394971 -46701
11366a8096o7615c8538F8256L35220b30790B2191d5228j98724C8860J41341g435
$$ -18096 -85711 -38538 68256 403476 -230790 22191 -45228 -243952 38860 180201 -7435
11354C2183Q0567c50594I194R5482j9625b45609a20671l2006G2989j7854B0356
$$ 32183 112750 -350594 9194 104676 85051 -245609 -120671 -152677 72989 55135 20356
11342a56333j44744B22348b07327J348b0005F7977e2896B49778i0821C89971H5947
$$ -156333 -301077 222348 -207327 -205979 -20005 67977 -52896 249778 -90821 389971 85947
11330a7482B13935e8156m0400p2920r7664I6106J08009A5883h5658H7704j4319
$$ -17482 213935 -58156 -98556 -171476 -269140 96106 204115 15883 -85658 87704 73385
11319G3385R7348l4177R0311o2327q375a90990g2756L831j07582j00533B24698
$$ 73385 170733 136556 226867 164540 156165 -190990 -72756 -68925 -176507 -277040 224698
11307A13512A0796P5625o372J59682e1905D4876j7729c08338J22565j30751b657
$$ 113512 10796 86421 80049 239731 -51905 44876 27147 -308338 -185773 -316524 -2657
11295A9026a15452F122M7176a03749M5445K5431j40166E1972c09908O0816J15140
$$ 19026 -115452 6122 53298 -103749 -58304 -32873 -173039 51972 -309908 -249092 -133952
11284a33952I6066K88743b18156i4233A32636b44426p772q9811J10039I6e16778
$$ -133952 96066 384809 -218156 -94233 132636 -244426 -252198 -342009 -231970 96 -516778
11272B27352n9883m1445e12039h3242j32619d5495A23810f2748B4209b4656q6745
$$ 227352 167469 126024 -512039 -83242 -215861 -45495 123810 -62748 24209 -24656 -111401
11261a11401o8662A5734J5719a19221m7133B3232J95438f901j36622n9438g999
$$ -111401 -180063 15734 31453 -119221 -166354 23232 218670 -6901 -143523 -202961 -7999
11249a36540A86932h8238B57048G289J59450c4507n0397p939k2538J983H4053
$$ -136540 186932 -88238 257048 7289 166739 -34507 -84904 -92843 -115381 -113398 84053
11237A3685c04965I0668b07164A66269a44417f6568j7213A80989M7083a45394
$$ 13685 -304965 90668 -207164 166269 -144417 -66568 -83781 180989 228072 -145394
11226A3445a11844G621a81474F3648c50383a22350N716R066A8986i5204A9435
$$ 13445 -111844 7621 -181474 63648 -350383 -122350 -116634 -107568 18986 -95204 19435
11214A42684a59130J3020q1960g0825A83486b6808A03803a3403j80292A19637
$$ 142684 -159130 -146110 -228070 -70825 183486 -26808 103803 -13403 -193695 119637
11203B69217c6840k0754B5654a06395c2848r1651j96987a34145A083J2401L98315
$$ 269217 -36840 -57594 25654 -106395 -32848 -124499 -321486 -134145 1083 13484 411799
11192D11799a35560j08270C15695a38859B19917d87765d1511j71191j58416i016
$$ 411799 -135560 -243830 315695 -138859 219917 -487765 -41511 -212702 -371118 -9016
11181D2917K71747G7750J9419O262c7524l6754f679k65321J2963Q595A13360b23254
$$ 42917 314664 77750 97169 103431 -37524 -74278 -6679 -272000 -259037 -250442 113360 -223254
11168a44j20729c7428D34021a47439e5670F1118o609g3973a4466m8384j10730
$$ -144 -120873 -37428 434021 -147439 -55670 61118 54509 -73973 -14466 -62850 -173580
11157a73580f9951A56899c1437A87423a98505A41806e0901j81211d6621A09070
$$ -173580 -69951 156899 -31437 187423 -198505 141806 -50901 -232112 -46621 109070
11146G5236e0436J3598G2315K02252a68882f4853m1498A0395a2920A48139F7960
$$ 75236 -50436 -36838 72315 274567 -168882 -64853 -106351 10395 -12920 148139 67960
11134B838a55376b8794I4878L8311i6597d144k591j7684m4737j22946B74023n4193
$$ 2838 -155376 -28794 94878 133189 -96597 -4144 -6735 -24419 -69156 -192102 274023 219830
11122B19830F349J03334k9156F633J06621N9787P4487C7476A3336c02705A14278
$$ 219830 6349 109683 80527 6633 113254 173041 247528 37476 13336 -302705 114278
11110C18376b98357B38507A07510m0795a87415C57456A62188a50572D30139a0763
$$ 318376 -298357 238507 107510 66715 -187415 357456 162188 -150572 430139 -10763
11099b04880A91180J77890G5608d0808G7127Q6245J22859K561O2428A27303m5881
$$ -204880 191180 369070 75608 -40808 77127 163372 286231 288792 351220 127303 81422
11088H1422J07693L63471F5006K67647j62180a56E7524J69039k5607j00127M00854
$$ 81422 189115 552586 65006 332653 170473 -156 57524 226563 200956 100829 501683
11077E01683k04665k4555j4051j15382J32414I2992K80589p4790L24271j11986
$$ 501683 297018 272463 258412 143030 275444 92992 373581 298791 623062 511076
11067E11076n5634n4542j33337K0452m4304P0120L06226J99293l94726j66446
$$ 511076 455442 400900 267563 288015 243711 313831 620057 819350 424624 258178
11057B58178K91943k7987L22457j93832J3795m5690Q4282j71397K29175r1939
$$ 258178 550121 522134 844591 650759 664554 618864 703146 531749 760924 668985
11047F68985J91312O3041j80459J90071k55164J29412K57844k31335l13520K76510
$$ 668985 860297 923338 742879 932950 677786 807198 1065042 833707 520187 796697
11037G96697K4401l1558k82526P3351K0070N0175N8607j48681J74164k4967l1955
$$ 796697 821098 789540 507014 580365 600435 650610 709217 560536 734700 709733 677778
11026F77778M464J29134l1270k05543K1449J70614n9356J59639C40700M59775
$$ 677778 682242 811376 780106 574563 596012 766626 707270 866909 340700 800475
11016H00475j15300k20610M9894l9366j80773K09576j7591M34588m22808R8974
$$ 800475 685175 464565 514459 475093 294320 503896 486305 920893 498085 597059
11006E97059n6725R5538J65781o8709C28436N02599J38120j95476j0343p5972
$$ 597059 540334 635872 801653 732944 328436 831035 969155 773679 763336 687364
10996F87364j55075r8488M56740C33044K04357K13181n0874J28672J14534P2726
$$ 687364 532289 433801 890541 333044 537401 750582 699708 828380 942914 1015640
10986A015640j78193J21551m850J29611K82225m83393R3464J29937K02419q023
$$ 1015640 837447 958998 954148 1083759 1365984 882591 976055 1105992 1308411 1300388
10976A300388N65206K06811K65610J63002K37315k85411K84377j72643l44228
$$ 1300388 1865594 2072405 2338015 2501017 2738332 2452921 2737298 2564655 2220427
10967B220427R9971p06826N566l27717K93047J16286l7656K8435N254j95718L0176
$$ 2220427 2320398 1613572 1619138 1291421 1584468 1700754 1663098 1691533 1696787 1501069 1531245
10956A531245q8328k44531o8122K39127m04291j57135j4810k48838B59408K53071
$$ 1531245 1442917 1198386 1130264 1369391 965100 807965 793155 544317 259408 512479
10946E12479K1142j19620j12514K3184J4716A25562K15791A38696O3689K29832
$$ 512479 533621 414001 301487 324671 339387 125562 341353 138696 202385 432217
10936D32217f603A95091j1611p4664K38680A00732b6730A00792d9789j02971B4145
$$ 432217 -6603 195091 183480 108816 347496 100732 -26730 100792 -49789 -152760 24145
10924d6731B15612A06039K27617B0721i387k47279B28037d935G4112b10339e8036
$$ -46731 215612 106039 333656 20721 -9387 -256666 228037 -4935 74112 -210339 -58036
10912a12023E932J07468n5088k3977J7432a67496C79602C3793d0368L642l21709
$$ -112023 5932 113400 58312 34335 51767 -167496 379602 33793 -40368 -36726 -358435
10901c58435J30660C06164b64896k9902A5360a82952A560i8855n10086F5609N7638
$$ -358435 -227775 306164 -264896 -294798 15360 -182952 1560 -98855 -608941 65609 123247
10890A23247b89683b7937A49158d28951E8806g799j52460l8665B2409b25798j3131
$$ 123247 -289683 -27937 149158 -428951 58806 -7799 -160259 -198924 22409 -225798 -238929
10879b38929H3410c542p8231c1343q0241A96031a29915F1441a3942q4828o5949
$$ -238929 83410 -3542 -81773 -31343 -111584 196031 -129915 61441 -13942 -98770 -164719
10868a64719P337A05663a41621o7477d8681A14405a14617A72026E5323A6429J41128
$$ -164719 -157382 105663 -141621 -209098 -48681 114405 -114617 172026 55323 16429 157557
10857A57557J6126g2652l8289b5230C17797a99236Q6426C40403A26913c9064r7148
$$ 157557 173683 -72652 -110941 -25230 317797 -199236 -112810 340403 126913 -39064 -136212
10846a36212C08784g10C15546a31527b7106P831A31640J0479e6378j41711K6183
$$ -136212 308784 -710 315546 -131527 -27106 -19275 131640 142119 -56378 -198089 -171906
10835a71906l2437A98746G5965J11934f7145m3381j84029j6169J55290H169a13183
$$ -171906 -204343 198746 75965 187899 -67145 -110526 -294555 -310724 -155434 8169 -113183
10823B89388a18934j06702H9976b06828j28120a01476j25321a2433l43382A43792
$$ 289388 -118934 -225636 89976 -206828 -334948 -101476 -226797 -12433 -355815 143792
10812a72747g7150m0439l4688p5872g8203A43277K84822A02299b3929i973k52887
$$ -172747 -77150 -117589 -152277 -228149 -78203 143277 428099 102299 -23929 -9973 -262860
10801b62860K7333a10871b7182l4079B06117G3996J09442L5824f3813E2707b37729
$$ -262860 -235527 -110871 -27182 -61261 206117 73996 183438 219262 -63813 52707 -237729
10789a0886N217k84913d947A15770m8959J15939h8377D6705Q0094E8525a81699
$$ -10886 -5669 -290582 -4947 115770 66811 182750 -88377 46705 126799 58525 -181699
10777B4023J18860a05105n8687q61l3827c1505B22847b61904B15609h818D7992
$$ 24023 142883 -105105 -163792 -164653 -198480 -31505 222847 -261904 215609 -8818 47992
10765b29020n4099a2535A45803a50386A33036b41616n3923a42648c5283M002r6338
$$ -229020 -283119 -12535 145803 -150386 133036 -241616 -295539 -142648 -35283 -31281 -127619
10754a27619e9229k46707g3510c1805d09j86460B3735b37020Q9565D29534c0266
$$ -127619 -59229 -305936 -73510 -31805 -409 -186869 23735 -237020 -147455 429534 -30266
10742a02949H5145b88568A89545m7662b04496A92622J28900c3370B60301f159
$$ -102949 85145 -288568 189545 141883 -204496 192622 321522 -33370 260301 -6159
10731e6963n3919H6421i636B36258E0300J34915b2297G2813A7667J3311a21873
$$ -56963 -110882 86421 -9636 236258 50300 185215 -22297 72813 17667 30978 -121873
10719a68148j42681J37668A3181b88348E6233K9242b54432e9900J0850k14624
$$ -168148 -310829 -173161 13181 -288348 56233 85475 -254432 -59900 -49050 -263674
10709b63674A13192a94278Q5139q2899k61363E4675C220e0200E975N4669h5642
$$ -263674 113192 -194278 -109139 -192038 -453401 54675 3220 -50200 5975 60644 -85642
10697E1143b4120A42428h691j14663C00908b41501d1978j72158A85628E8193J7293
$$ 51143 -24120 142428 -8691 -123354 300908 -241501 -41978 -214136 185628 58193 75486
10686G5486b72997j00691a53947C1779a60684j18708g8371E0794L2392b28633
$$ 75486 -272997 -373688 -153947 31779 -160684 -279392 -78371 50794 83186 -228633
10675a36085f5406C56648a49440M4282M5304k44724f0923I5251b78700A15213
$$ -136085 -65406 356648 -149440 -105158 -59854 -304578 -60923 95251 -278700 115213
10664a7675j13381b2696A22479A1160M2530c11885L4906a18098d2799o3440a7718
$$ -17675 -131056 -22696 122479 11160 53690 -311885 -276979 -118098 -42799 -106239 -17718
10652a75196g4505O412F7530J40854a43050K3761j47404i1892G1313f4665C6720
$$ -175196 -74505 -68093 67530 208384 -143050 -119289 -266693 -91892 71313 -64665 36720
10640A12266n4348K7345a91263k221M0689F8336k6173h4999k30383C15087e0372
$$ 112266 57918 85263 -191263 -193484 -152795 68336 42163 -84999 -315382 315087 -50372
10628a4100m2354j5234j80423A983J4968i9512d2584j8744B2854g7643j66645
$$ -14100 -56454 -71688 -252111 1983 16951 -99512 -42584 -61328 22854 -77643 -244288
10617b44288e1380j18106e6406p2004D0935J30848B0290e4464q2323b7033n45183
$$ -244288 -51380 -169486 -56406 -128410 40935 171783 20290 -54464 -136787 -27033 -572216
10606e72216d8664B31332H7747a6979G3191J5368B1603f7500j55740B38464h3775
$$ -572216 -48664 231332 87747 -16979 73191 88559 21603 -67500 -223240 238464 -83775
10594b78138B28976A9417f5428l84625A91525a65128k02182M1195F8730a05001
$$ -278138 228976 19417 -65428 -450053 191525 -165128 -367310 -326115 68730 -105001
10583b45934B92191i1295J6908A17472Q2797O8921I3869M8139m701c21706j8803
$$ -245934 292191 -91295 -74387 117472 200269 269190 93869 142008 137307 -321706 -340509
10572c40509A90335j204b46988k24389J90573j48832a66335o223A90236c23621
$$ -340509 190335 189131 -246988 -471377 -280804 -429636 -166335 -172558 190236 -323621
10561f1195F1031J44956E2079h8629j29046H2966j6709b80632J34134M4624C17799
$$ -61195 61031 205987 52079 -88629 -217675 82966 66257 -280632 -146498 -101874 317799
10549f6526A80122a69036A23253e4642l233k69122C0308K67709b77576a25161
$$ -66526 180122 -169036 123253 -54642 -57875 -326997 30308 298017 -277576 -125161
10538a18326j64683I5238k7015a64588A9392J53534b24163g8366m8198p2541A67528
$$ -118326 -283009 95238 68223 -164588 19392 172926 -224163 -78366 -126564 -199105 167528
10526g0372A58956k9428b5077e967j00136A2082L2045R9482a95443A68441e6546
$$ -70372 158956 129528 -25077 -5967 -106103 12082 44127 143609 -195443 168441 -56546
10514a32322c9799n5928p9923K9119a5754B4238a56955K9377l6490A47230c9187
$$ -132322 -39799 -95727 -175650 -146531 -15754 24238 -156955 -127578 -164068 147230 -39187
10502H3727k5714R3179b88389Q6193l0190A37149n8793c62049A39945a1853j49883
$$ 83727 58013 151192 -288389 -202196 -232386 137149 78356 -362049 139945 -11853 -161736
10491a61736N3924B07923m8439J89219N9609A18588R6561j9620L30801L12177
$$ -161736 -107812 207923 159484 348703 408312 118588 215149 195529 526330 838507
10481H38507j05833C03286E2171J97692a77783M1106A21325f8474j05782L5328
$$ 838507 732674 303286 52171 249863 -177783 -136677 121325 -68474 -174256 -138928
10471a38928B56220h3144j9893M1071j10614E4291j7300i2209D1393J3822A9766
$$ -138928 256220 -83144 -103037 -61966 -172580 54291 36991 -92209 41393 55215 19766
10459A0510a36545D28160a70087d3195E5850b9013k2021J1588B40399j2392M3507
$$ 10510 -136545 428160 -170087 -43195 55850 -29013 -51034 -39446 240399 228007 271514
10448B71514b16533J00205D1384C517J53833G5924i9654j1346A0742e82230A08086
$$ 271514 -216533 -116328 41384 3517 157350 75924 -99654 -111000 10742 -582230 108086
10436a05390M8167k12634A34076N7759f4778j71309A1874c67582A10582J839Q2320
$$ -105390 -57223 -269857 134076 191835 -64778 -236087 11874 -367582 110582 112421 194741
10425A94741D0182h4789A00148A0793a28155q7388F000a00748A72480p2130B9696
$$ 194741 40182 -84789 100148 10793 -128155 -215543 6000 -100748 172480 100350 29696
10413b64959P2261A00662h4783a5097j46307A3211L0440b53863N6118E3595b7039
$$ -264959 -192698 100662 -84783 -15097 -161404 13211 43651 -253863 -197745 53595 -27039
10401a54057A49690h0121j0819A32032m0488b0053j16816F9722J33451J3287Q9860
$$ -154057 149690 -80121 -90940 132032 91544 -20053 -136869 69722 203173 216460 306320
10390C06320A07742A7575J7604P532h8712A18057J35096B7356b54248b5636D4544
$$ 306320 107742 17575 35179 42711 -88712 118057 253153 27356 -254248 -25636 44544
10378B36257m2251J47170j15477a10628D48626R363A35900J29638m2959L25092
$$ 236257 194006 341176 225699 -110628 448626 457989 135900 265538 222579 547671
10368E47671k05001P2893K18752j25892F3610K56497j46442R905p8003K08308
$$ 547671 342670 415563 634315 508423 63610 320107 173665 183570 105567 313875
10358C13875G8599k8411J04033a60401G6958j6562M37384J21818j00163k06499
$$ 313875 78599 50188 154221 -160401 76958 60396 497780 619598 519435 312936
10348C12936J51875A96254C6038N33685A48749M35887A59583J03116K03693B7810
$$ 312936 464811 196254 36038 569723 148749 584636 159583 262699 466392 27810
10337A95344K51583E6400M81037D5130L16963c5392B72380G2084L1107D3508J54090
$$ 195344 446927 56400 537437 45130 362093 -35392 272380 72084 103191 43508 197598
10326A97598a4332G3841J69830i0204A70843p1305J00479i5968m273C32740d5451
$$ 197598 -14332 73841 243671 -90204 170843 99538 200017 -95968 -100241 332740 -45451
10314A0381K97306h8229j65059A72422Q2326B4604f6761G2744A0846J28350n1590
$$ 10381 307687 -88229 -253288 172422 254748 24604 -66761 72744 10846 139196 87606
10303H7606b13234e5431A09657l7353a9016I7439K9832b57020r8545h261H8861
$$ 87606 -213234 -55431 109657 72304 -19016 97439 127271 -257020 -355565 -8261 88861
10291a76952n7705i2985C19530G5565e8527j68478i5861H9268f8939A37298d9713
$$ -176952 -234657 -92985 319530 75565 -58527 -227005 -95861 89268 -68939 137298 -49713
10279D2534a14538D1169K60217d39124a24333N4669A7322O636a09132k74007i8348
$$ 42534 -114538 41169 301386 -439124 -124333 -69664 17322 23958 -109132 -383139 -98348
10267f1586j45743A07348C1752J35038J62909C7244L43924J71374j26580D3411
$$ -61586 -207329 107348 31752 166790 329699 37244 381168 552542 425962 43411
10256F5299J31436J06476E746N8268J27650J19363C0803a77633F9540a40427d3756
$$ 65299 196735 303211 5746 64014 191664 311027 30803 -177633 69540 -140427 -43756
10244E0647b28102a13488k87958i2208q970A34730k3954a33954N1347F8208J41337
$$ 50647 -228102 -113488 -401446 -92208 -101178 134730 110776 -133954 -82607 68208 209545
10233B09545b0050A20170H594a90655R2578j81138F8428F686a280r3583M6300
$$ 209545 -20050 120170 8594 -190655 -98077 -279215 68428 6686 -1280 -94863 -48563
10222d8563q9892N2819E0562Q7456b43992A43706i0219I0110g6128A20062b41277
$$ -48563 -138455 -85636 50562 138018 -243992 143706 -90219 90110 -76128 120062 -241277
10210a02421j08446K4104N1057K2247d1023a3999A07003a53745A92497f0232p9144
$$ -102421 -210867 -186763 -135706 -113459 -41023 -13999 107003 -153745 192497 -60232 -139376
10199a39376e541l23569i6031c6449j02772d6514F8295a05724L1774A10270b06089
$$ -139376 -5541 -329110 -96031 -36449 -139221 -46514 68295 -105724 -73950 110270 -206089
10187i8083M0615B67984L5973b36283I7079P8537G8515J72779G0291a2403H629
$$ -98083 -57468 267984 303957 -236283 97079 175616 78515 251294 70291 -12403 8629
10175a57585A55366d0512C03044a97153C1718b25460A20154a8875A30868m2818
$$ -157585 155366 -40512 303044 -197153 31718 -225460 120154 -18875 130868 88050
10165H8050i4741o4335C11745A40077i4508K7413A95877A1953J18832c71069F165
$$ 88050 -94741 -159076 311745 140077 -94508 -67095 195877 11953 130785 -371069 6165
10153C0366b02696D307e24455A00588b52964o2481A74310e9422l16375a60790
$$ 30366 -202696 4307 -524455 100588 -252964 -315445 174310 -59422 -375797 -160790
10142f8259A7076f9203j19310i0700j62948k5565a07630b8451A04220a27015A63960
$$ -68259 17076 -69203 -188513 -90700 -253648 -279213 -107630 -28451 104220 -127015 163960
10130a47809A13877d6986H5276l3668J11784C4757O3983b96300J23655A69355
$$ -147809 113877 -46986 85276 51608 163392 34757 98740 -296300 -172645 169355
10119b73554J23026A96099b1253F6988g0510A14196K67606L8224c9999k6778F7380
$$ -273554 -150528 196099 -21253 66988 -70510 114196 381802 420026 -39999 -66777 67380
10107d9129A15864a29143A43391c11530A92984d14646A49057K4288B7250e2895
$$ -49129 115864 -129143 143391 -311530 192984 -414646 149057 173345 27250 -52895
10096a11851C18739d567j41640K8816B04648a17929j44910j9147C8736c3123B6108
$$ -111851 318739 -4567 -146207 -117391 204648 -117929 -262839 -281986 38736 -33123 26108
10084b02285f2418G1650i0242I912c7801k16432J06348A33343a44113E4311J38998
$$ -202285 -62418 71650 -90242 9912 -37801 -254233 -147885 133343 -144113 54311 193309
10073A93309f76189g8072G6503c24220G9327a89578A03094a62714A03236a38410
$$ 193309 -676189 -78072 76503 -324220 79327 -189578 103094 -162714 103236 -138410
10062a47367A50238K93482I1778a44826c2340C7860b94001a02702q537C1288b27353
$$ -147367 150238 443720 91778 -144826 -32340 37860 -294001 -102702 -111239 31288 -227353
10050b27333E6656J2065e7318d079j26066j2313B07236h9350l99989D52087a69346
$$ -227333 56656 68721 -57318 -4079 -130145 -142458 207236 -89350 -489339 452087 -169346
10038A3535J35982F9036N3660f2947A16657m9644L7592f7765J8109B7394a00681
$$ 13535 149517 69036 122696 -62947 116657 67013 104605 -67765 -49656 27394 -100681
10026d6887A36615a57119K4075d0052A08365d69352a99116g6341C5978a71686
$$ -46887 136615 -157119 -133044 -40052 108365 -469352 -199116 -76341 35978 -171686
10015D6580d5944A26626g708H4066a48273c3585B31071a07157I5094c67932B68772
$$ 46580 -45944 126626 -7708 84066 -148273 -33585 231071 -107157 95094 -367932 268772
10003b41687B10466g3781k16118q878K7461C1488d436C6416h2679D1750a7440
$$ -241687 210466 -73781 -289899 -298777 -271316 31488 -4436 36416 -82679 41750 -17440
9991D4368j6180c65871J69547i1287B51276A5347M7866g4339m9259I0840C9755
$$ 44368 28188 -365871 -196324 -91287 251276 15347 63213 -74339 -123598 90840 39755
9979c10411A39175b13001D3999a30258A57780f0073l4346L1443F8207b7398k33268
$$ -310411 139175 -213001 43999 -130258 157780 -60073 -94419 -62976 68207 -27398 -260666
9968b60666M6377Q1600A92132f9966P058m5445a9380C1052a21560A1047R5664
$$ -260666 -214289 -132689 192132 -69966 -62908 -108353 -19380 31052 -121560 11047 106711
9957A06711b5132F2696a2996n6609n6292k60808F1027a8574j24801f5175p6631
$$ 106711 -25132 62696 -12996 -69605 -125897 -386705 61027 -18574 -143375 -65175 -141806
9946a41806k2707d8576k61804I9477a56319H6159b81727J03081n2259h10l36753
$$ -141806 -164513 -48576 -310380 99477 -156319 86159 -281727 -178646 -230905 -810 -337563
9935c37563d8162l19783Q7552J21635A81849B8972a57618p6372c9732F213b57311
$$ -337563 -48162 -367945 -280393 -158758 181849 28972 -157618 -233990 -39732 6213 -257311
9923f6622E2302a45258k10282A64630c55314J43382C11875G6100i4180k38656
$$ -66622 52302 -145258 -355540 164630 -355314 -211932 311875 76100 -94180 -332836
9913c32836f4246j1495K1086F4590f7467l60309K08873P0986F5648Q8659a8475
$$ -332836 -64246 -75741 -54655 64590 -67467 -427776 -218903 -147917 65648 154307 -18475
9901a80205J9475M1022E5790J91709a09664A21036g9067a3713E2052m748b5495
$$ -180205 -160730 -119708 55790 247499 -109664 121036 -79067 -13713 52052 47304 -25495
9889i7572H897Q3139h6674K2118K8934n0152j52250J00322A1270K36446I8875
$$ -97572 8897 92036 -86674 -64556 -35622 -85774 -238024 -137702 11270 247716 98875
9877g8470j50726b4489k30896B2103B042a14831B7661g4581D8500K39010j6507
$$ -78470 -229196 -24489 -255385 22103 2042 -114831 27661 -74581 48500 287510 271003
9866B71003j26205e881k8644B70228a75415E313b3610l1176C00767a06405D994
$$ 271003 144798 -5881 -34525 270228 -175415 5313 -23610 -54786 300767 -106405 4994
9854A18676b67917B6484J92503h6408C02435c5127k0636k15692C69306f6110D88856
$$ 118676 -267917 26484 218987 -86408 302435 -35127 -55763 -271455 369306 -66110 488856
9842b09277G5616a51533A5298L590K1094R9037L9964b24403K3020k62758B06133
$$ -209277 75616 -151533 15298 18888 39982 139019 178983 -224403 -201383 -464141 206133
9830C827L0225R6133J32818h3854o6511j28923F3892b5476A30982d349B75096
$$ 3827 34052 130185 263003 -83854 -150365 -279288 63892 -25476 130982 -4349 275096
9818a00578B14401b33037A4972a77249r3007A56049P6431h6117j38473j90202
$$ -100578 214401 -233037 14972 -177249 -270256 156049 232480 -86117 -224590 -414792
9808d14792B31639a80713q3073b5373A73447k3288K49406f3082A12938D1271b39946
$$ -414792 231639 -180713 -263786 -25373 173447 150159 399565 -63082 112938 41271 -239946
9796E4435a68130A24571a64070G1880a71919B51739D2229j9959b44592C40368
$$ 54435 -168130 124571 -164070 71880 -171919 251739 42229 22270 -244592 340368
9785c12190B38797a95400i2518E6731J78567e31674D9275b35496I915a89486N3832
$$ -312190 238797 -195400 -92518 56731 235298 -531674 49275 -235496 9915 -189486 -135654
9774a35654A7274b9584l4831A77599a26552M0369j65618e3375j09268B37520p2830
$$ -135654 17274 -29584 -64415 177599 -126552 -86183 -251801 -53375 -162643 237520 164690
9763A64690b17058l0877a607F1033b74056j1340D2046c30403F0287C894i8215
$$ 164690 -217058 -247935 -1607 61033 -274056 -285396 42046 -330403 60287 3894 -98215
9751C994a8497j0755A16247n7467i3188K6463D3509a41720p7509J07814C15347
$$ 3994 -18497 -29252 116247 58780 -93188 -66725 43509 -141720 -219229 -111415 315347
9739g0826n5537K1713l28037h3468C1863A2027a13664k4900j04122c7249b550
$$ -70826 -126363 -104650 -432687 -83468 31863 12027 -113664 -138564 -242686 -37249 -2550
9727a47343A14417A7793M3335A6030c3174k0987F2398J50747d9863H1076J13013
$$ -147343 114417 17793 61128 16030 -33174 -54161 62398 213145 -49863 81076 194089
9716A94089G6314g1387q8474b1191k3784j62570g9557j95146L3889d1486k9173
$$ 194089 76314 -71387 -159861 -21191 -44975 -207545 -79557 -274703 -240814 -41486 -70659
9705g0659j39466F037c32100A51256a58874p8060B6853L3267h7057A75234m2565
$$ -70659 -210125 6037 -332100 151256 -158874 -236934 26853 60120 -87057 175234 132669
9694A32669c84087a70800G5780a57841H0655b13867M9274A206b26589C13098i6556
$$ 132669 -384087 -170800 75780 -157841 80655 -213867 -164593 1206 -226589 313098 -96556
9682a92321N8525G2855a24088F8698c24030J40695e6120k13124e9462C14375a10427
$$ -192321 -133796 72855 -124088 68698 -324030 -183335 -56120 -269244 -59462 314375 -110427
9670A53634e4744A25617B9586L0275b28146b7724D4900c0925k18742B40746a35142
$$ 153634 -54744 125617 29586 59861 -228146 -27724 44900 -30925 -249667 240746 -135142
9658A95467d1139A8953f3158j29229f9043j20921q2220h185j37513G391a14585
$$ 195467 -41139 18953 -63158 -192387 -69043 -189964 -272184 -8185 -145698 7391 -114585
9646a93044g2515a8761C1540a26585p5175A47590c03565B3159J1209a20389M2121
$$ -193044 -72515 -18761 31540 -126585 -201760 147590 -303565 23159 34368 -120389 -78268
9635g8268k30469E1035A3432O631h57j20043G8333J79016I1151J05059a91498
$$ -78268 -308737 51035 13432 20063 -857 -120900 78333 257349 91151 196210 -191498
9623A03224i6134n4174N5142J552K4043C2863c98601A73236F8805a0868A07154
$$ 103224 -96134 -150308 -95166 -93614 -69571 32863 -398601 173236 68805 -10868 107154
9611b55763j02101b8363A58782L286m753B7549M911b39962m2309a24521f0293
$$ -255763 -357864 -28363 158782 162068 157315 27549 32460 -239962 -282271 -124521 -60293
9599c31335g2631j15974p2457k2361A4388e7622j06041B10364H6860f5120j69289
$$ -331335 -72631 -188605 -261062 -283423 14388 -57622 -163663 210364 86860 -65120 -234409
9588b34409A80649b43924D7408b81668E9385r023f8391D60182a97248n8791d7409
$$ -234409 180649 -243924 47408 -281668 59385 50362 -68391 460182 -197248 -256039 -47409
9576a05896Q253D0448L14141A55349b77590a7089E9654b78369e9256k83325N2705
$$ -105896 -97643 40448 354589 155349 -277590 -17089 59654 -278369 -59256 -342581 -289876
9565b89876B2591M0592a4405j14914C38698b03808D654K02273c07727A65113F5226
$$ -289876 22591 63183 -14405 -129319 338698 -203808 4654 206927 -307727 165113 65226
9553H8534a13864m7239j82059A13669N8264h0880q906A96800c63408J76413L3091
$$ 88534 -113864 -161103 -343162 113669 171933 -80880 -89786 196800 -363408 -186995 -153904
9542a53904o7700d8170A33400c85314a40739O1599c226B08050L0691a55364o3400
$$ -153904 -221604 -48170 133400 -385314 -140739 -79140 -3226 208050 238741 -155364 -218764
9531b18764Q0314p0962M2696C1903a39300m961F6080a07257J5358k12557J07630
$$ -218764 -138450 -209412 -166716 31903 -139300 -144261 66080 -107257 -91899 -304456 -196826
9520a96826H3740R4319j3351A2469J55417E371a38517M0113b0134E2347N4151
$$ -196826 83740 178059 164708 12469 167886 5371 -138517 -98404 -20134 52347 106498
9509A06498a5792I8159g8534n6686G9330b26600C94477c52615I3231C560b21665
$$ 106498 -15792 98159 -78534 -135220 79330 -226600 394477 -352615 93231 3560 -221665
9497A70298d5739i934C60704f5321A85330c615E8587a92519N4206d9790k19779
$$ 170298 -45739 -9934 360704 -65321 185330 -3615 58587 -192519 -138313 -49790 -269569
9486b69569a02668F1058a02012b4032B29021B4538b65956g4390H27K378h5523
$$ -269569 -102668 61058 -102012 -24032 229021 24538 -265956 -74390 827 3205 -85523
9474e329k50421A20425f6768o424A00950b01317A65090b59063L4510I3845b59307
$$ -5329 -255750 120425 -66768 -73192 100950 -201317 165090 -259063 -224553 93845 -259307
9462a01359J7591k1776E3552a29874c9308A83408F2679k0718Q5887i0244h419
$$ -101359 -83768 -105544 53552 -129874 -39308 183408 62679 41961 127848 -90244 -8419
9450a49690A13956e4166j45446k52835b3956k38094d1591E0193a61323A0124a42560
$$ -149690 113956 -54166 -199612 -452447 -23956 -262050 -41591 50193 -161323 10124 -142560
9438C6636h2209A49102c5764B60718a09953m3315e2583l72A40215a36638O8302
$$ 36636 -82209 149102 -35764 260718 -109953 -153268 -52583 -52955 140215 -136638 -68336
9427f8336l5312E7807c22697i6737d3564k03196a01664j4484A52061i2525l1684
$$ -68336 -103648 57807 -322697 -96737 -43564 -246760 -101664 -116148 152061 -92525 -124209
9416a24209L0256q5872e0935C41230c12333g7233j21656A58332A4673L05960A59098
$$ -124209 -93953 -179825 -50935 341230 -312333 -77233 -198889 158332 14673 320633 159098
9404d5403m0679B9678i2513b6988b712p1833O197A46543J06730B2577i384m16530
$$ -45403 -86082 29678 -92513 -26988 -2712 -74545 -68348 146543 253273 22577 -9384 -425914
9392d25914h5187B48104a13386d5798j50033B23753A01306m5814K2975a27609
$$ -425914 -85187 248104 -113386 -45798 -195831 223753 101306 55492 78467 -127609
9381A64647d34712d0700k90088D075b00939B03526c25585C240a9343l4266r8469
$$ 164647 -434712 -40700 -330788 4075 -200939 203526 -325585 3240 -19343 -53609 -152078
9370a52078k5885f6317A04822G369a86538f0327k2190H0369l8296Q9515c3917
$$ -152078 -177963 -66317 104822 7369 -186538 -60327 -82517 80369 42073 131588 -33917
9358e8139p2282l7200j61122B65425b35907J6633O7582j2513B41664E9657a38785
$$ -58139 -130421 -167621 -328743 265425 -235907 -219274 -151692 -164205 241664 59657 -138785
9346b89288J9962D2248b25747c2099l32472B33919a07455E7536a1871l00038j786
$$ -289288 -269326 42248 -225747 -32099 -364571 233919 -107455 57536 -11871 -311909 -313695
9335c13695l7628F0040J44086c91344a80168f9436C53534b76926B31801A737c19845
$$ -313695 -351323 60040 204126 -391344 -180168 -69436 353534 -276926 231801 1737 -319845
9323b14419l6863A19528c49257J62009B9278L16386j43652a1720j37595f1777
$$ -214419 -251282 119528 -349257 -187248 29278 345664 202012 -11720 -149315 -61777
9312d83589c7563B31297g5988k7627D2671J6361J00979D5797O2675P3986b29168
$$ -483589 -37563 231297 -75988 -103615 42671 59032 160011 45797 108472 182458 -229168
9300B13320a14328k20248J13737B17364c49824a61157a967j46612O0237G0652
$$ 213320 -114328 -334576 -220839 217364 -349824 -161157 -1967 -148579 -88342 70652
9289b16752c4597A64599a96300g2110A42267a98152R5451H9884g6530o7800D1828
$$ -216752 -34597 164599 -196300 -72110 142267 -198152 -102701 89884 -76530 -144330 41828
9277b62648B34594a12004L0942l15357a0925j74064b4763j8002B12912E7493g896
$$ -262648 234594 -112004 -81062 -396419 -10925 -184989 -24763 -42765 212912 57493 -7896
9265d1053k93384J29238e1389a8474m0420A83504b57013B4943a13789p4112e0502
$$ -41053 -334437 -205199 -51389 -18474 -58894 183504 -257013 24943 -113789 -187901 -50502
9253B3945c38127g7754L7308o237k7833j316C64928b58561g7884F1542a00811
$$ 23945 -338127 -77754 -40446 -46683 -74516 -75832 364928 -258561 -77884 61542 -100811
9241d17051N9775A02778Q6720n4792P6309a96262f6631H1056b8026l3174j2509
$$ -417051 -357276 102778 189498 134706 211015 -196262 -66631 81056 -28026 -61200 -73709
9230g3709k19060i7223A00597g6736p0437B17174b76008J05016D28839B5471a14968
$$ -73709 -292769 -97223 100597 -76736 -147173 217174 -276008 -170992 428839 25471 -114968
9218B9460K90541f2058G2034B8149a38155B50971a10745m708F1982b14969I2777
$$ 29460 320001 -62058 72034 28149 -138155 250971 -110745 -115453 61982 -214969 92777
9206a2323k15407A86791L26301a18195l1378p882o4929B24483a17015B7325a90845
$$ -12323 -227730 186791 513092 -118195 -149573 -157455 -222384 224483 -117015 27325 -190845
9194C12516b05011G2997J47280c93845P5196A05075c1898B51808g388k18658C6211
$$ 312516 -205011 72997 220277 -393845 -318649 105075 -31898 251808 -7388 -226046 36211
9182a79834j6597A62791f8861j66309e2512E1124e9358F9458N6279b41980c5481
$$ -179834 -196431 162791 -68861 -235170 -52512 51124 -59358 69458 125737 -241980 -35481
9170a69134l13399e0942A67702e21200a1894m0692j11862j24693a4611k25178
$$ -169134 -482533 -50942 167702 -521200 -11894 -52586 -164448 -289141 -14611 -239789
9160b39789H310h7875D2896e1061A35181d22361A95348a80288h6099b188B63247
$$ -239789 8310 -87875 42896 -51061 135181 -422361 195348 -180288 -86099 -2188 263247
9148f6763j13775A03935b83421B99515m2120d6653F6375a37191A14328e6261E0125
$$ -66763 -180538 103935 -283421 299515 257395 -46653 66375 -137191 114328 -56261 50125
9136f5019C004a1695k12245M5174k19252a25699r1505g1690j58942H2631J11155
$$ -65019 3004 -11695 -223940 -178766 -398018 -125699 -217204 -71690 -230632 82631 193786
9125A93786c1076j8102a9667j06150j05422D62Q3311a36490e4427A16889I122
$$ 193786 -31076 -49178 -19667 -125817 -231239 462 83773 -136490 -54427 116889 9122
9113b89084i6235d5338k19629A6480d3484k50338G8550a32063n2907j8334l361
$$ -289084 -96235 -45338 -264967 16480 -43484 -293822 78550 -132063 -184970 -203304 -206665
9102b06665J00752L2142j54386D3919J20121i002j74798R1618B33538H059a38693
$$ -206665 -105913 -73771 -228157 43919 164040 -9002 -183800 -92182 233538 8059 -138693
9090A0879e615A95573k9230b1099I0873b63417D6452a14244b3066j04435l179
$$ 10879 -5615 195573 166343 -21099 90873 -263417 46452 -114244 -23066 -127501 -130680
9079a30680K636o8082j47586A8184N37619e6731j29549O0862a5388j64891A17310
$$ -130680 -128044 -196126 -343712 18184 555803 -56731 -186280 -125418 -15388 -180279 117310
9067c71590H4689Q6816b575j15920E9501R3826a34162H2626h5430A9220b04610
$$ -371590 84689 171505 -2575 -118495 59501 153327 -134162 82626 -85430 19220 -204610
9055a42107m17625K76699a06944A39013N0782f19D5522N5504a20303a9514G8166
$$ -142107 -559732 -283033 -106944 139013 189795 -619 45522 101026 -120303 -19514 78166
9043a01122j0049b6498G3830b75333h3243k3201m5544E3385b10963a6588B66641
$$ -101122 -111171 -26498 73830 -275333 -83243 -106444 -151988 53385 -210963 -16588 266641
9031D6136C110b29453k4395F2650A7288K54516c0967k385q0221n5232B0616N3633
$$ 46136 3110 -229453 -253848 62650 17288 271804 -30967 -33352 -113573 -168805 20616 74249
9019G4249l4201g0059F0918J37014k9723c53438a31421N7564C38123a62897I3996
$$ 74249 40048 -70059 60918 197932 168209 -353438 -131421 -73857 338123 -162897 93996
9007e5876r830r0831p6775J10870E9328c74244d0406k07857B92548A38761b82157
$$ -55876 -65706 -156537 -233312 -122442 59328 -374244 -40406 -248263 292548 138761 -282157
8995b02856E9389b4103j15920l36499B6037c34803C31721m5276b27628A04338
$$ -202856 59389 -24103 -140023 -476522 26037 -334803 331721 286445 -227628 104338
8984A09890b95766A07870b26413K8306J334h0157A0190a42378d0211C04228g3684
$$ 109890 -295766 107870 -226413 -198107 -196773 -80157 10190 -142378 -40211 304228 -73684
8972d8348D6241h7602o8529o6226D8690e7724a8568B39400d96170F7711M59564
$$ -48348 46241 -87602 -156131 -222357 48690 -57724 -18568 239400 -496170 67711 527275
8961E27275j78525c58002D8072g9834b8806A00503i5563A03533D547b69163M0184
$$ 527275 348750 -358002 48072 -79834 -28806 100503 -95563 103533 4547 -269163 -228979
8950b28979j65017C23183j61141C057J72102b81705E036J77314E5416b23888H8306
$$ -228979 -393996 323183 162042 3057 175159 -281705 5036 182350 55416 -223888 88306
8938F6124a22651B41326o0943P0712a40522E3172N4362a16603j05818B29758a77070
$$ 66124 -122651 241326 180383 251095 -140522 53172 107534 -116603 -222421 229758 -177070
8926h727k0846B18556L6579K72418J406394k41825C46813q4095a05915A59577
$$ -8727 -29573 218556 255135 527553 1933947 1692122 346813 262718 -105915 159577
8915a46553D6695e0088l41379e8263j38041O212o5933I8557a92310A63357b90780
$$ -146553 46695 -50088 -391467 -58263 -196304 -190092 -256025 98557 -192310 163357 -290780
8903B5487L2218f5154m719A8631d38753g502D182a87969Q4562p8596A10482a19651
$$ 25487 57705 -65154 -69873 18631 -438753 -7502 4182 -187969 -103407 -182003 110482 -119651
8890b96177m2835g615j11096o4111q5085c9768j04432A99239b13332F0762a81423
$$ -296177 -339012 -7615 -118711 -182822 -267907 -39768 -144200 199239 -213332 60762 -181423
8878a6543F4035g3666j3540B4338L13557G0973l0034j762L784b6400e028j72429
$$ -16543 64035 -73666 -87206 24338 337895 70973 40939 39177 42961 -26400 -5028 -177457
8866a77457N643A74374O6466G3943a02132M4760K2430j92331P2035B4462f6046
$$ -177457 -171814 174374 240840 73943 -102132 -57372 -34942 -227273 -155238 24462 -66046
8854G6869b50166N263o7516D48178E340a26936B9514c59777J67721A23490b83460
$$ 76869 -250166 -244903 -312419 448178 5340 -126936 29514 -359777 -192056 123490 -283460
8842C14074C729a96453A95747D775K44473a60104A94219a88508A06288b1880q9306
$$ 314074 3729 -196453 195747 4775 249248 -160104 194219 -188508 106288 -21880 -111186
$$ [...]
##END NTUPLES=NMR SPECTRUM
##END=
