##TITLE=NES1064_ptc160_9883234_A9gzNZVP0y
##JCAMPDX= 6.0         $$ Bruker NMR JCAMP-DX V2.0
##DATA TYPE= NMR SPECTRUM
##DATA CLASS= NTUPLES
##ORIGIN= BRUKER
##OWNER= Administrator
$$ 1.72 TOPSPIN		Version 2.1
$$ 2016-08-26 19:22:02.914 -0500  Administrator@X
$$ Compression mode = diff/dup
##.OBSERVE FREQUENCY= 400.02188249412
##.OBSERVE NUCLEUS= ^1H
##.ACQUISITION MODE= SIMULTANEOUS (DQD)
##.ACQUISITION SCHEME= undefined
##.AVERAGES= 64
##.DIGITISER RES= 22
##SPECTROMETER/DATA SYSTEM= spect
##.PULSE SEQUENCE= noesygpps1d.comp
##.SOLVENT NAME= COFFEE_meoh
##.SHIFT REFERENCE= INTERNAL, COFFEE_meoh, 1, 14.96088
##AUDIT TRAIL= $$ (NUMBER, WHEN, WHO, WHERE, PROCESS, VERSION, WHAT)
$$ ##TITLE= Audit trail, TOPSPIN		Version 2.1
$$ ##JCAMPDX= 5.01
$$ ##ORIGIN= Bruker BioSpin GmbH
$$ ##OWNER= Administrator
$$ $$ E:\/data/COFFEE/nmr/NES1064_ptc160_9883234_A9gzNZVP0y/12/pdata/1/auditp.txt
$$ ##AUDIT TRAIL=  $$ (NUMBER, WHEN, WHO, WHERE, PROCESS, VERSION, WHAT)
(   1,<2016-08-26 19:21:55.226 -0500>,<Administrator>,<X>,<go>,<TOPSPIN 2.1>,
      <created by zg
	started at 2016-08-26 19:10:25.586 -0500,
	POWCHK enabled, PULCHK disabled,
       configuration hash MD5:
       21 0F 79 D6 B3 7B B4 F6 88 20 88 DB 03 48 BD 9F
       data hash MD5: 64K
       DB 44 D7 F6 EB D9 67 E4 EB AF 55 35 9C BF 03 45>)
(   2,<2016-08-26 19:21:58.351 -0500>,<Administrator>,<X>,<proc1d>,<TOPSPIN 2.1>,
      <Start of raw data processing
       efp LB = 0.3 FT_mod = 6 PKNL = 1 PHC0 = 0 PHC1 = 0 SI = 128K 
       data hash MD5: 128K
       CA E8 ED D7 52 C3 7E 1F 21 41 61 58 ED 96 24 53>)
(   3,<2016-08-26 19:21:59.554 -0500>,<Administrator>,<X>,<proc1d>,<TOPSPIN 2.1>,
      <pk PHC0 = -87.73682 PHC1 = 0 
       data hash MD5: 128K
       48 D4 7E 15 ED 9C A8 E5 CF 87 DA 9F FF D2 DA A7>)
(   4,<2016-08-26 19:22:00.695 -0500>,<Administrator>,<X>,<proc1d>,<TOPSPIN 2.1>,
      <abs ABSG = 1 
       data hash MD5: 128K
       8E CB B3 C1 0F 74 8C FF 32 A1 A8 3E 40 0D B3 11>)
(   5,<2016-08-26 19:22:01.164 -0500>,<Administrator>,<X>,<proc1d>,<TOPSPIN 2.1>,
      <abs ABSG = 2 
       data hash MD5: 128K
       D7 0C 04 15 F2 07 36 8F 4B 54 4B DC 33 AD 1F 62>)
(   6,<2016-08-26 19:22:01.336 -0500>,<Administrator>,<X>,<proc1d>,<TOPSPIN 2.1>,
      <abs ABSG = 3 
       data hash MD5: 128K
       78 14 A4 13 FF 01 DB D8 46 1B 7F F2 37 32 4F 60>)
(   7,<2016-08-26 19:22:02.054 -0500>,<Administrator>,<X>,<proc1d>,<TOPSPIN 2.1>,
      <abs ABSG = 4 
       data hash MD5: 128K
       06 27 0A 10 AF E5 DF 09 FC E1 AE C0 AD DA C4 FC>)
(   8,<2016-08-26 19:22:02.367 -0500>,<Administrator>,<X>,<proc1d>,<TOPSPIN 2.1>,
      <abs ABSG = 5 
       data hash MD5: 128K
       2E CB 9C 62 AC ED E4 2C B6 EA 25 9C AA 6D 61 95>)
$$ ##END=
$$ 
$$ $$ hash MD5
$$ $$ CF 64 58 65 1C 00 FF 4F 12 B3 C5 C2 1C 36 31 BE
##$RELAX= 
##$RELAX= 
##$RELAX= 
##$RELAX= 
##$RELAX= 
##$RELAX= 
##$RELAX= 
##$RELAX= 
$$ Bruker specific parameters
$$ --------------------------
##$DU= <E:\>
##$EXPNO= 12
$$ [...]
##$TP07= 0
##$TPNAME0= <>
##$TPNAME1= <>
##$TPNAME2= <>
##$TPNAME3= <>
##$TPNAME4= <>
##$TPNAME5= <>
##$TPNAME6= <>
##$TPNAME7= <>
##$TPOAL= (0..7)
0.5 0.5 0.5 0.5 0.5 0.5 0.5 0.5
##$TPOFFS= (0..7)
0 0 0 0 0 0 0 0
##$TUNHIN= 0
##$TUNHOUT= 0
##$TUNXOUT= 0
##$USERA1= <user>
##$USERA2= <user>
##$USERA3= <user>
##$USERA4= <user>
##$USERA5= <user>
##$V9= 5
##$VALIST= <valist>
##$VCLIST= <CCCCCCCCCCCCCCC>
##$VD= 0
##$VDLIST= <DDDDDDDDDDDDDDD>
##$VPLIST= <PPPPPPPPPPPPPPP>
##$VTLIST= <TTTTTTTTTTTTTTT>
##$WBST= 2048
##$WBSW= 25
##$XGAIN= (0..3)
0 0 0 0
##$XL= 0
##$YL= 0
##$YMAX_a= 6343240
##$YMIN_a= -11044867
##$ZGOPTNS= <>
##$ZL1= 120
##$ZL2= 120
##$ZL3= 120
##$ZL4= 120
##$ABSF1= 14.96088
##$ABSF2= -5.597301
##$ABSG= 5
##$ABSL= 3
##$ALPHA= 0
##$AQORDER= 0
##$ASSFAC= 0
##$ASSFACI= 0
##$ASSFACX= 0
##$ASSWID= 0
##$AUNMP= <proc_prof1d_extract.lims>
##$AXLEFT= 0
##$AXNAME= <>
##$AXNUC= <1H>
##$AXRIGHT= 0
##$AXTYPE= 0
##$AXUNIT= <>
##$AZFE= 0.1
##$AZFW= 0.1
##$BCFW= 0
##$BC_mod= 0
##$BYTORDP= 0
##$COROFFS= 0
##$CY= 15
##$DATMOD= 1
##$DC= 0
##$DFILT= <>
##$DTYPP= 0
##$F1P= 0
##$F2P= 0
##$FCOR= 0.5
##$FTSIZE= 131072
##$FT_mod= 6
##$GAMMA= 0
##$GB= 0
##$INTBC= 1
##$INTSCL= 1
##$ISEN= 128
##$LB= 0.3
##$LEV0= 0
##$LPBIN= 0
##$MAXI= 10000
##$MC2= 0
##$MEAN= 0
##$ME_mod= 0
##$MI= 0
##$NCOEF= 0
##$NC_proc= -2
##$NLEV= 6
##$NOISF1= 0
##$NOISF2= 0
##$NSP= 0
##$NTH_PI= 0
##$NZP= 0
##$OFFSET= 14.96088
##$PC= 1
##$PHC0= -87.73682
##$PHC1= 0
##$PH_mod= 1
##$PKNL= yes
##$PPARMOD= 0
##$PPDIAG= 0
##$PPIPTYP= 0
##$PPMPNUM= 2147483647
##$PPRESOL= 1
##$PSCAL= 4
##$PSIGN= 0
##$PYNMP= <proc.py>
##$REVERSE= no
##$SF= 400.020009685751
##$SI= 131072
##$SIGF1= 0
##$SIGF2= 0
##$SINO= 400
##$SIOLD= 131072
##$SPECTYP= <>
##$SREGLST= <1H.CDCl3>
##$SSB= 0
##$STSI= 131072
##$STSR= 0
##$SW_p= 8223.68421052631
##$SYMM= 0
##$S_DEV= 0
##$TDeff= 65536
##$TDoff= 0
##$TI= <>
##$TILT= no
##$TM1= 0
##$TM2= 0
##$TOPLEV= 0
##$USERP1= <user>
##$USERP2= <user>
##$USERP3= <user>
##$USERP4= <user>
##$USERP5= <user>
##$WDW= 1
##$XDIM= 131072
##$YMAX_p= 413150362
##$YMIN_p= -11432
##$CURPLOT= <Network HP LaserJet P1505>
##$CURPRIN= <$Network HP LaserJet P1505>
##$DFORMAT= <normdp>
##$LAYOUT= <+/1D_H.xwp>
##$LFORMAT= <normlp>
##$PFORMAT= <normpl>
##$SURQMSG= 1
$$ End of Bruker specific parameters
$$ ---------------------------------
##NTUPLES= NMR SPECTRUM
##VAR_NAME=  FREQUENCY,     SPECTRUM/REAL,   SPECTRUM/IMAG
##SYMBOL=    X,             R,               I
##VAR_TYPE=  INDEPENDENT,   DEPENDENT,       DEPENDENT
##VAR_FORM=  AFFN,          ASDF,            ASDF
##VAR_DIM=   131072,        131072,          131072
##UNITS=     HZ,            ARBITRARY UNITS, ARBITRARY UNITS
##FACTOR=    0.0627417313425164, 1,          1
##FIRST=     8223.62146879497, -79,          -56415
##LAST=      0,             2557,            -56210
##MIN=       0,             -11432,          0
##MAX=       8223.62146879497, 413150362,    0
$$ Real data points
##PAGE= N=1
##DATA TABLE= (X++(R..R)), XYDATA
$$ [...]
64004B61284l558l565l253k657k177k062k123k087j913j613j143o70o44j278k016
63989B30525j917o01J317K792L265L034K803K988L484L983M358M639M778M710
63975B70158M616M849N561O556P601Q656R672J0404J0625J0481J0396J0676J1311
63962C81562J2104J2890J3683J4636J5872J7282J8690K0248K2492K5771K9815
63951E85045L4142L8776M4366N1564O0498P0801Q1920R3453J05373J17862J30623
63940A414423J42456J52039J59249J65229J70802J75058J75883J71697J62351
63931B889187J48557J31043J10390Q7327O2797L7733J2707j2279l7570o3173q8204
63920C278515j11191j30867j46471j57479j63689j65841j65550j64054j61139
$$ y = [261284, 257726, 254161, 250908, 248251, 246074, 244012, 241889, 239802, 237889, 236276, 235133, 234463, 233819, 232541, 230525, 228608, 228007, 229324, 232116, 235381, 238415, 241218, 244206, 247690, 251673, 256031, 260670, 265448, 270158, 274774, 279623, 285184, 291740, 299341, 307997, 317669, 328073, 338698, 349179, 359575, 370251, 381562, 393666, 406556, 420239, 434875, 450747, 468029, 486719, 506967, 529459, 555230, 585045, 619187, 657963, 702329, 753893, 814391, 885192, 967112, 1060565, 1165938, 1283800, 1414423, 1556879, 1708918, 1868167, 2033396, 2204198, 2379256, 2555139, 2726836, 2889187, 3037744, 3168787, 3279177, 3366504, 3429301, 3467034, 3479741, 3467462, 3429892, 3366719, 3278515, 3167324, 3036457, 2889986, 2732507, 2568818, 2402977, 2237427, 2073373, 1912234]
63911A912234j55746j47444j36903j25025j12351r9404q7016p5837o5906n7011
63901H49591m9262m2856l7579l2950k8845k5448k2630j9877j7007j4510j2861
63890E45766j1814j0765r620q880q800q917q655q151q047q482q684p825o061m319
63876D26746l087j877m3K205M055N102N681O285P069P980Q901R532R521Q931Q245
63861E05246P674O817N314L520K059R14n73k751n140o975p974q382q577q857r422
63846D72893j0323j1302j1859j1669j0953j0358j0269j0390j0191r731r631j0153
63834C46064j0717j0660j0094r678r756j0119j0387j0170r081p207n482m952n513
63821B32248n969n435m234l232k893l205l906m360l817k380j325j706k925l394
$$ y = [1912234, 1756488, 1609044, 1472141, 1347116, 1234765, 1135361, 1048345, 972508, 906602, 849591, 800329, 757473, 719894, 686944, 658099, 632651, 610021, 590144, 573137, 558627, 545766, 533952, 523187, 513567, 504687, 495887, 486970, 478315, 470164, 462117, 453635, 444951, 437126, 431065, 426746, 423659, 421782, 421739, 423944, 427999, 433101, 438782, 445067, 452136, 460116, 469017, 478549, 488070, 497001, 505246, 512920, 519737, 525051, 528571, 530630, 531544, 530971, 528220, 523080, 516105, 508131, 499749, 491172, 482315, 472893, 462570, 451268, 439409, 427740, 416787, 406429, 396160, 385770, 375579, 365848, 356217, 346064, 335347, 324687, 314593, 304915, 295159, 285040, 274653, 264483, 255402, 248195, 242713, 237761, 232248, 226279, 220844, 216610, 213378, 210485, 207280, 203374, 199014, 195197, 192817, 191492, 189786, 186861, 183467]
63807A83467k542j393j010j150q96n3O78P11K22k90o54j030j524k066k559k903
63791A67008k826k065q54j4k06j180k038k192j763j125m69P5L39L80N18Q51R62
63774A55401M29n62j314j280m96M05N76k89j446j696q09J39J53m46o90m34k90
63757A47351l91r9Q65J798J885J149K62k17j66K13N11L79p7l70j93K70O64Q17
63739A54651O97L97K60O52J428J965J950J822K162K936L628L810L355K377J341
63724A83431J006J746K996L752L693L421L533L825L720L223L009L465M033L807
63710B28660K651J328M75o7o83j251j528j844k753l984m500l767k371j214n83
63695B08569k93k10k34j76m8j38n09o67j73P22J462J939K411K821K780K238J746
$$ y = [183467, 180925, 179532, 178522, 177372, 176476, 176423, 177101, 177812, 178034, 177744, 177090, 176060, 174536, 172470, 169911, 167008, 164182, 162117, 161263, 161249, 161043, 159863, 157825, 155633, 153870, 152745, 152276, 152351, 152690, 153070, 153588, 154439, 155401, 155830, 155268, 153954, 152674, 152178, 152583, 153159, 152870, 151424, 149728, 148919, 149058, 149211, 148765, 148075, 147641, 147351, 146960, 146861, 147726, 149524, 151409, 152558, 152820, 152603, 152437, 152650, 153161, 153540, 153463, 153093, 152900, 153170, 153834, 154651, 155348, 155745, 156005, 156657, 158085, 160050, 162000, 163822, 165984, 168920, 172548, 176358, 179713, 182090, 183431, 184437, 186183, 189179, 192931, 196624, 200045, 203578, 207403, 211123, 214346, 217355, 220820, 224853, 228660, 231311, 232639, 233114, 233047, 232364, 231113, 229585, 227741, 224988, 221004, 216504, 212737, 210366, 209152, 208569, 208276, 208066, 207832, 207656, 207608, 207470, 206961, 206294, 206121, 206843, 208305, 210244, 212655, 215476, 218256, 220494, 222240]
63678B22240J844K417K773K352J345N59N42Q73O55j82o56J2J309K112K105J938
63662B42238K146K549K723K532J975R55m54j715k121j544p78r26k283l930m662
63647B36705m219l292k510j962j668j745j888j463n23M4j47k29N59J593J915J865
63631B23035K441L475L879L578L664M476N032M849M904N989P302P673P322P283
63617B94902P741Q084Q306R173J1041J3376J5540J7378J8920K0155K1265K2665
63605D68546K4602K6991K9655L2430L4976L6704L6938L5133L1115K5355J8853
63594H01298J2424O366R78l007m999n441n505n936o649p452q712j1121j4986j9813
63580G27445k4391k7486k8776k8973k8741k7810k5671k2873k0752j9740j8763
$$ y = [222240, 224084, 226501, 229274, 231626, 232971, 233530, 234072, 234945, 235600, 235418, 234762, 234774, 236083, 238195, 240300, 242238, 244384, 246933, 249656, 252188, 254163, 255118, 254664, 252949, 250828, 249284, 248506, 247580, 245297, 241367, 236705, 232486, 229194, 226684, 224722, 223054, 221309, 219421, 217958, 217435, 217479, 217332, 217103, 217662, 219255, 221170, 223035, 225476, 228951, 232830, 236408, 240072, 244548, 249580, 254429, 259333, 265322, 272624, 280297, 287619, 294902, 302643, 310727, 319033, 328206, 339247, 352623, 368163, 385541, 404461, 424616, 445881, 468546, 493148, 520139, 549794, 582224, 617200, 653904, 690842, 725975, 757090, 782445, 801298, 813722, 820088, 821066, 818059, 813060, 807619, 802114, 796178, 789529, 782077, 773365, 762244, 747258, 727445, 703054, 675568, 646792, 617819, 589078, 561268, 535597, 512724, 491972, 472232, 453469]
63569D53469j6706j3746j0839q429o330m406k702j096N38J920K789L641N321P804
63555D11228R988J1027J1287J1668J2510J3628J4978J6653J8484K0345K2768K6571
63543F01135L1711L7036M1342M4070M4757M2513L6776K8361J9149J0691L442k750
63531I38233p821j1260j2501j1469q944o262m541m248n534q565j3155j8413k3332
63518H02188k7612l1463l4660l6499l6673l5646l4029l2049k9824k7558k5272
63507D50903k2771k0152j7915j6291j4847j3105j1176r508q322p569p094o548
63495B95605n488l984k814k631l170l597l408k676j710r22p14r52q06K91J664
63480B64688K032J160K23L42J294K087K366K783L948N444O132N366L653K003Q55
$$ y = [453469, 436763, 423017, 412178, 403749, 397419, 393013, 390311, 389215, 389753, 391673, 394462, 398103, 403424, 411228, 421216, 432243, 443530, 455198, 467708, 481336, 496314, 512967, 531451, 551796, 574564, 601135, 632846, 669882, 711224, 755294, 800051, 842564, 879340, 907701, 926850, 937541, 940983, 938233, 930412, 919152, 906651, 895182, 886238, 879976, 875435, 871187, 865653, 857088, 843933, 825520, 802188, 774576, 743113, 708453, 671954, 635281, 599635, 565606, 533557, 503733, 476175, 450903, 428132, 407980, 390065, 373774, 358927, 345822, 334646, 325138, 316816, 309247, 302153, 295605, 290117, 286133, 283319, 280688, 277518, 273921, 270513, 267837, 266127, 265205, 264491, 263539, 262733, 263024, 264688, 266720, 267880, 268103, 268445, 269739, 271826, 274192, 276975, 280923, 286367, 292499, 297865, 301518, 303521, 304376]
63465C04376J0o20q13p44j156k396l796m550m756m936m916m048k465j194q58r33
63449B66205o35M4O03Q60J103J551K090K508K816L329M436O204Q222R946J1189
63434C20471J2263J3749J6240J9991K4406K7995K9245K7677K3919J9039J4058
63423E49053R876P021N511N249O462R220J2830J6352J9721K3677K8486L3503L8095
63410G65056M2163M5333M6496M4790M0531L4513K6889J7602P690p78o307r045
63398A054933j0108j0338j0073r783j0421j2889j7223k2518k7696l2213l5893
63387H55778l8418l9450l9197l8277l6875l4520l1022k7177k4100k2060k0323
63376E04359j7997j4802j1208q122o190n180m141k438l32J603L348N291P508R674
$$ y = [304376, 304386, 303766, 302953, 302209, 301053, 298657, 294861, 290311, 285555, 280619, 275703, 271655, 269190, 267996, 267138, 266205, 265570, 265614, 266217, 267077, 268180, 269731, 271821, 274329, 277145, 280474, 284910, 291114, 299336, 309282, 320471, 332734, 346483, 362723, 382714, 407120, 435115, 464360, 492037, 515956, 534995, 549053, 558929, 565950, 571461, 576710, 583172, 592392, 605222, 621574, 641295, 664972, 693458, 726961, 765056, 807219, 852552, 899048, 943838, 984369, 1018882, 1045771, 1063373, 1071063, 1070285, 1063978, 1054933, 1044825, 1034487, 1024414, 1014631, 1004210, 991321, 974098, 951580, 923884, 891671, 855778, 817360, 777910, 738713, 700436, 663561, 629041, 598019, 570842, 546742, 524682, 504359, 486362, 471560, 460352, 452230, 446040, 440860, 436719, 434281, 433949, 435552, 438900, 444191, 451699, 461373]
63362D61373J1566J3246J4814J6375J8225K0636K3454K6244K8858L1497L4240
63351G00528L6865L9260M1499M3307M3736M1733L6932K9824K1308J2341L895l093
63339A048135p982j0702j1719j1672j1058j0324j0204j1666j5154k0025k4990
63328I02639k9227l2798l5893l8052l8506l7217l5055l2774l0095k6185k0962
63317E45875j5471j1028q334p614q980j2134j5921j8850k0152k0043j9071j7607
63305C70670j5903j4091j2006r546p262n978n639n211m156l295l581m535m767
63292B74700l823k590j948j802j725j774k205k826l173l116k913k722k450k071
63278B39562j807j806j837j525q57k46j6k1R8M60R27J329J473J115L68n7M42J434
$$ y = [461373, 472939, 486185, 500999, 517374, 535599, 556235, 579689, 605933, 634791, 666288, 700528, 737393, 776653, 818152, 861459, 905195, 946928, 983860, 1013684, 1034992, 1047333, 1051228, 1048135, 1040153, 1029451, 1017732, 1006060, 995002, 984678, 974474, 962808, 947654, 927629, 902639, 873412, 840614, 804721, 766669, 728163, 690946, 655891, 623117, 593022, 566837, 545875, 530404, 519376, 511042, 503428, 494448, 482314, 466393, 447543, 427391, 407348, 388277, 370670, 354767, 340676, 328670, 319124, 311862, 305884, 300245, 295034, 290878, 287583, 284002, 279467, 274700, 270877, 268287, 266339, 264537, 262812, 261038, 258833, 256007, 252834, 249718, 246805, 244083, 241633, 239562, 237755, 235949, 234112, 232587, 231730, 231484, 231468, 231447, 231545, 232005, 232932, 234261, 235734, 236849, 237217, 237160, 237602, 239036]
63260B39036J891J620J455J861K166J790J333J670K579L199L455L967M769N221
63246B76012N232N497O331P183P624P992Q580R102R430J0199J1945J4113J5712
63233C94952J6581J7335J8285J9146J9835K0749K2038K3075K3051K1912K0388
63222F17347J9142J8187J7315J6817J7356J8986K0727K1574K1613K1543K1279
63211H31886J9852J6850J3088R330N113m05o852j2832j7560k1458k4979k7721
63199G84312k9072k9176k8608k7447k5244k1899j8102j4705j1932r351o459l112
63187E59205N13M095P297R948J2244J4617J7268J9831K1654K2415K2342K1910
63175G33339K1471K1205K1237K1620K2185K2518K2168K1023J9413J7687J5675
$$ y = [239036, 240927, 242547, 244002, 245863, 248029, 249819, 251152, 252822, 255401, 258600, 262055, 266022, 270791, 276012, 281244, 286741, 293072, 300255, 307879, 315871, 324451, 333553, 342983, 353182, 365127, 379240, 394952, 411533, 428868, 447153, 466299, 486134, 506883, 528921, 551996, 575047, 596959, 617347, 636489, 654676, 671991, 688808, 706164, 725150, 745877, 767451, 789064, 810607, 831886, 851738, 868588, 881676, 891006, 896119, 895714, 888862, 876030, 858470, 837012, 812033, 784312, 755240, 726064, 697456, 670009, 644765, 622866, 604764, 590059, 578127, 568776, 562317, 559205, 559718, 563813, 571110, 581058, 593302, 607919, 625187, 645018, 666672, 689087, 711429, 733339, 754810, 776015, 797252, 818872, 841057, 863575, 885743, 906766, 926179, 943866, 959541]
63164I59541J2773Q721L941j063o362j2260j8429k3972k8322l1709l4557l6824
63152G91478l8112l8149l6996l5007l2704l0433k8112k5505k2811k0578j8980
63141D64091j7525j5727j3715j1890j0313q783p319o188n480m991m474l849l186
63128C50651k595k122j650j015k02O41J374J891K032J788J530J724K306K792L012
63113C62157L286L722L962L868L881M302M685M491L859L255K721K099J614J599
63099D09501J861J971J949K054K119J782J226R26Q45N65J78K14O70R57Q83Q17
63083D28518P42J29r10j319n29O20J044R30J304K561M135N371O047O251O335O843
63067D68072Q020R442J0556J1347J2125J2968J3818J4823J6085J7368J8579K0200
$$ y = [959541, 972314, 981035, 984976, 983913, 977551, 965291, 946862, 922890, 894568, 862859, 828302, 791478, 753366, 715217, 678221, 643214, 610510, 580077, 551965, 526460, 503649, 483071, 464091, 446566, 430839, 417124, 405234, 394921, 386138, 378819, 372631, 367151, 362160, 357686, 353837, 350651, 348056, 345934, 344284, 343269, 343067, 343708, 345082, 346973, 349005, 350793, 352323, 354047, 356353, 359145, 362157, 365443, 369165, 373127, 376995, 380876, 385178, 389863, 394354, 398213, 401468, 404189, 406288, 407902, 409501, 411362, 413333, 415282, 417336, 419455, 421237, 422463, 423389, 424234, 424799, 424977, 425191, 425861, 426818, 427701, 428518, 429260, 429389, 428479, 427160, 426631, 427251, 428295, 429225, 430529, 433090, 437225, 442596, 448643, 454894, 461229, 468072, 476092, 485534, 496090, 507437, 519562, 532530, 546348, 561171, 577256, 594624, 613203, 633403]
63055F33403K2581K5203K7365K9387L2142L5581L8695M1093M3453M6120M8302
63044A023325M9281M9641N0368N1348N1591N0691M9309M8268M7886M8146M8969
63033A568823N0175N1464N2445N2464N0592M6283L9896L2214K3460J3276J695
63022A982787j0461k2237l3164m2991n1272n7611o2033o4713o5460o3866o0043
63011A448936n4865m9295m3590l7347l0303k2838j5567q619j625N557J2472J8574
62999A221490K3828K8499L2512L5460L7192L8085L8686L9310L9930M0264L9977
62988A615233L9136L8351L8095L7901L6643L3626K8971K2876J5195N980m073j4213
62976A893721k4306l4447m4264n3095o0605o6768p1358p4060p4942p4368p2420
$$ y = [633403, 655984, 681187, 708552, 737939, 770081, 805662, 844357, 885450, 928903, 975023, 1023325, 1072606, 1122247, 1172615, 1223963, 1275554, 1326245, 1375554, 1423822, 1471708, 1519854, 1568823, 1618998, 1670462, 1722907, 1775371, 1825963, 1872246, 1912142, 1944356, 1967816, 1981092, 1982787, 1972326, 1950089, 1916925, 1873934, 1822662, 1765051, 1703018, 1638305, 1572845, 1508979, 1448936, 1394071, 1344776, 1301186, 1263839, 1233536, 1210698, 1195131, 1186512, 1184887, 1190444, 1202916, 1221490, 1245318, 1273817, 1306329, 1341789, 1378981, 1417066, 1455752, 1495062, 1534992, 1575256, 1615233, 1654369, 1692720, 1730815, 1768716, 1805359, 1838985, 1867956, 1890832, 1906027, 1912007, 1907934, 1893721, 1869415, 1834968, 1790704, 1737609, 1677004, 1610236, 1538878, 1464818, 1389876, 1315508, 1243088]
62965A243088o8944o4185n8920n3816m9027m4481m0228l6344l2860k9851k7300
62954G37132k4861k2150j9382j7300j6256j5808j5433j5194j5283j5288j4505
62943E45672j2936j1475j0954j1319j1843j1996j1818j1524j0988r867q245o816
62931D15891o140n967n633n038m731m991n374n330m858m253l588k819k076j576
62917C53517j379j474j811k098j905j229o04l58k14K8j08j028k173k660k559k691
62901C31254l247l482k973k289k076k151k003j551j010m19J32K32l42j048j095
62886C07932l83M82J009J219J290J281J193J026P10K75J8J78M99M99J58l2J66
62869C17520L95K71n8k16j40K3K69O17P64L48m19q68p18m02l81m58j65N01J069
$$ y = [1243088, 1174144, 1109959, 1051039, 997223, 948196, 903715, 863487, 827143, 794283, 764432, 737132, 712271, 690121, 670739, 653439, 637183, 621375, 605942, 590748, 575465, 560177, 545672, 532736, 521261, 510307, 498988, 487145, 475149, 463331, 451807, 440819, 430952, 422707, 415891, 409751, 403784, 398151, 393113, 388382, 383391, 378017, 372687, 367829, 363576, 359988, 357169, 355093, 353517, 352138, 350664, 348853, 346755, 344850, 343621, 343017, 342659, 342445, 342473, 342365, 341337, 339164, 336504, 333945, 331254, 328007, 324525, 321552, 319263, 317187, 315036, 313033, 311482, 310472, 310053, 310185, 310417, 310075, 309027, 307932, 307549, 308031, 309040, 310259, 311549, 312830, 314023, 315049, 315759, 316034, 316052, 316230, 316729, 317228, 317386, 317354, 317520, 317915, 318186, 318128, 317912, 317772, 317795, 318064, 318681, 319445, 319793, 319374, 318506, 317788, 317386, 317005, 316547, 316382, 316883, 317952]
62850C17952J240J125R73R44J144J515J683J338P34M34M75L51p6j79M77J312J407
62833C32849P11o1m53o11o42m09k2Q0k51n93n53k17J67N70R80J268J475J875K485
62814C38648K854K698K362K365K730L182L636M113M382M334M455N330O684P597
62800C95370P734P750Q255Q957R320R493J0052J1023J1855J2389J3204J4751J6665
62787E36818J8384K0088K2559K6123L0331L4686L9199M3947M8654N3162N7992
62776I31943O3790P0333P6561Q1602Q5188Q7063Q6718Q3949P9145P2653O4283
62765A783228N3767M1304K7301J2062l820j9237l3325m6091n7599o6993p3135
62754A617462p6116p7205p7305p6365p4377p1930o9310o6050o1938n7753n4168
$$ y = [317952, 319192, 320317, 321290, 322234, 323378, 324893, 326576, 327914, 328648, 329082, 329557, 329908, 329832, 329653, 330130, 331442, 332849, 333560, 333499, 333046, 332435, 331793, 331384, 331362, 331442, 331191, 330598, 330045, 329828, 329995, 330565, 331545, 332813, 334288, 336163, 338648, 341502, 344200, 346562, 348927, 351657, 354839, 358475, 362588, 366970, 371304, 375759, 381089, 387773, 395370, 403104, 410854, 419109, 428066, 437386, 446879, 456931, 467954, 479809, 492198, 505402, 520153, 536818, 555202, 575290, 597849, 623972, 654303, 688989, 728188, 772135, 820789, 873951, 931943, 995733, 1066066, 1142627, 1224229, 1309417, 1396480, 1483198, 1567147, 1646292, 1718945, 1783228, 1836995, 1878299, 1905600, 1917662, 1913842, 1894605, 1861280, 1815189, 1757590, 1690597, 1617462, 1541346, 1464141, 1386836, 1310471, 1236094, 1164164, 1094854, 1028804, 966866, 909113, 854945]
62743H54945n0569m5927m0524l5783l2399k9599k6467k3186k0518j8635j7011
62732E14327j5203j3238j1332r616q124o806n507m119k778j760j139o40J17J240
62718D35422K495L558M344M993N689O546P740R455J1621J3831J5730J7448J9451
62705E58323K2022K5039K8292L1787L5692M0114M5023N0316N5898O1661O7427
62694A021594P2879P7724Q1884Q5383Q7893Q8609Q6799Q2256P5036O5071N2559
62683A877687L8464K3942R172o517k3068l8914n2235o2537p0566p6984q1740q4472
62671A452232q5023q3592q0791p7375p3573o8958o3389n7727n2958m8846m4315
62660G15685l9129l4305l0717k8115k5810k3582k1473j9320j7065j5062j3580
$$ y = [854945, 804376, 758449, 717925, 682142, 649743, 620144, 593677, 570491, 549973, 531338, 514327, 499124, 485886, 474554, 464938, 456814, 450008, 444501, 440382, 437604, 435844, 434705, 434065, 434182, 435422, 437917, 441475, 445819, 450812, 456501, 463047, 470787, 480242, 491863, 505694, 521424, 538872, 558323, 580345, 605384, 633676, 665463, 701155, 741269, 786292, 836608, 892506, 954167, 1021594, 1094473, 1172197, 1254081, 1339464, 1427357, 1515966, 1602765, 1685021, 1760057, 1825128, 1877687, 1916151, 1940093, 1949265, 1942748, 1919680, 1880766, 1828531, 1765994, 1695428, 1618444, 1536704, 1452232, 1367209, 1283617, 1202826, 1125451, 1051878, 982920, 919531, 861804, 808846, 760000, 715685, 676556, 642251, 611534, 583419, 557609, 534027, 512554, 493234, 476169, 461107, 447527]
62649D47527j2377j1165j0082r315q724q278q280q577q198o542m575l824m449
62636C43141n120m776l606k305j223m67q2J33L94M50j21j049j515j281q76n02
62620C21195L34J675K553K214J223N96M85M87P46J724L174M291M827N295O012
62605C56831O676P040P379Q109R359J1099J3240J5555J7754J9808K1913K4204
62593E18967K6760K9772L3285L6799L9571M1291M2137M2152M1070L8683L4993
62582I25480K9942K3474J5903P806n14q953j7009k3842k9106l3167l6260l8018
62570H15736l8169l7215l5958l4695l3303l1763l0164k8424k6422k4245k2000
62559D73378j9631j7208j5116j3513j1955r973p803o010m673l578k959l258m086
$$ y = [447527, 435150, 423985, 413903, 404588, 395864, 387586, 379306, 370729, 362531, 355989, 351414, 347590, 343141, 338021, 333245, 329639, 327334, 326111, 325644, 325562, 325695, 326089, 326539, 326418, 325369, 323854, 322573, 321697, 321195, 321529, 323204, 325757, 327971, 329194, 329790, 330275, 330762, 331508, 333232, 336406, 340697, 345524, 350819, 356831, 363507, 370547, 377926, 386035, 395394, 406493, 419733, 435288, 453042, 472850, 494763, 518967, 545727, 575499, 608784, 645583, 685154, 726445, 768582, 810734, 851804, 890487, 925480, 955422, 978896, 994799, 1002605, 1002091, 993138, 976129, 952287, 923181, 890014, 853754, 815736, 777567, 740352, 704394, 669699, 636396, 604633, 574469, 546045, 519623, 495378, 473378, 453747, 436539, 421423, 407910, 395955, 385982, 378179, 372169, 367496, 363918, 360959, 357701, 353615]
62546C53615m254l239j902j349j530j549r94l19J3K03P75J833K901L340K938K126
62530C52608J595J583J765J908K391L687N498P014Q027R226J1146J3423J5522
62517D35393J7715K0652K4253K7824L1186L4836L8798M2124M4116M5391M7018
62506H09306M8920M9846M8809M5853M1366L5373K7794J9021R880J156o757j3916
62494A116651k0620k6860l1972l5081l6006l5427l4099l2142k9260k5416k1014
62483G88754j6577j2376q329m232r8L748P054J0047J3135J6325J9121K0940K1368
62470H58880K0139J7396J3877J0350O763K492k585p840j2876j8006k3362k8192
62458H37036l1562l3328l3992l4018l3816l3822l3924l3202l0947k7660k4402
$$ y = [353615, 349361, 346122, 344220, 342871, 341341, 339792, 338798, 338479, 338492, 338695, 339470, 341303, 344204, 347544, 350482, 352608, 354203, 355786, 357551, 359459, 361850, 365537, 371035, 378049, 386076, 395302, 406448, 419871, 435393, 453108, 473760, 498013, 525837, 557023, 591859, 630657, 672781, 716897, 762288, 809306, 858226, 908072, 956881, 1002734, 1044100, 1079473, 1107267, 1126288, 1136168, 1137324, 1130567, 1116651, 1096031, 1069171, 1037199, 1002118, 966112, 930685, 896586, 864444, 835184, 809768, 788754, 772177, 759801, 751472, 747240, 747142, 750890, 757944, 767991, 781126, 797451, 816572, 837512, 858880, 879019, 896415, 910292, 920642, 927405, 929897, 927312, 919472, 906596, 888590, 865228, 837036, 805474, 772146, 738154, 704136, 670320, 636498, 602574, 569372, 538425, 510765, 486363]
62447D86363k1450j8365j5143j2414j0490r000p594o346n283m179k990j953j086
62434C70070r2J042J918K351K564K633K292J533Q09L08m17j714l174m181m739
62419C71203n298n994o502o498n967n181m574m452m613m555m139l791l802l882
62405C01955l623l063k450j843j316j157j411j588j332j025j151j375r03L33J563
62390B81614K223K503K751K954K966K807K494K000J545J544K064K666L009L244
62376C16384L624M039M315M707N633O995Q121Q470Q220Q087Q630R798J1058J1961
62362D20042J2641J3700J5592J8138K0770K3279K6124K9927L4722L9921M4964
62351F99820M9736N4240N8203O1290O3382O4184O2749N7981M9834L9605K8958
$$ y = [486363, 464913, 446548, 431405, 418991, 408501, 399501, 391907, 385561, 380278, 376099, 373109, 371156, 370070, 369978, 371020, 372938, 375289, 377853, 380486, 382778, 384311, 385120, 385428, 385011, 383297, 380123, 375942, 371203, 365905, 359911, 353409, 346911, 340944, 335763, 331189, 326737, 322124, 317569, 313430, 309639, 305837, 301955, 298332, 295269, 292819, 290976, 289660, 288503, 287092, 285504, 284172, 283147, 281996, 280621, 279718, 280051, 281614, 283837, 286340, 289091, 292045, 295011, 297818, 300312, 302312, 303857, 305401, 307465, 310131, 313140, 316384, 320008, 324047, 328362, 333069, 338702, 345697, 353818, 362288, 370508, 378595, 387225, 397023, 408081, 420042, 432683, 446383, 461975, 480113, 500883, 524162, 550286, 580213, 614935, 654856, 699820, 749556, 803796, 861999, 923289, 986671, 1050855, 1113604, 1171585, 1221419, 1261024, 1289982]
62340A289982J8930R901J798n924j4004k2514l0636l7569m3268m7902n1091n2325
62328A015378n1878n0569m8723m5994m2155l7538l2670k8015k4066k1131j8967
62317F13672j7121j5645j4973j5091j5407j5537j5630j5770j5632j4978j3978
62306D43910j2830j1519j0206r305q876q369p353o090n083m373l752l260l105
62293C49789l235l335l151k554j559m50L26O65Q98J196J276J022R58J594K561
62278C46001K946K511K012K286L329M405M899M933N154N900O750P071O885O842
62264D11924P407Q556J0264J2679J5536J8086J9993K1855K4407K7734L1670L6428
62252F46539M2156M8332N4221N9598O4311O7521O8200O6170O1946N5707M7255
$$ y = [1289982, 1308912, 1318813, 1320611, 1314687, 1300683, 1278169, 1247533, 1209964, 1166696, 1118794, 1067703, 1015378, 963500, 912931, 864208, 818214, 776059, 738521, 705851, 677836, 653770, 632639, 613672, 596551, 580906, 565933, 550842, 535435, 519898, 504268, 488498, 472866, 457888, 443910, 431080, 419561, 409355, 400050, 391174, 382805, 375452, 369362, 364279, 359906, 356154, 352894, 349789, 346554, 343219, 340068, 337514, 335955, 335505, 335831, 336496, 337394, 338590, 339866, 340888, 341846, 343440, 346001, 348947, 351458, 353470, 355756, 359085, 363490, 368389, 373322, 378476, 384376, 391126, 398197, 405082, 411924, 419331, 427887, 438151, 450830, 466366, 484452, 504445, 526300, 550707, 578441, 610111, 646539, 688695, 737027, 791248, 850846, 915157, 982678, 1050878, 1117048, 1178994, 1234701, 1281956]
62241A281956L6915K5663J4391L691n759j3511k0146k6873l4209m1685m8815n5341
62229A116277o0457o2964o2685o0796n8168n4392m9114m3355l8464l4463l0571
62218E60848k6826k3987k1931j9505j6247j3179j1454j0900j0469r574q410p243
62206C81123o028m721l613l109l245l542l410k649j498k49J014K299L500M465
62192C60337N132N558N986O919Q707J0991J2835J3742J4172J4762J5409J5566
62180D90116J5120J4457J3765J2943J2054J1251J0197Q221N339K563R02M44P04
62167E98076J467K907N166Q359J2696J8170K4104K9524L4043L8061M2006M5545
62155H60124M7668M7345M4117L8245L0480K1731J2953N113j143o088j0861j6400
$$ y = [1281956, 1318871, 1344534, 1358925, 1362616, 1356857, 1343346, 1323200, 1296327, 1262118, 1220433, 1171618, 1116277, 1055820, 992856, 930171, 869375, 811207, 756815, 707701, 664346, 625882, 591419, 560848, 534022, 510035, 488104, 468599, 452352, 439173, 427719, 416819, 406350, 396776, 388366, 381123, 375095, 370374, 366761, 363652, 360407, 356865, 353455, 350806, 349308, 349059, 350073, 352372, 355872, 360337, 365469, 371027, 377013, 383932, 392639, 403630, 416465, 430207, 444379, 459141, 474550, 490116, 505236, 519693, 533458, 546401, 558455, 569706, 579903, 588124, 593463, 596026, 596928, 597372, 598076, 599543, 602450, 607616, 615975, 628671, 646841, 670945, 700469, 734512, 772573, 814579, 860124, 907792, 955137, 999254, 1037499, 1067979, 1089710, 1102663, 1107776, 1106633, 1100545, 1089684, 1073284]
62143A073284k2473k8136l2935l7136m0740m3045m3496m2384m0255l7119l2869
62132F72696k8061k3538j9432j5332j1320q006n410k792J03K451L516L646L436
62119E71957K596N85k036l909m455m248l798k858j265K42N16j000l957p392j0144
62104E30834j1426j1312j0462r346p960o336m767l410k067o21O65J488J846J899
62090D69025J873K200L223M597N455N487N336N651O320P039Q095R828J1752J2982
62076E58863J3421J3785J4544J5455J6227J7008J8010J9132K0211K1345K2624
62065G50625K3815K4513K4649K4729K5551K7628L0749L4086L6850L8742L9800
62054A081737L9974L8931L6157L1249K4375J6574R278L191k244q065j4635k1481
$$ y = [1073284, 1050811, 1022675, 989740, 952604, 911864, 868819, 825323, 782939, 742684, 705565, 672696, 644635, 621097, 601665, 586333, 575013, 567007, 561597, 558805, 558908, 561359, 564875, 568521, 571957, 574553, 575138, 573102, 569193, 564738, 560490, 556692, 553834, 552569, 552811, 553327, 552327, 548370, 540978, 530834, 519408, 508096, 497634, 488288, 480328, 473992, 469225, 465815, 463748, 463127, 463792, 465280, 467126, 469025, 470898, 473098, 476321, 480918, 486373, 491860, 497196, 502847, 509167, 516206, 524301, 534129, 545881, 558863, 572284, 586069, 600613, 616068, 632295, 649303, 667313, 686445, 706656, 728001, 750625, 774440, 798953, 823602, 848331, 873882, 901510, 932259, 966345, 1003195, 1041937, 1081737, 1121711, 1160642, 1196799, 1228048, 1252423, 1268997, 1278275, 1281466, 1279222, 1271157, 1256522, 1235041]
62042A235041k7972l3796l8894m3229m6656m8882m9649m9065m7487m5063m1659
62031G62689l7478l3268k9616k6407k3325k0517j8258j6325j4310j2317j0781
62020E20087r715q669p447o383n880o024o559p005o987o743p008p888q373p564
62006D17842o011m984m617l814j999J9J222J670K178L295M853O167O462N562M155
61991D32000K998J960M52j301k348k499k737l737m882n285n123n277o079p042
61977C91100p510p202o352n593n371n289m539l076j714r29l74J12n2j053j885
61962C40273j557n35mk03m07k56q5k8K52Q33J261J170P42M07M83J038J816K417
61944C47617K836L554M773N966O755P747R757J2515J5001J6828J8448K0061K1292
$$ y = [1235041, 1207069, 1173273, 1134379, 1091150, 1044494, 995612, 945963, 896898, 849411, 804348, 762689, 725211, 691943, 662327, 635920, 612595, 592078, 573820, 557495, 543185, 530868, 520087, 510372, 501703, 494256, 487873, 481993, 475969, 469410, 462405, 455418, 448675, 441667, 433779, 425406, 417842, 411831, 406847, 402230, 398416, 396417, 396436, 397658, 399328, 401506, 404801, 409654, 415821, 422283, 427845, 432000, 434998, 436958, 437410, 436109, 433761, 431262, 428525, 424788, 419906, 414621, 409498, 404221, 398142, 391100, 383590, 376388, 370036, 364443, 359072, 353783, 349244, 346168, 344454, 343525, 343151, 343263, 343211, 342158, 340273, 338716, 338181, 338177, 337974, 337567, 337311, 337226, 337198, 337450, 338283, 339544, 340714, 341456, 341863, 342346, 343384, 345200, 347617, 350453, 354007, 358780, 364746, 371501, 379248, 389005, 401520, 416521, 433349, 451797, 471858, 493150]
61931D93150K2062K2791K3461K3311K1949K0089J8767J8159J7607J6491J4682
61920G12519J2397R904P272M330J023k279n054p161q714r588r516q578p031m701
61906F84823j267K800O337Q793J0810J3034J5054J5990J5699J4670J3034J0319
61894H10096O286J450l294p407j0982j4393j7722k0544k2378k3252k3558k3476
61882F50826k2892k1891k0790j9646j8181j6489j5207j4681j4392j3699j2701
61871D60257j1891j1264j0383r174q005p042o090n100m267l465k143r4K053L530
61857C86922M379N314O770Q500J0165J1897J4041J6620J9373K2157K4998K7758
61845E58894L0199L2340L4384L6120L6964L6781L6207L5550L3822K9653K3081
$$ y = [493150, 515212, 538003, 561464, 584775, 606724, 626813, 645580, 663739, 681346, 697837, 712519, 724916, 734820, 742092, 746422, 747445, 745166, 740112, 732951, 724237, 714649, 705133, 696555, 689524, 684823, 683556, 686356, 692693, 701486, 712296, 725330, 740384, 756374, 772073, 786743, 799777, 810096, 816382, 817832, 814538, 807131, 796149, 781756, 764034, 743490, 721112, 697860, 674302, 650826, 627934, 606043, 585253, 565607, 547426, 530937, 515730, 501049, 486657, 472958, 460257, 448366, 437102, 426719, 417545, 409540, 402498, 396408, 391308, 387041, 383576, 381433, 381339, 383392, 386922, 391301, 396615, 403385, 411885, 422050, 433947, 447988, 464608, 483981, 506138, 531136, 558894, 589093, 621433, 655817, 691937, 728901, 765682, 801889, 837439, 871261, 900914, 923995]
61834I23995J5702Q972L013k631p865j2067j4819j6064j5816j4208j1608q304
61822H48300m227P01O031J0981J5068J8213K0220K0530J8656J4622Q934K243m873
61809I75399j1956j8680k4837l0242l4554l7277l8200l7838l7086l6173l4339
61798F34217l1046k7173k4247k2536k0836j8363j5909j4462j3532j1925r738q390
61786D16060q593r336r285q348p307o505n688m909m725n318o017o050n415m677
61772C23887m112l576l129l119l448l252j971l37L13l13j185j383j098r14q25
61757B95538m71N3L07J82p7l43o00n92o0P00J075R61Q75J065J111O56O3m8K95
61738C00690N20L50J23J96M31M94M37O62J335K079K374K141J799J859K514L539
$$ y = [923995, 939697, 948669, 951682, 949051, 941186, 929119, 914300, 898236, 882420, 868212, 856604, 848300, 844073, 844774, 850805, 861786, 876854, 895067, 915287, 935817, 954473, 969095, 978029, 980272, 975399, 963443, 944763, 919926, 889684, 855130, 817853, 779653, 741815, 704729, 668556, 634217, 603171, 575998, 551751, 529215, 508379, 490016, 474107, 459645, 446113, 434188, 424450, 416060, 407467, 398131, 388846, 380498, 373191, 366686, 360998, 356089, 351364, 346046, 340029, 333979, 328564, 323887, 319775, 316199, 313070, 309951, 306503, 303251, 301280, 300943, 301256, 300943, 299758, 298375, 297277, 296363, 295538, 295067, 295120, 295427, 295609, 295532, 295189, 294589, 293997, 293937, 294637, 295712, 296673, 297548, 298613, 299724, 300380, 300443, 300395, 300690, 301210, 301560, 301683, 301879, 302310, 302804, 303241, 303903, 305238, 307317, 309691, 311832, 313631, 315490, 318004, 321543]
61722C21543M453M865M798M596M376L734K303N46m00K09K036M070N463N936N701
61707C74229N193M631L793K432Q55l06r59j642k575l287l485l711m460n193m955
61692C60560l744k505j883j713j706j919k343k640k603k440k373k335k251k225
61678C27880k235j982j319n54j34j78n12r29j265j376j230r48o35k79J44N88R66
61661C16002J135R19L55j60k52p8p7k45r6N04R73P76K81L74J333K451K859K467
61643C29521J959J925K256K484K586L108M302N564O027N520M514L304J789J34
61629C74993j039j385j385j789k774l865m512m531m147l789l735l839l736l289
61615C31178k625j805q11J50P95J280K035K889K870J319j208l501m880n436n532
$$ y = [321543, 325996, 330861, 335659, 340255, 344631, 348365, 350668, 351214, 350814, 351023, 353059, 357129, 362592, 368528, 374229, 379422, 384053, 387846, 390278, 391133, 390827, 389868, 388226, 385651, 382364, 378879, 375168, 370708, 365515, 360560, 356816, 354311, 352428, 350715, 349009, 347090, 344747, 342107, 339504, 337064, 334691, 332356, 330105, 327880, 325645, 323663, 322344, 321790, 321656, 321478, 320966, 320037, 318772, 317396, 316166, 315218, 314583, 314304, 314448, 315036, 316002, 317137, 318056, 318411, 318251, 317999, 317921, 317844, 317599, 317503, 318007, 318980, 319756, 320037, 320411, 321744, 324195, 327054, 329521, 331480, 333405, 335661, 338145, 340731, 343839, 348141, 353705, 359732, 365252, 369766, 373070, 374859, 374993, 373954, 372569, 371184, 369395, 366621, 362756, 358244, 353713, 349566, 345777, 342042, 338203, 334467, 331178, 328553, 326748, 325937, 326087, 326882, 328162, 330197, 333086, 335956, 337275, 336067, 332566, 327686, 322250, 316718]
61600C16718n455n379n203m661l896l568l974m494m487m320m692n197m634k831
61586B53927j177q84j611k316k710l071l206k657j750j453j993k438j993j029
61572B25639m13l60n52r66j770k583k686k048j422j179q03k6L89k59j244j188
61556B08529k5R19P80J60m0J81M19O67R03N92n48j672j628m97N10O64L51R6k05
61537B10156q00j408j529j023j39P55J291J246Q34O18R31J522J860J629Q28k91
61521B16480j289j797j844j744j620j347j022j020j416j713j473r37o73q29j096
61506A96660j248j336j384j244q35k72K14L70M7n77r69p89l93m45r76j232p05
61489A84886P9J56o09j350j282o20j52k41n52n99k00N33J321J737J461O69j4j15
$$ y = [316718, 311263, 305884, 300681, 296020, 292124, 288556, 284582, 280088, 275601, 271281, 266589, 261392, 256758, 253927, 252750, 251866, 250255, 247939, 245229, 242158, 238952, 236295, 234545, 233092, 231099, 228661, 226668, 225639, 225226, 224866, 224314, 223348, 221578, 218995, 216309, 214261, 212839, 211660, 210857, 210831, 211220, 210961, 209717, 208529, 208504, 209423, 210203, 210363, 210323, 210504, 210923, 211590, 212493, 213085, 212537, 210865, 209237, 208740, 209250, 209914, 210265, 210361, 210156, 209356, 207948, 206419, 205396, 205257, 206012, 207303, 208549, 209383, 210001, 210932, 212454, 214314, 215943, 216771, 216480, 215191, 213394, 211550, 209806, 208186, 206839, 205817, 204797, 203381, 201668, 200195, 199258, 198585, 197756, 196660, 195412, 194076, 192692, 191448, 190613, 190341, 190555, 190925, 190972, 190395, 189426, 188637, 188244, 187799, 186823, 185591, 184886, 184965, 185121, 184512, 183162, 181880, 181260, 181108, 180867, 180315, 179716, 179516, 180049, 181370, 183107, 184568, 185237, 185223, 185108]
61471A85108L46J168K258L386L921L273J615j28j015p12L50J266J283M55m10p00
61455B01464n97m91k66K94P35M38k55l56L11Q31O57L47M34M52j33p81n34N87J690
61436B04827K227K346K254K047K068K636L423L812L830M048M500M501L709K593
61422B48821J634P45j49o27m11O9K61K73N52J068J381J334J193J188J296J388
61406B60016J292Q25K8o61r20j005j424k173k688k507j729q13k21k50q55j583
61390B45332j952j972k034k249k232j658p61o7K04K48L20M60N65N61M99M83N47
61373B36294N58L54Nk05j34K0L7J09O29J528K089J749R70Q97K002L392L785L005
61355B57084K096K065K893L960M903N704O202O094N483M978N020N274M985L899
$$ y = [185108, 185454, 186622, 188880, 192266, 196187, 199460, 201075, 200947, 199932, 199220, 199570, 200836, 202119, 202574, 202164, 201464, 200867, 200376, 200110, 200404, 201139, 201577, 201322, 200966, 201277, 202108, 202765, 203112, 203546, 203998, 203865, 203084, 202550, 203137, 204827, 207054, 209400, 211654, 213701, 215769, 218405, 221828, 225640, 229470, 233518, 238018, 242519, 246228, 248821, 250455, 251200, 251051, 250424, 250013, 250082, 250343, 250616, 251168, 252236, 253617, 254951, 256144, 257332, 258628, 260016, 261308, 262133, 262161, 261500, 260580, 259575, 258151, 255978, 253290, 250783, 249054, 248241, 248020, 247770, 246915, 245332, 243380, 241408, 239374, 237125, 234893, 233235, 232474, 232407, 232611, 232859, 233179, 233639, 234204, 234765, 235264, 235747, 236294, 236852, 237206, 237211, 237006, 236872, 236892, 236929, 237038, 237667, 239195, 241284, 243033, 244003, 244900, 246902, 250294, 254079, 257084, 259180, 261245, 264138, 268098, 273001, 278705, 284907, 291001, 296484, 301462, 306482, 311756, 316741, 320640]
61341C20640K646K097K454L164L726M312N308O444O874O214N090M397M261M110
61327C81737L477K418J220J44o34j155j695k352k724k453k026k365l489m209l509
61312C62385j786k07P43J539K618L776M645N251N825O392O753O729O237N272L962
61297D20134K578J386N33L1k31m71q12j115j185j172j480k193k880l191l384l885
61281D02663m537m749m399m029l988l856l115k019j247r07m99J59O28O92Q60J502
61265C73159K045J721R57J102K655M474N194M839M460M519M482L969L480L628
61251D20684M145M307M040M028M701N657O248O310O028N426M450L379K649K242
61237D84294J662N94o98j799k657l459m160m469m222l628l109k949l057l107k905
$$ y = [320640, 323286, 325383, 327837, 331001, 334727, 339039, 344347, 350791, 357665, 363879, 368969, 373366, 377627, 381737, 385214, 387632, 388852, 388996, 388362, 387207, 385512, 383160, 380436, 377983, 375957, 373592, 370103, 365894, 362385, 360599, 360392, 361135, 362674, 365292, 369068, 373713, 378964, 384789, 391181, 397934, 404663, 410900, 416172, 420134, 422712, 424098, 424631, 424662, 424431, 423960, 423148, 422033, 420848, 419676, 418196, 416003, 413123, 409932, 406548, 402663, 398126, 393377, 388978, 384949, 380961, 377105, 373990, 371971, 370724, 369817, 369318, 369477, 370105, 370797, 371657, 373159, 375204, 376925, 377882, 378984, 381639, 386113, 391307, 396146, 400606, 405125, 409607, 413576, 417056, 420684, 424829, 429136, 433176, 437204, 441905, 447562, 453810, 460120, 466148, 471574, 476024, 479403, 482052, 484294, 485956, 486550, 485852, 484053, 481396, 477937, 473777, 469308, 465086, 461458, 458349, 455400, 452343, 449236, 446331]
61222D46331k620k447k194j503m66L34N62N67R15J765K866L855M349M124L499
61207D59937L138L167K885J757L40l78j82M00J021J721K440L084M008N603P456
61192D96397Q634Q925R004R268R337Q881Q102P112N681L985K826K604K766K734
61178E86256K615K517K046J168P57J306J847J197k30j010p86n28q89j465j821
61163E92980k137k631l156l623m134m524m508m370m768n648o222o220o314o867
61149E27858p137o272m577l187k886l649m972o238p136p976r174j0288j0194q563
61135D35609o506n252m800m416l824l165k326j140j6N11O71J187K192L173L885
61120D15783M565N253N683O065P161R154J1136J2186J2581J3338J4851J6515J7615
$$ y = [446331, 443711, 441264, 439070, 437567, 437101, 437435, 437997, 438564, 439479, 441244, 444110, 447965, 452314, 456438, 459937, 463075, 466242, 469127, 470884, 471224, 470846, 470664, 471064, 472085, 473806, 476246, 479330, 483338, 488941, 496397, 505031, 513956, 522960, 532228, 541565, 550446, 558548, 565660, 571341, 575326, 578152, 580756, 583522, 586256, 588871, 591388, 593434, 594602, 595359, 596665, 598512, 599709, 599479, 598469, 597683, 597155, 596266, 594801, 592980, 590843, 588212, 585056, 581433, 577299, 572775, 568267, 563897, 559129, 553481, 547259, 541039, 534725, 527858, 520721, 514449, 509872, 506685, 503799, 500150, 495178, 488940, 481804, 473828, 464654, 454366, 444172, 435609, 429103, 423851, 419051, 414635, 410811, 407646, 405320, 404180, 404164, 404675, 405346, 406533, 408725, 411898, 415783, 420348, 425601, 431284, 437349, 444510, 453664, 464800, 476986, 489567, 502905, 517756, 534271, 551886]
61107E51886J8160J8672J9482K0382K0941K0968K0593J9897J8625J6462J3516
61096G59584J0357P509N081K958J158j38r13j515k523m321o792r324j1298j2530
61082G37293j3297j3947j4565j5002j5073j4719j4056j3352j2903j2749j2589
61071E85041j2011j0948r733q691p755o639n311m093l216k529j740p75K03J018
61057E12821J627K175L002M297N690O485O566O734P759R350J0608J1285J2062
61044F00461J3560J5628J7724J9583K1286K3000K4859K6895K9055L1417L4266
61033H57734L7617M0835M3116M4263M4585M4429M4357M5585M9189N4795O0964
61022A367469O6981P3361Q0367Q7212R3356R9905J09051J22881J43119J71274
$$ y = [551886, 570046, 588718, 608200, 628582, 649523, 670491, 691084, 710981, 729606, 746068, 759584, 769941, 777450, 782531, 785489, 786647, 786509, 785596, 784081, 781558, 777237, 770445, 761121, 749823, 737293, 723996, 710049, 695484, 680482, 665409, 650690, 636634, 623282, 610379, 597630, 585041, 573030, 562082, 552349, 543658, 535903, 529264, 523953, 519860, 516644, 514115, 512375, 511600, 511803, 512821, 514448, 516623, 519625, 523922, 529612, 536097, 542663, 549397, 557156, 566506, 577114, 588399, 600461, 614021, 629649, 647373, 666956, 688242, 711242, 736101, 762996, 792051, 823468, 857734, 895351, 936186, 979302, 1023565, 1068150, 1112579, 1156936, 1202521, 1251710, 1306505, 1367469, 1434450, 1507811, 1588178, 1675390, 1768746, 1868651, 1977702, 2100583, 2243702, 2414976]
61012B414976K08434K55605L14902L89568M82392N95194P30718Q94045J090509
61003G376343J319899J565958J781360J881113J768750J399607Q38627K51849
60995A8183506j78825l52684k81977n1426K32859M58049N05940K89691j81647
60986A8623486p79169j316007j653353j762307j701362j550575j366771j179761
60978G314181j005064q50197p15680n98921m98739m15054l46249k89510k43098
60969B351669k06382j77954j55429j36939j21690j09054r8133q8208p8946p0153
60959A108781o1790n4016m6840m0123l4239l0223k8603k8484k8376k7487k5789
60948G02811k3431k0806j8677j7344j6027j3890j1310r291q008o811n514m580
$$ y = [2414976, 2623410, 2879015, 3193917, 3583485, 4065877, 4661071, 5391789, 6285834, 7376343, 8696242, 10262200, 12043560, 13924673, 15693423, 17093030, 17931657, 18183506, 18004681, 17651997, 17370020, 17318594, 17551453, 18009502, 18515442, 18805133, 18623486, 17844317, 16528310, 14874957, 13112650, 11411288, 9860713, 8493942, 7314181, 6309117, 5458920, 4743240, 4144319, 3645580, 3230526, 2884277, 2594767, 2351669, 2145287, 1967333, 1811904, 1674965, 1553275, 1444221, 1346088, 1257880, 1178934, 1108781, 1046991, 992975, 946135, 906012, 871773, 841550, 812947, 784463, 756087, 728600, 702811, 679380, 658574, 639897, 622553, 606526, 592636, 581326, 572035, 564027, 557216, 551702, 547122]
60936E47122m113l666l164l107l597m047m115m176m572n021n168n068m798m161
60922D88349l269k882l573m882n801n894n530n149m781m326l871l598l513l386
60908D27894k996k437k106k239k501k261j260J50J483K593L560M360M862N126
60894D34228N496O230P145P802Q122Q639R829J1357J2363J2546J2448J2550J2652
60881E61407J2488J2408J2868J3683J4439J5359J6944J8903K0229K0488K0260
60870G39476K0233K0395K0317J9636J8036J5346J1954Q679N946L396N52k658o193
60857H75115j0062j3843j6593j7789j8012j8197j8563j8806j9030j9656k0510
60846F84054k0739j9891j8541j7548j7042j6504j5657j4846j4499j4537j4545
$$ y = [547122, 543009, 539343, 536179, 533072, 529475, 525428, 521313, 517137, 512565, 507544, 502376, 497308, 492510, 488349, 485080, 482198, 478625, 473743, 467942, 462048, 456518, 451369, 446588, 442262, 438391, 434793, 431280, 427894, 424898, 422461, 420355, 418116, 415615, 413354, 412094, 412244, 413727, 416320, 419880, 424240, 429102, 434228, 439724, 445954, 453099, 460901, 469023, 477662, 487491, 498848, 511211, 523757, 536205, 548755, 561407, 573895, 586303, 599171, 612854, 627293, 642652, 659596, 678499, 698728, 719216, 739476, 759709, 780104, 800421, 820057, 838093, 853439, 865393, 874072, 880018, 883414, 883966, 881308, 875115, 865053, 851210, 834617, 816828, 798816, 780619, 762056, 743250, 724220, 704564, 684054, 663315, 643424, 624883, 607335, 590293, 573789, 558132, 543286, 528787, 514250, 499705]
60835D99705j4370j4240j4249j4119j3633j2969j2304j1409j0129q928q331p971
60823C57053o995n464m477m568m889m500l688l269l206k829k091j579j404j024
60809C07070k97J50p7m20p9R55J968K339K019J394R47R76J445K081K589K726K370
60792C28156J711J237J213J326J079M75r2m28o44p73p87r26j393j798j524q23
60776C26009p44j654k594k594k042k000k664l221l083k525k105k036k223k434
60762B94090k352j840j231j023j252j478j463j485j881k563l111l163k650j841
60748B66757j183q69n68K14J431K492K913K768K473K325K346K272J732P45k5N8
60732B85881O48O91j65j015r81m89o21j505k136j838j189j161j862k568k721k472
$$ y = [499705, 485335, 471095, 456846, 442727, 429094, 416125, 403821, 392412, 382283, 373355, 365024, 357053, 350058, 344594, 340117, 335549, 330660, 326160, 322472, 319203, 315997, 313168, 311077, 309498, 308094, 307070, 306773, 306923, 306846, 306426, 306347, 307302, 309270, 311609, 313628, 315022, 315969, 316945, 318390, 320471, 323060, 325786, 328156, 329867, 331104, 332317, 333643, 334722, 335197, 335105, 334677, 334033, 333260, 332473, 331547, 330154, 328356, 326832, 326009, 325265, 323611, 321017, 318423, 316381, 314381, 311717, 308496, 305413, 302888, 300783, 298747, 296524, 294090, 291738, 289898, 288667, 287644, 286392, 284914, 283451, 281966, 280085, 277522, 274411, 271248, 268598, 266757, 265574, 264705, 264137, 264351, 265782, 268274, 271187, 273955, 276428, 278753, 281099, 283371, 285103, 285848, 285823, 285881, 286529, 287220, 287055, 286040, 285059, 284570, 283949, 282444, 280308, 278470, 277281, 276120, 274258, 271690, 268969, 266497]
60716B66497k251k242k465l026l927m700m633l611k428j934k025j908j269o83
60702B29395p19j163j462j469j365j162p71m08l92n67l89L46J244J821J985J865
60686B26789J508Q96J36n04p07l19M01Q72Q18P02J182K194K949K917K418K087
60670B44339K154K484K978L530L811L480K655J940J858K309K684K500J890J407
60656B80019J336J450J538J838K553L197K973J831O60K76O87J424K108K398J909
60641C06197N95r95k221k921l323l612l878m208m513m556m333m181m199l947l112
60626B56793k163j842k182k562k567k266j732q67K10J095J553J702J603J091J72
60611B48038p34j136r23l74J05J68k28p06p82m06PJ46J34K25L40K15j71m84l79
$$ y = [266497, 264246, 262004, 259539, 256513, 252586, 247886, 243253, 239642, 237214, 235280, 233255, 231347, 230078, 229395, 228676, 227513, 226051, 224582, 223217, 222055, 221284, 220876, 220484, 219917, 219528, 219874, 221118, 222939, 224924, 226789, 228297, 229193, 229329, 228825, 228118, 227799, 228200, 229072, 229890, 230592, 231774, 233968, 236917, 239834, 242252, 244339, 246493, 248977, 251955, 255485, 259296, 262776, 265431, 267371, 269229, 271538, 274222, 276722, 278612, 280019, 281355, 282805, 284343, 286181, 288734, 291931, 294904, 296735, 297395, 297671, 298358, 299782, 301890, 304288, 306197, 306792, 305797, 303576, 300655, 297332, 293720, 289842, 285634, 281121, 276565, 272232, 268051, 263852, 259905, 256793, 254630, 252788, 250606, 248044, 245477, 243211, 241479, 240612, 240822, 241917, 243470, 245172, 246775, 247866, 248038, 247304, 246168, 245245, 244871, 244976, 245144, 244916, 244210, 243428, 243022, 243029, 243175, 243309, 243534, 243874, 244089, 243918, 243434, 243055]
60592B43055Q0M27K12m76j002q06rP49R84P67M80L80M45M99M14K11k2k18j92M49
60572B46427J944L843N269N890O288P053P963Q495Q761R204R583R027P171M655
60558C41573K287K61j588l267m631n595o083n938n064l516j499N04J779K084K216
60543C13523L295N377P353Q383Q767R098R268Q818P776O447M714K245o89l215
60529C91160m674n103m877m248l360k441j757j402j157p43l13m81j518k645k809
60514C53632k103j640j804j558j14J605K199J932K349M010N882P202Q711J1377
60500C91680J4894J8260K1260K4460K8019L1444L4381L6846L8476L8296L5618
60489G13634L0665K3958J5480N091o463j7616k7089l4392l9179m0882l9524l6427
$$ y = [243055, 243135, 243562, 243774, 243298, 242296, 241490, 241481, 242230, 243214, 243981, 244461, 244841, 245286, 245785, 246199, 246410, 246388, 246170, 245978, 246427, 248371, 252214, 257483, 263373, 269661, 276714, 284677, 293172, 301933, 311137, 320720, 329747, 336918, 341573, 343860, 344121, 342533, 339266, 334635, 329040, 322957, 317019, 311955, 308439, 306940, 307444, 309223, 311307, 313523, 316818, 322195, 329548, 337931, 346698, 355796, 365064, 373882, 381658, 388105, 392819, 395064, 394375, 391160, 386486, 381383, 376506, 372258, 368898, 366457, 364700, 363298, 362141, 361398, 361085, 360604, 359086, 356441, 353632, 351529, 349889, 348085, 346527, 346413, 348018, 350217, 352149, 354498, 358508, 364390, 371592, 380303, 391680, 406574, 424834, 446094, 470554, 498573, 530017, 564398, 601244, 639720, 678016, 713634, 744299, 768257, 783737, 788828, 782365, 764749, 737660, 703268, 664089, 623207, 583683, 547256]
60477E47256l3374l1082k8965k6242k2734j8690j4558j1085q979q125p637o904
60465C28881o108n488m792l908l434l872m678m867m314l745l552l452l255l228
60451B70188l433l412k818j907j104n48k89n19j231j932k089j664r62j80N62R53
60435B49615O27l53j428k021k039j826j729j779j783j663j508j241n18P86K127
60420B35267K731K504K107K009J854J119M8n24k86R2j39p86j000m83M8j42p36
60403B43683p39J52J134J373J021Q05J022J365J583J717J771J644J483J643K068
60388B61725K086J231L2m05L39J458J873J503J208J500J841J593J114J234J847
60373B80179J989J438J164J772K455K280J687J638J895J427K92k48L73J264J570
$$ y = [547256, 513882, 482800, 453835, 427593, 404859, 386169, 371611, 360526, 351547, 343422, 335785, 328881, 322773, 317285, 312493, 308585, 305151, 301279, 296601, 291734, 287420, 283675, 280123, 276671, 273416, 270188, 266755, 263343, 260525, 258618, 257514, 256966, 256677, 256158, 254927, 252995, 250906, 249242, 248280, 248100, 248662, 249615, 250242, 249889, 248461, 246440, 244401, 242575, 240846, 239067, 237284, 235621, 234113, 232872, 232354, 233140, 235267, 237998, 240502, 242609, 244618, 246472, 247591, 247639, 247115, 246829, 246921, 246782, 245996, 244996, 244513, 244561, 244419, 243683, 242944, 243096, 244230, 245603, 246624, 247429, 248451, 249816, 251399, 253116, 254887, 256531, 258014, 259657, 261725, 263811, 265042, 265074, 264669, 265008, 266466, 268339, 269842, 271050, 272550, 274391, 275984, 277098, 278332, 280179, 282168, 283606, 284770, 286542, 288997, 291277, 292964, 294602, 296497, 297924, 298216, 297968, 298341, 299605, 301175]
60358C01175J577J874K317K509K576K776K983L143L763N212P030Q465R256R343
60344C63999Q342O144L565J560Nj884m124n827o492o533o403n990n229m557m335
60329C32241m259l801k945k151j755j681j630j369j010j000j598k361k482j782
60315C02417r46o45p64p65l96L30J516L220N043O403P289Q373J0210J2651J5156
60300C69092J7239J8289J7337J3750Q235K633j714n118q723j2700j5837j6871
60288C85612j5825j3777j1839j0511r737r017p695n536l072j109R9Q90J437J383
60274C01303M53q94j743j669j128q26q65p74l77k64j072k480l388l163k297j602
60258B79214j204p54k53j15m79r85j300j426j425j220q65o38o46n75j03O00J043
$$ y = [301175, 302752, 304626, 306943, 309452, 312028, 314804, 317787, 320930, 324693, 329905, 336935, 345400, 354656, 363999, 372341, 378485, 382050, 383610, 383615, 381731, 377607, 371780, 365288, 358755, 352352, 346362, 341133, 336576, 332241, 327982, 324181, 321236, 319085, 317330, 315649, 314019, 312650, 311640, 310640, 309042, 306681, 304199, 302417, 301471, 300826, 300062, 299297, 298901, 299231, 300747, 303967, 309010, 315413, 322702, 331075, 341285, 353936, 369092, 386331, 404620, 421957, 435707, 443942, 446575, 444861, 439743, 431020, 418320, 402483, 385612, 369787, 356010, 344171, 333660, 323923, 314906, 307211, 301675, 298603, 297494, 297593, 298483, 299920, 301303, 301756, 300862, 299119, 297450, 296322, 295496, 294631, 293857, 293480, 293216, 292144, 289664, 286276, 283113, 280816, 279214, 278010, 277256, 277003, 276888, 276409, 275424, 274124, 272698, 271273, 270053, 269188, 268550, 267904, 267329, 267226, 267826, 268869]
60241B68869R91P06O28R77J622K221K415K047J297N91L03L94M86L66L16O80J193
60224B86102J159M40j72P0R05J501J541J412J431J509J531J558J495J121O06N40
60208C02749J224K312L270L895M163M078L873L953M325M524M372M372M861N285
60194C57256M892L893L178L060L014K679K405K538K771K634K172J768J488J048
60180C94796L07n62j395k268l265m171m514m058l220k861l457m501m974m430l410
60165C48017k706k494k395k169j994k056k191k068j574q75j20O86J528K201K466
60150C34256K381K281K347K310J780Q52J50J57O82J092J056Q81J103J870K738
60135C55936L119K918K661K934L645M055L620K674K046K053K216K007J541J231
$$ y = [268869, 269860, 270566, 271194, 272171, 273793, 276014, 278429, 280476, 281773, 282364, 282667, 283061, 283547, 283913, 284229, 284909, 286102, 287261, 287701, 287529, 287599, 288504, 290005, 291546, 292958, 294389, 295898, 297429, 298987, 300482, 301603, 302209, 302749, 303973, 306285, 309555, 313450, 317613, 321691, 325564, 329517, 333842, 338366, 342738, 347110, 351971, 357256, 362148, 366041, 369219, 372279, 375293, 377972, 380377, 382915, 385686, 388320, 390492, 392260, 393748, 394796, 395103, 394541, 393146, 390878, 387613, 383442, 378928, 374870, 371650, 368789, 365332, 360831, 355857, 351427, 348017, 345311, 342817, 340422, 338253, 336259, 334203, 332012, 329944, 328370, 327495, 327375, 328061, 329589, 331790, 334256, 336637, 338918, 341265, 343575, 345355, 346207, 346357, 346514, 347196, 348288, 349344, 350225, 351328, 353198, 355936, 359055, 361973, 364634, 367568, 371213, 375268, 378888, 381562, 383608, 385661, 387877, 389884, 391425, 392656]
60121C92656J028N12k41m82K38J232J378N19l84n15j11J44J30K21M71M53mm63
60103C96782m31j9K11q8p38j282j401j183j044j373k085k649k642k202j813j654
60087C76389j395o43N05J458J672J127L08k46l09J8M84P96P29L11j29k95k65k98
60069C80217m00l79l76r22k191l557m200l987l461l113l035l170l412l465l087
60054C41462k575k578l175l574l040j879j004p69o40m8Q96J711K195K545K933
60039C32460L217L145K685K118J792J854K236K805L423L886L974L631K985K112
60025C72323R69l38j407j943k096k277k655l155l804m650n332n183m002k457j433
60010C32560j176j273j379j615k270l334m416n056n035m487l727l049k606k431
$$ y = [392656, 393684, 394196, 393955, 393473, 393711, 394943, 396321, 396840, 396456, 395941, 395830, 395974, 396104, 396325, 396796, 397249, 397245, 396782, 396351, 396332, 396543, 396455, 395717, 394435, 393034, 391851, 390807, 389434, 387349, 384700, 382058, 379856, 378043, 376389, 374994, 374351, 374856, 376314, 377986, 379113, 379421, 379175, 378866, 378884, 379368, 380164, 380893, 381204, 381075, 380780, 380515, 380217, 379817, 379438, 379062, 378140, 375949, 372392, 368192, 364205, 360744, 357631, 354596, 351426, 348014, 344549, 341462, 338887, 336309, 333134, 329560, 326520, 324641, 323637, 322868, 322228, 322180, 323076, 324787, 326982, 329527, 332460, 335677, 338822, 341507, 343625, 345417, 347271, 349507, 352312, 355735, 359621, 363595, 367226, 370211, 372323, 373292, 372954, 371547, 369604, 367508, 365231, 362576, 359421, 355617, 350967, 345635, 340452, 336450, 333993, 332560, 331384, 330111, 328732, 327117, 324847, 321513, 317097, 312041, 307006, 302519, 298792, 295743, 293137, 290706]
59996B90706k425k401k234j917j332k25J312K474K427J386N34N69R58J017J036
59981B91885J644K475K440J360K81qK3l62r21q78j71M54M96J77j30m19q56j373
59963B96117j616j237k31P94R84J46q41r01K5J026J388J171O52j08q85j066l64
59946B95054N52P43K14j05M16J325J719J318O08R8k32o32r90q49r3P16R71Q19
59928C01652R17J429J800J693J573J922K399K377K018K033K443K449J720J101
59914C27526J558K970M488N649O588P313P443O688N161L187J097p36k060k994
59900C73878l852m626m955m691m181l790l443k868k134j585j292q60Q7J370K397
59885C39455K871L149L782M779N515N528N138N049N425N727N430M655L884L352
$$ y = [290706, 288281, 285880, 283646, 281729, 280397, 280172, 281484, 283958, 286385, 287771, 288305, 288874, 289832, 290849, 291885, 293529, 296004, 298444, 299804, 300085, 300077, 300100, 299738, 298817, 297939, 297768, 298222, 298718, 298895, 298765, 298346, 297490, 296117, 294501, 293264, 293033, 293827, 294811, 294957, 294116, 293215, 293240, 294266, 295654, 296825, 297477, 297369, 296484, 295418, 295054, 295606, 296349, 296563, 296458, 296874, 298199, 299918, 301236, 301844, 301942, 301710, 301078, 300088, 299239, 299146, 299862, 300833, 301652, 302569, 303998, 305798, 307491, 309064, 310986, 313385, 315762, 317780, 319813, 322256, 324705, 326425, 327526, 329084, 332054, 336542, 342191, 348779, 356092, 363535, 370223, 375384, 378571, 379668, 378932, 376872, 373878, 370026, 365400, 360445, 355754, 351573, 347783, 344340, 341472, 339338, 337753, 336461, 335601, 335688, 337058, 339455, 342326, 345475, 349257, 354036, 359551, 365079, 370217, 375266, 380691, 386418, 391848, 396503, 400387, 403739]
59871D03739K927K412J668N57q97k264k977k957k770k921l238l184k677k128j725
59856C83565j081J45J702L157M544O079P387P626O491M526K323L6j991k787j743
59841D19979L14J732J604J75k114n024p880r495r248p812o300n107m024l013k309
59826C61478j905j444o20N19J601K002J290j20j076r17l16l91j200j809j658j112
59810C54322n62J50J068J586J134j3j144k001k825l715m459m893n003m731m034
59795C24880l143k407j901j518j319j511j981k333k374k227j849r40M22J423J357
59780C04579N61P1L32P61O91K93K12O23J103J328J412J462J241O05J6J00P60J175
59762C17325Q57L25M61J400K421K795K375J398J96p43q14J74J622K622K806K524
$$ y = [403739, 406666, 409078, 410746, 411303, 410406, 408142, 405165, 402208, 399438, 396517, 393279, 390095, 387418, 385290, 383565, 382484, 382629, 384331, 387488, 392032, 398111, 405498, 413124, 419615, 424141, 426464, 426500, 424509, 421722, 419979, 420293, 422025, 423629, 423804, 421690, 416666, 408786, 399291, 390043, 382231, 375931, 370824, 366800, 363787, 361478, 359573, 358129, 357509, 358028, 359629, 361631, 362921, 362801, 361725, 360808, 360492, 360101, 358901, 357092, 355434, 354322, 353760, 353910, 354978, 356564, 357698, 357685, 356541, 354540, 351715, 348000, 343541, 338648, 333645, 328914, 324880, 321737, 319330, 317429, 315911, 314592, 313081, 311100, 308767, 306393, 304166, 302317, 301377, 301799, 303222, 304579, 305140, 305211, 305543, 306304, 306995, 307288, 307500, 308123, 309226, 310554, 311966, 313428, 314669, 315274, 315290, 315390, 316150, 317325, 318182, 318507, 318968, 320368, 322789, 325584, 327959, 329357, 329553, 328810, 327996, 328170, 329792, 332414, 335220, 337744]
59746C37744K257K175K255K560L109L634L706L140K218J497J397J941K789L471
59732C73893L638L202K358J483R44P96Q06P69P72R26R73M57o68j812k315k042
59716C84180j383q36o87r10j165j074o32j92K6J79L19R1p07j498j468o98j59m48
59698C72938j027j059n56k86p11j477j899j685j128p17o38o16k83K98O23K98m90
59681C61585j129j089l44N77Q95J79j199k412l050l412l817l964l362k201j318
59666C35939j327k050k870l331l294k803k026j253p78p08q79r60p22k60J30L70
59650C13178P16J306J762J550P35J04L22J180J831J684Q73o7p56j081j003n34
59634C21800Q5M70N61P04J115J405J021L4r41j567k018k368k299j717j108r13
$$ y = [337744, 340001, 342176, 344431, 346991, 350100, 353734, 357440, 360580, 362798, 364295, 365692, 367633, 370422, 373893, 377531, 380733, 383091, 384574, 385518, 386314, 387120, 387889, 388661, 389587, 390560, 391017, 390349, 388537, 386222, 384180, 382797, 381961, 381274, 380364, 379199, 378125, 377493, 377301, 377327, 377506, 377825, 377916, 377209, 375711, 374243, 373545, 373386, 372938, 371911, 370852, 370296, 370010, 369299, 367822, 365923, 364238, 363110, 362393, 361755, 361139, 360856, 361154, 361777, 362075, 361585, 360456, 359367, 359023, 359600, 360495, 360674, 359475, 357063, 354013, 350601, 346784, 342820, 339458, 337257, 335939, 334612, 332562, 329692, 326361, 323067, 320264, 318238, 316985, 316207, 315499, 314620, 313660, 312938, 312678, 312808, 313178, 313894, 315200, 316962, 318512, 319247, 319351, 319673, 320853, 322684, 324368, 325241, 325174, 324418, 323337, 322334, 321800, 321885, 322355, 322916, 323620, 324735, 326140, 327161, 327195, 326254, 324687, 322669, 320301, 318002, 316285, 315177, 314264]
59618C14264r45q91r90j579k273k334j723j088p26k40N55J198J296J134J133J284
59602C08075J494J949K590K692J728L53k70nJ70l77j186j636j743j605q41O59
59586C12047J948J915Q04q4j05J10o3l85n35q77j651k122j522m09p2p43j379j300
59568C05577r64r39j056j027j016j085q03p4L56m5o18m57K06M78L52O98J752K659
59550C03994K665J993J311J031J323K109K771K543J578J133K228M501O710Q082
59536C43972Q924J0262J3033J7228K1339K2902K0032J2723K927o443j2844j5284
59524D38771j4599j2400r674o629l610j355j40N71J256J615J211L16l96p17r71
59509C93249j482k291l244l957m025l546l234l595m287m612m454m293m510m991
$$ y = [314264, 313319, 312428, 311438, 309859, 307586, 305252, 303529, 302441, 301715, 301475, 302030, 303228, 304524, 305658, 306791, 308075, 309569, 311518, 314108, 316800, 318528, 318881, 318611, 318606, 318776, 318399, 317213, 315577, 313834, 312229, 311388, 312047, 313995, 315910, 316714, 316630, 316525, 316635, 316572, 316187, 315652, 314775, 313124, 311002, 309480, 309071, 308999, 308256, 306877, 305577, 304613, 303674, 302618, 301591, 300575, 299490, 298687, 298613, 298969, 298924, 298306, 297849, 298055, 298533, 298885, 299583, 301335, 303994, 306659, 308652, 309963, 310994, 312317, 314426, 317197, 319740, 321318, 322451, 324679, 329180, 335890, 343972, 352896, 363158, 376191, 393419, 414758, 437660, 457692, 470415, 473342, 466899, 454055, 438771, 424172, 411772, 402098, 395469, 391859, 390504, 390364, 390935, 392191, 393806, 395017, 395333, 394937, 394220, 393249, 391767, 389476, 386232, 382275, 378250, 374704, 371470, 367875, 363588, 358976, 354522, 350229, 345719, 340728]
59495C40728n338n177m432l504k951k832k665k160j567j065m39L03N85J25m22
59480C09189l31J25L13M44J187K320K847K492K091K301K785K992K935K778K397
59465C36865J780J354J366J416J038M77L55P71J194J270J304J854K925L814L893
59450C61676L519L777N128O691P296O909O392O132N712M852L816K702J190p03
59436D25089k321l256l838m409m732m673m733n297n832n581m621l559k550j457
59422C68230n95m10m67K87K128M155N554O564P885R651J1466J3077J4646J6503
59408D58674J8783K1065K2138K0355J4770O096l327j0680j4132j3720j0969p499
59396E01554l936j94L434N839N663K137m336j1893j7755j9949j8868j6652j4883
$$ y = [340728, 335390, 330213, 325781, 322277, 319326, 316494, 313829, 311669, 310102, 309037, 308598, 308901, 309486, 309611, 309189, 308858, 308983, 309296, 309740, 310927, 313247, 316094, 318586, 320677, 322978, 325763, 328755, 331690, 334468, 336865, 338645, 339999, 341365, 342781, 343819, 344296, 344651, 345422, 346616, 347886, 349190, 351044, 353969, 357783, 361676, 365195, 368972, 374100, 380791, 388087, 394996, 401388, 407520, 413232, 418084, 421900, 424602, 425792, 425089, 422768, 419512, 415674, 411265, 406533, 401860, 397127, 391830, 385998, 380417, 375796, 372237, 369687, 368230, 367635, 367225, 366758, 367045, 369173, 373328, 378882, 385446, 393331, 402982, 414448, 427525, 442171, 458674, 477457, 498522, 520660, 541015, 555785, 561881, 558554, 547874, 533742, 520022, 509053, 501554, 497618, 497424, 500858, 506697, 512360, 514497, 510161, 498268, 480513, 460564, 441696, 425044, 410161]
59383D10161j3380j1425r218p508o378n326m204l270k415j183L37J433J726J622
59369C50972J550J383J000P86J066J504J540J159P49M95M28Q17J847K986L351
59354C71633K872K562L368N117O791P560P397O963P068Q026R327J0179J0455J0777
59340D70095J1554J2309J2373J1894J1637J1787J1553J0100P632N208L605K618
59328E82365J506j37k074l908n487o766p537p710p668p950q496q570p698o365
59314E03505n522n502n660n044l328j062R61K581M390O859R499J1151J0926Q520
59300E32274L937k299q577j2785j4056j3449j2498j1584j0241q481o901n760m763
59287D24817l751k887k130j133J93J533K584L248L378K910K263K002K095K054
$$ y = [410161, 396781, 385356, 376138, 368630, 362252, 356926, 352722, 349452, 347037, 345854, 346191, 347624, 349350, 350972, 352522, 353905, 354905, 355691, 356757, 358261, 359801, 360960, 361709, 362204, 362632, 363449, 365296, 368282, 371633, 374505, 377067, 380435, 385552, 392343, 399903, 407300, 414263, 421331, 429357, 438684, 448863, 459318, 470095, 481649, 493958, 506331, 518225, 529862, 541649, 553202, 563302, 570934, 576142, 579747, 582365, 583871, 583734, 581660, 577752, 572265, 565499, 557962, 550252, 542584, 534634, 526138, 517568, 509870, 503505, 497983, 492481, 486821, 481777, 478449, 477387, 478348, 480929, 485319, 492178, 501677, 512828, 523754, 532274, 536211, 533912, 525335, 512550, 498494, 485045, 472547, 460963, 450722, 442241, 435340, 429580, 424817, 421066, 418179, 416049, 414916, 415109, 416642, 419226, 422474, 425852, 428762, 431025, 433027, 435122, 437176]
59273D37176J902K323L622N188O285O828P049O942O563O371O714P234P268O623
59259E18088N570M303K874J486K70j140l269n970q276r313r113q475q083p965
59245D70987p663o869n766m734l924l295k914k843k734k088j012k86l43o53m83
59230D25380J62Q21J355J882K180J873J141O07M09N6p34j590k167k673l414m174
59214D21114m491m258l724l103k534k185k032j662p69K85P09J58j030k323l391
59199C90764l971l829l091k261j586q14K15J000R48K57k12O3Q85J887K941L912
59183C87108M548M851N120N350N022L867K497J810J979K477K904L325L855M382
59169D39095M743M827M560M088L836M124M696N044N023M889M780M679M676M827
$$ y = [437176, 439078, 441401, 445023, 450211, 456496, 463324, 470373, 477315, 483878, 490249, 496963, 504197, 511465, 518088, 523658, 527961, 530835, 532321, 532591, 531451, 528182, 522212, 513936, 504623, 495510, 487035, 478952, 470987, 463324, 456455, 450689, 445955, 442031, 438736, 435822, 432979, 430245, 428157, 427145, 426859, 426516, 425863, 425380, 425542, 426363, 427718, 429600, 431780, 433653, 434794, 435401, 435810, 435866, 435132, 433542, 431375, 428702, 425288, 421114, 416623, 412365, 408641, 405538, 403004, 400819, 398787, 397125, 396356, 396641, 397350, 397508, 396478, 394155, 390764, 386793, 382964, 379873, 377612, 376026, 375212, 375427, 376427, 377375, 377632, 377420, 377483, 378368, 380255, 383196, 387108, 391656, 396507, 401627, 406977, 411999, 415866, 418363, 420173, 422152, 424629, 427533, 430858, 434713, 439095, 443838, 448665, 453225, 457313, 461149, 465273, 469969, 475013, 480036, 484925, 489705, 494384, 499060, 503887]
59155E03887M775M111L106K462K217J538q3k016l274l645l723m038m626n161n288
59140D90242m909m394m212m316m213l785l513l678l851l561l041k731k477j764
59126D39797n91N41J370K097K803L179K999K607K671L522M742N499N403N022N298
59111D86959O410P573Q102Q175Q345Q700Q895Q660P826O266M268K738K420L034
59097E78371L624L610L075K193R25o14k021k909l188l066k928l069l232k786j666
59082E66319q27j195k412l272l256k954l040l527m193n024n936o546o597o324
59068E11216o134o216o496o776o807o492o012n586n143m578m116m020l993l476
59054D35371k492j572q66k2R20J305R03M58O92J241J236N89O4K49R70J748K341
$$ y = [503887, 508662, 512773, 515879, 518341, 520558, 522096, 522013, 519997, 516723, 513078, 509355, 505317, 500691, 495530, 490242, 485333, 480939, 476727, 472411, 468198, 464413, 460900, 457222, 453371, 449810, 446769, 444038, 441561, 439797, 439206, 439747, 441117, 443214, 446017, 449196, 452195, 454802, 457473, 460995, 465737, 471236, 476639, 481661, 486959, 493369, 500942, 509044, 517219, 525564, 534264, 543159, 551819, 559645, 565911, 570179, 572917, 575337, 578371, 581995, 585605, 588680, 590873, 591798, 591184, 589163, 586254, 583066, 580000, 577072, 574003, 570771, 567985, 566319, 565492, 564297, 561885, 558613, 555357, 552403, 549363, 545836, 541643, 536619, 530683, 524137, 517540, 511216, 505082, 498866, 492370, 485594, 478787, 472295, 466283, 460697, 455554, 450976, 446860, 442840, 438847, 435371, 432879, 431307, 430441, 430419, 431339, 432644, 433547, 434005, 434697, 435938, 437174, 437763, 437827, 438076, 439046, 440794, 443135]
59037D43135K792L113L118K545J467N37M95J370K472L243L798M414M944N098M983
59022D87524M951N117N393N825O463P023P102O766O560O881P493P782P272N947
59008E78099M198K529J208K09n70j106j367j388j138m43Q02K411M014N231N768
58993E98457N541M889M411M287L970K839J100l42q86r06j316k609m466o183p384
58978F01402q153q577q376p245n482l871k891k232j243L56K337M258N766O782
58964E72831P565Q407R174R349Q721P749P093O982P261P650P725O963N316L510
58950F76296K224J157n14k849m922o056o611p187p636p387o522n865n975o503
58936F11650o676o191n461n140n449n943n923n164m138l413k883j935l91J099
$$ y = [443135, 445927, 449040, 452158, 454703, 456170, 456707, 457202, 458572, 461044, 464287, 468085, 472499, 477443, 482541, 487524, 492475, 497592, 502985, 508810, 515273, 522296, 529398, 536164, 542724, 549605, 557098, 564880, 572152, 578099, 582297, 584826, 586034, 586243, 585673, 584567, 583200, 581812, 580674, 580231, 581033, 583444, 587458, 592689, 598457, 603998, 608887, 613298, 617585, 621555, 624394, 625494, 625152, 624266, 623360, 622044, 619435, 614969, 608786, 601402, 593249, 584672, 576296, 569051, 563569, 559698, 556807, 554575, 553332, 553688, 556025, 560283, 566049, 572831, 580396, 588803, 597977, 607326, 616047, 623796, 630889, 637871, 645132, 652782, 660507, 667470, 672786, 676296, 678520, 679677, 679163, 676314, 671392, 665336, 658725, 651538, 643902, 636515, 629993, 624128, 618153, 611650, 604974, 598783, 593322, 588182, 582733, 576790, 570867, 565703, 561565, 558152, 555269, 553334, 552943, 554042]
58922E54042J886K160K581L177L228K347J193Q06J541K958M488N794O693P266
58908F00160P983R226J0601J1146J0443R141Q141P567O911N919M975M552M615
58895G01380M664M208L163J901R47O10P99J211J594J957K611M014O381R317J1957
58880G56714J3614J4228J4190J3797J3013J1624R545O971M345K143N83n18j585
58867H58664k914m515o283q293j0736j3454j5781j7060j7254j6831j6102j5121
58855G14320j4143j3619j3571j3483j3163j3122j3620j3967j3428j2370j1583
58844E68251j0898r553p765o674o566o454n808n492o154o844o342n081m459m745
58830D75416m890m315l572l119k620j860j334j381j470r96k44J41K26O45J600
$$ y = [554042, 555928, 558088, 560669, 563846, 567074, 569421, 570614, 571420, 572961, 575919, 580407, 586201, 592894, 600160, 608143, 617369, 627970, 639116, 649559, 658700, 666841, 674408, 681319, 687238, 692213, 696765, 701380, 706044, 710252, 713415, 715316, 716263, 716873, 717672, 718883, 720477, 722434, 725045, 729059, 735440, 744757, 756714, 770328, 784556, 798746, 812543, 825556, 837180, 846725, 853696, 858041, 860184, 860767, 860249, 858664, 855750, 851235, 844952, 836659, 825923, 812469, 796688, 779628, 762374, 745543, 729441, 714320, 700177, 686558, 672987, 659504, 646341, 633219, 619599, 605632, 592204, 579834, 568251, 557353, 547800, 540035, 533361, 526795, 520341, 514533, 509041, 502887, 496043, 489701, 484620, 480161, 475416, 470526, 466211, 462639, 459520, 456900, 455040, 453706, 452325, 450855, 449859, 449615, 449756, 449982, 450627, 452227]
58815D52227K648L476M182M699M607L810K984K780K878K357J062qJ12J203K190
58800D91207K359J806R27J3o76r16q18p91j082j582k082k448k520k273k123k519
58784D76482l101k865j411M33J696K415L176M016M543M861N457O211O247M997
58770E13157K849N28j609l448m773n435n610n595n505n328n023m508l818l435
58756D62447m000n400o542o492n598m866m418l312j099J204K259K072J854K353
58742D30462L089L340L227L344L821M263M460M627N049N809O826P771Q082P478
58728E01648O446N822N858O115O221O229O165N755M892L852K909K091J503J356
58714E66862J430J063J27m55K69K011L551M116M005L884L997M037L518K228M92
$$ y = [452227, 454875, 458351, 462533, 467232, 471839, 475649, 478633, 481413, 484291, 486648, 487710, 487702, 487814, 489017, 491207, 493566, 495372, 496299, 496312, 495636, 494720, 493902, 493111, 492029, 490447, 488365, 485917, 483397, 481124, 479001, 476482, 473381, 470516, 469105, 469538, 471234, 473649, 476825, 480841, 485384, 490245, 495702, 501913, 508160, 513157, 516006, 516534, 514925, 511477, 506704, 501269, 495659, 490064, 484559, 479231, 474208, 469700, 465882, 462447, 458447, 453047, 446505, 440013, 434415, 429549, 425131, 421819, 420720, 421924, 424183, 426255, 428109, 430462, 433551, 436891, 440118, 443462, 447283, 451546, 456006, 460633, 465682, 471491, 478317, 486088, 494170, 501648, 508094, 513916, 519774, 525889, 532110, 538339, 544504, 550259, 555151, 559003, 561912, 564003, 565506, 566862, 568292, 569355, 569482, 569027, 569296, 571307, 574858, 578974, 582979, 586863, 590860, 594897, 598415, 600643, 601135]
58699F01135j093k273l366m770o505q378j0235j1827j2739j2754j2072j0959r533
58686D94631q088p168o983p104p067o783o164n001l681l273m119n015m650l318
58672D16217k196j405j09J705L003L455M054N498P074P812P885Q133Q759R184
58658D79069Q789P243M541J209j812l910n221o030o220n697m924m439m134l508
58644D54956k514j630j187j013p87m69l06n66j206j758j688r44j0O68J134J668
58628D44348K358L027L424L374K956K572K619K978L094K659J930J285Q33O63J021
58613D79141J965L112M050M716N122M989M140L022K320K064J617O44l25n51r6
58598E15930K36j57j089k012k669l076l112k604j818j383j559j869j669p50P50
$$ y = [601135, 600042, 597769, 594403, 589633, 583128, 574750, 564515, 552688, 539949, 527195, 515123, 504164, 494631, 486543, 479375, 472392, 465288, 458221, 451438, 445274, 440273, 436592, 433319, 429200, 424185, 419535, 416217, 414021, 412616, 412507, 414212, 417215, 420670, 424724, 430222, 437296, 445108, 452993, 461126, 469885, 479069, 487858, 495101, 499642, 500851, 499039, 495129, 489908, 483878, 477658, 471961, 467037, 462598, 458464, 454956, 452442, 450812, 449625, 448612, 447825, 447356, 447050, 446484, 445278, 443520, 441832, 440888, 440878, 441546, 442680, 444348, 446706, 449733, 453157, 456531, 459487, 462059, 464678, 467656, 470750, 473409, 475339, 476624, 477457, 478120, 479141, 481106, 484218, 488268, 492984, 498106, 503095, 507235, 510257, 512577, 514641, 516258, 516902, 516577, 516026, 515930, 516166, 516009, 514920, 512908, 510239, 507163, 504051, 501447, 499629, 498246, 496687, 494818, 493149, 492399, 493149]
58583D93149K552M145M995N286N940P336Q532Q473P470O620O144N448M649M656
58569E75395N543O070N440M511M547N578O805P967R493J1573J3848J5876J7441
58556F90087J8593J9686K1058K2342K2491K0902J8114J5018J1817Q298M589J105
58544H74100j998m642o408o924o608o391o747p426q065q619r291j0319j1744j3096
58530G65822j3633j3286j2961j3387j3945j3360j1408r206p778o996o069m539
58518F39254k583p60L09L50k56p99r31q86r62j107j055p01k26M7l5k14k1N98J067
58499F31089Q11Ln90m78R1M71K52l82p98n33J37M75K53J32P88J978K866L036K830
58480F42431K838L462M759O391P859R124J0684J2713J4512J5268J5059J4491J3605
$$ y = [493149, 495701, 499846, 504841, 510127, 516067, 523403, 531935, 540408, 547878, 554498, 560642, 566090, 570739, 575395, 580938, 587008, 592448, 596959, 601506, 607084, 613889, 621856, 631349, 642922, 656770, 672646, 690087, 708680, 728366, 749424, 771766, 794257, 815159, 833273, 848291, 860108, 868406, 872995, 874100, 872102, 867460, 861052, 854128, 847520, 841129, 834382, 826956, 818891, 810272, 800981, 790662, 778918, 765822, 752189, 738903, 725942, 712555, 698610, 685250, 673842, 664636, 656858, 649862, 643793, 639254, 636671, 635911, 636220, 636570, 636314, 635515, 634584, 633698, 632736, 631629, 630574, 629873, 629647, 629694, 629659, 629445, 629424, 630022, 631089, 631900, 631903, 631313, 630835, 630926, 631397, 631649, 631267, 630469, 629936, 630073, 630548, 630801, 630933, 631721, 633699, 636565, 639601, 642431, 645269, 648731, 653490, 659881, 667740, 676864, 687548, 700261, 714773, 730041, 745100, 759591, 773196]
58467G73196J1906R356O582M081J882N2j128j622j680j364n63L56P36O38R23J972
58451H05323L036L383L383L765M244L813K224L98p68j390k211l685n644p572q903
58436G99396r216q409o755m729k758j094J67J031J606K185L165M646O147P000
58422G92382P158P319Q009Q885R284R284R536J0113J0152R009P185N632M446K968
58408I01362J010p31j640j879j866j633j215j114j725k479k216n03J870L741M611
58393H95593M836N113N826O662O965O632O374O796P547P917Q022Q588R700J0562
58379I97133J0612J0097R317Q107O421M798L675K802J712M97l05l32L65J341J917
58364A058157J717J263J521K731M239N612P159R054J0729J1710J2307J2893J3115
$$ y = [773196, 785102, 794458, 801040, 805121, 807003, 807055, 805927, 804305, 802625, 801261, 800698, 801054, 801790, 802428, 803351, 805323, 808359, 811742, 815125, 818890, 823134, 826947, 829171, 829569, 828801, 827411, 825200, 821515, 815871, 808299, 799396, 790180, 781771, 775016, 770287, 767529, 766435, 766602, 767633, 769239, 771424, 774589, 779235, 785382, 792382, 799540, 806859, 814868, 823753, 833037, 842321, 851857, 861970, 872122, 881131, 888316, 893948, 898394, 901362, 902372, 901641, 900001, 898122, 896256, 894623, 893408, 892294, 890569, 888090, 885874, 885371, 887241, 890982, 895593, 900429, 905542, 911368, 918030, 924995, 931627, 938001, 944797, 952344, 960261, 968283, 976871, 986571, 997133, 1007745, 1017842, 1027159, 1035266, 1041687, 1046485, 1050160, 1052962, 1054674, 1055171, 1054866, 1054534, 1054899, 1056240, 1058157, 1059874, 1061137, 1062658, 1065389, 1069628, 1075240, 1082399, 1091453, 1102182, 1113892, 1126199, 1139092, 1152207]
58351A152207J2562J1675J1234J1238J1008J0101Q622O930N591N282O200P733
58339A260383R135J0181J0909J1304J1659J2609J4242J5764J6614J7217J8084
58328A408101J8899J9255J9533K0059K0207J9349J8012J6996J6000J4475J3223
58317A604109J3518J4996J5984J5902J5724J6080J6425J6403J6496J6915J7166
58306A779718J7307J8293K0444K2591K3573K3694K4001K4836K5852K6818K7789
58295B034916K8760K9651L0340L0608L0409L0307L1047L2606L4230L5491L6707
58284B385072L8211L9929M1800M3958M6330M8634N0882N3233N5449N7064N8095
58273B918657N8781N8871N8080N7056N6848N7319N7343N6691N6586N8015O0616
$$ y = [1152207, 1164769, 1176444, 1187678, 1198916, 1209924, 1220025, 1228647, 1235577, 1241168, 1246450, 1252650, 1260383, 1269518, 1279699, 1290608, 1301912, 1313571, 1326180, 1340422, 1356186, 1372800, 1390017, 1408101, 1427000, 1446255, 1465788, 1485847, 1506054, 1525403, 1543415, 1560411, 1576411, 1590886, 1604109, 1617627, 1632623, 1648607, 1664509, 1680233, 1696313, 1712738, 1729141, 1745637, 1762552, 1779718, 1797025, 1815318, 1835762, 1858353, 1881926, 1905620, 1929621, 1954457, 1980309, 2007127, 2034916, 2063676, 2093327, 2123667, 2154275, 2184684, 2214991, 2246038, 2278644, 2312874, 2348365, 2385072, 2423283, 2463212, 2505012, 2548970, 2595300, 2643934, 2694816, 2748049, 2803498, 2860562, 2918657, 2977438, 3036309, 3094389, 3151445, 3208293, 3265612, 3322955, 3379646, 3436232, 3494247, 3554863]
58262C554863O3564O6525O9381P1961P4518P7605Q1273Q5190Q9584R4930J00597
58251D429991J05159J08424J11784J16114J20624J24465J28161J32697J38229
58242E515648J44527J51690J59666J67991J76631J86279J97178K08630K20151
58233G128391K32237K45423K59683K75210K92669L12082L32611L54073L77509
58224I809888M03642M31967M62059M94628N30610N70434O14811O65047P21817
58215A4704903P84881Q54788R33640J023587J125610J240143J367534J507952
58207B3543038J663084J839077K046328K296173K599633K969621L422004L974646
58199D4353604M649592N478811O506230P783476R365198J1306272J3655377J6445913
$$ y = [3554863, 3618427, 3684952, 3754333, 3826294, 3900812, 3978417, 4059690, 4144880, 4234464, 4329394, 4429991, 4535150, 4643574, 4755358, 4871472, 4992096, 5116561, 5244722, 5377419, 5515648, 5660175, 5811865, 5971531, 6139522, 6316153, 6502432, 6699610, 6908240, 7128391, 7360628, 7606051, 7865734, 8140944, 8433613, 8745695, 9078306, 9432379, 9809888, 10213530, 10645497, 11107556, 11602184, 12132794, 12703228, 13318039, 13983086, 14704903, 15489784, 16344572, 17278212, 18301799, 19427409, 20667552, 22035086, 23543038, 25206122, 27045199, 29091527, 31387700, 33987333, 36956954, 40378958, 44353604, 49003196, 54482007, 60988237, 68771713, 78136911, 89443183, 103098560, 119544473]
58191A19544473J9693859K3398168K7511384L1843375L5901159L8745748L9029941
58184C35668107L5378652K7079717J4726113K97773j3529525k4474136l1437921
58177C43708780l4568953l4757272l3046620l0296404k7104105k3845934k0738215
58170A39351277j7893441j5362018j3154730j1255684r635909q263573p105882
58163E6680040o129390n304379m607671m019239l519150l090299k721311k403861
58155B4884740k128961j888150j676365j490971j328876j186459j061157r51225
58147A3172576q54491p68916o93828o29437n75376n30300m92256m58829m27792
58138G741351l98247l70597l45033l20899k97849k76515k57490k40565k25332
$$ y = [119544473, 139238332, 162636500, 190147884, 221991259, 257892418, 296638166, 335668107, 371046759, 398126476, 412852589, 413150362, 399620837, 375146701, 343708780, 309139827, 274382555, 241335935, 211039531, 183935426, 160089492, 139351277, 121457836, 106095818, 92941088, 81685404, 72049495, 63785922, 56680040, 50550650, 45246271, 40638600, 36619361, 33100211, 30009912, 27288601, 24884740, 22755779, 20867629, 19191264, 17700293, 16371417, 15184958, 14123801, 13172576, 12318085, 11549169, 10855341, 10225904, 9650528, 9120228, 8627972, 8169143, 7741351, 7343104, 6972507, 6627474, 6306575, 6008726, 5732211, 5474721, 5234156, 5008824]
58129E008824k11668j99132j86899j74820j63645j53735j44491j35501j27252
58120C511681j20133j13633j07213j01193r6096r1800q7863q4162q0783p7826
58110B550979p5575p4120p2607o9830o5915o2421o0281n8670n6491n4015n2218
58099A848836n1501n1824n3250n5221n6004n4077m9758m4570l9289l3642k7723
58088A331977k2573j9107j7172j5978j4976j4149j3722j3730j3873j3856j3874
58077A158967j4473j5732j7053j7976j8766j9807k0814k1213k0994k0693k0613
58066I50833k0486j9815j8272j5902j3316j1474j0898j1097j1078j0383r479r198
58054G89435r955j1396j2635j2989j2575j2056j1757j1372j0590r572q613p718
$$ y = [5008824, 4797156, 4598024, 4411125, 4236305, 4072660, 3918925, 3774434, 3638933, 3511681, 3391548, 3277915, 3170702, 3069509, 2973413, 2881613, 2793750, 2709588, 2628805, 2550979, 2475404, 2401284, 2328677, 2258847, 2192932, 2130511, 2070230, 2011560, 1955069, 1901054, 1848836, 1797335, 1745511, 1692261, 1637040, 1581036, 1526959, 1477201, 1432631, 1393342, 1359700, 1331977, 1309404, 1290297, 1273125, 1257147, 1242171, 1228022, 1214300, 1200570, 1186697, 1172841, 1158967, 1144494, 1128762, 1111709, 1093733, 1074967, 1055160, 1034346, 1013133, 992139, 971446, 950833, 930347, 910532, 892260, 876358, 863042, 851568, 840670, 829573, 818495, 808112, 798633, 789435, 779480, 768084, 755449, 742460, 729885, 717829, 706072, 694700, 684110, 674538, 665925, 658207]
58042F58207o882o367o335o423o143n453m643l828l050k668l152m421n804o739
58028E86299p265p702q152q443q472q432q588q817q516p253n456m161l898m117
58014D87027l902l054k223k092k701l517m016m120m047l786k956j477q3K96l11
57999D49038r84j146j188j603k134k176j627r36n97r72k221l961n345n849n773
57984D12526n578n160m307l438l193l459l556l246k925k805k693k585k720k867
57970C63994k297q69M78P92K31l16m07l43n20r02j156r49k33O01R75P23L18K73
57952C60393M79M31j8m43l77J84Q08J030O64j3m40k41M77J369K307L337M276M767
57934C78990M855N143O079P287P968P916P684P666P379O098M031K345J831J900
$$ y = [658207, 651325, 644958, 638623, 632200, 626057, 620604, 615961, 612133, 609083, 606415, 603263, 598842, 593038, 586299, 579034, 571332, 563180, 554737, 546265, 537833, 529245, 520428, 511912, 504659, 499203, 495042, 491144, 487027, 483125, 480071, 477848, 475756, 473055, 469538, 465522, 461402, 457355, 453569, 450613, 449136, 449053, 449349, 449038, 448054, 446908, 445720, 444117, 441983, 439807, 438180, 437244, 436647, 435675, 433454, 429493, 424148, 418299, 412526, 406948, 401788, 397481, 394043, 390850, 387391, 383835, 380589, 377664, 374859, 372166, 369581, 366861, 363994, 361697, 360828, 361306, 362098, 362329, 362013, 361606, 361263, 360743, 359841, 358685, 357736, 357503, 358104, 359079, 359802, 360120, 360393, 360872, 361303, 361285, 360842, 360465, 360649, 361457, 362487, 363151, 363138, 362698, 362457, 362934, 364303, 366610, 369947, 374223, 378990, 383845, 388988, 395067, 402354, 410322, 418238, 425922, 433588, 440967, 447065, 451096, 453441, 455272, 457172]
57920D57172J294l77k287l571m391n456o872p970q261q031p836p770p536p006
57906C81102o297n418m197k661j209l14j32n36j300k156k738k700j966r01r2J59
57890C48644J90O29J604K496K660K207J762J578J364R26N08L32K48J12Q1J92J4
57873C65547p74j766k216j970j523j261j138j098j280j676j988k017j856j564
57859C43420r83q9P66J255J521J919K530L118L567L992M464M773M575L748K609
57844C81185J708J369J398J301P95p9j235k650m102n094n342n141n017n089n036
57829C48971m652m078l431k453q62J101K773L754M271M740N221N510N620N778
57815C72263N909N461L927J431j291l366m275m136l654l464l440k890j550k6J012
$$ y = [457172, 458466, 458089, 455802, 452231, 447840, 442384, 435512, 427542, 419281, 411250, 403414, 395644, 388108, 381102, 374805, 369387, 365190, 362529, 361320, 361006, 360874, 360338, 359038, 356882, 354144, 351444, 349478, 348577, 348485, 348644, 348834, 349463, 351067, 353563, 356223, 358430, 360192, 361770, 363134, 364060, 364568, 364900, 365148, 365260, 365341, 365533, 365547, 364773, 363007, 360791, 358821, 357298, 356037, 354899, 353801, 352521, 350845, 348857, 346840, 344984, 343420, 342437, 342348, 343114, 344369, 345890, 347809, 350339, 353457, 357024, 361016, 365480, 370253, 374828, 378576, 381185, 382893, 384262, 385660, 386961, 387756, 387677, 386442, 383792, 379690, 374596, 369254, 364113, 359096, 354007, 348971, 344319, 340241, 336810, 334357, 333495, 334596, 337369, 341123, 345394, 350134, 355355, 360865, 366485, 372263, 378172, 383633, 387560, 388991, 387700, 384334, 380059, 375923, 372269, 368805, 365365, 362475, 360925, 360899, 361911]
57800C61911J675K450L363M036M431M898N461N644N074L888K454J061q6r57j809
57785D03494k791l465l154j878m41N77J379K300L138L455L250K894K662K490K129
57770D16039J363L30m15n05m40j079k414l445l596l498l897m470m436l800l196
57755C82541k741j967q05J65N57O71R57J476K054K530K712K456J958J654J710
57740C95928J927K142K403K674K656K089J056j05r98j345j199r94j129j516j706
57725D01883j446q13K9Q19J057M23o57j314j279j086j133j074m66M86J176J336
57709C97941J102O41J49l9J93L63p9q82j118l59P24J219J123J263K107L184L774
57692D11306L831L816L839L510K723K019J807J677J034J24k36J19M81M16M30J175
$$ y = [361911, 363586, 366036, 369399, 373435, 377866, 382764, 388225, 393869, 398943, 402831, 405285, 406346, 406260, 405303, 403494, 400703, 397238, 394084, 392206, 391765, 392342, 393721, 396021, 399159, 402614, 405864, 408758, 411420, 413910, 416039, 417402, 417732, 417317, 416812, 416372, 415293, 412879, 409434, 405838, 402340, 398443, 393973, 389537, 385737, 382541, 379800, 377833, 377028, 377193, 377750, 378421, 379378, 380854, 382908, 385438, 388150, 390606, 392564, 394218, 395928, 397855, 399997, 402400, 405074, 407730, 409819, 410875, 410770, 409772, 408427, 407228, 406234, 405105, 403589, 401883, 400437, 399624, 399653, 400472, 401529, 401952, 401295, 399981, 398702, 397616, 396483, 395409, 394943, 395429, 396605, 397941, 399043, 399684, 399833, 399794, 399987, 400350, 400271, 399389, 398271, 397912, 398636, 399855, 400978, 402241, 404348, 407532, 411306, 415137, 418953, 422792, 426302, 429025, 431044, 432851, 434528, 435562, 435686, 435450, 435569, 436050, 436466, 436896, 438071]
57676D38071K579M200N967Q010J0092J1860J3561J5924J9370K3802K9090L5140
57664F17666M1292M6010M7429M3953L4576J9467P69j7548l1509l9177m1104l9122
57652F82702l5040l0221k5609k1644j8194j4903j1625q570o024m084k692j811
57640E02285j414j313j147p59l01R3O27J447K135K072J467J365K321L525L853
57625E16256L345K930K883K512J526P29Q52J403J408Q43N61J001J763K335K535
57610E42882K176J062l63j021k88J224K361K637K490K597L224M180N058N484N292
57595E78995M504L269J927J012Q07R77R52O89O39R17J155J230J547K211K640K465
57579F05936K236K609L275L467L224L252L775M272M391M253L839K901J696J065
$$ y = [438071, 440650, 444850, 450817, 458827, 468919, 480779, 494340, 510264, 529634, 553436, 582526, 617666, 658958, 704968, 752397, 796350, 830926, 850393, 851162, 833614, 802105, 762928, 721824, 682702, 647662, 617441, 591832, 570188, 551994, 537091, 525466, 516896, 510872, 506788, 504096, 502285, 500871, 499558, 498411, 497652, 497351, 497444, 498071, 499518, 501653, 503725, 505192, 506557, 508878, 512403, 516256, 519601, 522531, 525414, 527926, 529452, 530181, 531033, 532436, 533844, 534687, 535248, 536249, 538012, 540347, 542882, 545058, 546120, 545757, 544736, 544448, 545672, 548033, 550670, 553160, 555757, 558981, 563161, 568219, 573703, 578995, 583499, 586768, 588695, 589707, 590514, 591491, 592443, 593132, 593771, 594688, 595843, 597073, 598620, 600831, 603471, 605936, 608172, 610781, 614056, 617523, 620747, 623999, 627774, 632046, 636437, 640690, 644529, 647430, 649126, 650191]
57565F50191J420K216K772L060L328L498L453L443L710M014M034M003M395N209
57551F98746O004O577P092P552P612P027O002M937M082L567L545M045M732N060
57537G76580M881M805N601P068P918P173N428M182M051M308M275M264M757N423
57523H50714N631N457N456N723N873N814N859O132O391O471O401O154N798N754
57509I33628O307O923O794O128O095P180Q390Q506P512O224N163M437M334N130
57495A022751O384P150P007O405N948N833N984O319O651O742O622O632O995P543
57481A114966P935P986P803P816Q512R847J0921J0822R778Q936Q835Q780Q031
57468A230968O937O272O069N937O130P259R035J0357J0864J1388J2448J3280J3058
$$ y = [650191, 651611, 653827, 656599, 659659, 662987, 666485, 669938, 673381, 677091, 681105, 685139, 689142, 693537, 698746, 704750, 711327, 718419, 725971, 733583, 740610, 746612, 751549, 755631, 759198, 762743, 766788, 771520, 776580, 781461, 786266, 791867, 798935, 806853, 814026, 819454, 823636, 827687, 831995, 836270, 840534, 845291, 850714, 856345, 861802, 867258, 872981, 878854, 884668, 890527, 896659, 903050, 909521, 915922, 922076, 927874, 933628, 939935, 946858, 953652, 959780, 965875, 973055, 981445, 989951, 997463, 1003687, 1008850, 1013287, 1017621, 1022751, 1029135, 1036285, 1043292, 1049697, 1055645, 1061478, 1067462, 1073781, 1080432, 1087174, 1093796, 1100428, 1107423, 1114966, 1122901, 1130887, 1138690, 1146506, 1155018, 1164865, 1175786, 1186608, 1196386, 1205322, 1214157, 1222937, 1230968, 1237905, 1244177, 1250246, 1256183, 1262313, 1269572, 1278607, 1288964, 1299828, 1311216, 1323664, 1336944, 1350002]
57455A350002J2270J1993J2229J2075J1262J0546J0477J0807J1293J2126J3096
57444A478176J3206J1931J0335J0019J1173J2434J2714J2387J2442J3066J3563
57433A611446J3349J2594J1912J1701J1950J2450J2995J3395J3412J2952J2370
57422A750526J2311J3055J4040J4354J3764J3040J3100J4003J4967J5272J4957
57411A903389J4595J4606J4918J5202J5282J5276J5438J5877J6398J6613J6302
57400B073896J5706J5370J5608J6210J6745J7025J7193J7455J7879J8367J8659
57389B260113J8489J7951J7653J8162J9343K0452K0981K1090K1121K1039K0578
57378B476972J9759J8972J8670J9034J9884K0722K1094K0952K0536J9880J8788
$$ y = [1350002, 1362272, 1374265, 1386494, 1398569, 1409831, 1420377, 1430854, 1441661, 1452954, 1465080, 1478176, 1491382, 1503313, 1513648, 1523667, 1534840, 1547274, 1559988, 1572375, 1584817, 1597883, 1611446, 1624795, 1637389, 1649301, 1661002, 1672952, 1685402, 1698397, 1711792, 1725204, 1738156, 1750526, 1762837, 1775892, 1789932, 1804286, 1818050, 1831090, 1844190, 1858193, 1873160, 1888432, 1903389, 1917984, 1932590, 1947508, 1962710, 1977992, 1993268, 2008706, 2024583, 2040981, 2057594, 2073896, 2089602, 2104972, 2120580, 2136790, 2153535, 2170560, 2187753, 2205208, 2223087, 2241454, 2260113, 2278602, 2296553, 2314206, 2332368, 2351711, 2372163, 2393144, 2414234, 2435355, 2456394, 2476972, 2496731, 2515703, 2534373, 2553407, 2573291, 2594013, 2615107, 2636059, 2656595, 2676475, 2695263]
57367B695263J7489J6823J7366J8615J9553J9817J9919K0327K0934K1469K1960
57356B909535K2581K3278K3790K3863K3431K2780K2488K2953K3890K4640K4933
57345C168162K5053K5154K4958K4339K3788K3891K4517K4940K4676K3911K3174
57334C436563K2843K2963K3295K3464K3247K2805K2579K2892K3654K4378K4574
57323C693257K4158K3509K3084K3024K3230K3659K4265K4747K4760K4452K4390
57312C956535K4783K5127K4877K4183K3654K3622K3923K4230K4290K4028K3670
57301D222922K3618K3882K3906K3256K2298K1790K1934K2348K2752K3196K3552
57290D475454K3465K2925K2407K2264K2307K2204K1912K1557K1309K1465K2232
$$ y = [2695263, 2712752, 2729575, 2746941, 2765556, 2785109, 2804926, 2824845, 2845172, 2866106, 2887575, 2909535, 2932116, 2955394, 2979184, 3003047, 3026478, 3049258, 3071746, 3094699, 3118589, 3143229, 3168162, 3193215, 3218369, 3243327, 3267666, 3291454, 3315345, 3339862, 3364802, 3389478, 3413389, 3436563, 3459406, 3482369, 3505664, 3529128, 3552375, 3575180, 3597759, 3620651, 3644305, 3668683, 3693257, 3717415, 3740924, 3764008, 3787032, 3810262, 3833921, 3858186, 3882933, 3907693, 3932145, 3956535, 3981318, 4006445, 4031322, 4055505, 4079159, 4102781, 4126704, 4150934, 4175224, 4199252, 4222922, 4246540, 4270422, 4294328, 4317584, 4339882, 4361672, 4383606, 4405954, 4428706, 4451902, 4475454, 4498919, 4521844, 4544251, 4566515, 4588822, 4611026, 4632938, 4654495, 4675804, 4697269, 4719501]
57279D719501K3189K3468K2773K1866K1554K1658K1478K0948K0643K0849K1259
57268D959186K1656K2168K2613K2167K0267J7590J5671J5439J6365J7144J6985
57257E167251J6114J5111J4156J3131J2185J1714J1728J1705J1357J1128J1581
57246E307161J2550J3346J3668J3773J3846J3694J3145J2390J1741J1308J1056
57235E447678J0913J0750J0449J0047R641R154Q422P492O526N462M126K658J413
57222E544731L56r36k505l732m167m260m789n840o723o813o174n383n007n156
57208E483602n450n488n329n336n504n364m704l953l598l658l988m617n401n797
57194E415415n622n578o403p798q906r616j0599j2134j3719j4872j5623j6096
$$ y = [4719501, 4742690, 4766158, 4788931, 4810797, 4832351, 4854009, 4875487, 4896435, 4917078, 4937927, 4959186, 4980842, 5003010, 5025623, 5047790, 5068057, 5085647, 5101318, 5116757, 5133122, 5150266, 5167251, 5183365, 5198476, 5212632, 5225763, 5237948, 5249662, 5261390, 5273095, 5284452, 5295580, 5307161, 5319711, 5333057, 5346725, 5360498, 5374344, 5388038, 5401183, 5413573, 5425314, 5436622, 5447678, 5458591, 5469341, 5479790, 5489837, 5499478, 5508632, 5517054, 5524546, 5531072, 5536534, 5540660, 5543318, 5544731, 5545087, 5544151, 5541646, 5537914, 5533747, 5529487, 5524698, 5518858, 5512135, 5505322, 5499148, 5493765, 5488758, 5483602, 5478152, 5472664, 5467335, 5461999, 5456495, 5451131, 5446427, 5442474, 5438876, 5435218, 5431230, 5426613, 5421212, 5415415, 5409793, 5404215, 5397812, 5390014, 5381108, 5371492, 5360893, 5348759, 5335040, 5320168, 5304545, 5288449]
57182E288449j6384j6931j8261k0053k1206k1188k0616k0230j9969j9641j9694
57171E074276k0604k1879k2532k2307k1773k1419k1251k1220k1355k1517k1449
57160D836970k1125k0673k0028j9124j8212j7554j6894j5892j5012j5232j6614
57149D640610j7898j8040j7605j8084k0093k2902k5624k8167l0806l3324l5079
57138D372988l5752l5622l5042l4025l2477l0485k8114k5109k1275j7092j3432
57127D064563j0593q013n248k773j370j027r56n63J64J295L476P498J3575K1202
57113D081230K9578L8042M6318N4563O3198P2574Q2849R4272J07581J23968J44658
57102D938831J70456K01901K39786K85455L40553M06814M86250N81187O93531
$$ y = [5288449, 5272065, 5255134, 5236873, 5216820, 5195614, 5174426, 5153810, 5133580, 5113611, 5093970, 5074276, 5053672, 5031793, 5009261, 4986954, 4965181, 4943762, 4922511, 4901291, 4879936, 4858419, 4836970, 4815845, 4795172, 4775144, 4756020, 4737808, 4720254, 4703360, 4687468, 4672456, 4657224, 4640610, 4622712, 4604672, 4587067, 4568983, 4548890, 4525988, 4500364, 4472197, 4441391, 4408067, 4372988, 4337236, 4301614, 4266572, 4232547, 4200070, 4169585, 4141471, 4116362, 4095087, 4077995, 4064563, 4053970, 4045957, 4040709, 4037936, 4036566, 4035539, 4034583, 4034020, 4034184, 4035479, 4038955, 4046453, 4060028, 4081230, 4110808, 4148850, 4195168, 4249731, 4312929, 4385503, 4468352, 4562624, 4670205, 4794173, 4938831, 5109287, 5311188, 5550974, 5836429, 6176982, 6583796, 7070046, 7651233, 8344764]
57093H344764Q24003R72116J136344J313158J495819J674961J840616J983147
57085A9584928K092637K159479K176405K137558K032987J845701J559670J175306
57077C4764671P18052K30963k42293o70296j036133j333331j561862j726388j834966
57068B7308417j896777j919366j907181j862606j788428j689378j571780j442495
57060A3230406j308480j176495j052339r39999q41432p56511o82901o16635n54043
57051E301571m93628m36165l83186l35650k93713k57078k25259j97746j74071
57042B505075j53689j35896j19991j05542r2453q0754p0252o0214m9560l7741
57032A598983k5420j4092n316r49l624j5216l3796n3138o6671p2096p1645o8478
$$ y = [8344764, 9168767, 10140883, 11277227, 12590385, 14086204, 15761165, 17601781, 19584928, 21677565, 23837044, 26013449, 28151007, 30183994, 32029695, 33589365, 34764671, 35482723, 35713686, 35471393, 34801097, 33764964, 32431633, 30869771, 29143383, 27308417, 25411640, 23492274, 21585093, 19722487, 17934059, 16244681, 14672901, 13230406, 11921926, 10745431, 9693092, 8753093, 7911661, 7155150, 6472249, 5855614, 5301571, 4807943, 4371778, 3988592, 3652942, 3359229, 3102151, 2876892, 2679146, 2505075, 2351386, 2215490, 2095499, 1989957, 1897504, 1816750, 1746498, 1686284, 1636724, 1598983, 1573563, 1559471, 1554155, 1553206, 1549582, 1534366, 1500570, 1447432, 1380761, 1308665, 1237020, 1168542]
57020A168542o4011n8471n2402m6761m2155l8612l5820l3234l0379k7291k4573
57009G14833k2763k1871k1607k1694k1922k2114k2210k2211k1996k1456k0740
56998D74249k0034j9173j7867j6286j4923j3827j2475j0494q052n422k687o0K115
56985C35064L945O048Q578J0685J1359J0403Q176M865O89l477o476p928q389q489
56971C65053q372p980p404o728n856m678l212j545J43J585K707L921N752Q098
56957C41484J0168J1294J1443J0687Q619M746n27n811r780j2141j3369j3797j3331
56944C29685j2009j0396r100q045o567m268j500J085L248N271P485R923J2454
56931C17266J4977J7260J8628J7994J4517Q330O06p101j3540j7949k0058k0164
$$ y = [1168542, 1104531, 1046060, 993658, 946897, 904742, 866130, 830310, 797076, 766697, 739406, 714833, 692070, 670199, 648592, 626898, 604976, 582862, 560652, 538441, 516445, 494989, 474249, 454215, 435042, 417175, 400889, 385966, 372139, 359664, 349170, 341118, 335696, 333009, 332949, 335064, 339009, 345057, 353635, 364320, 375679, 386082, 394258, 399123, 399812, 396335, 389859, 381931, 373542, 365053, 356681, 348701, 341297, 334569, 328713, 324035, 320823, 319278, 319421, 321006, 323713, 327634, 333386, 341484, 351652, 362946, 374389, 385076, 393695, 398441, 397914, 392103, 382323, 370182, 356813, 343016, 329685, 317676, 307280, 298180, 290135, 283568, 279300, 277800, 278885, 282133, 287404, 294889, 304812, 317266, 332243, 349503, 368131, 386125, 400642, 408972, 409578, 402477, 388937, 370988, 350930, 330766]
56919C30766j9085j7693j6442j5376j4414j3377j2052j0483r101q190p425o300
56907A80828m902l746l020k542k385k774l292l097k109j298j321j636j506j164
56893A46036j192j293n84J101K979M282M797M653M257M313N098N765N056K752
56879A88020k47l147n685p355p359n827m137l339k895j724J50J824L040M528O865
56864A62712R812J2938J6222J9691K2896K5152K6018K5263K2483J7237R751J328
56852C71503o235j1722j4999j6466j6305j4543j1648q558o002m021k167Q4L229
56839B62150P569J2835J8273K3398K8422L3633L8501M1641M1524L7037K7858J4915
56827E87756M24j3026k3736l1096l4913l5161l2578k8791k5261k2213j8910j4864
$$ y = [330766, 311681, 293988, 277546, 262170, 247756, 234379, 222327, 211844, 202743, 194553, 187128, 180828, 175926, 172180, 169160, 166618, 164233, 161459, 158167, 155070, 152961, 151663, 150342, 148706, 147200, 146036, 144844, 143551, 142967, 144068, 147047, 151329, 156126, 160779, 165036, 169349, 174447, 180212, 185268, 188020, 187773, 184626, 178941, 171586, 164227, 158400, 154263, 150924, 148029, 146305, 146455, 148279, 151319, 155847, 162712, 172524, 185462, 201684, 221375, 244271, 269423, 295441, 320704, 343187, 360424, 370175, 371503, 365268, 353546, 338547, 322081, 305776, 291233, 279585, 271027, 265025, 261004, 258837, 258921, 262150, 269719, 282554, 300827, 324225, 352647, 386280, 424781, 466422, 507946, 544983, 572841, 587756, 588180, 575154, 551418, 520322, 485409, 450248, 417670, 388879, 363618, 341405, 322495, 307631]
56815C07631j0464o429k916O89N098J0311J5512J9909K3484K6556K8515K7525
56803D45421K2042J2504J175r640j8701k5350k8928k9307k7515k5046k2598k0037
56791B74020j7400j5024j2631r273m796n98J917L213M989P835J0578J2024J2292
56778B67146J1903J0414O845J189n269j1003j5153j7484j8125j7507j6219j4755
56766A81982j3417j2322j1313j0048q495p197o610o348n583m225l151l012l363
56753H6898l310k745k371k604k908k478j344m94p25j647k072j467o35o52j486
56738E9960k063j644n62L98Q12O55M1o83j003p73m25l32k38K41Q52J037Q64J033
56720E8170J822K620K687K004J149O28N10N28L40j38n57n34k42k88q40j297j042
$$ y = [307631, 297167, 290738, 287822, 288511, 293609, 303920, 319432, 339341, 362825, 389381, 417896, 445421, 467463, 479967, 481142, 471502, 452801, 427451, 398523, 369216, 341701, 316655, 294057, 274020, 256620, 241596, 228965, 219692, 214896, 214298, 216215, 219428, 224417, 232252, 242830, 254854, 267146, 279049, 289463, 296308, 297497, 292228, 281225, 266072, 248588, 230463, 212956, 196737, 181982, 168565, 156243, 144930, 134882, 126387, 119190, 112580, 106232, 100649, 96424, 93273, 90261, 86898, 83588, 80843, 78472, 75868, 72960, 70482, 69138, 68644, 67919, 66272, 64200, 62733, 62098, 61446, 59960, 57897, 56253, 55691, 56089, 56901, 57556, 57597, 56914, 55911, 55138, 54713, 54381, 54143, 54384, 55236, 56273, 57137, 58170, 59992, 62612, 65299, 67303, 68452, 69080, 69590, 70118, 70458, 70320, 69763, 69229, 68987, 68699, 67859, 66562, 65520]
56703F5520k24N09Q08Q08P24O70P05Q05Q40Q54J102J563J691J092K01k42j50J5
56685G7291J25M00O87N09K4M3P53J268Q80N0l99m24l51o3N78R63M17n36o79J85
56665H1721R22P02kl07l6M65R84J410J537J288R39P85Q85J246J860K375K246J425
56647A00445N02p5m09n85k54O94J633J873J460Q11P7o77j075r55r03j481k215
56630I8866k137j198l04J3P4J52k6n49q78o04p1J80J36Q2M1j39m07n65n06j93
56610I1967L25P30O07O3k42L8M34L70J1o3K90P11R20Q31L22o07j527j941j887
56591I1352j759j601j125l13M64J004J393J474Q73k36r32o36R4K88j19k85L40
56574I0276J302J725J262L87j25J07P67J267J469J790K494L160L204K767K653
$$ y = [65520, 65296, 65805, 66613, 67421, 68145, 68815, 69520, 70325, 71165, 72019, 73121, 74684, 76375, 77467, 77668, 77426, 77276, 77291, 77416, 77816, 78503, 79012, 79036, 79079, 79832, 81100, 81980, 82030, 81631, 81207, 80856, 80793, 81371, 82334, 82751, 82215, 81536, 81721, 82643, 83345, 83343, 83036, 83000, 83465, 84449, 85859, 87396, 88684, 89623, 90408, 91293, 92539, 94399, 96774, 99020, 100445, 100947, 100872, 100463, 99878, 99624, 100318, 101951, 103824, 105284, 106095, 106172, 105495, 104420, 103465, 102562, 101081, 98866, 96729, 95531, 95227, 95240, 95314, 95466, 95440, 94891, 94013, 93409, 93338, 93518, 93654, 93736, 93777, 93638, 93231, 92666, 92160, 91967, 92292, 93022, 93629, 93692, 93450, 93488, 93922, 94292, 94303, 94240, 94530, 95241, 96161, 96992, 97314, 96707, 95180, 93239, 91352, 89593, 87992, 86867, 86554, 87018, 88022, 89415, 90889, 91762, 91526, 90594, 89958, 90052, 90340, 90221, 89936, 90276, 91578, 93303, 94565, 94952, 94827, 94934, 95701, 96968, 98437, 100227, 102721, 105881, 109085, 111852, 114505]
56559A14505L362M586N797O903Q019Q821Q525O646L611N48j537k366k318j917
56545A63185j535j450j873k685l348l378k848k259j972j945j957j770j241n40
56531A34384k03n17r71q12j58J43j80l71J00O17M33p0K6O91J011O38J66K7j39
56512A34815o64j203j310j126r88q42m80j02j07n03q55p91l21K00L23j23o97o75
56494A24551J39J121J578J482J249J048O98J44l32m10n0M34N28o3j009j448q38
56477A28822L59J066P12j52m62J54R84J149P18N13P88Q54L37J06J105K674L162
56460A42889K144Q53L63L69K40N9K6j97p26q82k48M13K57k59j43N15Q54P93J019
56441A48339J567J674J142O57N32J74p53j544j366l34P39J221R54J78n22n88l6
$$ y = [114505, 117867, 122453, 128250, 135153, 143172, 151993, 160518, 167164, 170775, 171323, 169786, 167420, 165102, 163185, 161650, 160200, 158327, 155642, 152294, 148916, 146068, 143809, 141837, 139892, 137935, 136165, 134924, 134384, 134181, 133664, 132693, 131881, 131723, 131866, 131686, 131315, 131415, 132032, 132465, 132395, 132421, 133112, 134123, 134761, 134927, 134954, 134815, 134151, 132948, 131638, 130512, 129524, 128682, 128202, 128100, 127993, 127490, 126635, 125844, 125523, 125723, 126046, 125923, 125226, 124551, 124690, 125811, 127389, 128871, 130120, 131168, 131866, 132010, 131678, 131268, 131218, 131652, 132180, 132117, 131108, 129660, 128822, 129181, 130247, 130959, 130807, 130345, 130499, 131483, 132632, 133350, 133863, 134651, 135505, 135842, 135948, 137053, 139727, 142889, 145033, 145886, 146249, 146618, 146858, 146917, 146943, 146746, 146020, 145138, 144890, 145303, 145560, 145301, 145158, 145673, 146527, 147320, 148339, 149906, 151580, 152722, 153379, 153911, 154085, 153332, 151788, 150422, 150088, 150827, 152048, 153002, 153180, 152658, 152070, 152034]
56424A52034O28J081J348J364R53L12r6k57n85j061j096m48L07O07O02O91Q56
56407A57240Q83Q04P74Q01Q72R93R99O77J97M5L81R00J378J817J995J547P32M14
56389A73449R51J676J830J447R42M63P0j7K20M53O26J085J758J843R52j16l98
56372A87234k3K47K58M10P98J181J600K153K395J781O59LJ38M50M80N55J063J668
56354B03050J680R49M5l33j2N37P59O30N98Q77J139J071Q71Q76R51P07J81r9K84
56335B14761J207K150K606K454K072J986K270K525K409J978J433R73R76J840L377
56320B45017M709N046M357L148K003J347J167Q53q4j104j201m34P3q2K4R14J639
56303B67392J334P50J070K043K576K556K672K925K713K143J946K219K466K744
$$ y = [152034, 152662, 153743, 155091, 156455, 157408, 157720, 157624, 157367, 156782, 155721, 154625, 154177, 154484, 155091, 155693, 156384, 157240, 158123, 158927, 159701, 160502, 161374, 162367, 163366, 164043, 164240, 164285, 164666, 165566, 166944, 168761, 170756, 172303, 173035, 173449, 174400, 176076, 177906, 179353, 180295, 180758, 180828, 180811, 181031, 181484, 182110, 183195, 184953, 186796, 187748, 187632, 187234, 187211, 187458, 187716, 188126, 188924, 190105, 191705, 193858, 196253, 198034, 198693, 198696, 198834, 199284, 199764, 200319, 201382, 203050, 204730, 205679, 205724, 205391, 205379, 205916, 206675, 207305, 207903, 208780, 209919, 210990, 211861, 212737, 213688, 214395, 214576, 214477, 214761, 215968, 218118, 220724, 223178, 225250, 227236, 229506, 232031, 234440, 236418, 237851, 238824, 239800, 241640, 245017, 249726, 254772, 259129, 262277, 264280, 265627, 266794, 267647, 267563, 266459, 265258, 264824, 264897, 264815, 264839, 265753, 267392, 268726, 269476, 270546, 272589, 275165, 277721, 280393, 283318, 286031, 288174, 290120, 292339, 294805, 297549]
56289B97549L477M219L949K728J864K074K749L196L592M185M657M731M603M452
56275C48025M241M273N050O289P032P083P388Q544R848J0384J0287J0245J0550
56262D49239J1212J2368J3898J5188J5914J6580J7755J9265K0755K2594K5517
56251F40285K9654L4418L9197M3740M8158N2847N8128O3723O8895P3382P7689
56240A230116Q2084Q5822Q7842Q7852Q6198Q2971P7781P0270O0394M8369L4669
56229B034368K0002N032r768k3850l6413m6832n5036o1351o6192o9907p2592p3925
56217A543536p3516p1579o8873o5900o2631n9044n5398n1803m8157m4669m1831
56206I00135l9507l6814l3373l0025k7584k5515k2723j9312j6591j5251j4413
$$ y = [297549, 301026, 305245, 309194, 311922, 313786, 315860, 318609, 321805, 325397, 329582, 334239, 338970, 343573, 348025, 352266, 356539, 361589, 367878, 374910, 381993, 389381, 397925, 407773, 418157, 428444, 438689, 449239, 460451, 472819, 486717, 501905, 517819, 534399, 552154, 571419, 592174, 614768, 640285, 669939, 704357, 743554, 787294, 835452, 888299, 946427, 1010150, 1079045, 1152427, 1230116, 1312200, 1398022, 1485864, 1573716, 1659914, 1742885, 1820666, 1890936, 1951330, 1999699, 2034368, 2054370, 2059402, 2049634, 2025784, 1989371, 1942539, 1887503, 1826152, 1759960, 1690053, 1617461, 1543536, 1470020, 1398441, 1329568, 1263668, 1201037, 1141993, 1086595, 1034792, 986635, 941966, 900135, 860628, 823814, 790441, 760416, 732832, 707317, 684594, 665282, 648691, 633440, 619027]
56195F19027j2830j0453q422p669p913q040p304n967m763l943l101j886o14K4
56181E36146k55r20j060l13P00J089R14J134K197L234L271K679K635L479M438
56166E59368M859M809M536M218M327N323O788P684P728P762Q539R825J0941J1496
56152F58203J1432J1055J1232J2815J5649J8844K2084K5867L0373L5293M1048
56141H93895M8932N9200O9925P8476Q3486Q4732Q1956P4917O4377N2418M1673
56130A633987L4333L1106L0817L1303L0901K8683K3789J5995P114L01k872l730
56118A861727m496o350j0144j7344k8585m2077n4737o4406p0131p1310o8064o1956
56106A362127n4883m7500l9716l2257k6321k1933j7925j3625r459n856k648K83
$$ y = [619027, 606197, 595744, 587322, 579653, 571740, 563700, 556396, 550429, 545666, 541723, 538622, 536736, 536122, 536146, 535891, 534971, 533911, 533598, 534298, 535387, 536301, 537435, 539632, 542866, 546137, 548816, 551451, 554930, 559368, 564227, 569036, 573572, 577790, 582117, 587440, 594228, 601912, 609640, 617402, 625941, 635766, 646707, 658203, 669635, 680690, 691922, 704737, 720386, 739230, 761314, 787181, 817554, 852847, 893895, 942827, 1002027, 1071952, 1150428, 1233914, 1318646, 1400602, 1475519, 1539896, 1592314, 1633987, 1668320, 1699426, 1730243, 1761546, 1792447, 1821130, 1844919, 1860914, 1868028, 1868329, 1865457, 1861727, 1857231, 1850881, 1840737, 1823393, 1794808, 1752731, 1697994, 1633588, 1563457, 1492147, 1424083, 1362127, 1307244, 1259744, 1220028, 1187771, 1161450, 1139517, 1121592, 1107967, 1098508, 1092652, 1090004, 1090287]
56094A090287K578L949M594M849M909M923N017N193N441N835O405P064P793Q515
56080A167352Q848Q568Q341R149J0891J2472J3453J4435J5520J5834J5194J4873
56068A314930J5738J6917J7399J7669J8491J9299J9339J9377K0624K2707K4320
56057A526810K5271K6279K7250K7484K7250K7524K8346K8972K9498L0807L2905
56046A838396L4683L5513L5907L6461L7192L7991L8845L9641M0428M1654M3440
56035B260151M5041M5819M6098M6242M5661M3942M2283M2413M4552M7613N0946
56024B760761N4494N7822O0398O2575O4925O7013O8111O8766P0352P3335P7173
56013C485725Q1473Q6080R0525R4617R9085J04512J10227J15360J20143J25060
$$ y = [1090287, 1092865, 1096814, 1101408, 1106257, 1111166, 1116089, 1121106, 1126299, 1131740, 1137575, 1143980, 1151044, 1158837, 1167352, 1176200, 1184768, 1193109, 1202258, 1213149, 1225621, 1239074, 1253509, 1269029, 1284863, 1300057, 1314930, 1330668, 1347585, 1364984, 1382653, 1401144, 1420443, 1439782, 1459159, 1479783, 1502490, 1526810, 1552081, 1578360, 1605610, 1633094, 1660344, 1687868, 1716214, 1745186, 1774684, 1805491, 1838396, 1873079, 1908592, 1944499, 1980960, 2018152, 2056143, 2094988, 2134629, 2175057, 2216711, 2260151, 2305192, 2351011, 2397109, 2443351, 2489012, 2532954, 2575237, 2617650, 2662202, 2709815, 2760761, 2815255, 2873077, 2933475, 2996050, 3060975, 3127988, 3196099, 3264865, 3335217, 3408552, 3485725, 3567198, 3653278, 3743803, 3838420, 3937505, 4042017, 4152244, 4267604, 4387747, 4512807]
56003D512807J29719J33949J38787J44929J51383J57431J64484J74073J85256
55994E892818J96230K07192K19333K32243K44983K58618K74971K93741L13465
55985H133594L34263L57045L81140M05747M32493M63518M98197N35044N75570
55976A2116611O22539O75822P34051P99232Q75273R62790J060050J168484J292620
55967B0307472J435227J597774J785647K008098K273575K590473K972437L438022
55959C8408725M006562M701529N558307O622338P939323R552488J1505609J3836296
55951A02131177J6562414J9678476K3149591K6858017L0482782L3363375L4460570
55944B86686402L2549143K6707468J6947973M571520q149651j8897094k6246859
$$ y = [4512807, 4642526, 4776475, 4915262, 5060191, 5211574, 5369005, 5533489, 5707562, 5892818, 6089048, 6296240, 6515573, 6747816, 6992799, 7251417, 7526388, 7820129, 8133594, 8467857, 8824902, 9206042, 9611789, 10044282, 10507800, 11005997, 11541041, 12116611, 12739150, 13414972, 14149023, 14948255, 15823528, 16786318, 17846368, 19014852, 20307472, 21742699, 23340473, 25126120, 27134218, 29407793, 31998266, 34970703, 38408725, 42415287, 47116816, 52675123, 59297461, 67236784, 76789272, 88294881, 102131177, 118693591, 138372067, 161521658, 188379675, 218862457, 252225832, 286686402, 319235545, 345943013, 362890986, 367462506, 359312855, 340415761, 314168902]
55937C14168902l0005859l0858935k9765747k7558138k4830597k1968997j9197558
55930A29983071j6630223j4322238j2296406j0546603r046757p768437o686622
55923E2685785n773321m998365m338483l778284l302608k894933k543037k239533
55915B2817221j976764j746666j545160j371116j221146j090012r75202q76216
55907A2014939p90126p12680o43162n83401n32457m86817m45349m09531l78960
55898G032456l51035l25047l02417k82777k63780k44966k27988k12872j97690
55889D623884j82326j68969j58547j50025j43412j39896j38446j35801j30637
55880C275825j24641j18849j12154j04339r7333r2061q6830q0322p3811o9097
$$ y = [314168902, 284163043, 253304108, 223538361, 195980223, 171149626, 149180629, 129983071, 113352848, 99030610, 86734204, 76187601, 67140844, 59372407, 52685785, 46912464, 41914099, 37575616, 33797332, 30494724, 27599791, 25056754, 22817221, 20840457, 19093791, 17548631, 16177515, 14956369, 13866357, 12891155, 12014939, 11224813, 10512133, 9868971, 9285570, 8753113, 8266296, 7820947, 7411416, 7032456, 6681421, 6356374, 6053957, 5771180, 5507400, 5262434, 5034446, 4821574, 4623884, 4441558, 4272589, 4114042, 3964017, 3820605, 3680709, 3542263, 3406462, 3275825, 3151184, 3032335, 2920181, 2815842, 2718509, 2626448, 2539618, 2459296, 2385485, 2316388]
55870B316388o6346o5130o5544o6945o7437o5922o3243o0371n7076n3243m9912
55859A635219m7937m6942m6408m6498m6990m6682m4604m0862l5880l0082k4695
55848A177639k1386k0480k0718k1173k2049k3235k3672k2813k1376j9965j8311
55837I42461j6530j5633j5905j6058j5059j3663j3157j3489j3691j3385j2865
55826G83026j2306j1699j1215j1002j0922j0886j1088j1663j2536j3609j4596
55815F51504j4765j3715j2292j1731j1843j1247r510p813p112o941o593o275o309
55802E25358o177n204l598k071j049p02j116j899k256j939j515j337r94j40R12
55787D96273J898L098M631O037P189Q725J0666J1281Q370J639o840j4372j9349
$$ y = [2316388, 2250042, 2184912, 2119368, 2052423, 1984986, 1919064, 1855821, 1795450, 1738374, 1685131, 1635219, 1587282, 1540340, 1493932, 1447434, 1400444, 1353762, 1309158, 1268296, 1232416, 1202334, 1177639, 1156253, 1135773, 1115055, 1093882, 1071833, 1048598, 1024926, 1002113, 980737, 960772, 942461, 925931, 910298, 894393, 878335, 863276, 849613, 836456, 822967, 809276, 795891, 783026, 770720, 759021, 747806, 736804, 725882, 714996, 703908, 692245, 679709, 666100, 651504, 636739, 623024, 610732, 599001, 587158, 575911, 566401, 558588, 551476, 544535, 537942, 531667, 525358, 519181, 513977, 510379, 508308, 507259, 506557, 505441, 503542, 501286, 499347, 497832, 496495, 495501, 495361, 496273, 498171, 501269, 505900, 511937, 519126, 527851, 538517, 549798, 558168, 559807, 552967, 538595, 519246]
55774E19246k1577k1645k0240j7826j4817j1761r058o696m733l805m510o301p799
55761C68478q322q323q248p842o913n913n209m457l292k100j547j692k016k057
55747C00547j789j639k287l965n886o917o930o782o805o244m659l007k547l182
55733B37908l647l115k006j274j409k092k530k187j327q00j230k494l863m473
55719B05461l893k670k050k632l558l616k905k451k456k077j021j43k1k9N15J229
55703A77683J390J039O14O4r21k124k970l236l149l023l114l525l968l978l502
55688A47280k851k019p46N95J052M46j60R1O95P45L55K81O35Q53O50K69q8m70
55670A47613r28j454j989k190j631n65Pl98r79o97K84R61R26O70O64Q42R99J057
$$ y = [519246, 497669, 476024, 455784, 437958, 423141, 411380, 402322, 395626, 390893, 387088, 382578, 376277, 368478, 360156, 351833, 343585, 335743, 328830, 322917, 317708, 313251, 309959, 307859, 306312, 304620, 302604, 300547, 298758, 297119, 294832, 290867, 284981, 278064, 271134, 264352, 257547, 251303, 246644, 243637, 241090, 237908, 234261, 231146, 229140, 227866, 226457, 224365, 221835, 219648, 218321, 217521, 216291, 213797, 209934, 205461, 201568, 198898, 196848, 194216, 190658, 187042, 184137, 181686, 179230, 177153, 176132, 175989, 175968, 175939, 176454, 177683, 179073, 180112, 180726, 180790, 179869, 177745, 174775, 171539, 168390, 165367, 162253, 158728, 154760, 150782, 147280, 144429, 142410, 141664, 142259, 143311, 143757, 143597, 143688, 144383, 145128, 145483, 145764, 146399, 147252, 147902, 148171, 148083, 147613, 146685, 145231, 143242, 141052, 139421, 138856, 138863, 138465, 137486, 136789, 137073, 138034, 138960, 139630, 140294, 141136, 142135, 143192]
55652A43192R41O22K61J9j87m01l52J03M69O0j058k010k045j271m56l12q90j577
55634A35108j779j597j632k087k565k775k954l291l470l207k733k404k157j720
55620A00737j028j61P32J173O60m64j011m32L77K76o15j392j788k250k873l203
55604H8738l044k718k423j958j229m94p7r2m45p93p05j55L13K60m4j02K1j47p18
55585G4188j340j672j588j088m25m8p2j3N02J159J483J588J846K223K579L228
55569H2550M431N606N843N109M138L256K056L37j424k626l074k875k400k277k872
55554I5778l696l896l401k950l054l423l547l223k494j609j081j169j281n69P91
55539F1176J595J153J04n23n03k29M0K97M36L16K3k17l05j97J91Q24J416J622
$$ y = [143192, 144133, 144755, 145016, 145035, 144848, 144447, 144095, 144198, 144667, 144727, 143669, 141659, 139614, 138343, 137887, 137575, 136685, 135108, 133329, 131732, 130100, 128013, 125448, 122673, 119719, 116428, 112958, 109751, 107018, 104614, 102457, 100737, 99709, 99548, 100280, 101453, 102113, 101649, 100638, 100206, 100583, 100859, 100244, 98852, 97064, 94814, 91941, 88738, 85694, 82976, 80553, 78595, 77366, 76872, 76795, 76703, 76258, 75465, 74760, 74605, 74918, 75178, 75134, 75032, 75053, 74906, 74188, 72848, 71176, 69588, 68500, 68075, 68027, 67955, 67942, 68444, 69603, 71086, 72674, 74520, 76743, 79322, 82550, 86981, 92587, 98430, 103539, 107677, 110933, 112989, 113326, 111902, 109276, 106202, 103327, 100927, 98650, 95778, 92082, 88186, 84785, 81835, 78781, 75358, 71811, 68588, 66094, 64485, 63404, 62235, 60954, 60385, 61176, 62771, 63924, 64028, 63505, 63002, 62773, 62813, 63110, 63546, 63862, 63885, 63668, 63363, 63166, 63357, 64181, 65597, 67219]
55521F7219J372R12N99N51N14J44m82q87r24j070j661k248k228j827j715j871
55505E6398j590o69J76K28m27j232j701j490n33O59J255Q90l8r57j573j736j404
55488D6256q53m77k58Q9M41L00l59r51j133j186j287j081l58M72J031J542K237
55471D4425K685K332J330L23l41p48r39q36m55J01P23J124R10J29n88q22q64j076
55453D7413j118m92M12O29j25j050j273p18R1O64Q21O45L61J33p5k93l59j75j5
55434D5476j89n51o54m04q1J68M37O30M49Oj51J37K64k74j015j086m18K17K95
55415D3256J41K40M92M71J37j22l5K36L39R1l97p80p82n75o34j080j303o53O07
55396C9649J440J235M33j51k09K5K88M43L71K2m67q81j026p30j2O66P39K81j5
$$ y = [67219, 68591, 69503, 70102, 70653, 71167, 71311, 70829, 69942, 69018, 67948, 66287, 64039, 61811, 59984, 58269, 56398, 54808, 54139, 54315, 54543, 54116, 52884, 51183, 49693, 49160, 49819, 51074, 51964, 51926, 50969, 49396, 47660, 46256, 45403, 44926, 44668, 44757, 45198, 45498, 45139, 44188, 43055, 41869, 40582, 39501, 39143, 39615, 40646, 42188, 44425, 47110, 49442, 50772, 51095, 50754, 50006, 49067, 48231, 47776, 47877, 48600, 49724, 50634, 50763, 50175, 49353, 48489, 47413, 46295, 45803, 46215, 46844, 46719, 45669, 44396, 43678, 43769, 44433, 45254, 45899, 46260, 46393, 46318, 46025, 45666, 45491, 45476, 45287, 44736, 44082, 43678, 43597, 43765, 44202, 44832, 45281, 45287, 45136, 45273, 45537, 45263, 44248, 43162, 42744, 42961, 43256, 43397, 43637, 44129, 44600, 44737, 44615, 44580, 44816, 45155, 45246, 44849, 44069, 43287, 42712, 42078, 40998, 39695, 39042, 39649, 41089, 42324, 42757, 42606, 42397, 42422, 42710, 43153, 43524, 43546, 43079, 42198, 41172, 40442, 40430, 41096, 41835, 42116, 42101]
55377D2101J42K14j78m54J4P17O52j04n35l67m82j364k150j847p16K52O79Q62
55359C7436Q29K48p67j433j187l66K09J48k09k50K40Q82J128Q31L09q1l13n31
55341C7123p65q74p41l78L5K81K55P5p0r2JK08M29M19O0l70m55j69J73L85N81
55320C6111Q10R11P66N14L91M99P30P80L51l86p99n95l07n00p40j62J037J587
55302D0998Q85j89n84m45m87p10n35J26P41R83R85Q53N12N1k43k99l70o42r84
55283D0646j120q46j72N99J033J020R09R71R60N25j38m71l09j1J24J69K39K59
55265D4387J93K32N55J071J537J743J552Q54k54j274j471m96J006J656N99j454
55249E0436k773k370r29J73L98K71M21Q67J226J121M04p15j670j964j657j224
$$ y = [42101, 42243, 42457, 42279, 41825, 41839, 42556, 43208, 43104, 42569, 42202, 41720, 40356, 38206, 36359, 35643, 35895, 36574, 37436, 38265, 38513, 37746, 36313, 35126, 34760, 34969, 35117, 34908, 34658, 34898, 35780, 36908, 37739, 38048, 37967, 37654, 37123, 36358, 35484, 34743, 34365, 34400, 34681, 34936, 35011, 34941, 34849, 34850, 35058, 35487, 35906, 35966, 35596, 35141, 34972, 35145, 35530, 36111, 36921, 37832, 38598, 39112, 39503, 40002, 40732, 41512, 41863, 41477, 40678, 40083, 39776, 39276, 38536, 38374, 39411, 40998, 41883, 41694, 41110, 40665, 40178, 39468, 38933, 39059, 39800, 40783, 41768, 42621, 43133, 43184, 42941, 42642, 42272, 41630, 40646, 39526, 38680, 38508, 39107, 40140, 41160, 42069, 43040, 44000, 44525, 44387, 43916, 43607, 43596, 43720, 43889, 44128, 44387, 44580, 44812, 45367, 46438, 47975, 49718, 51270, 52124, 51870, 50596, 49125, 48629, 49635, 51291, 51890, 50436, 47663, 45293, 44364, 44537, 44935, 45206, 45627, 46494, 47720, 48841, 49245, 48530, 46860, 44896, 43239, 42015]
55233D2015r02m35M31J434J960J666Q57J99J00L70M57k7r83j909k182j462j15
55216D1474Q91Q75K58R0P11J383J349P21L3n68j115j299q12j3L53R6l10n16n89
55197D3012n52k20L20N60J91l92m98J37J140J857J818J063J18m30l86N4O18J057
55179D9467J041L76o61j446j616j313q26k99J78M82O02O64O40L28l24j009j401
55162D4883j474j365j066n24J62P28J029J123J149J191J290J485J793K078J974
55147E4456J160j36j101j124n29k37o58j287j396q15J54J137J769J634O70n08
55131E3189j071q46m05k93m35m78l49k65k83k13J0J30q2m56o21m83k91k22j45
55112D6391R9L51K95q4m42m71j90J66L82L46M9l10l47J89J052J614J438O84q4
$$ y = [42015, 41113, 40678, 41109, 42543, 44503, 46169, 47026, 47225, 47325, 47695, 48152, 48125, 47142, 45233, 43051, 41589, 41474, 42365, 43240, 43498, 43588, 44299, 45682, 47031, 47752, 47785, 47217, 46102, 44803, 43991, 43978, 44331, 44427, 44117, 43601, 43012, 42460, 42240, 42560, 43120, 43311, 42919, 42421, 42558, 43698, 45555, 47373, 48436, 48554, 48124, 47738, 47792, 48410, 49467, 50508, 50884, 50223, 48777, 47161, 45848, 45022, 44723, 44901, 45383, 45985, 46649, 47289, 47617, 47293, 46284, 44883, 43409, 42044, 40978, 40454, 40616, 41344, 42373, 43496, 44645, 45836, 47126, 48611, 50404, 52482, 54456, 55616, 55480, 54379, 53255, 52726, 52489, 51831, 50544, 49148, 48333, 48487, 49624, 51393, 53027, 53697, 53189, 52118, 51272, 50867, 50574, 50139, 49661, 49312, 49047, 48764, 48551, 48561, 48691, 48609, 48153, 47532, 47049, 46758, 46536, 46391, 46490, 46841, 47136, 47052, 46610, 46139, 45949, 46115, 46497, 46843, 46892, 46582, 46235, 46424, 47476, 49090, 50528, 51212, 51128]
55093E1128m45l50N6O24J175J464J368R59L87j88m68j19P81J516J397N63j73l00
55075E9375r7o2k48l16k7M71P54M45l61r93q25n0N29M62R6p9n8j7R4K63J29n39
55053E8946j265j327o57J00L79J41l35p02o01R5J028J575J435P80k4o61r25q46
55035E7136p16o93n24L5O49P18J89l64m83k40R6L43L21n6m97n47k32q4l51o50
55015E4050n78k99j42l7K33M88L42j37m00r0N42R80J032R88J251J876K445K447
54997F4991J785Q58R2m27q23j139j319j343j170o24L59J395J794J231K14l79j94
54980F5301K80L60L6r3L71J133J598J453P48k92j194j306m00Q62J490J226O65
54963G2238L07k8o18j166j100l38N45R05N49k05p74p18j49K70p2j012j700j463
$$ y = [51128, 50683, 50333, 50389, 51013, 52188, 53652, 55020, 55979, 56366, 56178, 55710, 55591, 56372, 57888, 59285, 59848, 59675, 59375, 59278, 59216, 58968, 58652, 58625, 59096, 59850, 60295, 59934, 58941, 58116, 58066, 58595, 59057, 59153, 59074, 59016, 58999, 59093, 59356, 59485, 58946, 57681, 56354, 55697, 55797, 56176, 56317, 55982, 55280, 54679, 54774, 55802, 57377, 58812, 59592, 59568, 58907, 57982, 57136, 56420, 55727, 55203, 55238, 55887, 56605, 56794, 56430, 55947, 55707, 55803, 56146, 56467, 56411, 55914, 55367, 55135, 55051, 54700, 54050, 53472, 53173, 53031, 52994, 53227, 53715, 54057, 53920, 53520, 53430, 53972, 54952, 55984, 56972, 58223, 60099, 62544, 64991, 66776, 67634, 67726, 67299, 66476, 65337, 64018, 62675, 61505, 60881, 61240, 62635, 64429, 65660, 65874, 65495, 65301, 65581, 65941, 65977, 65884, 66255, 67388, 68986, 70439, 71187, 70895, 69701, 68395, 67995, 68857, 70347, 71573, 72238, 72545, 72517, 71899, 70733, 69633, 69295, 69840, 70745, 71294, 71089, 70315, 69597, 69448, 69718, 69646, 68634, 66934, 65471]
54945F5471n50J07j29r51j486j214m27K72O20P08O02K84m5l6L35O48O30N75R38
54926F6352J619K037J792J084L32k19m91m00J01Q82J709K394K784K726K272J872
54910H6846K058K871L801M359M471M201L469K385J422Q77L24q12k305l295l410
54895A07262l069k576j699m51M33L41l59q61r81j131j497j835j911j640j006k43
54879H8777Po57j694k084j476m83J32J97J15M96J634L019L607L058K347K550L358
54862A02903L586K984K445K394K073Q18q57k106k903l686m397m594m250l783l472
54847H7155l329l382l611l752l511k969k486k215j968j465o21L26Q88P79L49K84
54831F0472P50J175J076P00N18M33Qp14j145r19l32Q4J99K66M57N39K48k42m52
$$ y = [65471, 64921, 65028, 64899, 63948, 62462, 61248, 60821, 61093, 61713, 62421, 63023, 63307, 63262, 63226, 63561, 64209, 64839, 65414, 66352, 67971, 70008, 71800, 72884, 73216, 72997, 72506, 72106, 72207, 73089, 74798, 77192, 79976, 82702, 84974, 86846, 88904, 91775, 95576, 99935, 104406, 108607, 112076, 114461, 115883, 116760, 117084, 116272, 113967, 110672, 107262, 104193, 101617, 99918, 99467, 99900, 100241, 99882, 99021, 98040, 96909, 95412, 93577, 91666, 90026, 89020, 88777, 88784, 88127, 86433, 84349, 82873, 82390, 82522, 82719, 82834, 83330, 84964, 87983, 91590, 94648, 96995, 99545, 102903, 106489, 109473, 111918, 114312, 116385, 117203, 116346, 114240, 111337, 107651, 103254, 98660, 94410, 90627, 87155, 83826, 80444, 76833, 73081, 69570, 66601, 64115, 61900, 59932, 58467, 57846, 58172, 59060, 59839, 60188, 60472, 61222, 62397, 63473, 64173, 64691, 65124, 65132, 64418, 63273, 62354, 62022, 62106, 62305, 62571, 63028, 63567, 63815, 63573, 63121]
54812F3121l25m17j003j379o88P45J666J493Q86N47L09j87n96l78L26R22J184
54795F6226J263J195R91R45J265J580J362P31L11L29M17K75M2q4j61k87l79k96
54777G5725kM58R86J372J372Q41j65j324k085k008j241m08R6M48R00J329J534
54760G7828J667J977K379K630K739K866L012L129L316L555L487K831J840R19k9
54745A14146j382l034m287m633m244l678l264k922k413j782j443j675k065j892
54731G5432j126m82l32k26J51K71l21r88p57K50J039J136R60R18R75J093J364
54714G9357J661J821K138L037M236M950M870M313L439K133O77l34r24j737k895
54699A06742l704l751l495l368l125k538k030j951j871j227k64K63M3o27j248
$$ y = [63121, 62796, 62379, 61376, 59997, 59309, 60054, 61720, 63213, 64099, 64646, 64955, 64768, 64172, 63794, 64120, 65042, 66226, 67489, 68684, 69675, 70620, 71885, 73465, 74827, 75558, 75869, 76198, 76615, 76890, 76932, 76848, 76687, 76400, 76021, 75725, 75723, 76181, 77167, 78539, 79911, 80752, 80587, 79263, 77178, 75170, 73929, 73521, 73617, 74065, 74965, 76294, 77828, 79495, 81472, 83851, 86481, 89220, 92086, 95098, 98227, 101543, 105098, 108585, 111416, 113256, 114175, 114146, 112764, 109730, 105443, 100810, 96566, 92888, 89624, 86702, 84289, 82507, 81064, 79389, 77324, 75432, 74306, 73824, 73492, 73266, 73417, 73688, 73367, 72379, 71622, 71872, 72911, 74047, 75007, 75925, 76900, 77993, 79357, 81018, 82839, 84977, 88014, 92250, 97200, 102070, 106383, 109822, 111955, 112632, 112298, 111374, 109637, 106742, 103038, 99287, 95792, 92424, 89299, 86761, 84731, 82780, 80909, 79682, 79418, 79681, 79724, 79097, 77849]
54684G7849j356p24J75L68m59j421j543j026p97j180j626j585r65N8J118J589
54668F8475J103J73k24K47R68J157O20k49q38p10l5M24J17n81q11l14L83P91Q87
54649G1583O50j05j126j559r15J09L93j78o21j82P61J310J114N07j02n44p16n34
54631F9845j60J15K80N77R32Q18kr22j154o86j39J36K66K92K7l87m57j11O5l08
54611F9027p40n14L61J214J478J042Q6j037j834k011j697j189o20p6K44K85L37
54594F4356O87J222J685K057K332K173J315K08l44j72J07M7q3J22M68M29j42r05
54576G5562j488j797j853j634j108l81L48R31J354J600J484Q00k76j138j266p65
54560G0373k00Lj53m66p77r38q00l71J51O06R67J221J295J168J013J035J214J275
$$ y = [77849, 76493, 75769, 75944, 76312, 75853, 74432, 72889, 71863, 71066, 69886, 68260, 66675, 65710, 65768, 66886, 68475, 69578, 69751, 69527, 69774, 70742, 71899, 72519, 72270, 71432, 70722, 70687, 71111, 71228, 70647, 69836, 69522, 69905, 70696, 71583, 72233, 72128, 71002, 69443, 68528, 68637, 69030, 68852, 68231, 68049, 68810, 70120, 71234, 71741, 71639, 71095, 70379, 69845, 69685, 69800, 70080, 70657, 71589, 72407, 72405, 71483, 70329, 69643, 69504, 69640, 69906, 70198, 70225, 69838, 69381, 69270, 69335, 69027, 68287, 67773, 68134, 69348, 70826, 71868, 71954, 70917, 69083, 67072, 65375, 64186, 63566, 63490, 63734, 64019, 64356, 65043, 66265, 67950, 70007, 72339, 74512, 75827, 76035, 75691, 75519, 75626, 75673, 75590, 75712, 76180, 76609, 76467, 75562, 74074, 72277, 70424, 68790, 67682, 67301, 67649, 68580, 69934, 71534, 73018, 73818, 73542, 72404, 71138, 70373, 70173, 70176, 70023, 69557, 68780, 67842, 67042, 66671, 66822, 67428, 68395, 69616, 70911, 72079, 73092, 74127, 75341, 76616]
54542G6616R52K69m15o64l01M33J037J116P17L15M07R71J449J380Q91M08M0l73
54524H5248o99n67p3L3p01j677j929j324o00l31l45k80j60k23m50n73m03K7N78
54505G5551J050J186P66j63j136j462p59O03J752K114J874J522J195P00j0p22
54489H4061j281j670j776j415p15j48J1L8L41Q56J097Q40M59N04J020J452J267
54472H4941N52j03k10K33R01J404J407Q14M0k39J56O15N31J33J39P02J246J307
54454I4569J014O73L37M9M1M17Q72R96O32j95j326k233k182j085J16M36Ok59j3
54435I2865J57k33q29j037q37o03m08jO32J138J234J021P76N65K54k22o10n23
54417I3339N3N12J66q85j750j755j164n89j02N80J232J226N40p7j87l00q85j356
$$ y = [76616, 77568, 77837, 77422, 76758, 76457, 76890, 77927, 79043, 79760, 80075, 80482, 81453, 82902, 84282, 85173, 85581, 85621, 85248, 84549, 83982, 83909, 83942, 83241, 81564, 79635, 78311, 77711, 77380, 77035, 76755, 76595, 76372, 75922, 75349, 74946, 74973, 75551, 76601, 77787, 78553, 78390, 77254, 75792, 75033, 75636, 77388, 79502, 81376, 82898, 84093, 84793, 84783, 84061, 82780, 81110, 79334, 77919, 77204, 77056, 77067, 77105, 77446, 78302, 79399, 80239, 80698, 81202, 82222, 83674, 84941, 85493, 85390, 85180, 85413, 86314, 87718, 89125, 89939, 89979, 89740, 89896, 90511, 91042, 91175, 91314, 92016, 93262, 94569, 95583, 96256, 96593, 96642, 96683, 97100, 97972, 98968, 99600, 99405, 98079, 95846, 93664, 92579, 92695, 93131, 93137, 92878, 92865, 93022, 92789, 91960, 90923, 90086, 89483, 89075, 89074, 89706, 90844, 92078, 93099, 93875, 94440, 94694, 94472, 93862, 93339, 93392, 93904, 94070, 93185, 91435, 89680, 88516, 87927, 87825, 88405, 89637, 90863, 91403, 91326, 91139, 90839, 89954, 88598]
54399H8598q46L72J093Q31M95J031K121K684K296J567J292J668K315K638K176
54384A10331R36n06j446j690j623j598j514j123n03j2J85L16O24R94J044N94q5
54367A04924m76k68L76R64J092P34J91k19l88m36n56q47j115q82J04J341J810
54350A06349J083o7n15m6O10R07J025J260J462J405J132P03K1p37j070r13r47
54333A11662j531j918j283j61J22p11j570j577j028n77l02j1K21K60J93Q1j52
54316A01718l64k67p1l91j202j562q55L44J112J291J127N00o79j707j704q41j49
54299I6300j23k83j42J34K12R3o8k24l40l37k67j95L5N29Q64M30o58j483j414
54280I3063q34n08n87n97k03M01Q29R33Q09N97L97L56O24J097J380J167O19J05
$$ y = [88598, 87752, 88124, 89217, 90048, 90543, 91574, 93695, 96379, 98675, 100242, 101534, 103202, 105517, 108155, 110331, 111267, 110761, 109315, 107625, 106002, 104404, 102890, 101767, 101264, 101252, 101437, 101753, 102377, 103371, 104415, 105009, 104924, 104448, 104180, 104556, 105520, 106612, 107346, 107537, 107318, 106930, 106494, 105938, 105091, 103976, 103094, 103198, 104539, 106349, 107432, 107365, 106850, 106804, 107414, 108321, 109346, 110606, 112068, 113473, 114605, 115308, 115329, 114592, 113522, 112609, 111662, 110131, 108213, 106930, 106769, 106891, 106180, 104610, 103033, 102005, 101428, 101126, 101115, 101336, 101596, 101789, 101870, 101718, 101354, 101087, 101016, 100625, 99423, 97861, 97006, 97350, 98462, 99753, 100880, 101380, 100701, 98994, 97290, 96449, 96300, 96177, 95894, 95752, 95886, 96098, 96191, 96123, 95899, 95559, 95222, 94955, 94760, 94795, 95324, 96188, 96618, 95960, 94477, 93063, 92229, 91721, 91134, 90537, 90334, 90735, 91564, 92497, 93306, 93903, 94300, 94656, 95280, 96377, 97757, 98924, 99543, 99648]
54262I9648l33q52j235r46J9R19J148Q64M33q3m75r4J194K338K220J138K53j31
54244A06025o52j384j491o28L58N55M3o54j312j743j555p69j48k48o34n96j62
54227I5005J81L61N65N18k64j539k356k097j051J37J072J615J681J308P31J62
54211I6029l83r63j475j578r45K94J404J574P19m36j120j192r74p10m42j61J18
54194H9759L96N98O12M62L09J81k8k50k16Q4K73J16j35j70p6n5p4o5k04n33o33
54173I0351j33O14Q87N18k3l15k82P6P41J351J404R01L67P1l04j010j704j858
54155I1652j479r94o22k15L07O99O85L56J45L55P49P47J59m28k77N09R73N37k04
54136I3654k40M89J042Q25L60M18Q87J066Q43P95J107J162N49j68k88j08l98j013
$$ y = [99648, 99315, 98463, 97228, 96282, 96301, 97220, 98368, 99232, 99665, 99582, 99107, 99013, 100207, 102545, 104765, 105903, 106156, 106025, 105373, 103989, 102498, 101870, 102228, 102783, 102826, 102172, 100860, 99117, 97562, 96793, 96645, 96397, 95763, 95167, 95005, 95186, 95547, 96112, 96630, 96366, 94827, 92471, 90374, 89323, 89460, 90532, 92147, 93828, 95136, 95867, 96029, 95646, 94683, 93208, 91630, 90685, 90979, 92383, 93957, 94676, 94240, 93120, 91928, 90954, 90244, 89802, 89641, 89759, 90155, 90753, 91365, 91827, 92136, 92317, 92289, 92039, 91823, 91907, 92180, 92296, 92161, 91991, 91915, 91860, 91786, 91721, 91517, 90984, 90351, 90218, 90832, 91719, 92237, 92214, 91899, 91617, 91693, 92434, 93785, 95189, 96090, 96457, 96528, 96224, 95214, 93510, 91652, 90173, 89179, 88557, 88342, 88649, 89348, 90033, 90389, 90534, 90889, 91638, 92385, 92544, 92116, 91839, 92348, 93321, 93858, 93654, 93414, 93903, 94945, 95770, 96130, 96548, 97435, 98501, 99344, 100139, 101246, 102408, 102957, 102789, 102501, 102393, 101995, 100982]
54118A00982r48R6J048Q23l27j293j463j024l19M65J013R81M78M9M9L09M87M89
54100A01895M22L35J48j71n15o73n61l59k87k38J65R97J738J775J021o1r26j208
54082A03497p91N3O67N61j6l28MO14R28Q03N51M22L59K00J8M8K66L13ok87N8R52
54060A08886J689J799J545J349J208R78Q27R70J221J251J160J332J849K400K773
54045A31237L079L475L852L833L027J536J92n8P61J604J784J837K542L594M013
54030A66308L555K864K424K162K021K069J950J096k83j219j218p42k72K66P58
54015A81739M84q48k348k925k644k366k451k585k644k896l354l588l314k769k298
54000A45193k055k060k306k623k679k244j442p06n02q60j221j030n08m07q32r80
$$ y = [100982, 100034, 100130, 101178, 102001, 101674, 100381, 98918, 97894, 97575, 98040, 99053, 100034, 100512, 100561, 100610, 100919, 101406, 101895, 102317, 102652, 102800, 102629, 102114, 101441, 100880, 100521, 100234, 99996, 100161, 101158, 102896, 104671, 105692, 105631, 104705, 103497, 102706, 102759, 103426, 103987, 103971, 103643, 103647, 104261, 105189, 105992, 106543, 106965, 107324, 107524, 107542, 107590, 107856, 108169, 108163, 107876, 107934, 108886, 110575, 112374, 113919, 115268, 116476, 117454, 118281, 119251, 120472, 121723, 122883, 124215, 126064, 128464, 131237, 134316, 137791, 141643, 145476, 148503, 150039, 150231, 150173, 150934, 152538, 154322, 156159, 158701, 162295, 166308, 169863, 172727, 175151, 177313, 179334, 181403, 183353, 184449, 184166, 182947, 181729, 180987, 180715, 180981, 181739, 182223, 181375, 179027, 176102, 173458, 171092, 168641, 166056, 163412, 160516, 157162, 153574, 150260, 147491, 145193, 143138, 141078, 138772, 136149, 133470, 131226, 129784, 129078, 128576, 127716, 126495, 125465, 124957, 124550, 123718, 122738]
53984A22738l09N72P53K45l21p59j245j443p70M81J190Q70K74K02M26K78k89p69
53966A22124q70p04m19n3L84Q59J295J451J111N17K36M69P81P72N84N31O23P71
53948A30462J053J441J586J382J300J705K241K417K524L146M051M365L909L548
53934A65130M025N081N979O329O092N353M405L647L105K428J576J021R81R65N57
53919B16674K09O67J851K904L228L025K843L040L627M335M799M896M833M730M374
53904B66035L669L067L132L875M807N413N147L379K8l877o947q728r635r827r055
53889B50483p694o917p323q111q115p148n871m861m345m421m873n019m323l064
53875A68398k054j794k227k965l465l209k236j239q51j020j415j969k548k556
$$ y = [122738, 122429, 123001, 123754, 123999, 123678, 122919, 121674, 120231, 119461, 119942, 121132, 122002, 122276, 122478, 122904, 123182, 122893, 122124, 121254, 120550, 120131, 120078, 120462, 121321, 122616, 124067, 125178, 125695, 125931, 126400, 127181, 127953, 128537, 129068, 129691, 130462, 131515, 132956, 134542, 135924, 137224, 138929, 141170, 143587, 146111, 149257, 153308, 157673, 161582, 165130, 169155, 174236, 180215, 186544, 192636, 197989, 202394, 206041, 209146, 211574, 213150, 214171, 215152, 216117, 216674, 216883, 217550, 219401, 222305, 225533, 228558, 231401, 234441, 238068, 242403, 247202, 252098, 256931, 261661, 266035, 269704, 272771, 275903, 279778, 284585, 289998, 295145, 298524, 298552, 294675, 287728, 279000, 269365, 259538, 250483, 242789, 235872, 228549, 220438, 212323, 205175, 199304, 194443, 190098, 185677, 180804, 175785, 171462, 168398, 166344, 164550, 162323, 159358, 155893, 152684, 150448, 149209, 148358, 147338, 145923, 143954, 141406, 138850]
53861A38850j613l82J06k43o94r84j520k230k277j300j81Q3l60p08p19p30q06
53844A24292o25j53K34L53M49P09R52J003R58R24P53L13k04n13o25p07o77k74
53826A27162M22R22R26O82N22M12K61L26P53R94L80o76r17P7J238J479J098J091
53808A37152J675K302K737L177L486L230K569K280K772L624M232M361M010L384
53794A80991K996L156L273K516J205N94J037J402Q55J42K26N89N9j228j937j468
53778A94408o51m33q63j570k405l203l618l570l424l416l362l188l215l520l492
53763A54478k608j378q52j257j661j255m09j04n85j139j167r61j068j321j111
53748A37602m42p0l50o51k30O18R38L70m08n63M7R35J521J527J083N86L85N02
$$ y = [138850, 137237, 136855, 136961, 136718, 136024, 135040, 133520, 131290, 129013, 127713, 127532, 127615, 127255, 126547, 125828, 125098, 124292, 123667, 123514, 123748, 124101, 124550, 125259, 126211, 127214, 128172, 129096, 129849, 130162, 129958, 129445, 128820, 128113, 127436, 127162, 127584, 128506, 129432, 130114, 130636, 131048, 131309, 131635, 132388, 133382, 133762, 133086, 132169, 132246, 133484, 134963, 136061, 137152, 138827, 141129, 143866, 147043, 150529, 153759, 156328, 158608, 161380, 165004, 169236, 173597, 177607, 180991, 183987, 187143, 190416, 192932, 194137, 194731, 195768, 197170, 198025, 198167, 198393, 198982, 199041, 197813, 195876, 194408, 193757, 193324, 192461, 190891, 188486, 185283, 181665, 178095, 174671, 171255, 167893, 164705, 161490, 157970, 154478, 151870, 150492, 149640, 148383, 146722, 145467, 145058, 144954, 144369, 143230, 142063, 141102, 140034, 138713, 137602, 137160, 137090, 136740, 136089, 135859, 136477, 137415, 137785, 137377, 136814, 136861, 137796, 139317, 140844, 141927, 142513, 142898, 143400]
53730A43400P15Q60R02R04R89J249J459J172L99l5P11K370L710L827K992K089
53714A67713J702J855K260K443J950P90l64p49k58N53J192J772K749M206N529
53699A93343N927N249M223L705L756L683K936J724P09K85L22N13O53O15L06j75
53683B27774m28o8P58J316R90j07j383k429l097l106k199q39n5k62p27o72l36
53666B15130l27l90J74J136J388N35n20q66o76o00p46p89n84j80L51O53K05q66
53648B13028j518j036n8L36K25N67J537K170J887J449J822K783L234K624J422
53633B30472L99o7O7P50J750K550K684K237J841J984K445K653K539K578K899K954
53617B60735K398J905K360L590M572M856M920N075M900M170L534L686M351M737
$$ y = [143400, 144115, 144975, 145877, 146781, 147770, 149019, 150478, 151650, 152049, 152014, 152725, 155095, 158805, 162632, 165624, 167713, 169415, 171270, 173530, 175973, 177923, 178713, 178349, 177600, 177342, 177895, 179087, 180859, 183608, 187814, 193343, 199270, 204519, 208742, 212447, 216203, 219886, 222822, 224546, 225255, 225540, 225862, 226375, 227028, 227643, 227949, 227774, 227346, 227278, 228036, 229352, 230342, 230235, 228852, 226423, 223326, 220220, 218021, 217182, 217127, 216865, 216138, 215466, 215130, 214803, 214413, 214587, 215723, 217111, 217646, 217126, 216260, 215584, 214984, 214238, 213449, 212865, 212685, 213036, 213689, 213894, 213028, 211510, 210474, 210416, 210752, 210977, 211544, 213081, 215251, 217138, 218587, 220409, 223192, 226426, 229050, 230472, 230871, 230804, 230871, 231621, 233371, 235921, 238605, 240842, 242683, 244667, 247112, 249765, 252304, 254882, 257781, 260735, 263133, 265038, 267398, 270988, 275560, 280416, 285336, 290411, 295311, 299481, 303015, 306701, 311052, 315789]
53603C15789M604M334M187M105M094M156M018L400K482J621P17n14j775k351k117
53588C46750j754j806k144k507k908l253l169k667k396k755l179k918k121j544
53574C11629j425j333j048q98j100j344j290j074j023j101r10k39N71Q54K97n83
53558B99983q28mJ293K121K147J730J268Q79N89M94O15Q78J271J851K623L517
53542C20427M411N048N151M871M804N213N531N115M303M077M803N970P135Q450
53528C95309J0029J1519J2623J3505J4345J4907J4898J4469J4117J4279J5112
53517E45112J6338J7307J7692J8096J9408K1436K3022K3610K3830K4224K4416
53506G74491K4174K4206K4983K5640K5226K4342K4223K4640K4206K2684K1468
$$ y = [315789, 320393, 324727, 328914, 333019, 337113, 341269, 345287, 348687, 351169, 352790, 353507, 352993, 351218, 348867, 346750, 344996, 343190, 341046, 338539, 335631, 332378, 329209, 326542, 324146, 321391, 318212, 315294, 313173, 311629, 310204, 308871, 307823, 306925, 305825, 304481, 303191, 302117, 301094, 299993, 299083, 298844, 299415, 300269, 300566, 299983, 299155, 299151, 300444, 302565, 304712, 306442, 307710, 308589, 309178, 309672, 310287, 311165, 312436, 314287, 316910, 320427, 324838, 329886, 335037, 339908, 344712, 349925, 355456, 360571, 364874, 368951, 373754, 379724, 386859, 395309, 405338, 416857, 429480, 442985, 457330, 472237, 487135, 501604, 515721, 530000, 545112, 561450, 578757, 596449, 614545, 633953, 655389, 678411, 702021, 725851, 750075, 774491, 798665, 822871, 847854, 873494, 898720, 923062, 947285, 971925, 996131, 1018815, 1040283]
53495A040283K1468K1893K1652K0838K0143J9682J9151J8614J8359J8371J8450
53484A258904J8520J8496J8231J7968J8286J9110J9340J8034J5557J2933J0496
53473A445875P886N139K865J293k37k515n617q978j1912j3945j4920j5033j4803
53460A375098j4842j5572j6970j8543j9736k0549k1519k2887k4086k4407k3961
53449A152026k3500k3358k3102k2303k1129j9906j8538j6742j4660j2765j1189
53438I44834r583p743o028m908m298l658k658j420j31J207K563L775M933O469
53424I23354Q511J0436J1571J2188J3284J5322J7704J9629K0959K2096K3366K4854
53412A123274K6476K7980K9071K9825L0775L2376L4561L6945L9263M1430M3456
$$ y = [1040283, 1061751, 1083644, 1105296, 1126134, 1146277, 1165959, 1185110, 1203724, 1222083, 1240454, 1258904, 1277424, 1295920, 1314151, 1332119, 1350405, 1369515, 1388855, 1406889, 1422446, 1435379, 1445875, 1453761, 1458900, 1461765, 1463058, 1462821, 1460306, 1454689, 1445711, 1433799, 1419854, 1404934, 1389901, 1375098, 1360256, 1344684, 1327714, 1309171, 1289435, 1268886, 1247367, 1224480, 1200394, 1175987, 1152026, 1128526, 1105168, 1082066, 1059763, 1038634, 1018728, 1000190, 983448, 968788, 956023, 944834, 935251, 927508, 921480, 916572, 912274, 908616, 905958, 904538, 904407, 905614, 908177, 911952, 916885, 923354, 931865, 942301, 953872, 966060, 979344, 994666, 1012370, 1031999, 1052958, 1075054, 1098420, 1123274, 1149750, 1177730, 1206801, 1236626, 1267401, 1299777, 1334338, 1371283, 1410546, 1451976, 1495432]
53401A495432M5536M7948N0664N3236N5296N6889N8116N8793N8819N8585N8554
53390B097868N8687N8672N8524N8390N7930N6453N3781N0495M7262M4345M1775
53379B684182L9476L6967L3529K8986K4015J9327J4861J0179N265L82m804j1219
53367B881146j9221k7931l6008m2885m8777n3755n7354n9237n9774n9684n9359
53356B357161n8829n8165n7465n6542n4989n2653m9885m7328m5705m5559m6737
53345A783304m8141m8477m7408m5561m3401m0757l7699l5089l3611l2610l0733
53334A339817k7579k4042k1048j8639j6509j4869j4241j4665j5485j5937j5776
53323A141027j5268j4713j4068j3050j1527r751q181p183o763o429n440l526j358
$$ y = [1495432, 1540968, 1588916, 1639580, 1692816, 1748112, 1805001, 1863117, 1921910, 1980729, 2039314, 2097868, 2156555, 2215227, 2273751, 2332141, 2390071, 2446524, 2500305, 2550800, 2598062, 2642407, 2684182, 2723658, 2760625, 2794154, 2823140, 2847155, 2866482, 2881343, 2891522, 2896787, 2897169, 2892365, 2881146, 2861925, 2833994, 2797986, 2755101, 2706324, 2652569, 2595215, 2535978, 2476204, 2416520, 2357161, 2298332, 2240167, 2182702, 2126160, 2071171, 2018518, 1968633, 1921305, 1875600, 1830041, 1783304, 1735163, 1686686, 1639278, 1593717, 1550316, 1509559, 1471860, 1436771, 1403160, 1370550, 1339817, 1312238, 1288196, 1267148, 1248509, 1232000, 1217131, 1202890, 1188225, 1172740, 1156803, 1141027, 1125759, 1111046, 1096978, 1083928, 1072401, 1062650, 1054469, 1047286, 1040523, 1034094, 1028654, 1025128, 1023770]
53310A023770J45R77K052L870N819P161Q115R372J0992J2523J3947J5706J7876
53297A132325K0028K1898K3601K5126K6340K7480K9000L0649L1441L0804K9291
53286A427983K7785K6471K4986K3130K1100J9157J7382J5547J3114R671N509J449
53274A633284k063n350q737j1864j4122j5543j6865j8853k1685k4829k7374k8703
53262A437296k9064k9293k9880l0554l0896l0937l0947l1017l1142l1330l1346
53251A100890l0692k9268k7779k7052k7089k7186k6842k6110k5250k4477k4047
53240H05098k4122k4419k4264k3190k1429j9684j8392j7241j5545j3203j1044
53229E92565r950r793r738r426r239r427r776j0332j1566j3337j4520j4347j3478
$$ y = [1023770, 1023915, 1024892, 1026944, 1030814, 1036633, 1043794, 1051909, 1061281, 1072273, 1084796, 1098743, 1114449, 1132325, 1152353, 1174251, 1197852, 1222978, 1249318, 1276798, 1305798, 1336447, 1367888, 1398692, 1427983, 1455768, 1482239, 1507225, 1530355, 1551455, 1570612, 1587994, 1603541, 1616655, 1626326, 1631835, 1633284, 1631221, 1625871, 1617134, 1605270, 1591148, 1575605, 1558740, 1539887, 1518202, 1493373, 1465999, 1437296, 1408232, 1378939, 1349059, 1318505, 1287609, 1256672, 1225725, 1194708, 1163566, 1132236, 1100890, 1070198, 1040930, 1013151, 986099, 959010, 931824, 904982, 878872, 853622, 829145, 805098, 780976, 756557, 732293, 709103, 687674, 667990, 649598, 632357, 616812, 603609, 592565, 582615, 572822, 563084, 553658, 544419, 534992, 525216, 514884, 503318, 489981, 475461, 461114, 447636]
53216D47636j3030j3077j2906j2308j1627j0901r890q747p835p037o113n520n828
53203C22817o534o585o107o328p516q328p797o748o394o469n847m409l226l086
53189B37443l711m312m337l725k963k737l140l364k667j399n83o47j077j261j160
53174B00360j085j195j369j380j166q95o93l82K14O87L69o00j157p07J2K3n24
53157A90512q33q17j033j440j333n66P1o3p25j401j937k212j874r19o1K2m81q69
53139A74041r06q85r09n74L72J474J947J562Q62M66L48J44j02O2O45R89P13K94
53121A80543K53K62k17q41q44l73l33q85j130n58J55K89J22K25M38K87p8k12j88
53102A76915l99p57q35o19m58m30l40l46q37j657k056j621p65j37O9M3q7l36o92
$$ y = [447636, 434606, 421529, 408623, 396315, 384688, 373787, 363897, 355150, 347315, 340278, 334165, 328645, 322817, 316283, 309698, 303591, 297263, 289747, 281419, 273622, 266874, 260480, 254011, 248164, 243755, 240529, 237443, 233732, 229420, 225083, 221358, 218395, 215658, 212518, 209154, 206487, 205088, 204505, 203858, 202781, 201520, 200360, 199275, 198080, 196711, 195331, 194165, 193270, 192577, 192195, 192409, 193096, 193465, 192865, 191708, 191001, 191013, 191036, 190512, 189679, 188862, 187829, 186389, 185056, 184490, 184561, 184498, 183773, 182372, 180435, 178223, 176349, 175430, 175369, 175391, 174910, 174041, 173135, 172250, 171341, 170767, 171139, 172613, 174560, 176122, 176984, 177450, 177798, 177942, 177840, 177902, 178547, 179536, 180249, 180543, 180796, 181058, 180841, 180000, 179156, 178783, 178450, 177565, 176435, 175877, 176032, 176321, 176443, 176668, 177106, 177393, 177315, 177103, 176915, 176516, 175759, 174924, 174305, 173847, 173417, 173077, 172731, 171894, 170237, 168181, 166560, 165795, 165658, 165727, 165770, 165683, 165347, 164655]
53083A64655j038j166q86k15N24J005J203J289J304J210J101J069R73O55L08K00
53067A72191J41l37j176j630j179j96M94M96N9m16p72j050j237j160o37K06R06
53050A64703J096Q77N66K93O5J39P36J450J404K86j163j945j844j413j215j399
53034A62636j813k148k003j166M8R39J015M71%O2M03L72k47q73q23j50N06P56
53016A57985P40O19K91j96m23j38L42N39L92J37j25m14o23o25n09l94j84K02N11
52997A58127M25Q2r4N7L27N84Q80J106J007O60M88O28P09M69K14K48K13m05j287
52978A64438j404l50J015J569J233Q26Q44R62P23K64Q2M04J069J759K093J778
52962A77305J015N94J125K208K739K123P76n90j645k278k312j800j291j239j416
$$ y = [164655, 163617, 162451, 161565, 161350, 161874, 162879, 164082, 165371, 166675, 167885, 168986, 170055, 171028, 171683, 171991, 172191, 172332, 171995, 170819, 169189, 168010, 167814, 168308, 168804, 168863, 168447, 167675, 166625, 165388, 164228, 163591, 163797, 164703, 165799, 166676, 167242, 167535, 167600, 167739, 168475, 169925, 171329, 171615, 170452, 168507, 166663, 165250, 164035, 162636, 160823, 158675, 156672, 155506, 155554, 156493, 157508, 157979, 157979, 158041, 158444, 158816, 158569, 157696, 156873, 156723, 157229, 157985, 158725, 159344, 159635, 159439, 159016, 158878, 159220, 159759, 160151, 160288, 160163, 159749, 159126, 158501, 157992, 157598, 157414, 157616, 158127, 158552, 158634, 158540, 158597, 158924, 159508, 160388, 161494, 162501, 163161, 163649, 164277, 164986, 165455, 165669, 165917, 166130, 165725, 164438, 163034, 162684, 163699, 165268, 166501, 167327, 168171, 169133, 169856, 170120, 170202, 170606, 171675, 173434, 175527, 177305, 178320, 178914, 180039, 182247, 184986, 187109, 187885, 187295, 185650, 183372, 181060, 179260, 177969, 176730, 175314]
52947A75314j318j017j009j356j523j232q91r28j112r68n45l34n44q31q09m57
52931A60440K1M35N97L23l33j014j397j499j461j140k75R45J745J455K34r71j241
52914A56864m63O02J000M83k66m58j43p1n93j216j401j314j384j491j148l05N81
52897A49277J126J226Q03n2p45o86j30J03j53j93L63R28Q95N07K97K31N1j0L87
52878A54225R55J110Q33N81N28N08N90R99J514J554R83L02o2k11l95o21p72p58
52860A61863m60J21O45O79K33k98p29j205j695j840j482r53o08l78n3K57K11k50
52842A54058o95n54K14Q72O02m77j325j334j126j492k025j736p38k04n61q59l75
52825A42245K06J6m31M8J407K250J683M37k31j17q1o96j430j384n54J30O6k02
$$ y = [175314, 173996, 172979, 171970, 170614, 169091, 167859, 166968, 166040, 164928, 163960, 163415, 163081, 162537, 161706, 160897, 160440, 160461, 160896, 161493, 161816, 161483, 160469, 159072, 157573, 156112, 154972, 154697, 155642, 157387, 158842, 159076, 158105, 156864, 156401, 157003, 158003, 158486, 158220, 157762, 157619, 157548, 156955, 155739, 154338, 153024, 151640, 150149, 149001, 148696, 149277, 150403, 151629, 152432, 152380, 151635, 150949, 150819, 150922, 150769, 150576, 150939, 151867, 152762, 153269, 153566, 153797, 153848, 153838, 154225, 155180, 156290, 157123, 157704, 158232, 158740, 159330, 160329, 161843, 163397, 164380, 164682, 164620, 164409, 164014, 163393, 162621, 161863, 161403, 161524, 162169, 162848, 163081, 162783, 162054, 160849, 159154, 157314, 155832, 154879, 154271, 153893, 153840, 154097, 154308, 154058, 153363, 152809, 153023, 153895, 154497, 154020, 152695, 151361, 150235, 148743, 146718, 144982, 144244, 144040, 143479, 142620, 142245, 142451, 142467, 142036, 142084, 143491, 145741, 147424, 147861, 147630, 147513, 147432, 146736, 145306, 143922, 143368, 143498, 143564, 143362]
52807A43362J49R64J377J144R01J021J071O86K84L30N16K53m09r66j229j421j617
52790A46416j643j348p42L5O18O16J38j98j29j19m86o65k2J054J606J393R18M14
52772A47856m00j446k045j764r53k06J86J68k48q06j112j024p18l22J81O93J073
52755A39113J368J618J494O82m28j015q43l98N1P43J617J970J378M14p5P4M70
52738A48233P85Q25M47p2j9Q78J897K236K136K401L042L183K347J088J63l13n77
52721A68680o62m86k75l94q54j322j594j802k106k379k328j815r89j07O23J075
52705A53265J204J108Q93N17j34q37j027m64L41P11O58O31O15J83m80m38O60J793
52687A59199J803R18L48N82R14N86k93j185j803k079j878j184m06j73p27j594
$$ y = [143362, 143511, 144475, 145852, 146996, 147897, 148918, 149989, 150675, 150959, 151289, 151805, 152058, 151649, 150683, 149454, 148033, 146416, 144773, 143425, 142683, 142718, 143336, 143952, 144090, 143892, 143763, 143644, 143158, 142493, 142471, 143525, 145131, 146524, 147442, 147856, 147456, 146010, 143965, 142201, 141248, 141042, 141228, 141396, 141148, 140342, 139230, 138206, 137488, 137166, 137347, 138040, 139113, 140481, 142099, 143593, 144275, 143847, 142832, 141989, 141591, 141642, 142385, 144002, 145972, 147350, 147764, 147689, 147763, 148233, 149018, 149843, 150290, 150218, 150199, 151077, 152974, 155210, 157346, 159747, 162789, 165972, 168319, 169407, 169570, 169257, 168680, 168018, 167532, 167257, 166863, 166009, 164687, 163093, 161291, 159185, 156806, 154478, 152663, 151674, 151567, 152190, 153265, 154469, 155577, 156470, 156987, 156853, 156016, 154989, 154525, 154866, 155577, 156235, 156866, 157481, 157664, 157184, 156746, 157406, 159199, 161002, 161920, 162268, 162850, 163764, 164350, 164057, 162872, 161069, 158990, 157112, 155928, 155522, 155349, 154622, 153028]
52671A53028j847r39N70J329O40n99q87J1Q20N72j55k24M23R10Q30O90R53J362
52653A57487J488J401J418J564J539J128L44o18j384j545j051l48P0J01n5k86
52637A61253n46o26l09K97Q02R27O70J29m97q12m93L04J032J363J397J324J193
52620A67408J059R32N50l32j289j419n45L55L29l82q21n53R1O74R26O95K40K91
52602A68209J087J724J199l9o45k91O1j30k17K98Q12O94L40L36M10P4k97K0R24
52583A74569J694K036K109J834J046Q4n54r03j107p70L21J179O27p95j273k59
52567A79838P70N56k73n27k89l64o99n46J48O05L18n32j606k592k935k180p45
52550A68947L51O17N38P22J146J401J226O49j29p94j085j031q70p21n70m94n55
$$ y = [153028, 151181, 150242, 150812, 152141, 152781, 152182, 151295, 151306, 152126, 152698, 152543, 152319, 152742, 153652, 154482, 155172, 156125, 157487, 158975, 160376, 161794, 163358, 164897, 166025, 166369, 165751, 164367, 162822, 161771, 161423, 161493, 161594, 161539, 161253, 160707, 160081, 159772, 160069, 160871, 161798, 162468, 162597, 162100, 161288, 160795, 161099, 162131, 163494, 164891, 166215, 167408, 168467, 169399, 169949, 169617, 168328, 166909, 166364, 166719, 167048, 166666, 165845, 165292, 165383, 166057, 166983, 167678, 167918, 168209, 169296, 171020, 172219, 172180, 171535, 171244, 171305, 171175, 170958, 171256, 172068, 172762, 173102, 173438, 173848, 173922, 173625, 173645, 174569, 176263, 178299, 180408, 182242, 183288, 183372, 182818, 181915, 180808, 180038, 180359, 181538, 182165, 181370, 180097, 179838, 180608, 181164, 180891, 180364, 180075, 179711, 179012, 178466, 178614, 179219, 179537, 179005, 177399, 174807, 171872, 169692, 168947, 169298, 169915, 170453, 171175, 172321, 173722, 174948, 175597, 175468, 174674, 173589, 172558, 171688, 170967, 170397, 169903, 169348]
52533A69348m87N0Q40J173Q08M04O18J118R99L9r97j369j182r43p40k94L71P94
52515A70550O90K59k35p73j155p37Q00K578L186K355J374J543K698L695L845L358
52499A94031K618J726O90l57j291k019k409k469k478k652k728k323j563r26n13
52484A77337j0N58O71R6o82j084j044p05p1O98J089Q55M99N91R27R18N70L80L81
52465A81974P1n95q72k33Q90J736K161K472K664K440J906J597J727J796J245K61
52449B01240m20m61l25o29j291j675j487j202j358j800k008j969k154k563k451
52434A79447j389o7M98L04K51P20J052O43p7k48K12O32O09M05K62lm41m68N14
52415A82856K101L027K499J135K86O27J649K578L364M493O043P375P862P565O828
$$ y = [169348, 168861, 168911, 169751, 170924, 171732, 172136, 172754, 173872, 174871, 174910, 173913, 172544, 171362, 170419, 169679, 169385, 169756, 170550, 171240, 171499, 171264, 170491, 169336, 168599, 169399, 171977, 175163, 177518, 178892, 180435, 183133, 186828, 190673, 194031, 196649, 198375, 199065, 198708, 197417, 195398, 192989, 190520, 188042, 185390, 182662, 180339, 178776, 177850, 177337, 177327, 177885, 178556, 178652, 177970, 176886, 175842, 175137, 175066, 175764, 176853, 177708, 178207, 178798, 179725, 180643, 181213, 181593, 181974, 182045, 181450, 180578, 180345, 181235, 182971, 185132, 187604, 190268, 192708, 194614, 196211, 197938, 199734, 200979, 201240, 200820, 200359, 200034, 199405, 198114, 196439, 194952, 193750, 192392, 190592, 188584, 186615, 184461, 181898, 179447, 178058, 177991, 178489, 178793, 179044, 179764, 180816, 181459, 181382, 181134, 181346, 181978, 182587, 182992, 183254, 183251, 182810, 182342, 182856, 184957, 187984, 190483, 191618, 191904, 192531, 194180, 196758, 200122, 204615, 210658, 218033, 225895, 233460, 240288]
52400B40288N545L332L80k359m022m576m528m257l914l627l368k797j725o42k76
52385B13454o30r36o46k8M78R60J679K362K369J612Q09P46J502K509L174L338
52369B32752L246L203L371L773M395N074N448N222M544L828L130K105P72j35j9
52354B80709O34P80J82l40j05O07J186J620K248K966L290L189L300M096N216N930
52338C15508O110O400P345Q690R769J0417J1142J2339J3704J4654J5174J5851
52326D47103J7087J8619J9854K0486K0667K0713K0788K0814K0690K0532K0597
52315F67950K0776K0457J9172J7271J5521J4098J2454J0315Q257O952O266N524
52303H25013M449L322K379J515N86l72j346k498l904n251n990n797m917m053l832
$$ y = [240288, 245833, 249165, 249545, 247186, 243164, 238588, 234060, 229803, 225889, 222262, 218894, 216097, 214372, 213730, 213454, 212824, 211888, 211242, 211214, 211692, 212652, 214331, 216693, 219062, 220674, 221483, 222229, 223731, 226240, 229414, 232752, 235998, 239201, 242572, 246345, 250740, 255814, 261262, 266484, 271028, 274856, 277986, 280091, 280863, 280728, 280709, 281343, 282123, 282305, 281965, 281860, 282467, 283653, 285273, 287521, 290487, 293777, 296966, 300266, 304362, 309578, 315508, 321618, 328018, 335363, 344053, 353822, 364239, 375381, 387720, 401424, 416078, 431252, 447103, 464190, 482809, 502663, 523149, 543816, 564529, 585317, 606131, 626821, 647353, 667950, 688726, 709183, 728355, 745626, 761147, 775245, 787699, 798014, 806271, 813223, 819489, 825013, 829462, 832784, 835163, 836678, 837264, 836892, 835546, 833048, 829144, 823893, 817903, 812106, 807189, 803136, 799304]
52288G99304m335n154n861o217n985m885k963p19J375L246M942O312P398Q807
52274G95265J1139J4081J6592J7976J8302J7824J6697J5411J4760J4874J4775
52263I67696J3436J1027Q507O300M079J805J88j98K32N15J67o35j658k907m291
52248A004263n385n786n576n290n453o191p230q193q936r627j0363j0829j0487
52235I04917r282p902p072o698o045m745l249k212j780j631j392p70M24J936K997
52220H57496L019K347J900K088K563K977L507M377N327N993O404O749O837O331
52206I17915N474N042N421O130O473O325N964N387M320K880J708J229J148R98
52192I76414R01J249J759J489L9j668k272j486l35K8n55j317j498j076p50j237
$$ y = [799304, 794969, 789815, 783954, 777737, 771752, 766867, 763904, 763185, 764560, 767806, 772748, 779060, 786458, 795265, 806404, 820485, 837077, 855053, 873355, 891179, 907876, 923287, 938047, 952921, 967696, 981132, 992159, 1000666, 1006966, 1011045, 1012850, 1013038, 1012840, 1013072, 1013587, 1013754, 1013119, 1011461, 1008554, 1004263, 998878, 993092, 987516, 982226, 976773, 970582, 963352, 955159, 946223, 936596, 926233, 915404, 904917, 895635, 887733, 880661, 873963, 867918, 863173, 859924, 857712, 855932, 854301, 852909, 852139, 852563, 854499, 857496, 860515, 862862, 864762, 866850, 869413, 872390, 875897, 880274, 885601, 891594, 897998, 904747, 911584, 917915, 923389, 928431, 933852, 939982, 946455, 952780, 958744, 964131, 968451, 971331, 973039, 974268, 975416, 976414, 977315, 978564, 980323, 981812, 981851, 980183, 977911, 976425, 976090, 976118, 975563, 974246, 972748, 971672, 970922, 969685]
52176I69685k524l814m298l977l579l730m367m957n107m951m909n088m927l736
52162I09721j696L5N17J19l2N21J269J764K245K996L744M064L999L811L413K511
52146I39001J175j51j093j480j151o4J439K799L790M574N216N530N526N736O732
52131I77579Q495J0400J1909J3043J4147J5356J6420J7167J7895J9189K1238K3562
52119A166400K5463K6621K7105K7037K6493K5677K4802K3744K1972J9123J5496
52108A429933J1834Q634N840L120K59k789n971r109j1871j4036j5659j6822j7288
52095A366075j6682j5073j3079j1249r650q171o927n985n024l650j966m55O17
52082A268781J287J478J024K44Q7J347L924O957R586J1435J2631J3505J4253J4856
$$ y = [969685, 967161, 963347, 959049, 955072, 951493, 947763, 943396, 938439, 933332, 928381, 923472, 918384, 913457, 909721, 908025, 908060, 908577, 908696, 908664, 909185, 910454, 912218, 914463, 917459, 921203, 925267, 929266, 933077, 936490, 939001, 940176, 940025, 938932, 937452, 936301, 936237, 937676, 940475, 944265, 948839, 954055, 959585, 965111, 970847, 977579, 986074, 996474, 1008383, 1021426, 1035573, 1050929, 1067349, 1084516, 1102411, 1121600, 1142838, 1166400, 1191863, 1218484, 1245589, 1272626, 1299119, 1324796, 1349598, 1373342, 1395314, 1414437, 1429933, 1441767, 1450401, 1456241, 1459361, 1459620, 1456831, 1450860, 1441751, 1429880, 1415844, 1400185, 1383363, 1366075, 1349393, 1334320, 1321241, 1309992, 1300342, 1292171, 1285244, 1279259, 1274235, 1270585, 1268619, 1268164, 1268781, 1270068, 1271546, 1272570, 1272814, 1272901, 1274248, 1278172, 1285129, 1294715, 1306150, 1318781, 1332286, 1346539, 1361395]
52068A361395J5287J5606J5639J4937J3374J1642J0450R450P627M799J961r6j775
52055A480296l889o565r424j2260j4851j6685j7545j8054j9005k0328k1374k1918
52043A298398k2187k2153k1619k0902k0610k0648k0204j8918j7383j6237j5331
52032A082206j4173j2702j1199r801q477p279o334n644n109m634m207m033m546
52019I84068n997p977r662j0608j1064j1445j1820j2049j2181j2516j3384j4854
52007H50511j6557j7840j8336j8312j8186j7915j7255j6436j5970j5800j5319
$$ y = [1361395, 1376682, 1392288, 1407927, 1422864, 1436238, 1447880, 1458330, 1467780, 1475407, 1480206, 1482167, 1482071, 1480296, 1476407, 1469842, 1460418, 1448158, 1433307, 1416622, 1399077, 1381023, 1362018, 1341690, 1320316, 1298398, 1276211, 1254058, 1232439, 1211537, 1190927, 1170279, 1150075, 1131157, 1113774, 1097537, 1082206, 1068033, 1055331, 1044132, 1034331, 1025854, 1018575, 1012241, 1006597, 1001488, 996854, 992647, 988614, 984068, 978071, 970094, 960432, 949824, 938760, 927315, 915495, 903446, 891265, 878749, 865365, 850511, 833954, 816114, 797778, 779466, 761280, 743365, 726110, 709674, 693704, 677904, 662585]
$$ [...]
##END NTUPLES=NMR SPECTRUM
##END=
