##TITLE=NES1064_ptc160_9883234_A9gzNZVP0y
##JCAMPDX= 6.0         $$ Bruker NMR JCAMP-DX V2.0
##DATA TYPE= NMR SPECTRUM
##DATA CLASS= NTUPLES
##ORIGIN= BRUKER
##OWNER= Administrator
$$ 1.72 TOPSPIN		Version 2.1
$$ 2016-08-27 01:43:47.679 -0500  Administrator@X
$$ Compression mode = diff/dup
##.OBSERVE FREQUENCY= 400.02188249412
##.OBSERVE NUCLEUS= ^1H
##.ACQUISITION MODE= SIMULTANEOUS (DQD)
##.ACQUISITION SCHEME= undefined
##.AVERAGES= 8
##.DIGITISER RES= 22
##SPECTROMETER/DATA SYSTEM= spect
##.PULSE SEQUENCE= zg30
##.SOLVENT NAME= COFFEE_meoh
##.SHIFT REFERENCE= INTERNAL, COFFEE_meoh, 1, 14.98509
##AUDIT TRAIL= $$ (NUMBER, WHEN, WHO, WHERE, PROCESS, VERSION, WHAT)
$$ ##TITLE= Audit trail, TOPSPIN		Version 2.1
$$ ##JCAMPDX= 5.01
$$ ##ORIGIN= Bruker BioSpin GmbH
$$ ##OWNER= Administrator
$$ $$ E:\/data/COFFEE/nmr/NES1064_ptc160_9883234_A9gzNZVP0y/20/pdata/1/auditp.txt
$$ ##AUDIT TRAIL=  $$ (NUMBER, WHEN, WHO, WHERE, PROCESS, VERSION, WHAT)
(   1,<2016-08-27 01:43:40.539 -0500>,<Administrator>,<X>,<go>,<TOPSPIN 2.1>,
      <created by zg
	started at 2016-08-27 01:42:34.523 -0500,
	POWCHK enabled, PULCHK disabled,
       configuration hash MD5:
       21 0F 79 D6 B3 7B B4 F6 88 20 88 DB 03 48 BD 9F
       data hash MD5: 64K
       7F 75 0C 06 44 82 93 60 68 42 CA FE DD 68 CD 03>)
(   2,<2016-08-27 01:43:43.633 -0500>,<Administrator>,<X>,<proc1d>,<TOPSPIN 2.1>,
      <Start of raw data processing
       efp LB = 0 FT_mod = 6 PKNL = 1 PHC0 = 0 PHC1 = 0 SI = 32K 
       data hash MD5: 32K
       52 82 29 9E 4C 7F EA 17 67 40 E5 4A 0E AC CD 65>)
(   3,<2016-08-27 01:43:43.914 -0500>,<Administrator>,<X>,<proc1d>,<TOPSPIN 2.1>,
      <pk PHC0 = 96.44897 PHC1 = 0 
       data hash MD5: 32K
       12 43 FD 6C C7 F3 85 08 D9 BA EC BF FE F4 E7 1A>)
(   4,<2016-08-27 01:43:44.023 -0500>,<Administrator>,<X>,<proc1d>,<TOPSPIN 2.1>,
      <abs ABSG = 1 
       data hash MD5: 32K
       9E 49 A5 11 3E 21 21 82 F9 51 F4 1B F0 A9 23 BF>)
(   5,<2016-08-27 01:43:44.086 -0500>,<Administrator>,<X>,<proc1d>,<TOPSPIN 2.1>,
      <abs ABSG = 2 
       data hash MD5: 32K
       AA 2D B4 A9 13 76 39 8A 55 1F 00 C8 54 2F 1C 68>)
(   6,<2016-08-27 01:43:44.148 -0500>,<Administrator>,<X>,<proc1d>,<TOPSPIN 2.1>,
      <abs ABSG = 3 
       data hash MD5: 32K
       9C FD D3 D5 F8 49 D6 8D 64 A4 BC 0F 1B 54 FB 1E>)
(   7,<2016-08-27 01:43:44.195 -0500>,<Administrator>,<X>,<proc1d>,<TOPSPIN 2.1>,
      <abs ABSG = 4 
       data hash MD5: 32K
       13 26 B6 69 43 85 BF 7A 15 54 4C 8A 89 D1 2A 32>)
(   8,<2016-08-27 01:43:44.258 -0500>,<Administrator>,<X>,<proc1d>,<TOPSPIN 2.1>,
      <abs ABSG = 5 
       data hash MD5: 32K
       A9 2E 7B 76 52 4E 35 57 D1 D0 62 3F DF 93 79 95>)
$$ ##END=
$$ 
$$ $$ hash MD5
$$ $$ 8F 9D 76 66 3B CC C7 D5 BB 74 96 F8 73 74 F2 6C
##$RELAX= 
##$RELAX= 
##$RELAX= 
##$RELAX= 
##$RELAX= 
##$RELAX= 
##$RELAX= 
$$ Bruker specific parameters
$$ --------------------------
##$DU= <E:\>
##$EXPNO= 20
##$NAME= <NES1064_ptc160_9883234_A9gzNZVP0y>
##$PROCNO= 1
$$ [...]
150 150 150 150 150 150 150 150
##$TP07= 0
##$TPNAME0= <>
##$TPNAME1= <>
##$TPNAME2= <>
##$TPNAME3= <>
##$TPNAME4= <>
##$TPNAME5= <>
##$TPNAME6= <>
##$TPNAME7= <>
##$TPOAL= (0..7)
0.5 0.5 0.5 0.5 0.5 0.5 0.5 0.5
##$TPOFFS= (0..7)
0 0 0 0 0 0 0 0
##$TUNHIN= 0
##$TUNHOUT= 0
##$TUNXOUT= 0
##$USERA1= <user>
##$USERA2= <user>
##$USERA3= <user>
##$USERA4= <user>
##$USERA5= <user>
##$V9= 5
##$VALIST= <valist>
##$VCLIST= <CCCCCCCCCCCCCCC>
##$VD= 0
##$VDLIST= <DDDDDDDDDDDDDDD>
##$VPLIST= <PPPPPPPPPPPPPPP>
##$VTLIST= <TTTTTTTTTTTTTTT>
##$WBST= 2048
##$WBSW= 25
##$XGAIN= (0..3)
0 0 0 0
##$XL= 0
##$YL= 0
##$YMAX_a= 601831
##$YMIN_a= -512602
##$ZGOPTNS= <>
##$ZL1= 120
##$ZL2= 120
##$ZL3= 120
##$ZL4= 120
##$ABSF1= 14.98509
##$ABSF2= -5.573092
##$ABSG= 5
##$ABSL= 3
##$ALPHA= 0
##$AQORDER= 0
##$ASSFAC= 0
##$ASSFACI= 0
##$ASSFACX= 0
##$ASSWID= 0
##$AUNMP= <proc_prof1d_extract_pilot.lims>
##$AXLEFT= 0
##$AXNAME= <>
##$AXNUC= <1H>
##$AXRIGHT= 0
##$AXTYPE= 0
##$AXUNIT= <>
##$AZFE= 0.1
##$AZFW= 0.1
##$BCFW= 0
##$BC_mod= 0
##$BYTORDP= 0
##$COROFFS= 0
##$CY= 15
##$DATMOD= 1
##$DC= 0
##$DFILT= <>
##$DTYPP= 0
##$F1P= 0
##$F2P= 0
##$FCOR= 0.5
##$FTSIZE= 32768
##$FT_mod= 6
##$GAMMA= 0
##$GB= 0
##$INTBC= 1
##$INTSCL= 1
##$ISEN= 128
##$LB= 0
##$LEV0= 0
##$LPBIN= 0
##$MAXI= 10000
##$MC2= 0
##$MEAN= 0
##$ME_mod= 0
##$MI= 0
##$NCOEF= 0
##$NC_proc= -8
##$NLEV= 6
##$NOISF1= 0
##$NOISF2= 0
##$NSP= 0
##$NTH_PI= 0
##$NZP= 0
##$OFFSET= 14.98509
##$PC= 1
##$PHC0= 96.44897
##$PHC1= 0
##$PH_mod= 1
##$PKNL= yes
##$PPARMOD= 0
##$PPDIAG= 0
##$PPIPTYP= 0
##$PPMPNUM= 2147483647
##$PPRESOL= 1
##$PSCAL= 4
##$PSIGN= 0
##$PYNMP= <proc.py>
##$REVERSE= no
##$SF= 400.02
##$SI= 32768
##$SIGF1= 0
##$SIGF2= 0
##$SINO= 400
##$SIOLD= 32768
##$SPECTYP= <>
##$SREGLST= <1H.CDCl3>
##$SSB= 0
##$STSI= 32768
##$STSR= 0
##$SW_p= 8223.68421052631
##$SYMM= 0
##$S_DEV= 0
##$TDeff= 65536
##$TDoff= 0
##$TI= <>
##$TILT= no
##$TM1= 0
##$TM2= 0
##$TOPLEV= 0
##$USERP1= <user>
##$USERP2= <user>
##$USERP3= <user>
##$USERP4= <user>
##$USERP5= <user>
##$WDW= 1
##$XDIM= 32768
##$YMAX_p= 433481455
##$YMIN_p= -677956
##$CURPLOT= <Network HP LaserJet P1505>
##$CURPRIN= <$Network HP LaserJet P1505>
##$DFORMAT= <normdp>
##$LAYOUT= <+/1D_H.xwp>
##$LFORMAT= <normlp>
##$PFORMAT= <normpl>
##$SURQMSG= 1
$$ End of Bruker specific parameters
$$ ---------------------------------
##NTUPLES= NMR SPECTRUM
##VAR_NAME=  FREQUENCY,     SPECTRUM/REAL,   SPECTRUM/IMAG
##SYMBOL=    X,             R,               I
##VAR_TYPE=  INDEPENDENT,   DEPENDENT,       DEPENDENT
##VAR_FORM=  AFFN,          ASDF,            ASDF
##VAR_DIM=   32768,         32768,           32768
##UNITS=     HZ,            ARBITRARY UNITS, ARBITRARY UNITS
##FACTOR=    0.250966925370066, 1,           1
##FIRST=     8223.43324360094, -155271,      60407
##LAST=      0,             -5006,           -235717
##MIN=       0,             -677956,         0
##MAX=       8223.43324360094, 433481455,    0
$$ Real data points
##PAGE= N=1
##DATA TABLE= (X++(R..R)), XYDATA
$$ [...]
23894 419205 176578 89664 -150886 -39002 -57895 28248 -94568 -164616 -51143 62858 118977
23883 118977 -139689 -261918 -48672 38934 400245 281273 -25897 -146868 -197061 94865
23872 -41002 -136254 72610 328581 -135195 57390 -5644 54246 89014 135241 334624 -96614
23860 -499224 -380204 379912 166896 81513 -136013 -257816 -44821 -33227 -109644 85814
23849 -155493 96251 79564 277313 -136093 -20848 -259390 242251 77764 58705 93285 160568
23838 160568 362327 -69462 -252058 97828 -178145 -408544 390205 242384 -215742 -24706
23827 68939 527750 -90993 -86277 -85749 85718 -83418 -73228 385456 -80690 -21258 -207624 64282
23814 -17798 -340333 -152191 75902 215609 -93086 168680 371637 186220 -201943 -28282
23803 234846 177597 -244423 -288072 -110765 -257887 -147095 86837 -215448 254619 -22970
23792 -23610 -131333 -116798 -75295 164639 -225256 -360272 198895 -149954 -26449 -166081
23782 -166081 52163 -210698 134922 120696 -59847 79496 -19505 26037 82544 -212120 -216245
23771 -216245 35900 -108066 40434 -13848 156201 20183 -95932 235980 50425 300496 -77094
23759 309903 325196 230988 246372 -75859 182103 17471 -122757 25832 -49855 -62954 32189
23747 123238 31669 9202 219154 63658 75064 43841 3669 -20068 125861 -22558 -5492 -134105
23735 -134105 -17373 50655 38048 84983 -103810 127892 -108850 -105114 -68705 -125762 -30006
23723 86504 12876 219598 324384 -118523 108857 -172476 -68898 -133579 -24431 132279
23712 -20407 -71726 -39514 -150609 117774 165516 -127824 -19492 96827 -216899 -79580 -19276
23700 -362579 -353301 14718 -348421 -43913 127502 -31657 -286806 90019 -239875 -412776 133790
23688 -160606 139849 -48603 -28405 -19221 223505 60079 35333 5086 -21924 20197 -368772
23676 -395358 -9700 42778 -76619 24815 -37540 20905 -187492 -88567 4407 57714 104126 9354
23663 -5645 -239353 242262 -270913 20839 -9909 126293 -81760 244812 -145753 -226255 -13257
23651 88049 -137537 -4640 -227336 -30116 19690 156386 -97164 92565 277308 -70594 -246935
23640 -246935 203026 20528 -6195 -240762 57606 421939 26527 -149166 55398 -209055 -104183
23628 110025 -163770 95224 -118281 200887 -96152 169551 -175808 -77358 -32050 -388712
23618 -388712 28103 -63605 33002 209112 31780 -57939 55638 85167 -98925 -128592 249890
23606 -72073 73809 15191 -221376 226557 39299 -64666 293112 101221 -199879 -46529 -80627
23595 -80627 -98363 -192613 -25536 385012 -121673 299758 -12550 35924 336794 56767 -285164
23583 -109358 95451 37911 7209 117366 256054 351124 46339 -149806 21257 -2787 -61164
23572 -61164 93578 154983 -142483 -178723 -32289 -30425 -152835 230277 39197 66589 169884
23561 169884 182148 211421 17351 -132341 71982 86379 54567 -161314 -191645 25370 134839
23550 134839 -394078 2791 -174847 38760 -22298 28579 144000 73556 -264620 21879 -93349
23538 -119949 -229891 102324 171270 63896 -150559 -105902 159095 70596 -199672 164073
23527 80491 -84476 -74747 64201 12091 -328219 -122911 -374487 -283686 202588 96080 147086
23516 147086 -102392 20429 -289304 316950 186400 -165430 -74757 -212541 -44618 -20510
23505 -107516 -40571 54861 195192 -161565 344930 -49891 -77209 52696 284594 -329575
23494 -38356 215468 249805 54080 170699 -176324 -25522 -198312 -86411 118359 -36755 71571
23482 -25980 63576 -78657 -405782 -154568 -451927 -123667 54662 9005 -80709 303268 92277
23470 11672 -81599 14075 59883 64455 264765 -227427 -79944 102954 -113781 115133 269740
23459 269740 -91613 -97917 -246314 -340616 108289 153804 -152260 148877 -52209 -79413 38677
23447 -122166 416244 -496 -222560 94069 66849 133944 24309 -17504 -312759 79712 81710
23436 81710 84168 -153841 -341717 32828 -150127 -112655 -36291 25326 -10648 162246 -128809
23424 -158660 -79215 -379502 20852 -438084 -157354 -205405 439049 116463 338 162202 -79218
23412 112015 -51137 -119999 163702 395207 -91234 -183403 -437679 -213025 -31754 229873
23401 132567 -134511 149070 223011 -258449 359444 206997 65549 56557 -172833 -279069
23391 -279069 191646 -12736 130919 46769 112060 -11835 110418 -444185 70168 -110741
23380 137581 65672 10709 14600 -160181 -46948 -96953 84167 -32568 59564 -175026 113797
23368 -71414 144514 60477 -95173 150901 1458 -66754 156690 -24112 78870 -98007 -9240
23356 44355 -193998 184170 70330 300149 144869 282201 -116601 -59944 163959 -101748
23345 -90018 -129443 -41098 -251408 293490 -26160 14542 74869 -29813 370207 -46242 -19936
23333 -78639 -164299 74961 36652 -171502 234890 246342 90117 74567 -27859 -124388 -126634
23322 -126634 -175714 36482 27872 170361 263236 -70846 137906 -162930 83951 -270968 21793
23310 167767 88784 -17956 66068 209635 -31348 51692 -42319 -83742 -94121 293378 -193901
23298 -74606 -252043 -53180 134934 -339953 88381 -28372 -175332 -291696 141640 -111814
23287 -101484 60391 -92668 76576 -41432 -169408 95003 -134135 262293 -243036 -251090 -247898
23276 -247898 72588 176050 -210530 -110132 -138344 266993 -96920 -121292 -9705 343906 -156409
23264 42688 -252975 -37555 -236529 -55575 -183372 -60487 -11255 131713 -217347 -273504 10818
23252 -51424 -139785 -26374 -52292 56630 -14296 9534 -97557 348265 41836 16860 111115 -76760
23239 163096 81450 -75952 -148322 75810 15539 -65017 -24874 477117 356684 -145008 -194446
23228 -194446 -385074 -481194 120073 -70400 -65197 103711 -135625 -21337 -263992 32081 85143
23217 85143 -66302 232920 23824 -70534 632 -132154 -396063 -164411 179289 76691 -29421
23205 -96249 -284811 127792 -417913 216750 47829 110259 -7085 -180620 299109 -83897 156220
23193 -245050 -76104 -66537 -11567 -19133 -209089 48040 -65045 76650 107510 -234060 222898
23181 114 -179853 710 -73328 18695 -318811 127372 -120060 -41596 -194749 -180706 134201
23169 55998 106738 -242675 57629 66866 81337 -109496 -18280 -69477 148160 -252245 50318
23157 170014 -72504 167406 157085 357089 112294 74608 21757 47183 752 32539 210572
23146 210572 -122698 301374 -59832 -175646 -11374 65917 312100 -114430 -174310 -114270
23136 -114270 34905 -36067 19080 -37127 489956 85738 -223309 -13713 -158784 -111020 -192314
23125 -192314 -129257 -89205 236601 68396 -143805 164049 2171 -105876 -198432 -54498 267736
23113 21821 -277957 -68380 -106981 -134304 -112332 -31807 -269845 -380183 210324 -43950 -146733
23102 -146733 213807 104721 224320 109966 -48895 95681 -55750 -129646 -184859 166574
23091 -74544 -106095 107678 6348 93378 -42057 2391 -6931 326115 46987 60079 -113227 -124889
23079 -124889 259533 191524 -253524 -176132 -168600 -248286 -112374 -5606 157944 128310 -10849
23067 -111213 -108756 -180637 -292701 -59489 199384 -268210 9025 157423 380259 -316784 261526
23055 213086 -92492 -83847 153979 176624 669 18748 123777 -375143 176066 -115024 43985
23043 -20566 -289563 -102175 -91138 152854 28064 -158899 208550 -57354 208651 -8756 622
23031 -48230 82004 146501 -52390 -5254 77023 99071 147657 -251061 167175 -93246 197945
23019 109606 148452 -51087 -31776 -56919 53740 134070 -379809 14787 180314 -31844 -23196
23008 -23196 107804 -157898 -329785 180070 255303 -159630 -162620 -91563 47077 -110791 -20313
22996 -165561 31386 -152527 144686 38205 56018 134390 44829 76820 -103644 95849 -48549
22984 -133458 -161177 -98139 66884 -150337 -156137 -195119 9734 -245684 -201383 134827 -202719
22972 124482 238625 -28204 66378 318404 74380 194515 -97438 -241107 -171979 62151 7279
22960 -107060 17038 -178393 -51544 4464 -58594 134848 -235721 37921 171816 -85804 10898
22948 -153709 -334374 -49136 246741 -43091 39213 -149385 -33342 -106531 119824 -16792 -246942
22937 -246942 -45564 -22737 311633 146878 -142992 -192877 -109670 109280 13662 -345161
22926 -167992 288004 172370 -114742 23150 19801 74378 99522 -166515 44115 5431 -198215
22914 -27667 15545 -43688 129588 -329801 191063 141216 -284592 -96706 37149 181546 52337
22902 -39106 47776 -276416 -159172 -82591 82834 357494 3879 204918 -104070 -50650 156730
22890 -44329 185409 31572 299411 -79216 205382 59955 301852 -159085 193527 -38800
22879 -52306 -42886 -75774 -118354 -257930 38980 185296 36557 -23139 -165134 -122946 -80363
22868 -80363 128394 -71340 -192342 -100910 18815 159356 -113380 -300553 -145837 3691 1904
22857 1904 -64880 -261578 -258917 289162 78429 -373342 -142863 -13056 -153534 -174352 -315528
22846 -315528 198297 53149 85948 53486 -113941 -72293 -43685 124676 -109145 -168366 334727
22834 17189 -28138 -81018 -197974 -122305 -25929 52118 359808 -154953 -373152 -103984 88379
22822 -76340 -129670 58055 -169434 -34920 236586 -231501 281184 83625 38965 -165156 -70328
22810 38442 9957 227228 9872 71624 24335 149437 -12736 70342 -132047 53854 -2367 -203599
22798 -203599 -237750 -205522 318479 294411 -148585 -224248 135069 57008 431509 15921 -74322
22786 -165595 -25977 259582 -20372 84346 18242 -116087 70463 -164974 80749 -21354 182906
22774 110499 32130 82896 -317536 -205119 -157050 -261019 -61167 112133 -95595 -197943
22764 -197943 178399 -173318 -323646 -68602 -34829 -22042 -73535 233815 115338 -228732
22753 300677 -165722 -197085 70407 41870 103620 -454587 102547 162694 220641 154479 67089
22741 -155226 -234063 476469 217190 -123824 -96870 -87582 -33225 -451682 -103533 -67034 -198309
22730 -198309 -6609 -338157 -27869 -216939 -269260 192501 -153783 22258 -457047 170434
22719 -323883 -237232 -99632 293640 -18866 -50996 4500 22675 -129602 138009 38102 -95411
22707 175638 66571 -52684 -71649 291044 280891 -8138 -14515 -300713 90663 -74765 25563
22695 -62338 -214618 -34929 -69514 38813 43201 98404 -139574 -144498 -159403 182345 272080
22684 272080 251969 17878 -326377 158007 -182286 -206131 -5141 -35099 -106461 12209 197706
22673 197706 -198256 169775 55137 81181 -5535 31685 132732 -338188 186939 -265489
22662 164996 -19158 112802 -357070 287027 9475 63718 -47390 104199 167658 52316 66281
22651 66281 -125664 59145 -277539 -30243 -147386 -122683 -3637 -234616 47676 -251966 63153
22639 -481539 -150854 -102678 195343 -272523 -67192 -82840 142995 42897 127681 92998 -196256
22627 -10446 142699 64468 -447506 99133 -206584 -273462 -104661 184578 -290307 56961
22616 45574 -194196 -171768 -332465 -515127 -491397 75487 -321881 175255 -149097 96306
22605 -160809 233349 50563 16180 -200514 -120976 206030 345457 100863 75097 158484
22595 158484 -109217 -73831 -444128 -144612 -57638 -54292 -126290 -256913 49381 48541 156536
22584 156536 254488 -281736 -204352 -152897 -296202 53587 -10460 149113 -54835 -315312 19702
22572 -3285 18279 -267529 113572 104540 -81761 141514 231743 17552 -162145 -222403 26368
22560 -127779 -65594 159990 -25779 -281032 261498 34989 496057 62658 84158 -167470
22549 83144 -53338 -126449 -19134 141599 -256153 -193619 -162562 336298 94411 30469 -129130
22537 -101461 -194122 125504 -6278 -76614 -43167 -441190 162858 70951 192154 89678 -31735
22525 -138547 -255303 -80557 -202168 -13227 308946 4485 112028 -352526 -68918 159752
22514 -106603 -409087 128863 -268939 113036 -31810 201092 180248 58672 132516 -118380
22503 -114536 -163386 41084 -78285 -204293 77638 227746 177793 -1313 -132818 209891 -129202
22491 -129130 112395 176506 -131086 354696 -71673 25014 -79591 -349357 26378 -7043 -16698
22480 -16698 123358 -3631 -12225 -193456 -74232 16458 -185369 246062 -81115 -84189 76606
22468 -289604 142566 -212693 176407 72448 139164 32501 -2239 124106 -77483 -229806 -145374
22457 -145374 -255019 -205355 -12652 -212736 -20154 106020 26353 -166766 30558 25933 -87614
22445 219927 119873 312399 147125 48954 -70992 -62023 54429 -83436 405119 130620 845
22433 -255752 -290385 -173200 -19032 -91018 117575 187082 -48570 159324 516712 133562
22422 120301 -105646 -142690 232689 -193679 -148708 -29876 -17673 71800 -114647 96169 -297694
22410 -78093 -242292 20657 41730 -88955 -224082 -211068 -31682 -199262 -120708 -81225 162038
22398 31973 -158749 23279 -3343 91143 -37556 -493656 -24330 32873 292191 -362052 103260
22386 85518 96239 -154218 43647 48689 -235151 -283431 210975 -212416 -145641 -46833 83981
22374 -4271 -174728 -245014 -159698 25419 -122238 -64235 13459 -317559 546 1343 303522 353860
22362 353860 -334315 -130268 -381138 -53218 265143 202312 77362 -76425 16585 -105738
22351 24110 258692 -149405 137836 -12218 16304 1208 -221121 -103714 -250669 62566 -154050
22339 336089 102391 -267753 -135414 -35726 220022 -95733 -41645 -339540 115538 -271744
22328 -155632 40170 -295340 319931 -66611 -65754 -81722 53033 -141828 57806 -65884 33894
22316 123913 297097 -113893 94948 -49259 77486 157291 106322 57951 -90960 -149047 318507
22304 109296 -218412 -298717 -21225 -57659 165010 164106 -74682 -20308 47677 143176 -278164
22292 121869 6179 -15091 -92633 -67571 -8700 25288 -79051 15987 -53244 137589 -217498
22280 -331270 -51488 -167 -77121 67073 -253041 175211 149002 -190614 -12020 -266140 -272515
22269 -272515 -249842 -55470 -304266 186331 30264 157454 -153667 229479 25295 42348
22259 42348 118792 -174909 128273 -233496 -19904 92096 109203 165421 -40430 -87313 -107585
22248 -107585 258995 -152820 -57721 -284620 -96986 -77996 75019 -176949 -44973 160355
22237 125436 -113783 233047 112055 -364361 -611996 73041 -111324 -76195 49481 48339
22227 48339 377003 219571 29046 -300501 3968 221547 -33954 -150658 -93846 72021 50761
22216 50761 -100336 -15152 -71748 39962 -293852 165007 -229091 243092 -84162 -282235
22206 -282235 -233563 -11312 -93755 64014 -174998 -195966 -246525 -66636 -174264 8334 112630
22195 112630 75133 18623 124331 -150965 95288 -110500 -244048 257673 86415 74514
22185 74514 46212 -203498 -234746 -209251 239457 -36608 -300481 32508 102378 158345 215302
22174 215302 -109160 5216 59358 16355 97491 -58847 53335 -61523 -230550 -147938 -39608
22162 -2954 -27743 178751 -152197 -99012 111820 -226045 -124972 -384445 -56927 168813
22151 -8289 -164983 23123 -33108 82419 87550 240803 -33391 -48450 157953 -208708 25059
22139 183056 -136795 -215525 115830 -198191 104289 3310 29399 14990 -257638 4711 416060
22128 416060 33016 -224512 -248507 -263129 376364 156438 81277 91657 -78599 18474 -142160
22116 -7531 32708 11112 -260068 113263 -253389 165836 -173830 -149463 -13165 202300 -80897
22104 292443 -141089 -104016 94207 -153890 -255719 -164271 -244290 -116469 -162817 142258
22093 -355144 -324654 42922 -5762 132078 -128201 7676 67915 197260 -38281 23897 143457
22082 143457 103645 -185881 -111700 -122781 257221 86751 189625 326645 -236359 -93971
22071 267005 171196 107965 273594 -348935 -210901 -82588 44499 -30637 -23628 -124752 38457
22059 -73846 -122645 -234009 -90563 -24933 -221979 21166 39283 38140 -149956 56586 -113513
22047 -34202 393440 150777 178127 29597 -229695 109053 8530 139611 -249283 -199999 101739
22035 -79353 20471 34005 -94287 -50874 -85076 -215965 151103 127610 72145 195775 -14213
22023 72227 -240622 27470 -80894 310357 298164 -67521 -63576 48411 -311689 90337 -86360
22011 54327 -130727 265480 -108043 33849 102250 -18530 -54475 78116 128711 -177314 -126802
22000 -126802 -229635 23183 -80398 -167701 -124087 -117245 32703 -332499 47120 -68693 -272470
21989 -272470 -142482 78192 -60180 -188492 -79377 -72163 -7711 -297896 -128974 -95552 146954
21977 -208816 -142679 201333 -63613 5540 -183104 6559 240069 -80988 309146 57219 104493
21966 104493 -349286 -309361 43129 -168699 242236 -46110 -186340 -100363 -83123 -61136 -111039
21955 -111039 -221638 -11288 -419714 -106205 146300 103141 128557 -254343 -24629 175420
21944 133148 -157129 -85628 83470 22202 -11761 -143249 -266160 328 128853 82686 -88584
21932 37786 8962 -257400 -435921 61379 -113495 33055 -30469 -172678 -165106 -350629 116289
21920 -321777 -310472 57143 -407832 -2603 -147911 172169 -295241 235516 -158832 -224911
21910 -224911 -298285 -236452 -167775 52210 104885 -23994 -398220 -339951 -112485 168866 -75842
21898 86087 -189124 -18777 -210085 -63836 265645 62064 96110 -26950 12257 54765 5356
21886 -108247 -161349 2410 134669 -191417 -116558 110705 -50688 -469119 78037 34324 -169265
21874 218691 -248909 -297932 364288 -285944 -248288 207175 -151741 31784 335324 -130075
21863 78553 40686 33281 126209 189285 -310958 2525 -58646 -97340 -293825 153951 100520
21852 100520 -17233 -148687 250591 -94551 -230516 27069 -30216 -13632 -113947 88328 -28318
21840 -31422 -26561 70344 -40787 297386 -348417 -54237 64179 -17058 123626 1800 12121
21829 12121 -20691 -211987 -241272 64229 293474 -137413 5301 -95775 -106958 -116306 -30486
21817 192108 -233561 211664 -291954 238839 -43756 -118236 3694 -38236 76666 -37342 81393
21805 94558 -154425 -88150 -242624 145437 -204750 -175636 -2848 5007 -98332 -187723 -99172
21794 -99172 -165892 260775 148748 319864 -140761 -172329 166807 278981 98319 -223296
21783 367177 -71065 -123347 -110463 -135564 -177356 -167358 -195008 -177011 -23975 -65153 -241956
21772 -241956 -115718 -122270 -126772 -215046 -46531 -204430 -44550 -114050 -5799 -201151 187973
21760 -52724 -126299 6123 -33305 -242706 -90480 -217518 85343 146720 16587 -165378 -154287
21749 -154287 65470 25028 -49967 -232022 -152987 44547 -11545 -385263 -109343 22232 -173827
21737 -88500 -83222 -76787 328863 126710 6018 118265 -66277 112622 -8711 176138 154339
21726 154339 18317 -174981 -36768 -473651 26987 156982 -203691 -67262 -82147 -100788 82359
21714 -59315 306848 131234 -127833 -134698 74841 391139 -68292 148825 -158614 32549 -100710
21702 -189812 -336267 -258052 -29028 81887 -19259 363576 -221024 8124 -18984 -166754 -374639
21691 -374639 59575 -126218 -437710 16214 149644 -227105 194977 154373 -45450 58651
21680 -102988 -276523 -87426 164302 123199 65533 -229102 48496 -197581 -214339 -395420
21670 -395420 -27076 -252289 -422855 -245095 -144643 22042 -46441 -111905 52880 -86478 -157144
21659 -157144 -24128 1488 124386 -170153 -448640 -473034 7910 -111687 -30581 420934 34051
21647 358688 -58007 33929 93126 9022 -8809 -56289 -307890 97413 177184 100109 -111319
21635 -108313 -258034 243538 5124 26485 -162292 -128685 -28413 -182062 17159 52818 8216
21623 200216 -386885 -34606 -68857 259206 -33023 -159268 187369 -262877 -62765 -64721 -239541
21612 -239541 -5489 -52415 -51963 179687 -19550 -154397 6561 176809 -58497 224036 -56937
21600 246208 370629 -361066 107097 -21272 -40553 298 28744 -70046 169658 2340 -182140
21588 175108 64806 318628 -146243 -208431 -36861 -18040 -191488 -175191 183079 116905 -29116
21576 -22164 -95401 -144220 -93775 -122936 215020 146838 -203539 -180823 -272738 123353 187501
21565 187501 -271272 -61612 51455 -70214 -196626 -293776 -155722 -4576 208051 1830 129855
21554 129855 166579 -25959 -64254 219964 383226 -121595 -133092 150540 56315 74661 -185696
21542 137127 44655 -236901 39251 126787 71151 -87077 90913 31855 30040 -47110 76183
21530 -315098 -109754 -100741 -59346 -162997 -26230 -27803 48850 -329854 203110 120041 -189984
21518 -195082 72140 145004 -196377 -173264 212539 -160569 -168077 89157 -27870 -172541 -41255
21506 -6347 254332 -69651 236177 -194601 -220063 152349 -180799 -222486 -310462 -137809 -53422
21494 -186822 -341553 -235044 -156161 -40827 28958 -163135 107197 16202 24960 -83598 -136748
21483 -136748 -116856 64740 18858 -28063 144415 -154330 -61191 48184 -9947 -220441 -84621
21471 177622 -119592 -15275 -257602 -309304 118364 -105097 -96334 -142096 -395396 -175229
21460 -78100 84871 64139 -127459 -255881 -122711 -153659 -127074 11363 233770 -65770 -112672
21449 -112672 -94302 -2021 -446505 -154363 65260 -70095 -160181 -39884 -239180 91147 330572
21438 330572 453585 212190 -6481 -101890 156723 -8145 99010 -84485 72545 71247 -151940
21426 -68884 -193066 -5877 -344424 -32950 272507 -54036 -48055 -208406 -146615 -303981 -2632
21414 240112 -46483 160125 -426173 -127049 -125620 -114038 106006 205249 144468 -133794 156516
21402 142547 -81600 -266341 62057 -140872 -475562 -193449 -313906 215103 49567 183014
21392 183014 176275 41490 -90954 -87327 -216340 7755 -181217 -183749 -168118 -294342 300011
21380 -192631 27698 136239 91241 -287792 -44487 -98058 -23086 -40945 -280899 39870 19056
21368 -102423 -58379 -78020 -136296 -321725 29559 -76322 334238 -225234 -76521 18206 -1818
21356 -188199 237440 -93459 -154998 -126855 -104829 -26504 -191893 121029 64210 251241 -177816
21344 -50136 170260 32787 -59444 41273 -292984 -20453 81383 402027 -23567 -174993 -129799
21333 -129799 24219 -57800 -199045 77320 -51791 124011 -58268 298958 258615 65945 -56796
21321 71924 32312 -170629 -81127 -167350 59050 -69483 -97035 -151545 55780 -176567 -413574
21310 -413574 28533 20370 8106 -439770 -186571 116702 -374616 -113955 -150237 90739 -206749
21298 15996 -25460 414063 175105 194714 -120014 -102439 105560 -89418 234096 -32020 128307
21286 -44343 -152471 -69847 148347 -189612 133354 -191681 -9930 -209019 307351 -62617
21275 224819 294268 210990 -55996 -45068 304038 48191 -70691 -113974 -194403 108519 -22963
21263 -341652 -8787 205232 171067 -32126 41251 -121132 -310828 138537 146599 409788 -201497
21251 185235 -8860 -265554 -326250 76884 202560 -9725 -241633 -142672 62181 238462 -336930
21239 11906 -92961 -267968 -35864 -252214 15952 -170750 46935 -150303 45729 -19172 129020
21227 179027 -245475 -211759 -99326 -211025 -112236 86208 152694 163763 277717 210759 147920
21216 147920 176920 -156937 -148488 -111752 -41170 -87279 -105647 261790 -163338 -204597 39374
21204 -279574 -131012 177489 204252 -61699 -122997 157438 -33444 -108012 171031 35336 -12998
21192 -126861 66253 181858 220907 -15397 -113249 -196539 -24760 11299 -153853 31896 -57415
21180 -109550 -265051 133536 221600 -178147 109096 -16392 -39320 -79423 -43016 -71212 -39821
21169 -39821 -44395 29027 20251 -121151 316742 35817 -388521 -244535 -19600 -75265 -120261
21158 -120261 68682 -301217 125988 -167662 -51621 44807 127408 -112348 324289 -63662
21147 22285 -196183 -279798 -81940 -95987 -259466 -352644 -221035 -219194 -130715 -15896 -13491
21136 -13491 -45858 -54053 158248 -361273 -354778 -30564 -140462 -126840 21275 -337510 -105186
21124 -116692 -73403 -280250 99784 58550 -52537 6733 160177 123 -5567 73503 -119667 -39358
21111 188820 -62440 -184821 -146550 69187 -437472 -194270 102874 -101630 -55110 -186174
21101 -186174 -238468 -30581 -456006 54377 -145979 -80922 82221 314509 4525 191958 103083
21090 103083 -157159 187262 206466 -43292 236963 101083 -137374 -51046 207693 181855
21080 181855 147972 -74859 -45822 -166406 -211761 110865 264684 177383 -209342 2087 -62673
21068 -126806 -141798 -78264 -343884 -179473 29346 -521107 -107090 -5935 -119743 105965
21057 -291856 159524 -10012 -339027 -213251 353298 -90912 -96248 -199067 252063 79525
21046 -293216 -93671 -276761 146118 285624 -352561 115972 -204224 111863 -47943 184737
21035 -112764 -13286 245022 -72894 -9951 -204361 67441 -231860 -152320 -149484 17621 -43565
21023 129666 211171 118851 -168015 -102584 25724 -97193 52957 -187360 30518 -290131 -56067
21011 -250645 167634 254007 -153059 148136 -76135 -872 -72543 164094 -57677 225798 -302402
20999 -73721 70149 214189 -127230 -96425 -72485 -123295 -10769 273865 234961 60102 -109234
20987 -81416 -43593 -177859 75292 -73238 33425 -46787 87718 5778 -220067 60620 -91124
20975 -302548 -13880 -138260 -215358 243138 -47367 -243799 -140903 -158432 -11588 160359
20964 -79572 87518 138394 -28440 256486 -225489 -74693 30321 172547 -101593 126352 277978
20953 277978 226484 125308 11481 -344453 -88762 -169869 41379 -149707 -12344 -190091 35568
20941 82553 58943 -124501 -7074 129508 -152549 -46175 -52327 40816 -244944 21350 -260357
20929 131513 -380278 193042 -9767 -153856 -106240 -176454 -259486 -236214 -64707 170803 -486128
20917 -426436 -114199 -257421 -211015 206179 -360075 -44447 82744 -238599 151624 -303190
20906 176384 9695 304128 123345 -307142 -140375 -130316 321981 183372 41360 -99118
20895 180584 186801 -356654 131702 227498 113840 -68872 -237211 -124773 -23672 -188977
20885 -188977 23947 -97734 319525 300346 -31475 -254295 -39361 -153094 84828 147220 80011
20874 80011 -62494 -261736 -120541 58303 3391 -13778 220358 -27713 -184892 -169137 50606
20862 -110636 -127860 13780 53500 -109999 69871 -46142 -100382 6584 232995 -403855 -63655
20850 -34290 -251648 -85459 -172982 116181 91030 328999 67138 -101683 113025 49949 -220797
20838 174598 46177 -2884 125080 52913 192191 28319 -31490 -134767 -112396 -78037 -28592
20826 -166189 143058 165634 188586 20897 57282 105005 -234057 226461 187008 -82258 -54950
20815 -54950 181835 -274756 -218416 -152857 -8874 103520 -99037 8239 -114924 132743 -111959
20803 -76516 67408 -25708 28667 11282 307439 73505 -166564 102274 -287823 27485 -115919
20791 -56771 24052 -99150 295709 285289 -37166 -307000 384559 -220203 -253164 -11132 -176782
20780 -176782 240875 101289 95730 -169658 148562 -141428 -139851 188295 -101628 -155286
20770 -155286 -57794 61767 -62738 -163087 -47643 175276 181150 71323 -36247 135141 -4012
20758 -56295 -67699 -206907 -368653 -479927 -79056 -119999 -16632 -125280 -125137 -277260 -20763
20746 -174889 -327931 -77045 19538 -10235 170516 102681 -284145 -313390 -67895 -137030 -133885
20735 -133885 -199343 9090 4137 -373719 154969 -165534 -250303 -159159 -128057 -14737 3880
20723 105152 9213 -200371 138210 -166620 207468 -73815 -95618 -110982 -52940 -143714 1047
20711 -525893 -108156 25752 -194372 -68037 -125999 -37029 -116888 -34693 -194220 -98029 120982
20699 -461974 70166 -132778 164582 18600 -303808 -12039 60580 -71761 -213231 -157075 -245317
20688 -245317 15977 35261 98054 118466 -30147 -289933 -20899 78289 -370878 -424824 -115046
20676 -53789 -231532 79150 35366 -315456 78414 123305 -62442 -164091 -94799 -205025 70799
20664 113476 -2455 -89652 334333 -128230 -29426 105318 72249 -250509 25400 -171441 225909
20652 -9980 -203779 -150685 -323406 166971 -30904 -111762 -183204 -272170 18938 -68563 -174584
20641 -174584 -186348 -6974 339617 -223009 35138 -416963 50672 -240717 311703 -177977
20630 257444 -88285 -298783 -58375 -124921 -147739 -179210 -154212 26876 -85279 -141950 -39804
20618 -36356 60484 -90204 -286959 -7126 -23236 186215 -156452 49297 -115161 324580 -26207
20606 28499 72425 17609 107648 32246 -76907 -3542 120605 224091 95312 -51202 -67318
20595 -67318 -29067 -333237 87785 51609 312766 -182219 -56879 92075 -167968 -47135 107060
20583 -269498 -101395 81179 -269577 22708 326285 144427 27716 189856 -252062 -447151
20573 -447151 -206783 -29399 199267 65210 -41597 163292 -2840 -118687 -90354 150830 13010
20561 -108350 -134821 -99152 -144642 -192402 227301 -314 106861 135154 -214877 -72905 -11140
20549 -187435 -31174 -386909 -107992 -242587 -182823 -175236 -75858 286032 20189 -391929 50145
20537 -173191 281936 103494 -296347 -81616 -92201 99935 45724 129851 176139 -231063 60106
20525 32351 110987 -279970 34967 -353185 129833 282212 122105 27232 88255 -126909
20514 -277789 340224 2092 76198 -251085 -388918 -327750 125624 55107 204660 -39223 247107
20502 -217655 263934 -105645 -53642 -108306 4224 -227284 -311160 -143821 -99502 -50847 -343054
20491 -343054 -56101 62578 -62910 -231839 -167605 58236 -188226 -459614 -243314 233882
20480 -208234 9783 -39627 -186243 -120985 90347 179435 120091 63362 196316 -127165 -136639
20469 -136639 -203698 -119357 -269708 120372 28528 371082 -34375 -23366 -142710 111826
20458 52511 305861 105437 152330 111211 308129 -184501 175247 208055 157636 -170526
20447 -172428 277048 -283485 -159719 -180092 -236077 116220 -35566 -149706 283275 112314
20436 17111 -78099 -254538 -32607 -47293 30473 -307854 103764 -66286 -305960 -362603 -36644
20424 94906 -22181 -285118 -137980 -82195 -9220 15787 162650 -270219 -141205 249941 -127985
20412 -17153 -27915 -219430 114787 -34934 16459 -119917 189922 -73092 110623 90493 204704
20401 204704 96938 41855 -325002 -38076 2445 214148 -90156 -19237 -237606 -156832 -32232
20389 -9223 -115090 -156533 107181 -177008 17662 95552 1124 139325 -173401 -97313 -297891
20378 -297891 -172392 -49041 -28982 49177 -29370 79711 121162 -312816 198908 -190759 -283515
20367 -283515 -239982 97845 -9802 -181029 8712 48034 60312 -78371 -185674 232033 -318855
20355 16846 -72159 -268263 63589 -152026 -132510 97238 184835 121966 479910 -1695 -197301
20344 -197301 -494924 308866 -221552 68882 157733 -283493 212070 76377 -166894 80709
20333 -11768 -159438 62945 -81453 -223043 -48 78637 16477 128812 -22291 -216202 -53245
20321 -31742 57869 -352554 -293534 -270610 -19895 -9806 -216952 -212862 290358 133221 4068
20309 93705 -157523 294941 61528 -217345 -217372 -323498 -285991 168975 -83157 -200613 193842
20297 -86227 -200008 -98220 -101618 89003 91493 -94421 122719 -238355 47707 34761 -116450
20285 96743 57891 -280132 -274531 -96684 -7731 -159482 -215674 -202062 -448214 32414 152520
20274 152520 -15088 -49375 239167 -8350 -105612 -227233 -138424 104304 36106 232440 -162610
20262 -38065 96178 -93234 -21228 -57440 -227295 -162226 -24017 -54404 -141521 -229361 -66056
20250 -326386 -162042 -97773 8547 26887 -35963 -1538 -107762 -142968 64896 -181745 -58194
20238 78564 74307 306234 -337007 -172647 -206747 -19794 -27059 -4764 -90830 70729 73287 -60682
20225 -379816 271624 40156 -196028 216175 -291056 335012 150824 121889 -56318 53448
20214 -220636 -119087 -234152 -47456 91604 -160768 -245895 -330449 12299 -123075 -3138 -4156
20203 -4156 370411 -342915 -58602 67656 99608 -236794 -259991 -218314 95059 -63660 -31477
20191 -118504 280079 -357519 6834 172073 -225423 -27717 10408 -47664 -368909 430498
20180 -648297 -39792 -82614 104399 337996 35987 180136 -87862 -97795 -190953 279249 202367
20169 202367 37502 -132207 -92356 79393 28226 -47468 22949 331968 229432 -13171 -27356
20158 -27356 -245928 -131700 -67572 -40539 -152146 -119160 105857 -2906 -280076 -22702 -53168
20147 -53168 35346 121933 -884 -311622 -104798 52127 -51432 76354 8028 4420 202316 -103483
20134 -193748 62199 -240506 -149472 -25937 72654 -190137 -22797 -62273 -137201 165932 -176593
20122 77546 49435 -198628 90483 -163820 -88430 -230900 -210745 -27066 116357 122931 101150
20111 101150 57489 119075 -129731 -323697 -109484 267290 9435 -193399 -198347 -99533 12231
20099 -64486 -10393 -201981 -289117 82318 -171499 -187961 -162479 217308 63227 70484 53299
20088 53299 -221622 -1477 -69309 -60261 -79342 -106964 -351459 152723 189711 -81926 24885
20076 -93142 364647 169302 60874 226825 -27509 -122372 11841 86672 -46907 -249878 71418
20064 -67898 -242550 -171797 382 -249120 -25962 -176943 -105216 -194764 -142834 -94091 -94556 139515
20051 -245688 -163614 -263401 263324 -143648 -140388 200162 -40118 9492 -27861 -216985 -39689
20039 -193296 95338 129305 -85588 -218365 -471954 -66046 150188 -234969 -12489 -98628 -111799
20028 -111799 120676 -100386 129869 156892 54231 -40786 250888 -433752 -174042 -159434
20018 -159434 -241443 -365284 -40011 -413933 -239982 -137240 -60053 -188485 -44661 39020
20007 -193361 -139499 -84393 188451 -234419 -216485 -679 -110600 124716 -251767 -127465 100882
19995 82568 -278724 -116201 -98656 -74102 -25447 -258040 32557 -103452 -9291 -65491 -133866
19984 -133866 -57334 -101766 -43582 -52643 -74226 -169987 121746 -203158 -27133 -62846 158835
19972 -53674 451 202194 295195 -138220 188348 -150661 -151278 -170241 1361 -83579 -63030 318493
19959 4268 -66065 -137647 -124041 -296978 6816 -4888 48978 -145445 -109465 -142228 69751 -123101
19946 75866 -186514 110978 -344143 213748 99944 -26385 273838 -160451 30172 -88911
19935 -105699 -81221 -310677 -146405 -264896 49224 29165 34133 -45382 66925 214811 62538
19923 7922 246758 323501 197863 57773 -34526 133549 -185155 -52282 -351455 106505 92716
19912 92716 227906 -38395 -352883 -70536 -53747 -211396 94297 257055 -16795 -257128 -197777
19901 -197777 -49101 -140657 -67964 -19283 -77034 -236085 -126764 -44882 66754 147823 -130251
19889 -39257 -102246 -371459 -340609 190648 -145239 -5990 -65700 -63709 -223985 -162007 123015
19877 86734 -62108 -15459 -313054 128056 -101750 -232060 66923 -220306 -77134 -32416 182558
19865 794 -232542 72374 -234679 123761 164983 -539134 -167258 56004 -2947 265830 -20870
19853 96800 -257755 70913 -215283 130626 -42131 99510 -364502 43823 -131125 -75938 70301
19841 39056 -166889 -80512 -274923 -225719 -101247 -145146 42861 -161591 23926 201291 -165756
19829 -79371 -246867 21287 6956 3298 -311000 -294558 192767 184173 306986 -8483 -42374 -431233
19817 -431233 99435 -422882 -132221 100265 99855 -162147 206305 -220132 -156251 -101631 93485
19805 64627 -261282 -158626 -252135 -193390 -235277 -302252 -146767 -161328 -59337 -265254 -146773
19794 -146773 -91893 14904 -31785 -176576 208908 -155757 -127778 -91009 122748 -485665
19783 -88969 -175570 -252551 -112097 -183975 -29990 93014 -51745 -225961 115921 -264878 -196936
19772 -196936 166460 -82310 -186251 175264 10213 -358334 -62120 -254626 127544 7757
19761 136335 -188427 162258 -18578 196772 242885 37808 -200834 4541 -38596 -224397 -129927
19750 -129927 7154 91145 -17997 -190728 107744 176632 -15323 -137449 -99456 81962 180707
19739 180707 -191021 -72663 -147485 -296666 216376 3956 235555 16509 133218 -6868 -175144
19728 -175144 14000 -37704 -119762 220604 122558 -176705 226968 -2927 304773 84081 -261521
19716 110030 -296311 262169 38645 -33975 -333333 -293997 154859 -225831 -105065 275486
19705 83381 -120357 45180 -141496 -167356 36352 -121987 365185 189640 -30945 -107847 -130038
19694 -130038 -62336 -86878 59262 183101 -90123 -50779 -267842 -183040 57054 5594 -258022
19682 80925 203894 139366 485223 -287606 97983 -164868 -218147 -336947 -190056 -89985
19671 43358 -246037 64981 -192329 -12057 -85009 -9283 94085 118421 22109 -114595 -168324
19660 -168324 47030 44421 -51232 -187630 216537 -51156 347917 -154425 -30307 -68692 -224521
19649 -224521 -43382 -35602 329646 103538 126428 -96441 -178505 -45862 -259968 264882 55127
19637 145739 -196485 -73709 -22251 -42313 -307527 -97095 12233 -183584 -421683 -121760
19626 -167737 327062 -72846 -53952 -378495 74747 59945 -441529 98230 -105291 -418467
19616 -418467 -156035 -233559 -352988 204629 81635 -213380 43178 88732 23912 48104 -192944
19604 -34412 -173615 4592 43770 -5080 140977 -183003 -152132 -68654 -107349 435544 -121529
19592 133866 -72365 9766 -52553 -72391 -16506 -138325 110228 -282912 5741 -54897 -137163
19581 -137163 -231419 -12426 -122211 -162337 4909 -227012 18894 -163238 164787 249754 -234542
19569 39572 174181 -358282 -176842 50510 -300164 97246 -130899 68313 -125443 -153113
19559 -153113 -99171 -141588 4286 -203 -23896 -243151 18197 90465 -310219 -164441 55494
19547 -250650 41922 -114771 48756 154120 180809 -163503 -156589 -36124 307917 -226568 -45188
19535 -283998 138145 51245 6736 172521 69908 365343 -143984 -121674 -241577 -532500
19525 -532500 154737 71988 288157 -21775 126409 -226064 -33984 147811 -7511 -261126
19515 -261126 -102628 120081 -144611 -118335 -276964 -160427 -69882 -42762 -256389 351730
19504 -110905 -243111 495350 120073 -190605 140144 -201620 -231341 -338702 106991 -44140
19493 -102141 35984 136973 152084 -304308 -314782 -52520 -248734 -240307 -169116 2526 -53584
19481 -129254 157035 -248357 -197668 -150245 -59413 -131783 -164345 -315069 -19995 83450 96991
19470 96991 -86761 -151857 -174789 170607 -368613 -365285 -131010 -121552 -45726 -194060 -165435
19459 -165435 -67323 -180224 -92781 68470 -10789 -70955 -334838 -409630 16602 -141897 -22691
19447 -243802 -137100 146580 -317471 -167336 173812 9940 60421 173146 -361970 -355101
19437 -355101 1702 -35976 3171 -176355 21950 24200 26470 41172 -202436 -207490 25296 -379405
19424 284693 -332096 222673 -11217 -37936 -147143 -140550 -16154 43432 -139417 230821 -8213
19412 173199 -191423 128779 -162539 -41074 -57622 -105361 206813 -148627 235269 6624
19401 -281960 -314830 -263804 146968 -172643 -212163 -231781 17175 -229354 -417019 -55728 -185509
19390 -185509 -260627 216440 -171535 41069 -138686 -127533 -104153 -172429 -204088 -214609 -217959
19379 -217959 -20737 -95190 82824 -411089 -341635 30698 -12282 83877 42298 -138920 129514
19367 172211 56870 -137796 -147461 -37879 51639 10334 210040 -261408 -21860 -149674 -220801
19356 -220801 5959 48621 -87014 -260677 -49519 -40369 64548 170211 11466 -144983 -47240
19344 152405 -341164 -173606 163220 -176446 -222473 -131758 -63046 168035 46883 -11780
19333 -46107 145821 114721 -35488 -225864 194458 -196335 241922 -189074 -108686 276728
19322 44811 -43532 -197121 -200841 -103293 -168 -94230 9590 -144103 -146949 -403386 150484 -161271
19309 308888 -97437 -8429 181152 -22603 -222003 -275139 -133139 -49864 62147 205508 -34637
19297 -99830 159860 -33470 55974 -225630 4177 234576 -412821 -27893 171445 -368643 139692
19285 132761 -194650 -181175 27806 -27448 6204 -324950 242985 19769 125273 23613 -93655
19273 -138831 -524014 -25313 71984 -86390 -140141 188885 216066 97823 -520644 -31190 100644
19261 79511 -230647 -270072 -264245 -238068 90856 134226 179562 -350608 -30191 -138005 30026
19249 -108496 -314521 15773 303159 33030 -69577 251359 -344723 -86167 -9654 183388 -52775
19237 -123209 -91972 100232 -83433 -118287 -195117 -107994 23560 82298 241521 -128938 -254654
19226 -254654 236325 122867 161093 179051 -31581 213698 15935 103477 -30970 -113853 -28721
19214 158453 -437689 170141 -202097 -126953 -149824 271933 -34279 -19803 -60694 -146077 189403
19202 73006 113959 -14135 34613 80922 -18278 -114102 43153 117512 154493 -69187 -107554 45302
19189 -42157 -41703 -316444 -116027 -269547 33628 -224913 -40275 -162888 -178548 -103099 -267052
19178 -267052 -172969 -55410 -125716 -136801 5149 -37413 -248441 -193841 -106005 192828 65676
19166 -229433 -231483 243146 -132942 47515 210289 127017 121899 -250146 -237467 414911 300408
19155 300408 -167042 47581 205672 -141619 -306291 136031 -163013 63421 37578 -170723
19144 45653 -224132 20481 -253100 19903 -94406 -38996 -319342 -201011 219679 -63641 -332169
19133 -332169 -65043 -328194 -114920 -327171 -261282 58276 -80811 58296 -101314 90191 114649
19122 114649 78526 -298430 -319563 -110267 -216445 -87397 -200658 -381022 -141808 -60146
19111 90368 154535 288057 -36590 -100555 75408 -14897 61922 -77208 28851 -186074 -361557
19100 -361557 51225 -56203 200463 54444 147490 -50124 -179970 14995 -86039 210261 -77717
19088 -283867 -154630 97112 48320 -383740 159373 -200841 206357 125333 -99024 -63194
19078 -63194 -300500 124288 -52541 -721 -176634 -122874 302981 -155174 -62738 -306068 -2102
19066 178341 -48287 -17038 -95321 -416374 -235355 -243028 -94261 236839 -3884 -118694 -108323
19055 -108323 9188 96853 -29612 29536 -13354 1768 -278102 -5585 -52345 -41601 -239819 -185958
19043 -185958 49929 139366 26000 179 -441068 59497 -184474 41662 -339854 -253213 10285
19031 -10617 -86205 -172772 -82008 4683 -49299 -25260 -41581 -4326 87826 127099 -182379 -40722
19018 11767 54772 -53607 59380 -176930 -259146 -271108 60991 85665 28950 10114 66306
19007 66306 154627 -430884 -262643 88855 -206708 187683 155880 -219736 -54533 308340
18996 -279155 202928 -312146 62642 63651 -307434 71239 -160755 188069 -46676 -32114 -59013
18985 -59013 -339780 -24067 266786 -78400 92992 -195154 110064 -94981 54505 93368 -259094
18973 -254168 -91216 269730 -63896 -399956 61707 -23184 -170206 -88559 84862 185589 133904
18962 133904 -271577 -325970 -27002 -26918 132930 -110272 -88237 194906 -361887 -20403 69506
18950 -111348 -252205 -29397 72411 106942 57553 -106960 -75895 1448 -169356 -288657 236269
18938 -184233 1971 -207476 -75782 -210178 -143697 -268885 -176174 89546 -51304 -52983 -118907
18927 -118907 10848 -90360 148809 -270385 174785 76652 175008 34760 -65686 -103947 12699
18915 157504 110020 -29222 67084 110144 -105448 -37741 -253227 12058 -186562 26752 89814
18904 89814 872 -210383 -227720 28128 -10470 317471 31782 -125008 48783 30168 -94382
18892 -34322 -45822 204947 127546 -39330 -137452 299905 6828 -133017 -48094 4705 -229899
18880 80586 116424 -167721 27668 -66895 -54988 -211456 -149982 -17082 -142587 19323 -108753
18868 -240839 -129861 317452 90011 -256645 182847 -178684 115384 84257 -92192 285073
18857 -25663 -214915 -137578 61166 237135 63009 -207135 4033 117691 522718 -118182 276008
18845 -7351 274240 -226480 985 159898 79978 134166 -38789 -46971 117601 -93232 42315 -114119
18832 22072 9844 -52866 -231252 -71028 274828 126046 -126623 -38075 -7206 -80697 104345
18820 10086 123269 254679 -84668 -303948 87579 -72766 -309296 162941 87059 -6383 -136211
18809 -136211 191951 -137410 -163931 110047 -291477 -235654 -287126 166837 -79146 -211214
18799 -211214 -286046 -65112 1696 -134391 -177527 46128 316405 28148 -314391 185986 -78715
18787 -248840 -224934 115279 -207071 117654 249925 304424 -168056 392772 -402154 -19060
18776 144620 -80852 -443384 -214187 -336603 289201 -329404 -193913 3874 -35643 209516
18765 -233587 -20942 -98956 161240 88313 -261794 1035 -20918 82507 -11189 74578 198816
18754 198816 141413 -45127 266485 132173 72695 -165885 -21217 -160249 67663 -353375
18743 -46412 -246120 -100588 15176 -241156 117713 -34425 179004 -180875 -90597 185117
18732 -68615 20035 122578 -169019 -158590 -39474 -168565 -353259 67433 112956 75168 14598
18720 -25330 -258046 83463 112292 191293 -48778 77172 -95781 -35299 119001 -388283 -36126
18708 153645 9932 -7474 91488 242115 153726 112544 -6313 48366 -81135 -362705 -90169 100011
18695 -165702 23052 193310 -167886 -230544 -311597 44096 -163224 107855 47811 81161 -256493
18683 -142410 291887 -25654 21186 36808 62035 -213049 -149613 2187 -98675 237987 171082
18672 171082 -95122 -62647 -36714 -70205 -256395 85401 165320 -223867 -342622 93612 -119878
18660 -121660 111764 196774 -39192 5273 -29452 -75219 138227 186883 26624 -97099 127019
18648 215109 355882 -442072 -17164 132317 7199 -504520 192269 272516 9167 192606 94773
18636 -109213 -78242 -81261 -213779 -28240 -48745 -91113 -269627 85267 -17175 230630 159548
18625 159548 -29328 -127269 130692 -379209 -280367 -296021 275482 35212 -375508 -190779
18615 -190779 71645 -221626 -249684 -171384 -44575 -156848 -19775 -129121 -20799 -275850 -118209
18603 -120848 -201904 69069 265837 -24241 -267231 98178 -24435 -95333 -187315 -276544 -67159
18591 -252220 164588 -38673 -171308 30932 76931 -83275 -447237 -14638 300925 174748
18581 174748 352567 -86663 59617 -205398 -261846 259924 -200938 147086 -233952 -28286
18570 302211 92522 -130492 20282 163462 -335277 -26226 -258380 -356828 -27363 -162280
18560 -162280 48405 -44253 -105395 -190316 -259678 -30003 -150821 339066 -150443 37454 161432
18549 161432 -206713 -30016 4582 -105613 -61072 -56692 12639 -181290 -305921 358290 -106766
18537 -34318 -30130 -167457 187087 -135518 150107 -275058 -223145 -271483 125195 -3722 181027
18525 -231857 71236 -162138 -326557 126519 -121442 52121 187047 -123692 -147475 -320967
18515 -320967 -240260 58085 -199984 116136 48579 44192 -344790 -55844 -130311 -150573 -138826
18504 -138826 -81027 -279962 177141 -34706 -80516 -226958 -232327 -165566 -30662 -131882 -156857
18493 -156857 -170063 -172496 -277388 -6759 -103363 146293 129797 86046 54476 -29017 -363458
18482 -363458 354 -140049 -180458 29065 -375700 71015 148066 160083 -106111 -58858 34458
18470 45924 11300 -158759 -183103 -9617 372466 -79010 -248852 198176 130953 53159 7885
18458 73478 324349 -269076 -84876 62685 -80988 -164548 -98291 46796 -97588 67948 -117305
18446 68865 -2274 118626 -439651 36030 352039 110585 -63818 -103154 -79352 -88960 41042
18434 21701 -308202 -468189 -18998 -407336 -51780 -311727 87692 155974 231506 -254916 32610
18422 12465 -284740 -298712 -162831 137549 -104984 34006 127564 156309 -87190 -74845 -125422
18411 -125422 -196278 -31671 95522 -192733 -65276 14004 72200 219531 251365 -49816 -73128
18400 -73128 -241527 -86568 -29577 187049 -162690 -86219 32146 -529603 -62145 -5491 270157
18388 -79202 -74188 -178899 -44539 -269849 -263898 -223041 142608 -38839 49977 69874 239152
18377 239152 163448 -32404 29735 -142644 -67413 262472 -173393 -16389 -207184 -90550 225311
18365 -151934 108032 -4172 26604 -51808 -273471 -206890 -117723 183599 189417 216230 -100434
18353 -265003 49541 44029 -11069 50033 -105437 5115 -193637 -51738 117836 -36544 -3708
18341 -155564 27280 -18433 -97320 -285293 -34489 2849 -16624 -137004 97395 -285 -271431
18330 -271431 -129883 -34769 43753 271358 39332 -168918 106419 113576 31462 -134141 -69767
18319 -69767 -150636 29686 88225 236669 23414 -3723 -188530 -110877 166858 197847 -126959
18307 -9647 319052 3421 -6994 146448 -324120 67679 -7388 -117525 33865 71045 -198836
18295 -244701 114451 -264872 36250 -95124 72756 -256381 -70017 52040 39927 567039 -26699
18283 -371339 174795 -292142 94462 4969 -233915 49433 -165789 78547 -386522 -294669 -424660
18272 -424660 37904 -279705 55567 31843 -205770 -129210 161664 16871 109227 -45540 -373872
18261 -373872 216547 72324 -139522 -75791 -123751 117456 -114544 -83987 -144304 -408533
18251 -408533 80121 -125926 302155 283238 -225953 -30536 -110678 -194673 10347 -10585 113512
18239 96686 -181575 317838 -422024 -353214 99635 202671 82562 -311829 -119269 18815
18228 24389 -315353 28503 166970 50366 175113 -197623 125922 15758 83210 22443 27233
18217 27233 -98053 -278598 347189 -222105 217611 -148668 251825 85572 105705 -144792
18206 -367907 -305100 171534 13609 65647 153400 -154768 -201123 79766 -145599 128901 61701
18194 -8453 106739 92139 -222138 -270106 48364 304523 134245 39893 150480 197531 -441467
18182 128809 122204 -113127 183662 50257 -210529 82272 337453 -145658 -63951 -113931 89691
18170 -74134 15873 -55597 -402905 -349362 -30761 -341715 -221989 74400 -117164 -108976 -44966
18158 -158944 -49240 -81468 64287 -15993 99978 97068 -346477 163503 6341 -84595 -100161
18147 -100161 -35713 192935 -188279 -191158 38461 -252888 -190998 -24858 -327712 -221380 -37642
18135 -242497 63525 198685 191991 -72410 -84366 96197 -110984 212256 -17130 -225780 -197351
18124 -197351 22602 160071 34505 -27633 47741 173879 -102383 188940 -225124 -111577
18113 110464 -318263 -38037 40555 62596 72022 -327003 174309 -24308 -42481 314249 -73241
18101 -129013 -212968 -310665 -359728 119738 75004 46889 -140225 132133 -300376 -435084
18091 -435084 -145343 185637 273380 198132 -120221 -175609 -138552 18090 -21867 -146472 -186201
18080 -186201 -174554 -123417 191616 112181 38876 64830 139952 -323205 85047 -91602 457013
18068 -203033 282492 326755 -85349 -9910 -66516 -365740 25605 19080 87281 -189337 -19400
18056 -229938 -10702 -11333 59373 -33872 8871 -70519 273792 -305955 -72550 35851 -145160
18044 36213 -141572 248519 1589 91308 -29438 -155158 -118585 41320 -163533 388731 84091
18032 -61194 -9152 -134076 157610 -22872 -64743 -281273 -21882 58005 -69558 58858 -62746
18020 104705 -8539 -40900 -102517 51804 -105478 -349806 558336 -396198 209562 55129 -178448
18008 -13814 156948 13916 -133778 -296814 177348 -119503 9026 102136 -94726 -178213 -109229
17997 -109229 -137248 -170873 259183 103095 -35512 -19503 -224466 -285838 -448273 90044 -159287
17985 277225 138654 -2132 105600 5481 -276441 -114290 128122 5630 -5822 167977 233897
17974 233897 -228330 -27558 65878 -128314 -45135 -16386 32352 -154591 -431645 -13105 64069
17962 321068 98639 -34390 44400 -127379 -40901 41233 -383333 -121662 -72032 -100112 208537
17950 -57029 -146499 137744 -202780 -3702 51697 287782 -22924 29195 344727 73389 -33045
17938 1395 59015 70545 -171850 -22033 146851 80658 -38904 -69710 12520 118699 -91780
17926 189009 109863 -220224 -72094 -463300 106781 470722 -113519 -23460 -23423 -132975 76358
17914 50188 288041 44494 -140379 41302 30413 297009 -14004 -161076 164261 -241449
17903 -79602 69136 135413 -170278 132184 -79184 -330890 156550 -65898 71153 30470 -142169
17891 -52234 -176378 85160 -384815 -76730 -252028 -107086 -168528 -167806 31234 66188 75060
17880 75060 -61698 -34089 -21764 43855 197659 -181145 -26782 -263338 171226 132129 41383
17868 -342548 148199 44471 -112891 171793 231812 69067 -222625 -69658 -528 60277 -107736
17856 343294 16116 -124800 -202540 80483 316367 -58803 32411 -48771 141809 -130221 -207099
17845 -207099 -24727 112726 332978 75049 185094 25279 29539 -332508 -24257 -104836 309540
17833 -97435 79454 301128 -283248 -239654 -68928 54445 81124 -356608 141505 -268582 -134948
17822 -134948 -74182 -98629 -154028 60737 -48541 -130034 86125 -346785 -142536 -125707 92671
17810 -310260 -2025 145623 -12830 -56015 -231205 31130 -156708 -288275 -43730 -195169 -38788
17798 43331 -23142 56828 -161371 -304172 232561 259757 -18543 55249 38832 216015 261747
17787 261747 263154 -157440 -24811 47257 15874 -71287 120948 -168282 -297860 -79664 123977
17775 -177473 234009 -80018 -17705 -24922 23488 148892 105643 113834 -173295 186487 17623
17763 -159208 180023 205207 -24987 112819 113141 208503 -30390 -16139 -129654 237291 -30488
17751 -238291 74048 -43189 129237 62983 246636 276601 70279 239037 22996 -154197 -283912
17740 -283912 -10445 43098 -61753 70412 124844 137478 -32434 -79802 106359 8850 63079
17729 63079 -55168 63545 -16439 -148718 535584 45466 -11573 -260186 -53873 114340 110532
17718 110532 -86447 -193914 -103337 299996 290608 150343 132146 85716 176344 165283 55889
17706 -149123 89296 33095 105506 -41306 2040 113295 249088 165757 -27141 246039 17869
17694 -210814 -91223 86780 -177158 35504 129785 -120123 -404658 -230787 -307249 112746
17683 22279 57909 43023 -74667 -182815 18976 1150 4833 322015 185077 -56061 -260514
17672 -260514 -105818 -159497 135919 -25268 -163474 -20341 28149 -77958 265056 -308378
17661 -15813 554619 -126366 40891 -208260 -192988 105846 -51132 -11119 99329 157062 317329
17650 317329 -199485 162146 44114 -104154 -120288 69644 16778 -209239 131612 164607
17640 164607 297102 -63003 252965 153901 -154655 68996 -125428 51121 59691 57011 146302
17629 146302 66282 -35548 5853 -141703 -38074 -203212 58914 239741 -100565 -78828 36544
17617 54964 -6820 216321 159403 -2424 -19049 29176 -250526 233066 -127054 225569 -237941
17605 120714 190589 3842 247813 -79566 -41195 315062 -192652 43935 103951 180726 162032
17594 162032 -185173 22840 -393049 67377 184662 89874 -77251 41844 -145643 251287
17583 -81999 62108 196846 375863 -176020 -144993 37883 28016 199266 -132871 168227 -21528
17571 -188126 -272521 -106213 101819 -483512 424957 -34815 44907 97930 210446 -255682
17560 -38894 -45279 389641 -201724 58751 91814 179238 -94313 440401 -334952 39891 106930
17549 106930 265257 278706 -4938 -17136 -110141 5624 94870 89892 8144 99065 -159765 119007
17536 -62816 215751 459634 153917 87010 16231 234084 -183014 180028 62003 232250
17526 232250 85570 197122 179045 353002 -167980 -137122 274960 105019 13304 -181501
17515 265158 -97629 -35638 233334 193851 86624 -69236 -9523 43149 -60921 221490 -213393
17503 -17159 137136 -66394 -165663 -176615 131095 -139623 -219338 272433 44264 224504 388471
17492 388471 -34011 -73971 -128345 183487 96647 -37507 399960 111596 230237 -17686 69831
17480 43129 110339 -126913 28714 150520 121913 20593 8188 352321 168540 231614 -100781
17468 25947 243575 166277 54444 285930 -69240 307951 200312 66792 -7630 358907 -20334
17456 213753 33309 -235051 59311 -18716 224390 321986 283785 88215 97167 456401 437921
17445 437921 606190 65891 236128 277501 -167393 214741 83503 162937 132865 124208 78445
17434 78445 43943 295804 18992 -34072 47085 124708 70366 152228 360910 119692 335811
17423 335811 240181 -18786 443669 539032 111467 434730 338782 132848 317347 368935
17413 368935 150842 339926 244938 76844 221734 46692 522822 77410 103327 370748
17403 370748 531738 41675 116472 100784 358144 92619 67767 56844 -80859 87576 70251
17392 70251 182154 312108 -7962 201321 -135497 103199 321730 57300 26393 -75270 -48397
17381 -48397 94874 313998 239816 96192 201465 199034 306625 165684 -90092 -11561 260533
17369 31543 239333 -117538 148524 377629 -267513 -91063 123834 177838 -166645 143039
17358 191108 262375 -206714 52543 -75440 197200 186634 158549 -249171 -3685 176619 -225185
17346 273267 179254 -85913 -327322 -49481 -79510 -70787 178288 18218 195050 -1008 91259
17334 209885 476537 162442 11509 -94322 -16729 -348916 -127707 50407 -32877 153942
17323 243659 446527 193293 399898 -242703 597757 133318 119914 -34531 144807 29997
17312 96306 39366 330107 6595 4941 73187 141657 16199 -10111 318622 179667 336130
17301 336130 316397 247047 -154293 45089 201187 114335 286880 81532 383269 267405
17291 267405 348292 434125 127046 -54202 240242 -42357 158182 -112128 197413 150281
17281 150281 219517 51533 -19608 224294 557362 133510 344698 294384 313944 222708 125049
17270 125049 199364 -36823 3754 125086 586817 286446 124437 -159495 253514 283786
17260 283786 109373 59817 11688 174902 -122184 33688 229677 95749 194582 184356 36276
17248 259766 171204 348593 18647 467706 85940 -168967 203448 226179 240954 318781 -9279
17236 124379 314066 -124278 -125250 179022 238174 29899 273016 177362 18112 252871 147027
17225 147027 56454 123362 219550 485882 122907 281563 252220 259614 77355 371478 226910
17214 226910 163232 -226902 353758 271573 118651 90532 -58261 181028 -9960 -42845 397573
17202 443614 213536 52958 311633 375832 253586 271722 410061 37363 306481 36224
17191 400169 -284613 446777 75776 98370 -22936 383591 148303 102946 -58152 281808
17180 158494 224677 113890 233958 506052 392039 -20276 374621 17992 441918 297664
17170 297664 217776 399316 289638 203678 356939 192266 560006 369724 181927 111174
17160 111174 378864 318618 317929 354051 423143 203450 49222 27790 103900 94175 132804 346756
17148 346756 201359 235283 137733 293814 572326 52384 158686 245099 164778 58611 169715
17137 169715 140430 296012 295868 78307 316645 258814 306065 418191 63971 309057 332698
17126 332698 270281 90489 304001 175594 155520 83570 19322 328110 482845 127004
17115 389996 449579 -33821 236834 506626 356941 532184 373446 180636 266913 115198
17104 477370 392989 513597 319044 457614 40520 382409 303292 414181 305655 -53676
17093 455897 316645 406793 256906 309958 443991 320107 284397 -47797 475338 479999 454339
17082 454339 362961 253459 364079 294601 258692 472806 288010 -37291 463272 515964
17072 515964 311283 570207 535859 488609 565416 236852 425709 506999 502284 94066 525898
17061 525898 480554 352574 305918 509140 357200 481795 279321 -6239 322139 371929
17051 371929 253754 266826 269072 294423 515038 445246 327684 551899 660008 346998
17041 346998 712695 667956 539312 374899 304103 719575 747031 560180 514695 565142
17031 565142 318409 384945 460673 357775 665205 554844 814210 495244 847368 14691
17020 517557 573160 339911 183877 444530 540702 764694 625471 572829 561635 511784
17010 511784 367787 599909 512595 757820 278755 216849 533743 521588 692306 396992
17000 396992 770048 635497 569342 545465 480280 717421 695181 605033 718120 561566
16990 561566 303723 589561 626858 881497 695917 755522 661406 749511 730444 510889
16980 510889 751753 534578 825869 769854 521446 750972 753663 731472 800935 691504
16970 691504 947686 628321 571418 649089 720923 962464 1078591 873480 608935 696969
16960 696969 430411 692653 792853 745806 939873 719751 929573 1104181 886137 904838
16950 904838 801504 644859 760678 1193869 707758 1256518 984647 848505 884169 1076775
16940 1076775 1053319 1180194 987830 961111 1005209 1162631 906647 1027898 736694 1017286
16930 1017286 1013014 706016 1519637 1218414 962694 1098261 889744 1254408 1037787 890436
16920 890436 1175581 1134117 1219531 1020580 1376343 1026656 915266 1369248 1130167 1250288
16910 1250288 1091422 1137944 1153899 1515716 1208642 1298642 1663224 1347869 1526088 1275217
16900 1275217 1564007 1424197 1427214 1204716 1455463 1583443 1597035 1463748 1466089 1680752
16890 1680752 1710511 1547078 1606923 1648106 1771132 1734910 1917135 1697820 1746447 1823726
16880 1823726 1787436 1628411 1899197 1901388 1795749 1628483 2046019 2071685 1707514 1856395
16870 1856395 2155395 2119639 2211848 2155030 1793128 2096475 2213823 2269482 2027773 2297942
16860 2297942 2291954 2231067 2372841 2653057 2583424 2248755 2539522 2340609 2490259 2524491
16850 2524491 2819968 2691327 2496765 2614349 3034676 3009415 2882399 2845574 2946960 3001663
16840 3001663 2927250 3179586 3205551 2963497 3536325 3367429 3177031 3274052 3622336 3613184
16830 3613184 3619967 3685110 3631157 4041417 3720669 4047608 3948505 4140699 4411108 4487703
16820 4487703 4203177 4286223 4303917 4440925 4457167 4814103 4972313 4997434 5113436 4769064
16810 4769064 5750759 5207495 5257108 5759092 5775238 5808989 5789857 6029745 6155333 6430407
16800 6430407 6439290 6674630 6489481 6981589 7236929 7370580 7613771 7615232 7840123 7905607
16790 7905607 8315986 8530117 8863530 8952964 9098498 9343159 9860560 9943497 10489830 10627670
16780 10627670 11126021 11021111 11527804 11810699 12095337 12390265 13125491 13497446 14007604
16771 14007604 14288140 15124111 15773558 16183172 16401889 17092851 17865280 18260421 19033113
16762 19033113 19923054 20660013 21677967 22391896 23625479 24633726 25594120 26509587 27948526
16753 27948526 29192763 30897156 31810015 33290876 35416887 36881906 39054310 41085749
16745 41085749 43128477 45534193 48052975 50630903 53710923 57169975 60182425 63885407
16737 63885407 67737406 72270713 76750557 81924835 87086291 92939062 99052727 105579620
16729 105579620 112263442 119296467 127146876 134788504 142769452 150711637 158436045 166046697
16721 166046697 172571726 179005449 184217040 188432782 191358168 192470206 192446377 191117737
16713 191117737 187936387 184135821 178750693 172822675 165478832 158338708 150897623 142784000
16705 142784000 135122542 126995128 119560336 111962617 105243427 98701541 92548418 86912364
16697 86912364 81448466 76666057 71721940 67242109 63376443 59895589 56394781 52877138
16689 52877138 50269981 47466917 44666054 42449653 40042697 38040029 35909483 34392611
16681 34392611 32612993 31375878 29806478 28200666 26686073 26159508 24505317 23632228
16673 23632228 22868203 21655683 20684339 19896245 19059151 18573481 17729774 17169259 16128480
16664 16128480 16005207 15148480 14664244 14104218 13910508 13251207 12799397 12901970 12037289
16655 12037289 11759748 11175066 10850627 10664037 10396102 10164609 9474860 9795925 9298990
16646 9298990 9201332 8554853 8353395 7934691 8181387 7614452 7783517 7662358 7069144 6670543
16636 6670543 6757665 6869766 6741750 6597732 6053025 5555791 5997762 5342646 5618788 5535958
16626 5535958 5532011 5490879 5034993 4943282 4888285 4707443 4650498 4476924 4364947 4496177
16616 4496177 4407972 4264608 4198148 4103111 4080615 3873202 3924652 3629044 3743156 3652622
16606 3652622 3482956 3487487 3140066 3386584 3090163 3236845 3242482 2928611 3306034 2956836
16596 2956836 2697754 2898130 2740088 2687578 2768461 2885682 2644275 2587342 2429004 2503767
16586 2503767 2606295 2553555 2654834 2687905 2157643 2099130 2249819 2082983 1979847 1921323
16576 1921323 2055716 2199573 1949222 2274917 1987244 2031752 2242167 1741512 1769345 1898536
16566 1898536 1876218 2038345 1476604 1496315 1666016 2097594 1695361 1825353 1678099 1966390
16556 1966390 1553498 1514316 1794121 1570256 1464848 1463491 1373675 1189326 1571345 1271720
16546 1271720 1224404 938663 1273115 1238241 1328949 1370256 1263286 1265532 1003738 944985 961160
16535 961160 1296430 1105652 1116398 1374558 1311883 1115736 933513 1206679 1038342 1058865
16525 1058865 761360 1323910 1066405 801372 1098767 913873 1029711 1157842 901454
16516 901454 856034 809604 936422 862958 1072087 769953 646118 893167 980344 849241
16506 849241 789997 784127 633404 996925 845588 1001515 884465 643113 757844 613045
16496 613045 936063 630503 751711 651406 818334 799188 628129 806917 735903 613358
16486 613358 754437 826809 543481 730710 518116 883235 652408 469202 407175 651108
16476 651108 542517 619390 563219 803192 385627 1038262 360527 516770 626998 454804
16466 454804 630207 539837 490225 812548 512809 666854 426390 686780 729504 815496
16456 815496 646842 621464 774806 632762 483625 762780 735493 335572 489786 588338
16446 588338 376553 483574 637859 255423 201088 583268 319427 542170 418307 286621
16436 286621 420749 508282 524855 581152 451651 298242 247689 341186 -164 445629 237342
16425 237342 330663 510172 313998 438383 501659 506849 473478 221427 394218 511751
16415 511751 455714 246981 181369 380645 334480 310863 441940 301390 380616 115569
16404 298697 223462 457222 288927 262345 516445 280140 561104 88079 363735 141044
16393 130055 316719 67785 241722 419311 477894 459771 246057 326757 593280 310586
16383 310586 560078 419839 128297 287118 47592 406482 93437 198202 419947 155682
16372 204999 303478 392100 233955 90456 240615 231585 318613 130668 346672 16640 447341
16361 447341 96427 -12336 355328 20040 575797 -35674 241006 -16075 314061 127888
16350 25873 271398 10658 109030 226268 348288 305556 104429 -4315 35948 8320 352019
16339 352019 426883 196999 283698 80130 205209 233008 134596 46651 -97520 332164 18701
16327 339158 200322 610220 135329 287537 388745 394167 139706 121817 74378 308148
16317 308148 -32866 -948 8702 369540 114801 203691 227083 7488 69776 44696 285853 190672
16305 190672 4710 422350 89002 -77230 -4388 38126 202079 269129 360986 309304 218346
16294 218346 -123460 243041 36569 -26147 84167 155992 628201 365412 356756 221512 64977
16282 -77420 253130 -64059 122959 97550 52153 -205789 187202 504526 157827 60289
16271 55274 -59263 152406 244297 -6376 -89481 255014 311796 165665 -143052 -79672 360573
16259 -135066 135551 -765 23585 223751 93801 162231 112283 109450 -136189 34754 210113
16248 210113 -301955 246197 274828 -13742 -116632 424022 157790 33227 186238 -230258
16237 -173341 -54174 179196 258103 178305 250944 130611 -160073 329632 191621 314604
16227 314604 -42341 85700 243852 171076 142970 81561 245734 131585 427372 60223 328987
16216 328987 28840 225500 311293 301532 37088 120849 -129505 160387 31472 357208 220601
16205 220601 -236828 121537 -72409 72164 360599 -30725 165020 -34745 147971 -247695
16194 20394 311054 -215292 118458 64732 -87243 -20969 -83268 110482 144452 -116011 60889
16182 133165 161177 208913 -61015 -192062 312893 43102 -60422 -171671 -99006 -22932 92208
16170 210042 33726 214489 299738 203778 -158639 -104596 183695 -110645 181684 215804
16160 215804 -90257 -100792 238367 116045 185036 342004 -142401 76644 15935 77489 118925
16149 118925 307491 -208692 -201921 78651 302183 307517 279542 -92642 120399 -150778 89028
16137 119316 30284 104559 167018 -177954 148536 120371 84109 -163153 23229 -4351 394861
16125 -80509 194841 135874 24577 -193735 -460492 197174 55559 91044 -121548 295396
16114 118285 401817 118319 -1412 -152630 111773 -164205 55823 259145 2633 -66461 177053
16102 -239460 123368 233874 -60592 -33318 2786 -144290 -90311 135700 67673 131407 476357
16091 476357 10207 -176969 45305 255271 -15464 44787 48189 -177767 -288980 23250 -77066
16079 -281752 -296911 127997 -128607 211305 67175 -60240 10761 -382397 -16439 -376594
16069 -376594 -62424 61613 -104491 -89916 38285 -44026 16601 -4741 214524 73210 -109268
16057 -213662 -53459 -252392 31804 -121481 -68154 -111996 -70222 -307246 -149400 97568 4522
16045 -162502 152386 70500 331296 -294326 175004 -36612 -168827 309832 -54411 -155419
16035 -155419 -227385 -110366 160967 -38363 -101911 208901 -121282 -57557 -417957 442997
16024 -217427 77708 -127200 -36211 145865 185233 140718 167707 184572 -350224 -51253 289445
16012 -229249 173993 -71534 -84539 -230361 121999 -170698 39087 18312 -83988 -29706 -357712
16001 -357712 -51652 15428 -149930 -181466 64070 130539 -8554 -67691 91007 -427852 17731
15989 108790 158012 -15374 162982 16428 -9896 49521 62523 394938 98388 398028 70397
15977 -46297 17224 47913 252064 -252774 -163338 -178882 219208 -170899 -72446 -109952 65043
15965 -33085 -65148 -242953 -115986 178429 198700 308918 -147049 135317 60900 -14712
15954 207236 -183154 -131631 64150 -132769 -236500 -48555 -35201 -63444 -111594 -153211 -159424
15943 -159424 113349 42247 200566 -31444 -248712 -268503 -14797 -89689 -208291 -257594 14800
15931 -321432 -85465 -176512 81223 -74279 8268 -112477 -89319 -121808 -47276 -166381 -154395
15920 -154395 47836 27025 -410 -128358 299092 -167389 -363293 -536753 -425338 20262 -142649
15908 -22752 108008 80108 2907 84203 65961 227711 76589 -88784 -32723 -117820 -152122
15897 -152122 111306 -154589 140718 -398860 117681 93051 -162457 -193561 -111739 200665
15886 -164566 -98504 121842 342871 4555 -143670 -99305 -155923 -15187 21409 -93663 -182561
15875 -182561 291422 -239360 279571 168230 117391 58639 -223857 -157113 -70341 188991
15864 4132 416512 -22327 -156333 55008 -203838 -27539 -418818 -127065 347285 66583 176235
15853 176235 184209 24036 147324 -19599 247593 83366 -91992 -166253 18403 77452 -6995
15841 26872 60573 72450 -109474 91138 -19737 -120253 257858 -32069 -60816 -76944 121907
15829 -174433 23112 333707 -329082 208240 23522 -37535 -387397 -32052 -101251 -395234
15819 -395234 295077 -305197 -6087 -123395 47192 40329 -326226 -141450 -34155 -355509 -547133
15808 -547133 -132095 103506 301924 -57342 -224696 270961 -52120 157423 -14460 -103194
15798 -103194 -168154 -272711 -25491 47276 -276 -189834 115653 -572763 78331 -41139 167800
15786 44316 -46374 -176571 -15301 -68713 -110851 -117400 -155120 -141198 -367337 -211443 -45684
15774 -97664 211550 -344808 82460 -22891 -113485 33861 -79622 103812 -131690 63504 -36852
15762 -85324 -83955 57928 455438 197051 -68656 199323 -165404 -80116 -268602 168994 96166
15751 96166 -362541 -166870 -123218 169858 80800 -101094 -59495 -26160 348341 71680 -71452
15739 5132 158061 39169 -105164 -166229 -103591 29078 44625 114360 -74929 -202839 28666
15727 -48331 20268 -153726 9417 72267 -78491 -129548 155663 82454 -153805 -153403 -216380 -358374
15715 -358374 48807 -100660 47392 -78217 -283143 -327093 45815 9473 123072 -48303 25161
15703 37856 -157851 99623 -309440 251333 19510 -181906 -65980 -101126 55405 28126 -231980
15691 111482 108481 -75253 192396 3964 -146009 114142 175543 -228286 210259 -208066 -42247
15679 -77781 79974 -271230 52342 70834 50320 259116 -145631 -57353 -44611 132596 -9622
15667 22844 -114740 188347 -35720 155586 38614 42719 -102256 -379177 -238296 32577 120653
15656 120653 -146610 -202976 -226774 -207805 -161057 -517173 29318 212601 61279 -205191 -171527
15645 -171527 101500 -261039 -95938 -151524 -99322 87454 -15411 212953 2802 -252386 -281629
15634 -281629 -187002 260850 85665 -121414 226486 24570 109058 -65339 122635 -345410
15623 81774 67028 296004 -208957 7710 -76205 -275771 9782 -35860 -289249 -59186 9856
15611 54677 -397975 110136 83957 92911 -282294 -48668 62269 18286 -45810 -194107 -156049
15600 -156049 -93964 -399490 151505 126523 -323661 4399 -154779 329084 75534 -298984
15589 2024 -135770 -287412 107537 -71034 -299190 -91038 105810 25609 -64483 120241 14005
15577 -171792 347329 87574 -314103 -93699 174514 -46450 257520 54178 173460 -141474
15566 17709 53727 -259691 13030 300413 -30656 -55070 469798 -37711 -53508 108839 74210
15555 74210 73542 117340 -21480 90363 -127569 367345 -353179 204438 -96845 -150948 -37173
15543 212032 -57233 -193254 120039 49118 -175962 -86734 108328 -213354 83994 248965
15533 248965 -77348 89936 208292 -63083 -107538 163158 -286191 113730 -71943 -233392
15523 -233392 -5881 -70511 -161677 77981 -61933 -356002 99576 -40986 104114 44184 148955
15512 148955 220448 -72530 68970 265249 178318 -87990 -147657 -15305 14918 -85588 156103
15500 -149124 349448 209118 -103548 43573 -128697 104531 -109787 -273941 -449389 113059
15489 -156955 61184 -8009 268912 -75911 -266845 -215482 -31522 -264903 -35902 56332 883
15477 -587432 202836 112289 -12961 65231 322591 -120224 24818 -26218 -151167 217210
15466 -308065 56896 -272887 182934 -43169 144095 -258717 -109075 -82288 75754 5763 -617784
15454 320552 61603 140990 -3509 79962 -274976 9672 -41055 -116082 -131272 346924 122238
15442 -71253 -59546 -115026 -227194 73648 -111684 99124 2751 190466 -212623 30332 -297311
15430 51041 -183718 15705 -152879 39655 49612 83602 141962 8722 44734 -346968 61501
15418 63922 206804 22871 -189950 -185652 -25957 32216 3283 17672 -2215 -166763 -162732 113913
15405 542685 72017 -23851 -277926 197896 -132786 -216198 204174 -90305 103732 36308
15394 125857 123682 147539 -27863 -192871 126458 -134361 279033 260365 56652 166945 -24042
15382 -56037 -62996 -73151 -76560 59651 186052 21 -240942 -8184 268572 -151025 8492 -6480
15369 105653 76272 -279936 -32396 -456877 153291 -241014 36659 -100624 95217 -185066
15358 41173 -8279 32414 141458 29020 92634 -232927 84636 202606 -141985 -156030 326006
15346 74441 106843 140629 -6869 102701 -66204 136313 128575 -141816 78550 -380632 42795
15334 139417 63099 -421685 -246166 -73287 120026 20580 -58209 140612 85987 -216107
15323 63910 176690 216130 -13288 364624 135487 -130236 214420 311032 42361 -131916
15312 -81209 -137691 64083 -109864 -15402 -344399 53664 264187 -15798 69321 -17772 19057
15300 -324619 157834 -6156 92107 84880 -138833 -168833 -214560 -290373 91328 -64775 -92103
15289 -92103 -61979 119319 -271897 26012 -258000 -323858 104278 246123 -137598 -25258
15278 -161111 108762 126489 184489 242047 -73561 153384 -159592 -188898 146545 -166863
15267 421896 233499 67679 -61754 76976 128130 107984 175541 85606 158584 -75802 296554
15255 -238352 -16841 70415 183695 213731 407524 1284062 1134102 1055929 927186 872740
15245 872740 64803 9464 23304 -4983 -112369 -251342 -45672 -18419 164111 -243321 -284657
15234 -284657 130290 209806 -1529 -209800 -9631 108846 27437 -159355 164974 -189719 7556
15222 97630 -26665 253837 418111 221410 94258 -179789 113413 -58293 153790 179745
15212 179745 305990 109645 278229 198516 -26333 230572 -54550 41882 -170651 63306
15201 -138088 213428 171147 243921 145326 223783 114974 169930 -110503 -39260 -119211 304455
15189 -207808 -159800 320396 -361 -10878 -128260 62630 -244355 221289 39014 -180052 35455
15177 169808 -176315 -54243 60955 51153 -171715 148531 82052 94273 -226486 -134426 76633
15165 160582 263475 116929 586876 137031 -28405 -281912 406195 237977 -58454 273014
15154 127681 -155647 -179991 -218113 335321 50385 -153886 93325 87490 42696 132293 -137559
15142 63528 -28727 29015 -226964 -114228 42741 260450 50095 -141729 -236862 381302 -76664
15130 90181 -36809 404412 -364379 267882 -218067 -58686 273029 193034 -38068 247533
15119 138137 -30560 90835 87483 -171660 91849 163097 165169 283629 336961 62708 207456
15108 207456 276743 110086 135171 -6712 137385 300071 -112761 -28533 390884 78363 169820
15097 169820 89241 148819 131444 160800 249791 309698 42740 110236 73409 82829 225877
15086 225877 -35198 -42748 228648 381934 -48425 118266 321423 439271 -44861 110332
15075 194951 140685 -60511 -39467 -6828 199884 -233273 100209 -57090 223158 221985 190269
15064 190269 -127942 71704 115328 -89880 216354 556400 -23768 268441 -106424 232041
15053 196156 209665 -48936 210945 123733 281010 242508 277291 186051 323948 -131544 353592
15041 109329 -200405 182464 -81577 -65335 252760 194701 381454 201605 238914 116181
15030 287987 157556 63548 99145 366697 138975 405640 279072 -108571 -32386 99508
15019 168492 375557 173205 445212 265326 -207577 155702 70821 93845 438429 210854
15008 105261 24800 462323 197882 140268 412230 178448 294061 35976 -144055 268318
14997 215040 17864 290295 267156 195640 467454 298548 187201 57040 438596 170011
14986 -192103 112437 -15532 285980 -86785 97725 145749 407572 15964 231657 179061 248742
14975 248742 610328 422856 472262 220618 205470 313271 -61629 188622 111767 272102
14965 272102 333953 258138 209841 77703 195430 394236 417557 -5870 330012 277536 364393
14954 364393 -135999 124058 409734 47853 556515 245555 144386 204386 246323 83565
14943 398766 586863 451090 325082 -135188 304012 458704 351512 297617 59534 83486
14933 83486 244031 391948 180531 17388 259289 -10808 327599 -103495 354252 322323
14923 322323 -64707 169659 209904 318721 271571 535873 -255781 323967 -137202 145563
14912 -59075 76966 60397 448909 161544 305853 273287 226966 464072 231772 326823 202825
14901 202825 202567 76940 33484 293988 16688 179966 404514 326215 151837 202707 343590
14890 343590 437217 409569 775985 169813 288536 205778 444595 361853 399599 463587 278735
14879 278735 561666 334924 564703 192554 370097 563098 -2985 282561 88579 494763
14869 494763 655841 498451 340884 152818 665764 81028 497733 60797 301111 685753
14859 685753 251726 308256 330471 575106 454277 387018 415378 -119941 277632 595943
14849 595943 605905 455833 538908 545682 420651 577500 594792 393909 280831 295480 58073
14837 357530 208787 313981 390624 668600 394026 376861 335501 12508 396914 48035
14826 523463 159889 469490 337767 125846 346228 574966 328403 710251 411264 83144
14815 493157 289238 185700 515135 188631 549287 703894 485531 787562 485263 28205
14804 250879 268938 838937 708670 450928 495747 308581 463954 481345 511450 437791
14794 437791 541776 443109 367830 584352 437667 504049 887648 404275 256136 712669
14784 712669 273045 461078 699074 565691 747511 704172 546436 540586 494506 582493
14774 582493 681429 494067 533129 618613 715250 434831 779522 597151 533766 638582
14764 638582 639880 702230 668183 564484 755037 380672 927499 799299 593445 228409
14753 563100 425884 523158 614038 743565 777386 505049 576106 357642 825929 853245
14743 853245 671021 668143 884440 681195 726062 442055 662259 1048843 400262 652125
14733 652125 541398 718644 778114 702960 748160 276239 876733 673626 948793 733426
14723 733426 627264 564667 627817 784589 649758 948888 607857 311523 1000229 776289
14713 776289 1060530 984891 1085723 867056 600790 800000 955278 769698 961964 813566
14703 813566 916275 907569 1078269 1071342 751769 1124780 966318 1005708 731315 620553
14693 620553 950551 713227 739104 772672 951515 937534 782572 970066 1104624 846717
14683 846717 885288 753817 658415 986290 1017517 959822 568683 915952 761197 915364
14673 915364 831460 902812 971153 854197 936399 1123420 1110646 749911 1142686 1081360 1127100
14662 1127100 1113353 1163208 1383293 878984 898507 1036042 855146 957308 991758 1157709
14652 1157709 1086675 1076959 1234126 1238787 1042582 1291972 676279 1141326 1209158 1369452
14642 1369452 955945 1182524 1206965 1163066 1164233 962170 1173662 1154022 1307772 959501
14632 959501 1207742 941011 1213244 1035107 1176895 1143162 1296216 1565648 1310873 1318139
14622 1318139 1390114 1457941 1271458 1255536 1432681 1500353 1334069 1284497 1530561 1487388
14612 1487388 1097723 1641673 1114800 1255413 1655008 1503057 1346306 1382576 1083950 1532033
14602 1532033 1416513 1343905 1380645 1350414 1554084 1628897 1570552 1493540 1596333 1585369 1424556
14591 1424556 1932220 1656931 1537066 1793909 1779464 1632135 1698171 1984140 1895337 1739538
14581 1739538 1826767 2079176 2006105 1743737 1881041 1668935 1879173 1907257 2010783 1844603
14571 1844603 1697973 1742473 1865531 2034359 2312706 2612179 1984371 1902203 2283104 2595460
14561 2595460 1918704 2457500 2461517 2567721 2956340 2758805 2997476 3252394 3362561 3930884
14551 3930884 4489492 5276577 7034534 10956001 19508358 32656197 34499220 22303794
14543 22303794 11470074 6260703 3888495 2903451 2495249 2019699 2013037 1983516 1959501
14534 1959501 1857309 1532994 1873420 1894694 1967276 2158294 2079732 2030954 2186775 2292749
14524 2292749 2161431 2155804 2280809 2200943 2245163 2222917 2440574 2533277 2480619 2541089 2453697
14513 2453697 2670801 2833389 2247383 2840654 2687494 2937340 2766989 2575405 2836701
14504 2836701 2732538 2695489 2946361 2886636 3183765 2734005 3167152 2866757 3199583 3384097
14494 3384097 3025980 3247256 3291715 3027251 3407028 3036108 3640048 3386903 3865314 3418825
14484 3418825 3258649 3489902 3716578 3728669 3597251 3430039 3872635 3922051 3819187 3767514
14474 3767514 3920184 3567531 3978369 3984487 3556315 4026986 4274886 3831222 4249682 4179574
14464 4179574 4634543 4478286 4509650 4437307 4408645 4747084 4273803 4615612 4646250 4863376
14454 4863376 5037666 4833946 4891890 4936894 5324161 4978300 5006565 5451450 5103507 5661320
14444 5661320 5277809 5595725 5373905 5589902 5540780 5366870 5479957 6111211 6067923 6014798
14434 6014798 6306521 5827388 6208896 6523039 6221653 6535686 6623363 6637026 6851599 6989249
14424 6989249 6723280 7111143 7232267 7339536 7312433 7281656 7906057 7612491 7590678 7559062
14414 7559062 8425519 7750391 8261632 8293063 8482294 8590838 8575248 8549200 8952057 8824569
14404 8824569 9185475 9526529 9456307 9518102 9724436 9904249 9798771 9931106 10239903 10436474
14394 10436474 10706551 10734071 10763909 11000822 11465254 11869908 12244622 12121159 12296594 12538560
14384 12538560 12477719 12651908 13102349 13290238 13644428 13898034 13961659 14255384 15018674 14825308
14374 14825308 14839903 15407332 16005566 16130399 15857791 16634805 17505650 17300321 17647560
14365 17647560 17871392 18363250 18824093 19111548 19923180 20046999 20491782 20813446 21609129
14356 21609129 22146736 22472811 22874182 23544151 24257247 24748116 25015183 25992901 26296256
14347 26296256 26999969 27745156 28558521 29341054 30034300 30882399 31504783 32351677 33145074
14338 33145074 34228840 35342938 36207646 37549096 38368930 39456435 40952239 41790047
14330 41790047 43433281 44682046 45819790 47515091 49023293 50341664 52294801 53896966
14322 53896966 55732897 57990082 59969320 62336581 64111173 66659537 69307759 71744503
14314 71744503 74479675 77644973 80706355 83950552 86723105 90840613 94750552 98958635
14306 98958635 103100063 107912014 112619457 117491634 123080657 128752540 135069940 141137791
14298 141137791 148346464 155902759 163353744 171603309 180296161 189595675 199510105 209961119
14290 209961119 220686352 232194313 243992134 256663363 269956373 283388584 297343732
14283 297343732 311473500 325753758 340354043 354712829 368450277 381777512 394258008
14276 394258008 405889239 416112707 424996989 431004495 433481455 432883741 431870820 430154950
14268 430154950 426848982 424167940 419965429 413632809 404491057 393623903 381333802 367710732
14260 367710732 353549063 339248316 324442414 310250022 296309460 282158087 268530804
14253 268530804 255689542 243058114 231176247 219724182 208796917 198509965 188438819
14246 188438819 179524516 171086367 163048476 155300498 147801845 140920628 134594211 128508358
14238 128508358 122632851 117404149 112242578 107478014 102904690 98763316 94757648 90999905
14230 90999905 87410649 83780581 80541883 77370636 74483706 72018957 68976806 66632815
14222 66632815 64351487 62266984 60137603 57774478 56142568 54204066 52526562 50703975
14214 50703975 49170671 47654661 46267608 44781375 43532504 42201786 41030857 40155928
14206 40155928 38840410 37831050 36547313 35585429 34703285 33745777 33076561 32150867 31076162
14197 31076162 30378426 29448364 28790449 28334021 27848208 26687446 26107893 25373434 24691056
14188 24691056 24166298 23805165 23054523 22855054 22005896 21751125 21482954 20593351 20237757
14179 20237757 19808439 19519583 19299874 18888325 18462439 17805437 17571847 17239736 16801409
14170 16801409 16665413 16175039 15970704 15462228 15331996 15281069 14808556 14462826 14077358
14161 14077358 14230496 13654588 13489774 13257457 12961651 12731573 12555591 12779645 12351178
14152 12351178 12021752 11866735 11288818 11173893 10945323 11022621 11140179 10659540 10431660
14143 10431660 10193956 10217894 9908961 9530276 9524133 9472378 9475689 9537661 9044545 9253227
14133 9253227 8805886 8797755 8909343 8653601 8210164 8289292 8151701 7881225 7867355 7870270
14123 7870270 7957126 7663226 7541202 7291652 7117595 7153503 7028398 6877769 6910409 6853058
14113 6853058 6552614 6699112 6617723 6399817 6808928 6602126 5919906 6186583 5905727 5986078
14103 5986078 5860197 5761070 5820548 5626399 5646758 5522900 5572836 5481262 5218319 5409311
14093 5409311 4986216 5241135 5258629 4846011 5193379 5148798 4464123 4838907 4646207 4850021
14083 4850021 4365915 4673894 4653480 4776788 4373886 4407281 4196661 4102354 4088090 4184316
14073 4184316 4082938 4000908 4132366 4161127 4225727 4018111 3864107 3905332 3638752 4050141
14063 4050141 3920119 3868483 3744909 3762955 3732775 4039940 3644626 3879643 3420853 3545620
14053 3545620 3694690 3545094 3728400 3280760 3329210 3296274 3173694 3360756 3355861 3055864
14043 3055864 3287752 2847416 3128233 3019319 3105479 2862530 2990908 2898921 2785500 2826693
14033 2826693 2859140 2982098 2814254 2636873 2573460 2791298 2538249 2586603 2599773 2624577
14023 2624577 2415027 2446505 2360110 2606068 2569651 2687853 2223485 2584479 2287543 2189759
14013 2189759 2429375 1961574 2577729 2225139 2348274 2230609 2127599 2289753 2215616 2045603
14003 2045603 1826769 2035667 1951494 1779182 1972698 1727974 1643209 1758725 1779557 2002878
13993 2002878 2075120 2281519 2425003 2606383 3925743 6286827 13034847 26570804 34346497
13984 34346497 25975518 15796702 9778905 6864138 4943087 4386011 3561543 3370988
13976 3370988 3018119 3062508 2845538 2495623 2475494 2494311 2229464 2406844 2046064 2420246
13966 2420246 2413514 2119372 2265220 2320960 1992800 1752620 2150843 2053168 2147709 1938156
13956 1938156 2013574 2070424 2192354 1862127 1919894 1640999 1663185 1912856 1766850 1951713
13946 1951713 1593074 1833782 1583275 1412965 1858909 2025269 1485210 1836526 1544018
13937 1544018 1760275 1568452 1627725 1472993 1480411 1576020 1766719 1496101 1476699 1606390
13927 1606390 1516752 1501393 1370358 1534414 1344617 1672171 1446468 1243112 1582500 1245467
13917 1245467 1135265 1285599 1334521 1258578 1344001 1299771 1221053 1361126 1572666 1151774
13907 1151774 1340935 1418173 1502007 1316733 1484138 1138429 1614640 942347 1195795 1537582
13897 1537582 1060832 1163547 1167921 1152785 1213967 958678 1072268 1157219 1235775 1200811 1431153
13886 1431153 1120570 1154103 1202759 1036541 1346823 1015760 1004864 1042565 869895 1085670
13876 1085670 1064477 1107739 744753 723607 1119912 1018278 1038869 1210184 909797 1089863
13866 1089863 668239 1197115 964296 1236009 1003181 954191 796509 1015788 1265584 1031578
13856 1031578 1388649 944541 1048856 1065752 756417 1197080 1086755 1095417 843168 765325
13846 765325 1102428 849379 1145873 1087750 818610 924160 817744 837096 1013857 797590
13836 797590 843450 1066043 1291607 1005199 978309 892563 534170 714845 1046561 732175
13826 732175 804023 801754 925291 1013365 985381 805401 406096 961788 719626 865668
13816 865668 523746 865463 551675 579756 888122 704006 597307 773833 1019243 704663
13806 704663 898380 461134 814536 585300 878571 713712 913161 727036 774051 775324
13796 775324 485764 1015443 830135 718599 889990 543003 744807 634843 688289 593498
13786 593498 617496 423146 899507 572710 731341 792015 431180 618315 993209 779525
13776 779525 625256 390360 364784 972743 438969 685731 646707 749207 444945 670134
13766 670134 801143 498415 611920 924672 587408 683132 828985 429364 497248 658928
13756 658928 597274 726374 590194 639143 722098 597522 791886 431291 254226 294770
13746 294770 768453 771531 624471 670134 314371 457755 482913 625487 216801 729073
13736 729073 466024 586493 303532 625317 580020 565399 743640 677075 792774 698401
13726 698401 685751 682758 583916 542995 814379 373211 538307 668126 768748 235770
13715 710313 599501 462463 541041 752879 555740 414316 583409 477661 582459 336207
13705 336207 506391 700561 378220 620511 881981 480854 495976 340612 567104 432419
13695 432419 541979 461266 740281 249394 608090 472629 209653 401653 288060 778483
13685 778483 631387 631910 354503 449003 314283 283676 415798 677055 460708 374728 455096
13674 455096 241651 253523 724445 426517 592869 519009 445111 376103 104664 222821
13664 222821 370432 374832 57180 375011 564923 193554 469741 312207 337979 661365
13654 661365 324640 539072 418254 405394 697103 410621 68918 378468 751823 270284
13643 419499 296140 386450 530905 322897 576005 312274 231395 295103 454656 267331
13633 267331 269360 365369 409680 588100 594373 475475 229650 366467 268874 288984 -184192
13621 506965 564924 382384 167267 449403 469553 305098 627066 268048 297905 492022
13611 492022 427141 324191 294956 39653 560191 514368 117643 21704 279779 599592
13601 599592 402002 416843 353300 57400 291642 366908 521692 353625 383661 428048 559893
13590 559893 297968 199608 295411 574190 584771 91744 140732 116259 160249 429464 679688
13579 679688 139159 550352 233733 -106705 479547 130537 76731 170346 -3588 433784
13568 637477 270197 101484 624063 30926 361718 165547 422746 410593 421416 188237
13557 239228 268649 279364 338894 481632 282720 590357 366945 309939 363979 185909
13547 185909 286693 105823 74358 -18864 468847 365867 331950 206303 293483 60295
13536 448084 354393 142105 515835 431738 232480 159152 -14436 310348 335718 211907
13526 211907 484622 307639 457371 482673 294987 201142 637923 178831 -116746 492686
13515 465665 200742 -76507 416640 122600 271458 366948 106703 527618 121981 462484
13505 462484 401999 180357 127141 741795 273579 556313 359059 144946 177601 154216
13495 154216 377292 319302 167376 5994 86517 406189 228867 259002 71303 461601 131599
13483 329737 606042 338580 331354 96366 369048 -57583 364546 221272 517837 206648
13472 74183 -68316 244985 219722 6241 169091 119357 113167 371744 348948 452393 -25923
13460 461821 -78941 4454 76712 127518 102233 256145 362529 177878 -139937 495552 471942
13449 471942 238695 72341 225109 334938 126151 71020 -32163 -9098 82570 -150744 313123
13437 247490 425415 -363056 101648 447352 -67710 334443 450183 188270 14568 197980
13427 197980 180116 123565 11102 80878 -149329 285884 339710 302999 -87071 378852 252017
13416 252017 140329 -65422 425668 -16643 127421 86205 117494 97246 230600 124589
13406 124589 -60045 239179 226008 5508 -198362 35212 113051 255936 -26479 180262 -245092
13394 -110849 162042 549531 152953 87332 99796 176437 -192263 -51734 146282 203738
13384 203738 250102 249415 314227 114994 292138 289356 -65886 225904 382566 329981 168426
13373 168426 173618 299963 471785 181755 286238 -11879 629900 243176 -66344 231224
13362 28720 186804 -143764 93238 385877 381092 306401 44005 245792 -120881 150901 134820
13351 134820 358919 95204 303976 269310 222208 194122 235812 12816 360748 467216 400290
13340 400290 291107 209293 42582 451428 348956 275310 130933 168993 303059 508544
13330 508544 273079 388084 -64542 529876 240942 -88561 58032 321385 113631 284059
13320 284059 22201 136662 106701 44241 419036 619403 236866 307168 257143 104566
13309 36341 271318 235771 172730 149710 -59283 193161 196797 -124789 40329 220111 248648
13298 248648 -26277 -86923 247149 180014 108945 17882 -26694 14057 173949 -141005 -94079
13287 -94079 359883 349741 -56874 108112 75842 115183 3423 289150 219184 55422 -110278
13275 -299229 32369 358503 95188 -37626 -93287 245110 -79573 49922 69179 225731 -110256
13263 38478 -300550 217496 -17820 20890 212776 -191944 187409 111377 -68024 42178 310432
13252 310432 69095 -211683 69496 204199 256207 201155 492016 304150 -112 140509 287495
13241 287495 206325 54198 -147770 233922 442304 -96431 356338 306937 185775 -41499
13230 153407 -253175 -23419 -140242 146558 -317627 -203110 215270 211079 204895 60007 36848
13219 36848 48857 -259668 -13195 347534 51994 -98826 83341 -26411 -217978 6688 -65929
13207 73946 -167945 -19808 135683 106729 161670 92493 -157917 -8548 187770 150056 63742
13195 145442 388842 215491 27466 258850 172323 224966 -37642 -41510 228840 -119690 -19580
13183 -274522 72082 248117 86021 168524 45883 89335 390351 -61673 115545 -5436 62343
13171 -46557 60123 258655 154441 283233 -208499 -114782 161100 -237496 -5598 -221841
13161 -221841 -3334 -60809 44398 670326 474411 153649 -356194 83637 241935 -81025 162509
13149 -251838 318596 -106507 551012 -236326 -22687 13166 189795 223151 303090 -9366 35919
13137 33929 27161 30290 -78673 127243 -287975 -129782 216810 36412 95638 23063 -93559
13125 70254 338472 -225662 -92734 -20092 248770 310999 -76 76914 73876 334341 16320 325012
13113 325012 -64089 172419 194308 -38305 -72149 -49053 78651 116675 241030 -149968 -11405
13101 216088 77718 407332 259374 42195 -74544 97239 224056 213499 61762 26351 4047
13089 -61732 -97013 167507 -82386 90190 -115684 -78922 -66312 147740 353375 -170084 166813
13077 134949 282278 185883 88207 184854 -184473 253950 -118660 86640 -20550 56091 276988
13066 276988 353816 15233 229280 52330 -226515 -33956 -7340 186509 57171 -48735 128261
13054 -171775 -847 102246 -5103 149104 349836 640278 198399 205206 -145731 -535445 -32423
13042 26158 432652 131232 8042 119720 90152 174436 16341 197109 48018 263716 -288514
13030 451703 98359 -107033 192811 -87618 138941 -27462 270234 199474 81837 209537
13020 209537 94257 22140 -36410 204977 96086 292449 154758 364401 106302 55202
13010 55202 89155 -193678 83586 -160763 166451 49090 -55039 -195128 161726 212789 246758
12999 246758 -66279 137474 213938 -1296 -170783 -134400 37316 125416 243190 -70701 75006
12987 83271 528745 291681 -39552 275383 260613 117833 135322 -1080 -95729 74964 58120
12976 58120 -51920 82591 -58134 -210549 -25449 278 -63909 203120 262684 67986 41509 -234680
12963 166728 94004 -158726 241269 7656 130903 -121442 -178560 367111 -135429 -93955
12953 -93955 8994 -10686 -123210 -229445 216695 -17554 341815 53290 235636 250943 210290
12942 210290 218288 53775 93365 408485 -92892 32966 -58752 281731 -55011 178413 216335
12931 216335 62383 1794 -195925 106827 -315048 156353 112941 55010 198106 374317
12921 374317 -60073 -264329 -88152 -297030 117297 117145 -142499 -73514 55128 32885 -232218
12909 12830 -217293 388309 185901 47512 15911 -41005 9136 219420 89890 -164242 378916
12897 265491 68980 -51704 135155 176551 -111349 106694 19019 85283 42506 -64776 77404
12885 101350 164155 176623 174825 865 -155368 152890 25463 -214602 20020 69001 -63227
12873 31980 69466 120588 63334 191480 67515 -7492 81374 -111519 83028 -231975 34671
12861 -86662 -233066 -134735 -110349 84250 -35576 -136720 98031 116713 6306 -146645 -29804
12849 242358 156344 345060 -97208 -92839 10658 -61110 204870 58426 70815 22197 5582
12837 86400 -219556 -41406 175566 -125288 -168795 -60375 231840 107399 201612 -147239
12826 126755 340565 146291 18624 295454 187460 283005 -162020 -42520 -55991 128434
12815 -24952 164016 -86367 271562 114433 -308019 -2355 62671 52330 82207 -147132 364073
12803 -41451 21019 -146255 344399 -361070 -71452 -131607 -84530 60058 -122648 -171481 -33690
12791 709078 70827 -24105 297572 246850 92607 180834 -70955 118255 161173 -11354 455879
12779 -130301 -109976 76304 -20026 -36535 10268 118297 -239917 33178 -92209 8582 -127036
12767 -156661 -36028 137467 -82665 245784 -185365 -90410 -264946 231747 46455 -183129
12756 -85603 -55509 373193 -47779 145631 126121 -18651 -127270 -284210 -69081 -39253 431027
12744 -17341 67817 159191 -109558 14960 286048 -430 -216499 -10077 -297640 596164 -46241
12732 156336 34498 -14511 -225074 -186535 47734 70036 103665 -6242 -216074 78236 69165
12721 69165 177173 -184727 -50033 162580 -234227 -239561 -98660 234010 29096 -58639 141632
12709 263802 164046 267587 -94681 93456 164068 12948 396668 -108841 341959 -127489
12698 232368 -191122 242660 6500 29319 88920 -246290 62736 119628 123902 -97952 86297
12686 -24079 -7133 79464 -38756 116647 48722 86990 4996 41753 62255 36326 195412 94170
12673 -9126 -114488 -161744 71056 359417 170540 34947 135168 -52700 27801 51707 34731
12662 34731 -98075 50947 -41226 206923 236748 185189 97958 122231 150330 17296 -165385
12650 232580 43363 142670 268084 -145737 29391 18885 421378 -39965 83224 96036 213287
12639 213287 17315 -135007 223339 241135 40231 113688 588204 155393 -169130 189558
12628 40852 189940 326620 -459085 249753 -96990 98092 -122493 127581 -58277 502825
12617 29357 93970 -44182 -118799 64470 199100 -82784 238026 -140165 11827 407795 173188
12605 220047 144656 14746 -96923 11788 182232 237973 164941 -207168 106586 -69675 171418
12593 -116101 377560 146010 -149726 -211536 -21663 -83457 -18109 51962 453901 68600 -156238
12581 123019 127126 -5631 163227 108253 222315 -57358 -221241 78955 -73528 16801 -89964
12569 169121 88060 139999 139545 -26751 888 -73223 281440 20861 57133 42020 59590 -78693
12556 -33369 159131 -1896 243985 -51498 56550 124298 -261188 -240710 -226516 -142735 -275284
12545 -275284 189690 -516998 196989 -4895 135774 -228043 230216 119391 253604 126951
12535 126951 88624 38697 -120918 172754 225913 121282 -366153 308850 299887 62195 208759
12524 208759 -165628 -74282 -286265 217026 -6654 50861 -107525 186743 153781 155390 16092
12512 212892 14102 62305 -77736 -217171 155143 -90631 123802 -374626 -23452 -120277 210963
12500 -168011 127707 -115684 85014 88968 -83207 154184 325335 34866 -274061 32899 -53991
12488 24702 79067 -217471 -68976 -182600 -51601 -171410 -24692 -53923 151867 329570 -180675
12476 110228 57083 154848 -3303 34240 438699 143453 -44543 -36628 158455 78623 -323873
12464 -116405 401610 134859 60821 -279416 347794 -2687 77866 78062 -243743 178816 -23628
12452 -26532 30341 -369616 -68184 -164854 -135405 -116151 115995 -282837 -93200 -265597 156069
12440 84119 -152541 -7514 134701 -150893 72267 304252 -170224 94960 -72803 130716 152167
12429 152167 132409 -109238 -81228 353236 -240040 22384 151568 20429 -43376 -130802 190682
12417 -98029 106726 -61272 96493 210684 -37717 164398 -43487 -219380 -263842 124923 -80423
12405 3669 -190084 216929 150675 -223823 -1570 -94501 311503 189497 -243237 10629 164740
12394 164740 367159 111645 -66355 128407 220478 -108879 -263314 -460408 54357 -241767
12383 17637 61984 -161963 -168167 -6227 375847 -228454 -159944 -66004 -83653 58054 -228103
12371 -97371 57819 162555 -93182 -291756 -40105 -105819 -217940 294250 -225383 -63087 -307950
12360 -307950 -249192 -79394 48665 17788 41556 176087 -58597 88885 279657 -32649 -238175
12349 -238175 -255306 -134055 24100 142547 99823 1628 255763 -253236 -54720 -61158 -178180
12338 -178180 91818 -69824 -156344 -58877 -17868 -47098 -33597 222243 141587 -85423 -112517
12327 -112517 42513 -10043 -14722 -33118 20949 -230713 175696 141322 -103513 -189120 49140
12315 190390 271314 -104231 -112116 470360 205573 1326 14456 -182293 -40564 -8418 -22264
12304 -22264 -226375 43740 -206716 72336 15661 329860 76783 44167 29753 203020 58369
12292 -122939 180827 -138100 56381 3372 60256 -177569 66946 119434 -26176 116401 67394
12281 67394 -5807 186851 -46861 -4396 429775 183756 234175 303791 -74771 334381 74855
12269 277862 -36137 -57810 166214 2786 216982 148912 220873 23059 17289 77732 101422
12258 101422 200077 153901 70614 187864 80227 145041 2610 2463 -127258 155977 271653
12247 271653 -63178 10180 -290612 68655 5712 196878 201695 -53174 128490 182735 -154385
12235 334160 -157473 257188 9571 158039 70793 97359 -99031 138922 218171 268186 100842
12223 48314 370724 183682 167424 321499 414922 335567 191353 376354 -101810 -119937
12213 -119937 -18838 109703 73302 -132094 -185463 261485 -58272 75113 77274 302572 298616
12202 298616 144774 250036 242228 524624 -117531 294122 73914 260500 134159 301518
12192 301518 -2852 344552 482713 285541 57005 -26116 59081 61248 -113703 -1975 226892
12180 -229989 -438905 134801 222122 -41301 118622 209525 -113191 -61380 -102599 156736
12169 85518 279238 -15405 -103191 -15777 -51136 -164011 -80934 162623 103299 -90077 102331
12157 -284659 -207481 145684 -189932 -234829 -13310 -155877 191958 115562 243853 228389
12147 228389 83159 252775 -48011 80532 355860 -1144 -114796 -276811 -182539 73303 -156611
12135 89976 16753 76082 -54742 -121304 284160 150971 -316395 -239613 133027 1742 17824
12124 17824 171885 -125282 -280564 68763 65210 92481 299649 56298 168769 89713 -299174
12112 -193877 -198559 -150880 -198862 -165847 53299 31885 284131 6554 250998 -324400 236201
12100 -85834 -46398 -61411 -152108 56208 16423 19385 236555 -115600 50400 -508239 209214
12088 -72534 -224972 -248708 53 152367 -229996 295756 -240570 -195792 -40081 478719 40432
12076 150405 -102965 -99581 -132474 82042 -40720 -182777 538825 915748 1114979 506351
12065 162096 392811 87626 -19572 145328 -16356 173230 80430 -256584 71017 20406 -118607
12053 -153726 -263830 118210 4118 -80963 -22230 75658 -228827 120672 -29564 -176617 1573
12041 33663 112924 -71872 -170062 -78436 -92043 -173527 79394 50733 -52539 -220817 376370
12029 -234022 -94915 -53092 -43011 277149 100116 -95501 -155263 -26170 137726 90871 -25208
12017 13311 -26431 233654 -30957 209685 -201032 -190333 -281295 -289247 45113 194519 -108778
12005 255901 -43118 -246959 -53263 188646 233162 247180 -242606 -190224 121028 29230 215261
11994 215261 12126 -2799 -208185 -249176 142902 -106659 -140390 77925 -226290 -70457 -59755
11983 -59755 135713 -152922 -229892 -325888 -145977 293487 247005 -394066 -122971 -208001
11973 -208001 9990 -206437 -231628 -16522 -107484 -119232 10573 -81234 -206541 -68456 95963
11961 -91245 -26757 167232 -105692 -100687 69871 -87730 -169571 54787 -317458 217055 133898
11950 133898 65111 452737 -20684 -108253 275966 83058 -97932 312483 47739 -325983 59152
11938 82816 -30411 -535026 13856 -129789 -155621 129669 -3468 338663 144318 -48104 -26750
11927 -26750 -305611 23025 100489 391400 -32212 -39794 -173803 47666 222585 -345526 -174978
11916 -174978 95228 94097 199434 4612 251403 51358 42839 -131607 93379 184353 123067
11905 123067 -84928 244751 363224 -34024 148668 307060 -176245 23474 -238876 45626
11894 -376654 214503 -34642 -59590 -243142 185149 75764 78373 417946 133027 -183352
11883 -325635 317245 35612 -100787 103071 -17403 -215919 -194241 -209440 68175 -262483
11872 55098 -53104 -411458 -390628 -119557 -508 251217 -617 -12186 -349046 -239234 149192
11860 13052 122989 -618564 -115276 -32434 -105440 48548 25771 -79481 -91161 -20244 -32846
11849 -32846 123202 178232 45501 -235832 -98844 143303 134684 -114031 112236 -80563 -35641
11837 29152 -14225 -69095 -237728 327163 -22770 -207359 -51371 26122 -2084 151439 -204010
11825 130735 179488 -187303 -158940 -200599 -164687 22091 -97176 -67969 -153095 -19117 -182896
11814 -182896 -17387 152493 287770 -337425 -8070 190067 5933 65035 457514 108099 32833
11802 -151292 -76203 -75527 -243190 106036 722 -129675 -40008 163444 -1827 -43704 -78532 7803
11789 -66511 462690 175125 286785 -239845 217308 37248 -143335 -165289 -173171 -15059 -71928
11778 -71928 -143302 495 -72211 209030 8678 390791 -162284 -280466 -204049 -311658 -161406
11767 -161406 -230513 -63103 -59928 -138632 178033 206167 71553 -57215 -149528 -107806 132208
11755 -83182 48195 -42550 -42011 1568 -80330 201211 359114 200396 1499 143237 -18942 84413
11742 -251144 -113245 19964 -30511 23824 334455 228785 4162 -145547 407385 4841 52159
11731 52159 137015 121875 -101264 14934 40689 116444 -250021 -194322 72763 100567 -223066
11719 38434 -31376 88471 -229506 184277 -208931 -88732 187116 -78586 73969 151592 -138515
11707 235420 87766 -196691 -218958 -14553 266333 -98501 -96340 -69535 -104532 261856 448045
11696 448045 69521 177260 -12548 -32465 144700 -204873 420996 174875 40331 261012
11686 261012 -155027 78861 102516 -6471 206075 267484 36108 -94587 -10017 331329 215057
11675 215057 -99295 -185492 -256588 -1491 199304 -163942 6575 -104284 -105972 -17607 91471
11663 -175299 164349 -28688 -29655 11433 175056 233771 -2583 98636 -63363 59376 -239429
11651 -107672 -173769 -166856 49757 -320463 -362569 -24735 83508 -6431 107112 148227 6131 823
11638 -11456 80930 255881 187880 181505 39731 136872 33506 106182 297910 388642 115349
11626 81875 30484 -148697 38638 247885 138762 -274920 100591 -133318 124810 365687
11616 365687 -174215 379109 91463 -213338 62783 62060 -11729 -87014 -32361 -64338 -128685
11605 -128685 92560 374022 84855 32496 107360 265061 -13101 5522 -14196 316947 119403
11593 170182 274316 20615 94544 -5411 318990 69765 354377 63847 73251 -30516 5228
11581 226905 -240575 -114984 -37575 78010 -10029 124641 351807 -30807 -114147 222021
11570 -245846 -42013 50140 -30590 36120 195102 431939 -212421 -28881 30779 -145353 -90422
11559 -90422 -11824 365633 40803 94772 -210991 -116658 -73170 -171952 40489 -61238 6938
11547 104845 39637 139710 123854 243333 107375 85714 47234 5578 152616 359571 21078
11535 322176 212468 4926 -203522 219008 143241 318150 -227813 317537 86077 26276
11524 -70153 195292 364157 90730 -23074 -6793 -105632 -69630 -208222 285709 189075 -111427
11512 -126535 167637 -13956 -414812 45977 -155834 70084 204626 235187 164771 409433
11502 409433 51421 -200124 188230 514907 9295 244037 -26350 95186 127200 -21986 78787
11490 -169338 120168 356817 -34688 25284 50441 249597 219152 33238 4987 161272 81622
11479 81622 -5358 141911 223868 270050 25403 344331 88861 229243 -166530 374566 4550
11467 22929 229571 270721 345435 100129 414696 -18088 102452 -210944 334698 -400351
11456 -393701 271113 15337 265747 100767 411586 138721 78244 305963 99315 -6458
11445 212237 -191125 -69939 -64333 -44734 353697 76330 99797 3225 67297 79234 -64329
11433 342556 -42859 1394 48778 -38298 -274816 -100244 -116823 436218 103352 -174937 -264881
11422 -264881 103289 -93049 28226 -313478 109693 278726 -96838 269369 14150 -223416
11411 -34529 -260985 254182 57919 -10119 210658 -41992 28150 25189 -166914 -182551 -58616
11399 190187 307926 -105460 -29351 98142 -153407 178456 474 211266 -112739 131332
11388 83792 203166 45674 -112789 -73769 24596 256641 3132 -98776 190831 262133 -141224
11376 113406 121572 143006 -120238 47038 -80481 123807 -180993 -176751 61663 -125649 163026
11364 -164861 29012 -109616 147235 -1853 310586 -65056 -55002 -50962 -301956 -8342 -132321
11353 -132321 88355 -170646 -4344 -218462 -119745 88490 -165849 113712 87977 89708 -31062
11341 -109808 -250546 -61770 -59531 296430 -36875 84136 274680 -63165 -223931 38671 53924
11330 53924 35009 42252 261918 -57735 171726 -55717 125099 -90283 -16073 -196610 -177121
11319 -177121 -53211 17121 -155583 -190673 177221 441428 361289 215591 -284218 -38449
11308 -131530 -86641 152415 -111753 92116 28120 303642 52382 -160271 -54655 -265660
11298 -265660 118147 -196701 152176 -107753 -225584 177339 47355 238878 -81238 54572
11287 -25365 -312837 -122879 -18542 92678 -50040 170722 -326493 239784 -187984 -267383
11277 -267383 -116838 -33247 -80786 46591 -83821 -227004 -2309 -226118 -104405 -267017 145846
11265 -70594 -63927 -294440 -153215 142677 -191029 115657 -124525 -52174 -40283 7106 119965
11254 119965 -69076 -58044 117889 -295526 -299806 -11688 -55389 -607980 -88641 -27430 -13267
11242 -147302 220168 -52851 409493 244425 -160419 114274 38762 -35968 -46518 -234953
11232 -234953 -262767 -75312 -310611 -138257 250660 -340531 -104782 149366 -113171 -11260
11221 -21955 -60134 -91957 264312 -50450 33331 -165724 -441218 -73758 -1206 -275976 71834
11209 -33723 104161 -34521 -149655 -119521 -37599 30793 -122934 -35993 -528477 2608 -429628
11197 -157627 -527671 -120960 -7090 -16095 -200694 25578 -71357 -330634 -195735 -50164 292541
11185 -174436 132778 -174084 35171 118277 -102466 -188428 -165774 -38505 -101671 -190233 148972
11173 226036 -224657 115363 118865 294336 304837 -262213 -116870 142475 -16576 178867
11162 90698 -275528 63008 -123542 -132355 36269 5354 -149159 33844 -137727 230809 -42604
11150 85830 227655 -51533 113408 77277 226710 -105542 -53011 135744 189065 -383385
11139 -111396 134980 -140151 27322 -169484 -62866 -180276 267397 250632 147558 -34004
11128 135169 184506 -2981 322091 15919 298268 -416209 -126749 50754 259883 -71410 157602
11116 320249 229286 -460306 41438 -44363 71735 56948 137207 141182 265026 289371 140214
11104 304421 403615 138245 66210 300929 105481 -19245 137019 69653 183001 47355
11093 210456 75695 -42029 103238 -30915 -121878 304926 361783 326183 547813 118946 77954
11082 77954 325684 -299118 121022 455930 388366 -119851 219336 214725 268241 37513 112468
11071 112468 635943 209279 146430 51841 498611 519475 -24255 76395 465456 542651 543202
11060 543202 405237 598683 484165 447823 545392 643681 514837 754346 871790 704809
11050 704809 829500 380096 808163 608974 659582 735846 970644 906356 597795 632965
11040 632965 865860 537742 494032 559837 738054 961334 750709 525034 249743 370125
11030 370125 808615 609884 698117 671751 574559 746749 603004 556386 502000 624335
11020 624335 609258 309810 539923 169963 755673 632886 231062 512276 387797 537097
11010 537097 540276 367489 873184 510896 640036 775589 923134 691246 397981 569621
11000 569621 472706 624545 956491 555445 446965 646439 857568 723952 471853 575803
10990 575803 996473 564622 764379 527658 978937 764842 974397 924940 959744 1199202
10980 1199202 1242256 1420512 1562222 1571841 1508104 1870721 2248181 2454002 2786171 2739162
10970 2739162 2609125 2417613 2127157 2362434 1885017 1434313 1547297 1487683 1606998 1299272
10960 1299272 1415556 1523729 1716458 1506171 1425497 1149438 1068545 802273 913727 648007
10950 648007 400713 669410 51670 -37784 492545 533575 341247 106826 217763 38409
10939 -52427 146907 138395 327360 150433 54814 35700 282203 36495 37224 -84359 201801
10927 56543 19946 302810 -116232 -431259 -86737 -285529 87756 -258166 19440 60235 -185363
10915 117053 154953 -119086 68782 36182 6313 -312098 -215471 -291893 49432 55635 -83770
10903 -84673 22787 -62435 39930 164385 -263777 154106 46610 439041 -305115 -18296 225215
10891 149810 176286 261786 -119601 -42302 -7691 -293705 -60754 -153939 -287040 -10340 37231
10879 334376 147144 79780 -61921 187224 -123114 -115778 564090 21291 -129751 74608 -174291
10867 109638 -58388 -28025 33960 193891 -9390 107372 76884 -57596 34801 -241087 -115527
10855 -171211 -209658 -82568 116793 -317820 -97942 -233999 197778 -5391 242827 -235586
10844 97039 65123 123837 205908 16801 -312423 182771 -212447 -280373 1795 -239904 -8244
10832 -105768 7765 41249 -226948 -112259 102154 103410 -36637 -198795 -94860 223279 -37065
10820 -59474 -222909 179469 -155965 -237143 -77433 -86858 -210458 97733 -174492 -1418 -123405
10809 -123405 135094 -126692 78700 -258247 -265604 -23775 88049 -161522 -252224 17037 323478
10798 323478 111957 216560 -32300 -54064 242861 52768 -60550 37938 -19220 198503 -123916
10786 -166254 -143192 -105397 124911 -256973 82208 -21947 184576 -115550 164453 -295458
10775 -40116 138214 -198958 -41218 155955 -97893 209590 56163 35466 10488 -139382 30641
10763 -135478 121541 107830 132692 147974 -539725 -128220 -45803 -175938 239659 226625
10753 226625 -252871 -170137 253984 -65736 286501 -71933 288351 14142 -61989 179762
10742 61762 -123450 101090 -357051 -63785 52372 -323637 -145621 133523 -103601 -84046
10732 -84046 -223297 175499 -64881 -154101 43973 -300205 -7002 83577 -95966 -240170 -491609
10721 -491609 279216 -317161 -324309 188528 237981 -261503 73483 166239 88273 -86964 -143462
10710 -143462 493729 52557 148110 259441 -35631 -265860 -211379 109283 -317471 -164799
10700 -164799 -127281 -535501 116426 -299124 61126 185902 -141044 224790 -88509 157837
10689 -54798 120743 -590 -465176 -236620 43256 -152110 97067 248587 -229509 39271 74026
10678 74026 -226302 -112819 -185240 115511 -21751 -372791 -104864 217707 1461 -122977
10667 34357 193662 -46976 166043 -12814 -177678 -117316 -276249 179893 -75566 -149681 -104904
10656 -104904 10495 -83827 -462844 -203684 -534440 -101072 15575 -41688 38447 -79392 -138281
10645 -138281 354084 -91803 152970 -94383 -108213 86948 100842 -140978 -303211 99496 -237391
10633 182480 -26802 25860 165812 210109 -227221 -61036 50777 -211365 60720 92918 -24505
10621 105266 127212 56605 68787 -90694 24300 -152788 -23633 21257 -170536 -195152 98842
10609 176358 -27635 -101549 -65360 -72932 -297378 117255 4408 -59157 -64592 -8646 13705 -127767
10596 171811 239600 13823 160546 96372 210757 -112038 188022 243277 -269882 -322234
10586 -322234 271945 -46389 -69265 -174837 -1688 -102915 95299 -188569 -98075 145316 -172649
10574 20150 -58167 112447 -107520 146865 -288152 -73357 -117668 -316641 228598 8074 -310875
10562 -160700 -127755 -174334 -175098 -110571 23047 -194015 -54152 -111682 18483 -271494 51350
10550 -126571 146072 -2977 -59118 -11185 -37405 188331 -148849 -227463 -68793 6906 238237
10539 238237 171780 -92570 -30917 -156250 -90715 -130015 -50265 23303 -218605 -197192 277095
10527 -92123 -256730 113346 147191 -137115 -83271 -54488 -69705 32793 13825 -9486 239932
10515 139090 64539 -55023 -245435 -77274 -5974 29304 141952 104755 295776 -172357 35330
10503 -32775 -81188 72398 -251923 -18710 62471 372166 -163760 -230627 -109913 393 -98658
10491 -299568 70493 -20011 -237713 282776 -251529 -49355 -27208 486578 347614 325384
10481 325384 366169 121096 189219 -111008 217573 115503 277337 66932 -119900 -31069
10470 284363 215596 -177035 -85678 -59254 -104650 49953 12505 78375 210609 -40414 -93021
10459 -93021 30401 -264838 71636 -8459 -133319 -59499 -18571 -435810 -109315 -261609 -98694
10447 135417 105774 -226175 20267 -40804 13051 371187 -324730 214916 -284023 -116897
10436 2592 6397 89095 -8162 -185699 -307984 -54743 -284866 -58963 -36826 168015 215905
10425 215905 72132 284182 -144567 55334 134338 -7736 391274 -93036 283433 -8391 24909
10413 189469 -27305 36429 135475 -101584 135218 3945 -235025 -154320 -457756 135932 36261
10401 12098 -289081 330791 58397 22041 -131483 144189 57456 56210 413129 270105 -118725
10389 156645 88114 49043 4020 -6741 -62648 -210857 -123293 60544 32249 -46818 50321 259972
10377 259972 370461 138091 349141 78194 64044 163924 153117 314801 199017 427289
10367 427289 445605 186659 554433 47890 482445 414135 361242 -180317 72625 379493
10357 379493 100893 -156692 -22749 327672 353157 260909 225596 326064 469583 292796
10347 292796 173529 679275 431448 315941 182783 81578 127761 196022 490623 301887
10337 301887 199005 -275714 -334317 424171 45394 109722 -13468 128307 -43968 332372
10326 193120 -31578 177639 -40651 29063 194127 178908 144017 -72093 138842 414169 187844
10314 122145 -24462 -130785 101826 -104965 -63047 231007 175282 17547 -60565 49453 123059
10303 123059 60169 497706 154232 187538 -188393 365644 -246322 -247479 -66405 206658
10292 -93847 -267599 -86080 35964 287811 -243890 73134 363171 -359913 54136 -145644
10281 12617 107582 23975 -275074 161174 44779 -112079 -24173 -177245 -117464 242479 -126073
10269 268616 -231487 -111880 -133873 -160941 169727 -188198 358181 235318 288059 182629
10259 182629 306424 278540 129054 -164464 67763 130019 67288 -38642 86806 250652 -336684
10247 108752 5235 208404 66083 -200418 -145859 -146291 -304832 54027 -16963 56684 -33517
10235 65300 609 -141568 100593 -46376 -306133 25441 -263581 -87064 215678 28126 -40845
10223 -116691 -205744 -233542 111413 -62782 202950 31614 235817 133683 -134282 61418
10212 -227536 68392 148794 -14387 -257297 -309025 84821 107880 -179835 -36012 -361136 -369955
10201 -369955 52128 -217383 42394 -70099 -172343 340777 -87046 188516 -262115 -126887
10190 157342 -388403 81620 -98095 3004 -263286 40137 -211581 -19401 -43095 149805 241165
10179 241165 -139577 -110081 493702 -38781 59747 -189913 -128239 -330409 -240868 129119
10168 -43396 -7049 10590 -131151 -174627 -47227 40742 -137677 -380355 118251 -55524 -128949
10157 -128949 -172951 -50091 -105013 194758 54993 -140528 -214513 -317842 -234819 112561 -13531
10145 391812 12851 -113482 -200015 31807 134238 128616 -79056 -161764 -202144 18310 -93070
10133 1555 250764 -34293 -236120 -57116 -112483 196535 35507 -364429 108878 -84855 66640
10121 -43357 -49198 -206292 167493 -151449 39961 6821 177851 82396 -216263 -249971 -159607
10110 -159607 -66168 -30948 167196 92759 -68625 31980 -477892 130788 213368 -3890 130176
10098 -236030 25934 -255039 36128 -5186 -66089 167459 88334 -190829 92807 -143179 17862
10086 151395 108655 -101070 9929 -310859 59811 -19994 -503908 -416548 -179301 -124248 -149590
10075 -149590 236106 -51499 69866 333457 -70504 58773 -106694 15235 -70147 -46592 -326167
10064 -326167 202981 -67396 77183 54148 69591 -344700 119247 -189757 53312 -94158 -229537
10053 -229537 -137511 43476 36634 20216 -257082 246331 184067 156569 110377 -238927 -6383
10041 42471 78593 -230700 -72502 70687 140286 61391 -385464 -55502 -37999 -151793 150365
10029 -413204 119183 -127534 3546 -114936 -135019 -392759 -29165 133465 -36869 -4611 -151737
10018 -151737 -8814 -22308 -44243 -196500 125425 -91292 218006 302059 -86382 106930 -22420
10006 -2505 -191403 109193 -249027 -151090 -16989 -92760 -52607 -781 -81807 219986 -151772
9994 45574 135816 -218188 -122741 -238484 -244529 26337 -46008 46614 31657 31920 -181202 -68867
9981 -158985 13270 -181796 111958 152312 -138928 -164716 41356 79428 219300 48988 -244740
9969 -271756 -268564 -416991 -152852 85041 -199183 -204900 -505023 -290952 82797 -92225 63915
9957 -146005 -81047 196704 -77440 -286895 -376595 14035 -111069 -293102 -137471 78116 -44505
9945 59454 -133547 5209 -68932 -352626 -243276 -157864 -116869 -35238 -104506 -408109 -144299
9933 -138024 -86086 67404 -157048 44505 -356641 202878 -134358 -35961 -148574 131660
9922 -213085 -642 -86527 -30513 -125530 -111389 -156956 -349892 -145672 -12447 179194 256859
9911 256859 66885 -387168 103710 -30915 -175879 -176457 131794 -52054 -299436 -210161 -384285
9900 -384285 172265 -83516 -206226 -250160 118652 53816 -296389 -150872 -69909 -462290
9890 -462290 -254718 -103857 -3249 -70519 -243162 -143637 -90482 -299718 110639 -155563 13616
9878 -170527 -191561 -67734 571770 106484 -236861 5685 86572 -113724 -228899 -34648 665
9866 94471 -187194 -83249 145742 -76449 -150125 -94686 210637 116541 -236879 -277240 31242
9854 80493 -212720 129862 107835 -151384 74592 90935 33261 -94153 173226 175599 -131474
9842 -28000 123274 -96794 -184118 -158552 56668 -19208 -110018 376720 58407 63816 108332 54435
9830 54435 81642 -74239 -232909 -180227 44517 -89824 -73307 -203180 16924 86857 32108
9818 113795 -356872 -109965 -106921 60034 -25455 -319954 -353944 202822 -215434 131385 103609
9807 103609 -260682 83382 -107703 224441 -95619 -277838 107425 -100042 -36703 -41964 38899
9795 57158 -209150 -212452 215563 -212621 81124 -11357 135987 66549 -255062 -68179 -236449
9784 -236449 -226373 19479 -260340 129173 224113 80862 13026 -24592 -66002 -158437 -30734
9772 -85878 -291741 -216211 91015 -35817 121204 16520 56074 90454 151027 -333583 -207005
9761 -207005 -366289 -100345 25866 65690 94691 -65925 -57275 -154112 43905 21045 -363036
9749 186887 -105084 -396162 290131 -34466 195754 -124279 22616 166066 -156432 -117941
9739 -117941 -80851 243583 -127672 -299473 -254352 -193785 -172315 -233449 -198807 -127166 -275473
9728 -275473 143305 -152308 136300 -80689 -368949 -237468 -40965 -144709 -311685 -143481
9717 -129542 -38579 455923 3810 -106364 54333 102244 91513 -25239 35434 -122959 369918
9705 -135844 27678 82763 -316078 305907 -15506 -137273 -193643 111906 -258277 199356
9694 87176 218545 124293 21075 -167476 -25540 191991 12718 -115525 -220099 -282762 -293931
9683 -293931 -244316 -104419 -37751 -201867 -230491 -75190 119926 -277188 53661 87590 -61914
9671 23397 -54400 13817 -363797 70409 -261013 -180360 84594 -143319 -16869 -195162 9120
9659 -97304 -63547 -7301 -154265 105548 211560 -53662 -98911 -43536 116316 171946 142136
9648 142136 -211228 95707 200394 -203342 34198 131065 34068 48575 -105703 -475750 286124
9636 100908 217020 -259975 -306729 -105679 -158685 1933 24703 254412 -108414 129474 16736
9624 -82804 -120317 -20873 -166777 10258 134652 -161268 90608 56182 -250876 -210181 -63529
9612 -108975 352301 -246522 69886 -88155 -438812 -117865 -180466 166383 -406052 211888
9601 -190434 -24792 138437 -160517 -195583 -81967 159895 -164053 125326 -57323 -302592
9591 -302592 -4535 -186551 -13894 -72679 -165271 73354 181675 48203 -19389 -289326 -96425
9579 73225 87555 -97855 -35957 -329832 105031 -376870 85378 37190 188384 121482 279750
9568 279750 -165673 -174256 -255689 -82603 206177 46728 -42709 -56521 -428549 -25769 -145017
9557 -145017 -261103 145803 -67123 -77700 125566 133870 99744 -142199 -246525 38444 -231440
9545 -369311 -29455 62746 9124 98762 -76831 107175 -220126 -119826 -25748 -285514 -128852
9533 205821 -124231 -91778 339483 -488535 217893 -157636 -80005 -232328 -245624 -306669
9523 -306669 -20394 -64578 219557 -53871 57955 -134607 298565 -7086 -247078 -388957 102288
9511 -68415 113985 33214 172505 -59799 -228702 47021 110460 -43496 20627 -237940 33448
9499 -192691 60170 195097 172952 -216532 132165 5504 -90202 -527171 243292 162678 -130272
9487 -344925 -27150 -247453 18956 -122282 -2266 -48854 33060 -81928 -290604 -199856 -155442
9476 -155442 -26291 276433 200330 -96512 -84469 -29631 -238165 59380 -81025 255131 251370
9465 251370 14299 -126189 -199380 156761 4235 -617107 -61186 -154455 70095 -15075 -43680
9454 -43680 -284656 -106942 30699 -33209 -106137 193422 -5856 -172743 -323585 -51049 98358
9442 -57038 -82230 93005 296242 -118104 -39331 -28737 -69172 -387766 -26076 55524 -256014
9430 -104059 160064 -175892 96269 -135093 -59704 -527820 -234958 -73375 -6476 -243758 -104741
9418 -64956 101196 -408997 -66968 -182556 -91727 -4991 270629 120875 -157443 -171686 -88644
9407 -88644 -161164 124640 -2854 -64282 -158641 108390 -171390 -234396 27352 -292320 -476831
9396 -476831 101955 -49867 -265774 58479 -64740 289447 31165 -150727 -251104 61469 -402678
9384 -289469 -225446 230671 138879 170417 133684 187119 -29495 59920 53352 -66884 186407
9372 57147 375041 97058 159821 313419 -163131 -293858 -241202 -28130 -236157 -223769 -59863
9360 -55545 216497 43228 327039 -316876 133037 147674 28406 -15238 -35850 -283255 -217539
9349 -217539 -195825 -261599 100690 -202348 -36852 -115354 69480 221698 -219397 706 -182512
9337 317014 119809 21513 51960 -377413 -38375 -21072 62016 -310567 -47086 -148043 -126338
9326 -126338 11369 -250339 93139 -223820 -117756 -11891 19530 -183904 -87948 175643 -219106
9314 93564 -297528 -126408 34580 -197496 -251601 22836 -146769 -298415 44703 202046 139886
9303 139886 220894 -38121 19384 73701 40889 -127000 -112329 -76544 52274 -4647 256583
9291 -46603 -218086 -54950 -29417 -141240 94144 -241425 -108535 -68403 -210489 58907 80050
9280 80050 -135801 -185683 50784 -160754 -205522 -223423 -327918 -31280 -195937 -134534 -391606
9269 -391606 14698 136600 94722 -67400 -67379 -30119 262584 82920 296540 -169936 318088
9257 -204488 -244300 201711 -422732 -241334 -107718 14785 165902 -337129 195085 -295130
9246 134306 99314 140862 12971 24225 -110800 -175311 -281126 -48488 -105205 -84900 -185157
9235 -185157 122254 50619 -107076 319332 91548 132103 -74922 -69879 87954 44401 -25738
9223 31844 63119 -230948 279624 -245011 130141 376005 61434 -20176 -143493 -358009
9213 -358009 -143473 58801 -54530 84849 53364 86687 -232341 -39490 -38505 70543 -143859
9201 -276284 -130460 -53690 -327979 -57129 -239394 -194736 -227382 -68749 -55154 108490 16938
9189 -108512 -181980 31836 -147876 -220005 201493 -27344 -56102 -118541 142826 -183580 -21130
9177 -98008 70258 -139976 -53582 14155 168592 -309910 -105810 -187495 31297 -68795 164100
9165 -130711 -288022 215565 -157910 -57030 -136728 -62015 193386 -7098 22569 -280479 -148733
9154 -148733 -88302 -207640 -59741 309106 -274165 157524 17738 33005 55035 230647 -68681
9142 50516 206546 -162588 3058 -246008 -84439 -281562 -9696 -103449 75543 65752 125868 -170434
9129 -58513 150816 76777 -222979 220924 -4779 -138775 -136766 -284317 -115946 68494 -164195
9117 -153408 -4506 17650 -15405 210808 -241401 -219025 -211998 182666 -155415 47198 -123157
9105 1602 -161557 -94751 99475 45037 -94741 -3960 -352696 -59440 -271783 -183880 70276 -86271
9092 -167339 -12348 -193634 -297877 115086 -175421 -47923 121542 62918 29103 -100263
9081 176502 -13444 -155044 -301201 -54695 78906 -353080 -189254 -155472 -122712 -58282 5799
9069 109390 -42969 86646 103923 -298556 157165 196200 -124667 52359 -26025 130448 -183766
9057 50781 -180655 -20865 87261 -342565 -110179 11872 24560 -92650 -441872 -205587 52844
9045 -212931 -205327 -327627 -190395 143552 -68801 -230745 -131236 -154285 -265443 38471 111697
9034 111697 153582 114623 -241040 197612 -68234 -269102 208928 53269 194611 -45609 97733
9022 -120542 20986 94475 60520 4364 -137426 276396 -19106 5471 -27532 131786 -237766
9010 68653 37825 -315486 13512 31772 -31893 77503 -300582 326173 -51117 107188 97617
8999 97617 66808 -322560 421434 -419458 -116647 -264808 41087 -319857 -427852 253657
8988 -167430 -188282 12002 -90203 -103022 -21429 -206181 52804 -305051 77929 196431 -103757
8976 -139095 -231542 -259660 -62568 -56393 -18745 3185 31949 -120239 -125770 119095 32757 -144010
8963 44412 -15470 75172 73988 105705 2740 -178053 62754 261545 170051 16219 28176 -47042
8950 -298145 169405 -551122 35717 -209937 174688 -151553 -75682 362462 16521 159064
8940 159064 -121388 -35564 254118 -108384 103686 71956 204046 -114251 237856 -72174
8929 -89374 104559 121249 5572 199575 109630 341674 607066 2263404 1594671 554604
8918 173367 -109149 -51231 285259 214220 231540 -121312 54592 -211131 -36067 73768 18824
8906 -72592 56203 49505 35962 -214156 -25798 45838 -85141 -64836 -239681 -68613 -98650 206544
8893 -149133 -241449 -279687 67495 -32162 49142 16154 27106 -186265 -317209 -109623 145321
8881 -160385 -145168 -9861 -29363 84287 -305627 5262 -228835 -91540 -49370 -29462 -36898 -81442
8869 -81442 155711 -75839 -53829 -62962 -130828 -162370 -333541 -94161 -222391 50311 -44556
8857 -276858 99097 32422 42152 -127057 -12913 63277 -114741 190686 146250 86995 -54560
8845 67260 13534 -409102 74422 -154404 128924 4889 -79341 149661 284164 49784 -103912
8833 -46069 -73986 -262548 19627 134022 94949 -226671 -21198 -4085 -154849 44817 -89426
8821 105997 145238 70086 -292278 -549307 -331995 -227518 -915 92412 -119737 135308 -116271
8809 -328337 -15460 -330029 -160236 -251534 -478207 15591 295441 -137041 -153358 135102
8798 -265386 -34207 219806 -171558 -163958 -105738 -218501 125799 -19072 -191043 -220826 30942
8786 79803 157474 59891 99304 86433 -30169 -137631 -120308 -107355 192525 175720 18663
8774 83068 44727 -132558 -35657 -147153 -130690 -33469 24946 -225957 -137717 -199139 -32188
8762 169512 62525 -153433 47910 -50810 228577 -144240 -116071 199335 -255687 -179895 -208615
8751 -208615 -138373 110859 137064 -254762 169249 65517 -230561 -31486 31158 73618 15698
8739 128516 -78557 -83882 -157802 139218 75303 354904 194623 -164728 -57033 -245107 -107105
8727 23138 160231 -208046 60988 66030 -127542 -52608 -91665 -264770 -82178 -212123 -297581
8716 -297581 -15842 -119719 126581 -406775 425615 -36422 94622 -301216 184191 281218
8706 281218 -85109 -100873 -403149 35536 -41643 -131296 86806 -20418 -286955 -396996 231895
8694 -35286 78087 195627 -130161 -223581 -231910 94890 -18970 -365020 27935 261079 16921
8682 -266754 -58216 113143 -170124 40545 -202593 -342162 -80201 107151 44450 -198166
8671 211984 -12230 -16433 -62154 53651 -77868 -153721 -390762 -99569 -30777 104295 137305
8660 137305 91282 -20963 -67332 29327 -300509 142809 249596 80696 -130844 -231349 -40354
8648 -181247 137243 -53139 -102141 -35450 -26431 -177976 -42125 -163515 -54800 -88324 -209614
8637 -209614 -237712 -112911 154889 2195 -5974 186572 49161 54528 -165118 -260783 93015
8625 -283547 -198404 58336 91827 -28730 -308426 85600 -105679 -156417 84713 -71645 -59615
8614 -59615 -298552 -65977 25626 -126121 -253477 35464 -85048 138961 10095 -22966 -160911
8603 -160911 -272657 -228017 -41461 205765 -240668 -225889 -41138 40963 73604 -17572 -225737
8592 -225737 -449818 137017 -124093 -19500 -63212 -16286 -228688 38901 22496 166274 -230206
8580 1886 102847 46234 -155367 -411550 -434756 -77905 -111371 -107378 -138134 -207979 -48137 -448996
8568 -448996 -67086 -405398 -298094 259083 12679 17733 -91024 103712 -59215 -15561 243307
8556 57292 -177679 112372 -15003 186928 -22721 48846 -106931 -173031 191191 -397525 -239921
8545 -239921 -60069 -320783 -74287 148672 73195 51005 -274038 -222857 99720 -228683 105197
8533 -105834 -114234 -117397 -53303 -63125 41368 -183250 -224873 4881 46928 333898 -25905 -417688
8521 -417688 -234248 92685 25636 -90143 -119932 -146096 257298 -24295 19558 114403 35463
8509 252563 222496 292843 33841 105439 92325 -42570 40057 -64276 -175399 -103832 -97348 -238873
8497 -238873 -131812 18065 33812 67837 109458 58294 270043 -168048 288321 -164914 -171521
8486 -171521 31362 -179906 -36957 237538 -61983 -44202 -63064 -182830 144781 -253284 261630
8474 -123791 399242 -100215 -321026 -136440 46203 -42383 205196 196947 -172806 -137353 21164
8462 -280381 75265 69832 -28158 103914 -285391 22025 -197780 291286 -76313 -63877 -269643
8451 -269643 -42618 -60063 -148981 -112590 21990 -47262 -10015 -80493 93369 43795 -21778 -97463
8439 -97463 -59847 76188 41156 35455 -244317 -208310 -466291 -81205 339942 -329417 -224501
8428 -224501 298850 -101333 203722 -45497 -113368 -44247 -87596 -241367 184815 -116507
8417 390330 -124521 -110006 161472 -267906 91282 -375937 366864 -44842 95578 -289198
8406 -7021 158233 -107255 152821 -171798 -193352 -255903 226429 -167021 -94914 156963 57093
8394 -230202 -245243 -355369 -42477 -184090 110649 -539184 111660 -39633 188507 -109802
8383 22094 -254338 10199 -197050 -1247 -54695 65576 122933 -345479 68606 -182107 -62666
8371 -189702 -201071 -365368 -44737 -327624 173731 -248508 -23143 -420709 -19019 89869 95291
8360 95291 79492 137512 -299435 -227019 -200399 268441 63818 -78237 120537 1198 95895
8349 95895 -113772 182117 172667 -158468 19641 70345 266260 -7111 119448 -198532 297519
8337 -172315 67362 -65079 -393047 -63341 7580 -209953 62892 -11613 -84270 189032 -47847
8325 -145892 -82392 -430792 -295642 -311670 22597 -91363 -51889 -186737 -260468 -74077 -18940
8313 -130805 78441 91167 -171130 52995 -35795 -127503 135838 -67715 -46177 422484 -296068
8301 -33062 -363647 -88912 -72606 -15755 230358 262654 -117016 -203945 57714 -5618 -80349
8290 -80349 181657 -39026 -12205 -59374 176688 23475 57957 -10634 292108 9560 -68710
8278 -151815 -145241 213292 -61265 -286056 -201835 -104482 3314 1779 183271 87796 -55407 -145050
8266 -145050 -70648 -18676 -179423 -230281 -373118 -209677 3140 -156635 -176049 -177071 -50451
8254 -156848 -18508 -157264 -34033 -126329 -199046 -93431 -445964 1790 -51378 16716 44602
8243 44602 -28273 196760 -116644 207335 -48066 -175321 -118074 66652 151418 369947 -79951
8231 -19262 -370757 -137327 -253886 99199 -39343 -53108 -192196 -330845 -9501 249481 366559
8220 366559 89467 -111749 -16424 34345 -108724 -204779 -46443 19348 249305 -6569 206726
8208 106031 -185076 -9735 228733 69476 -350641 222439 -251839 -162320 -223371 -540 190810
8196 -24159 66910 -157450 -364128 357106 -317104 -27371 -426565 3168 -686 160654 -31344
8184 -252766 -320213 -480229 -75692 -293436 -102742 -167913 -53807 23163 -81684 -219596 -4398
8172 -109767 -117086 203194 -224138 231340 -159891 97241 49771 362403 -58710 138444 637
8160 -236316 73673 205155 -25745 351523 76622 -179115 -84065 -31155 -273967 206008 228212
8149 228212 35459 17835 -69918 272798 -116058 -31321 242045 223940 30361 57306 167643
8138 167643 95665 -187211 -213423 -225904 -74358 -111621 -242961 166463 -195530 -50223 -50261
8127 -50261 -178363 -171542 42169 336093 249779 -164368 -121970 83877 327247 132528 63028
8115 91490 -145768 26212 257454 2830 213606 186708 8119 -346175 109966 -98217 -17288
8103 -205362 -135564 -127674 119041 -73106 -162590 -112992 164285 61662 81996 -79819 61964
8091 -116778 -83321 34059 -83512 -312367 47605 10995 14081 357317 -46306 182761 152149
8080 152149 64050 -51827 -120960 270862 -117654 196620 -103529 -52188 -50108 -76196 8945
8068 -52334 135620 23279 91528 32879 152493 -275022 -160916 222386 -76367 -45512 -171611
8057 -171611 68333 166226 -112488 91395 -185854 58227 -87434 -367088 -51779 -179267 106
8045 115377 132118 -414162 -93716 -166688 -254052 -31133 -95430 121451 -98923 -48613 -32154
8034 -32154 271898 -284650 -74775 126295 -115229 -50858 -72728 -302186 -221698 21607 183352
8023 183352 35813 -223429 -262815 -47946 432850 -101981 -118363 134869 -53958 -324163 -210641
8012 -210641 -94404 -69675 262661 -132122 -66949 -301571 18264 -81368 -204287 31630 -37642
8000 -205510 11826 -250490 88235 -184677 -164858 178414 52536 -252556 -160729 -103636 -110265
7989 -110265 -72041 200874 -323693 -82155 27038 -227450 205709 -233189 -174635 242282
7978 73506 -77496 -105298 -13580 -251742 82734 127 -157985 199128 -126476 -86717 -59594
7967 -59594 -342105 -354096 138657 147835 34981 -398282 -37608 36515 -63518 -80032 299002
7955 -119364 161616 -86578 122534 -6451 52878 -177141 200496 75439 -8530 -342899 -228388
7944 -228388 100039 -325935 -30725 -100740 38311 138772 76841 -141389 260609 -14504 -291217
7933 -291217 61518 -71472 -61644 252663 -97849 -24066 190727 159094 85229 -204681 -52973
7921 -125637 3006 -60290 -48888 112923 45664 37791 -215768 81697 -105234 -10136 -219701
7910 -219701 -57864 -257359 -20113 29958 95633 164838 -115765 20378 -419449 -152076 38124
7898 8509 -165630 -387761 53966 64940 162435 82097 -43503 21187 40509 -99277 -114245 -253509
7886 -253509 -115812 -154456 56650 12906 17271 40752 58619 -150675 -174519 20681 -117618
7874 1079 -93214 -198135 -279155 -159565 -77178 426 164841 -171091 -432845 -61363 37324
7862 -148215 -143158 -236343 -40022 290827 -64185 40126 44229 70334 -100636 65965 247978
7851 247978 154635 -36300 -328825 -51939 562171 13899 -85473 145788 -178596 177373 -146880
7839 210180 10678 -302310 -111762 -228552 -95126 -198729 74910 -214077 -86846 -144412 -15844
7827 -184618 -77336 336552 -305969 -195250 -248318 22627 -101786 71238 -399743 -131429
7816 131862 -52429 -72816 -9824 -16442 -264835 -6116 3028 54169 13932 126199 42889 -245613
7803 538 -165948 81910 -147783 162890 -74418 44426 -40214 56943 64177 -74447 136986 17889
7790 10833 197787 42561 17959 124988 -61394 236589 12433 -171763 62200 -64706 106414
7778 -181575 -198859 -208800 -95499 -122389 -27122 91838 14728 -78350 168523 5304 231031 -151797
7765 -28108 44003 -89023 -80143 -110836 -18546 -25193 -30931 101647 -48432 -46664 -10829 -230302
7753 -230302 115591 -260898 317974 -31379 -27594 -211552 -141217 -91944 -163013 123967 -74254
7741 18000 160101 -208701 -154777 46238 290767 204209 -129126 -121661 -129010 -51715 5244 61142
7729 61142 -150999 -58359 261212 93548 -96010 -255961 46536 154130 180173 -9478 103938
7717 -277535 97013 -164479 292320 3625 -59204 -442627 -204161 231104 -222374 240741
7706 30393 -101850 -137923 -70931 -1639 -48647 415179 -463185 -66038 -262714 -171199 23701
7694 -2095 -66797 3056 -253738 -182987 13273 -115180 -91015 130974 -292790 -147827 -54472
7682 -145708 170090 -113007 1351 339661 16807 -45797 -49213 -82611 104588 139218 187819
7671 187819 241412 345016 -87428 79316 28172 -28959 30557 74905 -88289 45426 405524
7660 405524 -149310 20113 351341 -161714 74102 -68282 -303458 -209566 -85596 -116037 98768
7648 -41799 -273392 299398 192344 -219885 86367 251534 -113062 -212386 -15483 -31628 -91920
7637 -91920 -41610 -295652 60380 150625 -385535 44578 -130983 -66379 -207739 -92053 -126570
7626 -126570 125348 -96225 127766 -3535 71154 3185 61409 8569 388247 15100 -31717 17901
7613 -233041 238983 -149328 90117 -208611 117278 149783 -89261 -110321 12058 -250999 135191
7601 -64506 -65864 -196924 -40135 142527 151406 -141849 38365 166967 -13519 2940 72415 -437151
7588 -29493 338553 -56492 -160996 -96606 131067 -383480 -52827 -16227 -39337 -111462 235217
7576 54489 86971 22943 135923 8658 -141245 -74547 -240318 -36916 -166246 -260235 -19537
7564 -261702 -111405 71469 -92029 -192815 -50759 -46565 148895 13379 -255211 -184679 16388
7552 -1308 -37992 -214271 235517 407116 -100120 -152741 -186488 -147869 6280 220291 275743
7541 275743 -161080 -68602 93976 -133302 -36506 206761 -150401 31315 -62154 195662 19269
7529 159265 98005 -235060 -15206 241357 -197068 -236212 179455 -95784 -203247 -88348 137706
7517 -19851 147124 202820 137552 68733 -163850 -211712 84762 -7582 -107767 30651 -52054
7505 57942 -185997 -167415 32164 -172006 -175855 130154 -149790 -164696 -150843 207767 101195
7493 -103934 147418 360098 -210212 -16914 55200 202145 -394992 128616 -99854 -1851 -26401
7482 -26401 -152221 -4966 -317080 67156 65646 -75663 319254 236581 151630 158304 -164452 -28831
7469 45912 213912 -186311 -131414 -423588 332831 197104 -90978 -95924 32661 -76708 192881
7457 60753 -43118 150076 19175 -163548 20441 88964 168010 109206 -67449 133806 -326893
7445 300282 -170281 -142608 -63983 -211570 -140295 -54350 229656 -121654 -74224 68055 83304
7434 83304 -142331 22106 250665 90465 114593 102710 -48648 -58951 -261093 -155871 259779
7422 137313 -74063 55759 -324197 -58810 216701 -81147 -61308 -342184 -88633 -291981 4558
7410 -194420 -114834 -26601 -5671 203498 -222437 -29762 23899 -190325 -127405 -226411 32818
7398 184677 -90773 -25757 -196268 -115023 404686 -1351 359423 -67611 -172145 -277433 -99179
7386 227199 170374 -638707 155019 73152 111653 -324388 32070 -323844 -48157 150705 74830
7374 -49994 114594 10989 -134244 103988 -61960 -24999 -37897 -80174 -114564 -171559 -289735
7363 -289735 -122104 -4807 -113996 280744 289961 406047 -112064 -104153 236963 -124267 260250
7351 -196929 -143772 -75031 164607 -70146 -209483 -248963 -179625 -115370 90289 -12514 -189345
7340 -189345 -176320 -116028 -359928 26386 -27040 -42224 -110181 115939 -160515 136936 -47286
7328 24076 101860 128793 211251 -98787 -21092 -23175 -221812 61732 91170 -97975 -4219 -216282
7316 -216282 136822 128381 -69684 -73458 -69354 34765 16342 138068 107679 176805 76523 -28528
7303 57384 -126793 90184 56640 14886 177964 -54148 -19193 -199025 -5405 211268 114587
7292 114587 -115954 -62931 -103358 361595 196552 -172941 76260 -172125 13400 -100445
7281 162228 21532 142384 -79084 238185 -11417 156438 -62529 -248368 253495 -33760 -251571
7270 -251571 -87899 72448 -93850 -46345 -68073 -213122 -234585 195885 -52183 -205549 4387
7258 372551 27069 -168913 205458 -158465 389084 -103478 28210 -86610 -157105 103937
7247 153726 22772 -348286 183908 221933 -366089 -227293 169486 -109126 -9796 -166455
7237 -166455 84141 -239592 -188578 -131315 -55466 -6074 106056 23974 -233998 86408 -203159
7225 219645 68153 148567 -290013 -30357 97121 -131197 43672 -198608 -60646 -37495 157209
7213 -107301 38322 -15040 116735 -405538 -189370 -104261 -4046 -140347 156981 93316 -189568
7201 -33687 -87973 -131677 -6911 -15273 -219636 -85944 19390 83326 -6858 391989 221721 252651
7189 252651 -198629 55596 -96233 -54452 -79196 -106822 263262 -239544 -168336 26747 31882
7178 31882 -328775 -62032 -86175 -9891 -20211 -75234 -66752 215161 -14334 -338714 171999
7166 -295769 27243 -168473 -99582 -342177 55723 -248530 259579 -71191 -69123 60467 255925
7155 255925 -136849 -90060 -228524 -152997 13460 -132271 119403 7372 160924 -6946 187399
7143 181347 98922 -100603 -79093 -58526 -167063 10756 42435 -427063 149061 -135992 -71478
7132 -71478 -78532 -229814 2214 -50412 10966 -259114 -28846 -11588 44677 118041 183432 2453
7119 -160163 263012 -406190 -163930 -29400 10270 -80005 58206 -76792 -68380 31367 108208
7108 108208 147389 85902 -24492 106534 227516 -99717 -24486 -16575 -11869 -118473 -75342
7097 -75342 -249121 -115468 16223 -151284 -284354 200281 -225499 -223182 -52739 -88449 -240014
7086 -240014 -4681 -176197 -50009 58803 -215482 -212080 24649 194880 50163 83924 -36370
7074 203487 -103238 -215866 -72327 32864 -204016 241479 -337476 490949 106891 -42838
7063 64933 -40138 307322 63525 91360 2938 -171896 67657 -120379 -275687 -51778 -127666
7052 -127666 -110413 -47351 192907 134622 194186 85922 51634 21998 -52366 7505 -212236
7040 -46840 -11605 -54436 -28586 -149134 -225118 -51039 -27929 195886 130348 275811 4311
7028 -209529 103879 287538 -340172 -321780 169600 55664 92301 9563 127439 14302 86879
7017 86879 22251 144176 82826 -70390 243761 67365 -508152 -74051 -141619 47562 -118133
7005 194576 -77952 72980 -444645 177821 -280021 -96050 -2031 59949 -97669 -114913 275358
6993 -92407 42728 -42804 2722 -67269 -83561 299219 -124293 -80194 -71701 -66244 170194 -425030
6980 39921 -76970 -16874 -162595 -83123 -214960 131416 50891 40471 -49224 -208938 170906
6968 -18843 208085 156011 18696 97382 -28720 224977 -213215 -305522 -117134 242504 266351
6957 266351 142289 -84350 -86735 -77838 179892 5441 4758 -106332 -179426 -153221 49328 -34112
6944 -73921 -131312 -154401 320519 -56124 64029 -202911 -264154 -422291 242948 -240962 94390
6932 -149171 61362 48820 -13966 146085 41474 -120334 -107625 25790 -186995 -144810 262731
6920 -139806 -310865 -349982 -183485 65434 149866 -29654 -197036 -182846 150079 91207 212412
6909 212412 102956 -87839 -104389 3831 82951 29021 53550 2568 24513 -204432 -102042
6897 -264428 212264 -78427 54155 -78621 -115507 -40411 122927 171627 4374 57977 -295532
6885 -157949 -158310 147647 -84023 -26653 -64936 84326 151923 -159614 56546 114237 71302 -242782
6872 189383 108048 -201431 84938 -63664 39456 -78176 -258101 -12435 -82916 -180566 -211053
6861 -211053 34690 -106562 -285829 34134 260647 192315 -55537 -158677 -104389 -89323 -24091
6849 -221107 -140939 -18347 55688 178855 -67378 52126 -523126 208835 19388 -231043 113436
6837 -237506 -146916 54059 256985 278046 -201738 93523 83506 -120820 1183 84889 -217320
6825 -12804 -514317 146729 -205712 -92080 46504 201306 5511 113907 -23535 -110503 -2082
6813 114240 -108761 -91734 39924 61133 15442 -23536 175288 -9738 -45493 -164178 -154833
6802 -154833 -22012 234531 16498 138816 256886 138055 230636 260515 -137697 53362 255897
6791 255897 -182164 -125744 195804 47366 194102 220626 -118282 15210 304461 75797 126272
6780 126272 -45265 -88000 1417 -194153 121674 236232 52477 -251808 -110645 -73404 -56085
6769 -56085 163089 -187020 -107344 -111543 275784 51341 -420924 -440244 9043 -7969 -201670
6758 -201670 83954 36017 -128280 -100981 10644 37937 -257631 -128432 157668 2845 -107760
6746 -53791 -70834 271371 106322 -107997 69436 355464 -70918 -90504 -129759 -210077 -79448
6734 -173186 219972 -69019 -261865 370 161700 36209 -180358 -2972 -191140 127931 -135531
6722 296246 -112146 -22245 87399 -85662 131764 -13403 -52567 -122751 -17766 -2840 313726
6710 -343576 -120622 -36259 -82200 92053 59 -3478 -193345 47183 -224057 -94929 135177 148111
6698 148111 -60397 -301207 -138845 84125 -9670 204125 93207 44347 -211916 8205 -182057
6686 -36970 -29487 -200308 140719 338621 42630 -124104 -331337 192535 -96337 -7341 -82252
6675 -82252 101773 -143149 54823 23335 -53497 -6008 -25748 -254168 -189736 -70626 -180314
6664 -180314 76693 -59498 -34772 -126961 -102852 56932 66388 -101316 -37061 -50598 94345 -13028
6651 -189599 -49470 62090 14844 48571 174858 -145927 19267 -304772 154907 220792 -43619
6639 241126 -41855 -427075 90574 -202847 -107122 -131814 -71600 -92850 -149816 -65736 175435
6627 140642 -4042 37585 163805 363636 178929 -126189 -243765 33729 -146728 54668 48713
6616 48713 245109 -26167 214348 123650 -77559 -157172 219127 -37271 -195326 -276761 -66511
6604 102627 74349 133030 145944 -364128 -251304 84140 137262 96991 99960 40224 -114109
6592 -520503 -113359 -82522 -366791 35645 -67987 -114885 254307 48334 -200824 43682 -216618
6580 13791 -89590 112862 -74310 123178 -3285 -10501 4805 -245980 43359 67645 185719 228374
6568 228374 16185 -96393 -61086 -218720 -60637 37290 -55856 -163044 110910 -26969 234860
6556 -256787 76708 -45995 -284667 56844 179909 -70220 192024 -30442 -250087 -120372 162347
6544 -99274 198559 -118165 -85698 -23623 -39862 30254 -121712 -234136 -53265 316499 -433193
6532 41535 120838 -266098 155480 130918 22635 -154675 52541 -303997 47399 119574 -118724
6520 -92364 58736 1832 -23769 94780 9048 -126514 42037 43890 -372247 143098 30774 -179105
6507 -154287 -66576 -28891 -108698 -45666 -24803 131479 -99701 -122572 371014 -141681 -102745
6496 -102745 -30509 196852 -76449 -7861 290108 415480 -677956 -101013 -260277 170236
6485 4422 -223029 -27473 -409460 308835 -66888 -117620 -81939 -65536 321653 26685 -179841
6473 -113494 -291811 373221 -181971 -10019 -173259 236463 -266397 -82238 179711 -190326
6462 -46557 -136634 -15451 -438724 -46979 79225 -202067 36436 340221 164878 -76708 -333845
6451 -333845 133083 90272 148551 290992 -68218 -59608 40105 -28097 -27664 218473 94159 170904
6439 170904 255907 -82360 47813 -364029 -11287 -245987 283118 -9381 -7852 238247 -61279
6427 34350 -41070 283873 -134376 47037 164903 43556 39459 -105098 -144699 165569 45713
6415 -70758 110686 92182 170354 28714 109315 274714 -125582 -380138 67316 -93110 303351
6403 -251146 220416 257727 118563 81818 154738 192389 89072 -351652 -94076 -117423 -63845
6392 -63845 82434 -28078 318549 50038 -114823 -182991 260566 236713 -12015 330090 317902
6381 317902 -23651 10345 377815 -191782 -198669 234041 44330 -119423 -23894 -46183 5075
6369 -311822 -1765 -129068 87734 -228661 73913 -60492 -191161 196926 -8022 -61138 51802
6357 -133560 -83482 139682 90706 -132464 29246 -32284 -267660 -79602 345118 35421 103723
6346 103723 117948 238044 148207 -102349 33558 51506 208113 219522 -233849 -107197 84246
6334 -32334 -196887 49489 -254742 -26176 -304875 -57928 -173847 -137503 -280953 284757 -97784
6322 -331421 75843 -278563 -128766 92287 -249596 -125899 91907 -100956 -73376 135399
6311 71596 6399 111441 -93331 -70747 60133 -244510 -29960 44570 -144101 351876 -102312
6299 65026 -93638 -121379 -265884 -24098 -18715 -96224 120813 67659 -36819 -375803 -49440
6287 -39033 112814 59007 234190 52813 78275 137607 -224494 134201 -477958 315885 12438
6275 -168629 -44918 11794 -180270 -61108 1631 169149 149474 -60760 134600 64249 -12794
6263 -89675 202371 -82614 -393768 9764 -186061 -6253 -331915 -564630 -125765 -77411 -199808
6252 -199808 3011 45479 58193 -344898 -69505 -90285 288594 224401 -51425 103830 244919
6241 244919 -43676 55173 26198 -92300 216415 -220090 164045 29987 146584 -212283 48705
6229 17787 135543 117777 157244 -33518 -125072 -54123 -9459 -71983 -140965 -21970 85572 -51138
6216 -129037 -98251 -111618 61546 -283938 -327323 -257392 -262137 15023 -139384 9464 -193527
6204 195039 37003 -171162 139662 111336 -446856 281450 69513 -275932 218814 90528
6193 7328 133426 -82915 -33982 146769 -68541 -29267 -17326 120256 -199692 48542 -38007
6181 -41386 177326 -110244 -157036 5421 26335 -196017 250381 144603 147467 -11843 327715
6169 -343859 -115401 219999 77960 -158085 -53476 223465 -36033 13217 -95376 -62764 134162
6157 -29900 -172006 200194 -48812 -257423 130666 -73090 -441876 80370 34579 -68126 122201
6145 158921 -178154 -43738 108845 5916 72961 322476 -4033 -76766 300481 -71059 175011
6133 -192465 -219088 -255682 84190 70007 41765 51880 -47214 107866 302963 115010 64387
6122 64387 37805 50122 70289 -77168 79394 22073 121221 -82743 -13480 107854 199023 225962
6110 225962 45950 -398085 -238305 179093 -202293 111566 22062 -108192 26132 210355
6100 210355 334220 44675 23565 25589 37511 -22825 -56568 28570 38986 144367 -115644
6088 49948 159226 -224843 50881 -34021 -331005 -216490 199616 168875 -248392 -251372 76606
6076 179562 179362 -118768 -231957 -41849 15420 -127606 179445 -241032 -96335 -265815 -117016
6064 10948 -48287 -368335 122478 -8088 29899 -35292 -29896 -121325 134134 123366 -229525
6052 -69763 113752 138908 336915 184971 137150 37636 -161956 -52885 -76034 219406 -167089
6040 -296632 -134816 -327377 -1262 116462 60923 229283 107969 104474 -130650 35101 -16533
6028 -249542 -53908 101439 38390 259076 63909 106565 -30784 188764 -72069 -124339 -112421
6017 -112421 -306029 10955 -138503 61863 -26219 224081 42275 185025 293227 126082
6006 395464 -327454 -43867 210394 334061 136949 -216995 -111832 -152121 -42411 192477
5995 -46641 -101836 216982 -219605 -70414 -141297 28916 -43553 229124 28273 235004 105380
5983 22385 61863 -25440 104917 -307230 159482 117497 39247 -283703 -81367 178786 -230562
5971 -77182 101753 -65290 -26069 -55550 -230499 -246242 -327010 -207980 35908 -34017 -224491
5960 -224491 -206910 -221340 -197257 42827 31162 -280349 153519 -140693 -88411 72988 25205
5948 -159102 47471 -355242 -158712 -61675 66736 -92318 -179919 13654 -80000 90940 312278
5937 312278 -123357 -66881 -10873 17062 -121397 -206705 448321 -2283 -149777 175652 33638
5925 112787 -198928 268683 -121160 124044 -323018 -275272 334082 -4993 322007 -280041
5914 26357 -119034 36734 -36125 73549 -163309 75517 36824 -186023 -64938 -216308 -7723
5902 245440 -187219 -169887 -120200 -167565 -290228 31852 -235425 61707 -259558 -120882 379002
5890 -19293 115579 -28300 -66235 -9663 -117012 -80041 -55482 -147314 -562 261071 387427 -33516
5877 83498 279368 -134885 31819 185628 -177169 -98660 22362 61681 -134179 -442819 -33662
5865 124778 -101957 117232 -289538 -113269 307543 -92566 -326734 12407 -35164 -55587
5855 -55587 -149713 182325 47372 4394 -100156 -296851 -50046 -162558 23858 19716 24097 48338
5843 48338 94969 -38997 -112828 -239820 69655 -163102 91405 -18002 78971 -134997 263630
5831 -230543 -171146 -128202 -184016 -105850 -10478 371181 361405 84820 101601 485075 70626
5819 -219878 15038 -152791 9341 -24249 -310071 43827 -96221 -17743 -246305 -166015 233498
5807 67659 240476 37685 45916 -149018 198669 -82961 -159045 4250 -18886 94312 149702 -311957
5794 -67674 3101 -90582 -113822 226894 -85162 18806 -31129 -31690 137142 188968 -165697 -194053
5782 -194053 -63496 -41720 289833 128181 -94736 -129096 101498 -92694 -38997 -104737 -65994
5771 -65994 179963 364863 -224468 -108209 -148239 -250762 -26176 -24931 235790 425097 -246512
5759 -192227 -455549 117450 -60058 -109653 -193344 224774 33064 -152630 279857 36904 -161705
5747 -115551 -34908 -68402 -86162 134620 14930 14089 -38003 15848 -199256 2737 -19788 -398857
5735 -398857 127154 -213955 213039 -15353 34924 -160171 171264 -61864 -399260 -9926 386361
5723 122831 90933 -6108 92235 139557 93768 165086 -15956 -276133 -494921 -154836 -227562
5712 -227562 161218 -291218 90125 188678 4265 -70819 122839 25179 -134461 -85672 -132162
5701 -132162 -120206 285840 23471 6645 -459613 -169952 261582 140250 -61208 186067 162874
5690 162874 -94496 -321279 -177526 -109863 83097 23609 271249 -38453 -47727 -151387 20457
5678 169181 8051 29767 53195 -130556 -284273 181796 110513 -168520 -34141 154331 -243050
5666 -7994 165870 182977 72675 235568 59327 -97333 -200374 -170963 73721 74637 -177156 218313
5653 257918 -244043 370974 47147 -12361 -25558 -7231 -119330 193832 -222417 -117010 96440
5641 112013 245840 -75761 177599 65749 -82277 20583 177192 263802 119900 -147045 61143
5629 135714 -9320 -196388 177388 303625 47291 -206320 -281284 168531 -61772 -245126 2745
5617 56924 3351 -105221 369577 -71526 154957 -145526 73311 -312070 9621 -30674 207791
5605 33651 243629 5634 252194 107999 42046 46519 -40620 75709 -275495 -86835 -116219
5594 -116219 -79853 -4507 -126595 120451 -150756 -170718 -214857 19483 232638 73371 -126147
5582 155272 127133 -52600 -12510 76142 129579 353106 221046 214551 -78061 -295194 -153313
5571 -153313 146309 104546 149032 94221 343416 -157854 -9659 -64802 -466439 -130858 -329874
5560 -329874 -244249 -35776 173887 -65502 245145 -8852 -260008 -183890 193308 -120777 3796
5548 5538 125752 -237930 -324116 -229510 -87383 -87787 120201 143536 230790 188256 93570 -18176
5535 278995 -195251 162296 119040 107797 3887 -244698 205182 -29129 -232816 264 33011
5524 33011 -122629 -242489 -12674 34327 -306694 94500 91113 213339 223348 277204 59898
5512 -81941 -185761 11823 157996 40913 61009 216985 23240 32325 46136 -23372 -175911
5501 -175911 245463 221756 -172070 61158 90441 15345 238725 184652 -136422 287353 -111283
5489 278533 -11316 426448 -50704 58288 -145511 -58168 -287592 11730 3700 -110652 -8600
5477 220630 -269046 189678 -102570 77676 4845 -56409 130627 -103311 -208685 100129
5466 75031 -66659 -148661 110640 14235 -216177 351884 -418379 -87473 -147604 -79278 -178256
5455 -178256 -19639 -22828 275063 91962 -191956 -44054 -130911 -120044 -44586 -183176 35816
5443 95093 -33997 -280854 88878 -22669 16737 121039 -115263 -136250 -145535 253706 48574
5431 -53533 -15973 128556 -296988 131637 -235929 -51358 -278882 22572 109333 138078 -140476
5419 258951 146094 165729 327023 -48683 -31114 43451 60576 -151880 -116578 301013 -488265
5407 144717 61114 26683 248651 -228779 -374663 295471 -82978 79828 9251 -99586 2167
5395 -26291 306944 28752 78751 102970 16973 361869 -190568 181299 334856 -47177 -334842
5384 -334842 22145 334497 -232515 -241149 272141 84426 -93114 -167557 1237 42723 83477
5373 83477 -239693 -329290 312250 -80208 82611 71338 -40408 21667 -197108 256361 319230
5362 319230 -48246 191572 110066 -145829 -81724 -45125 101120 -295172 198026 -137028
5351 156490 62711 -125932 -268539 -156421 -3794 148029 79213 -84763 80033 -100372 -80870
5340 -80870 280671 -2863 -270846 -119882 -76889 99375 -76889 55691 252948 -97351 167642
5328 -50727 236619 222274 152544 -8067 208823 174554 -242402 -367821 182935 153273 245142
5317 245142 -115888 113579 -117589 -2011 -73768 -60420 -124833 -112180 -188460 146808 203743
5306 203743 -366401 72476 24343 -20294 -15172 -166821 412854 155502 5138 55445 -280113
5294 112305 -76765 -97873 -189549 -209886 -595217 231974 -51166 -240209 -75372 101968 174558
5283 174558 -235185 246010 -65851 260831 -384761 65847 204316 38346 435618 -54923
5272 -12623 -236607 -128549 -317728 -24875 -60004 87906 -27200 -236529 97455 -177214 -234439
5261 -234439 126562 92874 65573 -131161 -102110 -44906 206342 21380 105086 -138448 14809
5249 199537 -19145 -158848 -141226 -179853 213457 146058 66401 237329 43350 115865 -181572
5237 -95318 10475 228324 -211734 8428 348397 -207434 -261855 71248 -42643 -41448 2567 186371
5225 186371 -33408 129755 90074 53118 23460 -149689 50640 287796 -80552 -302859 92971
5213 186515 134140 -280992 -143360 35497 13040 -163512 -232064 -92045 -41072 52624 -62016
5201 -52227 -258272 7350 -106738 187884 -333924 286623 60321 -323501 -49734 -20093 160916
5189 9078 13509 40510 119801 225514 81529 -277312 210250 -121242 451645 -221051 3676
5177 -6266 198847 170776 -92444 -87487 -105138 32282 -45679 167704 47790 168237 -158549
5165 52611 204617 27159 85516 -87763 2896 100143 236489 160725 -168930 -193526 -414358
5154 -414358 -263406 30492 -41188 46048 -509053 153312 76315 173326 117933 -118417 120892
5142 46033 -41182 -138374 -74233 64015 -296391 214226 -93176 19329 -246188 183145 -128959
5130 2954 128025 48904 -62140 -104810 -75283 125763 -49879 457845 30235 -5614 215772
5118 248065 -183930 -51036 -227205 28480 104233 -280924 143499 185203 119759 274117 72825
5106 -45913 -82921 220945 -26096 109229 -117675 144905 -66447 170779 -188875 47912 -251537
5094 251293 -138522 29778 39823 -15617 180700 357965 75256 -202092 -26970 -44668 -218593
5083 -218593 235759 5989 77968 -25828 90128 118781 179693 -206923 54203 -139074 -149268
5072 -149268 172624 286793 -69114 -121588 -78671 81043 -342285 286192 -91219 344086 276567
5061 276567 100871 185567 -99131 -16892 105097 41578 208616 23188 -96062 -142905 -63224
5049 201405 251131 129632 294054 64470 161048 136562 -430465 48865 -368485 -195806 -168899
5038 -168899 72365 -22037 -337073 -103506 244356 -77195 401601 -171590 17691 -71454 -66815
5027 -66815 130346 2710 201600 309085 -52465 -78957 -186800 24574 335800 -302895 95942
5015 -95491 -58759 176045 91790 -178869 -131016 3960 -364556 217410 -40822 -123508 -20907
5003 9406 529503 -219432 -17996 -170479 -192210 -20536 -268107 31431 181556 91485 -54419
4991 -207057 10960 252375 -139588 69477 334930 -405078 -85157 -15936 -128217 217228
4980 207821 382077 44264 -22949 14340 254820 -44027 -300207 -97342 132201 72141 36060
4968 -151494 1913 110819 70672 300 205346 -267998 315802 -233997 -148001 -72359 198583
4956 -63819 -30849 -219924 -98524 190701 -67314 53019 -154270 125016 288103 28143 6256
4944 105233 -33416 -163114 -437328 14203 244142 -69459 -154124 74299 471635 182041 -187501
4932 215991 -17136 112719 16059 31095 222215 261105 -267394 308754 86479 -2552 -92678
4921 -92678 -157678 -158226 232874 -80816 -36004 234460 -17752 136387 234113 330681 344435 -202818
4908 158166 51258 -179309 -89538 66860 228580 -130734 -47937 335556 285898 -52017 190158
4896 54099 -39839 9112 -305278 32696 72986 390943 -221604 66860 225763 -184144 -59343
4884 -12494 19804 185900 122850 -147684 -51132 71798 138310 236886 121797 144361 -183975
4872 -107940 -180467 79867 426939 -177399 94049 118825 136856 -89206 26501 243125 -187510
4860 -195732 32344 -16169 230414 82777 84185 -265338 19379 102424 -216346 -41148 -84561
4849 -84561 34198 29124 253096 363616 104403 -185623 -282442 259642 -222300 17198 -183639
4837 163156 159165 72606 -55094 200059 -26806 -230373 67137 -57567 -177953 -56630 161697
4825 -246484 -12123 62356 268039 -110949 79305 133159 -27256 -76795 -17325 167320 -90300
4813 21744 27290 20709 -231006 -108424 9292 -34523 -359898 73010 73058 192333 -216934 -44162
4800 91152 203369 16244 -78661 107876 115825 61319 33223 -293300 -95644 -107584 -295284
4789 -295284 -17016 44473 120530 227880 104456 110429 -81501 -248698 -58240 -131066 -45558
4777 256269 19584 187728 143541 58197 -9739 15494 13652 102877 297958 -104087 -45215
4765 -211153 216996 -106645 70623 -63830 -85580 -77583 346438 -233154 -172448 -215807 -339105
4754 -339105 -149092 229332 -120444 85060 -182369 32526 -49580 179449 75835 20317 -163116
4742 -199740 -190125 218028 -120982 -99236 -31195 -102597 -12459 -211 -97981 394690 115199
4730 -144176 -77991 -153912 -84663 59949 164747 33301 -173374 247636 -56312 -73259 276670
4718 -41450 -135678 -53853 7509 -86711 28392 280222 166100 176026 -9573 -113939 105301 309899
4706 309899 414825 2392 218316 -69082 6003 64721 86374 310742 -79646 -15969 -42761
4695 -42761 -200094 38507 -300537 225205 -85236 150964 -127427 260984 -172584 -257144
4685 -257144 -227225 170318 -275545 -249610 9446 111978 237596 138127 34154 -445038 -10302
4673 -126062 267420 184053 138440 22999 -93870 -89361 90257 189756 -64926 -288137 -191985
4662 -191985 -159425 408986 266271 -129676 253436 148666 173231 15567 232008 278035
4652 278035 102937 80485 35028 -245466 -145027 -168886 -69846 43037 -20816 154463 52061
4640 -169183 27034 98277 250222 -183731 65487 204549 245903 159820 -76011 106761 -113790
4628 64084 48252 -356767 249191 18285 -226072 -4894 -324356 111370 -45277 29039 203671
4617 203671 -242743 -529642 61876 16414 136618 -8726 -311308 -17356 -32618 -37896 140280
4605 112688 169312 -204168 17231 175797 -78826 66961 -136437 -49162 285830 -6781 -18910
4594 -18910 -47107 -127487 293929 250901 176286 222466 199916 128721 -99245 138812 -151759
4582 231337 -84252 -127995 -145696 1437 69957 -77759 251647 79589 -176861 161196 216888
4571 216888 -207303 -101379 294503 58285 -115123 30402 -2710 -198034 -176025 53044 99311
4560 99311 85228 246541 -365990 -111332 -179819 55730 -156487 -174067 100898 196562 -85007
4548 -18809 -39180 144900 -257407 -276023 -20363 -114767 -100516 449261 19992 119422 -61670
4536 176326 -275774 -145277 -178106 156317 -30214 152195 175105 108683 192648 30636 46006
4525 46006 218231 -232807 -189521 -176327 196197 -138545 -100622 -225018 -104509 -60141 -1310
4513 37245 -152045 177284 -70718 149265 -102767 49124 -170850 -86366 -174538 -31240 -79564
4502 -79564 84594 148790 297791 -96297 35565 3816 113754 129529 -92352 -17356 211669
4490 -124204 15221 86044 46805 69122 156821 -57793 -59801 287370 736 15130 -5313 321804
4477 -11058 131107 -170501 154022 207568 128398 109554 49735 -19971 -247264 -83596 268237
4465 135689 146610 -69803 70080 97309 150560 -199314 -104839 -192582 260807 -51227 5819
4453 74069 -255940 -205951 -192422 -47405 188249 509998 138872 62570 52128 -353112 -50380
4441 20900 141058 -69663 -256002 15481 -82115 183920 22708 359600 46432 81357 -118236
$$ [...]
##END NTUPLES=NMR SPECTRUM
##END=
