##TITLE=NES1064_ptc160_9883234_A9gzNZVP0y
##JCAMPDX= 6.0         $$ Bruker NMR JCAMP-DX V2.0
##DATA TYPE= NMR SPECTRUM
##DATA CLASS= NTUPLES
##ORIGIN= BRUKER
##OWNER= Administrator
$$ 1.72 TOPSPIN		Version 2.1
$$ 2016-08-27 01:56:51.023 -0500  Administrator@X
$$ Compression mode = diff/dup
##.OBSERVE FREQUENCY= 400.02188249412
##.OBSERVE NUCLEUS= ^1H
##.ACQUISITION MODE= SIMULTANEOUS (DQD)
##.ACQUISITION SCHEME= undefined
##.AVERAGES= 64
##.DIGITISER RES= 22
##SPECTROMETER/DATA SYSTEM= spect
##.PULSE SEQUENCE= noesygpps1d.comp
##.SOLVENT NAME= COFFEE_meoh
##.SHIFT REFERENCE= INTERNAL, COFFEE_meoh, 1, 14.96066
##AUDIT TRAIL= $$ (NUMBER, WHEN, WHO, WHERE, PROCESS, VERSION, WHAT)
$$ ##TITLE= Audit trail, TOPSPIN		Version 2.1
$$ ##JCAMPDX= 5.01
$$ ##ORIGIN= Bruker BioSpin GmbH
$$ ##OWNER= Administrator
$$ $$ E:\/data/COFFEE/nmr/NES1064_ptc160_9883234_A9gzNZVP0y/22/pdata/1/auditp.txt
$$ ##AUDIT TRAIL=  $$ (NUMBER, WHEN, WHO, WHERE, PROCESS, VERSION, WHAT)
(   1,<2016-08-27 01:56:45.867 -0500>,<Administrator>,<X>,<go>,<TOPSPIN 2.1>,
      <created by zg
	started at 2016-08-27 01:45:15.242 -0500,
	POWCHK enabled, PULCHK disabled,
       configuration hash MD5:
       21 0F 79 D6 B3 7B B4 F6 88 20 88 DB 03 48 BD 9F
       data hash MD5: 64K
       35 C6 32 DA 72 82 95 34 69 5E B6 43 E7 75 A4 89>)
(   2,<2016-08-27 01:56:48.961 -0500>,<Administrator>,<X>,<proc1d>,<TOPSPIN 2.1>,
      <Start of raw data processing
       efp LB = 0.3 FT_mod = 6 PKNL = 1 PHC0 = 0 PHC1 = 0 SI = 128K 
       data hash MD5: 128K
       8B A8 83 D3 DB A5 E4 77 C7 57 5A 5B 86 15 1F 03>)
(   3,<2016-08-27 01:56:49.836 -0500>,<Administrator>,<X>,<proc1d>,<TOPSPIN 2.1>,
      <pk PHC0 = -82.03491 PHC1 = 0 
       data hash MD5: 128K
       DA E6 B7 8E 88 F8 F1 3E E7 EC E3 56 E4 95 81 37>)
(   4,<2016-08-27 01:56:50.195 -0500>,<Administrator>,<X>,<proc1d>,<TOPSPIN 2.1>,
      <abs ABSG = 1 
       data hash MD5: 128K
       DB 79 E6 D3 CA 81 0E D7 AF FA 8D 05 0C 62 F6 D8>)
(   5,<2016-08-27 01:56:50.304 -0500>,<Administrator>,<X>,<proc1d>,<TOPSPIN 2.1>,
      <abs ABSG = 2 
       data hash MD5: 128K
       75 29 25 C3 DD 1A EA 43 97 5A 78 55 63 F6 C7 27>)
(   6,<2016-08-27 01:56:50.398 -0500>,<Administrator>,<X>,<proc1d>,<TOPSPIN 2.1>,
      <abs ABSG = 3 
       data hash MD5: 128K
       A8 DE 36 49 67 CC 81 AA 0E AB A8 4F F2 B4 0A 0C>)
(   7,<2016-08-27 01:56:50.476 -0500>,<Administrator>,<X>,<proc1d>,<TOPSPIN 2.1>,
      <abs ABSG = 4 
       data hash MD5: 128K
       09 24 AA B7 15 27 7A 1C BB 8E C1 54 D6 5E 66 94>)
(   8,<2016-08-27 01:56:50.570 -0500>,<Administrator>,<X>,<proc1d>,<TOPSPIN 2.1>,
      <abs ABSG = 5 
       data hash MD5: 128K
       CC 91 E9 24 F6 6C 78 E0 C4 EB 9D 3D 44 AD 2D 0B>)
$$ ##END=
$$ 
$$ $$ hash MD5
$$ $$ 74 5C 53 79 C1 2D 21 0A 27 BC 68 61 84 9C D6 C4
##$RELAX= 
##$RELAX= 
##$RELAX= 
##$RELAX= 
##$RELAX= 
##$RELAX= 
##$RELAX= 
##$RELAX= 
$$ Bruker specific parameters
$$ --------------------------
##$DU= <E:\>
##$EXPNO= 22
$$ [...]
##$TP07= 0
##$TPNAME0= <>
##$TPNAME1= <>
##$TPNAME2= <>
##$TPNAME3= <>
##$TPNAME4= <>
##$TPNAME5= <>
##$TPNAME6= <>
##$TPNAME7= <>
##$TPOAL= (0..7)
0.5 0.5 0.5 0.5 0.5 0.5 0.5 0.5
##$TPOFFS= (0..7)
0 0 0 0 0 0 0 0
##$TUNHIN= 0
##$TUNHOUT= 0
##$TUNXOUT= 0
##$USERA1= <user>
##$USERA2= <user>
##$USERA3= <user>
##$USERA4= <user>
##$USERA5= <user>
##$V9= 5
##$VALIST= <valist>
##$VCLIST= <CCCCCCCCCCCCCCC>
##$VD= 0
##$VDLIST= <DDDDDDDDDDDDDDD>
##$VPLIST= <PPPPPPPPPPPPPPP>
##$VTLIST= <TTTTTTTTTTTTTTT>
##$WBST= 2048
##$WBSW= 25
##$XGAIN= (0..3)
0 0 0 0
##$XL= 0
##$YL= 0
##$YMAX_a= 5894698
##$YMIN_a= -11076141
##$ZGOPTNS= <>
##$ZL1= 120
##$ZL2= 120
##$ZL3= 120
##$ZL4= 120
##$ABSF1= 14.96066
##$ABSF2= -5.597522
##$ABSG= 5
##$ABSL= 3
##$ALPHA= 0
##$AQORDER= 0
##$ASSFAC= 0
##$ASSFACI= 0
##$ASSFACX= 0
##$ASSWID= 0
##$AUNMP= <proc_prof1d_extract.lims>
##$AXLEFT= 0
##$AXNAME= <>
##$AXNUC= <1H>
##$AXRIGHT= 0
##$AXTYPE= 0
##$AXUNIT= <>
##$AZFE= 0.1
##$AZFW= 0.1
##$BCFW= 0
##$BC_mod= 0
##$BYTORDP= 0
##$COROFFS= 0
##$CY= 15
##$DATMOD= 1
##$DC= 0
##$DFILT= <>
##$DTYPP= 0
##$F1P= 0
##$F2P= 0
##$FCOR= 0.5
##$FTSIZE= 131072
##$FT_mod= 6
##$GAMMA= 0
##$GB= 0
##$INTBC= 1
##$INTSCL= 1
##$ISEN= 128
##$LB= 0.3
##$LEV0= 0
##$LPBIN= 0
##$MAXI= 10000
##$MC2= 0
##$MEAN= 0
##$ME_mod= 0
##$MI= 0
##$NCOEF= 0
##$NC_proc= -2
##$NLEV= 6
##$NOISF1= 0
##$NOISF2= 0
##$NSP= 0
##$NTH_PI= 0
##$NZP= 0
##$OFFSET= 14.96066
##$PC= 1
##$PHC0= -82.03491
##$PHC1= 0
##$PH_mod= 1
##$PKNL= yes
##$PPARMOD= 0
##$PPDIAG= 0
##$PPIPTYP= 0
##$PPMPNUM= 2147483647
##$PPRESOL= 1
##$PSCAL= 4
##$PSIGN= 0
##$PYNMP= <proc.py>
##$REVERSE= no
##$SF= 400.020009771531
##$SI= 131072
##$SIGF1= 0
##$SIGF2= 0
##$SINO= 400
##$SIOLD= 131072
##$SPECTYP= <>
##$SREGLST= <1H.CDCl3>
##$SSB= 0
##$STSI= 131072
##$STSR= 0
##$SW_p= 8223.68421052631
##$SYMM= 0
##$S_DEV= 0
##$TDeff= 65536
##$TDoff= 0
##$TI= <>
##$TILT= no
##$TM1= 0
##$TM2= 0
##$TOPLEV= 0
##$USERP1= <user>
##$USERP2= <user>
##$USERP3= <user>
##$USERP4= <user>
##$USERP5= <user>
##$WDW= 1
##$XDIM= 131072
##$YMAX_p= 378368935
##$YMIN_p= -11120
##$CURPLOT= <Network HP LaserJet P1505>
##$CURPRIN= <$Network HP LaserJet P1505>
##$DFORMAT= <normdp>
##$LAYOUT= <+/1D_H.xwp>
##$LFORMAT= <normlp>
##$PFORMAT= <normpl>
##$SURQMSG= 1
$$ End of Bruker specific parameters
$$ ---------------------------------
##NTUPLES= NMR SPECTRUM
##VAR_NAME=  FREQUENCY,     SPECTRUM/REAL,   SPECTRUM/IMAG
##SYMBOL=    X,             R,               I
##VAR_TYPE=  INDEPENDENT,   DEPENDENT,       DEPENDENT
##VAR_FORM=  AFFN,          ASDF,            ASDF
##VAR_DIM=   131072,        131072,          131072
##UNITS=     HZ,            ARBITRARY UNITS, ARBITRARY UNITS
##FACTOR=    0.0627417313425164, 1,          1
##FIRST=     8223.62146879497, 1818,         -51845
##LAST=      0,             3796,            -52070
##MIN=       0,             -11120,          0
##MAX=       8223.62146879497, 378368935,    0
$$ Real data points
##PAGE= N=1
##DATA TABLE= (X++(R..R)), XYDATA
$$ [...]
61848E20958K6148K8389L0745L3112L5235L6671L6769L5240L2714L0086K7274
$$ 520958 547106 575495 606240 639352 674587 711258 748027 783267 815981 846067 873341
61837H73341K3268J7604J1135N052k84n050r006j1538j2415j1995j0707q725o056
$$ 873341 896609 914213 925348 930400 930116 925066 916060 904522 892107 880112 869405 860680 854624
61824H54624k678J383N840J0111J3634J6152J7492J7367J5690J2784R012M283
$$ 854624 851946 853329 859169 869280 882914 899066 916558 933925 949615 962399 971411 975694
61812I75694j664q598j5735k2300k7836l2036l4670l5735l5548l4585l3333l2077
$$ 975694 974030 965432 949697 927397 899561 867525 832855 797120 761572 726987 693654 661577
61800F61577l0632k8516k5678k2921k1105k0050j8697j6468j3986j2233j1350
$$ 661577 630945 602429 576751 553830 532725 512675 493978 477510 463524 451291 439941
61789D39941j0648r574q324p492p364p659p839p596p011o286n502m713m153m064
$$ 439941 429293 419719 411395 403903 396539 388880 381041 373445 366434 360148 354646 349933 345780 341716
61775C41716m300m343l874l142k700k742k942k826k308j720j401j353j343j237
$$ 341716 337416 333073 329199 326057 323357 320615 317673 314847 312539 310819 309418 308065 306722 305485
61761C05485j038o86q5O86J347J730J805J443N25n30q50j83N80M26m37r19m89
$$ 305485 304447 303761 303676 304362 305709 307439 309244 310687 311212 310682 309832 309649 310229 310655 310218 309299 308810
61744C08810L94J170J724J905J379L50l31k26L8k38p12n69J92Q30J013J100J296
$$ 308810 309204 310374 312098 314003 315382 315732 315401 315175 315213 314975 314263 313694 313886 314716 315729 316829 318125
61727C18125J328J175J418K457L791M553M452L914L507L529L957M517M847M848
$$ 318125 319453 320628 322046 324503 328294 332847 337299 341213 344720 348249 352206 356723 361570 366418
61713C66418M772M821M795M342L435K409J543Q53K46l59r92j611k116k569l236
$$ 366418 371190 376011 380806 385148 388583 390992 392535 393388 393634 393275 392283 390672 388556 385987 382751
61698C82751m203m983m865l753k430j845k189k903l330l278k923k433j823j171
$$ 382751 378548 373565 368700 364947 362517 360672 358483 355580 352250 348972 346049 343616 341793 340622
61684C40622p94r86j576j998j911j576j435j556j739j975k352k588k232j348n43
$$ 340622 339828 338842 337266 335268 333357 331781 330346 328790 327051 325076 322724 320136 317904 316556 316013
61669C16013j40R7K51q0r62j585j219k88K83M34P91J326J252M29j94N5O27P72
$$ 316013 315873 315970 316221 316141 315179 313594 312375 312087 312370 312804 313595 314921 316173 316602 316408 316463 317090 317862
61651C17862P55J316K407L304L625L518L088K470K284L178M734N592M945L435
$$ 317862 318617 319933 322340 325644 329269 332787 335875 338345 340629 343807 348541 354133 359078 362513
61637C62513K281K004K226K293J772O57o17j503j896k237k904l755m404m724m841
$$ 362513 364794 366798 369024 371317 373089 373746 373129 371626 369730 367493 364589 360834 356430 351706 346865
61622C46865m878m839m631m037k906j538n85l04j88L28J012J119N06j04j08J05
$$ 346865 341987 337148 332517 328480 325574 324036 323451 323147 322959 323287 324299 325418 325924 325820 325712 325817
61606C25817l68j758l304m137m158l907l853m048m390m827n148m979m265l558
$$ 325817 325449 323691 320387 316250 312092 308185 304332 300284 295894 291067 285919 280940 276675 273117
61592B73117l473l898m103l623k769k128j898j871j879k003k388k912l136k677
$$ 273117 269644 265746 261643 258020 255251 253123 251225 249354 247475 245472 243084 240172 237036 234359
61578B34359j736j017r29j036p15k26m66j623k754l000k626k377k329k006j336
$$ 234359 232623 231606 230677 229641 228926 228700 228234 226611 223857 220857 218231 215854 213525 211519 210183
61563B10183p54m87m04n11r71j530j563r34k62o9n4L45J078J591J639J518J512
$$ 210183 209429 208942 208538 208027 207056 205526 203963 203029 202767 202698 202644 202989 204067 205658 207297 208815 210327
61546B10327J474J060K61m30l70N13J409J253j09j589j999j354o98o82q22l28
$$ 210327 211801 212861 213122 212692 212322 212835 214244 215497 215388 213799 211800 210446 209748 209066 208244 207916
61530B07916P59J634J777J472J215J005M99l49j132j516j685k070k723l154k827
$$ 207916 208675 210309 212086 213558 214773 215778 216277 215928 214796 213280 211595 209525 206802 203648 200821
61515B00821j842r72r33j594k068j647o05J11q8r55j856k360k301j681q14k48
$$ 200821 198979 198007 197074 195480 193412 191765 191160 191271 191183 190228 188372 186012 183711 182030 181216 180968
61499A80968k14k50J54P12O39j94r54q96k81J46J99K92O80J124J323J193P16q3
$$ 180968 180754 180504 180658 181370 182009 181815 180861 179965 179684 179830 180029 180321 181001 182125 183448 184641 185357 185274
61481A85274q82j143p01K5O07J105J750K394K685K608K412K086J424O18K42M40
$$ 185274 184392 183249 182548 182573 183180 184285 186035 188429 191114 193722 196134 198220 199644 200262 200504 200944
61465B00944N91K01k86r6O79J107O02l56q57n26K50P29L96n10j042m60P51J274
$$ 200944 201535 201736 201450 201354 202033 203140 203742 203386 202529 202003 202253 202982 203378 202868 201826 201366 202117 203391
61447B03391N97l35l83L02P09M81K59N98J215J507J333J089J278K126L295M024
$$ 203391 203988 203653 203270 203572 204281 204762 205021 205619 206834 208341 209674 210763 212041 214167 217462 221486
61431B21486L833L117K630K479K139J482J092J311J646J563J287J269J335J112
$$ 221486 225319 228436 231066 233545 235684 237166 238258 239569 241215 242778 244065 245334 246669 247781
61417B47781R45J486K458K648J425l94j445j156P8J498K362K136Q79o15j476j556
$$ 247781 248726 250212 252670 255318 256743 256349 254904 253748 253826 255324 257686 259822 260701 260086 258610 257054
61401B57054j367j381j723k395l315m018l761k307l70R93J410J318J180R22K92
$$ 257054 255687 254306 252583 250188 246873 242855 239094 236787 236417 237410 238820 240138 241318 242240 242532
61386B42532n99j389j894k096j890j262o78p56j340j453m89Q43J366Q94L46L95
$$ 242532 241933 240544 238650 236554 234664 233402 232724 231968 230628 229175 228686 229529 230895 231789 232135 232530
61370B32530O65M52k13n55O2J486K828L167K387J376J124J602J955J759J589K061
$$ 232530 233195 233647 233434 232879 232941 234427 237255 240422 242809 244185 245309 246911 248866 250625 252214 254275
61354B54275K904L513L942M703N752O428O366N867N301M773M484M819N652O114
$$ 254275 257179 260692 264634 269337 275089 281517 287883 293750 299051 303824 308308 313127 318779 324893
61340C24893N589M577M072M268M469M176L744L705M004M202M145M022L833L245
$$ 324893 330482 335059 339131 343399 347868 352044 355788 359493 363497 367699 371844 375866 379699 382944
61326C82944K071O30n75j382j988k593l216l780m101l846k843j496n50k08J66
$$ 382944 385015 385645 385070 383688 381700 379107 375891 372111 368010 364164 361321 359825 359275 359067 359233
61311C59233J163K506L428L723L878M301M919N594O339O980P003O101M617L188
$$ 359233 360396 362902 366330 370053 373931 378232 383151 388745 395084 402064 409067 415168 419785 422973
61297D22973K175J500R04J84n92j056j016r39j507k607l361l397l406l991m588
$$ 422973 425148 426648 427552 427736 427144 426088 425072 424133 422626 420019 416658 413261 409855 405864 401276
61282D01276m303l399l028l574m214m127l379k350j114J47P51K06r23j410o55
$$ 401276 396973 393574 390546 386972 382758 378631 375252 372902 371788 371935 372686 372892 371969 370559 369904
61267C69904P08J556J468J166J726L383N212O172O211N982N728N088M081L475
$$ 369904 370612 372168 373636 374802 376528 379911 385123 391295 397506 403488 409216 414304 418385 421860
61253D21860L808M580M910M673M439M562M853N053N051M718L966L002K196J610
$$ 421860 425668 430248 435158 439831 444270 448832 453685 458738 463789 468507 472473 475475 477671 479281
61239D79281R69J43o75j367k092k948l669l882l537k968k564k461k527k535k365
$$ 479281 480250 480393 479718 478351 476259 473311 469642 465760 462223 459255 456691 454230 451703 449168 446803
61224D46803k024j474o53K62P81O19K06L55J328K561L426L888M207M231L532K208
$$ 446803 444779 443305 442652 442914 443695 444314 444520 444875 446203 448764 452190 456078 460285 464516 468048 470256
61208D70256J007N23N59N82N18O78J072J318J361J730K798M182N298O240P503
$$ 470256 471263 471786 472345 472927 473445 474123 475195 476513 477874 479604 482402 486584 491882 498122 505625
61193E05625R008J0014J0109R695R228Q541P275N629M187L231K661K434K609K972
$$ 505625 514633 524647 534756 544451 553679 562220 569495 575124 579311 582542 585203 587637 590246 593218
61179E93218L122K965K731K406J562R6j204j319k27Q78P68n54k020k754k896l074
$$ 593218 596340 599305 602036 604442 606004 606100 604896 603577 603350 604228 604996 604442 602422 599668 596772 593698
61163E93698l420l500l141k852l249m327n530o399o886p103p087o828o376n791
$$ 593698 590278 586778 583637 580785 577536 573209 567679 561280 554394 547291 540204 533376 527000 521209
61149E21209n078m276l623l519m208n415o481p000p177p394p530p131o243n609
$$ 521209 516131 511855 508232 504713 500505 495090 488609 481609 474432 467038 459508 452377 446134 440525
61135D40525n802o462o701o055m792l484k501j817j003M01K321M041M918N123
$$ 440525 434723 428261 421560 415505 410713 407229 404728 402911 401908 402309 404630 408671 413589 418712
61121D18712N414O229P331Q288Q986R597J0245J0933J1690J2617J3758J4997J6202
$$ 418712 424126 430355 437686 445974 454960 464557 474802 485735 497425 510042 523800 538797 554999
61108E54999J7427J8810K0152K0906K0765K0056J9231J8185J6522J4323J2142
$$ 554999 572426 591236 611388 632294 653059 673115 692346 710531 727053 741376 753518
61097G53518J0229Q409O706N325L942J823j023l604n324o751q470r975j0621j0914
$$ 753518 763747 772156 778862 784187 788129 789952 788929 785325 780001 773250 764780 754805 744184 733270
61083G33270j1836j3280j4298j4650j4992j5550j5705j5106j4275j3773j3430
$$ 733270 721434 708154 693856 679206 664214 648664 632959 617853 603578 589805 576375
61072E76375j2784j1743j0542r388q299p095n621m228l651l953m020k828r00M52
$$ 576375 563591 551848 541306 531918 523619 516524 510903 506675 503024 499071 495051 492223 491323 491775
61058D91775R39J390K237L164M205N798P516Q187P759P769R205J1166J2459J3398
$$ 491775 492714 494104 496341 499505 503710 509508 517024 525211 532970 540739 549944 561110 573569 586967
61044E86967J4939J6942J8597J9974K1905K4528K7166K9466L1802L4459L7192
$$ 586967 601906 618848 637445 657419 679324 703852 731018 760484 792286 826745 863937
61033H63937L9669M1772M3397M4505M5482M7107N0036N4390N9701O5262P0797
$$ 863937 903606 945378 988775 1033280 1078762 1125869 1175905 1230295 1289996 1355258 1426055
61022A426055P6766Q3666R1252R9306J09187J23573J44439J72437K08591K55233
$$ 1426055 1502821 1586487 1677739 1777045 1886232 2009805 2154244 2326681 2535272 2790505
61012B790505L14492L87381M75354N81152P06842Q53156J022205J215513J419489
$$ 2790505 3104997 3492378 3967732 4548884 5255726 6108882 7131087 8346600 9766089
61003I766089J589018J653518J553924J285839R11918N31987K35513P0377L9329
$$ 9766089 11355107 13008625 14562549 15848388 16760306 17292293 17527806 17598183 17637512
60994A7637512J09757K21224K93803K50549N2651k76184o59171j006161j255399
$$ 17637512 17747269 17968493 18262296 18512845 18565496 18289312 17630141 16623980 15368581
60985A5368581j390881j431530j407558j342086j246706j127936r94596q58516
$$ 15368581 13977700 12546170 11138612 9796526 8549820 7421884 6427288 5568772
60977E568772p29886o14048n12783m26677l55431k97398k50396k12698j82718
$$ 5568772 4838886 4224838 3712055 3285378 2929947 2632549 2382153 2169455 1986737
60968A986737j58521j38472j21855j08201r6522q5896p6211o7677n9982n2688
$$ 1986737 1828216 1689744 1567889 1459688 1363166 1277270 1201059 1133382 1073400 1020712
60958A020712m6042m0723l6989l4566l3006l1637k9710k7217k5081k3851k2672
$$ 1020712 974670 933947 896958 862392 829386 797749 768039 740822 715741 691890 669218
60947F69218k0390j7265j4643j3105j1950j0448q745p329o381n830n434m699l364
$$ 669218 648828 631563 616920 603815 591865 581417 572672 565343 558962 553132 547698 542999 539635
60934E39635k063j843k767l735l935l888m482n569o151n760n005m754n178n772
$$ 539635 537572 535729 532962 529227 525292 521404 516922 511353 505202 499442 494437 489683 484505 478733
60920D78733o012n774n227m544l810l199k953l085l197k882k345k271k945l675
$$ 478733 472721 466947 461720 457176 453366 450167 447214 444129 440932 438050 435705 433434 430489 426814
60906D26814l398j912j95O08M35K76R75K379L730M601N110N491N862O371P175
$$ 426814 423416 421504 421309 421917 422352 422628 423603 425982 429712 434313 439423 444914 450776 457147 464322
60891D64322Q170R058R722J0269J0689J0877J0963J1176J1336J1016J0402J0445
$$ 464322 472492 481550 491272 501541 512230 523107 534070 545246 556582 567598 578000 588445
60879E88445J1725J3624J5076J5792J6321J7173J8319J9377J9849J9399J8307
$$ 588445 600170 613794 628870 644662 660983 678156 696475 715852 735701 755100 773407
60868G73407J7400J7049J6487J4735J1968R305P192M882J714j884n113p915j0643
$$ 773407 790807 807856 824343 839078 851046 860351 867543 872425 874139 872255 867142 859227 848584
60855H48584j3063j4510j5077j5867j7653j9814k1032k0815j9854j9067j8780
$$ 848584 835521 821011 805934 790067 772414 752600 731568 710753 690899 671832 653052
60844F53052j8871j9079j8967j8044j6355j4641j3612j3276j3325j3691j4263
$$ 653052 634181 615102 596135 578091 561736 547095 533483 520207 506882 493191 478928
60833D78928j4448j3778j2724j2148j2060j1662j0638r511q602p569o261n174
$$ 478928 464480 450702 437978 425830 413770 402108 391470 381959 373357 365788 359527 354353
60821C54353m652m394m185m339m848m950m211l325l023k874k054p98q4j57l63
$$ 354353 349701 345307 341122 336783 331935 326985 322774 319449 316426 313552 311498 310700 310616 310459 310096
60806C10096k30J68P39J442J933J957J942K409K971K831K108J694J785J663J036
$$ 310096 309866 310034 310773 312215 314148 316105 318047 320456 323427 326258 328366 330060 331845 333508 334544
60791C34544N23M69K63n77j523j777j349q26n42m47m32m11m29q01j768k808k935
$$ 334544 335067 335536 335799 335222 333699 331922 330573 329747 329205 328758 328326 327915 327486 326685 324917 322109 319174
60774C19174j917o82k34o44j353j895k002j650j312j605k306k426j672j119j756
$$ 319174 317257 316575 316341 315697 314344 312449 310447 308797 307485 305880 303574 301148 299476 298357 296601
60759B96601l051l781l679l382l158k698k086j869k039j783o46O65J082M67j97
$$ 296601 293550 289769 286090 282708 279550 276852 274766 272897 270858 269075 268429 269094 270176 270643 270446
60744B70446J57J573K987L282K482J652J568J906J932J511R00N1j159k197k289
$$ 270446 270603 272176 275163 278445 280927 282579 284147 286053 287985 289496 290396 290447 289288 287091 284802
60729B84802j572j030j127j236p43n2L7m93r99j198j545k461l664m446m357l506
$$ 284802 283230 282200 281073 279837 279094 279042 279079 278586 277587 276389 274844 272383 268719 264273 259916 256410
60713B56410k394j582j471k024k718k923k522k049k013k253k247j962j919k312
$$ 256410 254016 252434 250963 248939 246221 243298 240776 238727 236714 234461 232214 230252 228333 226021
60699B26021k580k114j075j24L39L27o2n88p06m3R34J242N32m43o97k0R38J385
$$ 226021 223441 221327 220252 220128 220467 220794 220732 220144 219438 219395 220329 221571 222103 221660 220963 220943 221881 223266
60681B23266J076M99N16J529K970L823L672L009K482K244K148K218K550L004L307
$$ 223266 224342 224841 225357 226886 229856 233679 237351 240360 242842 245086 247234 249452 252002 255006 258313
60666B58313L334L080K524J793J325J445J864J972J693J628K171K786K630J617
$$ 258313 261647 264727 267251 269044 270369 271814 273678 275650 277343 278971 281142 283928 286558 288175
60652B88175N79K97P60J356J539J189O19L33N41P98L77q08j912k100j557j255
$$ 288175 288754 289051 289811 291167 292706 293895 294514 294847 295388 296186 296563 295755 293843 291743 290186 288931
60636B88931j854l109m242m576l998l110k809l341l920l718k978k557k605k519
$$ 288931 287077 283968 279726 275150 271152 268042 265233 261892 257972 254254 251276 248719 246114 243595
60622B43595k126k002k283k219j353l77n5r4K46Q98J268J315J424J469R63L0o09
$$ 243595 241469 239467 237184 234965 233612 233235 233180 233086 233332 234230 235498 236813 238237 239706 240669 240699 240090
60605B40090o89o09o01m31p0R9o4k13j83k38m25l34J80N62L13l07o81o32m06j39
$$ 240090 239401 238792 238191 237760 237690 237789 237725 237512 237329 237091 236666 236332 236512 237074 237387 237080 236399 235767 235361 235222
60585B35222J96M91N33L24K10N76J405K104K030J378J173J984L067L449L461M232
$$ 235222 235418 235909 236442 236766 236976 237552 238957 241061 243091 244469 245642 247626 250693 254142 257603 261835
60569B61835N787O988P450Q136R422J0037Q911O991N837N267L911J594m97j897
$$ 261835 267622 274610 282060 290196 299618 309655 318566 325557 331394 336661 340572 342166 341669 339772
60555C39772l395n230o276n710m316l273k531j267O66K638M204N396O321P064
$$ 339772 336377 331147 324871 319161 314845 311572 309041 307774 308440 311078 315282 320678 326999 334063
60541C34063P851Q743R316R088Q129O889N559M017K160l4k465m524n135l925k108
$$ 334063 341914 350657 359973 369061 377190 384079 389638 393655 395815 395781 393316 388792 383657 379732 377624
60526C77624j401k043k688k377j769j904k579k704j889r15o49j090j569j424m75
$$ 377624 376223 374180 371492 369115 367346 365442 362863 360159 358270 357355 356706 355616 354047 352623 352148
60511C52148Q24J676J754J734K640M584O741Q666J0968J4261J8014K1267K4022
$$ 352148 352972 354648 356402 358136 360776 365360 372101 380767 391735 405996 424010 445277 469299
60498D69299K7064L0426L3158L4796L5993L7040L6568L2846K5915J7453Q699m41
$$ 469299 496363 526789 559947 594743 630736 667776 704344 737190 763105 780558 789257 788816
60486G88816j0086j9310k6875l2303l5687l7027l6457l4633l2267k9571k6584
$$ 788816 778730 759420 732545 700242 664555 627528 591071 556438 524171 494600 468016
60475D68016k3778k1581j9660j7334j4618j2174j0315q788p532o865o780o706
$$ 468016 444238 422657 402997 385663 371045 358871 348556 339768 332236 325371 318591 311885
60463C11885o248n541m742l808l027l006l711m156l644k670k091j954j843j822
$$ 311885 305637 300096 295354 291546 288519 285513 281802 277646 274002 271332 269241 267287 265444 263622
60449B63622k159k486k220j610j495j977k260j865j165n46J37Q96J214P93J13
$$ 263622 261463 258977 256757 255147 253652 251675 249415 247550 246385 245839 245976 246872 248086 248879 248992
60434B48992k74n08j033j844k606l170l503l376k640j620p80j02P81J883K731
$$ 248992 248718 248210 247177 245333 242727 239557 236054 232678 230038 228418 227638 227536 228317 230200 232931
60419B32931K947K655K272K003J610O79p51j891j855p11M84Q47M97P9n2J69Q22
$$ 232931 235878 238533 240805 242808 244418 245097 244346 242455 240600 239889 240373 241220 241717 241796 241744 241913 242735
60402B42735J776K462K406J807J197P58M47M80J062J810K063J728J286J017Q16
$$ 242735 244511 246973 249379 251186 252383 253141 253588 254068 255130 256940 259003 260731 262017 263034 263850
60387B63850O80P83R94R92Q87J122J702K075K034K017K321K623K577K345K100
$$ 263850 264530 265313 266307 267299 268186 269308 271010 273085 275119 277136 279457 282080 284657 287002 289102
60372B89102J641Q89L71O09J397K127K538K635K243J242J10m03j03N69J237J934
$$ 289102 290743 291632 292003 292612 294009 296136 298674 301309 303552 304794 304904 304501 304398 304967 306204 308138
60356C08138K729L479M059M563N150N955P036Q176Q784Q362P136N839M806L586
$$ 308138 310867 314346 318405 322968 328118 334073 341109 349285 358069 366431 373567 379406 384212 387798
60342C87798J617j012l614n525o482o579o172n699n421n285n129m925m670m201
$$ 387798 389415 388403 384789 379264 372782 366203 360031 354332 348911 343626 338497 333572 328902 324701
60328C24701l323k210j400j218j387j420j280j336j633j664j123n28n71j077j147
$$ 324701 321378 319168 317768 316550 315163 313743 312463 311127 309494 307830 306707 306179 305608 304531 303384
60313C03384l69P43J626K445L596M955O154P334R039J1369J3729J5437J6138J5628
$$ 303384 303015 303758 305384 307829 311425 316380 322534 329868 338907 350276 364005 379442 395580 411208
60299D11208J3722J0583O827L019q18m927r121j2591j4499j4738j4004j3043j1910
$$ 411208 424930 435513 442340 445359 444541 439614 430493 417902 403403 388665 374661 361618 349708
60286C49708j0197q007o280n738n819n229l566j784q70o97o09n61r11j366j041
$$ 349708 339511 331504 325224 319486 313667 308438 304872 303088 302218 301521 300912 300351 299440 298074 297033
60271B97033J83J182Q39n86j919k509k631k605k230j385n68m78j203k167k730
$$ 297033 297216 298398 299237 298651 296732 294223 291592 288987 286757 285372 284804 284326 283123 280956 278226
60256B78226k613j891r03j04K30K28K16L34M99O48Q00Q60O00r4r68j477j146m2
$$ 278226 275613 273722 272819 272715 272945 273173 273389 273723 274222 274870 275670 276530 277130 277036 276068 274591 273445 273403
60238B73403J090J393P79K6j69J3qk60k44K67J004J696K241K390J890J060O37
$$ 273403 274493 275886 276665 276691 276522 276535 276527 276267 276023 276290 277294 278990 281231 283621 285511 286571 287208
60221B87208Q18J044R17P84J021J373J468J522J887K322K329J976J810K105K723
$$ 287208 288026 289070 289987 290771 291792 293165 294633 296155 298042 300364 302693 304669 306479 308584 311307
60206C11307L547M497N206N268M857M545M535M466M045L449L066L128L575L976
$$ 311307 314854 319351 324557 329825 334682 339227 343762 348228 352273 355722 358788 361916 365491 369467
60192C69467L787L080K760L450M388M216K874J724J588J614O59j011k172k365
$$ 369467 373254 376334 379094 382544 386932 391148 394022 395746 397334 398948 399607 398596 396424 394059
60178C94059k310k795l844m939n551n360m459l445k969l061l159k828k251j887
$$ 394059 391749 388954 385110 380171 374620 369260 364801 361356 358387 355326 352167 349339 347088 345201
60164C45201j855j846j558j040n66k32J59P12J148J132Q04O11O23M52K4q8N31
$$ 345201 343346 341500 339942 338902 338336 338104 338263 338975 340123 341255 342059 342670 343293 343745 343769 343681 344212
60147C44212J409J738J464J250J478J831J926J865J937K176K461K856L466M067
$$ 344212 345621 347359 348823 350073 351551 353382 355308 357173 359110 361286 363747 366603 370069 374136
60133C74136M159L470K332J446J236J484J633J424J094R04P62N25M52R48J798
$$ 374136 378295 381765 384097 385543 386779 388263 389896 391320 392414 393318 394080 394605 395057 396005 397803
60118C97803K120J299k43j458j693j092j07R37J762J961J313J98n90o20k54j19
$$ 397803 399923 401222 400979 399521 397828 396736 396629 397566 399328 401289 402602 402800 402210 401590 401336 401217
60102D01217l23m28j71J17J6l62n12k83j61p02j854k948l334k939k239j723j501
$$ 401217 400894 400466 400295 400412 400428 400066 399554 399271 399110 398408 396554 393606 390272 387333 385094 383371 381870
60085C81870j415j343j253j017n22J4J18k76n35J5J225K264K516K020J097n1j240
$$ 381870 380455 379112 377859 376842 376320 376334 376452 376176 375641 375656 376881 379145 381661 383681 384778 384727 383487
60068C83487k192k708k760k392j822j672k554m158n236m938l892l395l777m225
$$ 383487 381295 378587 375827 373435 371613 369941 367387 363229 357993 353055 349163 345768 341991 337766
60054C37766m052l480k937k309j387n53m22r00j099k97J329K947L798L694L067
$$ 337766 333714 330234 327297 324988 323601 323048 322626 321726 320627 320330 321659 324606 328404 332098 335165
60039C35165K602K669K965K862K181J457J345J865K462K741K851K983K803J777
$$ 335165 337767 340436 343401 346263 348444 349901 351246 353111 355573 358314 361165 364148 366951 368728
60025C68728Q8j270j584j290j370k088k867l223l303l421l624l876m095l864k728
$$ 368728 368816 367546 365962 364672 363302 361214 358347 355124 351821 348400 344776 340900 336805 332941 330213
60010C30213j143m42j296k789l610l676l733l924l796l440l468l767l429k194
$$ 330213 329070 328628 327332 324543 320933 317257 313524 309600 305804 302364 298896 295129 291700 289506
59996B89506r75n03l91j6M64O24N33M17J41k92l30K83Q65P54M90J061K282K888
$$ 289506 288531 288028 287637 287621 288085 288709 289242 289659 289800 289508 289178 289461 290326 291080 291570 292631 294913 297801
59978B97801K210R30Q2J2L64N33O6q82j473j053l6N41K95k45n01m01n6M09P33
$$ 297801 300011 300941 301023 301035 301399 301932 301998 301116 299643 298590 298554 299095 299390 299145 298644 298243 298187 298596 299329
59959B99329P08N43N35M93P7m44n39l87o45j227j268n53O7J6j35K84R56J188J021
$$ 299329 300037 300580 301115 301608 301685 301241 300702 300315 299670 298443 297175 296622 296689 296705 296570 296854 297810 298998 300019
59940C00019R84J184J272J040N65N9j70Q4M86L84k23n62k37J62J27J71R66K128
$$ 300019 301003 302187 303459 304499 305064 305123 304953 305037 305523 305907 305684 305122 304885 305047 305174 305345 306311 308439
59922C08439K764K759K652K578K247J856K036K911L925M682N272N697N690N251
$$ 308439 311203 313962 316614 319192 321439 323295 325331 328242 332167 336849 342121 347818 353508 358759
59908C58759M761M369L731K554J030m42j586k331k791l237l766m032l688k956
$$ 358759 363520 367889 371620 374174 375204 374762 373176 370845 368054 364817 361051 357019 353331 350375
59894C50375k357j985j480o95J53R44J753K476K855K958L173L604L894L848L790
$$ 350375 348018 346033 344553 343858 344011 344955 346708 349184 352039 354997 358170 361774 365668 369516 373306
59879C73306M107M690M989M530L403K357K234L029L708L336K101Q43j41j176k311
$$ 373306 377413 382103 387092 391622 395025 397382 399616 402645 406353 409689 411790 412633 412492 411316 409005
59864D09005l144l482l506l201k388j320m92K55J622L597N154N550N155M530L537
$$ 409005 405861 402379 398873 395672 393284 391964 391472 391727 393349 396946 402100 407650 412805 417335 420872
59849D20872J994N27o5R0K79L41P24J462J771Q02j533m464o887q085q214p971
$$ 420872 422866 423393 423328 423418 423697 424038 424762 426224 427995 428797 427264 422800 415913 407828 399614 391643
59833C91643p712p099n805m156k793j939j363p87o1Q30J563J584P76k19o74n54
$$ 391643 383931 376832 371027 366871 364078 362139 360776 359989 359928 360758 362321 363905 364681 364462 363788 363234
59817C63234l20k77m48q34j279j395r78l60O6L81P55Q43J80j007j997k503k822
$$ 363234 362914 362637 362189 361355 360076 358681 357703 357343 357409 357790 358545 359388 359568 358561 356564 354061 351239
59800C51239l112l206l151l363l983m596m686m101l004j780j023j123j725j973
$$ 351239 348127 344921 341770 338407 334424 329828 325142 321041 318037 316257 315234 314111 312386 310413
59786C10413j430l86O96J566J945J555O39j01l59n48r70j163o06L87J085J357
$$ 310413 308983 308597 309293 310859 312804 314359 314998 314897 314538 313990 313020 311857 311251 311638 312723 314080
59770C14080J622J932J816J103K76k02l54l09J04R30J708J971J918K070K388K346
$$ 314080 315702 317634 319450 320553 320829 320627 320273 319964 320068 320998 322706 324677 326595 328665 331053 333399
59754C33399J881J602J828J988J495P19N09J018J657K071K418K696K629K364K571
$$ 333399 335280 336882 338710 340698 342193 342912 343421 344439 346096 348167 350585 353281 355910 358274 360845
59739C60845L355L804L144J891J229J577K362K896K817J932M08r44j243n54K27
$$ 360845 364200 368004 371148 373039 374268 375845 378207 381103 383920 385852 386260 385316 384073 383519 383746
59724C83746N01M64M30K97o9m42n58m57l09j77j08j83l45m41n12o83p74m86k9
$$ 383746 384247 384711 385141 385438 385369 384927 384369 383912 383603 383426 383318 383135 382790 382349 381837 381154 380380 379894 379865
59705C79865k3o06j116r91m47lJ71J24j69n44n38p9K11m7k46L47J325J572Q44
$$ 379865 379842 379236 378120 377129 376682 376679 376850 376974 376805 376261 375723 375644 375855 375808 375562 375909 377234 378806 379650
59686C79650j1l73n29q31j065j031j031j277j368r53m59n44j128j649k047k755
$$ 379650 379639 379266 378737 377906 376841 375810 374779 373502 372134 371181 370722 370178 369050 367401 365354 362599
59670C62599l713m169l751l154l231l796l909l188k279j913k026k060j819j609
$$ 362599 358886 354717 350966 347812 344581 340785 336876 333688 331409 329496 327470 325410 323591 321982
59656C21982j650j775j726j433q96n6R49J715K020K207K691L230L074K002O85
$$ 321982 320332 318557 316831 315398 314502 314446 315395 317110 319130 321337 324028 327258 330332 332334 333019
59641C33019j58n73r59j235r98l80k5q2P8Q47J598J526Q26L69L98L17j99o40n94
$$ 333019 332861 332288 331329 330094 329096 328716 328691 328609 328687 329534 331132 332658 333484 333853 334251 334568 334369 333729 333135
59622C33135n14j048j978k516k411k171k206k331k254k032j815j466p75J13P85
$$ 333135 332621 331573 329595 327079 324668 322497 320291 317960 315706 313674 311859 310393 309618 309731 310516
59607C10516R90Q33N45K89J73K94O53J063J282J253J135J048Q54M47J15L14R95
$$ 310516 311506 312339 312884 313173 313346 313640 314293 315356 316638 317891 319026 320074 320928 321375 321490 321804 322799
59590C22799J492J292O75K75K27J11m13j226j922k095j555n99L9o7m96n95m61
$$ 322799 324291 325583 326258 326533 326760 326871 326458 325232 323310 321215 319660 319061 319100 319033 318537 317942 317481
59573C17481p52j502j909j570j159j407j935j795q95j34j32m32j98O36J251Q77
$$ 317481 316729 315227 313318 311748 310589 309182 307247 305452 304557 304423 304291 303859 303661 304297 305548 306425
59557C06425l04j276j252m47L40P54J098J524J585R70K52L78J541L013M048M592
$$ 306425 306121 304845 303593 303146 303486 304240 305338 306862 308447 309417 309669 310047 311588 314601 318649 323241
59541C23241N047N671O455P469R184J2193J6294J9818K0381J6761J0085K976k445
$$ 323241 328288 333959 340414 347883 357067 369260 385554 405372 425753 442514 452599 455575 453130
59528D53130n654p332q302q830q654p520n686l732j975m31O43Q13L09R2N57Q41
$$ 453130 447476 440144 431842 423012 414358 406838 401152 397420 395445 395014 395657 396470 396779 396871 397428 398269
59512C98269J07r94j244q37j229k950m806n583n468n264n155m991n018n401n532
$$ 398269 398376 397382 396138 395301 394072 391122 386316 380733 375265 370001 364846 359855 354837 349436 343904
59497C43904m756l470k688k645k639k264j920j926j832j011M25J691K139J781
$$ 343904 339148 335678 332990 330345 327706 325442 323522 321596 319764 318753 319178 320869 323008 324789
59483C24789J123O47M74M22L81N28J034J761K458L168M105N122N671N369M431
$$ 324789 325912 326559 327033 327455 327836 328364 329398 331159 333617 336785 340890 346012 351683 357052 361483
59468C61483L359K401J475N47j27j97L85J164J502J175O50O25J316K330L216L993
$$ 361483 364842 367243 368718 369265 369138 368941 369326 370490 371992 373167 373817 374442 375758 378088 381304 385297
59452C85297M944O039O784O755O182N829O280P400Q460Q686P710N684L142O53
$$ 385297 390241 396280 403064 409819 416001 421830 428110 435510 443970 452656 460366 466050 469192 469845
59438D69845j544l480n014n740n574n145n187n677o021o013n994o093n934n336
$$ 469845 468301 464821 459807 454067 448493 443348 438161 432484 426463 420450 414456 408363 402429 397093
59424C97093m699m279l599k076J13K331M336O355Q436J0288J1776J3123J4668
$$ 397093 392394 388115 384516 382440 382553 384884 389220 395575 404011 414299 426075 439198 453866
59411D53866J6626J8899K0727K0759J7982J2681O221P9m645p233p678o887n819
$$ 453866 470492 489391 510118 530877 548859 561540 567761 567840 563195 555962 548284 541397 535578
59398E35578m326j662J740L849K881j015o253j1288j5110j7050j7104j6260j5626
$$ 535578 531252 529590 531330 535179 538060 537045 530792 519504 504394 487344 470240 453980 438354
59385D38354j5168j4013j1927r780q340p314o030m510l270k356j280L0Q82P22
$$ 438354 423186 409173 397246 387466 379126 371812 365782 361272 358002 355646 354366 354396 355278 356000
59371C56000kl33O4O76R93J086J303J736K228K574K496J865J117J106K132L454
$$ 356000 355998 355665 355729 356405 357398 358484 359787 361523 363751 366325 368821 370686 371803 372909 375041 378495
59355C78495M212M498M936N606O059O263O639P200P503P624Q286R689J1015J1588
$$ 378495 382707 387205 392141 397747 403806 410069 416708 423908 431411 439035 447321 457010 468025 479613
59341D79613J1756J2084J2346J2022J1278J0614R968Q878P335N692L978K033K12
$$ 479613 491369 503453 515799 527821 539099 549713 559681 568559 575894 581586 585564 587597 587809
59328E87809q41j170j580k676m329o096p594q465q618q600r045r633r225p320
$$ 587809 586968 585798 584218 581542 577213 571117 563523 555058 546440 537840 528795 519162 509937 502617
59314E02617m829l039k283j896j108M34K653N121P238Q503Q579P133M045j77m482
$$ 502617 497788 494749 492466 490570 489462 489896 492549 497670 504908 513411 521990 529123 533168 532991 528509
59299E28509q013j0466j1765j1925j1331j0599r812q436o380m539l752l606k960
$$ 528509 520496 510030 498265 486340 475009 464410 454598 446162 439782 435243 431491 427885 424925
59286D24925j450J93J253J785K178K475K486K213J953J994K305K569K559K523
$$ 424925 423475 423668 424921 426706 428884 431359 433845 436058 438011 440005 442310 444879 447438 449961
59272D49961K989M076N196N686N527N247N257N654O394P295P873P642O659N473
$$ 449961 452950 457026 462222 467908 473435 478682 483939 489593 495987 503282 511155 518797 525456 530929
59258E30929M400L105J105j524m133o051p093p518p693p834q042q393q788q850
$$ 530929 535329 538434 539539 538015 533882 527831 520738 513220 505527 497693 489651 481258 472470 463620
59244D63620q259p215o292n655m825l380j648l72P4j37n91q24m03O68J791K377
$$ 463620 455361 448146 441854 436199 431374 427994 426346 425974 426048 425911 425320 424496 424093 424761 426552 428929
59228D28929K468K395K071J199M5o70p53p84j200j695j816j659j654j987k557
$$ 428929 431397 433792 435863 437062 437107 436437 435684 434900 433700 432005 430189 428530 426876 424889 422332
59213D22332l185l583l453k874k309j995j644j067o60q28j270j388j160j050j181
$$ 422332 419147 415564 412111 409237 406928 404933 403289 402222 401562 400734 399464 398076 396916 395866 394685
59198C94685j298j397j764k214k014r52J75N73N31R40K029L134L664L678L534
$$ 394685 393387 391990 390226 388012 385998 385046 385221 385794 386325 387265 389294 392428 396092 399770 403304
59183D03304L400L339L443L672L774L567L121K578K047J755K015K806L673M210
$$ 403304 406704 410043 413486 417158 420932 424499 427620 430198 432245 434000 436015 438821 442494 446704
59169D46704M434M451M150L610L511M446N910O613O009M937M542M949N362N146
$$ 446704 451138 455589 459739 463349 466860 471306 477216 483829 489838 494775 499317 504266 509628 514774
59155E14774M385L551K933K380J485Q0j444k513l023l341l638l730l661l846m333
$$ 514774 519159 522710 525643 528023 529508 529588 528144 525631 522608 519267 515629 511899 508238 504392 500059
59140E00059m505m018l510l753m497m880m668m376m264m044l602l218k955k494
$$ 500059 495554 491536 488026 484273 479776 474896 470228 465852 461588 457544 453942 450724 447769 445275
59126D45275j804j256q41M1J616L134L787L818M166N196O315O796O571O210O271
$$ 445275 443471 442215 441374 441415 443031 446165 449952 453770 457936 463132 469447 476243 482814 489024 495295
59111D95295O784P301P521P640P934Q124P702O814O178N973N511M411L433L455
$$ 495295 502079 509380 516901 524541 532475 540599 548301 555115 561293 567266 572777 577188 580621 584076
59097E84076M076M015K787J211J78m27j274k492l472l653l213k841k942l150k819
$$ 584076 588152 592167 594954 596165 596343 595916 594642 592150 588678 585025 581812 578971 576029 572879 570060
59082E70060j891j075j062j789k677l354l918m556n209n625n665n488n444n691
$$ 570060 568169 567094 566032 564243 561566 558212 554294 549738 544529 538904 533239 527751 522307 516616
59068E16616n971n913n487m973m536m140l811l652l565l362l175l267l426l085
$$ 516616 510645 504732 499245 494272 489736 485596 481785 478133 474568 471206 468031 464764 461338 458253
59054D58253k245j600j415j010J48J499K199K327K466K564K148J435J179J408
$$ 458253 456008 454408 452993 451983 452131 453630 455829 458156 460622 463186 465334 466769 467948 469356
59040D69356J322O35J38N02J305J743J733J819K370L294M287M978N098M838M764
$$ 469356 470678 471313 471451 471953 473258 475001 476734 478553 480923 484217 488504 493482 498580 503418 508182
59025E08182N074N278M954M576N031O378P613P818P239O913P383Q045P862O552
$$ 508182 513256 518534 523488 528064 533095 539473 547086 554904 562143 569056 576439 584484 592346 598898
59011E98898M818L492K711K085J368O16j29r01j514j628j197n63L5P99K007L486
$$ 598898 603716 607208 609919 612004 613372 613988 613859 612958 611444 609816 608619 608056 608091 608890 610897 614383
58995F14383M679N210N253N296N580N785N379M253K813J406j01j892l670m936
$$ 614383 619062 624272 629525 634821 640401 646186 651565 655818 658631 660037 659936 658044 654374 649438
58981F49438n636o128o571o835o919o954o706n642l709j570J91J669L113M283
$$ 649438 643802 637674 631103 624268 617349 610395 603689 598047 594338 592768 592959 594628 597741 602024
58967F02024M849N143N892P199Q304Q560Q263Q210Q656R059Q833Q065P235O453
$$ 602024 606873 612016 617908 625107 633411 641971 650234 658444 667100 676159 684992 693057 700292 706745
58953G06745N318L538J363p69k663m273n426o022o303o615o966p080o799o161
$$ 706745 712063 715601 716964 716195 713532 709259 703833 697811 691508 684893 677927 670847 664048 657887
58939F57887n302m587m610n561o732p165o711n971n313m577l749l172k843k177
$$ 657887 652585 647998 643388 637827 631095 623930 617219 611248 605935 601358 597609 594437 591594 589417
58925E89417q10P99J962K520K697K642K485K471K672K841K903L261M307N882P497
$$ 589417 588607 589406 591368 593888 596585 599227 601712 604183 606855 609696 612599 615860 620167 626049 633546
58910F33546Q869R935J0641J1074J1476J1802J1505J0200Q308O643N557M790M049
$$ 633546 642415 652350 662991 674065 685541 697343 708848 719048 727356 733999 739556 744346 748395
58897G48395L274K498J747J029J93j020k444l224k536m70K115M521O632Q493J0057
$$ 748395 751669 754167 755914 756943 757136 756116 753672 750448 747912 747442 749557 754078 760710 769203 779260
58882G79260J1400J2767J4106J4869J4576J3408J2005J0706R247P310N140L303
$$ 779260 790660 803427 817533 832402 846978 860386 872391 883097 892344 899654 904794 908097
58870I08097J881K42k152n041p776j0226j2707j5138j6853j7408j7148j6734j6480
$$ 908097 909978 910220 908068 903027 895251 885025 872318 857180 840327 822919 805771 789037 772557
58857G72557j6321j6159j6047j6166j6658j7216j7027j5654j3804j2640j2299
$$ 772557 756236 740077 724030 707864 691206 673990 656963 641309 627505 614865 602566
58846F02566j1884j0984j0263j0227j0403j0155r542q716p397n701m656m959n802
$$ 602566 590682 579698 569435 559208 548805 538650 529108 520392 512995 507294 502638 497679 491877
58833D91877n911n221m529m028l289k419j983j916j580q87l59m1N66J468K028
$$ 491877 485966 480745 476216 472188 468899 466480 464497 462581 461001 460114 459755 459714 460280 461748 463776
58818D63776K100K285K845L256L166K925K852K753K538K440K336J672N16j27K81
$$ 463776 465876 468161 471006 474262 477428 480353 483205 485958 488496 490936 493272 494944 495460 495333 495614
58803D95614Q45L88r21j854j685q18n6K06N9j43j66j93o37j545k456k948l018
$$ 495614 496459 496847 495926 494072 492387 491569 491513 491719 491778 491635 491469 491276 490639 489094 486638 483690 480672
58786D80672k779k177j299n20p1L22J092K313L702M895N584N679N482N373N275
$$ 480672 477893 475716 474417 473897 473826 474148 475240 477553 481255 486150 491734 497413 502895 508268 513543
58771E13543M739L586K031J88j973m027n183n257n008n165n611n890o004o219
$$ 513543 518282 521868 523899 524087 522114 518087 512904 507647 502639 497474 491863 485973 479969 473750
58757D73750o477o524o257n692m809l800l070k686k177j164J25J225J963K329
$$ 473750 467273 460749 454492 448800 443991 440191 437121 434435 432258 431094 431219 432444 434407 436736
58743D36736K409K686L780N450O473O053M978M684N547O707P222O933O347O232
$$ 436736 439145 441831 445611 451061 457534 463587 468565 473249 478796 485503 492725 499658 506005 512237
58729E12237O975P995Q099O900N408M747M780M636M098L605L242K614J577L78
$$ 512237 519212 527207 535306 542206 547614 552361 557141 561777 565875 569480 572722 575336 576913 577291
58715E77291p87j660j578n8K269M119M872M886M635M218L619K701J135r43k432
$$ 577291 576504 574844 573266 573208 575477 579596 584468 589354 593989 598207 601826 604527 605662 604719 602287
58700F02287k480k075l232o367r632j1218j1307j1145j1216j1182j0894j0486
$$ 602287 599807 597732 594500 588133 578501 567283 555976 544831 533615 522433 511539 501053
58688E01053r833q730p469o623o349o340o333o268o095n712n035l974k583j337
$$ 501053 491220 482490 475021 468398 462049 455709 449376 443108 437013 431301 426266 422292 419709 418372
58674D18372q35j004j003l15O11J214J850L276N356P058P766P932Q280Q867R189
$$ 418372 417537 416533 415530 415215 415826 417040 418890 422166 427522 434580 442346 450278 458558 467425 476614
58659D76614Q816P615N619L027K95j991l454m114m369m741n478o215o157m830
$$ 476614 485430 493045 498664 501691 501986 499995 496541 492427 488058 483317 477839 471624 465467 460637
58645D60637k720r87m22q30j516k131k716l096k814j885j070r69j185q48K74J661
$$ 460637 457917 456930 456508 455678 454162 452031 449315 446219 443405 441520 440450 439481 438296 437448 437722 439383
58629D39383K851L814M552M902M860M591L995K769J124m0m1Q07J638K009K108
$$ 439383 442234 446048 450600 455502 460362 464953 468948 471717 472841 472801 472760 473567 475205 477214 479322
58614D79322K176K188K109K157K609L351L750L190J859P46N75R05O68m28j557
$$ 479322 481498 483686 485795 487952 490561 493912 497662 500852 502711 503457 504032 504937 505605 505177 503620
58599E03620j921j713j683k126k659k816k480j861j241p46k52L61R66J365J778
$$ 503620 501699 499986 498303 496177 493518 490702 488222 486361 485120 484374 484122 484483 485449 486814 488592
58584D88592K700M228N862P145Q109Q846R086Q656P971P572P335O685N560M625
$$ 488592 491292 495520 501382 508527 516636 525482 534568 543224 551195 558767 566102 572787 578347 582972
58570E82972M401M589M523M065L792M391N996Q108J0031J1418J2416J3407J4642
$$ 582972 587373 591962 596485 600550 604342 608733 614729 622837 632868 644286 656702 670109 684751
58557F84751J6106J7597J8886J9795K0159J9748J8350J5950J2812R305N771K647
$$ 684751 700857 718454 737340 757135 777294 797042 815392 831342 844154 853459 859230 861877
58545H61877L62j084k286l783n424o723p707q831j0105j0992j1346j1736j2558
$$ 861877 862239 861155 858869 855086 849662 842939 835232 826401 816296 805304 793958 782222 769664
58532G69664j3389j3729j3828j4137j4380j3860j2511j1002r764q617p339o063
$$ 769664 756275 742546 728718 714581 700201 686341 673830 662828 653064 644447 637108 631045
58520F31045m916l815k829k303k302k304j832j103o74o22n32k48j27l73n19o0
$$ 631045 626129 622314 619485 617182 614880 612576 610744 609641 608967 608345 607813 607565 607438 607065 606546 606486
58504F06486P01Q87J94o65q97n10rM21Q72J126Q37K69K00Q21J327R96K37M7P60
$$ 606486 607187 608074 608268 607603 606706 606196 606187 606608 607480 608606 609443 609712 609912 610733 612060 613056 613293 613340 614100
58485F14100J774K496K951L495M209M832N115N151N397O354Q157J0480J2735J4265
$$ 614100 615874 618370 621321 624816 629025 633857 638972 644123 649520 655874 664031 674511 687246 701511
58471G01511J4493J3317J1447R928R088Q239O663M549K647J323L86l26p16p25
$$ 701511 716004 729321 740768 750696 759784 768023 774686 779235 781882 783205 783591 783265 782549 781824
58457G81824m83j78j0j40l89k24N98J509J753J392J079R41L84q43k134k975l693
$$ 781824 781341 781163 781153 781013 780624 780400 780998 782507 784260 785652 786731 787672 788056 787213 785079 782104 778411
58440G78411m709n610n682n085m709m881m967m435l605k999k502j631l41R65K081
$$ 778411 773702 768092 762410 757325 752616 747735 742768 738333 734728 731729 729227 727596 727255 728220 730301
58425G30301L183M450N875P420Q948R970R929Q911P727P133P155P283O968N871
$$ 730301 733484 737934 743809 751229 760177 770147 780076 788987 796714 803847 811002 818285 825253 831124
58411H31124M102K394J603J616J244l43k397l437l043k140j625j464j196o78O1
$$ 831124 835226 837620 839223 840839 842083 841740 839343 835906 832863 830723 829098 827634 826438 825760 825821
58396H25821J120K528M042N373O455P251P601P437O976O513O196O021N895N624
$$ 825821 826941 829469 833511 838884 845339 852590 860191 867628 874604 881117 887313 893334 899229 904853
58382I04853N103M548M262M193M033L755L683L795L461K154K31j327j908j771
$$ 904853 909956 914504 918766 922959 926992 930747 934430 938225 941686 943840 944071 942744 940836 939065
58368I39065j582j587j347l96J003K067K575L203M468N871O663P049P866R249
$$ 939065 937483 935896 934549 934153 935156 937223 939798 943001 947469 953340 960003 967052 974918 984167
58354I84167J0453J0930J0788J0185R128P996P466P604P692P197O315N463M953
$$ 984167 994620 1005550 1016338 1026523 1035651 1043647 1051113 1058717 1066409 1073606 1079921 1085384 1090337
58341A090337N148O192P415P883P764Q200R608J1130J2129J3061J4332J5381J5685
$$ 1090337 1095485 1101677 1109092 1116975 1124739 1132939 1142547 1153677 1165806 1178867 1193199 1208580 1224265
58328A224265J5722J6097J6515J6460J6090J5647J4791J3426J2363J2211J2277
$$ 1224265 1239987 1256084 1272599 1289059 1305149 1320796 1335587 1349013 1361376 1373587 1385864
58317A385864J1706J0999J1223J2194J2704J2297J1732J1778J2519J3680J4825
$$ 1385864 1397570 1408569 1419792 1431986 1444690 1456987 1468719 1480497 1493016 1506696 1521521
58306A521521J5361J5143J4907J5466J6752J8160J9332J9969J9634J8610J8262
$$ 1521521 1536882 1552025 1566932 1582398 1599150 1617310 1636642 1656611 1676245 1694855 1713117
58295A713117J9481K1421K2771K3616K4784K6052K6564K6582K7177K8425K9447
$$ 1713117 1732598 1754019 1776790 1800406 1825190 1851242 1877806 1904388 1931565 1959990 1989437
58284A989437L0172L1510L3696L5930L7857L9969M2356M4333M5662M6907M8212
$$ 1989437 2019609 2051119 2084815 2120745 2158602 2198571 2240927 2285260 2330922 2377829 2426041
58273B426041M8861M8429M7411M6408M5574M5085M5206M5811M6607M7897N0151
$$ 2426041 2474902 2523331 2570742 2617150 2662724 2707809 2753015 2798826 2845433 2893330 2943481
58262B943481N2952N5423N7678O0702O4753O9028P2970P6764Q0443Q3628Q6264
$$ 2943481 2996433 3051856 3109534 3170236 3234989 3304017 3376987 3453751 3534194 3617822 3704086
58251C704086Q8652R0786R2660R4997R8511J02736J06844J11286J17080J23918
$$ 3704086 3792738 3883524 3976184 4071181 4169692 4272428 4379272 4490558 4607638 4731556
58241D731556J30699J37732J46418J56729J67029J76568J86339J97281K09435
$$ 4731556 4862255 4999987 5146405 5303134 5470163 5646731 5833070 6030351 6239786
58232F239786K23018K38403K54898K71510K88994L09039L31484L54718L78937
$$ 6239786 6462804 6701207 6956105 7227615 7516609 7825648 8157132 8511850 8890787
58223H890787M06275M37425M71007N06911N47299N93454O44573P00734P64156
$$ 8890787 9297062 9734487 10205494 10712405 11259704 11853158 12497731 13198465 13962621
58214A3962621Q36363R16968J006481J107375J221253J348328J491427J657572
$$ 13962621 14798984 15715952 16722433 17829808 19051061 20399389 21890816 23548388
58206B3548388J854387K088375K368396K707364L119424L620277M232871M989071
$$ 23548388 25402775 27491150 29859546 32566910 35686334 39306611 43539482 48528553
58198D8528553N924182P074649Q481811J0188836J2228061J4616448J7363874
$$ 48528553 54452735 61527384 70009195 80198031 92426092 107042540 124406414
58191A24406414K0465131K3851080K7317493L0469298L2701202L3242336L1322493
$$ 124406414 144871545 168722625 196040118 226509416 259210618 292452954 323775447
58184C23775447K6474123J8841668R277697q89253j0299227j7966036k3455405
$$ 323775447 350249570 369091238 378368935 377479682 367180455 349214419 325759014
58177C25759014k6815428k8366694k8494230k7538353k5790473k3525417k1004446
$$ 325759014 298943586 270576892 242082662 214544309 188753836 165228419 144223973
58170A44223973j8446321j6005035j3773091j1795735j0082337q617995p377257
$$ 144223973 125777652 109772617 95999526 84203791 74121454 65503459 58126202
58163E8126202o332585n455408m717368m094561l568670l123475k743351k416024
$$ 58126202 51793617 46338209 41620841 37526280 33957610 30834135 28090784 25674760
58155B5674760k133753j890484j679911j496825j337792j199460j077963r70578
$$ 25674760 23541007 21650523 19970612 18473787 17135995 15936535 14858572 13887994
58147A3887994q76209p93893p22339o60778o08336n62630n20931m82620m48491
$$ 13887994 13011785 12217892 11495553 10834775 10226439 9663809 9142878 8660258 8211767
58138H211767m17965l89198l61820l37019l14702k93209k72243k53603k38189
$$ 8211767 7793802 7404604 7042784 6705765 6391063 6097854 5825611 5572008 5333819
58129E333819k24530k11197j98613j87476j77202j67006j57125j48058j39848
$$ 5333819 5109289 4898092 4699479 4512003 4334801 4167795 4010670 3862612 3722764
58120C722764j32707j26909j21624j15343j08064j01464r6371r1733q6790q2430
$$ 3722764 3590057 3463148 3341524 3226181 3118117 3016653 2920282 2828549 2741759 2659329
58110B659329p9329p6360p2223o7536o3960o2043o0993n9866n8179n5941n3785
$$ 2659329 2580000 2503640 2431417 2363881 2299921 2237878 2176885 2117019 2058840 2002899 1949114
58099A949114n2443n1664n0432m8500m6642m5090m2997m0005l6982l4441l1511
$$ 1949114 1896671 1845007 1794575 1746075 1699433 1654343 1611346 1571341 1534359 1499918 1468407
58088A468407k7595k3838k1715k0947k0120j8758j7668j7584j8496k0013k1516
$$ 1468407 1440812 1416974 1395259 1374312 1354192 1335434 1317766 1300182 1281686 1261673 1240157
58077A240157k2235k1906k1271k1271k1973k2673k2812k2355k1599k0971k0759
$$ 1240157 1217922 1196016 1174745 1153474 1131501 1108828 1086016 1063661 1042062 1021091 1000332
58066A000332k0731k0358j9504j8445j7115j5124j2783j1278j1342j2314j3058
$$ 1000332 979601 959243 939739 921294 904179 889055 876272 864994 853652 841338 828280
58055H28280j3220j3138j3055j2980j2914j2749j2304j1687j1179j0608r482p958
$$ 828280 815060 801922 788867 775887 762973 750224 737920 726233 715054 704446 694964 687006
58043F87006o923o790o956o806o495o307o110n892o106o782p117o680o297p006
$$ 687006 680083 673293 666337 659531 653036 646729 640619 634727 628621 621839 614722 608042 601745 594739
58029E94739q608j0049j0727j0730j0204r254q191p261o380n484m809m381l814
$$ 594739 586131 576082 565355 554625 544421 535167 526976 519715 513335 507851 503042 498661 494847
58016D94847l068k772l309m082m392m417m690n063m938m122k831j304N3N99L00
$$ 494847 491779 489007 485698 481616 477224 472807 468117 463054 458116 453994 451163 449859 449912 450511 450811
58001D50811R9O90J436J312M69j17k65p77k091l688m855n344n240m812m550m742
$$ 450811 450910 451600 453036 454348 454817 454700 454435 453658 451567 447879 443024 437680 432440 427628 423078 418336
57985D18336n054m999m687m606m779m768m405l964l631l288k790k098j221m75
$$ 418336 413282 408283 403596 398990 394211 389443 385038 381074 377443 374155 371365 369267 368046 367571
57971C67571m12j095j726j637j287j559k336k632k058j326j101j175r97n10q9
$$ 367571 367159 366064 364338 362701 361414 359855 357519 354887 352829 351503 350402 349227 348230 347720 347631
57956C47631m2l46o92o99l08J18K16L7k02m79p46o95j78L96N68N12P42J365K122
$$ 347631 347589 347243 346551 345852 345544 345662 345878 345915 345713 345234 344488 343793 343615 344011 344579 345091 345833 347198 349320
57937C49320K900L707M347M754N380O611Q001Q761Q795Q585Q183P184N600M001
$$ 349320 352220 355927 360274 365028 370408 377019 385020 393781 402576 411161 419344 426528 432128 436129
57923D36129K620J102p06k393l636m654n737o759p449p727p689p499p374p327
$$ 436129 438749 439851 439145 436752 433116 428462 422725 415966 408517 400790 393101 385602 378228 370901
57909C70901p016o154n018m091l328k327j154l77l44q83j735k672l262l150k645
$$ 370901 363885 357731 352713 348622 345294 342967 341813 341436 341092 340209 338474 335802 332540 329390 326745
57894C26745k422k544k433j876j383j335j414j162o13n4L97P55J043J365J754
$$ 326745 324323 321779 319346 317470 316087 314752 313338 312176 311563 311509 311906 312661 313704 315069 316823
57879C16823J909J426M67l44p17r95j500k021k149j785j260j152j878l116l847
$$ 316823 318732 320158 320625 320281 319564 318569 317069 315048 312899 311114 309854 308702 306824 303708 299861
57864B99861l439k413j589q53L77J804K500K456K623L265L510K960K489K789L288
$$ 299861 296422 294009 292420 291567 291944 293748 296248 298704 301327 304592 308102 311062 313551 316340 319628
57849C19628L341L427M114M698M033K178J18j662l223m158l899l008k936m176
$$ 319628 322969 326396 330510 335208 339241 341419 341537 339875 336652 332494 328595 325587 322651 318475
57835C18475n567n890n356n036n314n526m901l462j906q23j40O71J878L171M181
$$ 318475 312908 307018 301662 296626 291312 285786 280885 277423 275517 274694 274554 275225 277103 280274 284455
57820B84455M988N872O667O696N405K936R4k136l233l491l707m338n090n361m849
$$ 284455 289443 295315 301982 308678 314083 317019 317113 314977 311744 308253 304546 300208 295118 289757 284908
57805B84908l661k039k60J323K347K604K221J748J928K983M221M679M217L497
$$ 284908 281247 279208 278948 280271 282618 285222 287443 289191 291119 294102 298323 303002 307219 310716
57791C10716K860J865J95j560k490k374j654p47J69R24J392J649J868K111K399
$$ 310716 313576 315441 315636 314076 311586 309212 307558 306811 306980 307904 309296 310945 312813 314924 317323
57776C17323K700K714K040P96l60j065j732k793l954m624m767m752m677m421m151
$$ 317323 320023 322737 324777 325573 325213 324148 322416 319623 315669 311045 306278 301526 296849 292428 288277
57761B88277m197m499m703m693m590m292l600k713k109j844j434n43O07J590K268
$$ 288277 284080 279581 274878 270185 265595 261303 257703 254990 252881 251037 249603 249060 249667 251257 253525
57746B53525K724K916K651J898J018N46N83O05J03o91j175j276j422j657j537
$$ 253525 256249 259165 261816 263714 264732 265278 265861 266466 266569 265878 264703 263427 262005 260348 258811
57731B58811j151j331k373l408l611l328l207k959k014q18k80l14m2N94P33J32
$$ 258811 257660 256329 253956 250548 246937 243609 240402 237443 235429 234611 234331 234017 233975 234569 235302 235434
57715B35434l62k11k2n15j461k187k460k467k372k315k368k238j426p5R05Q68
$$ 235434 235072 234861 234839 234324 232863 230676 228216 225749 223377 221062 218694 216456 215030 214955 215860 216728
57699B16728K59M5O34J619K325K399K097K053K468K717K103R31R9k29p11j520
$$ 216728 216987 217032 217666 219285 221610 224009 226106 228159 230627 233344 235447 236378 236477 236248 235537 234017
57683B34017j925j526r46p53n13M01J800L232M881P100R553J1797J4318J7996
$$ 234017 232092 230566 229620 228867 228354 228755 230555 233787 238668 245768 255321 267118 281436 299432
57669B99432K2756K7702L2447L7175M1187M2356L8643K9669J6716J904j2296k3574
$$ 299432 322188 349890 382337 419512 460699 503055 541698 571367 588083 589987 577691 554117
57657E54117l0796l4474l5906l5874l4438l1668k8060k4240k0575j7203j4178
$$ 554117 523321 488847 452941 417067 382629 350961 322901 298661 278086 260883 246705
57646B46705j1545r396p797o642n591m419l320k608k143j414l25M61L26l76o83
$$ 246705 235160 225764 217967 211325 205734 201315 197995 195387 193244 191830 191505 191966 192292 191916 191233
57631A91233k52L03L68R4p1j55m25p36p48o28q95j527j820j318m27J77K84R5k58
$$ 191233 190981 191284 191652 191746 191675 191520 191095 190359 189611 188983 188088 186561 184741 183423 182996 183173 183457 183552 183294
57612A83294p72j372j918k238k097j389m92k0q6j67M7K11L5n3M40J095J044J83
$$ 183294 182522 181150 179232 176994 174897 173508 173016 172996 172910 172743 172790 173001 173036 172983 173423 174518 175562 175745
57594A75745p62j327j710j978j756j078p97j493k462k551j790j356j860k441j987
$$ 175745 174983 173656 171946 169968 168212 167134 166337 164844 162382 159831 158041 156685 154825 152384 150397
57579A50397p07J41j25q70j085n41K47Q00J017Q65K80n99j354j693j721j677j523
$$ 150397 149690 149831 149706 148836 147751 147210 147457 148257 149274 150139 150419 149820 148466 146773 145052 143375 141852
57562A41852j086m75j12j81l58k44P1K05J56L82J055J671J706J412J423J790J895
$$ 141852 140766 140291 140179 139998 139640 139396 139467 139672 139828 140210 141265 142936 144642 146054 147477 149267 151162
57545A51162J365N32j11l50q0O87J376J124j3q32m82M01P86P60R64J108L48r92
$$ 151162 152527 153059 152948 152598 152518 153205 154581 155705 155692 154860 154378 154779 155565 156325 157289 158397 158745 157753
57527A57753j501o82L80P09N64M46R9n90p82J80J500J873J229N71L38M3n68r89
$$ 157753 156252 155570 155950 156659 157223 157669 157768 157178 156396 156576 158076 159949 161178 161749 162087 162130 161562 160573
57509A60573p58q2N79R72J018P46L47L6j83l30k36Q2P2p33j883k377j903j155
$$ 160573 159815 159733 160312 161284 162302 163048 163395 163431 163248 162918 162682 162764 162836 162103 160220 157843 155940 154785
57491A54785q39r17r48p26l36J30O11J000J123Q28K22j81J16Q03R29J99m17rQ49
$$ 154785 153946 153029 152081 151355 151019 151149 151760 152760 153883 154711 154933 154752 154868 155671 156600 156799 156382 156373 157222
57472A57222Q66o2q19q12o49q63j091r71q98j210j402q91m2L58K89M21J005J486
$$ 157222 158088 158026 157207 156395 155746 154883 153792 152821 151923 150713 149311 148420 148378 148736 149025 149446 150451 151937
57454A51937J284N11k03l29Q5N10N67M93O96R51N89l60r75o53O6L72K46J08m8
$$ 151937 153221 153732 153529 153200 153285 153795 154362 154855 155551 156502 157091 156731 155756 155103 155169 155541 155787 155895 155847
57435A55847m06o21k53L60M39j6j72M24J263J600J215L72m49p01k11M89O99M41
$$ 155847 155441 154820 154567 154927 155366 155350 155178 155602 156865 158465 159680 160052 159603 158902 158691 159180 159879 160320
57417A60320K49J62k69r01r17j58L23k33r77n22J181K868L574L328K477J271K04
$$ 160320 160569 160731 160462 159561 158644 158486 158809 158576 157599 157077 158258 161126 164700 168028 170505 171776 171980
57400A71980j65l6k89j173j783j245R2J231J813K167K370K067J269N89M99P78
$$ 171980 171815 171779 171490 170317 168534 167289 167381 168612 170425 172592 174962 177029 178298 178887 179386 180164
57384A80164R65R81J033J194J411J626J682J277M08l63m58o9O3l21n93j03Q94
$$ 180164 181129 182110 183143 184337 185748 187374 189056 190333 190741 190378 189920 189851 189914 189593 189000 188897 189791
57367A89791J485J189M56M0J44L46L16K82O86J521K277K470K037J154N2q48j028
$$ 189791 191276 192465 192921 192961 193105 193451 193767 194049 194735 196256 198533 201003 203040 204194 204246 203398 202370
57350B02370m27L16N83N75Q81J469J725J500J380J686J843J230J11p39j050j084
$$ 202370 201943 202259 202842 203417 204298 205767 207492 208992 210372 212058 213901 215131 215242 214503 213453 212369
57334B12369r83o82l41k13j50K38Q24J005N95J61J83L58J49l30m65n3M47N69M10
$$ 212369 211386 210704 210363 210150 210000 210238 211062 212067 212662 212823 213006 213364 213513 213183 212718 212665 213112 213681 214091
57315B14091L84O38R53J062R72Q47P95Q04Q59R59R93Q12M21J4k51l64l11l3L35
$$ 214091 214475 215113 216066 217128 218100 218947 219742 220546 221405 222364 223357 224169 224590 224604 224353 223989 223678 223645 223980
57296B23980M77L47L02N18N67J32k23K90J340J651P40l11l57L23O72M56K99L96
$$ 223980 224457 224804 225106 225624 226191 226323 226100 226390 227730 229381 230121 229810 229453 229776 230448 230904 231203 231599
57278B31599J80n39r67l30R86J822J560P32L55Q91J889K511K459K242K421K717
$$ 231599 231779 231240 230273 229943 230929 232751 234311 235043 235398 236289 238178 240689 243148 245390 247811 250528
57262B50528K376J407Q83J594K844L192K250J077P74J299J904K209K342K454K586
$$ 250528 252904 254311 255194 256788 259632 262824 265074 266151 266925 268224 270128 272337 274679 277133 279719
57247B79719K912L445L620K821J479R63J871L018K819J319J00K49J274K126K522
$$ 279719 282631 286076 289696 292517 293996 294959 296830 299848 302667 303986 304086 304335 305609 307735 310257
57232C10257K780L028L178L315L508L499L081K642K793L569M478N175N598N585
$$ 310257 313037 316065 319243 322558 326066 329565 332646 335288 338081 341650 346128 351303 356901 362486
57218C62486N059M521M667N351N641N126M445M249M339M314M391M851N228M901
$$ 362486 367545 372066 376733 382084 387725 392851 397296 401545 405884 410198 414589 419440 424668 429569
57204D29569M228M167M872N502N552N540O061O831P141O819O276N904N881O338
$$ 429569 433797 437964 442836 448338 453890 459430 465491 472322 479463 486282 492558 498462 504343 510681
57190E10681P233Q161Q646Q695Q785R242R876J0336J0613J1001J1621J2171J2335
$$ 510681 517914 526075 534721 543416 552201 561443 571319 581655 592268 603269 614890 627061 639396
57177F39396J2298J2564J3196J3593J3314J2793J2815J3442J4009J4197J4378
$$ 639396 651694 664258 677454 691047 704361 717154 729969 743411 757420 771617 785995
57166G85995J4766J4897J4435J3948J4192J4989J5502J5500J5565J5985J6223
$$ 785995 800761 815658 830093 844041 858233 873222 888724 904224 919789 935774 951997
57155I51997J5851J5404J5790J7147J8721J9775K0200K0335K0580K1251K2439
$$ 951997 967848 983252 999042 1016189 1034910 1054685 1074885 1095220 1115800 1137051 1159490
57144A159490K3890K5150K5934K6228K6100K5704K5529K6251K7978K9878L0960
$$ 1159490 1183380 1208530 1234464 1260692 1286792 1312496 1338025 1364276 1392254 1422132 1453092
57133A453092L1257L1750L3097L4842L6150L6902L7590L8456L9412M0801M3431
$$ 1453092 1484349 1516099 1549196 1584038 1620188 1657090 1694680 1733136 1772548 1813349 1856780
57122A856780M7376N1151N2749N1501M8705M6517M6438M8728N2691N7362O2097
$$ 1856780 1904156 1955307 2008056 2059557 2108262 2154779 2201217 2249945 2302636 2359998 2422095
57111B422095O6800P1681P6934Q2737Q9469R7643J07711J20180J35915J56104
$$ 2422095 2488895 2560576 2637510 2720247 2809716 2907359 3015070 3135250 3271165 3427269
57101C427269J81857K14027K53514L01498L59251M27864N08088N99935P02016
$$ 3427269 3609126 3823153 4076667 4378165 4737416 5165280 5673368 6273303 6975319
57092F975319Q11111R22545J030869J130273J214737J278427J316225J323940
$$ 6975319 7786430 8708975 9739844 10870117 12084854 13363281 14679506 16003446
57084A6003446J298121J236013J136148R99666Q31799O42201M42726K43164M8127
$$ 16003446 17301567 18537580 19673728 20673394 21505193 22147394 22590120 22833284 22881411
57075B2881411j41879l25998m99951o57649p95301r12926j011562j089845j144166
$$ 22881411 22739532 22413534 21913583 21255934 20460633 19547707 18536145 17446300 16302134
57066A6302134j171845j173444j152141j112125j058060r95088r27802q58758
$$ 16302134 15130289 13956845 12804704 11692579 10634519 9639431 8711629 7852871
57058G852871p88641p18063o48704n82435n20020m61350m06683l56926l12669
$$ 7852871 7064230 6346167 5697463 5115028 4595008 4133658 3726975 3370049 3057380
57049C057380k73522k38713k07906j81037j57665j36952j18380j02084q8237p6268
$$ 3057380 2783858 2545145 2337239 2156202 1998537 1861585 1743205 1641121 1552884 1476616
57039A476616o4959n3442m1908l1124k1263j1608j788O612J0214O137n464k1081
$$ 1476616 1411657 1358215 1316307 1285183 1263920 1252312 1250524 1257136 1267350 1273487 1268023 1246942
57027A246942l5961m6839n3124n6043n6953n6318n3982n0071m5322m0554l6094
$$ 1246942 1210981 1164142 1111018 1054975 998022 941704 887722 837651 792329 751775 715681
57016G15681l1893k7994k4576k1684j9280j7509j6498j5867j4912j3515j2378
$$ 715681 683788 655794 631218 609534 590254 572745 556247 540380 525468 511953 499575
57005D99575j1993j1794j0859r245p999p818q309q635q436p814o887n778m791
$$ 499575 487582 475788 464929 455684 447685 439867 431558 422923 414487 406673 399786 394008 389217
56992C89217m181l724k847j232Q10K647L945M933O013P124P622O932N111K600
$$ 389217 385036 381312 378465 377233 378043 380690 384635 389568 395581 402705 410327 417259 422370 424970
56978D24970l56l603o528q257q586q233p944p723p254o601o013n329m155k506
$$ 424970 424614 421011 414483 406226 397640 389407 381463 373740 366486 359885 353872 348543 344388 341882
56964C41882q13O98K229M029O104Q291J0310J1734J2161J1437R527O388K272j957
$$ 341882 341069 341767 343996 348025 354129 362420 372730 384464 396625 408062 417589 423977 426249 424292
56950D24292n309p523r107j0478j1468j1752j1366j0575r470p928n828l159j17
$$ 424292 418983 411460 402353 391875 380407 368655 357289 346714 337244 329316 323488 320329 320212
56937C20212K845N216O934Q561J0760J3577J6224J7593J6991J4441J0394N258
$$ 320212 323057 328273 335207 343768 354528 368105 384329 401922 418913 433354 443748 449006
56925D49006n81o341j0929j3759j5255j6219j6859j6809j5920j4564j3203j2099
$$ 449006 448425 442084 431155 417396 402141 385922 369063 352254 336334 321770 308567 296468
56913B96468j1434j1205j0875r693p640n659m603m233l587k260q83m07j036j947
$$ 296468 285034 273829 262954 253261 245621 239962 235359 231126 227539 225279 224396 223989 222953 221006
56899B21006k000p73J072K439K783K468K296K781L773M702N265N884P121Q658
$$ 221006 219006 218233 219305 221744 224527 226995 229291 232072 235845 240547 245812 251696 258817 267475
56885B67475R384Q832P858P269O386L964K41l047m717n172n270n168m707l964
$$ 267475 276859 285691 293549 300818 307204 311168 311409 308362 303645 298473 293203 288035 283328 279364
56871B79364k908j269P67K456L625N174P880J1350J4764J8011K1258K4042K5554
$$ 279364 276456 275187 275954 278410 282035 287209 295089 306439 321203 339214 360472 384514 410068
56858D10068K5476K3757J9974J3940O684q0n455r718j3201j5642j6663j6218j4482
$$ 410068 435544 459301 479275 493215 499899 499819 494364 484646 471445 455803 439140 422922 408440
56845D08440j1743q510n204j753K223O838J1855J6937K1747K6083L0223L4693
$$ 408440 396697 388187 382983 381230 383453 390291 402146 419083 440830 466913 497136 531829
56833E31829L9111M1647M0310L4485K4902J2755l03j2058k0938k7178l1835l4878
$$ 531829 570940 612587 652897 687382 712284 725039 724736 712678 691740 664562 632727 597849
56821E97849l5425l3565l0534k6980k2464j6953j1457o626j904L327Q723J3768
$$ 597849 562424 528859 498325 471345 448881 431928 420471 413845 411941 415268 423991 437759
56809D37759J8565K3213K7070K9266K9180K6048J9167R197j572j1060j8705k4464
$$ 437759 456324 479537 506607 535873 565053 591101 610268 619465 617893 606833 588128 563664
56797E63664k7762k8490k7955k7393k6237k3291j9044j5282j2661j0173p050l723
$$ 563664 535902 507412 479457 452064 425827 402536 383492 368210 355549 345376 338326 334603
56785C34603o48K479N908R238J2046J4150J4930J3396R471M391o71n611j0545
$$ 334603 333955 336434 342342 351580 363626 377776 392706 406102 415573 419964 419293 413682 403137
56772D03137j4823j7718j9400k0366k0375j8948j6626j4691j3549j2285j0140
$$ 403137 388314 370596 351196 330830 310455 291507 274881 260190 246641 234356 224216
56761B24216p773o446o382o563o066n023m168l865l941m106m132l749k906k126
$$ 224216 216443 209997 203615 197052 190986 185963 181795 177930 173989 169883 165751 162002 159096 156970
56747A56970k050k486k443j436k09K87J54K02O27Q08L21m66r46r13n30q4J09n5
$$ 156970 154920 152434 149991 148555 148346 148633 148787 148989 149616 150424 150745 150279 149333 148420 147890 147806 147915 147860
56729A47860l10l27j46K7K57O77J001Q67N25N54Q76Q18K52j02J74N78N22J61j56
$$ 147860 147550 147223 147077 147104 147361 148038 149039 149906 150431 150985 151861 152679 152931 152829 153003 153581 154103 154264 154108
56710A54108m94q95r13l06L08K66j00mN52R44J078J402J775J418K46p46q83p69
$$ 154108 153614 152719 151806 151500 151808 152074 151974 151970 152522 153466 154544 155946 157721 159139 159385 158639 157756 156987
56692A56987j206j840j718q41j84k56m49r6N55Q17N77K95K37J88oj10J06M49N28
$$ 156987 155781 153941 152223 151382 151198 150942 150493 150397 150952 151769 152346 152641 152878 153066 153060 152950 153056 153505 154033
56673A54033K74m4k01k22j48R6N11Q59Q69N51J80k5p2o4J8K74O09O98L55r5j04
$$ 154033 154307 154263 154062 153840 153692 153788 154299 155158 156027 156578 156758 156733 156661 156597 156615 156889 157498 158196 158551 158456 158352
56652A58352L75O99L49l13l70N42J824K560K337J432M49q2p5Q5O6J08O78J613
$$ 158352 158727 159426 159775 159462 159092 159634 161458 164018 166355 167787 168236 168154 168079 168164 168230 168338 169016 170629
56634A70629K045J377J0j210j858j958j553p28P3K89j61p65r44n04L19J032J225
$$ 170629 172674 174051 174061 172851 170993 169035 167482 166754 166827 167116 166955 166190 165246 164742 165061 166093 167318
56617A67318R05M30j5o49j516k095j856j033l49j54l23q20j580j964j155O11J857
$$ 167318 168223 168653 168638 167989 166473 164378 162522 161489 161140 160986 160663 159843 158263 156299 155144 155755 157612
56600A57612J447j25j431j661j100m00M7J67O4o6j14j09m7J21K46O0k97k73K97
$$ 157612 159059 158934 157503 155842 154742 154342 154389 154556 154620 154554 154440 154331 154284 154405 154651 154711 154414 154141 154438
56581A54438P70N52jp3M50R03Q16M15J50K40P05J360J734J521J094J129J662K101
$$ 154438 155208 155760 155759 155686 156136 157039 157855 158270 158420 158660 159365 160725 162459 163980 165074 166203 167865 169966
56563A69966K261K687L695M774N374N689O091O262N573M082K513J322M24k50n42
$$ 169966 172227 174914 178609 183383 188757 194446 200537 206799 212372 216454 218967 220289 220713 220463 219921
56548B19921n72r06j840k845l092k433j589j356j795k274k288k005j861j859j584
$$ 219921 219349 218443 216603 213758 210666 208233 206644 205288 203493 201219 198931 196926 195065 193206 191622
56533A91622j006p23j132j726j696r76k11J78L77O09P45O65N90P81J131J276R90
$$ 191622 190616 189893 188761 187035 185339 184363 184152 184330 184707 185316 186061 186726 187316 188097 189228 190504 191494
56516A91494L86j87m17l76m85r84j439j237m53J13m1m90m72K04J034J352Q35k46
$$ 191494 191880 191693 191276 190900 190415 189431 187992 186755 186302 186415 186374 185884 185412 185616 186650 188002 188837 188591
56498A88591j082r77j27N60N74L18K04j22j048j923j648l08O60K16j012j657j238
$$ 188591 187509 186532 186405 186965 187539 187857 188061 187939 186891 184968 183320 183012 183672 183888 182876 181219 179981
56481A79981l83K45O06Q77R53O36P9j78K63J160J716J344L59l18k42O2p1l90l0
$$ 179981 179598 179843 180449 181326 182279 182915 182994 182816 183079 184239 185955 187299 187658 187340 187098 187160 187089 186699 186669
56462A86669J150K115J873O79l96p98q30p87m50L18J048J163P26L19K90N24Q60
$$ 186669 187819 189934 191807 192486 192090 191292 190462 189675 189225 189543 190591 191754 192480 192799 193089 193613 194473
56445A94473J288J703J771J291N31K0J4K68L68K70L53Q25J228R15mo49n04j21
$$ 194473 195761 197464 199235 200526 201057 201077 201091 201359 201727 201997 202350 203175 204403 205318 205314 204665 204161 204040
56427B04040k56p70r45o48m58o24o64j64N60R57R01O28K88m8j76J27Q29J573J853
$$ 204040 203784 203014 202069 201421 200963 200339 199675 199511 200071 201028 201929 202557 202845 202797 202621 202748 203577 205150 207003
56408B07003J380M81K6N43J421J495M56q53j543j480q46L36J759K591K303J384
$$ 207003 208383 208864 208890 209433 210854 212349 212805 211952 210409 208929 208083 208419 210178 212769 215072 216456
56392B16456P50O81Q41J013J237J419J307Q64L38LJ3K84L84j39j051j456q49K55
$$ 216456 217206 217887 218728 219741 220978 222397 223704 224568 224906 224909 224922 225206 225590 225451 224400 222944 222095 222350
56374B22350J052J311J155O05r0j96O68J774K113J637J021N40P6j50K17Q45J055
$$ 222350 223402 224713 225868 226473 226383 226187 226855 228629 230742 232379 233400 233940 234016 233866 234083 234928 235983
56357B35983R06R98J217Q16k10q55n56J15N53R13J365J471R83N62R72K052L053
$$ 235983 236889 237887 239104 239920 239710 238855 238299 238414 238967 239880 241245 242716 243699 244261 245233 247285 250338
56340B50338L480L194K229J110P81J525K351K146J129M96Q69J738K337K394K089
$$ 250338 253818 257012 259241 260351 261132 262657 265008 267154 268283 268779 269648 271386 273723 276117 278206
56325B78206J732J651J936K293K327K001J576J234R17N35R2l07m72k40K71P54
$$ 278206 279938 281589 283525 285818 288145 290146 291722 292956 293873 294408 294500 294193 293721 293481 293752 294506
56309B94506J051J274J517J728J847J853J618J148R16J471K570L276L112K596
$$ 294506 295557 296831 298348 300076 301923 303776 305394 306542 307458 308929 311499 314775 317887 320483
56295C20483K354K325K179K028K169K527K778K749K388J755J273J546K558L555
$$ 320483 322837 325162 327341 329369 331538 334065 336843 339592 341980 343735 345008 346554 349112 352667
56281C52667M027M237M483M484M147M135M971O116O760P027P529Q173Q408Q303
$$ 352667 356694 360931 365414 369898 374045 378180 383151 389267 396027 403054 410583 418756 427164 435467
56267D35467Q461R044R787J0775J2258J3823J4797J5371J6405J8108J9953K1906
$$ 435467 443928 452972 462759 473534 485792 499615 514412 529783 546188 564296 584249 606155
56255F06155K4629K8220L1909L5325L9128M3881M9165N4348N9471O4749O9901
$$ 606155 630784 659004 690913 726238 765366 809247 858412 912760 972231 1036980 1106881
56244A106881P4583P8911Q2993Q6292Q7986Q7649Q5208Q0690P4315O6436N7029
$$ 1106881 1181464 1260375 1343368 1429660 1517646 1605295 1690503 1771193 1845508 1911944 1968973
56233A968973M5734L2743J9151O016o481j8542k9983m0418m9701n7604o3562o7313
$$ 1968973 2014707 2047450 2066601 2072617 2066136 2047594 2017611 1977193 1927492 1869888 1806326 1739013
56221A739013o9456p0779p1391p1056o9928o8253o5688o1776n7020n2650m9274
$$ 1739013 1669557 1598778 1527387 1456331 1386403 1318150 1252462 1190686 1133666 1081016 1031742
56210A031742m6431m3577m0772l8159l5395l2056k8333k4927k2367k0591j9153
$$ 1031742 985311 941734 900962 862803 827408 795352 767019 742092 719725 699134 679981
56199F79981j7652j5983j4200j2308j0392q893q292q310p912o519m861m060m141
$$ 679981 662329 646346 632146 619838 609446 600553 592261 583951 576039 569520 564659 560599 556458
56186E56458m106l388k507k130k163k026j442n84K99J063J639J983K056J832J454
$$ 556458 552352 548964 546457 544327 542164 540138 538696 538112 538411 539474 541113 543096 545152 546984 548438
56171E48438J311J665K323K907L433M186N089N635N618N443N547N885O279O833
$$ 548438 549749 551414 553737 556644 560077 564263 569352 574987 580605 586048 591595 597480 603759 610592
56157F10592P737Q921J0207J1540J2832J3911J4953J6691J9658K3472K7380L1421
$$ 610592 618329 627250 637457 648997 661829 675740 690693 707384 727042 750514 777894 809315
56145H09315L6473M3079N0722N8449O5726P2296P7400P9694P8144P2933O5391
$$ 809315 845788 888867 939589 998038 1063764 1136060 1213460 1293154 1371298 1444231 1509622
56134A509622N7098M9137M2195L6951L3767L1916K9677K5729K0247J4390Q996
$$ 1509622 1566720 1615857 1658052 1695003 1728770 1760686 1790363 1816092 1836339 1850729 1859725
56123A859725M298M82k407n198r356j5657k3640l2649m2565n2871o1748o7138
$$ 1859725 1864023 1864505 1862098 1856900 1847544 1831887 1808247 1775598 1733033 1680162 1618414 1551276
56111A551276o8657o7590o5080o1048n5111m7734m0061l3031k7017k2038j7907
$$ 1551276 1482619 1415029 1349949 1288901 1233790 1186056 1145995 1112964 1085947 1063909 1046002
56100A046002j4283j0902p746m943k592p96L54R44J260J570J922K238K464K632
$$ 1046002 1031719 1020817 1013071 1008128 1005536 1004740 1005094 1006038 1007298 1008868 1010790 1013028 1015492 1018124
56086A018124K855L294M016M955O072P396Q794R865J0353J0493J0694J0998J1192
$$ 1018124 1020979 1024273 1028289 1033244 1039316 1046712 1055506 1065371 1075724 1086217 1096911 1107909 1119101
56073A119101J1284J1469J1761J2094J2657J3589J4441J4595J4228J4229J5010
$$ 1119101 1130385 1141854 1153615 1165709 1178366 1191955 1206396 1220991 1235219 1249448 1264458
56062A264458J6026J6717J7221J7848J8478J8926J9428K0306K1519K2832K4067
$$ 1264458 1280484 1297201 1314422 1332270 1350748 1369674 1389102 1409408 1430927 1453759 1477826
56051A477826K4933K5152K5037K5391K6401K7224K7199K6852K7088K7876K8543
$$ 1477826 1502759 1527911 1552948 1578339 1604740 1631964 1659163 1686015 1713103 1740979 1769522
56040A769522K8981K9793L1297L3152L4851L6101L6765L6968L7194L7825L8731
$$ 1769522 1798503 1828296 1859593 1892745 1927596 1963697 2000462 2037430 2074624 2112449 2151180
56029B151180L9624M0618M1937M3349M4460M5434M6854M8954N1424N3936N6425
$$ 2151180 2190804 2231422 2273359 2316708 2361168 2406602 2453456 2502410 2553834 2607770 2664195
56018B664195N8981O1759O4917O8322P1565P4511P7540Q0899Q4254Q7300R0464
$$ 2664195 2723176 2784935 2849852 2918174 2989739 3064250 3141790 3222689 3306943 3394243 3484707
56007C484707R4363R8914J03448J07599J11679J16373J22275J29364J36797J43764
$$ 3484707 3579070 3677984 3781432 3889031 4000710 4117083 4239358 4368722 4505519 4649283
55997D649283J50708J58935J68814J79325J89794K00962K13641K27534K42219
$$ 4649283 4799991 4958926 5127740 5307065 5496859 5697821 5911462 6138996 6381215
55988F381215K58145K75646K94122L13375L34612L58802L85258M13364M44488
$$ 6381215 6639360 6915006 7209128 7522503 7857115 8215917 8601175 9014539 9459027
55979I459027M80307N20408N63596O10724O64026P24398P91633Q66856R52535
$$ 9459027 9939334 10459742 11023338 11634062 12298088 13022486 13814119 14680975 15633510
55970A5633510J050530J162444J291523J442095J617811J822954K065115K354522
$$ 15633510 16684040 17846484 19138007 20580102 22197913 24020867 26085982 28440504
55962B8440504K702013L120752L629556M252299N016086N953536P104180Q507021
$$ 28440504 31142517 34263269 37892825 42145124 47161210 53114746 60218926 68725947
55954F8725947J0190372J2170447J4454115J7032679J9868097K2873288K5859541
$$ 68725947 78916319 91086766 105540881 122573560 142441657 165314945 191174486
55947A91174486K8432690K9912754K9428096K6248093K0198674J1876920K496203
$$ 191174486 219607176 249519930 278948026 305196119 325394793 337271713 339767916
55940C39767916o551654j4161694j9777244k3369759k5224081k5701288k5114060
$$ 339767916 333216262 319054568 299277324 275907565 250683484 224982196 199868136
55933A99868136k3726450k1792966j9562564j7249268j5009909j2944247j1103897
$$ 199868136 176141686 154348720 134786156 117536888 102526979 89582732 78478835
55926G8478835r501875q126454o956403n968236n136224m434253l840491l338204
$$ 78478835 68976960 60850506 53894103 47925867 42789643 38355390 34514899 31176695
55918C1176695k912536k549732k239360j974097j746928j550800j380725j233673
$$ 31176695 28264159 25714427 23475067 21500970 19754042 18203242 16822517 15588844
55910A5588844j106160r94163q95275q08725p33139o66216o06591n54093n08017
$$ 15588844 14482684 13488521 12593246 11784521 11051382 10385166 9778575 9224482 8716465
55901H716465m66941m30203l97802l68866l41974l16959k94667k74886k56279
$$ 8716465 8249524 7819321 7421519 7052653 6710679 6393720 6099053 5824167 5567888
55892E567888k38446k22254k07996j94969j83191j73814j67287j62423j57772
$$ 5567888 5329442 5107188 4899192 4704223 4521032 4347218 4179931 4017508 3859736
55883C859736j52707j46950j40349j33421j26905j20484j13175j05133r7677r1323
$$ 3859736 3707029 3560079 3419730 3286309 3159404 3038920 2925745 2820612 2722935 2631612
55873B631612q5239p9173p4335p1660p0358o9006o7079o4662o1652n8101n4627
$$ 2631612 2546373 2467200 2392865 2321205 2250847 2181841 2114762 2050100 1988448 1930347 1875720
55862A875720n1748m9384m7479m6402m6199m6165m5650m4715m3488m1583l8797
$$ 1875720 1823972 1774588 1727109 1680707 1634508 1588343 1542693 1497978 1454490 1412907 1374110
55851A374110l5823l3584l2256l1306l0249k8926k7498k6396k5988k5986k5621
$$ 1374110 1338287 1304703 1272447 1241141 1210892 1181966 1154468 1128072 1102084 1076098 1050477
55840A050477k4580k3253k1954k0493j8817j7467j6929j6993j7109j6962j6428
$$ 1050477 1025897 1002644 980690 960197 941380 923913 906984 889991 872882 855920 839492
55829H39492j5405j4063j2867j2057j1441j0972j0987j1628j2424j2834j2854
$$ 839492 824087 810024 797157 785100 773659 762687 751700 740072 727648 714814 701960
55818G01960j2824j2931j3189j3509j3622j3237j2480j1792j1242j0455r324q288
$$ 701960 689136 676205 663016 649507 635885 622648 610168 598376 587134 576679 567355 559067
55806E59067p619o993o094n152m418l659k576j429p27n79p87j306k104k745k610
$$ 559067 551448 544455 538361 533209 528791 525132 522556 521127 520400 519821 519034 517728 515624 512879 510269
55791E10269j530N7J632L021M396N938P458Q423Q434P595O059L374j044o646j1564
$$ 510269 508739 508796 510428 513449 517845 523783 531241 539664 548098 555693 561752 565126 564082 557436 545872
55776E45872j4133j4281j3050j1237q845n675j949J539L630L347O45l449p544
$$ 545872 531739 517458 504408 493171 484326 478651 476702 478241 481871 485218 485863 482414 474870
55763D74870j0792j3018j4352j4937j4833j4040j2691j1200r952q779p191n271
$$ 474870 464078 451060 436708 421771 406938 392898 380207 369007 359055 350276 343085 337814
55751C37814l922l933n039o254o836o740o397o301o677p204p257o550n443m477
$$ 337814 333892 329959 324920 318666 311830 305090 298693 292392 285715 278511 271254 264704 259261 254784
55737B54784l876l600l561l607l507l212k856k441j825j146r21j420k327l113
$$ 254784 250908 247308 243747 240140 236633 233421 230565 228124 226299 225153 224232 222812 220485 217372
55723B17372l515l437k964k618l025l911m074k911j487j248k053k351j246M94
$$ 217372 213857 210420 207456 204838 201813 197902 193828 190917 189430 188182 186129 183778 182532 183026
55709A83026J638J871J702J523J280Q17J64m71r12j198j598k267k982l428l647
$$ 183026 184664 186535 188237 189760 191040 191857 192021 191550 190638 189440 187842 185575 182593 179165 175518
55694A75518l960m387m503l966k974k060j624j666j886j854j337n01K28O28Q67
$$ 175518 171558 167171 162668 158702 155728 153668 152044 150378 148492 146638 145301 144800 145028 145656 146523
55679A46523J177J485J519J220Q24N02J30m28r94j256j235j239j237p96J22P17
$$ 146523 147700 149185 150704 151924 152748 153250 153380 152952 151958 150702 149467 148228 146991 146195 146317 147034
55663A47034K53p68j036p3J166J527R75L32J56L18M53L82J22j63l49n16q65j293
$$ 147034 147287 146519 145483 145410 146576 148103 149078 149410 149566 149884 150337 150719 150841 150678 150329 149813 148948 147655
55645A47655j355q38j78Nl78q91j158j127q80m83n0K12J39k92r31j552k031k422
$$ 147655 146300 145462 145284 145289 144911 144020 142862 141735 140855 140372 140322 140534 140673 140381 139450 137898 135867 133445
55627A33445k730k717k255j759j817k324k457j836j130j147j679j855j379q33
$$ 133445 130715 127998 125743 123984 122167 119843 117386 115550 114420 113273 111594 109739 108360 107527
55613A07527p68j076j351j465j582j795j981j922j542j016o63o58r54j387j760
$$ 107527 106759 105683 104332 102867 101285 99490 97509 95587 94045 93029 92366 91708 90754 89367 87607
55598H7607j814j384o78j60m9j84m62j034j874k467k294j406l20M33N14j21r64
$$ 87607 85793 84409 83731 83571 83522 83338 82876 81842 79968 77501 75207 73801 73481 73914 74428 74307 73343
55581G3343j163l53Q81J780K303K830L265L043K032R16N70J367L015M768N699
$$ 73343 72180 71827 72708 74488 76791 79621 82886 85929 87961 88877 89447 90814 93829 98597 104296
55566A04296N227L590J706M57O3pn99k083l892n002n044m575m173l710k939k235
$$ 104296 109523 113113 114819 115276 115339 115332 114733 112650 108758 103756 98712 94137 89964 86254 83315 81080
55550H1080k174k603k804k440j773j080m05J18K87K95N69J150J584J563J205P11
$$ 81080 78906 76303 73499 71059 69286 68206 67801 67919 68206 68501 69070 70220 71804 73367 74572 75283
55534G5283J99l2L66J225J801J552P02q5l52j06K58K68j54n60n42l71o62j480
$$ 75283 75482 75450 75816 77041 78842 80394 81096 81011 80659 80553 80811 81079 80925 80365 79823 79452 78790 77310
55516G7310k216k363k003j479j063r63j213j447j270r02r77j592k080j941j443
$$ 77310 75094 72731 70728 69249 68186 67223 66010 64563 63293 62391 61414 59822 57742 55801 54358
55501E4358j010n97p5K42k4o22r51q47o88p43q09n66p9K41M7n61j138j324j122
$$ 54358 53348 52751 52676 52918 52894 52272 51321 50474 49786 49043 48234 47668 47589 47830 47877 47316 46178 44854 43732
55482D3732o97m9Q30J609J776J166J40q10j374j400q87j02N66Q80Q09M00j23l49
$$ 43732 43035 42986 43816 45425 47201 48367 48507 47697 46323 44923 44036 43934 44500 45380 46189 46589 46466 46117
55464D6117j20J50Ll94n33m01m15o36o73m08j75j19k6P4j42o13q33o23l62j92
$$ 46117 45997 46147 46150 45756 45223 44822 44407 43771 43098 42690 42515 42396 42370 42444 42302 41689 40856 40233 39871 39679
55444C9679J70O10M98k38p38m47J24M94J101K239L026K537J338O69N57O5q23j047
$$ 39679 39849 40459 40957 40719 39981 39534 39658 40152 41253 43492 46518 49055 50393 51062 51619 51684 50861 49814
55426D9814l13K79j21r02j072o55l46l96n06m54k59K8K73K37m7j87oM1m90j279
$$ 49814 49501 49780 49659 48757 47685 47030 46684 46288 45782 45328 45069 45097 45370 45607 45560 45373 45367 45408 44918 43639
55406D3639j557j095l72J95P09J255J405P14m05r06l70L34J12r11j562j154k14
$$ 43639 42082 40987 40615 40810 41519 42774 44179 44893 44488 43582 43212 43546 43658 42747 41185 40031 39817
55389C9817M54P86J085J192P07j92q03p32k57J27J65r9l45j80L63O35J97m69n79
$$ 39817 40271 41057 42142 43334 44041 43849 43046 42314 42057 42184 42349 42250 41905 41725 42088 42723 42920 42451 41872
55370D1872k72m37j274j848j394l59L16M45N10P29P91N19J48o7j40p4L31J122
$$ 41872 41600 41163 39889 38041 36647 36288 36604 37049 37559 38288 39079 39598 39746 39679 39539 39465 39796 40918
55352D0918J807J694P52j29n8P95J369J072M62L23N22L39l36q56q40o39n57k87
$$ 40918 42725 44419 45171 45042 44984 45779 47148 48220 48682 49005 49527 49866 49530 48674 47834 47195 46638 46351
55334D6351M61J200J085j2j244j655j091k19K09O8j95k38k53n57r73j017n62M9
$$ 46351 46812 48012 49097 49085 47841 46186 45095 44876 45085 45153 44958 44720 44467 43910 42937 41920 41358 41407
55316D1407N68J025J347J232O51M6j65l3J92L89M48J86k88n60m58l59o26j041
$$ 41407 41975 43000 44347 45579 46230 46276 46111 46078 46270 46659 47107 47293 47005 46445 45987 45628 45002 43961
55298D3961j165r66o98m22j9M25O96P83Q68J004J143J311J470J377Q69J69l96
$$ 43961 42796 41830 41132 40710 40691 41116 41812 42595 43463 44467 45610 46921 48391 49768 50637 50806 50410
55281E0410p73r65p61j75J94j30o26l85M62P55pr03r06k69J3l57q06q50n35o0
$$ 50410 49637 48672 47911 47736 47930 47800 47174 46789 47251 48006 47999 47096 46190 45921 45934 45577 44771 43921 43386 43326
55261D3326M13O22L86j6o2K69M71K33j12j01K57N60M90Q4l27l50J03O08O20J12
$$ 43326 43739 44361 44747 44731 44669 44938 45409 45642 45530 45429 45686 46246 46736 46820 46493 46143 46246 46854 47474 47586
55241D7586m47p30q38q20m64J74N14J89k77j35M93P70M00l5n1L6k41o56o39j30
$$ 47586 47139 46409 45571 44751 44287 44461 44975 45164 44887 44752 45245 46015 46415 46380 46329 46365 46124 45468 44829 44699
55221D4699L76N38M65L42J03l40p46o56R9J038J341O75l68q83o71k94j66m0L53
$$ 44699 45075 45613 46078 46420 46523 46183 45437 44781 44880 45918 47259 47934 47566 46683 46012 45718 45552 45512 45865
55202D5865O70M33j52m16j24L38O04P09P68P03M62J19l05q56j312j202l27Q69
$$ 45865 46535 46968 46816 46400 46276 46614 47218 47927 48695 49398 49860 49979 49674 48818 47506 46304 45977 46846
55184D6846J674J711J128L68j20j04K99P72J027R17M17k62o67n18j01N4j18j85
$$ 46846 48520 50231 51359 51727 51607 51503 51802 52574 53601 54518 54935 54673 54006 53488 53387 53441 53323 53138
55166E3138N3K25J2l44l87q5K07K51P3k33n74p72p02m86l39k62p6K73O27Q34Q84
$$ 53138 53191 53416 53428 53084 52697 52612 52819 53070 53143 52910 52336 51564 50862 50376 50037 49775 49699 49972 50599 51433 52317
55145E2317P92N15M5m64p47o17j10N36J042J218J005N39J61J97N44O52J78n56
$$ 52317 53109 53624 53669 53205 52458 51841 51731 52267 53309 54527 55532 56071 56232 56429 56973 57625 57803 57247
55127E7247r97j126j340j668j594q25K38J034J377J302Q08J04k81j14J31q1n30
$$ 57247 56250 55124 53784 52116 50522 49697 49935 50969 52346 53648 54456 54560 54279 54165 54296 54215 53685
55110E3685n37k7L39Q2m55n83r2O18J046J022P34M25K06J54M26J017J470J223
$$ 53685 53148 53121 53460 53542 53087 52504 52412 53030 54076 55098 55832 56257 56463 56617 57043 58060 59530 60753
55092F0753M12j37K6L58J53l62l95J65N88M40J55K94P49J065J073Q55L24o67j826
$$ 60753 61165 61028 61054 61412 61565 61203 60808 60973 61561 62001 62156 62450 63199 64264 65337 66192 66516 65849 64023
55073F4023k429k033j051l90m79p27k52Q84J508P23q68j747j191P6R32J043Q31
$$ 64023 61594 59561 58510 58120 57641 56914 56662 57546 59054 59777 58909 57162 55971 56047 56979 58022 58853
55056E8853P06O66M63k5o23r67q97o78o58p44n49k5M17M65K49K1j59k50r9K86
$$ 58853 59559 60225 60688 60663 60040 59073 58176 57498 56840 56096 55547 55522 55939 56404 56653 56674 56515 56265 56166 56452
55036E6452O16O70N23K52k18p70r63n92n3J55M7p7j98m08m20J68J120J693J509
$$ 56452 57068 57738 58261 58513 58295 57525 56562 55970 55917 56072 56119 56042 55844 55436 55016 55184 56304 57997 59506
55017E9506Q99K38m99j326j884j835j375q93l70N12J668K481K507J992J468J020
$$ 59506 60405 60643 60144 58818 56934 55099 53724 52831 52461 52973 54641 57122 59629 61621 63089 64109
55001F4109L56m58q00l14L84K96o89j592j514n48O01J424J700J285L93k10J5N44
$$ 64109 64465 64007 63207 62893 63277 63573 62884 61292 59778 59230 59831 61255 62955 64240 64633 64423 64438 64982
54983F4982L71n46j161p70J23O70P42O50M26L9j27K43O67L93l78o40m1N62L28
$$ 64982 65353 64807 63646 62876 62999 63669 64411 65061 65487 65526 65399 65642 66309 66702 66324 65684 65643 66205 66533
54964F6533m28q08n75k65l33o66q64o45l8N52O18J66j87pK94J29k29M4R87J579
$$ 66533 66105 65297 64722 64457 64124 63458 62594 61949 61911 62463 63081 63247 63060 63053 63347 63476 63247 63291 64278 65857
54944F5857J084P1l92r8K47Q8m13p86p94m89n9K93M57M91M75M15L45M20O71Q03
$$ 65857 66941 67012 66620 66522 66769 66857 66444 65658 64864 64375 64316 64609 65066 65557 66032 66447 66792 67212 67883 68686
54924F8686M87j49n50k74N68J426J701J298Q90J398K940M512N036M592M143M203
$$ 68686 69173 69024 68474 68200 68768 70194 71895 73193 74083 75481 78421 82933 87969 92561 96704 100907
54908A00907M360M152L747L379K712J258p44k444l269l427l447l591l758l789
$$ 100907 105267 109419 113166 116545 119257 120515 119771 117327 114058 110631 107184 103593 99835 96046
54894I6046l640l288k661j829j184j152j596j833j468r56q84j016o45J78N58J01
$$ 96046 92406 89118 86457 84628 83444 82292 80696 78863 77395 76439 75555 74539 73894 74072 74630 74731
54878G4731m15j91M56P02N12N87J299K283L077L525L613L424L292L495L748L448
$$ 74731 74316 74125 74581 75283 75795 76382 77681 79964 83041 86566 90179 93603 96895 100390 104138 107586
54862A07586K451J231K33m74r19j167j596k665m146n160n211m713m220l670k883
$$ 107586 110037 111268 111501 111027 110108 108941 107345 104680 100534 95374 90163 85450 81230 77560 74677
54847G4677k264k301k657k473j567o36k26j08P1J10l60j084j316o75L92J078J013
$$ 74677 72413 70112 67455 64982 63415 62779 62553 62445 62516 62626 62266 61182 59866 59191 59583 60661 61674
54830F1674N08J26R0K01K48L21N71P73M47n07j502j786j150n2Q40J086O68k3m21
$$ 61674 62182 62308 62398 62599 62847 63168 63739 64512 64959 64452 62950 61164 60014 59962 60802 61888 62556 62533 62112
54811F2112k31K88O20N29J95j16l00l52k84k26l84p46r46o26J55R74J421J351
$$ 62112 61881 62169 62789 63318 63513 63397 63097 62745 62461 62235 61851 61105 60159 59533 59688 60662 62083 63434
54793F3434R01M11K16L55N11M44L33N20J044J650K117K298J949R93q6n52l20j01
$$ 63434 64335 64746 64962 65317 65828 66272 66605 67125 68169 69819 71936 74234 76183 77176 77090 76538 76218 76117
54775G6117m56j057j149n27L27Q26P50L33J39O93J835K688K570J841J486J975
$$ 76117 75661 74604 73455 72928 73255 74081 74831 75164 75303 75996 77831 80519 83089 84930 86416 88391
54759H8391K913L733M152M048L380K499K043K218K429J929O59p68j757k181k274
$$ 88391 91304 95037 99189 103237 106617 109116 111159 113377 115806 117735 118394 117626 115869 113688 111414
54744A11414k354k595k944l123k917k494k322k593k821k325j194m14o34j186r55
$$ 111414 109060 106465 103521 100398 97481 94987 92665 90072 87251 84926 83732 83318 82684 81498 80543
54729H0543j23k1j036j731q39P98J367O71J57N93J159J128J035J530K216K500
$$ 80543 80420 80399 79363 77632 76793 77591 78958 79629 79786 80379 81538 82666 83701 85231 87447 89947
54713H9947K724L473M347M439L689K805K096J259J99p03j257j710k259k805l164
$$ 89947 92671 96144 100491 104930 108619 111424 113520 114779 114978 114275 113018 111308 109049 106244 103080
54698A03080l103k300q18M94O95k51j590k739l477l493k653j717j703k375k292
$$ 103080 99977 97677 96859 97353 98048 97797 96207 93468 89991 86498 83845 82128 80425 78050 75758
54683G5758q41P48R97K3r54j261j087n95J81P86O01k04p02m44p7m37j438k184
$$ 75758 74917 75665 76662 76685 75731 74470 73383 72788 72969 73755 74356 74152 73450 73006 72929 72492 71054 68870
54665F8870k029j190m51l31n77m86K05R02Q42Q2m88j73P65J482J456Q85L02mj49
$$ 68870 66841 65651 65200 64869 64292 63806 64011 64913 65755 65837 65349 65176 65941 67423 68879 69764 70066 70062 69913
54646F9913l44n17l84R6N17M40r2o36q23n85j6O90J140R53K80j54J82R20J089
$$ 69913 69569 69052 68668 68764 69281 69721 69629 68993 68170 67585 67569 68259 69399 70352 70632 70478 70660 71580 72669
54627G2669K21j071j742j350l58N35R81J032Q22N89O08Q83R11K60p02j091o42
$$ 72669 72890 71819 70077 68727 68369 68904 69885 70917 71739 72328 72936 73819 74730 74990 74288 73197 72555
54610G2555o2j9k32k0N46P41K87j92OP60J331J140K09r27j537j182p5J045J528
$$ 72555 72493 72474 72242 72222 72768 73509 73796 73604 73610 74370 75701 76841 77050 76123 74586 73404 73329 74374 75902
54591G5902J254M26o81j717k209j947j351j129j497j861j407L9J754K670K211
$$ 75902 77156 77582 76901 75184 72975 71028 69677 68548 67051 65190 63783 63822 65576 68246 70457
54576G0457P24q40j575j161O0J319J863J446N53nJ45O55R76R63P98N53J47k53
$$ 70457 71181 70341 68766 67605 67665 68984 70847 72293 72846 72841 72986 73641 74617 75580 76378 76931 77078 76825
54558G6825k47K79Q62R87O93M15L60L32J27k09n54q08p58j70P46J353J303J037
$$ 76825 76578 76857 77719 78706 79399 79814 80174 80506 80633 80424 79870 79062 78304 78134 78880 80233 81536 82573
54540H2573J158J473J204J55q72r83j75Q01J214P75l12j362j529n76P07J225O50
$$ 82573 83731 85204 86408 86563 85691 84708 84533 85334 86548 87323 87011 85649 84120 83544 84251 85476 86126
54523H6126m30j321j774j786j343n70J71N68O49O40O78P37P15N24K35R8K79N24
$$ 86126 85696 84375 82601 80815 79472 78902 79073 79641 80290 80930 81608 82345 83060 83584 83819 83917 84196 84720
54505H4720L96j85p97j058j010r20r16r93j087r81l79O24J406J475J086Q69R41
$$ 84720 85116 84931 84134 83076 82066 81146 80230 79237 78150 77169 76790 77414 78820 80295 81381 82250 83191
54488H3191Q64M16k6k8L26O23O29M23J53j19m38q35j139r46n4J072J691J731J918
$$ 83191 84055 84471 84445 84417 84743 85366 85995 86418 86571 86452 86014 85179 84040 83094 83040 84112 85803 87534 89452
54469H9452K563K790J672j83j084m36M63K28p81j093j58J124J744J585J044L74
$$ 89452 92015 94805 96477 96294 95210 94774 95237 95465 94684 93591 93433 94557 96301 97886 98930 99304
54453I9304k78p40j057j456j769j398k17Q38P14m39j414j354n87k4j26o32r81
$$ 99304 99026 98286 97229 95773 94004 92606 92389 93227 93941 93502 92088 90734 90147 90123 89997 89365 88384
54436H8384q26k73K85N84O61O27M48J55RJ48K92J67M6L70R46J109P52N18P82J032
$$ 88384 87558 87285 87570 88154 88815 89442 89890 90045 90054 90202 90494 90661 90707 91077 92023 93132 93884 94402 95184 96216
54416I6216O44k08q85j151j210j161q94m90k01j02r5j56j98J37J061K055K241
$$ 96216 96860 96652 95767 94616 93406 92245 91351 90861 90660 90558 90463 90307 90109 90246 91307 93362 95603
54399I5603J455M89Q9J80K50Q9j83m66o62n34j2M97N16J82J21O26J248J397R73
$$ 95603 97058 97547 97636 97816 98066 98155 97972 97506 96844 96310 96298 96795 97311 97493 97614 98240 99488 100885 101858
54380A01858K84l69q06r05p05m77m49n09m18k16r6K6M45J084J360R12K12Q9P99
$$ 101858 102142 101773 100967 100062 99357 98880 98431 97922 97504 97288 97192 97218 97663 98747 100107 101019 101231 101320 102119
54361A02119J733K099J596N71l65p98p23m43k18o1J60N73J270K159K725K304R12
$$ 102119 103852 105951 107547 108118 107753 106955 106232 105789 105571 105510 105670 106243 107513 109672 112397 114701 115613
54344A15613m49p59r2O14P91O45M55M3q05j907k895l505l485k644j290j81K43
$$ 115613 115164 114405 114313 114927 115718 116363 116818 116861 116056 114149 111254 107749 104264 101620 100330 100149 100392
54327A00392K58K30Q2k80m28K8O91Q00L44N9L03N91M21K9m9J92K55j54p65j116
$$ 100392 100650 100880 100962 100682 100254 100282 100973 101773 102117 102176 102479 103070 103491 103520 103471 103663 103918 103764 102999 101883
54307A01883j032o89l40j22p8k47n71q28q60p94q57r66q29m44j63j33j08M3M3
$$ 101883 100851 100162 99822 99700 99622 99375 98804 97976 97116 96322 95465 94499 93670 93226 93063 92930 92822 92865 92908
54288I2908k67n46m88l19l24k33L23J094J441J195O66N3n60q21n02j30m25j073
$$ 92908 92641 92095 91607 91288 90964 90731 91054 92148 93589 94784 95450 95503 94943 94122 93620 93490 93065 91992
54270I1992r52K56J534J873J353N28l88j155j071J59J621J998J096j23q18r47
$$ 91992 91040 91296 92830 94703 96056 96584 96196 95041 93970 94129 95750 97748 98844 98721 97903 96956
54254I6956p79l68L08J059J565J617J294R38Q90J120J293J182P85O4r81j919k087
$$ 96956 96177 95809 96117 97176 98741 100358 101652 102590 103480 104600 105893 107075 107860 107924 106943 105024 102937
54237A02937j511j042j250j714j838j767j875j868j261l87l6k30j89M62J232J532
$$ 102937 101426 100384 99134 97420 95582 93815 91940 90072 88811 88424 88388 88158 87969 88431 89663 91195
54221I1195J302P70K76K53P76J090M61o31r15j09O99O71J93j02l27o43n59K38
$$ 91195 92497 93267 93543 93796 94572 95662 96123 95492 94577 94468 95167 95838 96031 95929 95602 94959 94400 94638
54203I4638J054J082N26L7m42j219j731j092L80J296R66N7n51o52l15M18J097
$$ 94638 95692 96774 97300 97337 96895 95676 93945 92853 93233 94529 95495 95552 95001 94349 94034 94452 95549
54186I5549J063M43J32L71K67o47j355p34O63J282O49k47m89j07N57J390K068
$$ 95549 96612 97055 97187 97558 97825 97178 95823 95089 95752 97034 97683 97436 96947 96840 97397 98787 100855
54169A00855J942Q04o73j673k017j965j664j147n82j43K04M92N76L40m3l15m02
$$ 100855 102797 103601 102928 101255 99238 97273 95609 94462 93880 93737 93941 94433 95009 95349 95306 94991 94589
54152I4589l60j98J1K3k77o23o35l05%j7k21k27J63P13J010R76R03Q25K27j098
$$ 94589 94229 94031 94042 94065 93788 93165 92530 92225 92225 92208 91987 91760 91923 92636 93646 94622 95525 96350 96577 95479
54132I5479k219j848r2J453J654J050O96N94J23o15r55q52q58r66n01O75J735
$$ 95479 93260 91412 91320 92773 94427 95477 96173 96767 96890 96275 95320 94468 93610 92644 92143 92818 94553
54115I4553J975J620J248J013P92N87M65M57P29J386K013J958J231N40J91k68
$$ 94553 96528 98148 99396 100409 101201 101788 102253 102710 103439 104825 106838 108796 110027 110567 110758 110490
54099A10490j036j441r24J8N81P45Q74P35j03j188j481q11j48k31o94p95m49r9
$$ 110490 109454 108013 107089 107107 107688 108433 109307 110042 109939 108751 107270 106459 106311 106080 105386 104591 104142 104043
54081A04043M4J99N59R65J079P53K08k18m09m51l41j8L50M34K77K64M58M82L32
$$ 104043 104087 104286 104845 105810 106889 107642 107850 107632 107223 106772 106431 106413 106763 107197 107474 107738 108196 108678 109010
54062A09010O08J409J723P76n27o03O37J755J917J818K195K591K327J778J883
$$ 109010 109618 111027 112750 113526 112999 112396 113033 114788 116705 118523 120718 123309 125636 127414 129297
54047A29297K748L598L834L522K953K288J695J398J438J548J428J145J177J905
$$ 129297 132045 135643 139477 142999 145952 148240 149935 151333 152771 154319 155747 156892 158069 159974
54033A59974K938L293K551J586J582K427K880K328J539J358J476J117L29j84j79
$$ 159974 162912 166205 168756 170342 171924 174351 177231 179559 181098 182456 183932 185049 185378 185194 185015
54018A85015j04l37q23j384j897k144k006j777j908k406k812k823k558k305k246
$$ 185015 184911 184574 183751 182367 180470 178326 176320 174543 172635 170229 167417 164594 162036 159731 157485
54003A57485k545l258m085m422l906k825j882j550j645j508p08M52J248J349J062
$$ 157485 154940 151682 147597 143175 139269 136444 134562 133012 131367 129859 129151 129603 130851 132200 133262
53988A33262P32K84l81r73j262j635k555l569l513j949P2J087P41p9m41l05k48
$$ 133262 133994 134278 133897 132924 131662 130027 127472 123903 120390 118441 118513 119600 120341 120262 119821 119516 119268
53971A19268n97j055j092n37L22J035J364J345J152Q84M63k19r63j203n44O59
$$ 119268 118671 117616 116524 115987 116309 117344 118708 120053 121205 122089 122552 122333 121370 120167 119623 120282
53955A20282J529J613J268J097J207J276J130R99J230J926K793L290L108K541
$$ 120282 121811 123424 124692 125789 126996 128272 129402 130401 131631 133557 136350 139640 142748 145289
53941A45289K242K538L205L942M748N637O297O379N927N260M560L857L185K506
$$ 145289 147531 150069 153274 157216 161964 167601 173898 180277 186204 191464 196024 199881 203066 205572
53927B05572J686Q15M21Q65J712K048J513O83M21J121K557M111N068N047M400
$$ 205572 207258 208073 208494 209359 211071 213119 214632 215315 215736 216857 219414 223525 228593 233640 238040
53912B38040L988M365N156N438M722L532K859L085L684M049M319M898N388M696
$$ 238040 242028 246393 251549 256987 261709 265241 268100 271185 274869 278918 283237 288135 293523 298219
53898B98219K433m82k931m758o339p585q132q200q485r184r763r715r013p814
$$ 298219 300652 300170 297239 292481 286142 278557 270425 262225 253740 244556 234793 225078 216065 208251
53884B08251o300m909m167m107m172l892l341k851k628k728l051l294l162k737
$$ 208251 201951 197042 192875 188768 184596 180704 177363 174512 171884 169156 166105 162811 159649 156912
53870A56912k361k151j938j659j463j402j392j474j746k026j964j569j265j305
$$ 156912 154551 152400 150462 148803 147340 145938 144546 143072 141326 139300 137336 135767 134502 133197
53856A33197j463j395r86l28L04N68M22K71L59K50m75j213r67Q5O17K0q14r47
$$ 133197 131734 130339 129353 129025 129329 129897 130319 130590 130949 131199 130724 129511 128544 128629 129246 129266 128452 127505
53838A27505o58o02o24l26r1n07j200j248n62O2K33L58P49J089R97N55J02r4J37
$$ 127505 126847 126245 125621 125295 125204 124697 123497 122249 121687 121749 121982 122340 123089 124178 125175 125730 125832 125738 125875
53819A25875P36J312J562J679J981K255K068J578J381J530J480J106J008J591
$$ 125875 126611 127923 129485 131164 133145 135400 137468 139046 140427 141957 143437 144543 145551 147142
53805A47142K501L318M111M824M859L885K657K225K593K835K431J864J792K219
$$ 147142 149643 152961 157072 161896 166755 170640 173297 175522 178115 180950 183381 185245 187037 189256
53791A89256K596K417J559M25k64p9N41P01R2o74r36q41j011j608k173k349k417
$$ 189256 191852 194269 195828 196253 195989 195910 196451 197152 197244 196570 195634 194793 193782 192174 190001 187652 185235
53774A85235k918l861m536m186k912j792j871k968l785l344k079j174j098j312
$$ 185235 182317 178456 173920 169734 166822 165030 163159 160191 156406 153062 150983 149809 148711 147399
53760A47399j298j255j468j614j244n82l07o34j083j152q03l12J7k8l27l33L49
$$ 147399 146101 144846 143378 141764 140520 139938 139631 138997 137914 136762 135959 135647 135664 135636 135309 134976 135325
53743A35325J321J739J425J042J045J080P48L59M12P47Q49O94O43P32O40L69K50
$$ 135325 136646 138385 139810 140852 141897 142977 143725 144084 144496 145243 146092 146786 147429 148161 148801 149170 149420
53726A49420L41L76L36M99Q05Q43O75R77K002K944K943K212J634J542J588J593
$$ 149420 149761 150137 150473 150972 151777 152620 153295 154272 156274 159218 162161 164373 166007 167549 169137 170730
53710A70730J709J769J283L53j09N27J721K566K948L427M198M879N210N292N068
$$ 170730 172439 174208 175491 175844 175735 176262 177983 180549 183497 186924 191122 196001 201211 206503 211571
53695B11571M234K912J811J341J043L68l92m57L51J405K042K017J344K26q26j286
$$ 211571 215805 218717 220528 221869 222912 223280 222888 222431 222782 224187 226229 228246 229590 229816 228990 227704
53679B27704j176r30p64n74m41o44j047j141q78q17j138j165l85O20R17M67p4
$$ 227704 226528 225598 224834 224260 223819 223175 222128 220987 220109 219292 218154 216989 216604 217224 218141 218608 218534
53662B18534m80j078j848k218j874j171n71k39k29n63q77n88L14J096J196R19
$$ 218534 218054 216976 215128 212910 211036 209865 209294 209055 208826 208263 207386 206798 207112 208208 209404 210323
53646B10323R08J229J448J319J008P06M65L50M29N99O65O16O32P90J027J301J634
$$ 210323 211231 212460 213908 215227 216235 216941 217406 217756 218185 218784 219449 220065 220697 221487 222514 223815 225449
53629B25449J938K019J884J798K004K446K915L296L553L662L658L718L887L919
$$ 225449 227387 229406 231290 233088 235092 237538 240453 243749 247302 250964 254622 258340 262227 266146
53615B66146L641L409L799M756N455N310M752M627N053N381N155M587M045L599
$$ 266146 269787 273196 276995 281751 287206 292516 297268 301895 306948 312329 317484 322071 326116 329715
53601C29715L297L331L676L843L361K335J205J80q37j876k742l222l230k824k185
$$ 329715 333012 336343 340019 343862 347223 349558 350763 350943 350106 348230 345488 342266 339036 336212 334027
53586C34027j563j181j219j754k526k885k410j560j261j750k388k690k893l133
$$ 334027 332464 331283 330064 328310 325784 322899 320489 318929 317668 315918 313530 310840 307947 304814
53572C04814k886j803n52n5k73m88m59m55m27k8N70Q01O87Q47J407J676J204M02
$$ 304814 301928 300125 299573 299518 299245 298757 298298 297843 297416 297388 297958 298759 299446 300293 301700 303376 304580 304982
53554C04982j76n13p60p59m10N0M89J153K132K968L233L154L248L671M256M884
$$ 304982 304806 304293 303533 302774 302364 302414 302903 304056 306188 309156 312389 315543 318791 322462 326718 331602
53538C31602N479N960O523P553Q898R673R301Q438Q287R221J0607J1778J2550
$$ 331602 337081 343041 349564 357117 366015 375688 384989 393427 401714 410935 421542 433320 445870
53525D45870J2915J2880J2756J3030J3741J4420J4793J5155J5848J6803J7886
$$ 445870 458785 471665 484421 497451 511192 525612 540405 555560 571408 588211 606097
53514F06097J9339K1332K3291K4271K4164K3978K4569K5508K5718K5080K4618
$$ 606097 625436 646768 670059 694330 718494 742472 767041 792549 818267 843347 867965
53503H67965K5000K5602K5502K4801K4259K4008K3424K2215K0905K0117J9960
$$ 867965 892965 918567 944069 968870 993129 1017137 1040561 1062776 1083681 1103798 1123758
53492A123758K0212K0569K0588J9941J8904J8122J7850J7858J8052J8556J9052
$$ 1123758 1143970 1164539 1185127 1205068 1223972 1242094 1259944 1277802 1295854 1314410 1333462
53481A333462J8829J7738J6455J5446J4375J2857J1064R117O585L257k09l073
$$ 1333462 1352291 1370029 1386484 1401930 1416305 1429162 1440226 1449343 1455928 1459185 1458976 1455903
53469A455903n446p761r830j1250j2305j3580j4920j5663j5799j6021j6729j7708
$$ 1455903 1450457 1442696 1432866 1421616 1409311 1395731 1380811 1365148 1349349 1333328 1316599 1298891
53457A298891j8818k0200k1647k2560k2775k2896k3482k4318k4751k4438k3538
$$ 1298891 1280073 1259873 1238226 1215666 1192891 1169995 1146513 1122195 1097444 1073006 1049468
53446A049468k2367k1012j9272j7034j4659j2711j1183r486p429n644m615l856
$$ 1049468 1027101 1006089 986817 969783 955124 942413 931230 921744 914315 908671 904056 900200
53434I00200k722j422m29O28K435M638O165O812P452Q597R869J1039J2516J4446
$$ 900200 897478 896056 895627 896255 898690 903328 909493 916305 923757 932354 942223 953262 965778 980224
53420I80224J6355J8031J9884K1954K3521K4211K4694K5644K6814K7763K8870
$$ 980224 996579 1014610 1034494 1056448 1079969 1104180 1128874 1154518 1181332 1209095 1237965
53409A237965L0775L3342L5886L8116M0193M2202M4197M6473M9203N2009N4346
$$ 1237965 1268740 1302082 1337968 1376084 1416277 1458479 1502676 1549149 1598352 1650361 1704707
53398A704707N6093N7350N8026N8146N8232N8776N9555N9919N9604N8757N7449
$$ 1704707 1760800 1818150 1876176 1934322 1992554 2051330 2110885 2170804 2230408 2289165 2346614
53387B346614N5653N3553N1402M9169M6703M4124M1602L8946L5767L1895K7415
$$ 2346614 2402267 2455820 2507222 2556391 2603094 2647218 2688820 2727766 2763533 2795428 2822843
53376B822843K2520J7633J3196R015M187j807q422j4956k1566k8698l5910m2242
$$ 2822843 2845363 2862996 2876192 2885207 2889394 2887587 2879165 2864209 2842643 2813945 2778035 2735793
53364B735793m7414n1791n5337n7599n8706n9394n9897n9691n8480n6693n4733
$$ 2735793 2688379 2636588 2581251 2523652 2464946 2405552 2345655 2285964 2227484 2170791 2116058
53353B116058n2608n0554m9224m8770m8492m7825m7073m6628m6034m4546m2222
$$ 2116058 2063450 2012896 1963672 1914902 1866410 1818585 1771512 1724884 1678850 1634304 1592082
53342A592082l9864l8058l6769l5719l4599l3028l0727k7833k4776k1857j9158
$$ 1592082 1552218 1514160 1477391 1441672 1407073 1374045 1343318 1315485 1290709 1268852 1249694
53331A249694j6789j4996j4057j4060j4749j5497j5665j5082j4098j3129j2317
$$ 1249694 1232905 1217909 1203852 1189792 1175043 1159546 1143881 1128799 1114701 1101572 1089255
53320A089255j1643j1006j0190r020p638o373n243l969k458q73Q44K951N230O950
$$ 1089255 1077612 1066606 1056416 1047396 1039758 1033385 1028142 1024173 1021715 1020842 1021686 1024637 1029867 1036817
53306A036817P880Q801J0483J2645J4485J5904J7508J9537K1485K2857K3787K4842
$$ 1036817 1044697 1053498 1063981 1076626 1091111 1107015 1124523 1144060 1165545 1188402 1212189 1237031
53294A237031K6455K8533L0402L1269L1046L0434K9879K8816K6554K3638K1405
$$ 1237031 1263486 1292019 1322421 1353690 1384736 1415170 1445049 1473865 1500419 1524057 1545462
53283A545462K0217J8926J6404J2831R163N916L022L18k400n431q741j1683j3745
$$ 1545462 1565679 1584605 1601009 1613840 1623003 1628919 1631941 1632259 1629859 1624428 1615687 1604004 1590259
53270A590259j5413j7668k0660k3443k5219k6236k7204k8251k8954k9194k9481
$$ 1590259 1574846 1557178 1536518 1513075 1487856 1461620 1434416 1406165 1377211 1348017 1318536
53259A318536l0248l1230l1825l1851l1667l1494l1038k9988k8669k7779k7592
$$ 1318536 1288288 1257058 1225233 1193382 1161715 1130221 1099183 1069195 1040526 1012747 985155
53248I85155k7693k7589k7220k6728k6076k5175k4206k3431k2797k2034k1126
$$ 985155 957462 929873 902653 875925 849849 824674 800468 777037 754240 732206 711080
53237G11080k0319j9584j8394j6338j3784j1653j0530j0238j0278j0461j0857
$$ 711080 690761 671177 652783 636445 622661 611008 600478 590240 579962 569501 558644
53226E58644j1338j1490j1138j0741j0958j1859j2820j3244j3201j3129j3137
$$ 558644 547306 535816 524678 513937 502979 491120 478300 465056 451855 438726 425589
53215D25589j2838j1930j0670r640r100q749q146p278o625o610p061p373p150
$$ 425589 412751 400821 390151 380511 371411 362662 354516 347238 340613 334003 326942 319569 312419
53202C12419o665o494o836p298p346o831o003n177m530m123l990m033m014l772
$$ 312419 305754 299260 292424 285126 277780 270949 264946 259769 255239 251116 247126 243093 239079 235307
53188B35307l464l399l582l592l090k244j511j113j006j260j974k799l026k393
$$ 235307 231843 228444 224862 221270 218180 215936 214425 213312 212306 211046 209072 206273 203247 200854
53174B00854j517j166j405j766j946j857j280q2J209J718J267N73K32qo27j487
$$ 200854 199337 198171 196766 195000 193054 191197 189917 189835 191044 192762 194029 194602 194834 194826 194199 192712
53158A92712k055k120j862j407p94k52j07l49p09j018j255j318j146r88j098j173
$$ 192712 190657 188537 186675 185268 184474 184222 184115 183766 183057 182039 180784 179466 178320 177332 176234 175061
53142A75061o43M16J146R61L27J24N67J077J041L49o77j522j730j222m42N7J55
$$ 175061 174418 174834 175980 176941 177268 177392 177959 179036 180077 180426 179749 178227 176497 175275 174833 174890 175045
53125A75045J61K98N05O94R48J322J602J473R15K76p8j73l72q96j440j466q72
$$ 175045 175206 175504 176009 176703 177651 178973 180575 182048 182963 183239 183161 182988 182616 181720 180280 178814 177942
53108A77942j28K52K06m1l85p59r17o78l37l93q09r59n20l8k49j073j721j668
$$ 177942 177814 178066 178272 178231 177846 177087 176170 175492 175155 174762 173953 172994 172474 172436 172187 171114 169393 167725
53090A67725j168p13l93J1N08Q00O30J07m08o20n09k46P9N84J315J910J766P57
$$ 167725 166557 165844 165451 165462 165970 166770 167400 167507 167099 166479 165970 165724 165803 166387 167702 169612 171378 172135
53072A72135m69j112j055p42m05J27P36P48k05j441j916j509j000q09m95K56Q63
$$ 172135 171666 170554 169499 168757 168352 168479 169215 169963 169758 168317 166401 164892 163892 163083 162588 162844 163707
53055A63707O59J3j11M95J047R50N24L22L70M11M10L98J66l87p95n68L7K26k68
$$ 163707 164366 164379 164268 164763 165810 166760 167284 167606 167976 168387 168797 169195 169361 168974 168179 167611 167648 167874 167606
53036A67606r22j273j466j773j990j784j208o03j48J16P8k44n20m53k28j99k98
$$ 167606 166684 165411 163945 162172 160182 158398 157190 156587 156439 156555 156633 156389 155869 155416 155188 154989 154691
53019A54691j36L35P31P69N70L70L12M78P39O48n0q00o98L34J394J768J597J170
$$ 154691 154555 154890 155621 156390 156960 157330 157642 158120 158859 159507 159457 158657 157959 158293 159687 161455 163052 164222
53001A64222L34r02j860j954j518j178q37m6R24J266P92J33j45N6P09J632K144
$$ 164222 164556 163654 161794 159840 158322 157144 156307 156261 157185 158451 159243 159376 159231 159287 159996 161628 163772
52984A63772J601M22k41K5N36P39Q71J084Q71rq62r49m96j57l4J30K91L53O64
$$ 163772 165373 165795 165554 165579 166115 166854 167725 168809 169680 169671 168809 167860 167364 167207 167173 167303 167594 167947 168611
52965A68611J475K274K430K217K324K647K431J564P96N87N36J44n44j252j846
$$ 168611 170086 172360 174790 177007 179331 181978 184409 185973 186769 187356 187892 188036 187492 186240 184394
52950A84394k165k049j704j573j667j630j474j592j840j455l42L85j55j248j498
$$ 184394 182229 180180 178476 176903 175236 173606 172132 170540 168700 167245 166903 167288 167133 165885 164387
52935A64387p97l61q52j512j405p80n16p52q17l71Q5L6k66k90j01j70m71m71p1
$$ 164387 163590 163229 162377 160865 159460 158680 158164 157412 156595 156224 156309 156345 156079 155789 155688 155518 155047 154576 154505
52916A54505R5l11o47j74P35J066O03J34K09M78M14R2j55k92m11l83r5K14K28
$$ 154505 154600 154289 153642 153468 154203 155269 155872 156006 156215 156693 157107 157199 157044 156752 156341 155958 155863 156077 156305
52897A56305L1ML57Q91J128O45m62j362j185j19O36K66o59j000m37M17R77J137
$$ 156305 156336 156340 156697 157588 158716 159361 158899 157537 156352 156233 156869 157135 156476 155476 155039 155456 156433 157570
52879A57570R15L14l52n26n3O15J010J164J325J425J174N57k8k13r8j50o07j102
$$ 157570 158485 158799 158447 157921 157868 158483 159493 160657 161982 163407 164581 165138 165110 164897 164799 164649 164042 162940
52861A62940j008k03O45P28L9o27n92o0K33N6o1K92O15R0j091j696j014J23M67
$$ 162940 161932 161729 162374 163102 163141 162514 161922 161862 162095 162151 162090 162382 162997 163087 161996 160300 159286 159409 159876
52842A59876j0l46k66n65j648k641k528j559q49r64j501j816j631j071n03k99
$$ 159876 159866 159520 159254 158689 157041 154400 151872 150313 149464 148500 146999 145183 143552 142481 141978 141679
52826A41679m65n69l15O0K12K53M60P42Q06O72N53M51K67J61K64K62j68o37m63
$$ 141679 141214 140645 140330 140390 140602 140855 141315 142057 142863 143535 144088 144539 144806 144967 145231 145493 145325 144688 144225
52807A44225K86Q44R09R82J342J422O32o78j555j479p00J15L37k37j074j271m98
$$ 144225 144511 145355 146264 147246 148588 150010 150642 149964 148409 146930 146230 146345 146682 146445 145371 144100 143602
52790A43602N77J130J087R50R41P91L15k38n07m37k54j27k8J34K45M8m30p06m11
$$ 143602 144179 145309 146396 147346 148287 149078 149393 149155 148648 148211 147957 147830 147802 147936 148181 148229 147799 147093 146682
52771A46682N6j12j013j760j616r11m79m84l77J53P24Q49N53K13J30L46P03R16
$$ 146682 146738 146626 145613 143853 142237 141326 140847 140363 139986 140139 140863 141712 142265 142478 142608 142954 143657 144573
52753A44573P46K97%J63N76P44M58K3j89k18l79o67o17Q2J124J958K444K771K879
$$ 144573 145319 145616 145616 145779 146355 147099 147557 147580 147391 147173 146794 146127 145510 145592 146716 148674 151118 153889 156768
52734A56768K524J889J619J975K417K337J827J342R57M44j23l75k15L9M1l24j076
$$ 156768 159292 161181 162800 164775 167192 169529 171356 172698 173655 174099 173976 173601 173386 173425 173466 173142 172066
52717A72066k077k937l263l059k603j965j063j21L88L40N3k66o98j074q68%P66
$$ 172066 169989 167052 163789 160730 158127 156162 155099 154978 155366 155706 155759 155493 154795 153721 152853 152853 153619
52700A53619P28K30J17N34Q63P84O74Q58J089J032P83O22N91N95O24N69J65n71
$$ 153619 154347 154577 154694 155228 156091 156875 157549 158407 159496 160528 161311 161933 162524 163119 163743 164312 164477 163906
52682A63906j077r13l99j85l24l50j65j76m39m35M6M18J84j97k4M74M35k60p86
$$ 163906 162829 161916 161517 161332 161008 160658 160493 160317 159878 159443 159489 159907 160091 159894 159870 160344 160779 160519 159733
52663A59733o36l33m98q55o64J52R33J194J120J140J350J497J235M41o23j371
$$ 159733 159097 158764 158266 157411 156747 156899 157832 159026 160146 161286 162636 164133 165368 165809 165186 163815
52647A63815j326n62L40P74N53l8n42o64m70k39j19q7k06o60j388j889j694q71
$$ 163815 162489 161927 162267 163041 163594 163556 163014 162350 161880 161641 161522 161435 161229 160569 159181 157292 155598 154727
52629A54727J30R97J637J950J886J679J617J572J171M68J6J55N64P58O23K61l14
$$ 154727 154857 155854 157491 159441 161327 163006 164623 166195 167366 167834 167850 168005 168569 169327 169950 170211 169897
52612A69897j006j427j253o65j26J20J19j8o7L35J216J977K010J542J284J354
$$ 169897 168891 167464 166211 165546 165420 165540 165659 165641 165574 165909 167125 169102 171112 172654 173938 175292
52596A75292J152M25k23k47J0j14n54o50j34N77J015J124J069R19O87M11J40k2
$$ 175292 176444 176869 176646 176399 176409 176295 175741 175091 174957 175534 176549 177673 178742 179661 180348 180759 180899 180877
52578A80877R1M61P25N23J7l01k43o8L5J66L04J49l97r03r14n14r7J86M16M73
$$ 180877 180968 181429 182154 182677 182694 182393 182150 182082 182117 182283 182587 182736 182339 181436 180522 180008 179911 180097 180513 180986
52558A80986Q1p03j389j560j265q75o78p10q28q32o05j67L36P03P33L85K3J87
$$ 180986 181067 180364 178975 177415 176150 175275 174597 173887 173059 172227 171622 171455 171791 172494 173227 173612 173635 173822
52540A73822R46J601J377L66n09n70r4J63j01n23n98k03M02P96O52n5r45j440
$$ 173822 174768 176369 177746 178112 177603 177033 176939 177102 177001 176478 175880 175677 176079 176875 177527 177472 176527 175087
52522A75087j209m79K22N59N97N18L77J74Qj31m14p88o64M26J924K595K027J231
$$ 175087 173878 173399 173621 174180 174777 175295 175672 175846 175854 175723 175309 174521 173857 174283 176207 178802 180829 182060
52504A82060J280J992K442K347K112J797J034k6o08m83m41j166k256k906l004
$$ 182060 183340 185332 187774 190121 192233 194030 195064 195038 194430 193947 193506 192340 190084 187178 184174
52489A84174k940k739k140j295o58k81J86P05P58J83m77p04o46o54o27k19N13
$$ 184174 181234 178495 176355 175060 174402 174121 174307 175012 175770 175953 175476 174772 174126 173472 172845 172626 173139
52472A73139J193J632J878J826J337P44P02J284J712J345O06M02R25J561J859
$$ 173139 174332 175964 177842 179668 181005 181749 182451 183735 185447 186792 187398 187800 188725 190286 192145
52457A92145J955J916J426M87j98n2N41P38L11l46r86j605j976j813j450j601
$$ 192145 194100 196016 197442 197929 197731 197679 198220 198958 199269 198923 197937 196332 194356 192543 191093 189492
52441A89492k254k573k077j280q01n17q2L08K71j5j71l20p49j106o82N07J588
$$ 189492 187238 184665 182588 181308 180507 179990 179908 180216 180487 180472 180301 179981 179232 178126 177444 177951 179539
52424A79539J930J747J520J304R36M84J67N2R0L48R29J739K424K630K414K395
$$ 179539 181469 183216 184736 186040 186976 187460 187627 187679 187769 188117 189046 190785 193209 195839 198253 200648
52408B00648L272M930O342O639O100N579N158M030J824p13k598l637m161m278
$$ 200648 203920 208850 215192 221831 227931 233510 238668 242698 244522 243809 241211 237574 233413 229135
52394B29135l921l361l038k923k492j410L0J170J511J067M23L27R09J418J048
$$ 229135 225214 221853 218815 215892 213400 211990 212020 213190 214701 215768 216191 216518 217427 218845 219893
52379B19893n0r07q44m8R50J845K465K695K766L291M446N434N342M415L774L859
$$ 219893 219843 218936 218092 218044 218994 220839 223304 225999 228765 232056 236502 241936 247278 251693 255467 259326
52363B59326L847K917J496O47O43Q50Q81J053J531J779J291M78K43R19K018K950
$$ 259326 263173 266090 267586 268233 268876 269726 270607 271660 273191 274970 276261 276739 276982 277901 279919 282869
52347B82869L497L650L433L142L307M153N247N909O015O189P186R082J1112J2319
$$ 282869 286366 290016 293449 296591 299898 304051 309298 315207 321222 327411 334597 343679 354791 367110
52333C67110J2371J1837J1663J2444J4126J6122J7702J8421J8494J8631J9331
$$ 367110 379481 391318 402981 415425 429551 445673 463375 481796 500290 518921 538252
52322E38252K0348K1048K1198K1131K1151K1098K0639J9678J8278J6437J4222
$$ 538252 558600 579648 600846 621977 643128 664226 684865 704543 722821 739258 753480
52311G53480J2034J0370R312Q477P535O514N552M525L215J691L47n42j096j663
$$ 753480 765514 775884 785196 793673 801208 807722 813274 817799 821014 822705 823052 822510 821414 819751
52297H19751k413l228l874m263m557n024n632n904n406m419l778l827l906l187
$$ 819751 817338 814110 810236 805973 801416 796392 790760 784856 779450 775031 771253 767426 763520 760333
52283G60333j711r2J515L478N758P698R014J0210J1692J3028J3687J3951J4462
$$ 760333 758622 758530 760045 763523 769281 776979 785993 796203 807895 820923 834610 848561 863023
52270H63023J5183J5542J5387J5101J4800J4091J2688J0771Q651O547M756L540
$$ 863023 878206 893748 909135 924236 939036 953127 965815 976586 985237 991784 996540 1000080
52258A000080K704J744N04p06j753k892m186n184n527n456n449n624n875o272
$$ 1000080 1002784 1004528 1005032 1004326 1002573 999681 995495 990311 984784 979328 973879 968255 962380 956108
52244I56108o976p887q688r131r117q694q123p781p752p678p204o393n536m762
$$ 956108 949132 941245 932557 923426 914309 905615 897492 889711 881959 874281 867077 860684 855148 850386
52230H50386l996l139k100q50M12J328J809K177K697L220L449L334K964K471K279
$$ 850386 846390 843251 841151 840301 840713 842041 843850 846027 848724 851944 855393 858727 861691 864162 866441
52215H66441L053M901O864P729P295O380N765N576N651N787N620M808L641K962
$$ 866441 869494 874395 881259 888988 896283 902663 908428 914004 919655 925442 931062 935870 939511 942473
52201I42473L174L765M041L932L653L039J795K84o11m81K12Q39J261J552J523
$$ 942473 945647 949412 953453 957385 961038 964077 965872 966156 965545 965064 965276 966115 967376 968928 970451
52186I70451R81K29j29O1L20J11o59j741k848l723m262m668n221n790n875n400
$$ 970451 971432 971661 971532 971593 971913 972024 971365 969624 966776 963053 958791 954123 948902 943112 937237 931837
52170I31837n005n219n649n490m650l694k862j787l45R00J421J434J547K034K770
$$ 931837 926832 921613 915964 910474 905824 902130 899268 897481 897136 898036 899457 900891 902438 904472 907242
52155I07242L509L943L734K882J894J279J024Q19N86M82N51O76Q17J071J514K197
$$ 907242 910751 914694 918428 921310 923204 924483 925507 926326 926912 927394 927945 928621 929438 930509 932023 934220
52139I34220L132M189N088N736O326P026P720Q307Q990J0062J1584J3479J5671
$$ 934220 937352 941541 946629 952365 958691 965717 973437 981744 990734 1000796 1012380 1025859 1041530
52126A041530J7902J9707K0895K1782K2664K3410K3901K4474K5355K5992K5633
$$ 1041530 1059432 1079139 1100034 1121816 1144480 1167890 1191791 1216265 1241620 1267612 1293245
52115A293245K4359K2872K1360J9406J6941J4444J2018R054N289J445j690m266
$$ 1293245 1317604 1340476 1361836 1381242 1398183 1412627 1424645 1433699 1438988 1440433 1438743 1434477
52103A434477o901r575j1702j3037j3916j4576j4769j4164j2841j1287j0050r363
$$ 1434477 1427576 1418001 1406299 1393262 1379346 1364770 1350001 1335837 1322996 1311709 1301659 1292296
52091A292296q900p965o149l845j964j132j249j724j926j438j90J534L346N103
$$ 1292296 1283396 1275431 1269282 1265437 1263473 1262341 1261092 1259368 1257442 1256004 1255814 1257348 1260694 1265797
52077A265797O970R012J0894J2184J2923J3619J4502J5095J4822J3871J3015J2518
$$ 1265797 1272767 1281779 1292673 1304857 1317780 1331399 1345901 1360996 1375818 1389689 1402704 1415222
52065A415222J1814J0443Q794P440O199M465K221J7j985m225o899r576j1917j4145
$$ 1415222 1427036 1437479 1446273 1453713 1459912 1464377 1466598 1466615 1464630 1460405 1453506 1443930 1432013 1417868
52051A417868j6414j8236j9057j9123j9208j9699k0389k1007k1537k1952k2018
$$ 1417868 1401454 1383218 1364161 1345038 1325830 1306131 1285742 1264735 1243198 1221246 1199228
52040A199228k1531k0542j9349j8303j7524j6688j5273j3192j1020r358q187p069
$$ 1199228 1177697 1157155 1137806 1119503 1101979 1085291 1070018 1056826 1045806 1036448 1028261 1021192
52028A021192n902n028m712m883n353n996o604o968p219p792q857j0105j1176
$$ 1021192 1015290 1010262 1005550 1000667 995314 989318 982714 975746 968527 960735 951878 941773 930597
52015I30597j2034j2661j2815j2480j2292j2956j4309j5488j6102j6583j7217
$$ 930597 918563 905902 893087 880607 868315 855359 841050 825562 809460 792877 775660
52004G75660j7480j6937j6228j6381j7269j7613j6666j5131j4105j3753j3463
$$ 775660 758180 741243 725015 708634 691365 673752 657086 641955 627850 614097 600634
51993F00634j2797j1753j0382q869p717p338p398p089o059m745l791l506l836
$$ 600634 587837 576084 565702 556833 549116 541778 534380 527291 521232 516487 512696 509190 505354
51980E05354m475n044n418n838o398o721o568o508p227q390q992q791q454q186
$$ 505354 500879 495835 490417 484579 478181 471460 464892 458384 451157 442767 433775 424984 416530 408344
51966D08344p245n335l380k245j465j81J365K280K574L112M125M853M840M584
$$ 408344 401099 395764 392384 390139 388674 388493 389858 392138 394712 397824 401949 406802 411642 416226
51952D16226M554M342L374J856M91m31j122j717k055j997j601r46k9J082K235
$$ 416226 420780 425122 428496 430352 430843 430412 429290 427573 425518 423521 421920 420974 420945 422027 424262
51937D24262L393M750O489Q412R913J0444R993R036Q026P011N791M196K147l47
$$ 424262 427655 432405 438894 447306 457219 467663 477656 486692 494718 501729 507520 511716 513863 513516
51923E13516l094n761q110j0115j1723j2726j3068j3045j2941j2593j1686j0295
$$ 513516 510422 504661 496551 486436 474713 461987 448919 435874 422933 410340 398654 388359
51911C88359q834p508o141m548k726p46J282L052M255N056O073P641R221R830
$$ 388359 379525 372017 365876 361328 358602 357856 359138 362190 366445 371501 377574 385215 394436 404266
51897D04266R002P234N422L973K522N60j782l810n119o106p365q790r595r229
$$ 404266 413268 420502 425924 429897 432419 432979 431197 427387 422268 416162 408797 400007 390412 381183
51883C81183q040o951o567o629o315n050l065j065N06J636K263K253J970K325
$$ 381183 373143 366192 359625 352996 346681 341631 338566 337501 338007 339643 341906 344159 346129 348454
51869C48454L669N054N257M276L172K555K006J050r3j065k028l251m451n058m974
$$ 348454 352123 357177 362434 366710 369882 372437 374443 375493 375400 374335 372307 369056 364605 359547 354573
51854C54573m589m142l384j994j60J432K229K362K366K333J716K77j209j769j574
$$ 354573 349984 345842 342458 340464 340304 341736 343965 346327 348693 351026 352742 353019 351810 350041 348467
51839C48467j691k512l225l126k711k852l532l991l784l100k233j334o27l09k22
$$ 348467 346776 344264 341039 337913 335202 332350 328818 324827 321043 317943 315710 314376 313749 313440 313218
51824C13218KL51L77k42j320k405l180l585l674l451k813j729n42J47R2j93P7
$$ 313218 313220 313571 313948 313706 312386 309981 306801 303216 299542 296091 293278 291549 291007 291154 291246 291053 291130
51807B91130J107K289K813K419J584J031J043J193R27K49m06r10j554k316k647
$$ 291130 292237 294526 297339 299758 301342 302373 303416 304609 305536 305785 305379 304469 302915 300599 297952
51792B97952k317k007k460l393l891l678l320l206l013k364j422n86M6O07J078
$$ 297952 295635 293628 291168 287775 283884 280206 276886 273680 270667 268303 266881 266295 266341 266948 268026
51777B68026J287J185R59Q77R60Q27Q7r94j458o87Q48K224L216M193N125N498
$$ 268026 269313 270498 271457 272334 273294 274121 274208 273214 271756 271069 271917 274141 277357 281550 286675 292173
51761B92173N360N508O277O863O436N352M546M092L154J303q18k356l158l656
$$ 292173 297533 303041 309318 316181 322617 327969 332515 336607 339761 341064 340246 337890 334732 331076
51747C31076m168m675n036n157m939m306l327k278j393o08L96J731L059L957M466
$$ 331076 326908 322233 317197 312040 307101 302795 299468 297190 295797 295189 295585 297316 300375 304332 308798
51732C08798M926N351N325M713M082M119M879N814O288N836M222J682j029l204
$$ 308798 313724 319075 324400 329113 333195 337314 342193 348007 354295 360131 364353 366035 365006 361802
51718C61802m761n962o749o745n870m634l712l549m229n345o052n678m438l197
$$ 361802 357041 351079 344330 337585 331715 327081 323369 319820 315591 310246 304194 298516 294078 290881
51704B90881k352j391K33K137L288L087J882N18l41n46l54j24J0J96N98J138J537
$$ 290881 288529 287138 287371 289508 292796 295883 297765 298283 297942 297396 297042 296918 296928 297124 297722 298860 300397
51687C00397J547J059J33j017k081k821l097k854k191j504j245j430j612j420
$$ 300397 301944 303003 303136 302119 300038 297217 294120 291266 289075 287571 286326 284896 283284 281864
51673B81864r24k69P17K196L790M830N136N155N246N211M651L530K128O94o13
$$ 281864 280940 280671 281388 283584 287374 292204 297340 302495 307741 312952 317603 321133 323261 323955 323342
51658C23342j593k095k159j850j042L61K001L249L886M296M750M849M033K440
$$ 323342 321749 319654 317495 315645 314603 314964 316965 320214 324100 328396 333146 337995 342028 344468
51644C44468P87n52j763k852l332l040k759l357m549n185m745l952l766m305m997
$$ 344468 345255 344703 342940 340088 336756 333716 330957 327600 323051 317866 313121 309169 305403 301098 296101
51629B96101n327n110m436l669l221l061k675j846j113j089j556j688j072l5R50
$$ 296101 290774 285664 281228 277559 274338 271277 268602 266756 265643 264554 262998 261310 260238 260203 261153
51614B61153J733K327K644K501J759N26o05q12R8J257J635J296J212J936L022
$$ 261153 262886 265213 267857 270358 272117 272643 272038 271226 271324 272581 274216 275512 276724 278660 281682
51599B81682L815M227M519M875N430O252O992O994N994M344K317k10l025n140
$$ 281682 285497 289724 294243 299118 304548 310800 317792 324786 330780 335124 337441 337231 334206 329066
51585C29066n784n448n227n347n069l956k501j337m46O36K210M259O506Q454R617
$$ 329066 323282 317834 312607 307260 302191 298235 295734 294397 293951 294587 296797 301056 307562 316016 325633
51570C25633R977R983J0101J0486J1050J1566J1655J1074J0211R962J0927J2963
$$ 325633 335610 345593 355694 366180 377230 388796 400451 411525 421736 431698 442625 455588
51558D55588J5579J8529K1820K5349K8749L1412L2602L1785K9019K4922K0040
$$ 455588 471167 489696 511516 536865 565614 597026 629628 661413 690432 715354 735394
51547G35394J4487Q330K006l918r297j4323j8971k2779k5291k6470k6715k6546
$$ 735394 749881 758211 760217 756299 747002 732679 713708 690929 665638 639168 612453 585907
51535E85907k6288k5893k4940k3028k0236j7286j5095j4067j3741j3183j1831
$$ 585907 559619 533726 508786 485758 465522 448236 433141 419074 405333 392150 380319
51524C80319r958q276p165o476n974n663n522n298m810m285m061l997l541k439
$$ 380319 370361 362085 354920 348444 342470 336807 331285 325987 321177 316892 312831 308834 305293 302854
51510C02854j183n03n35o33j02J040K130K680K887L190L560L628L447L560M081
$$ 302854 301671 301168 300633 300000 299898 300938 303068 305748 308635 311825 315385 319013 322460 326020 330101
51495C30101M198L092J067p25j651k080k480k659k308j808j924k791l709m061
$$ 330101 334299 337391 338458 337733 336082 334002 331522 328863 326555 324747 322823 320032 316323 312262
51481C12262l975l989m333m854n354n685n589m877l886l352l587l923l456k226
$$ 312262 308287 304298 299965 295111 289757 284072 278483 273606 269720 266368 262781 258858 255402 253176
51467B53176j263j333k020k328j939j420j280j289r25j90L86M71L70O13J251J774
$$ 253176 251913 250580 248560 246232 244293 242873 241593 240304 239379 239189 239575 240046 240416 241029 242280 244054
51451B44054J759J457J535K234L041L368L351L635M517N644O654P558Q291Q339
$$ 244054 245813 247270 248805 251039 254080 257448 260799 264434 268951 274595 281249 288807 297098 305437
51437C05437P333N727M331L325K351J468J260J680J638K95j806l519m565n411
$$ 305437 312770 318497 322828 326153 328504 329972 331232 332912 334550 334845 333039 329520 324955 319544
51423C19544o066n971n118m314m029l786l054k098j389q52k25L13N39Q47J699
$$ 319544 313478 307507 302389 298075 294046 290260 287206 285108 283719 282867 282642 282955 283494 284341 286040
51408B86040K706K935K089Q04j78m89L0J256K471K868K531K326K619K824K459
$$ 286040 288746 291681 293770 294574 294396 293907 293937 295193 297664 300532 303063 305389 308008 310832 313291
51393C13291J976K101K839L631M077M072L732L580M438O497Q893J0782J2521J5136
$$ 313291 315267 317368 320207 323838 327915 331987 335719 339299 343737 350234 359127 369909 382430 397566
51379C97566J8821K2727K6256K9751L3761L8114M1985M4417M4557M1920L6788
$$ 397566 416387 439114 465370 495121 528882 566996 608981 653398 697955 739875 776663
51368G76663L0203K3317J6766J0644M693j531q362j5572k2443k8402l3290l6962
$$ 776663 806866 830183 846949 857593 862286 860755 852393 836821 814378 785976 752686 715724
51356G15724l9037l9402l8620l7372l5660l3019k9417k5544k2082j9055j6105
$$ 715724 676687 637285 598665 561293 525633 492614 463197 437653 415571 396516 380411
51345C80411j3173j0696r127q412p983p305o384n700n527n497m982l816k482j503
$$ 380411 367238 356542 347415 339003 331020 323715 317331 311631 306104 300607 295625 291809 289327 287824
51331B87824r38o16o30j294k618l967m492l929k915k409k753l336l302k449j330
$$ 287824 286886 286270 285640 284346 281728 277761 273269 269340 266425 264016 261263 257927 254625 252176 250846
51316B50846n49k52k77m34m81k08K05K01m39j140j222q30o10o03j55R79K171K873
$$ 250846 250297 250045 249768 249334 248853 248645 248850 249051 248612 247472 246250 245420 244810 244207 244052 245031 247202 250075
51298B50075L333L901M234L841K977K206J433J88j250j947j616j027q69r91j011
$$ 250075 253408 257309 261543 265384 268361 270567 272000 272188 270938 268991 267375 266348 265479 264488 263477
51283B63477r75r07l85Q01K043K523K165J488P80K9n88p79o28m85l63QN16O45
$$ 263477 262502 261595 261210 262011 264054 266577 268742 270230 271010 271039 270451 269672 269044 268559 268196 268204 268720 269365
51265B69365K60k6L92J336K091K234J910J438R11K69m02q21q12n44l71m93r31
$$ 269365 269625 269599 269991 271327 273418 275652 277562 279000 279911 280180 279778 278957 278145 277601 277230 276737 275806
51248B75806j690k685l462l421k525j486r19o79l18Q6O8l94p71p12m47l51m93
$$ 275806 274116 271431 267969 264548 262023 260537 259618 258939 258621 258707 258775 258381 257610 256898 256451 256100 255607
51231B55607p24q78q61p51q46j288j641j297l87K56K12Q2N38J279J446Q76K86
$$ 255607 254883 254005 253144 252393 251547 250259 248618 247321 246934 247190 247402 247484 248022 249301 250747 251623 251909
51214B51909J96L66L99M01N78P00M97L88J085K446L393L268K634K294K065J284
$$ 251909 252105 252471 252870 253271 253849 254549 255046 255434 256519 258965 262358 265626 268260 270554 272619 273903
51198B73903J86k33L05R44J049J068J528J955J529L27q60j594j934j814j115k47
$$ 273903 274089 273856 274161 275105 276154 277222 278750 280705 282234 282561 281701 280107 278173 276359 275244 274997
51182B74997K7m98j335k032k462k435j773r07o62j179j683j506q60k91Q1M41Q41
$$ 274997 275024 274526 273191 271159 268697 266262 264489 263582 262920 261741 260058 258552 257692 257401 257482 257923 258764
51165B58764J293J875K468K717K576K584L136L813L816K935J720P82K28k76j024
$$ 258764 260057 261932 264400 267117 269693 272277 275413 279226 283042 285977 287697 288479 288707 288431 287407
51150B87407j868k273j916j140n65l46k22j64m46r59j135p52k14J92O74J198J133
$$ 287407 285539 283266 281350 280210 279645 279299 279077 278913 278467 277508 276373 275621 275407 275599 276273 277471 278604
51133B78604K24p45r46o74p51j211j396j124q01n75k17J36L7l93m69m2J82k44
$$ 278604 278828 278083 277137 276463 275712 274501 273105 271981 271180 270605 270388 270524 270561 270168 269699 269657 269839 269595
51115B69595p04l45Q03J936K425K304K010K019K534L319L933M198M237M094L639
$$ 269595 268891 268546 269349 271285 273710 276014 278024 280043 282577 285896 289829 294027 298264 302358 305997
51100C05997K993K646K834L130K901K025R21M9m19n32m06j58J12K55J07k88o14
$$ 305997 308990 311636 314470 317600 320501 322526 323447 323496 323077 322545 322139 321981 322093 322348 322455 322167 321553
51083C21553o64o69r27j236j134o62k96j45J37N09L70l60p13J60J827L242M114
$$ 321553 320889 320220 319293 318057 316923 316261 315965 315820 315957 316466 316836 316476 315763 315923 317750 320992 325106
51066C25106M824N414N634N894P158R688J2600J4840J5902J5481J3360J0162P509
$$ 325106 329930 335344 340978 346872 354030 363718 376318 391158 407060 422541 435901 446063 453572
51053D53572O722P651R284J1006J2721J4126J4715J4427J3686J2746J1398R385
$$ 453572 460294 467945 477229 488235 500956 515082 529797 544224 557910 570656 582054 591439
51041E91439O710L658P40j446k757l797n266p212r372j1952j5236j8526k0394
$$ 591439 598149 601807 602547 601101 598344 594547 589281 582069 572697 560745 545509 526983 506589
51028E06589k0289j9146j8058j7043j5566j3582j1438r259p054n051l373j687
$$ 506589 486300 467154 449096 432053 416487 402905 391467 382208 375154 370103 366730 365043
51016C65043K42J994L057L607M129M650N044N713P054Q442Q760Q008P369P556
$$ 365043 365285 367279 370336 373943 378072 382722 387766 393479 400533 408975 417735 425743 433112 440668
51002D40668P993P943P546P275P112O846O640O758P168P792Q702R699J0161R802
$$ 440668 448661 456604 464150 471425 478537 485383 492023 498781 505949 513741 522443 532142 542303 552105
50988E52105R127Q694Q402P942P460P199O881O118N169M632M607M743M931N393
$$ 552105 561232 569926 578328 586270 593730 600929 607810 613928 619097 623729 628336 633079 638010 643403
50974F43403O213P346Q966J1291J4159J7266K0719K4776K9191L3409L7359M1449
$$ 643403 649616 656962 665928 677219 691378 708644 729363 754139 783330 816739 854098 895547
50962H95547M5721M9643N2882N5704N8360O0563O1799O1822O0671N8484N5508
$$ 895547 941268 990911 1043793 1099497 1157857 1218420 1280219 1342041 1402712 1461196 1516704
50951A516704N2057M8278M4183L9897L5579L1145K6441K1804J7990J5392J3564
$$ 1516704 1568761 1617039 1661222 1701119 1736698 1767843 1794284 1816088 1834078 1849470 1863034
50940A863034J1812R872P836N663L158M84j684k768l124m051o647j0677j4883
$$ 1863034 1874846 1884718 1892554 1898217 1901375 1901859 1900175 1897407 1894283 1890232 1883585 1872908 1858025
50927A858025j8522k2148k6580l1630l6390m0502m4463m8718n3031n6765n9291
$$ 1858025 1839503 1817355 1790775 1759145 1722755 1682253 1637790 1589072 1536041 1479276 1419985
50916A419985o0109n9101n6783n3925n0841m7415m3730m0182l6936l3828l0763
$$ 1419985 1359876 1300775 1243992 1190067 1139226 1091811 1048081 1007899 970963 937135 906372
50905I06372k7794k4839k1842j9188j7288j5764j3839j1633j0200r939r885r056
$$ 906372 878578 853739 831897 812709 795421 779657 765818 754185 743985 734046 724161 715105
50893G15105p764o877o495o097n556n137m773m095l102k123j196r8J124K131K829
$$ 715105 707341 700464 693969 687872 682316 677179 672406 668311 665209 663086 661890 661792 662916 665047 667876
50878F67876L397L912M325M809N513O108O160N974O480Q077J0021J1315J1839
$$ 667876 671273 675185 679510 684319 689832 695940 702100 708074 714554 722631 732652 743967 755806
50865G55806J2333J3506J5483J7926K0440K2800K5015K7332L0132L3702L8026
$$ 755806 768139 781645 797128 815054 835494 858294 883309 910641 940773 974475 1012501
50854A012501M2755M7594N2667N8364O4799P1661P8660Q5853R3376J01112J08805
$$ 1012501 1055256 1102850 1155517 1213881 1278680 1350341 1429001 1514854 1608230 1709342 1818147
50843A818147J16267J23195J29131J33817J37306J39305J38737J34644J27327
$$ 1818147 1934414 2057609 2186740 2320557 2457863 2597168 2735905 2870549 2997876
50834B997876J17951J06955R3602P7539O0184M3864K9744J7217N506m748j1955
$$ 2997876 3115827 3222782 3316384 3393923 3454107 3497971 3527715 3544932 3550438 3545690 3533735
50823C533735j5261j5226j2774q154j384O596J3867J8676K0218J8337J2957M125
$$ 3533735 3518474 3503248 3490474 3482320 3480936 3487532 3501399 3520075 3540293 3558630 3571587 3575712
50811C575712p762k1974l7546n3388o8765q3763r8761j13166j25260j33716j38678
$$ 3575712 3567950 3545976 3508430 3455042 3386277 3302514 3203753 3090587 2965327 2831611 2692933
50800B692933j40906j40363j36466j29401j20352j10417j00026q9369p8712o8134
$$ 2692933 2552027 2411664 2275198 2145797 2025445 1915028 1815002 1725633 1646921 1578787
50790A578787n7487m6888l6869k7981k0593j5021j1279q707o440m453l570m167
$$ 1578787 1521300 1474412 1437543 1409562 1388969 1373948 1362669 1353962 1347522 1343069 1339499 1335332
50778A335332n488o554p287q248r686j1252j2548j3450j4086j4776j5937j7749
$$ 1335332 1329844 1323290 1316003 1307755 1298069 1286817 1274269 1260819 1246733 1231957 1216020 1198271
50766A198271j9944k2027k3646k4667k5147k5323k5387k5143k4140k2332k0242
$$ 1198271 1178327 1156300 1132654 1107987 1082840 1057517 1032130 1006987 982847 960515 940273
50755I40273j8279j6276j3987j1689r801q173o292m021j634P92L426O152Q569
$$ 940273 921994 905718 891731 880042 870241 862068 855776 851755 850121 850913 854339 860491 869060
50742H69060J0634J2828J5522J8618K2093K6318L1460L6876M1594M5326M8649
$$ 869060 879694 892522 908044 926662 948755 975073 1006533 1043409 1085003 1130329 1178978
50731A178978N2311N6580O1103O5078O7728O8990O9646P0408P1030P0740O9382
$$ 1178978 1231289 1287869 1348972 1414050 1481778 1550768 1620414 1690822 1761852 1832592 1901974
50720A901974O7497O5200O1703N6270M9006M0330L0268J8960P413l034j1769j8792
$$ 1901974 1969471 2034671 2096374 2152644 2201650 2241980 2272248 2291208 2298621 2295587 2283818 2265026
50708B265026k3714k5713k4585k1118j6288j0709m974K47M819R143J3042J5210
$$ 2265026 2241312 2215599 2191014 2169896 2153608 2142899 2137925 2138172 2142991 2152134 2165176 2180386
50696B180386J4303J0132L306n756j6723k8677m0311n0770n9770o7019p2118p4863
$$ 2180386 2194689 2204821 2208127 2202371 2185648 2156971 2116660 2065890 2006120 1939101 1866983 1792120
50684A792120p5141p2710o7687o1070n4055m6865l8904l0086k1153j2588m059
$$ 1792120 1716979 1644269 1576582 1515512 1461457 1414592 1375688 1345602 1324449 1311861 1307802
50673A307802M666J2996K0189K6214L1367L5456L7999L8975L8785L7540L4927
$$ 1307802 1312468 1325464 1345653 1371867 1403234 1438690 1476689 1515664 1554449 1591989 1626916
50662A626916L0916K6235K2011J8964J6933J5213J3367J1696J0744J0441J0174
$$ 1626916 1657832 1684067 1706078 1725042 1741975 1757188 1770555 1782251 1792995 1803436 1813610
50651A813610R656R279R436R962J0590J1564J3354J5988J9146K2753K7065L2023
$$ 1813610 1823266 1832545 1841981 1851943 1862533 1874097 1887451 1903439 1922585 1945338 1972403 2004426
50639B004426L6951M0950M3560M5047M6040M6848M7047M5935M3432M0341L7656
$$ 2004426 2041377 2082327 2125887 2170934 2216974 2263822 2310869 2356804 2400236 2440577 2478233
50628B478233L5825L4557L2795K8676K0171O537j0777k8893m4932n6819o3479
$$ 2478233 2514058 2548615 2581410 2610086 2630257 2636794 2626017 2597124 2552192 2495373 2431894
50617B431894o5129o3152n8948n2815m4457l4357k3947j4396n966J250O636R557
$$ 2431894 2366765 2303613 2244665 2191850 2147393 2113036 2089089 2074693 2068727 2069977 2076613 2086170
50605B086170J0012Q318M397k078j0965k1383l2087m1975n0363n7125o2554o6902
$$ 2086170 2096182 2104500 2108897 2106819 2095854 2074471 2042384 2000409 1950046 1892921 1830367 1763465
50593A763465o9934p0985o9554o5902o1152n6643n2941m9487m5363m0377l5223
$$ 1763465 1693531 1622546 1552992 1487090 1425938 1369295 1316354 1266867 1221504 1181127 1145904
50582A145904l0692k7069k4225k1918j9863j7892j6123j4718j3432j1784r734
$$ 1145904 1115212 1088143 1063918 1042000 1022137 1004245 988122 973404 959972 948188 938454
50571I38454p711n845l718j115J535L826N910P949R619J0855J2487J5233J8445
$$ 938454 930743 924898 921180 920065 921600 925426 931336 939285 948904 959759 972246 987479 1005924
50558A005924K0853K2429K4462K7704L1508L4979L7927M0312M1762M2331M2788
$$ 1005924 1026777 1049206 1073668 1101372 1132880 1167859 1205786 1246098 1287860 1330191 1372979
50547A372979M3370M2963M0517L6740L3432L1524L0728L0846L2283L5188L9008
$$ 1372979 1416349 1459312 1499829 1536569 1570001 1601525 1632253 1663099 1695382 1730570 1769578
50536A769578M3143M7467N2137N7524O4219P2357Q0925Q8644R5593J02955J10979
$$ 1769578 1812721 1860188 1912325 1969849 2034068 2106425 2187350 2275994 2371587 2474542 2585521
50525B585521J18378J24239J29283J34233J37963J38536J35572J30208J22948
$$ 2585521 2703899 2828138 2957421 3091654 3229617 3368153 3503725 3633933 3756881
50516C756881J12903R9382Q3063O5065M5669K4554J840k1629m4753o6476q5806
$$ 3756881 3869784 3969166 4052229 4117294 4162963 4187517 4189357 4167728 4122975 4056499 3970693
50505C970693j01854j13931j21617j24861j24023j19526j11416r9459q3732o4996
$$ 3970693 3868839 3754908 3633291 3508430 3384407 3264881 3153465 3054006 2970274 2905278
50495B905278m4460k3466l283J5073L0872M3328N1306N3688N0035M0552K5512
$$ 2905278 2860818 2837352 2834069 2849142 2880014 2923342 2974648 3028336 3078371 3118923 3144435
50484C144435N336j8540m3433o6568q6455j02932j16103j25635j31087j32518
$$ 3144435 3149771 3131231 3087798 3021230 2934775 2831843 2715740 2590105 2459018 2326500
50474B326500j30608j26233j20089j12732j04770r6763q8864q0863p2723o4892
$$ 2326500 2195892 2069659 1949570 1836838 1732068 1635305 1546441 1465578 1392855 1327963
50464A327963n7839n1523m5667m0397l6106l2728k9551k5893k1663j7243j3110
$$ 1327963 1270124 1218601 1172934 1132537 1096431 1063703 1034152 1008259 986596 969353 956243
50453I56243r595o693m042j349J179L050M158M840N308N424N149M714M261L681
$$ 956243 946648 939955 935913 934564 935743 938793 942951 947791 953099 958523 963672 968386 972647 976328
50439I76328L043K730K997L602M106M279M180M150M774O438Q744J0878J2599J4399
$$ 976328 979371 982101 985098 988700 992806 997085 1001265 1005415 1010189 1016627 1025371 1036249 1048848 1063247
50425A063247J6515J8480J9921K1239K2989K5075K7157K9449L2472L6257M0316
$$ 1063247 1079762 1098242 1118163 1139402 1162391 1187466 1214623 1244072 1276544 1312801 1353117
50414A353117M4288M8181N2076N6035O0073O3933O7108O9386P1020P1959P1428
$$ 1353117 1397405 1445586 1497662 1553697 1613770 1677703 1744811 1814197 1885217 1957176 2028604
50403B028604O8896O5044O0936N6474N0595M2936L4258K5028J4557K104j1843
$$ 2028604 2097500 2162544 2223480 2279954 2330549 2373485 2407743 2432771 2447328 2449432 2437589
50392B437589k5997l9477n1896o2621p0760p5986p8773p9461p7567p2369o4127
$$ 2437589 2411592 2372115 2320219 2257598 2186838 2110852 2032079 1952618 1875051 1802682 1738555
50381A738555n4283m4244l4258k3780j2710j888P643J5331K0972K4261K4877K2686
$$ 1738555 1684272 1640028 1605770 1581990 1569280 1567392 1575035 1590366 1611338 1635599 1660476 1683162
50369A683162J7678R999K55j0507k1432l2092m1871m9705n5013n8407o0764o1929
$$ 1683162 1700840 1710839 1711094 1700587 1679155 1647063 1605192 1555487 1500474 1442067 1381303 1319374
50357A319374o1148n8511n5135n1920m8954m6106m3388m0563l7242l3620l0364
$$ 1319374 1258226 1199715 1144580 1092660 1043706 997600 954212 913649 876407 842787 812423
50346H12423k7550k4450k0728j7089j4235j1832r120o063l265j079P01K498M640
$$ 812423 784873 760423 739695 722606 708371 696539 687419 681356 678091 677012 677713 680211 684851
50333F84851P194R764J1753J3063J4226J5599J6808J7255J6593J4441J0364M790
$$ 684851 692045 701809 713562 726625 740851 756450 773258 790513 807106 821547 831911 836701
50321H36701o01m256o189p352q031p804o886o273o381o431n568l871j897J15K076
$$ 836701 836100 831844 825655 818303 810272 802468 795582 789309 782928 776497 770929 767058 765161 765276 767352
50306G67352L653M545M888N020N090N234N733O647P468P634P235O926P177P924
$$ 767352 771005 775550 780438 785458 790548 795782 801515 808162 815630 823264 830499 837425 844602 852526
50292H52526Q804R430R523R058Q362P827P501P111O492N775N256N184N700O812
$$ 852526 861330 870760 880283 889341 897703 905530 913031 920142 926634 932409 937665 942849 948549 955361
50278I55361Q495J0870J4122J7855K0554K0129J5424P183k468j1371j8256k2721
$$ 955361 963856 974726 988848 1006703 1027257 1047386 1062810 1069993 1067525 1056154 1037898 1015177
50266A015177k4872k5009k3509k0827j7612j4577j2082r864p465m943k871j500
$$ 1015177 990305 965296 941787 920960 903348 888771 876689 866825 859360 854417 851546 850046
50254H50046k72J486L603N251O059O674P884R633J1220J2345J3486J5138J7098
$$ 850046 849774 851260 854863 860114 866173 872847 880731 890364 901584 913929 927415 942553 959651
50241I59651J8817K0226K1834K3910K5956K7201K7424K6998K6189K4742K2296
$$ 959651 978468 998694 1020528 1044438 1070394 1097595 1125019 1152017 1178206 1202948 1225244
50230A225244J8955J5327J2072R568P864O676N472L729J211k151o605j2533j9874
$$ 1225244 1244199 1259526 1271598 1281166 1289030 1295706 1301178 1304907 1306118 1303967 1297362 1284829 1264955
50217A264955k7658l4333l8718m0658m0757l9630l7529l4582l1010k6919k2174
$$ 1264955 1237297 1202964 1164246 1123588 1082831 1043201 1005672 971090 940080 913161 890987
50206H90987j6940j2281r716r904j2076j4850j7291j9000j9763j9673j9350j9345
$$ 890987 874047 861766 852050 842146 830070 815220 797929 778929 759166 739493 720143 700798
50194G00798j9376j8720j7312j5868j4821j3813j2496j1209j0416j0002r617r369
$$ 700798 681422 662702 645390 629522 614701 600888 588392 577183 566767 556765 547148 537779
50182E37779r511r672r138p851o580n942n740n413m722l848l147k992l472m020
$$ 537779 528268 518596 509458 501607 495027 489085 483345 477932 473210 469362 466215 463223 459751 455731
50168D55731l736k438r96k56N9Q36K195L404M090M772N855O869P280P465Q172
$$ 455731 451995 449557 448561 448305 448364 449200 451395 454799 458889 463661 469516 476385 483665 491130 499302
50153D99302R310J0139J0496J0913J1443J1305J0148Q813Q220Q067P388N984M499
$$ 499302 508612 518751 529247 540160 551603 562908 573056 581869 590089 598156 605544 611528 616027
50140F16027L381K530K024K299L526N342P447R886J2578J5074J7091J8886K0939
$$ 616027 619408 621938 623962 626261 629787 635129 642576 652462 665040 680114 697205 716091 737030
50127G37030K3545K6924L1248L6333M1648M6812N1766N6295N9948O2553O4241
$$ 737030 760575 787499 818747 855080 896728 943540 995306 1051601 1111549 1174102 1238343
50116A238343O4616O2721N8495N3739N0682M9795M9687M8957M7300M4847M1297
$$ 1238343 1302959 1365680 1424175 1477914 1528596 1578391 1628078 1677035 1724335 1769182 1810479
50105A810479L6067K8701J8925O904o247j8715k9217l7745m4921n0988n5783n9275
$$ 1810479 1846546 1875247 1894172 1901076 1894829 1876114 1846897 1809152 1764231 1713243 1657460 1598185
50093A598185o1490o2049o0316n6210n0618m4808l9499l4603k9825k5426k2192
$$ 1598185 1536695 1474646 1414330 1358120 1307502 1262694 1223195 1188592 1158767 1133341 1111149
50082A111149k0499j9657j8567j7005j5825j5754j6405j6868j6817j6597j6417
$$ 1111149 1090650 1070993 1052426 1035421 1019596 1003842 987437 970569 953752 937155 920738
50071I20738j6128j5697j5349j5036j4363j3265j2350j2098j2120j1645j0571
$$ 920738 904610 888913 873564 858528 844165 830900 818550 806452 794332 782687 772116
50060G72116r444q481p290n611l850k438j172L46J952L137L913M878O298P652
$$ 772116 762672 754191 746901 741290 737440 735002 733830 734176 736128 739265 743178 748056 754354 762006
50046G62006Q296Q204P743P093O211N147M010K687J042o35j745k105k224k703
$$ 762006 770302 778506 786249 793342 799553 804700 808710 811397 812439 811804 810059 807954 805730 803027
50032H03027l499m115m363m605n200n916o146n629m714l926l351k705j866j172
$$ 803027 799528 795413 791050 786445 781245 775329 769183 763554 758840 754914 751563 748858 746992 745820
50018G45820j022j262j175j90J413K705L117L074L446M451N520O309P328R251
$$ 745820 744798 743536 742361 742171 743584 746289 749406 752480 755926 760377 765897 772206 779534 788785
50004G88785J1927J4724J7588K1118K5410K9535L2528L4407L5778L6695L6498
$$ 788785 800712 815436 833024 854142 879552 909087 941615 976022 1011800 1048495 1084993
49993A084993L4770L2062K9524K7978K7356K6867K5568K2824J8318J1917L817
$$ 1084993 1119763 1151825 1181349 1209327 1236683 1263550 1289118 1311942 1330260 1342177 1345994
49982A345994n243j4421k3503l2781m1972m9755n4868n7340n8130n7789n6075
$$ 1345994 1340751 1326330 1302827 1270046 1228074 1178319 1123451 1066111 1007981 950192 894117
49971H94117n2835m8520m3731l8734l3710k9060k5153k1959j9192j6675j4406
$$ 894117 841282 792762 749031 710297 676587 647527 622374 600415 581223 564548 550142
49960E50142j2520j1189j0363r499p946n758l817k805k334j488l0J445K528L529
$$ 550142 537622 526433 516070 506571 498625 492867 489050 486245 483911 482423 482393 483838 486366 489895
49946D89895M886O447P734Q596R203R503R199Q243P047N996N051L991K708J061
$$ 489895 494781 501228 508962 517558 526761 536264 545463 553706 560753 566749 571800 575791 578499 579560
49932E79560j217m132p087r410j1061j2434j3519j3830j3208j2170j1217j0304
$$ 579560 578343 574211 567124 557714 546653 534219 520700 506870 493662 481492 470275 459971
49920D59971r203p876o202l928j423J04k0p40l61J239K447K108R59M14P41J147
$$ 459971 450768 442892 436690 432762 431339 431443 431423 430683 430322 431561 434008 436116 437075 437489 438230 439377
49904D39377J195J278J795K588L386M287N578P240Q897J0094J0550J0243R386
$$ 439377 440572 441850 443645 446233 449619 453906 459484 466724 475621 485715 496265 506508 515894
49891E15894Q356P466O767N986M822L321J888Q08j54j502l381n464p454r380j1285
$$ 515894 524250 531716 538483 544469 549291 552612 554500 555308 555154 553652 550271 544807 537353 527973 516688
49876E16688j2894j3794j3820j3020j1464r420p640o873p016o982n869l987k420
$$ 516688 503794 490000 476180 463160 451696 442276 434636 427763 420747 413765 407896 403909 401489
49863D01489j561p15P37K271K890K550K284K833L812M482M817N316O152P079P990
$$ 401489 399928 399213 399950 402221 405111 407661 409945 412778 416590 421072 425889 431205 437357 444436 452426
49848D52426R031J0101J0714J0467R451Q128O940N949M730K871P50n85p67q90
$$ 452426 461457 471558 482272 492739 502190 510318 517258 523207 527937 530808 531558 530973 530206 529316
49834E29316k196m306n694n908o073o969p782p497o521n815n220l906k105j002
$$ 529316 527120 522814 517120 511212 505139 498170 490388 482891 476370 470555 465335 461429 459324 458322
49820D58322q66n90O14K125L113L798M774N801O260O358O894P928Q588Q307P483
$$ 458322 457456 456866 457480 459605 462718 466516 471290 477091 483351 489709 496603 504531 513119 521426 528909
49805E28909O703N936M949L963L374L092K644J843R41J45p13j926l644n793q081
$$ 528909 535612 541548 546497 550460 553834 556926 559570 561413 562354 562499 561786 559860 556216 550423 542342
49790E42342j0032j1305j2035j2623j3108j3005j1912j0056q104o642n902n779
$$ 542342 532310 521005 508970 496347 483239 470234 458322 448266 440162 433520 427618 421839
$$ [...]
##END NTUPLES=NMR SPECTRUM
##END=
