##TITLE=NES1065_ptc_ref_9883764_BG3vxLU3YG
##JCAMPDX= 6.0         $$ Bruker NMR JCAMP-DX V2.0
##DATA TYPE= NMR SPECTRUM
##DATA CLASS= NTUPLES
##ORIGIN= BRUKER
##OWNER= Administrator
$$ 1.72 TOPSPIN		Version 2.1
$$ 2016-08-27 01:11:05.851 -0500  Administrator@X
$$ Compression mode = diff/dup
##.OBSERVE FREQUENCY= 400.02188249412
##.OBSERVE NUCLEUS= ^1H
##.ACQUISITION MODE= SIMULTANEOUS (DQD)
##.ACQUISITION SCHEME= undefined
##.AVERAGES= 8
##.DIGITISER RES= 22
##SPECTROMETER/DATA SYSTEM= spect
##.PULSE SEQUENCE= zg30
##.SOLVENT NAME= COFFEE_meoh
##.SHIFT REFERENCE= INTERNAL, COFFEE_meoh, 1, 14.98509
##AUDIT TRAIL= $$ (NUMBER, WHEN, WHO, WHERE, PROCESS, VERSION, WHAT)
$$ ##TITLE= Audit trail, TOPSPIN		Version 2.1
$$ ##JCAMPDX= 5.01
$$ ##ORIGIN= Bruker BioSpin GmbH
$$ ##OWNER= Administrator
$$ $$ E:\/data/COFFEE/nmr/NES1065_ptc_ref_9883764_BG3vxLU3YG/10/pdata/1/auditp.txt
$$ ##AUDIT TRAIL=  $$ (NUMBER, WHEN, WHO, WHERE, PROCESS, VERSION, WHAT)
(   1,<2016-08-27 01:10:58.601 -0500>,<Administrator>,<X>,<go>,<TOPSPIN 2.1>,
      <created by zg
	started at 2016-08-27 01:09:52.070 -0500,
	POWCHK enabled, PULCHK disabled,
       configuration hash MD5:
       21 0F 79 D6 B3 7B B4 F6 88 20 88 DB 03 48 BD 9F
       data hash MD5: 64K
       65 02 55 91 EA 07 47 38 9A 34 F0 18 0C 7B 65 22>)
(   2,<2016-08-27 01:11:01.758 -0500>,<Administrator>,<X>,<proc1d>,<TOPSPIN 2.1>,
      <Start of raw data processing
       efp LB = 0 FT_mod = 6 PKNL = 1 PHC0 = 0 PHC1 = 0 SI = 32K 
       data hash MD5: 32K
       DF 73 A7 38 B0 6F BF 6E 0F 9C E8 6C ED B3 82 A3>)
(   3,<2016-08-27 01:11:02.039 -0500>,<Administrator>,<X>,<proc1d>,<TOPSPIN 2.1>,
      <pk PHC0 = 96.1084 PHC1 = 0 
       data hash MD5: 32K
       1E 5A C5 BE E2 7F 0E EE 69 6A AB C8 7E B2 5A F0>)
(   4,<2016-08-27 01:11:02.164 -0500>,<Administrator>,<X>,<proc1d>,<TOPSPIN 2.1>,
      <abs ABSG = 1 
       data hash MD5: 32K
       27 00 12 7B 61 0F 33 AB 31 29 EF 7C B0 3B 92 6A>)
(   5,<2016-08-27 01:11:02.226 -0500>,<Administrator>,<X>,<proc1d>,<TOPSPIN 2.1>,
      <abs ABSG = 2 
       data hash MD5: 32K
       ED D3 94 8F 90 40 3F 37 17 53 DD 4B 15 31 86 DA>)
(   6,<2016-08-27 01:11:02.289 -0500>,<Administrator>,<X>,<proc1d>,<TOPSPIN 2.1>,
      <abs ABSG = 3 
       data hash MD5: 32K
       03 EA 97 5B 17 9A 31 F1 64 B3 79 F6 FB 00 71 44>)
(   7,<2016-08-27 01:11:02.336 -0500>,<Administrator>,<X>,<proc1d>,<TOPSPIN 2.1>,
      <abs ABSG = 4 
       data hash MD5: 32K
       02 0B 7C 42 AA C2 D4 98 29 B8 25 7D A9 CA 73 55>)
(   8,<2016-08-27 01:11:02.398 -0500>,<Administrator>,<X>,<proc1d>,<TOPSPIN 2.1>,
      <abs ABSG = 5 
       data hash MD5: 32K
       77 4A 63 E1 06 E5 12 72 1F C1 43 F7 58 CD 0A 0C>)
$$ ##END=
$$ 
$$ $$ hash MD5
$$ $$ 26 CD F3 F7 2A 26 54 CC F7 40 FE CB 4B 90 67 00
##$RELAX= 
##$RELAX= 
##$RELAX= 
##$RELAX= 
##$RELAX= 
##$RELAX= 
##$RELAX= 
$$ Bruker specific parameters
$$ --------------------------
##$DU= <E:\>
##$EXPNO= 10
##$NAME= <NES1065_ptc_ref_9883764_BG3vxLU3YG>
$$ [...]
##$TP= (0..7)
150 150 150 150 150 150 150 150
##$TP07= 0
##$TPNAME0= <>
##$TPNAME1= <>
##$TPNAME2= <>
##$TPNAME3= <>
##$TPNAME4= <>
##$TPNAME5= <>
##$TPNAME6= <>
##$TPNAME7= <>
##$TPOAL= (0..7)
0.5 0.5 0.5 0.5 0.5 0.5 0.5 0.5
##$TPOFFS= (0..7)
0 0 0 0 0 0 0 0
##$TUNHIN= 0
##$TUNHOUT= 0
##$TUNXOUT= 0
##$USERA1= <user>
##$USERA2= <user>
##$USERA3= <user>
##$USERA4= <user>
##$USERA5= <user>
##$V9= 5
##$VALIST= <valist>
##$VCLIST= <CCCCCCCCCCCCCCC>
##$VD= 0
##$VDLIST= <DDDDDDDDDDDDDDD>
##$VPLIST= <PPPPPPPPPPPPPPP>
##$VTLIST= <TTTTTTTTTTTTTTT>
##$WBST= 2048
##$WBSW= 25
##$XGAIN= (0..3)
0 0 0 0
##$XL= 0
##$YL= 0
##$YMAX_a= 607992
##$YMIN_a= -518437
##$ZGOPTNS= <>
##$ZL1= 120
##$ZL2= 120
##$ZL3= 120
##$ZL4= 120
##$ABSF1= 14.98509
##$ABSF2= -5.573092
##$ABSG= 5
##$ABSL= 3
##$ALPHA= 0
##$AQORDER= 0
##$ASSFAC= 0
##$ASSFACI= 0
##$ASSFACX= 0
##$ASSWID= 0
##$AUNMP= <proc_prof1d_extract_pilot.lims>
##$AXLEFT= 0
##$AXNAME= <>
##$AXNUC= <1H>
##$AXRIGHT= 0
##$AXTYPE= 0
##$AXUNIT= <>
##$AZFE= 0.1
##$AZFW= 0.1
##$BCFW= 0
##$BC_mod= 0
##$BYTORDP= 0
##$COROFFS= 0
##$CY= 15
##$DATMOD= 1
##$DC= 0
##$DFILT= <>
##$DTYPP= 0
##$F1P= 0
##$F2P= 0
##$FCOR= 0.5
##$FTSIZE= 32768
##$FT_mod= 6
##$GAMMA= 0
##$GB= 0
##$INTBC= 1
##$INTSCL= 1
##$ISEN= 128
##$LB= 0
##$LEV0= 0
##$LPBIN= 0
##$MAXI= 10000
##$MC2= 0
##$MEAN= 0
##$ME_mod= 0
##$MI= 0
##$NCOEF= 0
##$NC_proc= -8
##$NLEV= 6
##$NOISF1= 0
##$NOISF2= 0
##$NSP= 0
##$NTH_PI= 0
##$NZP= 0
##$OFFSET= 14.98509
##$PC= 1
##$PHC0= 96.1084
##$PHC1= 0
##$PH_mod= 1
##$PKNL= yes
##$PPARMOD= 0
##$PPDIAG= 0
##$PPIPTYP= 0
##$PPMPNUM= 2147483647
##$PPRESOL= 1
##$PSCAL= 4
##$PSIGN= 0
##$PYNMP= <proc.py>
##$REVERSE= no
##$SF= 400.02
##$SI= 32768
##$SIGF1= 0
##$SIGF2= 0
##$SINO= 400
##$SIOLD= 32768
##$SPECTYP= <>
##$SREGLST= <1H.CDCl3>
##$SSB= 0
##$STSI= 32768
##$STSR= 0
##$SW_p= 8223.68421052631
##$SYMM= 0
##$S_DEV= 0
##$TDeff= 65536
##$TDoff= 0
##$TI= <>
##$TILT= no
##$TM1= 0
##$TM2= 0
##$TOPLEV= 0
##$USERP1= <user>
##$USERP2= <user>
##$USERP3= <user>
##$USERP4= <user>
##$USERP5= <user>
##$WDW= 1
##$XDIM= 32768
##$YMAX_p= 439158782
##$YMIN_p= -702423
##$CURPLOT= <Network HP LaserJet P1505>
##$CURPRIN= <$Network HP LaserJet P1505>
##$DFORMAT= <normdp>
##$LAYOUT= <+/1D_H.xwp>
##$LFORMAT= <normlp>
##$PFORMAT= <normpl>
##$SURQMSG= 1
$$ End of Bruker specific parameters
$$ ---------------------------------
##NTUPLES= NMR SPECTRUM
##VAR_NAME=  FREQUENCY,     SPECTRUM/REAL,   SPECTRUM/IMAG
##SYMBOL=    X,             R,               I
##VAR_TYPE=  INDEPENDENT,   DEPENDENT,       DEPENDENT
##VAR_FORM=  AFFN,          ASDF,            ASDF
##VAR_DIM=   32768,         32768,           32768
##UNITS=     HZ,            ARBITRARY UNITS, ARBITRARY UNITS
##FACTOR=    0.250966925370066, 1,           1
##FIRST=     8223.43324360094, -41501,       116347
##LAST=      0,             -78971,          42159
##MIN=       0,             -702423,         0
##MAX=       8223.43324360094, 439158782,    0
$$ Real data points
##PAGE= N=1
##DATA TABLE= (X++(R..R)), XYDATA
$$ [...]
23891 -1648 83075 215519 179636 65091 52138 19175 -47462 198480 33781 253114 -42575
23879 82465 -327897 394011 34726 237906 31907 122778 254811 139968 -19935 -203781
23869 -203781 119636 76917 -209201 18375 -63540 199105 -147161 64596 57732 -34321 231507
23857 194379 -215263 -20488 27296 211551 -62558 56712 199048 27041 92278 -238943 39305
23845 -41569 121840 -137088 -448922 -297422 -36519 56786 -182584 -105873 406353 104842
23834 210440 -216079 -131854 246810 194917 -44251 -96526 90119 -223597 47327 -85874 -129951
23823 -129951 280300 -22110 -24624 -35906 218472 -263169 36326 151075 -35441 -25437 238770
23811 220060 -114635 -222868 150204 -119309 -67126 -23058 -1590 87583 160758 -413643 -28484
23799 -327488 17781 417153 77222 169700 -240578 61948 221769 -57725 -135247 67051 -165451
23787 228023 211573 278079 -36790 -103474 181114 106756 -134424 -9008 -40283 184641 -14126
23775 140294 -40245 -45058 -79564 -256881 191008 -105371 180913 126246 30449 44959 157634
23764 157634 -194970 64863 -93485 140490 -305044 -50927 -47161 139312 48012 -13417 -10051
23753 -10051 3387 -293984 75465 25600 116564 24962 -351024 32248 -138475 -270284 336858
23741 105146 -7926 -18448 -114636 150249 3635 -128991 -100253 -2754 140610 -19076 76059
23729 -152646 15158 208597 -10617 -154857 -143318 -106563 -164556 144652 -94201 323794 20591
23717 120454 -40967 161421 189944 -339426 -61166 -133320 110214 7191 -128252 -1420 -50599
23706 -50599 253663 112389 -139355 -51060 -128511 -44677 -113091 -128497 76135 56405 -193343
23694 51573 -175325 92581 72126 95955 -261363 13774 273123 -151576 -59241 -199833 313382
23682 -360932 44255 -198776 -10128 219511 -127280 -68163 -82472 203390 -4073 185491 134313
23671 134313 -168969 181940 -382617 -197191 311710 15191 292150 -171490 4235 -120577
23660 -99261 85770 -246860 -334832 -40191 -61574 -87010 -170434 -249896 -106846 23220 -10071
23648 118860 -29988 -176053 -233904 118371 -108129 15998 -184287 166698 -42551 -134468
23638 -134468 120853 153087 157539 -95093 129413 -45379 83381 -125251 257555 -98233 -75880
23627 -75880 -75464 -77312 76142 50198 3538 94084 -31943 292140 -40424 134953 278507 10119
23614 109259 -142754 -255015 183770 227757 -109502 3328 94774 -121902 179941 -60764
23603 -65600 -51898 -68405 -130767 -233759 -156486 -171840 8852 -221068 -86534 -134919 98840
23591 -97600 -83778 -166864 -23023 -128430 -108652 -186590 4236 42746 213146 42235 183093
23580 183093 -202964 -75152 -134963 -175219 -158376 81926 -51216 -2292 -158216 128214 180171
23569 180171 -56658 -23212 -132724 24261 20016 -275350 -74226 -127156 238825 -24187 -418320
23558 -418320 -339325 107694 -153076 -133699 14071 -279692 214191 -82304 84931 495919
23548 495919 -6386 -152107 -22787 15047 130528 -77435 284210 -46899 85468 -225271 96496
23536 -15277 140811 -49995 93325 62721 -149551 -206258 10336 -192850 -6372 -18110 -843 181108
23523 -170010 101048 210968 317907 -66415 143909 -249950 -122344 -21372 1976 -171228
23512 -228136 125429 112146 37559 135417 194995 -286385 133849 -108801 -166874 164660
23501 -155237 -31497 -113039 135200 -76967 27585 361720 -213137 57896 -47746 -296876 97477
23489 -124808 46392 -118425 -98397 108674 53019 -81327 243840 -28826 23895 -94445 78718
23477 23708 295453 -350176 -156900 263989 -19669 308640 42905 1449 -175583 -23266 138003
23465 24043 -92716 -5117 -68270 26286 -229156 -152345 103264 -105556 145146 192039 170555
23454 170555 -442473 134722 189888 -2879 99845 -201010 156655 182211 -226091 23508 142459
23443 142459 11444 -211066 -88724 -98275 90819 171160 -173258 135396 -233066 -151631 91862
23431 -55810 -109971 -228001 -63641 21498 -66762 20103 -135901 -76779 -124998 -68266 64923
23419 10924 -13553 347257 -184853 55516 -229873 -14444 192328 155391 52342 -490667 26160
23407 41857 -285537 181542 110878 59049 -173961 -206891 -269991 -302652 52447 180278 99590
23396 99590 -188453 11713 -70080 -113171 -54615 -11233 118699 -27504 -86639 433201 197714
23384 -19410 -73858 -197443 292288 37252 -199925 44696 300217 -167705 -16094 53268 -57358
23372 -470801 59490 -152039 38720 -228646 -104958 407446 79491 34900 -52667 -232216
23362 -232216 -59309 53863 131825 -182466 -150884 74090 39724 172050 -51612 -23988 -18873
23351 -18873 -8222 378769 -55833 -52588 -172248 -540 -258130 -119094 -127181 -76464 -115837 124873
23338 137969 67620 93808 243443 -24946 -18342 -230217 11875 27138 -115817 -322558 133529
23326 -137375 -53972 -4861 114078 -34610 -238485 -149248 -84356 300900 -25397 148602 -91801
23314 -51334 -144852 251241 -164226 -191615 249683 127441 -193164 3332 -130384 96237 -62953
23302 -43012 -912 -40622 321347 -99819 172399 -66089 38923 79150 -47681 99798 -175799
23290 -250489 -29215 24734 83514 -35215 275478 41821 -323390 37593 211476 -210533 -223244
23279 -223244 -129866 126497 -51586 -224441 186116 25479 -258929 48443 -131753 -314177
23269 -314177 252053 -292109 -118732 235351 18520 -186753 10468 -15747 -516 171454 29085
23257 31229 393522 -89990 -136682 -150013 96457 200078 76051 -118617 -97203 -141278 39037
23245 -120828 -137261 -38866 174099 156954 73143 40110 -8207 -146455 134145 199184 -239339
23233 -369751 -30211 -98137 -77514 -321142 66586 -86599 -56148 -92911 -211087 52558 -134636
23221 -31970 29570 154050 -117648 49128 120881 207520 23468 270798 139647 99216 96486
23210 96486 -144374 -188455 -18987 -110529 25451 -154170 3337 144416 -272856 -92775 22773
23198 -232648 29008 299306 40154 273171 104132 -221062 -2240 -51813 -45638 112227 -76891
23186 -6580 198152 -262930 -175508 -194963 -75887 -200096 455423 -60537 -67891 94680 180564
23175 180564 3413 66321 117269 95603 -141740 47286 3109 -88059 129554 -35791 -247761
23164 -247761 99862 -64934 120674 -279632 -26283 94050 223830 148907 -288625 71552 38649
23153 38649 70599 316744 246740 -119103 -97560 144040 -180591 -158177 104085 13400 -118052
23141 -348504 -149940 -342422 160691 -110420 187752 86288 -11377 93524 170201 203748
23131 203748 211081 -175545 -113768 -89260 166071 145352 128258 98161 125082 230037 19437
23119 117105 115454 79172 -235537 -192238 -10344 118165 -84467 -17504 84303 50417 -234820
23107 115151 67028 -262207 -154772 -275732 -119831 -391040 33365 127173 -70547 17557
23096 345717 -66623 -449728 -115562 171537 -96085 -138833 -314487 40826 -51383 175974
23085 -224373 116118 -269150 -45451 -251529 125143 227652 -62710 -174332 1079 -161816
23074 -35272 170488 -277154 -59705 324382 95631 8393 -100216 97691 -167192 79694 178618
23063 178618 88197 85870 -92700 182905 23314 -83188 -130716 -1762 213331 -316876 128528
23051 38913 -162111 202135 -102230 5975 -98424 -217205 97598 -230531 252772 153357 143399
23040 143399 -228871 81254 100590 -7564 81689 -25361 124551 -195051 -53679 -26143 336305
23028 -84389 -127106 -241240 38415 -39522 40302 12823 104290 20514 -85024 60289 3733 114482
23016 114482 163192 -79696 -92788 101978 60730 -4166 -231215 23767 214606 -99742 142561
23004 22705 98973 7607 -33480 27809 173530 -127552 18769 -253214 -88876 59597 -289022
22992 304163 71823 170138 193308 -180718 137904 -69471 -76231 -298715 154847 -56493 -206167
22981 -206167 -212255 -4591 -150598 -151287 192123 -284190 267364 225123 132024 -50027 34939
22969 -84109 -25741 352923 199292 -38556 -110571 -67888 -27362 -281967 70865 -45629 -23876
22958 -23876 -171476 -268647 93568 -31495 -74964 122050 -165588 -416569 161818 61958 4172
22946 258406 37206 77910 -203425 -39805 192953 206490 -212133 213430 -35385 71486 -112711
22934 381065 -17094 -125901 13720 36474 87084 128510 -177332 -62306 187268 -145911 -62994
22922 -62691 -32718 -138829 18317 -3245 46848 54682 -165652 106910 103307 52854 11938 109844
22910 109844 -124295 62837 325863 -178299 -113566 -127182 -92077 -162770 147538 -105778
22899 -18194 -137223 -9237 198027 -165697 -49904 -54120 -226913 -84169 -28289 -48687 164398
22887 110447 -114189 100950 -54184 -68250 24681 267650 190664 -81495 -132322 124314 84132
22876 84132 90164 -100987 -217662 30239 -54320 -268136 60886 -117667 -46885 -147581 -6995
22864 -340777 -3862 -240579 96387 273440 30436 -18104 -84764 -225220 -142345 -282516 -156180
22853 -156180 -86938 52864 -76861 200497 110801 110616 -147296 214705 -433438 -31852 45385
22841 45469 -76587 -110301 -41308 8941 -110338 -146326 -227760 144054 -229900 85988 217027
22830 217027 20853 52374 168184 -368002 -226450 -330451 -301862 -160607 95923 -167970
22819 83178 89329 89891 -46388 88589 61986 51835 -123428 -183961 -126984 -152454 271722 -256652
22806 31034 -13117 13959 84668 10115 131399 893 324843 8612 52884 230379 108867
22794 -105377 -331138 5718 -65167 134219 281762 298810 -40509 60806 9593 151567 -3008
22782 -142741 -163328 4463 -318290 166102 57978 -150259 -202113 310562 111251 60138 -130135
22770 -325066 92746 33162 -95705 -80778 102331 399369 -246225 102868 123924 -4636 -134987
22759 -134987 4739 -374538 1542 -48829 53046 236686 -163436 -11358 127961 -226290 36683
22747 -270716 -257337 158280 -151163 -256851 -73320 265765 23983 18557 -145031 -171971 -184105
22736 -184105 101583 -261240 -81922 -24234 -5624 29100 -78441 -119001 152001 -107038 -34435
22724 -163048 -195791 291680 -4364 107423 -277053 -52765 -59957 43180 100433 -113862 -290189
22713 -290189 -242645 -18177 -5316 218734 78419 -182694 -50853 17178 235361 129511 -52686
22701 -173688 227954 -99704 109548 249210 -131198 16153 -85224 175712 -165708 91779
22690 115090 205023 -210270 37828 -22525 -229407 -18214 95017 21313 -141534 112428 -11493
22678 12253 -70533 32578 87213 255243 -19392 5994 269042 -55795 -2695 235440 5451 -161300
22665 -282040 66336 9571 -47178 298 176226 40673 156047 299446 85980 -106122 -149604
22654 -149604 105469 8785 -55027 -122819 -258866 57083 -99945 397490 108484 32095 60244
22643 60244 77844 89794 -143061 -92261 -36923 87589 -158485 -273958 49551 -154756 132889
22631 -267375 -147904 -121988 -178880 18345 106922 155948 3816 214061 -151480 -177543 -43568
22619 158070 -31164 -302276 158174 63345 100492 -337350 -57273 -169058 208050 -61334
22608 130656 86157 -303493 1203 147300 101692 -217078 -211405 -10582 149188 -314370 -37486
22596 346024 9481 211232 -46431 -155086 53799 74776 -2853 74517 -24079 -470268 -211039
22584 76692 107344 77311 -39798 -67309 -93445 -285981 -314321 57888 -54468 -378746 252661
22572 -61312 -67176 -101288 -197830 205112 187009 -238883 69151 319366 -19473 -107133 10824
22560 -99239 191591 15610 6661 -65771 -284368 -31204 -253355 57871 55640 90386 -259487
22548 -155206 -219038 109399 -151978 -92288 -330889 -34849 104314 -42512 -164190 80489
22537 71785 -50853 9539 -177104 22892 311291 -123803 -155298 -308376 -59227 69431 69048
22526 69048 -207243 96563 -100848 -202963 -142647 -202619 76461 -119239 24999 -344389 129793
22514 173966 142050 -180861 3276 -6947 -77208 -279376 104842 243300 -13849 -13080 -37010
22503 -37010 -92406 332060 88124 64651 -172033 -310815 -108747 -112133 -43760 -27084 119769
22491 122849 243083 172878 -105361 84463 71640 362443 -78975 102250 132051 110409 -464659
22479 -138150 23785 75903 192809 -144906 -175243 -14172 197540 -77714 110885 -291227
22468 101594 246322 -247284 -66437 72843 39017 -32607 -210284 48376 -35090 150628 14608
22456 460558 92692 502188 -130323 -246448 531 -38100 -128442 -65821 -23967 114625 135212
22445 135212 15182 -227200 -23517 -90738 -539248 -16576 -92815 55471 166744 280613 44501
22433 -44242 -238353 65727 27589 165760 -107538 -165123 299726 114665 315370 -226136
22422 -50221 -49046 -133992 -31648 248755 115379 57632 296962 7537 275883 6875 13382 21342
22410 21342 -229396 261471 -202667 -114971 -124945 36959 278684 -115082 -440002 32186 -74038
22398 91265 -123902 149413 -47649 95852 -25332 153457 190409 -74174 -277423 126482 105703
22387 105703 -64557 -30989 10161 11226 -615676 -173626 -106955 135693 -327499 73080 -274738
22375 -64890 -61401 83975 295947 220548 2311 -81713 -70492 102209 -67576 -23017 -116063 -35001
22362 39020 -12535 -83800 -119493 -183749 -94640 -129123 24419 -115467 -67155 117247 325848
22351 325848 -32776 190595 -338443 -156414 166629 -41545 -112106 -166075 -118910 40441 -56650
22339 -197059 -190382 -178750 220257 -129717 -39321 157391 81001 65991 34868 285661 348106
22328 348106 -239127 275779 -465517 -51083 -570886 91739 50574 -184855 91290 -177720
22317 -93178 -35947 -252693 -80502 -27428 94340 14856 -394841 46937 232663 -29984 232829
22305 130719 412 -406180 -133491 -365264 50620 -36001 296783 -151871 -125619 237577 -140641
22293 -141926 -32749 -49104 66344 -243381 -172455 -190731 -78441 171020 -331239 140040 54469
22281 -31724 10849 383214 -9979 -220615 56936 -107122 24462 147057 335135 97080 -76402
22269 -204333 -1941 294921 -198379 -45585 -277352 15652 -134002 90760 -167051 306244
22258 -78564 261897 199928 70681 -175374 -138057 40784 69767 2671 48258 -276825 -26452
22246 79942 -90130 110632 -92210 -134089 -333414 246596 -338990 174784 293592 -75655
22235 -177305 -300140 193728 -378862 81564 -231888 -50313 162672 137523 -127094 22430
22224 -49351 159102 204673 319004 -281654 -101972 280115 -136401 -55211 -345088 -72220
22213 36440 -38464 255737 58358 31402 -72510 -21856 -325580 -221188 -47096 49248 -344993
22201 196770 -31462 -216872 -42094 255123 -75387 -52290 -277972 -175976 64450 46853 -287119
22189 51387 150408 -46845 7386 219927 -9239 -229577 49888 114660 -53474 -193156 19882
22177 -105786 -188818 -113083 -213152 78699 -410416 -327638 -441682 278155 120356 118124 -47695
22165 -33469 -70455 259939 47882 -71403 -196032 -30414 168653 -18386 24431 -48016 -174461
22154 -174461 -233777 -73877 135608 -97332 -50647 183268 221965 -6820 14047 -260728 -223403
22143 -223403 170535 -106500 -35544 -83969 113746 -91770 84396 154595 -183672 -50390 50192
22131 38930 27628 44191 -86629 228558 -140510 -14711 81668 -304140 29877 197532 35328
22119 -7521 -210251 -76993 -145713 -268000 -224108 11303 -143889 23107 219127 263395 -146102
22107 -317375 123583 34057 -479350 -303792 -211953 77163 166707 -18815 -121382 -643477
22097 -643477 -146236 96249 -112992 22079 -82818 85248 -45718 295929 10094 -116708 -52379
22085 53131 91769 54496 -164137 -90962 89520 -126173 -347399 96457 -250587 -38260 -215141
22074 -215141 -27916 8498 37462 261863 -110036 -129850 24836 -77793 -234095 -521178 -180495
22062 -259217 -13570 72166 166703 -184606 167594 -193477 -96633 -72839 -241716 103185
22051 -25440 -42598 30606 102384 195290 -84042 53122 -47991 204745 308 -104036 133954
22039 -17305 -170251 245948 31916 -104580 -51293 164607 -124732 -73766 -19551 -109709 33284
22027 58016 -171019 193706 184648 43809 297694 -164784 -216363 -124345 -301141 -246171 -88082
22015 91811 211476 98865 -72181 -254069 79269 -64544 -19309 -243143 190598 -131791 55791
22003 -98721 74990 -247930 60717 -160156 173611 21557 -49316 -64364 -192295 87450 -33322
21991 210741 193866 16032 79750 -256497 174513 -67652 102299 -408332 182796 -29345
21980 -122405 -154746 -159209 274254 23228 -103042 77976 -393279 -138987 -79286 -70582 -349342
21969 -349342 -480064 -5344 -205941 -142570 -301951 125686 96254 1994 44164 -61245 42642
21957 -230069 7668 8848 -186897 467334 -139378 -279215 266777 32234 -93361 -165504 -213213
21946 -213213 -166028 -24100 -136274 371704 44417 -75463 36013 -16611 177762 -96336 143930
21934 -105415 -92014 131689 -249767 1467 274804 32222 19883 -34933 -176220 -198361 52407
21922 10124 -103530 39104 80030 19580 -231465 -81168 -180732 203781 -239089 -165975 -18935
21910 129019 -64017 -197070 -118415 -69893 87867 -107129 -294083 -34426 46501 -61957 -77448
21899 -77448 -100404 -34979 -97020 163730 108282 -13765 -209233 -17575 -164306 -147468 -57493
21887 256888 -73168 -378089 144954 52285 36087 278679 -19522 -87913 59985 -261049 -83256
21875 229986 -90245 78698 -7333 -39195 59414 377077 -43792 -505163 186213 -62534 -49326
21864 -49326 9534 -247351 -217254 -196566 -215579 62764 63564 -48098 138635 100452 203576 -313260
21851 -182534 -94453 -446949 -164009 47997 -37176 -338310 -324729 -190459 -344861 53358
21840 -106540 -343126 -147587 62309 -13793 104378 93019 348657 -162329 -151787 -23475
21829 -218257 313378 71888 -85888 -23155 280928 -88112 -59039 27320 -3722 194929 250807
21818 250807 -49493 21721 -30637 -326628 -142033 -114630 -53891 -181451 -29514 266826 63247
21806 -400936 62399 -557 -98162 -158169 280811 -40199 -147940 11823 -97693 66440 8853 245473
21794 245473 -94439 -196693 -150348 -326828 192802 -245134 -286294 251405 73685 12782
21783 -3264 43274 -168321 -188931 -87494 -89433 64162 -28877 97271 -338923 -176147 -404668
21772 -404668 220556 -312 -145265 132020 -13373 -32675 191700 -156541 85875 -185847 -670
21760 332595 -74155 -56307 1339 93607 -6759 -149376 -59561 -58255 48052 134799 78026 -7117
21747 35631 -293090 -50358 99622 -150714 67097 -132727 -100803 -266641 -342703 135368 63411
21735 -10503 -152721 16239 -330781 89307 174074 190321 -80486 -118725 180269 -6919 -141317
21724 -141317 -207634 -327137 -399238 456443 -23380 -94724 -22126 138874 -15664 23132 -131953
21712 -100985 65773 -94407 -9572 3963 -279826 -99878 -62965 87755 156705 81634 -19260 14840
21699 -113442 -134697 -116589 132899 -372299 -4122 121579 -127543 -401435 30481 286828
21689 286828 1319 -44809 253858 8052 272878 -294112 83415 17837 145858 69769 148569
21678 148569 28417 -255625 -114136 258070 89993 -160977 84283 229100 171796 -24931
21667 215203 160750 154908 -343684 41179 -235629 37048 152398 179554 -212038 -12800 28620
21655 -43519 -254681 43564 104870 132199 262453 -165303 -211056 -32460 27051 130143 -43467
21643 -69033 -255206 -92621 -2474 -455416 48819 -140195 -86225 64394 96305 -95934 -98849
21632 -98849 -224733 156153 -354238 -61403 -206216 -72588 -88191 152786 11894 50170 13609
21620 -6857 -130571 142947 117492 -161482 -65137 -119559 -172426 72863 301941 -36850 31885
21608 -64366 -11574 -3084 -106091 2306 38361 132690 307807 -149197 30451 -59029 -242631
21597 -242631 -342446 88690 254845 64462 -20066 23537 2066 277100 95863 33062 -72406
21585 240326 -226111 -6377 126927 -275074 262871 -119543 231355 -189226 -50565 -184259
21575 -184259 -52190 29154 -314468 -77547 307586 -228882 318975 119662 -41366 -240301
21565 -240301 172864 130203 -227907 99359 -181247 -260857 -24746 -168644 -195999 -385173
21555 -385173 -9623 -123953 -112578 -15285 -18896 -220798 202660 296532 -185846 101070 -166628
21543 73865 -51733 -174088 241599 247122 -94931 59125 -111855 -1650 -139592 -40638 66831
21531 -159598 -47236 -266929 -282318 282787 28876 -98769 -109915 205707 71183 -223614 259888
21519 -160018 145407 -272798 -326730 -5882 -128292 -217334 42627 197366 1260 -63422 -163858
21508 -163858 -113534 -14294 -12588 30120 221132 -7119 -41709 189471 -50357 -89886 181873
21496 -426343 32680 -96340 -64334 211052 -192679 -138762 -383914 -180895 -117927 155744
21485 -192428 -378669 130458 -159244 65236 -537733 -205814 -124854 -60102 196742 115030
21475 115030 -188330 -10243 127419 228702 45372 -9186 -336508 -77093 71923 48982 -183243
21463 -24328 -211414 -111658 206611 -127781 186134 36269 -72303 45726 47270 -364184 -109981
21451 -126507 120660 -283884 -5858 -74423 -340755 -32948 -347008 128743 207145 -10204 -22479
21440 -22479 355651 231424 246761 527839 -13484 167800 -157048 -19422 112748 49402
21429 -109249 12025 163655 -429792 191539 45442 19274 325156 -230502 143277 45627
21418 42226 233040 -159214 210596 102401 -15964 316012 256376 66565 50817 -51203 -17358
21406 92325 221392 99151 -47076 123088 -73817 -118209 -24391 -160916 -14185 176296 19325
21394 195430 -190256 103405 -540 -194421 -181986 104153 -116644 34409 109043 -172422 -151126
21383 -151126 -126604 -334956 -6703 -92210 3312 26989 32980 34097 34630 14216 -390711 -4509
21370 -265675 244906 -163130 242911 125795 -3350 -49752 39156 -413374 119693 -153953
21359 95194 -45468 -359004 119884 -110936 -98787 -145325 61954 -248183 -181928 105194 145879
21348 145879 429405 -37471 -201913 -156961 58946 -18551 -128206 11694 -76887 -143417 -23090
21336 -84902 -100251 438780 -239099 296000 186989 205632 76873 124233 244205 145656 -318798
21324 25796 43426 33473 12037 142882 93840 249 21362 -94313 -152118 -115909 153786 -209235
21311 128677 -291691 39964 84161 207171 -6120 -192066 -78383 13076 -104451 -269300 -91132
21299 -102410 57749 -275502 66002 242163 320253 -9347 267958 -48629 113217 -233294 -71257
21287 -215834 -397240 -202285 -332538 133322 141871 -44851 -253825 -36106 -38320 -240558 258157
21275 -236528 -157896 -123994 -67968 121629 24497 -395998 49024 -41537 3163 43701 8954
21263 -86812 -351106 -124329 -67789 187349 -97368 -76006 -97918 154099 -198893 320775
21252 -225279 -354136 -55183 -123814 -207940 -110783 20741 125307 -32671 -24454 -159013 61247
21240 357814 -277873 76682 177071 55082 109985 113563 -259426 -65229 -119048 106935 -42801
21228 3013 80127 82709 -99331 55765 108183 -104469 9028 -84055 -338175 -163622 -145892 116792
21215 -102916 -206211 -36628 42280 -76750 5521 -171306 38904 46889 -42976 -82660 123185
21203 113322 -165518 244379 -117368 -255963 170030 -101476 33754 -87906 -188034 -91811
21192 74786 -52175 -52969 -164203 -112997 43166 40069 -328415 188650 125362 141318 -42417 -106581
21180 -106581 32811 -75503 209124 143353 -61120 -13593 537 -28823 218069 -313129 -149362
21168 -494115 -140835 216976 37903 -327044 159142 -156522 -315619 -84750 -110786 199122
21157 -19576 107672 -23147 99277 -104764 -89470 89880 29115 -91544 -180700 40365 61945
21146 61945 -74159 -360010 -94574 -233644 89400 89448 -218537 80241 154751 81616 -177766
21134 19479 -203318 -155410 22216 -177774 -316329 -91476 -219476 116785 82884 -31349 250015
21122 -247334 237868 103474 -199114 -52089 -32640 -122603 -35702 104208 -50016 86155 -26330
21110 -77794 230539 -241787 -283603 21293 -30833 99680 -142712 -194708 133063 151866 -242722
21098 -265000 -69600 -198082 49643 -173145 -197333 84252 -99546 -37837 -48714 24379 -170319
21086 38113 34041 -93428 -264982 -46147 -73943 -101773 -291201 -20535 48721 -257822 290159
21074 74131 -80478 -4138 -327641 -61871 144559 100856 -261214 -119417 -13202 -194955 -79147
21062 103063 18563 -30052 -94544 17004 -228865 77450 66632 231087 -217504 242882 -141424
21050 186858 -167450 -72600 -23468 -251874 -122655 -415084 267677 290169 310794 220124
21040 220124 -281554 74717 -163787 103575 -48203 -264605 64320 -152522 -78313 -220454
21030 -220454 -15426 33903 -300156 -67991 115993 115160 227101 -12221 52527 403293 -46734
21018 255172 32808 8008 -94839 -100375 -147378 -248478 4749 18581 -73028 -264988 -115488
21006 -116821 -143206 117657 -72019 -258964 -230771 224944 180487 10053 151457 171068 -159259
20994 329539 -184664 -253606 -548633 12372 -55501 219197 -244355 -56747 -3772 126248 54636
20982 -106491 133933 -411129 -22426 -75833 142440 -211812 3338 118955 -237673 -85103
20971 -168432 11074 -63436 203720 347118 -20057 -193361 115233 142994 -234098 212966
20960 61293 219636 -285864 -178681 -222758 -28210 -307657 265237 -65907 113342 -72046
20949 -10270 -115085 -152361 57778 26317 -300621 -150051 -40822 180882 -134548 133856
20938 94081 -106957 27500 124312 130921 -137471 144868 -204369 -287398 -121287 -92278 -213154
20927 -213154 -86316 -219306 82852 89141 144439 268854 -167243 -150565 -33282 22942 -561091
20915 130131 -80292 -195155 39311 -16749 -14740 -256406 -181598 -123371 -53423 15240 -60064
20903 293621 -246918 -120413 -190096 -505017 252271 -52573 -7178 -185093 -46500 -22520 -24827
20892 -24827 47617 -52772 -35922 -17457 -200145 -47155 -259803 205826 -207237 -49261 -123609
20881 -123609 4385 -151119 1532 -154217 -39963 -111243 77997 76273 -110143 -54180 325472
20869 -280416 -211898 -224202 -115754 3200 237126 111946 -135542 165791 17215 313152
20859 313152 194676 -47022 -136510 140861 -277350 -39673 43958 -170014 149755 -130418
20848 -125993 -88576 20018 11591 250733 -403262 -55372 203008 44181 -68069 200983 -166493
20836 133286 -258486 -135682 190949 46503 -108654 -124936 -38965 -32161 -194196 -154284 -165861
20825 -165861 -283247 202823 160521 165246 -272850 -88824 -31051 -8384 -331095 -17330 -468805
20814 -468805 -53141 78134 40583 42463 -148365 -200945 220946 -15937 -340240 159679 63555
20802 -237870 66533 -357581 61355 196272 19791 -263597 -14346 61057 -133834 -351161
20792 -351161 -35593 -83266 -8014 17512 4916 48365 157160 147140 -35134 -233602 36977
20780 97676 -261200 -21263 103640 88310 -114303 -133596 140897 97078 -40319 -97032 -151770
20769 -151770 77569 -77521 171440 134919 -26598 -78248 28227 -213199 -46950 -333288 -255633
20758 -255633 -102236 118602 -132167 -173433 195525 17170 -194787 -47845 -162252 221176
20747 -203998 -254109 -334653 -135936 309801 -119653 53476 8146 130592 -250511 -332326 -104616
20735 -210221 23334 -64412 -73314 -334939 -119248 82431 173424 -236567 -79962 44388 -246081
20723 -218862 97146 -225131 -54456 -133495 -46353 -308410 163625 -264267 19405 185691
20713 185691 350033 47758 -177616 67662 -101007 -262917 -10201 33075 -205080 19187
20702 373898 -52142 18736 66519 -143044 464797 -132247 10793 -192552 -292210 -233083 -29346
20690 -358144 -96716 141678 35979 105508 10356 134115 42900 -24113 -345157 -153975 -124583
20679 -124583 -12873 40470 36492 -31598 -21248 -160112 186358 -196701 56451 17253 -202887
20667 -154836 35648 123288 -173462 -71031 45479 169644 -35147 -381553 -290474 82857 122185
20656 122185 -281218 -20243 -203976 -10622 -85564 53538 3033 -164500 -173187 141396 -6250
20644 -212032 -173742 105599 -14936 64614 -75382 -148023 -337305 -485631 165654 158721 -102834
20632 450801 -57860 -103614 -57792 20103 -159669 -112998 9197 -91472 -136830 19395 -131754
20620 2762 -18775 58462 -97448 166443 -62427 196416 110198 20282 -216441 -1111 -323715
20609 -323715 -80415 -122572 -84435 3998 4836 -187585 -42241 -238785 68552 -252451 -157538
20598 -157538 -41873 -184752 -142213 -151000 36188 -360548 -67483 -192368 -189552 -26218 112780
20586 -327692 -29826 -40368 -216160 -40119 -196596 267645 86207 -32199 9113 -324905 -11411
20574 -27760 -65667 -197700 91779 -37856 -306228 177536 102496 -52423 250040 -61510 -167042
20563 -167042 -91663 28629 -151911 -96667 1439 73965 -33500 -30401 -407020 -68844 -1518 3482
20550 141003 -307729 -80106 -151819 89059 53440 419587 -217408 -100579 128840 84354
20540 84354 -206043 -63333 -429407 -360014 6317 3636 -53802 -20865 -34826 226336 101481
20528 172370 -109774 -447992 -42626 188152 -59438 120434 -36620 112666 -34401 -57650
20518 -57650 -264441 -43116 -107500 -84795 185 121784 16238 91423 -22266 -109306 -312340
20507 -312340 52433 72442 -57105 -173398 -356619 -106896 -97087 -162024 -36299 75888 -177763
20495 49273 -406499 -18074 -179989 -101718 -293107 -150790 60478 163370 -84009 -139597 -236782
20484 -236782 32142 -431 -378372 95013 -194225 -51818 198610 -29637 -260747 -158454 -117167
20473 -117167 81457 212967 -218085 -265861 104005 220508 60438 187362 -217167 -129227
20463 -129227 -47982 -131798 160176 178079 -53925 -25787 -36713 -124499 -157231 42115 118065
20452 118065 -12212 -85670 105607 23672 -12981 -136890 191808 -242479 -196810 176487
20441 33831 -130819 -185957 -147321 -38012 80374 47993 -331639 144438 177450 -296550 -327781
20430 -327781 -321915 40180 68120 -86153 -113478 -45453 -104275 -295924 -190694 -394080 232792
20418 113276 -20004 -72282 -105012 -221130 -10932 -332693 185164 12298 -46444 23250 -8444
20406 -166357 104391 42321 -220724 -273880 -172737 317329 166294 95929 59363 -155175
20395 -182984 -328928 -45445 -384130 -153044 64173 -161434 356328 -98942 -117787 -310471
20385 -310471 -43653 185356 -214530 101708 -5373 -221360 -59495 68000 -262463 -100586
20374 -322766 184378 111055 -192932 87258 10703 5331 219237 37030 -100569 -147816 -344063
20363 -344063 154748 121447 23263 -6074 158966 -213518 -242428 158894 123626 21756 142300
20352 142300 -260047 84184 -59614 63862 -242983 -250238 24506 -19409 46266 6132 86383
20341 86383 86516 108412 124070 101799 145242 20626 33014 -58561 108096 243664 -354640
20329 -22002 111517 -94356 118197 85025 -282665 -423577 132063 -39910 -115224 -184543 -21427
20317 -91906 188223 -168536 72599 202536 28352 -74023 161095 -17612 -229705 131824
20306 -47000 60292 -132977 -205054 -202781 -413629 -139768 15086 -66416 -112289 172655 -80329
20294 -43055 80121 -292798 116688 64201 -205162 81657 63734 -195352 58792 219917 -276529
20282 430327 -45537 -191710 -348155 102931 -35336 12861 -45185 21927 97414 -40075 -59349
20271 -59349 -76295 32294 -215581 44037 -105509 90305 298838 -216079 -115216 -37742 -283691
20260 -283691 -112447 -78955 -344589 -87349 35871 -158927 -72516 -139806 51620 -255204 1532
20248 -228821 -231599 -191723 -41519 72282 -10681 -282703 -26293 -187325 63863 -43301 -323335
20237 -323335 -230792 -87169 -192465 -176493 -260642 93774 -334892 -146299 -19104 35953 -211301
20225 -34272 -112921 -137731 -70491 71763 52839 128614 1803 24098 39779 184748 16783 -260825
20212 -25930 214316 -163106 84967 -272271 -195299 -107983 239576 -27271 362158 -43501 -99867
20201 -99867 -131098 45928 238633 -223571 -101262 200318 155288 171564 -34463 -132107 -184582
20190 -184582 158079 185379 -160075 -187626 404044 -195254 -78011 -225363 48815 46816 -169160
20178 -30151 -40800 -167061 -35478 184035 -255753 -221976 86513 -8580 -228656 -64358 -67161
20167 -67161 48365 -52961 -186266 -125149 2181 -11857 291006 271848 47392 -194622 -179393
20156 -179393 -140115 -399504 -328032 148750 172050 -267190 -115282 -124546 -58302 -53510 -170924
20145 -170924 307781 203333 27456 122131 -151434 -3112 -145430 -528690 -157963 140736
20134 28881 -67291 149963 -224651 -324618 -9354 -77562 -107172 93700 -269557 -726 -25196 -226556
20122 -226556 -225986 -305899 188275 -128356 -182908 -73175 139466 346567 -72162 12201 11873
20111 11873 -89085 -77445 -155974 239561 -112353 82549 -313839 23846 160359 83472 -42331
20099 13871 -99513 45054 90131 7969 110244 -288011 -202164 155275 -158764 -96977 -109928
20088 -109928 -51537 -110671 -198607 116328 -249335 -100940 -60909 -290276 -7961 87929 -35344
20076 -100856 -229004 -299576 -50646 -142861 -148593 74759 229104 47805 -241139 -30373 -108455
20065 -108455 200881 -154118 32513 -271594 -124423 -228718 -59519 -150539 -29298 -242523
20055 -242523 33885 27564 -60210 3753 -198022 -7011 -92272 -49305 -71302 271765 21728 -84664
20042 -28876 254828 86589 105979 -438701 360962 -142341 181973 -149853 247028 -152737
20031 68291 -168226 103098 164363 -374326 95447 -119465 4113 -112003 -334685 -319640 24672
20019 -302624 142064 -80050 168982 85993 9774 -219013 45894 117668 97910 204364 -25154
20007 -25995 159590 -365589 -141317 128857 -97995 -119147 -288085 136244 172628 23870
19996 66329 -231723 70287 -420734 1986 284790 -61401 -63990 43676 208592 -35197 48667
19984 30080 79341 200197 -129889 -326352 -95157 -29663 100663 -78126 -56285 -406587 -320034
19973 -320034 -83229 -116240 146505 -98112 4832 23999 6401 -318684 -35540 39556 -235356
19961 38696 62761 -179656 -87988 -182910 127141 -153169 8336 -1392 -160911 -96987 -69648
19950 -69648 -188637 76344 53906 47849 -83720 46500 -292912 295841 70447 -98444 116296
19938 -337119 -51232 -135015 -139079 105974 -253581 -244852 309080 281649 -70640 179792 801
19926 150768 -245938 179055 -362469 -88417 -180947 -224688 -41761 40957 -364039 -43886 -222969
19915 -222969 -184749 -153634 -80153 -336744 -17272 244670 -186188 311207 -257490 -391170
19905 -391170 -53543 34266 -134231 289311 -110294 -101688 -159371 -80505 -122011 -123182 -206583
19894 -206583 -11950 -189313 69011 266794 2612 -478725 -72395 42303 -101566 -62554 -224510
19883 -224510 -42269 79007 21527 7575 -91114 -234738 -4770 207171 -96017 9012 -9485 180098
19870 -90034 -4052 -19459 101846 -66851 -17530 108726 -53643 -17015 -220575 56424 175446
19859 175446 -326909 -361432 220882 -242031 -140888 72772 56661 -136525 132818 -56659
19848 -233029 174694 -89514 12050 81890 -326500 147064 -63312 -308452 -60167 -219167
19838 -219167 -213844 -206459 -44040 -312427 -236599 -290242 -135882 332444 -45088 99044 86632
19827 86632 335276 -32415 185717 -166390 -230733 -11276 -72515 -179513 161565 -127336
19816 -305590 50891 -214789 -194766 116682 48134 -32239 325327 155434 12154 180333
19806 180333 -511583 146981 84156 -144834 -159882 32410 -244602 -198188 -24107 35980 -233060
19794 -51231 85230 -70467 -232812 -65924 -88123 -295729 115035 30918 150443 -68471 -145792
19783 -145792 -280319 42521 285985 87055 293155 58472 125604 -66358 -124311 -28948 81466
19771 -77851 -108486 159103 -171010 -9450 50816 -255981 -348933 146368 -226068 -75289 -15060
19759 -337559 -157488 -167354 282414 75937 -264450 -317366 -203497 -223938 258101 -128785
19748 -135794 -136411 -368721 105270 34871 239656 -25532 -78815 -41466 -5359 -188590 -77839
19736 161081 -70587 -57801 -60955 -192983 -291568 -236259 135378 -317741 -180520 681 32284
19725 32284 -248355 -96020 -283745 102904 -291982 -103159 128515 -308586 127626 70921
19715 70921 -149045 177687 -204381 216918 109461 -245726 243645 174580 -272257 120812
19704 -109723 -345386 104050 -71832 -57869 -161287 -21469 172876 139867 93020 99500 88476
19693 88476 284931 -62803 -110812 -32608 -199144 -14105 15843 86483 -96010 -206402 -165775
19682 -165775 -125384 226 -390684 166193 -125260 31141 14492 -15887 -84459 -163484 56479
19670 -85797 -284331 184387 60885 -170424 -185822 -155011 88222 53869 85465 -150263 217491
19658 -63968 -54908 -238733 2542 -193501 25162 -153516 -18731 136686 71449 3413 -62042
19646 39089 73837 201666 61301 -250275 171909 -285254 -216636 109078 -58547 -366317
19636 -366317 68829 -133943 174508 -131946 -63504 -390207 13304 -163060 -49204 363692
19625 -447167 183112 21883 -39075 -24055 -49233 -234584 -173089 -319564 11417 -148719 390109
19613 131301 -179476 -36464 -7619 -158916 -44663 19540 -262021 -436834 -300944 -206637 -47802
19601 -211996 92871 -145955 -391251 -115881 35942 -25385 31161 -118471 -19799 -150922
19591 -150922 -15335 136636 -46561 67443 -340011 -122219 28458 31494 -236188 -33382 -84473
19580 -84473 12099 -33296 109453 -299375 266757 -412654 120403 -50010 156034 -338427
19569 105085 -71246 -13899 -288881 179019 -98811 284936 -55580 -153778 -80134 -3796 -399318
19558 -399318 -207058 204532 3830 51394 -183978 -204687 351552 -98327 19648 -312727 -10237
19546 -134258 -102011 -203100 -148947 -180520 17153 99226 -312986 -216711 41200 34010 14468
19534 -239258 205628 -422824 80989 -171994 86049 -6777 -157974 -147236 107937 -163389
19523 145103 -13857 226828 -45552 -30867 -131061 113768 86090 -13288 -60060 -219291 -175493
19512 -175493 4818 -30422 -265845 -60755 9432 -169514 -299040 -29596 -38573 -110609 31475
19500 -190798 12547 304828 160002 -160123 -99260 -229888 -277190 -189400 -144129 160716
19489 -167561 177113 121419 -419267 156672 -250930 -173690 -67271 219900 79436 -418506
19478 58454 54879 -192036 -26361 -239558 -42247 -403344 197161 -168444 -27676 -102543 -10427
19466 41936 52811 -28204 39265 70810 -164224 -160704 39641 138258 75489 -249353 -45566
19454 -143264 18770 -238589 -64964 -20444 -432312 -98622 28295 -102733 90255 -155327 -115932
19443 -115932 45936 -336070 -291007 -121522 55343 -140264 -11497 -85898 84837 66249 -73574
19431 -224952 -173882 -173510 -209313 46892 103952 -32158 20438 -266266 -140741 -140729 -83407 -102975
19419 -102975 -391878 123765 -234248 -162290 -339804 299913 -142696 -113620 79910 43066
19409 43066 -58813 -94062 -201289 -91149 -311081 -484014 33381 -131462 5191 -344629 -94365
19397 -33527 -231094 18108 -204487 43595 53683 -161501 105580 -207933 -62706 -9482 -82741
19386 -82741 93749 -101994 -199384 115783 -107600 85440 22295 163946 142764 215105 20204
19374 -278332 -279839 -359788 341859 -144494 -39469 -162059 -160798 -68531 69832 -103136 -311239
19363 -311239 5334 -141970 -176766 -144222 -26838 73421 -161090 -90908 -12314 -115818 -72095
19352 -72095 230334 -2591 156339 -302565 -126784 -2866 66908 -267627 -140681 142536 -8339
19340 -40699 -51721 -109912 -42949 -297025 -213723 -108988 -196824 -40736 104669 38167 135596
19329 135596 -117124 -306118 -99239 168871 15340 -54528 163167 191597 -221461 255808
19318 -291584 -89005 -101378 -209928 38070 213366 37670 -260539 -132922 36759 345433
19308 345433 -19456 -214207 -25582 36610 112609 181269 -124008 -99367 214836 65154 20092
19296 179032 138254 -61984 -121291 -458163 38117 -320249 -244179 -247848 145573 -51387 46207
19284 -48469 -170210 -277221 347010 326065 184702 93423 -28717 9398 147997 149562 176281
19273 176281 33951 -16554 -69256 -98189 -21852 -357327 -161922 -139659 -278626 277073 487
19261 -61240 138264 -98269 -213226 157720 -33283 -410014 -128136 -147010 -29730 -130582
19251 -130582 -314654 -69282 29365 175720 -178448 -209216 3334 -288059 58477 -368674 -80580
19239 -326312 -72198 -183509 249957 74825 -80472 -53972 -81305 -138183 -195867 50036 -155180
19227 -155214 168965 64517 -144904 247438 153381 -40182 -147811 -181484 154245 -248428
19216 -34524 275281 -5307 -54792 -34926 -317332 178161 -145356 -33132 96683 18678 -246441
19204 176279 -163430 -158722 82764 -396084 -176907 -115596 67246 160409 -209010 75245 -10895
19192 -85099 101217 112872 -56259 -37285 -128578 -53793 -94839 -222953 -13373 -73941 38301
19180 -106866 -420217 -74926 -5106 153959 -126265 -284273 -153935 60473 -15269 22214 -20065
19168 -193100 -204034 73050 -132839 -12452 -106202 20763 53737 70430 13793 67266 -208727
19156 -131179 -292562 129719 -340148 -67501 133258 -236945 -67597 -11168 -163019 -76848
19145 -239991 -159962 -38994 -175940 174773 29751 209473 76742 4767 25734 -380182 -165690
19133 43349 167635 101357 399208 -324750 929 -149761 -173117 -15808 4300 82754 -69535
19121 -345047 -87593 -285965 -264590 58805 -54058 -428557 -337392 -319416 -106610 -212372 -454931
19110 -454931 -40424 -133028 -97300 11030 -117960 15081 -78014 -285820 68248 15961 -356506
19098 245186 65937 -245924 -262295 -84338 -53652 210201 65862 -118165 -45186 -150008 -130560
19087 -130560 -168762 -281327 92868 -3878 34796 -53869 75197 259598 -119801 -153556 -2812
19075 82925 -182971 512398 53830 47269 -90403 289516 -126438 -131520 -172439 17877 -171499
19063 -207239 -233586 -258510 -180088 21119 326025 407360 -138990 -280889 -161876 146401
19052 200469 -200098 213698 -192306 -29950 25392 234630 36215 -174055 -101583 -43664
19041 92951 -79316 -270687 214060 12366 -6408 73016 -111051 -74157 124530 9217 -45152
19029 -38595 7837 63687 125032 -137650 174768 530456 68770 98363 179404 56804 113855
19018 113855 -182794 114816 -83313 3969 29671 -139651 60682 -368076 -74733 33063 69217
19007 69217 17937 -141547 -170607 -59689 -9546 91269 -40401 -98676 93656 263983 -91115
18995 184189 109005 -294325 -29938 -47750 -60517 70701 100121 -74800 3750 -159650 -180015
18984 -180015 13949 -8375 -202350 -129965 -68663 -392396 -222744 -56817 10422 -187959 74268
18972 -36528 -35802 229820 510910 -79873 139444 -340147 -327098 91277 -21831 166159 135598
18961 135598 -241370 -11290 267990 324504 -177525 -258536 -141329 -77794 56386 -85701 190620
18949 -172492 -248949 -204661 244655 -435726 121884 -173562 -326336 122691 -284272 152856
18938 24556 -16848 -53839 179822 -59424 353950 -274316 98029 -209118 10468 -306358 65545
18926 83195 -137182 159125 -8674 -131688 -106555 255150 15284 -275578 -61569 -288888 276443
18914 -170160 20998 -222362 144879 110477 65799 114451 80460 -298914 -79267 43824 -29844
18902 87849 273117 -333934 48461 264728 -347432 -210779 -47893 -281408 7035 123135
18892 123135 -195738 -178727 -323610 -157585 106304 -193217 -49829 84609 -51012 221346
18881 175871 -206024 121593 -110176 -350365 -129991 -261083 153307 -33073 -44920 -6215
18870 -215718 206935 28207 110894 -162200 13508 14963 13399 56194 -71622 -154056 -37561
18858 -197111 272535 38531 19927 93552 86167 242899 -257943 -163653 227301 -18692 -229636
18847 -229636 167632 157244 -291060 -136284 229735 68093 -203712 233224 116866 370484
18837 370484 65441 -64091 299173 -107719 -121039 -48434 86154 -252364 79022 -224160 22597
18825 -165630 -371911 -217220 -229371 -114430 220591 -174676 354103 -241643 91026 134057
18815 134057 176965 12991 115766 -7173 -137687 314749 93512 -170206 150749 66735 -214982
18803 -10603 20147 -194592 -31703 -194528 49694 -78447 -140962 -66850 20999 -273027 -69065
18791 244734 43447 -173605 120609 -236256 -22668 -317566 131099 -167794 177364 -184452
18780 -139450 9023 -421911 -123970 -93845 179743 -45869 -143478 -273586 -165480 -357840
18770 -357840 -106948 -97271 42957 -164277 158000 368916 197468 -23331 -251758 -74385
18759 -44836 -187168 -260789 -242925 21769 -80292 -42857 229462 42477 -136770 -132229 -329040
18748 -329040 -177793 -278362 67445 -72335 -64810 -126959 23135 -293815 71277 257472 -94351
18736 -165874 -48450 128665 98774 171663 156767 20208 -48098 180557 -33990 8559 44458
18725 44458 15337 -84768 128603 -124506 -141963 -371264 114771 -112991 -187838 -61433 -283050
18714 -283050 -231728 -50666 82865 -26745 -204390 -17329 -100167 -66416 -106214 148813 -215797
18702 198653 -73901 -97715 -76415 222073 83999 -190652 -178156 -218433 10982 -111167 -50913
18690 -416106 39377 -225985 68402 -82417 -213153 -168000 171018 -65362 175717 -79129 -332996
18679 -332996 -101035 -169093 -242413 -228955 79126 53123 59146 -149181 -186792 -342629 -103512
18667 -56704 -50256 86578 -16095 125006 86510 -54149 -132924 120115 -271453 194261 -221027
18655 175885 54214 48820 -33199 65993 -382527 -321500 -191815 191940 -76930 110577 -121636
18643 82353 34596 84950 20595 -50957 -302774 36134 150695 181686 -85470 -294299 62895
18631 -174421 168373 -450360 -124642 110110 -239942 219599 -120761 -156699 -48233 -405289
18621 -405289 -230514 -237404 133580 36981 -168534 -248458 -45063 168888 -136289 -166715 -178309
18610 -178309 -193676 -78720 82927 -80156 119311 -25531 224468 138165 -166781 229997 87927
18598 -312171 151622 -241033 120564 154478 250757 98117 82370 -21051 -17305 88070 202566
18587 202566 -82091 63956 163035 -72742 -28166 -119145 27713 36551 25373 310252 -127973
18575 225724 18797 -123209 -291918 97063 -203650 -349746 335002 -34635 -363513 -80150
18564 -24446 -295765 198932 -246346 -40116 -66677 -71156 -46828 67004 84819 -79706 -233546
18553 -233546 -197133 -186800 79345 219695 -243265 -76360 -349293 -95142 283543 -114650
18542 -99427 -233193 270912 -244476 -73121 253709 -115757 -279646 108052 142220 -345841
18531 97390 -118990 -65625 -128497 -27467 104887 -28795 196612 -154539 -369126 56720 124196
18520 124196 117736 -280601 409411 188173 -139955 -21430 -36612 -23547 -276212 1863 294941
18509 294941 101003 -89376 -97353 -37285 50770 57996 319893 -159530 324673 27901 -381035
18497 -156493 -330297 -259943 458164 199953 -221678 288337 -167176 -251390 -168901 173296
18486 -34738 -83509 -328567 -176477 -51159 -89315 -131603 1136 142421 -143583 -232282 198705
18474 34242 -416408 -128747 -98250 -254275 -27619 -108309 7987 210897 -10243 -325099 -469589
18463 -469589 -220084 -295337 33150 65856 -384178 37632 -118911 -320790 -247187 55763 -193293
18451 61069 65088 114668 -187409 -70119 203805 -128067 -191551 -36017 84569 164573 -2082
18439 30444 36869 141167 -56700 -29655 50921 33072 -393880 -247780 -242970 -378511 -489911
18428 -489911 -68945 -140136 41655 9177 452887 -80026 -278992 -9721 -30142 -242826 50315
18416 -301651 -217498 167636 -75438 -10450 307490 25976 327986 198695 280222 -142996
18405 64931 -140978 99616 -190779 10322 22220 303085 334534 -315687 -210164 49784 -192281
18393 53875 -264971 -105766 -181232 -114161 -139245 1377 -285665 -53394 -116661 -115552 -246021
18382 -246021 33523 -76205 170126 -71124 -21385 134361 -287813 80319 7579 81779 -308560
18370 24944 -331118 -84848 46478 -97553 322853 8678 200256 -57397 362472 203779 142491
18359 142491 -162073 113928 287924 -172493 -3861 37743 92792 50593 -244082 -145630 -196795
18348 -196795 -62070 296357 356090 -316831 -218816 93129 118170 -224557 316569 -53621 113134
18336 -218005 -307279 -80404 -295303 196187 -170165 -48139 -139509 211206 237281 36381 -302186
18324 -80598 -45313 -281772 261826 138805 -19922 304857 -147152 -197218 -105940 -215659
18314 -215659 60217 -116250 -203547 -432017 446179 -158876 107331 62402 118552 96556
18304 96556 -19294 173663 279186 142015 18630 46207 -141562 140436 151166 -98845 -220767
18293 -220767 -187304 67444 136899 177211 -387736 -317423 131854 334293 -284487 276291
18282 -67917 357556 -155243 -206439 226959 -277996 15789 -253778 33383 -341965 141270
18271 -192755 -34161 -98997 -165211 -207584 -436415 54635 -158327 -2729 20546 78336 -52694
18259 -1786 -65992 11477 -254545 19487 2014 -34717 -66921 -160826 58316 -408508 -157045
18247 -24014 148924 -123505 -208292 -2078 121656 -131977 -89998 -133743 -59407 -173116 -118005
18236 -118005 41496 -199029 87980 -185607 -230295 -219270 -320942 -195146 321014 -202070
18225 -104213 38261 -3922 -271607 275556 12743 -98687 -190170 -38448 -62543 182693 -44945
18213 80088 -139354 56081 -181872 58297 -122471 -152341 16964 -338992 58955 -183813 29218
18201 -60052 -105045 -432210 -54200 157261 163439 -62658 179643 125895 247576 -58403 -41775
18190 -41775 -340182 -16156 -231226 205893 -215022 -115362 -259464 -32256 547197 -191191
18179 125481 -15318 -174561 -175758 -171111 -207238 116161 -180817 141781 -376181 -98732 -152518
18168 -152518 84666 -267323 49832 22066 -193861 43672 189514 18097 -50956 -237477 -294251
18157 -294251 25488 -20856 -29535 7367 136043 206035 -76177 -275625 198759 39212 -109684
18145 188830 -10896 -71634 -99828 175730 -166924 240689 -58661 -166949 73234 -112762
18134 169460 -203497 28098 -19562 109927 -97885 -248053 -129956 34054 273660 -166519
18123 -136140 -89666 -62832 -221812 -242758 -6627 189443 147893 -14471 -76911 43332 232400
18112 232400 38926 297160 104155 26356 -27955 -68784 -218799 49913 -159045 -189935 99461
18100 -149346 -264926 61715 -103941 -25716 -415597 89768 -189038 -46192 120896 153883
18090 153883 -70575 274315 69312 -2173 -234469 -164893 -314628 -176977 -146306 -164373 -107713
18079 -107713 98117 -28761 70027 -270962 -367010 -39501 -157880 -141970 -121017 149113 -9605
18067 102539 25978 165188 -185302 58714 -52652 61701 -21212 -62754 137013 -48613 76847
18055 -221617 -203866 81025 -162162 229424 -94889 93384 -169034 -2624 -269901 -178024 -81267
18043 63602 -38902 -69002 -91012 151122 -5983 -55762 12328 -32336 -5808 135024 194091 109517
18031 109517 -142067 -176956 72837 -424374 -105763 -56750 125735 -152348 20330 233570
18021 233570 72383 229687 -91712 -108761 -220730 46560 -49666 -241079 -160625 -110439 -159294
18010 -159294 -60089 -160042 -184166 210840 -19123 -233736 249369 -200575 -120142 301284
17999 11208 137966 146115 -307460 -169895 294806 -253875 53513 -57440 -409237 -223910
17989 -223910 -38619 -266591 -254750 111207 -507 42179 -29644 -19338 18249 -480158 -160996
17977 -169055 -141351 -272693 118844 59538 -88442 -186214 90766 247458 -460654 386053
17966 -166117 -118962 6414 -222134 -57192 -123486 54157 -45708 73230 70109 -51812 -79293 502505
17953 -265118 -2779 -97989 -77357 -252649 -97484 -259220 150577 118219 -155790 119768 -329391
17941 44795 258327 2848 -143212 112681 -273189 11157 -74850 382493 126170 -20033 -171532
17930 -171532 213566 211542 -146920 -149848 -21016 106737 95830 -14931 64827 274852 16633
17918 158222 -55051 -292257 -63239 -12543 -113812 304174 2208 20608 216781 308982 -203400
17906 -82888 -79401 -467078 -19947 -63684 -91414 64846 -148218 56756 166992 -83900 141361
17894 -284676 -338226 -81806 -34191 -24163 122805 53426 -72902 105716 -29444 279841 21669
17882 -9914 82299 10495 -179831 1997 -49172 -89962 67116 95873 -152866 -50988 -142326 -222433
17870 -222433 -270896 76283 175053 -182179 50697 -64699 -328153 39904 -92959 540 120838
17859 120838 -158630 -139556 -48275 -19246 303068 81781 37625 -37027 -80642 -113169 -60468
17848 -60468 282693 339 294309 55121 -227481 -181457 -13899 24882 119257 -139753 -175201
17837 -175201 14849 57629 -25745 -353079 -139631 183573 -473233 59610 -224827 31293
17826 -150763 -15147 69605 -134628 189579 254802 -188264 109551 16126 140361 -114157
17815 373641 125614 238084 35447 -13426 66718 64058 -205078 -137615 -168472 -318932 982
17803 -95732 50613 304774 -225071 -32315 -95647 -29219 137682 71073 -76295 -291635 -259690
17792 -259690 47267 -5580 -155509 -204989 -58266 -107099 -110401 2960 70619 -222909 -215004 -62792
17779 87513 -53375 46870 -83445 -76569 -121274 147937 -130766 27074 96512 136958 77431
17768 77431 -123192 32954 -168422 -52691 -43273 82522 -21570 -31761 176547 250029 -22441
17756 -83622 366268 -299644 107142 -126691 190518 51444 129735 -175606 75899 -336081
17745 -267915 -120795 -246876 -139956 8561 276101 49842 -32653 -2853 -119945 504184 140402
17733 -128536 -116365 79460 212784 90342 -192267 -43978 -106770 321562 221984 -29864 39344
17721 -257604 -76896 197877 305522 31815 -35185 -404089 -92137 223823 -90559 -204550
17711 -204550 -7540 -36497 -40066 223701 -169532 -59350 15875 -242622 -212342 250496 -195318
17699 231507 -150613 -36432 81864 189935 -197601 130153 -339628 -36822 200490 241746
17689 241746 10521 -279704 309705 51080 -21490 -20492 -200182 181703 14523 14357 -152042
17677 -63330 -94615 -32462 46060 -208055 -432778 99703 175610 83411 -190612 357566 196240
17666 196240 39255 -222905 299473 -91996 195421 51980 255555 65193 -122926 -248112
17656 -248112 457891 -27531 -31627 -32441 -15201 49606 -55429 203492 38122 209521 -214298
17644 -11446 179080 -201297 23298 -22638 135998 -155544 86275 -191662 -85315 -136267 -34766
17632 -161998 68866 -30086 -186691 63026 220256 375199 3829 401181 -112156 94749 148658
17621 148658 -168987 31482 349697 58065 138057 -68399 -164999 -60775 158515 -73997 -45863
17610 -45863 195647 -149456 -44422 -186329 92802 -77070 8419 236351 -52434 -32846 152719
17598 50918 -251250 -74384 -42348 -128619 -142871 -140246 195592 210297 48781 -196222 37039
17586 -48102 -7933 54173 463043 -2582 -282462 -6231 10625 -16915 100374 163386 28085 180685
17574 180685 193851 116222 -137695 245845 43971 -235746 -175647 -174498 1207 -236849 236942
17562 45695 47843 -3165 201694 205723 -47977 103007 132997 115388 176110 -50304 53414 40650
17550 40650 -215314 -78828 116942 -274712 52291 -252129 36375 246218 68667 89793 287800
17539 287800 -168040 -64009 -9114 13333 -1752 30809 25508 118862 214113 161590 -36029 136965
17526 -72349 -235356 177160 283714 44120 494868 145548 50326 37216 177318 279627
17516 279627 -96061 7697 236253 246584 408424 -55860 54502 2500 -32786 40161 338083
17505 338083 153111 324818 240463 -117102 246006 249736 105201 37948 59751 133408 254326
17494 254326 311192 247124 132833 183106 112157 129721 161212 90218 2006 351519 -959 19148
17481 265385 344904 40290 101362 200755 -33077 14414 -969 524961 203970 157611 71497
17469 193427 86307 446135 254778 -108583 134197 151630 305582 -46033 426250 -225544
17458 -268033 320765 -213423 69110 151983 321726 430534 267508 -23818 69250 435830
17448 435830 426633 -46573 175918 124710 -16249 132745 194727 98629 237776 -14267 243799
17436 249035 128641 21614 -76076 302165 294834 -23325 210425 201558 -46979 -184031 305764
17424 329344 6318 246250 189703 327069 123373 223868 122489 194524 312908 -25491
17413 140322 154646 32480 -203789 33111 130091 149762 -81075 -19631 -173520 450067 151203
17401 259785 -109148 -19720 297912 -83374 -104612 -260971 2151 -43372 -54762 -376738 121875
17389 117977 167488 356910 -292528 328163 -135925 36118 325694 201309 310626 -47171
17378 232939 158760 74391 -6252 171118 -239941 348485 372268 220093 168112 -28161 221150
17366 26467 4328 61777 269511 103851 -91295 4997 87850 231777 -149457 152177 258381
17355 258381 179364 -78419 -86501 -86024 151107 183575 -176831 -116 329296 268932 3071 448837
17343 448837 271068 208008 94760 -32352 -2371 52647 152809 62043 334068 -27985 197943
17331 5336 124603 65683 256329 192884 625587 -22087 93271 271287 170530 144723 -48997
17319 270004 36956 235355 323140 245710 155500 -189891 70214 493470 -31893 -21416 284273
17307 269297 -52108 186816 -51761 36084 426916 -64108 127122 -41342 432180 -4818 -142776
17296 -142776 294185 -197137 60830 -17749 11132 115799 145293 45000 260356 -304836
17285 -91671 299988 131538 -128704 -212893 433117 245554 258055 -79633 108676 84826
17275 84826 83231 176778 46599 317278 -40321 408549 192695 344787 291151 98146 5925
17263 25548 355950 288540 -206552 39803 235897 66128 527708 35052 211164 7715 318682
17252 318682 -10082 82313 40078 274560 214588 303207 380572 -8039 462148 135221 91336
17241 91336 76576 156000 66548 92875 -74379 175245 149119 17865 -171 403547 17998 16234
17229 16234 178732 -6306 428248 65826 506572 40580 9516 292999 469317 241132 -64670
17217 134074 397752 123669 385539 399468 -99 381180 -221 119133 -68353 226103 437404
17206 437404 -148517 605661 -129670 94679 308094 141016 178724 494685 -10400 125948
17195 184698 111174 189842 310003 244313 164001 448809 -43600 600140 222077 292191 653059
17184 653059 -153974 330487 199697 64829 455667 311968 197634 13987 -25855 248620
17173 190358 392880 -235965 296823 390656 173761 99160 244009 425569 492999 86245
17162 143457 314980 295153 130370 71430 480320 124050 2308 227106 432555 1749 170978
17151 170978 60606 108481 241880 80460 40100 290202 489982 242606 154868 115970 454754
17140 454754 167937 -84352 216964 91869 139430 181052 82840 444882 262264 509991
17130 509991 599507 460490 111128 153366 284029 57419 171265 191242 80201 147264 207805
17119 207805 242149 164718 340909 356430 327542 42163 561027 846511 -82772 300738 458919
17108 458919 434057 243497 45210 318936 16303 152922 84072 389942 173371 174144 75281
17096 476239 172711 400123 80866 344497 498268 70939 302028 433228 385305 391034
17086 391034 441575 373294 417842 5013 461949 485456 550938 477994 211042 288797 640930
17075 640930 498702 423574 278931 373373 309471 414985 350380 548190 180536 97339
17065 97339 340968 355250 289008 207795 306926 542817 600330 535685 492282 442215 315823
17054 315823 204377 347776 449778 244851 496379 445395 514210 353747 308011 367556
17044 367556 325563 433391 -10770 586254 93208 426431 472730 409498 437690 114510 653124
17033 653124 432488 335857 380020 60650 292911 521558 372039 581224 415613 252168
17023 252168 320013 416522 489436 565602 370710 406450 493043 536374 326705 717373 372573
17012 372573 520551 660008 754983 786512 745195 351946 633864 548305 190101 439871
17002 439871 266685 439017 613350 808013 313260 336493 326989 407232 487837 314277
16992 314277 840675 518824 546305 781576 709534 487092 200544 503042 534391 738718
16982 738718 574711 984720 599052 862006 403538 578788 460421 790196 478221 570321
16972 570321 691595 897600 620112 486076 334912 431453 802335 805516 546002 340299
16962 340299 740826 642409 455057 782899 782447 720269 613648 822814 685716 581562
16952 581562 693356 959834 960513 936056 1014299 903041 727317 897418 1104803 945179
16942 945179 990017 696261 937059 913383 882891 962394 1393320 707636 948817 916854
16932 916854 980692 1048743 954669 781248 1042135 908706 1156234 1223733 1057280 1469273
16922 1469273 1072330 1150415 1198676 820102 921988 985489 1077617 1212004 1261147 1375789
16912 1375789 1310738 1090764 1251674 1182541 1413381 1513116 1202095 1295274 1192104 1534383
16902 1534383 1315480 1447319 1158051 1578254 1670767 1320182 1592579 1642931 1521365 1465500
16892 1465500 1367993 1607762 1803353 1834319 1346692 1473647 1276753 1697689 1513870 1842928
16882 1842928 1790050 1670985 1489991 1954684 2014391 1523953 1637791 1650080 1498697 1853142
16872 1853142 2037124 2108879 1952801 1832086 1819582 2052906 2106074 2133149 1936385 2237371
16862 2237371 2358759 2326978 2411753 2233637 2510264 2521982 2183850 2435950 2611228 2070267
16852 2070267 2617410 2724096 2818331 2882105 2659507 2538411 2815583 2849223 2800396 3092192
16842 3092192 3057433 2842707 2978700 3218492 3263065 3000815 2912728 3708800 3228744 3315000
16832 3315000 3415262 3290697 3641650 3671050 3844681 4109855 3684474 3820962 4141256 4096816
16822 4096816 4210593 4313206 4548362 4753465 4335460 4814785 4876539 5059945 4967469 5303297
16812 5303297 5007544 5409144 5313519 5446764 5747962 5590709 5983912 6069450 6041212 6297248
16802 6297248 6564031 7133758 7013383 7189247 7268924 7260384 7636119 8019904 7816514 8084800
16792 8084800 8281196 8666103 8806546 9127451 9476541 9589418 9921547 10279908 10568529
16783 10568529 10869062 11042814 11118069 11877008 11926328 12397350 12536354 13144756 13670569 13953250
16773 13953250 14889511 15134225 15953217 16004165 16691415 17118032 18063660 18657533 19433467
16764 19433467 20440881 20844895 21649206 22557496 23457760 24376667 25335566 26785372 27794904
16755 27794904 29195771 30194523 31559726 33615634 35101633 36739283 38529221 40554754
16747 40554754 42578573 44732953 47647905 49905312 52943898 56088715 59424698 63102302
16739 63102302 66986741 70865607 75739272 80430976 85788170 91541871 97604225 103919326
16731 103919326 110728883 118040540 125937640 134124957 142354938 150780190 159310167 167594867
16723 167594867 175560263 182678175 189225373 194193830 197630782 200152235 200579721 199767303
16715 199767303 197142304 193028882 187798464 181269609 173801771 166058518 157531335 148660344
16707 148660344 140195500 131634207 123384479 115558458 108008781 101052445 94575269 88546520
16699 88546520 83013771 77130108 72659508 67909403 63701871 59950506 56328743 53043021
16691 53043021 50124857 47114340 44662954 42014344 40065575 37563404 35847424 33786210
16683 33786210 32365014 30695025 29391215 28065659 26441507 25629940 24511425 23062099
16675 23062099 22081682 20923799 20172169 19162381 18897454 18036187 17494185 16556271 16028022
16666 16028022 15728855 14769431 14429456 13956121 13143021 12826151 12533017 12108278 11339955
16657 11339955 11322546 10826740 10585934 10046202 10086840 9737037 9352139 9096950 8651720 8257370
16647 8257370 8241508 8232866 7893537 7757760 7532619 7356417 7039547 6820211 6590989 6502782
16637 6502782 6029931 6330511 6030617 5775639 5498431 5749955 5248810 5141638 5127733 5139851
16627 5139851 5010590 4964562 4465289 4665510 4419377 4952552 4332088 4297570 4003124 4385083
16617 4385083 3805937 4157919 4021163 3791312 3810101 3552160 3513590 3484373 3578402 3276546
16607 3276546 3566626 3393380 3514169 3374928 3126976 3078795 2825181 2971838 3017377 2859952
16597 2859952 2685018 2779440 3037890 2526213 2471668 2477443 2414965 2152443 2615519 2348587
16587 2348587 2379278 2363342 2485485 2293640 2462464 2066247 2033339 1965813 2148479 1898830
16577 1898830 1937392 2009249 1932788 1979677 2043153 1766141 1551533 1643854 1761640 1838180 1863236
16566 1863236 1797647 1437800 1866538 1511416 1366220 1307307 1349760 1773232 1520456 1149565
16556 1149565 1354055 1514080 1275884 1671243 1337449 1733071 1240123 1437655 1247222
16547 1247222 1308049 1488437 1386952 1202433 1443591 1012114 1239591 1053971 1244395 1015699
16537 1015699 1473089 841962 1133811 998830 1022543 1057177 1232551 918571 1165672 1034889
16527 1034889 1062033 1121151 1146821 950263 1132980 1281884 1351201 754971 757102 886689
16517 886689 1333698 1096599 638656 978083 963935 1244821 949453 624290 878903 719132
16507 719132 564581 607898 471020 941683 706374 647637 328957 788500 959299 721563
16497 721563 877815 823835 726478 644729 808585 761917 628392 621102 635183 630869 729694
16486 729694 636180 693607 632850 1021840 590122 714562 679215 813414 543742 526910
16476 526910 585612 533956 570895 544154 840213 776038 755486 531887 673951 493754 839622
16465 839622 836193 471377 693575 615552 612170 223431 721556 528660 309864 723831
16455 723831 717032 412313 220318 392428 429651 309123 408278 689204 374187 88495
16444 457999 698961 531210 316987 439243 508821 291659 325614 407395 318820 436598
16434 436598 154387 332080 183779 208161 393740 592373 313328 359828 316506 233160
16424 233160 260694 931742 217011 382524 188144 396158 569933 630921 251650 398895
16414 398895 433604 159253 370547 277220 302538 223982 215904 332974 368906 442155 655047
16403 655047 -7169 359827 564625 421566 364801 144325 485936 131050 202232 193767 401819
16392 401819 328131 379377 361514 123088 310738 235866 148277 453892 81796 -84941 33005
16380 152050 447110 134430 287042 252151 524183 290289 598239 601332 200965 237616
16370 237616 -98953 300242 107191 508664 339472 297559 312647 196063 296144 -96832
16359 210164 385423 307439 258460 167824 3637 219187 34984 183986 128664 437837 287042
16348 287042 195119 368157 192744 529507 323602 253455 156385 -35721 79511 -197466
16337 251794 207341 185544 103825 218121 298917 232385 56591 217736 179300 34661 377878
16326 377878 86036 166940 116055 41638 288583 321711 148782 142385 421723 429184 222357
16315 222357 107291 98011 432014 213523 335387 197433 556530 174890 72186 250138
16305 250138 -10128 -66270 294312 43604 1399 118635 112238 245768 380064 90900 189480
16294 189480 -90055 -2988 355431 164262 73016 339593 287648 12868 283891 260478 395039
16283 395039 332498 409673 121135 158129 254305 225126 224868 -173724 112899 -74279 181001
16271 -77520 326990 -72761 131619 -20182 207888 210825 107882 361616 51319 322999 192562
16260 192562 200683 256628 410793 104444 332495 190999 -167886 186051 207080 207281 184197
16249 184197 344307 145347 406872 102117 224733 238326 277965 17199 80931 471009
16239 471009 109294 -199489 248987 -61993 19623 73165 -40047 110854 211213 171400
16229 171400 359397 -144774 3553 78479 24174 333192 143244 232618 516616 -6599 78871
16217 55737 47945 -8535 227716 388944 -152308 -246945 36817 316926 435900 -175756 317027
16205 188893 -21568 150457 106400 162025 194927 5057 392247 105754 171428 10941 35425
16194 35425 -51090 -180830 -23392 78969 52677 142937 -72889 -86676 -11802 280288 8992
16182 205603 370447 -62671 95400 181217 125537 85942 400291 205818 80970 68271 682543
16171 682543 314400 6999 136570 -17528 120387 2017 83746 187480 61844 137277 120675
16160 120675 -139484 3853 41213 135160 -69890 42468 12620 122231 14450 -120367 147850
16148 -113931 59052 41004 -126124 -296779 157265 51422 179899 233993 -255237 82711
16137 21373 96951 -99504 74224 19416 128998 -23797 -197944 368281 111490 -6260 176284
16125 139735 316631 250440 117635 -203719 -14008 25421 179565 -71543 -42460 389479
16114 -121998 -59114 -197211 -180959 -146373 59524 111666 112629 185159 204322 -112817 -135155
16103 -135155 -238708 -13672 96441 -19058 273576 246633 187988 327462 4975 -279957 -34082
16091 186126 -103919 -70197 -22379 -78816 92441 35179 -93669 -86991 -147457 -113820 -198117
16080 -198117 -174640 39294 -409726 209067 204962 -186241 7309 158074 -98003 54186 122817
16069 122817 -2179 1330 24330 -194467 -94448 -53347 98485 -120536 43180 16822 -29408
16057 -104021 -49395 120982 -43373 37159 -203751 87473 257686 205892 147484 -86275 151767
16045 12279 -64316 194853 -127326 -8968 -285053 -215678 47343 6210 -81534 -225395 -143365
16034 -143365 141290 -193635 40428 388773 -506 -254952 -169354 -162146 -21464 208691 -126489
16022 -62855 56262 86036 -75293 -271463 -37380 -12769 -339728 -205410 48493 -293213 225001
16010 133484 -22367 4331 422078 405018 110599 -29757 273390 35738 -316679 257745 -14473
15998 119895 85809 -193799 211367 58396 -124902 85025 167993 42611 -80411 -8440 -389526
15987 -389526 -160704 -29907 -242895 -326836 -205250 238108 278960 -102257 132498 150048
15977 150048 -21078 -62496 227347 -215145 -113275 189382 24021 240992 2079 233613
15967 233613 148489 27210 135108 -249275 -102856 -161034 -337855 -47522 4967 -194766 214222
15955 -240109 -130201 -169253 -112377 -176377 -100448 71016 158565 7043 -173010 -25245 -88559
15944 -88559 -383163 -109058 -249499 -154344 -27843 -278371 19396 231369 11906 158704
15934 158704 -78806 -284102 -289947 68675 5625 -70749 150734 -242892 -96203 -224252 -4790
15922 -32967 -170413 -185061 -110183 -44663 -340823 29299 121539 60315 -195476 -23412 69320
15910 -99923 -93318 -21507 -364099 108842 9120 -165227 -160629 -144571 -179640 -59710 -121680 -114637
15898 -114637 33051 -344367 303374 -310004 5419 27127 -307021 -84900 12222 132702 47471
15886 142356 -90494 412239 200046 -227713 -33880 149728 73301 -253764 -216636 138704
15875 -45452 -60993 151186 -29270 -257865 -932 174483 74185 -381035 352767 3846 -38604
15863 -97018 -97615 134807 -133939 135580 -33969 -199812 167045 -72797 -82914 -220469 14248
15851 -82176 55985 -247499 -227565 46423 -51942 -148639 -198873 2848 -291538 -44643 113866
15839 130431 -330735 -598998 -132478 -219537 214368 -322460 -6096 -333769 -9759 -7224 -76793
15828 -76793 -47524 -301537 17865 15656 -44068 -164658 -152323 47106 -22668 -298148 70547
15816 -357817 -231146 -95282 -80348 52748 423764 -124710 217030 57832 33779 -176023
15805 -7256 -127657 -509379 24483 434252 222603 -327680 -269557 105019 6260 96579 -20622
15793 -204269 -98859 40579 67882 -67137 201735 -105227 -166966 -54867 243416 -40468 -21562
15782 -21562 -91554 -247987 33900 -276460 -61016 -230068 54432 -21701 -122104 234244 -132850
15770 -465139 233489 292130 197481 -146070 105255 -93180 -25128 174965 127973 -171133
15759 -36756 -116166 65044 -32861 -100186 -216609 268587 -124182 -142707 2969 -23366 20455
15747 151043 -81466 -234117 182016 -190579 -57371 -203759 323893 161794 88502 -36070
15736 -187198 -63635 -158852 -237651 -237245 131637 -78498 -196024 369418 57916 -78892 307138
15724 -252190 100526 133359 106979 90744 -36402 211124 39182 42711 -521453 -9978 -352330
15713 -352330 -281528 -298915 -9784 266770 -67679 -334909 4745 -60126 -59711 29434 -139683 -64569
15700 -214105 -206224 -234467 -9682 -326100 -94822 -358980 54198 -74369 -206185 88084 5688
15688 -103037 243109 63856 135322 -290535 -235991 60095 -507506 -11695 -37330 87156 196806
15677 196806 52636 222494 80572 268334 32582 -262996 -173368 7875 152207 -346040 196274
15665 63413 86707 -84941 3943 133432 14948 -126123 -565477 -40989 142433 155154 133849
15654 133849 58445 -193447 -4971 236727 8783 -101254 275977 -275176 -44732 178608 116275
15643 116275 308515 287802 -36109 -47594 -340708 70146 -94927 -188111 114298 267026 -192111
15631 25923 97938 53673 -248029 102740 16877 226120 -124531 209507 -307 91036 -43858
15619 4806 370420 -454233 -98311 154087 -199223 10689 158598 269596 103228 186148
15609 186148 -229216 -60422 44804 -108594 -325278 152363 13236 -327964 -87128 -64204
15599 -64204 -260973 -139140 20537 -194562 158309 208505 82884 187900 -268616 -280641
15589 -280641 -210435 -366591 -498252 44645 21344 -131933 -45183 -31348 -166628 216943
15578 -251467 344963 199684 -294620 -239907 351947 89637 -177318 162943 -51497 -84279
15568 -84279 -115630 189275 -109523 238482 -40756 187389 61118 123030 329941 -88571 103682
15556 88848 94346 -86456 -179805 -127881 27465 -62508 -133214 196230 -155763 -11750 -74605
15545 -74605 -384373 -25031 69455 114287 5462 58157 89255 -371813 -123345 150634 -84513
15533 -213204 58087 45968 122770 -153965 -327250 -377609 -162333 148301 382067 199084
15523 199084 -117624 205813 311906 206524 -40185 -242795 -135831 24787 -376688 -122255
15512 -109460 -141181 82636 80864 88609 -116451 -74755 -140978 -5473 -318690 -118015 45888
15500 70186 96609 27980 -30707 -48865 -139861 105278 -89646 -91048 -98904 147791 -135733
15488 -121614 -193807 -177977 -20291 338060 -87481 72152 42463 269500 196766 288128 -75562
15476 92963 -12585 -152145 119139 239607 178858 -232339 15786 -172520 -221337 48500 -36478
15464 -352636 -211989 24907 83832 25331 148328 70606 -80371 -132368 -118113 -1580 -57833
15453 -57833 228541 260542 119863 -57239 20447 182684 -144959 84413 66937 135794 205990
15442 205990 -33681 206099 -108666 -435990 355466 43323 212998 -38857 8959 -94171 -153356
15431 -153356 201076 -55507 201563 47237 -39829 76745 152977 -93522 -18769 -271190 306894
15419 -116343 160251 282278 -52814 173966 35670 334902 -283052 110602 -3199 179830
15408 78367 68761 -129970 -176870 -362179 -76028 -154293 -195839 44033 -22313 58231 -93146
15396 127446 58350 -109315 329848 247870 117458 228932 -289080 113567 -55039 -206608
15386 -206608 10597 -66296 46122 109358 -201748 -58248 -242688 -139398 -63706 -170589 215760
15374 10936 -163596 192616 -247170 77537 141512 -4455 93876 -155131 62559 -138387 -99466
15363 -99466 -361061 42722 59664 -155978 298848 318543 -107218 -17325 16460 44384 208028
15352 208028 -63330 -299768 -96432 -67287 -95705 13282 -94294 72821 -435719 -171910 5339
15340 299678 -60223 -238158 60157 250611 184427 -147778 -142286 171027 -116002 -84124 306185
15328 12269 52197 142694 78296 78057 27097 201214 45859 -94767 -90110 -26998 -61744 275678
15315 -155835 226058 -194566 65835 189668 197853 236535 -103471 94451 230159 -30471 13092
15303 -22550 -14320 -168398 34080 76025 136541 124629 176689 180109 -58915 420251 36836 67496
15291 67496 226590 -98872 84283 -257654 18130 -243863 144551 247155 9158 72779 -327404
15279 51127 90865 -46064 49244 120991 210245 50690 254779 -116112 30634 -30790 190157
15267 -283274 -106331 3004 -219967 -14528 32264 -166542 -240548 115254 27912 -67912 80736
15255 -107310 -147556 -128492 283525 404749 336732 829957 1110231 815122 1427065 914190
15245 914190 423086 273473 176901 315377 5423 66453 -122999 -176323 -147903 -146913 -121822
15234 -121822 28379 485108 170451 223074 -11416 64173 -122182 104241 274208 312374
15224 312374 206259 -36550 106464 -4104 274989 187813 58843 199676 231884 -170502 -293021
15213 -293021 -150682 238468 -285336 -372451 169997 -39874 45097 386368 444152 26493
15202 159407 12065 227272 -72574 -24181 44580 53134 232481 160684 -36446 263059 285122
15191 285122 -126774 105774 60084 236244 -235527 111166 211487 411024 25934 37626
15181 37626 62436 78429 -57813 -70667 334174 117930 203086 202529 123527 321386 81762
15169 283237 -181985 -244535 131384 136686 -81657 -112312 128657 -159737 481262 26148 -4821
15157 -125919 236154 -18153 -120802 43507 161112 66117 -155181 232335 172977 168964 126706
15146 126706 189121 162839 -284881 273518 -10061 375179 188952 244786 -136572 214086
15135 369000 -116385 -36786 192560 13482 134621 -60468 379000 -97189 -214506 -119135
15125 -119135 286872 -19575 100805 342363 -27438 114190 -58033 98535 258409 417789
15115 417789 254746 -95758 -48477 94017 199444 93922 241672 -244 245703 -59727 192407
15103 50321 93619 -39097 -62004 -231799 75209 291607 175663 -39627 81343 103250 130620
15092 130620 25630 -125041 6744 36981 -212555 -191355 145023 -1708 -24874 363300 89572
15080 36159 150515 116258 157917 -160184 -124928 455968 -56456 49174 -249741 167957 116836
15069 116836 120739 60305 -26591 161378 -73959 189281 149549 -139217 99893 140424 -37855
15057 143665 168136 243697 292764 120588 92597 199586 62979 216775 -168389 -67314 -123646
15046 -123646 73669 -60700 189299 -123387 122674 66803 138573 360182 154851 44961
15035 159500 130631 219291 163674 135596 272318 -86598 241115 198847 -50733 -16884 330150
15023 300853 -13802 329813 55058 264445 203812 38216 -1922 -112595 33805 233014 185973
15012 185973 205266 -66815 5311 146559 528220 -171440 261927 401313 441623 13421 167628
15001 167628 398426 174961 272035 120283 115104 339038 378524 11182 -54247 -86221 131640
14989 126182 219898 107861 400459 169606 154586 81305 -11896 229033 361671 202470
14979 202470 65339 449974 362833 395764 493968 484818 93466 239299 362540 109857 220291
14968 220291 92779 -23979 -72867 188787 143487 116737 409448 -73407 24018 101853 189599
14957 189599 150547 -6316 140001 357267 77038 -73076 140241 133431 171789 7329 146471
14946 146471 41684 122612 266125 173811 146743 112449 452824 239689 33631 271507 203733
14935 203733 190965 258437 374940 361071 310012 2816 595965 -23647 120226 -77748 534873
14923 32923 199255 197557 213378 176728 369823 311828 270811 380756 338759 147872 812316
14912 812316 253890 421242 375298 -279962 316398 327915 52255 -26551 -126671 332455
14901 259182 368545 405666 208051 344297 48761 233326 678225 300494 126161 402931
14891 402931 207613 272597 156436 93861 258075 265059 505167 291185 494427 222138
14880 386790 248248 288197 461623 362796 178318 430985 532908 427927 345589 147769
14869 57627 149622 318120 268919 -105031 444065 411605 423069 332915 191556 270859 412310
14858 412310 279531 308518 434447 222516 197876 271313 352348 370611 501041 111173
14847 722471 451387 463474 283018 420169 499429 291488 409952 208848 601904 361405
14837 361405 298391 462308 463043 142239 426717 400751 270426 448903 213530 348269
14827 348269 215520 566635 340133 54662 436904 344308 246526 586419 389359 778187
14817 778187 -128713 271691 121923 469628 455748 503319 540469 225893 308901 352976
14807 352976 236656 755393 423951 411670 236088 614329 464635 405396 614039 304568
14796 637762 802842 705318 568190 534498 603965 343520 703933 425707 594010 542511
14786 542511 520889 407262 426749 420583 544071 381586 672942 464884 498557 405598 625997
14775 625997 197607 406014 573432 438414 602455 533708 360195 433796 609841 678828
14765 678828 396817 423626 307253 505690 782298 411410 501019 772260 447272 686810
14755 686810 938416 494384 604250 523689 289963 252456 448963 512867 552561 632620
14745 632620 836082 716719 850316 724554 837993 492877 488348 644234 498041 717138
14735 717138 409719 556772 727103 508938 729969 528737 744816 552029 475147 563114
14725 563114 785093 923604 700772 728832 486567 859725 424754 806543 637442 516140
14715 516140 948264 835487 584163 864546 749827 517789 719846 753489 879629 620547
14705 620547 900823 745064 608294 694457 480798 681924 792763 1008365 561841 763466
14695 763466 711456 820005 392488 817857 958091 1075184 904147 757562 1149954 494264
14684 525426 694534 924334 968592 955611 1059533 548273 639487 437933 712689 754447
14674 754447 875826 924628 1070284 955545 964026 1145535 729364 889240 907929 859842
14664 859842 1104433 966839 793469 899536 1089046 1051522 1074284 1036387 1402897 1246713
14654 1246713 922766 999579 780993 965132 758440 1073647 1035137 984370 1111542 1217797
14644 1217797 1026768 1086907 1106965 984889 982906 1269594 1229258 947707 1159430 1136923
14634 1136923 1270115 884173 1287023 1009064 1320833 1226704 789775 1163000 1345933 1342311
14624 1342311 1226501 1275600 1155638 1171341 1411479 1139340 1364451 1044856 1553314 1088192
14614 1088192 1360325 1321327 1396211 1350545 1162595 1657459 1183885 1512185 1274887 1572917
14604 1572917 1333637 1494028 1206294 1862977 1335191 1653744 1627564 1451696 1496808 1429177
14594 1429177 1254500 1403917 1639513 1710457 1581349 1475893 1590143 1410739 1937209 1713645
14584 1713645 1389993 1818686 1734709 1628905 1431323 1739311 1982269 1818776 1899813 1852980
14574 1852980 1942170 2253744 2119096 1948691 1955649 1933669 1826586 2351005 2168337 2181046
14564 2181046 2355242 2285867 2336194 2305041 2557833 2813388 2569977 2749738 2903839 3022958
14554 3022958 3569513 3635026 4297613 4919806 6897114 9506874 14628169 24074414 35270267
14545 35270267 29741456 15887265 8110586 4899627 3500689 2587792 2565814 2303471
14537 2303471 1968579 2112510 1789738 1961193 1862847 2152309 2241137 2055278 1895171 2307975
14527 2307975 2004904 2334313 1995477 2124178 2561035 2024622 2435861 2380701 2171787 2239972
14517 2239972 2577206 2275958 2446780 2636525 2676058 2356390 2484088 2545701 2528677 2246567
14507 2246567 2476774 2312310 2537083 2607871 2503309 3058273 2744101 2747176 3129200 3014900
14497 3014900 3112260 2894875 2750307 3037514 3379537 3087779 3320470 3309540 3263421 3390779
14487 3390779 3784134 3218283 3457254 3524360 3291094 3869655 3872441 3239496 3487590 3615576
14477 3615576 3772149 3821165 4270352 3859939 4162425 4017473 4219527 4120532 3734064 3915198
14467 3915198 4084160 4265677 4319090 4277229 4249047 4768157 4748529 4596516 4556293 4758457
14457 4758457 4510884 4939018 4945204 5068889 4862044 4881017 4831098 4859878 5063598 5166620
14447 5166620 5119756 5357337 5545880 5543647 5663158 5218097 5614574 5760338 5887607 5661454
14437 5661454 5968416 5810645 6597402 6017433 6134463 6001127 6232067 6490633 6482237 6746796
14427 6746796 6671821 6683523 6805245 7006884 7141332 7520211 7310185 7197310 7425334 7562398
14417 7562398 7664652 7886661 8090902 8293848 8330852 8515456 8608101 8807797 8588450 8685722
14407 8685722 8803505 8974061 9218829 9504428 9466815 9622120 9696700 9807938 10221542 10174759
14397 10174759 10522391 10738710 10570701 10815425 11054331 11124214 11197300 11636876 11950811 11803682
14387 11803682 12243500 12722769 12757825 12927007 13242126 13435979 13939629 14329977 13957415
14378 13957415 14394935 14653001 15282187 15494325 15690514 16188066 16351252 16981209 17031987
14369 17031987 17517519 17638579 18261838 18422005 18667122 19359103 19461507 19974177 20350060
14360 20350060 20974427 21572300 21856807 22770226 23270788 23795687 24235504 24824400 25150277
14351 25150277 25863637 26640063 27155903 27882146 28397015 29549827 29910690 30556939 31473512
14342 31473512 32628941 33305418 34358586 35231746 36069833 37247479 38186069 39655706 40814090
14333 40814090 41600352 43348977 44255650 45538957 47048418 48818273 50261021 51786347
14325 51786347 53773818 55208216 57239247 59189322 61237272 63209015 65532627 67984355
14317 67984355 70301675 73200374 75793398 78950806 81709921 85210117 88536743 91891358
14309 91891358 95889272 99757810 103992966 108423398 113049217 118086748 123471527 128595675
14301 128595675 134617029 140660582 147477667 154774886 162283554 169941287 178553565 186798771
14293 186798771 196721036 206303547 216963854 227514974 239003957 251141174 263859867
14286 263859867 276776995 290300447 304245601 318592957 333031707 347673351 362277105
14279 362277105 376632940 390703436 403876071 415637870 426071758 433586253 437107965
14272 437107965 437867352 438504414 439158782 438108335 435101191 431375995 424751701 416373148
14264 416373148 406523894 394734024 381273582 367206431 352633968 337674616 322388202
14257 322388202 307260148 293123215 278872822 265147470 251875059 239303213 227380958
14250 227380958 215831870 204887682 194617759 184962088 175822025 167356804 159750695
14243 159750695 151780473 144710377 137995894 131783908 125699020 120191311 115169579 109951936
14235 109951936 105281157 100610994 96406708 92962115 89232260 85547915 82023536 78456445
14227 78456445 75969449 73028872 70243357 67458477 65006621 62698475 60798999 58573153
14219 58573153 56833796 54860216 52777236 51272010 49567330 47944849 46797016 45215643
14211 45215643 43534084 42512161 41440340 40337604 39322544 38064588 36836453 35848692
14203 35848692 34839751 34088724 32908608 32028069 31472999 30579051 29587463 28625288 28536687
14194 28536687 27749826 27004776 26357727 25480706 24873773 24646429 24131986 23236586 22514856
14185 22514856 22209793 21664217 21218093 20618201 20409694 19956044 19538094 19140968 18385125
14176 18385125 18151451 17635176 17165594 17240206 16564010 16587350 15983253 15857854 15913330 15279843
14166 15279843 15282763 14813524 14500403 14578386 14133922 14154591 13534244 13082581 12931949 12882556
14156 12882556 12755653 12494320 12179445 11951109 11828288 11472290 11577160 11060633 10930578
14147 10930578 11198417 10962530 10300751 10235602 10161333 9911416 9726144 9974532 9726420 9437061
14137 9437061 9573321 9523041 8859966 9239680 9029856 8783783 8514133 8545395 8149913 8288761
14127 8288761 8427170 8179390 7988491 7657887 7494151 7639759 7488977 7403893 7134653 7172256
14117 7172256 7092297 6836192 7144664 6971395 6738819 7035029 6507163 6685313 6346062 6396137
14107 6396137 6122289 6290390 6032162 6161162 5832973 5776852 5838003 5557384 5543450 5638782
14097 5638782 5599541 5373242 5367454 5248113 5480676 5162591 5242394 5177184 4962228 5133322
14087 5133322 4854362 4590100 4953037 4726715 4565295 4580537 4964231 4597265 4657535 4350390
14077 4350390 4443696 4129853 4564193 4281290 4210915 4248509 4251437 3966476 4045994 4069606 3982407
14066 3982407 3746249 3701004 3636747 3816261 3785735 3748929 4136309 3645667 4079086 3724684
14056 3724684 3703838 3666458 3462548 3428181 3481035 3265454 3360821 3306334 3327943 3500166 3234347
14045 3234347 3354968 3274447 2980952 3033729 3120353 3160174 2865960 3136094 3243720 3035337
14035 3035337 3342021 3058471 2941216 2845019 2907771 3057211 3187994 2795414 2731341 2573502
14025 2573502 2737553 2882601 2877750 2814136 2624231 2810663 2354772 2507321 2406669 2371478
14015 2371478 2437348 2483886 2551593 1933256 2274440 2561650 2303089 2212297 2238437 2215353
14005 2215353 2571171 2317607 2282808 2586897 2169918 2055653 2243121 2182849 2201214 2141415
13995 2141415 2402227 2139570 2338683 2226049 2878623 4052155 5492026 10289800 18554956
13986 18554956 31045187 31131357 19985281 11618282 7835160 5962117 4912684 3746625
13978 3746625 3722850 3534768 3200003 2836340 2822876 2658714 2618491 2736321 2348025 2281933
13968 2281933 2343778 2770357 2288211 2191722 2013189 2384896 2155784 1639391 2125235 2054748
13958 2054748 2028374 1791553 2130389 2064656 1683834 2237497 2154113 1804615 1920116 1776228
13948 1776228 1949999 1722678 1769882 1638241 1972586 1794072 1663455 1805249 1810756 1837880
13938 1837880 1638814 1756369 1774318 1861526 1759290 1673627 1521075 1204085 1807693 1303862
13928 1303862 1625244 1387912 1243859 1440196 1334550 1464661 1474051 1323279 1706933 1313096
13918 1313096 1426886 1408056 1489421 1427726 1502295 1673712 1416289 1323358 1177801 1318005
13908 1318005 1573167 1152348 1197331 820220 1607409 1361688 1179963 1339681 1195669 1542143
13898 1542143 1063082 1331857 1305424 1371002 1428518 1248164 1216478 1059688 1158195 1149830 1500572
13887 1500572 1421934 1601882 1168497 1335717 1261417 1243939 1079363 1239866 1104308 1126749
13877 1126749 1407801 991448 871451 964633 960385 1212051 914720 840852 1078066 1135498
13867 1135498 1360392 1050908 1132590 1024346 1171437 978138 713368 1080845 1066768 1364046
13857 1364046 1057244 982387 973601 925115 1034055 1352320 1263704 962238 948082 1004801 901417
13846 901417 1136219 1038318 896131 831904 852546 1021962 785603 1059481 857349 755655
13836 755655 1055768 798851 756707 551418 1105859 846161 1039022 895803 971067 1082050
13826 1082050 825159 937332 1288396 615637 825828 830075 719287 908285 1122059 639426
13816 639426 1006698 716464 902858 898786 696165 954612 654916 704349 777868 993392
13806 993392 1057970 649126 781686 892629 459863 909349 779598 777907 445620 1047066
13796 1047066 637968 695530 860486 709669 869174 649379 725210 821006 896156 1071816
13786 1071816 483864 732847 535071 656022 609372 733138 739159 844640 589079 516276
13776 516276 762176 1026023 735780 682471 601493 788181 618165 738409 512265 619783
13766 619783 700075 805786 732302 889916 716758 634720 841903 728124 710099 439516
13756 439516 342954 619528 355410 892584 502216 332896 646850 600085 671400 650132
13746 650132 188178 411899 525869 421754 581475 520778 422089 506949 845891 714501
13736 714501 654844 611808 690602 650374 650701 55346 426469 658600 869039 751958 391442
13725 391442 302778 584734 550743 305842 580347 329388 766876 530908 813484 736620
13715 736620 191672 652290 380070 872198 304776 431679 302583 468636 555865 188473
13704 332110 681507 627743 228971 464664 224137 494038 494321 715294 657723 343939
13694 343939 658646 729057 655826 534166 581548 594372 505304 650471 571313 281217 511305
13683 511305 111672 253876 659218 399760 506779 365140 481892 331600 392519 505249
13673 505249 217770 757396 358052 691559 263153 224768 254388 516226 672096 214945
13662 571112 354234 378558 624607 475856 454143 670577 234984 299645 546360 491709
13652 491709 371892 165833 300363 230769 668660 299186 203610 472042 436343 628262
13642 628262 354293 437417 164681 244517 292290 180520 157999 343670 478199 707911
13632 707911 402182 200097 585287 3316 455094 524922 533934 357379 433798 294935 322681
13621 322681 263545 324848 223737 865001 700071 792212 217788 386548 448181 305655
13611 305655 223965 212291 394706 435331 102101 316081 115645 385538 201129 402881
13601 402881 414479 428975 160410 244916 287409 472535 449559 516110 295700 675567 92821
13589 519501 524465 191442 439590 435559 648974 297711 419301 68047 506207 262401
13579 262401 463131 211526 303145 584702 72075 510026 243446 327303 297548 430988
13569 430988 139385 458748 392895 607679 352073 220018 494997 106662 507415 646450
13559 646450 392721 85961 179369 280946 502635 366802 414699 646123 241909 619666
13549 619666 319330 679202 127213 362028 153104 346874 141123 266234 291391 372416
13539 372416 301799 235326 305634 247047 235514 414976 575723 501587 459648 391963 477703
13528 477703 358383 150904 237142 338576 266366 163204 80142 80051 287166 140440 173816
13517 173816 104654 505135 167401 99685 281417 539516 56110 31869 539630 234949
13506 150361 366131 80178 338029 332568 130391 -17879 218755 334535 126224 -93380
13495 557850 233370 223233 -109133 94396 113749 201247 521521 342048 415423 321354 85435
13483 207843 313648 95133 438308 238900 -36669 73535 149086 332056 473759 349356
13473 349356 58667 458908 252360 -42391 56236 403817 48862 179017 363387 83287
13462 266033 283168 274329 225768 28737 -25033 296671 69504 -54412 140629 45072 395259
13451 395259 137161 531102 194172 45448 273430 234840 349055 126024 -99669 163702
13440 447907 322573 528858 41100 240435 357670 43757 172374 207527 348437 458627
13430 458627 43087 104330 370420 150790 512282 93149 153820 55921 -54292 348786 278129
13419 278129 231207 514495 350731 129166 -54094 2960 96225 317289 12622 -25351 22641
13407 -12182 398301 19079 -49972 400013 627555 305988 105200 228177 265111 458061
13397 458061 339108 231546 55374 373273 108910 156824 183556 445709 166913 442382
13387 442382 255301 128085 140471 -86331 383350 113989 247291 221480 140147 279768
13377 279768 -37433 142256 84969 105083 182648 68644 324180 207927 55443 101725 347812
13366 347812 210712 246988 157789 210362 269848 403422 171193 250903 226436 -93818 235917
13354 100044 422341 55400 189241 294898 450433 533198 152493 336766 216051 181752
13344 181752 531347 152489 161537 265417 408410 134777 297681 357419 315097 218937
13334 218937 233954 266568 160094 92938 1710 197738 33735 147053 -30093 306148 -47756
13322 151068 41863 129830 268662 341426 -180166 229211 379134 76571 163041 1160 370500
13311 370500 250256 455718 220101 -98687 395898 14523 192987 304535 -120671 -18000
13300 13182 -76938 356164 74291 360966 320424 557485 104140 250061 137870 373008
13290 373008 149206 192633 276041 -22018 114855 95378 -306166 229967 475273 19239
13279 -295321 416930 -86628 395752 259343 380618 -170374 70232 14397 -15613 -385700
13269 -385700 375686 128864 138647 270553 36190 294485 -290073 20051 32673 115309 307280
13258 307280 -26893 432960 275371 337916 237994 70722 169792 41373 264579 327996 251005
13247 251005 26250 -31945 374873 28944 46910 182116 149271 178431 38304 10604 194569
13236 194569 303709 -41260 -164590 363716 62607 270637 231573 90123 314933 -959 59123
13224 192549 109926 212044 786 -22131 200195 -18135 -72820 68887 214199 25269 10561
13212 -79027 -163710 364291 167411 32633 316502 281227 241815 47913 155975 109324 169758
13201 169758 -139096 304341 -4879 59864 9598 262453 228318 312759 149742 156163 -174220
13189 36863 76202 268258 -221833 282457 306778 66490 281547 118978 54708 130042 122800
13178 122800 137208 229252 77301 165258 335067 178258 7606 323289 -97818 -138416 -265602
13167 -265602 323931 -28630 517171 229791 259577 122742 184969 -89693 24351 315333
13157 315333 85198 -5054 394307 159012 -43840 265861 372717 -1929 -160219 81606 213975
13146 213975 346911 7089 -104441 -131287 14625 421728 77450 62500 111523 -96014 99683
13134 237098 89850 96067 25188 -98464 -75629 265238 287863 -86316 -226015 -37449 -16342
13122 151230 1101 -38770 -83783 218071 49159 -39626 64314 129428 504098 206975 -76316
13110 9881 145358 92362 -94873 206962 -72568 298634 -215387 63722 -34771 -49123 42696
13098 230620 186764 234431 -104245 -38109 168027 -94029 -150634 380096 -112078 216127
13087 46291 4455 428626 138303 -54304 143329 -174262 7524 -114278 184557 237358 -29487
13075 -17353 -143224 -19369 -115959 160841 86423 99089 165759 162083 308182 125720 169859
13064 169859 -213068 98605 24282 269070 178346 244122 327982 49456 395930 192770 292270
13053 292270 66863 303210 305513 449843 23975 -13376 131742 82666 -322923 155475 -123735
13041 -232208 152041 128424 -50692 75133 118573 -214811 85429 324886 271391 40046 197380
13030 197380 128834 73961 196854 332281 503791 -16583 308949 8582 67909 -141517 127404
13018 -104113 -7339 -29837 422745 -86790 88941 143619 62212 109622 -118744 80443 290786
13007 290786 -235307 282844 202066 12357 1688 61838 189139 354725 -258554 139199
12996 -252271 75347 -50262 45399 -328 24170 138461 58990 -35150 134088 -132902 -27285
12984 407364 346732 81198 101085 173823 50750 -152635 159107 -93444 43385 29833 322095
12973 322095 -153213 -109062 193128 257517 20494 22095 332342 46530 -77296 277038 -61629
12961 40826 -141690 285346 -39630 -68252 165111 -67586 -176721 -101596 165987 -122308
12950 145815 -247457 -10082 296666 -74066 447372 -101904 49826 294444 18131 250680
12940 250680 -72005 -240450 -108559 177613 597123 -105309 -342177 273952 88246 126758
12930 126758 249455 165346 203011 -300604 194849 -14246 -95070 -157404 184439 368162
12920 368162 -227032 112015 -252518 -275110 -103342 -26128 -239613 319385 -158749 -21619
12909 -11732 207984 231281 3715 68998 -1706 115479 -70892 325544 64205 76263 291494
12898 291494 213382 -17575 -61553 -137969 359390 -156352 62480 221723 344880 62169 -118382
12886 53206 373806 36093 -84405 64279 184190 117382 256784 294041 113948 -191576 -27334
12874 -56799 167798 227038 48862 87782 -25195 32198 -61672 185426 -103317 125561 -36539
12862 313893 41240 62364 196746 125493 -10225 300342 356 100337 108217 -56063 -92704 -89448
12850 -89448 183732 -281145 240927 199473 109603 -284227 270071 -186334 145289 -67502
12839 393719 189242 195396 131306 1566 270568 372 75099 -110333 55212 -151589 -180940
12828 -180940 110321 -193912 26604 67946 390238 -97190 79553 -107959 -72113 93357 -117053
12816 91869 186496 -226820 -106962 175544 -147687 -61603 -1622 -93441 -79443 -189631 -3636
12804 -169290 -184123 -131548 -47996 121077 426714 34442 75397 -25540 -49150 -68317 232531
12792 17627 -101700 237971 49776 -270848 70806 -164035 -146537 -46237 -234432 151603
12781 20097 -135257 -265841 346647 214999 140544 143601 40483 244349 51456 -10105 -185905
12770 -185905 -40119 87252 -274146 146478 -38937 273055 82820 210107 -43036 -279519
12760 -279519 66921 10754 132081 -148941 46138 93098 170975 126434 229267 -16129 -66087
12749 -66087 52240 212228 -9463 52222 139863 119911 -431362 119146 79441 38148 -223403
12737 -184225 8107 63500 124227 348008 142087 212396 110919 -93953 -120085 124470 69230
12726 69230 12507 -55150 214600 -110344 -61224 92595 -12154 448107 -6418 -36294 124786
12714 -83223 -220045 301440 157281 -58077 -62033 138281 21678 -143463 328131 320835 299813
12703 299813 139015 441309 144559 -210740 210755 32364 -196127 -123550 194585 -28290
12692 -37854 84333 295228 -38409 176848 -243962 287551 -3794 -288192 -123969 79928 -188950
12680 -8599 131125 151699 45076 -58356 -147539 -15104 -296338 -426797 -137041 107021 54635
12669 54635 86468 63895 59023 131994 -145807 -49993 127528 -131366 161749 -237955 8847
12657 185157 73472 241462 -55420 55974 105461 129195 260492 -178895 103300 106808 -34354
12645 151083 -129535 477146 13728 -133116 141598 78088 124411 -96200 223575 -161862
12634 458424 241800 -110253 -81759 79415 11750 228083 340957 403996 112648 240336
12624 240336 178332 162018 353052 390876 283761 91304 -50319 368583 1540 249440 -53184
12612 207678 -47421 143750 159364 -139386 118589 -228547 -8946 196176 -280405 -19148
12601 -103573 272751 36315 67176 323317 92188 212668 -24585 1774 -61055 271192 179183
12590 179183 243307 277585 2600 -82031 193188 248118 -13227 -98533 26417 -233682 107287
12578 166816 -406475 240059 -17487 55895 46967 223414 -4062 72316 32223 -20090 -21714
12567 -21714 273813 128866 31619 173776 87179 20998 -79683 104472 -154431 209830
12556 -179922 -199370 -73187 -224295 -61169 235295 211157 244140 286871 -204401 308709 176600
12545 176600 35774 -13821 46643 331934 -185430 63961 -153970 99758 14402 -9937 116678
12533 -274608 146694 244082 60020 11965 -106573 163855 -83305 -452 169954 90248 23890
12521 -175126 -236374 266400 -174832 -204297 214292 235979 203824 45265 82171 316222 360630
12510 360630 173994 160185 -261101 -39445 172427 -345412 132285 190945 -51796 527688
12499 119372 -182341 293203 111687 60295 197259 85627 -82228 142322 -290144 -212283
12489 -212283 -71375 -102173 278296 -297520 -171630 293675 -4826 45866 -393557 -158192
12478 -78617 -1029 113692 -49934 -141078 19283 325085 -243737 -134050 -77965 366109 -27483
12466 -81443 -139980 14750 -120303 -8004 145073 126759 100485 -135931 -94324 -206074 -251649
12455 -251649 -115438 -164527 -123812 -402221 -263526 41441 15879 234868 -95113 222030
12444 17122 192018 149052 98097 -21704 292193 -70252 -121524 -90906 -4579 -82697 18315
12432 -162238 -29214 -104022 118781 52309 31636 -64276 45316 -63524 44474 52856 93380
12421 93380 69836 -249937 295957 -180232 -88840 -82209 353519 -128754 7039 -93100 154033
12409 31962 -2588 117429 228305 95929 -11524 47489 2258 -4156 201139 86114 -348434
12397 178455 -117634 15453 45493 168043 154024 -30343 -99163 -304630 -70837 -46583 -73501
12386 -73501 65195 97543 114790 174298 302591 -217001 -202366 -173089 294302 -155904 -274990
12375 -274990 -2134 -372360 105053 -1375 101785 -251516 -158791 -141519 14313 6397 61917
12364 61917 14622 -84721 166352 -256773 -95085 -232399 99105 -176234 -36269 27159 -88582
12352 202167 -472925 -45247 -451123 -34215 -123006 178572 -298756 202506 -232231 260205
12341 -156807 100234 -255364 56301 338692 30441 -158221 151349 -168938 98396 -71665
12330 48911 -28194 -298747 217404 371701 -128027 202586 349596 -267725 -29580 -169873
12320 -169873 -71603 -89865 167981 23799 159812 -89057 -16386 -95499 -110630 74614 -140363
12308 97575 6134 -148312 82437 -21452 257549 -105556 54053 -57420 -120030 66713 30814
12296 22566 -137498 112563 59940 -121118 155949 -371566 3692 119291 -11290 466050
12285 -83595 165503 99375 433986 55371 322706 91365 395626 -111217 84755 299459
12275 299459 32229 145610 -49093 99711 -57610 195641 201988 -125381 -159476 -136284 286342
12263 218218 221682 355334 148490 186737 113345 182119 -165236 196118 -65308 277556 162463
12252 162463 66223 201350 -49026 108239 173716 180340 -220979 396085 109961 189742 -82875
12240 -73394 163072 243915 -123546 9344 156959 28417 401584 51597 -258005 216179 471134
12229 471134 142200 -40122 79188 10929 19603 248505 212009 128428 252822 250390 368577
12218 368577 186196 181165 13090 -46908 14728 -78818 -8383 199171 446827 44176 241771
12207 241771 198078 -202387 208210 409957 246376 71198 243393 -519594 91574 220322
12197 220322 66180 300245 90745 -9285 277217 76790 -133984 112705 366957 247916
12187 247916 168122 345316 423669 65648 472232 -43641 204974 17554 64902 162643 151217
12176 151217 257487 263654 -25090 346034 247206 -42901 -256356 70286 201804 -11967 146897
12164 73620 392290 371667 -6679 295064 34602 210635 -42960 166419 242003 -160481 -168715
12153 -168715 126790 -259795 63984 426266 309953 -83719 -69197 165751 -288555 -259663
12143 -259663 -37943 -62425 76572 -155644 248612 125586 -112589 -52681 198155 -111711
12132 -88827 -301178 -96672 -154763 179235 316994 309428 -43392 221770 97788 -125176 124444
12120 -349438 -96285 -300433 124032 -58136 343546 131120 -19021 28841 -61028 -100449 -171102
12109 -171102 243549 26649 -130216 -275428 -277019 60035 252371 -166405 -198119 105946
12098 23091 62338 254364 -197192 51282 61623 -225491 132479 -231960 -73634 7291 -107861
12086 -95998 -224472 -84383 -48107 63854 -156742 8976 -43983 172665 -108387 -38786 133180
12074 -1766 148658 -162394 60084 181268 80070 331991 -66277 341038 -211313 247506
12063 -40456 27562 69401 -4129 582044 730012 1343230 730012 425013 16122 -115958 91577
12051 328498 73743 -61666 9724 117239 -125937 32474 -169167 9738 -328694 -51877 12323
12039 -93191 -93624 206191 -183719 32462 144470 250754 -5052 241706 257114 39832 441016
12028 441016 -294937 -215460 40013 116292 -215520 23364 -136670 -431163 -27213 -133082
12018 -133082 -33992 78787 -74945 58074 -68323 332534 32866 -102597 64085 -230985 64447
12006 -36661 -119392 315602 -50279 -82570 104161 -96981 -88991 -99852 -13066 -144786 173937
11994 -344747 93322 -197858 392133 122912 43938 -294940 96675 -194347 56148 33121
11984 33121 147093 146447 -171214 -217628 -135301 -128452 13802 8987 78136 -69882 98451 115881
11972 115881 323005 -57178 77356 -124131 94691 223989 77793 -172156 -21903 21521 27988
11961 27988 -271778 35204 171518 -349083 -204763 33247 -253686 -49588 -237596 305069
11950 -190806 -126927 242401 179410 -54048 121708 -173215 90109 249710 150757 -26899 -337181
11939 -337181 -260969 66491 34126 3027 -87850 -12744 -81541 148587 65390 188517 29825
11927 -257515 -121469 322162 -333202 -13530 -136201 -109155 -197273 258402 17224 39171
11917 39171 129909 300794 -127624 -28072 20488 -26290 -217408 109092 -236498 -71151 -40330
11906 -40330 -27476 107699 -46370 12361 -168573 -10680 254689 50471 357547 -45399 -394727
11895 -394727 184947 20410 -62943 -227585 151603 39210 14457 -180157 112006 162849
11885 162849 176940 141174 100857 272749 301507 30224 -71213 57118 20871 42195 -353409
11873 -225688 -177800 12269 -23074 -131595 117368 53789 155720 -39256 45437 -5483 15144
11861 -272649 -218834 -70124 -291978 4871 84897 -210318 160214 -332050 136989 -258976
11850 216462 116447 45965 6582 13914 26577 -337798 296695 -27032 -188956 -30843 -351733
11839 -351733 -155094 228440 -79146 -116116 -15572 -20951 233517 82291 -23681 81216 78546
11828 78546 -221193 36685 -59321 59882 -38087 86037 78320 -214756 -183294 -88441 -106496
11817 -106496 -50084 -6143 -225522 76415 -283932 93015 155272 -31946 7932 -87665 335388
11805 -69372 126289 192384 60233 -119612 -196424 -98085 -21769 -30793 -26717 86862 -20380 -47871
11793 -47871 -9775 27354 205634 -191716 -228769 -88613 99913 244587 87743 235278 -129281
11781 -141000 146156 -223420 151486 -88514 -116475 -81165 121909 -109890 -95404 -113143
11771 -113143 141756 -313111 -330373 -112039 -151257 68023 78230 -75350 -299582 69154 -378363
11759 -348521 403848 -111926 -174559 -21818 -55572 81766 -82824 -59830 136806 96713 -114986
11747 135840 -14440 118671 -279249 -110862 54470 205183 -102364 278142 -158379 280174
11736 104609 -91712 39359 3401 -223723 -151772 135367 -257774 105877 -427153 64204 -44315
11724 -154286 -128702 213079 6741 226662 127635 5833 -227014 236173 -132241 -131374 -38277
11712 -143325 135672 95303 -115865 92204 151154 -287954 67384 -175378 12660 -483048
11701 -6698 118451 -345214 -8778 -106210 -210611 3283 -1742 -91799 123631 288186 255028
11690 255028 136038 -21288 -201422 82021 335919 -179782 450287 -141634 -133653 -199682
11680 -199682 318692 -297160 195844 -35163 -8365 63922 -128889 58980 56724 76055 -54350
11668 196577 86923 11087 -193824 -182908 -47053 -207878 29920 318520 393378 238050 61126
11656 74928 142121 -167733 95623 49912 -7463 -61944 260746 3812 -37144 175912 325623
11645 325623 59267 43218 179572 190028 111370 -219352 -282607 133193 -15489 33713 -188546
11633 247133 57561 49500 93642 223975 74060 440629 33980 -91099 66014 -227985 -101466
11621 219654 -125450 33026 159805 -264571 -47862 -37567 -167334 162909 68422 181021
11611 181021 119921 -72569 32660 -11420 43136 -95173 342822 212932 121304 174429 207975
11600 207975 117518 8953 45092 54389 -127717 359475 22517 371222 -157245 -189923 59222
11588 368369 127168 -91003 18834 155576 183628 -152856 85185 -38608 -32393 19215 42093
11577 42093 -196692 51433 -53488 -73431 238343 -239181 67631 360266 -101513 166083
11566 21536 213458 -30209 -65906 276979 365492 -271125 165439 135071 302941 -168344
11555 312120 385663 -381947 107177 -38797 128416 31607 418399 85757 -69783 246625
11544 121419 -390114 166465 93854 -36630 148746 335506 -339860 126980 81301 309685
11534 309685 222715 365362 -130841 -213570 190226 238020 -31504 11354 157661 178095 49928
11522 -360862 -300908 -249521 -3403 14007 150281 273599 138838 -11301 342818 -308394 346369
11510 138437 269004 317325 -36914 -12912 452103 -165299 128405 284086 -304838 239230
11499 173674 16607 71895 -90796 162320 144056 245888 413815 -86277 116419 75661 -34153
11487 148876 58683 -8196 21668 155650 -254987 -2310 -4008 120932 278702 -109933 34808
11475 141743 -222873 492783 -51779 183649 -97073 324950 90891 403994 1930 483113
11465 483113 403384 -187535 -16404 107503 6117 142557 183590 264344 263152 177397 311075
11454 311075 251611 54162 112267 -150154 119146 -137709 -238668 -69610 60883 85532 123367
11443 123367 240175 185322 49639 84647 159853 191851 25004 177888 164850 -108233 176689
11431 265988 112110 -71238 221171 -43266 42031 12482 104394 312388 -162801 48231 147070
11420 147070 -134333 132428 324744 -284690 -40642 -234118 -130828 159445 -34005 431005
11409 -98107 190084 -73001 5061 -155112 -121657 -132631 -183957 18850 323647 179140 -314308
11397 -100508 68670 -56131 95643 -228545 158386 12708 55811 308341 -147693 115624
11386 -59027 -222712 27670 -126777 -226260 187983 -210662 -360090 306570 -100600 60733
11375 155307 -33243 180733 -3671 -88003 -183687 -41637 75005 -299724 248578 67778 -92637
11363 125843 -71331 -105681 190027 -17327 -47993 -234977 198719 118936 -169 -96202 -84503
11352 -84503 467257 316432 -99876 -92730 153229 -11294 -280898 88212 -278508 331180 -114453
11340 91709 -193311 81887 -73082 -37441 102546 -275831 -10384 -182702 256509 -109052
11329 -95314 -24302 -262607 -374236 -173234 -159686 -48780 1041 -123993 350582 63350 -306642
11317 123768 71912 -80286 34730 -184004 73529 -22135 -219590 191549 132285 98675 460252
11306 460252 -6887 -72915 95490 -140059 -167009 -41490 -41663 -204349 -125170 17825 29452 -415389
11293 -227369 272116 183715 237079 228202 391636 -2704 170204 -79163 316189 -184884 -37846
11281 -140836 350 -206637 -120645 324933 -131359 -271042 -294703 -13700 -83318 139427 -65660
11269 -110284 -182379 197038 226737 134613 -179501 -436015 184345 -214762 -81501 67666
11258 -330654 -191788 -325534 -142119 -299002 163006 -169519 -132446 -24730 33510 98870
11248 98870 385170 191019 -28926 80881 151875 155806 -148534 196744 147930 7276 -41860
11236 -71286 -134897 -210778 184507 -25421 456825 200970 9327 26264 91892 110334 -112209
11224 -328545 55513 116154 -99415 128438 319513 -229507 361915 -4322 -85796 172095 -38241
11212 -67843 -144005 -409879 -296359 -42785 -259998 357 -116747 157101 13439 -8591 131256
11200 212096 -85786 -101615 -257509 -29436 -308353 183437 52419 -350327 -63857 -30096 173650
11188 -199268 87501 -67741 -272209 -476900 -349501 112609 -105717 -223222 -130091 -143698
11178 -143698 -35711 -81675 -52547 -12794 -288746 -3746 -245306 251652 -115092 82118 -89075
11166 170139 -135958 -338634 42360 -153834 13726 -78579 -306880 -44688 -109396 -148085 -363442
11155 -363442 4600 -9671 41798 104943 306336 -150021 203137 96255 207835 212233 -29235
11143 101263 50006 42220 164890 231901 186536 84515 -304793 119400 61897 548521 48016
11131 -178234 75843 6014 -161279 217192 245655 331073 -63178 -118946 -39778 133361 -272270
11119 34378 -373138 135282 107185 228920 58780 214618 2973 -78650 351667 198629 44507
11107 -233277 -81911 105287 239577 140974 393381 -77860 -70075 68321 -102727 171577 54330
11095 211766 317618 13673 151919 126963 186756 57507 446658 238507 88106 398818
11085 398818 -70279 186754 93001 339045 306775 526280 325367 -2726 264222 71978 236527
11074 236527 80 127829 324244 512801 519876 346319 314240 126318 436672 569169 532676
11063 532676 518766 314763 382916 444053 708660 526579 358190 535108 1023114 822794
11053 822794 671071 517042 623696 853159 442326 854770 348648 790434 350791 366828
11043 366828 670595 893771 1174044 661320 739727 461028 702260 577652 784732 355326
11032 773140 642367 415739 596207 676256 599975 990096 408482 227712 812260 921276
11022 921276 564253 558645 520072 635027 701722 468890 548526 278307 776901 430753
11012 430753 665312 801476 715511 445919 775861 670835 863321 566473 532191 508753
11002 508753 699902 727714 994745 740905 632670 648456 872413 1047176 294121 403043
10992 403043 755675 612010 897782 775119 892258 876920 722048 456330 1160081 920307
10982 920307 888937 939702 1391551 1524050 1750362 1651772 1706869 2544788 2487277 2597654
10972 2597654 2693922 2769711 2389085 2365917 2136293 2179161 1398548 1588743 1701337 1150830
10962 1150830 1488910 1596783 1593688 1469741 1202010 1313039 1811875 882222 1077981 1013354
10952 1013354 845107 808661 625723 484776 290453 384839 296662 -27216 352559 174042
10941 277382 200320 436364 92551 35130 101512 222176 10489 -81233 19542 -16082 390313
10929 86266 -114830 -184465 146504 306971 116703 317476 -219133 134611 -16507 125733
10918 -59246 54813 321428 218471 -219831 -275722 381920 -185096 214253 62316 257422
10908 257422 -44993 176248 108434 -37914 -113664 167163 4736 -154328 -29 -41899 -200587
10897 -200587 128622 -68238 17725 24603 -43925 -42049 -255771 -6592 85102 -181388 -167402
10886 -167402 8485 300 -150436 22363 66370 41058 -19350 195638 88993 -249667 -68519
10874 41420 -172039 316741 -188244 94740 -136567 147153 39282 53858 -41505 -119678 133078
10862 46325 -9135 -215439 167705 -183346 -33190 58859 205814 71474 -27544 176331 162659
10851 162659 -54657 29517 -10610 -50578 45742 28176 -40065 -196004 -78096 -329496 -55154
10839 -327663 258904 71494 286884 -24975 -57756 3141 -14769 -67551 8109 28392 -17733
10827 -159689 39960 225326 9879 -167269 -110033 294669 -176098 -125951 -58151 -171666 -44231
10815 -288545 28601 30641 -146494 -298230 -68517 -197032 -270874 -140064 -13876 12898 87287
10804 87287 169983 147828 -102707 -343344 70716 -227217 -208605 -69484 121925 -85033 155299
10792 13766 59345 -274495 49265 -41556 -180282 77901 -103716 69150 84114 244860 -195653
10780 -9863 -167459 -107708 -79118 49282 -1408 136091 66856 -127669 267232 -262527 169636
10768 295139 -40079 -272939 -41981 -303517 -42599 -231563 119681 18092 -46036 -252304
10758 -252304 224270 150510 -294110 218051 -196849 217365 201753 371947 -220913 -80942
10747 -156828 179205 -115196 23165 -118606 -76158 1050 -286708 -71440 -63417 144557 -275113
10735 -363085 -78269 -43169 101256 151145 60681 225436 -283173 -149795 1590 -321128 141732
10723 -13417 -221757 -54998 -34180 -129397 -45325 6455 -204569 -232779 4967 -215479 57609
10711 -116009 -322976 -274331 -186477 152240 -40991 58494 -41486 -98811 -38507 -345971 -28664
10699 -147274 -112125 -155580 -102913 94147 -278956 -269197 160551 -103355 -99702 -31484 -110972
10688 -110972 -39562 76249 -41664 135321 -3882 -21785 -59700 -177874 -250501 -216244 -96401
10676 -290654 -243732 38700 -184707 195138 218872 4625 133038 134115 152280 91999 -141024
10664 -91188 -389655 282350 -170030 4030 159802 -152743 -59799 -306925 -238792 -32065 47209
10652 -291224 -118451 38802 -52666 210481 187736 -123504 -17683 -27202 -330729 -93716 108179
10640 -286179 96656 15220 -83241 49328 -8160 -245735 -18103 50510 -152441 -57000 138038
10628 7964 38520 275594 -99132 143429 247933 -220732 -225428 306920 209486 -74564 56018
10616 -250207 -94578 182403 95780 -83698 -323344 -118459 53999 11911 -377322 66211 -224637
10604 -103242 268198 209007 -231839 130528 -48164 112198 -208312 69128 41690 -324580
10593 232922 -246814 195181 -139547 -93183 205455 188666 19425 -92462 197869 -239853
10582 -96279 -198029 -96644 71724 -413352 263106 -150075 27858 -245311 107850 -4262 -51520
10571 -51520 -413902 183126 -153151 -165139 -260088 9299 126500 10398 -100094 -23030 -146558
10560 -146558 -141485 6655 -19570 -158579 -72415 -24350 -119371 -77464 74954 -96748 -26669 258001
10547 51130 -97230 -121923 -13328 7389 -357703 105195 -143764 -156599 -111953 9632 -94802
10535 94581 -268035 -60141 240788 65617 -126577 -242340 110049 -57917 -216095 118712
10524 -44097 -261258 50089 102470 -169166 -173347 150698 240782 -292517 -127744 198064 -191353
10512 -192560 -66637 56318 -300893 49006 -256897 -216376 -187082 -95033 -5099 -253348 72040
10500 1743 -229478 -213466 -213922 -120444 -3134 -358120 -44741 99786 10882 167116 -211329 9158
10487 -123164 162898 48282 21563 270379 244388 467681 99852 348156 99715 198259 85109
10475 51768 -382419 226007 -129063 106927 150088 196689 -282621 -119768 -156273 -175020
10465 -175020 165973 -53739 -213630 92599 49311 27128 -31452 -74624 58444 -196684 -211518
10454 -211518 -62920 283445 18280 -70941 -213144 -336676 -39283 73693 56665 41277 65921
10443 65921 21648 -139740 198888 330003 -54543 -144239 -113105 -194276 50696 89265 67095
10432 67095 -118626 -523308 -100758 251284 -170026 170803 70763 -474247 254528 143766
10422 143766 217230 132120 -88356 -94528 -72970 -47273 120388 -8716 -342819 -195019 -113133
10411 -113133 6995 371107 -105478 106164 23402 -91711 -138470 -137813 -141881 -702423 247860
10399 -88163 48723 238741 -14711 3359 24308 323884 288548 462263 -223936 18652 282716
10388 282716 15941 -1078 122087 108090 175199 -24146 399057 61537 -454932 210157 10872
10376 90471 -3402 217171 -19847 354797 568832 378792 247819 262011 585564 545304 325022
10365 325022 389946 427674 564852 87928 406838 420429 306826 248868 145033 13470 286973
10354 286973 117863 98202 348875 430681 325916 518247 574402 -102600 251225 333516
10344 333516 193130 39725 -185665 147658 302794 471601 250639 220692 237756 250063
10334 250063 296561 5844 233441 6463 9414 194175 35912 310106 107410 -93251 20788
10322 294667 57440 142058 -300667 80513 -24634 87068 203849 -192755 -30838 202908 -111469
10310 72048 -230364 -188131 216926 -48953 -59226 -84729 58330 -207831 183391 1636 -121506
10298 221106 -58109 136208 -192454 -22764 -115537 -258227 -21564 27706 -74490 114195 -252447
10286 18133 -179963 82509 83551 -144250 -13016 86949 259236 -283126 59664 -92784 32385
10274 -291127 22700 108346 8538 20515 363303 -153182 -156965 -156896 56374 -135250 57381 143273
10262 143273 353149 94233 455019 285781 217718 116728 44887 151110 -77730 27364
10251 -326364 -100046 160454 16955 -314169 17442 -55830 -100416 -86694 100740 61870 34140
10240 34140 -83955 -460333 -97182 107081 252345 102070 -141805 297623 -27761 -10708
10229 -23044 -48337 58935 234265 -103066 236317 5040 -282362 -245931 58019 102823 229385
10218 229385 130041 257626 -5918 57076 -99778 -27474 -191171 1917 -118417 -267955 -140190
10207 -140190 -310158 -122945 -165966 110240 -163686 -164597 -174488 -19061 -246582 127596 -159577
10195 -52999 56728 -218422 112140 -198197 -129819 358671 -79031 181142 -349906 -330362
10185 -330362 122745 20421 55164 -23526 -360443 -316850 -17605 132294 -232610 172813
10174 36013 -102950 -1666 101268 -134823 29065 -105786 -4321 -253317 -91760 -1791 97946
10162 -176726 -13345 -86357 -157638 180728 129491 129929 -247191 28570 28012 -222159 285640
10150 183138 -40264 -68328 -94302 72018 154704 -57258 137153 -395493 -104293 83568 -102542
10138 14812 -105831 -244270 -131354 19491 11366 -107800 234415 78976 -139782 -44227 -37249
10127 -37249 -54558 -21127 165621 -162234 233689 -45455 79811 1083 -118274 7531 -326002
10115 -735 -487 108890 -132400 49690 -25659 -181031 -65929 99583 -64318 -263818 -240393 11151
10102 -319223 -172131 -257948 -343103 -166243 -142966 298940 -61647 -41554 22707 -79295 -131416
10091 -131416 -16178 83235 -72936 67395 -281640 3864 -246815 36305 375041 48654 24542
10080 24542 -64624 -153743 -161591 -55827 -181121 -322417 79882 -3284 -191362 143138 138341
10069 138341 48015 196155 -108504 5759 -194981 30102 -93213 477674 -28626 60915 -125354
10057 205543 31437 -120709 -353492 -173557 -141057 -243006 -69047 -46677 -132883 202281
10046 -189206 176308 3986 -68726 -112602 -224315 -32424 -62489 119979 188683 -224487 -2836
10034 -241274 -119525 -191982 -163019 48234 -328380 -164202 -61763 173959 -123170 79269
10023 59347 204446 -12356 318832 35108 -194496 -253548 80440 92665 -98939 8579 -452725
10011 -366581 -217969 -120960 161506 -249603 -262162 -219903 -118196 67484 -385766 -50977
10000 274172 -65181 -33295 -51589 -32711 140666 29695 -22167 250196 46271 39387 10360
9988 138963 67899 205106 19896 -336288 -135249 125004 183261 47013 246784 -124256
9977 16708 -78971 63791 -56206 285286 196536 -78454 -198680 -95088 -21283 -203786 136220
9965 -445322 255972 -260796 -212206 -176187 10282 16279 -355016 -169690 -303173 -265611 160912
9953 125748 74989 -95736 -135953 -152861 -443905 6009 -89041 54861 41039 -194390 -170299
9942 -170299 -187902 -8823 12699 -189110 -103835 115472 -374115 -160588 -208024 -43501 30738
9930 -37205 -156043 -204028 56036 -124962 135565 -318550 -23297 -301677 -101109 -57739 -114704
9919 -114704 -193791 -61746 -92710 95819 -39128 210223 -254943 96214 231863 123876 -200261
9907 -151002 136251 -42502 313849 142494 -104355 -90476 -429201 -204653 33484 -49311
9896 -560999 -93854 17454 203448 -28285 239568 -88994 -194080 -88842 -141111 -77973 -5840
9884 -84660 -46368 46589 -167498 55729 -90255 46361 -80462 -311438 -246041 -399567 -40303
9872 29262 -203100 -55330 125886 -10524 -65915 184147 81551 -11896 137275 169984 -87098
9860 -162081 45239 -175455 38223 219172 -258817 -129393 -103184 -390111 -128910 -84355
9850 -84355 -319 -5768 18530 -154693 -187269 -274687 -330176 349742 -98827 -933 122014 153997
9838 153997 -154760 -264902 -22444 -59280 -291124 59872 21900 -398220 -379706 75024 -300029
9826 201570 153997 158261 -275027 46867 -141418 -59020 -127033 -120527 403 128200 114984 17408
9813 -174880 -329161 -57931 231552 -174373 -89518 -85186 33328 387636 -193415 -36250 116947
9801 183913 -210689 -30775 25718 -5514 -16405 -22233 -197526 70638 -263560 -74554 -3368 -239867
9789 -239867 364432 27407 -40951 -61699 -159425 -197302 -321263 -341819 -94780 32469 -17092
9777 -306176 -10802 -21080 38402 -221701 -104157 -307735 -103604 -169848 136011 -68109 -190119
9766 -190119 276416 -66568 816 67810 76431 -231630 -349392 -265602 79573 -257210 217859
9754 178079 -143285 -45851 -349437 146569 -371275 95415 336830 92189 -394633 -73991
9743 -198915 -110355 -125042 27715 88847 -60523 481339 -308286 7242 78844 60521 -246939
9731 228812 -70538 95697 -243212 128100 -21928 -59223 90974 -96709 -25016 -291175 -645102
9720 -645102 199102 64196 66498 106786 -250795 -183693 217859 -251970 29881 -109431 -11929
9708 -15330 -137381 41219 -278903 -268794 -222001 -80738 -155568 337301 55140 -54535 -57909
9697 -57909 -260913 -112275 123555 -14910 -32196 -165632 -54069 196956 174008 -348070 116468
9685 26420 -108206 1318 -398839 -159829 188330 -130802 -130921 15151 -15830 -587835 -98714
9673 43801 -145942 258593 -50728 -60659 -12193 -18424 -91697 -89842 -82942 16847 -73416 277552
9660 91045 60792 161266 100427 133068 -26818 120875 35200 -2877 -263994 -50771 -44697 -320912
9648 -320912 -413004 -7780 149707 -279891 -291126 -18158 -143970 -87283 -20132 -207520 -206524
9637 -206524 -80191 -50751 -149955 -115964 19238 -138813 60889 148518 69976 13028 353222
9626 353222 -2270 -209740 24540 -50292 -221501 -132089 184843 -297260 -44621 -58957 -197571
9615 -197571 260382 -117282 -337607 118629 125773 -66824 -103653 297919 68656 -9755 -189726
9604 -189726 95052 201210 -95308 -114170 -151290 -152772 72442 54482 110020 -185644 -172652
9593 -172652 -4321 -49309 -475378 201608 -299904 230228 70563 -167346 -69013 316873 327337
9582 327337 -115731 -175092 41772 -109013 -109968 23784 -28662 87063 426922 174214 -62186
9570 -414040 -280835 257781 165628 -22436 -34840 -123313 3398 -292869 -297292 1433 126009
9559 126009 58483 345124 2615 -301725 -189607 70432 -473409 -231645 -345002 38919 -40274
9547 -281685 -139514 -393616 -70630 -94765 198093 46805 -200717 157122 -306229 134376
9536 -60574 -164365 -222486 -94675 -282449 -55632 209349 -176123 -185906 -132638 -346095 -123991
9524 52885 41922 -219759 27867 -197680 84298 22126 -63359 -39627 -331597 -62649 57600
9512 4392 148060 202952 -24360 20682 -265315 -31087 -139799 -513459 -148066 51602 60280
9501 60280 -141757 -33412 -242029 36852 -123302 48777 -67389 -291558 -129679 -528348 -81283
9489 -111095 -388966 -122482 324831 -13685 -67664 17676 8666 -13226 -421637 -151417 202421
9477 153946 -48320 -362573 40875 -229133 122554 115497 341671 -44751 -56125 -230219 90812
9465 98255 -67723 -84320 -89769 297427 9152 -368258 -322495 94746 101442 -90970 -83166 -179650
9453 -179650 -96453 -277361 -81748 -163963 -8444 -128225 -135330 45495 -342087 -42103 -98417
9442 -98417 129173 78226 -265892 -427979 176895 -4214 14555 -137638 348466 -195432 77909
9430 -152350 -159176 88845 137899 196467 -230764 107943 -259906 -57195 57108 -88687 114214
9418 201784 -273934 -175944 -578266 -44271 -89328 -310106 -66302 -228754 202925 -279429
9407 -264813 -176758 -195139 -87978 101686 -236347 145876 68013 -13335 -30206 -22520 166008
9395 -227648 26051 -246285 -192273 161131 153968 -168693 -185203 -299260 167079 -85761 38389
9383 315138 22060 -805 199587 179071 30512 -15273 -21859 -16312 -87363 359272 33103 144470
9371 144470 73206 -29690 -48753 -2332 40267 -279527 55283 12474 -346616 -125340 60944
9359 51813 -259602 238323 -11396 160368 -63885 -213678 -26260 -221432 -12869 8677 185831
9348 185831 -16897 192896 -260040 82889 102572 19614 44203 133686 312095 -219460 -26923
9336 -56672 -191421 252937 230186 -92907 -36226 -38237 -121705 38722 -71621 -192070 -77543
9324 -38165 -226885 -278215 -283 -224248 68991 79447 -262938 227504 -8569 -353244 248139
9312 -188344 -54281 91452 -118019 -198458 -261936 -319492 26930 -148402 -290585 -367707 -166109
9300 -79383 121387 -13414 115093 98327 179070 -925 -402471 24344 23318 362465 -131813
9288 -110488 -122450 197 2731 -1769 -103267 -430275 -188131 96165 156973 -334771 -37828 -123455
9276 -123455 86447 64552 79390 146828 27790 31187 10374 157219 -148503 -79601 -193842
9265 -193842 -252357 -172940 -49047 37221 -189226 37955 184488 167310 -361292 -435742 -22997
9253 -318329 306355 -187452 16132 164085 -174365 -59196 -151589 -47444 22501 -251939 239511
9241 168985 63472 -250331 60505 -148019 199107 35347 16021 59278 68113 -46598 -256946
9230 -256946 179028 -131337 121348 -116727 -241535 -41046 -22610 -120001 -174927 18817 -292863
9218 109719 -281760 -52620 -122098 -328368 -157776 -288322 -213729 -169861 -3022 49513 71977
9207 71977 -6623 -50368 -114301 -189480 -138925 128871 -25964 -22802 -81888 -224453 41341 -38913
9194 111178 -25736 -326933 -194162 -15883 378817 -41611 -95984 -229232 -16360 58863 -476646
9182 98073 84447 -73694 -45718 83821 2029 54891 17347 -46841 -203069 -227422 -231595 -357201
9170 -357201 -303927 -151998 -106099 124932 -93598 -42475 260961 -39184 -213363 62947 -99908
9158 -48810 -71242 195517 97881 -97546 -117242 173729 -63373 -161708 -181164 -15539 -66781
9147 -66781 125438 -280944 -183903 -243389 -287618 45519 -58803 -86397 -162512 44494 39145 -24311
9134 98688 -165993 -358405 47982 99135 49131 -231780 -220932 -247789 92863 16839 -65303
9122 -246036 168930 -166669 182301 28554 107036 -176847 -201035 433905 -109756 176961
9111 -39473 -149637 -6564 5771 -252068 -112791 -415 -167009 -202933 -89134 1845 -302347 -50359
9098 -109688 63117 -207485 104822 -26216 -151600 25387 241379 95348 -140386 19981 63474
9087 63474 -283101 -72657 -89459 -121606 -154381 -118457 -185082 -203727 -160767 -53886 -201427
9076 -201427 -37812 -7145 -83928 -16147 20960 61351 2502 -8712 -36065 -19408 -227376 -352366
9064 -352366 14023 -44175 188265 32188 -75633 -261522 -62026 105154 -382983 238870 -126061
9052 -9916 -6286 -30432 40454 -140500 339584 308893 10569 -82730 -141868 95738 17538 66641
9040 66641 -36804 66555 -56171 -164880 193094 -126297 332080 -3308 -264305 50937 -138057
9028 112782 39771 76102 -241004 -49013 343 48377 64875 -99556 -147468 69223 -262477 -107114
9015 119360 -101822 -117598 -98450 -80095 519661 -323568 -33292 -531709 3345 -98409 35335
9003 -74314 -189304 -119298 234716 -115349 -82585 -28656 -102857 -223263 4278 2930 -393261
8991 157250 175595 -229208 -69965 -303294 -45699 73700 236850 -30102 67314 68222 -146761
8979 2985 37456 -390298 -245084 64621 -95922 -127134 -125063 -28957 90837 263905 182125 4559
8966 196196 -321256 -116989 52960 203354 11952 -62726 78251 233816 -280202 -128238
8955 -15502 -93938 -145097 -123197 -287415 -76943 -117844 308155 -21725 -272480 15442 -290254
8943 -103282 1211 -140647 267145 -136095 -105395 -275841 -201235 -114535 22473 -259437 -182749
8932 -182749 7760 -323309 111322 -255185 124986 132467 -212104 102943 752501 1833018
8922 1833018 2297438 572164 496446 391099 301604 54247 -56299 -25069 170293 56256 332163
8911 332163 -112568 -3853 -116876 -253999 -144100 -111300 -71334 112867 22600 27631 -285864
8899 86932 -280462 -9797 -107638 -125657 31482 -270604 -93121 -109475 60051 -18788 87342 183796
8887 183796 -96311 -119329 -216360 147619 82734 -135599 154634 -91388 -192167 -108008 79533
8875 78578 13671 -99497 -192430 -248545 -205247 9186 161623 -70437 -343147 -380855 -150446
8863 125005 -212218 -103436 -89582 -77595 115193 211482 186495 -385061 -156702 238979
8852 253615 34585 207603 -95953 -155960 319802 144956 154088 -126933 -208093 -36137 -49423
8841 -49423 -266440 103196 -213801 -51388 140684 33485 -106321 -83434 -201821 -78301 161720
8829 -108322 -169738 147780 -112214 -9768 189506 308801 154697 64274 -98040 131984 -263573
8817 -2769 -362738 -49732 -299881 131106 -28809 -167175 139045 -125333 193760 132540 176470
8806 176470 39949 -3945 -142272 -177622 -348556 -340875 224597 33431 108640 128196 -8304 -210283
8794 -210283 53675 -236027 16409 -113690 -157365 -5767 -41974 141492 51648 -74965 -129636
8783 -129636 0 -258099 -33177 -135073 -220921 -489227 -139942 -65140 -102483 19669 37270 385511
8771 385511 -229826 -103414 243238 283756 -171999 -111354 -120944 51251 5669 -60621 41340
8759 -551701 79890 -90727 -59144 70950 78278 -23127 160234 199763 -314856 94305 -80116
8747 476990 48918 89994 -69465 -144213 -194090 -250126 79361 -213797 -64450 195121 425057
8736 425057 -18833 154476 14789 200543 -264503 -33989 -59995 45721 -125921 -47631 -9140
8724 104474 -247676 -66381 140359 -238696 -242369 216704 -51687 -216715 110739 67242 -13231
8712 -132718 -138607 87055 114934 24829 102690 262986 -14523 -251114 64520 -430505 23245
8700 231007 -282775 35189 193355 -232783 222870 94943 246710 -253732 169207 -8811
8689 23282 38901 -98929 50234 115630 262555 -355921 -242130 -181926 -7270 118093 -183034
8677 -49093 -136095 -150856 -48725 -162877 -19285 141282 -137027 235398 -196815 47467 -346895
8665 -200312 -126422 -149217 -165401 -266865 -178247 -158252 -209375 -21597 212856 -2783 112168
8653 57591 61428 -201927 -219078 -26175 11869 -176397 227172 202423 91671 -124373 -326171
8642 -326171 -43537 -102941 195652 127917 105830 -142258 37020 164824 178271 243821 -74385
8630 144894 54400 161071 179938 -25763 99689 140087 -104666 -50246 163595 87745 -128701
8618 -165429 60349 314708 -120795 -53189 80708 -169942 -284886 59714 -49078 -326099 -395086
8607 -395086 72666 -103663 16258 -195561 -139376 -28589 -54276 -48589 -314276 -28760 -213047
8596 -213047 -54380 -132665 50210 293187 -153011 42873 220519 -25239 256341 -106897 148653
8584 119026 -54111 -52946 80286 -247540 -202947 -173808 80355 -152637 -254725 -57602 122425
8572 -226138 -48340 222795 -71975 -53425 29403 220695 182484 -50474 -251611 -67864 192903
8560 13597 83893 -103886 -254989 28351 40123 -45816 -172323 154437 -267530 -122541 -195865
8549 -195865 -237605 32033 -23473 315927 -55212 131974 -219179 -139361 -237710 -256117 -424132
8538 -424132 85351 -116392 -89468 47800 -95727 285859 -235863 -160025 -65665 149716 21309
8526 -39740 -281000 -3291 -84120 -142817 -132948 291536 52910 169290 -268157 40806 -67856
8514 -419654 -53143 -260841 -154839 -51144 -187429 -83718 44854 305152 -3160 -137259 68804
8502 -124314 71025 -149804 -60778 325994 -127076 124056 -209544 -3376 -84494 -171175 -523944
8491 -523944 -408928 -107152 230985 -210365 -117437 -210035 -96140 19230 -341337 73909 -503108
8479 -173448 264886 -64144 -12204 -133754 -165006 87042 -270638 -462440 75440 -138552 153653
8467 10183 356232 153176 -190295 94889 -205212 181230 -79589 16508 -257425 116308
8456 -141944 60903 -90510 -109634 -204491 -7442 -59710 -93694 -239790 -37686 -32503 111426 -175762
8443 -234357 -247664 57449 11445 -490650 -343738 -148246 -31792 -198738 -1214 78182 -52860
8431 -148155 -167602 47791 -78830 -18133 -110330 -41841 -119839 -203355 174685 -2907 68211 -176664
8418 16173 -113363 96365 53937 -160545 170222 -284877 45729 -89966 158007 298274 -23394
8406 221149 -20777 -213699 -227374 -33189 -291847 -28788 -107366 65751 15448 -74742 -168008
8395 -168008 59743 -377407 77893 -150148 -339515 -133612 226076 -291117 -3070 135832
8384 50827 -360920 -108637 -38863 234944 173516 42855 -84326 -211882 13107 -101155 123718
8372 -277203 173381 -17974 96831 1737 -5859 -122736 141935 -223979 24154 79501 77967
8361 77967 -55881 -62521 -42839 2587 225309 -350311 -228584 -81878 -25531 -241013 192828
8349 75506 -34693 -170850 185698 122144 -187084 -254127 116756 24645 21787 77614 -315972
8337 49589 -30463 -52293 347660 -99994 -133382 31477 -137714 -51108 -346334 -220567 -381466
8326 -381466 241284 101472 -202369 21964 110444 123899 -477463 -86308 -192390 102007
8315 -13192 211718 -29803 -248060 176687 21150 -258514 -55141 -135643 -27817 94324 11521
8303 213659 140451 -194972 -31 -187103 246298 -63258 65694 -250644 -61177 67640 -118041
8291 141664 -209803 -128165 -215388 -53499 -243033 382904 -60656 -87858 -91965 -162356 -32646
8279 8841 98476 -161449 -86785 106480 235138 117012 325021 -203953 -1233 244531 26057
8267 -155709 24171 -225775 -13760 -67903 288019 16601 -54505 -174128 102292 194930 -144247
8255 -163178 143382 26196 -49548 35064 117331 13685 220019 -140500 166397 -86168 -90779
8244 -90779 -123396 -85166 62299 -29468 -1591 -305084 -189713 9732 -70793 -246526 -16655 -266440
8232 -266440 749 157329 -406468 -39529 76 80020 157581 96165 -75962 -82493 256383 -55099
8219 -290115 -73194 287362 -174317 94966 -209290 -330625 210000 57133 -31286 -79921 -108484
8208 -108484 -249367 -56427 210171 206244 74847 -26124 29958 -271952 -23532 -154707 -4575
8196 -237629 -84169 255530 -59431 -6518 -341218 -313527 -191300 -233003 -38712 -479995 -95905
8184 35434 -279519 136584 4621 -41009 240583 -86648 -202706 -84790 -35924 -168110 5836
8172 72802 -69733 64399 -182227 -73412 125285 100646 -100997 151575 -19131 -27945 175555
8160 -344033 -12345 -46978 112005 -65271 29441 48629 -139452 -191202 165870 2284 -188410
8148 353701 -438125 -107186 -242682 -40049 -118991 -219663 443747 104693 112873 64327 70580
8137 70580 -166300 -79175 276770 -41869 -65003 -54488 138149 21274 5251 -30026 113792
8125 -135060 -126954 -80564 9973 137705 -57130 -150934 -7684 134141 -365883 -57436 -337394
8114 -337394 203228 -285989 -135988 -105253 -77180 -94913 -29578 -61661 -59417 47888 109004
8103 109004 60109 -53515 -187116 138119 105061 -55546 148903 -65008 -199072 184237 -36974
8091 -29113 -44097 -85242 94637 -160834 12451 86510 -53488 198615 -71462 -61353 8461 96572
8079 96572 160563 -22168 -2324 289752 2301 -164890 213131 90189 144618 -82872 -249641
8068 -249641 -406972 262074 -187121 -119445 -1374 -92766 -115859 -5030 -100860 -263081 -153512
8057 -153512 -253412 -186772 -20382 -187768 77090 300127 335777 247882 131793 250977 107583
8045 126481 150669 21169 -299090 109792 8139 -210524 -133445 -200073 166002 -106359 -197814
8034 -197814 -131118 -150497 -145705 -41482 -69064 282148 -297707 -139988 476 -44454 151064
8022 -101162 57723 -133297 -119988 -394271 124544 -190259 -118395 2077 -66544 132467 -102240
8010 -62268 29889 -179697 138197 -199825 -224027 40234 87417 -85823 -28931 -78842 97263
7998 138521 -38389 -171944 258127 -26291 -37462 142451 104701 162728 -348681 378773 54110
7986 -190932 72795 -238310 -139128 -187347 45641 403251 -35433 120261 5758 45332 145460
7975 145460 -448367 -150061 -275993 -72228 -93164 -70080 30469 -24701 100576 -84855 -76478
7964 -76478 -303463 -174042 80915 -119446 180367 -152635 75310 -127575 69692 54010 -24327
7952 -165886 59371 32721 56767 -192393 -177232 -244439 342074 316499 510884 -38542 -12172
7940 -15074 169770 -112423 -220947 -398958 -23827 -377680 -225458 -87635 -173018 -366624
7930 -366624 180265 -181144 -111673 253722 53798 142182 240159 -414473 -48411 -205319 -11028
7918 -362462 -31866 108175 -123444 -101509 -7563 -19996 -14176 -40766 26645 -83916 144882
7906 -282085 99674 -8039 -255194 73956 -228205 43183 153256 159091 50537 -79847 -23801
7894 -42723 373048 -25306 40854 -228112 -379136 80296 -128897 -28641 -63690 -189725 43521
7882 -220938 194739 104126 31375 -243228 208251 -120640 -366976 -289336 -104042 -158589
7872 -158589 -117370 -182202 38357 -84442 208558 110201 -53979 -149366 379011 -66548 -229883
7861 -229883 -66769 50247 -192344 10668 -28484 -101844 -156153 318452 310702 251995 80282
7849 55411 137318 -63298 -214704 101636 -287379 -140160 68157 2646 -136465 380226 -65349
7837 11782 63026 -233119 -150350 111267 -178372 101819 87193 -193554 -174297 -33660 -285320
7826 -285320 -168229 -143043 -48359 54404 248514 95426 -96089 -117497 -88621 -61014 91574
7814 -24246 -187437 660 -369273 270244 54127 -307147 -88919 -223990 -206089 -141722 -115370
7803 -115370 150200 14190 -86179 76109 -374003 -140060 138952 12327 -60587 118955 323134
7792 323134 -33279 -69773 -348225 -165319 -69431 44717 436246 -39122 143925 22018 -70450
7780 -120273 -449533 -63583 -98915 -94858 66813 172105 -367332 5327 43309 -193243 -70257
7768 48458 -75968 81753 -243018 67041 -42001 180160 103699 -205456 -104211 -31875 56559
7756 -44266 -142377 67062 -251884 -12301 -48413 -206868 184948 -346957 -156067 -205254 -7399
7744 29148 -192783 -59812 -158810 86047 -96841 72403 -120853 -251622 -326396 223070 291273
7733 291273 101954 -23931 172065 -59256 437494 -274808 -226933 -41657 -393988 66397 133910
7722 133910 -2631 143448 3387 49547 301983 -8986 -117269 -236893 187673 72966 -89759
7710 -82321 -81368 -79386 -10767 79450 -337158 -41510 62233 -240586 147234 -245068 235605
7698 -16317 -31549 -27328 351999 -10674 -293124 45052 -232820 -196442 134709 -26844 -89287
7687 -89287 -123779 -324623 -220979 94204 225092 -227042 -100859 232594 -19254 79062 -29786
7675 112423 147019 -208403 -102067 -220493 -224941 -497416 -1083 -251913 -71235 -88785 -44120
7663 41435 78632 -20514 -168026 -162092 -14262 -283580 166663 -33552 61527 334290 131541
7651 289608 382331 52535 -236904 7550 111367 144522 214368 -65189 -67659 375664 -289292
7639 27246 76345 37158 -93422 -40599 -31277 -226941 -107222 -21281 -173255 10227 20907
7628 20907 142332 -32066 -131365 -5545 -194294 -57853 84553 -69610 -57755 78508 -171647
7616 -424817 63256 -232594 -139917 171800 67494 84218 179388 101147 243134 -258574 -265415
7605 -265415 -74944 193901 -167155 -211222 -175930 26655 -176844 56187 235008 79846 -38327
7593 -245269 -489853 -227944 -212886 43062 -329673 29758 -179360 -222389 224871 35181 -223206
7581 60778 -118475 89610 -57704 -34706 98530 -218908 54761 161587 -44796 36721 -21811
7569 -187766 -277349 -126198 -119497 104400 -235285 -262948 61930 -88555 -69789 142585 92609
7558 92609 -340418 -269690 -206511 183149 51511 139308 193777 -364791 -183346 106059 -454417
7546 125994 -7401 -272530 -5 -220277 -11771 55589 23727 130126 -253926 90690 -77480 -21099
7533 5034 -284029 -164236 186606 -171061 -218341 -28664 198523 310402 127557 -163397
7522 369688 51653 -125216 261196 -478744 303198 -370685 -22534 44944 -4406 -154886 -10071
7510 80775 62550 -195336 -44455 -113641 87836 -137634 192039 -31817 221395 -167979 -47636
7498 177735 -70504 -178383 55089 28992 58326 -245868 -83269 56 -57060 118088 -205027
7486 -19824 53657 62122 -217247 253296 -132288 -104247 220389 -15801 -282978 -233811 161131
7474 -65946 -386910 -275906 -294568 77503 -40493 122857 241916 154850 191724 320895 -129904
7462 275718 212703 29156 -204967 -48559 183711 116312 -225231 -104522 31586 -228211 -174893
7451 -174893 -55000 -399124 -32173 -95420 -64425 -112778 -28793 -15099 214146 -302626 529880
7439 150436 -89064 -41692 -111313 32997 184902 -161372 -221972 145278 45022 98489 379126
7428 379126 -210027 -158518 352465 55694 -53129 -356280 1671 -150184 63871 320903 11566
7416 -22615 39377 -96658 -208394 -73543 -119090 -298074 -405349 111533 -155345 -195014 176476
7404 -56998 -138626 -262554 -244930 114170 -52456 52469 322754 192478 -95786 100267 -32468
7392 -375062 -330436 90956 4610 -203607 162816 -118775 367041 -175211 239846 -276114
7381 139642 278814 -259018 -96604 -8367 111326 -44346 -13436 133345 -19908 -135820 -36659
7369 -33450 82937 32874 -87311 50503 -77573 -155214 221877 16587 -296251 89954 -142503
7357 100446 -251789 38923 193940 -118847 -283909 66261 132739 134784 -285059 5995 -136591
7345 -232470 34963 -19947 83702 -18758 -89849 -296304 -242820 78282 -200439 145824 16543
7333 -164358 -157938 117094 75107 -157470 -510496 -196937 -73580 307048 -212841 5858 -33376
7321 -154615 -21262 -49052 -93446 140581 -277992 -72027 -261002 38670 -207727 -190717 -48626
7309 216281 -109728 -377333 -130556 41988 51115 9942 -247385 166937 94978 -31127 -13531
7297 -31064 -115858 -290644 -90029 -70256 -229858 -127755 5724 -129487 -211059 -96772 38477
7285 92812 -18442 56734 145647 -162498 -105877 -470238 179671 188501 -64059 -167074 211566
7273 150079 22591 -7032 65614 -150909 -244 50680 -19585 138088 207311 264273 -26936 30323
7260 -26731 -236796 227238 138612 111456 -35322 -101431 -21928 70439 180152 -237480 16446
7248 -24638 138845 210636 -294539 68803 47273 77926 -351 31451 -86615 86782 89055 133454
7236 133454 -196061 -109312 100156 -43686 -117244 -228915 255706 -26891 150765 -244747
7225 -79053 -58059 -43889 97308 -284788 -96009 -90489 -115518 191309 124612 113302 159672 49233
7212 -225966 -28851 -246540 210478 -98280 202487 -31384 -202710 173379 -8348 179 -151339
7200 280325 169714 -56550 82521 158445 -67265 -213123 118200 -74137 -80724 108266 224844
7189 224844 -101664 -115982 168981 -306614 -217356 417641 141058 -98776 -113615 121459
7178 81701 -310609 -466048 -47374 -14172 65247 -78514 -103853 -157335 104015 -251152 28612
7166 -271207 -303754 158473 160597 -149375 168952 -180733 -135831 82836 -68511 -117412 -132231
7155 -132231 150781 12624 14302 -143677 -26741 -28655 157060 -334030 -258024 -276154 -463675
7144 -463675 -3429 -162641 273823 -166290 -59420 -122495 73792 -66366 57254 -219378 177985
7132 147663 154606 -293386 292505 -201022 -232705 157217 -26578 -130814 -243097 226273
7121 -272673 -154718 -284741 -204436 171238 -187954 -410106 77873 -68699 75583 -29915 39787
7109 -55662 102462 -268550 -40966 67884 10993 -8455 186867 -210000 -119151 274064 313271
7098 313271 -115304 149419 -450113 -236418 173020 -232439 -248952 38998 156389 -336639
7087 -122126 15926 71561 -84211 -313438 -174024 -154204 64147 -10642 -182933 173751 -176293
7075 -71549 -151710 -132819 -173298 -64726 -114763 -227275 6353 -199997 -1761 -89103 -87255 102075
7062 302193 459425 -12336 69834 -50876 -98701 134552 -245202 -65655 -412 -281799 177879
7050 -234159 109138 -250511 -183947 74459 13731 219298 331521 -6071 51563 101927 -43750
7038 31360 -61119 -146509 34510 -271515 -526281 181920 30446 93560 -456116 -269485 6384
7026 15203 36786 -105287 -118257 -152130 793 -57981 -81276 444023 44412 162178 -5779 -21995
7014 -21995 44586 -6991 -267973 36298 226705 -30485 121613 -85330 -20388 -179018 -166879
7003 -166879 -5743 12276 151648 -406447 -138532 207055 -336384 79727 -334323 235859
6992 61222 -19486 192244 74017 -51137 47416 143977 -76902 -20017 -191149 -25718 -41744
6981 -41744 -171070 92722 68278 144652 -140799 -222083 -241567 -72922 -84088 -140979 287020
6969 -5461 72532 -201989 -83772 -61640 -142725 247940 343045 245890 20652 16192 -245808 -94504
6956 83201 86714 181298 -589941 62339 -176728 -43185 -48235 -14226 221343 -61626 -32676 -255453
6944 -255453 -275776 -133027 -20412 -56057 457207 19555 1714 78898 76023 169881 23506 19884
6932 19884 -4856 -131960 -86148 -127328 -148200 -120479 17695 -98845 -128513 -5881 184961 -10381
6919 241033 29290 -309133 128841 8097 -161722 -28031 36954 -390136 142330 59004 202590
6908 202590 24011 47310 52925 63245 -60857 -265515 -87878 90263 -69874 -96689 -131877 50370
6895 -24914 19563 -50952 37172 -114829 -112481 83298 -199649 234460 87160 140224 -30208
6883 -173035 141516 56784 -247173 94464 -317000 116580 264300 14853 -26843 241144
6872 149509 96492 123574 180889 -719 250907 -168294 -196770 -63782 109377 14290 -124340
6860 124333 183033 19376 492268 131455 16884 115471 72687 -2247 -43085 -309720 91209
6848 64052 63054 -61000 -184848 50270 -188372 23622 -292591 50638 -413474 101102 -204541
6836 418472 -76420 54082 -158948 -138867 -103321 5631 -102146 -183421 266680 -231751 -47539
6824 54881 -156931 185106 73828 88075 100092 105966 22464 -218447 75841 16018 -100896
6812 -55403 17586 125229 -147456 51343 9545 -236769 97280 39710 -505624 -224070 -54813
6800 -164359 -51937 6646 40918 173983 -189592 53605 -212995 -23211 -101398 -4997 151965
6788 76163 -131784 -269199 106310 364619 -19970 -27085 -183732 58626 -123701 105436 -94615
6776 130578 -129685 -133714 475030 -59218 -51562 49102 -68739 -105692 -8345 67888 -40209 -33478
6764 -33478 373159 -56367 280344 -186125 2308 328356 257578 -177263 -24298 64915 -19982
6752 365777 -7347 -66575 361335 -207114 259904 298292 146246 236297 -44794 81533 -7377
6740 -48937 -138236 -170909 98426 130813 -167496 34267 76515 -434849 -48448 130160 -223964
6728 672240 281438 53287 -185763 144734 60055 90849 328402 -210785 -140734 -145795 136331
6716 227945 88134 -233288 -145327 -10745 -45688 314319 -50757 -132195 -23373 -48646 -23492
6704 -160132 91416 94534 7890 254065 -59761 132840 -179861 -41535 -73466 126239 -342027
6692 -18449 -109531 -28739 -136526 25849 -288381 -137703 -127680 87086 -22241 -318855 -1285
6680 -198172 44374 -298704 -154442 -113629 -101641 -73902 32515 -73041 -41945 -42644 13245 -107741
6667 -131211 270736 104669 -223040 -181393 -112524 104383 6 22125 236528 -144568 54133
6655 67353 -83153 -67021 103932 103383 -78920 -102688 -480573 -233418 208266 7572 174975
6644 174975 93117 155579 -14306 169893 -153630 -73786 -93342 149807 72301 51768 -77368
6632 -129865 -99123 -131998 -115668 65217 -69425 -190712 -235729 91773 -58993 -95085 87001
6620 -244698 -304655 109041 -104711 219293 20594 44371 60530 253556 -15504 -230468 232040
6608 155307 -349867 73205 188317 -265441 -1833 -99466 50898 -45852 146243 168062 107611
6597 107611 -13960 -92540 141659 -235995 34572 -2844 -204324 149843 -4217 -139031 147148
6585 -32392 128419 -99407 27195 -6456 -2374 125825 277625 24880 138087 -125366 -121662
6574 -121662 -319396 -134535 39695 395554 -47611 -247892 439214 -253812 78904 143279
6564 143279 -56632 -152052 200539 19407 -373417 -98655 35353 88095 -134228 -24824 183740
6552 -97349 -49440 -40581 -21241 -322961 135427 207837 87923 166547 -26013 -112835 -78134 -81630
6540 -81630 333779 -87554 8377 280579 150386 22789 -223530 149051 127134 -8810 213288
6528 -341320 15932 45519 33035 -311917 -55364 -253369 -9059 -132146 -25174 126 125639
6517 125639 246883 -82833 95007 41662 -15357 -231991 -41577 490732 96360 56145 190469
6506 190469 -7836 -108000 -320483 -34130 -32147 51210 36593 -30708 213791 161029 -58632
6494 -42295 -112392 -129675 -74998 413902 115078 41622 267244 63271 39876 161923 -65204
6482 -78679 13249 19857 -207306 -324603 54657 -80394 2572 242947 -74145 13200 -46997 -253539
6470 -253539 64565 3779 -7976 209126 134499 118926 -25883 -117512 -4344 -412171 -34401 353252
6457 282005 -106213 240676 -211206 104589 -79033 -221132 51857 -49219 -125407 -36798 -458269
6446 -458269 30502 -34270 -160671 -54532 -5252 -92807 -8324 -45939 201254 -184244 -139049
6435 -139049 419759 -230313 -57531 -235938 -172488 241786 372349 -17705 -54939 -126904 -301443
6424 -301443 67359 -50533 8068 81239 39060 45046 -116588 -196667 -55283 83965 147828 -124471
6411 288807 -55363 -203781 187717 183315 -47792 215277 -71672 -56188 -3781 17984 174440
6400 174440 42443 -20179 -130475 237550 -131347 249849 -192189 67573 -208537 93422
6389 -243724 -180108 -249379 256726 240726 -91175 -43614 77017 234691 -46690 -79027 157844
6377 -23549 -75035 126880 -25449 156582 176636 -11699 -237382 -197637 -266729 -22825 -119991
6366 -119991 50556 32038 156763 171996 -77979 53769 167038 135517 -99376 -276504 -149
6354 253245 -296858 -300428 -357456 6801 -120137 -98812 124476 120042 -18134 120412 74046
6343 74046 -12960 -130917 -131023 381484 -342526 163331 -19280 183431 64947 208948 -130840
6331 134520 -380539 -218306 146685 -285667 153163 76400 -190084 -126718 196965 98176
6320 214017 -31313 108202 -142458 -73373 -223638 53405 53968 50002 93204 -62464 113691
6308 106163 -242450 -163561 178345 128450 -71043 -121619 -198778 -324097 -216483 -101803 48645
6296 -164897 127498 -30383 199917 -152077 145116 51335 -110534 198520 -183222 39829
6285 196171 11861 222551 51652 142284 111884 -118534 -128320 438256 47525 -88580 60227
6273 -260925 165952 -337461 464741 -240060 -11452 75158 -205994 -62839 128147 30932
6262 -190563 415880 -131303 115548 61061 -250006 5854 136360 41793 -250748 80180 2724
6250 -61231 320603 194750 37759 -45536 -70460 107208 -178127 -22726 -102594 -154744 246285
6238 -152523 -52422 35910 -77840 80199 -98575 -88669 -172138 -40470 91785 -120259 211998
6226 43289 93080 9060 -215101 237033 -34221 -16359 -83781 48832 178352 166037 -235490
6214 -462 -3867 -43447 326047 -169546 -161464 -75052 347264 108638 166416 -88362 61701 31638
6202 31638 221416 -82004 -415290 -53362 13091 261864 21132 -65534 43132 -197650 -132506
6191 -132506 136270 -54267 -68448 -11901 -200214 -186038 72985 183599 21526 -393600 -27791
6179 126611 151611 -64591 230120 -48670 127576 -285191 76302 139751 -1762 150868 160955
6168 160955 192905 -120858 96003 -136167 21629 -61393 -122904 108393 -247567 -50881 70207
6156 -128302 -48889 -61649 104768 -183512 439789 -298840 -27902 423074 177024 -62087
6145 16343 -84770 -26941 149493 44800 -251011 -258343 -200504 48015 -101382 -374987 342634
6133 168979 -53111 108060 115965 18372 87813 19144 -149407 -223137 186065 -123681 -157479
6122 -157479 108057 158578 48814 -129845 235566 39247 34141 79056 -5855 357923 4050
6110 -244560 -30194 112093 -260799 24469 4060 -77698 110630 -26523 349908 -170422 203829
6098 -222737 299561 165300 -96997 199793 240463 -15925 -2235 -71838 72449 3447 -249479
6086 -28226 146254 222651 -406879 -213979 -180135 111966 -152983 128479 -58085 283348
6075 77372 182350 234596 -81844 -481023 -139036 86890 -8883 328344 -104905 -208193 -116156
6064 -116156 -93971 -342338 -74998 5289 -51339 -111147 -274989 70597 96089 -405396 293913
6052 -57263 82335 -13070 86144 116086 -96769 -217031 104557 -59714 -4650 65208 49158 -39047
6039 -238680 -250440 359203 42458 14735 -18717 -193631 6812 161026 -450606 264230 -58914
6027 -34826 121620 38521 62088 -160877 -111887 93856 -30189 -87941 187284 110540 -109486
6015 713 -69928 -272359 -57348 -81728 -155631 -102313 171588 -213815 97826 -79389 145105
6003 -265664 -191068 -174323 -159455 2070 -94184 239621 -189994 -134839 178126 166962 -186168
5991 -173126 222686 44497 131601 -119329 -174169 -5176 49804 302521 -203293 -88375 175537
5979 198825 -130526 -103717 63365 -31793 -375704 -378421 -133771 85352 -5886 -91140 -156957
5968 -156957 79959 -185645 -106817 -75008 178244 195507 458 161247 -97096 44944 -200373
5956 106680 -22297 -114023 -272616 -33747 -39665 143603 41176 189969 53912 11696 -100011
5944 81332 183717 -32308 18894 -15769 83437 -49932 150376 16877 -43311 -4944 -104995
5933 -104995 176326 196274 4073 -86272 -93293 -140698 64739 -121213 22000 -120732 61579
5921 102750 59293 44656 -243418 -100476 -178812 -138451 -53938 26204 -266259 34400 113780
5910 113780 213212 -51330 13978 34138 -93724 -16757 242310 -177395 -342729 -159119 -67589
5898 -192793 -180010 -145571 -69842 314062 -32961 -126853 34748 -117691 90863 118854 -187352
5886 -25092 -15237 181931 39843 114299 -21514 -95236 -3471 218249 -206850 39440 -149752
5874 -236451 169086 14691 299393 -412405 -64710 -215175 -173253 159265 -48437 -200312
5864 -200312 -175036 -190589 -77947 123132 -274845 -83938 -173965 189184 -81705 -397227 -326950
5853 -326950 -83930 74828 -80921 -6561 -309353 291532 299633 198637 2055 -203772 147419
5841 91467 -60498 -212689 -242345 86708 290030 -17604 -5719 41690 -22097 -80586 -256994
5830 -256994 -173064 -204010 148245 95158 -86464 315535 345196 319029 20120 32307 -147706
5818 97540 -12844 -271886 224765 265283 217483 27037 -60736 -267866 157739 -132659 93528
5806 69714 -228754 225763 -63272 140159 238845 -456809 24126 123034 -127605 32662 297021
5795 297021 82665 -229117 149940 -73926 -185315 61618 -88847 151573 -284430 -152205
5785 -152205 -21944 2781 91659 427050 33829 -17055 -116858 93433 -371816 -100912 287873
5773 77582 148878 20055 -200626 74504 -69513 -35777 68545 -54392 -55875 -256811 -48643 13914
5760 39777 432517 172706 -110682 584154 -114563 -46003 243643 21017 -154642 -11099
5749 -155405 -172217 -57333 -135012 53365 -63528 92150 -161191 344299 11624 157912 183390
5738 183390 122079 130319 -37715 -154369 81968 73748 63583 13271 438401 90855 120063 -143576
5725 128599 -207676 46224 -307219 -85936 -22423 -162680 60833 96437 198367 112339 -356323
5713 -65736 96388 -98945 214674 -103884 -292981 247868 -266666 81636 -183011 -89784 -115320
5702 -115320 -85225 -163658 -146500 116095 -390991 -168633 141783 -198838 -439587 153538
5691 102760 -161668 11942 -93677 -244771 -134279 -61121 -64305 -81630 109143 37581 -37430
5679 18712 -108656 46918 -183468 146995 325044 13455 -139350 -37963 172 97871 150383
5668 150383 -11021 48727 -59063 15668 36068 -341235 -171831 141037 224610 -406542 -81325
5656 -149520 -4834 275472 -293215 -91868 45743 138010 -183914 120592 -178481 53144 310250
5645 310250 147553 -224103 -116163 126681 -145402 135798 52753 -31203 -40957 126309
5634 201107 114285 -86946 142095 -258611 -50271 235567 280513 -204934 -91173 68782 269211
5623 269211 8254 103007 170821 -92919 -48169 -73169 -216954 -97716 22663 -215467 -23267
5611 128073 228658 47304 -156219 -139632 -189257 -48182 -53506 110067 -126834 -139418 -301877
5600 -301877 -73832 -137623 64117 164278 -57537 -102189 -27830 184509 85900 306028 32653
5588 -318023 -25464 -75372 -9576 -40347 22170 30314 -80168 -14364 -3001 79127 71711 199907
5576 199907 446966 -273492 293015 -56235 -43649 91234 256387 -6871 56942 61275 -110284
5564 -260193 335759 -35201 155897 100432 73335 -36579 -124496 460 1572 128631 -38153 -60731
5552 -60731 317463 361564 165216 -73305 -258901 -141415 -140168 206408 168565 -189121 -20292
5540 -3569 -267858 112571 -295386 -194779 182630 -23682 -221674 54678 -245491 -144016
5530 -144016 13949 25579 29476 107452 171201 45708 85624 12263 146129 52267 90541 -160790
5517 231730 44391 265644 162195 -6151 26969 -216883 -175457 -140037 -93027 -48432 -11801
5505 293926 -17802 227019 251451 7869 -268708 88092 -166253 69632 16362 -32504 226270
5493 -78506 94876 52396 80511 55879 -144950 -139904 35638 161327 -77605 -193107 -60285
5481 -163401 202516 -15028 -109590 178096 18467 156604 -99206 3464 125539 -7949 166297
5469 209310 337917 89281 178954 35047 277644 -261735 176547 -237231 -31916 -423727
5459 -423727 -174267 -33983 -259220 105067 -27243 -34432 -119110 148973 124860 334545 -137614
5447 -57437 -20686 161293 -172886 -99463 -12937 93521 21790 22962 287701 -19158 -173625
5436 -173625 -245622 144551 50051 365163 76010 -8171 23804 -232079 -12126 67005 -46193
5424 164796 81781 80539 38130 56387 135441 111136 -53529 -191419 22534 65052 4799 -126676
5411 139516 -139246 112040 -126836 -381008 18232 -97973 -320833 73633 -102924 -92055
5401 -92055 -36317 -63827 -215721 -95535 -144768 17045 -95152 -22293 -105652 10801 -41803 95504
5388 -339837 -181940 -15034 -405596 -148837 20216 175752 -4066 -131709 -112081 64710 236041
5377 236041 43984 -443531 61267 -87876 -248159 96406 -239556 -46607 -68283 -12192 268778
5365 81811 240701 32315 -295553 329080 377358 -89152 -421706 64636 -184403 55827 -120248
5353 447377 -78656 97431 -242804 -174985 -82967 -33944 -75597 -255284 -278946 -45653 -167019
5342 -167019 -308840 108147 25546 37276 1422 232351 -12440 162014 22999 71369 270966
5331 270966 -175079 2325 229055 -293919 409123 15066 -92392 199659 -448926 -185863
5320 20853 -126492 -334108 178890 -50756 193516 -140712 106263 16915 39552 84219 -186564
5308 -52202 43401 97295 -113123 39486 -70668 81704 76436 271081 -174528 47599 -108603
5296 71824 107333 -58752 359727 -198006 64373 12944 251208 -14720 -156763 39521 83227
5285 83227 263995 -222623 -57239 73368 11614 54028 63601 -36434 -264384 -39852 -143014
5274 -143014 -29144 91796 -32505 175847 -76030 -45833 207398 -209159 -60935 -161455 -44639
5262 -28283 279828 103213 -105909 100716 -120162 209747 58956 15159 -109951 -3391 -321771
5251 -321771 -122760 3541 -129886 -329983 249884 -12627 -18757 -52716 -5976 -134050 -320011
5240 -320011 -104830 -191820 -109281 79887 190607 -14443 -412852 -207092 -144647 227180 -8991
5228 189635 -170277 -184577 -29918 14856 46091 -126151 84734 -226950 -266998 145158 56761
5216 -108076 186135 -375142 215520 49568 -531 178970 -157276 -122693 187510 -38004 131282
5204 538580 123260 49706 -41595 13013 73626 192565 55132 257273 249244 274181 178428
5193 178428 184856 38376 146827 -232596 108909 155029 -51410 211995 167891 41659 148724
5182 148724 125913 228329 -7789 218318 -102527 148897 90986 -21855 -292512 261666 114425
5170 -148712 122625 -272052 369989 39108 54977 -86223 -214259 -45002 -40199 44301 -32612
5158 164998 -146731 338763 231493 -16706 -89538 31214 175388 -23387 244820 -59724 235707
5146 -6936 -292974 -352381 -55104 207069 -173425 32631 -147136 235815 -406472 136841 5683
5134 49030 -89851 174109 139065 -78450 -145166 -27216 61641 17036 -73803 -153128 -322186
5123 -322186 156905 95970 61435 -81181 16448 208363 -417647 127644 225797 -140978 251376
5111 -267597 -270809 145224 47341 379213 -250483 30609 -15379 146305 -95760 -176056 -163439
5100 -163439 -77204 -185590 -205619 29145 64868 -40440 132588 35127 132410 72017 -73796
5088 -51283 -126110 237802 145293 194792 92911 -318859 -129757 76250 59164 -30049 76587
5076 -470610 50251 -320334 -159387 -53379 -12427 -34047 75548 -97912 -145891 131446 169415
5065 169415 143369 -186558 -145755 223053 -277124 -21262 68106 173041 439878 46852 -213404
5053 -118313 -62236 -309127 -212630 -14428 87936 169619 20612 -347801 147956 73507 239959
5042 239959 -91718 -94685 -188987 209481 -165140 378633 -171591 -140440 -72100 319051 312027
5031 312027 -86050 246104 -128707 -191322 249406 -120560 49688 -87698 83650 -222225 44210
5019 -149864 68072 -88656 -144859 242615 -229300 34888 -104078 -131852 44460 -101654 -112957
5008 -112957 -180045 -183610 64527 -92212 212979 181260 -41678 30081 70346 193349 -57602
4996 52518 -43382 45549 -51691 84524 104426 -132873 61488 -347032 305624 102307 7437
4984 117160 -12597 127814 -553184 -87757 -208372 -96470 19236 228345 93538 153519 -53172
4972 179288 38372 -230 -191517 24378 176603 99488 139497 117275 -48738 -306193 207691
4960 -100569 -247220 74327 -172339 -128369 101310 402510 747 -547978 21200 -57906 -535990
4949 -535990 72306 -78340 -26496 -540859 -59391 179457 47348 164196 -190050 -127887 -276007
4938 -276007 34437 123466 -177576 33426 46955 -65425 138053 308277 3819 106218 341853
4927 341853 -172262 -109068 292418 -151164 -20144 -66877 78323 232158 -111548 32462 145008
4916 145008 151290 85200 -50090 -79730 176468 -126258 32712 324946 44741 -312126 62494
4904 149993 14995 189930 -37959 -21578 -182100 -145356 48066 -46840 82271 141015 -67773
4892 76980 435184 217484 11540 174801 -142181 323728 102419 -235898 85952 -50210
4881 -90095 -107352 -145053 -18368 143892 32726 -52334 -119359 233058 103516 -306920 128594
4869 1047 -115438 411719 -145682 -218516 -33938 209573 1050 -263438 64781 -213456 -90876
4857 130158 -120916 -188172 68470 68233 -42664 -403441 37163 63001 66595 237932 -30513 195265
4844 -44 -5810 121117 -208307 -69838 -55092 233430 45736 -5418 -160885 17422 -250832 159441
4831 -74191 9868 202507 -34485 110585 213173 -69573 38007 -131327 23602 -321967 -79259
4819 -449456 72953 -108247 61523 -172194 -162250 -363929 -160102 54318 20281 253180 173499
4808 173499 91121 -185658 -32505 -135085 37823 -199639 100006 -79615 -476465 154779
4797 -110518 236120 -75022 -238992 -221729 -96975 -179190 14959 -30532 161905 -216033 47410
4785 -155124 -23322 107623 137939 126460 -177900 332450 269252 -77056 -31913 -85902 284987
4773 -53184 58499 -51877 33700 28378 107602 249007 288256 -200048 83138 119921 46936 -228874
4760 39282 -304678 -81077 -21066 -205408 -215576 -228645 152795 -206838 -90406 -116113 -44955
4748 32297 -153707 -86872 101749 96331 66966 219713 16494 87702 42230 -62895 -32105
4737 -32105 349543 -76687 18124 -22521 -224815 -217103 -258855 396907 -180423 -86674 -308928
4726 -308928 67661 -121034 316896 -157829 58849 199297 -273472 -308406 31431 40205 -317134
4714 -62201 365775 -41071 194465 -28318 -140316 -32015 259503 -24744 65579 131131 -45727
4702 279756 233732 231180 162110 348327 32770 -154072 261604 293392 -102637 46215 262853
4691 262853 147724 -73758 128621 131534 -2636 -114915 -222577 299648 -137563 355401 31443
4679 -51004 62420 199173 -183379 -156897 114648 -8696 -265703 -84002 14010 -71978 -15398
4667 89189 11796 -84430 160018 -154271 -62769 -100549 -120212 4710 -231586 -21150 -230475
4656 -230475 -335336 -52435 -266344 -96611 77650 -52529 -167316 -178973 -79441 -160822 339194
4644 212542 39564 347287 -254266 -165974 134797 72274 -117724 -113684 265052 -146420 -72145
4632 109165 133892 177355 192572 -11653 -2857 172978 -346849 89193 172307 -318440 -53582
4620 141798 295812 15739 -32868 195762 3964 101502 54651 -105019 111647 22891 -9979
4608 31608 -180885 55716 190150 108299 17694 -12622 -226296 20837 48944 -5846 -34726
4597 -34726 182152 -155862 -46934 21811 84097 -85918 167325 40729 114002 177491 88916
4586 88916 90634 27566 -64611 23219 -104327 -20076 -165359 62796 150993 -132948 -137056 31253
4573 -125598 232905 -71384 1902 92684 -12038 187014 248091 132286 -88732 -58842 100289
4561 148264 42287 -136687 -122192 194200 -122726 -106720 42845 219098 248146 85228 -63113
4549 -136853 -52904 149828 25733 -62402 128493 164340 57515 -218092 -140585 194577 -21984
4537 -62789 97619 247299 26121 50920 -234555 127988 44038 214598 90223 -98471 343254
4525 -262036 157062 -81232 171914 231894 205461 83084 26370 -161154 -134433 354313 23193
4513 100958 246920 -106062 280325 -135204 223414 -12013 -82835 -25016 124166 -205399
4502 -320983 17131 -90060 23338 43846 -92622 -13395 -368650 167371 -22532 219169 137699
4491 137699 272771 -47288 -64978 -55543 147306 319130 -135113 89724 -84205 3792 76643
4480 76643 -46071 -110717 69595 -310543 -270545 -77625 267056 261076 -72375 -216308 -97699
4468 393017 -141465 129564 67198 10998 -145008 30250 111366 27785 5931 -250705 13053
$$ [...]
##END NTUPLES=NMR SPECTRUM
##END=
